##TITLE=NES1042_878015014_9242965_O5LvIJuU8l
##JCAMPDX= 6.0         $$ Bruker NMR JCAMP-DX V2.0
##DATA TYPE= NMR SPECTRUM
##DATA CLASS= NTUPLES
##ORIGIN= BRUKER
##OWNER= Administrator
$$ 1.72 TOPSPIN		Version 2.1
$$ 2015-06-23 20:07:56.373 -0700  Administrator@X
$$ Compression mode = diff/dup
##.OBSERVE FREQUENCY= 400.02188249412
##.OBSERVE NUCLEUS= ^1H
##.ACQUISITION MODE= SIMULTANEOUS (DQD)
##.ACQUISITION SCHEME= undefined
##.AVERAGES= 64
##.DIGITISER RES= 22
##SPECTROMETER/DATA SYSTEM= spect
##.PULSE SEQUENCE= noesygpps1d.comp
##.SOLVENT NAME= COFFEE_meoh
##.SHIFT REFERENCE= INTERNAL, COFFEE_meoh, 1, 14.96262
##AUDIT TRAIL= $$ (NUMBER, WHEN, WHO, WHERE, PROCESS, VERSION, WHAT)
$$ ##TITLE= Audit trail, TOPSPIN		Version 2.1
$$ ##JCAMPDX= 5.01
$$ ##ORIGIN= Bruker BioSpin GmbH
$$ ##OWNER= Administrator
$$ $$ E:\/data/COFFEE/nmr/NES1042_878015014_9242965_O5LvIJuU8l/12/pdata/1/auditp.txt
$$ ##AUDIT TRAIL=  $$ (NUMBER, WHEN, WHO, WHERE, PROCESS, VERSION, WHAT)
(   1,<2015-06-23 20:07:51.201 -0700>,<Administrator>,<X>,<go>,<TOPSPIN 2.1>,
      <created by zg
	started at 2015-06-23 19:56:21.217 -0700,
	POWCHK enabled, PULCHK disabled,
       configuration hash MD5:
       21 0F 79 D6 B3 7B B4 F6 88 20 88 DB 03 48 BD 9F
       data hash MD5: 64K
       7B 15 14 04 E2 CB 4A A5 5F 88 BD 13 90 44 3A C9>)
(   2,<2015-06-23 20:07:54.358 -0700>,<Administrator>,<X>,<proc1d>,<TOPSPIN 2.1>,
      <Start of raw data processing
       efp LB = 0.3 FT_mod = 6 PKNL = 1 PHC0 = 0 PHC1 = 0 SI = 128K 
       data hash MD5: 128K
       8C 5C 2A 79 E3 AA 78 27 D5 B3 77 39 4B 1E 9D C8>)
(   3,<2015-06-23 20:07:55.233 -0700>,<Administrator>,<X>,<proc1d>,<TOPSPIN 2.1>,
      <pk PHC0 = -88.13232 PHC1 = 0 
       data hash MD5: 128K
       72 ED F0 F0 2D 4F 38 04 E1 04 01 2D 7D B9 64 E5>)
(   4,<2015-06-23 20:07:55.592 -0700>,<Administrator>,<X>,<proc1d>,<TOPSPIN 2.1>,
      <abs ABSG = 1 
       data hash MD5: 128K
       59 C6 AD BA 22 05 11 E2 6E AF 28 32 5E 5D E6 03>)
(   5,<2015-06-23 20:07:55.701 -0700>,<Administrator>,<X>,<proc1d>,<TOPSPIN 2.1>,
      <abs ABSG = 2 
       data hash MD5: 128K
       9C 20 7C F5 02 38 7A 1A 4B 69 0C 06 03 1A 54 79>)
(   6,<2015-06-23 20:07:55.779 -0700>,<Administrator>,<X>,<proc1d>,<TOPSPIN 2.1>,
      <abs ABSG = 3 
       data hash MD5: 128K
       86 DB A4 CB E8 C8 27 EC E2 A7 27 88 CB B6 2B 74>)
(   7,<2015-06-23 20:07:55.858 -0700>,<Administrator>,<X>,<proc1d>,<TOPSPIN 2.1>,
      <abs ABSG = 4 
       data hash MD5: 128K
       A7 62 49 01 46 2E 33 31 C6 E4 C6 EE 41 EB 1A 4E>)
(   8,<2015-06-23 20:07:55.967 -0700>,<Administrator>,<X>,<proc1d>,<TOPSPIN 2.1>,
      <abs ABSG = 5 
       data hash MD5: 128K
       2A 31 A5 11 73 00 75 F3 57 C8 B1 7C 28 65 A3 E4>)
$$ ##END=
$$ 
$$ $$ hash MD5
$$ $$ A0 47 EA F3 88 82 74 0E 3C 09 9F 7C 82 A0 59 0E
##$RELAX= 
##$RELAX= 
##$RELAX= 
##$RELAX= 
##$RELAX= 
##$RELAX= 
##$RELAX= 
##$RELAX= 
$$ Bruker specific parameters
$$ --------------------------
##$DU= <E:\>
##$EXPNO= 12
$$ [...]
150 150 150 150 150 150 150 150
##$TP07= 0
##$TPNAME0= <>
##$TPNAME1= <>
##$TPNAME2= <>
##$TPNAME3= <>
##$TPNAME4= <>
##$TPNAME5= <>
##$TPNAME6= <>
##$TPNAME7= <>
##$TPOAL= (0..7)
0.5 0.5 0.5 0.5 0.5 0.5 0.5 0.5
##$TPOFFS= (0..7)
0 0 0 0 0 0 0 0
##$TUNHIN= 0
##$TUNHOUT= 0
##$TUNXOUT= 0
##$USERA1= <user>
##$USERA2= <user>
##$USERA3= <user>
##$USERA4= <user>
##$USERA5= <user>
##$V9= 5
##$VALIST= <valist>
##$VCLIST= <CCCCCCCCCCCCCCC>
##$VD= 0
##$VDLIST= <DDDDDDDDDDDDDDD>
##$VPLIST= <PPPPPPPPPPPPPPP>
##$VTLIST= <TTTTTTTTTTTTTTT>
##$WBST= 2048
##$WBSW= 25
##$XGAIN= (0..3)
0 0 0 0
##$XL= 0
##$YL= 0
##$YMAX_a= 6660452
##$YMIN_a= -12294602
##$ZGOPTNS= <>
##$ZL1= 120
##$ZL2= 120
##$ZL3= 120
##$ZL4= 120
##$ABSF1= 14.96262
##$ABSF2= -5.595562
##$ABSG= 5
##$ABSL= 3
##$ALPHA= 0
##$AQORDER= 0
##$ASSFAC= 0
##$ASSFACI= 0
##$ASSFACX= 0
##$ASSWID= 0
##$AUNMP= <proc_prof1d_extract.lims>
##$AXLEFT= 0
##$AXNAME= <>
##$AXNUC= <1H>
##$AXRIGHT= 0
##$AXTYPE= 0
##$AXUNIT= <>
##$AZFE= 0.1
##$AZFW= 0.1
##$BCFW= 0
##$BC_mod= 0
##$BYTORDP= 0
##$COROFFS= 0
##$CY= 15
##$DATMOD= 1
##$DC= 0
##$DFILT= <>
##$DTYPP= 0
##$F1P= 0
##$F2P= 0
##$FCOR= 0.5
##$FTSIZE= 131072
##$FT_mod= 6
##$GAMMA= 0
##$GB= 0
##$INTBC= 1
##$INTSCL= 1
##$ISEN= 128
##$LB= 0.3
##$LEV0= 0
##$LPBIN= 0
##$MAXI= 10000
##$MC2= 0
##$MEAN= 0
##$ME_mod= 0
##$MI= 0
##$NCOEF= 0
##$NC_proc= -2
##$NLEV= 6
##$NOISF1= 0
##$NOISF2= 0
##$NSP= 0
##$NTH_PI= 0
##$NZP= 0
##$OFFSET= 14.96262
##$PC= 1
##$PHC0= -88.13232
##$PHC1= 0
##$PH_mod= 1
##$PKNL= yes
##$PPARMOD= 0
##$PPDIAG= 0
##$PPIPTYP= 0
##$PPMPNUM= 2147483647
##$PPRESOL= 1
##$PSCAL= 4
##$PSIGN= 0
##$PYNMP= <proc.py>
##$REVERSE= no
##$SF= 400.0200089902
##$SI= 131072
##$SIGF1= 0
##$SIGF2= 0
##$SINO= 400
##$SIOLD= 131072
##$SPECTYP= <>
##$SREGLST= <1H.CDCl3>
##$SSB= 0
##$STSI= 131072
##$STSR= 0
##$SW_p= 8223.68421052631
##$SYMM= 0
##$S_DEV= 0
##$TDeff= 65536
##$TDoff= 0
##$TI= <>
##$TILT= no
##$TM1= 0
##$TM2= 0
##$TOPLEV= 0
##$USERP1= <user>
##$USERP2= <user>
##$USERP3= <user>
##$USERP4= <user>
##$USERP5= <user>
##$WDW= 1
##$XDIM= 131072
##$YMAX_p= 343600712
##$YMIN_p= -13199
##$CURPLOT= <Network HP LaserJet P1505>
##$CURPRIN= <$Network HP LaserJet P1505>
##$DFORMAT= <normdp>
##$LAYOUT= <+/1D_H.xwp>
##$LFORMAT= <normlp>
##$PFORMAT= <normpl>
##$SURQMSG= 1
$$ End of Bruker specific parameters
$$ ---------------------------------
##NTUPLES= NMR SPECTRUM
##VAR_NAME=  FREQUENCY,     SPECTRUM/REAL,   SPECTRUM/IMAG
##SYMBOL=    X,             R,               I
##VAR_TYPE=  INDEPENDENT,   DEPENDENT,       DEPENDENT
##VAR_FORM=  AFFN,          ASDF,            ASDF
##VAR_DIM=   131072,        131072,          131072
##UNITS=     HZ,            ARBITRARY UNITS, ARBITRARY UNITS
##FACTOR=    0.0627417313425164, 1,          1
##FIRST=     8223.62146879497, 1207,         -42707
##LAST=      0,             2684,            -42423
##MIN=       0,             -13199,          0
##MAX=       8223.62146879497, 343600712,    0
$$ Real data points
##PAGE= N=1
##DATA TABLE= (X++(R..R)), XYDATA
$$ [...]
67587 177454 176768 176001 175814 176309 177057 177566 177546 176884 175644 174178 173013 172526 172746 173404 174055 174284 173984 173488
67569 173488 173222 173189 172943 172124 170882 169687 168871 168486 168503 168917 169577 170094 170105 169619 168931 168157 167049 165467
67551 165467 163874 163069 163344 164124 164561 164386 164038 164052 164484 164950 165171 165392 166110 167330 168308 168308 167602 167345 168382
67532 168382 170415 172457 173813 174443 174651 174757 174931 175097 175059 174836 174730 174939 175339 175829 176545 177436 177933 177495
67514 177495 176382 175400 174980 174966 175240 175982 177177 178346 179048 179317 179384 179214 178561 177352 175819 174314 173093
67497 173093 172226 171735 171815 172728 174283 175695 176323 176395 176554 176892 177065 177230 178014 179331 180122 179785 179189 179615
67479 179615 181134 182734 183704 184163 184421 184570 184731 185081 185492 185625 185504 185623 186358 187582 188883 189892 190354
67462 190354 190249 189922 189838 190193 190931 192026 193379 194545 195025 194832 194390 193908 193274 192567 192077 191760 191311 190917
67444 190917 191264 192406 193287 193009 192126 191972 192957 194231 194973 195338 196005 197343 199238 201310 203073 204131
67428 204131 204485 204498 204456 204295 203820 203055 202302 201995 202448 203548 204650 205081 204875 204818 205574 206932 208089 208531
67410 208531 208461 208513 209192 210575 212333 213995 215296 216282 217122 217919 218732 219567 220198 220221 219562 218861 218967 219991
67392 219991 221135 221609 221481 221418 221761 222168 222108 221467 220627 220127 220320 221200 222394 223347 223627 223141 222167 221254 221008
67373 221008 221760 223370 225362 227276 228815 229782 230163 230347 230978 232283 233651 234216 233872 233513 234140 235905
67357 235905 238138 240100 241495 242329 242646 242610 242650 243219 244306 245373 245923 246041 246246 246862 247738 248580 249330 250111
67339 250111 250990 251991 253259 254979 257090 259196 260818 261724 262039 262081 262100 262137 262189 262431 263098 264111 265076 265836
67321 265836 266780 268288 270061 271410 272182 272905 273899 274738 274907 274691 274950 276093 277691 279099 280154 281189
67305 281189 282575 284422 286568 288679 290435 291743 292857 294266 296340 298943 301333 302675 302827 302584 302942
67290 302942 304139 305585 306669 307393 308103 308898 309591 310191 311122 312831 315252 317715 319437 320111 320108 320123 320609
67273 320609 321518 322566 323672 325070 326972 329198 331191 332415 332771 332696 332882 333847 335590 337625 339356 340567
67257 340567 341528 342631 343998 345511 347144 348957 350755 352050 352659 353144 354322 356338 358550 360400 362056
67242 362056 364002 366301 368566 370519 372263 374044 376008 378177 380465 382674 384600 386153 387299 388052
67228 388052 388738 390053 392455 395502 398204 400111 401676 403494 405683 408202 411252 414858 418387 421067
67214 421067 422855 424390 426180 428276 430617 433126 435424 437041 438148 439680 442381 445994 449614 452629
67200 452629 455110 457465 459981 462659 465319 467881 470532 473517 476771 479924 482672 484943 486746 488201
67186 488201 489727 491840 494637 497773 501072 504751 508837 512792 516053 518682 521160 523787 526571 529431
67172 529431 532194 534611 536803 539454 543135 547541 551784 555380 558598 561949 565702 569869 574262 578590
67158 578590 582794 587201 592038 596889 601011 604161 606781 609484 612701 616653 621155 625519 629196 632549
67144 632549 636489 641320 646532 651730 657093 662629 667778 672240 676718 682147 688438 694546 699714 704198
67130 704198 708747 713735 718985 724261 729771 736064 743372 751152 758481 764885 770610 776205 782176 788942
67116 788942 796584 804482 811678 817850 823611 829708 836256 842948 849545 855889 861855 867660 873859 880727
67102 880727 887953 895271 903007 911569 920740 929971 939104 948263 957243 965595 973284 980755 988372 996214
67088 996214 1004358 1012930 1021862 1030985 1040340 1050035 1059858 1069469 1078979 1088853 1099195 1109559 1119595
67075 1119595 1129442 1139328 1149215 1159130 1169503 1180753 1192678 1204590 1216131 1227734 1240132 1253451
67063 1253451 1266912 1279597 1291410 1303062 1315058 1327130 1338896 1350712 1363303 1376679 1389981
67052 1389981 1402535 1414663 1427288 1440980 1455557 1470392 1484961 1499200 1513422 1527881 1542440
67041 1542440 1556756 1570723 1584596 1598775 1613578 1629032 1644682 1659819 1674213 1688466 1703344
67030 1703344 1718894 1734595 1750187 1765855 1781678 1797462 1813188 1829172 1845608 1862347 1879199
67019 1879199 1896044 1912516 1928100 1942792 1957299 1972281 1987678 2003026 2018114 2033050 2047894
67008 2047894 2062628 2077378 2092349 2107580 2122896 2138123 2153211 2168170 2182968 2197521 2211804
66997 2211804 2225987 2240308 2254712 2268775 2282211 2295253 2308238 2321044 2333310 2345084 2356735
66986 2356735 2368279 2379298 2389581 2399347 2408755 2417721 2426290 2434662 2442686 2449927 2456469 2463090 2470245
66973 2470245 2477397 2483718 2489043 2493746 2498080 2502100 2505852 2509250 2512020 2514156 2516087 2518081 2519828 2521003
66959 2521003 2521760 2522212 2521945 2520675 2518981 2517609 2516268 2513934 2510307 2506164 2502205 2498242 2493718 2488421 2482424
66944 2482424 2475780 2468542 2460821 2452649 2444038 2435123 2425921 2415989 2404797 2392488 2379867 2367583 2355778
66931 2355778 2344536 2333992 2323734 2312731 2300423 2287569 2275480 2264514 2253680 2241614 2227597
66920 2227597 2211801 2195020 2178315 2162546 2147896 2133815 2119577 2104911 2090053 2075228 2060268
66909 2060268 2044912 2029352 2014116 1999316 1984326 1968434 1951611 1934412 1917390 1900873 1885053
66898 1885053 1869839 1854750 1839420 1824131 1809362 1794880 1779860 1764008 1747996 1732541 1717589
66887 1717589 1702725 1687951 1673536 1659379 1644957 1629903 1614308 1598531 1582957 1567873 1553348
66876 1553348 1539248 1525465 1512025 1498853 1485653 1472276 1459007 1446175 1433554 1420463 1406569
66865 1406569 1392376 1378829 1366512 1355212 1344144 1332582 1320380 1307921 1295596 1283450 1271437
66854 1271437 1259754 1248653 1237926 1226919 1215253 1203333 1191948 1181422 1171371 1161261 1150968
66843 1150968 1140631 1130184 1119372 1108199 1097069 1086330 1075931 1065736 1055900 1046620 1037672 1028591
66831 1028591 1019313 1010267 1001743 993546 985422 977443 969732 962072 954164 946104 938265 930713 923075 915001
66817 915001 906534 897952 889468 881266 873568 866450 859548 852222 844160 835826 828107 821481 815511 809278
66803 809278 802281 794839 787668 781189 775283 769595 763900 758172 752445 746777 741340 736393 732021 727913
66789 727913 723575 718717 713289 707210 700398 693188 686366 680460 675187 669908 664432 659062 653975 649085
66775 649085 644480 640478 637070 633738 630080 626231 622452 618605 614416 609959 605469 600835 595741 590321
66761 590321 585227 580895 577013 572897 568249 563377 558785 554720 551074 547600 544142 540771 537783 535496
66747 535496 533905 532437 530270 527078 523408 520084 517279 514410 510962 507106 503364 499994 496924 494076
66733 494076 491413 488775 485928 482781 479307 475372 470954 466548 462964 460512 458603 456402 453747 451196
66719 451196 449232 447642 445717 442896 439199 435188 431607 428900 426970 425421 424083 423104 422446 421537 419768
66704 419768 417211 414458 411724 408619 405054 401883 400106 399584 399087 397663 395544 393544 391958 390344 388205
66689 388205 385566 382925 380811 379426 378596 377965 377204 376077 374455 372380 370058 367692 365345 363003 360629
66674 360629 358089 355246 352263 349598 347404 345179 342388 339261 336558 334608 333083 331725 330643 329724
66660 329724 328309 325853 322597 319237 316190 313512 311284 309625 308380 307148 305651 303935 302222 300710
66646 300710 299449 298354 297417 296839 296721 296600 295687 293788 291646 290102 289193 288329 287088 285497 283762 282100
66630 282100 280703 279476 277964 275901 273770 272355 271821 271643 271451 271400 271534 271278 270024 268039 266341 265650
66614 265650 265673 265532 264696 263350 261895 260373 258535 256333 254075 252072 250377 248938 247835 247241 247254 247795
66598 247795 248567 249110 249133 248801 248418 247836 246563 244623 242864 242112 242294 242722 242997 243266 243729 244250 244374 243609
66580 243609 241872 239853 238593 238471 238852 239016 239060 239419 239882 239687 238481 236634 234685 232960 231642 230680
66564 230680 229642 228138 226407 225073 224334 223812 223106 222051 220572 218891 217774 217791 218299 217971 216576 215432
66548 215432 215663 216762 217446 217323 216951 216603 215825 214227 212109 210095 208491 207173 205963 204938 204356 204242
66532 204242 204177 203689 202760 201679 200470 198883 197013 195448 194588 194146 193498 192227 190298 188150 186686 186558
66516 186558 187200 187210 186019 184581 183943 183805 183169 181812 180276 178812 177322 176102 175663 175810 175789 175345 174790
66499 174790 173975 172288 169976 168376 168224 168559 168084 166950 166318 166546 166811 166363 165342 164304 163656 163703 164596
66482 164596 165941 166846 166626 165251 163153 160987 159634 159785 161169 162557 162925 162392 161773 161575 161817 162471
66466 162471 163408 164036 163651 162311 160910 160166 159960 159863 159853 160125 160522 160624 160311 159823 159303 158579 157481 156093
66448 156093 154664 153495 152900 153045 153739 154557 155198 155625 155862 155902 155794 155583 155136 154290 153241 152489 152252 152189
66430 152189 151941 151713 151970 152707 153388 153658 153734 153892 153885 153216 151942 150803 150413 150588 150715 150572 150361 150057 149234
66411 149234 147815 146543 146285 147040 147975 148357 148100 147476 146735 146051 145558 145247 145016 144853 144817 144829 144711 144450 144168
66392 144168 143806 143080 141840 140374 139208 138665 138514 138001 136474 134196 132293 131507 131308 130729 129806 129404 129669
66375 129669 129687 128952 128265 128528 129388 129807 129530 129128 128960 128926 129169 130085 131460 132325 131991 130798 129503 128328
66357 128328 126953 125292 123898 123558 124566 126371 127948 128579 128267 127415 126315 125127 124125 123585 123439 123353
66341 123353 123182 123073 123092 122974 122408 121423 120425 119944 120348 121600 123193 124459 125040 125076 124897 124586 123908 122706
66323 122706 121313 120419 120364 120697 120682 120160 119578 119162 118572 117621 116868 117016 117965 118914 119333 119433 119674 120131 120436
66304 120436 120217 119556 119048 119254 120009 120515 120231 119387 118458 117549 116594 115777 115258 114816 114210 113700 113649 113864 113858 113615
66284 113615 113513 113631 113742 113846 114079 114201 113898 113503 113598 113913 113564 112537 111907 112192 112464 111694 110095 108449
66266 108449 106897 105324 104306 104488 105355 105687 105230 104886 105201 105609 105529 105264 105311 105410 104966 104114 103733 104452 106011
66247 106011 107579 108469 108529 108116 107732 107607 107613 107581 107570 107703 107870 107786 107309 106541 105627 104647 103746 103136 102792 102327
66227 102327 101463 100609 100562 101458 102338 102110 100828 99645 99516 100299 101220 101779 101976 101941 101738 101496 101424 101665 102280
66208 102280 103319 104683 105912 106357 105764 104575 103516 102880 102348 101488 100300 99154 98358 98001 98151 98870
66192 98870 99962 100975 101658 102189 102770 103218 103296 103211 103414 103993 104666 105286 105965 106688 107241 107592 107889 108059 107826
66173 107826 107263 106804 106512 105891 104739 103706 103569 104255 105059 105520 105618 105390 104951 104737 105034 105225 104218 101859
66155 101859 99407 98214 98306 98738 98994 99404 100160 100644 100150 98933 97967 97760 97909 97886 97691 97473 97000 96022
66137 96022 94826 93945 93472 93228 93408 94383 95889 97060 97443 97392 97364 97443 97705 98310 98903 98677 97486 96274
66119 96274 95815 95691 95192 94617 94762 95488 95813 95329 94610 94180 93890 93506 93175 93027 92904 92703 92572 92609 92787
66100 92787 93255 94176 95143 95357 94662 93867 93743 94166 94591 94887 95227 95489 95326 94759 94235 94017 93753 92769 90806
66081 90806 88466 86852 86563 87103 87519 87519 87536 87754 87703 87077 86426 86605 87798 89395 90616 91020 90741 90521 91176
66062 91176 92628 93772 93694 92662 91479 90269 88652 86883 85824 85673 85600 85022 84524 84966 86239 87577
66046 87577 88681 89814 90962 91676 91805 91727 91662 91400 90997 91126 92175 93414 93744 93136 92661 93053 93839 94115
66028 94115 93674 93057 92810 93097 93825 94771 95675 96420 97062 97517 97469 96835 96139 96000 96366 96629 96456 96126 95957
66009 95957 95858 95659 95557 95883 96572 97175 97452 97693 98333 99349 100190 100329 99743 98830 98007 97572 97762 98549 99355
65990 99355 99418 98603 97575 96965 96769 96765 97081 97869 98698 98868 98187 97039 95807 94726 94133 94250 94687 94725 94142
65971 94142 93292 92374 91237 90058 89557 90152 91298 92023 91840 90981 90041 89571 89721 90049 89953 89371 88749 88354
65953 88354 88106 88149 88856 90069 91022 91456 92076 93353 94557 94744 94219 94078 94574 94898 94579 94146 94193 94527 94659
65934 94659 94620 94884 95737 97028 98338 99191 99263 98547 97296 95789 94299 93177 92666 92641 92741 92833 93058 93390
65916 93390 93413 92703 91315 89816 88870 88745 89134 89489 89617 89800 90236 90621 90535 90038 89569 89379 89458 89881 90772
65897 90772 91878 92536 92270 91208 89903 88930 88566 88552 88184 86949 85152 83657 83052 83284 84007 84877 85535
65880 85535 85773 85779 85901 86077 85940 85492 85157 85043 84710 83936 83197 82984 83058 82853 82317 81870 81740 81780 81826 81836 81767
65859 81767 81686 81942 82802 83947 84663 84610 84144 83866 84124 84974 86290 87761 88975 89683 89953 89999 89954 89795 89360
65840 89360 88431 87001 85586 85083 86046 88024 89828 90594 90545 90502 90739 90699 89935 88902 88382 88431 88524 88595 89130
65821 89130 90068 90435 89662 88618 88627 89809 91188 92166 93008 93871 94331 94208 94046 94232 94252 93496 92398 92022 92641
65802 92641 93422 93607 93479 93936 95441 97592 99475 100316 100058 99428 99215 99379 99197 98415 97844 98403 99841 100983
65784 100983 101213 101167 101753 102922 103775 103632 102673 101586 100865 100462 99968 99078 97949 96979 96245 95362 94061 92624
65766 92624 91452 90462 89354 88343 88033 88496 89022 89121 89238 90038 91275 91930 91421 90208 89114 88461 88038
65749 88038 87650 87339 87134 86809 86081 85026 84142 83841 83928 83798 83205 82579 82446 82808 83303 83747 84134 84264 83797
65730 83797 82725 81520 80731 80675 81395 82605 83666 84025 83820 83688 83881 83984 83676 83245 82950 82347 80922 79175
65712 79175 78411 79370 81554 83930 85846 87089 87638 87684 87600 87574 87479 87288 87298 87704 88270 88734 89230 89838 90059
65693 90059 89322 87927 86853 86564 86558 86247 85683 85170 84716 84306 84268 84832 85566 85803 85479 85057 84662 83896 82661
65674 82661 81671 81782 83009 84469 85253 85199 84833 84671 84682 84517 84159 84030 84323 84673 84857 85476 87242 89677
65656 89677 91249 91031 89621 88122 86812 85341 83779 82769 82746 83558 84875 86487 88095 89209 89455 88878
65640 88878 87894 87018 86514 86123 85266 83738 82096 81071 80728 80549 80243 79996 79960 79994 80067 80431 81104 81582 81458
65621 81458 81051 81075 81810 82937 84028 84866 85298 85177 84578 83883 83533 83711 84166 84271 83422 81621 79639 78339
65603 78339 77887 77805 77775 78001 78665 79346 79303 78230 76544 74985 74061 73833 74028 74326 74639 75134 75921 76784 77359
65584 77359 77608 77925 78711 79909 81060 81703 81639 80926 79861 78960 78705 79108 79606 79548 78840 78048 77879 78612 79926
65565 79926 81162 81784 81762 81543 81536 81625 81350 80593 79804 79404 79221 78804 78114 77505 77021 76155 74543 72573 71008
65546 71008 70212 70091 70603 71831 73457 74671 74959 74778 75079 76246 77798 79083 79857 80103 79707 78668 77478
65529 77478 76850 76999 77412 77440 76966 76477 76592 77655 79558 81810 83821 85264 86217 86877 87228 87104 86506 85666
65511 85666 84771 83777 82576 81302 80361 80214 81051 82567 83993 84552 84112 83355 83212 84054 85509 86999 88319
65494 88319 89586 90841 91908 92727 93579 94737 95938 96438 95792 94395 93089 92360 92119 92143 92319 92459 92378
65477 92378 92403 93323 95340 97349 97941 97119 96405 96966 98199 98645 97967 97351 97926 99395 100571 100918 101047 101716
65459 101716 102829 103741 104284 105012 106384 108165 109876 111473 113142 114641 115375 115162 114451 113639 112597 111131
65443 111131 109529 108296 107483 106569 104958 102488 99630 97241 95854 95005 93580 91080 88236 86114 84992
65428 84992 84574 84880 86123 87828 88919 88961 88675 88899 89508 89761 89335 88631 88243 88474 89198 89962 90395 90727
65410 90727 91667 93464 95346 96239 95943 95223 94834 94900 95260 95951 97036 98185 98834 98812 98622 98970 100105 101705
65392 101705 103340 104857 106286 107614 108882 110340 112253 114620 117314 120338 123617 126676 129066 131199
65378 131199 134211 138730 144150 149329 153631 157096 160092 163152 166721 170595 173976 176513 178881 181697
65364 181697 184256 185161 184090 182169 180546 179394 178315 176890 174526 170612 165417 160287 156373 153566
65350 153566 151100 148773 146911 145455 143827 141699 139309 136986 134874 133193 132301 132226 132469 132494 132201 131817
65334 131817 131538 131472 131802 132759 134497 136963 139812 142420 144227 145163 145634 145978 146124 145894 145362 144610 143299
65317 143299 140915 137519 133861 130555 127432 124012 120383 117190 114760 112653 110213 107280 104242 101649
65303 101649 99964 99385 99580 99740 99211 98026 96628 95224 93738 92217 90835 89509 88061 86854 86721
65288 86721 87851 89182 89390 88261 86652 85245 83972 82692 81788 81671 82066 82255 81875 81109 80186 79135
65272 79135 78101 77486 77516 77904 78185 78269 78434 78943 79880 81175 82442 82924 82092 80368 78854 78231 78241 78344
65254 78344 78398 78490 78618 78894 79616 80616 80961 79988 78383 77501 77689 78026 77733 77020 76322 75532 74547 73971 74591
65235 74591 76353 78375 79892 80827 81544 82410 83564 84882 86153 87327 88399 89056 88867 88003 87346 87485
65219 87485 87964 88002 87672 87803 88877 90560 92282 93705 94561 94631 94184 94068 95040 97089 99541 101607 102818
65202 102818 103176 103161 103418 104329 105835 107592 109100 109783 109369 108240 107101 106095 104578 102058 99064 96690
65186 96690 95356 94387 92866 90599 88104 85904 84099 82523 81045 79636 78280 76967 75719 74599 73755
65171 73755 73469 74014 75306 76801 77921 78542 78900 79078 78828 77926 76535 75162 74375 74455 75110 75645 75727 75883
65153 75883 76810 78214 78946 78410 77234 76272 75606 75046 74955 75797 77161 78099 78295 78254 78363 78508 78606 78795 78886
65134 78886 78309 76946 75515 74783 74763 74982 75194 75523 76083 76730 77120 77006 76644 76811 78008 79681 80722 80815
65116 80815 80746 81162 81668 81525 80826 80435 80967 82225 83554 84454 85019 85909 87698 90146 92488 94599 97367
65099 97367 101539 106656 111633 116000 120021 123881 127468 130907 134591 138504 141977 144372 145746 146699 147732
65084 147732 148793 149308 148704 147015 144847 142596 140014 136825 133437 130455 127698 124407 120452 116651 113632
65069 113632 110983 107892 104219 100507 97278 94768 93109 92300 91986 91667 91155 90557 89822 88661 87050 85417
65053 85417 84078 82683 80632 77976 75515 73890 73001 72552 72687 73501 74212 73657 71812 70125 69932 71038
65037 71038 72268 72947 73224 73289 73051 72551 72057 71641 71128 70521 70036 69672 69201 68720 68702 69310 70056 70404 70367 70255
65017 70255 70171 70068 70061 70303 70672 70826 70584 70058 69462 68893 68273 67506 66734 66396 66856 68003 69416 70832 72160
64998 72160 73039 72837 71303 68943 66576 64780 63869 64016 65097 66642 68212 69655 70783 71131 70427 69194
64982 69194 68441 68714 69669 70562 70925 70783 70439 70173 70107 70267 70719 71436 72080 72178 71665 71022 70708 70645 70486 70164
64962 70164 69923 69899 69957 69862 69425 68594 67647 67191 67680 68924 70253 71123 71443 71399 71229 71164 71324 71601 71742 71597
64942 71597 71233 70849 70662 70824 71373 72295 73543 74822 75452 74845 73168 71197 69395 67662 66163 65612 66166
64925 66166 66653 65847 64192 63309 63880 65016 65787 66308 66905 67168 66569 65434 64574 64282 64288 64376 64456 64294 63827
64906 63827 63550 63978 64767 65017 64507 64018 64287 65150 65964 66448 66703 66748 66458 65895 65392 65240 65460 65884 66368
64887 66368 66905 67555 68242 68640 68380 67422 66172 65170 64731 64877 65432 66055 66322 66015 65423 65166 65622 66532
64869 66532 67225 67225 66642 66038 65957 66486 67170 67386 66914 66110 65439 64982 64632 64699 65815 67981 70092 70863 70084
64850 70084 68619 67306 66364 65824 65884 66632 67850 69358 71126 72756 73380 72560 71009 69832 69267 68707 67777
64833 67777 66727 65796 64925 64266 64234 64692 64703 63639 62149 61430 61797 62592 63297 63968 64516 64386 63408 62459 62712
64814 62712 64352 66466 68066 68889 69227 69407 69535 69495 69048 68093 66877 65780 64899 64076 63380 63204 63691 64426
64796 64426 65006 65651 66765 68036 68561 67989 67031 66588 66744 66952 66891 66672 66350 65730 64772 63815 63267 63217 63468
64777 63468 63799 64128 64566 65330 66468 67604 68137 67786 66872 65983 65504 65507 65944 66740 67728 68596 68986 68755 68270
64758 68270 68365 69687 71929 73926 74662 74110 72969 71857 71010 70551 70580 70948 71344 71745 72495 73704 74863
64741 74863 75352 75202 74996 75050 75043 74584 73834 73300 73179 73233 73316 73660 74421 75165 75184 74334 73238 72507 72013 71188 69857
64720 69857 68476 67620 67537 68187 69315 70351 70600 69872 68754 67994 67755 67704 67629 67609 67615 67360 66677 65799 65108 64762
64700 64762 64629 64449 64021 63424 63057 63254 63830 64249 64308 64358 64779 65500 66235 66931 67778 68988 70728 72944 74989
64681 74989 75786 74791 72675 70640 69188 67951 66612 65466 64993 65270 65919 66363 66129 65264 64450 64307 64558
64664 64558 64363 63565 63007 63333 64031 64144 63564 63073 63344 64407 65938 67458 68242 67658 65860 63836 62548
64647 62548 62212 62482 63057 63857 64763 65519 65966 66285 66880 67973 69322 70443 71125 71604 72114 72503 72470 72062
64629 72062 71661 71542 71703 72100 72746 73530 74210 74659 74864 74648 73783 72593 72011 72643 73936 74797 74937 75072
64611 75072 75671 76098 75482 74042 72915 72678 72673 72017 70819 69986 70045 70581 70764 70165 69080 68280 68328 68922 69108
64592 69108 68420 67576 67557 68220 68457 67743 66804 66562 67166 68391 70189 72190 73307 72762 71284 70448 70883 71771
64574 71771 72055 71442 70227 68922 68228 68662 69840 70641 70432 69734 69403 69610 69943 70094 70063 69985 70135 70827 71951
64555 71951 72905 73362 73770 74591 75337 75051 73707 72436 72149 72548 72800 72741 72769 72828 72180 70454 68407 67212
64537 67212 67172 67551 67580 67150 66395 65173 63436 61823 61320 62273 64048 65674 66494 66293 65279 64114 63565
64520 63565 63875 64610 65188 65333 65041 64488 64057 64083 64397 64480 64197 64026 64358 65008 65630 66174 66570 66431 65608 64752
64500 64752 64732 65621 66687 67319 67520 67592 67787 68268 68977 69457 69159 68066 66805 66072 66004 66127 65820 64992 64364
64481 64364 64785 66151 67371 67744 67790 68226 68596 67875 66206 64983 65016 65552 65548 65148 65246 66093 67056 67553 67644 67746
64461 67746 68172 68956 69819 70317 70236 69812 69440 69198 68869 68310 67685 67319 67436 67930 68384 68431 68124 67811 67623 67373
64441 67373 67047 67043 67698 68741 69491 69504 68888 68095 67516 67174 66728 65949 65196 65120 65768 66354 66176 65392 64600 64002
64421 64002 63556 63639 64848 66985 68839 69279 68297 66776 65519 64799 64617 64993 65899 67085 68093 68492 68149
64404 68149 67308 66354 65459 64509 63368 62163 61314 61272 62189 63773 65441 66682 67280 67235 66639 65751 65071 65091
64386 65091 65874 66998 68042 69038 70371 72229 74252 75744 76213 75701 74663 73603 72834 72475 72511 72819 73213
64369 73213 73544 73798 74115 74640 75318 75808 75759 75255 74899 75321 76622 78324 79771 80485 80340 79631 78892 78442
64351 78442 78135 77756 77507 77757 78418 78986 79272 79603 80228 80944 81575 82309 83242 83996 84266 84446 85133 86165 86714
64332 86714 86408 85858 85970 87139 89249 92042 95194 98304 101203 104251 108004 112554 117340 121740 125783
64317 125783 130161 135533 141856 148447 154567 159843 164162 167374 169190 169326 167752 164897 161577 158524
64303 158524 155982 153907 152377 151435 150643 149320 147391 145519 144207 143261 142427 141932 141879 141653 140677 139457
64287 139457 139061 139706 140608 141149 141309 140893 139339 136703 134068 132332 131106 129370 126801 123851 120834 117709
64271 117709 114693 112378 111011 110039 108650 106627 104514 103040 102483 102573 102932 103537 104666 106476 108742 111008
64255 111008 112854 114001 114424 114423 114429 114700 115307 116358 117956 119914 121876 123829 126190 129191 132488 135552
64239 135552 138159 140308 141963 143142 143977 144379 143907 142299 139938 137411 134811 131861 128620 125626 123410
64224 123410 122233 122181 123013 123881 123747 122366 120644 119728 119888 120418 120524 120171 120059 120879 122632 124760 126873
64207 126873 129081 131563 134204 136939 140073 143790 147630 151037 154294 158194 162748 166979 170256 173151
64193 173151 176538 180454 184445 188528 192998 197480 201006 203115 204194 204510 203555 200774 196557 192010 187870
64178 187870 184018 179993 175603 170990 166410 162125 158312 154900 151602 148234 145004 142386 140798 140421
64164 140421 141185 142726 144398 145539 145807 145249 144113 142787 141784 141425 141475 141445 141383 141949 143399 144903 145370
64147 145370 144748 143988 143798 144036 144356 144788 145436 146108 146621 147118 147720 148165 148152 147813 147571 147784 148847 151247
64129 151247 154910 158706 161264 162339 162924 163984 165603 167421 169305 171251 173082 174619 175929 177179
64115 177179 178490 180121 182396 185166 187703 189631 191713 195175 200350 206501 212937 219742 227278 235509
64101 235509 244150 253110 262385 271675 280438 288288 295037 300373 303717 304558 302917 299434 294954 289913
64087 289913 284143 277403 270116 263307 257715 253175 249090 245249 241814 238678 235359 231716 228342 225915
64073 225915 224317 222750 220703 218544 217080 216747 217389 218701 220639 223300 226551 230035 233589 237503 242184
64058 242184 247638 253480 259504 266031 273522 281961 290790 299444 307728 315646 323047 329661 335377 340229
64044 340229 344041 346290 346535 344954 342264 339116 335668 331789 327470 322879 318146 313317 308531 304116
64030 304116 300498 298059 296994 297125 297891 298768 299826 301701 304855 309010 313462 317868 322506 327816 333962
64015 333962 340912 348673 357153 365882 374146 381538 388356 395384 403320 412383 422325 432675 442984 453007
64001 453007 462816 472754 483224 494452 506437 519137 532635 547090 562512 578744 595775 614027
63989 614027 634210 656817 681888 709250 738833 770606 804449 840346 878670 919977 964477
63978 964477 1012018 1062709 1117335 1176976 1242503 1314717 1394893 1484889 1586771 1702618 1834793
63967 1834793 1986246 2160480 2361391 2593263 2860910 3169627 3524588 3929631 4385949
63958 4385949 4891631 5442391 6032888 6657837 7312653 7993386 8695277 9409981 10123308
63949 10123308 10815594 11464860 12050661 12556866 12972875 13293379 13516611 13641790 13667198
63940 13667198 13589845 13406529 13115836 12720740 12230747 11661981 11034715 10369666 9684841
63931 9684841 8993764 8305563 7626976 6965031 6328146 5724914 5162388 4645592 4177625
63922 4177625 3759160 3388037 3060286 2771911 2519456 2299302 2107424 1940134 1794492
63913 1794492 1667735 1556841 1459027 1372287 1295144 1226252 1164495 1108963 1058332 1010598 964064
63902 964064 918515 874910 833843 794781 756910 720201 685270 652427 621307 591437 562803
63891 562803 535701 510272 486436 464197 443700 424921 407563 391458 376875 364213 353455
63880 353455 344062 335362 326918 318722 311221 304984 300006 295473 290594 285587 281423 278589 276615 274935
63866 274935 273710 273481 274418 276293 278863 281819 284530 286309 286924 286574 285479 283885 282304 281209 280279
63851 280279 278401 274725 269536 263868 258382 252907 246982 240538 233854 227018 219772 212009 204246 197324
63837 197324 191640 186865 182469 178242 174204 170274 166352 162587 159203 156050 152698 149050 145601 142848
63823 142848 140686 138607 136401 134314 132523 130750 128633 126283 124181 122547 121106 119602 118259 117464
63809 117464 117183 117025 116819 116762 116933 117043 116831 116433 116115 115878 115582 115248 114950 114552 113882 113137 112794 113055 113604
63790 113604 113925 113733 113074 112179 111270 110403 109502 108568 107695 106758 105368 103453 101752 101244 101990 102931 103004 102217
63772 102217 101419 101244 101497 101479 100785 99787 99301 99687 100341 100365 99646 98922 98698 98590 98030 97209 96894 97504 98786
63753 98786 100310 101823 103107 103905 104095 103757 103016 102070 101322 101139 101431 101795 102193 103140 104999 107425 109770
63736 109770 111812 113745 115670 117530 119448 121618 123753 125052 124993 123969 122939 122546 122706 122867 122535 121738
63720 121738 121179 121749 123628 126013 128009 129658 131690 134397 137225 139574 141465 143144 144501 145290 145564
63705 145564 145376 144336 142040 138913 135991 133805 131987 130086 128216 126633 125239 123989 123332 123611 124236
63690 124236 124117 122959 121601 121006 121334 122130 122938 123504 123812 124245 125473 127744 130372 132209 132568 131610 130047
63673 130047 128772 128505 129301 130361 130713 130198 129531 129408 129922 130888 132211 133601 134351 133933 132696 131547 130959
63656 130959 130694 130466 130444 130964 132145 134026 136799 140589 145163 150106 155201 160475 166009 171954 178618
63641 178618 186262 194814 203976 213597 223731 234438 245870 258546 273013 288988 305136 320055
63629 320055 333305 345150 355446 363267 367743 368897 367497 364375 360117 355248 350350 345947 342368
63616 342368 339675 337595 335646 333511 331279 329037 326238 321811 315131 306690 297547 288268 278743 269043
63602 269043 260017 252755 247583 243806 240397 236781 233072 229907 228069 228026 229585 232068 234985 238484 243028
63587 243028 248702 255005 261313 267345 273162 278907 284678 290576 296702 303105 309797 316775 324060 331794
63573 331794 340369 350257 361517 373491 385124 395496 403878 409532 411896 411105 407995 403375 397571
63560 397571 390817 383777 377301 371775 367100 363172 360029 357483 355033 352248 349000 345181 340453 334453
63546 334453 327076 318454 308838 298621 288298 278240 268677 259958 252501 246211 240190 233462 225965
63533 225965 218487 211646 205330 199243 193598 188949 185474 182754 180204 177548 174860 172391 170410 169040
63519 169040 168074 167034 165544 163701 161966 160683 159840 159315 159137 159262 159247 158536 157202 156092 155994 156802 157777
63502 157777 158543 159437 160851 162582 164126 165472 167231 169881 173088 175990 178129 179952 182320 185638 189535
63487 189535 193353 196774 199944 203119 206303 209225 211597 213376 214784 216086 217455 219028 220937 223076
63473 223076 224967 226178 226964 228237 230696 234212 238215 242482 247163 252117 256629 259965 262073 263581
63459 263581 265214 267314 269833 272581 275435 278425 281822 286119 291762 298741 306613 315091 324574 335810
63445 335810 349062 363905 379933 397328 416479 437226 458654 479421 498016 512967 523348
63434 523348 529259 531655 531654 530075 527487 524318 520785 516914 512786 508711 505096 502100 499303 495703 490253
63419 490253 482551 472876 461487 448284 433446 418024 403274 389496 376121 363008 351017 341056
63407 341056 333057 326299 320453 315842 312789 311012 309767 308529 307515 307489 308885 311214 313571 315744 318452
63392 318452 322482 327996 334844 343058 352682 363448 375065 387654 401504 416539 432364 448800
63380 448800 465957 483682 501165 517182 530662 541078 548435 552914 554495 553073 549003 543321 537254
63367 537254 531652 526967 523501 521342 520222 519721 519442 518748 516593 512136 505517 497625 489060 479691 469240
63352 469240 457895 446240 434917 424547 415585 407950 400989 394072 387181 380809 375432 371188 367768
63339 367768 364348 359829 353661 346548 339990 334859 330533 325680 319803 313721 308473 304134 300057 296034
63325 296034 292605 290046 287651 284469 280499 276642 273565 271123 268991 267320 266490 266537 267150 268062 269131
63310 269131 270193 271131 272076 273265 274596 275530 275538 274603 273231 272070 271514 271542 271769 271662 270814 269105 266678
63293 266678 263844 261021 258608 256752 255246 253791 252361 251172 250279 249434 248481 247650 247237 247148 247058 246890 246800
63276 246800 246680 246112 244929 243563 242709 242856 244140 246270 248508 250137 251155 252163 253428 254548 255315
63261 255315 256313 258100 260236 261869 263052 264766 267656 271411 275455 279614 283930 288386 293026 297974
63247 297974 303182 308592 314635 322073 331178 341585 353150 366336 381328 397261 412917 427963
63235 427963 443032 458858 475754 493752 512633 531802 550602 568883 586967 604998 622607
63224 622607 639301 655000 670046 684890 699845 715075 730645 746534 762544 778176 792629
63213 792629 804896 813895 818614 818390 813081 802891 788134 769346 747477 723627 698569 672909
63201 672909 647625 623907 602311 582582 564544 548617 535178 524072 515285 509509 507228 507621
63189 507621 509290 512023 516972 524942 535282 546697 558526 570809 583673 597172 611455 626606
63177 626606 642320 657993 673137 687598 701478 714873 727622 739314 749712 759027 767473 774631
63165 774631 779649 782008 781571 777856 769982 757664 741767 723502 703513 682153 660129 638228 616683
63152 616683 595454 574967 555939 538503 522193 506894 493194 481533 471527 462517 454437 447660
63140 447660 442190 437466 433008 428950 425737 423443 421571 419534 417231 415055 413382 412153 410960 409374
63126 409374 407190 404605 402294 401061 401108 401756 402160 402188 402285 402640 402959 403131 403613 404921 407078 409847 413179
63109 413179 417092 421317 425467 429485 433624 438005 442446 446691 450557 453890 456607 458774 460435 461389
63095 461389 461433 460913 460788 461970 464648 468219 471751 474570 476724 478955 482000 485818 489695 493245 496989
63080 496989 501715 507418 513166 517990 521739 525148 529245 534655 541255 548470 555935 563829 572554 582353
63066 582353 593411 606000 620105 635081 650244 665916 683448 703974 727509 753424 781436
63055 781436 811760 844570 879727 916904 955607 995177 1035150 1075528 1116329 1156929 1196414
63044 1196414 1234677 1272609 1310877 1349006 1386176 1422604 1459483 1497505 1535972 1573512 1609241
63033 1609241 1642881 1674043 1701734 1724491 1740694 1748777 1747560 1736626 1716387 1687684 1651310 1608031
63021 1608031 1559007 1506086 1451513 1397208 1344333 1293547 1245517 1200949 1160156 1123017 1089705
63010 1089705 1061241 1038888 1022937 1012417 1006136 1003753 1005612 1011798 1021745 1034730 1050408 1068749
62998 1068749 1089608 1112457 1136431 1160580 1184254 1207378 1230289 1253232 1276054 1298374 1319861
62987 1319861 1340225 1359060 1375932 1390542 1402503 1410858 1414042 1410617 1400033 1382525 1358419 1327812
62975 1327812 1291037 1249118 1203468 1155291 1105479 1055021 1005105 956701 910203 865618 822985
62964 822985 782612 745036 710725 679602 650824 623423 597342 573570 553032 535604 520437
62953 520437 506894 494718 483597 473227 463827 455881 449196 442726 435670 428295 421391 415314 410007
62940 410007 405580 402217 399587 396975 394124 391514 389610 388218 386802 385113 383150 380734 377593 373904
62926 373904 370406 367779 366116 365104 364371 363382 361272 357422 352327 347441 343841 341318 339054 336801 334902
62911 334902 333390 331773 329745 327577 325616 323958 322849 322848 324119 325879 327067 327377 327253 327018 326530 325644
62895 325644 324534 323424 322319 321101 319722 318268 316963 316022 315305 314257 312543 310610 309263 308716 308505
62880 308505 308273 308135 308125 307903 307402 307291 308247 309975 311439 311997 311958 312128 313208 315530 318823 322068 324092
62863 324092 324645 324590 324778 325011 324546 323328 322142 321488 320874 319488 317167 314365 311487 308731 306352 304513
62847 304513 302812 300549 297678 295097 293679 293319 293256 293049 292842 292877 293244 294097 295615 297584 299366 300500
62831 300500 301167 301956 303341 305511 308436 311874 315367 318454 320900 322736 324207 325777 327999 331113 334720
62816 334720 338069 340781 343230 346092 349588 353330 356951 360722 365353 371223 378055 385439 393464 402616
62802 402616 413159 424905 437661 451656 467264 484387 502420 521021 540828 563130 588800
62791 588800 617875 650327 686860 728514 775564 827316 882918 941973 1004354 1070061 1139318
62780 1139318 1212113 1287203 1362078 1434356 1502698 1565887 1621629 1667168 1700880 1722537 1732173
62769 1732173 1729595 1715016 1689338 1653576 1608650 1555951 1497474 1435098 1370205 1304076 1238036
62758 1238036 1172945 1109132 1047102 987739 931600 878707 829430 784787 745158 709292 675420
62747 675420 643084 613206 586620 563268 542678 524419 507979 492772 478512 465258 453034
62736 453034 441701 431174 421521 412931 405783 400503 396953 394244 391628 389405 388376 388624 389461 390579
62722 390579 392491 395759 400463 406682 414814 425028 436827 449624 463428 478658 495599 514413
62710 514413 535429 558997 585215 614168 646369 682609 723306 768066 815851 865568 916688
62699 916688 969352 1023592 1078279 1131075 1179668 1222813 1259963 1290203 1312106 1324593 1327481 1321092
62687 1321092 1305717 1281768 1250219 1212606 1170528 1125247 1077695 1028688 979044 929558 880978
62676 880978 834034 789394 747518 708549 672375 638825 607797 579343 553697 531080 511255
62665 511255 493341 476314 459868 444626 431360 420080 410043 400592 391737 383777 376539 369344
62653 369344 361829 354535 348290 343087 338017 332418 326692 321670 317519 313778 310256 307310 305163 303476
62639 303476 301800 300041 298164 295807 292612 288869 285467 283120 281788 280873 279898 278944 278436 278529 278761 278468
62623 278468 277556 276725 276857 278277 280644 283423 286368 289666 293738 298858 304916 311540 318500 325941 334308
62608 334308 344175 356051 370170 386387 404425 424269 446217 470625 497747 527693 560259 594804
62596 594804 630586 667202 704338 741042 775678 806753 833423 854991 870448 878999 880801 876653
62584 876653 867039 851872 831217 805922 777503 747593 717405 687387 657363 627297 597936 570512
62572 570512 545768 523486 502989 483853 466069 449798 435190 422332 411208 401608 393107 385181
62560 385181 377529 370336 364046 358730 353795 348503 342705 336779 330939 324909 318374 311536 305100 299722
62546 299722 295467 291740 287856 283819 280409 278336 277464 277120 277046 277602 279069 281239 283861 287077 291167
62531 291167 296207 302314 309916 319408 330628 343041 356378 370833 386742 404386 424065 445981
62519 445981 469950 495543 522604 551287 581373 611861 641550 669788 696187 719689 738559
62508 738559 751627 759182 762228 761055 755059 743981 728732 710664 690397 667845 643241 617614
62496 617614 592226 567899 545075 524018 504658 486513 469248 453216 439060 426792 415706
62485 415706 405292 395806 387684 380766 374576 369077 364553 360786 356974 352802 349057 346732 345790 345279
62471 345279 344554 343905 344024 345329 347846 351290 355143 359062 363365 368698 374984 381203 386622 391831 398025
62456 398025 405568 413878 422499 431505 440748 449490 457086 463467 468527 471525 471692 469207 465031 459819
62442 459819 453432 445471 435858 424843 412894 400767 389350 379155 370081 361813 354214 347184 340411
62429 340411 333674 327317 322032 318160 315493 313839 313342 314020 315346 316749 318367 320875 324512 328753 333065
62414 333065 337539 342506 347885 353330 358807 364553 370503 376253 381729 387523 394247 401742 409180 415892
62400 415892 421864 427386 432449 436661 439707 441689 442877 443307 442858 441757 440681 440176 440173 440304 440565 441366
62384 441366 442988 445339 448278 452001 457076 464221 474009 486601 501795 519470 539806 562836 588070
62371 588070 615073 644293 676663 712213 749662 787514 824926 861079 894396 923092 946295
62360 946295 964149 977097 985649 990584 992673 992155 988930 983163 975057 964155 949616 931432 910746
62347 910746 888728 865676 841548 816829 792461 769306 748070 729329 713014 698067 683208
62336 683208 668057 653199 639234 626103 613227 599936 585877 571449 557770 545754 535158
62325 535158 524928 514566 504757 496575 490470 486228 483411 481460 479718 477878 476336 475733 476191 477255
62311 477255 478546 480104 482069 484292 486370 487852 488297 487411 485327 482658 480090 477948 476243 474996 474260
62296 474260 473917 473748 473816 474522 476156 478598 481722 485802 491103 497078 502525 506827 510741 515614 522043
62281 522043 529576 537585 546021 555344 566142 578915 593939 611160 630349 651432 674580 700066
62269 700066 728185 759112 792449 827041 861697 896140 930648 964604 996003 1022754 1044058
62258 1044058 1060239 1071807 1079165 1082655 1082158 1076930 1066569 1051942 1034478 1014772 992680 968661
62246 968661 944032 919767 895908 872474 850163 829795 811758 796348 783935 774320 766648 760483
62234 760483 756220 753853 752182 750194 748614 748902 751125 754082 757307 761571 767200 773278 779111 785334
62220 785334 792750 800841 808356 814921 821190 827645 834033 839892 845005 849353 853164 857084 861820 867456
62206 867456 873427 879243 884964 890844 896802 902483 907798 913234 919518 926960 935256 944059 953611 964516
62192 964516 976948 990467 1004630 1019292 1034146 1048553 1062297 1076159 1091218 1107853 1125845
62181 1125845 1145259 1166567 1190021 1215431 1242560 1271201 1300816 1330567 1359793 1387968 1414136
62170 1414136 1436953 1455594 1470277 1481711 1490440 1496902 1501685 1505277 1507776 1509046 1508890 1506916 1502637
62157 1502637 1496127 1488339 1480423 1472977 1466244 1460682 1456822 1454745 1454183 1455042 1457306 1460504 1463821 1466831
62143 1466831 1469631 1472155 1473878 1474443 1474083 1473067 1471094 1467715 1463187 1458547 1454829 1452437 1451151 1450482 1450051
62128 1450051 1449852 1450078 1450519 1450326 1448733 1446051 1443531 1442124 1441641 1441281 1440640 1439899 1439215 1438387 1437228 1435932
62112 1435932 1434877 1434132 1433307 1431874 1429594 1426693 1423767 1421510 1420377 1420364 1421028 1421757 1422081 1421867 1421296 1420699
62096 1420699 1420375 1420463 1420900 1421471 1421990 1422544 1423501 1425081 1426918 1428319 1429160 1430295 1432741 1436520 1440744 1444934
62080 1444934 1449815 1456450 1464845 1473811 1482186 1489797 1497128 1504340 1510771 1515260 1516823 1515104 1510332 1502924
62066 1502924 1493162 1481290 1467732 1452948 1437040 1419646 1400290 1378747 1355139 1329886 1303621
62055 1303621 1276951 1250239 1223750 1197964 1173488 1150645 1129428 1109885 1092122 1075722 1059693
62044 1059693 1043462 1027691 1013587 1001470 990466 979613 968802 958492 948924 939834 930727 921269
62032 921269 911561 902116 893367 885165 877032 868937 861424 854754 848297 841233 833670 826602 820669 815338
62018 815338 809537 802893 796072 789917 784513 779183 773341 767180 761487 756912 753438 750453 747213 743380
62004 743380 739241 735414 732212 729339 726237 722621 718498 713834 708491 702499 696176 689958 684216 679146
61990 679146 674605 670137 665441 660716 656325 652255 648358 644989 642856 642123 642165 642301 642320 642158 641696 641189
61974 641189 641355 642643 644818 647515 650692 654193 657584 660971 665346 671362 678263 684867 691126 697703
61960 697703 704406 710356 715780 722417 731686 743382 756546 770715 785823 801698 818389 836358
61948 836358 855670 875529 895317 915706 938042 962889 989820 1018417 1048721 1080811 1114585
61937 1114585 1150039 1187249 1226052 1266255 1308279 1353093 1401330 1452850 1507441 1565716 1628976
61926 1628976 1698217 1773484 1854388 1941261 2035634 2139370 2253432 2377745 2512209 2657336
61916 2657336 2813695 2981184 3159210 3347211 3544445 3749357 3959488 4171885 4383171
61907 4383171 4589205 4784959 4964732 5122395 5251804 5347690 5406533 5426657 5407748 5350632
61897 5350632 5257516 5132171 4979773 4806446 4618463 4421314 4219310 4015954 3814262 3616526
61887 3616526 3424283 3239050 3062774 2896973 2741720 2596115 2459671 2332586 2214850
61878 2214850 2105948 2005509 1913483 1829416 1752307 1681470 1616890 1558340 1504812 1455327 1409854
61867 1409854 1368868 1332363 1299812 1270827 1245352 1223356 1204766 1189545 1177449 1167858 1160196 1154398
61855 1154398 1150581 1148380 1146915 1145328 1143167 1140493 1137908 1136228 1135691 1135599 1135135 1134370 1134009 1134285 1134694 1134896
61839 1134896 1135394 1137127 1140669 1145950 1152476 1159660 1167178 1175122 1183693 1192736 1201750 1210379 1218678 1226919
61825 1226919 1235408 1244450 1254260 1264867 1276451 1289688 1305370 1323560 1343583 1365079 1388685 1415374
61813 1415374 1445481 1478762 1515082 1554557 1597099 1642421 1690635 1742450 1798600 1859355 1924826
61802 1924826 1995464 2071960 2154771 2244049 2340057 2443455 2555150 2676104 2807375 2950138
61792 2950138 3105459 3274123 3456855 3654657 3868795 4100463 4350537 4619515 4907376
61783 4907376 5213410 5536342 5874653 6226515 6589087 6957840 7326488 7687340 8031560
61774 8031560 8349375 8630481 8864643 9042431 9156234 9201417 9176841 9084317 8927856 8713714
61764 8713714 8450775 8149779 7821309 7474154 7115311 6750960 6387056 6029208 5682271
61755 5682271 5349807 5033573 4733663 4449667 4181884 3931277 3698328 3482335 3281981
61746 3281981 3096293 2924807 2766973 2621693 2487476 2362917 2247032 2139264 2039186
61737 2039186 1946253 1859899 1779833 1705970 1637932 1574909 1516283 1462169 1412882 1367913 1325955
61726 1325955 1286083 1248468 1213664 1181678 1152145 1125014 1100309 1077312 1054713 1031870 1009419
61715 1009419 988275 968409 949023 929717 911009 893715 878122 863859 850264 836779 823180
61704 823180 809607 796371 783615 771166 758758 746435 734689 724037 714427 705173 695582 685514
61692 685514 675170 664562 653593 642586 632223 622809 613986 605386 597144 589501 582252 575042 567889
61679 567889 560917 553830 546207 538232 530531 523277 516033 508604 501518 495427 490466 486398 482911 479498
61665 479498 475481 470663 465730 461558 458279 455380 452524 449838 447464 445352 443560 442379 441926 441842 441575
61650 441575 440851 439789 438705 437945 437758 438146 438806 439316 439404 439090 438626 438317 438342 438720 439416 440446 441801 443312
61632 443312 444690 445704 446305 446556 446486 446107 445557 445170 445230 445607 445749 445176 443879 442134 440047 437620 435157
61615 435157 433213 431941 430848 429388 427559 425713 424078 422754 421871 421309 420501 418992 417061 415268 413466
61600 413466 410949 407658 404572 402597 401621 401027 400597 400339 399909 398934 397796 397418 398247 399946 402123 404793
61584 404793 407996 411458 414948 418637 422844 427699 433217 439374 445892 452289 458524 465321 473470 482952
61570 482952 493118 503562 514436 525993 538320 551545 565814 580895 596161 611173 625995
61559 625995 640763 655270 669341 683362 698003 713418 729043 744250 758956 773488 788034
61548 788034 802398 816210 829235 841449 852886 863507 873282 882333 890860 898884 906121 912137 916532
61535 916532 919031 919631 918811 917420 916094 914851 913342 911393 909145 906851 904867 903770 904157 906316 910304
61520 910304 916279 924351 934050 944506 955537 968240 984079 1003516 1025893 1050514 1077422 1107079
61508 1107079 1139802 1175774 1215316 1258867 1306784 1359329 1416763 1479317 1547149 1620454 1699486
61497 1699486 1784259 1874260 1968578 2066272 2166342 2267296 2366906 2462580 2551891 2632698 2702855
61486 2702855 2760063 2802218 2828085 2837726 2832335 2813614 2783214 2742667 2693633 2638017 2577789 2514765
61474 2514765 2450596 2386820 2324713 2265044 2208033 2153686 2102221 2054261 2010649 1972019 1938460
61463 1938460 1909539 1884721 1863859 1847295 1835435 1828151 1824678 1824247 1826873 1833330 1844097 1858432
61451 1858432 1874814 1892307 1911162 1931961 1954618 1978583 2003703 2030267 2058242 2086999 2115965
61440 2115965 2145100 2174552 2204275 2234194 2264296 2294061 2322180 2347443 2369878 2390485 2409909
61429 2409909 2427851 2443781 2457542 2468967 2477504 2482819 2485456 2486324 2485562 2482440 2476548 2468649 2460080
61416 2460080 2451505 2442530 2432390 2420661 2407263 2392151 2375440 2357821 2340455 2324109 2308503 2292873
61404 2292873 2277291 2263009 2251208 2241618 2232795 2223754 2214888 2207129 2200671 2194886 2189265 2183937 2179313
61391 2179313 2175783 2173975 2174909 2179545 2188366 2201700 2220156 2244347 2274307 2309693 2350602 2397764
61379 2397764 2451850 2513025 2581360 2657177 2740645 2831370 2928691 3032018 3140344 3251662 3363380
61368 3363380 3473259 3579446 3679603 3770507 3848655 3911002 3955254 3980171 3985901 3973695 3944963
61357 3944963 3900780 3842335 3771423 3690184 3600579 3504336 3403026 3297940 3190162 3081006
61347 3081006 2972152 2865061 2760628 2659671 2563382 2472754 2387812 2308019 2233400 2164789
61337 2164789 2103033 2048421 2000880 1960136 1925531 1896196 1871677 1852076 1837399 1827109 1820581
61326 1820581 1817751 1819079 1825046 1835746 1850684 1868754 1888689 1909663 1931189 1952316 1971434 1987328
61314 1987328 2000109 2010632 2019276 2025895 2030872 2035492 2040999 2047672 2055041 2062602 2070053 2077225 2084166
61301 2084166 2091112 2097944 2103771 2107436 2108449 2107137 2103869 2098512 2090755 2080578 2068200 2053861 2037982
61288 2037982 2021241 2003971 1985569 1965062 1942390 1918723 1895378 1872842 1851166 1830807 1812528
61277 1812528 1796660 1782978 1771105 1760460 1749807 1737565 1722876 1706028 1687701 1668251 1647966
61266 1647966 1627507 1607672 1589024 1572090 1557514 1545509 1535491 1526928 1520476 1517652 1519290 1524860
61254 1524860 1533495 1545108 1560162 1578737 1600314 1624434 1651287 1681722 1716783 1757123 1802578
61243 1802578 1852251 1905015 1959814 2015466 2070322 2122322 2169410 2209902 2242606 2266707 2281489
61232 2281489 2286196 2280346 2264294 2239206 2206304 2166193 2119135 2065889 2008057 1947649 1886510 1826235
61220 1826235 1768354 1714208 1664414 1618499 1575326 1534049 1494623 1457426 1422785 1391199 1363652
61209 1363652 1340908 1322257 1305448 1288235 1269742 1250227 1230106 1209755 1189892 1171455 1155062
61198 1155062 1140917 1129074 1119293 1110723 1102308 1093629 1084968 1076477 1067770 1058439 1048512 1038167 1027412
61185 1027412 1016293 1005076 993934 982693 971195 959602 948063 936360 924292 912283 901215
61174 901215 891709 883829 877408 872329 868527 866053 865176 866174 868904 872735 876900 880746 883575 884377 881901
61159 881901 875100 863708 848525 831078 812835 794674 777018 760145 744223 729209 715034 701776
61147 701776 689362 677200 664527 651224 638040 625869 615013 605315 596718 589376 583202 577617
61135 577617 571944 565980 560031 554392 548956 543448 537889 532640 528121 524715 522848 522742 524003 525901
61121 525901 528293 531915 537385 544119 550552 555302 557859 558395 557366 555160 551825 547118 541092 534425
61107 534425 527819 521300 514597 508028 502423 498106 494501 490765 486338 480860 474263 467123 460337 454122
61093 454122 447814 440885 433638 426640 420067 414044 409012 405212 402232 399653 397671 396506 395609 394327
61079 394327 393123 393178 394759 396798 398282 399303 400473 401954 403524 405126 406843 408625 410399 412348 414733
61064 414733 417587 420800 424333 428098 431782 434985 437501 439223 439952 439503 437997 435807 433152 429955 426206
61049 426206 422434 419598 418342 418326 418443 417859 416769 416022 416091 416659 417138 417279 417144 416716 415733 413913 411331
61032 411331 408753 407543 408859 412706 417934 423372 428916 435319 443107 452028 461622 472047 484170 498937
61018 498937 516812 537778 561743 588930 620095 656590 700426 754383 821792 905008 1002093
61007 1002093 1103568 1193222 1254974 1281825 1279487 1261706 1242454 1232025 1237389 1261397 1298850
60996 1298850 1334732 1349991 1332008 1280881 1206832 1122679 1038350 959924 890687 831713 782190
60985 782190 740561 705854 677793 655773 638371 624193 612843 604582 599188 595647 592984 590924
60973 590924 589440 588032 585810 582177 577122 571006 564401 558123 552856 548414 543645 537383 529521 520861
60959 520861 512008 502792 492881 482548 472434 462779 453375 444256 435890 428479 421484 414250 406873 400053
60945 400053 394208 389163 384736 381237 379172 378653 379307 380758 383108 386851 392168 398294 403846 407986 411126
60930 411126 414319 418165 422559 427157 431545 435063 437126 437920 438301 438781 438954 438078 435875 432615 428808
60915 428808 425094 421992 419370 416415 412502 407909 403396 399350 395671 392218 388835 385122 380764 376174
60901 376174 372310 369691 367905 366207 364254 362041 359436 356192 352383 348485 344905 341601 338315 335179
60887 335179 332865 331966 332282 332951 333330 333626 334585 336780 340299 344974 350630 357180 364614 372899 381873 391299
60871 391299 401062 411027 420546 428328 433258 435401 436010 436506 437611 439432 442046 445636 449981 454020 456255
60856 456255 455914 453709 451246 449613 448688 447794 446650 445452 444251 442607 439797 435322 429366 422898 417009
60841 417009 411926 406936 401519 396165 391650 387875 384131 380392 377556 376230 375953 375988 376343 377443 379110
60826 379110 380424 380621 379714 378135 376092 373530 370631 368081 366606 366288 366493 366546 366311 366010 365785 365717 366100
60809 366100 367222 368867 370393 371437 372299 373511 375274 377367 379423 381196 382817 384801 387570 390851
60795 390851 393761 395543 396084 395809 395411 395669 397034 399182 401280 402809 403800 404234 403819 402708 401820 401850 402311
60778 402311 402215 401493 401148 402057 404180 406893 409440 411022 411153 410242 409319 408860 408329 407206 405933 405310 405324
60761 405324 405320 405240 405910 407916 410734 413361 415366 416914 418027 418354 417656 416065 413808 411002 407833 404630
60745 404630 401552 398445 395222 392158 389584 387364 384993 382172 379148 376552 375034 374900 375872 377263 378640
60730 378640 380252 382603 385695 388999 392077 394848 397211 398858 399600 399537 398777 397326 395389 393353 391165
60715 391165 388137 383728 378298 372739 367665 363308 359887 357453 355520 353485 351483 350189 349616 348696 346494
60700 346494 343439 340916 339785 339684 339665 339093 337951 336722 336144 336754 338370 340154 341476 342647 344520 347302
60684 347302 350161 352238 353771 355825 358998 362841 366598 370059 373480 377082 380972 385269 389841 394049
60670 394049 397201 399303 401092 403397 406735 411397 417411 424296 431302 438120 445161 453007 461806 471299
60656 471299 481050 490435 498723 505521 511013 515511 518923 520915 521432 520765 519180 516785 513681 509987 505721
60641 505721 500953 496032 491367 486962 482562 478293 474791 472418 470667 468713 466362 464102 462281 460621
60627 460621 458622 456125 453353 450615 448138 445999 444008 441798 439260 436876 435416 435279 436232 437750 439397
60612 439397 440898 442033 442622 442556 441837 440677 439516 438697 438053 437025 435358 433498 432078 431189 430443 429649
60596 429649 429025 428692 428332 427578 426529 425602 425001 424590 424234 423985 423839 423484 422516 420919 419286 418445 418791 419913
60578 419913 420914 421200 420996 421097 422142 424168 426787 429621 432443 435018 437031 438354 439313 440559 442534
60563 442534 445056 447351 448572 448399 447338 446438 446583 447983 450370 453570 457695 462760 468441 474468 481055
60548 481055 488702 497678 507971 519634 532789 547259 562697 579305 598082 619907 644393 669846
60536 669846 694225 715964 733981 747326 755077 756567 751806 741756 728078 712353 695533 678250
60524 678250 661491 646541 634150 624057 615488 607998 601713 597002 594141 593194 593976 596106 599313 603702
60510 603702 609744 618005 628968 642964 660102 680144 702408 725715 748466 769007 786112 799087
60498 799087 807464 810926 809813 805514 799959 794637 790330 787672 787607 791128 798919 811426 829066 852103
60484 852103 880419 913727 952085 996113 1046742 1104887 1171400 1247212 1333317 1430485 1538791
60473 1538791 1657155 1782782 1910434 2032071 2137841 2218359 2266732 2279045 2254031 2193500
60463 2193500 2103080 1991353 1867249 1738052 1609535 1486623 1372747 1268959 1174730 1089754
60453 1089754 1014306 948066 889683 837893 792250 752291 716801 684661 655980 631540 611277
60442 611277 594041 578885 565818 555021 545873 537260 528642 520409 513161 506965 501488 496672 492975
60429 492975 490786 489674 488434 485966 482138 477825 474207 471938 470774 469855 468440 466475 464527 463286
60415 463286 463186 464286 466133 467768 468318 467794 467063 466864 467187 467813 469103 471722 475780 480723 486117 492114
60399 492114 498960 506403 513792 520597 526650 531992 536708 540959 545031 549286 553999 559234 564843 570502
60385 570502 575738 580070 583341 585918 588339 590713 592726 594243 595572 596969 598207 598911 599034 598735 598081
60370 598081 597337 597246 598482 600856 603596 606380 609600 613600 618236 623360 629098 635310 641300 646523 651276
60355 651276 656187 661243 665776 669267 671679 673087 673541 673478 673792 675056 676808 677878 677551 676272 675087
60340 675087 674443 673649 671606 667908 663047 657591 651503 644454 636514 628298 620504 613580 607683 602616 597810
60325 597810 592703 587298 582109 577395 572653 567124 560709 554107 547981 542264 536459 530522 525168 521223
60311 521223 518824 517377 516215 515155 514362 513913 513634 513373 513253 513514 514136 514698 514693 513936 512624 511128 509859
60294 509859 509267 509625 510696 511824 512577 513095 513586 513768 513251 512411 512341 513732 516182 518848 521377 523878 526275
60277 526275 528219 529652 530977 532526 534148 535505 536538 537449 538384 539415 540783 542818 545484 548167 550159
60262 550159 551345 552300 553787 556300 559997 564695 569736 574175 577531 580329 583676 588300 594180 600953
60248 600953 608299 615957 623817 632264 642109 653936 667631 682733 699011 716475 735056 754642
60236 754642 775430 798065 823377 852048 884361 920116 958944 1000871 1046436 1096109 1149808
60225 1149808 1207215 1268325 1333275 1401749 1472969 1546133 1620365 1694204 1765755 1833633 1897265
60214 1897265 1955997 2008454 2053313 2090332 2119875 2141502 2153846 2156123 2149220 2134936 2114636 2089152
60202 2089152 2059716 2028195 1996337 1965247 1935880 1909646 1888180 1872628 1863449 1860797 1864895 1876084
60190 1876084 1894842 1921839 1957790 2003123 2057800 2121328 2192728 2270455 2352619 2437342 2522722
60179 2522722 2606374 2685351 2756863 2819007 2870578 2910262 2936367 2947534 2943571 2925438 2894442
60168 2894442 2851563 2797652 2734310 2664412 2591481 2518379 2446647 2377231 2311642 2252162 2200947
60157 2200947 2159205 2127311 2105405 2093698 2092402 2101679 2121670 2152308 2192920 2241995 2297283 2355978
60145 2355978 2414926 2471090 2522244 2567275 2605615 2636327 2657977 2669520 2671240 2664630 2651456 2633118
60133 2633118 2610890 2586472 2562088 2540141 2522873 2512172 2509345 2515041 2529637 2553964 2589492 2637591
60121 2637591 2698716 2772632 2859421 2959847 3074555 3203359 3345750 3501799 3671874 3855399
60111 3855399 4050335 4253937 4463431 4675697 4886870 5092797 5289633 5473627 5640720
60102 5640720 5786996 5909484 6006062 6074698 6113376 6120859 6097115 6043042 5960345 5851850 5721398
60091 5721398 5573087 5410804 5238544 5060693 4881630 4705218 4534749 4373110 4222749
60082 4222749 4085649 3963395 3856982 3766570 3691822 3632616 3589032 3560537 3545672 3542759 3550465
60071 3550465 3567438 3591974 3622367 3657103 3694296 3731509 3766678 3798693 3826405 3847582 3859781
60060 3859781 3862066 3854986 3838951 3813559 3778609 3734867 3683436 3624967 3559823 3488535 3411780 3330363
60048 3330363 3245600 3159420 3073850 2990565 2910967 2836316 2767687 2706131 2652975 2609468 2576074
60037 2576074 2552680 2539692 2538317 2549382 2572445 2606587 2651634 2708013 2775637 2853431 2939668
60026 2939668 3032136 3128023 3224100 3317106 3403824 3481122 3546466 3598303 3635562 3656945 3661228
60015 3661228 3648142 3618376 3572744 3512020 3437752 3352685 3260056 3162920 3064331 2967483 2875007
60004 2875007 2788352 2708366 2636338 2573892 2521933 2480286 2448525 2426760 2415393 2414592 2424458 2445573
59992 2445573 2478935 2525298 2584758 2656939 2741312 2837259 2943946 3060039 3183228 3309938
59982 3309938 3435714 3556056 3666917 3764770 3846936 3912208 3960705 3992566 4006857 4002039 3977311
59971 3977311 3933158 3870946 3792741 3701609 3601457 3496221 3389429 3284576 3185328 3094983
59961 3094983 3015904 2949609 2896938 2857854 2831513 2817155 2814828 2824930 2847188 2880483 2923580
59950 2923580 2975643 3035977 3103567 3176909 3254135 3333318 3412729 3490666 3564940 3632941 3692686
59939 3692686 3743664 3786303 3820748 3846688 3864269 3874587 3879132 3879310 3876798 3873983 3873707 3878781 3891824
59926 3891824 3915210 3950876 4000451 4065634 4147945 4247766 4364130 4495967 4643060 4805016
59916 4805016 4979574 5162752 5350577 5539630 5725637 5902504 6063432 6202491 6314625
59907 6314625 6395021 6439817 6447629 6419689 6358536 6267242 6149940 6012045 5859233 5696504 5528420
59896 5528420 5359538 5193942 5034668 4884133 4744906 4619413 4509074 4414341 4335583 4273327
59886 4273327 4227621 4197843 4183462 4184544 4201159 4232612 4277512 4334244 4401044 4475816 4556299
59875 4556299 4640203 4724787 4806307 4880274 4942465 4989682 5019699 5030870 5022108 4993276 4945488
59864 4945488 4880782 4801331 4708974 4605564 4493477 4375256 4252686 4126708 3998513 3870285
59854 3870285 3744404 3622236 3504260 3391306 3284968 3186563 3096129 3012743 2935533 2864080
59844 2864080 2798021 2736685 2679162 2624557 2572219 2521937 2473996 2428868 2386715 2347236 2309990
59833 2309990 2274709 2241133 2208746 2177040 2146216 2117307 2091285 2068129 2047153 2028241 2012368
59822 2012368 2000673 1993337 1989684 1989264 1992442 1999942 2012097 2028586 2048636 2071346 2096024 2122419
59810 2122419 2150601 2180522 2211713 2243350 2274392 2303541 2329330 2350577 2366941 2378925 2387435
59799 2387435 2393407 2397787 2401611 2405980 2412095 2421362 2435271 2455031 2481516 2515663 2558752 2612085
59787 2612085 2676680 2753634 2844673 2951864 3076849 3220863 3385443 3572301 3781822 4011663
59777 4011663 4256270 4506170 4746413 4956549 5114698 5204232 5218548 5161426 5044431 4883641
59767 4883641 4696375 4498184 4301022 4113055 3939258 3782051 3642228 3520053 3415655
59758 3415655 3328533 3257435 3201163 3159073 3130364 3113432 3106599 3109298 3121869 3144279 3175653 3215085
59746 3215085 3262315 3317441 3380498 3451711 3531875 3622109 3723219 3835505 3959252 4095279
59736 4095279 4244940 4409620 4590398 4788182 5003968 5238767 5493423 5768767 6065711
59727 6065711 6384672 6724801 7083992 7459431 7847342 8242027 8635853 9020628 9388734
59718 9388734 9733174 10047943 10329691 10578905 10798883 10993863 11168608 11328889 11480696
59709 11480696 11628405 11774209 11919196 12064086 12208630 12351175 12489304 12620598 12742600
59700 12742600 12852714 12948702 13029190 13093678 13142502 13177045 13199561 13212546 13218589 13221039 13224391
59689 13224391 13233595 13253117 13286845 13338602 13412332 13511732 13639722 13798176 13988165 14210489
59679 14210489 14465730 14753230 15069984 15410892 15770139 16141753 16518587 16891151 17247757
59670 17247757 17575553 17861298 18091844 18254925 18340360 18341341 18255487 18085150 17836686 17519387
59660 17519387 17145136 16728445 16285422 15831584 15380197 14941996 14524795 14131596 13758359
59651 13758359 13393657 13020968 12622779 12185448 11703469 11181195 10630901 10068550 9509756
59642 9509756 8967371 8450472 7964342 7511196 7091262 6703759 6347558 6021380 5723486
59633 5723486 5451383 5202340 4974340 4766198 4576679 4404052 4246756 4103985 3975132
59624 3975132 3859099 3754661 3661142 3578113 3504586 3439081 3380370 3327712 3280480 3238043 3199889
59613 3199889 3165296 3132834 3100699 3067633 3033217 2997346 2959869 2920791 2880421 2839148 2797287
59602 2797287 2755060 2712528 2669731 2627268 2586489 2548576 2513606 2481083 2451253 2425018 2402525
59591 2402525 2382765 2365039 2350031 2338813 2331383 2326936 2325198 2326616 2331281 2338438 2347318 2357947 2370899
59578 2370899 2386569 2404917 2425692 2448634 2473598 2500661 2530012 2561625 2595185 2630510 2668003
59567 2668003 2708431 2752249 2799374 2849775 2904084 2963286 3027859 3097575 3172311 3252731 3339760
59556 3339760 3433477 3532884 3636790 3744567 3855914 3970356 4087472 4207371 4329893 4452469
59546 4452469 4568820 4670815 4752682 4813915 4858208 4889727 4910400 4920125 4918418 4905374 4881615
59535 4881615 4848032 4805594 4755028 4696763 4631563 4561201 4488185 4414773 4342504 4272668 4206865
59524 4206865 4146939 4094651 4051624 4019518 3999996 3994451 4003809 4028697 4069924 4128811 4206810 4304662
59512 4304662 4421940 4557434 4709618 4876324 5053975 5237446 5420697 5597408 5761142
59503 5761142 5905447 6024172 6111891 6164367 6179202 6156315 6097681 6006496 5886735 5743369
59493 5743369 5582539 5410987 5235112 5060359 4891125 4730915 4582564 4448394 4330207
59484 4330207 4229197 4145927 4080391 4031972 3999536 3981882 3978260 3988214 4010792 4044032 4085339
59473 4085339 4132184 4182285 4233271 4282473 4327074 4364289 4391411 4405992 4406279 4391454 4361254 4315404
59461 4315404 4253751 4177058 4087357 3987123 3878294 3762482 3641927 3519415 3396946 3275065
59451 3275065 3153985 3034921 2919750 2809612 2704570 2604650 2510511 2422887 2341778 2266531
59441 2266531 2196524 2131613 2072060 2018138 1969702 1926174 1887083 1852550 1823052 1798767 1779391
59430 1779391 1764490 1753711 1746658 1742846 1741992 1744387 1751093 1763597 1782366 1804932 1825685 1838708
59418 1838708 1841468 1835836 1825850 1815100 1805945 1799910 1798060 1801354 1810927 1827233 1848222 1868879 1883648
59405 1883648 1889820 1888756 1884341 1880670 1880657 1885638 1895657 1910180 1928786 1951423 1978381 2010219 2047477
59392 2047477 2090186 2137842 2190016 2246808 2308566 2375509 2447907 2526308 2611171 2702577 2800720
59381 2800720 2906491 3021130 3145447 3279921 3425471 3583601 3755738 3943025 4146970
59372 4146970 4369849 4614058 4881112 5171451 5484960 5821258 6179273 6556489 6948636
59363 6948636 7350093 7754496 8154943 8544029 8914545 9260704 9578616 9865508 10118918
59354 10118918 10337005 10519150 10665369 10774999 10846354 10877672 10867839 10816026 10721109 10581880
59344 10581880 10397799 10169567 9899343 9590719 9248486 8878452 8487615 8084266 7677244
59335 7677244 7274524 6882352 6505510 6147811 5811975 5499279 5209791 4943029 4698331
59326 4698331 4474774 4271155 4086250 3918985 3768309 3632982 3511628 3402932 3305715 3218862
59316 3218862 3141277 3071977 3009999 2954131 2902911 2855267 2811146 2771147 2735396 2703018 2672775
59305 2672775 2643874 2616037 2589333 2564359 2542132 2523100 2506410 2490739 2475874 2462930 2453050
59294 2453050 2446463 2442910 2442400 2445281 2452047 2463280 2479346 2499859 2523846 2550720 2580675 2613852
59282 2613852 2649566 2686690 2724247 2761050 2795222 2824889 2849222 2868125 2880947 2886267 2883088 2871624
59270 2871624 2852644 2826591 2793647 2754257 2709235 2659684 2606991 2552480 2496726 2439583 2381335
59259 2381335 2323414 2267464 2213963 2162408 2112676 2065449 2021296 1980153 1941976 1907211 1876137
59248 1876137 1848305 1823227 1801280 1783318 1769618 1759845 1753885 1752051 1754380 1760329 1769348 1781307
59236 1781307 1796244 1814202 1835512 1860758 1890193 1923655 1961407 2004568 2054218 2110362 2172384
59225 2172384 2240433 2315828 2400079 2493967 2597721 2711853 2837622 2976726 3130504 3299368
59215 3299368 3483155 3682036 3896589 4126661 4370298 4624018 4883501 5143328 5396332
59206 5396332 5634253 5849394 6035257 6185741 6294755 6357319 6370762 6334641 6250185 6120534
59196 6120534 5951283 5750053 5525184 5284677 5035765 4784700 4536616 4295665 4065197
59187 4065197 3847691 3644618 3456556 3283335 3124121 2977799 2843780 2722283 2613554
59178 2613554 2516927 2430950 2354277 2286086 2225778 2172708 2126204 2085467 2049447 2017228 1988529
59167 1988529 1963485 1941810 1922550 1904742 1887948 1871959 1856375 1840824 1825400 1810609 1796920
59156 1796920 1784442 1772826 1761301 1749015 1735547 1721080 1706003 1690509 1674654 1658497 1641949
59145 1641949 1624735 1606768 1588375 1569821 1550818 1530940 1510471 1490389 1471418 1453451 1436015
59134 1436015 1418987 1402646 1387269 1372898 1359440 1346900 1335652 1326437 1319834 1315583 1312722 1310553
59122 1310553 1309273 1309512 1311579 1315440 1321189 1329074 1339067 1350762 1363762 1377860 1392731 1407700 1421993
59109 1421993 1435213 1447602 1459877 1472695 1486025 1499068 1510968 1521680 1532005 1542863 1554768
59098 1554768 1567974 1582848 1599983 1620095 1643783 1671147 1701596 1734268 1768738 1805105 1843361
59087 1843361 1882992 1923391 1964354 2005832 2047273 2087456 2124953 2158615 2187667 2211557 2229742
59076 2229742 2241562 2246283 2243284 2232254 2213320 2187083 2154460 2116368 2073596 2027070 1978060 1927858
59064 1927858 1877291 1826794 1776818 1727789 1679739 1632524 1586505 1542533 1501039 1461585 1423550
59053 1423550 1386873 1351825 1318516 1287030 1257673 1230664 1205784 1182750 1161650 1142616 1125319
59042 1125319 1109247 1094244 1080227 1066589 1052485 1037718 1022867 1008579 995232 983193 972737
59031 972737 963593 955052 946737 938883 931783 925351 919395 913931 908989 904388 899923 895601 891639 888374
59017 888374 886195 885277 885370 885970 886691 887249 887318 886830 886334 886639 888071 890445 893620 897555 901946 906464 911468
59000 911468 917812 925778 934821 944565 955377 967563 980643 993960 1007615 1022177 1037789 1053987
58988 1053987 1070203 1085965 1100794 1114369 1126716 1138010 1148311 1157693 1166384 1174456 1181603 1187491
58976 1187491 1192187 1196001 1199177 1202047 1205151 1208773 1212499 1215637 1218057 1220349 1223307 1227536 1233441 1241256
58962 1241256 1251021 1262593 1275581 1289297 1303068 1316705 1330303 1343543 1355756 1366932 1378029
58951 1378029 1389860 1402172 1414385 1426629 1439287 1452030 1464324 1476712 1490561 1506396 1523319
58940 1523319 1540371 1557754 1576437 1597158 1620177 1645515 1673023 1702527 1734139 1768218 1804829
58929 1804829 1843632 1884445 1927556 1973217 2021189 2071119 2123142 2177760 2235263 2295608 2358881
58918 2358881 2425742 2497330 2574660 2657965 2746697 2840345 2939231 3044238 3155804 3273510 3396677
58907 3396677 3525078 3658968 3798831 3945318 4099155 4260844 4430543 4608354 4794574
58898 4794574 4989538 5193288 5405414 5624919 5850108 6078797 6308837 6538397 6765668
58889 6765668 6988366 7203490 7407458 7596637 7768129 7920201 8051779 8161433 8247040 8306393
58879 8306393 8337866 8340455 8313646 8257656 8173726 8063975 7930923 7777203 7605504 7418634
58869 7418634 7219567 7011351 6796747 6577900 6356490 6134237 5913178 5695435 5482834
58860 5482834 5276693 5077817 4886718 4703973 4530306 4366197 4211635 4066478 3930875
58851 3930875 3804865 3687797 3578702 3477302 3384123 3299491 3222901 3153516 3090758 3034195
58841 3034195 2983400 2938284 2899153 2866031 2838181 2814634 2794910 2778928 2766489 2757275 2751203 2748496
58829 2748496 2749633 2755382 2766472 2782778 2803111 2826319 2852491 2882670 2917576 2957092 3000877 3048946
58817 3048946 3101549 3158961 3221591 3290059 3364992 3446905 3536313 3633778 3739817 3854910 3979625
58806 3979625 4114473 4259559 4414470 4578559 4751343 4932739 5123038 5322559 5531182
58797 5531182 5748216 5972633 6203099 6437483 6672608 6904847 7130934 7347952 7552605
58788 7552605 7740891 7908594 8051987 8168137 8254830 8310416 8333789 8324603 8283493 8211752 8110515
58777 8110515 7980345 7821839 7636549 7427151 7197071 6950382 6691989 6427281 6161236
58768 6161236 5897759 5639737 5389362 5148286 4917647 4698121 4489984 4293258 4107883
58759 4107883 3933694 3770229 3616881 3473420 3340079 3216862 3103068 2997827 2900733 2811378
58749 2811378 2728560 2650730 2577289 2508781 2445643 2387411 2333336 2283099 2236485 2192830 2151339
58738 2151339 2111704 2074006 2038230 2004297 1972388 1942754 1915199 1889128 1864168 1840503 1818399
58727 1818399 1797459 1776491 1754276 1730546 1706046 1681470 1656544 1630479 1603094 1574857 1545792
58716 1545792 1515106 1482207 1447543 1412040 1376217 1340394 1305233 1271367 1238735 1206994 1176508
58705 1176508 1148240 1122719 1099717 1078987 1060619 1044516 1030163 1017199 1005700 995563 986012
58694 986012 976075 965268 953614 941396 929241 917982 907925 898488 889015 879732 871501 864822 859665
58681 859665 856165 854889 856227 860050 866132 874491 885071 897487 911480 927371 945696 966483 989226
58668 989226 1013509 1039232 1066038 1092571 1116427 1134862 1145754 1148195 1142409 1129213 1109662 1085146
58656 1085146 1057492 1028574 999670 971310 943811 917790 894115 873444 855916 841207 828809
58645 828809 818363 809844 803496 799503 797716 797669 798864 801099 804556 809530 815934 823043 829914 836158
58631 836158 842231 848883 856484 865036 874591 885204 896481 907658 918481 929739 942542 957214
58619 957214 973300 990549 1009295 1029768 1051689 1074979 1100430 1128990 1160587 1194338 1229912
58608 1229912 1268014 1309377 1353910 1401284 1451726 1505657 1562827 1622447 1684043 1747636 1813151
58597 1813151 1880121 1947993 2016113 2083261 2147665 2207637 2261790 2308506 2345797 2372154 2387205
58586 2387205 2391166 2384058 2366048 2338435 2303650 2264087 2221199 2175689 2128155 2079388 2030410 1982458
58574 1982458 1936608 1893115 1851208 1809883 1768975 1729277 1691607 1655954 1621679 1588375 1556260
58563 1556260 1525675 1496541 1468563 1441803 1416666 1393243 1370972 1349183 1327796 1307258 1287879
58552 1287879 1269353 1250879 1231637 1211296 1190302 1169632 1150054 1131555 1113420 1094724 1074685
58541 1074685 1052939 1029920 1006881 985100 964852 945432 926230 907520 890047 874151 859542
58530 859542 845815 832918 821181 811103 803003 796577 790718 784080 776113 767586 759964 754253 750470
58517 750470 748079 746646 745907 745487 744957 744271 743860 744146 745085 746267 747293 747946 748224 748357 748570 748602 747740 745702
58499 745702 743339 741946 741867 742246 742192 741722 741357 741296 741402 741656 742152 742781 743292 743605 743734 743515 742783 741779 741004
58480 741004 740601 740237 739633 738880 738149 737456 736856 736512 736346 736000 735399 735063 735389 735858 735479 733999 732220 731015
58462 731015 730425 729905 729117 728244 727719 727870 728710 729909 731069 732161 733590 735763 738763 742579 747418 753478
58446 753478 760422 767288 773019 777162 780171 783066 786567 790406 793661 795883 797655 799871 802793 806173
58432 806173 810059 814827 820327 825444 828867 830219 830286 830247 830724 831470 831892 831859 831919 832659 834098 835856 837767
58415 837767 839962 842524 845388 848547 852010 855555 858934 862379 866504 871610 877348 883173 888848 894447
58401 894447 900150 906127 912320 918375 924075 929782 935986 942415 948145 952741 956709 960616 964422 967974
58387 967974 971527 975178 978221 979758 979759 979086 978625 978857 980053 982404 986026 991136 998044 1006682 1016396 1026552
58371 1026552 1037053 1047881 1058568 1068737 1078861 1089759 1101467 1113279 1124887 1136758 1149289
58360 1149289 1162234 1175218 1188293 1201690 1215362 1229019 1242387 1255297 1267760 1279997 1292109
58349 1292109 1303733 1314276 1323596 1332213 1340861 1350044 1359919 1370268 1380640 1390906 1401646 1413602
58337 1413602 1426794 1440590 1454648 1469236 1484543 1500187 1515661 1530907 1546234 1561967 1578401
58326 1578401 1595813 1614263 1633498 1653235 1673485 1694567 1716864 1740507 1765122 1789982 1814566
58315 1814566 1838855 1862883 1886319 1908854 1930778 1952737 1975008 1997438 2019944 2042620 2065475
58304 2065475 2088623 2112557 2137658 2163545 2189594 2216083 2244034 2273838 2304792 2336274 2368639
58293 2368639 2402590 2438267 2475379 2513735 2553227 2593649 2634902 2677117 2720378 2764601 2809801
58282 2809801 2856096 2903429 2951806 3001884 3054705 3110535 3168496 3227636 3287841 3349514 3412977
58271 3412977 3478520 3546427 3616438 3687643 3759390 3831972 3906081 3981924 4059267 4138001 4218379
58260 4218379 4301010 4386824 4476667 4570710 4668682 4770801 4877879 4990297 5107591 5229415
58250 5229415 5356260 5488768 5627004 5770976 5921286 6078662 6243320 6415420 6595781
58241 6595781 6785474 6984971 7194212 7413353 7643068 7884323 8138202 8405807 8688253
58232 8688253 8986984 9303909 9640614 9997557 10375030 10775066 11201386 11657122 12143703
58223 12143703 12662502 13216505 13809718 14446059 15129870 15866783 16663300 17526285 18463761
58214 18463761 19485604 20602955 21828031 23175420 24662928 26310757 28141544 30182964
58206 30182964 32470201 35046080 37961590 41279377 45076419 49440348 54460997 60225853
58198 60225853 66826439 74373946 83013573 92925895 104315302 117400574 132419204 149632522
58190 149632522 169301787 191612472 216530868 243575734 271536089 298296642 321022088
58183 321022088 336813008 343600712 340801325 329373516 311324339 289016117 264617255
58176 264617255 239824461 215805467 193264827 172557726 153803257 136973406 121957656
58169 121957656 108610073 96778904 86318229 77089796 68964198 61822035 55552616
58162 55552616 50052363 45225877 40987574 37261031 33977785 31077750 28509428 26228161
58154 26228161 24194753 22376225 20746069 19281793 17962462 16769171 15686538 14702124
58146 14702124 13804806 12984627 12233398 11544162 10910381 10326439 9788249 9292238 8834062
58137 8834062 8409191 8014292 7647040 7304898 6985093 6685600 6405232 6142719 5896398
58128 5896398 5664814 5446950 5241859 5048548 4866260 4694400 4532119 4378345 4232225
58119 4232225 4093284 3961226 3835826 3716876 3603939 3496229 3392979 3293848 3198865 3108111
58109 3108111 3021656 2939511 2861356 2786452 2714113 2644243 2577208 2513219 2451999 2393072 2336302
58098 2336302 2282085 2230813 2182164 2135268 2089832 2046653 2006478 1968683 1931814 1895306 1859766
58087 1859766 1825501 1791750 1757795 1724115 1691791 1661230 1631928 1603161 1574474 1545820 1517637
58076 1517637 1490593 1465036 1440891 1418100 1396670 1376197 1356045 1336293 1317782 1300750 1284124
58065 1284124 1266841 1249322 1232849 1217896 1203915 1190503 1177868 1166119 1154869 1143681 1132339
58054 1132339 1120566 1108020 1094786 1081515 1068862 1057119 1046404 1036865 1028482 1020950 1013911 1007178
58042 1007178 1000647 994150 987485 980518 973278 966065 959395 953696 949054 945251 941917 938577 934734 930132
58028 930132 924847 919080 913025 906992 901328 896036 890766 885433 880510 876447 873102 870154 867739 866206
58014 866206 865406 864814 864242 863896 863748 863420 862747 861891 860693 858511 855063 851076 847645 845168 843285 841660
57998 841660 840415 839721 839367 838951 838327 837662 837084 836447 835470 833972 831859 828959 825039 820048 814329 808638
57982 808638 803972 801140 800169 800164 800086 799814 800205 802044 805161 808591 811239 812234 811151 808368 804948 801742
57966 801742 798668 795204 791370 787771 784773 782172 779784 777883 776826 776619 777060 778081 779650 781538 783552
57951 783552 785946 789317 793970 799592 805657 811990 818552 824715 829182 831039 830664 829111 826671 822628
57937 822628 816633 809626 802846 796336 789098 780632 771659 763242 755784 749163 743376 738648 735063 732433
57923 732433 730518 729176 728265 727571 726917 726285 725758 725275 724476 722977 720890 718973 718096 718560 720045 722113
57907 722113 724608 727555 730840 734148 737292 740584 744710 749998 755809 760915 764568 767014 768939 770768
57893 770768 772617 774507 776217 777205 777055 775908 774212 772334 770725 770059 770554 771379 771514 771192 771810 774252
57877 774252 777991 782115 786518 791501 796703 801178 804469 807097 809974 813674 818322 823774 829660 835336
57863 835336 839985 842937 844080 843954 843251 842188 840552 838377 836152 834144 831850 828544 824303 820113 816977
57848 816977 815245 814807 815623 817827 821433 826122 831353 836713 842173 848007 854447 861517 869204 877563 886431
57833 886431 895210 903264 910516 917302 923455 927712 928262 923981 915254 903814 891846 880971 871752 863959
57819 863959 857199 851231 845956 841459 838145 836432 836127 836398 836684 837407 839393 842765 846844 851101 855675
57804 855675 860880 866690 873014 880081 888236 897584 908042 919428 931179 942417 952758 962850 973570
57791 973570 984806 995484 1004661 1012035 1017513 1021041 1023001 1024084 1024423 1023374 1020478 1016180 1011232 1005847
57777 1005847 999954 993868 988161 983042 978405 974348 971175 968872 967032 965372 964097 963721 964637 966725
57763 966725 969245 971318 972807 974541 977413 981440 985990 990663 995575 1000981 1007074 1013971 1021471 1028939
57749 1028939 1035946 1042913 1050643 1059244 1067999 1076207 1083629 1090180 1095934 1101576 1108147 1115915 1124007 1131501
57735 1131501 1138461 1145587 1153276 1161500 1170235 1179456 1188842 1197904 1206469 1214753 1223030 1231514 1240513 1250422
57721 1250422 1261373 1272973 1284486 1295352 1305615 1315798 1326332 1337234 1348429 1360116 1372464
57710 1372464 1385170 1397846 1410788 1424858 1440513 1457439 1475230 1493879 1513378 1533467 1554133
57699 1554133 1575903 1599214 1623886 1649658 1676878 1706213 1737982 1772328 1809812 1851233 1896916
57688 1896916 1946596 1999907 2056629 2116620 2180063 2247766 2320799 2399762 2484689 2575557 2672493
57677 2672493 2775535 2884567 2999407 3119541 3243879 3371447 3502660 3639917 3787113
57668 3787113 3948247 4124242 4307462 4477414 4603746 4658036 4627176 4518591 4354453 4160704
57658 4160704 3958614 3761927 3578061 3410495 3260503 3127801 3010799 2907366 2815913 2735731
57648 2735731 2666291 2606577 2555426 2512135 2476200 2446584 2421900 2401550 2386109 2376187 2371196 2369740
57636 2369740 2371064 2375611 2384165 2396867 2413200 2432546 2454643 2479682 2508135 2540269 2575838 2614439
57624 2614439 2656162 2701485 2750520 2802736 2857618 2915158 2975385 3037729 3101135 3164481 3226571
57613 3226571 3286016 3341473 3391751 3435389 3470475 3495452 3509855 3513791 3506972 3488982 3460457 3423260
57601 3423260 3379363 3330155 3276994 3221649 3165709 3109938 3054677 3000622 2948835 2900094 2854501
57590 2854501 2811577 2770676 2731650 2695299 2662813 2634467 2609233 2586000 2564816 2546403 2530758
57579 2530758 2516906 2503988 2492037 2481567 2472889 2465990 2460669 2456621 2453701 2452211 2452590 2454640 2457463
57566 2457463 2460373 2463564 2467598 2472593 2478302 2484755 2492299 2501080 2510890 2521494 2532706 2544185 2555648
57553 2555648 2567403 2580231 2594553 2610085 2626493 2643978 2662832 2682798 2703396 2724676 2747122
57542 2747122 2770913 2795768 2821616 2848910 2878088 2909126 2941862 2976483 3013417 3052912 3094957
57531 3094957 3139448 3186182 3234824 3285110 3337068 3390876 3446537 3503797 3562346 3621905 3682063
57520 3682063 3742036 3800576 3856192 3907596 3953980 3994773 4029150 4055967 4074239 4083519 4083879 4075824
57508 4075824 4060369 4038862 4012554 3982506 3949989 3916570 3883423 3850830 3818706 3787459 3757962
57497 3757962 3730867 3706436 3684953 3666753 3651796 3639750 3630705 3625295 3623752 3625173 3628186 3632290
57485 3632290 3638115 3646420 3657236 3670125 3684921 3701822 3720893 3741852 3764471 3788954 3815755 3845217
57473 3845217 3877574 3913103 3951938 3993798 4038225 4085077 4134473 4186210 4239689 4294549 4350950
57462 4350950 4408968 4468050 4527353 4586208 4643769 4698507 4748675 4793222 4831730 4863421 4886815
57451 4886815 4900671 4904968 4900782 4889409 4871784 4848556 4820472 4788643 4754463 4719246 4683980 4649480
57439 4649480 4616552 4585750 4557149 4530650 4506476 4485055 4466467 4450370 4436512 4424977 4415854
57428 4415854 4408999 4404252 4401560 4400685 4401029 4402077 4403990 4407534 4413336 4421155 4429949 4438766 4447640 4457415
57414 4457415 4468664 4480998 4493648 4506339 4519229 4532321 4545518 4559165 4573876 4589747 4606205
57403 4606205 4622725 4639215 4655625 4671790 4687844 4704307 4721453 4738998 4756631 4774389 4792299
57392 4792299 4810201 4828278 4847248 4867458 4888226 4908662 4928868 4949690 4971419 4993383 5014836
57381 5014836 5035722 5056386 5076940 5097137 5116692 5135676 5154628 5174187 5194428 5214722 5234493
57370 5234493 5253977 5273881 5294385 5314889 5334788 5354178 5373598 5393280 5412813 5431543 5449256
57359 5449256 5466560 5484473 5503564 5523495 5543511 5563234 5582873 5602762 5622983 5643407 5663915
57348 5663915 5684493 5705165 5725827 5746200 5766056 5785537 5805038 5824714 5844308 5863605 5882773
57337 5882773 5902110 5921657 5941301 5960989 5980566 5999622 6017876 6035632 6053587 6072257 6091720
57326 6091720 6111718 6131783 6151519 6171086 6191145 6212019 6233108 6253545 6273210 6292617 6312092
57315 6312092 6331671 6351646 6372432 6393822 6415072 6435964 6457152 6479226 6501945 6524727 6547410
57304 6547410 6570144 6592984 6616001 6639426 6663187 6686517 6708420 6728447 6746762 6763708 6779606
57293 6779606 6794623 6808355 6819680 6827593 6832182 6834415 6834906 6833371 6829378 6823199 6815595 6807038 6797538
57280 6797538 6787229 6776813 6767178 6758617 6750555 6742203 6733451 6724968 6717434 6710877 6704867 6699122 6693682
57267 6693682 6688623 6683894 6679422 6675110 6670721 6666031 6661212 6656795 6653040 6649434 6645034 6639284 6632401 6625015
57253 6625015 6617639 6610505 6603675 6597064 6590342 6582967 6574490 6564869 6554503 6543969 6533670 6523650 6513673
57240 6513673 6503412 6492574 6480903 6468260 6454808 6441076 6427598 6414404 6400984 6386862 6372163
57229 6372163 6357518 6343463 6330010 6316771 6303394 6289886 6276544 6263600 6250957 6238307 6225505
57218 6225505 6212738 6200362 6188660 6177701 6167200 6156437 6144626 6131566 6117768 6103798 6089725
57207 6089725 6075408 6061001 6046699 6032152 6016751 6000530 5984228 5968216 5951832 5934220 5915536
57196 5915536 5896838 5878864 5861324 5843436 5824775 5805446 5785734 5765878 5746130 5726750 5707773
57185 5707773 5688862 5669545 5649605 5629175 5608462 5587561 5566594 5545853 5525558 5505512 5485183
57174 5485183 5464175 5442522 5420623 5399030 5378233 5358321 5338697 5318375 5296730 5273913 5250505
57163 5250505 5226918 5203265 5179598 5156033 5132618 5109231 5085645 5061648 5037102 5011897 4985823
57152 4985823 4958457 4929271 4897962 4864714 4830222 4795464 4761385 4728663 4697651 4668510 4641285
57141 4641285 4615794 4591538 4567934 4544607 4521362 4497999 4474434 4450944 4427938 4405290 4382209
57130 4382209 4357928 4332356 4305774 4278184 4249347 4219507 4189729 4161426 4135687 4113192 4094545
57119 4094545 4080418 4071310 4067363 4068557 4075053 4087187 4105181 4129094 4159304 4196941 4243721 4301478
57107 4301478 4372147 4458135 4562365 4687875 4837790 5016020 5227887 5479909 5779167 6133076
57097 6133076 6549485 7036389 7601151 8249825 8986796 9814224 10731161 11732932 12811296
57088 12811296 13954766 15148107 16371024 17597352 18795934 19932827 20973476 21884236
57080 21884236 22634047 23197092 23555758 23702377 23639015 23376035 22930214 22322601 21576302
57071 21576302 20714896 19761888 18740651 17673885 16582426 15484111 14393427 13322071
57063 13322071 12279872 11275444 10316265 9408538 8557208 7766065 7037533 6372197 5768728
57054 5768728 5224459 4736113 4300070 3912264 3568194 3263230 2992970 2753389 2540772
57045 2540772 2351567 2182420 2030385 1893105 1768691 1655466 1551883 1456622 1368664 1287274
57035 1287274 1211955 1142286 1077631 1017120 960137 906694 857034 810979 767999 727903 690911
57024 690911 656939 625281 595308 567117 541140 517357 495189 473997 453426 433476 414564
57013 414564 397277 381686 366999 352250 337229 322383 307976 293787 279676 265964 253073
57002 253073 241098 229857 219106 208562 197990 187528 177778 169377 162537 157052 152630 149132 146665
56989 146665 145633 146651 150194 156216 164171 173452 183786 195138 207165 218871 228935 236457 241271
56976 241271 243648 243941 242640 240410 237736 234741 231688 229493 229202 230855 233284 235292 236813 238744 241853
56961 241853 246159 251237 256873 263341 271055 279858 288631 295760 300113 301464 299994 295767 288958 280262
56947 280262 270641 260773 251122 242449 235619 230702 226803 223161 220115 218672 219434 222322 227059 233395
56933 233395 241046 250036 261010 274347 288713 301152 309060 311738 309840 304078 295139 284239 272712
56920 272712 261025 248856 236180 223664 211981 201372 191978 183983 177238 171286 165993 161625 158109
56907 158109 154815 151401 148345 146224 144850 143554 141950 140004 137765 135592 134390 134953 137061 139699
56893 139699 142148 144569 147542 151508 156723 163403 171626 181128 191185 200747 208838 214951 218986 220881
56879 220881 220575 218378 214990 210990 206618 202227 198556 196283 195682 196969 200458 205974 212585 219577 227418
56864 227418 237225 249552 264253 281207 300350 320963 341528 360369 376037 387228 392988 393127
56852 393127 388145 378935 366942 354251 342633 332536 323670 316551 312549 312328 315188 320369 328277
56839 328277 339929 355777 375619 399141 425970 455458 486776 518805 549412 575144 592320
56828 592320 598676 594029 579828 558455 532630 504766 476583 449294 423988 401678 383136 368808
56816 368808 358766 352657 349946 350413 354298 361929 373447 388877 408089 430358 454063 476921 496345
56803 496345 509685 514751 510668 498216 479282 456089 430863 405708 382288 361547 343721 328444
56791 328444 314965 302753 292134 284092 279356 277928 279479 283705 290138 298111 307191 317254 327770
56778 327770 337271 343811 345825 342561 334292 322400 308754 294570 280006 265044 250286 236527
56766 236527 223977 212353 201479 191363 181978 173399 165974 159947 155008 150508 146025 141547 137363
56753 137363 133970 131732 130415 129339 128218 127404 127009 126368 124873 122957 121659 121462 121997 122612 122791 122306
56737 122306 121463 120919 120901 120930 120674 120575 121066 121680 121713 121318 121102 120948 120298 119390 119169 119846 120501 120333 119517 118630
56717 118630 117970 117740 118120 118752 118769 117796 116523 115993 116642 118214 120121 121662 122349 122370 122389 122690 122881 122623
56699 122623 122185 122005 122121 122354 122694 123155 123541 123741 123997 124571 125288 125727 125760 125662 125799 126388 127451 128839 130298
56680 130298 131595 132575 133128 133218 132900 132258 131426 130725 130511 130700 130736 130364 130107 130543 131434 132112 132442 132691 132646
56661 132646 131765 130269 129176 128967 128963 128352 127196 126062 125231 124717 124548 124627 124670 124601 124612 124585 123990 122717 121543
56642 121543 121323 122035 122975 123474 123155 121922 120148 118523 117372 116452 115691 115627 116691 118474 120164 121334
56626 121334 121948 121989 121554 120884 119889 118150 115861 114203 114039 114728 115039 114944 115527 117266 119267 120357 120286 119703
56608 119703 119552 120514 122552 124827 126517 127691 129037 130809 132556 133844 134687 135279 135803 136554 137707 138923
56592 138923 139693 140119 140807 141919 142921 143447 143870 144747 146162 147847 149549 151001 151929 152357 152589 152728 152545
56575 152545 151963 151300 150850 150642 150765 151475 152703 153958 155088 156641 159040 161850 164496 167339 171212 175928
56559 175928 180056 182498 183758 185245 187623 190280 192291 193481 194406 195506 196565 197085 196973 196660 196497
56544 196497 196285 195570 194259 192716 191220 189540 187180 183967 180335 177022 174515 172736 171152 169123 166288
56529 166288 162856 159692 157975 158430 160703 163553 165767 166940 167413 167619 167604 167166 166232 164977 163626 162255
56513 162255 160910 159830 159388 159732 160532 161152 161120 160411 159344 158259 157295 156378 155382 154273 153180 152406 152291
56496 152291 152883 153654 153736 152623 150640 148659 147410 147103 147505 148140 148583 148855 149473 150883 152922 155038 156879
56479 156879 158331 159160 159191 158771 158505 158465 158326 158387 159702 162765 166678 170188 173075 175914 178834 181247 182738
56462 182738 183665 184848 186919 189793 192493 193783 193397 192406 191986 192179 192309 192164 192042 191961 191706 191597 192312
56445 192312 193864 195512 196839 198124 199419 200066 199585 198456 197482 196768 195775 194033 191453 188203 184735
56430 184735 181709 179623 178561 178392 178889 179527 179592 178849 177859 177373 177599 178245 178996 179676 180197 180631 181187 181878
56412 181878 182397 182431 181948 181084 180135 179799 180961 183786 187314 190353 192609 194662 197090 200046 203509 207402
56396 207402 211386 214905 217565 219322 220301 220655 220648 220675 221086 221927 222809 223128 222602 221667 221052 220893 220549 219502
56378 219502 218180 217639 218565 220808 223647 226295 228277 229655 230812 231953 232983 233963 235237 236813 237965
56363 237965 237985 237187 236716 237406 239215 241665 244341 246921 249153 251026 252667 254037 255012 255805 256939 258624
56347 258624 260505 262237 264076 266592 269886 273338 276169 278134 279700 281609 284274 287560 291077 294616
56333 294616 298254 302140 306352 310886 315622 320300 324686 328848 333162 338044 343643 349726 355763 361221
56319 361221 366013 370642 375802 381787 388413 395412 402652 409947 416878 423036 428356 433148 437847 442728
56305 442728 447636 451896 454677 455715 455639 455477 455858 456879 458580 461135 464442 467917 471084 474237 478181
56290 478181 483388 489760 497216 505967 516008 526805 537917 549702 562958 578011 594548 612288
56278 612288 631359 652009 674344 698487 724680 753189 784351 818781 857213 900112 947748
56267 947748 1000672 1059742 1125615 1198681 1279652 1369744 1469934 1580367 1700712 1830729 1970023
56256 1970023 2117513 2271490 2430062 2591149 2752156 2909915 3060864 3201032 3326170
56247 3326170 3432437 3517152 3578875 3617052 3631868 3624297 3595857 3548331 3483892 3405285 3315413
56236 3315413 3216570 3110260 2997669 2880043 2758685 2634902 2510082 2385670 2263069 2143630
56226 2143630 2028576 1918723 1814292 1715152 1621133 1532066 1447867 1368950 1296306 1230714 1171869
56215 1171869 1118638 1070155 1026289 987090 952154 920675 891859 865224 840699 818519 798872
56204 798872 781662 766700 753898 743012 733346 724151 715217 706771 698920 691720 685699 681595 679349
56191 679349 677897 676332 674875 674355 675095 676760 679029 681930 685602 690179 695889 702884 710869 719228 727679
56176 727679 736574 746412 757266 768928 781439 795184 810407 826932 844439 862733 881484 899962
56164 899962 917498 934231 951012 968406 986114 1003518 1020500 1037465 1054940 1073550 1094314
56153 1094314 1118540 1147415 1181858 1222711 1270949 1327946 1395792 1477127 1574108 1687206 1814763
56142 1814763 1952995 2095768 2234788 2361400 2469587 2558052 2630101 2691906 2750282 2810185
56132 2810185 2872381 2932588 2983167 3016680 3029291 3022314 3001400 2973993 2946209 2920240 2893149
56121 2893149 2857711 2805453 2730569 2632344 2514740 2384328 2248535 2114659 1988825 1874939
56111 1874939 1774629 1688167 1615194 1554677 1504945 1464288 1431534 1405953 1386886 1373618 1365398
56100 1365398 1361443 1361070 1363888 1369625 1377722 1387336 1397790 1408721 1419704 1430071 1439304 1447352 1454391
56087 1454391 1460534 1465919 1470853 1475651 1480485 1485561 1491231 1497777 1505221 1513516 1522749 1532984 1544129
56074 1544129 1556140 1569202 1583462 1598749 1614820 1631827 1650252 1670317 1691616 1713386 1735051
56063 1735051 1756519 1778133 1800484 1824186 1849587 1876484 1904153 1931849 1959462 1987632 2017140
56052 2017140 2048242 2080660 2114070 2148412 2183735 2219940 2256791 2294213 2332496 2372074 2413026
56041 2413026 2454987 2497811 2542130 2588814 2637860 2688367 2739734 2792328 2846767 2903127 2961318
56030 2961318 3021694 3084746 3150550 3219073 3290625 3365379 3442716 3521726 3602215 3684673 3769482
56019 3769482 3856825 3947186 4041141 4138617 4239029 4342219 4448726 4559112 4673564 4792220
56009 4792220 4915332 5043115 5175874 5314258 5458926 5610099 5767924 5933065 6106338
56000 6106338 6287991 6478041 6677185 6886655 7107337 7339758 7584733 7843227 8115762
55991 8115762 8402895 8706206 9027914 9369650 9732511 10118179 10528972 10966967 11434266
55982 11434266 11934045 12470183 13045868 13663825 14327956 15043484 15815606 16649631 17552730
55973 17552730 18534243 19604216 20773427 22055417 23467354 25029094 26763486 28698497
55965 28698497 30868001 33311099 36073609 39211986 42795656 46907080 51643074 57116870
55957 57116870 63456296 70799082 79291840 89093685 100379559 113344171 128210623 145233415
55949 145233415 164671467 186710911 211320889 238023288 265608815 291966401 314279933
55942 314279933 329696050 336214540 333317364 321997137 304251018 282398259 258551528
55935 258551528 234355370 210936697 188972201 168800218 150530646 134131685 119493726
55928 119493726 106475342 94930442 84717978 75703817 67762754 60779598 54647110
55921 54647110 49264202 44537498 40383431 36727741 33504231 30655022 28130651 25888258
55913 25888258 23889955 22103104 20500675 19059872 17760589 16585317 15519278 14549582
55905 14549582 13664671 12854913 12112862 11432153 10806548 10230228 9698185 9205848 8749063
55896 8749063 8324810 7931120 7565658 7225058 6906193 6607454 6328202 6067439 5823647
55887 5823647 5595440 5381717 5181326 4992876 4814728 4645022 4482200 4325748 4176031
55878 4176031 4033209 3896793 3766406 3642295 3524692 3413194 3307193 3206438 3110669 3019142
55868 3019142 2931030 2846037 2764243 2685658 2610316 2538477 2470236 2405164 2342737 2282878 2225563
55857 2225563 2170132 2115749 2062622 2012135 1965362 1921799 1879975 1839150 1799906 1762957 1727850
55846 1727850 1693269 1658475 1623938 1590564 1558823 1528891 1501161 1476119 1453894 1434291 1417112
55835 1417112 1402158 1389073 1377428 1366736 1356144 1344540 1331415 1317287 1302745 1287453 1270738
55824 1270738 1252716 1233967 1214217 1192422 1168284 1142793 1117048 1091423 1066232 1042280 1020069
55813 1020069 999041 978327 957919 938609 921057 905398 891507 879155 868074 858282 850272 844537
55801 844537 841071 839562 839870 841888 845073 848528 851602 854020 855234 853823 847842 835992 818568 797306
55787 797306 774377 751627 730515 712020 696107 681604 667301 653128 639837 627749 616530
55776 616530 606165 597301 590316 584617 579225 573573 567523 561115 554597 548214 541628 534054 525395 516802
55762 516802 509558 503676 498041 491649 484233 475956 467087 458025 449208 440852 432861 424923 416618 407649
55748 407649 398064 388059 377527 366206 354405 343034 332628 322802 313174 304360 297451 292676 289165
55735 289165 285868 282273 278406 274679 271749 269968 268892 267649 265788 263485 261038 258567 256141 253746
55721 253746 251036 247575 243476 239487 236282 233866 231746 229467 226883 224180 221776 220102 219257 218889 218484
55706 218484 217837 217275 217360 218275 219535 220449 220747 220532 219741 218185 216154 214477 213724 213807 214536 216035 218241
55689 218241 220553 222561 224651 227292 230140 232603 234974 238112 242042 245724 248249 249538 249719 248599
55675 248599 246040 242269 237483 231657 225035 218344 212173 206496 201062 195926 191390 187741 185183 183639
55661 183639 182488 180977 179115 177685 177144 177094 177120 177528 178681 180213 181612 183170 185516 188405 190815 192285
55645 192285 193321 194323 194845 194328 192970 191334 189492 187106 184266 181668 179801 178333 176530 174185 171877
55630 171877 170259 169235 168017 165992 163358 160762 158462 156029 152876 148908 144616 140653 137309 134331
55616 134331 131221 127767 124245 120991 117915 114654 111231 108254 106343 105528 105322 105170 104655 103510 101744
55601 101744 99697 97674 95534 92952 90112 87789 86539 86114 85886 85592 85283 84720 83388 81257 79140
55586 79140 78005 78052 78633 78965 78720 78034 77205 76446 75846 75437 75235 75196 75186 75136 75166 75375 75546 75240 74274 72895
55566 72895 71401 69825 68117 66439 65050 63992 63069 62042 60764 59289 58005 57413 57531 57671 57101 55829
55550 55829 54489 53530 52865 52271 51796 51648 51865 52204 52242 51702 50840 50416 50976 52175 53028 52848 51698 50021
55532 50021 48193 46474 45038 43900 43045 42680 43058 43991 44891 45442 45945 46779 47875 48990 50226 51880
55516 51880 53929 55987 57753 59299 60913 62817 64945 66886 68186 68878 69602 70938 72692 74058 74473
55501 74473 74052 73175 71925 70095 67627 64831 62087 59437 56634 53627 50807 48527 46506 44051 40949
55486 40949 37879 35751 34880 34931 35412 35953 36285 36282 36002 35526 34800 33795 32690 31717 30982 30569 30616 30948 30848
55467 30848 29597 27247 24534 22081 20036 18455 17508 17093 16700 15977 15230 15068 15689 16725 17651 18146 18172
55450 18172 17960 17870 18044 18246 18164 17834 17601 17670 17842 17696 17015 16091 15683 16486 18431 20615 22086 22614 22579
55431 22579 22315 21947 21687 21740 21801 21192 19831 18635 18538 19369 20146 20321 20212 20271 20464 20532 20402 20128 19770 19546
55411 19546 19779 20414 20890 20792 20409 20291 20484 20608 20543 20559 20796 21072 21329 21810 22586 23180 22976 21904 20592
55392 20592 19913 20385 21790 23249 23842 23349 22348 21607 21538 22158 23228 24242 24598 24079 23104 22273 21753 21246
55374 21246 20436 19256 17881 16687 16150 16512 17455 18236 18195 17120 15269 13218 11629 10873 10752 10709 10420
55357 10420 10165 10567 11903 13644 14737 14458 13040 11399 10307 9940 10120 10596 11053 11185 11040 11079 11623
55340 11623 12472 13272 13981 14641 14970 14680 14063 13727 13717 13397 12334 10814 9319 7950 6750 6227 7065 9316
55322 9316 12142 14399 15423 15393 15132 15432 16390 17384 17786 17624 17415 17485 17634 17419 16603 15312 13890 12654
55304 12654 11770 11323 11393 11917 12554 12910 13000 13271 14052 15183 16308 17324 18288 19085 19536 19782 20221 20969 21646
55285 21646 21833 21535 21067 20654 20345 20223 20428 20879 21098 20569 19336 18149 17765 18113 18354 17883 17037 16590
55267 16590 16700 16730 16107 14979 13884 13097 12536 12093 11734 11353 10886 10539 10632 11095 11382 11038 10245 9665 9846
55248 9846 10880 12446 13948 14703 14365 13335 12544 12635 13401 14170 14630 15062 15772 16570 16976 16798 16242 15498
55230 15498 14504 13273 12242 12021 12749 13936 14985 15700 16205 16578 16830 17089 17511 17971 18130 17864 17408 16999
55212 16999 16627 16262 16073 16183 16390 16407 16220 15959 15544 14830 14060 13719 13841 13832 13218 12343 11999 12506 13382 13911
55192 13911 13805 13271 12594 11783 10717 9575 8922 9139 9808 10014 9343 8388 8143 9067 10805 12553 13512 13366
55174 13366 12676 12617 13855 15721 16835 16549 15477 14652 14562 15081 15881 16622 17001 16924 16599 16330 16284 16473 16753
55155 16753 16815 16433 15860 15714 16256 16988 17167 16542 15394 14144 13253 13235 14243 15663 16559 16624 16369 16341 16527
55136 16527 16642 16642 16715 16992 17478 18109 18673 18855 18539 17948 17385 17016 16962 17348 18053 18707 19189 19883 21096 22463
55116 22463 23368 23899 24886 26916 29697 32498 34909 36988 38943 40762 41981 41816 39846 36681 33593
55101 33593 31392 29956 29025 28841 29594 30669 31197 31222 31666 33017 34605 35378 34948 33648 31966 30329 29143
55084 29143 28605 28489 28419 28342 28515 29030 29620 29958 29973 29844 29848 30223 30960 31645 31721 31072 30206 29697 29573 29491 29393 29657
55062 29657 30503 31583 32353 32662 32721 32657 32405 31958 31375 30526 29185 27517 26147 25502 25292 25006 24701 24930
55044 24930 25873 26923 27282 26832 26255 26417 27672 29606 31375 32376 32711 32956 33486 34155 34696 35291 36550
55027 36550 38880 41943 44826 46766 47721 48223 48732 49277 49648 49691 49292 48319 46906 45669 45263 45671 46210
55010 46210 46336 46190 46250 46686 47266 47695 47848 47751 47535 47340 47098 46518 45390 43860 42217 40539 38728 36948
54992 36948 35808 35952 37485 39771 41796 42817 42773 42147 41425 40768 40169 39736 39618 39726 39721 39418 39133 39479
54974 39479 40735 42477 44017 45230 46708 48927 51449 53429 54855 56762 59983 64118 68104 71529
54960 71529 74899 78828 83552 89316 96610 105725 116411 128301 141464 156140 172011 188001 202799
54947 202799 215299 224535 229570 229784 225263 216780 205456 192525 179165 166144 153525 141080 129125
54934 129125 118619 110152 103203 96797 90677 85320 80946 77185 73764 70864 68602 66795 65547 65447
54920 65447 66647 68297 69536 70691 72840 76520 81589 88135 96617 107082 119032 132250 146914
54907 146914 162583 177708 190638 200656 207694 211529 211731 208123 200906 190610 178249 165155 152194
54894 152194 139429 126886 115333 105668 97764 90517 83156 76059 70222 66231 63819 62117 60245
54881 60245 57904 55433 53218 51171 49043 47021 45588 44800 44182 43408 42688 42265 41935 41415 40979 41345 42850
54864 42850 44950 46666 47408 47276 46592 45381 43572 41584 40238 39775 39282 37569 34607 31695 30072 29696
54848 29696 29558 28901 27863 27027 26661 26486 26066 25302 24491 23984 23858 23971 24181 24443 24816 25507 26774 28567
54830 28567 30285 31188 31142 30826 31122 32292 33781 34771 34944 34708 34675 35084 35885 37166 38963 40665 41311 40888
54812 40888 40704 41892 44040 46119 48372 52198 58053 64591 70326 75326 80759 87465 95698 105743
54798 105743 117869 131757 146614 161831 176976 191159 202877 210687 213892 212673 207919 200882
54786 200882 192552 183216 172788 161557 150394 140205 131409 123985 117737 112407 107675 103236 98920
54773 98920 94811 91238 88548 86762 85514 84370 83230 82400 82443 83932 87118 91702 97076 102842 108938
54758 108938 115369 122255 130172 139901 151595 164608 178413 193030 208036 221702 231940 237893
54746 237893 240030 239037 235369 229650 222471 213746 203114 191117 179115 167854 156960 146118 135853
54733 135853 126606 117925 109335 101351 94724 89170 83730 78193 73255 69313 65903 62506 59168 56103
54719 56103 53254 50610 48502 47209 46559 46273 46474 47465 49022 50256 50278 48925 46785 44696 43326 43073
54703 43073 43975 45592 47174 48260 49038 49945 51025 51932 52443 52510 51935 50506 48624 47227 46791 46869 46940 47208
54685 47208 48014 48936 49259 49184 49767 51493 53566 54903 55398 55815 56750 58089 59441 60744 62260 64010 65436
54668 65436 65832 65116 63898 62688 61369 59723 58188 57652 58531 60361 62222 63320 63340 62613 61931 61843 62178
54651 62178 62530 63024 64182 66147 68570 71281 74486 78211 82129 86155 90702 96057 101918 107883 114065
54636 114065 120906 128668 137412 147145 157621 168089 177476 184629 188368 187784 182989 175364 166738 158346
54622 158346 150654 143723 137286 130805 124078 117737 112636 108726 105009 100674 95884 91322 87355 83889
54608 83889 80719 77767 75079 72785 70959 69341 67311 64367 60654 56909 53822 51558 49935 48892
54594 48892 48548 48808 49236 49526 49873 50642 51754 52739 53325 53697 54133 54723 55456 56289 57047 57584 58007 58385 58240
54575 58240 56904 54623 52675 52015 52200 52118 51309 50101 48866 47809 47192 46992 46512 45126 43446 42935 44108
54558 44108 45751 46292 45503 44442 44070 44325 44420 43784 42686 42000 42219 42801 42782 41962 41098 40860 41081 41217 41156
54539 41156 41264 41951 43527 46208 49801 53451 56069 57203 57408 57774 59076 61321 64016 66821 69875
54524 69875 73429 77359 81297 85128 88982 92719 95750 97504 97790 96662 94250 90856 86904 82625 78037
54509 78037 73403 69395 66599 65003 64041 62922 60939 57971 54857 52886 52543 53048 53312 52978 52315 51630
54493 51630 51286 51809 53285 54874 55594 55482 55364 55565 55581 55131 54799 55246 56294 57241 57763 58089 58440 58713
54475 58713 58730 58529 58282 58038 57639 56908 55939 55105 54706 54640 54570 54368 54262 54567 55382 56558 57837 58972 59831
54456 59831 60460 61019 61659 62350 62749 62327 60918 59218 58386 58942 60283 61508 62387 63245 64206 65053 65625 65838
54438 65838 65443 64354 63175 62779 63231 63655 63341 62531 61900 61747 61982 62464 62982 63120 62570 61445 60104 58837
54420 58837 57883 57473 57628 58108 58743 59579 60583 61542 62478 63788 65621 67507 69011 70512 72839 76242
54404 76242 80124 83666 86343 87980 88781 89250 89696 89834 89309 88505 88300 88930 89620 89511 88544 87240 86048
54387 86048 85193 84831 84883 84859 84185 82742 80900 79056 77289 75464 73629 72159 71429 71246 70864 69774 68367
54370 68367 67408 66996 66519 65684 65021 65076 65651 66278 66978 67942 68765 68735 67938 67404 67933 69260 70635 71861 73341
54351 73341 75359 77691 79843 81384 82116 82187 82063 82126 82159 81389 79257 76135 73155 71224 70215 69204 67518
54334 67518 65431 63805 63139 63113 62994 62333 61209 59942 58679 57298 55705 54226 53447 53466 53466 52400 50196
54317 50196 47897 46491 45968 45740 45523 45256 44484 42625 40005 37975 37586 38531 39733 40621 41337 41991 42332
54300 42332 42199 41793 41365 41009 40913 41426 42574 43805 44515 44696 44750 44836 44804 44715 44911 45403 45569 44843 43478 42264
54280 42264 41554 40981 40230 39679 39945 41020 42224 43026 43582 44284 45073 45470 45236 44686 44286 44106 43841 43307
54262 43307 42752 42644 43252 44545 46422 48863 51758 54654 56854 57836 57597 56655 55717 55276 55360 55686 56093
54245 56093 56763 57891 59207 60053 59986 59150 58030 57043 56389 56038 55688 54951 53812 52742 52161 51938 51609 50918
54227 50918 49948 48850 47800 47047 46700 46533 46298 46136 46312 46590 46310 45135 43368 41569 40247 39894 40688
54210 40688 41966 42590 42172 41487 41344 41567 41554 41346 41423 41716 41588 40837 40080 40006 40675 41678 42606 43227 43535
54191 43535 43724 43921 43923 43488 42811 42333 42079 41634 40836 40031 39509 39103 38537 37753 36679 35131 33293 31853
54173 31853 31238 31029 30636 30285 30705 31968 33242 33838 34008 34451 35411 36487 37098 36870 35800 34306 33058
54156 33058 32505 32557 32847 33229 33853 34785 35766 36401 36474 35997 35081 33909 32812 32203 32331 33107 34156 35017 35399
54137 35399 35394 35442 35895 36557 36836 36420 35602 34812 34134 33577 33505 34266 35442 36047 35652 34844 34313 33962 33355 32661
54117 32661 32597 33469 34767 35809 36386 36618 36570 36283 36013 36049 36319 36430 36239 36204 36953 38550 40410 41955 43129
54098 43129 44113 44827 45016 44718 44307 44113 44314 45146 46718 48507 49547 49409 48661 48069 47747 47514 47719 49046
54080 49046 51475 53957 55313 55262 54533 54130 54483 55177 55535 55520 55778 56588 57194 56644 55114 53823 53679 54536
54062 54536 55790 57135 58582 60215 62136 64245 65947 66529 66089 65688 66329 68116 70626 73613 76943
54047 76943 80250 83271 86326 89939 94055 98090 101746 105340 109195 113106 116544 119171 120967 122017
54033 122017 122393 122256 121917 121656 121467 121111 120562 120211 120391 120754 120554 119544 118139 116500 114038 110319 106035
54016 106035 102460 100029 98047 95766 93182 90652 88244 85824 83474 81444 79777 78218 76496 74640
54002 74640 73009 72002 71663 71514 70852 69279 66989 64632 62901 62076 61864 61755 61520 61172 60448 58825 56362
53985 56362 54131 53320 54025 55403 56826 58324 59919 61173 61686 61590 61277 60917 60495 60078 59891 60206 61194
53968 61194 62624 63739 63810 62964 62109 61890 62138 62493 63079 64148 65470 66625 67696 69080 70649 71627 71521
53951 71521 70865 70783 71946 74080 76444 78630 80867 83629 87128 91275 95970 101198 106919 113159 120134
53936 120134 127981 136368 144821 153543 163356 174544 186138 196714 205550 212719 218453 222988 226681
53923 226681 229642 231370 231387 230157 228749 227561 225987 223522 220595 218011 215997 214138 211886 208822 204710
53908 204710 199755 194676 190235 186645 183574 180556 177219 173314 168806 163924 158956 154019 149092 144156
53894 144156 139189 134186 129385 125356 122562 120803 119290 117351 114931 112315 109572 106553 103403 100749
53880 100749 99105 98192 97167 95546 93598 91757 90058 88430 87175 86583 86181 84943 82449 79506 77443
53865 77443 76929 77523 78100 77709 76295 74711 73813 73561 73266 72679 72370 72906 74088 75214 75744 75489 74572 73499
53847 73499 72906 72843 72611 71694 70557 70076 70374 70711 70409 69439 68169 67042 66526 66959 68249 69986 71800
53830 71800 73392 74382 74625 74642 75215 76389 77349 77482 77196 77436 78724 80900 83497 86068 88391 90736 93788
53813 93788 97985 102942 107751 111806 115110 117885 120162 121865 123126 124372 126056 128204 130266 131590
53799 131590 132144 132568 133346 134073 133858 132403 130385 128681 127497 126410 125059 123486 121850 120126 118209
53784 118209 116103 113768 110916 107339 103513 100536 99092 98559 97465 94885 91198 87486 84493 82294
53770 82294 80680 79480 78464 77234 75399 72880 69961 67093 64673 62989 62173 62047 62051 61565 60438 59056
53754 59056 57834 56817 55893 55196 54990 55311 55957 56726 57375 57513 56976 56296 56283 57033 57759 57825 57488 57311 57241
53735 57241 56715 55483 53888 52432 51415 50948 50974 51255 51552 51844 52240 52782 53528 54636 56103 57546 58586
53718 58586 59326 60098 60867 61335 61649 62406 63811 65292 66267 66886 67658 68621 69362 69683 69872 70282 70998 71957
53700 71957 73129 74466 75891 77425 79221 81389 83871 86500 89087 91431 93326 94601 95168 95053 94472
53685 94472 93813 93422 93418 93795 94617 95912 97425 98698 99517 100078 100599 101035 101326 101742 102614 103818 104790 105103
53667 105103 104821 104324 104073 104525 105850 107531 108612 108660 108232 108120 108363 108416 108052 107583 107239 106843 106208 105411
53649 105411 104549 103660 103081 103433 104901 106827 108300 108939 108885 108389 107731 107268 107093 106894 106498 106309 106746 107442
53631 107442 107574 106905 105993 105366 105085 105192 105950 107368 108914 110009 110529 110652 110578 110578 110960 111753 112762 114061
53613 114061 115958 118150 119559 119622 119336 120237 122472 124621 125484 125362 125363 126021 127074 128252 129725 131774 134368
53596 134368 137194 139964 142573 144990 147092 148743 150057 151414 153099 155025 156962 158886 160869 162708
53582 162708 163987 164539 164628 164584 164474 164212 163813 163417 163176 163153 163171 162793 161720 160341 159597 160057 161269 162240 162450
53563 162450 162151 161825 161636 161436 161083 160606 160225 160247 160835 161820 162788 163425 163707 163809 163963 164414 165329 166642 168044
53544 168044 169253 170262 171278 172461 173805 175170 176346 177177 177747 178379 179287 180301 181090 181627 182188 182903
53528 182903 183642 184456 185852 188332 191825 195798 199795 203636 207244 210653 214173 218243 223032 228377 234064
53513 234064 239928 245709 251198 256617 262553 269377 276902 284755 292824 301277 310394 320487 331671 343590
53499 343590 355665 367739 380172 393151 406352 419542 433029 447082 461308 475164 488833
53488 488833 502984 517814 532911 547960 562947 577656 591676 605115 618747 633128 647847
53477 647847 661965 674926 686944 698766 711103 724043 736960 749318 761486 774283 787732
53466 787732 800837 812735 823430 833215 842098 850278 858471 867009 874967 880940 884514 886382 887226 887096
53452 887096 885771 883083 878854 873097 866348 859304 852092 844332 835932 827266 818509 809419 799995 790738
53438 790738 781875 772783 762669 751521 739947 728355 716698 704963 693416 682326 671775 661836
53426 661836 652700 644538 637363 631129 625888 621824 619130 617841 617719 618392 619611 621332 623514 625966 628481
53411 628481 631081 634057 637811 642690 648844 656127 664213 672934 682472 693129 704918 717454 730245
53398 730245 743117 756407 770737 786466 803340 820780 838538 856988 876747 898274 921852
53387 921852 947650 975403 1004199 1032982 1061388 1089897 1119128 1149263 1180249 1212214 1245305
53376 1245305 1279167 1312920 1345792 1377673 1408962 1439958 1470500 1500099 1528244 1554564 1578840
53365 1578840 1601039 1621368 1640199 1657841 1674284 1689104 1701655 1711428 1718333 1722614 1724450 1723636
53353 1723636 1719660 1712067 1700675 1685459 1666337 1643266 1616645 1587574 1557565 1527834 1498756 1469955
53341 1469955 1440847 1411117 1380837 1350417 1320475 1291570 1263879 1237209 1211403 1186613 1162974
53330 1162974 1140033 1116819 1092624 1067649 1042738 1018575 995328 973004 951874 932299 914316
53319 914316 897713 882550 869254 858009 848268 839198 830464 822203 814273 805985 796701 786428 775658
53306 775658 764939 754807 745798 738175 731715 725971 720614 715404 710143 704974 700586 697729 696494 696295
53292 696295 696481 696827 697585 699313 702467 706861 711679 716377 721434 727883 736280 746476 758114 770737
53278 770737 783592 796143 808857 822749 837941 853326 867962 882027 895968 909341 921243
53267 921243 931488 940641 949051 956464 962545 967282 970855 973494 975425 976625 976606 974802 971104 965728
53253 965728 958653 949588 938481 925702 911650 896493 880385 863657 846622 829289 811425 792917
53241 792917 774098 755661 738131 721411 705077 689133 674069 660065 646561 632963 619328
53230 619328 605950 592698 579344 566170 553514 540862 527273 512807 498772 486318 475390
53219 475390 465318 455835 447058 438989 431529 424791 418943 413824 408950 403800 398044 391780 385638 380289
53205 380289 375530 370147 362949 353814 343544 332994 322631 312671 303257 294477 286414 279159 272667
53192 272667 266724 261168 255941 250885 245717 240323 234820 229180 223118 216541 209822 203369 197223 191355
53178 191355 186019 181409 177253 173217 169517 166683 164815 163487 162306 161088 159559 157377 154595 151732
53164 151732 149314 147594 146662 146390 146158 145114 143021 140648 139096 138841 139496 140322 140794 140844 140745 140805 141118 141642
53146 141642 142364 143215 143905 144148 144026 143883 143821 143553 142828 141754 140653 139782 139295 139207 139338 139476 139680 140135 140636
53127 140636 140564 139583 138125 136959 136407 136100 135323 133534 130841 128164 126618 126442 126724 126458 125602 124791 124272
53110 124272 123658 122668 121596 120892 120611 120403 119807 118481 116404 114000 111876 110294 108972 107435 105444 103138
53094 103138 100930 99249 98126 97052 95481 93567 92062 91452 91507 91791 92174 92571 92608 92079 91514 91701 92651
53077 92651 93497 93550 93008 92402 91784 90814 89496 88368 87868 87755 87307 86071 84320 82760 81853 81509 81437 81570
53059 81570 82014 82709 83441 84186 85199 86659 88408 90119 91549 92602 93328 94013 95047 96566 98374 100302
53043 100302 102412 104655 106598 107791 108247 108223 107691 106408 104465 102386 100579 99008 97513 96133 94935
53028 94935 93755 92293 90314 87675 84422 81071 78525 77384 77331 77401 76872 75793 74731 74168 74156 74401 74566
53011 74566 74526 74392 74293 74188 73848 73046 71841 70715 70258 70516 70797 70350 69264 68391 68377 69129 70298 71891
52993 71891 74066 76577 78745 79964 80058 79280 78116 77005 76023 74974 73913 73344 73678 74704 75925 77248
52977 77248 78860 80523 81524 81557 81259 81540 82531 83496 83758 83481 83474 84286 85628 86734 87249 87585 88354 89649
52959 89649 91041 92166 93088 94114 95418 96851 98000 98472 98263 97784 97388 97019 96487 95935 95723 95930 96294
52942 96294 96613 96860 96909 96514 95731 95040 94858 95088 95321 95285 95027 94791 94867 95367 96060 96543 96673 96720 97039 97713
52922 97713 98526 99144 99347 99306 99603 100681 102257 103587 104347 104881 105531 106184 106692 107216 107825 108231 108437 109231
52904 109231 111353 114359 116998 118745 120273 122284 124487 126141 127156 128227 129981 132344 134630 136040
52890 136040 136212 135469 134519 133764 133019 132017 130968 130313 130018 129467 128171 126377 124799 123906 123598 123438 123047
52873 123047 122337 121554 121121 121261 121783 122440 123417 125240 128049 131194 133771 135343 135913 135429 133774 131267
52857 131267 128711 126737 125312 123953 122187 119747 116666 113449 110924 109602 109262 109214 108804 107623 105678
52842 105678 103646 102562 102717 103087 102367 100527 98767 97978 97805 97407 96562 95642 94934 94440 94102 93819 93362
52825 93362 92670 92124 92091 92170 91346 89122 86303 84391 84282 85571 87019 87583 87177 86575 86509 86795 86521 85206
52807 85206 83503 82484 82411 82679 82872 83322 84438 85990 87387 88276 88477 87713 85996 84091 82954 82658 82361
52790 82361 81389 79852 78203 76780 75986 76257 77411 78509 78853 78849 79467 81052 83059 84740 85746 86280 87046
52773 87046 88808 91564 94285 95863 96154 95789 95219 94511 93777 93166 92455 91280 89765 88328 86864 84861
52757 84861 82433 80530 79763 79601 79177 78411 77828 77590 77171 75932 73772 71336 69720 69660 70736 71651 71504
52740 71504 70530 69516 68935 68954 69700 70895 71554 70727 68544 66063 64146 62895 62119 61793 61891 62164 62292 62069
52722 62069 61440 60586 59942 59822 59997 59909 59338 58588 58004 57622 57374 57327 57528 57878 58274 58723 59163 59401 59417 59555
52702 59555 60170 61166 62097 62688 63070 63433 63676 63524 62929 62177 61605 61368 61538 62189 63180 64021 64316 64284 64512
52683 64512 65159 65800 66166 66599 67546 68949 70454 71813 72764 72887 72142 71265 71030 71261 71185 70679 70461 70964
52665 70964 71705 72030 71981 72112 72811 73992 75131 75471 74700 73550 73178 73694 73945 73172 72226 72462 73933 75496
52647 75496 76509 77489 79065 81039 82733 83657 83643 82835 81867 81594 82276 83305 84057 84689 85777 87437 89236
52630 89236 90897 92622 94657 96846 98812 100422 101936 103696 105737 107699 109113 109743 109657 109001 107874
52615 107874 106447 105056 104022 103419 103139 103137 103467 104013 104349 104003 102922 101587 100563 99918 99186 97969 96513
52598 96513 95495 95311 95708 96183 96532 96851 97170 97340 97299 97225 97317 97547 97753 97940 98349 99193 100429 101826 103164
52579 103164 104264 104881 104726 103784 102535 101801 102193 103662 105537 107022 107717 107730 107371 106808 106120 105543 105445 105942
52561 105942 106714 107375 107930 108669 109580 110089 109531 107809 105559 103688 102753 102703 103107 103589 104079 104675 105393 106115
52543 106115 106681 106908 106668 106136 105914 106605 108165 109835 110823 110929 110511 110081 110036 110488 111052 111000 109965 108418
52525 108418 107167 106354 105301 103412 100948 98727 97283 96501 95935 95235 94248 92988 91648 90644 90459 91257
52509 91257 92545 93333 92880 91362 89704 88718 88515 88748 89144 89589 89843 89583 88800 87953 87540 87592 87719 87646 87553
52490 87553 87854 88688 89720 90448 90659 90514 90233 89752 88791 87259 85568 84455 84382 85125 86053 86871 87912 89515
52472 89515 91326 92537 92863 92877 93223 93843 94297 94566 95101 96092 97137 97716 97730 97462 97235 97257 97595 98098 98433
52453 98433 98327 97751 96910 96186 96001 96450 97034 97132 96852 97029 98091 99295 99572 98869 98121 97949 98030 97860 97573
52434 97573 97658 98225 98981 99676 100234 100567 100621 100607 100884 101544 102269 102676 102698 102604 102663 102754 102345 101088 99469 98575 98941
52413 98941 99867 100196 99596 98761 98522 99156 100509 102203 103631 104265 104250 104353 105010 105795 106120 106152 106573 107555 108406
52394 108406 108285 107018 105196 103700 103091 103306 103913 104709 105897 107551 109182 110154 110353 110092 109502 108520 107456
52377 107456 107038 107661 108960 110357 111747 113368 115178 116715 117504 117518 117288 117618 119012 121280 123768 126028
52361 126028 128106 130171 132141 133814 135148 136212 137008 137537 138022 138872 140420 142663 145183 147392 149076
52346 149076 150689 152849 155549 158210 160547 162945 165774 168791 171539 174000 176462 179040 181774 184948
52332 184948 188806 193131 197606 202493 208364 215144 222056 228760 236007 244790 255102 265975 276611
52319 276611 287170 298422 310843 324181 337805 351319 364804 378544 392816 407862 423717
52308 423717 439866 455402 469863 483723 497773 512210 526628 540581 553650 565146 574449 581747
52296 581747 587920 593525 598348 602095 605069 607806 610312 611924 611878 609914 606484 602400 598096 593326 587766
52281 587766 581724 575850 570328 564910 559782 555712 553150 551724 550925 550836 551929 554510 558669 564372 571355
52266 571355 579235 587932 597615 608142 619069 630348 642359 654949 667121 678102 688144 697802
52254 697802 707102 715986 724853 733807 741966 748413 753422 757742 761058 762342 761561 759805 757546 753943
52240 753943 748260 740985 733002 724436 714987 704838 694575 684515 674609 664787 655010 645189 635375
52227 635375 625834 616740 608004 599620 591950 585424 580098 575665 571756 568226 565287 563287 562090 560837
52213 560837 558802 556430 554952 554962 556001 557657 560278 564136 568478 572050 574216 575167 575467 575890 577329
52198 577329 580093 583334 585694 586625 586732 586839 587101 587107 586612 585937 585592 585521 584938 583188 580665 578412 576793
52181 576793 575122 572802 570188 567904 565810 563308 560362 557576 555334 553383 551274 548816 546129 543565
52167 543565 541523 540040 538672 537045 535326 533859 532539 530976 529089 527082 524999 522782 520694 519172
52153 519172 518210 517339 516209 514771 512943 510651 508292 506600 505879 505757 505839 506162 506784 507378 507590 507499 507423 507488
52135 507488 507636 507923 508549 509797 512134 516163 522124 529475 537231 544758 552231 560412 570129 581752 594890
52120 594890 608574 621961 635014 648464 663076 678926 695331 711408 726637 741021 754887
52109 754887 768631 782498 796364 809744 822296 834330 846498 858771 870031 878985 885333 889681
52097 889681 892463 893391 892047 888655 884091 879227 874266 868593 861375 852519 842964 833793 825170 816484
52083 816484 807443 798568 790493 783292 776767 771088 766756 764056 762771 762380 762402 762712 763798 766644 772005
52068 772005 779570 787952 795802 803052 810920 820554 831780 843412 854622 865496 876183 886130 894606
52055 894606 901611 907706 913131 917608 920915 923120 924191 923795 921544 917216 910883 903158 895080 887139
52041 887139 878459 867606 854260 839531 824570 809557 794207 778464 762321 745609 728512 711855
52029 711855 696347 681869 667903 654324 641360 629095 617470 606494 596046 585688 575042
52018 575042 564112 552972 541552 530112 519480 510195 501723 493071 483922 474596 465159 455291 444902
52005 444902 434212 423222 411723 399843 388014 376403 364942 353881 343600 333738 323254 311710
51993 311710 299951 289180 279764 271256 263146 255215 247448 239987 233000 226402 219928 213613 207939 203266
51979 203266 199363 195629 191521 186637 180830 174542 168698 163898 159875 155980 151963 148013 144359 141152
51965 141152 138492 136216 133862 131208 128646 126645 125102 123690 122582 122177 122193 121703 120301 118605 117397
51950 117397 116727 116221 115815 115694 115743 115563 114939 113933 112579 110910 109339 108582 108956 109921 110526 110174 108910
51933 108910 107149 105361 103924 102992 102390 101716 100671 99283 97831 96601 95760 95362 95382 95679 95991 96076 95910
51916 95910 95649 95351 94815 93847 92597 91401 90288 88904 87108 85362 84209 83537 82751 81699 80983 81238
51900 81238 82404 83919 85347 86562 87577 88428 89117 89420 88959 87771 86585 86160 86442 86763 86832 87055 87809
51883 87809 88856 89709 90193 90398 90382 90219 90167 90473 91109 91878 92629 93174 93225 92720 92082 91823 91963 92176 92441 93093
51863 93093 94195 95276 95842 95792 95138 93743 91709 89709 88462 87955 87632 87301 87373 88094 89058 89802 90545 91825
51845 91825 93578 95021 95587 95598 95822 96580 97543 98344 99122 100344 102259 104732 107627 111200 115923 121996
51829 121996 129203 137234 145971 155445 165782 177359 190705 205850 221710 236251 247261 252973
51817 252973 252425 245854 234866 221740 208257 195171 182703 171150 160862 151920 144085 136912 129882
51804 129882 122718 115771 109867 105545 102585 100373 98470 96665 94836 93080 91801 91336 91574 92141 92738
51789 92738 93047 92631 91414 90139 89832 90713 91941 92506 92087 91084 90159 89847 90328 91406 92792 94351 95979
51772 95979 97399 98362 98917 99133 98704 97317 95379 93812 93015 92510 91851 91427 92013 93788 96116 98123 99266
51755 99266 99538 99351 99180 99238 99590 100423 101758 102924 102935 101717 100493 100509 101755 103331 104639 105566 105839 105057
51737 105057 103543 102444 102614 103792 105135 106208 107080 107700 107679 106815 105575 104856 105304 106903 109164 111566
51721 111566 113761 115510 116686 117429 118122 119070 120272 121558 122871 124236 125479 126100 125579 123875 121702
51706 121702 120172 119885 120291 120102 118432 115406 111734 108086 105064 103337 103243 104217 105026 104804 103831 103329 104528
51689 104528 107782 112254 116354 118577 118166 115267 110748 105916 101953 99275 97420 95737 94081 92735
51675 92735 91857 91253 90629 89842 88913 87996 87246 86608 85815 84778 83850 83502 83829 84612 85734 87193 88760 89901
51657 89901 90167 89503 88242 86917 85980 85444 84893 84050 83259 83082 83470 83749 83510 83184 83573 85002 87003 88672
51639 88672 89316 89018 88643 89065 90315 91710 92768 93676 94820 96197 97524 98622 99486 100292 101487 103577
51623 103577 106497 109453 111785 113850 116609 120369 124373 127741 130397 132782 135031 136936 138602 140548
51609 140548 142861 144698 145173 144612 144462 145851 148663 152067 155389 158195 160051 160811 160914 160812 160231 158508
51593 158508 155551 151963 148247 144447 140609 136994 133665 130354 126966 123758 120853 117971 114877 111691
51579 111691 108627 105842 103680 102430 101550 99799 96679 93270 91018 90159 89959 90030 90527 91304 91859 92198
51563 92198 92864 93905 94560 94360 93896 94033 94781 95415 95439 94966 94355 93886 93754 94059 94767 95844 97338 99189
51545 99189 101031 102389 103082 103305 103333 103238 102905 102309 101728 101628 102244 103367 104642 106009 107622 109367 110728
51528 110728 111277 111091 110644 110435 110781 111721 112915 113803 114092 114080 114434 115718 118146 121568 125524 129437 132983
51511 132983 136283 139669 143352 147392 151749 156143 160053 163161 165778 168524 171554 174376 176456 177724
51497 177724 178340 178321 177650 176507 175044 173070 170373 167342 164818 163122 161550 159167 155934 152752 150482
51482 150482 149220 148493 147885 147344 147042 147043 147082 146717 145763 144402 142676 140098 136222 131546 127312 124272 122107
51465 122107 120260 118744 117721 116751 115130 112811 110382 108213 106185 104302 102951 102332 102074 101678 101057
51450 101057 100408 99793 99082 98149 96961 95562 94091 92670 91266 89780 88275 86919 85715 84559 83529
51435 83529 82793 82200 81322 79975 78347 76617 74921 73779 73939 75460 77427 78956 79988 80681 80633 79427
51419 79427 77576 76133 75511 75400 75706 76674 78044 78918 78883 78581 78801 79565 80522 81687 83205 84691 85464
51402 85464 85380 85022 85041 85667 86842 88513 90670 93189 95722 97819 99327 100659 102367 104319 105654 105806
51386 105806 105317 105301 106289 107844 109135 109545 108880 107354 105393 103268 100984 98650 96637 95064 93410 91150
51370 91150 88569 86379 84642 82706 80224 77576 75174 73007 71188 70281 70626 71700 72636 73080 73210 73258
51354 73258 73474 74205 75460 76525 76497 75211 73293 71480 70267 70019 70802 72061 72922 73001 72624 72237 71941
51337 71941 71616 71143 70432 69576 68954 68870 69114 69283 69495 70238 71430 72262 72241 71813 71638 71724 71700 71514 71314 70995
51317 70995 70458 70083 70378 71174 71700 71477 70778 70173 70016 70430 71404 72761 74172 75237 75505 74664 73014 71559
51299 71559 71192 71826 72669 73302 74028 75165 76425 77139 76798 75343 73307 71716 71415 72292 73365 73744 73312
51282 73312 72546 72086 72428 73498 74424 74280 73238 72460 72612 73144 73434 73901 75285 77267 78703 79109 79142 79585
51264 79585 80546 81807 83358 85233 87149 88653 89505 89866 90233 91156 92730 94400 95519 96102 96704 97549
51248 97549 98212 98215 97548 96467 95250 94408 94718 96517 99087 101101 101703 101028 99820 98813 98381 98442 98552 98281
51230 98281 97572 96736 96114 95837 95915 96390 97292 98433 99374 99788 99862 100140 100822 101417 101369 100892 100791 101457 102466
51211 102466 103237 103638 103759 103542 102963 102227 101361 99944 97775 95559 94311 94132 94145 93709 93089 92764 92653 92345
51193 92345 91655 90535 88793 86397 83868 81952 80964 80688 80779 80935 80880 80577 80426 80818 81548 82031 82053 81888
51175 81888 81657 81123 80249 79443 78960 78593 78274 78459 79374 80290 80266 79428 78834 79090 79818 80554 81388 82405 83146
51156 83146 83223 83024 83257 83973 84541 84476 83850 82965 82083 81489 81407 81717 82051 82244 82459 82826 83260 83746 84470 85495
51136 85495 86544 87331 87930 88579 89247 89696 89946 90387 91308 92507 93563 94409 95399 96750 98179 99296 100222
51119 100222 101480 103256 105110 106527 107460 108104 108420 108245 107717 107234 107041 107109 107351 107681 107980 108407 109610
51102 109610 112129 115557 118770 121063 122569 123488 123638 123068 122455 122244 121845 120407 118178 116384 115820 116155
51086 116155 116671 117066 117383 117707 118186 118971 119871 120395 120394 120368 120859 121751 122446 122558 122198 121676 121177 120685 120050 119177
51066 119177 118243 117649 117647 118143 118984 120252 122037 123954 125168 125025 123638 121882 120776 120750 121364 121784 121619
51049 121619 121266 121430 122423 123974 125571 126856 127835 128900 130494 132640 134793 136310 136975 136955 136482 135843
51033 135843 135552 136092 137459 139200 140980 142815 144719 146466 147888 149125 150415 151843 153521 155746 158635
51018 158635 161783 164674 167331 170209 173417 176499 179132 181663 184627 187983 191242 194270 197565 201657
51004 201657 206601 212211 218506 225573 233152 240798 248483 256690 265713 275255 285004 295334 306950 319958
50990 319958 333857 348591 365077 384301 406261 430249 456015 484160 515391 549810 587041
50979 587041 626742 668864 713633 761380 812194 865589 920583 976078 1030987 1084109 1134222
50968 1134222 1180399 1221928 1257895 1287300 1309863 1326353 1337775 1344468 1346295 1343465 1336766 1327158
50956 1327158 1315572 1303006 1290395 1278348 1267326 1257946 1250592 1244675 1238739 1231485 1222347 1210980
50944 1210980 1196767 1179246 1158676 1135659 1110242 1081739 1049510 1013696 975188 935030 893900
50933 893900 852055 809713 767482 726368 687345 650955 617311 586369 558155 532773 510166
50922 510166 489860 471159 453786 438156 424720 413183 402819 393421 385314 378372 371844 365541
50910 365541 360485 357618 356316 355027 353220 351871 351946 353186 354734 356374 358586 361598 364906 367833 370358
50895 370358 373173 376946 381655 386815 392238 398133 404398 410438 416157 422674 431334 442175 454102 466520
50881 466520 479968 494961 511020 527394 544227 562412 582607 604921 629450 656723 687606
50870 687606 723006 763519 809250 860166 916851 980616 1052564 1132744 1220513 1315424 1417309
50859 1417309 1525649 1639429 1757657 1879534 2003854 2128431 2250243 2365996 2472493
50850 2472493 2566816 2646595 2710332 2757504 2788345 2803481 2803801 2790714 2766436 2733902 2696304 2656776
50838 2656776 2618268 2583260 2553382 2529418 2511704 2500084 2493249 2488474 2482433 2472322 2456192 2432645
50826 2432645 2400622 2359366 2308263 2246851 2175259 2094552 2006405 1912577 1814872 1715261 1615624
50815 1615624 1517546 1422678 1332946 1249826 1173567 1103651 1039887 982471 931165 885236 844284
50804 844284 808361 777070 749371 724716 703733 687169 674649 664993 657409 651713 647551 644027
50792 644027 640139 635291 629425 622870 615989 608695 600568 591662 582884 575162 568416 561791 554752 547442
50778 547442 540044 532392 524417 516576 509644 504239 500639 498752 498142 498302 499000 500258 502004 504086 506748
50763 506748 510863 517416 526737 538298 551255 565241 580686 598314 618384 640658 665272 693253
50751 693253 725744 762927 804144 848978 897637 950286 1006710 1066925 1131460 1200497 1273027
50740 1273027 1347363 1422287 1497170 1571068 1642173 1708147 1766639 1815513 1853105 1878525 1891538
50729 1891538 1892090 1880411 1857861 1827352 1792367 1755444 1717886 1680938 1646770 1617842 1595378 1578829
50717 1578829 1566866 1558521 1553181 1549833 1546790 1542119 1533984 1520632 1500557 1472956 1437843 1395635
50705 1395635 1346993 1293300 1236876 1180222 1124989 1071905 1021523 974633 931988 894000 860775
50694 860775 832105 807317 785538 766400 750285 737591 727838 719762 712312 705376 699482 694965 691601
50681 691601 689016 687220 686524 686975 688098 689327 690469 691572 692516 693089 693443 694053 695138 696403 697597 699104
50665 699104 701703 705850 711351 717737 724835 733028 743041 755411 770171 787136 806391 828130 852069
50652 852069 877524 904333 933196 964575 997617 1030800 1063440 1095850 1127921 1158325 1185452
50641 1185452 1208696 1228472 1245387 1259726 1271430 1280116 1285337 1287131 1286192 1283208 1278319 1271567 1263657
50628 1263657 1255760 1248656 1242462 1237102 1232522 1228398 1224178 1219695 1215370 1211590 1208131 1204403 1200066 1195290
50614 1195290 1190632 1186821 1184349 1182942 1181530 1178937 1174547 1168166 1159420 1147572 1131879 1111893 1087441
50601 1087441 1058599 1025883 990401 953697 917286 882151 848517 816168 785055 755660 728763
50590 728763 704913 684123 666024 650338 637250 627304 620753 617069 615330 615166 617034 621398 627844
50577 627844 635306 642973 650662 658338 665631 672005 677315 682110 687375 693925 701896 710877 720562 731157
50563 731157 743013 756061 769829 783954 798387 813051 827618 841721 855252 868313 880989
50552 880989 893321 905532 918276 932605 949498 969289 991657 1016310 1043489 1073710 1107257
50541 1107257 1144359 1185726 1232381 1284774 1342329 1403953 1468724 1536093 1605716 1677220 1749735
50530 1749735 1821559 1890663 1955716 2016179 2071153 2118597 2156157 2182431 2197019 2199813 2190969 2171427
50518 2171427 2142599 2105361 2059949 2007122 1948906 1887799 1825593 1763296 1701917 1642852 1587550
50507 1587550 1537167 1492542 1454242 1422465 1396989 1377327 1363021 1353860 1349851 1351001 1357242 1368651
50495 1368651 1385459 1407440 1433158 1460068 1485325 1506259 1520164 1524387 1517176 1498357 1468910 1430123
50483 1430123 1383453 1330899 1274872 1217515 1160326 1104377 1050494 999209 950799 905535 863681
50472 863681 825271 790193 758566 730732 706710 685908 667629 651766 638806 629178 622729 618828
50460 618828 617001 617443 620868 627703 637458 649080 661869 675844 691195 707694 724781 741997 759233
50447 759233 776731 794871 813676 832432 850125 866432 881887 896837 910671 922501 932265 940588
50435 940588 947833 953989 959440 965083 971446 978235 985021 991934 999423 1007873 1017937 1030851 1047723
50422 1047723 1068505 1092076 1117390 1144300 1173290 1204702 1238220 1272863 1307314 1340341 1370967
50411 1370967 1398300 1421492 1439973 1453473 1461577 1463392 1457993 1444985 1424364 1396037 1360075 1317470
50399 1317470 1270122 1219848 1167740 1114617 1061674 1010351 961872 917173 876913 841147 809215
50388 809215 780518 755436 735076 720047 709799 703218 699637 699185 702432 709792 721036 735189 750981
50375 750981 767429 783797 799011 811431 819391 821833 818373 809124 794727 776344 755197 732116
50363 732116 707650 682464 657269 632470 608206 584788 562791 542689 524667 508765 494838
50352 494838 482337 470625 459784 450699 443958 438973 434623 430603 427676 426610 427378 429507 432840 437689
50338 437689 444363 452746 462320 472629 483711 495895 509023 522150 534430 546125 558221 571021
50326 571021 583728 595553 606681 617723 628639 638701 647220 653849 658373 660743 661347 660899 660011
50313 660011 659059 658310 657831 657325 656420 655103 653551 651580 648702 644759 640125 635208 630138 625130 620716
50298 620716 617283 614516 611541 607532 602054 595043 586797 578032 569793 563079 558331 555143 552657 550479
50284 550479 549114 549168 550237 551108 551121 550784 550785 550931 550597 549853 549493 549953 550744 551036 550433 549046 547149 545051
50266 545051 543133 541691 540642 539456 537555 534931 532298 530441 529374 528347 526765 524786 522813 520792
50252 520792 518398 515688 513100 510802 508542 506247 504374 503491 503717 504654 505676 506273 506380 506502 507252 508632
50236 508632 510043 511055 511862 512835 513987 515161 516381 517629 518444 518221 516886 514946 512843 510609 508140
50221 508140 505394 502225 498349 493757 488898 484187 479542 474719 470006 466175 463638 461939 460275 458377
50207 458377 456660 455480 454453 452612 449239 444522 439407 434824 431035 427627 424032 420023 415823 411887
50193 411887 408634 406258 404661 403470 402182 400397 398016 395235 392270 389070 385421 381437 377758 374983
50179 374983 372940 370848 368323 365888 364277 363538 363203 363118 363572 364586 365620 366252 366850 368313 371345 376187
50163 376187 382780 390889 400256 410958 423568 438628 455915 474382 492742 509918 525120 537987
50151 537987 548845 558483 567421 575542 582636 589155 596058 603845 611875 618690 622867 623518 620228 612876
50137 612876 601703 587374 570744 552508 533191 513451 494188 476192 459767 444809 431247
50126 431247 419296 409287 401301 395016 389949 385867 382907 381251 380768 381083 381903 382978 383894 384313 384636
50111 384636 385973 389097 393587 398283 402448 406186 409926 413940 418329 423095 428067 433045 438023 443137
50097 443137 448398 453725 459194 464952 470872 476631 482189 487889 493972 500280 506540 512683 518790 524944
50083 524944 531298 538031 545111 552288 559436 566697 574177 581774 589409 597166 604985 612528 619578 626349
50069 626349 633095 639623 645510 650644 655231 659369 662971 666062 668800 671136 672684 673097 672482 671451 670810
50054 670810 671092 672294 674144 676762 680912 687432 696525 707820 721081 736664 755348 777886 804591
50041 804591 834989 867859 901740 935462 968097 998695 1026548 1051778 1075305 1098002 1120024
50030 1120024 1141023 1160743 1179105 1195747 1209618 1219089 1222476 1218564 1206846 1187517 1161491 1130339
50018 1130339 1095752 1058729 1019404 977914 935285 893163 852793 814608 778677 745044 713579
50007 713579 684032 656592 632014 610900 592916 576951 561923 547374 533545 521117 510655
49996 510655 502003 494233 486442 478540 471154 464864 459651 454980 450181 444829 438934 432805 426717 420769
49982 420769 415049 409677 404532 399208 393485 387654 382046 376413 370182 363334 356592 350608 345254 339935
49968 339935 334431 329176 324768 321367 318632 316172 314001 312394 311315 310210 308565 306490 304433 302451
49954 302451 300229 297874 296192 295846 296514 297218 297351 297093 296950 297169 297593 297898 298008 298397 299808 302454 305633
49937 305633 308480 311010 314047 318168 323234 329066 336020 344457 353989 363753 373407 383454 394579 407052
49923 407052 420898 436301 453498 472288 491856 511204 529724 547326 563945 578988 591508
49912 591508 601092 608474 615023 621669 628460 635042 641133 646331 649727 650060 646304 638085 625636 609482
49898 609482 590099 567822 543153 517199 491576 467672 446015 426446 408746 392855 378589
49887 378589 365545 353431 342354 332545 323932 316157 309056 302968 298425 295478 293429 291320 288730
49874 288730 285997 283654 281853 280475 279680 279964 281552 283924 286163 287735 288842 290006 291483 293112 294649
49859 294649 296108 297726 299601 301460 302863 303665 304212 305007 306140 307129 307368 306713 305563 304363 303179 301797
49843 301797 300065 298041 295897 293869 292228 291083 290237 289391 288482 287640 286889 286217 285927 286440 287510 288095
49827 288095 287462 286185 285494 285733 286025 285590 284842 284762 285575 286625 287521 288814 291134 293980 295955 296273 295571
49810 295571 294920 294411 293274 291196 288805 286675 284573 282062 279347 276902 274699 272437 270366 269140 268891
49795 268891 269048 269117 269066 268887 268393 267624 266917 266396 265853 265279 264926 264627 263758 262260 261111 261230 262422 263938
49777 263938 265581 267539 269549 271069 272141 273251 274376 274918 274664 274125 273792 273665 273704 274120 274977 275977
49761 275977 276957 278174 279833 281734 283563 285111 286078 286254 286193 287045 289222 291728 293414 294472 295979 298283
49745 298283 300617 302213 302997 303178 302905 302582 302872 304006 305450 306493 306872 306657 306007 305252 304745 304305 303173
49728 303173 300969 298377 296434 295336 294404 293061 291316 289387 287388 285552 284302 283797 283651 283336 282696
49713 282696 281952 281348 280966 280771 280674 280545 280241 279615 278590 277345 276403 276297 277126 278535 280121 281604 282667
49696 282667 282981 282625 282233 282493 283556 285013 286241 286683 286157 285154 284638 285157 286233 286908 286862 286710 287243
49679 287243 288640 290464 292176 293629 295215 297497 300501 303398 305160 305556 305363 305596 306690 308327 309795
49664 309795 310540 310687 311013 312166 313892 315350 316155 316728 317574 318697 319907 321245 322803 324479 326221 328252
49648 328252 330737 333441 336009 338305 340219 341481 342035 342371 343006 343847 344488 344912 345372 345762 345772 345601 345887
49631 345887 346789 347800 348651 349750 351390 353088 354232 355015 356147 357930 360080 362294 364429 366198 367248
49616 367248 367706 368233 369408 371286 373637 376337 379372 382716 386370 390341 394449 398361 401985 405698 409965
49601 409965 414833 419983 425230 430699 436539 442697 449015 455350 461522 467424 473348 479955 487584 495699
49587 495699 503435 510716 518422 527248 536756 545933 554433 562794 571527 580557 589699 599227 609543 620543
49573 620543 631639 642367 652671 662698 672632 682786 693540 705036 717114 729631 742659 756242
49561 756242 770129 783963 797651 811362 825259 839410 853961 869103 884780 900608 916207
49550 916207 931477 946453 961073 975291 989276 1003264 1017144 1030386 1042438 1053114 1062616 1071302
49538 1071302 1079451 1087044 1093761 1099341 1104017 1108410 1112895 1117160 1120495 1122451 1123179 1123283 1123451 1124124 1125352
49523 1125352 1126925 1128652 1130494 1132516 1134880 1137875 1141742 1146433 1151747 1157693 1164423 1171774 1179210 1186369
49509 1186369 1193276 1199772 1205260 1209462 1213048 1216873 1220825 1224102 1226548 1228951 1231879 1234910 1237350 1239079
49495 1239079 1240277 1240777 1240267 1238825 1236705 1233711 1229296 1223290 1216174 1208573 1200721 1192425 1183232 1172627
49481 1172627 1160415 1147059 1133461 1120243 1107291 1094012 1079919 1064958 1049457 1033867 1018469
49470 1018469 1003329 988587 974756 962396 951369 940673 929341 917438 905860 895146 884954
49459 884954 874891 865398 857252 850333 843515 836013 828382 821858 816997 813288 809832 806074 802021 798186
49445 798186 795271 793616 793088 793727 796087 800244 804533 806157 803491 797473 790514 784434 779622 775576 771632
49430 771632 767364 762892 758884 756044 754541 753934 753464 752348 750156 747340 745228 745101 747145 750392 753586
49415 753586 756051 758000 760272 763654 768208 773294 778357 783460 788859 794345 799376 803802 808169 813262
49401 813262 819448 826346 833035 838789 843825 849085 855079 861165 866223 869840 872462 874612 876358 877475
49387 877475 877766 877314 876665 876578 877241 877912 877777 876953 876183 875727 875248 874803 875175 876883 879347 881451 882709 883544
49369 883544 884585 885948 887229 888091 888801 890005 891953 894266 896727 899900 904465 910200 916278 922442 929152
49354 929152 936569 944214 951893 960268 970080 981333 993612 1006707 1020470 1034488 1048366 1062196
49342 1062196 1076397 1091351 1107411 1124871 1143605 1163013 1182647 1202647 1223315 1244631 1266434
49331 1266434 1288686 1311234 1333765 1356393 1379805 1404314 1429217 1453672 1477876 1502610 1527917
49320 1527917 1553004 1577372 1601261 1624871 1647878 1669911 1691013 1711384 1731055 1749989 1768169
49309 1768169 1785429 1801497 1816210 1829388 1840521 1849071 1855201 1859804 1863685 1867013 1869650 1871553 1872688
49296 1872688 1872937 1872366 1871342 1870198 1868979 1867630 1866178 1864663 1863142 1861870 1861236 1861381 1862137 1863429 1865474
49281 1865474 1868467 1872362 1877079 1882650 1888993 1895824 1903003 1910786 1919547 1929410 1940217 1951542 1962543
49268 1962543 1972022 1979032 1983464 1985931 1987077 1987074 1985747 1983163 1979916 1976595 1972829 1967228 1958628 1947212
49254 1947212 1934033 1919740 1904388 1888254 1871916 1855302 1837466 1817706 1796347 1774104 1751282
49243 1751282 1728050 1704872 1682098 1659578 1637248 1615669 1595381 1576127 1557406 1539420 1522642
49232 1522642 1506689 1490547 1473984 1457962 1443438 1430395 1418256 1406630 1395411 1384624 1374446
49221 1374446 1365051 1356224 1347544 1339070 1331402 1324841 1318914 1313064 1307418 1302477 1298272 1294244 1289935 1285511
49207 1285511 1281558 1278470 1276017 1273502 1270415 1266887 1263396 1260184 1257226 1254608 1252498 1250719 1248840 1246732
49193 1246732 1244605 1242422 1239897 1237322 1235737 1235742 1236607 1237132 1237067 1237005 1237181 1237138 1236659 1236281 1236565 1237378 1238303 1239504
49175 1239504 1241724 1245445 1250326 1255556 1260682 1266006 1272183 1279562 1287967 1296947 1305991 1314624 1322742 1331033
49161 1331033 1340591 1351867 1364249 1377034 1390403 1404924 1420313 1435279 1448657 1460218 1470455
49150 1470455 1480123 1490066 1500864 1512275 1523373 1533522 1542933 1552097 1561058 1569613 1577930 1586502 1595588
49137 1595588 1605014 1614495 1623880 1633121 1642176 1650880 1658786 1665329 1670456 1674942 1679727 1684949 1689964 1694297
49123 1694297 1698164 1701975 1705733 1709280 1712831 1716780 1720909 1724286 1726192 1726947 1727451 1727985 1727957 1726999 1725852
49108 1725852 1725679 1726653 1727828 1728466 1728941 1730091 1732152 1734794 1737789 1741141 1744717 1748365 1752327 1756950 1761866
49093 1761866 1766084 1769194 1772013 1775673 1780408 1785642 1790924 1796212 1801319 1805683 1808841 1810735 1811421 1810793
49079 1810793 1808881 1806191 1803435 1800885 1798107 1794332 1789101 1782645 1775675 1768642 1761211 1752620 1742630 1731843
49065 1731843 1720981 1710113 1698910 1687362 1675749 1663961 1651374 1637592 1622893 1607778 1592488
49054 1592488 1577292 1562833 1549634 1537413 1525388 1513303 1501714 1491252 1482043 1473953 1466907 1460706
49042 1460706 1454946 1449539 1445041 1442072 1440476 1439458 1438485 1437744 1437631 1438092 1438541 1438294 1437104 1435421 1434129
49027 1434129 1433780 1434051 1434063 1433201 1431456 1429094 1426382 1423697 1421555 1420225 1419397 1418413 1416835 1414788 1412897 1411917
49011 1411917 1412235 1413559 1415211 1416779 1418423 1420507 1423100 1425956 1428839 1431759 1434925 1438578 1442771 1447309
48997 1447309 1451982 1456839 1461998 1467255 1472203 1476837 1481589 1486540 1491044 1494567 1497612 1501237 1505819 1510808
48983 1510808 1515627 1520206 1524581 1528647 1532568 1536877 1541721 1546393 1550138 1553154 1556276 1559814 1563274 1566220
48969 1566220 1568828 1571367 1573665 1575524 1577365 1579898 1583188 1586518 1589308 1591769 1594428 1597341 1600214 1603075
48955 1603075 1606277 1609797 1613122 1616083 1619238 1623011 1626872 1630102 1633216 1637790 1644713 1653194 1661818 1670011
48941 1670011 1678129 1686716 1696322 1707730 1721530 1737378 1754244 1771533 1789611 1809189 1830605 1853842
48929 1853842 1878804 1905334 1933261 1962717 1994145 2027682 2062765 2098597 2134859 2171712 2209230
48918 2209230 2247182 2285277 2323296 2361009 2398313 2435494 2472965 2510569 2547414 2582680 2616374
48907 2616374 2649072 2681087 2712265 2742553 2772312 2801848 2830858 2858654 2884891 2909856 2934095
48896 2934095 2957925 2981348 3004179 3026167 3047184 3067490 3087704 3108249 3128818 3148534 3166674
48885 3166674 3183161 3198327 3212354 3224970 3235608 3243838 3249809 3254291 3258021 3260789 3261346 3258466 3252071
48872 3252071 3243051 3232024 3218586 3201918 3181812 3158810 3133459 3105818 3075713 3043154 3008316
48861 3008316 2971369 2932599 2892628 2852232 2811905 2771787 2731994 2692705 2653850 2615106 2576573
48850 2576573 2539282 2504572 2472845 2443312 2415053 2387983 2362617 2339284 2317979 2298743 2281733
48839 2281733 2266956 2254354 2244177 2236775 2231966 2229038 2227672 2228432 2231975 2238022 2245546 2253834 2262950
48826 2262950 2273161 2284366 2296172 2308276 2320663 2333685 2347963 2363894 2381086 2398581 2415741
48815 2415741 2432716 2449894 2467233 2484270 2500522 2515643 2529580 2542895 2556658 2571588 2587518
48804 2587518 2604060 2621480 2640248 2659896 2679158 2697447 2715534 2734420 2754114 2773945 2793593
48793 2793593 2813241 2833020 2852873 2872790 2892620 2911743 2929456 2945701 2960964 2975455 2988887
48782 2988887 3001152 3012721 3024121 3035352 3046058 3055976 3065033 3073260 3080858 3088088 3094885 3100734 3105180
48769 3105180 3108282 3110334 3111353 3111115 3109510 3106540 3102075 3096018 3088744 3080942 3072796 3063580 3052284 3038646
48755 3038646 3023407 3007632 2991866 2975927 2959382 2942106 2924346 2906374 2888266 2870050 2851916
48744 2851916 2834181 2817196 2801404 2787291 2775078 2764493 2755055 2746521 2738961 2732510 2727345 2723828
48732 2723828 2722327 2722796 2724841 2728316 2733571 2740926 2750151 2760708 2772320 2785001 2798620 2812798 2827293
48719 2827293 2842152 2857370 2872622 2887511 2901999 2916414 2931149 2946501 2962628 2979357 2996009
48708 2996009 3011733 3026179 3039657 3052493 3064363 3074497 3082344 3087786 3090836 3091534 3090162 3087077 3082128
48695 3082128 3074598 3064074 3051181 3037104 3022525 3007357 2991381 2974680 2957356 2939138 2919570
48684 2919570 2898521 2876527 2854687 2834141 2815361 2797884 2780881 2763892 2746796 2729297 2710961
48673 2710961 2691927 2673102 2655279 2638349 2621672 2605087 2589206 2574708 2561584 2549041 2536021
48662 2536021 2521869 2506702 2491196 2475957 2461072 2446186 2430823 2414559 2397057 2378072 2357456
48651 2357456 2335259 2312003 2288675 2265960 2243443 2220027 2195282 2169854 2144344 2118452 2091772
48640 2091772 2064856 2038694 2013516 1988877 1964733 1941498 1919096 1896921 1874958 1854027 1834552
48629 1834552 1815879 1797347 1779291 1762380 1746580 1731579 1717771 1705891 1695792 1686417 1677085 1668155
48617 1668155 1660314 1653785 1648448 1644234 1641023 1638465 1636261 1634569 1633921 1634739 1636972 1640220 1644181 1648954
48603 1648954 1654750 1661324 1667978 1674236 1680213 1686135 1691868 1697305 1702810 1708766 1714919 1720802 1726649 1733228
48589 1733228 1740813 1749012 1757645 1767019 1777113 1787239 1796854 1806060 1814899 1822808 1829264 1834361 1838183
48576 1838183 1840184 1839983 1838357 1836630 1835301 1834083 1833103 1833047 1834014 1835126 1835650 1835877 1836535 1837872 1839669 1841716
48560 1841716 1843831 1845798 1847711 1850158 1853689 1858187 1863051 1867907 1872890 1878385 1884658 1891647 1899007 1906520
48546 1906520 1914536 1923743 1934381 1945941 1957827 1970022 1982878 1996539 2010910 2026001 2041918 2058616
48534 2058616 2075869 2093470 2111292 2129271 2147402 2165525 2183028 2199159 2213917 2228197 2242639
48523 2242639 2256661 2269189 2280113 2290343 2300527 2310401 2319471 2327642 2334838 2340505 2343935 2344989 2344295
48510 2344295 2342856 2341397 2339795 2337120 2332594 2326573 2320273 2314517 2309118 2303496 2297288 2290205 2281877 2272322
48496 2272322 2262148 2251866 2241261 2229814 2217408 2204250 2190365 2175669 2160355 2144704 2128570
48485 2128570 2111488 2093283 2074268 2054880 2035359 2015700 1995697 1975187 1954542 1934698 1916297
48474 1916297 1898915 1881496 1863503 1845318 1827755 1811600 1797356 1784722 1772295 1758526 1743208
48463 1743208 1727614 1713007 1699519 1686659 1674309 1662694 1651739 1640936 1629829 1618345 1606674
48452 1606674 1595005 1583278 1571213 1558742 1546361 1534743 1523861 1512859 1500949 1488155 1475084
$$ [...]
##END NTUPLES=NMR SPECTRUM
##END=
