##TITLE=NES1042_878015014_9242965_O5LvIJuU8l
##JCAMPDX= 6.0         $$ Bruker NMR JCAMP-DX V2.0
##DATA TYPE= NMR SPECTRUM
##DATA CLASS= NTUPLES
##ORIGIN= BRUKER
##OWNER= Administrator
$$ 1.72 TOPSPIN		Version 2.1
$$ 2015-07-01 22:41:19.570 -0700  Administrator@X
$$ Compression mode = diff/dup
##.OBSERVE FREQUENCY= 400.02188249412
##.OBSERVE NUCLEUS= ^1H
##.ACQUISITION MODE= SIMULTANEOUS (DQD)
##.ACQUISITION SCHEME= undefined
##.AVERAGES= 8
##.DIGITISER RES= 22
##SPECTROMETER/DATA SYSTEM= spect
##.PULSE SEQUENCE= zg30
##.SOLVENT NAME= COFFEE_meoh
##.SHIFT REFERENCE= INTERNAL, COFFEE_meoh, 1, 14.98509
##AUDIT TRAIL= $$ (NUMBER, WHEN, WHO, WHERE, PROCESS, VERSION, WHAT)
$$ ##TITLE= Audit trail, TOPSPIN		Version 2.1
$$ ##JCAMPDX= 5.01
$$ ##ORIGIN= Bruker BioSpin GmbH
$$ ##OWNER= Administrator
$$ $$ E:\/data/COFFEE/nmr/NES1042_878015014_9242965_O5LvIJuU8l/20/pdata/1/auditp.txt
$$ ##AUDIT TRAIL=  $$ (NUMBER, WHEN, WHO, WHERE, PROCESS, VERSION, WHAT)
(   1,<2015-07-01 22:41:11.414 -0700>,<Administrator>,<X>,<go>,<TOPSPIN 2.1>,
      <created by zg
	started at 2015-07-01 22:40:05.680 -0700,
	POWCHK enabled, PULCHK disabled,
       configuration hash MD5:
       21 0F 79 D6 B3 7B B4 F6 88 20 88 DB 03 48 BD 9F
       data hash MD5: 64K
       0B 05 03 92 1A 32 B5 33 BC 23 2B 67 21 16 9A DF>)
(   2,<2015-07-01 22:41:15.539 -0700>,<Administrator>,<X>,<proc1d>,<TOPSPIN 2.1>,
      <Start of raw data processing
       efp LB = 0 FT_mod = 6 PKNL = 1 PHC0 = 0 PHC1 = 0 SI = 32K 
       data hash MD5: 32K
       38 15 13 19 DF 4E 44 F9 C8 B1 2C 53 3A 13 D9 63>)
(   3,<2015-07-01 22:41:15.820 -0700>,<Administrator>,<X>,<proc1d>,<TOPSPIN 2.1>,
      <pk PHC0 = 94.1803 PHC1 = 0 
       data hash MD5: 32K
       38 F1 82 CB E6 DF F1 D9 6D C6 93 E4 37 9D 4F 70>)
(   4,<2015-07-01 22:41:15.930 -0700>,<Administrator>,<X>,<proc1d>,<TOPSPIN 2.1>,
      <abs ABSG = 1 
       data hash MD5: 32K
       EA 8E 99 74 BA 1A 8E E5 2F 63 BF 52 61 C4 DB B3>)
(   5,<2015-07-01 22:41:16.008 -0700>,<Administrator>,<X>,<proc1d>,<TOPSPIN 2.1>,
      <abs ABSG = 2 
       data hash MD5: 32K
       31 28 FB 92 FA 64 41 7F 2B 83 3F F7 EF C9 D4 9F>)
(   6,<2015-07-01 22:41:16.055 -0700>,<Administrator>,<X>,<proc1d>,<TOPSPIN 2.1>,
      <abs ABSG = 3 
       data hash MD5: 32K
       80 A5 F7 BC 0A 14 FA 77 39 8D 26 71 D2 A5 A8 42>)
(   7,<2015-07-01 22:41:16.117 -0700>,<Administrator>,<X>,<proc1d>,<TOPSPIN 2.1>,
      <abs ABSG = 4 
       data hash MD5: 32K
       62 DC DA 09 0A 62 45 01 D3 EB D0 B0 B6 A3 C0 36>)
(   8,<2015-07-01 22:41:16.164 -0700>,<Administrator>,<X>,<proc1d>,<TOPSPIN 2.1>,
      <abs ABSG = 5 
       data hash MD5: 32K
       5B 26 C7 CB A5 F8 AC C0 E4 6B 52 8C 18 A3 B5 BE>)
$$ ##END=
$$ 
$$ $$ hash MD5
$$ $$ 8A 25 85 69 35 EE D9 D5 E5 01 69 EC F0 13 EF CF
##$RELAX= 
##$RELAX= 
##$RELAX= 
##$RELAX= 
##$RELAX= 
##$RELAX= 
##$RELAX= 
$$ Bruker specific parameters
$$ --------------------------
##$DU= <E:\>
##$EXPNO= 20
##$NAME= <NES1042_878015014_9242965_O5LvIJuU8l>
$$ [...]
150 150 150 150 150 150 150 150
##$TP07= 0
##$TPNAME0= <>
##$TPNAME1= <>
##$TPNAME2= <>
##$TPNAME3= <>
##$TPNAME4= <>
##$TPNAME5= <>
##$TPNAME6= <>
##$TPNAME7= <>
##$TPOAL= (0..7)
0.5 0.5 0.5 0.5 0.5 0.5 0.5 0.5
##$TPOFFS= (0..7)
0 0 0 0 0 0 0 0
##$TUNHIN= 0
##$TUNHOUT= 0
##$TUNXOUT= 0
##$USERA1= <user>
##$USERA2= <user>
##$USERA3= <user>
##$USERA4= <user>
##$USERA5= <user>
##$V9= 5
##$VALIST= <valist>
##$VCLIST= <CCCCCCCCCCCCCCC>
##$VD= 0
##$VDLIST= <DDDDDDDDDDDDDDD>
##$VPLIST= <PPPPPPPPPPPPPPP>
##$VTLIST= <TTTTTTTTTTTTTTT>
##$WBST= 2048
##$WBSW= 25
##$XGAIN= (0..3)
0 0 0 0
##$XL= 0
##$YL= 0
##$YMAX_a= 617325
##$YMIN_a= -516110
##$ZGOPTNS= <>
##$ZL1= 120
##$ZL2= 120
##$ZL3= 120
##$ZL4= 120
##$ABSF1= 14.98509
##$ABSF2= -5.573092
##$ABSG= 5
##$ABSL= 3
##$ALPHA= 0
##$AQORDER= 0
##$ASSFAC= 0
##$ASSFACI= 0
##$ASSFACX= 0
##$ASSWID= 0
##$AUNMP= <proc_prof1d_extract_pilot.lims>
##$AXLEFT= 0
##$AXNAME= <>
##$AXNUC= <1H>
##$AXRIGHT= 0
##$AXTYPE= 0
##$AXUNIT= <>
##$AZFE= 0.1
##$AZFW= 0.1
##$BCFW= 0
##$BC_mod= 0
##$BYTORDP= 0
##$COROFFS= 0
##$CY= 15
##$DATMOD= 1
##$DC= 0
##$DFILT= <>
##$DTYPP= 0
##$F1P= 0
##$F2P= 0
##$FCOR= 0.5
##$FTSIZE= 32768
##$FT_mod= 6
##$GAMMA= 0
##$GB= 0
##$INTBC= 1
##$INTSCL= 1
##$ISEN= 128
##$LB= 0
##$LEV0= 0
##$LPBIN= 0
##$MAXI= 10000
##$MC2= 0
##$MEAN= 0
##$ME_mod= 0
##$MI= 0
##$NCOEF= 0
##$NC_proc= -8
##$NLEV= 6
##$NOISF1= 0
##$NOISF2= 0
##$NSP= 0
##$NTH_PI= 0
##$NZP= 0
##$OFFSET= 14.98509
##$PC= 1
##$PHC0= 94.1803
##$PHC1= 0
##$PH_mod= 1
##$PKNL= yes
##$PPARMOD= 0
##$PPDIAG= 0
##$PPIPTYP= 0
##$PPMPNUM= 2147483647
##$PPRESOL= 1
##$PSCAL= 4
##$PSIGN= 0
##$PYNMP= <proc.py>
##$REVERSE= no
##$SF= 400.02
##$SI= 32768
##$SIGF1= 0
##$SIGF2= 0
##$SINO= 400
##$SIOLD= 32768
##$SPECTYP= <>
##$SREGLST= <1H.CDCl3>
##$SSB= 0
##$STSI= 32768
##$STSR= 0
##$SW_p= 8223.68421052631
##$SYMM= 0
##$S_DEV= 0
##$TDeff= 65536
##$TDoff= 0
##$TI= <>
##$TILT= no
##$TM1= 0
##$TM2= 0
##$TOPLEV= 0
##$USERP1= <user>
##$USERP2= <user>
##$USERP3= <user>
##$USERP4= <user>
##$USERP5= <user>
##$WDW= 1
##$XDIM= 32768
##$YMAX_p= 440774413
##$YMIN_p= -675894
##$CURPLOT= <Network HP LaserJet P1505>
##$CURPRIN= <$Network HP LaserJet P1505>
##$DFORMAT= <normdp>
##$LAYOUT= <+/1D_H.xwp>
##$LFORMAT= <normlp>
##$PFORMAT= <normpl>
##$SURQMSG= 1
$$ End of Bruker specific parameters
$$ ---------------------------------
##NTUPLES= NMR SPECTRUM
##VAR_NAME=  FREQUENCY,     SPECTRUM/REAL,   SPECTRUM/IMAG
##SYMBOL=    X,             R,               I
##VAR_TYPE=  INDEPENDENT,   DEPENDENT,       DEPENDENT
##VAR_FORM=  AFFN,          ASDF,            ASDF
##VAR_DIM=   32768,         32768,           32768
##UNITS=     HZ,            ARBITRARY UNITS, ARBITRARY UNITS
##FACTOR=    0.250966925370066, 1,           1
##FIRST=     8223.43324360094, 4015,         -219464
##LAST=      0,             139872,          -113922
##MIN=       0,             -675894,         0
##MAX=       8223.43324360094, 440774413,    0
$$ Real data points
##PAGE= N=1
##DATA TABLE= (X++(R..R)), XYDATA
$$ [...]
23757 -75121 14841 -157293 54321 -117648 -179237 -121396 -74847 -89072 -307046 86646 -288716
23745 -139040 112267 101879 -58415 51076 503466 -207084 184033 11839 216223 212346 -106071
23733 -220972 212370 -98957 154541 33774 -82442 166333 -232969 -72869 -171250 57406 185539
23722 185539 63816 -133212 -332846 -332602 -141999 200436 102232 155482 127444 -56382 -255761
23711 -255761 -357740 14767 6894 -3727 36256 12925 85887 98536 -2540 -111202 -114136 -168225
23699 -168225 -43149 -257640 -154276 66626 -49508 -115529 8366 -378740 -136267 -207194 52373
23687 -46008 -229417 -62970 -193684 -98546 299999 60596 -103439 46967 -35372 -98569 315116
23675 -17173 -191019 -231156 133243 183580 11513 -108058 31929 105162 277559 -236597 -105609
23663 2765 327901 172580 -18138 113702 -252111 -12702 182459 -270761 -391498 -66709
23652 26769 -213805 236464 -426078 137379 -128198 62891 109660 -61965 -508605 28864
23641 -210204 18391 110996 -57477 4503 -6158 107750 151614 113965 136343 116997 391115
23630 391115 -51632 -299030 33509 260216 57837 -17818 39149 120115 190689 -201712 -92887
23618 -154373 134043 119146 -332714 -340211 146586 -259495 121945 -48147 18927 -79178 174842
23606 3017 -217383 130934 -453731 41193 19730 -266407 -179388 -173248 -177179 -197886 127252
23594 -128603 -3969 484166 -35053 -256749 74304 426461 52890 45618 -205488 159391 292874
23583 292874 9895 77102 -225345 178114 338084 -47487 98585 276818 59409 -36974 722
23571 79448 32299 232743 -87941 -827 -418757 145985 -121244 -299942 -224399 -185559 -169144
23560 -169144 -233777 -274038 -77485 93738 334971 12451 214439 -103847 88244 -124105 132806
23548 33345 -103201 -154814 -32807 -258693 159210 482279 -34511 -218921 343435 153476
23537 -101939 199914 -228175 143478 -139374 -227997 92965 -269875 -4644 164915 183536
23527 183536 95489 -38320 90989 126952 -266024 63208 97666 -55021 75189 106000 -340711
23515 245703 -54842 292201 -116797 58484 -182051 -353739 196284 82233 -298131 -110336
23504 139983 -106686 393760 128096 -185953 -34523 -89310 -73400 -65640 -28030 -168293 102896
23492 -242376 327786 49231 -29808 -135486 126776 -119505 14700 13222 238820 -208504
23481 -159087 44589 18186 -263310 192843 175475 -265698 -257683 -89921 -158134 -80505 -296622
23470 -296622 52496 75530 -22539 289301 -53691 -287494 -78004 -18194 62416 233649 -135657
23458 -125200 -45512 292772 29331 -2959 113176 85587 -170175 45878 46119 -75775 453482
23446 314184 163088 15442 -139081 28868 -8635 15734 313019 192409 -214602 -46822 7641
23434 160305 1497 84598 31845 119977 205712 -32236 239691 272883 -409062 6483 -101873
23422 -67548 -157127 -215800 109746 -18875 -135039 27688 -374595 -129224 -139506 217133 101015
23410 112567 38111 -17392 -6736 -253723 -20828 -96706 159653 -52576 45703 -120609 -93687
23399 -93687 133656 27961 67162 -261830 -1683 -41033 4003 60871 -115937 -130080 -456762
23388 -456762 172540 -200675 39497 -428763 -233410 5281 -414506 71990 -157637 -344257
23378 -344257 373932 97396 -28113 -44510 203446 30080 -144698 -4055 -178241 213247 -42609
23366 181040 238026 110843 -102663 -43034 -323291 -245475 54284 -276012 58034 198332
23356 198332 76743 177843 63956 -103956 355705 -89056 -201028 125006 163845 67976
23345 -257826 216958 42619 -193729 -344266 60410 -124862 103389 -339568 -173417 -67393
23334 -206075 -243836 354830 -60908 -266393 10065 -24958 -94336 -191132 -184679 -309792 -107721
23322 -107620 -357016 12114 199548 -214531 -70546 266175 -112525 -31542 57446 -190291
23311 74264 235799 187945 -242660 -388305 72150 -42175 -285335 -113116 -87621 -180499 -97344
23300 -97344 111289 -171210 147124 -165777 166819 -179517 -15584 -239827 137524 301284
23290 301284 -134156 -224540 111370 263577 -166863 42470 285494 130000 19645 250349
23280 250349 62583 99779 -194076 -149802 172284 -250353 -48475 -33653 -234769 333568
23269 71698 -117982 230154 -110629 18794 -153139 -490810 131984 -183680 -316092 202390
23258 44297 -65543 45878 9507 122662 -271998 58698 -41882 261510 -44762 -77667 253533
23246 -247562 424298 -180851 74974 117403 154528 68068 -103227 -233169 -36890 182557
23235 146727 -34963 -191426 221892 -204665 185175 -27177 -58559 24946 -148742 -6147 7615
23223 29968 -152012 106671 26512 -216488 75451 -122562 192135 2964 70882 244729 -105924
23211 152512 -251091 -27730 -129816 388439 -133088 -127047 243585 -74753 190522 634089
23201 634089 320913 -267363 -7794 -70528 -225806 281870 12865 220525 -326824 64847
23190 -92594 34794 4641 170246 98364 -69000 860 358539 -103578 -80225 120448 33527
23178 -117352 72964 -77584 -41222 14672 4937 -373643 -129101 256055 -304961 149774 -16647
23166 -73291 -319475 132315 -86348 173413 -87968 -217220 92183 -68036 77769 2216 117306
23155 117306 1000 -103181 -6252 184186 -116978 -181574 -95633 11748 3294 -33284 332003
23143 -72199 21604 -246594 107132 163544 -210371 111861 -79922 -6429 131923 -64472 -219066
23132 -219066 297680 17642 -98861 271265 -146351 2746 -154719 -67410 116476 -109465
23121 225522 262375 -24532 -235613 -42399 33185 236283 140545 103320 -36783 129032 -230966
23109 88760 20106 207889 272314 188208 84537 220875 -71537 -6682 -154260 -23205 -93411
23098 -93411 123404 161682 238282 -64929 396753 -107902 -6586 266209 -51494 -74733 -336186
23087 -336186 73666 -15805 -206016 145908 65063 -161941 -46476 241733 -94390 45383 290005
23076 290005 -74284 71910 -4077 -150360 -231583 374753 362025 -168221 75010 297721 -22433
23064 -185171 -136764 -181731 -36449 46246 -141002 -43460 45006 -187856 92267 221790 224062
23053 224062 -144398 251301 -323665 -82062 -178548 130320 -94071 69962 -85109 -10800 317043
23041 10075 161033 55347 -273000 -193760 70993 -40171 -85159 -258411 -86425 -36565 158116
23029 -158825 -138266 186215 -27833 -96327 -146830 99791 105477 -160204 -127698 -78753 105080
23017 87218 252982 -92962 121899 -41433 -252062 -203896 -32246 -128668 -113121 137296 74989
23006 74989 -179090 308462 74004 5274 -109608 324561 -27352 95422 -146784 -56428 49558
22994 -22214 -109665 -341750 -205474 8474 -2493 209814 -149204 -34330 -230367 -280954 -293936
22983 -293936 45742 -253814 245991 145121 -54683 -244551 -396575 183004 101380 30426
22972 -60886 195166 19694 83211 -7591 16620 -77439 -202800 180302 -184894 -501056 118548
22960 -183921 188056 -315766 -5675 166366 -91928 -152514 124093 -204902 -180897 306910
22949 -19693 337072 174751 -72633 89276 -111519 -174818 -161846 -300450 38804 56879 -86121
22937 268896 95679 -2826 -162671 -150273 -188050 24543 142856 -29601 -194673 -162949 42101
22925 79954 168664 106976 -170184 -102005 -129685 60599 67254 173400 930 249641 -51952 117275
22912 227679 112510 70244 49599 88344 247605 126434 -152547 -96831 -224172 31749
22901 6247 110885 129156 103086 -49338 -16006 176405 258866 -101660 -28589 -299229 86667
22889 -159778 32576 -71825 -160426 -47075 12486 62006 -209193 -2222 -324992 -152794 89148
22877 19642 -126046 35466 88416 -87080 -80364 136147 -51367 -130602 -158575 121073 240748
22866 240748 -244112 53781 -79508 91232 -51546 -115358 -62184 291608 -296144 -63481 178248
22854 49748 -194220 -335193 -80271 -192380 146034 -24823 454821 78728 100793 53183 -46382
22842 65118 274316 -1056 -147736 -123418 16755 275245 -50726 -255366 -41157 -111720 471479
22830 -237685 6202 7762 -245622 142175 -363690 161685 -311986 -272129 -47832 50424 -184844
22818 -180558 -103850 -105717 86349 253873 23451 -46952 74661 -175271 -76183 -326311 -40112
22806 -255763 -72917 -89530 4539 93825 -297064 114837 206624 -138148 214373 -208780 149198
22794 -229280 143254 -211659 86485 80687 -109029 87855 372994 -197634 -335599 85771
22783 4790 -62631 -161929 79140 301487 -170458 115335 486052 -152530 84588 41091 40464
22772 40464 58152 331696 -108182 25017 50832 -228801 -228081 126017 -105155 29563 79137
22761 79137 -312163 -127006 260915 57035 -6088 -372900 157364 -19122 -41280 -16251 32225
22749 -483661 154755 -143416 -236718 -86914 -32738 219372 -363964 -265939 -88474 -130321 -148282
22738 -148282 -124590 366222 52243 38653 -5580 -54902 242741 105066 -295 -14703 -73498
22727 -73498 -293046 -169603 1822 48595 -327257 64263 125685 -76834 -6819 201025 -113330
22715 68605 -112594 -52690 405403 -34275 -71320 23636 160298 -253756 254168 82839 -184790
22703 162041 294551 -136073 -173066 -66003 -163564 114157 78510 -5860 -319942 -308469 -268587
22692 -268587 359513 -31336 132915 -220344 -121349 202122 -361785 47258 170084 139121
22682 139121 -2769 -70526 1767 -7137 107726 -93753 -86135 163708 -23169 84776 -160328 290859
22669 186011 -98047 4799 -173670 71999 -316829 64792 256115 -10084 -89072 -60737 55179
22657 480072 -80131 -153427 91819 -105680 -34784 -224681 -24315 -484718 188687 -224531
22646 22150 -48542 87001 248208 -221306 -198696 145142 -80981 -72803 83316 -387414 -48836
22634 9593 -73607 -3206 325481 -276799 234380 -44632 -201841 305847 -81036 155582 70280
22622 -114359 -159082 -23673 -201859 -135077 -43915 -199735 -210872 -239090 51161 -225872 -231009
22611 -231009 -65904 36377 -113393 200816 -136469 208310 153136 -38854 211148 -108524
22600 -36505 -89215 -105638 -124949 343169 63636 -44274 -12599 19437 -155317 121941 -138217
22588 -148037 -234075 -208665 231624 -125259 126999 296033 -282628 -84401 -177317 -192749
22578 -192749 211506 233896 227351 -174923 -44938 -98041 187535 334061 -19973 17208 -69139
22566 40027 -5635 -170011 -181043 130573 -222819 83676 34769 48181 -88831 -265755 -73275
22554 -102695 -437985 -18075 -109135 -2281 128261 60424 -7053 71732 -22365 129788 -75313
22542 -553273 -177443 -160995 -14324 -32883 -237243 278508 278902 29185 222813 -117046 111705
22530 -19462 137559 197969 -384699 -262734 -373050 -144242 -257351 -379301 -85881 -32260
22519 146317 -238545 99691 -103306 -131347 -195491 193655 127469 105273 -159976 -10209 -146828
22508 -146828 -187958 -194663 -94235 -59747 -227572 -142627 -183920 213322 -22982 -110669 -144742
22497 -144742 -156255 -147161 111986 48814 250668 155567 95621 -275961 -138356 199097 -167564
22485 -181655 -269289 270263 -7333 -339004 128547 -135508 -173853 37594 -168672 157703
22474 80910 80324 421021 91226 -233940 16045 118487 109120 107633 -294999 -401170 -184678
22462 156406 -86104 -289762 -73860 27326 185446 165378 355359 -262915 -236619 138790
22451 141533 -247985 21246 -328768 -102681 -130287 -21897 -123612 111300 143607 -29207
22440 -248158 -193353 116476 86555 -55556 -1950 -69123 52569 -96511 120473 165182 -151402
22428 205848 181170 503750 201032 164152 -134825 -114747 -447075 -7195 -326770 8958 -175829
22416 -18240 68087 124584 -260538 66027 78959 -425737 -71433 -193550 -212325 209774 85225
22404 -169513 -213361 67194 16857 -3991 -265363 -186381 -9357 -559989 -125030 130629 -249640
22392 52469 -254515 -63192 -40154 314397 -57296 -5838 30930 -147009 110286 1421 -216235
22380 -225382 -181573 -105081 -251428 42515 -167207 -74285 -134757 15896 -53520 -110943 -67643
22369 -67643 -291278 271512 17433 -419438 298371 -66565 101182 46125 86379 239982
22359 239982 -152551 65020 -392642 -27152 -45964 413975 -66860 -24505 -295974 -6180 -187858
22348 -187858 -57675 -504082 28976 20271 -157928 -86960 199273 154392 -217276 -87756 58493
22336 -189436 2944 -261015 161252 208024 -161668 -177737 280697 12718 124247 -78488 158730
22324 -64085 -140318 -62915 -76440 -140237 124491 -301540 83499 139496 248362 75152 91152
22313 91152 -171472 91576 -186122 -102774 -113179 -217532 -28424 -66013 201499 -167369 -146154
22302 -146154 -253673 -367359 -122153 93783 -30873 126507 -3057 -278152 -223143 171116
22291 -154810 -385078 -156325 -132060 127318 -33585 -281538 90007 -497469 152573 -114732
22280 -46201 -81446 -62956 -114546 -258925 107131 -126186 -31540 202297 -155713 236277
22269 182742 114583 -132175 137107 288206 234444 252413 46782 -290553 160719 206998
22259 206998 127758 8941 127240 -80442 41308 -131814 -101777 191909 91761 173337 -107516
22247 -234163 -99571 16455 -232614 -171628 -329113 -91906 76438 254258 -283775 -35423 -380797
22236 -380797 204457 -125984 183537 232407 -131880 -18059 -26902 -42935 -52636 -118011 -263809
22225 -263809 145728 -221557 -44359 213993 193017 -23193 -204996 66159 257934 -105627
22214 -52329 -48689 253403 133351 191765 -61443 -430060 268634 -32745 18492 -75214 -382983
22203 -382983 -206301 -134406 113657 -122185 -264766 -87479 33319 -196488 -63333 -301016
22193 -301016 -53112 162373 -30785 -187048 -392481 34010 -196460 -49978 -39066 191045
22182 74288 -137980 316472 -149426 -234256 -201517 -202283 250728 -15299 -47661 -53961 -243329
22171 -243329 -181940 130377 422583 -206963 -22899 -221082 58693 36084 15078 -285838
22160 -142774 12640 -428785 -556 110734 143823 -13029 -41831 -243688 -93315 -13645 -171511
22149 -171511 -243854 36131 -139133 -175957 -38295 -404974 198407 -393198 364470 -249187
22138 -206856 163234 -220195 360943 5548 -139696 -51819 103541 -320370 -155710 59928
22127 -3306 -87216 -292744 -356774 -85186 -127043 -203908 -37326 -328280 -45983 -34246 -13238
22115 217024 105438 -276049 -56217 -64637 103706 -297697 29853 71154 -388656 99181 161552
22104 161552 520545 -67054 -33529 -154166 -45223 -75384 -198244 -178666 176926 211356 -294525
22092 -49707 20604 -113930 20656 173467 -230879 -246157 -93260 191865 52939 -245964 -169595
22081 -169595 -269877 -396572 99222 -198719 -118694 -114063 21164 254079 27094 29615 -184719
22069 -116419 -201609 24924 -134094 176243 -223722 123915 -207001 73133 -402928 -222962
22059 -222962 145147 -234029 78200 105875 -127055 12407 -155901 24469 46877 -304635
22048 -162980 135674 -18187 -325949 -107704 78305 -101319 84133 134573 -245051 12810
22037 -108500 50926 209754 179232 366467 -156860 4861 -76974 -11572 -42484 -467800 -388547
22026 -388547 -301958 -320265 -160657 -101605 112892 -62015 47310 205404 7728 -12984 -4398
22014 -90405 -107142 -61653 -103533 -32494 -86415 348141 378831 -230319 154823 -284402 -178990
22003 -178990 -273962 -219641 -376865 -91671 101069 -155576 254384 33400 -52296 -37548 -15987
21991 82211 39752 32033 -170304 173810 135761 -65342 119541 32292 143382 4164 -18667
21979 -24468 -151002 -243025 -148899 -366588 -517210 -90690 233659 -361825 137414 133419 370077
21968 370077 -253228 -84174 -423385 4957 -106401 -147257 -3835 -108620 301015 -92488 -154893
21957 -154893 81717 -59202 157048 187697 13369 -227800 318917 292442 -115826 -177976 -13017
21945 255848 -283428 313593 -461881 187412 -72073 -342966 -274522 153655 -83708 -19260
21934 -108900 -514887 142607 -150485 116226 -48904 -172364 -223197 58612 -8460 -89211 224897
21922 -184690 -307117 131786 448163 -58143 -140266 57436 -110422 238692 -76709 -6433 -42738
21911 -42738 41355 -7787 379816 126589 293083 236710 -153077 -57672 -175168 93459 -116648
21899 132247 -141391 -97148 -6057 -188287 -344816 129764 57105 -232566 -91634 -281299
21889 -281299 -32432 16088 187624 98933 -166397 -221018 51954 -35913 -87442 22514 -78830
21877 -378498 -83487 -93022 -98278 -88056 75970 -38015 -150266 179396 -49868 206677 45090
21865 187674 -233730 113137 87625 -42390 -141764 -72756 38272 289389 -125862 85639 -186514
21853 91790 74918 -17365 -124846 78702 -400644 -62102 244614 -185449 -14816 10413 118863
21842 118863 193947 -304133 565891 28794 -128705 -79196 243955 53081 -108648 56394
21831 -4343 191294 452538 -487024 12444 -123545 -7523 -131009 -104695 -136984 21613 -212597
21819 14795 -13799 478544 -139627 -101622 149932 -213237 40680 -100681 234596 -26343
21808 -426426 -121967 34219 -134249 -29536 181899 73884 -166439 136253 -231775 -35099
21797 -313969 -362563 -132724 -172027 253682 28600 -285951 235310 -105320 -82715 82434
21786 -136150 491591 70956 -92127 -58056 -117043 20374 53095 -455880 -58983 324701 75032
21774 207882 -425176 37102 -271430 -69434 -47535 119586 -201374 -130632 26852 283896
21764 283896 252975 -11082 52057 4513 -215387 274654 -353888 -93944 -63618 32697 -328088
21752 123760 -215686 -1182 238106 49801 -212960 -3579 -88027 -114099 -253684 -67507 21908
21740 -16709 -240781 219952 -117633 45756 -64288 -74672 -381209 12758 -256506 151466
21729 -218323 -74917 66196 -1177 -48936 -74763 64890 -147920 -328965 -398175 -85228 -1089
21717 -41074 -65089 -369604 -54177 -97562 -96713 -121948 -165885 -129718 -31327 -289056 -25216 -13927
21705 -13927 -114805 -147578 -72331 -114731 -222163 -185250 -63317 -57658 -135320 147147 -10058
21693 225851 255876 -460582 84139 53583 -126718 -159590 -79307 8464 -199394 41498 -277039
21681 -203658 23581 96013 -225268 -146641 -4898 8437 -163803 -220219 155773 -25863 33178
21669 216497 314346 -186947 -113779 -126915 13734 3823 -199479 -274995 97325 -37304 -117598
21658 -117598 -1393 -108139 50295 212760 267427 -43980 -294104 -402274 103843 -546 -183869
21647 -183869 -165914 -20094 76906 -74713 -97214 82375 359132 -101380 -249744 14740 -108602
21635 11749 -293186 -150185 12523 88461 28263 131768 -21494 11305 -154732 321508 24014
21623 -98858 114127 -50797 -217858 390879 52792 222397 44919 153653 -180900 -345516
21613 -345516 127168 30584 -177218 -149963 360298 122369 -313753 185749 -241241 145223
21602 -137347 -25772 -86021 -156646 61058 -63252 -96755 179666 -160254 -449548 395595 6398
21590 9439 157322 -7366 102838 9267 36125 -58281 -13958 -163249 -72463 211494 -127093
21578 -150643 125176 -202719 -340969 -20917 83170 -310972 146258 -217802 280836 -79269
21567 -27216 45832 47343 412646 -329114 -152769 -375510 -150492 -113872 -64604 122924 -177008
21555 6117 -302901 -403352 84490 182820 -165695 126063 -225836 154330 223476 -163667
21544 -115133 16848 -148032 -354503 -30598 -77156 -227850 215304 27769 69164 103146 72094
21533 72094 11445 -267728 -105663 169771 -145492 -383564 -7601 65500 -111590 -66846 10977
21521 276368 -263084 39256 -231160 95427 7535 238903 47588 65449 -143450 -248543 -6575
21509 -227029 132666 -171639 -110448 -248351 111672 -26026 50467 67553 -294455 -150406
21499 -150406 188540 24147 78530 -171043 -337179 202818 190384 36804 -258361 -47141
21488 27469 -217863 179109 -105753 -5932 180371 -115143 68237 98623 101989 107712 26265
21476 -54214 -156607 72588 -62195 140519 -138734 -60951 10325 29919 -208760 -254962 -150634
21465 -150634 -145749 -316129 -191700 151332 -117894 -241768 96459 -194962 7042 -98403 -311034
21454 -311034 -67971 175243 -126387 -107627 17924 -75959 -114800 -45186 65516 -230863 381308
21442 -423107 -133649 262093 165800 143871 -132895 -188938 147284 113489 86993 -144062
21431 -78438 217857 77648 -40763 21592 43874 -150843 16131 -271337 -102001 -8877 -192278
21420 -192278 -39847 -308679 -334597 123002 -83614 -264820 98026 -158181 -179839 323934
21409 -399094 10278 -19741 -133146 508585 -166551 -345496 -68665 -25471 -249149 170738
21398 28732 99873 -166400 -149933 -104127 72540 132220 -167795 142233 -119986 -406525 62658
21386 92615 -531874 46462 -250455 -56906 157833 -149620 7918 10145 28049 -388301 43969
21374 142168 14314 -61676 -87384 -89945 -217717 49301 4315 -111974 221339 168182 3011
21362 -275386 -91884 145168 -49513 -71093 120514 -11931 -125639 -136558 158079 48309 219093
21351 219093 294623 3302 -123590 162580 75019 -28409 19828 -148490 95118 -83976 69897
21339 96807 270779 348577 -12481 -268883 -69439 51513 -8097 -65468 -211523 -5543 28630
21327 -183061 78524 3619 49734 -425014 -262369 -633802 167441 43499 -112900 160658
21316 -35339 51356 38081 22448 -107449 -24770 107309 -35678 -26582 20319 -85879 -112832
21305 -112832 376676 -95037 -99519 -192591 -66145 342753 144222 117048 37722 -304869 129711
21293 -78103 61441 189332 -45254 -256375 -61419 -52799 -112189 -170090 -156052 137952 -223332
21281 127945 90316 -43184 -23289 993 -16479 98016 -25732 -273567 80401 192282 219175
21270 219175 -49603 182549 72622 324062 -186814 -186626 -539 -138020 52462 -37723 238694
21258 222182 -79783 278222 -43108 35102 -58575 122868 -77792 88125 341806 -17271 -46100
21247 -46100 -153216 19702 -279709 -218645 -328486 -257878 -358449 -158835 -102637 63986 -33012
21235 -99997 30604 -139803 -90337 -50093 -310933 71771 -107527 -231059 171650 -31308 -216651
21224 -216651 139302 272369 34716 19359 -365194 83956 -17180 112608 -9538 99864 193197
21213 193197 179163 -147486 274002 -192122 -147263 12141 -205116 220462 96325 -218966
21202 88862 -32644 41210 91230 99934 -53901 36645 -60906 -201211 -11136 144713 -167983
21190 -79261 -282050 -179745 224259 -69424 -165112 79071 -61008 47062 35709 -49280 -172501
21179 -172501 80610 24308 5929 -33507 -99229 114510 9057 -123370 -211235 -7731 16061 -177801
21166 -295151 53893 366561 -90186 17410 93749 178969 -19192 -245556 -43775 96200 188960
21155 188960 -119761 -202612 -108516 9674 -167511 19953 39653 29586 -160526 -100955 43074
21143 83277 -343827 -54925 -172166 -350064 -178326 -265649 -210609 -78692 -74052 -62361 7675
21131 -21628 -121355 -190431 166353 -89043 97431 -134932 95628 -200309 -112097 94738 -160558
21119 -100048 -372971 -116751 138888 128625 -105674 -122487 -326658 -65867 196516 -158833
21108 -12123 -157804 54524 -252218 -205051 -85691 -118944 110408 211427 -277007 74418 60296
21097 60296 68702 151330 10072 -256074 -116389 16829 106382 100475 -291926 -330669 199683
21085 87235 -21380 50823 -81899 76934 -186917 -195251 138098 -59338 32320 135124 11646
21073 -5523 -134801 -84490 303959 -37013 -86296 -124488 25511 -286483 -115487 -314755 -202659
21062 -202659 103725 -94918 -3488 102450 -177906 54571 -39595 -292559 -58381 194416 175216
21051 175216 409018 -23507 -182352 73497 137819 -89087 -219983 77249 -172555 9703 101846
21040 101846 -282550 262293 56525 -74584 -140753 568192 203226 18646 -34013 55193 -193452
21028 43329 -248409 -240911 222334 178670 -282395 -106427 189414 39210 85836 -137525 -159062
21017 -159062 -59186 -2437 161489 -106099 -273316 110185 243197 130115 433342 328713
21007 328713 -5311 -164617 -238936 -243105 -305328 41332 108880 150464 -29184 111892 -140224
20995 -175762 -71209 -244112 -120402 -708 -63279 -255250 -314632 -284008 -1719 80738 -169685
20983 -86309 -43706 -7804 149759 50453 -33752 255835 -268782 46343 -83496 313759 193492
20972 193492 -179732 -144511 110283 -69318 -146731 -142984 -285734 111007 -121572 116215
20961 135978 67712 -117962 -73280 90790 -46687 58248 -98604 -53503 17476 -287095 -174707
20950 -174707 129383 -23302 129455 61368 143290 47923 189680 95942 -150704 113554
20939 10815 -566293 -143265 1158 -76501 -58165 98319 99239 -54575 -116679 -38467 -268569 -138971
20927 -138971 -110106 -112095 -1676 33179 121119 -294972 282044 -520 33899 -5081 -342248 -283632
20915 -283632 69137 -36600 -7157 -3516 -5941 697 191896 -187135 -268190 77083 -4 278449 159401
20902 159401 -344779 -253620 139531 -267314 264283 -167191 -28047 -107367 -96072 296187
20891 282123 -99253 -155409 38598 33981 -192785 11217 11770 42100 42541 -56085 -329078 -91304
20878 -44907 171175 -89820 237705 10682 75686 179355 -233932 -17486 -426034 -37520 -123369
20867 -123369 206591 -140337 110149 -150316 77298 -20623 29272 11739 -125291 -56065
20856 90761 168534 -163443 -163228 94726 253419 20646 -58863 -79310 82817 -44911 -62177 -168479
20844 -168479 -202366 -224173 187150 -180941 -272623 142609 -45545 107144 -112873 155174
20833 99975 41809 111275 -62594 -170958 -248087 -86758 -212026 -281058 102014 -375984 -474784
20822 -474784 -17220 70291 -105470 -380801 -176183 -433142 -130467 -185901 157688 -111788
20811 105723 -232491 -85575 -270749 216631 -62773 99589 77961 -243414 -140383 119418
20800 202833 23719 -253096 -158869 336915 -161402 58877 -385567 -54612 -6655 95836 -188241
20788 -301838 -84601 95429 -124020 56612 -257284 -272056 -148645 -274833 7188 -361376 -82764
20776 83314 -202048 11369 -164961 -37059 -49407 -118351 -271055 -283488 -276553 -148485 146032
20764 114353 -397461 -28674 90770 -147543 -80995 -222848 -209355 87871 -178381 135187
20753 21177 57815 101409 -77273 68728 -252330 12312 145016 -60805 -274780 39180 287264
20742 287264 -157234 80445 -202216 -189948 26714 -134210 -40707 -187861 -25972 -130762
20732 -130762 -180391 250477 -53620 106563 -19724 -219816 -261720 59591 -7305 37655 -154160
20720 -242285 -114957 -105831 -126057 158771 -140126 181674 -162779 -134447 -87176 -29000 -73259
20709 -73259 167603 75109 52401 267257 -307055 36688 215540 248702 -189753 140788
20698 -266925 -163690 -47584 -169731 -311437 90981 10019 -69891 -50068 87556 -420707 -133268
20686 -333029 -273079 -86560 -356393 -289904 -43759 -226358 -23860 41872 106283 -190586 -173525
20675 -173525 110344 182166 97932 -109447 117298 54996 -170112 -23752 51566 44791 272053
20664 272053 132231 -107832 -35521 -42849 -35599 20061 17616 -70275 -139423 -240052 -15462
20652 218529 81334 -140004 -140307 24852 121470 -258166 351443 -4266 -45777 -359967 62845
20640 -322667 -505638 -155413 -11049 -270408 -164502 -58535 98190 138308 -90187 247691
20629 -42849 -242314 -101276 -167809 133739 -42846 101887 -222417 -36647 -190221 23237
20618 139223 -104368 170638 -177481 -162224 -413769 -37355 -327823 48859 79092 81781 -118963
20606 -105613 166387 -105788 -256859 -123557 110632 -393722 41965 -78906 5195 231157
20596 231157 -39844 -2634 -220724 35594 -203232 45053 107598 38649 229883 85708 -92034
20584 -160161 -79269 329534 -4956 118921 269174 -243078 -28646 11553 -72595 -21012 -221882
20573 -221882 -74421 -226234 -17353 -214845 -67339 267336 -277576 -276680 -98469 115144 -271088
20561 104566 -110446 519415 -144989 16354 -267848 -325320 -173898 556 -196567 -322755
20551 -322755 -91558 13191 -80903 -55878 -85063 126734 194404 -282920 67815 108741 390744
20540 390744 -70255 141965 -15717 -20245 -21174 -152098 -78769 -356373 -53086 59819 -99594
20528 229753 121255 146431 48063 -327134 130300 -87331 -135935 -287085 -174980 -214582
20518 -214582 164379 -225268 130346 -23294 -110327 -215388 146825 -225531 -47825 -149149
20508 -149149 188838 -42594 -211799 144670 41281 -386350 79555 -115933 -277650 -244283
20498 -244283 62547 -178564 -123803 -162423 -355736 118775 -95631 8368 71643 -274582 43860
20486 15963 123605 -116233 -124198 19727 -107138 -301165 65962 -217005 12471 -169969 49887
20474 114213 162047 -206165 -207531 210335 -108537 -138295 -199940 -126393 259264 -33294 -35186
20463 -35186 -279243 160157 -130246 -347246 68379 196838 235585 244798 -236762 -18667 50852
20451 190330 -123250 -350469 -129331 -206555 12383 -37536 18314 71709 -19160 58780 90363
20440 90363 62771 -557037 -95549 200753 -92455 -79407 -10735 217365 -88102 -123303 191812
20428 39465 22053 116557 -216340 -203541 45877 70613 -154213 -85877 -59159 -113138 84267
20416 -65876 143650 -51025 -184487 -116522 33739 -210501 -6656 -24765 -96000 -4579 127706
20404 -19150 -40655 -157923 -77694 -43580 -201731 -116612 72161 81779 -180968 91109 69541
20393 69541 179691 180852 -318891 -225089 -275457 217503 -318494 167150 -174087 -209180 46138
20381 -179035 -85821 -193178 -438328 46794 -362634 273085 71574 -186951 114787 89237
20371 89237 -75544 9959 -182202 -277782 402094 -173744 -349192 306270 -274115 49682 142965
20360 142965 -137669 214295 -136576 -136269 -100782 -141495 126759 -21336 64053 316668 -253954
20348 -81473 -20803 -397863 122850 -50337 -128530 -98516 -193997 18273 -332122 22211 -6861
20336 122235 -61584 -193537 -70666 -30329 -274953 -438730 -262979 -261901 56136 55085 153375
20325 153375 -36030 -181181 -377198 -252633 -12020 -196800 -24224 36010 17308 -245956
20314 -181848 -339657 121813 -220312 -77180 -16072 -106703 -194043 -180190 -201405 45767 -250971
20302 -120635 120595 243000 -336244 -204978 -11178 2736 -158887 -43129 -342274 180044
20291 -178389 -36450 -294638 -124499 190718 -235215 -105807 21733 101725 -118467 -124805
20281 -124805 1033 232952 -492425 -34008 382418 -91592 -375841 -71586 -115161 -310633 58026
20269 46315 110321 -261794 -329611 -161579 367811 -98839 117942 56033 170707 130828 -58651
20257 -118246 -170603 208474 24455 32282 -163691 -212759 194875 -315923 -42351 152730 228320
20246 228320 130391 14681 -48429 -527170 62452 -12720 -277229 229746 297824 -79940 63850
20234 -87150 217266 73415 -68294 243310 -1739 86087 206200 -204599 -162476 -201483 134833
20222 -7849 14602 -152882 -176943 33634 678 9172 -212737 -40974 -113785 21911 -18406 -19728
20210 -19728 -416154 -260146 21120 -27177 145994 -134856 -247357 286565 148480 25436
20199 79985 -101459 -200788 -144260 -102431 -151554 -319704 56899 -254951 -426611 -31438 70465
20187 -79181 210378 63466 -70910 190846 -52475 -3570 -162352 -205415 -212532 -18893 -120881
20176 -120881 77967 35822 270251 -336869 -30758 -135916 -118075 -39047 -279977 -9256 -323061
20165 -323061 343814 -110364 -183966 1562 -98300 -120481 355334 166315 299579 -80779 83975
20153 261297 350919 73347 148526 -66503 121110 64847 68174 282046 -209410 64254 -10808
20141 100576 -233037 -55426 267756 -200657 79944 -107339 -170400 -89637 -146334 53986 -79431
20129 -254174 28993 -70095 -449 66147 -370851 -51602 11168 -28685 -22792 -184026 120454
20117 -73715 26652 -167276 -211583 191644 -403377 80109 -140846 34217 -127576 201982
20106 -164238 -8569 -178086 39854 190823 -46759 -296144 154210 -91199 131085 -335311
20095 -143978 50126 57573 -75988 -304582 130941 12027 277619 46915 4942 113439 -168972
20083 221416 345139 169467 -487551 76506 456164 140784 -370390 -107720 137702 67756
20072 -55318 -198377 188549 -55930 114382 106639 112703 -139611 -320033 -211524 -57627 -69380
20061 -69380 -289017 -182670 158266 -117486 -105628 -5061 288529 71819 -94430 -121095 -33340
20049 54499 161702 -1570 -100534 21205 -287900 88430 -35858 -272779 -21770 188528 -195092
20037 -174198 73817 66809 306133 -442893 235638 -284452 -389155 128506 -31517 -26040 376725
20025 -284402 -92696 -237499 -39624 -276373 -189547 -497740 196641 -147904 34628 -43694
20014 17703 149453 -149788 -228906 -19018 287652 249333 109241 -84166 -15229 -167125 76240
20002 -211030 152611 67327 29596 -111423 -290985 23574 87038 406155 78724 286049
19992 286049 -241107 26238 97499 -156999 -163987 66576 -285312 -233562 380258 32068 -182544
19980 -174183 -146318 182465 -51423 -84796 -1430 -171857 -214898 11673 128842 67419 413029
19969 413029 1090 -68565 -10204 95791 36335 -145807 43796 258692 106603 105453 135569
19958 135569 205222 384025 -215 -75597 83459 328343 -138332 -324897 124171 -66973 64220
19946 -176201 -72655 42756 216877 -230790 -420202 -170008 -417072 -252804 -7571 -49264
19936 -49264 -7447 -39307 -31256 -260842 41017 -147379 -213067 -198063 246698 80222 -226103
19924 -77324 -115039 61161 -421038 -83735 106974 -258782 -249948 -6163 -66218 -308113 223810
19912 26928 228827 43014 -223172 375823 -148063 -105870 -122641 -24374 -62445 99818 133924
19901 133924 86073 -29776 -283543 -84457 -137982 -155597 -19395 -135845 -44488 -482191 -280069
19890 -280069 54881 -45211 57739 93978 -346593 -75463 -236356 113477 -599565 -63877 -187403
19879 -187403 -49949 259502 -300425 165802 76013 128245 -188304 239477 -193271 -35733
19868 24706 -49799 -59683 -109245 252405 -211135 171317 -176441 293372 -87938 -146973 -153367
19857 -153367 197760 -101155 25528 -33450 -198262 55585 52654 8028 106833 -227258 -28733
19845 -45202 18612 156883 -43868 191112 -37808 310242 -166160 -119042 -484737 -300247
19835 -300247 -102591 -105771 -151982 383788 135607 8779 132986 -310301 241417 -105195
19824 -330807 -342894 -123082 -108404 12140 -110330 72062 -42418 -156437 -169039 9221 -207292
19812 384360 7784 135869 107787 -245403 617 -196980 -136809 139630 -35991 154513 202889
19801 202889 -66274 56711 -52357 -65580 -132488 -237089 -131917 -49285 18683 -163440 51660
19789 -253064 24631 85269 110986 -343589 -44384 -68157 -8937 -54978 126027 -118472 -766
19777 -18565 7273 -63508 -313349 -33315 -92102 -4355 -420835 -416685 -79132 85007 29135 195566
19765 195566 114496 109068 67067 -209123 202727 26488 65973 -1979 85606 152129 96671
19754 96671 -171648 -51552 226182 25524 5169 85589 84173 51980 -95351 244818 -285330
19742 -231003 -308626 -192964 7801 -138586 21149 137071 118367 307705 -270032 284659
19731 -1015 55000 -433844 288724 -248572 36062 130457 -182242 -114607 29277 67348 143373
19720 143373 -12517 109265 -404390 -73172 -78281 -232975 29854 2466 59600 -88990 -178609
19709 -178609 -197857 -373504 6980 111807 269937 52479 344527 240035 -14315 -33876 1903
19697 -135142 228269 -52721 -253283 -68324 -114282 78043 21469 -36170 58855 -124540 145713
19685 106393 314922 -17735 -189978 34523 258291 -158768 336878 134012 132772 -109092
19674 -135524 -380276 -403420 -6882 -215182 180573 -73003 156454 -300680 208579 3397 -447740
19662 -47794 156079 4513 -1398 81927 -164116 -47857 -264067 -417807 -17205 -14402 4764 194401
19650 194401 -48034 -180723 -103397 82396 145544 132019 -236020 -198845 -349240 -265391 -173855
19639 -173855 -205306 67012 125041 1030 -31172 -132842 -45 172763 -280334 -150726 -139450
19628 -139450 -82721 -105528 83717 -24807 -117011 122786 -66920 37244 -145278 -141716 -74309
19617 -74309 -193138 2743 -52051 -253760 154096 -199832 -236043 -83732 109230 110380 112768
19606 112768 -369834 -36797 11173 86624 -74999 -232204 2459 64559 -39812 35256 -29323
19594 -347601 167163 -126300 -85848 -195795 -109359 17937 -14799 -249628 23691 -361490
19583 83722 48065 -297862 -136034 95236 -226312 22462 -175966 47576 -252301 54671 62404
19572 62404 -61137 -83727 -7864 -36320 50676 -49877 -35342 39664 -198935 130096 -322336
19560 -230815 -24756 103820 -19160 -3357 69492 228069 -133272 -85279 199169 -201286 -26662
19548 -66993 -283337 33659 151728 -165700 -46309 -37422 -73674 58441 -309620 -60935 47120
19536 -297401 -157515 38561 221458 52438 143961 -79258 -216684 -133357 119469 20141 76064
19525 76064 24637 -104944 115665 220775 -165912 -46481 -295752 253130 -168558 304126
19514 -174078 25336 -459427 -10704 45071 49461 -67617 89940 -179754 -208880 45646 -132554
19502 -53263 -70730 -227733 4229 -316644 10761 -374326 156516 21075 -228118 -109920 -90382
19491 -90382 -462817 -76268 -292304 -228984 -38880 -300079 41257 -98790 -345452 126159 74483
19480 74483 142089 49460 -188237 5319 -61097 77425 29366 -73760 15244 -139036 44719
19468 -231333 -73240 -131931 -48595 -101776 142501 -99050 -71553 55817 -152906 92775 -41942
19456 67420 -28347 3349 28772 -98663 -107835 -216455 11493 -115779 128982 143560 -31569
19444 -240116 -16040 144809 209319 -56847 -21465 -134683 -98094 -273268 172433 115795 79590
19433 79590 51452 248604 -109822 27107 -207463 -167072 42823 -19461 -255471 186646 96001
19422 96001 51979 49927 4071 -97663 -49354 173537 -159545 -203548 -39886 -40418 -146948 -75903
19410 -75903 -153565 -87847 -367339 -151804 -184938 -299188 69482 193745 -167255 -227700 -547
19398 -64795 -152458 -191982 101458 37103 -265160 -96736 -258335 -171368 -354474 -67622 -148116
19387 -148116 -151369 -435 -97882 77361 46244 -93956 38572 -31247 -398908 -42656 140588 -45175
19374 -353265 16325 26124 325393 231751 272018 475 -238466 -282097 -38829 -190199 58649
19362 -70299 -205567 -332322 -112944 -48880 83371 79790 -262523 106127 -275757 -89971 387314
19350 -151952 -197252 -61113 60138 -258200 -230229 -54746 243442 106827 218276 -337234
19339 -71074 79677 -91200 152034 26097 -101915 252974 -54811 -94482 -71713 -20431 -10463
19328 -10463 -77281 -50731 -160558 -76449 -161938 327010 -103585 -246385 -323394 23680 -284985
19316 -109886 -74748 33588 162776 -256646 48661 13402 -29358 -90995 -165896 -273533 60317
19304 6296 29007 -18238 -398656 -166139 -505868 -128486 -211965 -367635 112854 -29920 34803
19292 36087 -64040 -140362 -152904 -40269 -276765 -244956 354364 225027 324403 128152 -91021
19280 95839 -58340 -328387 -39035 -234315 -82119 -9334 -288708 140720 -44992 52319 -46928
19268 -103954 -114214 75441 -11792 178955 -341017 79027 -159218 -179431 28950 -165741 -132904
19257 -132904 -19133 352329 -405425 -174916 70466 -59357 -183988 147088 -185300 -121838
19247 -121838 -213752 30813 -148047 -114962 150089 67588 196513 -73080 -265118 78272 -185534
19235 83999 -222367 -83918 -223491 316987 -23226 106793 -281800 198214 2420 -63475 -244169
19224 -244169 -312044 -263450 -4781 141003 70743 -14247 30982 -11446 -208568 -141029 -176220
19213 -176220 -70702 -146741 8459 83322 -13708 -78548 -130462 44631 -169038 53828 76212
19202 76212 -222814 -153686 -65683 185967 -196335 80349 -128494 -107351 -238306 -10947 -13745
19191 -13745 -212223 11214 -226497 -216012 -67632 -69867 -179809 -20123 136930 -317466 353091
19179 -148251 -120629 -121719 -382391 9177 -520974 237163 198954 -427341 -287533 -147848 -95429
19168 -95429 -97984 -42710 -174425 -336705 86118 26897 124088 -62199 166949 -31412 -107770
19157 -107770 -11482 -244 -248460 -105115 -202573 28946 282321 -162315 -356511 81741 -49666
19145 16582 118840 188315 107157 -9029 -35814 -117749 103162 48344 -36204 128138 -116743
19133 -66368 214663 -119704 -67992 -267733 -148563 -29704 -168909 302002 4005 341398
19123 341398 -200222 52177 -12269 -47143 8011 -398172 -174841 -291121 -1996 14056 -237872
19111 33186 -83467 22880 321146 -84239 -183718 -154640 -41837 -223201 48645 -181475 90219
19099 -85775 -173548 18477 77265 -350087 -40463 -82215 249775 46314 125139 -245281 -211429
19088 -211429 -130398 -9002 43498 258770 -179245 20603 -42434 25649 -64724 52322 98535
19077 98535 61296 -43882 107818 -139782 -449011 -81229 -228331 5021 -111886 134100 -50835
19065 -71499 -135499 -121529 -70351 256046 -122439 -36106 -156087 -88017 379815 134595 -78948
19053 -59052 -137092 -67560 -172100 -181655 -77745 -247252 175604 -557741 143477 11001 -278918
19041 -329657 -162630 118368 -133292 -87106 70744 -61536 -8184 68415 168891 198451 246210
19030 246210 202218 242630 241972 -1193 380396 -103902 40889 45432 -123160 -36974 -177788
19019 -177788 108192 -148347 -266518 -279542 377832 -155926 -27607 -210406 98363 -169192
19008 -221806 -112064 -150636 182732 205915 71790 -38696 -135318 -80776 -197553 166973 -293924
18996 345855 -24542 -149840 -92919 -339806 -16329 327475 -234746 -108945 53626 60031 243469
18985 243469 -419936 -70451 -137856 -11088 -178733 64011 -227575 190668 144007 -142795
18974 36256 370363 103688 -111321 -254906 22368 -321793 -168231 176568 272816 -83964
18963 93388 -116313 231212 -63707 -191885 -214295 142940 843 -132450 -183174 -191606 -85612
18951 -318393 -27392 -227105 198141 128466 271448 -86962 -264053 -196801 -135715 -68624 7499
18939 154816 42093 -59838 213119 -87985 852 -231245 115355 170875 -51901 -353865 -25142
18927 -175265 -35219 -105167 183620 225494 -85133 -99843 252955 131512 242599 -164304
18916 -103948 -74094 -215794 5304 -140456 120262 182426 267543 129623 -99461 -77921 -211986
18905 -211986 158139 -126565 -147936 -67412 111731 200678 -135992 -62386 -116072 -81741 -282967
18894 -282967 -224933 -107462 -171222 102802 -70016 272414 -19864 186734 -24115 -121128 -116726
18883 -116726 -212301 150084 -142387 104242 -219813 104236 -321396 -88827 -245794 -318120
18873 -318120 -78393 369856 -80878 -48527 47409 184359 -156582 78647 75970 -184061 -210545
18862 -210545 246795 -9063 -335363 147981 -16472 -214140 183404 93438 -136007 -109310
18852 -109310 -27111 -155604 -265611 -148143 -17208 -121092 33823 195704 83592 -60049
18841 147487 -326445 50930 166357 84128 -350029 -159819 -342047 101556 -62266 -87015
18831 -87015 -237480 48063 -51933 -308744 79843 -185882 -311564 -314950 185770 282723 151471
18820 151471 -45877 387118 155185 -26126 -155060 164056 262535 291983 81528 -48332 190971
18808 -206814 -90638 28139 -1689 231377 -257231 -9413 214393 -243479 -66672 74977 229434
18797 229434 -607166 159947 40109 -173815 110301 -239145 -9463 -14277 104941 -171416
18786 -4777 -97669 -11046 -31512 -38709 25600 -37808 -194856 38027 -195480 -117400 -36652 20591
18773 100499 18649 369302 -295227 -58528 19492 -231807 -322060 -108495 -64883 -21037 130642
18761 193161 -44795 154899 -27163 -47268 -82164 2657 -42076 -174639 19070 -56123 126504
18749 -269360 -242693 82907 110687 -53578 -219100 100743 -340135 -118492 124907 -43894
18738 62016 -146273 -29495 -62631 -8447 -161823 -278993 112032 -299029 -164678 -209595 -40490
18726 131267 -63078 -112667 -80227 33032 119519 -12808 109328 -53092 89999 217026 299966
18715 299966 159267 80094 -120326 288650 82946 16541 41800 -96503 -74485 226308 -31773
18703 -132255 -55200 -367611 -145120 -7790 -18446 181404 150855 47491 -405277 -32972 -234423
18692 -234423 -191184 186657 -279973 104367 -107676 278498 -217262 243249 -18726 279567
18681 -143596 -118010 -36186 -191672 141911 -89404 -204148 37666 107147 -256780 -26096 37492
18669 -247853 -459626 -320671 28923 162877 -158932 -33358 -324597 -79720 -104049 -164786
18659 -164786 -105210 -517236 -257205 26999 -12444 -17092 -14954 -72310 -59975 -448635 202534
18647 -264135 -163144 -162243 -187326 -86002 -221474 -299157 -245598 -189444 -244906 -175462 2755 -269433
18634 -215767 -338620 158895 -137896 37136 -106891 19050 42001 193693 -16417 -177703
18624 -177703 -25781 220226 -242364 -197577 168952 -240903 -235725 140968 -62500 -252335
18614 -252335 104027 168348 120847 40708 159666 -116918 46392 93090 153386 -131296 28919
18602 81547 -132523 64860 179309 277214 -362929 57963 -53323 177979 -155695 -187837 75354
18590 -12721 16401 -54751 -74222 -27136 -347584 -159410 218185 -169150 -186073 -290469 79767
18578 -86888 -212698 -136821 -266072 23799 265588 -193175 -287947 110500 -164884 41950
18567 -115882 121265 100216 -314092 -86918 -80012 -94938 -98174 53560 -234647 213180 -175010
18555 -130892 -310488 -74123 -424973 114952 71924 -248694 -67330 104222 39134 14041
18544 -293734 279578 53961 52587 20251 46071 33274 -346932 -217453 -316044 143658 -190469
18532 38895 -126965 240369 -137629 53356 -66179 237283 -153473 -187404 316361 192907
18522 192907 -179874 -68197 -300888 -219161 -412773 -121273 -468015 183172 76710 195643
18512 195643 -213013 -94387 86410 -13395 -74560 21725 -1988 -108138 -35645 -22281 -68104
18501 -68104 374254 85980 22401 -159638 -255208 -112687 61534 -195981 -68582 164779 -813
18489 -158383 213489 -176402 -338772 -144081 6052 -148424 -77475 -270649 -267747 -184259 -288581
18478 -288581 34143 -232633 -94464 280094 -134104 -55845 -237946 -13548 8335 -332436 -223332
18467 -223332 -86486 -152432 206029 -94657 -12817 -215573 -3961 63087 -44752 -14770 -184417
18456 -184417 -56249 -28576 -229859 285142 233831 146774 -321001 40396 -60938 24234 98436
18445 98436 192849 194239 -188972 -343735 -144638 -57261 -180425 -35576 114945 284378 -36867
18433 -5394 295022 -65215 -59752 -227986 -106768 -296534 13693 -36891 -10880 -80574 75101
18421 -59662 144769 10754 -63774 -185362 -27287 -196888 -114905 -141187 -35465 40919 -12230
18409 345959 213217 27493 -151566 -90123 118138 -6285 -101010 -564988 15876 133448 -82978
18397 24959 -33311 410389 -127599 -509325 138659 -216570 89632 72692 -227235 -494437
18387 -494437 271751 -428416 495749 -224495 -165156 76398 -144860 -12238 -91028 -38505
18376 76633 56310 -6117 50021 -95034 110466 191906 32916 -124267 1445 157503 -82871
18364 -68179 71919 -264584 -167715 -135167 216206 -87545 155119 276652 291606 149201 101319
18353 101319 278801 181907 -431786 -183317 312836 349052 -97936 -69079 98266 133654 25586
18341 111254 321196 267056 211392 184437 57590 7762 -222440 222770 -119295 -160819 -182817
18330 -182817 193243 -166933 52018 344648 -101811 -360298 279521 136368 -120173 325597
18319 -46087 -16331 138934 11694 82010 -259127 68883 236136 58037 -141199 -289303 -223586
18308 -223586 -16628 175350 -110552 -64955 -113815 -128202 319808 135126 -27296 -57787 -250986
18297 -250986 86497 -38495 -387895 8576 -380752 36735 236594 -589217 -154027 204257
18286 -367330 -190242 -47031 290035 46407 66883 -205088 13368 89629 -39131 159323 -168623
18274 59794 87667 -12627 15923 -131262 11248 132326 -90451 -458829 -115527 106556 -389077
18262 79954 179577 -173884 67823 121189 -74399 -187344 -90139 -127525 -113938 -78278 -155245
18251 -155245 -155818 5650 -434036 -379925 -225644 -298208 75070 218362 -410352 60155 -245491
18239 -214508 -33840 104138 74242 97046 -238086 61971 121778 -366343 -71057 157322 -149491
18227 -158269 -257099 219906 56441 135646 37160 8623 -247764 7607 95494 -15455 -315156
18216 -315156 281560 -182000 -205991 -123237 -50530 -396199 81848 -54397 42337 -13507 -117331
18205 -117331 66901 -38875 -393685 -73207 206062 -246829 164927 -347992 86444 -91180
18194 407385 -199333 175241 204748 20960 -178325 -484661 77949 -320512 61076 -333329
18183 -263641 3174 -39591 -81533 -95429 -155769 36705 243366 414237 416273 32286 -259150
18171 -137362 11126 -205480 205553 48740 128809 -372814 94192 -51152 77076 -118803 165006
18159 -32299 -192370 -74605 -258109 16869 -7374 40784 -40231 -9768 -278001 -120829 -119018
18148 -119018 -132561 -42443 -24087 46142 81350 22752 -6902 32990 62305 166230 -137325
18136 73461 201258 245469 -486699 288829 191022 -256671 -198264 -6770 3413 21388 93981
18125 93981 -29340 -74447 -74775 -199399 130184 -63660 -331825 119125 70023 -26708 87334
18113 -273007 110668 247922 173099 91889 -84673 -168803 202411 -152142 173145 75826
18102 21248 421673 150662 -60393 -119866 -156578 -159816 414477 29827 -155176 99394 -280050
18090 -124602 -43121 203710 -6812 -67069 96732 289582 -85728 181878 139269 201043 57397
18078 27875 25645 359783 202523 -203582 -41242 -108246 -52769 27021 97975 1824 116323
18067 116323 -191185 -222520 -62948 -175713 -70533 -64421 45122 47422 48717 59493 261058
18056 261058 16258 106494 185178 -19483 104456 -209135 126432 171265 -32658 -41462 -137919
18045 -137919 136628 38768 280739 208249 -108204 -175718 13414 -271387 93646 -167187
18034 -200234 118997 396217 -11761 -42894 346658 -159798 131624 -46650 -220072 -53343
18023 -186703 -117102 -150815 8339 -61582 280103 319752 -80272 287515 328716 -32464 -115545
18012 -115545 120922 138456 283131 76554 -3547 65561 -1235 249319 -329659 -177633 -102329
18001 -102329 5597 -66138 108972 -147483 -33276 17680 167486 171819 -52244 -72183 28061
17989 -41426 -16219 -42154 42731 82286 129786 -172458 -115353 22850 -119978 -231121 -136960
17978 -136960 -58774 -52008 -179309 236820 -129146 -192213 69373 290209 -69508 -90861 -289438
17967 -289438 26944 119435 -165516 -188534 -99116 93502 -381633 -231888 -87527 -8844 22355
17955 213474 -48693 49237 224802 -116348 -107473 157243 159617 462047 83561 -36734 282524
17943 -157439 -125639 -7254 -462057 239298 296636 -314758 -49449 68747 348177 -81335 -80324
17932 -80324 73638 227874 -180168 -10406 -130373 112106 109570 194169 237434 177526 -246211
17920 -155287 -200634 -105472 -79790 117493 32679 173511 241559 260200 22454 -52529 209023
17908 271233 369753 -35072 -37290 130543 -71627 -137861 196628 -210542 -134152 -230670 -48820
17896 179731 56300 -256003 32156 -141733 -5820 91307 -151722 -50621 -66924 113772 -220757
17884 -178877 243245 -286675 -475895 322644 -149404 -75336 345638 -84643 -282150 132346
17873 286963 58807 -167517 -311954 79520 163934 45390 -21198 112128 -13230 -138728 116433
17861 167094 -91892 -239969 40813 81728 -232219 309923 9952 104096 -244457 311929 -20528
17849 -107191 121707 77408 -30148 5422 274527 37904 -69502 48193 -6299 167087 142227
17838 142227 -226718 180479 61062 306835 -5112 25657 -51418 262965 -48373 110394 256805
17827 256805 -176498 54465 -96725 388651 78865 15426 58774 -241692 -33716 85269 177601
17816 177601 120356 111463 -55965 144075 -167315 238665 197504 5834 -267193 -109379 -10421
17804 -33791 255749 -37062 -153073 141073 -202075 485211 -169557 24744 -107825 -29264
17793 -173071 -214049 355886 287595 368704 60714 178855 -78890 212701 -198827 -64615 -172634
17782 -172634 207586 195966 288767 90021 -21588 -20521 177899 -59516 119689 -79393 -167262
17771 -167262 93972 -189066 114890 145564 -216124 -226077 -170925 -159946 -5604 8452 333890
17760 333890 138978 -3142 -137403 275072 -70872 80389 129623 132667 -254614 38758 215925
17749 215925 21976 26904 -17023 -17152 -233585 277289 193474 -345175 -154317 267951 1747
17737 -64026 123639 -51382 145500 -17009 -149483 62114 39340 -74563 -142946 -261 135192
17725 67693 94089 -112488 -136866 40039 243642 165620 -146070 266680 1763 -377506 94548
17713 -167737 107248 190078 156446 -22123 284697 -181509 302985 -141473 136187 -65981
17702 192456 52382 202450 337455 -13904 -255118 170511 -111924 -163253 -133997 1728 123167
17691 123167 403850 187190 59285 231021 17549 105935 330765 177474 -246786 93500
17680 362725 186358 -239988 375882 -27883 190541 -110385 297929 139957 264731 168243
17670 168243 -5273 -16969 -168843 127660 24753 284406 158868 85410 148322 358171 135563
17658 70289 177392 256604 -171189 -115002 -110378 23276 180622 86601 8808 84909 -116017
17646 119876 128634 43235 172994 217177 281297 117640 -134848 -199310 -27299 13970 100421
17635 100421 17327 400590 -136190 55764 -37805 235367 14402 -60087 174667 44955 -5977
17623 341884 76778 407070 -104275 189072 200547 91856 242307 385165 -159855 -13355
17612 32559 43977 -53744 428111 -73853 176927 201207 200964 -46753 434991 282936 313660
17601 313660 216339 350578 414423 186246 231421 -42488 -10677 177899 157805 248080 13999
17589 64158 210235 323792 108575 185001 288551 112850 91635 247550 272519 410385
17579 410385 368273 -31940 32045 -137480 193530 8491 -299488 32528 337791 206989 -195498
17567 52426 66247 329986 355897 318188 2747 54371 168952 -21213 -153592 -44802 55318
17555 -65600 193417 120276 262211 193097 211668 302719 364730 70355 33495 -64370 192859
17543 306931 364879 42815 161613 21051 113707 -29621 429700 90103 51271 78058 -44293
17531 131371 74970 194372 246814 279925 498417 -41677 497065 799376 878638 724699
17521 724699 577972 674507 311985 103766 313018 -31469 111748 23119 140813 392031
17511 392031 18590 555806 91941 727410 752567 949601 680798 565775 590133 83790
17500 159571 181722 395021 355700 282704 -77616 288596 -26964 300594 -186626 332545
17489 84887 178717 -222525 31504 -77238 -65522 523693 380248 269408 109332 354957
17479 354957 89761 17963 421005 -50895 551333 103990 213902 322378 -20691 -31301
17469 -31301 335830 207102 -54997 84145 42792 136209 215648 310089 26053 225705 179234
17458 179234 217599 233232 307404 -15772 392928 203266 299730 585521 103533 74828 257412
17447 257412 534054 205279 427775 -111112 20522 125458 209645 389683 255387 440493
17437 440493 445620 240983 50220 536149 169723 128994 313113 247186 277078 330009 182608
17426 182608 200796 11203 -267862 24292 32816 541787 270813 277209 209095 490912 232249
17414 127436 89712 -13095 44677 300949 118155 161875 -15507 3540 448594 3928 387265
17403 387265 41406 50174 125996 104686 97724 304619 184389 345334 280341 196087 102012
17392 102012 371279 175031 95547 220103 458870 189443 1003 -927 294100 23093 205195
17381 205195 117485 248202 299836 462499 126133 466675 493846 289713 30837 169780
17371 169780 211791 249642 -29942 348721 88158 422564 207651 310743 -24212 498032
17360 250038 30620 279556 261281 391067 197019 -33397 206452 -63686 268367 486025
17350 486025 584969 57220 193669 235849 162151 104972 577966 -100703 337141 150658
17339 329961 142483 96159 -33698 27596 122507 224500 151942 1215 77872 201227 -129533
17327 435970 633177 325780 452401 10746 231840 200118 470592 -125443 149639 46221
17316 237307 287097 205769 353138 106819 205881 -91187 358617 398181 27355 240349 380911
17305 380911 243619 -13607 264971 504812 -32285 264692 466984 61870 317273 173804
17295 173804 109284 167118 290174 254435 -173982 404984 462180 276228 19495 483714
17285 483714 60317 526681 366909 269493 330894 344176 558476 108337 161150 240445 18635
17273 234528 266240 135547 67197 295313 290351 299405 159165 103154 217720 95821 283383
17262 283383 651238 497799 190623 326621 128636 357040 361775 -104770 85221 243263
17252 243263 310658 404282 -3523 64193 271157 250264 396670 419583 574829 218936 175483
17241 175483 74105 417460 17881 392890 354101 327515 294725 278138 301320 -11278 395055
17229 391455 294786 83960 456409 52066 284191 328376 206955 455363 -11389 461076
17218 340147 371215 225117 7137 542479 222247 345864 318391 320403 234025 30231 674293
17207 674293 245155 740918 288217 74766 465361 93890 364399 346627 525283 357533
17197 357533 418291 93490 564001 747789 310726 229724 399658 144990 443195 96276
17186 353191 369589 296481 443403 521127 492801 237237 540086 273296 213240 440704
17176 440704 358399 552296 155486 536813 583257 323089 363915 349847 359653 355941 438055
17165 438055 443530 551143 520686 407994 450206 504170 370310 384990 738816 276828 318599
17154 318599 308345 256508 457562 336037 491910 482480 477910 612518 461725 507874 110611
17142 582540 210013 330682 107603 626652 502019 505440 462695 684156 335425 492897
17132 492897 375161 320989 522320 287743 402263 470327 379580 208569 300065 131528
17121 294869 304404 562528 443334 716784 538368 757058 397432 431764 333783 610504
17111 610504 518584 642564 266816 394129 613369 502562 529298 490622 465151 618249
17101 618249 545243 114000 583585 468651 450360 482219 507850 850076 634242 853337
17091 853337 647439 778193 443444 946575 894939 645874 590144 778857 586205 418642
17081 418642 428852 306408 808109 458439 278306 716954 470441 785125 568962 308448
17071 308448 432190 555436 428639 633035 412946 623510 763090 704796 754393 503214
17061 503214 920141 1108368 542345 752764 751155 745152 822097 882786 695580 845920 578321
17050 578321 802750 867291 607476 754345 828523 630223 564386 526441 903396 1111612
17040 1111612 770061 713705 806834 1089038 787988 974493 482228 559891 805911 1076895
17030 1076895 1128739 688932 803503 1100852 972843 734040 783175 931905 1037205 858611
17020 858611 644259 1122830 981366 984248 745435 1033356 1076865 695287 1096355 1297357
17010 1297357 899277 1040120 1000837 1173947 1301927 1146329 1060616 1109628 1133242 1168509
17000 1168509 1191709 989979 1333310 1462065 923998 1077662 1134268 1115352 985595 1316332
16990 1316332 1021515 1021034 1427903 1444376 1205596 909305 1670131 1155875 1302416 1438745
16980 1438745 1138049 1445016 1311234 1330002 1122346 1376452 1842822 1483112 1437169 1585725
16970 1585725 1573325 1550857 1411114 1740422 1661930 1400431 1581143 1414234 1452978 1579288
16960 1579288 1618814 1665886 1930787 1287521 1694577 1663213 1433934 1817923 1943875 1556265
16950 1556265 1684970 1519023 1459995 1678407 1754315 2022098 1704999 1818752 1911738 1782974
16940 1782974 2151156 2122416 1986564 2199831 1906936 1975680 2371196 1790646 1929185 2069682
16930 2069682 1894271 1880054 2342039 2100985 2080300 2160838 2102336 2534318 2396312 2600945
16920 2600945 2481887 2552176 2530417 2437997 2554338 2619625 2612579 2244652 2541619 2381787
16910 2381787 2571658 2759146 2707207 2661457 2726057 3032537 2687150 2995729 2967051 2973071
16900 2973071 2918072 2929039 2958502 3187907 3405978 3198925 3418453 3388184 3406120 3523796
16890 3523796 3433834 3856454 3549376 3408104 3798101 3557868 3653301 3731330 3891061 3897003
16880 3897003 3876163 3922361 3932167 4273870 4292220 4146577 4297860 4709715 4569784 4604260
16870 4604260 4384969 4943542 4617043 4946613 5087790 4814800 5077609 5257214 5413257
16861 5413257 5618029 5424463 5452847 5378631 5866680 5899089 6150722 5955545 6057988 6291529
16851 6291529 6468832 6700404 6546591 6476267 6732680 6535193 6896920 7033086 7230968 7133883
16841 7133883 7612327 7789626 8043686 7997604 8387297 8115054 8370576 8721839 8793966 9095438
16831 9095438 9295324 9593905 9685596 9807568 10100667 10008285 10027691 10565263 10904927 11249903
16821 11249903 11484944 11323566 12087746 11759166 12437449 12675389 12989657 13152142 13677370
16812 13677370 14018103 14240007 14813410 15022025 15353496 15687823 15745489 16804058 17041992
16803 17041992 17140988 17901647 18374838 18763389 19224120 19771504 20804928 20881845 21742992
16794 21742992 22432459 22727098 23014781 24023637 24430952 25489062 26371211 26985904 27648716
16785 27648716 28574187 29332852 30142356 31222389 32022411 32933537 33831365 35114737 36045113
16776 36045113 37234336 38579729 39796818 41393347 42270098 43581980 44948491 46317726
16768 46317726 48071753 49428995 50933983 52596009 54376419 55839682 57383588 59429626
16760 59429626 61295150 62804747 64732959 66926131 68794316 70449641 72400289 74247328
16752 74247328 76463825 78176277 80352286 81892250 84004232 85456450 86696509 88791142
16744 88791142 90149756 91923083 92838175 94083020 95123168 95902645 96462716 97163252 97273163
16735 97273163 97644622 97655772 97443392 96992731 96665525 95949125 95332272 94134610 92982815
16726 92982815 91609005 90814156 88828169 87476990 86027152 84154164 82779339 80864020
16718 80864020 79133656 77319775 75088518 73434529 71633890 69810253 68132926 66197208
16710 66197208 64572175 62136715 60428864 59158596 57324689 55841477 53963459 52531998
16702 52531998 51066120 49860659 48010603 46818465 45443556 44391897 42616067 41771941
16694 41771941 40651879 39660369 38177422 37328260 36564685 35305245 34620701 33437273 32406686
16685 32406686 31822522 30918395 30137925 29354322 28743349 27628691 27265505 26336757 25967158
16676 25967158 25091592 24530405 24230745 23416689 22614678 22467795 21633575 21602200 21101162
16667 21101162 20140530 20205492 19257187 18855785 18953919 18352278 18069270 17950879 17124389 16709289
16657 16709289 16350933 16129902 15779755 15311283 15065007 14960936 14508921 14604948 14070061
16648 14070061 13922708 13401343 13304222 13336875 12719466 12751611 12198265 11983887 11687352 11749007
16638 11749007 11552930 11304338 11159695 10865279 10782486 10553212 10443378 10608819 10110693
16629 10110693 9906900 10008300 9760114 9456001 9184644 8916087 9443609 8993947 8891916
16620 8891916 8887898 8569442 8425920 8238330 8387255 7824361 8134201 7785684 7466905 7615285
16610 7615285 7674683 7544488 7525980 7356130 7151448 6858879 7142171 6886371 6895715 6561375
16600 6561375 6827644 6607617 6502480 6323557 6225036 6206291 6105425 6414343 5940091 5980959
16590 5980959 5965666 6031653 5612993 5754893 5885908 5486136 5000059 5594923 5467913 5244360
16580 5244360 5478903 5090913 5037725 4687233 5003300 4938281 4885874 4866888 4965886 4699133
16570 4699133 4757427 4978997 4679158 4838670 4681557 4544622 4582591 4418404 4425239 4527734
16560 4527734 4563092 4382991 3984760 4533113 4160332 4219348 4007040 4171616 4075517 3991269
16550 3991269 4104315 3907026 3778572 3856578 4084687 4075717 3838913 3691355 3902535 3627112
16540 3627112 3479065 3740816 3757459 3760656 3318070 3303675 3627760 3498043 3574747 3539669
16530 3539669 3288110 3505799 3216774 3192471 3328481 3434061 3426880 3237223 3203684 3163701
16520 3163701 3277981 3376748 3061072 3213954 2964569 3594346 3358545 3291166 3321143 3442269
16510 3442269 3107168 2869057 2939596 3002365 3128553 3004030 2945799 3250056 2926128 2891026
16500 2891026 2896781 3026221 2942875 2744871 2729090 2901875 2713302 2449485 2845475 2464068
16490 2464068 2894876 2628160 2747235 2820202 2656933 2883067 2670843 2810580 2882652 2602625
16480 2602625 2631002 2580580 2555171 2470636 2257448 2623131 2544169 2467370 2339748 2744632
16470 2744632 2504646 2682156 2223566 2434225 2298065 2465107 2254361 2414073 2361503 2242887
16460 2242887 2261268 3017613 2424014 2175503 2414332 2314250 2347023 2221018 2167748 1936775
16450 1936775 2084108 2595431 2117478 2459198 2213304 2275682 2202560 2123188 2127993 1797510
16440 1797510 2223633 2146389 2064123 2202614 2074229 1881350 2523589 2330790 2278673 2467562
16430 2467562 2324893 2289157 2231387 2033336 2367983 2431207 2275017 2256410 2128941 2086900
16420 2086900 1961064 2092773 2092814 2105079 2214221 2309768 2285623 1917719 1934297 2049428 1902825
16409 1902825 2052253 2108038 2211042 2029998 2162622 1717565 1963967 1891403 1942925 1872119
16399 1872119 1666741 1767347 1841122 2132543 1968099 1838488 1775757 1965203 1926763 1904061
16389 1904061 1984400 1966377 2139140 1901342 1786875 1989449 1768040 1581371 1847784 1965435
16379 1965435 1956363 1952609 1937819 1753502 2067660 1679489 1920468 1839333 1654272 2069932
16369 2069932 1944668 1616817 1665544 2067695 2024930 1842307 1973999 1754986 1806931 2029159
16359 2029159 1650486 1834857 2067044 1762090 1860862 1903939 1781199 1712998 1811490 1695426
16349 1695426 1712502 1859486 1732930 1731319 1537990 1877365 1831851 1758734 1431573 1530630
16339 1530630 1702707 1671576 1853232 1696755 1643682 1616999 1508363 1806201 1582935 1721864
16329 1721864 1649872 1854255 1783625 1681684 1827065 1832534 1732027 2045278 1627693 1633019
16319 1633019 1721052 1622905 1581938 1462202 1769540 1464467 1736597 1481127 1711113 1732003
16309 1732003 1776377 1625765 1639661 1824788 1629050 1673109 1876601 1923741 1473881 1577638
16299 1577638 1263451 1632987 1670980 1664906 1322948 1538541 1585199 1918463 1311313 1299614
16289 1299614 1449511 1593831 1508042 1482641 1369170 1891317 1765317 1345743 1519960 1601150
16279 1601150 1551635 1376695 1209081 1552545 1443686 1415515 1171663 887433 1404208 1624218
16269 1624218 1438364 1572327 1009781 1307492 1704978 1676060 1346687 1298693 1315935 1097678
16259 1097678 1299317 1291642 1294584 1373164 1246214 1181718 989404 1669597 1385275 1316887 1300915
16248 1300915 1229509 1103818 1297180 1201723 1667726 1006024 1277112 1305474 1010235 1216965
16238 1216965 1176609 1304322 967429 1088158 1148090 1139020 976595 871864 1379366 1326630
16228 1326630 1458313 1132101 999451 1197412 1049421 1051218 921395 1032245 1033311 1315643
16218 1315643 1141800 1147463 707088 868858 821615 998599 1182537 988870 1086205 998279
16208 998279 1241537 826487 871961 1040279 921350 989944 1143056 1016587 1104805 943895
16198 943895 968418 1106045 805278 942772 799537 1022999 892185 1026754 1056501 1005288
16188 1005288 906547 754980 1072223 983214 948157 886195 1162558 780779 1136591 1018858
16178 1018858 806720 1015056 854013 698429 640076 726836 897169 800043 726975 761407
16168 761407 905961 905571 977474 867980 948055 378736 735271 403231 927710 831419 714945
16157 714945 646334 1000276 1117234 714230 428035 730788 546355 618841 477678 574006
16147 574006 848363 674944 622266 867554 737805 680382 936701 571678 915288 773700
16137 773700 631977 657091 676993 433705 696384 551792 719937 470768 592955 241074
16126 1009152 317415 628766 513368 688423 597844 351262 786517 518328 575077 623159
16116 623159 509807 542691 421975 480427 353515 418341 483274 545885 543497 212827 694722
16105 694722 779223 306956 533910 278361 73625 506584 315085 653864 294959 224441
16095 224441 585778 600848 247819 408150 149018 93486 654292 460686 602751 660168
16085 660168 505223 618727 440826 405196 318783 444852 305576 389785 426011 462166
16075 462166 181011 296798 -7702 496161 518232 -72496 312573 222560 311027 546705 263066
16063 -137075 638054 320776 326137 272804 111170 200568 357706 420711 735631 440851
16053 440851 421167 317535 445126 242471 -52640 318356 407915 134019 -43848 129972
16042 247142 366982 328425 201092 503867 148302 446029 219311 -88397 200776 408477
16032 408477 -7110 290776 157230 92631 -98460 91726 91457 748231 510972 469444 307531
16021 307531 509397 4379 250871 147838 404974 271604 161928 365983 137093 258880
16011 258880 318159 320036 317566 69819 281025 112648 692176 21750 254736 68610 523908
16000 523908 224587 131869 83698 -72029 21419 162636 314190 106498 668515 287140
15989 484552 433329 953606 793624 1085729 882583 974615 782963 58706 286359 597737
15979 597737 -14593 240116 210346 88792 -1327 -51067 124611 -134920 398611 43401 220548
15968 220548 192356 144825 304629 29567 468682 137989 127095 194356 -284315 -132974
15957 89549 281461 266771 235394 -86447 36965 361953 -108807 305439 -7335 183127 156140
15946 156140 343712 5604 220336 -181574 210369 -143157 -141642 6903 17381 247003 -20133
15934 -51514 -136281 101926 333813 223229 -64687 76307 -104037 299266 123468 165386
15924 165386 171172 171154 -339223 186321 153608 105570 219632 132581 25707 -39201 191146
15912 -90350 -227224 -50339 99702 74623 8097 103841 66266 -123083 190314 57952 241162
15901 241162 127781 256435 102256 92091 193005 45393 -172274 -102592 -57792 130098
15890 30414 -198589 240465 -230113 268620 194951 -85517 -123291 -110527 -144041 409523 -105741
15878 -77291 -139449 -64561 90442 10962 -6960 -232404 -48940 186891 -84803 66732 161020
15867 161020 -147091 190564 -222637 65701 -231275 -84176 -137257 -149388 162588 60133
15856 60151 63795 -49838 151553 -316110 151693 -144921 55669 139270 70961 213273 -40663
15844 -80942 7030 -11857 222396 -32460 442942 45262 321488 -39861 35596 -164853 -41217
15832 -123471 358573 -35633 35997 -197102 234558 99205 -184083 177861 -387785 -311517
15822 -311517 172489 195357 -35400 61545 131398 95412 -377270 -64787 150697 -234681 -12823
15810 -86243 -7144 -69328 -253300 70537 -14764 70963 124976 18584 6576 -150279 45472 92476
15798 92476 -103070 -23798 -29956 -22481 -231987 215101 87600 -38727 86457 125964 -209377
15786 62253 -50518 -225508 -3024 -491320 -10876 131886 -37631 -25186 482377 14988 21886
15775 21886 259978 140875 -68538 -216857 -128357 -79715 -3733 -100130 116324 39806 329926
15764 329926 319145 -3418 -219878 78698 50009 -159621 99007 301322 -108705 -33999 -26464
15753 -26464 252568 294095 -14755 150137 43906 18142 275301 231443 148665 383972 62103
15741 -16186 -303939 -156191 -26239 127827 -4088 -235468 -337557 -255720 -7897 -237267 -57604
15729 -128536 205261 -43549 -157639 -20465 -33793 -63976 -133174 -215878 4383 40858 72075
15718 72075 -9041 -39397 42471 290930 83394 301205 -315487 157676 28214 -147905 -281658
15707 -281658 -111976 125917 107021 -15709 -84454 22511 -276136 12532 -4698 195617 -22781
15695 -3242 427931 3843 -99924 -179182 -221453 236851 -35839 -75666 -56815 -92416 83019 -151830
15682 117192 -195359 -229367 244960 -73284 123952 -244940 17655 -510 -185600 -78080 46951
15670 -29110 -110384 410444 -130913 -270883 -148642 5315 -246657 182501 83338 143167 -84131
15658 636 -84901 90224 -376801 86615 109598 141137 122984 -35276 -51934 -71536 -142634 313173
15645 181883 -5629 65113 -213550 139969 -55082 -112636 -103737 100155 221259 -120352 165149
15633 -15875 41161 -260858 -181908 42791 359398 -105255 -55999 92962 22188 97628 -172350
15621 158012 8399 94397 -105963 8401 339628 82779 -155718 81261 -307050 -167450 -289071
15610 -289071 133494 -103780 29370 -35252 -155584 -70110 -30619 -97330 -110280 52780 -398242
15598 109054 128366 154458 270746 60444 202158 -329725 -42606 142659 266828 -150876
15587 30775 51812 -58586 -99148 154059 70492 122 -197425 -24049 -22613 -54046 -65368 206525
15574 112205 130170 -336293 -101727 276119 76123 -401365 288145 28788 -508860 -125565
15563 88024 128755 112736 22948 400977 31550 -70174 -156843 70329 109296 -197059 -108089
15552 -108089 219931 -172263 162799 -187178 343107 66121 29135 32204 -68007 184443
15541 -25399 115607 50843 30875 265467 -138762 53054 39611 240027 125928 -284050
15530 25502 54207 233608 224633 -69406 63835 -11461 -20072 193108 92253 245798 153589
15519 153589 -65271 -183456 -33398 118272 224681 94717 -224131 2448 -112683 110153
15508 -89813 205843 -16821 208738 -190380 -77739 -30053 -180179 -85600 130486 72961 -35167
15496 -19620 -159428 -23600 155403 402687 -258501 -253338 -102741 -208878 -59286 -96825 -38552
15484 -87583 -9417 -10184 -378360 -316003 162386 206388 119447 279202 -45078 577501 -110579
15472 483864 297710 199265 -72168 336561 119367 -155018 -49031 101911 76018 -368171
15461 135096 -174082 -20354 -407225 190670 -60929 92137 -95155 30227 -189783 121081
15450 -69816 322193 -94676 270722 84746 95728 341740 551082 517603 472236 403297 293972
15439 293972 119647 51125 -30606 225456 120288 230818 -136214 46932 -172754 56192
15428 63941 -122334 140081 164686 223224 -133428 19280 -196822 323596 -18178 -175899
15418 -175899 111425 355993 49318 105923 -162803 -239710 4413 421617 -55182 -226160 99641
15406 -60840 31050 61598 -96006 20158 278942 -18646 70650 -50497 -98859 92768 -60781
15394 -108325 -104602 197200 -28781 20560 -96044 143080 -209620 -211495 -184530 56857 166600
15383 166600 73006 101499 -162890 246727 -145944 257309 -72622 27603 38562 193056
15373 193056 -7190 -10130 303973 196545 81321 207086 58928 -64793 9622 -361469 70889
15361 166334 -413785 99008 155130 360898 -59 120497 123852 -216008 113833 208588 151261
15350 151261 -142364 19403 -22221 188952 303565 193141 236982 162173 146436 305720
15340 305720 404743 269526 332229 81760 114682 214820 10079 22829 50580 1704 79163
15329 79163 111638 41690 138327 33837 -63358 258976 69815 56639 136826 147533 152202 51830
15316 -59907 -102999 264071 -26915 96564 -121851 287741 154173 418439 230688 442317
15306 442317 66489 339197 -110231 106012 256334 71800 282110 17860 137292 -4265
15295 172412 16084 71325 59914 -47288 21669 -261613 -51671 -153245 316344 238875 26516
15283 141550 -282791 160977 317991 -54156 -75763 -46969 -163055 -157625 80994 -70026 43743
15271 288641 -3791 11222 -179634 20881 25348 239854 253677 160168 -179061 218873 7811
15259 31897 14931 -29929 -113505 -256140 -111216 -162496 -225816 210781 250051 149780 -42745
15247 208117 173090 -60809 99092 252557 16208 135163 135570 95548 191080 -55786 356027
15235 70731 -35312 30489 80793 -72171 123824 -43437 481550 14184 75472 411745 137879
15223 -76079 -12038 132387 375208 1194 327053 -84521 154050 158337 303515 -26065 491722
15211 123588 173075 465579 -33991 258384 165512 -210375 -216090 -18692 -177732 -57171 134743
15199 59875 74629 125200 267600 -45563 330354 296424 128765 663 368017 -39799 30432
15187 421292 224790 72429 -73947 69895 -95381 123135 -58901 -41652 -148598 -55409 -165028
15176 -165028 79519 -75215 -171634 -351777 234967 100466 -144981 -175441 -66639 244119
15165 -9955 -14234 117666 -203676 494452 115156 -893 -19366 63594 -197411 23812 278270
15154 278270 -50886 57255 -29541 155587 254732 -72010 22762 30626 44430 -117018 420233
15142 -158240 -36676 -65794 -119416 -120078 -91087 34118 -39333 125402 -51187 259524 456943
15131 456943 148404 183805 156535 21389 147981 100395 276692 -173688 -212483 268582
15120 -118066 137039 338736 213336 97506 325455 583670 -168872 4054 197985 104609
15110 104609 50814 265229 100457 109734 20074 94066 270314 184590 -134928 -90530 120736
15098 89894 158295 -34920 -78622 229062 -47128 247381 -79379 536119 -123095 224100 339139
15087 339139 -10551 242891 113203 -30860 419623 206649 -316745 172786 -3021 222614
15076 103502 208669 239398 11367 120530 218970 154933 -58548 37869 38398 306786 126741
15064 211990 108799 97448 143589 -37093 137487 190146 192712 -107190 98363 251194 171923
15053 171923 138756 -12563 7603 -92826 83908 111172 336590 156161 105365 103813 153640
15042 153640 225699 411376 351203 13011 262007 259295 263241 188317 -24387 55203 -36916
15030 424096 354160 264126 17876 603745 174846 453967 310214 472339 346929 288719
15020 288719 179849 361146 373035 202045 508642 220982 408621 313818 437135 350545
15010 350545 407199 362523 411923 461700 428071 489135 519506 212458 161996 471366 318643
14999 318643 168171 298691 430343 271141 134239 516223 138167 423543 221359 229450
14989 229450 239361 462464 138908 540868 577397 383532 392664 247442 308327 415500 442751
14978 442751 478530 405843 423595 552793 215908 510897 377284 360942 248250 317570
14968 317570 324424 86485 318918 524852 402206 651683 68467 608770 196211 417728
14958 417728 304192 -32749 383530 350664 415855 105443 347114 383283 303864 365621 364786
14947 364786 -73401 336229 331913 647541 665038 394977 335119 337677 198653 254310 333230
14936 333230 209433 149471 727847 562057 478497 782757 702198 823278 727290 878384
14926 878384 706701 1040964 941669 874196 940491 676774 1254404 1440623 1430472 1171902
14916 1171902 1274388 1363864 1130889 739289 902418 679750 261876 393666 454382 334866
14906 334866 435476 333269 408169 101621 250654 506810 569843 199780 171214 -115041
14895 282682 214142 240187 155842 252077 519207 531835 688600 261919 353900 569014 734761
14884 734761 738486 599435 311829 186307 535952 728840 186815 702053 626684 804857
14874 804857 429653 656559 735184 677131 619429 342067 342878 777371 530318 412280 308518
14863 308518 434982 381554 390025 285255 460794 325011 500393 114656 640857 266038
14852 270426 589646 419251 569133 442047 447676 748216 384652 84392 588608 609224
14842 609224 488720 856944 782255 1138859 647702 1010888 849646 639190 721294 691640
14832 691640 727781 875476 543383 710051 344870 347849 616202 390464 322984 324310 251158
14821 251158 655678 643022 723634 407262 419619 383633 585203 379352 461472 155527
14810 245731 722659 536071 414550 456310 423774 379901 690127 787949 942537 601740
14800 601740 723254 557708 585542 478071 319291 615389 272245 468994 362192 690280
14790 690280 774814 488449 97672 434514 755111 432540 600927 299870 499434 484826
14780 484826 435431 460692 403262 863342 935769 457363 499699 666040 46013 420122 629491
14769 629491 734039 321809 534836 559090 705949 627867 521934 411096 634634 753504
14759 753504 634814 259136 865406 559156 484209 215050 529652 253570 692620 384174
14749 384174 430205 774162 536726 312875 650499 737541 537452 684131 385594 784276
14739 784276 611724 621204 773773 828257 659444 774236 800582 612180 899338 640429
14729 640429 822474 919004 723630 1163016 942424 1261893 1295038 1198445 1091927 1385850
14719 1385850 961551 1300804 1114249 854012 831883 731827 747337 891718 882421 954137
14709 954137 1117050 1072670 609198 875706 785275 1165551 778804 969817 1059439 985622
14699 985622 920494 893369 1430640 1238424 1613335 1192172 1212294 824103 689486 851593
14689 851593 779104 779485 819162 813753 948047 1123941 845859 865987 481522 776554 878198
14678 878198 978199 978854 1010709 807908 978618 787353 809321 867254 1140374 596353 958905
14667 958905 989211 1059481 770197 989809 797601 959559 726571 965912 782047 922249
14657 922249 1248290 1094042 737891 1334147 1031045 1192633 1075651 1007547 1174541 788437
14647 788437 1004856 835359 1496116 1344709 1254837 1210024 1216226 977359 1071381 1280058
14637 1280058 1264001 988037 918049 1415697 1358461 1306533 1160452 1234641 992076 1226434
14627 1226434 905119 1327455 1023648 1126163 1365243 1406088 1319957 1577704 1329845 1490440
14617 1490440 1467656 1345341 1541485 1471391 1443829 1268160 1123554 1344903 1257688 1390330
14607 1390330 1598660 1333441 1243426 1551144 1308191 1366920 1458259 1131936 1451602 1417972
14597 1417972 1494510 1757429 1634479 1575560 1579034 1793222 1449734 1576403 1471257 1612916
14587 1612916 1834326 1135177 1419110 1736244 1595372 1595974 2169728 1715985 1576846 2077862
14577 2077862 1784477 1686273 1582333 2025574 1605017 2015106 2190509 1751489 2397101 2161470
14567 2161470 2287821 2058670 2149516 1982596 2221403 2536177 2477093 2465041 2612276 2497486
14557 2497486 2959969 3298135 3178013 3563463 3891280 4194255 5268137 5972766 8495316
14548 8495316 11761984 19237328 30777066 31352131 17441873 8843919 4942902 3214868
14540 3214868 2544338 2172894 2154516 2245156 2356206 1916937 2582630 2101826 1774718 1844567
14530 1844567 1983619 1996401 2151641 1935402 2317982 2222794 2247555 2352029 2364804 2304802
14520 2304802 2444569 2505089 2060104 2217478 2461247 2402266 2522905 2555509 2371983 2549362
14510 2549362 2520869 2438930 2424971 2408203 2619093 2526469 2820129 2690928 2926189 2991018
14500 2991018 2702409 2957503 2766808 2973200 3460332 2788592 3091647 3533806 2906672
14491 2906672 3138310 2920090 3021489 3173430 3472847 3626536 3332267 3356891 3511732 3682547
14481 3682547 3357450 3370987 3724728 3357499 3582038 3609564 3664608 3435986 4091473 3795416
14471 3795416 3763104 4228156 3843809 3754275 4165589 4270015 4498168 4149419 4098454 4173577
14461 4173577 4260332 4356067 4701182 4201321 4625514 4189683 4424915 4854423 4559200 4990234
14451 4990234 4793633 4898272 5198151 5181115 5250647 5507982 4907726 5330634 5301878 5630874
14441 5630874 5557036 5882960 5469150 5433581 5677541 6126628 5795144 5918754 6196227 5880256
14431 5880256 6186566 6443553 6704604 6705933 6728619 6946572 6762507 6996800 7083095 7239229
14421 7239229 7095659 7236657 7454540 7445244 7945407 7806028 8139799 8024299 8300310 8257515
14411 8257515 8237221 8516764 8830381 8910764 8773133 9124378 9181812 9384614 9335300 9348543
14401 9348543 9694064 9862118 10053521 10104492 10297478 10803148 10684586 10790821 10768957 11207141
14391 11207141 11491980 11512273 11650133 11871030 11984716 12110833 12449946 13085492 13054753 13336693
14381 13336693 13660210 13996112 13784754 14155601 14322625 14680270 14970160 15173336 15774660
14372 15774660 15955473 16435134 16710808 16684707 16789953 17421380 18021890 18172088 18842295
14363 18842295 19287649 19806324 19689642 20288975 20643829 21387835 21787253 22204511 22876780
14354 22876780 23299478 23521246 24872055 25253901 25525780 26537551 27189503 27809635 28635046
14345 28635046 29059421 30090887 31009907 31688456 32505391 33566087 34695467 35225295 36242328
14336 36242328 37309770 38469876 39285310 41060711 42051598 43257146 44821385 46356907
14328 46356907 47733116 49410434 50758582 52592774 54273446 56559214 58353112 60441760
14320 60441760 62557795 64968566 67574700 69868517 72634698 75424940 77622238 81228299
14312 81228299 83924520 87808176 90881979 94642140 98640625 102718061 107497559 112020656
14304 112020656 116960761 121928575 127376128 133202183 139280044 145556953 152579228 160027824
14296 160027824 167745489 175774186 184368118 193526806 202876801 212534967 222631820 233607260
14288 233607260 245043660 257110311 269567472 282283765 295335738 309007446 322783330
14281 322783330 336816512 350992018 364758391 378021920 391199979 403244036 414417906
14274 414417906 424116616 431475333 435840960 438524716 440626883 440774413 437892005 434154989
14266 434154989 429334370 421528883 411538431 399731111 386520586 372335433 357657700
14259 357657700 342722183 327607364 312681151 297812913 283265894 269565615 256182358
14252 256182358 243510037 231189435 219659779 208705281 197951369 188216922 178964956
14245 178964956 170001639 161974085 154332454 146908390 140060653 133643320 127553674 121673642
14237 121673642 116490916 111307728 106558860 101678969 97410853 93526654 90294504 86367846
14229 86367846 83035506 79648277 76416573 73611737 70929415 68213003 65864235 63301250
14221 63301250 61270276 59064459 57270300 55332907 53442842 51621862 49966956 48460202
14213 48460202 46964666 45644949 43517345 42789051 41627991 40466522 39737743 38545421
14205 38545421 37381745 36144120 35080824 33996918 33275512 32411906 31592204 30786522 30174863
14196 30174863 29553306 28328095 27831866 27510782 26413308 25849441 25154016 24255314 23879123
14187 23879123 23514344 22813666 22317623 21806070 21420211 20866524 20467344 20053064 19862664
14178 19862664 19525172 19057380 18672648 18077262 17844149 17144099 17336632 17047400 16342938
14169 16342938 15988275 15811139 15429348 15312111 15268474 14475946 14700309 13987176 13693430
14160 13693430 13308065 13119792 12961730 13089611 12726639 12579224 12373823 12034502 11684827
14151 11684827 11422934 11393923 11199282 10930420 11040176 10634051 10677111 10391300 10079603 10106799
14141 10106799 9904656 9516623 9387694 9464195 9171260 8856514 8932591 8758980 8535912 9072276
14131 9072276 8362427 8225108 8156879 7948602 8153019 8008227 7842416 7694739 7583235 7850956
14121 7850956 7332441 7135330 6978179 7163427 6823985 6685548 6734470 6730804 6474751 6419854
14111 6419854 6310885 6155726 6346546 6530781 6183075 5884456 5831373 5990099 5783627 5648221
14101 5648221 5510037 5625227 5804421 5488443 5373830 5272936 5103084 5493899 5259325
14092 5259325 5101063 5200339 4940795 4943911 5088401 4909451 4761122 4599180 4510724 4461797
14082 4461797 4572620 4407320 4253696 4607468 4450494 4520041 4143952 4031496 4209119 4047470
14072 4047470 3905810 3816688 3999650 4205030 3998900 3935082 3918260 3882743 3882044 4025091 3900870
14061 3900870 4084540 3844882 3572664 3744965 3201801 3698636 3686820 3415017 3373660 3503266
14051 3503266 3328241 3197459 3496195 2946157 3334915 3409779 3005275 3226255 3364040 3348593
14041 3348593 2834493 2943197 2973195 2626319 2394163 3236741 2908147 2875669 3129661 2797283
14031 2797283 3020731 2598307 2824161 2507032 2755048 2824734 2524608 2556781 2626123 2705966
14021 2705966 2846422 2508723 2489368 2624353 2684045 2485108 2660449 2467162 2222175 2057937
14011 2057937 2238936 2217674 2150412 2491635 2355101 2059517 2312882 2095967 2507276 2099586
14001 2099586 2084453 2120229 2236689 2097343 2250067 2264294 2088351 2328791 2231838 2763765
13991 2763765 2699002 3293913 4871327 7452106 12844325 23770968 34410912 23997551
13983 23997551 14332598 8862385 6317633 4997160 4294611 3572041 3432572 3168961 3121800
13974 3121800 2714206 2818067 2220682 2431415 2454877 2167741 2343413 2381564 2369219 2194198
13964 2194198 1882333 2249789 1780833 2322566 1851234 1858181 1737312 1913285 1978513 1819482
13954 1819482 1771144 1995934 2018409 1943794 1880920 1546820 2137509 1842998 2054644 1737339
13944 1737339 1790411 1615870 1839258 1445007 1177818 1525562 1499025 1770344 1325795 1987334
13934 1987334 1495481 1363586 1388257 1591687 1428988 1448017 1477776 1597027 1428153 1555862
13924 1555862 1502839 1485450 1427128 1468374 1329671 1273007 1564558 1107699 1676336 1540203
13914 1540203 1389744 1378269 1567849 1491364 1317430 1458543 1436635 1540412 1460453 1532985
13904 1532985 1384678 1128564 1259849 1288515 1052483 1257821 1273161 914580 1216411 1281758
13894 1281758 1071182 1190113 1092288 1463550 1210322 997783 1398328 995239 996930 1240171
13884 1240171 892428 1378902 1411889 1540065 1310934 1286561 1067648 1460084 1299443 935090
13874 935090 911193 1077468 1063110 955173 1273850 600838 1006830 1055525 1018921 883366
13864 883366 999026 846442 895349 1050902 1047298 959036 1016596 857828 960792 897719 688796
13853 688796 1212813 978525 809739 983686 1130017 854884 878181 735861 781771 1015644
13843 1015644 804330 1224058 1041744 859689 591974 1069170 925365 793078 837396 782405
13833 782405 641643 902550 990117 915488 988295 719573 888984 1037816 469844 738196
13823 738196 802440 718731 722034 955598 670575 584909 1083698 1007789 533376 441300 806497
13812 806497 1083739 541826 883868 763290 586929 470076 532328 1015967 350737 880180
13802 880180 919503 880247 707664 612302 810997 735825 972841 926247 845841 531802 492589
13791 492589 910771 876505 958690 463012 626641 640923 485646 961567 627956 949321
13781 949321 879841 640289 509553 1005333 550496 527205 621235 969045 488193 888996
13771 888996 617419 694143 534612 511822 310274 476120 861192 483772 852195 570525
13761 570525 730296 137052 576693 543773 679928 202091 409993 479796 487704 640211
13751 640211 752874 514694 114912 241401 374865 251773 355051 604159 652626 464755
13741 464755 555745 451786 421880 642002 674747 430048 521543 319902 749773 512366
13731 512366 427033 368288 457613 520249 400202 465800 675986 606660 367113 702624 661727
13720 661727 658268 614093 519056 530502 596691 308669 403062 353228 540194 657663 395962
13709 395962 400487 572812 400392 534319 341338 567709 459462 290105 664894 394934
13699 394934 423523 262081 202203 774226 297524 118224 417243 517908 381885 257589
13689 257589 466499 308881 180281 791029 503882 446057 562466 521476 380582 362490
13679 362490 691022 580561 439463 398968 263369 539870 407635 511092 76315 621788
13669 621788 344364 517796 609450 502083 501928 285271 202920 425819 868888 721035
13659 721035 114641 401581 505620 444387 205752 472175 415073 274783 516318 257881
13648 406526 255664 335707 188869 313554 270399 475641 510342 290979 255912 462055
13638 462055 383864 513360 446194 365277 353239 600884 342149 388746 319168 731300 588032
13627 588032 283278 284890 490967 543112 -50530 478042 120417 587008 240341 604581
13617 604581 73179 309180 136935 471662 431568 508621 401276 341535 364087 338785 227940
13606 227940 255654 52613 302058 160119 341338 311768 533625 790916 413556 137234
13595 484812 317765 145805 433698 344046 131799 436364 90134 550119 356395 500617
13585 500617 20646 211117 -53899 310866 472020 293150 396909 349945 243666 551442
13575 551442 492670 312712 83122 450251 269663 224952 419261 463407 443998 448151 299143
13564 299143 390018 54895 256774 160288 250227 -335510 431062 202196 429923 292264
13554 292264 332595 271281 165441 265405 427158 367999 535191 487104 306599 471323
13544 471323 227958 41658 19496 498037 380296 65508 92048 275672 285437 18007 126272
13533 126272 337246 225276 317839 127579 180851 173761 -61222 199820 284391 290028 317892
13522 317892 262755 239133 101908 259691 224404 -179903 646278 202881 -11099 30746
13511 383645 204264 -62953 161661 414131 404584 162219 116718 113174 474047 -1502 243410
13499 690 -56531 211395 114834 124505 13359 54737 -63274 423112 342528 522542 139378
13487 284196 245081 356245 311683 154386 181627 242744 106885 144491 176645 401312 315180
13476 315180 -82633 385757 141945 10470 233445 430982 -145042 -107878 24031 -94337
13465 25374 183940 376473 187805 -12941 324994 291547 341875 335017 73844 241573 12945
13453 280680 165798 242837 60914 277087 -125992 95932 398126 376994 315290 321231 189944
13442 189944 -27871 28947 237145 50238 172848 8987 489246 434976 91187 314508 237733
13431 237733 231541 347962 17763 250330 390837 310333 -79274 295214 238635 9476 170917
13420 170917 309918 293468 400849 458027 223093 484509 177657 139099 259186 361135
13410 361135 478239 73653 129920 255941 163009 138994 283417 174122 174420 59145 127958
13399 127958 -123784 652574 260893 258445 241369 461562 276316 324667 282031 441792
13389 441792 198316 91229 -89612 36010 184694 199384 -29984 198076 -71289 265785 123266
13377 141565 120030 264887 192411 200316 328226 137347 290203 130317 71130 219625
13367 219625 384633 293202 529519 224082 553598 217309 397896 -90798 66827 -8927
13356 320300 127289 191362 214822 -14021 462547 -44243 53579 75243 302629 356541 57798
13344 321972 340323 496519 -33619 333529 383499 16573 221632 79799 395737 66083 1932
13332 304493 434768 26114 -206995 212984 178323 253153 59481 126399 346700 141771
13321 101098 -75106 29469 211418 202335 75702 451674 266946 364543 65554 -10126 321049
13309 535060 587775 98972 213143 -224179 212478 84450 101159 404283 261159 496197
13299 496197 26783 -4766 108650 -124569 266138 305594 56473 70236 262899 102709 -33871
13287 215017 74687 143572 -147990 -11492 77176 -76678 24942 -35603 326481 -188544 -94424
13276 -94424 379158 325059 254980 45217 141595 182008 -164562 -16867 166421 47681 85092
13265 85092 93424 -20820 323812 40320 399451 -121238 95868 -182332 15314 -249725 146913
13253 156726 54185 313860 290549 -32587 -148638 126051 -54403 -182451 73027 198425
13243 198425 -276084 36883 147219 -70115 289453 205876 243524 -44567 8128 36246 28912
13232 28912 -26598 362129 147793 349224 -18018 -213097 -68459 -223270 -126514 179313
13221 69835 64754 24050 12634 -122213 -99413 -159284 -147566 131647 14078 102184 122414
13210 122414 -240224 -196461 -138672 -24822 172489 -835 191467 -371614 232339 -16169 -157583
13199 -157583 223659 -3321 -101823 182547 -98721 137124 161574 359226 -100933 36291 258795
13188 258795 85775 -33112 64291 23209 492986 89050 -141727 38211 175056 79351 214773
13177 214773 159141 168723 -15756 -79433 159945 384469 251940 -89197 452132 -137021 121579
13165 182930 237801 -74694 -151694 -38062 51626 193133 59011 198112 -38145 65787 -119944
13153 4740 -268401 67821 260687 190198 80344 8257 222249 46337 176440 70734 128220
13142 128220 28992 62201 -107909 -103746 -51042 -16803 56285 319693 142814 285981 118231
13130 246695 261759 -63213 49344 -169550 172779 -333988 160067 -170157 -41818 -106614
13120 -106614 291777 61856 86736 151787 -51268 -95103 92572 -3686 -227536 5627 68674
13109 68674 204608 256207 -313465 304342 64903 282692 -221684 23980 -187498 234741
13098 197288 179079 92262 -43629 -22840 186722 59848 -54039 -89381 -15443 -100174 -96117
13087 -96117 337522 155242 252186 -55483 -171604 -119621 222611 151006 188926 -25971 24515
13075 54879 314391 -208140 91034 -456919 30728 100588 -198168 464980 410992 159733
13064 -49780 187921 278429 183019 -76037 111266 -67654 32042 -80372 101063 134960 -153591
13052 371809 17438 -204222 109585 43561 104894 16358 -26778 -56696 -175293 306817 147024
13040 294197 37124 233056 41616 67261 68707 200559 72450 3922 30617 22331 -210841
13028 132021 536280 -147072 -194769 180967 -284230 276274 -735 -91401 -86672 132264 309155
13017 309155 -25146 -228102 40757 -172236 56686 112597 179634 13354 153933 -103121 283284
13005 140449 19960 193998 127533 434594 266170 273788 42216 107296 -97413 85851 66287
12994 66287 289358 93942 98597 -160714 -247198 47749 -275699 45224 101714 153935 223845
12983 223845 -312349 -423122 158998 7379 141016 -32301 146404 -190606 -13428 47782
12972 -172821 -206369 33603 23003 -225768 -119906 -120063 -114949 265308 138245 -79632 167699
12960 230309 -54410 6582 -26287 -142989 240336 -83547 477433 49858 -32647 -98217 61180
12948 -27112 -284759 173536 200722 49136 76888 12764 -13155 -208436 80262 -79050 -139019
12937 -139019 89802 12581 108543 -9985 180702 -50603 282447 -117857 -52894 129320 57625
12925 256767 -141508 -152283 -62934 -261131 363799 -93209 -24203 163695 -86901 -191482
12915 -191482 303058 238108 -210631 -5818 258644 -215350 203252 185108 176707 127263 -81278
12903 -113915 11521 -58726 -287694 -167253 -34788 82663 -35887 72413 -217003 -244942 -204756
12892 -204756 -170384 219951 -7367 27175 -134614 1791 5896 -111581 16887 -243848 26773
12880 -299009 18952 87918 114924 238094 120265 -9586 -111788 177685 45020 -176845 29581
12868 119650 91397 135847 71990 444237 -169580 -181648 -281062 -20424 -178348 90811 3095
12856 13079 145184 348638 5098 99043 237867 -164777 -74501 237674 2034 56172 -12461
12844 228161 -157845 -255686 225157 -184074 368636 260223 -142587 122522 -8536 6178
12833 31712 -62477 82502 161950 -53165 -126876 -274753 23260 18494 -88763 55802 -170543
12821 -204453 -3042 -291766 46837 80696 391905 22381 313874 114300 -116146 -65338 -145207
12810 -145207 208214 91238 226826 95120 -261219 -190158 210172 -144412 79831 -273655
12799 -13760 -75398 -542777 86729 15724 194486 -124514 -102960 -204682 40869 -100890 -178321
12788 -178321 -14908 341903 -15681 100929 -250956 264073 -78347 -296592 -97827 74270
12777 67904 430228 -64993 -61880 -57548 7032 -262083 -83885 -399198 379664 366439 214148
12766 214148 319 210505 -36526 -80589 -261947 -40691 151042 105362 -69775 360863 106217
12754 -119362 -49182 240752 -204738 147987 313550 31598 37122 116703 28292 119564 35211
12742 -18754 239348 -95241 133447 23767 157850 -179533 160028 -35484 91663 134866 199542
12731 199542 47240 -23324 -6360 -12034 106768 -106585 315764 190642 -20046 185618 -272689
12719 -113112 236238 -86243 -47058 9374 -38799 146510 -50972 153875 247666 -77555 -264159
12708 -264159 -37067 -48851 -5958 255922 250685 22447 1884 -29784 143709 -154794 -116899
12697 -116899 -273163 -77554 -158071 -77261 113793 28354 168740 411534 -279864 149401
12686 -65699 -196909 -168417 325490 84825 222362 91155 275937 129463 72184 305582
12676 305582 -56533 -112808 255446 -227722 -96152 475309 56376 -329597 31013 -158557
12665 -33554 -201566 50048 -192712 173401 33311 332797 -511084 376503 143007 57553
12654 52116 111970 -228667 -378173 -102674 -209021 172273 112600 -55575 -62831 162617 74366
12642 -75603 46137 -312308 179231 11474 -148093 -13313 -6562 179170 118779 142849 96720
12631 96720 -12178 147284 -73303 10784 271646 98050 -108632 14200 6559 231882 81606
12619 41192 -50846 -89571 -144473 96597 168872 -99673 174776 -6517 -33713 -347612 -317504
12608 -317504 99701 143382 -79834 84212 321625 241538 84524 -60875 -220860 -45787 -115390
12597 -115390 -362868 56941 195597 36238 -115598 64610 -267766 -132246 127278 -132721
12586 -299763 178375 -234894 -31037 149704 -387820 80911 -50555 131832 375726 225922
12576 225922 -35008 -7859 -23201 -206927 -257396 99698 -50299 27654 18367 238709 91951
12564 49240 -53320 -227014 -211516 -62594 -117134 215016 38507 -29880 -260549 230710 -185539
12552 -322109 348468 -64403 -47111 -3658 187716 -98502 -318588 -88842 53379 -60707 -201605
12541 -201605 -97282 -118887 15572 -30361 -259659 115256 122770 207077 105650 23775 132605
12530 132605 251637 -39822 6995 -135356 -108515 -354176 -119530 161953 -279818 90802
12519 76305 -60273 280834 46130 -97941 -10739 -80337 107850 184182 114214 -106464 -199834
12508 -199834 116945 -165123 -184970 297610 -19247 -71806 21400 93947 366321 77767 -51673
12496 227714 -206263 -98226 375377 160370 -41729 -103507 -120098 -144906 -33101 -83224 79502
12484 8494 -96885 177416 -89323 164872 -12225 -40976 -200834 -29651 10004 34254 71772
12473 71772 -214296 198303 293533 -149899 -444519 -67285 205894 -29627 102183 -148052
12462 5128 279983 219883 -101429 15054 35480 -358953 -164117 121802 -142153 -188587 122198
12450 -27433 175637 -214022 -324948 -309893 -26592 125254 -51630 -72827 -201285 -194856 133409
12438 -284403 142594 -11003 -278608 -60903 55008 -13605 -23153 253172 -261238 37439 -96255
12426 341151 -11091 -44480 -21884 -69939 -43910 95326 86840 -303597 -20819 251456 -167498
12414 -370509 -251705 44979 -110101 127474 112540 -279342 -5439 171521 -396840 -36472
12403 -148195 -53793 197675 149808 161043 -235868 -20558 -22213 -65021 -5279 -131035 -280817
12392 -280817 176392 -111164 -95821 -81843 -176574 133485 199528 174255 -70283 9354 -45093
12380 467322 391293 -96090 256199 -57190 217315 325922 92763 249201 -213960 -227202
12370 -227202 44778 54304 382911 -252412 -44503 32679 -174031 64488 -321581 164469 -58624
12358 34176 -85246 -144564 46379 148248 75302 -67795 59732 101669 132934 93308 -390690
12346 -57317 -209274 80601 125449 -256617 39970 45813 -145919 324760 -52619 232887 111576
12334 -38347 -107478 -59600 -30718 93144 355320 -102600 396034 241964 57152 -72273 219493
12322 190953 80744 199367 -158393 -133933 26520 -98444 87222 -11262 183930 -166586 -3112
12310 187613 -119304 30403 272468 -269459 141092 14721 -117371 248905 15485 185358
12300 185358 328283 252577 122005 27434 90896 123109 199746 75856 248140 -128084 -204125
12289 -204125 -78015 4727 18801 -16968 33993 -112818 230621 -63736 269204 -266686 -106923
12277 33671 306694 -277701 70807 200966 206578 209145 -157204 57897 -172520 395778 -104456
12265 -54685 334047 97978 -59996 231885 67288 -80984 -201195 96222 45872 86511 128951
12254 128951 -4075 -124541 3942 -368234 -198177 -152060 -1376 167627 -42662 139440 333731
12243 333731 -16517 141362 293444 147776 28265 -40452 -19031 161604 392492 145980
12232 137442 -22333 333918 -17183 -239130 -122146 154115 28674 -152888 280522 122301
12221 -71544 -23008 187530 112536 250149 295040 131337 151655 23236 -215255 333132 -100589
12209 32062 -144719 -80557 12718 405155 -130756 -168299 -104065 177842 -162783 46538 248464
12198 248464 108918 159588 -6169 -10123 117290 446488 5043 28799 565427 456335 150701
12186 111151 82490 100741 -59524 266478 94687 6929 192590 138142 -18072 75915 204807
12175 204807 173855 289006 5949 65764 210564 99368 274876 41371 188918 161472 -164626
12163 259976 244845 96709 -313905 -3561 55597 106127 17694 133117 -79445 -30839 268097
12151 384203 85369 110776 5798 -28758 83731 -168945 15364 164796 -95154 67129 -24384
12139 -52191 -56075 -167380 444431 67758 -169781 219073 9441 239295 339866 15504 -111248
12127 -63167 84267 271319 -20587 -110614 35870 180577 -341475 -176398 174755 42530 -174197
12115 -45357 76157 -71750 3558 -124067 215538 238506 -253116 -106282 -69975 240458 -263221
12103 94767 106760 236909 202820 -71885 -225026 80308 210893 -206153 414600 178286
12092 -200700 -205837 9024 -150712 13050 213517 17329 446234 132705 79613 -26462 -70985
12081 -70985 -126843 184661 316436 225406 -310033 -80949 -52824 144606 -75423 -296117 -120389
12069 263651 244753 270798 53109 -4846 285448 155185 249818 29403 12795 -71304 97097
12057 127066 -97701 181235 -94998 -113320 -130322 -134964 -202380 -165425 90782 163200 282342
12046 282342 324401 -237012 -138684 -78398 -22324 63668 100879 -106986 31389 104297 -37536
12034 211101 -262269 -201522 178908 -290619 -217631 -252859 -35765 -99865 -108719 -156309 255667
12022 -206775 225064 33148 261135 154138 115575 -17830 -49511 34838 -170739 -197368 -190223
12011 -190223 18786 -72446 -248247 -282890 302605 234860 95064 -89956 -46235 -647325 -45994
11999 -88883 -145040 -373 132461 157756 -163561 -215596 -133839 -276599 27053 -348859 113499
11987 267555 81874 -269917 -113241 321582 -139610 8108 51451 11932 11895 5991 111296
11976 111296 100772 54362 232563 -213636 -16642 -47888 35123 -181624 -238092 -375846 -116254
11964 -394382 -190772 -36288 296867 28946 75618 -125367 -44828 21834 81468 -16541 -178211
11953 -178211 54225 207753 7325 63245 107862 46032 124547 -187610 -34142 -120635 -294092
11942 -294092 -157874 118661 54847 -155332 -78004 10937 35313 -269930 -196624 -111633 -98328
11931 -98328 142186 17247 -67406 98968 -2236 -26022 345442 -248148 -75092 -166758 -201457
11920 -201457 -155271 85271 -122023 -393361 34900 85214 186231 -365782 157752 -70686
11909 -132384 18098 -160894 -15179 -285504 131966 395890 200634 -154317 144639 -105771
11898 -36519 -11798 15831 219917 -140576 6994 -123072 -168630 -323787 -225595 -166795 168967
11886 -35608 -321476 42709 -204056 -225205 56639 -176216 -209236 -152971 148881 210172 48427
11874 162265 172704 -51160 312015 -77528 134296 -269016 -301945 -312342 276549 -362075
11863 141925 -162041 192253 -45704 -160979 -477 -184896 13769 96222 56359 121984 101193
11852 101193 128129 89563 160759 487 296968 300406 10447 202006 96221 -113300 -45309
11840 354518 -85974 -268322 -282729 -259447 117440 110217 -471609 -220234 96307 -181925 -153579
11829 -153579 -78608 349303 263852 -92096 18711 -221228 -285412 -86324 -35638 -189521 11067
11817 -224430 -125427 -231053 -385043 -87956 -80131 -35750 -216752 -146270 -55563 -1043 -168505
11806 -168505 231670 -202439 -220239 -163852 -74640 -354646 183806 179256 39147 -198944 -185904
11795 -185904 -34295 251672 79532 -200923 -108584 19951 -132909 25879 -344444 -176522
11785 -176522 -156842 -178081 222505 -63409 -36772 100567 -263947 -74655 -384217 125471
11774 -112581 303725 -92169 -118294 -48400 -537392 70823 -15635 185390 8271 -61993 -970
11762 -90176 -90903 -103202 -2596 272860 66547 -107840 199960 59434 128620 139878 -28902 99862
11749 -80661 -230014 174544 -41306 -97894 -97333 -172443 -201998 -98208 85226 49577 189612
11738 189612 44137 118312 104834 -528613 -103166 185875 8475 209204 -144057 339368
11727 302308 3377 66840 159581 258420 -232730 -13044 -114981 -64340 56366 -237669 75512
11715 43337 141688 -49325 287907 151211 -100605 77044 -157638 157549 -24700 150041
11704 61668 -13717 -55944 46737 64309 105207 -57681 -8393 64900 61310 -256079 -227803 -113116
11691 86711 -27403 -135273 75012 184361 34268 -43927 -49466 -22805 56302 219245 -433007
11679 -430738 -29774 -90989 -478 -135367 177968 -60990 -26740 116117 -27870 -107755 107403
11667 121698 -74808 231618 -232332 -129861 33187 -3973 -13622 -68725 266165 -179007 160699
11655 308110 54155 37528 61796 -231810 -174295 32331 350196 182340 253044 -222537 -298324
11644 -298324 -13407 219476 -136878 231795 -81374 114719 -23105 76898 32828 -16337 160197
11632 -96175 -12559 65605 210368 -18698 -229047 440319 229745 -137045 -73454 -155809 82703
11620 -281915 -53684 -119616 42977 54450 -111616 346447 -243460 178061 63386 357626
11610 357626 276263 -177250 2777 107601 -174710 244184 208762 -26632 241562 -258563
11599 67975 -159393 -45089 66708 61071 -96675 -128417 150412 -36876 142285 169211 -141122
11587 -378807 24210 181062 -98810 -32383 45026 188342 -70148 -49252 115794 -174353 -74044
11575 -109881 216305 -71944 82616 144090 -26894 191490 189180 55348 -70776 -249538 75212
11563 -187877 -65788 -169013 -248899 26027 -143536 -153007 -13313 -163969 236438 -156721 -201864
11552 -201864 2020 -221802 -359889 -10641 277107 5762 -265971 -110648 -94910 -34993 -167660
11541 -167660 -174586 285467 -167424 215600 221203 -129663 -223745 131168 170634 353912 -62712
11529 -229246 -156149 -70548 1462 211716 -19104 86717 -11277 107314 413627 238516 -42496
11517 51836 314192 -156407 -35541 -9086 -67257 117866 -243327 -4147 298830 13277 -5108
11505 -3945 -221845 -128512 246562 147290 -136192 186362 16986 263090 167210 223458 152186
11494 152186 140140 191245 205244 -197590 -125811 54153 313390 -83221 78028 -157187 11290
11482 317476 24406 -209395 152086 10476 54982 100855 3890 258059 344584 222410 -21666
11470 -109753 -65512 -39048 155180 -56704 250544 345705 120205 208194 -262604 -329489 -104645
11458 38038 149594 21267 61665 116601 55358 75005 277105 383738 256264 57006 -129718
11446 50286 41845 137744 96087 -67620 131335 -6989 45482 26829 45698 239814 35642 -46087
11433 -6501 110565 113916 -65723 175604 135438 13612 45973 -229569 -105978 252778 238470
11422 238470 -112490 -198989 -86456 234029 201066 89794 279858 -177386 -41905 177624
11411 19944 -502933 -278881 -188617 290643 -41914 -6458 -51472 -252402 263922 -69155 395403
11399 94131 -214698 -24053 -102918 -207125 201102 -249070 -334635 -247265 30539 90451 84045
11388 84045 -109503 -152042 -89024 77154 -79961 105372 201070 -240275 240502 34690 -87852
11376 215236 -295315 -180230 -99455 8700 -10707 -1410 156321 -90095 -499194 -953 -347075
11365 -347075 76438 -52214 113842 -170421 -68077 -181713 -221445 -243633 -99492 -22713 91555
11353 313569 68615 274040 -57308 -227929 62668 118038 138529 338938 -145220 122341
11342 261284 -140609 57496 337327 247694 -84307 22542 -32851 -32797 -137681 -189613 61060
11330 6045 229755 197723 311698 146216 -223056 -150604 -25161 -71785 161658 -186693 377165
11318 -7448 -267238 23376 -33870 -309427 -78256 10820 -79538 -8065 219238 135916 -35809
11306 16292 -237400 145213 -159778 -160808 -282448 -138274 -212426 -100777 -74046 -110373 -473545
11295 -473545 -41047 -208155 -77843 -88861 -146739 -150826 82358 -100254 310845 223904 104112
11283 -240694 14410 -221614 -57644 -396723 101847 2880 -303289 -74416 207929 -13735 32170
11271 108990 -17345 -383099 -86562 201538 -72625 159003 331367 158103 -245433 -155257
11261 -155257 -389125 -434459 -48947 62594 83072 -122522 33326 -93420 104849 -48202 -85223
11250 -85223 -128993 36469 -80208 -171415 16904 -114135 -90528 -66562 -183603 -149973 -145660
11239 -145660 -84827 -227711 -4429 -27537 -157990 314499 -403862 -21368 89415 -106041 31717
11227 12246 55592 108148 -17976 -214159 -470214 -40504 324640 46134 -61395 -199797 -308884
11216 -308884 -84391 -79451 -34955 -388924 95726 96740 -100453 366012 -75685 67338 -101688
11204 -418327 -16078 -94246 -41472 -150173 -345774 -441403 245396 -290104 -110644 1629 394588
11193 394588 89806 -79775 -329343 -274950 -307584 -102878 -48900 125580 16972 -14510 -215578
11182 -215578 -30473 -116575 -462927 -347973 906 -9685 -331682 -11732 -35561 140189 -90900
11170 -89709 139865 8322 5737 34851 -57916 56664 20665 321631 -29121 -6051 -13560 -255333
11158 -255333 -188159 -305840 85802 -175492 -58170 -6418 47908 82604 -176499 -96299 -1693
11146 -205702 50819 -34621 -94934 -69390 41596 -9525 -405204 -271842 -27904 -127642 -37972
11134 -349005 -118236 91901 16366 39418 -493878 -260642 -20650 71896 82298 -91388 -76830
11123 -76830 206351 -48510 183513 172074 -147558 -276326 262488 -46418 108891 -51331
11112 -205250 297293 1745 72978 -160231 133682 104990 11828 228283 9508 78633 31451
11100 -6634 5279 71866 53314 161465 -105248 -118301 84467 -323035 -226430 54980 201261
11089 201261 -19155 -394098 208813 132575 233713 241955 538823 31783 92089 29304 -167630
11077 241404 217137 432548 -121242 177410 181971 133550 302711 480645 457451 17771 147374
11066 147374 -54117 46101 -69157 197447 256124 281721 382812 129310 196527 352319 312208
11055 312208 514693 534417 -209942 347337 362043 764738 12145 401986 338922 487526
11045 487526 428193 128050 364387 611709 335469 384407 139081 324919 169056 538025
11035 538025 271003 727474 144702 399423 648092 400905 360126 438252 463211 260251
11025 260251 331804 366635 427628 416395 113663 286328 514238 361601 73215 248827
11015 248827 509998 230092 364075 241895 404744 244499 94763 414931 551576 313362
11005 313362 295782 164831 418542 279167 214420 612939 246091 333352 221493 202418
10995 202418 422245 588508 267379 489309 343378 275633 319223 414541 53145 375510
10985 375510 168661 787607 265226 101956 871951 883742 464958 502424 634452 645515
10975 645515 622012 736915 838003 967954 1439882 1418885 1406778 1703082 1506040 1259381
10965 1259381 1472383 1434984 970336 1372296 1124710 1043158 916652 863358 680164 1115552
10955 1115552 995205 1020854 1349316 886804 1231436 865853 986677 719826 965912 807338
10945 807338 756821 138317 172540 134847 382628 272210 618271 -8892 -22323 133839 154843
10934 154843 -66343 -79321 157718 89304 54728 299872 -170950 319022 -21656 382425
10923 -357236 616486 -63799 63998 104783 308859 -83518 107512 64314 -23338 -58807 9874
10911 19114 -10730 245004 192219 -364762 -43106 -9131 -12012 262305 281905 -101029 -166766
10900 -166766 -20585 150726 -217705 -220582 -50454 -105469 -291291 42743 -63161 175511 27394
10888 -247435 171442 -74829 -80739 -176518 -104426 -156615 -175478 34211 -76045 166880 209242
10877 209242 -14645 113683 -214189 34294 -44247 -83249 -198143 40214 -156828 155992
10866 -102261 70938 -285248 -413084 122442 27577 -232932 -171824 96459 -118027 12672
10855 -609349 27385 -70933 -226114 79068 84446 21851 -120121 -237330 31314 -10667 -81473
10844 -81473 -20675 -217367 -11943 41491 26432 6617 -294204 -15453 59208 -10898 267822
10832 -96579 -91340 -102338 -54135 -113097 359188 32529 46413 201002 -140034 -27796 54110
10820 21014 109811 184038 -124600 213488 44932 -251565 -213332 313089 -105316 -83444 -31960
10808 117542 37256 -88790 -46646 109354 -128039 91726 368106 -210004 139368 78159
10798 78159 73370 80371 -176347 -23269 -111056 -279203 238320 228313 -41597 -191174 -208912
10787 -208912 -175240 22811 131794 -290880 -81547 -290523 -212982 -225240 -177000 -57834 8619
10775 -167215 -252540 6218 60610 -195563 -189324 292268 -57297 159527 16189 -342402 -152539
10763 -177873 -99145 -109633 -32742 -47506 -16282 -94232 172403 -39560 -153151 -387377 -25348
10751 225828 -130476 50035 -186842 -154330 -197535 196943 109544 -347817 -244895 -177860
10741 -177860 -35898 138484 -350289 -158093 34242 -14029 -174362 -255368 252753 -237952
10730 -124010 -359005 -104643 109245 -78416 -13619 376318 -96890 -253996 46253 -72086
10719 55835 -348278 -196619 -230012 -103494 113898 -52769 -124421 -54012 -49543 -295160 -108061
10707 -359762 -149647 249626 -94956 -186045 -98205 329011 -228668 327490 141596 88391
10697 88391 142533 3962 -303773 -27477 -352098 -176669 284931 121474 -187175 -119096 253146
10685 183588 -256660 -56244 -85 -137882 328744 -164742 50918 -216851 240130 90395 80276
10674 80276 -21702 -108513 -117670 256280 94306 25627 57925 1817 33766 -69601 120432 -40377
10661 109973 -59346 -191197 24226 -110525 -26333 -107681 -10625 94742 -286985 -101847 21451
10649 -201817 -10587 55470 -41920 183913 -117037 137053 -226497 63913 -311587 -37859
10638 85945 233608 -183741 102549 -204542 -305064 -339286 96856 -76535 -69640 121550 188248
10627 188248 -258561 23466 -13629 -52307 -97225 35555 -285559 -327248 -34015 21371 -283721
10615 -179201 -375262 113319 -23432 216722 -100106 152909 1855 -207676 -73846 -267537
10605 -267537 -36921 -339893 -181967 24288 -137128 -12308 165227 301232 -77188 -137592
10595 -137592 71513 -133975 -67400 101773 -169097 158795 23597 -145822 -231783 -220189
10585 -220189 -109745 -219916 -234902 102956 -219673 74585 -123070 -170805 278484 208858
10575 208858 193927 -321415 -117990 90076 58835 -151867 28751 174261 301 67915 -34205
10563 -162809 75274 23788 -60521 -178990 -128161 -146824 -119328 51493 -151293 -33407 65481
10551 168748 30853 3121 180882 -161049 -179659 -299940 64662 -113556 71703 -371772 -378310
10540 -378310 65686 -337622 -18094 52365 173671 -37549 -269225 -262483 -357251 210056 -79118
10528 202933 23244 -127618 -44299 -156700 -471094 -279211 -216546 -248654 -354104 385333
10517 168973 -90856 92936 147917 -92092 378166 -89368 -171173 8519 -49458 -191084 229700
10505 383721 -62089 14887 115720 -21343 20562 232046 16661 76417 -114035 -71190 -328417
10494 -328417 151584 -211439 172647 -297443 -319663 -73115 -2116 -105325 -219332 44442
10483 157208 90341 -164691 -238412 152995 258113 375831 521685 139264 126692 141014
10473 141014 4463 -129111 165742 -362180 -258365 -109621 -195749 -133080 -170084 -96997 91859
10461 91087 482843 -50135 52609 -56579 -20340 -55859 10678 -20470 -275932 -294229 227916
10449 -282333 101449 -23077 -80875 -137768 -195315 251918 89913 -494071 256356 117620
10438 60755 -53275 -364808 -226686 -397463 -173531 -127535 156945 146443 288307 -360348
10427 132130 -220379 77590 223788 -348166 -155781 110421 24107 5627 4958 284204 -80588
10415 55496 -232848 -340528 98460 -58226 65413 -18257 -181669 -83634 45524 69084 -49012
10403 -148382 197093 -106836 163797 -57808 -35878 102265 250689 19957 91876 228069
10393 228069 -60845 93554 -232340 248816 -110806 81382 263169 291816 50339 -162640
10382 -57581 213583 -58932 -148191 -150671 -144553 95808 52284 -47116 48783 76517 133784 274994
10370 274994 308513 -157391 30299 286606 453714 351454 132425 296568 588675 362847
10360 362847 349136 194439 313578 303903 169594 202356 59255 259358 -94281 -28994 87343
10348 -127972 148908 221670 274326 -156451 249824 -51274 387455 242520 302697 485080
10338 485080 46290 81360 211473 -192427 115161 -129880 11335 -188655 443248 213081
10327 -130413 103159 97809 -234850 61891 -73550 293185 -449218 240301 281310 6267 248900
10316 248900 -63439 515617 4163 -284353 229256 154355 60814 87049 -206957 -130889 -164180
10305 -164180 -76704 -265208 160326 -303525 -211037 -40828 -56925 -175554 97852 -178068
10294 -220294 224365 24842 88125 -230359 104098 300429 -145001 65805 -360594 16235
10283 -86049 130868 -75940 -175930 -213272 73379 193351 28413 136770 199147 -355051 -54937
10271 -599809 -68150 -181019 96150 -134446 -27216 -80901 -356099 275462 -15771 50870 117047
10260 117047 72920 35506 -46268 208514 142663 459011 -53739 237118 39648 -177448 -179192
10249 -179192 -21102 879 -235266 -296778 -128914 -45745 -21142 5458 301989 -178996 2848
10237 86172 -212150 130690 -194793 25967 19907 -7117 -344552 404386 -278345 -59115 -118191
10226 -118191 -297504 -135572 -15958 -239730 -380478 -52393 54220 -144921 -176665 -111304
10216 -111304 162695 -8913 87634 -35721 -314505 -247251 274894 111764 -580631 -31382 -58388
10205 -58388 98790 127472 58435 -145571 57909 -517695 -86660 300983 -237203 -117526 -69963
10194 -69963 -324457 110682 -237503 -50285 -225826 36346 -165181 28461 -112795 -36699
10183 197471 -19642 -143018 -55565 -29344 371855 5895 58406 131278 -77090 -7666 80394
10171 -212199 256 -264667 -150038 -162084 -128413 -98849 -191326 26923 -5526 -60333 -513534
10160 -513534 -156928 -148677 129935 -58686 -23508 -240136 -80169 258364 32416 -205095 145614
10148 -146964 -130298 -176395 -202715 -80345 -33177 -213629 -281315 -223625 -282730 -365296 -332868
10137 -332868 263435 -18156 -62901 62137 105124 -156038 67378 10679 -197382 4245 73101
10126 73101 -245449 219449 -61890 166332 294423 129094 -179802 -34461 -153815 -459887
10116 -459887 -78148 -2776 188894 -113527 -268404 -139028 29541 -207964 -267118 441981
10105 26677 -268386 -294220 -178865 -291952 -82695 70377 47425 -348626 -220367 17280 29965
10094 29965 122623 249162 -38926 -4160 333506 -260914 -450224 6760 -256987 176130 115454
10083 115454 146720 -90868 -87148 -229315 -492662 14578 -60923 -163006 -94190 -137638 -11740
10071 -160085 -253378 31201 52532 58382 -7583 7810 -186042 -81749 308869 125184 -299785
10059 263477 -61627 -266613 -73785 106739 -403545 63665 -324418 79200 -17865 -225365
10049 -225365 -151362 -29686 -70593 -26644 18865 -90555 135480 -326808 44794 -141277 63634
10037 -203824 -33983 -169539 -277265 -52892 203583 -2630 -38921 -60135 -29217 -45396 -42503
10026 -42503 -40767 133847 -11842 -232307 -107013 -254392 95832 -11359 -133332 -222848 74611
10014 162280 -190220 -226040 -48333 -183163 -49998 -57246 -198068 -176592 229637 -446275 194443
10002 -289958 -68806 22187 -67235 -416873 -8893 -133691 108494 -67581 -289937 126476 -186992
9990 -350773 -156712 -285654 155653 -32444 -194166 -321129 -68539 -41502 -112039 100322
9979 -333134 -140575 -43704 -186824 253044 -252949 -227938 45326 -223704 -300935 -276340 244702
9967 -111929 -40552 -26193 -266708 -211137 -104023 -23899 2312 -110031 -63643 -195860 -9111
9955 -147652 -144226 -278000 94752 -38054 -404421 -256358 -64275 -158423 -108350 -166709 -226445
9944 -226445 -182274 -227669 -148145 -164735 284850 111582 235917 7948 -33501 -96194 -84751
9933 -84751 -208540 -71261 -191463 -303498 -183045 -151383 -254436 220089 -225562 110484
9922 24276 25527 -304889 108502 -251218 -204453 5190 -111810 171976 -53091 -12038 -210034
9911 -210034 80646 -127397 -75303 233269 -99223 -280061 -110782 125595 -228677 -14701
9900 55606 -175220 95215 -192606 78171 -219214 182409 53298 -591006 -136667 52115 -14261
9888 -148100 245204 82810 -157448 -66624 95945 21533 328940 77928 -183150 57181 -76042
9876 -40437 271081 53719 226635 17032 19913 56500 -6355 175752 -147694 -139351 -70082 -98251
9864 -98251 -80398 -203682 355621 -181132 31159 57821 -80431 -326757 -136087 -2700 -63802
9853 -63802 -20188 -168582 45835 -39996 -98570 -143174 -113273 -107652 -31827 280356 -1210 -62455
9841 -62455 -133060 -120931 -108917 309574 -254836 174891 -210084 -22809 -23741 184700 -96994
9829 71516 75548 -243448 -320259 -246274 -139816 -41977 61135 -377965 163190 168313 -50969
9817 181730 -168871 -92220 -88878 136479 -217556 -311530 -175783 -282726 139601 296694
9807 296694 -12067 -72760 -22050 248231 -31807 -318248 81095 -178225 290817 -313810 167628
9795 -113313 -288123 -254074 136675 -178883 -82559 -164112 37507 -136476 172382 -26808 268253
9783 146551 -64065 109097 -207094 -164440 -223445 -205598 122904 14950 -123518 56795 12585
9771 -42204 19826 -142157 98398 -302952 54184 -180950 -70700 -56617 36790 -238692 283519
9759 -16037 -82565 11684 -8887 -87920 -45911 -239550 -92476 25327 -27379 114703 -315470
9747 130052 -426586 9820 -40696 -60004 -181224 7487 -74822 -105742 69775 143555 -124186
9735 -46635 -32726 10282 -178031 -217450 97428 62295 228821 163589 72874 -128683 -23970
9723 -93579 -259990 -63673 56737 81422 -92265 -86156 77787 -39983 -55581 -172051 -46677 -327648
9711 -327648 -37316 -15306 -358953 -102688 -268882 -95779 150445 153414 35005 -172115 -62477
9699 -77341 152869 259722 -108282 -165680 269203 386581 -42492 124251 -124753 -8180 89885
9687 -142668 28084 -296092 -240423 97577 -50764 382338 -47847 17337 -7505 -113532 -87376
9676 -87376 117032 -339746 16566 90294 -28002 -242464 82611 -172058 45302 -172876 -125708
9665 -125708 -139765 -52620 -10545 345951 -58587 -284722 9314 55027 167724 302243 -7039
9653 -82746 -36545 19714 61548 261898 -266144 -150431 -271557 -471735 -51320 -145493 -119882
9642 -119882 -241661 -276235 -373855 -556331 305582 -72223 -120289 -454 147874 251965 -230291
9630 -175660 29303 -282846 66508 -277149 331904 9279 -186390 -220745 76326 188938 -53828
9618 -295525 186912 -69416 -260966 -106248 -288498 99341 276997 -117516 -215353 246467
9607 -210129 -298189 -267267 -94637 -18829 -96135 247507 87913 -373618 -161452 393164 89134
9595 -258172 -317141 -147538 -190265 23032 -274315 -267776 -84877 -240644 -51524 -74782 -75592 294485
9582 380064 -382542 5421 -184345 -213575 58262 -90319 94811 42966 -418 150026 -295764
9570 -212767 96862 -127613 -345687 237361 266400 -181849 -187255 29764 301945 366311 -127495
9558 -271727 344839 -268370 -278258 70189 18679 -201227 186821 81612 275300 -178320 -270921
9547 -270921 109773 -315408 -129415 -261067 86859 62629 -15465 94086 -38759 -183284 215229
9535 -274338 -97044 -54155 -248437 224207 -251175 -286437 24047 -373341 -110811 -34647 90073
9523 -69129 -137525 -173239 -230980 -90502 -64447 173990 181926 -135621 -28266 -229142 -512910
9512 -512910 30693 -10075 -136678 -63833 -45567 86258 86311 -79189 -33822 -147990 146784 79129
9500 79129 9744 238419 -5105 11512 -68657 -22857 -161694 -46523 -292426 -242040 -135354
9489 -135354 135974 309353 -219582 -121868 309519 -126155 106543 6829 -132137 -195586
9479 -195586 -132950 -178956 -401803 -310123 -258970 211333 -90229 13170 148697 -78924 53151
9467 4077 234379 -130106 150775 60108 -359912 111175 273171 9091 -5521 12325 68213
9456 68213 101466 -215599 -108591 232624 -413389 -180596 -126903 -270297 113541 162087
9446 162087 -17977 172240 -101688 624 -75544 3611 239562 274405 40748 93783 -346447
9434 -22835 10863 -175513 -314989 35253 -44826 168603 30413 198117 -15910 78179 35978
9422 -29612 -349415 -171323 141908 252228 -36631 -191329 5175 -33450 -75584 -187255 -61512
9410 -198590 120614 -33601 64458 32923 -20155 32186 268332 -86671 -126291 -312955 -11857
9398 -292747 44301 -21434 245587 -19361 62848 -81456 -37444 94634 27674 -551463 341399
9386 -4345 -246152 -139069 -93894 -16236 223335 189310 75930 -179792 183798 -149425 -100493
9375 -100493 18704 -379931 174223 -210134 45127 -134494 169907 -223112 268347 98826
9364 332316 -37344 -125421 -72275 -156906 246577 -149210 -44367 -89714 22141 340077 -378785
9352 -181591 54367 -13459 -57048 -464421 42080 -325779 208404 -214663 110698 175383 -101262
9340 204541 309881 -267449 -152323 97500 -71233 39586 106581 108247 -87153 -20962 81824
9328 -325113 -274600 348360 -61913 -278173 89439 2174 106737 253480 -34408 -53233 46397
9316 -105719 41875 272650 -198577 257324 -313034 -101472 26859 128177 -23495 166152
9305 -68226 -216254 90264 -61568 127129 -13935 36198 -69286 119101 -237209 -124617 24467
9293 178637 68914 57723 176997 -176278 -247383 -391886 -284169 -11227 -525848 81724 123263
9282 123263 5086 -183275 -56671 -99909 -81587 -80110 -123149 -21944 39169 -184494 -5309 421
9269 -16092 -190064 3136 -53496 170109 -206888 -30061 -77293 -9992 13867 -216501 -65147
9257 -116666 -104907 -31992 -84606 -15846 312595 -387964 -66798 -16750 -379656 -218446 76432
9245 -23683 -89575 8811 169650 -152473 47165 164147 82592 5019 -109467 -172590 -112975
9234 -112975 100006 182443 121786 -12786 -117339 -76874 -231427 -425428 13934 84353 -199469
9222 25421 -179340 246865 -172612 25540 180270 195512 393107 -242977 -337586 -179395
9212 -179395 -130978 -154050 -127359 -149124 -2453 191371 -19702 -209748 -142618 -117399 30473
9200 -183960 -1124 -111652 -162016 95568 -351200 -350605 23880 -40151 -62525 -115902 -24900 -208508
9188 -208508 -164081 -65476 -133609 -160253 -194549 -29141 21600 -120834 -422893 -90089 65007
9176 -84198 -207979 -93474 88061 -39648 -26329 70388 105538 121168 184372 221860 -162602
9164 -172443 -11177 77040 -32396 67336 -47315 255023 138486 -142657 -63512 84208 -106531
9152 -315510 -53984 -68754 3233 -4533 59636 -206862 54712 -78069 -111793 -160327 36 315144
9140 315144 210273 -31418 265599 -224764 -208304 88129 -188057 34514 71383 -148693 -308918
9129 -308918 -71659 -57007 -103785 89418 -126872 -199854 146599 -284663 -316928 -283053 372469
9117 -288193 103025 -214704 134386 -161565 -250524 -439572 207194 50060 -59014 89407
9106 -209560 -152405 -78423 31186 -125559 -210723 83065 -104980 -174074 29698 -199372 -83216
9094 -9870 80042 -7101 200203 -178773 -106291 -473949 53964 -54423 -102184 -36097 -143784
9083 -143784 -508719 71993 161457 22493 113273 98634 117283 135319 -64876 -157667 -22933
9071 -25033 -10258 101875 -4857 193890 -169481 -36068 183197 41414 -46904 -267137 -81760
9059 -14265 -268403 -190339 96584 12436 -89578 55500 -278922 85407 -204134 212587 -114266
9047 -47832 -166781 -73248 108371 -163856 -27537 32441 45498 -222928 42342 -140965 -64724
9035 94287 -194963 117255 104877 209779 -194573 -66827 -189174 -352146 -120772 16821
9024 -116263 -180361 -99414 268598 100772 -37773 -147478 -294517 -4387 -104029 -208369 10477
9012 -172305 -196033 -49900 -527564 -572522 62026 39386 62006 -275757 376090 -93187 180216
9000 -176083 13929 -104443 25038 35890 -147420 -57046 86080 -35872 -279783 -237570 -45561
8988 -287603 -317240 307280 -251007 270664 307399 2596 -86198 -41206 -66189 -264203 157559
8976 297718 141541 58449 -197205 -115194 113275 102519 -140539 -189543 142218 242161 186161
8965 186161 -268865 -153738 -145466 -171344 74303 -129645 -628563 25609 -343258 -16222 3448
8953 -15807 -317070 -73698 -137807 -248844 -148804 66324 -164831 -61800 -121762 -375600 -453321
8942 -453321 242873 -136213 -93320 -232932 36376 100288 -31944 -29175 -16876 -2968 262775
8930 -53018 90889 105988 22979 13778 -195276 -61030 -236909 -224020 249803 -16978 -13994 1242168
8917 644755 28545 11017 -146437 83949 -173819 -86578 137868 -206674 -158004 -188653 -175341
8906 -175341 -505 -355625 -22129 -168891 53292 -341709 148994 -373966 -131385 70968 40906
8895 40906 -167530 -122115 -45082 -87900 210802 -108671 -71025 -117487 -5165 -181714 125223
8883 17658 166218 -7951 -229028 -148162 39674 61242 45697 148759 -28432 -178869 310967
8871 134579 -248210 96976 -235447 -258313 232171 70077 38779 -137502 -63175 8084 -258652
8859 -385144 77526 39780 104739 -4585 -88882 296397 -51803 -133989 -205261 158564 -18667
8847 124229 171058 -49292 218100 -86764 -49488 37008 -81473 -193906 -312205 211952 -203246
8835 -269868 -101161 -229125 29996 68756 265351 -44923 111969 -17988 92960 26406 -83786
8823 37406 -244381 55820 299509 -171416 7955 38058 115962 -84372 -221968 64081 23799
8811 222418 36318 207 -158279 -122402 -91924 83679 131202 -391528 168236 -161927 -133939
8800 -133939 -139241 -250437 113852 -235751 -424862 265963 -236742 -68653 -71511 -256980 90741
8788 -18247 5766 -21026 -220333 -38273 -189779 -303225 -76473 110618 -28028 -66407 -16437
8776 -105466 55941 -139408 -1931 -108396 -101937 37461 31966 -84868 281987 87637 182375 -43881
8763 75911 -133464 -247435 139479 -131781 47661 -108378 99469 -167909 15434 90815 267045
8752 267045 201034 237158 196836 -90594 -53142 497907 -93836 -114073 21688 134650 73091
8741 73091 -193174 -121712 239986 73699 229724 -174715 -71224 340681 -332270 -247732 51395
8729 -47052 -157770 -311824 -38191 -107054 37520 293567 -63004 -62740 19341 89723 176462 188522
8717 188522 -80388 243003 -179512 -121775 221231 63127 -83116 -30278 -233440 -268289 -424537
8706 -424537 -164296 -127335 -25876 -58313 10124 -151774 -97238 -8713 -63401 86423 -217751
8694 84240 193000 -61006 94285 158514 131880 -386561 -182365 -254468 -50501 -235632 15858
8682 -25997 -91702 87444 2676 -169730 88799 10217 113172 -113260 -647078 -401538 -154066
8670 -111786 131732 -47771 303521 -89343 160079 -301073 153418 79419 311515 -112288
8659 -124049 230979 32310 145328 84085 45408 10368 -96326 211893 -39028 385409 310534
8648 310534 -410378 -94119 -92973 203629 120124 -87897 -250313 278967 -119021 201122 -72319
8636 -447444 11602 -512812 49991 -270220 -62889 -98098 -177753 -162674 -19411 -49875 -230800
8625 -230800 -33680 -223995 235115 307923 72435 202893 -168031 -7472 -406194 -228530 27486
8613 -39919 46168 89073 -438312 -183962 165069 110135 102290 87868 -102622 192772 -108959
8601 243961 124060 -309303 -338679 -203709 -55567 -221454 99207 -169484 112422 -4083 166827
8589 230811 -61948 147274 -201739 -136497 79066 46175 59003 194455 -42998 139961 23502
8577 -234420 -291834 -6087 -90199 -226808 -262160 -138798 217220 84095 29844 -99534 -176816
8566 -176816 -159570 -37512 -11049 109414 -515724 -116852 -347466 -57723 -245753 -71448 28121
8554 186633 15288 195226 -92563 58935 8557 -133796 -230455 -99959 148778 65124 -9165
8542 26022 26772 21775 -86151 1455 73514 -215497 105976 -35579 -133519 -101490 505425 63595
8529 255702 -281220 -136126 -181992 319755 -190752 -133307 -93620 119493 -103676 -199430
8519 -199430 -130257 30785 20640 -282334 -205124 75398 -225467 73393 -19645 140727 211756
8508 211756 33241 -65146 10670 -77032 -103155 -178684 -320558 95788 137784 -115046 -230622
8497 -230622 -159362 -13235 -190874 -16635 82199 123745 -26149 -276495 -352508 83378 286925
8486 286925 17176 49188 -53625 -82430 -119237 99626 15745 207053 108109 -132583 133427
8474 65705 -296810 87060 -381232 -288102 121991 -406454 -4414 19153 -346613 -19882 -196314
8463 -196314 -30608 -220432 72133 -118785 -320976 -141150 -56469 142416 -68020 -29431 -64174
8452 -64174 243623 -112543 -137117 25266 -180404 -235502 99602 -56024 112230 -64566 -115584
8441 -115584 -91243 224560 -430460 186033 -36554 166424 -113401 -120038 235472 65396 19811
8429 19921 71538 -112679 280675 64865 75288 -106977 -109476 297827 -39752 29869 65705
8418 65705 239649 -192864 -23775 28439 -27894 151182 -58308 -119747 189801 -82291 -321869
8407 -321869 242 -179396 -79526 195146 118670 62763 91129 -224877 55376 37130 -38356
8395 -152059 -252025 -125983 -53620 162932 61427 -145002 24721 -55847 51312 30757 168684
8384 168684 -244083 -160462 63247 79768 -160697 96581 -107473 -190363 -343734 -114862 -293538
8373 -293538 -22137 22122 100997 -141502 463946 24199 -149977 -161169 -98520 -77963 141952
8361 -117747 25761 49134 -421742 67582 -60911 -344524 -28335 64009 244462 -218575 -149365
8350 -149365 -39113 219772 7461 -285430 -5290 -89887 -64910 -161130 -276834 -104917 -29824
8338 56757 -111638 -76824 -56924 177039 126427 12996 -329110 3839 201776 -27694 77874
8326 42000 29197 -116273 84948 -227815 -160326 -50923 382613 -45671 -198820 -115530 -102961
8315 -102961 187213 -252257 13230 104174 181658 227943 -94094 22177 49776 -250493 -13543
8303 -76072 -205721 -385884 14645 46966 156757 23338 -79558 -74984 -332344 290723 124531
8291 89920 195597 14811 -68230 101 -370841 260095 119580 -55489 -227345 53637 14753
8279 83432 187083 -362385 -289625 620043 -396389 25360 -3646 -228124 110431 198590 1558
8267 -334050 473578 -88444 214199 -72490 -184188 -147040 14451 275706 267441 -117848 -162670
8256 -162670 213910 -268323 -129205 180784 -118917 711 -190522 145754 -34847 -276054
8246 -276054 -49537 -149158 -92858 -344406 68615 27224 -342187 183512 -78674 -134861 -112773
8235 -112773 -228574 42879 -16541 122362 214222 45272 19191 -35696 3320 -64203 -258712
8224 -258712 -45661 -57252 59847 486570 -132165 153980 -322897 -297480 -20269 20055 139836
8213 139836 14669 -41479 -181556 346421 154036 -224586 185929 250262 101770 -121327
8202 -109513 -84109 47274 24059 -339513 123338 16641 -205892 -46345 -332164 220418 -45149
8190 -131625 -29554 -86927 172036 208592 195974 -62848 57127 -184711 20521 -286841 -264098
8179 -264098 -128229 174534 -118413 -240604 14618 -52570 -249525 -344812 -66250 -105945 162858
8167 24066 -316067 -76134 256586 34809 -114777 -284624 -12961 -60244 158188 83056 -124582
8155 97833 -280092 -12839 -124314 10517 39104 -104417 8327 135449 -9338 -112693 -208790
8144 -208790 26655 -59459 -186967 -205431 -38207 -217778 57999 55749 34682 44887 -311319
8132 2739 -165747 -80901 -13799 72342 -176328 -66887 -303088 12210 -120578 -216144 -252712
8121 -252712 -233105 -124476 -83162 -345730 -180277 56395 -369648 7712 158311 -117348 233132
8109 154000 -87064 -55074 68756 19264 23208 -89446 9388 -144332 -71930 144305 -147255
8097 15357 -193486 -163981 5230 -75897 74049 -160231 -229871 -188079 -206604 125674 40644
8085 -229051 120565 -48112 61806 -12339 -63857 -235044 -121873 118930 -199212 99278 186646
8074 186646 -124074 -18541 -31059 -114481 224545 -290970 -341551 81133 97990 170832 -301436
8062 106136 140883 36858 120740 136097 -141675 -347000 -343621 58476 74589 202184 -89924
8050 4136 -147374 13793 46223 166612 131690 -308515 -117499 -145583 78657 30984 -103793
8038 175250 12250 -114247 -176059 -43197 193968 182078 -279650 177240 -87770 67498 -43078
8026 -14640 55999 -9407 73394 135655 -189486 103107 -253509 -372171 -191889 -128772 -9666
8014 -153752 -222523 -302328 166354 -22311 -73006 85155 95823 -351758 -135399 -47825 274515
8002 -237419 203121 -25744 39436 6594 26168 92373 306840 -447639 -77297 118287 144855
7991 144855 -383 -78817 97765 231753 -325818 21848 -411001 -347141 38798 -438612 44301
7979 -671014 90264 159207 259299 155353 -153000 215605 -185103 239957 317494 9512 137390
7968 137390 -150952 63290 45354 -148642 170850 11300 -50795 -21840 46089 -100167 -98542
7957 -98542 49170 -16200 -197899 1627 156049 170436 -163836 -164355 -380613 -12800 127402
7945 24573 8094 169603 -265943 17691 -125215 -110109 -135472 132039 79680 282399 69468
7933 -77873 173627 82794 -101957 -270373 280228 -148312 99219 1530 134825 -6041 21982
7921 -181533 96550 185455 -260541 -154985 20424 205397 -211556 130264 -217322 -263172
7911 -263172 -291251 -210404 -10791 -174445 -68195 -264770 -82714 -146953 -111336 9548 82289
7900 82289 -359621 -100749 82925 -64080 -238805 44138 -134727 265280 -45445 -63730 213632
7888 -85148 -122587 69307 -97798 -9912 -19010 -110877 -57674 -259432 -108933 -180819 -104857 163781
7875 -53438 -15520 322113 100221 -81375 259275 -92817 -247813 118519 -3593 130392 -75210
7863 -63655 -17646 116285 15470 -294108 -24981 99073 -144417 300439 115999 -208952 -292375
7852 -292375 -33361 -74204 36123 -168471 111152 -131618 152764 147080 227741 -63887 301472
7840 225029 30353 260574 -193366 -111362 729 -253672 -26103 -121670 -97218 354329 -307033
7828 300216 -26075 64555 -86845 -94532 -21450 -133911 -160426 337081 124574 -61255 329349
7816 -144560 -19969 -222248 66115 -62099 162129 22194 -40502 -31759 141289 -283167 -72457
7804 -120602 -416502 -82390 -225067 341657 170666 -428443 -81736 -209829 175210 68645
7793 212805 167457 163155 56374 -292077 35305 135755 -204811 -160913 -83627 -350437 -51412
7781 363944 29512 138541 -201908 23912 -159424 97579 -130758 23562 182167 35943 -261282
7769 -73434 -23361 -174068 26801 -46708 8996 93806 -104460 -35384 -294958 -209167 -22486
7757 -99820 3635 -82973 -85525 -135194 -163304 -56077 -277987 -116628 -104890 -122368 74743 -92364
7744 244098 104725 -520406 195651 143504 -180290 -15186 145735 211381 182046 -155658
7733 -38128 103640 172926 -455885 309480 109574 -363418 237558 -18726 118665 25827
7722 -62295 99928 -242909 -123035 -45031 -32129 -22560 -196217 -3117 -207633 -298622 146455
7710 -45740 123865 167196 -74034 92344 166003 -359964 -56250 140316 -349841 121541 42807
7698 70051 -205467 -157057 -50891 75537 4801 -114777 398435 241550 120575 230309 206759
7687 206759 -229257 -68559 -348666 25935 6229 84711 -173284 -406452 -162511 67863 -155395
7675 50380 -88561 2776 115888 122985 -49439 146033 59567 -48078 -109665 119181 86401 97840
7663 97840 -44527 -67066 18985 -41153 -160253 -44274 189527 209447 297268 -67065 112981
7651 -342089 287887 -212699 -128816 4921 -81788 -273172 -303938 -24801 200216 -107229 -150897
7640 -150897 -190973 264052 71534 265036 -58865 -189367 -237110 -20621 308108 30572 51255
7629 51255 324667 -314899 -147825 -162777 123779 155988 4854 -240555 -78453 7603 8389 32911
7617 32911 -136996 -70645 221479 117305 -82629 -316791 170761 203817 200174 239805 -461295
7605 65957 -5064 67190 330273 -100767 -93923 11593 99300 -117971 -120993 -223108 26369 -154311
7592 -377863 -57918 37715 -365539 -248686 -560022 63974 148433 -83145 -58007 -109562 38080
7580 68308 -186545 -15368 72788 -214813 251035 -238642 74312 -263689 304608 -151907
7569 -246203 -158909 -150485 41928 -159445 265168 -216042 724 81533 -178838 85157 -45064
7557 -9587 5712 -43831 321899 -154444 379646 -83467 51343 -34841 -149044 -177491 18764
7545 -438011 -151113 -140297 -17038 -594157 -263332 40165 -19026 -294799 85150 307316 -88303
7533 111909 -6494 -286058 127869 299045 260031 -122004 -53858 -210344 -286540 129137 78041
7522 78041 -296423 -16322 -204910 -24519 -134109 52345 288904 140465 -138956 62588 39147
7511 39147 -191595 -230859 61785 -80064 -185713 105048 -199538 -154506 -123565 -156082 -215320
7500 -215320 -45936 -216367 -99172 -218929 -93274 77189 -267724 65800 137913 -31124 -199427
7489 -199427 -135231 -122353 -166809 -157919 34870 83070 -12742 -128969 241641 12532 131576
7478 131576 -39498 402294 -305676 132364 -158503 -247137 -91294 -84093 -24874 43075 188436
7467 188436 -18588 222577 56727 249542 -110934 -442871 33270 -144624 -266116 14574
7456 -350482 -185151 174675 -168523 22733 191505 418036 -2659 -83731 99469 48474 165282
7445 165282 -56761 159886 -20159 -24204 -59379 -12180 117762 -17818 199222 121783 -51094
7433 -55314 -130148 -129953 -20752 147137 -171220 -83251 12904 567247 243291 62980 -40250
7421 107769 313064 41881 153418 -66795 42073 -82543 103485 39467 22062 -107388 -48216
7409 -259498 264738 63614 -352756 -149634 -423670 -107063 162172 -235696 140513 19957
7398 -77955 -199292 -37615 -99596 68279 137532 187646 -112717 -121407 -246056 -41838 -186179
7387 -186179 -30838 -15845 267042 155040 167879 -64680 67184 100208 -209430 156413 -31275
7375 97954 175927 -126708 -21717 338994 81514 -189750 -27223 78740 -79769 49106 86391
7364 86391 105377 -87161 -142536 76093 45696 -133534 126873 -82903 -41714 -88781 -46791
7353 -46791 -162178 -177130 -156320 -110270 94488 -237701 244954 34563 -164978 -159693 204649
7341 -296012 65076 -348877 -29392 -95638 119075 -13664 -260244 236946 -4984 127366 -220524
7329 -188153 74941 109473 -117260 -50739 165063 187234 236463 171691 -217774 52674 -199303
7317 51044 -249769 69496 -40401 -25951 -336142 -239663 -127478 83459 -167416 162213 -40840
7305 132310 -509110 -196569 240169 24204 136861 -309175 459832 -227773 56693 93050
7295 93050 -180468 -115747 -175174 -119784 -245165 69045 -462407 117703 202101 82197 5167
7283 -5751 -69985 -100090 69008 -387153 162555 -264597 -11002 -160108 -131797 -196219 54653
7271 170646 -71488 35559 -323851 -199610 -93560 80309 129596 -116402 108470 243650 -125345
7259 -153428 123851 -41575 -27084 -138992 -433886 -46506 44024 194155 -78495 38996 -150557
7247 -145261 107287 157541 100393 -220953 -31057 -327119 87018 -158106 481366 126627
7236 220391 208559 154703 19437 -133716 -219739 36634 47402 26435 -244681 234808 141780
7225 141780 -205445 -248733 75087 -113647 -68763 -346519 99472 51556 -208832 -36150 -90173
7214 -90173 -67071 91170 -153429 176691 -90947 28695 -17700 -135147 -37291 -80157 201097
7202 31488 62347 -239912 -343473 -197823 -80041 -14805 -474170 44361 -20631 -182429 -28260
7190 -106053 -7925 84597 -203953 151542 109320 -24863 -4235 -164146 190594 -308076 500403
7178 234938 -131185 108511 -139782 -108791 -277061 106729 107242 -99943 121782 -47696 -160178
7167 -160178 65801 230787 -153055 -57060 -143200 158859 52071 296825 -87020 -133028 318926
7155 -154836 79332 -21126 -166743 263232 -43231 -234859 138980 250292 107953 63439
7145 63439 127172 22061 -70235 -128739 111088 133258 64364 -107022 -43709 264764 -14231
7133 91545 3455 175691 -87475 -344679 -52752 -141483 28349 65043 -211497 303245 -139077
7121 40784 -21519 -224163 136909 -80473 -274439 -41906 -92114 -82931 -59298 -72308 232319
7109 -74008 36649 -140583 150106 32447 19237 -57871 -153189 3235 -116222 166076 12695
7097 172445 -35364 -52387 30620 -99050 211308 -71197 -118521 -48731 -21985 -307851 130017
7085 -3654 113584 -192559 38556 81888 141774 -271978 96923 125338 -191822 -174254 -61553
7073 129722 -73980 86655 -296695 136435 -47737 7450 -305246 -142528 131660 39965 -524499
7061 120158 -65809 455217 -167943 288484 -239363 4173 -11156 51636 -216437 19692 -57628
7049 -462360 -118101 -109954 269239 76579 25094 97052 81341 -150397 396951 -102366 -299023
7038 -299023 146056 96120 -214079 -81510 -149672 62850 33461 31705 -163786 16097 -17954
7026 87608 147220 -209903 244308 -94344 -175621 85791 -73690 -179809 -61791 -32710 240119
7014 212892 83076 -23125 279398 -244436 -46400 198653 58797 -255640 -57683 -140533 -55002
7002 130807 -34336 -111126 -58964 5594 -460159 -168001 -270982 -114206 -57527 -60255 187348
6990 279524 8023 84779 -153315 23720 3205 -84538 214541 71744 125959 -31019 38047 122020
6978 122020 -123007 -99212 81097 -9730 -139129 -66779 -259863 -187639 91623 173588 -46970
6966 -174286 -123941 -25508 -53778 -53176 107375 4350 -135292 -390930 -36202 80121 22793 -193447
6953 -265053 -271766 349 -26129 -12591 -357778 -165154 -414325 126960 -96587 -54304 -346973
6942 -346973 427032 99232 -33077 137865 134634 -114244 -8931 29048 176466 58507 362781
6931 362781 247666 1589 -138353 43417 -1070 128417 90477 -236641 9549 50605 70701
6920 70701 -229967 79043 97566 152820 111631 -19364 172555 52710 107273 26370 193117
6909 193117 120925 -64432 -23105 164493 176679 -82935 110820 2024 10454 -275527 210443
6897 12094 -27256 -154193 -156395 168537 -119660 34689 -70889 -19763 -143153 -205362 -71625
6885 153551 39198 123229 -36975 86070 247565 110413 -416906 24692 141782 197622 -189002
6873 -92473 -9027 18816 -207833 26279 -51686 -252862 -44794 -227067 -2091 12436 193706
6862 193706 -51063 -23243 97193 316792 -45101 45573 -183549 156471 -30700 134877 70243
6851 70243 -81619 196261 -102526 -60718 -175756 -161895 98427 73532 156996 -87119 234426
6839 -42468 156144 94913 -48979 -43372 78528 429053 3183 -113943 -243237 -181634 65919
6827 -121344 38968 254682 231971 -214892 -199099 -61600 12785 271281 -179492 46537 -339210
6815 -9528 4733 1833 -352873 -244844 -63797 -405627 -126212 -100463 192391 -68605 47487
6803 43909 -62782 -227016 38753 282849 -102024 118762 112587 -196536 -173530 -122161 -95714
6792 -95714 -102510 119478 -104215 71651 -257707 23868 20464 -189692 6099 87494 816 -159274
6779 -47986 174713 10719 -51569 -244890 232271 45633 186074 -111841 890 177837 235145
6768 235145 -76136 -166120 52595 -102616 -32628 5950 -237543 -478030 -13448 10900 -129022
6756 -369014 910 -153877 -149093 -208019 -96657 -222953 -164146 -176704 -65912 233042 31581 249263
6744 249263 -259607 73712 -128973 52914 88688 -71705 309735 -227875 151180 -108606
6733 148518 149021 152723 187003 -176431 -49277 -114905 15229 -198034 10259 359771 -97260 -102072
6721 -102072 -13903 282366 126357 -86737 204958 -258996 12639 -117688 -203951 -277375 -73425
6709 25776 -201799 312409 -88181 116012 -119421 385738 -115094 133358 28574 16735
6699 16735 -13298 -231031 14792 69471 -252260 -8306 -175487 165944 14308 -340692 164440
6687 90476 -272531 -232344 170241 -112861 -336529 -80749 154727 -137218 52582 148422 68258
6675 -79030 -332460 -375314 -81626 269604 12041 288596 179314 -75647 28589 77959 180306
6664 180306 -141846 294201 79142 27605 12958 -43336 -121034 -138024 -151592 98195 -381187
6652 -84348 -9115 -68462 56429 56105 109493 207481 51439 -145592 -127605 201558 -219108 -130587
6640 -130587 -255443 39868 48780 -25131 110999 -169846 -218849 81758 -72634 89533 -104129
6628 95880 -253321 100928 280490 -145270 -138804 -418638 -12019 88356 -365199 -138490 -67819
6616 30861 -477818 138589 55136 184281 -171882 -191127 -362505 -118944 -182374 -26476 -56198
6605 -56198 -20895 -234777 -415667 190498 -59360 32130 -7864 -129446 -228214 113616 206412
6594 206412 117762 48458 28734 9531 176645 -14049 251050 -176955 14578 -99359 171515
6582 268691 19328 209984 -33807 -149889 344593 -71111 61890 -136859 288697 -293845
6571 -12352 27637 -53887 -99535 -89849 120130 219548 -178312 -52786 -7106 6356 7963 127852
6559 127852 -48864 -191380 -121269 -191434 249654 -358502 50733 -219636 -100262 166784
6548 -51386 -6690 249686 324924 -125329 -316186 154605 -84097 -62955 -234124 -92725 -141077
6537 -141077 68628 -293958 -127771 -154923 -195550 163114 -100015 72470 62345 -260165 -233182
6526 -233182 -16546 152085 333870 -114177 46322 -216870 160301 61246 -309226 -52333
6515 70395 -203175 -195770 -31714 192343 29616 82422 -40375 25212 151354 -4277 161318
6503 -23708 -52058 -25601 -146795 -178072 -57053 -70540 159635 -268293 96723 25830 35077
6492 35077 -244657 -3344 -121107 -41148 294587 -338954 -169134 150522 -99665 122033 234858
6481 234858 65485 78131 -4410 79681 -135007 43921 173968 -97073 222178 129533 125404
6470 125404 312676 -174124 -2097 207389 -3010 -364137 290058 -1065 -15387 -167567 172049
6458 421097 -228919 -2763 155107 -16004 -74575 -21969 105212 -427769 -163106 -341443 -207463
6447 -207463 36412 70579 -72768 112207 156238 -231096 -263648 -217978 126846 112001 -228643
6435 235269 183057 -40536 -105205 146933 -8292 -122683 -42274 11319 -209090 -239046 -231431
6424 -231431 -151052 -33378 9540 -253536 -36863 56976 293048 -29955 79170 149865 296352
6413 296352 -455726 177434 -235008 -74332 -226840 21397 200003 140807 188213 70849 188783
6402 188783 287596 -122214 137100 -142301 76782 -149350 -358945 113263 138947 -493789
6391 -48689 -188095 -31218 21334 -157338 -418955 -90729 -123605 41923 -4764 -183855 -239599
6380 -239599 -156843 -264298 -392 -33137 -208643 -78922 -63583 -91705 -126650 222482 88749
6368 -92340 61314 22335 -83170 -206391 -365714 139598 170990 17569 301090 -279572 297207
6356 -58521 262741 151837 -203472 -12047 472544 -54455 -249971 189268 -198111 -347975
6346 -347975 102179 220820 -94815 -339609 -223599 -146253 170519 73319 121948 63710 269848
6335 269848 -178099 -58620 -13869 7155 64964 259310 -186602 40628 -122609 92757 149036
6324 149036 -17633 6381 219520 -346644 -166858 -123333 51180 -20639 -96337 -34214 -287505
6313 -287505 -99843 -138273 164099 -220877 43349 115260 188476 17418 88776 351111 -25208
6301 -26662 54056 -83331 156185 253047 127209 35123 -128719 -393057 -140638 -142688 182223
6289 -146127 19023 98425 196442 -189066 -38648 140508 -445043 153430 180226 -112532 -105592
6278 -105592 297153 -211893 -23418 190484 81149 108189 98228 91889 166969 4531 -345175
6266 -150605 -13909 -205046 -147205 -475823 -256983 230143 -107471 22722 176033 -121555
6255 24736 147972 -102303 396876 15551 98258 -155457 126800 -137557 125014 -185815
6244 -64243 -161422 -82486 232370 197558 111995 2086 -56940 -44941 151311 11372 -61805 18541
6231 50051 57868 112029 17324 -397179 -16805 -47454 -272871 217385 79119 19205 -122637
6219 -314130 -167931 163041 -112848 225290 224559 58108 -47414 3265 257500 -46135 98154
6207 -134064 89319 279717 171768 52334 125707 79524 -28930 -36615 -185122 -274235 -21163
6195 207504 44229 5502 -6133 168890 148033 170192 -41615 22701 -5403 -149453 -290538 8939
6182 -37068 -83932 -20355 -18997 -10975 -231822 186292 1079 258865 -91081 -140132 151285 -313036
6169 -235909 -184883 1777 -182808 377517 103917 280421 -264564 256378 -30564 -63910 79607
6157 -8484 -49038 17675 234939 -173446 124556 -326404 58692 17202 -84396 95070 -236785
6145 1656 249630 53102 -125719 219142 -32285 -35500 -78403 28667 -19455 300528 29380
6133 165628 -114037 123801 -68882 -8275 -149591 129298 66696 -441686 -160865 -35069 336906
6121 211981 25892 271917 -255643 25700 149054 44292 237095 320258 40317 22462 130685
6110 130685 -132627 60720 -171796 -198771 76155 -9375 -3305 -170314 53254 161851 -53720
6098 -123075 -132233 87853 -104311 110062 -313373 30477 -151351 -249874 -9841 247829 194926
6087 194926 -195674 -70617 -35535 148284 81538 44997 76453 -127679 -85113 58229 -90859
6075 -265242 62421 -178033 -35178 300865 84158 -262338 -3748 1482 -1433 -139292 573 228152
6063 228152 -243910 -264583 -66026 -371206 -345260 121510 -274360 -402068 -31458 221215
6052 41739 133138 260393 -158155 65711 -151724 -63564 23714 -501248 -34374 35696 133795
6041 133795 -121628 -2744 329981 -96018 245960 221359 76955 190708 -184818 168401 -129583
6029 389388 -11271 241362 -118964 40133 198768 250272 108414 160973 -54936 -167542 -23471
6017 262151 -63174 -11793 -73649 -265849 -133341 -54322 61313 213127 -114446 23575 144839
6006 144839 -196815 -206762 -114523 -120486 152591 93934 28552 247443 89738 -25823 212977
5994 137262 -148706 -237146 -94074 -148852 25800 77479 90742 145156 -144230 24243 107677
5983 107677 -60169 -162556 96779 364971 87515 -151277 -151724 334814 45382 306461 42170
5971 86053 -101019 -183266 -189604 -142084 -20789 223389 -80540 211981 121055 -30407 155559
5959 124979 -191141 -153907 -122599 143684 106095 -271482 126405 -265318 -34385 -69700 301570
5947 -211400 -82548 83896 46343 16392 -92346 12871 -87382 231598 68786 86111 -399258
5935 92581 81568 -29750 -6200 159944 231439 83638 -230880 -104100 -41503 -138453 61785
5923 137111 332769 42815 -158528 4588 29650 66725 -193859 -198623 -189437 148056 -255350
5911 53181 281593 294299 85979 -160309 -36698 -457264 -357481 77317 269629 141072 -122681
5899 -48247 -22368 242435 -96450 -2924 337535 63102 -95203 -32873 -138871 86437 -204075
5887 -101944 -9618 109861 186347 72125 -149193 -134845 190712 -99776 46863 -21976 -141720
5876 -141720 -56235 -317416 -54217 -150209 156890 -137233 155575 -115859 -72622 49306 25062
5865 25062 -224913 -70016 -99839 173491 -183852 84694 -86964 20924 -20831 -23758 -35869
5854 -35869 64871 -97588 -30612 101492 -101476 162337 325321 15105 -127831 114380 -156717
5842 183867 8096 1042 20879 -8939 367631 -34870 -352783 -400001 -36158 125662 181809 -13242
5829 -80666 65896 124980 100124 -321996 -152450 108156 -159697 165982 -54680 -183460 -111416
5818 -111416 194369 -271469 -381807 -162510 46851 141780 -216465 246855 -166634 38182
5807 -119752 -34388 365746 -190540 -74037 -89259 -47834 201156 -167429 84462 -86330 169975
5795 -244923 -114835 -90669 122040 165426 39204 155575 171553 -335860 -3129 -392562 71466
5783 -56643 -107430 -189965 -154635 -63061 93295 -56613 265117 -253274 -131673 47513 39975
5772 39975 -144066 328684 -120552 285670 281570 -33881 113871 -262082 6493 31448 -19479
5760 -108217 -131733 47162 -34949 -93061 63963 -191918 -337002 233565 664415 128008 -25895
5748 -191217 -69179 142514 -146884 -235523 -22826 -130835 -34526 106181 -144128 316612
5737 96333 23131 -228149 -176796 -152216 -203422 -199395 19114 38215 -82114 -114281 -53595 144427
5724 42873 84808 349634 26400 152048 146516 -53422 -133742 67782 5654 -114508 -37697 -83444
5712 -83444 116148 -123036 153223 170370 182066 -399374 33648 -247250 170498 -377569
5701 -135164 -48294 319096 151616 241071 303875 149922 169772 238694 340033 96573 72872
5690 72872 75700 437533 -44486 104940 -261473 -235847 124092 -94315 -91197 47498 22860
5678 140852 -46873 120577 128979 270783 81184 176914 128721 122493 -132181 -199647 -214961
5667 -214961 142837 73139 201611 94542 -98729 -217350 267985 81288 -192027 13681 -27181
5655 151962 -92809 -33425 -74006 -258556 -417333 -379922 -130551 -45977 -194853 -221662 182494
5643 -188619 -120545 -5084 237320 376822 -57420 -68256 -266685 -232976 -183677 -80751 -164908
5632 -164908 17735 -6076 92866 -74138 210597 -61474 120664 -32593 -109885 -264322 -33632
5620 -131666 224891 290134 271691 -326878 78836 460487 17541 435765 -127649 79688 34449
5608 -137831 104034 90869 59281 -3709 -85782 35166 -173397 212707 -380256 -199315 -58384
5596 64156 -51662 48107 -233841 -83327 51506 58860 113394 185364 7192 -130063 -57073 -76711
5584 -76711 -96885 185173 -203437 -14806 83669 -307789 123639 162692 236006 -322550 -3392
5572 -332275 132848 17824 -118477 -189653 -44097 -327343 -176262 -460875 -1728 -227750 40197
5560 -68765 227226 -3492 240141 -18470 83299 -197380 -3863 56367 29492 -152356 -12667
5548 64253 -187723 1572 242267 396407 213204 390327 -58816 132272 -6627 -28085 -47582
5537 -47582 -144073 189662 80410 164152 -189812 -332248 12422 59279 -46293 59457 306022
5526 306022 216696 -9113 2441 172118 -168073 -41175 203840 -280835 269033 21987 -8423
5514 101522 55331 -117301 141792 -260388 327050 -121140 123822 -88991 201774 -393810
5503 72720 29196 -61989 -4040 -50361 223262 62881 -47503 -142218 -64372 165131 -25716 431544
5490 -56527 -78469 -118840 -199301 367856 -19153 25184 -208271 -86531 -138961 -146535 21901 -81504
5477 57209 77352 451609 133583 78538 -9794 -109792 32267 36817 315592 -146688 273914
5465 -73729 369507 -44335 -210675 78717 -51633 -44351 -126266 178979 59307 -45886 -260557
5454 -260557 -210127 -163556 -292992 91881 -273693 88073 148787 52553 76845 185249 -294150
5442 229613 100839 246818 -606 -138334 -137495 192447 59917 215663 12714 -108408 -62801
5431 -62801 108964 25659 -20044 -26191 -2531 -180831 152703 -57218 217316 11644 -354210
5419 119261 -154772 83072 224065 -147133 44095 -41257 -54564 302257 141694 -62218 -75765
5408 -75765 160014 164800 83281 180644 72231 -16764 -47332 119201 -217747 -348621 160 -49763
5395 -247867 -108172 309301 -167434 123220 -96044 -91227 -102764 -39628 -160193 75773 -557732
5383 252587 -72073 37256 53008 390056 -18516 242143 -173685 22936 -314748 169074 18696
5371 -80569 1919 -189622 92099 29731 179619 21801 122341 140647 -269704 4968 -22192
5359 -102745 -133231 -153012 -261056 -68865 86032 -232721 143430 -239184 102363 -139402
5348 111319 1683 184962 11003 -21428 260542 -16391 112308 69218 5511 275599 -129211
5336 -171282 31388 -24444 31956 -63622 153986 120425 -173365 -112071 201673 -333737 1784
5324 -116900 -155060 -222326 -188394 -123140 63873 -87841 248941 448171 -199742 200053 -25421
5312 234491 1472 -90207 268013 150925 102381 -96414 -99408 -31288 65649 351018 -198098
5300 -52839 -24102 -157977 40287 12292 306284 -7734 248492 250890 -86637 99112 -53667 -37360
5288 -37360 -266414 59233 79098 -98242 223563 332015 -131036 64089 -64769 -293566 -26662
5276 -326397 -101649 -152176 -182845 67015 -224632 268560 -167802 244916 23086 210222
5266 210222 21722 -99457 148848 -22977 14841 -35301 -224792 101346 65804 70228 -123748
5254 16134 -147530 59071 -64804 72602 57142 23869 -160576 -119822 -62040 -139918 28544
5242 -105954 262539 33991 -101352 91100 -35549 30586 9695 211280 1448 334882 -81640
5230 32823 -237308 -132670 -66594 -138093 -123635 -15557 12104 245323 200465 420973 227213
5219 227213 184848 233806 3839 121925 -11805 -176834 34725 12374 14801 88478 231668
5208 231668 -124760 -62099 -62955 131978 -213916 -417006 -136783 -156464 171293 165684 -132783
5196 111835 -65979 -124829 270879 137509 -323878 -16892 268215 -16118 43474 -372836 188570
5184 374914 -23356 42553 -56462 -82040 296661 211272 -1061 -359196 37401 -40592 -35212 -51981
5172 -51981 -76373 170153 137079 -214937 305163 5818 53718 -38868 -39636 59943 112236 312013
5160 312013 139333 128607 90244 133483 294453 -34645 21034 57667 16872 765 -69160 220
5147 19342 101569 -48417 242434 264989 73702 -38399 -190784 -90644 -185873 -80697 310327
5135 -126402 -51724 94993 59731 299403 -217717 10927 6430 -101708 82204 -11078 -212797
5124 -212797 -106916 82084 -75488 35969 77617 -109615 77686 56698 106754 268128 98521
5112 -125339 -48744 -82356 100525 -294124 -64999 -290089 176842 206891 21033 -56003 -127901
5101 -127901 -380587 94233 -7718 -92541 107115 32861 -247874 -87129 53531 -72474 84790
5089 -61157 -92651 -49150 280679 59249 -146235 -177156 -36227 61875 24854 206483 88956
5077 43537 170475 211480 36507 169103 -65533 125282 -39983 -274376 -159711 -131771 419325
5065 187125 68996 250101 -116430 201918 -117355 121540 -42949 148559 -92443 102088
5054 120846 221335 254713 139786 31564 -77374 -29437 122206 -153070 269481 200742 -180958
5042 -176598 40634 -46748 -145987 -227566 196829 -135816 -185195 290450 -421259 597 113818
5031 113818 -221753 157702 80012 -142968 21555 -218099 57044 10413 -217758 -44736 11071
5019 407274 11504 -159723 273504 -284030 184650 184850 -201930 92900 82016 -51256 46124
5007 -230389 107251 -13201 -136246 -223355 226484 -309541 -97880 -375447 80866 218281
4997 218281 -44168 76951 -61994 -184525 47058 -182994 148431 207391 256527 -33196 28966
4985 69266 193860 -43246 94094 43244 243440 172393 -136958 -218826 125996 66705 -134510
4973 -138182 147021 83812 -301954 104336 68632 80921 60625 -187281 70058 148727 -269559
4961 286732 4322 291961 -214286 141997 -50044 -5184 62243 34361 137397 23151 241621
4950 241621 -279805 -206934 427771 131055 60527 -78969 -253895 98789 35344 32096 -62342
4938 -94913 8706 126014 -54122 202243 341318 59923 -3404 -39144 8125 83356 263412 -163830
4925 -36312 -20876 295586 9421 8416 84629 45667 -79362 -53500 31705 135078 -11109 -128289
4913 -128289 189121 175229 90248 -21301 -72419 182988 21542 74884 -62199 89411 -350112
4901 305257 -294247 79248 -1083 -164931 30469 -152356 9803 -123148 11104 38337 27164
4890 27164 -185083 157255 128338 94305 -6393 -199151 73265 91960 16172 107451 -120237
4878 -340489 83626 26910 148457 179429 -317595 139308 -1205 356354 14497 111080 5639
4866 127545 103795 -80771 -260500 66228 68321 318962 -111937 -78589 259958 -106046 -100664
4855 -100664 58563 -66516 -83868 -64027 313494 33388 -67025 -145521 237606 -2872 279586
4843 -215174 -158102 -60300 -77280 338508 201601 -179108 39651 -109202 63911 27035 -55349
4831 -49632 -125736 -63044 -140186 322477 114442 -31309 -158873 294858 -43046 -256045 315134
4819 48038 -43166 23377 71146 394086 136496 -19158 270325 -17305 -23401 -244761 -102612
4807 54735 21293 93684 97999 -143426 36060 -258813 -27622 303627 30902 280150 -21911
4795 -271413 250849 -155645 -43815 -10994 -61127 -95369 -92383 29516 -30842 -9296 -27214 66013
4782 160721 -149442 170169 60740 -196890 192644 247167 212012 -366471 390989 -244366
4771 478067 -109202 62690 -5474 41216 -164849 35620 -215751 94075 164011 20349 -144247
4759 -153672 99242 -296451 14636 144389 41381 -212590 10874 146440 423154 -21631 -127222
4748 -127222 -5873 267324 -11742 -142926 13008 -44223 -400010 -137237 -141077 -178145 -189987
4737 -189987 -90955 5628 -42031 167745 162776 -122688 -57835 -715 107722 -225783 -3878 -219702
4725 -219702 -74720 -6261 211680 483596 -136925 63326 138238 101762 258589 -98105 -36057
4713 140548 -54681 435303 -9499 -336246 37054 152923 85215 212266 206011 -150554 280371
4701 109658 139821 232149 24751 7251 152429 186925 132676 99350 -122030 15383 218132
4690 218132 56480 -191562 -107120 -66276 304740 27335 -4365 -359423 -304391 17222 -215285
4678 -192741 34333 -118085 -120904 -21022 186804 -22678 108304 125746 150912 -138991 18844
4666 201294 -126146 -304638 -81722 -71066 71436 116819 47914 -193044 -318852 250279 83090
4654 230511 15957 -117090 73468 -212413 -138981 43465 -368500 162117 -34497 -159359 21347
4642 -261792 97123 -254227 -205693 -14571 -305849 48149 183076 22787 190157 -127530 125833
4630 186549 311677 91957 -101863 66434 357825 -200028 -131280 -71102 16949 -225186 -20158
4618 85245 -98225 26357 337334 -69296 -59236 -188816 275597 -361324 209531 57290 224936
4607 224936 62070 208096 18803 -86154 93031 -22528 177749 -203526 -138990 -4617 66683
4595 -14733 -59070 192791 211308 -70215 -96757 -161466 276084 14295 -374360 -32368 -332622
4584 -332622 158175 -145631 432958 -17083 -2235 -118838 75765 122490 -77741 151169 156683
4573 156683 310966 -400877 -79894 -160035 -1049 -25675 -84279 -108730 396840 -154304 -26600
4561 78198 -178494 142792 -22091 346725 -108810 209021 47041 20648 2307 -136179 70255
4549 54824 224859 349071 -146057 111036 37726 61092 -297943 75369 -192673 -246664 152311
4537 -44268 -117923 -117769 105101 238336 143794 80684 -45632 -18713 75511 -134890 -77946 -149689
4525 -149689 207918 -136047 -51526 -45559 -65604 76797 -339516 186303 -34908 217606 101947
4513 227385 -2197 49441 22356 205067 98984 -321606 286840 173767 233190 -147581 68196
4501 -72656 -212885 174085 -82382 -237314 46262 205893 236766 -283306 89458 280740 -160231
4489 -216341 87907 215617 219611 -84588 -67670 72223 20047 -235667 214765 163233 -235016
4477 251948 -112991 327164 -304235 144320 -87697 -37092 -169755 132229 -12181 119999
$$ [...]
##END NTUPLES=NMR SPECTRUM
##END=
