##TITLE=NES1042_878015014_9242965_O5LvIJuU8l
##JCAMPDX= 6.0         $$ Bruker NMR JCAMP-DX V2.0
##DATA TYPE= NMR SPECTRUM
##DATA CLASS= NTUPLES
##ORIGIN= BRUKER
##OWNER= Administrator
$$ 1.72 TOPSPIN		Version 2.1
$$ 2015-07-01 22:54:22.883 -0700  Administrator@X
$$ Compression mode = diff/dup
##.OBSERVE FREQUENCY= 400.02188249412
##.OBSERVE NUCLEUS= ^1H
##.ACQUISITION MODE= SIMULTANEOUS (DQD)
##.ACQUISITION SCHEME= undefined
##.AVERAGES= 64
##.DIGITISER RES= 22
##SPECTROMETER/DATA SYSTEM= spect
##.PULSE SEQUENCE= noesygpps1d.comp
##.SOLVENT NAME= COFFEE_meoh
##.SHIFT REFERENCE= INTERNAL, COFFEE_meoh, 1, 14.96264
##AUDIT TRAIL= $$ (NUMBER, WHEN, WHO, WHERE, PROCESS, VERSION, WHAT)
$$ ##TITLE= Audit trail, TOPSPIN		Version 2.1
$$ ##JCAMPDX= 5.01
$$ ##ORIGIN= Bruker BioSpin GmbH
$$ ##OWNER= Administrator
$$ $$ E:\/data/COFFEE/nmr/NES1042_878015014_9242965_O5LvIJuU8l/22/pdata/1/auditp.txt
$$ ##AUDIT TRAIL=  $$ (NUMBER, WHEN, WHO, WHERE, PROCESS, VERSION, WHAT)
(   1,<2015-07-01 22:54:17.586 -0700>,<Administrator>,<X>,<go>,<TOPSPIN 2.1>,
      <created by zg
	started at 2015-07-01 22:42:47.930 -0700,
	POWCHK enabled, PULCHK disabled,
       configuration hash MD5:
       21 0F 79 D6 B3 7B B4 F6 88 20 88 DB 03 48 BD 9F
       data hash MD5: 64K
       D0 25 98 DF B0 12 9F DC 14 CE 1D DD C1 75 9D 1D>)
(   2,<2015-07-01 22:54:20.805 -0700>,<Administrator>,<X>,<proc1d>,<TOPSPIN 2.1>,
      <Start of raw data processing
       efp LB = 0.3 FT_mod = 6 PKNL = 1 PHC0 = 0 PHC1 = 0 SI = 128K 
       data hash MD5: 128K
       03 F8 68 6D CB 64 69 93 A8 18 EF D1 F1 08 50 4E>)
(   3,<2015-07-01 22:54:21.680 -0700>,<Administrator>,<X>,<proc1d>,<TOPSPIN 2.1>,
      <pk PHC0 = -83.67188 PHC1 = 0 
       data hash MD5: 128K
       DF 53 3E 46 B1 8A 07 34 33 F0 40 24 C7 49 B5 55>)
(   4,<2015-07-01 22:54:22.055 -0700>,<Administrator>,<X>,<proc1d>,<TOPSPIN 2.1>,
      <abs ABSG = 1 
       data hash MD5: 128K
       45 33 1A 01 80 23 34 E9 9D FF F9 66 B8 6D 74 6B>)
(   5,<2015-07-01 22:54:22.164 -0700>,<Administrator>,<X>,<proc1d>,<TOPSPIN 2.1>,
      <abs ABSG = 2 
       data hash MD5: 128K
       4F A7 E8 95 46 C9 C7 DD BD 76 11 A0 2B 80 93 6C>)
(   6,<2015-07-01 22:54:22.242 -0700>,<Administrator>,<X>,<proc1d>,<TOPSPIN 2.1>,
      <abs ABSG = 3 
       data hash MD5: 128K
       55 ED 8C 7B CB 00 E1 50 20 8C AF A4 7E 5B 65 60>)
(   7,<2015-07-01 22:54:22.336 -0700>,<Administrator>,<X>,<proc1d>,<TOPSPIN 2.1>,
      <abs ABSG = 4 
       data hash MD5: 128K
       E7 E6 C0 B7 6B 9B 85 82 3D F1 5E 4F 69 CF 17 3E>)
(   8,<2015-07-01 22:54:22.430 -0700>,<Administrator>,<X>,<proc1d>,<TOPSPIN 2.1>,
      <abs ABSG = 5 
       data hash MD5: 128K
       1C A5 B4 DB B8 89 C1 72 B1 84 6F 00 28 F1 2D 24>)
$$ ##END=
$$ 
$$ $$ hash MD5
$$ $$ EF B2 54 0D 1B FE 76 EE EA 48 22 F6 A2 A7 2C 94
##$RELAX= 
##$RELAX= 
##$RELAX= 
##$RELAX= 
##$RELAX= 
##$RELAX= 
##$RELAX= 
##$RELAX= 
$$ Bruker specific parameters
$$ --------------------------
##$DU= <E:\>
##$EXPNO= 22
$$ [...]
##$TP07= 0
##$TPNAME0= <>
##$TPNAME1= <>
##$TPNAME2= <>
##$TPNAME3= <>
##$TPNAME4= <>
##$TPNAME5= <>
##$TPNAME6= <>
##$TPNAME7= <>
##$TPOAL= (0..7)
0.5 0.5 0.5 0.5 0.5 0.5 0.5 0.5
##$TPOFFS= (0..7)
0 0 0 0 0 0 0 0
##$TUNHIN= 0
##$TUNHOUT= 0
##$TUNXOUT= 0
##$USERA1= <user>
##$USERA2= <user>
##$USERA3= <user>
##$USERA4= <user>
##$USERA5= <user>
##$V9= 5
##$VALIST= <valist>
##$VCLIST= <CCCCCCCCCCCCCCC>
##$VD= 0
##$VDLIST= <DDDDDDDDDDDDDDD>
##$VPLIST= <PPPPPPPPPPPPPPP>
##$VTLIST= <TTTTTTTTTTTTTTT>
##$WBST= 2048
##$WBSW= 25
##$XGAIN= (0..3)
0 0 0 0
##$XL= 0
##$YL= 0
##$YMAX_a= 6261506
##$YMIN_a= -12327504
##$ZGOPTNS= <>
##$ZL1= 120
##$ZL2= 120
##$ZL3= 120
##$ZL4= 120
##$ABSF1= 14.96264
##$ABSF2= -5.595542
##$ABSG= 5
##$ABSL= 3
##$ALPHA= 0
##$AQORDER= 0
##$ASSFAC= 0
##$ASSFACI= 0
##$ASSFACX= 0
##$ASSWID= 0
##$AUNMP= <proc_prof1d_extract.lims>
##$AXLEFT= 0
##$AXNAME= <>
##$AXNUC= <1H>
##$AXRIGHT= 0
##$AXTYPE= 0
##$AXUNIT= <>
##$AZFE= 0.1
##$AZFW= 0.1
##$BCFW= 0
##$BC_mod= 0
##$BYTORDP= 0
##$COROFFS= 0
##$CY= 15
##$DATMOD= 1
##$DC= 0
##$DFILT= <>
##$DTYPP= 0
##$F1P= 0
##$F2P= 0
##$FCOR= 0.5
##$FTSIZE= 131072
##$FT_mod= 6
##$GAMMA= 0
##$GB= 0
##$INTBC= 1
##$INTSCL= 1
##$ISEN= 128
##$LB= 0.3
##$LEV0= 0
##$LPBIN= 0
##$MAXI= 10000
##$MC2= 0
##$MEAN= 0
##$ME_mod= 0
##$MI= 0
##$NCOEF= 0
##$NC_proc= -2
##$NLEV= 6
##$NOISF1= 0
##$NOISF2= 0
##$NSP= 0
##$NTH_PI= 0
##$NZP= 0
##$OFFSET= 14.96264
##$PC= 1
##$PHC0= -83.67188
##$PHC1= 0
##$PH_mod= 1
##$PKNL= yes
##$PPARMOD= 0
##$PPDIAG= 0
##$PPIPTYP= 0
##$PPMPNUM= 2147483647
##$PPRESOL= 1
##$PSCAL= 4
##$PSIGN= 0
##$PYNMP= <proc.py>
##$REVERSE= no
##$SF= 400.020008982357
##$SI= 131072
##$SIGF1= 0
##$SIGF2= 0
##$SINO= 400
##$SIOLD= 131072
##$SPECTYP= <>
##$SREGLST= <1H.CDCl3>
##$SSB= 0
##$STSI= 131072
##$STSR= 0
##$SW_p= 8223.68421052631
##$SYMM= 0
##$S_DEV= 0
##$TDeff= 65536
##$TDoff= 0
##$TI= <>
##$TILT= no
##$TM1= 0
##$TM2= 0
##$TOPLEV= 0
##$USERP1= <user>
##$USERP2= <user>
##$USERP3= <user>
##$USERP4= <user>
##$USERP5= <user>
##$WDW= 1
##$XDIM= 131072
##$YMAX_p= 342070291
##$YMIN_p= -12234
##$CURPLOT= <Network HP LaserJet P1505>
##$CURPRIN= <$Network HP LaserJet P1505>
##$DFORMAT= <normdp>
##$LAYOUT= <+/1D_H.xwp>
##$LFORMAT= <normlp>
##$PFORMAT= <normpl>
##$SURQMSG= 1
$$ End of Bruker specific parameters
$$ ---------------------------------
##NTUPLES= NMR SPECTRUM
##VAR_NAME=  FREQUENCY,     SPECTRUM/REAL,   SPECTRUM/IMAG
##SYMBOL=    X,             R,               I
##VAR_TYPE=  INDEPENDENT,   DEPENDENT,       DEPENDENT
##VAR_FORM=  AFFN,          ASDF,            ASDF
##VAR_DIM=   131072,        131072,          131072
##UNITS=     HZ,            ARBITRARY UNITS, ARBITRARY UNITS
##FACTOR=    0.0627417313425164, 1,          1
##FIRST=     8223.62146879497, -827,         -42842
##LAST=      0,             1280,            -42587
##MIN=       0,             -12234,          0
##MAX=       8223.62146879497, 342070291,    0
$$ Real data points
##PAGE= N=1
##DATA TABLE= (X++(R..R)), XYDATA
$$ [...]
61133E50576p850o719n599m830l798k102l54R00K183M076O084P466Q372R037Q661
$$ 550576 542726 536007 530408 525578 521780 519678 519324 520224 522407 526483 532567 540033 548405 557442 566103
61118E66103O349K726o64l144m941n895n624m780m666n515o391o779p032p202
$$ 566103 572452 575178 574514 571370 566429 560534 554910 550130 545464 539949 533558 526779 519747 512545
61104E12545o880o340o446p088p113o288n885o666p589p489o752o263n710m360
$$ 512545 505665 499325 492879 485791 478678 472390 466505 459839 452250 444761 438009 431746 426036 421676
61090D21676k730k100k647l290l273k826k243j353j29R03J238J010Q53J346K492
$$ 421676 418946 416846 414199 410909 407636 404810 402567 401214 401085 401988 403226 404236 405089 406435 408927
61075D08927L544L584K535J401J147J624K008K006K021K358K784K940K669J968
$$ 408927 412471 416055 418590 419991 421138 422762 424770 426776 428797 431155 433939 436879 439548 441516
61061D41516J044L63K27L24N2o81j345j491j203q75p56q53j001j053j175j801
$$ 441516 442560 442923 443150 443474 443526 442845 441500 440009 438806 437931 437175 436322 435321 434268 433093 431292
61045D31292l038m264m639m006k941j967j108j77Q35J799K610L182L556M002M827
$$ 431292 428254 423990 419351 415345 412404 410437 409329 409152 409987 411786 414396 417578 421134 425136 429963
61030D29963N949O898P328P343P312P552Q272R574J1329J3150J4757J6366J8642
$$ 429963 435912 442810 450138 457481 464793 472345 480617 490191 501520 514670 529427 545793 564435
61017E64435K2123K6749L1983L7538M3992N2765O5312Q1648R8537J08850J04306
$$ 564435 586558 613307 645290 682828 726820 779585 844897 926545 1025082 1133932 1238238
61006A238238Q1356M5584R452j5529k4845k0219n387J5037L3416L9576K6637l081
$$ 1238238 1319594 1365178 1374630 1359101 1334256 1314037 1308650 1323687 1357103 1396679 1423316 1420235
60994A420235l8885o8848q6451r1727q8124p9368o8416n7465m7760l9391l1781
$$ 1420235 1381350 1312502 1226051 1134324 1046200 966832 898416 840951 793191 753800 722019
60983G22019k4635j8308j3383j0077q169p239o882o770o701o607o511o536o863
$$ 722019 697384 679076 665693 655616 647447 640208 633326 626556 619855 613248 606737 600201 593338
60970E93338p560q459r353j0176j0803j0817r956q717q051q282q834r086r019
$$ 593338 585778 577319 567966 557790 546987 536170 526214 517497 509446 501164 492330 483244 474225
60957D74225q791q365p876p766p986p688o356m767m053m177m174l586k717j660
$$ 474225 465434 457069 449193 441427 433441 425753 419397 414630 410577 406400 402226 398640 395923 394263
60943C94263r2J827L354M204M855N569N905N659N394N614N973N849N182M245L128
$$ 394263 394171 395998 399352 403556 408411 413980 419885 425544 430938 436552 442525 448374 453556 457801 460929
60928D60929J940J033M60l05j569k790l361l596m128m773m782m107l504l416l547
$$ 460929 462869 463902 464362 464057 462488 459698 456337 452741 448613 443840 439058 434951 431447 428031 424484
60913D24484l622l810m140m216l892l685m138n080n834n904n267m237l330k981
$$ 424484 420862 417052 412912 408696 404804 401119 396981 391901 386067 380163 374896 370659 367329 364348
60899C64348l197l588l822l843l672l273k728k202j574n01R46K074K355K122K165
$$ 364348 361151 357563 353741 349898 346226 342953 340225 338023 336449 335948 336894 338968 341323 343445 345610
60884C45610K777L554M103M515N136O065O998P541P654P749Q251R088R770R870
$$ 345610 348387 351941 356044 360559 365695 371760 378758 386299 393953 401702 409953 419041 428811 438681
60870D38681R193P608N169K496N05m96r69j113l63J523L437L839K441K46j882
$$ 438681 447874 455482 460651 463147 463652 463156 462187 461074 460711 462234 465671 469510 471951 472197 470315
60855D70315l710m857m765l784l262l875m671m504l666l319l781m396m773n090
$$ 470315 466605 461748 456983 453199 449937 446062 441391 436887 433221 429902 426121 421725 416952 411862
60841D11862n262m785l678k719k376k173j514n66P6J92k0m02q23r56n27K80R73
$$ 411862 406600 401815 398137 395418 393042 390869 389355 388789 388865 389057 389037 388635 387812 386856 386329 386609 387582
60824C87582J257J209R78O19J88k09m63n17l63l7M41J101J826K256K079J472R33
$$ 387582 388839 390048 391026 391645 391833 391624 391161 390644 390281 390244 390685 391786 393612 395868 397947 399419 400352
60807D00352P09O74Q29J393K234K680K262J336O65N78Q31R91P01r1q78r38k81
$$ 400352 401061 401735 402564 403957 406191 408871 411133 412469 413134 413712 414543 415534 416235 416144 415266 414328 414047
60790D14047J73j40n16J4J078J320K13j298k062j860j133l40Q7j39p59j115r55
$$ 414047 414220 414080 413564 413578 414656 415976 416189 414891 412829 410969 409836 409496 409583 409444 408685 407570 406615
60773D06615n98j98M97J364J683J155M96M24O29M54P6K11R43J646J886J680J033
$$ 406615 406017 405819 406316 407680 409363 410518 411014 411438 412067 412521 412597 412808 413751 415397 417283 418963 419996
60756D19996L6p11o55k64n72j584k094j440n62p03j747k664l077l487m079m203
$$ 419996 420032 419321 418666 418402 417830 416246 414152 412712 412150 411447 409700 407036 403959 400472 396393 392190
60740C92190l255j518K19J436K092K291K108J633J063O91P54J197J646J701J248
$$ 392190 388935 387417 387636 389072 391164 393455 395563 397196 398259 398950 399704 400901 402547 404248 405496
60725D05496L98p33j962k905l215l071l105l658m379m677m417l932l486l089k734
$$ 405496 405894 405161 403199 400294 397079 394008 390903 387245 382866 378189 373772 369840 366354 363265 360531
60710C60531k505k339j946j183l48Q3l3l45m30j89P1J0l76o92n05K09J026J482
$$ 360531 358026 355687 353741 352558 352210 352293 352260 351915 351485 351296 351367 351377 351001 350309 349804 350013 351039 352521
60692C52521J484J325J362J709K170K491K732L246M096M654M272L331L039L838
$$ 352521 354005 355330 356692 358401 360571 363062 365794 369040 373136 377790 382062 385393 388432 392270
60678C92270M675M355L197K508K742L138L192L382M078M716M715M502M845N643
$$ 392270 396945 401300 404497 407005 409747 412885 416077 419459 423537 428253 432968 437470 442315 447958
60664D47958O262O652P249P972Q174P689P025O466N754M867M268L988L218J404
$$ 447958 454220 460872 468121 476093 484267 491956 498981 505447 511201 516068 520336 524324 527542 528946
60650E28946q27k448l315m018m761n174n110m903m744m399l784l303l321l639
$$ 528946 528119 525671 522356 518338 513577 508403 503293 498390 493646 489247 485463 482160 478839 475200
60636D75200l819l768l665l470k907j996j217r90j155j226j049r46j103j200q82
$$ 475200 471381 467613 463948 460478 457571 455575 454358 453368 452213 450987 449938 448992 447889 446689 445807
60621D45807m02l28o15m36P75K412L228K660J291O7n83p97q14p79q79j329k115
$$ 445807 445405 445077 444462 444026 444801 447213 450441 453101 454392 454459 453876 453079 452265 451486 450607 449278 447163
60604D47163k831k978k440j630j100j019j121j100r28p62p23p88p75m72J27P06
$$ 447163 444332 441354 438914 437284 436184 435165 434044 432944 432016 431254 430531 429743 428968 428496 428623 429329
60588D29329R85J087J242J199M78o56j075j13J472K395K343J923J500R42L93L70
$$ 429329 430314 431401 432643 433842 434320 433664 432589 432476 433948 436343 438686 440609 442109 443051 443444 443814
60572D43814Q31J054P63O52J215J794J450L36n52p01l90J27R76K083K962L321
$$ 443814 444645 445699 446462 447114 448329 450123 451573 451909 451357 450656 450266 450393 451369 453452 456414 459735
60556D59735L433L711M225M818N437O166P131Q422R917J1218J2037J2692J3871
$$ 459735 463168 466879 471104 475922 481359 487525 494656 503078 512995 524213 536250 548942 562813
60543E62813J5781J7922J9832K1696K3893K6125K7297K6359K3066J7960J1722
$$ 562813 578594 596516 616348 638044 661937 688062 715359 741718 764784 782744 794466
60532G94466M700k832j0037j5580j8579j9298j8621j7084j4859j2451j0661r744
$$ 794466 799166 796334 786297 770717 752138 732840 714219 697135 682276 669825 659164 649420
60520F49420r148q255o898n076k762k79J755L162M496O280Q544J1326J4915J9023
$$ 649420 640272 632017 625119 620043 617281 617002 618757 621919 626415 632695 641239 652565 667480 686503
60506F86503K2422K4180K4669K4543K3256J9766J4341Q480L099j959o484r303
$$ 686503 708925 733105 757774 782317 805573 825339 839680 848160 851259 849300 842816 833513
60494H33513r669q181n690k271K076O634J0810J5153K0439K6213L1253L5282L9222
$$ 833513 823844 815663 809973 807702 809778 816412 827222 842375 862814 889027 920280 955562 994784
60481I94784M3902M9462N6128O4508P4866Q6745R9633J13142J25992J35299J37601
$$ 994784 1038686 1088148 1144276 1208784 1283650 1370395 1470028 1583170 1709162 1844461 1982062
60470A982062J30545J13507Q7137N3031J3884k6627o4533r6466j20202j34836
$$ 1982062 2112607 2226114 2313251 2366282 2380166 2353539 2289006 2192540 2072338 1937502
60460A937502j40693j39243j32814j23830j13751j02811r1013p9219o8724n9909
$$ 1937502 1796809 1657566 1524752 1400922 1287171 1184360 1093347 1014128 945404 885495
60450H85495n2080m4787l8575l3973l0397k6731k2706j8926j5741j2850j0094
$$ 885495 833415 788628 750053 716080 685683 658952 636246 617320 601579 588729 578635
60439E78635p976p058p239p853q269q184p645o955o369n848n239m657m292l871
$$ 578635 570659 563601 556362 548509 540240 532056 524411 517456 511087 505239 500000 495343 491051 487180
60425D87180k906j627j040j560k155j513J93J531J669J243J214J598J737J231
$$ 487180 484274 482647 481607 480047 477892 476379 476572 478103 479772 481015 482229 483827 485564 486795
60411D86795K91n42o01N24K429L984M469M404M758N640O351O585O792P231P356
$$ 486795 487086 486544 485943 486467 488896 492880 497349 501753 506511 512151 518502 525087 531879 539110 546466
60396E46466O588N258M301M198M568M719M336L603K910K455K172J998K062K387
$$ 546466 553054 558312 562613 566811 571379 576098 580434 584037 586947 589402 591574 593572 595634 598021
60382E98021K582K203J428R13R50J159J172J125J214J270J134J043J151J127P92
$$ 598021 600603 602806 604234 605147 606097 607256 608428 609553 610767 612037 613171 614214 615365 616492 617284
60367F17284P95J885L730N222N986O742P954Q970Q916P905O768N957N249M368
$$ 617284 618079 619964 623694 628916 634902 641644 649598 658568 667484 675389 682157 688114 693363 697731
60353F97731L338K300J337N80K01K39N05O47L00p11k196l649m591m857m650m502
$$ 697731 701069 703369 704706 705286 705487 705726 706231 706878 707178 706467 704271 700622 696031 691174 686524 682022
60337F82022n063o550q315r220q710p283n828m790m126l772l743l982m381m943
$$ 682022 676959 670409 662094 652874 644164 636881 631053 626263 622137 618365 614622 610640 606259 601316
60323F01316n655o345o847p156p234o865n930m687l493k421j438p58o12q48j089
$$ 601316 595661 589316 582469 575313 568079 561214 555284 550597 547104 544683 543245 542487 541875 541027 539938
60308E39938j223j371j455j257q36m94k91l0L04M71M03L24L52M13N67R70J392
$$ 539938 538715 537344 535889 534632 533796 533302 533011 532981 533285 533756 534159 534483 534835 535248 535815 536785 538177
60291E38177J344Q48N83R25J425J543J453J597J887J954J898K082K372K228J555
$$ 538177 539521 540369 540952 541877 543302 544845 546298 547895 549782 551736 553634 555716 558088 560316 561871
60276E61871R06O82O66M95J69n4j1L10P95J200J342J349J554K084K820L700M728
$$ 561871 562777 563459 564125 564620 564789 564735 564724 565034 565829 567029 568371 569720 571274 573358 576178 579878 584606
60259E84606N663O141O241O525P313Q276Q943R342R806J0430J0991J1325J1513
$$ 584606 590269 596410 602651 609176 616489 624765 633708 643050 652856 663286 674277 685602 697115
60246F97115J1860J2744J4405J6650J8960K1026K3025K5304K8077L1465L5446
$$ 697115 708975 721719 736124 752774 771734 792760 815785 841089 869166 900631 936077
60235I36077L9524M2929M5532M8205N1822N6174O0464O4527O8872P3514P7532
$$ 936077 975601 1018530 1064062 1112267 1164089 1220263 1280727 1345254 1414126 1487640 1565172
60224A565172Q0024Q0969Q0861P9880P7769P4166O8843O1812N3491M4561L5504
$$ 1565172 1645196 1726165 1807026 1886906 1964675 2038841 2107684 2169496 2222987 2267548 2303052
60213B303052K6357J6998P430k223j1687k0337k7377l2440l5767l7595l7680l5705
$$ 2303052 2329409 2346407 2353837 2351614 2339927 2319590 2292213 2259773 2224006 2186411 2148731 2113026
60201B113026l1908k6976k1426j5345q582r48P644J6957K6455L5796M5173N4893
$$ 2113026 2081118 2054142 2032716 2017371 2008789 2007841 2015485 2032442 2058897 2094693 2139866 2194759
60189B194759O4793P4323Q3037R0547R6049R8469R7276R2850Q5851P6488O4704
$$ 2194759 2259552 2333875 2416912 2507459 2603508 2701977 2799253 2892103 2977954 3054442 3119146
60178C119146N0825L5708K0185M571j1199k7010m2247n6013o7555p6406q2259
$$ 3119146 3169971 3205679 3225864 3230435 3219236 3192226 3149979 3093966 3026411 2950005 2867746
60167B867746q4940q4635q1873p7118p0413o1703n1367m0193k8757j7042m807
$$ 2867746 2782806 2698171 2616298 2539180 2468767 2407064 2355697 2315504 2286747 2269705 2264898
60156B264898P847K0363L2196M3196N3365O2167O8251P0176O7542O1269N2752
$$ 2264898 2272745 2293108 2325304 2368500 2421865 2484032 2552283 2622459 2690001 2751270 2804022
60145B804022M2971L2523K2097J2436L812m085j1677j8938k5237k9536l0939k9288
$$ 2804022 2846993 2879516 2901613 2914049 2917861 2913776 2902099 2883161 2857924 2828388 2797449 2768161
60133B768161k5298j9856j3265n264M302J5077K6454L8045M9914O2487P6207R1128
$$ 2768161 2742863 2723007 2709742 2704478 2708780 2723857 2750311 2788356 2838270 2900757 2976964 3068092
60121C068092J06877J22977J39087J54849J69897J84140J97599K09693K19128
$$ 3068092 3174969 3297946 3437033 3591882 3761779 3945919 4143518 4353211 4572339
60112D572339K24890K26932K25343K19460K08758J94162J77181J57771J34379
$$ 4572339 4797229 5024161 5249504 5468964 5677722 5871884 6049065 6206836 6341215
60103F341215J06576P6345M6034J6036j4456m5197p4579j01251j24875j45366
$$ 6341215 6447791 6524136 6570170 6586206 6571750 6526553 6451974 6350723 6225848 6080482
60093F080482j62305j75311j84231j88846j89002j85232j78615j69736j58252
$$ 6080482 5918177 5742866 5558635 5369789 5180787 4995555 4816940 4647204 4488952
60084D488952j43797j26897j08709r0128p1445n2740l4300j6721p07J3326K5487
$$ 4488952 4345155 4218258 4109549 4019421 3947976 3895236 3860936 3844215 3843508 3856834 3882321
60073C882321L6218M5775N3814N9473O1857O0680N6538N0413M2714L3048K1100
$$ 3882321 3918539 3964314 4018128 4077601 4139458 4200138 4256676 4307089 4349803 4382851 4403951
60062D403951P469o675k0568l4096m7191n9536p0797q0802q9441r6746j02982
$$ 4403951 4411420 4404745 4384177 4350081 4302890 4243354 4172557 4091755 4002314 3905568 3802586
60051C802586j08124j11243j10969j06925j00278r2532q4080p4254o2672n0060
$$ 3802586 3694462 3583219 3472250 3365325 3265047 3172515 3088435 3014181 2951509 2901449
60041B901449l7638k5858j3956q69J3432K7772M1015N3203O5047P6597Q6978R5312
$$ 2901449 2863811 2837953 2823997 2823128 2836560 2864332 2905347 2958550 3023597 3100194 3187172 3282484
60029C282484J01195J04125J03196R7886Q8710P6709O2578M6703K9596J1759o698
$$ 3282484 3383679 3487804 3591000 3688886 3777596 3854305 3916883 3963586 3993182 4004941 3998243
60018C998243k5681m4405o1599p6486q9101r9543j07301j11534j11793j08366
$$ 3998243 3972562 3928157 3866558 3790072 3700971 3601428 3494127 3382593 3270800 3162434
60008C162434j02107r4026q4779p4324o2363m9226l6102k4079j3103k226R219
$$ 3162434 3060327 2966301 2881522 2807198 2744835 2695609 2659507 2635428 2622325 2620099 2629318
59997B629318K1050L2909M5003N7821P1393Q5292R9207J12936J25588J35359J40563
$$ 2629318 2650368 2683277 2728280 2786101 2857494 2942786 3041993 3154929 3280517 3415876 3556439
59986C556439J40722J36265J27497J14488R7895P9232N9905M0303K0077r68k2430
$$ 3556439 3697161 3833426 3960923 4075411 4173306 4252538 4312443 4352746 4372823 4371855 4349425
59975D349425m3516o3331q1076r6224j08306j16519j19869j18061j12054j03337
$$ 4349425 4305909 4242578 4161502 4065278 3956972 3840453 3720584 3602523 3490469 3387132
59965C387132r2804q0691o7414n3802m0312k6612j2336K049J5603K7965L9582
$$ 3387132 3294328 3213637 3146223 3092421 3052109 3025497 3013161 3015210 3030813 3058778 3098360
59954C098360N0838O1445P0777P8447Q4203Q7523Q7811Q5022P9807P2909O4682
$$ 3098360 3149198 3210643 3281420 3359867 3444070 3531593 3619404 3704426 3784233 3857142 3921824
59943C921824N5256M4907L4067K3167J2707L297m590j0860j5537j8294j8463j5504
$$ 3921824 3977080 4021987 4056054 4079221 4091928 4095225 4090635 4079775 4064238 4045944 4027481 4011977
59931D011977r328k24J1382K5110M0762N8212P7093R6701J16365J35736J54561
$$ 4011977 4002649 4002425 4013807 4038917 4079679 4137891 4214984 4311685 4428050 4563786 4718347
59920D718347J72401J88836K03629K16225K25271K29217K27299K19377K04901
$$ 4718347 4890748 5079584 5283213 5499438 5724709 5953926 6181225 6400602 6605503
59911F605503J82906J53326J17617P7719L5118q585n0972q9572j23104j51273
$$ 6605503 6788409 6941735 7059352 7137071 7172189 7163604 7112632 7023060 6899956 6748683
59901F748683j73554j89019j97384j99491j96591j89638j79385j66557j51617
$$ 6748683 6575129 6386110 6188726 5989235 5792644 5603006 5423621 5257064 5105447
59892E105447j34725j16266r7079p7896n8837l9709k0621j994J5882L2959M9156
$$ 5105447 4970722 4854456 4757377 4679481 4620644 4580935 4560314 4558320 4574202 4607161 4656317
59881D656317O4207P7800Q9586R8944J04969J06908J04625R8409Q8309P3872N4833
$$ 4656317 4720524 4798324 4887910 4986854 5091823 5198731 5303356 5401765 5490074 5563946 5618779
59870E618779L2020P344j7243m0717o2933q3974j03625j21368j36483j48282j56392
$$ 5618779 5650799 5658143 5640900 5600183 5537250 5453276 5349651 5228283 5091800 4943518 4787126
59859D787126j60917j62208j60584j56340j49894j41738j32276j21910j11255
$$ 4787126 4626209 4464001 4303417 4147077 3997183 3855445 3723169 3601259 3490004
59850C490004j01063r1881q3875p6973p1090o6124o1904n8214n4896n1933m9382
$$ 3490004 3388941 3297060 3213185 3136212 3065122 2998998 2937094 2878880 2823984 2772051 2722669
59839B722669m7246m5375m3609m1890m0200l8463l6619l4772l3007l1151k8881
$$ 2722669 2675423 2630048 2586439 2544549 2504349 2465886 2429267 2394495 2361488 2330337 2301456
59828B301456k6055k2594j8237j2842o948j496L158P461J1685J5454J8573K1666
$$ 2301456 2275401 2252807 2234570 2221728 2214780 2213284 2216442 2223903 2235588 2251042 2269615 2291281
59816B291281K5339K9116L2074L4070L5497L6035L4763L1606K7691K3813J9442
$$ 2291281 2316620 2345736 2377810 2411880 2447377 2483412 2518175 2549781 2577472 2601285 2620727
59805B620727J3924Q037L503J208O79J285L242P093J2708J9400K6910L5759M6406
$$ 2620727 2634651 2642688 2646191 2647399 2648078 2649363 2652605 2659698 2672406 2691806 2718716 2754475 2800881
59792B800881N8521P1621Q6120J03136J23080J45189J68668J93637K20167K46617
$$ 2800881 2859402 2931023 3017143 3120279 3243359 3388548 3557216 3750853 3971020 4217637
59782D217637K69284K83102K82080K60061K13321J43875O0133k6144j03944j65507
$$ 4217637 4486921 4770023 5052103 5312164 5525485 5669360 5729493 5703349 5599405 5433898
59772E433898k07167k29337k35405k29642k15596j96072j73714j50826j28760
$$ 5433898 5226731 4997394 4761989 4532347 4316751 4120679 3946965 3796139 3667379
59763C667379j07921q8429p0464n4187l9527k6101j3379j133J0234K0147K8695
$$ 3667379 3559458 3471029 3400565 3346378 3306851 3280750 3267371 3266238 3276472 3296619 3325314
59752C325314L6665M4656N2627O0520O8727P7637Q7162R7162J07901J19647J32174
$$ 3325314 3361979 3406635 3459262 3519782 3588509 3666146 3753308 3850470 3958371 4078018 4210192
59741D210192J45248J59242J74764J91853K10115K29474K50169K72072K94647
$$ 4210192 4355440 4514682 4689446 4881299 5091414 5320888 5571057 5843129 6137776
59732F137776L17584L40890L64135L85931M04374M17613M23931M21861M10637
$$ 6137776 6455360 6796250 7160385 7546316 7950690 8368303 8792234 9214095 9624732
59723I624732L90547L62678L28561K90401K51494K15881J87081J66809J54854
$$ 9624732 10015279 10377957 10706518 10996919 11248413 11464294 11651375 11818184 11973038
59714A1973038J50033J51109J56781J65227J74190J81719J86666J88464J86754
$$ 11973038 12123071 12274180 12430961 12596188 12770378 12952097 13138763 13327227 13513981
59705A3513981J81323J72127J59207J42819J23728J03160Q2352O2390M4449K9745
$$ 13513981 13695304 13867431 14026638 14169457 14293185 14396345 14478697 14541087 14585536 14615281
59695A4615281J8998J2371J0185J3323K2559L7842N8476Q3810J13402J46820J83588
$$ 14615281 14634279 14646650 14656835 14670158 14692717 14730559 14789035 14872845 14986247 15133067 15316655
59684A5316655K23010K63770L04072L42446L77959M09309M34237M50376M56146
$$ 15316655 15539665 15803435 16107507 16449953 16827912 17237221 17671458 18121834 18577980
59675A8577980M50139M30078L93564L39823K70156J86863R2805p955j10081k08077
$$ 18577980 19028119 19458197 19851761 20191584 20461740 20648603 20741408 20733453 20623372 20415295
59665B0415295k97229l73563m33908m76529n01390n09589n03293m86787m67200
$$ 20415295 20118066 19744503 19310595 18834066 18332676 17823087 17319794 16833007 16365807
59656A6365807m53405m53430m71829n07912n55460o04497o44641o68337o72561
$$ 16365807 15912402 15458972 14987143 14479231 13923771 13319274 12674633 12006296 11333735
59647A1333735o58755o31417n95876n56391n15638m75289m36483l99781l65380
$$ 11333735 10674980 10043563 9447687 8891296 8375658 7900369 7463886 7064105 6698725
59638F698725l33575l04723k78713k54955k33007k12814j94273j77030j60793
$$ 6698725 6365150 6060427 5781714 5526759 5293752 5080938 4886665 4709635 4548842
59629D548842j45482j31036j17575j05661r5691q6886p7767o7940n8661n1261
$$ 4548842 4403360 4272324 4154749 4049088 3953397 3866511 3788744 3720804 3662143 3610882
59619C610882m5711m1233l7544l4817l3067l2371l3198l5668l8761m1184m2841
$$ 3610882 3565171 3523938 3486394 3451577 3418510 3386139 3352941 3317273 3278512 3237328 3194487
59608C194487m4635m6913m9003n0277n0831n0793m9766m7482m4534m1816l9415
$$ 3194487 3149852 3102939 3053936 3003659 2952828 2902035 2852269 2804787 2760253 2718437 2679022
59597B679022l6538l2588k7970k3650k0088j6867j3444r881o610l620m59K990
$$ 2679022 2642484 2609896 2581926 2558276 2538188 2521321 2507877 2497996 2491386 2487766 2487307 2490297
59585B490297O253R004J1583J4397J7216J9465K0991K2162K3410K5009K7020K9197
$$ 2490297 2496550 2505554 2517137 2531534 2548750 2568215 2589206 2611368 2634778 2659787 2686807 2716004
59573B716004L1179L3099L5678L9365M3697M8014N2389N7371O3058O9142P5635
$$ 2716004 2747183 2780282 2815960 2855325 2899022 2947036 2999425 3056796 3119854 3188996 3264631
59562C264631Q2823R0532R8085J05058J11550J17634J23134J28030J32578J36830
$$ 3264631 3347454 3437986 3536071 3641129 3752679 3870313 3993447 4121477 4254055 4390885
59552D390885J40447J42877J43074J39000J28492J11386R0582P0238N2869L8243
$$ 4390885 4531332 4674209 4817283 4956283 5084775 5196161 5286743 5356981 5409850 5448093
59542E448093K4817J1637j247j3628k5740l7801m9321n9398o7655p4340p9435
$$ 5448093 5472910 5484547 5483300 5469672 5443932 5406131 5356810 5297412 5229757 5155417 5075982
59531E075982q2231q2206p9720p5295o8717n9511m7973l4870k0347l935J4423
$$ 5075982 4993751 4911545 4831825 4756530 4687813 4628302 4580329 4545459 4525112 4521177 4535600
59520D535600L4230N5246P7576J00730J23529J45131J65317J83390J97509K05585
$$ 4535600 4569830 4625076 4702652 4803382 4926911 5072042 5237359 5420749 5618258 5823843
59510E823843K06315J99122J83778J60467J29778R2430M9699M182m0741q2714
$$ 5823843 6030158 6229280 6413058 6573525 6703303 6795733 6845432 6849614 6808873 6726159
59500F726159j20923j54577j81964k01677k13774k18895k17120k08713j95241
$$ 6726159 6605236 6450659 6268695 6067018 5853244 5634349 5417229 5208516 5013275
59491E013275j78826j60714j41489j21996j02841q3479o3184m2672k3551o334
$$ 5013275 4834449 4673735 4532246 4410250 4307409 4223930 4160746 4118074 4094523 4088189
59481D088189R630K4461L7468M8633N8800O7841P4129P6420P5200P1388O4845
$$ 4088189 4097819 4122280 4159748 4208381 4267181 4335022 4409151 4485571 4560771 4632159 4697004
59470D697004N4991M1983K6403Q531j1162l1390n0779o8867q5699j01022j14467
$$ 4697004 4751995 4793978 4820381 4828912 4817750 4786360 4735581 4666714 4581015 4479993 4365526
59459D365526j25905j34914j40538j42517j42214j41244j39594j36112j30536
$$ 4365526 4239621 4104707 3964169 3821652 3679438 3538194 3398600 3262488 3131952
59450C131952j23890j17006j09866j02517r5489q8964q2420p5475o8441o1753
$$ 3131952 3008062 2891056 2781190 2678673 2583184 2494220 2411800 2336325 2267884 2206131
59440B206131n5495m9698m4416l9230l3441k7142k1471j7326j4305j1345p870
$$ 2206131 2150636 2100938 2056522 2017292 1983851 1956709 1935238 1917912 1903607 1892262 1884392
59429A884392l914M17N030R614J3683J6508J6866J3508O616j486p706j0316r600
$$ 1884392 1880478 1880895 1885925 1895539 1909222 1925730 1942596 1956104 1962720 1961234 1953528 1943212 1933612
59416A933612o843l065J535P342J4276K0647K3605K1495J5620R175M777L441N308
$$ 1933612 1926769 1923704 1925239 1932581 1946857 1967504 1991109 2012604 2028224 2037399 2042176 2045617 2050925
59403B050925J0051J6443K2705K7858L2307L6831M1636M6645N1950N7493O2835
$$ 2050925 2060976 2077419 2100124 2127982 2160289 2197120 2238756 2285401 2337351 2394844 2457679
59392B457679O7823P3102P9394Q6585R4011J01452J09242J17658J26757J36752
$$ 2457679 2525502 2598604 2677998 2764583 2858594 2960046 3069288 3186946 3313703 3450455
59382C450455J47953J60348J73762J88525K05348K24382K45001K66803K90245
$$ 3450455 3598408 3758756 3932518 4121043 4326391 4550773 4795774 5062577 5352822
59373E352822L15680L42160L67801L91112M11266M27164M37101M39695M34564
$$ 5352822 5668502 6010662 6378463 6769575 7180841 7608005 8045106 8484801 8919365
59364H919365M21783M01388L74171L42365L08597K74045K38376K01403J63935
$$ 8919365 9341148 9742536 10116707 10459072 10767669 11041714 11280090 11481493 11645428
59355A1645428J26569Q8509M8198M749m1750r0889j42151j94601k46849k97337
$$ 11645428 11771997 11860506 11908704 11913453 11871703 11780814 11638663 11444062 11197213 10899876
59345A0899876l44305l85649m19339m44008m58953m63858m59029m45821m26319
$$ 10899876 10555571 10169922 9750583 9306575 8847622 8383764 7924735 7478914 7052595
59336G052595m02556l76251l48930l21627k94603k67975k42514k19195j98053
$$ 7052595 6650039 6273788 5924858 5603231 5308628 5040653 4798139 4578944 4380891
59327D380891j78355j59962j43648j29805j17698j06461r6113q6982p8848p1356
$$ 4380891 4202536 4042574 3898926 3769121 3651423 3544962 3448849 3361867 3283019 3211663
59317C211663o4828n9875n6463n3950n1818m9795m7518m4694m1630l8977l6953
$$ 3211663 3146835 3086960 3030497 2976547 2924729 2874934 2827416 2782722 2741092 2702115 2665162
59306B665162l5158l3141l0725k7851k4549k1063j7697j4437j0972p078k793J667
$$ 2665162 2630004 2596863 2566138 2538287 2513738 2492675 2474978 2460541 2449569 2442491 2439698 2441365
59294B441365O071J0347J4768J9766K5379L1096L6370M0973M4703M7202M8430
$$ 2441365 2447436 2457783 2472551 2492317 2517696 2548792 2585162 2626135 2670838 2718040 2766470
59283B766470M8955M9210M8775M6724M2543L6344K8551J9798J0772J670p936j8218
$$ 2766470 2815425 2864635 2913410 2960134 3002677 3039021 3067572 3087370 3098142 3099812 3091876 3073658
59271C073658k8394l7422m4997n1310n6218n9410o1142o2042o2343o1987o1184
$$ 3073658 3045264 3007842 2962845 2911535 2855317 2795907 2734765 2672723 2610380 2548393 2487209
59260B487209o0139n8496n5909n2877n0123m7333m3608l8965l4318l0007k5545
$$ 2487209 2427070 2368574 2312665 2259788 2209665 2162332 2118724 2079759 2045441 2015434 1989889
59249A989889k0824j6296j1862o960j986J886M714Q125J2918J7837K1696K5293
$$ 1989889 1969065 1952769 1940907 1933947 1931961 1933847 1938561 1946686 1959604 1977441 1999137 2024430
59237B024430K9939L5307M0220M4718M9795N5687O1865O8372P5804Q4211R3256
$$ 2024430 2054369 2089676 2129896 2174614 2224409 2280096 2341961 2410333 2486137 2570348 2663604
59226B663604J03255J14853J27870J41630J56246J72348J89643K06977K23872
$$ 2663604 2766859 2881712 3009582 3151212 3307458 3479806 3669449 3876426 4100298
59217D100298K40648K56898K71009K81422K87251K87277K79543K62488K35766
$$ 4100298 4340946 4597844 4868853 5150275 5437526 5724803 6004346 6266834 6502600
59208F502600J99723J55145J03951M9036p255o3706j18769j69498k12791k47044
$$ 6502600 6702323 6857468 6961419 7010455 7003200 6939494 6820725 6651227 6438436 6191392
59198F191392k71949k87433k93794k92416k85269k73770k58729k41202k22663
$$ 6191392 5919443 5632010 5338216 5045800 4760531 4486761 4228032 3986830 3764167
59189C764167k04267j86462j69273j52649j36630j21544j07915r5912q5113p5072
$$ 3764167 3559900 3373438 3204165 3051516 2914886 2793342 2685427 2589515 2504402 2429330
59179B429330o5913n7964n1085m4767l8729l3081k8100k4115k1334j9446j7685
$$ 2429330 2363417 2305453 2254368 2209601 2170872 2137791 2109691 2085576 2064242 2044796 2027111
59168B027111j5734j4240j3933j4512j5047j5311j5930j7258j8827k0132k1248
$$ 2027111 2011377 1997137 1983204 1968692 1953645 1938334 1922404 1905146 1886319 1866187 1844939
59157A844939k2319k3057k3285k3535k4494k6018k7272k7806k7916k7856k7280
$$ 1844939 1822620 1799563 1776278 1752743 1728249 1702231 1674959 1647153 1619237 1591381 1564101
59146A564101k5861k4048k2659k1841k0964j9618j8186j7133j6279j5172j3867
$$ 1564101 1538240 1514192 1491533 1469692 1448728 1429110 1410924 1393791 1377512 1362340 1348473
59135A348473j2763j1830j0621r033p539o435n338l645j231J501L999N918P335
$$ 1348473 1335710 1323880 1313259 1304226 1296687 1290252 1284914 1281269 1280038 1281539 1285538 1291456 1298791
59122A298791Q790J0813J3283J5513J7015J7890J8473J8992J9623K0413K1019
$$ 1298791 1307581 1318394 1331677 1347190 1364205 1382095 1400568 1419560 1439183 1459596 1480615
59111A480615K1023K0646K0565K0800K0468J9175J7909J7855J8815J9635K0041
$$ 1480615 1501638 1522284 1542849 1563649 1584117 1603292 1621201 1639056 1657871 1677506 1697547
59100A697547K1042K3514K7125L0914L4306L7265L9895M2314M4657M6921M8847
$$ 1697547 1718589 1742103 1769228 1800142 1834448 1871713 1911608 1953922 1998579 2045500 2094347
59089B094347N0085N0418M9797M8215M5623M1892L6957L0915K3914J5895O765
$$ 2094347 2144432 2194850 2244647 2292862 2338485 2380377 2417334 2448249 2472163 2488058 2494823
59078B494823l098j2840k1814k9971l7401m3925m9477n4332n8488o1265o2166
$$ 2494823 2491725 2478885 2457071 2427100 2389699 2345774 2296297 2241965 2183477 2122212 2060046
59067B060046o1822o1277o0578n8934n6201n3276n0835m8599m6209m3939m2041
$$ 2060046 1998224 1936947 1876369 1817435 1761234 1707958 1657123 1608524 1562315 1518376 1476335
59056A476335l9967l7031l3428l0003k7206k4897k2995k1709k0989k0253j8974
$$ 1476335 1436368 1399337 1365909 1335906 1308700 1283803 1260808 1239099 1218110 1197857 1178883
59045A178883j7292j5842j5002j4506j3915j3273j3080j3543j4165j4327j3971
$$ 1178883 1161591 1145749 1130747 1116241 1102326 1089053 1075973 1062430 1048265 1033938 1019967
59034A019967j3432j2742j1621j0040q360o918n852n291n242n248m696l565k448
$$ 1019967 1006535 993793 982172 972132 963772 956854 951002 945711 940469 935221 930525 926960 924512
59021I24512j727j255r01p59o15J34J532K685K837K418K422L100L860M255M443
$$ 924512 922785 921530 920629 919870 919255 919389 920921 923606 926443 928861 931283 934383 938243 942498 946941
59006I46941M726N188N811O658P820R400J1437J3595J5171J5710J5478J5043J4624
$$ 946941 951667 956855 962666 969324 977144 986544 997981 1011576 1026747 1042457 1057935 1072978 1087602
58993A087602J4119J3585J3231J3062J2898J2622J2161J1340J0166Q988Q097P326
$$ 1087602 1101721 1115306 1128537 1141599 1154497 1167119 1179280 1190620 1200786 1209774 1217871 1225197
58981A225197O420N552M967M429L592K730K417K559K536K313K671M080O030P822
$$ 1225197 1231617 1237169 1242136 1246565 1250157 1252887 1255304 1257863 1260399 1262712 1265383 1269463 1275493 1283315
58967A283315R411J1079J2774J4312J5812J7465J8992J9848J9829J9262J8602
$$ 1283315 1292726 1303805 1316579 1330891 1346703 1364168 1383160 1403008 1422837 1442099 1460701
58956A460701J8071J7622J7088J6457J5998J5981J6277J6529J6684J7007J7508
$$ 1460701 1478772 1496394 1513482 1529939 1545937 1561918 1578195 1594724 1611408 1628415 1645923
58945A645923J7843J7963J8414J9632K1326K3003K4809K7337L0738L4461L7950
$$ 1645923 1663766 1681729 1700143 1719775 1741101 1764104 1788913 1816250 1846988 1881449 1919399
58934A919399M1209M4543M7931N0876N2868N4025N5113N6821N9139O1679O4561
$$ 1919399 1960608 2005151 2053082 2103958 2156826 2210851 2265964 2322785 2381924 2443603 2508164
58923B508164O8428P3588P9630Q6107R3069J00488J07631J13646J18553J23195
$$ 2508164 2576592 2650180 2729810 2815917 2908986 3009474 3117105 3230751 3349304 3472499
58913C472499J28332J34167J40567J47145J53251J58521J63577J69739J77837
$$ 3472499 3600831 3734998 3875565 4022710 4175961 4334482 4498059 4667798 4845635
58904D845635J87493J97656K07559K17087K26525K36024K45142K52924K58555
$$ 4845635 5033128 5230784 5438343 5655430 5881955 6117979 6363121 6616045 6874600
58895F874600K61871K62981K61578K56983K48742K36644K20275J99146J73540
$$ 6874600 7136471 7399452 7661030 7918013 8166755 8403399 8623674 8822820 8996360
58886H996360J44721J13979Q1745M7897J2720k2845n7749r1330j23239j52994
$$ 8996360 9141081 9255060 9336805 9384702 9397422 9374577 9316828 9225498 9102259 8949265
58876H949265j79772k02753k21734k37187k49483k58306k63227k64653k63698
$$ 8949265 8769493 8566740 8345006 8107819 7858336 7600030 7336803 7072150 6808452
58867F808452k61042k56520k49952k41822k32740k22756k11694j99884j88093
$$ 6808452 6547410 6290890 6040938 5799116 5566376 5343620 5131926 4932042 4743949
58858D743949j76788j65881j55111j44386j33801j23596j14009j05014r6314q7698
$$ 4743949 4567161 4401280 4246169 4101783 3967982 3844386 3730377 3625363 3529049 3441351
58848C441351p9341p1473o4014n6747m9766m3377l7712l2600k7797k3029j8007
$$ 3441351 3362010 3290537 3226523 3169776 3120010 3076633 3038921 3006321 2978524 2955495 2937488
58837B937488j2759p862l938q51K243N980J0225J4537J8822K3308K8063L2884
$$ 2937488 2924729 2916867 2912929 2912078 2914321 2920301 2930526 2945063 2963885 2987193 3015256 3048140
58825C048140L7579M2201M7004N2219N7861O3659O9276P4716Q0422Q6826R3874
$$ 3048140 3085719 3127920 3174924 3227143 3285004 3348663 3417939 3492655 3573077 3659903 3753777
58814C753777J01175J08739J17265J27395J38800J50408J61648J72996J85010
$$ 3753777 3854952 3963691 4080956 4208351 4347151 4497559 4659207 4832203 5017213
58805E017213J97295K08971K19953K30931K42013K52118K60096K65774K69423
$$ 5017213 5214508 5423479 5643432 5874363 6116376 6368494 6628590 6894364 7163787
58796G163787K70564K67963K60596K48117K30604K08405J82158J52439J19341
$$ 7163787 7434351 7702314 7962910 8211027 8441631 8650036 8832194 8984633 9103974
58787I103974Q2895M3919M089l4899p1851j05927j36636j64242j89631k13361
$$ 9103974 9186869 9230788 9234877 9199978 9128127 9022200 8885564 8721322 8531691 8318330
58777H318330k35114k54280k70710k84423k94772l00475l00616k95491k86426
$$ 8318330 8083216 7828936 7558226 7273803 6979031 6678556 6377940 6082449 5796023
58768E796023k74941k62086k48406k34284k20185k06525j93423j80755j68406
$$ 5796023 5521082 5258996 5010590 4776306 4556121 4349596 4156173 3975418 3807012
58759C807012j56364j44685j33577j23476j14642j06670r8736r0547q2736p6117
$$ 3807012 3650648 3505963 3372386 3248910 3134268 3027598 2928862 2838315 2755579 2679462
58749B679462p0682o5704o0657n5723n1363m7664m4358m1323l8794l6981l5633
$$ 2679462 2608780 2543076 2482419 2426696 2375333 2327669 2283311 2241988 2203194 2166213 2130580
58738B130580l4198l2425l0577k8999k7683k6521k5738k5728k6507k7581k8396
$$ 2130580 2096382 2063957 2033380 2004381 1976698 1950177 1924439 1898711 1872204 1844623 1816227
58727A816227k8708k8541k8170k8117k8867l0298l1776l2894l3919l5289l6906
$$ 1816227 1787519 1758978 1730808 1702691 1673824 1643526 1611750 1578856 1544937 1509648 1472742
58716A472742l8188l8703l8474l7707l6504l4871l2904l0838k8911k7090k4975
$$ 1472742 1434554 1395851 1357377 1319670 1283166 1248295 1215391 1184553 1155642 1128552 1103577
58705A103577k2187j8913j5990j4236j3785j4154j4811j5521j6160j6473j6256
$$ 1103577 1081390 1062477 1046487 1032251 1018466 1004312 989501 973980 957820 941347 925091
58694I25091j5669j5156j4925j4601j3608j1863r850q005o266m453k725j377k83
$$ 925091 909422 894266 879341 864740 851132 839269 829419 821414 815148 810695 807970 806593 806310
58681H06310J163L481O671J0169J3193J5347J7058J9179K1899K4435K6169K7617
$$ 806310 807473 810954 817625 827794 840987 856334 873392 892571 914470 938905 965074 992691
58669I92691K9580L1616L2113K9787K4323J5763M444q116j9372k7544l2705l5707
$$ 992691 1022271 1053887 1086000 1115787 1140110 1155873 1160317 1152201 1132829 1105285 1072580 1036873
58657A036873l6753l5665l2901k9443k5924k2508j9280j6178j2835r163n818l487
$$ 1036873 1000120 964455 931554 902111 876187 853679 834399 818221 805386 796223 790405 786918
58645G86918j936m36J111K258K995L820M800N351N203M886N028N653O367O823
$$ 786918 784982 784546 785657 787915 790910 794730 799530 804881 810084 814970 819998 825651 832018 838841
58631H38841O904O865P324Q680J0457J1817J2739J4071J6162J8237J9490K0252
$$ 838841 845745 852610 859934 868614 879071 890888 903627 917698 933860 952097 971587 991839
58619I91839K1480K3593K6321K9375L2574L5541L7956M0185M3052M6824N0870
$$ 991839 1013319 1036912 1063233 1092608 1125182 1160723 1198679 1238864 1281916 1328740 1379610
58608A379610N4544N8001O1793O5929O9781P2906P5512P7962P9981Q0801P9925
$$ 1379610 1434154 1492155 1553948 1619877 1689658 1762564 1838076 1916038 1996019 2076820 2156745
58597B156745P7451P3551O7938O0150N0210L8713K6264J3109o05j4352k7157l8072
$$ 2156745 2234196 2307747 2375685 2435835 2486045 2524758 2551022 2564131 2563526 2549174 2522017 2483945
58585B483945m6625n2834n6842n8818n9226n8837n8081n6633n4115n1075m8613
$$ 2483945 2437320 2384486 2327644 2268826 2209600 2150763 2092682 2036049 1981934 1930859 1882246
58574A882246m6975m5375m3429m1927m1546m1569m0737l8922l6975l5173l2971
$$ 1882246 1835271 1789896 1746467 1704540 1662994 1621425 1580688 1541766 1504791 1469618 1436647
58563A436647l0253k7821k6279k5172k3649k1451j8865j6254j3987j2557j2384
$$ 1436647 1406394 1378573 1352294 1327122 1303473 1282022 1263157 1246903 1232916 1220359 1207975
58552A207975j3651j6384k0332k4703k8433l0866l1938l1754l0433k8461k6534
$$ 1207975 1194324 1177940 1157608 1132905 1104472 1073606 1041668 1009914 979481 951020 924486
58541I24486k4925k3382k1774k0305j8885j6985j4483j2084j0521r683q974q120
$$ 924486 899561 876179 854405 834100 815215 798230 783747 771663 761142 751459 742485 734365
58529G34365p191o211n248m607m494m698m943n303n868o330o316n947n631n493
$$ 734365 727174 720963 715715 711108 706614 701916 696973 691670 685802 679472 673156 667209 661578 656085
58515F56085n388n265n102m704m020l461l386l447k938j797o90j31qr0l42n68
$$ 656085 650697 645432 640330 635626 631606 628145 624759 621312 618374 616577 615887 615756 615748 615658 615316 614748
58499F14748k14R92K490L395L397K936K491K113J667J241J083J251J580K010K639
$$ 614748 614534 615526 618016 621411 624808 627744 630235 632348 634015 635256 636339 637590 639170 641180 643819
58484F43819L377L740L294K173J026M10L79N38L51m91j745k792l317l679m367
$$ 643819 647196 650936 654230 656403 657429 657839 658218 658756 659107 658616 656871 654079 650762 647083 642716
58469F42716n311o080o505o663o413n612m678m297m441m356l601k468j277RJ174
$$ 642716 637405 631325 624820 618157 611744 606132 601454 597157 592716 588360 584759 582291 581014 581023 582197
58454E82197J575J024K51J3K41N19P85J021Q42Q4o04m02P17K172L543M542M667
$$ 582197 583772 584796 585047 585060 585301 585820 586605 587626 588468 588552 587948 587546 588263 590435 593978 598520 603187
58437F03187L686K292J531J620J906J860J532J154Q39O89P22P23N70N43Q69J211
$$ 603187 606873 609165 610696 612316 614222 616082 617614 618768 619607 620296 621018 621741 622311 622854 623723 624934
58421F24934J167R96J246J729J717J125Q76J796L615N297N947N404M234L274K940
$$ 624934 626101 627097 628343 630072 631789 632914 633790 635586 639201 644498 650445 655849 660083 663357 666297
58406F66297L043L330L905M783N390N156M373L868L951M204M228M027L697L338
$$ 666297 669340 672670 676575 681358 686748 691904 696277 700145 704096 708300 712528 716555 720252 723590
58392G23590L222L536L967M036L747L505L481L578L813M163M247L824L463L945
$$ 723590 726812 730348 734315 738351 742098 745603 749084 752662 756475 760638 764885 768709 772172 776117
58378G76117N116O021O131N723N091M305L760M077N218O438P257P870Q437Q731
$$ 776117 781233 787254 793385 799108 804199 808504 812264 816341 821559 827997 835254 843124 851561 860292
58364H60292Q715Q713Q871R057R361R891J0087R150P366O028N750N829N613N455
$$ 860292 869007 877720 886591 895648 905009 914900 924987 934137 941503 947531 953281 959110 964723 970178
58350I70178N800O325O679P176Q050Q797R037R243R850J0327J0060R534R680J0484
$$ 970178 975978 982303 988982 996158 1004208 1013005 1022042 1031285 1041135 1051462 1061522 1071056 1080736 1091220
58336A091220J1193J1600J2099J2727J3029J2913J2894J3375J4302J5499J6826
$$ 1091220 1102413 1114013 1126112 1138839 1151868 1164781 1177675 1191050 1205352 1220851 1237677
58325A237677J7985J8607J8632J8361J8176J8325J8760J9053J8787J8209J7937
$$ 1237677 1255662 1274269 1292901 1311262 1329438 1347763 1366523 1385576 1404363 1422572 1440509
58314A440509J7924J7406J6256J5514J5896J6541J6223J5251J5091J6342J8234
$$ 1440509 1458433 1475839 1492095 1507609 1523505 1540046 1556269 1571520 1586611 1602953 1621187
58303A621187J9968K1548K3115K4430K5345K6145K7060K7982K8833K9813L0974
$$ 1621187 1641155 1662703 1685818 1710248 1735593 1761738 1788798 1816780 1845613 1875426 1906400
58292A906400L2020L2768L3543L4822L6603L8297L9276L9597M0155M1928M4922
$$ 1906400 1938420 1971188 2004731 2039553 2076156 2114453 2153729 2193326 2233481 2275409 2320331
58281B320331M8101N0515N2222N3941N6086N8451O0576O2014O2492O2068O1151
$$ 2320331 2368432 2418947 2471169 2525110 2581196 2639647 2700223 2762237 2824729 2886797 2947948
58270B947948O0141N9302N8942N9362O0485O1956O3723O6042O8805P1516P4177
$$ 2947948 3008089 3067391 3126333 3185695 3246180 3308136 3371859 3437901 3506706 3578222 3652399
58259C652399P7461Q1660Q6192R0508R4765R9147J03394J07647J12834J19334
$$ 3652399 3729860 3811520 3897712 3988220 4082985 4182132 4285526 4393173 4506007 4625341
58249D625341J26020J31634J36554J42238J49387J57504J65827J73862J81462
$$ 4625341 4751361 4882995 5019549 5161787 5311174 5468678 5634505 5808367 5989829
58240E989829J89308J98740K10201K22432K34187K46101K59653K74902K90736
$$ 5989829 6179137 6377877 6588078 6810510 7044697 7290798 7550451 7825353 8116089
58231H116089L07006L24905L45253L67768L92067M18231M46229M75901N07632
$$ 8116089 8423095 8748000 9093253 9461021 9853088 10271319 10717548 11193449 11701081
58222A1701081N42220N80125O21669O67757P19485P77319Q41583R13401R94182
$$ 11701081 12243301 12823426 13445095 14112852 14832337 15609656 16451239 17364640 18358822
58213A8358822J084772J186260J301065J432051J581367J751672J947847K176069
$$ 18358822 19443594 20629854 21930919 23362970 24944337 26696009 28643856 30819925
58205C0819925K442531K755274L125751L564485M074640M654084N307627O058008
$$ 30819925 33262456 36017730 39143481 42707966 46782606 51436690 56744317 62802325
58197F2802325O944409Q009374R284485J0785787J2522433J4509062J6764513
$$ 62802325 69746734 77756108 87040593 97826380 110348813 124857875 141622388
58190A41622388J9286174K1998147K4669144K6810388K7631096K6189369K1793877
$$ 141622388 160908562 182906709 207575853 234386241 262017337 288206706 310000583
58183C10000583J4475064N177921m531854j3088092j9468837k3375408k5068338
$$ 310000583 324475647 329653568 325121714 312033622 292564785 269189377 244121039
58176B44121039k5077690k3969161k2217599k0165310j8033027j5953861j4004433
$$ 244121039 219043349 195074188 172856589 152691279 134658252 118704391 104699958
58169A04699958j2223841j0626562r213558p978489o908942n988167n198815m524730
$$ 104699958 92476117 81849555 72635997 64657508 57748566 51760399 46561584 42036854
58161D2036854l949941l458807l038127k677752k368838k102924j872974j673858
$$ 42036854 38086913 34628106 31589979 28912227 26543389 24440465 22567491 20893633
58153B0893633j501250j350963j219491j104137j002459r12294q32183p60954
$$ 20893633 19392383 18041420 16821929 15717792 14715333 13803039 12970856 12209902
58145A2209902o97025o38985n86631n40346m99584m62848m29094l98227l70322
$$ 12209902 11512877 10873892 10287261 9746915 9247331 8784483 8355389 7957162 7586840
58136G586840l45232l22862l02926k84526k66845k50111k34987k21206k07878
$$ 7586840 7241608 6918746 6615820 6331294 6064449 5814338 5579351 5358145 5150267
58127E150267j95035j83677j74153j65643j57448j49770j42785j35947j28828
$$ 5150267 4955232 4771555 4597402 4431759 4274311 4124541 3981756 3845809 3716981
58118C716981j21887j15755j10308j05009r9729r4733r0171q5996q2182p8659
$$ 3716981 3595094 3479339 3369031 3264022 3164293 3069560 2979389 2893393 2811211 2732552
58108B732552p5220p1705o8198o4923o2149o0144n8857n7661n5802n3205n0460
$$ 2732552 2657332 2585627 2517429 2452506 2390357 2330213 2271356 2213695 2157893 2104688 2054228
58097B054228m7985m5691m3623m2242m1709m1328m0240l8408l6524l5056l3801
$$ 2054228 2006243 1960552 1916929 1874687 1832978 1791650 1751410 1713002 1676478 1641422 1607621
58086A607621l2309l0469k8595k7212k6674k6884k7294k7310k6762k5949k5251
$$ 1607621 1575312 1544843 1516248 1489036 1462362 1435478 1408184 1380874 1354112 1328163 1302912
58075A302912k4752k4234k3508k2646k1891k1321k0763j9979j8859j7423j5858
$$ 1302912 1278160 1253926 1230418 1207772 1185881 1164560 1143797 1123818 1104959 1087536 1071678
58064A071678j4552j3792j3338j2632j1589j0790j0578j0494j0056r728j0353
$$ 1071678 1057126 1043334 1029996 1017364 1005775 994985 984407 973913 963857 954129 943776
58053I43776j1731j2604j2178j0998j0108r902j0157j0584j0880j0569r428p967
$$ 943776 932045 919441 907263 896265 886157 876255 866098 855514 844634 834065 824637 816670
58041H16670p058p025p390p517p283p003o907o798o261n226m215l994m809o119
$$ 816670 809612 802587 795197 787680 780397 773394 766487 759689 753428 748202 743987 739993 735184 729065
58027G29065p022o952o060n059m684n047n453n109m015l027k890l436l839l551
$$ 729065 722043 715091 709031 703972 699288 694241 688788 683679 679664 676637 673747 670311 666472 662921
58013F62921k799k250k344k951l516l601l308l173l601m391m909m731m028l282
$$ 662921 660122 657872 655528 652577 649061 645460 642152 638979 635378 630987 626078 621347 617319 614037
57999F14037k703k135j525j163j179j054j66J252K208K192J730J445J209O66P3
$$ 614037 611334 609199 607674 606511 605332 604278 604112 605364 607572 609764 611494 612939 614148 614814 614887
57984F14887j45k15o10r97n90M34P91k62j952l062l333l347l552l999m655n388
$$ 614887 614742 614527 613917 612920 612330 612764 613555 613293 611341 608279 604946 601599 598047 594048 589393 584005
57968E84005n805n583m841l961l240k880k911k870j987j64J666K643L018L535
$$ 584005 578200 572617 567776 563815 560575 557695 554784 551914 549927 549763 551429 554072 557090 560625
57954E60625M218M585M688N038N474N139L786K238J151P5j680l897n847p436r146
$$ 560625 564843 569428 574116 579154 584628 589767 593553 595791 596942 597017 595337 591440 585593 578157 569011
57939E69011j0949j2104j2155j1591j1118j0712r761q104o397n350m887m400l680
$$ 569011 558062 545958 533803 522212 511094 500382 490621 482517 476120 470770 465883 461483 457803
57926D57803l170l175l280k937k320k088k368k559k253j831j800j989j797j044
$$ 457803 454633 451458 448178 445241 442921 440833 438465 435906 433653 431822 430022 428033 426236 425192
57912D25192j09O54J266J832K272K435K400K527L134M011M314L311J400m3k47
$$ 425192 425083 425737 427003 428835 431107 433542 435942 438469 441603 445614 449928 453239 454639 454596 454349
57897D54349r4j011l014m669n096n063n554o067n351l484k053k121k880k913j947
$$ 454349 454255 453244 450230 445561 440465 435402 429848 423781 418430 414946 412893 410772 407892 404979 403032
57882D03032q25j08L73Q56J262J689K500L686M601M711M322M179M550M999M916
$$ 403032 402207 402099 402472 403328 404590 406279 408779 412465 417066 421777 426099 430278 434828 439827 444743
57867D44743M018K510R42j65q26j573k800m212n160n328m901m274l885m027m489
$$ 444743 448761 451271 452213 452048 451222 449649 446849 442637 437477 432149 427248 422974 419089 415062 410573
57852D10573m545l775k706k116j881j207P8J227J763K177L079M264N162N642N771
$$ 410573 406028 402253 399547 397431 395550 394343 394421 395648 397411 399588 402667 406931 412093 417735 423506
57837D23506N307M119K862K479L075L891M237L799K170j117n794j0647j4343j6151
$$ 423506 428813 432932 435794 438273 441348 445239 449476 453275 455445 454328 448534 437887 423544 407393
57823D07393j5902j3881j0996q394o532m994l442k222j652j300n25P24K128L655
$$ 407393 391491 377610 366614 358220 351688 346694 343252 341030 339378 338078 337553 338277 340405 344060
57809C44060N316O567O701N865N028M900N454O434P699Q937R723J0048J0243J0148
$$ 344060 349376 355943 362644 368509 373537 378437 383891 390325 398024 406961 416684 426732 436975 447123
57795D47123R084P004M965L844L115J653o40k848m477o018p930r865j1223j1916
$$ 447123 456207 463211 468176 472020 475135 476788 476148 473300 468823 462805 454875 445010 433787 421871
57781D21871j2192j2087j1464j0398r163q010p068o354n752n121m520m064l538
$$ 421871 409679 397592 386128 375730 366567 358557 351489 345135 339383 334262 329742 325678 322140
57768C22140k546j198k47j59m43l32J77M94M39N19J172K210L099L484L362L087
$$ 322140 319594 318396 318149 317990 317547 317215 317392 317886 318325 318844 320016 322226 325325 328809 332171 335258
57752C35258L254M137N273N894N825N573N485N347M954M559M373M147L610L010
$$ 335258 338512 342649 347922 353816 359641 365214 370699 376046 381000 385559 389932 394079 397689 400699
57738D00699K769K842K929L070L514M128M514M697N186O210P302P868P839P581
$$ 400699 403468 406310 409239 412309 415823 419951 424465 429162 434348 440558 447860 455728 463567 471148
57724D71148P428P474P661P861P990Q105Q346Q703R051R389R957J0963J2335J3807
$$ 471148 478576 486050 493711 501572 509562 517667 526013 534716 543767 553156 563113 574076 586411 600218
57710F00218J5080J5961J6500J7020J7847J8982K0188K1389K2748K4300K5893
$$ 600218 615298 631259 647759 664779 682626 701608 721796 743185 765933 790233 816126
57699H16126K7555K9639L2357L5463L8614M1836M5315M8990N2712N6680O1318
$$ 816126 843681 873320 905677 941140 979754 1021590 1066905 1115895 1168607 1225287 1286605
57688A286605O6655P2199P7434Q2257Q6813R1173R5215R8701J01339J02946J03564
$$ 1286605 1353260 1425459 1502893 1585150 1671963 1763136 1858351 1957052 2058391 2161337 2264901
57677B264901J03311J02189J00316R8484R8202J01182J08734J20937J34687J41611
$$ 2264901 2368212 2470401 2570717 2669201 2767403 2868585 2977319 3098256 3232943 3374554
57667C374554J29420Q8681K0875n9916j34381j88350k17714k25870k18755k02148
$$ 3374554 3503974 3592655 3613530 3553614 3419233 3230883 3013169 2787299 2568544 2366396
57657B366396j81159j59698j39747j21660j05301r0624p7477o5555n4829m5577
$$ 2366396 2185237 2025539 1885792 1764132 1658831 1568207 1490730 1425175 1370346 1324769
57647A324769l7878l1373k5591k0224j4998r718m591j53L412O692J0463J4830
$$ 1324769 1286891 1255518 1229927 1209703 1194705 1184987 1180396 1180243 1183655 1190347 1200810 1215640
57635A215640J9192K2979K6243K9497L3178L7289M1534M5650M9529N3042N5994
$$ 1215640 1234832 1257811 1284054 1313551 1346729 1384018 1425552 1471202 1520731 1573773 1629767
57624A629767N8454O0818O3186O4816O4617O2170N7886N2259M5433L7477K8360
$$ 1629767 1688221 1749039 1812225 1877041 1941658 2003828 2061714 2113973 2159406 2196883 2225243
57613B225243J7616M784r401k2979l4488m4180n3007o0950o7125p1115p3320p4077
$$ 2225243 2242859 2247643 2238242 2215263 2180775 2136595 2083588 2022638 1955513 1884398 1811078 1737001
57601A737001p3321p1184o8211o4876o1386n7996n4942n1994m8721m5236m2102
$$ 1737001 1663680 1592496 1524285 1459409 1398023 1340027 1285085 1233091 1184370 1139134 1097032
57590A097032l9393l6550l3404l0629k8767k7350k5476k2870k0047j7683j6192
$$ 1097032 1057639 1021089 987685 957056 928289 900939 875463 852593 832546 814863 798671
57579G98671j5541j5147j4203j2426j0294q442p114o330n986n607m564k944j645
$$ 798671 783130 767983 753780 741354 731060 722618 715504 709174 703188 697581 693017 690073 688428
57566F88428j175r46l20K91K64Q6Q79K720M501N446N837O179O590P187Q261R672
$$ 688428 687253 686307 685987 686278 686542 686628 687507 690227 694728 700174 706011 712190 718780 725967 734228 743900
57550G43900J0874J1873J3373J5567J7589J8822J9979K2070K4763K6881K8215
$$ 743900 754774 766647 780020 795587 813176 831998 851977 874047 898810 925691 953906
57539I53906K9770L2158L4648L6308L7359L8841M1305M4391M7465N0209N2554
$$ 953906 983676 1015834 1050482 1086790 1124149 1162990 1204295 1248686 1296151 1346360 1398914
57528A398914N4369N5404N5406N4236N1924M8641M4511L9346L2684K4182J4116
$$ 1398914 1453283 1508687 1564093 1618329 1670253 1718894 1763405 1802751 1835435 1859617 1873733
57517A873733L388p006j6584k5377l3424m0404m5819m9391n1290n1989n1967n1362
$$ 1873733 1877121 1870115 1853531 1828154 1794730 1754326 1708507 1659116 1607826 1555837 1503870 1452508
57505A452508m9910m7371m4069m0761l7823l4871l1357k7362k3452j9981j6947
$$ 1452508 1402598 1355227 1311158 1270397 1232574 1197703 1166346 1138984 1115532 1095551 1078604
57494A078604j4437j2655j1322r564o799l488o00J509L288N187P153R100J1337
$$ 1078604 1064167 1051512 1040190 1030626 1023827 1020339 1019739 1021248 1024536 1029723 1036876 1045976 1057313
57481A057313J4174J7312K0140K2586K5220K8435L1889L5007L7736M0463M3257
$$ 1057313 1071487 1088799 1108939 1131525 1156745 1185180 1217069 1252076 1289812 1330275 1373532
57470A373532M5647M7185M7973M8522M9190M9796M9617M7784M3906L8377L1898
$$ 1373532 1419179 1466364 1514337 1562859 1612049 1661845 1711462 1759246 1803152 1841529 1873427
57459A873427K4682J6378O829l428j3594k3220l2130l9993m6354n1000n3958n5278
$$ 1873427 1898109 1914487 1921316 1917888 1904294 1881074 1848944 1808951 1762597 1711597 1657639 1602361
57447A602361n5111n3946n2387n0633m8545m6137m3714m1423l9065l6472l3739
$$ 1602361 1547250 1493304 1440917 1390284 1341739 1295602 1251888 1210465 1171400 1134928 1101189
57436A101189l0946k8035k5195k2901k1241j9529j7067j4128j1682j0266r623
$$ 1101189 1070243 1042208 1017013 994112 972871 953342 936275 922147 910465 900199 890576
57425H90576r362r305r037p873n794l905l313l751l971l354k427j709r24K32J265
$$ 890576 881214 871909 862872 854999 849205 845300 841987 838236 834265 830911 828484 826775 825851 826083 827348
57410H27348J466J019P32R20J240J567K202L051L456L220L033L444M000M055L833
$$ 827348 828814 829833 830565 831485 832725 834292 836494 839545 843001 846221 849254 852698 856698 860753 864586
57395H64586L917M191M211M299N169O545P250O938O652P217Q022Q048P383O873
$$ 864586 868503 872694 876905 881204 886373 892918 900168 907106 913758 920975 928997 937045 944428 951301
57381I51301O781O662O281N945N970O430P313Q412R167R141Q564Q015P688P392
$$ 951301 958082 964744 971025 976970 982940 989370 996683 1005095 1014262 1023403 1031967 1039982 1047670 1055062
57367A055062P061O799O644O747P517Q990J0317J0644J0269J0129J0311J0053
$$ 1055062 1062123 1068922 1075566 1082313 1089830 1098820 1109137 1119781 1130050 1140179 1150490 1160543
57355A160543R244Q840R373J0109J0251J0126J0459J1159J1582J1562J1447J1447
$$ 1160543 1169787 1178627 1188000 1198109 1208360 1218486 1228945 1240104 1251686 1263248 1274695 1286142
57343A286142J1590J2030J2774J3399J3603J3756J4237J4641J4349J3772J4026
$$ 1286142 1297732 1309762 1322536 1335935 1349538 1363294 1377531 1392172 1406521 1420293 1434319
57332A434319J5375J6829J7512J7707J8160J8991J9747K0209K0604K1163K1844
$$ 1434319 1449694 1466523 1484035 1501742 1519902 1538893 1558640 1578849 1599453 1620616 1642460
57321A642460K2516K3232K4157K5222K5950K5884K5349K5397K6667K8515K9813
$$ 1642460 1664976 1688208 1712365 1737587 1763537 1789421 1814770 1840167 1866834 1895349 1925162
57310A925162L0418L1242L2849L4711L6042L6745L7121L7183L6820L6336L6179
$$ 1925162 1955580 1986822 2019671 2054382 2090424 2127169 2164290 2201473 2238293 2274629 2310808
57299B310808L6242L5937L5023L3911L2966L1921L0308K8301K6661K5796K5194
$$ 2310808 2347050 2382987 2418010 2451921 2484887 2516808 2547116 2575417 2602078 2627874 2653068
57288B653068K4100K2546K1385K1310K2271K3926K6183K8995L1989L4809L7508
$$ 2653068 2677168 2699714 2721099 2742409 2764680 2788606 2814789 2843784 2875773 2910582 2948090
57277B948090M0251M2741M4544M5788M7035M8408M9454M9912N0099N0313N0374
$$ 2948090 2988341 3031082 3075626 3121414 3168449 3216857 3266311 3316223 3366322 3416635 3467009
57266C467009N0052M9507M9052M8732M8362M7672M6321M4169M1737L9932L9014
$$ 3467009 3517061 3566568 3615620 3664352 3712714 3760386 3806707 3850876 3892613 3932545 3971559
57255C971559L8307L7188L5921L5022L4286L3102L1472L0055K9246K8824K8433
$$ 3971559 4009866 4047054 4082975 4117997 4152283 4185385 4216857 4246912 4276158 4304982 4333415
57244D333415K7915K7134K6021K4902K4337K4433K4725K4924K5338K6270K7325
$$ 4333415 4361330 4388464 4414485 4439387 4463724 4488157 4512882 4537806 4563144 4589414 4616739
57233D616739K7758K7358K6641K6236K6373K6960K7804K8566K8780K8251K7412
$$ 4616739 4644497 4671855 4698496 4724732 4751105 4778065 4805869 4834435 4863215 4891466 4918878
57222D918878K6965K7101K7308K7109K6673K6465K6483K6299K5775K5206K4722
$$ 4918878 4945843 4972944 5000252 5027361 5054034 5080499 5106982 5133281 5159056 5184262 5208984
57211E208984K4082K3269K2757K2817K2941K2499K1640K1024K0842K0687K0260
$$ 5208984 5233066 5256335 5279092 5301909 5324850 5347349 5368989 5390013 5410855 5431542 5451802
57200E451802J9585J8544J6925J5118J4159J4575J5596J6010J5418J4323J3204
$$ 5451802 5471387 5489931 5506856 5521974 5536133 5550708 5566304 5582314 5597732 5612055 5625259
57189E625259J2136J1233J0773J0742J0675J0330J0114J0564J1599J2696J3644
$$ 5625259 5637395 5648628 5659401 5670143 5680818 5691148 5701262 5711826 5723425 5736121 5749765
57178E749765J4709J6041J7381J8400J9020J9202J8796J7796J6467J4971J3177
$$ 5749765 5764474 5780515 5797896 5816296 5835316 5854518 5873314 5891110 5907577 5922548 5935725
57167E935725J1070Q949O788L801o92o098j0857j3921j5354j5584j4891j3817
$$ 5935725 5946795 5955744 5962532 5966333 5965641 5959543 5948686 5934765 5919411 5903827 5888936 5875119
57155E875119j3208j3302j3430j3113j2970j3865j5545j6878j7324j7538j8454
$$ 5875119 5861911 5848609 5835179 5822066 5809096 5795231 5779686 5762808 5745484 5727946 5709492
57144E709492k0283k2494k4397k5661k6510k7429k8518k9254k9176k8513k7863
$$ 5709492 5689209 5666715 5642318 5616657 5590147 5562718 5534200 5504946 5475770 5447257 5419394
57133E419394k7404k6816k5776k4133k1722j8559j5139j2115r631p340m975k428
$$ 5419394 5391990 5365174 5339398 5315265 5293543 5274984 5259845 5247730 5238099 5230759 5225784 5223356
57121E223356O17M573R426J4837K0815K7704L5495M3760N2517O2475P4094Q7025
$$ 5223356 5223973 5228546 5237972 5252809 5273624 5301328 5336823 5380583 5433100 5495575 5569669 5656694
57109E656694J01003J16848J35948J59059J86241K17861K54995K98853L50389
$$ 5656694 5757697 5874545 6010493 6169552 6355793 6573654 6828649 7127502 7477891
57100G477891M10842M82214N66819O66375P81828R13953J063699J231461J415817
$$ 7477891 7888733 8370947 8937766 9604141 10385969 11299922 12363621 13595082 15010899
57091A5010899J613076J817930K024238K224759K410197K568675K685948K745712
$$ 15010899 16623975 18441905 20466143 22690902 25101099 27669774 30355722 33101434
57083C3101434K730050K621341K406609K083125J662319J169264O37286J00107
$$ 33101434 35831484 38452825 40859434 42942559 44604878 45774142 46411428 46511535
57075D6511535m14501q86980j304918j661250j953183k181180k347530k455190
$$ 46511535 46097034 45210054 43905136 42243886 40290703 38109523 35761993 33306803
57067C3306803k507698k509509k465808k382174k264967k122029j962265j793948
$$ 33306803 30799105 28289596 25823788 23441614 21176647 19054618 17092353 15298405
57059A5298405j623374j455244j293863j143280j006180q83278p74184o78468
$$ 15298405 13675031 12219787 10925924 9782644 8776464 7893186 7119002 6440534
57051F440534n95470n23567m60622m05312l57394l16506k81466k51101k25049
$$ 6440534 5845064 5321497 4860875 4455563 4098169 3781663 3500197 3249096 3024047
57042C024047k03129j84457j67875j52948j39850j28473j18380j09378j01449
$$ 3024047 2820918 2636461 2468586 2315638 2175788 2047315 1928935 1819557 1718108
57033A718108r4137q6795p9519p3159o8243o4338o0635n6675n2481m8421m4986
$$ 1718108 1623971 1537176 1457657 1384498 1316255 1251917 1191282 1134607 1082126 1033705 988719
57022I88719m2345m0111l7949l6109l4810l3390l1026k8162k6171k5507k5208
$$ 988719 946374 906263 868314 832205 797395 764005 732979 704817 678646 653139 627931
57011F27931k4453k3483k2613k1500k0011j8817j8259j7553j6037j4430j3763
$$ 627931 603478 579995 557382 535882 515871 497054 478795 461242 445205 430775 417012
57000D17012j3664j2852j1047r218q090p372o456n086l241j121P21J861K666L873
$$ 417012 403348 390496 379449 370231 362141 354769 348313 343227 339986 338865 339586 341447 344113 347986
56986C47986N572P186Q404R415J0142R949Q323N440J924j498m168n778o661p398
$$ 347986 353558 360744 369148 378563 388705 398654 406977 412417 414341 412843 408675 402897 396236 388838
56972C88838q123q500q287p482o063m141k231q41K23J520L042M284N244O590Q596
$$ 388838 380715 372215 363928 356446 350383 346242 344011 343170 343393 344913 347955 352239 357483 364073 372669
56957C72669J0552J1524J1122R239N735Q88m189q121j0203j0656j0261r885r930
$$ 372669 383221 394745 405867 415106 420841 421729 417540 409419 399216 388560 378299 368414 358484
56944C58484j0000r337p783n989m553l325j808J36K314M633P130R730J2279J4607
$$ 358484 348484 339147 331364 325375 320822 317497 315689 315825 318139 322772 329902 339632 351911 366518
56930C66518J6304J6594J4739J0621M851j616p867j3178j7019j9023j9158j7981
$$ 366518 382822 399416 414155 424776 429627 428011 420144 406966 389947 370924 351766 333785
56918C33785j6482j5283j4122j2463j0492q976q149p375o076m508l321k725k425
$$ 333785 317303 302020 287898 275435 264943 255967 247818 240443 234367 229859 226538 223813 221388
56905B21388k111j703j324j163j213j083l81O74J391J475J357J486J832K368L487
$$ 221388 219277 217574 216250 215087 213874 212791 212410 213084 214475 215950 217307 218793 220625 222993 226480
56890B26480N478P811R497J0084R977R857R908R588Q081N157J594j492l675n208
$$ 226480 231958 239769 249266 259350 269327 279184 289092 298680 306761 311918 313512 312020 308345 303137
56876C03137o084n853m497k845j599n64P59K381M182O446R279J2004J3911J5401
$$ 303137 297053 291200 286703 283858 282259 281695 282454 284835 289017 295463 304742 316746 330657 346058
56862C46058J7527K0497K3424K5414K6018K4596K0281J3147M798k785q681j2984
$$ 346058 363585 384082 407506 432920 458938 483534 503815 516962 521760 518975 510294 497310
56850D97310j5804j6937j6399j4769j2710j0293p059k814J867O139R900J3863
$$ 497310 481506 464569 448170 433401 420691 410398 403339 400525 402392 408531 418431 432294
56838D32294J8553K3583K8289L2613L6807M0399M1932L9770L2994K1850P939o206
$$ 432294 450847 474430 502719 535332 572139 612538 654470 694240 727234 749084 757023 750817
56826G50817j8399k7786l4361l7797l7584l4284k9649k5150k0909j6455j1811
$$ 750817 732418 704632 670271 632474 594890 560606 530957 505807 484898 468443 456632
56815D56632p378l257P78M925R427J4577K0146K5084K8292K9354K8062K3634J5356
$$ 456632 449254 445997 446775 451700 461127 475704 495850 520934 549226 578580 606642 630276 645632
56802F45632M065p801j7917k5379l0299l2760l2757l0742k7582k3979k0244j6649
$$ 645632 649697 641896 623979 598600 568301 535541 502784 472042 444460 420481 400237 383588
56790C83588j3525j0937q475n657k440Q56M070P347J0677J3511J5069J4915J3012
$$ 383588 370063 359126 350651 344994 342554 343410 347480 354827 365504 379015 394084 408999 422011
56777D22011R301L758k989r505j4420j7456j9279k0419k0637j9470j7112j4523
$$ 422011 431312 435070 432081 422576 408156 390700 371421 351002 330365 310895 293783 279260
56765B79260j2672j1731j1041r856q116o452n396m808m172l323k624k460k822
$$ 279260 266588 254857 243816 233960 225844 219392 213996 209188 205016 201693 199069 196609 193787
56752A93787l383l813l879l490k809k197j901j773j443p11K46J001J195Q10K35
$$ 193787 190404 186591 182712 179222 176413 174216 172315 170542 169099 168388 168634 169635 170830 171640 171875
56737A71875QL50R50J291J147P50M58L64K70K7k26k43p9r1m68r31j103j004q69
$$ 171875 171883 172233 173183 174474 175621 176371 176829 177193 177463 177490 177264 177021 176942 176851 176383 175452 174349 173345 172476
56718A72476o59j60M00L81m12j318j650j530j549j840k019j793j226m52L53Q21
$$ 172476 171817 171657 172057 172438 172026 170708 169058 167528 165979 164139 162120 160327 159101 158649 159002 159823
56702A59823P01L07J87L64M44M32P33J194R80j93j330j347m82J53J20M1N18J289
$$ 159823 160524 160831 161018 161382 161826 162258 162991 164185 165165 164972 163642 162295 161813 161966 162086 162127 162645 163934
56684A63934J637J263O23N13J305K448K955K505J773J484J562J586J569J674J535
$$ 163934 165571 166834 167457 167970 169275 171723 174678 177183 178956 180440 182002 183588 185157 186831 188366
56669A88366O88m44q58k82M63N58J8o52j091j133p68l27l01q12j516k150k667
$$ 188366 189054 188610 187752 187470 187933 188491 188509 187857 186766 185633 184865 184538 184237 183425 181909 179759 177092
56652A77092k907k635k009j452r76k40O22Q95L06n11q54p33m70j87m5l06p67p68
$$ 177092 174185 171550 169541 168089 167113 166873 167495 168390 168696 168185 167331 166598 166128 165941 165896 165590 164823 164055
56634A64055k25M9l94q23n38j51o46j654j859q81K90P76P20N89M72L51L20K67
$$ 164055 163830 163879 163485 162662 162124 161973 161327 159673 157814 156933 157223 157999 158719 159308 159780 160131 160451 160718
56616A60718j34q15j196q97j40O58J303J730J939K100K341K362J773Q12K16K55
$$ 160718 160584 159769 158573 157676 157536 158194 159497 161227 163166 165266 167607 169969 171742 172554 172770 173025
56600A73025M49L64J50Q8J30J79L68P35R99Q94M33k73j013j288o98K53M50l50
$$ 173025 173474 173838 173988 174076 174206 174385 174753 175488 176487 177381 177814 177541 176528 175240 174542 174795 175245 174895
56582A74895r69l20J089J880J692J447J897K629K782K164J349R69J200J738K140
$$ 174895 173926 173606 174695 176575 178267 179714 181611 184240 187022 189186 190535 191504 192704 194442 196582
56567A96582K213K098K036K140K413K790L035K832K186J573J444J725J952J802
$$ 196582 198795 200893 202929 205069 207482 210272 213307 216139 218325 219898 221342 223067 225019 226821
56553B26821J289O21P1r4J33M23M50K14j74p83j650k345k337j762j432j827k470
$$ 226821 228110 228731 228802 228708 228841 229264 229714 229928 229754 228971 227321 224976 222639 220877 219445 217618 215148
56536B15148k544j938j358j439k071k600k490j722p13L3K78J88J36K82L98J61
$$ 215148 212604 210666 209308 207869 205798 203198 200708 198986 198273 198306 198584 198772 198908 199190 199588 199749
56520A99749m04r58j257j336j252r48n32m37r03j467j435q45n44j098k010k307
$$ 199749 199345 198387 197130 195794 194542 193594 193062 192625 191722 190255 188820 187975 187431 186333 184323 182016
56504A82016j705q33m21n75q61q33l45M46J202J536J242M88l05p82r30r15q14
$$ 182016 180311 179478 179057 178482 177621 176788 176443 176889 178091 179627 180869 181357 181052 180270 179340 178425 177611
56487A77611n42n6N68J221J740J872J525J091J166J766K243K159J835J715J603
$$ 177611 177069 177013 177581 178802 180542 182414 183939 185030 186196 187962 190205 192364 194199 195914 197517
56472A97517J142O32P59J599K575L320L879M102L594K444J346P26L56O0J31O17
$$ 197517 198659 199291 200050 201649 204224 207544 211423 215525 219119 221563 222909 223635 223991 224051 224182 224799
56456B24799Q80L77m86q50m73J68N46M53j0m03j62O98J396J269N62p0m29o63o63
$$ 224799 225679 226056 225570 224720 224247 224415 224961 225414 225404 225001 224839 225537 226933 228202 228764 228694 228265 227602 226939
56437B26939l08q3o44j733k318j946j353j406j984k294j946j286p88n15k44P7
$$ 226939 226631 226548 225904 224171 221853 219907 218554 217148 215164 212870 210924 209638 208850 208335 208091 208168
56421B08168J88p3l95k36M51J107J240R59O81O41Q99J460K067K228J869J545J632
$$ 208168 208356 208283 207888 207652 208103 209210 210450 211409 212090 212731 213630 215090 217157 219385 221254 222799 224431
56404B24431J754J544J457K042K782K633J545N06Q2r8l00k84j53n61j513j953
$$ 224431 226185 227729 229186 231228 234010 236643 238188 238694 238776 238678 238378 238094 237941 237380 235867 233914
56388B33914j224j92%m02k29Q72K019K311J661O05j74k08L24O77M64K38O28J291
$$ 233914 232690 232498 232498 232096 231867 232739 234758 237069 238730 239335 239161 238953 239277 239954 240418 240656 241284 242575
56370B42575J450J197J313J896K178J840J543J785K091J875J449J423J700J696
$$ 242575 244025 245222 246535 248431 250609 252449 253992 255777 257868 259743 261192 262615 264315 266011
56356B66011J311R96J037J331J744K213K498K413K265K539L160L466L109K522
$$ 266011 267322 268318 269355 270686 272430 274643 277141 279554 281819 284358 287518 290984 294093 296615
56342B96615K288K514K981L579M205M548M401M058M014M317M617M814N229O006
$$ 296615 298903 301417 304398 307977 312182 316730 321131 325189 329203 333520 338137 342951 348180 354186
56328C54186O731O932O701O514O581O718O799O949P165P098O415N300M358M044
$$ 354186 360917 367849 374550 381064 387645 394363 401162 408111 415276 422374 428789 434089 438447 442491
56314D42491M240M396L960K756J176K1r0O90J482J537R79N40N67O56L95J63P46
$$ 442491 446731 451127 455087 457843 459019 459040 458950 459640 461122 462659 463638 464178 464745 465401 465796 465959 466705
56297D66705K240L912N187O330P780R323J0428J1112J1855J2718J3214J3276J3673
$$ 466705 468945 472857 478044 484374 492154 501477 511905 523017 534872 547590 560804 574080 587753
56284E87753J5091J7194J9017K0118K0922K2124K4082K6731K9734L2766L5878
$$ 587753 602844 620038 639055 659173 680095 702219 726301 753032 782766 815532 851410
56273H51410L9511M3956M8975N4287O0234O7496P6163Q5541R4974J04475J14391
$$ 851410 890921 934877 983852 1038139 1098373 1165869 1242032 1327573 1422547 1527022 1641413
56262A641413J24751J35138J44902J53371J60056J64833J67708J68321J65813
$$ 1641413 1766164 1901302 2046204 2199575 2359631 2524464 2692172 2860493 3026306
56253C026306J59350J48566J33526J14628R2669O8690M3545J7960o915k9536m8980
$$ 3026306 3185656 3334222 3467748 3582376 3675045 3743735 3787280 3805240 3798325 3768789 3719809
56242C719809o5644q0456r3703j04957j13930j20794j25862j29421j31801j33063
$$ 3719809 3654165 3573709 3480006 3375049 3261119 3140325 3014463 2885042 2753241 2620178
56232B620178j32767j30560j26997j23162j19424j15185j09925j03893r7499r0733
$$ 2620178 2487411 2356851 2229854 2106692 1987268 1872083 1762158 1658265 1560766 1470033
56222A470033q3594p6586p0300o4685n9267n3774m8332m3189l8575l4599l1051
$$ 1470033 1386439 1309853 1239553 1174868 1115601 1061827 1013495 970306 931731 897132 866081
56211H66081k7559k4191k1576k0015j8810j6934j4194j1322r103p803p294p148
$$ 866081 838522 814331 792755 772740 753930 736996 722802 711480 702377 694574 687280 680132
56199F80132o672n386l643k372k092k359k301j465j10J144J894K297K879L891
$$ 680132 673460 668074 664431 662059 659967 657608 655307 653842 653732 654876 656770 659067 661946 665837
56185F65837N046O013O884P900Q926R649J0141J0797J1777J2866J3873J4765J5446
$$ 665837 670883 676896 683780 691680 700606 710255 720396 731193 742970 755836 769709 784474 799920
56172G99920J5784J5821J5719J5452J4955J4387J3951J3518J2880J2214J1859
$$ 799920 815704 831525 847244 862696 877651 892038 905989 919507 932387 944601 956460
56161I56460J1828J2041J2921J5014J8152K1701K5686L0868L7560M5349N4272
$$ 956460 968288 980329 993250 1008264 1026416 1048117 1073803 1104671 1142231 1187580 1241852
56150A241852O5384P9521R6168J14109J32378J49727J63610J70600J68084J55514
$$ 1241852 1307236 1386757 1482925 1597034 1729412 1879139 2042749 2213349 2381433 2536947
56140B536947J34878J10688Q8818P3946O7261O6438O7172O4602N4613L5974J1858
$$ 2536947 2671825 2782513 2871331 2945277 3012538 3078976 3146148 3210750 3265363 3301337 3313195
56129C313195j1536k8708l7583l9610l8586l9604m7397o4007q7574j13539j36967
$$ 3313195 3301659 3272951 3235368 3195758 3157172 3117568 3070171 3006164 2918590 2805051 2668084
56118B668084j53934j61895j60202j50483j35870j19290j02426q6092p0946n7467
$$ 2668084 2514150 2352255 2192053 2041570 1905700 1786410 1683984 1597892 1526946 1469479
56108A469479m5677l5424k6912k0371j5233j0215m708L46L506M576M702M862M954
$$ 1469479 1423802 1388378 1361466 1341095 1325862 1315647 1310939 1311285 1314791 1319367 1324069 1328931 1333885
56095A333885M485L442K149Q08m11j179j382j372j447j349o89M18J602K895M601
$$ 1333885 1338370 1341812 1343961 1344769 1344358 1343179 1341797 1340425 1338978 1337629 1336940 1337358 1338960 1341855 1346456
56080A346456O575Q168Q970R275R695J0578J1828J3135J4330J5543J6973J8489
$$ 1346456 1353031 1361199 1370169 1379444 1389139 1399717 1411545 1424680 1439010 1454553 1471526 1490015
56068A490015J9680K0334K0633K0819K0968K1242K1907K2937K3977K4907K5991
$$ 1490015 1509695 1530029 1550662 1571481 1592449 1613691 1635598 1658535 1682512 1707419 1733410
56057A733410K7224K8177K8813K9765L1260L2430L2523L2210L2714L3982L4917
$$ 1733410 1760634 1788811 1817624 1847389 1878649 1911079 1943602 1975812 2008526 2042508 2077425
56046B077425L5277L6158L8394M1362M3894M5515M6453M7068M7789M9153N1334
$$ 2077425 2112702 2148860 2187254 2228616 2272510 2318025 2364478 2411546 2459335 2508488 2559822
56035B559822N3880N6220N8215O0094O2114O4385O6787O9004P0864P2690P4894
$$ 2559822 2613702 2669922 2728137 2788231 2850345 2914730 2981517 3050521 3121385 3194075 3268969
56024C268969P7249P9090Q0343Q1767Q3977Q6709Q9400R2080R5190R8915J03076
$$ 3268969 3346218 3425308 3505651 3587418 3671395 3758104 3847504 3939584 4034774 4133689 4236765
56013D236765J07530J12214J16928J21439J25887J30778J36415J42591J48895
$$ 4236765 4344295 4456509 4573437 4694876 4820763 4951541 5087956 5230547 5379442
56004E379442J55246J61955J69361J77584J86721J96929K08171K20075K32383
$$ 5379442 5534688 5696643 5866004 6043588 6230309 6427238 6635409 6855484 7087867
55995G087867K45325K59249K74028K89362L05563L23394L43028L63930L85854
$$ 7087867 7333192 7592441 7866469 8155831 8461394 8784788 9127816 9491746 9877600
55986I877600M09343M34945M62626M92324N24419N59337N97322O38963O85223
$$ 9877600 10286943 10721888 11184514 11676838 12201257 12760594 13357916 13996879 14682102
55977A4682102P36741P93811Q57398R29207J010401J101401J203477J319475J452307
$$ 14682102 15418843 16212654 17070052 17999259 19009660 20111061 21314538 22634013 24086320
55968B4086320J603997J777058J975642K204676K469543K777952L140872L570670
$$ 24086320 25690317 27467375 29443017 31647693 34117236 36895188 40036060 43606730
55960D3606730M080072M684423N403231O257583P266993Q449308R821234J1398076
$$ 43606730 47686802 52371225 57774456 64032039 71299032 79748340 89569574 100967650
55952A00967650J3196788J5241345J7557885K0148006K2935423K5679483K7867616
$$ 100967650 114164438 129405783 146963668 167111674 190047097 215726580 243594196
55945B43594196K8672454K7118637K2507258J4896674N281072m728196j3536838
$$ 243594196 272266650 299385287 321892545 336789219 342070291 337342095 323805257
55938C23805257k0110273k4146580k5910535k5942849k4821919k3033362k0928335
$$ 323805257 303694984 279548404 253637869 227695020 202873101 179839739 158911404
55931A58911404j8735383j6593027j4579977j2736430j1079381r612320q328855
$$ 158911404 140176021 123582994 109003017 96266587 85187206 75574886 67246031
55924F7246031p214898o253383n428239m723731m122720l608642l168475k791990
$$ 67246031 60031133 53777750 48349511 43625780 39503060 35894418 32725943 29933953
55916B9933953k469185k190591j949332j740755j560276j403065j265345j144496
$$ 29933953 27464768 25274177 23324845 21584090 20023814 18620749 17355404 16210908
55908A6210908j038158r44291q61511p88270p22334o62173o08015n60371n18242
$$ 16210908 15172750 14228459 13366948 12578678 11856344 11194171 10586156 10025785 9507543
55899I507543m80002m45156m13861l85440l58910l34411l12565k92882k74267
$$ 9507543 9027541 8582385 8168524 7783084 7424174 7089763 6777198 6484316 6210049
55890F210049k56713k40892k26409k12217j98715j87693j79756j73248j66249
$$ 6210049 5953336 5712444 5486035 5273818 5075103 4887410 4707654 4534406 4368157
55881D368157j58427j50476j42880j35871j29689j24078j18178j11532j04801
$$ 4368157 4209730 4059254 3916374 3780503 3650814 3526736 3408558 3297026 3192225
55872C192225r8974r4287r0324q6777q3596q0616p7478p4041p0573o7531o5142
$$ 3192225 3093251 2998964 2908640 2821863 2738267 2657651 2580173 2506132 2435559 2368028 2302886
55861B302886o3219o1311n9101n6540n3664n0507m7269m4205m1274l8230l5215
$$ 2302886 2239667 2178356 2119255 2062715 2009051 1958544 1911275 1867070 1825796 1787566 1752351
55850A752351l2829l1263k9858k7998k6031k4706k3985k3020k1235j8894j6599
$$ 1752351 1719522 1688259 1658401 1630403 1604372 1579666 1555681 1532661 1511426 1492532 1475933
55839A475933j4769j3613j3207j3452j4150j5171j6334j7372j8249j9381k1090
$$ 1475933 1461164 1447551 1434344 1420892 1406742 1391571 1375237 1357865 1339616 1320235 1299145
55828A299145k3007k4346k4758k4562k4238k4016k3955k4057k4189k4069k3437
$$ 1299145 1276138 1251792 1227034 1202472 1178234 1154218 1130263 1106206 1082017 1057948 1034511
55817A034511k2244k0730j9333j8324j7525j6549j5340j4118j2818j1060q792
$$ 1034511 1012267 991537 972204 953880 936355 919806 904466 890348 877530 866470 857678
55806H57678o503m626l156k043j411j123p43k04L5k53q53k060m909r712j5107
$$ 857678 851175 846549 843393 841350 839939 838816 838073 837869 837904 837651 836798 834738 829829 820117 805010
55791H05010j9400k2252k4135k4818k3631k0960j8122j5828j3794j1925j0686
$$ 805010 785610 763358 739223 714405 690774 669814 651692 635864 622070 610145 599459
55780E99459j0108r561q864q661r180r569r050q072p631p939q432q680q692q502
$$ 599459 589351 579790 570926 562265 553085 543516 534466 526394 518763 510824 502392 493712 485020 476518
55766D76518q087p635p519p911q583r123r198q739p949p084o274n645n458n792
$$ 476518 468431 460796 453277 445366 436783 427660 418462 409723 401774 394690 388416 382771 377313 371521
55752C71521o202o029n104l893k949k591l042m246n559o105n761n283n206n079
$$ 371521 365319 359290 354186 350293 347344 344753 341711 337465 331906 325801 320040 314757 309551 304472
55738C04472m271l122k680l335m213m189l155k035j693k092k609k874k934k786
$$ 304472 300201 297079 294399 291064 286851 282662 279507 277472 275779 273687 271078 268204 265270 262484
55724B62484k238j498j299k072l282m018m083l967l934l741l280k863k709k582
$$ 262484 260246 258748 257449 255377 252095 248077 243994 240027 236093 232352 229072 226209 223500 220918
55710B20918k213j715j311r07j88R02K011K640K594K175J846J682J357P78L81
$$ 220918 218705 216990 215679 214772 214584 215486 217497 220137 222731 224906 226752 228434 229791 230569 230950
55695B30950M87P38O33M77J078K555L943M175L070J342q8p33q86j342k474l662
$$ 230950 231437 232175 232808 233285 234363 236918 240861 245036 248106 249448 249360 248627 247741 246399 243925 240263
55679B40263m077l780l545l670l705l401l142l208l333l352l588m096m141l104
$$ 240263 236186 232406 228861 225191 221486 218085 214943 211735 208402 205050 201462 197366 193225 190121
55665A90121j515n41o21j087j079k98J016K443L525L933L670L064K525K240K041
$$ 190121 188606 188065 187444 186357 185278 184980 185996 188439 191964 195897 199567 202631 205156 207396 209437
55650B09437J575P26k39j084j949k967l730l711l193l077l599l864l077j640n67
$$ 209437 211012 211738 211499 210415 208466 205499 201769 198058 194865 191788 188189 184325 181248 179608 179041
55635A79041k93n99j308k366l408l879l716l398l347l505l636l652l623l634l692
$$ 179041 178748 178149 176841 174475 171067 167188 163472 160074 156727 153222 149586 145934 142311 138677 134985
55620A34985l721l609l384l198l041k700k213k046k508l129l081k216j285j007
$$ 134985 131264 127655 124271 121073 118032 115332 113119 111073 108565 105436 102355 100139 98854 97847
55606I7847j315j663j789j873k027j997j503o83j1J32k65r75j629j772j217m92
$$ 97847 96532 94869 93080 91207 89180 87183 85680 84997 84986 85118 84853 83878 82249 80477 79260 78768
55590G8768n17j416k097j499k0R82R57O50P51R38O60J57J02N88J065J086P00K71
$$ 78768 78251 76835 74738 73239 73219 74201 75158 75808 76559 77497 78157 78314 78416 79004 80069 81155 81855 82126
55572H2126J64M74P65L81p28j803k162k020j995k213k296k057j696j401j187j038
$$ 82126 82290 82764 83529 83910 83182 81379 79217 77197 75202 72989 70693 68636 66940 65539 64352 63314
55556F3314q38l39M29R13O11k49r69j228j214j079p71l49k5J60K41%p70j628j690
$$ 63314 62476 62137 62566 63479 64090 63841 62872 61644 60430 59351 58580 58231 58206 58366 58607 58607 57837 56209 54519
55537E4519p09M95R40M88k41o59o93o70q69j109q22K14J325J588J071Q62J600
$$ 54519 53810 54305 55245 55733 55492 54833 54140 53470 52601 51492 50670 50884 52209 53797 54868 55730 57330
55520E7330K556K663J991J590K009K659K792K497K379K589K628K052R91j13j017
$$ 57330 59886 62549 64540 66130 68139 70798 73590 76087 78466 81055 83683 85735 86726 86613 85596
55505H5596j785k514l113l359l113k564k228k548l375l998l898l321k850k553
$$ 85596 83811 81297 78184 74825 71712 69148 66920 64372 60997 56999 53101 49780 46930 44377
55491D4377j976r85j26O6k52n26n07l62l04m22p19j045j151j052j136j621k091
$$ 44377 42401 41416 41290 41356 41104 40578 40071 39709 39405 38983 38264 37219 36068 35016 33880 32259 30168
55474C0168j981j406j036j143j282r78l35K47O61J051J417J497J125N21K00M81
$$ 30168 28187 26781 25745 24602 23320 22342 22007 22254 22915 23966 25383 26880 28005 28526 28726 29207
55458B9207J076J260N81o38j649k028j870j449j015q69j171j598j497o52L84R38
$$ 29207 30283 31543 32124 31486 29837 27809 25939 24490 23475 22606 21435 19837 18340 17688 18072 19010
55442A9010R31P52O26M36J10k07l54l31j91N5L42N51O28O34N79L63kk95l38k32
$$ 19010 19941 20693 21319 21755 21865 21658 21304 20973 20782 20837 21179 21730 22358 22992 23571 23934 23932 23637 23299 23067
55422B3067r0K38Q31J181N92p55j662j260p3O58M34l14j126j836k103j528m58
$$ 23067 22977 23215 24046 25227 25819 25064 23402 22142 22069 22727 23161 22847 21721 19885 17782 16254 15796
55405A5796J16j60m73k1Q60J340J313J261J293J087O24K82J96R3j78m71o69p75
$$ 15796 15912 15752 15279 15258 16118 17458 18771 20032 21325 22412 23036 23318 23514 23607 23429 22958 22289 21514
55387B1514o83l43o4k15o15p29n34o01j159j586j194j28P86Q66R1r80j621j489
$$ 21514 20831 20488 20424 20209 19594 18865 18331 17730 16571 14985 13791 13663 14449 15315 15406 14426 12805 11316
55369A1316r63p66j101j413j067j00Q42J117O16j90o65n67k66j92k65n9M80R14
$$ 11316 10353 9587 8486 7073 6006 5906 6748 7865 8481 8291 7626 7059 6793 6601 6336 6277 6757 7671
55351G671Q59L99j02l22r0M21O63J64q57j636j669j091k72M86R20Q85O44N57M98
$$ 7671 8530 8929 8827 8505 8415 8836 9499 9663 8806 7170 5501 4410 4138 4624 5544 6429 7073 7630 8128
55332H128P4n02m48L75J087J005O23P14J036P44k70j254j691j659j149K1J502
$$ 8128 8202 7700 7252 7627 8714 9719 10342 11056 12092 12836 12566 11312 9621 7962 6813 6834 8336
55315H336K290J856Q24J61J05K53M09O44P02L1j321k342k017n52Q04J152P69M62
$$ 8336 10626 12482 13306 13467 13572 13825 14234 14878 15580 15611 14290 11948 9931 9379 10183 11335 12104 12566
55297A2566M95N59M96M59M43J87l10o58o71o64q66r27m26M10R38R00N45P0n38
$$ 12566 13061 13620 14116 14575 15018 15205 14895 14237 13566 12902 12036 11109 10683 11093 12031 12931 13476 13546 13008
55278A3008j104j208p90m14n73r60p69K36J308J535R14L04L18O33N55k2o07q50
$$ 13008 11904 10696 9906 9492 8919 7959 7190 7426 8734 10269 11183 11487 11805 12438 12993 12971 12364 11514
55260A1514q50p53n27j96J15M62R60J253P04n60j382q88K93P98J89o87r00l96
$$ 11514 10664 9911 9384 9188 9303 9765 10725 11978 12682 12122 10740 9852 10145 10943 11132 10445 9545 9149
55242I149K17L66n5n54m58K73P80L64m29m55M29J133Q67J59pM98R31O59k58j137
$$ 9149 9366 9732 9677 9123 8665 8938 9718 10082 9653 9198 9627 10760 11627 11786 11779 12277 13208 13867 13609 12472
55222A2472j148k0J418J849R08k73m29L28Q37M73k58o57p29q42j017r33n13j23
$$ 12472 11324 11304 12722 14571 15479 15206 14777 15105 15942 16415 16157 15500 14771 13929 12912 11979 11466 11343
55204A1343o5j24J48O92Q15O8r80j290o70M2J78L8R9P1n54j370j339k43R52J334
$$ 11343 11278 11154 11302 11994 12809 12877 11897 10607 9937 9979 10157 10195 10294 10365 9811 8441 7102 6859 7811 9145
55184I145J008N53J41l11n63k98K64N20K63j07k10j08lJ57N19R45J054P15K97
$$ 9145 10153 10706 10847 10536 9973 9675 9939 10459 10722 10615 10405 10297 10294 10451 10970 11915 12969 13684 13981
55165A3981K65N58N44k08j265j732j352p70n41l26M51J474J749R86J2m03n67j149
$$ 13981 14246 14804 15348 15140 13875 12143 10791 10021 9480 9154 9605 11079 12828 13814 13826 13423 12856 11707
55147A1707j957k139j435n65j38J10O85J351J393O44k40n71k69L86J194J908K095
$$ 11707 9750 7611 6176 5611 5473 5583 6268 7619 9012 9656 9416 8845 8576 8962 10156 12064 14159
55130A4159J563P92N00P44Q98N92J89K11O62J261J932K623K964K693K246K306
$$ 14159 15722 16514 17014 17758 18656 19248 19437 19648 20310 21571 23503 26126 29090 31783 34029 36335
55114C6335K750K707J781O01p9k96m40n49m61l64n87j072j500j726j660j061L6
$$ 36335 39085 41792 43573 44174 44095 43799 43359 42810 42349 41985 41398 40326 38826 37100 35440 34379 34415
55097C4415Q65O78j90p12o12o11j112j460r74j0N83N99M35K44j54o76q85o07j68
$$ 34415 35280 35958 35768 35056 34444 33833 32721 31261 30287 30277 30860 31459 31894 32138 31984 31308 30423 29816 29648
55078B9648R2K29M52P31Q21N29j06q27j346j580j640j518r41J91J286J396L21
$$ 29648 29740 29969 30421 31152 31973 32502 32396 31569 30223 28643 27003 25485 24544 24735 26021 27417 27738
55061B7738r58j253n27J64R1k07J95J194J748J338O19L37L04n6o68j035j163j406
$$ 27738 26780 25527 25000 25164 25255 25048 25243 26437 28185 29523 30142 30479 30783 30727 30059 29024 27861 26455
55043B6455j505p65O81J723J717J308J317J553J357P63M01N84J211K224L488M339
$$ 26455 24950 24185 24866 26589 28306 29614 30931 32484 33841 34604 35005 35589 36800 39024 42512 46851
55027D6851M046K681J094j6n61p07o44o48q71j011o91r0K25O6k87o66j136j496
$$ 46851 50897 53578 54672 54656 54095 53388 52744 52096 51225 50214 49523 49433 49658 49724 49437 48771 47635 46139
55009D6139j388r11n65m17l1N73O40j86j123j228n65J58O45R72R33K16q31j350
$$ 46139 44751 43840 43275 42858 42827 43400 44040 43854 42731 41503 40938 41096 41741 42713 43646 43862 43031 41681
54991D1681r51j1R15J447J187l1j522k096j417m52j51k30J95J146J826J979K324
$$ 41681 40730 40719 41634 43081 44268 44237 42715 40619 39202 38750 38599 38369 38564 39710 41536 43515 45839
54974D5839L351M436M633L971L266L005K991L147L848N192O499P042P092P723
$$ 45839 49190 53626 58259 62230 65496 68501 71492 74639 78487 83679 90178 97220 104312 112035
54960A12035R592J2271J4817J6634J7708J8164J7837J6256J3094Q619L613j233
$$ 112035 121627 133898 148715 165349 183057 201221 219058 235314 248408 257027 260640 259407
54948B59407n730r920j3539j6052j7131j6893j5732j4135j2582j1330j0194q811
$$ 259407 253677 243757 230218 214166 197035 180142 164410 150275 137693 126363 116169 107358
54936A07358p136n487m113l010k194j831j920k119k018j502p50k9M98R85J935
$$ 107358 100222 94735 90622 87612 85418 83587 81667 79548 77530 76028 75278 75249 75747 76732 78667
54921G8667L685N818P449Q279Q983J0289J2112J3889J5392J6612J7095J6042J3221
$$ 78667 82352 88170 95619 103898 112881 123170 135282 149171 164563 181175 198270 214312 227533
54908B27533R251M787r5n400j0460j4170j5975j6298j5952j5360j4450j3073j1373
$$ 227533 236784 241571 241476 236076 225616 211446 195471 179173 163221 147861 133411 120338 108965
54895A08965r731q500p755p230o494n275l650j936m49N36P54J56q53j650j976
$$ 108965 99234 90734 82979 75749 69255 63980 60330 58394 57945 58481 59235 59391 58538 56888 54912
54880E4912k032j943j474n74K41M15L4m80j095j959k611k257j001l4k12j009j339
$$ 54912 52880 50937 49463 48889 49130 49545 49579 49099 48004 46045 43434 41177 40176 40142 39930 38921 37582
54863C7582r78n51m73n23l78j53k30q18j607j823r68M04R97K62q75j211o82j2
$$ 37582 36604 36053 35580 35057 34679 34526 34296 33478 31871 30048 29080 29484 30481 30743 29868 28657 27975 27963
54845B7963N47J174J437M61j529k874k271l59J110J255O90M42Q50J455J635J279
$$ 27963 28510 29684 31121 31582 30053 27179 24908 24549 25659 26914 27604 28046 28896 30351 31986 33265
54829C3265R35J184J826K041J483P92P75J437K199K638K617K029J050M40R20K294
$$ 33265 34200 35384 37210 39251 40734 41526 42301 43738 45937 48575 51192 53221 54271 54711 55631 57925
54813E7925L695M662N387N973O226O342P072Q776J0844J2554J4010J5673J7312
$$ 57925 61620 66282 71669 77642 83868 90210 97282 106058 116902 129456 143466 159139 176451
54800A76451J8062J7327J5132J1576O713J078m212q250j0953j2709j3660j3672
$$ 176451 194513 211840 226972 238548 245261 246339 242127 233877 222924 210215 196555 182883
54788A82883j2781j1389r976q811p876o959n888m743l848l452l477l547l262k404
$$ 182883 170102 158713 148737 139926 132050 125091 119203 114460 110612 107160 103683 100136 96874 94470
54774I4470j087K24R51R17N68O62J626L285N098O579P564Q207Q832R751J1173
$$ 94470 93383 93607 94558 95475 96043 96705 98331 101616 106714 113293 120857 129064 137896 147647 158820
54759A58820J3083J5082J6469J6667J5638J3668J0832P046K643j534m901p683
$$ 158820 171903 186985 203454 220121 235759 249427 260259 267305 269948 268414 263513 255830
54747B55830j0292j2516j3838j4323j4570j4761j4392j3146j1549j0359r664q955
$$ 255830 245538 233022 219184 204861 190291 175530 161138 147992 136443 126084 116420 107465
54735A07465p923o805o021n704n524m954l790k546k010k295k619k315j728j619
$$ 107465 99542 92737 86716 81012 75488 70534 66744 64198 62188 59893 57274 54959 53231 51612
54721E1612j944j858j000q6R1k68l52J03O27Q65J017J311J504J225N51j52o94
$$ 51612 49668 47810 46810 46724 46815 46547 46195 46298 46925 47790 48807 50118 51622 52847 53398 53246 52552
54704E2552j047j006l42O21J028L86q34j717j831j388p27m2N25Q65J040J184J215
$$ 52552 51505 50499 50157 50778 51806 52192 51358 49641 47810 46422 45695 45653 46178 47043 48083 49267 50482
54687E0482R44M78K20M01Q37J234J484J580J566J579J675J584R94J88j05L06O67
$$ 50482 51426 51904 52124 52525 53362 54596 56080 57660 59226 60805 62480 64064 65058 65246 65141 65447 66114
54670F6114L09l87n52j35P1l59q78p77n4P62J353J797K214K499K455K075J691
$$ 66114 66423 66036 65484 65349 65420 65061 64183 63406 63352 64114 65467 67264 69478 71977 74432 76507 78198
54653G8198J755K381L116L422L328L321L661M107M491N123O356P945R238R870
$$ 78198 79953 82334 85450 88872 92200 95521 99182 103289 107780 112903 119259 127204 136442 146312
54639A46312J0038J0025R778Q997P458N168K260j056m430p333r253j0022r982
$$ 146312 156350 166375 176153 185150 192608 197776 200036 198980 194550 187217 177964 167942 157960
54626A57960r632r101q116o609n118m304m106l827l162k764l407m724n370m589
$$ 157960 148328 139227 131111 124502 119384 115080 110974 107147 103985 101221 97814 93090 87720 83131
54612H3131l177k520k908l349k989k120j566j536j600j480j296j077n84J57O24
$$ 83131 79954 77434 74526 71177 68188 66068 64502 62966 61366 59886 58590 57513 56929 57086 57710
54597E7710M02k12n41l10J59M11L09N1l2K07M97L13m15r60n41N79J208O38n09
$$ 57710 58112 57900 57359 57049 57208 57619 57928 57979 57947 58154 58651 58964 58549 57589 57048 57627 58835 59473 58964
54578E8964j110q91n06m80o75p83q48j066j338j420j309j224j223j092o54p8K62
$$ 58964 57854 56963 56457 55977 55302 54519 53671 52605 51267 49847 48538 47314 46091 44999 44345 44267 44529
54561D4529K19J16L76Q49P78k50j512j739o16P53J107L68n45q60n05J98Q85J274
$$ 44529 44748 44864 45240 46089 46867 46617 45105 43366 42750 43503 44610 44978 44433 43573 43068 43266 44151 45425
54543D5425J372J536J970K319K092J416R46J064J555K075K508K830L088L554M401
$$ 45425 46797 48333 50303 52622 54714 56130 57076 58140 59695 61770 64278 67108 70196 73750 78151
54528G8151N198N231M426L463K824K281J478M24q81k576m289m985m186k899k561
$$ 78151 83349 88580 93006 96469 99293 101574 103052 103476 102595 100019 95730 90745 86559 83660 81099
54513H1099l326m069l945l165k299j545q78l71q4L4m9m15r43j328j427j327j050
$$ 81099 77773 73704 69759 66594 64295 62750 61872 61501 61417 61451 61402 60987 60044 58716 57289 55962 54912
54496E4912n34O8M06L78L21N85J084J364J081L95j28r5J83M1o22j131r73m56j20
$$ 54912 54378 54446 54852 55230 55551 56136 57220 58584 59665 60060 59932 59837 60020 60061 59439 58308 57335 56879 56759
54477E6759O2L28M64J85j71j78j90q08j552j286RR88Q38K98K66M91M22L86Q98
$$ 56759 56821 57149 57613 57798 57627 57449 57259 56451 54899 53613 53622 54610 55448 55746 56012 56503 56925 57311 58209
54458E8209J426J037j01q69p51k31K58Q32J487J720J287N95J18j18k24j06K31
$$ 58209 59635 60672 60571 59702 58951 58720 58978 59810 61297 63017 64304 64899 65017 64899 64675 64569 64800
54441F4800M55L37Q7pj07n57j231j524j010j2O64N10j78o63n80k94l20o33p43
$$ 64800 65255 65592 65679 65672 65565 65008 63777 62253 61243 61231 61895 62405 62227 61564 60984 60690 60370 59737 58994
54422E8994l81K20O93R00Q93P76P48J028J602K148K340K179K010K246L023L978
$$ 58994 58613 58833 59526 60426 61319 62095 62843 63871 65473 67621 69961 72140 74150 76396 79419 83397
54406H3397M384L725K214O92q6j0M39O55L46k96q24r95j025j309j903k408k286
$$ 83397 87781 91506 93720 94412 94326 94316 94755 95410 95756 95460 94636 93641 92616 91307 89404 86996 84710
54389H4710j349K1J001R05j48j266j700j558j433j552j710j837k072k289k129
$$ 84710 83361 83382 84383 85288 85140 83874 82174 80616 79183 77631 75921 74084 72012 69723 67594
54374F7594j629j284j267j095l92M45P37L26m55j260j762j535m97O93J219J043
$$ 67594 65965 64681 63414 62319 61927 62372 63109 63435 62980 61720 59958 58423 57926 58619 59838 60881
54358F0881Q08R04J180J508K052K784L267L186K608J712N97l97p85o14n38q77
$$ 60881 61689 62593 63773 65281 67333 70117 73384 76570 79178 80890 81487 81090 80305 79691 79153 78276
54342G8276j104p43k49l32q12r55p98j171k308l276l193k348j721j804k310k654
$$ 78276 77172 76429 76180 75848 75036 74081 73283 72112 69804 66528 63335 60987 59266 57462 55152 52498
54326E2498k359j330j56J63p58k107k707k280j425o48M2O01O74J29n79q77o97
$$ 52498 50139 48809 48653 48816 48058 45951 43244 40964 39539 38891 38933 39534 40208 40337 39758 38881 38184
54309C8184m21l19l41l92n55q88j133q32R6J074J406J062O50N50M77N6n00o26
$$ 38184 37763 37444 37103 36711 36156 35268 34135 33303 33399 34473 35879 36941 37591 38141 38618 38674 38174 37548
54291C7548j41N91J104J181Q90N32L97M22L05R2K81R94J522J227M44m4j73l90
$$ 37548 37407 37998 39102 40283 41173 41705 42102 42524 42829 42921 43202 44196 45718 46945 47389 47345 47172 46782
54273D6782o34m15J65M81N40J010J910K221J368J07o01q33j023r11q7R39J254
$$ 46782 46148 45733 45898 46379 46919 47929 49839 52060 53428 53535 52934 52101 51078 50167 50080 51019 52273
54256E2273Q88P02J019J286J103Q07Q14J038J195J197R90M53l59j089j408j208
$$ 52273 53161 53863 54882 56168 57271 58078 58892 59930 61125 62322 63312 63765 63406 62317 60909 59701
54240E9701n09N09J316J315M77m78q04m84k23o85j774k625k414j229k9L24j67
$$ 59701 59192 59701 61017 62332 62809 62331 61527 61043 60820 60135 58361 55736 53322 52093 52064 52388 52221
54223E2221r19j413j441j000l57J9o6l32m78n41n88m13K5K76M5k24j1M36N60N02
$$ 52221 51302 49889 48448 47448 47091 47110 47044 46712 46234 45693 45105 44692 44717 44993 45038 44814 44803 45239 45799 46301
54203D6301P46J035O66k04n69p9M97N68M76N39L28m04r40o17O1J41m10r32j226
$$ 46301 47047 48082 48748 48544 47975 47896 48393 48961 49437 49976 50304 49900 48960 48343 48404 48545 48135 47203 45977
54184D5977j624k083k145j749j304r40m10J62J40p14j803k323j995r88L31J371
$$ 45977 44353 42270 40125 38376 37072 36132 35722 35884 36024 35310 33507 31184 29189 28201 28532 29903
54168B9903J521P16m17j185j330q60J07J102J351O27l08n41j26J32j26m53l98
$$ 29903 31424 32140 31723 30538 29208 28348 28455 29557 30908 31535 31227 30686 30560 30692 30566 30113 29715
54151B9715r7J28K50L41K97J14O8K60L38R2J6O29J535J785J186M74J74jl42n55
$$ 29715 29618 29746 29996 30337 30634 30748 30816 31076 31414 31506 31522 32151 33686 35471 36657 37131 37305 37304 36962 36407
54131C6407m23l59o95j009q02m23m74p58o27j31J04O3L93J159J604J364J042J102
$$ 36407 35984 35625 34930 33921 33119 32696 32222 31464 30837 30706 30810 30873 31266 32425 34029 35393 36435 37537
54113C7537J094N65J4J65P87J026O14N7k42l28k43J72P94J098P36jn05m99k27
$$ 37537 38631 39196 39210 39375 40162 41188 41802 41859 41617 41289 41046 41218 42012 43110 43846 43845 43340 42841 42614
54094D2614j9J33M55Q61Q68K80l64m37j63j77l17K72J623K498J961O64j64k68
$$ 42614 42595 42728 43183 44044 44912 45192 44828 44391 44228 44051 43734 44006 45629 48127 50088 50752 50588 50320
54076E0320j69KM13P02L30l39l22N58J429J698J677J715J626J337J267J560J635
$$ 50320 50151 50153 50566 51268 51598 51259 50937 51495 52924 54622 56299 58014 59640 60977 62244 63804 65439
54059F5439J066K84j69m58q57r25m0J540K963L836M258M028K881J466J063J974
$$ 65439 66505 66789 66620 66162 65305 64380 64340 65880 68843 72679 76937 80965 83846 85312 86375 88349
54043H8349L099L503L597M109M680M402L348K523K370K292J761J052N40M5o32
$$ 88349 91448 94951 98548 102657 107337 111739 115087 117610 119980 122272 124033 125085 125625 125670 125038
54028A25038j118j018o77p53j252j627j693j856k411l106l522l463k990k382k102
$$ 125038 123920 122902 122225 121472 120220 118593 116900 115044 112633 109527 106005 102542 99552 97170 95068
54013I5068k365k795k831k497k234k108j813j492j730k438k582j591l73j73q67
$$ 95068 92703 89908 87077 84580 82346 80238 78425 76933 75203 72765 70183 68592 68219 68046 67179
53998F7179j239o97P7K55j81p30j085j208j051n76J04O95Q70N31m6l79l08j60
$$ 67179 65940 65243 65320 65575 65394 64664 63579 62371 61320 60744 60848 61543 62413 62944 62898 62519 62211 62051
53980F2051k70n73q48j066j153p07M40J549J541L66p80p97O2O22J90p57j213p10
$$ 62051 61781 61208 60360 59294 58141 57434 57874 59423 60964 61330 60550 59753 59815 60437 60627 59870 58657 57947
53962E7947L20J195J777K338K806K654J782R86J033J640J937J701J475J642K033
$$ 57947 58267 59462 61239 63577 66383 69037 70819 71805 72838 74478 76415 78116 79591 81233 83266
53947H3266K478L104L927M706N393O217P197P988Q335Q335Q221Q284Q920J0155
$$ 83266 85744 88848 92775 97481 102874 109091 116288 124276 132611 140946 149167 157451 166371 176526
53933A76526J1110J0689Q940P068N892M995L712K180R23Q7l83l51K5l9j065k466
$$ 176526 187636 198325 207265 214333 220225 225220 228932 231112 232035 232122 231739 231388 231413 231374 230309 227843
53917B27843l258l314l238l321l380l423l712m120m174l731l126k697k641l198
$$ 227843 224585 221271 218033 214712 211332 207909 204197 200077 195903 192172 189046 186349 183708 180510
53903A80510m328n352n561n159m909m894m522l812l640m357n077m905m142l567
$$ 180510 176182 170830 165269 160110 155201 150307 145785 141973 138333 133976 128899 123994 119852 116285
53889A16285l235k784k398k502k779k468j621j162j516k031k058j887k077k431
$$ 116285 113050 110266 107868 105366 102587 100119 98498 97336 95820 93789 91731 89844 87767 85336
53875H5336k291j575q56m96l06j31k25p44j238j084k79N35P93M48k49j032j522
$$ 85336 83045 81470 80614 80118 79812 79681 79456 78712 77474 76390 76111 76646 77439 77887 77638 76606 75084
53858G5084j223l1J388K062J623N57l92q77r28p20n14o50j248j959k206j724p93
$$ 75084 73861 73830 75218 77280 78903 79460 79068 78191 77263 76543 76029 75379 74131 72172 69966 68242 67449
53841F7449Q3N93P03N27K01j13k38o0L54Q20J213J506J629J469J142J106J635
$$ 67449 67532 68125 68828 69355 69556 69443 69205 69145 69499 70319 71532 73038 74667 76136 77278 78384 80019
53824H0019K332K541K257K111K336K381J885J449J725K224J900Q47M01J355K949
$$ 80019 82351 84892 87149 89260 91596 93977 95862 97311 99036 101260 103160 104007 104408 105763 108712
53809A08712M018M333M260L817K867J812J219R42L49o25j335j378r91n19j20o2
$$ 108712 112730 117063 121323 125140 128007 129819 131038 131980 132329 131704 130369 128991 128000 127481 127361 127299
53793A27299n96j361j615j296j216j815k423k327j880j869k265k406k150j984
$$ 127299 126703 125342 123727 122431 121215 119400 116977 114650 112770 110901 108636 106230 104080 102096
53779A02096k059j941j543j507k219l029l007k201j585j823k513k818k515k051
$$ 102096 100037 98096 96553 95046 92827 89798 86791 84590 83005 81182 78669 75851 73336 71285
53765G1285j752j405p60r9O9l11p98j071j202j288j269j152j049q40k80M17O06
$$ 71285 69533 68128 67368 67269 67338 67027 66229 65158 63956 62668 61399 60247 59198 58358 58078 58495 59101
53748E9101J21l48j98K60L60P3j51j84k49l13j23K50M20K62Mj88l39m52n17o74
$$ 59101 59222 58874 58676 58936 59296 59369 59218 59034 58785 58472 58349 58599 59019 59281 59285 59097 58758 58306 57789 57115
53728E7115r23r15m29J75M54N33P50R61R23J002J676K478K447J606R60R88J093
$$ 57115 56192 55277 54848 55023 55477 56010 56760 57721 58644 59646 61322 63800 66247 67853 68813 69801 70894
53711G0894P38J58l58q93j277r92k05J00m48r45o27m5pj39M62J702K600K672K327
$$ 70894 71632 71790 71432 70539 69262 68270 68065 68165 67717 66772 66145 66100 66093 65954 66416 68118 70718 73390 75717
53692G5717K038J843J619J290Q66O33R92J770K139J686J039Q72R50P66N50P82
$$ 75717 77755 79598 81217 82507 83373 84006 84998 86768 88907 90593 91632 92504 93454 94220 94770 95552
53676I5552J214J308J203J296J224L88p19r38j50N07L27j83l76l71m51m57j95
$$ 95552 96766 98074 99277 100573 101797 102185 101466 100528 100378 100885 101212 101029 100653 100282 99831 99374 99179
53659I9179J15K28K16J31j02k84K2P63J239R72L17m1J79P68J293J327Q69M97O92
$$ 99179 99294 99522 99738 99869 99767 99483 99505 100268 101507 102479 102796 102755 102934 103702 104995 106322 107191 107688 108380
53640A08380J086R34K44k83m03n37q15q54o52p72j241j221l30O36Q46N78N11O19
$$ 108380 109466 110400 110644 110361 109958 109421 108606 107752 107100 106328 105087 103866 103536 104172 105018 105596 106107 106726
53622A06726N21L50M35O04N68N47Q20J061Q44M44L30K97j00n44l54L80R51J232
$$ 106726 107247 107597 108032 108636 109204 109751 110571 111632 112476 112920 113250 113547 113447 112903 112549 112929 113880 115112
53604A15112J674K199K176J671J587K153K344J516O77J146K492L000K068R91J039
$$ 115112 116786 118985 121161 122832 124419 126572 128916 130432 131109 132255 134747 137747 139815 140806 141845
53589A41845J723J700Q40L21P41J240R20L00M41J170J276M39k34O7O85O70K15
$$ 141845 143568 145268 146108 146429 147170 148410 149330 149630 150071 151241 152517 152956 152722 152789 153474 154144 154359
53572A54359pj80q55j560j193K16J346J468J316J590J653O11r92j708j166m82
$$ 154359 154352 154172 153317 151757 150564 150780 152126 153594 154910 156500 158153 158764 157772 156064 154898 154416
53556A54416o08j125j074m01J43K36L72Q88J203O17m84q25J41J448J810J201P17
$$ 154416 153808 152683 151609 151208 151351 151587 151959 152847 154050 154667 154183 153358 153499 154947 156757 157958 158675
53539A58675J041J649J633Q17j70o34l54L85J063J304J213J297J940K889L394
$$ 158675 159716 161365 162998 163815 163645 163011 162657 163042 164105 165409 166622 167919 169859 172748 176142
53524A76142K959J963J403J917L098L913L841L351L255L775M497N018N376N847
$$ 176142 179101 181064 182467 184384 187482 191395 195236 198587 201842 205617 210114 215132 220508 226355
53510B26355O520P156P411P188O853O902P410P967Q265Q468Q901R577J0329J1080
$$ 226355 232875 240031 247442 254630 261483 268385 275795 283762 292027 300495 309396 318973 329302 340382
53496C40382J1765J2159J2216J2325J2812J3362J3421J3075J2951J3246J3486
$$ 340382 352147 364306 376522 388847 401659 415021 428442 441517 454468 467714 481200
53485D81200J3373J3297J3616J4012J3935J3498J3350J3824J4529J4816J4392
$$ 481200 494573 507870 521486 535498 549433 562931 576281 590105 604634 619450 633842
53474F33842J3488J2606J2092J1859J1531J0982J0547J0615J1095J1476J1370
$$ 633842 647330 659936 672028 683887 695418 706400 716947 727562 738657 750133 761503
53463G61503J0864J0266R738R175Q417P452O343N037L393J491k73j568k544l633
$$ 761503 772367 782633 792371 801546 809963 817415 823758 828795 832188 833679 833406 831838 829294 825661
53449H25661m902n895o230o133o229o867p816q551q734q500q268q364q758r262
$$ 825661 820759 814864 808634 802501 796272 789405 781589 773038 764304 755804 747536 739172 730414 721152
53435G21152r815j0465j1057j1262j0973j0538j0347j0380j0234r569q358o789
$$ 721152 711337 700872 689815 678553 667580 657042 646695 636315 626081 616512 608154 601365
53423F01365n114l645k669k225j945j342l48N27P64N76Q16J973L463M217L943
$$ 601365 596251 592606 589937 587712 585767 584425 584077 584604 585368 585944 586760 588733 592196 596413 600356
53408F00356L416L560M563O013P538Q996J0188J0843J0966J0994J1404J2239J3148
$$ 600356 603772 607332 611895 617908 625446 634442 644630 655473 666439 677433 688837 701076 714224
53395G14224J3868J4540J5454J6566J7479J7936J8194J8755J9868K1405K3158
$$ 714224 728092 742632 758086 774652 792131 810067 828261 847016 866884 888289 911447
53384I11447K4906K6349K7304K8005K8896K9888L0213K9366K8018K7516K8395
$$ 911447 936353 962702 990006 1018011 1046907 1076795 1107008 1136374 1164392 1191908 1220303
53373A220303K9715L0103K9180K7727K6619K6003K5502K4740K3489K1609J9319
$$ 1220303 1250018 1280121 1309301 1337028 1363647 1389650 1415152 1439892 1463381 1484990 1504309
53362A504309J7310J6103J5323J4042J1905R421P039M451J228k432o025r451j2811
$$ 1504309 1521619 1537722 1553045 1567087 1578992 1588413 1595452 1599903 1601131 1598699 1592674 1583223 1570412
53349A570412j5813j8141k0226k2857k5892k8176k9006k8944k8780k8451k7563
$$ 1570412 1554599 1536458 1516232 1493375 1467483 1439307 1410301 1381357 1352577 1324126 1296563
53338A296563k6428k5699k5268k4416k3052k1990k1794k2055k2146k2145k2508
$$ 1296563 1270135 1244436 1219168 1194752 1171700 1149710 1127916 1105861 1083715 1061570 1039062
53327A039062k3216k3764k3808k3327k2280k0622j8745j7333j6554j5739j4179
$$ 1039062 1015846 992082 968274 944947 922667 902045 883300 865967 849413 833674 819495
53316H19495j1972r813q140o904o014n667o065p078q242r043r231r005q815q757
$$ 819495 807523 797710 789570 782666 776652 770985 764920 757842 749600 740557 731326 722321 713506 704749
53302G04749q374p318o058n422n572n863n729n112m012k344m99P09J084J412K281
$$ 704749 696375 689057 682999 677577 672005 666142 660413 655301 651289 648945 648446 649155 650239 651651 653932
53287F53932L250L790M377N722P446Q590R156J0010J1297J2095J1865J1246J1081
$$ 653932 657182 660972 665349 671071 678517 687107 696263 706273 717570 729665 741530 752776 763857
53274G63857J1487J2214J3074J3558J2932J1251R685R176R349R224Q490P421O122
$$ 763857 775344 787558 800632 814190 827122 838373 848058 857234 866583 875807 884297 891718 897840
53261H97840M616L328K636K164J153n08k291l939n793q112j0593j2662j3920j4342
$$ 897840 902456 905784 908420 910584 911737 911229 908938 904999 899206 891094 880501 867839 853919 839577
53247H39577j4305j4409j4936j5583j5956j6131j6347j6411j5906j4955j4178
$$ 839577 825272 810863 795927 780344 764388 748257 731910 715499 699593 684638 670460
53236F70460j3858j3637j3193j2737j2591j2626j2483j2173j2142j2669j3446
$$ 670460 656602 642965 629772 617035 604444 591818 579335 567162 555020 542351 528905
53225E28905j3871j3734j3360j3104j2849j2274j1364j0293q924p023m973l665
$$ 528905 515034 501300 487940 474836 461987 449713 438349 428056 419132 412109 407136 403471
53213D03471l379l377l002k611k899l778m603n218o048p251q443r260r690r828
$$ 403471 400092 396715 393713 391102 388203 384425 379822 374604 368556 361305 352862 343602 333912 324084
53199C24084r743r568r363q986q360p667o976n999m738l909m064m638m710m479
$$ 324084 314341 304773 295410 286424 278064 270397 263421 257422 252684 248775 244711 240073 235363 230884
53185B30884m939o151o947o617n801n326n069m571l998l719l574l292l212l796
$$ 230884 225945 219794 212847 206230 200429 195103 190034 185463 181465 177746 174172 170880 167668 163872
53171A63872m656m745l552j632N4R12R68O65M57L93K00j93m85m71l72m52o70r51
$$ 163872 159216 154471 150919 149287 149341 150253 151221 151886 152343 152736 152936 152743 152258 151787 151415 150963 150293 149342
53153A49342j448k149k534k115j102j83K68M06M99O03O81O30K51n73j597k293
$$ 149342 147894 145745 143211 141096 139994 139811 140079 140485 140984 141587 142268 142898 143149 142576 140979 138686
53137A38686k191j218J26R11N04p64j862k130j779j298r01p52j072j625j689j081
$$ 138686 136495 135277 135403 136314 136818 136054 134192 132062 130283 128985 128084 127332 126260 124635 122946 121865
53121A21865o28r65j403q86K86P72J67n14m46j47m84j387k117k364k339k200j841
$$ 121865 121237 120272 118869 117983 118269 119041 119208 118694 118248 118101 117617 116230 114113 111749 109410 107210 105369
53104A05369j247o03j36m0l54p80q32l79J28K45N9q3j44l15n70p31q83j325k035
$$ 105369 104122 103519 103383 103343 102989 102209 101377 100998 101126 101371 101430 101347 101203 100888 100318 99587 98704 97379 95344
53085I5344k506k281j451n40j9Kk57m71m86m16m46n51n01k18J4j15n19p08l34
$$ 95344 92838 90557 89106 88566 88547 88549 88292 87821 87335 86919 86473 85922 85421 85203 85217 85102 84583 83875 83541
53066H3541M81J330J904K090J852J260O17L18N26J063J603J917J979J977K112
$$ 83541 84022 85352 87256 89346 91198 92458 93075 93393 93919 94982 96585 98502 100481 102458 104570
53051A04570K229J811O32p20j409j383j342j635j812j546j296j584k076k009j253
$$ 104570 106799 108610 109242 108522 107113 105730 104388 102753 100941 99395 98099 96515 94439 92430 91177
53036I1177l78J27J40l90j336k083j950j087m56p19j549k092j853j014k30l0k82
$$ 91177 90799 90926 91066 90676 89340 87257 85307 84220 83764 83045 81496 79404 77551 76537 76307 76277 75995
53019G5995l12J63N70L43j40j81N5j32o12n60L0J50n31r64l46N73P11L01K53N74
$$ 75995 75683 75846 76416 76759 76619 76438 76493 76361 75749 75189 75219 75369 74838 73874 73528 74101 74812 75113 75366 75940
52999G5940N14J0k48k2K06K15L12N43M92J60J70Q09J445J360O57Jj55K08Q75J439
$$ 75940 76454 76464 76216 76194 76400 76615 76927 77470 77962 78122 78292 79101 80546 81906 82563 82564 82409 82617 83492 84931
52979H4931J402N84o50j665k035j695q80J7P39J336J904K201J860R83J25l33m61
$$ 84931 86333 86917 86267 84602 82567 80872 79992 80009 80748 82084 83988 86189 88049 89032 89157 88824 88363
52962H8363m01j06L87P84R14R88J286J698J818J371N10k23k94K66P60N54j08m38
$$ 88363 87962 87856 88243 89027 89941 90929 92215 93913 95731 97102 97612 97389 97095 97361 98121 98675 98567 98129
52944I8129j41K80L71K79L33N10N89N05K87j6j42J84O78O46l4n17q4Q66J454J480
$$ 98129 97988 98268 98639 98918 99251 99761 100350 100855 101142 101126 100984 101168 101846 102492 102458 101941 101857 102723 104177 105657
52924A05657J342J111N36j20j15P53J767K182K005J668J349J031Q79J141J761
$$ 105657 106999 108110 108646 108526 108411 109164 110931 113113 115118 116786 118135 119166 120045 121186 122947
52909A22947K320K446K154J811J798K178K680K972K837K164R74l06r47o32M9J82
$$ 122947 125267 127713 129867 131678 133476 135654 138334 141306 144143 146307 147281 146975 146028 145396 145445 145627
52893A45627m36j196j544j481j258r50o72p51j346k046k227j790j249j045j061
$$ 145627 145191 143995 142451 140970 139712 138762 138090 137339 135993 133947 131720 129930 128681 127636 126575
52878A26575r96r92j417k000j681J75K629L870L180J671Q89J200J929K449K534
$$ 126575 125579 124587 123170 121170 119489 119664 122293 126163 129343 131014 131903 133103 135032 137481 140015
52863A40015J967N69j326k962l761l604k659j382n02m74j012j513j815k052k087
$$ 140015 141982 142551 141225 138263 134502 130898 128239 126857 126355 125881 124869 123356 121541 119489 117402
52848A17402j757j528j983k680k512j334l21l11p24o87l88n05r38j064q80r89
$$ 117402 115645 114117 112134 109454 106942 105608 105287 104976 104252 103565 103177 102672 101734 100670 99790 98801
52832I8801j547j960j714r79k83K2k9j00J10M15K67m55j097j057n95m05o63r64
$$ 98801 97254 95294 93580 92601 92318 92340 92311 92211 92321 92736 93003 92548 91451 90394 89799 89394 88731 87767
52814H7767r73o10J48J057J404O90m99j013m64M58J023J192J167R03L61j90m25
$$ 87767 86794 86184 86332 87389 88793 89483 88984 87971 87507 87965 88988 90180 91347 92250 92611 92421 91996
52797I1996k97M2L64M34K14N5L44R85J609K150K712K874J943J11j288j187k0Q59
$$ 91996 91699 91741 92105 92539 92753 92808 93152 94137 95746 97896 100608 103482 105425 105536 104248 103061 103041 103900
52779A03900O92j96j100j577j523j109p70r54j676k393k437j698q17o01j127j688
$$ 103900 104592 104396 103296 101719 100196 99087 98317 97363 95687 93294 90857 89159 88342 87741 86614 84926
52763H4926j730j548j649j843j616j178j294j993k307j626n82j02j83j91J62O99
$$ 84926 83196 81648 79999 78156 76540 75362 74068 72075 69768 68142 67560 67458 67275 67084 67246 67945
52747F7945J292J809J901J408P83N15L59k61j186j671j557j594k282k991k748
$$ 67945 69237 71046 72947 74355 75138 75653 76012 75751 74565 72894 71337 69743 67461 64470 61722
52732F1722j507k41J66k19o75p35n85n86o61m22J74O71P63P06Q47J066J024P35
$$ 61722 60215 59974 60140 59921 59246 58511 57926 57340 56679 56257 56431 57102 57865 58571 59418 60484 61508 62243
52714F2243M90L52J92Q0K64O92J008J006Q59P88Q12P99O09J87k87m77l32k65n88
$$ 62243 62733 63085 63277 63357 63621 64313 65321 66327 67186 67974 68786 69585 70194 70381 70094 69617 69285 69020 68432
52695F8432r50q16k72J64M72J082J872J972R54m10j045p97l19j01j48l05m33l55
$$ 68432 67482 66666 66394 66558 67030 68112 69984 71956 72910 72500 71455 70658 70339 70238 70090 69785 69352 68997
52677F8997j29j56o29r86m86P28J650J598R61N98R13J651K265K297J652P36J18
$$ 68997 68868 68712 68083 67097 66611 67339 68989 70587 71548 72146 73059 74710 76975 79272 80924 81660 81778
52660H1778o6j49l23l36LM41P07R71J387J576J069K34RP13J639K048J932J632
$$ 81778 81712 81563 81240 80904 80907 81348 82055 83026 84413 85989 87058 87292 87301 88014 89653 91701 93633 95265
52642I5265J221P09M02N39Q49R61J008J293J610J522J123R31R89Q44M49L54O47
$$ 95265 96486 97195 97597 98136 98985 99946 100954 102247 103857 105379 106502 107433 108422 109266 109715 110069 110716
52625A10716M93p29k321k964k249r71m3K53M3m90j020j150q30m44l21l76m04m51
$$ 110716 111209 110480 108159 105195 102946 101975 101932 102185 102228 101738 100718 99568 98738 98294 97973 97597 97193 96742
52607I6742o67r51j055r89r89j020o71J74Q47N35n68j280q04L08R42P78L61J38
$$ 96742 96075 95124 94069 93080 92091 91071 90400 90574 91421 91956 91388 90108 89304 89612 90554 91332 91693 91831
52589I1831J03L27J036J976K407K036J409J031O94J09l37q1O83J243J288J055
$$ 91831 91934 92261 93297 95273 97680 99716 101125 102156 102850 102959 102622 102541 103224 104467 105755 106810
52573A06810P08J74m17o97n20q6M26R76J415J446R51J00q17j472j558j109n98
$$ 106810 107518 107692 107275 106578 106058 105972 106398 107374 108789 110235 111186 111286 110469 108997 107439 106330 105732
52556A05732m39m40j30N28J109J314J152O68m7o10o13j35L76P15R85J119Q43K20
$$ 105732 105293 104853 104723 105251 106360 107674 108826 109494 109447 108837 108224 108089 108465 109180 110165 111284 112127 112347
52538A12347l01m23k81o8J53K25o5o02r95j098j148j294j457j617j843j971j780
$$ 112347 112046 111623 111342 111274 111427 111652 111587 110985 109990 108892 107744 106450 104993 103376 101533 99562 97782
52521I7782j480j487j680j476q18l45m05n56l99k18l51n31m02j91k65m27k60J30
$$ 97782 96302 94815 93135 91659 90841 90496 90091 89535 89136 88918 88567 88036 87634 87443 87178 86751 86491 86621
52503H6621L10K32K00L18M51O08Q42R61P72M75L77L66J08l15m71k30R6K24J55
$$ 86621 86931 87163 87363 87681 88132 88740 89582 90543 91315 91790 92167 92533 92641 92326 91855 91625 91721 91945 92100
52484I2100p0m25p32p07k89L11Q57J238J402J367J221R53M74p5k62O4M08J92m30
$$ 92100 92030 91605 90873 90166 89877 90188 91045 92283 93685 95052 96273 97226 97700 97625 97363 97427 97835 98027 97597
52465I7597p70n24q7N2j82n57q36q71o10j13N20J138J419J032J21o19o97l67r7
$$ 97597 96827 96303 96216 96268 96086 95529 94693 93822 93212 93099 93619 94757 96176 97208 97329 96710 96013 95646 95549
52446I5549J67P13J242J064J78n59m94L9L16J82O6K59M97K99m20j129j139l57
$$ 95549 95716 96429 97671 98735 98913 98354 97860 97899 98215 98397 98463 98722 99219 99518 99098 97969 96830 96473
52428I6473N05O27l8p86r46m64K23O71P60P01P72R51R96Q91R03J065R30K50m92
$$ 96473 96978 97605 97567 96781 95835 95371 95594 96265 97025 97726 98498 99449 100445 101336 102239 103304 104234 104484 103992
52409A03992o45k81jl4j17j28k32l86k85Q5M32P40J226J646J286L0j189j378o24
$$ 103992 103347 103066 103065 103031 102914 102786 102554 102168 101883 101968 102400 103140 104366 106012 107298 107328 106139 104761 104137
52390A04137K50P30R14R69Q56N22Q9k05j01N27J416J951J685Q45J56J25N83R42
$$ 104137 104387 105117 106031 107000 107856 108378 108467 108262 108161 108688 110104 112055 113740 114585 114741 114866 115449 116391
52372A16391Q56O15P32J225J550J345R41P72P10M52K67O36J273J365Q69O92J300
$$ 116391 117247 117862 118594 119819 121369 122714 123655 124427 125137 125589 125856 126492 127765 129130 129999 130691 131991
52355A31991J992K023J660J462J235O32J94P03J729K025J431J180J957K691K158
$$ 131991 133983 136006 137666 139128 140363 140995 141189 141892 143621 145646 147077 148257 150214 152905 155063
52340A55063R40P00J886L239L640L377L201L034K465J919K360L891N497O399O899
$$ 155063 156003 156703 158589 161828 165468 168845 172046 175080 177545 179464 181824 185715 191212 197611 204510
52325B04510P571Q304Q710Q954R484J0177J0496J0441J0663J1561J2753J3648
$$ 204510 212081 220385 229095 238049 247533 257710 268206 278647 289310 300871 313624 327272
52313C27272J4074J4226J4348J4572J4796J4704J4206J3775J3889J4153J3614
$$ 327272 341346 355572 369920 384492 399288 413992 428198 441973 455862 470015 483629
52302D83629J2113J0637J0050J0000R501Q192O591N373M804M691M499L752K522
$$ 483629 495742 506379 516429 526429 535930 544122 550713 556086 560890 565581 570080 573832 576354
52289E76354J304L09q11k248l558m268m581m991n491n653n308m695m062l561l346
$$ 576354 577658 577967 577156 574908 571350 567082 562501 557510 552019 546366 541058 536363 532301 528740 525394
52274E25394l312k921j694J44J939L374M600N703O606P438Q496R741J0776J1361
$$ 525394 522082 519161 517467 517611 519550 522924 527524 533227 539833 547271 555767 565508 576284 587645
52260E87645J1580J1480J0995J0389J0229J0633J0851J0044Q328O721O024N972
$$ 587645 599225 610705 621700 632089 642318 652951 663802 673846 682174 688895 694919 700891
52248G00891N672M694L506K751K307J390m54k777m770o042o763p281p876q654
$$ 700891 706563 711257 714763 717514 719821 721211 720757 717980 713210 707168 700405 693124 685248 676594
52234F76594r432r888r942r834r731r573r422r469r471q786p367o121n730n654
$$ 676594 667162 657274 647332 637498 627767 618194 608772 599303 589832 581046 573679 567558 561828 556174
52220E56174n050m146l737l686l089j888j098j167j266o27L59J077J747K800L818
$$ 556174 551124 546978 543241 539555 536466 534578 533480 532313 531047 530420 530779 531856 533603 536403 540221
52205E40221M007L354K539J958J538J284J275J212O63j49m77q2L91K78l17q41
$$ 540221 544228 547582 550121 552079 553617 554901 556176 557388 558051 557902 557425 557343 557734 558012 557695 556854
52189E56854j056j149j271j381j437j528j655j604j250r56j382k700m140m656
$$ 556854 555798 554649 553378 551997 550560 549032 547377 545773 544523 543567 542185 539485 535345 530689
52175E30689m017k936k138j651j204q44q71j315j830k056j839j300q03p56j180
$$ 530689 526672 523736 521598 519947 518743 517899 517028 515713 513883 511827 509988 508688 507885 507129 505949
52160E05949j700k010k225k472k523k126j569j427j820k235k132j458o43k76o57
$$ 505949 504249 502239 500014 497542 495019 492893 491324 489897 488077 485842 483710 482252 481609 481333 480676
52145D80676j407j695j159m67n22j270j756j360l89O21J575K516L163L243L066
$$ 480676 479269 477574 476415 475948 475426 474156 472400 471040 470651 471272 472847 475363 478526 481769 484835
52130D84835L272M084N053N621N758N974O736P942R024R698J0329J1379J2663
$$ 484835 488107 492191 497244 502865 508623 514597 521333 529275 538299 547997 558326 569705 582368
52117E82368J3667J4393J5304J6375J6895J6527J5844J5425J4983J4031J2870
$$ 582368 596035 610428 625732 642107 659002 675529 691373 706798 721781 735812 748682
52106G48682J2238J2229J2335J2329J2247J1645R819P000M465L029K102O47j433
$$ 748682 760920 773149 785484 797813 810060 821705 831524 838524 842989 846018 848120 848767 847334
52093H47334l432m903n946o746p319p669p844p868p854q014q286q271p779p197
$$ 847334 843902 838999 833053 826307 818988 811319 803475 795607 787753 779739 771453 763182 755403 748206
52079G48206o881o464n343l694k383j805j394m57R72K360L437M401N482O620P591
$$ 748206 741325 734861 729518 725824 723441 721636 720242 719785 720757 723117 726554 730955 736437 743057 750648
52064G50648Q360R133R973J0505J0256R377Q625Q394Q224P571O683O133N831N138
$$ 750648 759008 768141 778114 788619 798875 808252 816877 825271 833495 841066 847749 853882 859713 864851
52050H64851L892K503J109n86k496l979m834n790p498r592j1191j1922j1978j1644
$$ 864851 868743 871246 872355 871769 869273 865294 860460 854670 847172 837580 826389 814467 802489 790845
52036G90845j1350j1822j3508j5830j7545j7903j7140j5991j5029j4414j3950
$$ 790845 779495 767673 754165 738335 720790 702887 685747 669756 654727 640313 626363
52025F26363j3371j2727j2351j2337j2312j1942j1360j0817j0230r449q724q472
$$ 626363 612992 600265 587914 575577 563265 551323 539963 529146 518916 509467 500743 492271
52013D92271q739r231r664r789r379q669q428r060r954j0283j0175j0329j0747
$$ 492271 483532 474301 464637 454848 445469 436800 428372 419312 409358 399075 388900 378571 367824
52000C67824j0732j0155r772j0018j0408j0446j0365j0438j0280r435q278p605
$$ 367824 357092 346937 337165 327147 316739 306293 295928 285490 275210 265775 257497 249892
51988B49892p590p659p261o372n326m565m404m747n129n272n350n529n503m951
$$ 249892 242302 234643 227382 221010 215684 211119 206715 201968 196839 191567 186217 180688 175185 170234
51974A70234m135l625l462l182k612k168k146k202j796r60l68o71j881l319m080
$$ 170234 166099 162474 159012 155830 153218 151050 148904 146702 144906 143946 143578 142907 141026 137707 133627
51959A33627l748k723j858j648j882k067k056k052k117j950j292l56L47N20K87
$$ 133627 129879 127156 125298 123650 121768 119701 117645 115593 113476 111526 110234 109878 110225 110745 111032
51944A11032r5n15r18j144j028n85p3J78l3n67r35p14p2L13N1m85o26k07L24M45
$$ 111032 110937 110422 109504 108360 107332 106747 106674 106852 106819 106252 105317 104603 104531 104844 104895 104410 103784 103577 103901 104346
51924A04346jp98j486j695j493j325j410j391q65l7N26N37Q1o86j496j800j288
$$ 104346 104345 103547 102061 100366 98873 97548 96138 94747 93882 93845 94371 94908 94989 94303 92807 91007 89719
51907H9719m65j28l37m78l08j68j30K53R93J274N33o22j140p61n2M23M81J51k66
$$ 89719 89254 89126 88789 88311 88003 87835 87705 87958 88951 90225 90758 90136 88996 88235 88183 88606 89087 89238 88972
51888H8972k55L49R85R86L98k47o45p83n36J33P06N07k92o82l7J084J612J066
$$ 88972 88717 89066 90051 91037 91435 91188 90543 89760 89224 89357 90063 90570 90278 89596 89559 90643 92255 93321
51870I3321j77j414k065j866j012j22K70K83N42J326K048J889R46K63M95R80O61
$$ 93321 93144 91730 89665 87799 86787 86665 86935 87218 87760 89086 91134 93023 93969 94232 94727 95707 96368
51853I6368l26p71q2R17J181O98J40j59j90K17J117J980K258K280K842L925M674
$$ 96368 96042 95271 95189 96106 97287 97985 98125 97966 97776 97993 99110 101090 103348 105628 108470 112395 117069
51836A17069M783N052O238P948R243R939J0660J1861J3312J4537J5212J4985J3258
$$ 117069 121852 126904 133142 141090 150333 160272 170932 182793 196105 210642 225854 240839 254097
51823B54097R581M259j657p021j1162j3835j4956j4640j3432j2100j1008r904
$$ 254097 263678 267937 266280 259259 248097 234262 219306 204666 191234 179134 168126 158222
51811A58222q469o844n474m618m240m212m329m237l660k743j921j457j235j040
$$ 158222 149753 142909 137435 132817 128577 124365 120036 115799 112139 109396 107475 106018 104783 103743
51797A03743q61q61j103j433j606j535j353j169r00n12l17o04j049r49j25Q48
$$ 103743 102882 102021 100918 99485 97879 96344 94991 93822 92922 92410 92093 91489 90440 89491 89366 90214
51781I0214J480J853K041J647N65l29j0J288K277K140J289M95m3n36r61r91m39
$$ 90214 91694 93547 95588 97235 97800 97471 97461 98749 101026 103166 104455 104950 104907 104371 103410 102419 101980
51764A01980M02R14P25K25J85P14R66L26n95p59k14R7p2O9R14J607J245K22k91
$$ 101980 102382 103296 104021 104246 104431 105145 106111 106437 105842 105083 104869 104966 104894 104963 105877 107484 108729 108951 108660
51745A08660J69R70J257P30k98j233j638j609j545j525j140k04Q41J449J642J713
$$ 108660 108829 109799 111056 111786 111488 110255 108617 107008 105463 103938 102798 102594 103435 104884 106526 108239
51729A08239J688J475J267J285J334J184J152J696K461K485J480K62l49m46m82
$$ 108239 109927 111402 112669 113954 115288 116472 117624 119320 121781 124266 125746 126008 125659 125213 124731
51714A24731m50j36J76j6n72q53p11p04j203j840k163k259k330k137j448p29o65
$$ 124731 124281 124145 124321 124305 123733 122880 122169 121465 120262 118422 116259 114000 111670 109533 108085 107356 106691
51697A06691j128j236m90P70K020L048L624L390K450J440O40n04k396m394n433
$$ 106691 105563 104327 103837 104607 106627 109675 113299 116689 119139 120579 121219 120715 118319 113925 108492
51682A08492n263m416l292k003r75q34j517k133j925j038j81J31j25n78p33m05
$$ 108492 103229 98813 95521 93518 92543 91709 90192 88059 86134 85096 84915 85046 84921 84343 83610 83205
51666H3205O7K28P4m1Q9M29R37J427J382M94o31r67l12N33R21J096J465J754J370
$$ 83205 83272 83500 83574 83533 83622 84051 84988 86415 87797 88291 87660 86693 86381 86914 87835 88931 90396 92150 93520
51647I3520K94q01j204p62JL15r8o82o82j0Q20J491K053K336J911Q60n1k15K41
$$ 93520 93814 93013 91809 91047 91048 91363 91265 90583 89901 89891 90711 92202 94255 96591 98502 99362 99311 99096 99337
51628I9337R55J858K844L503L634L596L746L861L584L093K845K896K902K635K136
$$ 99337 100292 102150 104994 108497 112131 115727 119473 123334 126918 130011 132856 135752 138654 141289 143425
51613A43425J566J122R15P75M17J0J29Q95J641J799J602J500J344P71lm61o85
$$ 143425 144991 146113 147028 147803 148220 148230 148359 149254 150895 152694 154296 155796 157140 157911 157908 157447 156762
51596A56762j233k222l141l637l957m449m994n153m730m096l867m151m165l068
$$ 156762 155529 153307 150166 146529 142572 138123 133129 127976 123246 119150 115283 111132 106967 103899
51582A03899j161K27L30k03m27l35m36o86p47q71j490k157j953r79m68j110k097
$$ 103899 102738 102965 103295 103092 102665 102330 101894 101208 100461 99590 98100 95943 93990 93011 92543 91433 89336
51565H9336k171j067M35J411J454Q47L62N81J215J438R80M78N91J164J536J345
$$ 89336 87165 86098 86533 87944 89398 90245 90607 91188 92403 93841 94821 95299 95890 97054 98590 99935
51549I9935Q07M02M53Q26J014O99J93MO8j48p48j103o20N76J789K269J595Q8j095
$$ 99935 100742 101144 101597 102423 103437 104136 104329 104333 104401 104253 103505 102402 101782 102358 104147 106416 108011 108099 107004
51530A07004q04Q84K646L317K860J882Q12m6k34M71J619K486K825K915L079L476
$$ 107004 106200 107084 109730 113047 115907 117789 118601 118555 118321 118792 120411 122897 125722 128637 131716 135192
51514A35192M120M782N046M772M381M395M789N011M543L262J499r6r52j110j184
$$ 135192 139312 144094 149140 153912 158293 162688 167477 172488 177031 180293 181792 181696 180744 179634 178450
51499A78450j577k012k071j868j761j701j330o54j54k39q84j739k308k176j409
$$ 178450 176873 174861 172790 170922 169161 167460 166130 165476 165322 165083 164199 162460 160152 157976 156567
51484A56567o29l21k77j91m68j673l300m007l376k532k546l008k901k266k070
$$ 156567 155938 155617 155340 155149 154681 153008 149708 145701 142325 139793 137247 134239 131338 129072 127002
51469A27002k721l655m315m632m401l184j223L00M75k76q63q05l93MJ45k76j305
$$ 127002 124281 120626 116311 111679 107278 104094 102871 103171 103646 103370 102507 101702 101309 101313 101458 101182 99877
51452I9877k301k471j858j220j027j126j358j738j915j291l1P84M89k60m84k21
$$ 99877 97576 95105 93247 92027 91000 89874 88516 86778 84863 83572 83541 84325 84814 84554 84070 83849
51436H3849j76m94o96o22n36m24lM55J38j038j960j614m04L78J97k39j02N15Q71
$$ 83849 83673 83179 82483 81861 81325 80901 80898 81353 81491 80453 78493 76879 76475 76853 77050 76811 76709 77224 78095
51417G8095N92J12R8O89J405J704J450Q68K05l97q11q92n90o0M09O18O49P59J035
$$ 78095 78687 78799 78897 79586 80991 82695 84145 85013 85218 84821 84010 83118 82528 82468 82877 83495 84144 84903 85938
51398H5938J301J528K033K973L796L733K834J934J514J243Q24N80O89N74l38j626
$$ 85938 87239 88767 90800 93773 97569 101302 104136 106070 107584 108827 109651 110231 110920 111494 111156 109530
51382A09530k408k480k283j996j480r35q09j107j422j648k022k495k714k611k408
$$ 109530 107122 104642 102359 100363 98883 97948 97139 96032 94610 92962 90940 88445 85731 83120 80712
51367H0712k048j339n80l23m29k25L47N43Np39j215j587j896j646p33j2k12q64
$$ 80712 78664 77325 76745 76422 75993 75768 76115 76658 76663 75924 74709 73122 71226 69580 68847 68835 68623 67759
51349F7759j047o62k84j46l9Q5J16K17N91R40P35n0q82j240r29o7Q55J152P05
$$ 67759 66712 66050 65766 65620 65581 65666 65782 65999 66590 67530 68265 68215 67333 66093 65164 65097 65952 67104 67809
51330F7809K16L47Q28R50O30L38K27K9k30j84J71L51J30j18J8M72Q98J031Q16
$$ 67809 68025 68372 69200 70150 70780 71118 71345 71374 71144 70960 71131 71482 71612 71494 71512 71984 72882 73913 74729
51311G4729M27J86J90J18k62n91m05Q3K59M8n7J17K04Q3M6K4m64j288j399k95
$$ 74729 75156 75342 75532 75650 75388 74797 74392 74475 74734 74782 74725 74842 75046 75129 75175 75199 74735 73447 72048 71753
51291G1753R99J192M99J95O86J053O06j79n37n01n74q38r52p31k37M53J191J620
$$ 71753 72752 73944 74443 74638 75324 76377 76983 76804 76267 75766 75192 74354 73402 72671 72434 72887 74078 75698
51273G5698J529J240J188J247R74M27K10M95O61K80l5O55K226L404L116J523l12
$$ 75698 77227 78467 79655 80902 81876 82303 82513 83008 83669 83949 83914 84569 86795 90199 93315 94838 94526
51256I4526j415j466p17L14J136J462J232N90j20n53o52o46o13l34L03R45J125
$$ 94526 93111 91645 90928 91242 92378 93840 95072 95662 95542 94989 94337 93691 93078 92744 93047 93992 95117
51239I5117P63P2p34j325j208l48M49M09j08j28M12N27l12j375j672j102j62P90
$$ 95117 95880 95952 95218 93893 92685 92337 92786 93195 93087 92959 93371 93898 93586 92211 90539 89437 89275 90065
51221I0065J553J908J879J824J920J920J717J536J325N92o71j607j591j105q86
$$ 90065 91618 93526 95405 97229 99149 101069 102786 104322 105647 106239 105568 103961 102370 101265 100379
51206A00379q37n65m12q98j557j457p33m69j013j465j134m98k97m78n75n47o17
$$ 100379 99542 98977 98565 97667 96110 94653 93920 93451 92438 90973 89839 89341 89044 88566 87991 87444 86827
51189H6827p00n00m4L28L54J4n78j219j613j582j266j040j178j526j482n70Q81
$$ 86827 86127 85627 85583 85911 86265 86279 85701 84482 82869 81287 80021 78981 77803 76277 74795 74225 75106
51172G5106J883J844J224P80N30L2n40l94O71J724J717P13l06n14K7N71L90n57
$$ 75106 76989 78833 80057 80837 81367 81399 80859 80465 81136 82860 84577 85290 84984 84470 84497 85068 85458 84901
51154H4901j512j582o60M26P08K4q94j197p92l41l67m85M8J149J899J819J522
$$ 84901 83389 81807 81147 81573 82281 82305 81411 80214 79422 79081 78714 78229 78277 79426 81325 83144 84666
51137H4666J637J804J358N04j0k4Q2L26J053K025K431K036J459J200J080Q42O46
$$ 84666 86303 88107 89465 89969 89959 89935 90017 90343 91396 93421 95852 97888 99347 100547 101627 102469 103115
51120A03115O90R41J321J695J626P71l62q30n15k05k53k9Q93J900K200J911J691
$$ 103115 103805 104746 106067 107762 109388 110159 109797 108967 108452 108247 107994 107965 108858 110758 112958 114869 116560
51103A16560J771J909J856J435N61m52r81q76p14r35j263j371j492j847j994j430
$$ 116560 118331 120240 122096 123531 124092 123640 122659 121783 121069 120134 118871 117500 116008 114161 112167 110737
51087A10737l80N77J343K070K517K275J501P67K74k12p85j266j521j516j088j56
$$ 110737 110357 110934 112277 114347 116864 119139 120640 121407 121681 121469 120684 119418 117897 116381 115293 115137
51071A15137R37J594J541J039N81M92O37M38l70j067n78J002K217K029J034L57
$$ 115137 116074 117668 119209 120248 120829 121321 121958 122396 122026 120959 120381 121383 123600 125629 126663 127020
51055A27020P6l86r56j028o16l72n31o64m32J23R43J831K184J591O53L58P28R47
$$ 127020 127096 126710 125754 124726 124110 123738 123207 122543 122111 122234 123177 125008 127192 128783 129436 129794 130522 131469
51037A31469P66P57J147J323R56O71J094J948K503K454J983J436J232J608K169
$$ 131469 132235 132992 134139 135462 136418 137089 138183 140131 142634 145088 147071 148507 149739 151347 153516
51022A53516K220J734J435J720K161K355K542K917L078K768K533K971L774M218
$$ 153516 155736 157470 158905 160625 162786 165141 167683 170600 173678 176446 178979 181950 185724 189942
51008A89942M269M469N010N573N992O376O667O651O465O612P400Q674J0055J1165
$$ 189942 194211 198680 203690 209263 215255 221631 228298 234949 241414 248026 255426 264100 274155 285320
50994B85320J1784J2169J3071J4942J7281J9236K0775K2658K5280K8112L0543
$$ 285320 297104 309273 322344 337286 354567 373803 394578 417236 442516 470628 501171
50983E01171L2703L5186L8238M1563M4660M7190M9173N0900N2444N3219N2393
$$ 501171 533874 569060 607298 648861 693521 740711 789884 840784 893228 946447 998840
50972I98840M9818M6143M1888L6898L1029K4870J9226J4196R326M483k3m017p544
$$ 998840 1048658 1094801 1136689 1173587 1204616 1229486 1248712 1262908 1272234 1276717 1276694 1272677 1265133
50959A265133j0312j1800j2140j2219j2514j2419j1258r448q045p466p477q150
$$ 1265133 1254821 1243021 1230881 1218662 1206148 1193729 1182471 1173023 1164978 1157512 1150035 1141885
50947A141885r964j2775j5665j8090k0613k3941k7840l1465l4410l6782l8617
$$ 1141885 1131921 1119146 1103481 1085391 1064778 1040837 1012997 981532 947122 910340 871723
50936H71723l9806m0431m0556l9778l7698l4823l2314l0656k9134k6873k3903
$$ 871723 831917 791486 750930 711152 673454 638631 606317 575661 546527 519654 495751
50925D95751k0845j8101j5769j4046j3047j2344j1211r408p423n853m887m367
$$ 495751 474906 456805 441036 426990 413943 401599 390388 380980 373557 367704 362817 358450
50913C58450m008l458k458j243n03o07j043r17k9R69J490J706K141K892L572L906
$$ 358450 354442 350984 348526 347283 346780 346173 345130 344213 344184 345153 346643 348349 350490 353382 356954 360860
50897C60860M034M259M756N480O155O410O230O229P038Q449R571R938J0039J0541
$$ 360860 364894 369153 373909 379389 385544 391954 398184 404413 411451 419900 429471 439409 449448 459989
50883D59989J1427J2266J2978J3922J5385J7414J9987K2960K5877K8387L0848
$$ 459989 471416 483682 496660 510582 525967 543381 563368 586328 612205 640592 671440
50872F71440L4170L8861M4498N0324N6149O2463O9688P7468Q4870R1259R6956
$$ 671440 705610 744471 788969 839293 895442 957905 1027593 1105061 1189931 1281190 1378146
50861A378146J02750J08813J14260J17909J19188J18169J14899J09018R9985Q7628
$$ 1378146 1480896 1589709 1703969 1821878 1941066 2059235 2174134 2283152 2383137 2470765
50851B470765P2578N6132L9502K3149P194p614j9948k9101l5472l9487m0808l9177
$$ 2470765 2543343 2599475 2638977 2662126 2669320 2661706 2641758 2612657 2577185 2537698 2496890 2457713
50839B457713l5413l0679k5177j8624j1758o348l662l843o805j2686k1070l0694
$$ 2457713 2422300 2391621 2366444 2347820 2336062 2329714 2326052 2322209 2315404 2302718 2281648 2250954
50827B250954m0426m9998n9470o8611p7060q4485r0254r3637r4700r4286r2755
$$ 2250954 2210528 2160530 2101060 2032449 1955389 1870904 1780650 1687013 1592313 1498027 1405272
50816A405272q9473q4072p7411p0605o3833n6883n0246m4582l9623l4569k9393
$$ 1405272 1315799 1231727 1154316 1083711 1019878 962995 912749 868167 828544 793975 764582
50805G64582k4718k0662j6838j3478j1408j0649j0066q863p610p237p709q238
$$ 764582 739864 719202 702364 688886 677478 666829 656763 647900 640290 633053 625344 617106
50793F17106q301p859o980n917n332n711o627p042o468n422m680m432m367m316
$$ 617106 608805 600946 593966 588049 582717 577006 570379 563337 556869 551447 546767 542335 537968 533652
50779E33652m498n155o083o669o355n075l310j703o60j73P7N17J445K885M572
$$ 533652 529154 523999 517916 511247 504892 499817 496507 494804 494144 493971 494048 494565 496010 498895 503467
50764E03467O164P535Q936J0791J3236J5900J8327K0513K2833K5494K8334L1219
$$ 503467 509631 517166 526102 536893 550129 566029 584356 604869 627702 653196 681530 712749
50752G12749L4275L7674M1508M5936N1042N6304O0740O3987O6803O9910P2678
$$ 712749 747024 784698 826206 872142 923184 979488 1040228 1104215 1171018 1240928 1313606
50741A313606P3675P2378O9621O6195O1725N5227M6223L5015K2321R038l876j5634
$$ 1313606 1387281 1459659 1529280 1595475 1657200 1712427 1758650 1793665 1815986 1825024 1821148 1805514
50729A805514k5630l3181l7610l8899l7848l5328l1604k6707k1110j5602j0721
$$ 1805514 1779884 1746703 1709093 1670194 1632346 1597018 1565414 1538707 1517597 1501995 1491274
50718A491274o735l999k816l090m630p736j2870j9688k6987l3819m0071m5640
$$ 1491274 1484539 1480540 1477724 1474634 1470004 1462268 1449398 1429710 1402723 1368904 1328833 1283193
50706A283193m9679n1360n1039m9892m8393m5896m1920l7163l2804k9167k5738
$$ 1283193 1233514 1182154 1131115 1081223 1032830 986934 945014 907851 875047 845880 820142
50695H20142k2276j9301j7324j6153j5256j4457j3843j3169j1838r623o997m661
$$ 820142 797866 778565 761241 745088 729832 715375 701532 688363 676525 666902 659905 655244
50683F55244k903j633p44j96J23L50M76M53L95M73O39P17P91J197K001K826L390
$$ 655244 652341 650708 649964 649768 649891 650241 650717 651170 651565 652038 652677 653394 654185 655382 657383 660209 663599
50666F63599L892M650N544O273O950Q047R715J1565J3209J4711J6380J8383K0626
$$ 663599 667491 672141 677685 683958 690908 698955 708670 720235 733444 748155 764535 782918 803544
50653H03544K2795K4406K5113K5127K5080K5327K5559K5252K4227K2613K0548
$$ 803544 826339 850745 875858 900985 926065 951392 976951 1002203 1026430 1049043 1069591
50642A069591J8191J5810J3577J1401R153O804M307J609r26k537k904k668k655
$$ 1069591 1087782 1103592 1117169 1128570 1137723 1144527 1148834 1150443 1149517 1146980 1144076 1141408 1138753
50629A138753k820k546j711q47l37j26k49r46k114l209l884m266m444m235l677
$$ 1138753 1135933 1133387 1131676 1130829 1130492 1130366 1130117 1129171 1127057 1123848 1119964 1115698 1111254 1107019 1103342
50614A103342l248l266l628m314n706p988j0700j3331j5948j8890k2130k5326
$$ 1103342 1100094 1096828 1093200 1088886 1083180 1075192 1064492 1051161 1035213 1016323 994193 968867
50602I68867k8164l0334l1515l1806l1770l1598l0624k8219k4829k1545j8839
$$ 968867 940703 910369 878854 847048 815278 783680 753056 724837 700008 678463 659624
50591F59624j6312j3527j0466p290m223j694p0Q21J447J952K181K231K386K594
$$ 659624 643312 629785 619319 612029 607806 606112 606042 606863 608310 610262 612443 614674 617060 619654
50577F19654K582K502K801L409L793L933M558O063P841R177J0192J1406J2762
$$ 619654 622236 624738 627539 630948 634741 638674 643232 649295 657136 666313 676505 687911 700673
50564G00673J3717J4078J4231J4533J4905J5038J4722J3980J3093J2446J2252
$$ 700673 714390 728468 742699 757232 772137 787175 801897 815877 828970 841416 853668
50553H53668J2453J2992J3960J5349J6889J8379J9938K1721K3574K5413K7721
$$ 853668 866121 879113 893073 908422 925311 943690 963628 985349 1008923 1034336 1062057
50542A062057L1250L6085M1330M5893M9406N2214N4612N6405N7215N6949N5793
$$ 1062057 1093307 1129392 1170722 1216615 1266021 1318235 1372847 1429252 1486467 1543416 1599209
50531A599209N3825N0939M7118M2375L6403K8659J9243R330K26p901j5830k3919
$$ 1599209 1653034 1703973 1751091 1793466 1829869 1858528 1877771 1887101 1887327 1879426 1863596 1839677
50519A839677l1598l8171m3470m7530n0240n1636n1937n0974m8193m3678l8572
$$ 1839677 1808079 1769908 1726438 1678908 1628668 1577032 1525095 1474121 1425928 1382250 1343678
50508A343678l3918k9575k4983k0403j6466j2903q774l983N59M409Q205J2398
$$ 1343678 1309760 1280185 1255202 1234799 1218333 1205430 1196656 1192673 1193232 1197641 1205846 1218244
50496A218244J6300J8898J9917J9402J6900J1883M646l932j3240k2905l2080l9627
$$ 1218244 1234544 1253442 1273359 1292761 1309661 1321544 1326190 1322258 1309018 1286113 1254033 1214406
50484A214406m5007m8374m9850m9384m7448m5111m3040m0897l8122l4909l1947
$$ 1214406 1169399 1121025 1071175 1021791 974343 929232 886192 845295 807173 772264 740317
50473G40317k9447k6915k3866k0368j6875j3793j1212q924o610m083j399J294
$$ 740317 710870 683955 660089 639721 622846 609053 597841 588917 582307 578224 576825 578119
50461E78119L847O133Q135J0075J2140J4042J5185J5553J5917J6872J7958J8399
$$ 578119 581966 588099 596234 606309 618449 632491 647676 663229 679146 696018 713976 732375
50449G32375J8356J8693J9468J9598J8357J6431J4950J4032J3041J1838J0891
$$ 732375 750731 769424 788892 808490 826847 843278 858228 872260 885301 897139 908030
50438I08030J0192R012P059N201M512N003N758O100O121O164O396P005Q345J0490
$$ 908030 918222 927234 934293 939494 944006 949009 954767 960867 966988 973152 979548 986553 994898 1005388
50424A005388J2986J5350J7737K0588K3673K5949K6657K6181K5447K4726K3431
$$ 1005388 1018374 1033724 1051461 1072049 1095722 1121671 1148328 1174509 1199956 1224682 1248113
50413A248113K0985J7426J3081Q193K993k246p553j3366j9967k6871l3056l7750
$$ 1248113 1269098 1286524 1299605 1307798 1310791 1308545 1300992 1287626 1267659 1240788 1207732 1169982
50401A169982m0867m2840m4215m5195m5444m4437m2143l9210l6237l3147k9551
$$ 1169982 1129115 1086275 1042060 996865 951421 906984 864841 825631 789394 756247 726696
50390G26696k5515k1553j7960j4522j0929p160l382K79L757P007R897J2080J3055
$$ 726696 701181 679628 661668 647146 636217 629057 625675 625954 629711 636718 646615 658695 671750
50377F71750J2710J1656J0630R572P601M067o79n564r693j2869j5462j7834j9805
$$ 671750 684460 696116 706746 716318 723919 727986 727307 721743 712050 699181 683719 665885 646080
50364F46080k0777k0579j9926j9642j9612j9028j7626j5992j4575j3102j1320
$$ 646080 625303 604724 584798 565156 545544 526516 508890 492898 478323 465221 453901
50353D53901r634q496p679o691n529m440l228j484O41K493L746M672N613O675
$$ 453901 444267 435771 428092 421401 415872 411432 408204 406720 407361 409854 413600 418272 423885 430560
50339D30560P905R270J0389J0867J1013J1700J3223J4746J5263J4675J3574J2367
$$ 430560 438465 447735 458124 468991 480004 491704 504927 519673 534936 549611 563185 575552
50327E75552J1083R991R665J0262J1037J0836R074O153L127R55o7l83o95j338
$$ 575552 586635 596626 606291 616553 627590 638426 647500 653653 656780 657735 657668 657285 656590 655252
50313F55252k022k192j634p40j95l74j112k000k809l491l901l805l322l117l836
$$ 655252 653230 651038 649404 648664 648469 648095 646983 644983 642174 638683 634782 630977 627655 624538 620702
50298F20702n396p076q326r232j0009j0333r590p769n802m744m663m603l665k012
$$ 620702 615306 608230 599904 590672 580663 570330 560740 552971 547169 542425 537762 533159 529494 527482
50284E27482o99n07j097j403q62QL43O4r8L44R87J189R86R38J229J415J170P68
$$ 527482 526783 526276 525179 523776 522914 522922 523265 523329 523231 523575 524562 525751 526737 527675 528904 530319 531489 532257
50266E32257N79M31j22j053j774j819j339q14m76j39M03R15P61m85k421l995m513
$$ 532257 532836 533267 533145 532092 530318 528499 527160 526346 525870 525731 526134 527049 527810 527325 524904 520909 516396
50249E16396m324m274m553m520l746k788k476k743k643j575P0J514K452K956L027
$$ 516396 512072 507798 503245 498725 494979 492191 489715 486972 484329 482754 482824 484338 486790 489746 492773
50234D92773K666K196J985J915J600J070P65P90O93K02l25n07n54q66j321j532
$$ 492773 495439 497635 499620 501535 503135 504205 504970 505760 506453 506655 506330 505823 505269 504403 503082 501550
50218E01550j467j368j175p18l91r55k404l693l891l254k740k863l425m108m820
$$ 501550 500083 498715 497540 496822 496431 495476 493072 489379 485488 482234 479494 476631 473206 469098 464278
50203D64278n452n747n578n130m670m314m070l962l932l715l113k366k048k414
$$ 464278 458826 453079 447501 442371 437701 433387 429317 425355 421423 417708 414595 412229 410181 407767
50189D07767k972k980k304j518j206j378j699j903j808j292n62j58k80l24M45
$$ 407767 404795 401815 399511 397993 396787 395409 393710 391807 389999 388707 388145 387987 387707 387383 387828
50174C87828J930L382M421N335O334P172P680Q256R415J1196J3131J4688J5550
$$ 387828 389758 393140 397561 402896 409230 416402 424082 432338 441753 452949 466080 480768 496318
50161D96318J5729J5483J4934J3825J1893R555P700O727O228N790N589N909O350
$$ 496318 512047 527530 542464 556289 568182 577737 585437 592164 598392 604182 609771 615680 622030
50148F22030N999M185R82k938o762j0133j3331j6633j9573k1273k1535k0996k0078
$$ 622030 628029 632214 633196 630258 623496 613363 600032 583399 563826 542553 521018 500022 479944
50135D79944j8533j6295j4072j2537j1440j0194q800p594o460n002l282j751o56
$$ 479944 461411 445116 431044 418507 407067 396873 388073 380479 374019 369017 365735 363984 363328
50122C63328RK01P5K13R54J766K004J981K526L640M513M813N033N512N988O250
$$ 363328 363337 363538 363613 363826 364780 366546 368550 370531 373057 376697 381210 386023 391056 396568 402556 408806
50106D08806O430O403N792M828M385M761N206N139N036N532O338O760O717O492
$$ 408806 415236 421639 427431 432259 436644 441405 446611 451750 456786 462318 468656 475416 482133 488625
50092D88625O002N140M435M503N007N057M567M343M761N228N285N368O013O871
$$ 488625 494627 499767 504202 508705 513712 518769 523336 527679 532440 537668 542953 548321 554334 561205
50078E61205P202O949O726O882P249P696Q310Q864Q704P623O429O137O739P299
$$ 561205 568407 575356 582082 588964 596213 603909 612219 621083 629787 637410 643839 649976 656715 664014
50064F64014P218O790O462O126N542M886M445M069L539L255L887N472P446R595
$$ 664014 671232 678022 684484 690610 696152 701038 705483 709552 713091 716346 720233 725705 733151 742746
50050G42746J2336J5889J9737K3209K6119K8566L0396L1237L0839K9201K6680
$$ 742746 755082 770971 790708 813917 840036 868602 898998 930235 961074 990275 1016955
50039A016955K4098K2328K1582K1334K1146K0987K0542J8821J5116R891M066k245
$$ 1016955 1041053 1063381 1084963 1106297 1127443 1148430 1168972 1187793 1202909 1212800 1216866 1214621
50027A214621r479j7211k4036k9051l2763l6046l8795m0232m0142l9236l8273
$$ 1214621 1205142 1187931 1163895 1134844 1102081 1066035 1027240 987008 946866 907630 869357
50016H69357l7369l6250l4746l2831l0465k7696k4849k2306k0155j8221j6465
$$ 869357 831988 795738 760992 728161 697696 670000 645151 622845 602690 584469 568004
50005E68004j5080j4061j3001j1522r770q201o979n928n052m614m668m817m718
$$ 568004 552924 538863 525862 514340 504570 496369 489390 483462 478410 473796 469128 464311 459593
49992D59593m507m524m777m995n016m911m755m506m143l743l426l278l303l404
$$ 459593 455086 450562 445785 440790 435774 430863 426108 421602 417459 413716 410290 407012 403709 400305
49978D00305l562m036n106o517p407p111n901m677m036l907m008m263m622m798
$$ 400305 396743 392707 387601 381084 373677 366566 360665 355988 351952 348045 344037 339774 335152 330354
49964C30354m429l504k461j819j720j864j897j810j824j886j532m32R95J775J356
$$ 330354 325925 322421 319960 318141 316421 314557 312660 310850 309026 307140 305608 305176 306171 307946 309302
49949C09302K74l34O3Q56J116Q32R49K094L674M657M926N234O004O827P309P735
$$ 309302 309576 309242 309305 310161 311277 312109 313058 315152 318826 323483 328409 333643 339647 346474 353783 361518
49933C61518Q572R846J1412J3362J5656J7729J9035J9744K0348K0737K0282J8757
$$ 361518 370090 379936 391348 404710 420366 438095 457130 476874 497222 517959 538241 556998
49921E56998J6619J4322J1958R666P862O822O391O335O613P020O835N234J986
$$ 556998 573617 587939 599897 609563 617425 624247 630638 636973 643586 650606 657441 662675 664661
49908F64661k375p038j1519j5778j9888k3469k5733k6235k5449k4259k2977k1281
$$ 664661 662286 655248 643729 627951 608063 584594 558861 532626 507177 482918 459941 438660
49896D38660j9109j6985j5291j3709j1798r757q178p324p007o944o804o118m688
$$ 438660 419551 402566 387275 373566 361768 352011 343833 336509 329502 322558 315754 309636 304948
49883C04948l111k330k558k987k771j958j203q32n22J01Q62J209Q84L49L08Q88
$$ 304948 301837 299507 296949 293962 291191 289233 288030 287198 286676 286777 287639 288848 289732 290081 290389 291277
49867B91277J453J410R90R25J411J833J635J019O00N81O81O41M93L58L11M56P84
$$ 291277 292730 294140 295130 296055 297466 299299 300934 301953 302553 303134 303815 304456 304949 305307 305618 306074 306858
49850C06858R92O69k32j304k137k617k754k517k004j524j312j319j375j399j320
$$ 306858 307850 308519 308287 306983 304846 302229 299475 296958 294954 293430 292118 290799 289424 288025 286705
49835B86705j054o67m12l50j73L71J083J563J673J474R88M19L02R56J845K031
$$ 286705 285651 284984 284572 284222 284049 284420 285503 287066 288739 290213 291201 291620 291922 292878 294723 296754
49819B96754J316M77K61O20R84R35M41j82m25k6N59M91m94j776k629k884k709
$$ 296754 298070 298547 298808 299428 300412 301347 301788 301606 301181 301155 301714 302205 301711 299935 297306 294422 291713
49802B91713k190j539j234j508j965k087j898j768j749j548j041l66L20Q60R75
$$ 291713 289523 287984 286750 285242 283277 281190 279292 277524 275775 274227 273186 272820 273140 274000 274975
49787B74975N31j19l91p1O06J339J893J971J407N47N7K67Q52J230J069M30l01
$$ 274975 275506 275387 274996 274925 275531 276870 278763 280734 282141 282688 282745 283012 283864 285094 286163 286593 286292
49770B86292o36l98N4J81p7k50R8Q58J505J595J162O74N24N72L74J9J81J145K105
$$ 286292 285656 285258 285312 285493 285416 285166 285264 286122 287627 289222 290384 291058 291582 292154 292528 292547 292728 293873 295978
49751B95978K032J038K76N10J341J939J998J764J532J373J182Q18K67k70o74j144
$$ 295978 298010 299048 299324 299834 301175 303114 305112 306876 308408 309781 310963 311781 312048 311778 311104 309960
49735C09960j858k502k552k040j588j591j788j780j587j441j345j088n58J35O24
$$ 309960 308102 305600 303048 301008 299420 297829 296041 294261 292674 291233 289888 288800 288242 288377 289001
49720B89001M77l37j116j038j90M41J64o34j143j109q36n57k58MO8p9k21o3N43
$$ 289001 289478 289141 288025 286987 286797 287238 287402 286768 285625 284516 283680 283123 282865 282869 282937 282858 282637 282574 283117
49701B83117J426K074K033J426Q03M62K33O0K61R55J583J454N57m84j026p44L67
$$ 283117 284543 286617 288650 290076 290879 291341 291574 291634 291895 292850 294433 295887 296444 295960 294934 294190 294557
49684B94557J859K933L040K362J488Q39O11R28J666K388K800L095L434L488K967
$$ 294557 296416 299349 302389 304751 306239 307078 307689 308617 310283 312671 315471 318566 322000 325488 328455
49669C28455K317K167K338K134J535J298J711K082J759R85L66J11K75J127K608
$$ 328455 330772 332939 335277 337411 338946 340244 341955 344037 345796 346781 347147 347258 347533 348660 351268
49654C51268L798L784K916K441K815L085K293Q94K33Q50J959K596K706K778K789
$$ 351268 355066 358850 361766 364207 367022 370107 372400 373294 373527 374377 376336 378932 381638 384416 387205
49639C87205K143P23o05q36L9J113J618J519J128O27J50k2K86Q18J084R32P18
$$ 387205 389348 390071 389466 388630 388669 389782 391400 392919 394047 394674 394824 394802 395088 395906 396990 397922 398640
49622C98640R09J553K159K130J385N39L61J041K116L103L989M880N517N452M729
$$ 398640 399549 401102 403261 405391 406776 407315 407676 408717 410833 413936 417925 422805 428322 433774 438503
49607D38503M045M098M893N849O433O558O428O277O310O670P245P584P339O768
$$ 438503 442548 446646 451539 457388 463821 470379 476807 483084 489394 496064 503309 510893 518232 525000
49593E25000O582P099P794P974P680P612Q159Q968R564R940J0251J0341J0011
$$ 525000 531582 538681 546475 554449 562129 569741 577900 586868 596432 606372 616623 626964 636975
49580F36975R589R654J0209J0618J0524J0318J0491J0923J1223J1441J1872J2398
$$ 636975 646564 656218 666427 677045 687569 697887 708378 719301 730524 741965 753837 766235
49568G66235J2545J2318J2326J2958J3809J4305J4501J4855J5462J5815J5459
$$ 766235 778780 791098 803424 816382 830191 844496 858997 873852 889314 905129 920588
49557I20588J4558J3794J3772J4452J5092J4947J4088J3302J3071J2966J2367
$$ 920588 935146 948940 962712 977164 992256 1007203 1021291 1034593 1047664 1060630 1072997
49546A072997J1364J0503R871R103Q156P431P021O447N391M177L264K712K417
$$ 1072997 1084361 1094864 1104735 1113838 1121994 1129425 1136446 1142893 1148284 1152461 1155725 1158437 1160854
49533A160854K419K583K424J715R92R51J596K384K999L501L828L824L701L956
$$ 1160854 1163273 1165856 1168280 1169995 1170987 1171938 1173534 1175918 1178917 1182418 1186246 1190070 1193771 1197727
49519A197727M646N225N294N116N221N761O492P063P096O269M729L276K757L224
$$ 1197727 1202373 1207598 1212892 1218008 1223229 1228990 1235482 1242545 1249641 1255910 1260639 1263915 1266672 1269896
49505A269896L905L987L229J834J08j560k642k815k376k021k147k587l127l938
$$ 1269896 1273801 1277788 1281017 1282851 1282959 1281399 1278757 1275942 1273566 1271545 1269398 1266811 1263684 1259746
49491A259746n243o734p836q440r023r974j1138j2172j2960j3495j3697j3586
$$ 1259746 1254503 1247769 1239933 1231493 1222470 1212496 1201358 1189186 1176226 1162731 1149034 1135448
49479A135448j3425j3439j3579j3781j4131j4527j4463j3591j2312j1396j1117
$$ 1135448 1122023 1108584 1095005 1081224 1067093 1052566 1038103 1024512 1012200 1000804 989687
49468I89687j1150j1185j1207j1130j0681r811q888q259p896p544p094o580o046
$$ 989687 978537 967352 956145 945015 934334 924523 915635 907376 899480 891936 884842 878262 872216
49455H72216n542n119m795m556m428m358m121l513k689j919r64Q60L618N970N985
$$ 872216 866674 861555 856760 852204 847776 843418 839297 835784 833095 831176 830212 831072 834690 840660 846645
49440H46645K936j860o080q269q623q134p331o146m668l435k766k297j593r18
$$ 846645 849581 847721 841641 833372 824749 816615 809284 803138 798470 795035 792269 789972 788379 787461
49426G87461r00j530k052j839r42K11J223J773J788J739K291L440M402M664M661
$$ 787461 786561 785031 782979 781140 780198 780409 781632 783405 785193 786932 789223 792663 797065 801729 806390
49411H06390N022N566N631N194N033N696O779P414P227O644O378O679P101O951
$$ 806390 811412 816978 822609 827803 832836 838532 845311 852725 859952 866596 872974 879653 886754 893705
$$ [...]
##END NTUPLES=NMR SPECTRUM
##END=
