##TITLE=NES1043_8708014013_9242921_HsXZwWY3Tl
##JCAMPDX= 6.0         $$ Bruker NMR JCAMP-DX V2.0
##DATA TYPE= NMR SPECTRUM
##DATA CLASS= NTUPLES
##ORIGIN= BRUKER
##OWNER= Administrator
$$ 1.72 TOPSPIN		Version 2.1
$$ 2015-06-23 20:32:35.201 -0700  Administrator@X
$$ Compression mode = diff/dup
##.OBSERVE FREQUENCY= 400.02188249412
##.OBSERVE NUCLEUS= ^1H
##.ACQUISITION MODE= SIMULTANEOUS (DQD)
##.ACQUISITION SCHEME= undefined
##.AVERAGES= 8
##.DIGITISER RES= 22
##SPECTROMETER/DATA SYSTEM= spect
##.PULSE SEQUENCE= zg30
##.SOLVENT NAME= COFFEE_meoh
##.SHIFT REFERENCE= INTERNAL, COFFEE_meoh, 1, 14.98509
##AUDIT TRAIL= $$ (NUMBER, WHEN, WHO, WHERE, PROCESS, VERSION, WHAT)
$$ ##TITLE= Audit trail, TOPSPIN		Version 2.1
$$ ##JCAMPDX= 5.01
$$ ##ORIGIN= Bruker BioSpin GmbH
$$ ##OWNER= Administrator
$$ $$ E:\/data/COFFEE/nmr/NES1043_8708014013_9242921_HsXZwWY3Tl/10/pdata/1/auditp.txt
$$ ##AUDIT TRAIL=  $$ (NUMBER, WHEN, WHO, WHERE, PROCESS, VERSION, WHAT)
(   1,<2015-06-23 20:32:28.029 -0700>,<Administrator>,<X>,<go>,<TOPSPIN 2.1>,
      <created by zg
	started at 2015-06-23 20:31:21.889 -0700,
	POWCHK enabled, PULCHK disabled,
       configuration hash MD5:
       21 0F 79 D6 B3 7B B4 F6 88 20 88 DB 03 48 BD 9F
       data hash MD5: 64K
       37 39 E4 AF BB 70 0D C3 CF A8 50 F5 5E 4D B7 B6>)
(   2,<2015-06-23 20:32:31.170 -0700>,<Administrator>,<X>,<proc1d>,<TOPSPIN 2.1>,
      <Start of raw data processing
       efp LB = 0 FT_mod = 6 PKNL = 1 PHC0 = 0 PHC1 = 0 SI = 32K 
       data hash MD5: 32K
       3B A6 75 C1 D2 2F A2 FE E7 F7 18 13 EB AF FD 6A>)
(   3,<2015-06-23 20:32:31.451 -0700>,<Administrator>,<X>,<proc1d>,<TOPSPIN 2.1>,
      <pk PHC0 = 91.06567 PHC1 = 0 
       data hash MD5: 32K
       31 6C 93 62 92 C3 BB 01 90 73 C4 62 42 86 C4 C3>)
(   4,<2015-06-23 20:32:31.561 -0700>,<Administrator>,<X>,<proc1d>,<TOPSPIN 2.1>,
      <abs ABSG = 1 
       data hash MD5: 32K
       C8 88 8F E5 8A EA B8 89 D4 7E 46 1C 6C 24 C3 A8>)
(   5,<2015-06-23 20:32:31.623 -0700>,<Administrator>,<X>,<proc1d>,<TOPSPIN 2.1>,
      <abs ABSG = 2 
       data hash MD5: 32K
       F7 1D 50 FE 68 15 22 E5 6B 18 BA AA 1A 29 F3 3E>)
(   6,<2015-06-23 20:32:31.701 -0700>,<Administrator>,<X>,<proc1d>,<TOPSPIN 2.1>,
      <abs ABSG = 3 
       data hash MD5: 32K
       15 F0 71 F0 78 1A 48 26 46 19 74 30 18 1A 8C 6F>)
(   7,<2015-06-23 20:32:31.748 -0700>,<Administrator>,<X>,<proc1d>,<TOPSPIN 2.1>,
      <abs ABSG = 4 
       data hash MD5: 32K
       C3 59 4D 5C C1 79 FF 7E 86 CD 30 A0 CB BD 31 8C>)
(   8,<2015-06-23 20:32:31.811 -0700>,<Administrator>,<X>,<proc1d>,<TOPSPIN 2.1>,
      <abs ABSG = 5 
       data hash MD5: 32K
       85 82 C6 CD 06 CD 49 FA 7A 92 BB 7D 0D F6 90 D2>)
$$ ##END=
$$ 
$$ $$ hash MD5
$$ $$ AA D0 CD 0D 76 28 5F EF F8 16 00 7C 43 E3 BD 0E
##$RELAX= 
##$RELAX= 
##$RELAX= 
##$RELAX= 
##$RELAX= 
##$RELAX= 
##$RELAX= 
$$ Bruker specific parameters
$$ --------------------------
##$DU= <E:\>
##$EXPNO= 10
##$NAME= <NES1043_8708014013_9242921_HsXZwWY3Tl>
$$ [...]
150 150 150 150 150 150 150 150
##$TP07= 0
##$TPNAME0= <>
##$TPNAME1= <>
##$TPNAME2= <>
##$TPNAME3= <>
##$TPNAME4= <>
##$TPNAME5= <>
##$TPNAME6= <>
##$TPNAME7= <>
##$TPOAL= (0..7)
0.5 0.5 0.5 0.5 0.5 0.5 0.5 0.5
##$TPOFFS= (0..7)
0 0 0 0 0 0 0 0
##$TUNHIN= 0
##$TUNHOUT= 0
##$TUNXOUT= 0
##$USERA1= <user>
##$USERA2= <user>
##$USERA3= <user>
##$USERA4= <user>
##$USERA5= <user>
##$V9= 5
##$VALIST= <valist>
##$VCLIST= <CCCCCCCCCCCCCCC>
##$VD= 0
##$VDLIST= <DDDDDDDDDDDDDDD>
##$VPLIST= <PPPPPPPPPPPPPPP>
##$VTLIST= <TTTTTTTTTTTTTTT>
##$WBST= 2048
##$WBSW= 25
##$XGAIN= (0..3)
0 0 0 0
##$XL= 0
##$YL= 0
##$YMAX_a= 627702
##$YMIN_a= -525741
##$ZGOPTNS= <>
##$ZL1= 120
##$ZL2= 120
##$ZL3= 120
##$ZL4= 120
##$ABSF1= 14.98509
##$ABSF2= -5.573092
##$ABSG= 5
##$ABSL= 3
##$ALPHA= 0
##$AQORDER= 0
##$ASSFAC= 0
##$ASSFACI= 0
##$ASSFACX= 0
##$ASSWID= 0
##$AUNMP= <proc_prof1d_extract_pilot.lims>
##$AXLEFT= 0
##$AXNAME= <>
##$AXNUC= <1H>
##$AXRIGHT= 0
##$AXTYPE= 0
##$AXUNIT= <>
##$AZFE= 0.1
##$AZFW= 0.1
##$BCFW= 0
##$BC_mod= 0
##$BYTORDP= 0
##$COROFFS= 0
##$CY= 15
##$DATMOD= 1
##$DC= 0
##$DFILT= <>
##$DTYPP= 0
##$F1P= 0
##$F2P= 0
##$FCOR= 0.5
##$FTSIZE= 32768
##$FT_mod= 6
##$GAMMA= 0
##$GB= 0
##$INTBC= 1
##$INTSCL= 1
##$ISEN= 128
##$LB= 0
##$LEV0= 0
##$LPBIN= 0
##$MAXI= 10000
##$MC2= 0
##$MEAN= 0
##$ME_mod= 0
##$MI= 0
##$NCOEF= 0
##$NC_proc= -8
##$NLEV= 6
##$NOISF1= 0
##$NOISF2= 0
##$NSP= 0
##$NTH_PI= 0
##$NZP= 0
##$OFFSET= 14.98509
##$PC= 1
##$PHC0= 91.06567
##$PHC1= 0
##$PH_mod= 1
##$PKNL= yes
##$PPARMOD= 0
##$PPDIAG= 0
##$PPIPTYP= 0
##$PPMPNUM= 2147483647
##$PPRESOL= 1
##$PSCAL= 4
##$PSIGN= 0
##$PYNMP= <proc.py>
##$REVERSE= no
##$SF= 400.02
##$SI= 32768
##$SIGF1= 0
##$SIGF2= 0
##$SINO= 400
##$SIOLD= 32768
##$SPECTYP= <>
##$SREGLST= <1H.CDCl3>
##$SSB= 0
##$STSI= 32768
##$STSR= 0
##$SW_p= 8223.68421052631
##$SYMM= 0
##$S_DEV= 0
##$TDeff= 65536
##$TDoff= 0
##$TI= <>
##$TILT= no
##$TM1= 0
##$TM2= 0
##$TOPLEV= 0
##$USERP1= <user>
##$USERP2= <user>
##$USERP3= <user>
##$USERP4= <user>
##$USERP5= <user>
##$WDW= 1
##$XDIM= 32768
##$YMAX_p= 430011399
##$YMIN_p= -676825
##$CURPLOT= <Network HP LaserJet P1505>
##$CURPRIN= <$Network HP LaserJet P1505>
##$DFORMAT= <normdp>
##$LAYOUT= <+/1D_H.xwp>
##$LFORMAT= <normlp>
##$PFORMAT= <normpl>
##$SURQMSG= 1
$$ End of Bruker specific parameters
$$ ---------------------------------
##NTUPLES= NMR SPECTRUM
##VAR_NAME=  FREQUENCY,     SPECTRUM/REAL,   SPECTRUM/IMAG
##SYMBOL=    X,             R,               I
##VAR_TYPE=  INDEPENDENT,   DEPENDENT,       DEPENDENT
##VAR_FORM=  AFFN,          ASDF,            ASDF
##VAR_DIM=   32768,         32768,           32768
##UNITS=     HZ,            ARBITRARY UNITS, ARBITRARY UNITS
##FACTOR=    0.250966925370066, 1,           1
##FIRST=     8223.43324360094, 87064,        -90607
##LAST=      0,             -53671,          -222808
##MIN=       0,             -676825,         0
##MAX=       8223.43324360094, 430011399,    0
$$ Real data points
##PAGE= N=1
##DATA TABLE= (X++(R..R)), XYDATA
$$ [...]
19477A88311G9998d186A27258n2268a82941c7105D3395a78496A23124d8120p7144
19466a25264C259i9622j10286l9589J13652A33992c04459B8419b58902J00144
19456a58758j74850E8124J30444l8346A7621d8686K3980k22813j39447H8348q84
19445H7464k0683b31536f5664n7940B8615c4184B61885b08428C9098c33196J25353
19434b07843j8068A51581b03440A926J52799b14602A4514J941K21974a70208A52882
19422A17388c05073a25257p5485Q8977A66913a31248N7307a2767A59283c0717
19411b51244d8051l4037j46229c5623n3302J0958A64511F8027a50659D5094L4092
19400G9186a42060o7917b6024n595A32746M2291a23481d0040A71410d7927j46481
$$ plain form
19477 188311 79998 -4186 127258 74990 -182941 -37105 43395 -178496 123124 -48120 -125264
19466 -125264 3259 -99622 -209908 -249497 -135845 133992 -304459 28419 -258902 -158758
19456 -158758 -333608 58124 188568 150222 17621 -48686 -24706 -247519 -386966 88348 87464
19445 87464 66781 -231536 -65664 -123604 28615 -34184 261885 -208428 39098 -333196 -207843
19434 -207843 -225911 151581 -203440 1926 154725 -214602 14514 16455 238429 -170208 152882
19422 117388 -305073 -125257 -200742 -111765 166913 -131248 -73941 -12767 159283 -30717
19411 -251244 -48051 -82088 -228317 -35623 -88925 -77967 164511 68027 -150659 45094 79186
19400 79186 -142060 -209977 -26024 -31619 132746 175037 -123481 -40040 171410 -47927 -194408
19389a94408j36934C8645a96097L85c2364G3474b34217j18316d6509j13488a9303
19377g3716C3606A2239J21345e2959K1556j19518b0413j39169D6244a9475D0509
19365a27486e0547l1922l1753j71800E8540a24396d5095m14651i7740A473a53277
19353a98000A38549E2556L6779A7961a92106Q0165C09502c28230J11116g3764
19342a02206j23638j6583l05967a22456d4323m4694J5201E6277a46747p1920A70163
19330A91855A4778J45246a37907r9478a722m49800c4194k9356I2286b84643D5845
19318a82013B24096a60629N6355A88589q6955L8075h6495H8504J28683F5294L75701
19307D40995b85270Q864F3013R1639F9821J60274n2083C3418N4898f1670J2632
$$ plain form
19389 -194408 -331342 38645 -196097 -195712 -32364 73474 -234217 -352533 -46509 -159997 -19303
19377 -73716 33606 12239 133584 -52959 -31403 -150921 -20413 -159582 46244 -19475 40509
19365 -127486 -50547 -82469 -114222 -286022 58540 -124396 -45095 -459746 -97740 1473 -153277
19353 -198000 138549 52556 89335 17961 -192106 -111941 309502 -328230 -217114 -73764
19342 -102206 -225844 -242427 -548394 -122456 -44323 -89017 -73816 56277 -146747 -218667 170163
19330 191855 14778 160024 -137907 -237385 -1722 -451522 -34194 -63550 92286 -284643 45845
19318 -182013 224096 -160629 -104274 188589 101634 139709 -86495 88504 217187 65294 440995
19307 440995 -285270 -276406 63013 154652 69821 230095 178012 33418 88316 -61670 -49038
19296d9038K4091A9778J37226d53325F2166e6524l45007B7378J87005I7200k7365
19285F9835g2238k13226a13210A01920b92527l00553b79615j68251L2931C9648
19274c81k67742D7200a38933B31966A3589M2203a21925l8322K7854j70709A96617
19262c63356f9099A12235a56992D7049i6355j5264l1812C7717M6773J66137o2343
19251A88284f1773l60886d3276r8424A67047a34743j23751B8592b072A0478a06510
19239c5133n6940A28045J13399a54128e1619A21470B9616g7087J520A9798b8411
19227B1141a07095B3859b48375i6955j78196c2366A59917d809k31328c183R19
19216b264j09l05300H442a72555P7545C33142a92550R5385Q578J4984A1820f4934
$$ plain form
19296 -49038 -24947 19778 157004 -453325 62166 -56524 -401531 27378 214383 97200 69835
19285 69835 -72238 -285464 -113210 101920 -292527 -593080 -279615 -447866 -414935 39648
19274 -381 -268123 47200 -138933 231966 13589 55792 -121925 -160247 -132393 -303102 196617
19262 -363356 -69099 112235 -156992 47049 -96355 -111619 -143431 37717 84490 250627 188284
19251 188284 -61773 -422659 -43276 -141700 167047 -134743 -258494 28592 -2072 10478 -106510
19239 -35133 -92073 128045 241444 -154128 -51619 121470 29616 -77087 -75567 19798 -28411
19227 21141 -107095 23859 -248375 -96955 -275151 -32366 159917 -4809 -236137 -3183 -2264
19216 -2264 -2373 -307673 8442 -172555 -95010 333142 -192550 -97165 -88587 -73603 11820 -64934
19203f5936f996A41601k8582i0538B56925a52069M6684p586d5358o6361p9752
19192a91471d9237j46310C25215a07482E2949a60853A03695a47572E194J42163
19182A47357i1573p9194B10794a01958k46265I4363l8589a93550A51426d8383
19171e4826j49942i5554r7191H3711k0748Q6737r552a08703m9511A10106i3908
19159a67824A00119d636m7786D4045b15649J2280B4595a09666a1036m0496j71864
19148b23396f3931j13195b351A150M620b13405B57912D1111M03105G4974K9552
19137A04526a73992d1912A16008d78068B40491a41113F1395a95833K0835e8825
19126a69836L7085O962m9954a5443B86608f0849q1938B3982J84266r7590l8591
$$ plain form
19203 -65936 -6996 141601 113019 -90538 256925 -152069 -105385 -112971 -45358 -111719 -191471
19192 -191471 -49237 -195547 325215 -107482 52949 -160853 103695 -147572 5194 147357
19182 147357 -91573 -170767 210794 -101958 -348223 94363 55774 -193550 151426 -48383
19171 -54826 -204768 -95554 -192745 83711 62963 149700 140148 -108703 -158214 110106 -93908
19159 -167824 100119 -4636 -52422 44045 -215649 -203369 24595 -109666 -11036 -51532 -223396
19148 -223396 -63931 -177126 -2351 1150 5770 -213405 257912 41111 444216 74974 104526
19137 104526 -173992 -41912 116008 -478068 240491 -141113 61395 -195833 -174998 -58825
19126 -169836 -132751 -125789 -175743 -15443 286608 -60849 -142787 23982 208248 110658 72067
19115G2067a3247p6958J6900j85658G5322b16893R6815B34188b67816A95408B8082
19103f0167E8628h0724j51691c5785m79924I2a75656B0577a68066j34412d2362
19091c47526J18279K4593c9288k68152i8751m1190o0210O5124e8682B07222h4283
19079a5820j29831K1437A29339c08966a40009A37816j3533J3072M2427l0440f6199
19067a47698F0811K5867B4613J06209b15582B22441I2596b04886d7612j46068
19057a93680b7293C32278a30128D3437L2638a85313j44036a64199C9581f6877
19046E775g2372A92873c40261J24925k00195B51900g9194F8934l3274J3928c7105
19034B28858e6665j31860A93462f5742B12581a3035k9389B14170q1629C5049Q6233
$$ plain form
19115 72067 -13247 -90205 -73305 -258963 75322 -216893 -120078 234188 -267816 195408 28082
19103 -60167 58628 -80724 -232415 -35785 -515709 92 -175656 20577 -168066 -302478 -42362
19091 -347526 -229247 -204654 -39288 -307440 -98751 -139941 -200151 -135027 -58682 207222 -84283
19079 -15820 -145651 -124214 129339 -308966 -140009 137816 124283 137355 179782 149342 -66199
19067 -147698 60811 86678 24613 130822 -215582 222441 92596 -204886 -47612 -193680
19057 -193680 -27293 332278 -130128 43437 76075 -185313 -329349 -164199 39581 -66877
19046 5775 -72372 192873 -340261 -215336 -415531 251900 -79194 68934 35660 49588 -37105
19034 228858 -56665 -188525 193462 -65742 212581 -13035 -42424 214170 132541 35049 121282
19023A21282a3615l4057o5685a6087j97658B60542J43700H7311g6881j26546B8611
19011F2178O2704b0220G625a88835F2230b05057b2912q0052i496B7318a04120
18999i4749l1748I2266a92536N4040j69383b8747k34872I6209f6906j2482j67421
18988b46809M5971D0453q790i0363n32500L01306a44436j90091J43659n2099A43195
18976a31963B99029E4670L87518B06830D555K8666Q5709B712i2183A19623i7455
18964a37526I419b0113F8569b60201a91j42446B33616c28287A09947n4308a61040
18952i0978l3700A35340H287O2462B1728N3492a9028C05860a58581j33213G9203
18940D9917e4373o8217j0611f3488D7289K1730a84535B48331a38932M2685j31381
$$ plain form
19023 121282 -13615 -47672 -113357 -16087 -213745 260542 404242 87311 -76881 -203427 28611
19011 62178 124882 -20220 7625 -188835 62230 -205057 -22912 -102964 -9496 27318 -104120
18999 -94749 -126497 92266 -192536 -138496 -307879 -28747 -263619 96209 -66906 -79388 -246809
18988 -246809 -200838 40453 31663 -90363 -622863 -321557 -144436 -334527 -190868 -242967 143195
18976 -131963 299029 54670 442188 206830 4555 33221 118930 2712 -92183 119623 -97455
18964 -137526 9419 -20113 68569 -260201 -191 -142637 233616 -328287 109947 55639 -161040
18952 -90978 -124678 135340 8287 70749 21728 75220 -19028 305860 -158581 -291794 79203
18940 49917 -54373 -122590 -133201 -63488 47289 69019 -184535 248331 -138932 -96247 -227628
18929b27628C10141f2965j39553E0156b5040j67280b47r1588I9320a54253l0303
18918a84556L1912b3384j7895p284n2586j0159F4404b10522i1104D52587A89761
18906C28148A40805b41916a10290j10194A35738f0709A7435c88628b9854k11278
18896b41132J09468d9334C321f2509H3482a39441d6645k43387F4158g6267l02456
18885c78723a27373k99930E4436a71142R900P0034A8197K4616b32587b2342I3352
18873A92439b48314B5829f9112k23567A23258a77680k7592A18362c94310a45161
18862d2559H102O310b64513A30562K989e5940A5485J97357l458K5505A1044K67556
18850B78600I7252d8386l8711c4555A38397M9941a19361l8663G5092B6423L3062
$$ plain form
18929 -227628 310141 -62965 -202518 50156 -25040 -192320 -247 -91835 99320 -154253 -184556
18918 -184556 -152644 -23384 -41279 -48563 -101149 -111308 64404 -210522 -91104 452587 189761
18906 328148 140805 -241916 -110290 -220484 135738 -60709 17435 -388628 -29854 -241132
18896 -241132 -131664 -49334 3321 -62509 83482 -139441 -46645 -290032 64158 -76267 -378723
18885 -378723 -127373 -427303 54436 -171142 -161242 -91208 18197 42813 -232587 -22342 93352
18873 192439 -248314 25829 -69112 -292679 123258 -177680 -205272 118362 -394310 -145161
18862 -42559 8102 14412 -264513 130562 133551 -55940 15485 212842 209384 234889 11044 278600
18850 278600 97252 -48386 -87097 -34555 138397 188338 -119361 -158024 75092 26423 59485
18839E9485J75087n9759n1569D2056J81760f3215r3755f0023l41688a5611B35557
18827c04303J34420j84014K3969a3474l3946A98131B0639d9384j8349C4837a76528
18815a66403b0671A57950P7760o2186b0931j63649h0287O883H9272a98597A36013
18803c20401a00119L3543a3131l8292q3396l4296d7856I6989D960a71226O3833
18792a07393L1695b2339A028J63488D445d12388C1181L1944c59220F2160a23293
18780B87562f5104r4371C04689a21812L5635a9430r7569B2849a32213j07903N9328
18769a80788n3003c3169A91003e21903A2044a12591I40a70165J682A12289K39864
18758C52153A70343c75145J48186B45865b44815A16830J38990b79068C6451b19226
$$ plain form
18839 59485 234572 174813 123244 42056 223816 -63215 -156970 -60023 -401711 -15611 235557
18827 -304303 -169883 -353897 -329928 -13474 -47420 198131 20639 -49384 -67733 34837 -176528
18815 -166403 -20671 157950 235710 173524 -20931 -184580 -80287 -73404 89272 -198597 136013
18803 -320401 -100119 -66576 -13131 -51423 -134819 -169115 -47856 96989 4960 -171226 -107393
18792 -107393 -75698 -22339 1028 164516 4445 -412388 31181 63125 -359220 62160 -123293
18780 287562 -65104 -159475 304689 -121812 -86177 -19430 -116999 22849 -132213 -240116 -180788
18769 -180788 -233791 -33169 191003 -521903 12044 -112591 940 -170165 -168483 112289 352153
18758 352153 170343 -375145 -226959 245865 -244815 116830 255820 -279068 36451 -219226
18747a53446J6815A23204a29731m0768a7906l0978q0579m8861A10474a27226d2330
18735B0626a54550J5062I0488N8502a27071J9644j07548L9078B4765c37422A31024
18723E8847a9441j87697K0796h4281G291c715D2954i1531F9727k3464N0749k5771
18711G1241a72048A60551j6672L1502a2160q0271K8415G0453k7412L0085K40520
18700C13646I8866C1467c15355N0135A28091C9691c26094a08605Q714r5365G1889
18688a5836H9732c03926C27361c52597J67528g8912A6098e2971F0500k1411A7304
18676F9680b44565j46461a35382j32044B54290I2735a58038J0821F631J38582
18666A45213N7213c8362j45183G6021b5515r4573a860j88759a9812j41968B7119
$$ plain form
18747 -153446 -136631 123204 -129731 -170499 -17906 -48884 -129463 -178324 110474 -127226 -42330
18735 20626 -154550 -139488 90488 148990 -127071 -107427 -214975 -175897 24765 -337422 131024
18723 58847 -19441 -207138 -186342 -84281 7291 -3715 42954 -91531 69727 46263 97012 71241
18711 71241 -172048 160551 143879 175381 -12160 -92431 -64016 70453 43041 73126 313646
18700 313646 98866 31467 -315355 -265220 128091 39691 -326094 -108605 -99891 -195256 71889
18688 -15836 89732 -303926 327361 -352597 -185069 -78912 16098 -52971 60500 39089 17304
18676 69680 -244565 -391026 -135382 -267426 254290 92735 -158038 -147217 6631 145213
18666 145213 202426 -38362 -183545 76021 -25515 -120088 -1860 -190619 -19812 -161780 27119
18654b98653h4678K7051k6725m669j51446J15562M3545j0160I8319m1186K2141
18643G9274b61860I3404a46646j08549p2569a45753j82477J15277g9442I1273
18632e3197B0082c12524J21543f6796j99150h7388k18199E7695n578R3938g4206
18620H0462l1345a25202a4485d12q5507J5341r7757B9655a70546B69733D2494
18608a44549O1175a4714B20336a21733A5043b15949M8842C9482c02802f179n56809
18597e62988a59953b1787H3707d1931k01476b7656J166A1643a15390G7865O1763
18586A39628E0218b16498r4255d4011A71804c02189e94p5681A91249A0220c3893
18574d30988a66942A9083h3996n0110P721j3769B14858m7306F4868K86981b72365
$$ plain form
18654 -298653 -84678 -57627 -84352 -89021 -240467 -124905 -81360 -91520 98319 57133 79274
18643 79274 -261860 93404 -146646 -255195 -327764 -145753 -328230 -212953 -79442 91273
18632 -53197 20082 -312524 -190981 -66796 -265946 -87388 -305587 57695 52117 146055 -74206
18620 80462 49117 -125202 -14485 -412 -85919 -70578 -168335 29655 -170546 269733 42494
18608 -144549 -83374 -14714 220336 -121733 15043 -215949 -167107 39482 -302802 -6179 -562988
18597 -562988 -159953 -21787 83707 -41931 -243407 -27656 -26490 11643 -115390 77865 139628
18586 139628 50218 -216498 -310753 -44011 171804 -302189 -594 -76275 191249 10220 -33893
18574 -430988 -166942 19083 -83996 -134106 -126385 -140154 214858 167552 64868 351849 -272365
18562b79472a23911e4951l23182E5251c27705e6637d272m05996A1941a15128c5963
18550A37878F7832b05772o0287j27644j03347K28801C6028L25783A2610a42041
18539d0898C8342c39268b8721A06300j7349O0103B9056c4926A57098E5301a37
18527B00435k4563J7911n9657a23820m838c6039E6265A3796P9556I009L8129c36979
18514c21680B02661q1285c5942B54857d1059A07400n2956J68276k3243a07033
18503F5845a68696A65194g0458r034B2470b21668B59197I1826i5854j12612C0134
18491A98796j0835a78659m0254g4131E8235b27797F6661K2215a673B0399a80398
18479D6850J368L05813h8248b5409j60141O1347q8454j1077c4275k4361j45950
$$ plain form
18562 -279472 -123911 -54951 -378133 55251 -327705 -56637 -4272 -410268 11941 -115128 -35963
18550 137878 67832 -205772 -266059 -393703 -497050 -268249 36028 361811 12610 -142041
18539 -40898 38342 -339268 -28721 106300 88951 149054 29056 -34926 157098 55301 -137
18527 200435 175872 193783 134126 -123820 -128658 -36039 56265 13796 93352 9009 47138 -336979
18514 -321680 202661 121376 -35942 254857 -41059 107400 54444 222720 199477 -107033
18503 65845 -168696 165194 -70458 -79492 22470 -221668 259197 91826 -95854 -208466 30134
18491 198796 187961 -178659 -218913 -74131 58235 -227797 66661 88876 -1673 20399 -180398
18479 46850 48218 354031 -88248 -25409 -185550 -124203 -212657 -223734 -34275 -58636 -204586
18468b04586F1811j2522a9779l7544I1554J82733a46621A06022k7652b45452B9017
18456a01355o962F3625J50324i0890B01372E0664b34772O6985h1698r3833N4625
18445a20906d5582n41694B41875a93731a9204G2644f7756k54115B06609a30415
18434f8673C7343a11116j68546C8859K08167g7150b1673C9426c18543a26419A21274
18422e5331k40222C10032H5970d0758G2665q295G513g680D37415k15862q0752
18411A40801d55536b8777D2796M9522f3842B66878a00565c6800A13510a7862j81028
18400a98890e7253j10312B7656e9603A82264d3011a4149p8400E164a82301c5711
18388a12008B06763j9122A5192a75028B14505K8182i3836A84719q7476c08945
$$ plain form
18468 -204586 61811 49289 -19779 -57323 91554 274287 -146621 106022 78370 -245452 29017
18456 -101355 -108317 63625 213949 -90890 201372 50664 -234772 -167787 -81698 -175531 -120906
18445 -120906 -45582 -587276 241875 -193731 -19204 72644 -67756 -321871 206609 -130415
18434 -68673 37343 -111116 -279662 38859 247026 -77150 -21673 39426 -318543 -126419 121274
18422 -55331 -295553 310032 85970 -40758 72665 64370 7513 -7680 437415 221553 140801
18411 140801 -455536 -28777 42796 92318 -63842 266878 -100565 -36800 113510 -17862 -198890
18400 -198890 -57253 -167565 27656 -59603 182264 -43011 -14149 -92549 5164 -182301 -35711
18388 -112008 206763 187641 15192 -175028 214505 242687 -93836 184719 97243 -308945
18377a54075A28214h8120c9612l2808C8474P5814l9040d8803l4991B22988c18980
18365A44150O7560m6365a12534E8022J24687c22319g4021A00121c36263a7913
18354a1854H7027j0265b38217J06565a8350j57428l8573O029A7295f462C4957
18342B79460c05012a24019E0039K22528G2481b91048A31466M7105J80762c46647
18331i6858n2633A5183g1295k4503A15950i1936A58983f4830j71227b901C98852
18319A40630B7718J29749d09625a43136C8759h1926B84459h7950j31113c7118
18308A45932a42573R668j39080J3801I7315b3920m7758k47946J17706f9717A11565
18296A37173k5628g3101k75140a9938B47834h7671I6692g9663j03862A94011q1804
$$ plain form
18377 -154075 128214 -88120 -39612 -72420 38474 114288 75248 -48803 -83794 222988 -318980
18365 144150 211710 165345 -112534 58022 182709 -322319 -74021 100121 -336263 -17913
18354 -11854 87027 76762 -238217 -131652 -18350 -175778 -214351 -208322 17295 -6462 34957
18342 279460 -305012 -124019 50039 272567 72481 -291048 131466 178571 359333 -346647
18331 -96858 -149491 15183 -71295 -95798 115950 -91936 158983 -64830 -236057 -2901 398852
18319 140630 27718 157467 -409625 -143136 38759 -81926 284459 -87950 -219063 -37118
18308 145932 -142573 -132905 -271985 -258184 97315 -23920 -71678 -319624 -201918 -69717 111565
18296 137173 111545 -73101 -348241 -19938 247834 -87671 96692 -79663 -183525 194011 112207
18285A12207n0773J82442i3701j59530a05896A09511h2553C49a77142H7225a7546
18273C49238b77406c3483j1724C8107a0488k66188A63801b25429K5047G4332Q394
18262H2726d4980D4103Q235g0893B0530H904K02550j6913B8633J57287b82246
18250i2390c9441I5647J91824h2055h290B9081L26977L9292e1553o8030j2049
18239a31632k02530C25878j59857i1905L5701K7491n0709L9204q5394A65128E0866
18227c09258B80787d93495a2500A10545L90436A78977E6935M5041f2807J5514
18217d7293H0084a2221A93153B8378K86397b42353A87549b81623I5013M3495b40329
18205a8120A66436B1267a01477b5221J0546k37316e2638j33161a7056j35749d2134
$$ plain form
18285 112207 61434 243876 -93701 -253231 -105896 109511 -82553 349 -177142 87225 -17546
18273 349238 -277406 -33483 -45207 38107 -10488 -276676 163801 -225429 -200382 74332 82726
18262 82726 -44980 44103 52338 -70893 20530 8904 211454 194541 28633 185920 -282246
18250 -92390 -39441 95647 287471 -82055 -8290 29081 356058 395350 -51553 -119583 -131632
18239 -131632 -334162 325878 166021 -91905 -56204 -28713 -79422 -40218 -125612 165128 50866
18227 -309258 280787 -493495 -12500 110545 500981 178977 56935 101976 -62807 -47293
18217 -47293 80084 -12221 193153 28378 314775 -242353 187549 -281623 95013 138508 -240329
18205 -18120 166436 21267 -101477 -25221 -14675 -251991 -52638 -185799 -17056 -152805 -42134
18193b70850F7314L67380f0637J8699r6701j12789B48198a50779A20733B5572
18182a1334j78194Q0150o2590D687a3807j43223D5327K56121j19780F8512a43499
18170b54078b5440k55941k10063a99856n1785r5612a02676a4537A28710B3455
18159F078h5038p0038B0077b0395H2189c06287j45785B59516A25592M2250D3929
18147A81702b346p4861I326K34173O7374h8981B01400j4608k0316c46094e567
18135I7577c18994h5323g218C91315B6788a72596f9231D8174d39815c6216l791
18124d0007j00734d5803j90365C0015b23382q761E8444a79772Q0035K2473J955
18113g5309I2425K45510b29C5321f0962A77408F5145L8413Q7100J98254F0863
$$ plain form
18193 -270850 67314 434694 -60637 -41938 -138639 -251428 248198 -150779 120733 25572
18182 -11334 -189528 -109378 -171968 4687 -13807 -157030 45327 301448 181668 68512 -143499
18170 -254078 -25440 -281381 -491444 -199856 -251641 -347253 -102676 -14537 128710 23455
18159 6078 -85038 -155076 20077 -20395 82189 -306287 -452072 259516 125592 167842 43929
18147 181702 -2346 -77207 9326 243499 310873 -88981 201400 186792 166476 -346094 -5567
18135 97577 -318994 -85323 -7218 391315 26788 -172596 -69231 48174 -439815 -36216 -40007
18124 -40007 -140741 -45803 -236168 30015 -223382 -232143 58444 -179772 -99737 -77264 -75309
18113 -75309 92425 337935 -229 35321 -60962 177408 65145 103558 190658 388912 60863
18101c0916I4869a2107A82817g8124n0430H2612R2844a52178D0580J9653Q3723
18090A43956c76966C9417K8972P4441B2163J36049M409P0383c5628p1913A17929
18078A35624b8591j75798f4380j07267a3594o1284F8732a56989b6196r9400G8465
18066A17397m3556K84766p2599a33380l9327P8688k7214k38654e1603b4566k8949
18055e3515m3172E3567J47701J47266j53458b32036C3347p67K8260B7949K35795
18044B63744p0737B6882O7342P5470m4088b3659B5077J66477c14121C65864e2806
18032C5818A0399d3395C2538F200b54323o4714b6313p0521A2068J71349i8706
18020i9744n4005B79550L347a0481j9925E0197k4257c41757a13774A25571L2056
$$ plain form
18101 -30916 94869 -12107 182817 -78124 -128554 82612 175456 -152178 40580 60233 143956
18090 143956 -376966 39417 68389 142830 22163 158212 162621 233004 -35628 -107541 117929
18078 135624 -28591 -204389 -64380 -171647 -13594 -74878 68732 -156989 -26196 -125596 78465
18066 117397 73841 358607 286008 -133380 -172707 -94019 -121233 -359887 -51603 -24566 -53515
18055 -53515 -96687 53567 201268 348534 195076 -232036 33347 32580 60840 27949 263744
18044 263744 193007 26882 94224 169694 125606 -23659 25077 191554 -314121 365864 -52806
18032 35818 10399 -43395 32538 6200 -254323 -319037 -26313 -96834 12068 183417 -98706
18020 -99744 -153749 279550 282897 -10481 -30406 50197 25940 -341757 -113774 125571 157627
18009A57627M1076b6255A57947C3036Q110b56075N6608A90457A6703K58899g2859
17997G5247M1295m6698a95580F0801G43b98743E6546a13151o3458h1029k69659
17986c50688A44159a86510A8976J15711O5946a04611A77402d29680A38158a01711
17975A93366a07103A65793m7421K70567h1252c7657k44398A90463C7617i3142
17964E14574D5558b03688B01051g4182r3601J6496A00935M2182a24286M3497B33727
17952A42602D1665Q8072a74519P8766B01897A510K02967n2738c74455A31943c13508
17940a25405F5008J03615J4629c1393o7541A33582c9780k6628b0932A5252Q8792
17929A04044f7798H1448a27288G8180j4765b28195m5596a0303F2026J69608g2581
$$ plain form
18009 157627 198703 -26255 157947 33036 41146 -256075 -199467 190457 16703 275602 -72859
17997 75247 116542 69844 -195580 60801 743 -298743 56546 -113151 -176609 -81029 -350688
17986 -350688 144159 -186510 18976 134687 200633 -104611 177402 -429680 138158 -101711
17975 193366 -107103 165793 118372 388939 -81252 -37657 -282055 190463 37617 -93142
17964 514574 45558 -203688 201051 -74182 -167783 -151287 100935 143117 -124286 -80789 233727
17952 142602 41665 129737 -174519 -95753 201897 1510 204477 151739 -374455 131943 -313508
17940 -125405 65008 168623 183252 -31393 -98934 133582 -39780 -66408 -20932 15252 104044
17929 104044 -67798 81448 -127288 78180 63415 -228195 -273791 -10303 62026 231634 -72581
17917b0936j22864h179k20909P0940d8856A26853a5037A00115c8938o5223j21776
17906b25937D27413o1051D6570f6941k0197Q87B30142e4924A66933c07704E0566
17894F8468Q1683E4950N2293a45538B06292B9172K41259d12147H0061J27164F2272
17882d7873o6094o7280h9351A61363n2386a29411G0113P2639h0014I9290f3206
17870A08188l6207O1666b00032n9986d4317j8849B10948a05659B7532J40843a34243
17858A80624k359F9517a70614B01033D2135J00328N0133O8403e6560r3401j83754
17847c33715A04873A306J41910A6251J08178J17544E2777l72L2220J55840A7127
17835A98553m7932e0419g86A51547a06173m7622a3156A37669E8538c99402B823
$$ plain form
17917 -20936 -143800 -8179 -229088 -158148 -48856 126853 -15037 100115 -38938 -104161 -225937
17906 -225937 427413 366362 46570 -66941 -87138 -86251 230142 -54924 166933 -307704 50566
17894 68468 150151 54950 107243 -145538 206292 29172 270431 -412147 80061 207225 62272
17882 -47873 -113967 -181247 -89351 161363 108977 -129411 70113 142752 -80014 99290 -63206
17870 108188 71981 133647 -200032 -260018 -44317 -63166 210948 -105659 27532 168375 -134243
17858 180624 178265 69517 -170614 201033 42135 142463 192596 260999 -56560 -149961 -333715
17847 -333715 104873 1306 143216 16251 124429 241973 52777 52405 84625 240465 17127
17835 198553 150621 -50419 -786 151547 -106173 -153795 -13156 137669 58538 -399402 2823
17823I6273b5886D8837a05302d253A41587F3703h8547r0704A8011N119N7467i7724
17810C54204a15693A68774n8550b78527J00137Q1507C23335B6635A1319J20544
17800A31863a85806c6872B62441f828A3144g0041A13893L39538E5964J5795g6406
17788B89374i0152O374A7555O0106J41705q8179B3650J9212Q6465b0232C1774
17776A44293J84090g3915A3395L3668N135O5131K00169a5899B08734a05876E3935
17764a51868L7621e1364A38666D462a55271A34068m0102b1129B39072f0284j75894
17753b36178B82763B5308h7646p4493B6826K19792n034r6573b11930A79319o8024
17742A11295n0790b50668i8198A98939n5567l8877a62983b3605E2238B4013L0966
$$ plain form
17823 96273 -25886 48837 -105302 -4253 141587 63703 -88547 -179251 18011 23130 80597 -97724
17810 354204 -115693 168774 110224 -278527 -178390 -96883 323335 26635 11319 131863
17800 131863 -185806 -36872 262441 -6828 13144 -70041 113893 453431 55964 71759 -76406
17788 289374 -90152 -83778 17555 77661 219366 131187 23650 42862 129327 -20232 31774
17776 144293 328383 -73915 13395 47063 52198 117329 317498 -15899 208734 -105876 53935
17764 -151868 -114247 -51364 138666 4462 -155271 134068 93966 -21129 239072 -60284 -236178
17753 -236178 282763 25308 -87646 -162139 26826 246618 241584 145011 -211930 179319 111295
17742 111295 60505 -250668 -98198 198939 143372 104495 -162983 -23605 52238 24013 54979
17731E4979M0316h0689o096A06619j3393b29567B51219e9412j21189G6941a68825
17719C6652a05689B36323D1714J8774K20069m3123l2234D4116h0018A57848a47872
17707g2489b386C77535R250b8538j6168B10944C6105a29753A28916a59313I0397
17695B72557a94808C86581B0617J1531J13908F7165d711j20454J3163C52025h6960
17683B35256q0755O1077n1488b0758l2822K6358C07859R6203A19844e756C08680
17671A84787p7253b16272B52756j26131P1047k4817E7454d1561B30644q7426e3423
17659a4430B57158R7689j66414J97172H2582e6861F4619i0308B51684n734J58780
17648D04730C6533P8078K359a08939C4409R9321E1545a83812F8597b77638B66541
$$ plain form
17731 54979 95295 -80689 -86785 106619 93226 -229567 251219 -59412 -180601 76941 -168825
17719 36652 -105689 236323 41714 60488 280557 237434 205200 44116 -80018 157848 -147872
17707 -72489 -2386 377535 386785 -28538 -44706 210944 36105 -129753 128916 -159313 90397
17695 272557 -194808 386581 20617 32148 146056 67165 -4711 -125165 -112002 352025 -86960
17683 235256 154501 215578 164090 -20758 -53580 -27222 307859 404062 119844 -5756 308680
17671 184787 107534 -216272 252756 126625 197672 172855 57454 -41561 230644 143218 -53423
17659 -14430 257158 354847 188433 385605 82582 -56861 64619 -90308 251684 245950 404730
17648 404730 36533 114611 116970 -108939 34409 133730 51545 -183812 68597 -277638 266541
17636f9846C63205b13589C66411A07716p393K19758d6303B19912n3295f0287A15106
17624B23663b10381K5617B50668A20353L3527n3655B1758J84047H6321k8170K54283
17613C12434L6484j59768e9190D0498K19666N8643E4606k6526R7214a3710A1960
17601b07243D6338L2175g9675B84506E0859O8192C6210i3660H6340a95241C12625
17589A8735M7950J81937A06300H470K48849G9680B9360j2832K15811m5374K72203
17578D59168C7223Q463R3299n8866a62240A00550P7240q6804K364R5317F2878
17566i3599A2474J86111r3076C9575O7148J60426j23417b5334C87927A7421P5448
17555I2869m3379R5854O39K6211H343b14695A50235J09954a24680E80444b35094
$$ plain form
17636 -69846 363205 -213589 366411 107716 100323 320081 -46303 219912 166617 -60287 115106
17624 223663 -210381 -184764 250668 120353 153880 100225 21758 205805 86321 58151 312434
17613 312434 348918 189150 -59190 40498 260164 318807 54606 28080 125294 -13710 11960
17601 -207243 46338 78513 -79675 284506 50859 119051 36210 -93660 86340 -195241 312625
17589 18735 66685 248622 106300 8470 257319 79680 29360 16528 232339 186965 459168
17578 459168 37223 45686 138985 80119 -162240 100550 177790 90986 93350 188667 62878
17566 -93599 12474 198585 105509 39575 106723 267149 143732 -25334 387927 17421 92869
17555 92869 49490 145344 145983 172194 8343 -214695 150235 260189 -124680 580444 -235094
17543H0513J07012a48854a9993D33766b24377A41746R3545l9287k7591K88054
17533D56467F4211a27133G2590M89207a79141C26976K1454C125K71935j22308
17523A52752J52172q5130P3379B6238M07975p1162J45584B52171L10171j75874
17513C86468A47368J60311G6025J9618L2668L06870J0979n4222K69726j60004
17503E01660n0815G8751K36108L7741j51959B9290K69478L7359L0609j00319F5619
17491H5359d6951D52488A53249A3287L48449r0379j17041B9770c7734F1927J50803
17480B12730m1689N9974J69888p2107J07136A96384R4339P2707a46115D19640
17469C4926J13622b1143C13048L2068b59275B3588L46785G3955J05144B7015f8396
$$ plain form
17543 80513 187525 -148854 -19993 433766 -224377 141746 235291 196004 168413 456467
17533 456467 64211 -127133 72590 561797 -179141 326976 348430 3125 275060 152752
17523 152752 304924 219794 293173 26238 434213 363051 508635 252171 562342 386468
17513 386468 147368 307679 76025 95643 128311 435181 446160 391938 661664 501660
17503 501660 450845 78751 314859 352600 200641 29290 298768 336127 366736 266417 65619
17491 85359 -46951 452488 153249 13287 361736 271357 154316 29770 -37734 61927 212730
17480 212730 171041 231015 400903 328796 435932 196384 290723 363430 -146115 419640
17469 34926 148548 -21143 313048 345116 -259275 23588 370373 73955 179099 27015 -68396
17457c452A31467Q3955B6732L30135J12415h4399B06625K57517p9378A58277Q4039
17446B42316J01868A02340A8092K20565J80604d7027B69660K403P409p0608K0292
17435B29156M3917j17399a9405E82347D0832O0258R704J4016C3484b8483B39790
17423C45168M1422j8119b585I6064n729J60576K70738B57210J54167G2011K17924
17412B89935J76280e7918C71900K319J15305B13675F1635K14722E2331J16849
17402A69180J86321h6296A54191J49467c4811A66150K4857k8530K76813k9750
17392D09540A10438N9886E0967a16768A67990K80336F5174J58637J56107A75296
17381B28471J591A11024a0083B52573m7410a677D66139A03249L24957j12527L01311
$$ plain form
17457 -3452 131467 215422 26732 356867 469282 -84399 206625 464142 384764 158277 242316
17446 242316 344184 102340 18092 238657 419261 -47027 269660 272063 279472 208864 229156
17435 229156 273073 155674 -19405 582347 40832 101090 110794 124810 33484 -28483 239790
17423 345168 386590 368471 -2585 96064 90335 250911 521649 257210 411377 72011 289935
17412 289935 466215 -57918 371900 374219 489524 213675 61635 276357 52331 169180
17402 169180 355501 -86296 154191 303658 -34811 166150 191007 162477 439290 409540
17392 409540 110438 170324 50967 -116768 167990 448326 65174 223811 379918 175296
17381 228471 230062 111024 -10083 252573 205163 -1677 466139 103249 428206 315679 616990
17370F16990B66b9628H3257K17043O6651Q4651c8151k0851B46301J50959j85607
17359B11653b24545C93352j40277L7042F0176b9525C04649j30028o2530J93369
17349C05460A19947a25141B2056K77860F8968M17394A00986M95452B76647l328
17339B73319k4542b8163k3602B38067K2549H3189L18061n6168o1253k8669A19116
17327B27488j0143D3899N2146J5489J85860O1276j32797l6077l0517J03338n0945
17316B11672I9793a66002C20019J79961j01818j90651J39777m0747n5997p7691
17306A72853K19865r8347A21619j1673K34277d56B80123k5524M3633O1054I4423
17294A1120O2022a14786E04591B22272L0915l6602r6991j8977K10941i2790C1177
$$ plain form
17370 616990 266 -29628 83257 300300 366951 451602 -38151 -59002 246301 397260 211653
17359 211653 -224545 393352 253075 290117 60176 -29525 304649 174621 112091 305460
17349 305460 119947 -125141 22056 299916 68968 486362 100986 596438 276647 273319
17339 273319 248777 -28163 -51765 238067 260616 83189 401250 345082 283829 255160 119116
17327 227488 217345 43899 96045 111534 297394 358670 225873 189796 159279 262617 211672
17316 211672 99793 -166002 320019 499980 398162 207511 347288 306541 250544 172853
17306 172853 392718 294371 121619 109946 344223 -456 280123 254599 298232 359286 94423
17294 11120 73142 -114786 504591 222272 253187 216585 119594 100617 311558 -92790 31177
17282C87511A48294J97807L8377j90827K42065j04523K1152j18462K70558A6776
17271H4346L17847J46270j82297o3628f7499c0711B39032o18a98585B05491K8323
17260B33814J48797G3634K6000K04667c1533o8122A31058J15481J69851j50345
17250B66045i49C76002p5763K6732q9625r7777J15731J1833P9128j11376J20377
17239C55262o2875L72388l26633o1181H5584J84862l1257J44038Q7223k04401
17229B66049p0028O6113K97237j80258A60893R3840a04063B20841J37800j74452
17219A84189J47569H8405L77104A49481J35239k3796Q5230j8586K4131A51189
17208A28426J74293j11662A0090K79359J41060j66366N4741j270r3723L6434P6299
$$ plain form
17282 387511 148294 346101 384478 193651 435716 331193 352345 233883 504441 16776
17271 84346 402193 548463 366166 302538 -67499 -30711 239032 238414 -198585 205491 233814
17260 233814 382611 73634 99634 304301 -31533 -99655 131058 246539 416390 266045
17250 266045 -949 376002 300239 326971 237346 139569 255300 267133 346261 234885 355262
17239 355262 292387 664775 338142 276961 85584 270446 239189 383227 470450 266049
17229 266049 196021 262134 559371 379113 160893 254733 -104063 220841 358641 184189
17219 184189 331758 88405 465509 149481 284720 260924 346154 327568 351699 151189
17208 128426 302719 191057 10090 289449 430509 264143 318884 317614 223891 260325 336624
17197C36624P9944J04062j83512j03019J06189A25109R5613L2051K55355j32740
17187C75388j45774j06026J97165J64538k04702K10705l468k28150K09288j23062
17177C45902K98256j58799R72j05173J06389j66808A25814K06862j34315J54389
17167C52750J81266j77584H7105K29164A04733K90508j02396j39034K1686L09021
17157D84518j70038J72639O3450e4736B42696K78068J40936B00541J06555K19048
17147E26144j10947j63318P9412Q3088M9359k4517K63924B05119K06192L39417
17137G50728l65679r903M8744K63872j23162A95084M88743l30569J51245O4624
17127E69127k51938K8388Q427q4045J04853j17206N73105k02404P2388j57139
$$ plain form
17197 336624 416568 520630 337118 234099 340288 125109 220722 252773 508128 375388
17187 375388 229614 123588 320753 485291 280589 491294 487826 259676 468964 345902
17177 345902 644158 485359 486331 381158 487547 320739 125814 332676 198361 352750
17167 352750 534016 356432 87105 316269 104733 395241 292845 153811 175497 484518
17157 484518 314480 487119 550569 -54736 242696 520764 661700 200541 307096 526144
17147 526144 415197 251879 331291 414379 463738 439221 703145 205119 411311 750728
17137 750728 385049 375146 423890 687762 564600 195084 683827 353258 504503 569127
17127 569127 317189 345577 354004 269959 374812 257606 830711 628307 700695 543556
17117E43556o4294K13012K04695l60406H394L37283J04785J78632j69495r5986
17107C63613J98931J10352o8391k28832L46856k07603O4220p2832J77180k4903
17097F58591p743j37034Q5032l2774J09099m0679j02514J28478P6766B98006J79912
17086D77918K55234C12300K26475K25077j99612B81885N62106l08729R7264N9138
17076F91664m8178R0809j79919l7719J51756j08535J424j10306L99476J03424
17066I53896l50572J45675C28250L67630k10309K87374j70470n1122J57813k09297
17056D99869K04046r0889q3830j6841L6719R6934Q6343R0565C76369O12524j08939
17045H79954j35768l726o8395k45291J61823K95700l28209Q3343j07605K41380
$$ plain form
17117 543556 479262 692274 896969 536563 8394 345677 450462 629094 459599 363613
17107 363613 562544 672896 604505 375673 722529 514926 579146 506314 683494 658591
17097 658591 650848 513814 598846 566072 675171 634492 531978 660456 737222 298006 477918
17086 477918 733152 312300 538775 763852 564240 281885 843991 535262 632526 691664
17076 691664 643486 734295 554376 516657 668413 559878 561302 450996 850472 953896
17066 953896 603324 748999 328250 695880 485571 772945 602475 551353 709166 499869
17056 499869 703915 613026 529196 512355 549074 646008 732351 822916 376369 988893 879954
17045 879954 744186 740460 672065 426774 588597 884297 556088 639431 531826 773206
17035G73206Q0194l74264M40896k78069Q6953P2086L3868K72129k95294L19173
17025A130878k55338l04609J79454k25069R1219j59748K53835K79520k79265j30075
17015E80802L69266j31055K49181l39835M4503K86489l05614M88581n00255M06283
17005A148346j81248J24898L307k56949o6329J38354L1585L94390m99781P5515
16995I12088K17635n2369j57616q428J66032N88687o34022k19033P9312N30546
16985A422832F96658K40631K13966l703k92327K21848K0762M82750m12717k08214
16975I59654K17558l0290M68662n25634L06740j68432o6380K77220m62525K40510
16965A217083K66182J02576j55057n5816j96586K42296P4070k53095J89851L75016
$$ plain form
17035 773206 853400 479136 920032 641963 728916 801002 834870 1106999 811705 1130878
17025 1130878 875540 570931 750385 525316 616535 456787 710622 990142 710877 580802
17015 580802 950068 819013 1068194 728359 772862 1059351 753737 1242318 742063 1148346
17005 1148346 967098 1091996 1095303 838354 772025 910379 941964 1336354 836573 912088
16995 912088 1129723 1077354 919738 911310 1077342 1666029 1032007 812974 892286 1422832
16985 1422832 696658 937289 1151255 1147552 855225 1077073 1097835 1580585 1167868 959654
16975 959654 1177212 1146922 1615584 1089950 1396690 1228258 1161878 1439098 976573 1217083
16965 1217083 1483265 1585841 1430784 1374968 1178382 1420678 1494748 1241653 1431504 1806520
16955A806520k94899l2189K3305o9640R4628L44054l88802K20951j74237j14389
16945A415302j61433O58316o01377K32410j82903N50515j60038L3025k23973L29545
16935A889389j60582K58224l63599L55852j47095k81580M13599O77J42528k71981
16925A835432N9984M4841J97482k33329L89159j1073k80793K51924j25362L8060
16915B166325R2826r625J59747m5609J66061j90548l6149K80440m4195j03878
16905B435395j4561K30065j61761O1524L59702n72278J95154L58833j43166M51389
16895C200296m54311K6714K9162L69477l04423L28364k37643R6436L73661J57565
16885C585298n6436k72438K29099K25697J45151l48750J46125L31085M7371l38391
$$ plain form
16955 1806520 1511621 1479432 1502737 1433097 1527725 1871779 1482977 1703928 1529691 1415302
16945 1415302 1253869 1912185 1310808 1543218 1360315 1910830 1750792 1783817 1559844 1889389
16935 1889389 1728807 1987031 1623432 1979284 1832189 1550609 1964208 1964885 2107413 1835432
16925 1835432 1895416 1940257 2137739 1904410 2293569 2282496 2001703 2253627 2128265 2166325
16915 2166325 2259151 2249526 2409273 2363664 2529725 2339177 2303028 2583468 2539273 2435395
16905 2435395 2420834 2650899 2489138 2550662 2910364 2338086 2533240 2892073 2748907 3200296
16895 3200296 2745985 2772699 2801861 3171338 2866915 3195279 2957636 3054072 3427733 3585298
16885 3585298 3528862 3256424 3485523 3711220 3856371 3507621 3653746 3984831 4032202 3693811
16875C693811J98403M1933M71655m61376J29731M97323Q8450k28884o5708J01773
16865D467111R1406M04907K7768K5947m38226L93051k1086K84298o1145L95321
16855E569352l31168K69014N2473J63214K05642j70702j11109N52164R2999N2839
16845F344718M08982R5806k67359L65158K82585J30961J93151P693J61330O05214
16835H328239m08240L46607M58979K38931k02009L35362N6715L95879J01134M9217
16825I700814N89709k94932O44753K46950K69628J37814M33571p0200Q08114J80452
16815A2646673K78115K75264M81270K60382K22449N08821J18425M33935L24568
16806A5549902M29720P13636J79682R57579M41115K91573Q11737N38660L84716
$$ plain form
16875 3693811 3892214 3934147 4405802 3944426 4074157 4571480 4659930 4431046 4365338 4467111
16865 4467111 4558517 4963424 4991192 5017139 4578913 4971964 4950878 5235176 5174031 5569352
16855 5569352 5238184 5507198 5559671 5722885 5928527 5757825 5646716 6198880 6291879 6344718
16845 6344718 6753700 6849506 6582147 6947305 7229890 7360851 7554002 7561695 7723025 8328239
16835 8328239 7919999 8266606 8725585 8964516 8762507 9097869 9154584 9550463 9651597 9700814
16825 9700814 10290523 9995591 10640344 10887294 11156922 11294736 11728307 11658107 12466221 12646673
16815 12646673 12924788 13200052 13681322 13941704 14164153 14672974 14791399 15225334 15549902
16806 15549902 15979622 16693258 16872940 17830519 18271634 18563207 19374944 19913604 20298320
16797B0298320O56491O81543Q48117N45936Q59534L91250P65327Q21079R18743
16788B6786340Q43984J266146P50381J100795J069454J442078L17983J751229
16780C5328390J294202J265771J170362J483608J770827J265439J519127J482438
16772D6580164K023465J827647J699134J634584K449596J829411K156689K139469
16764F2340159K291274K476024K179729K551677K638377K697219K322418K779678
16756H2276555K686203K561636K595326K591899L065956K366727K633635K010235
16748A02788172K268798K501585J691162J743379J503850J343478R84778P01210
16740A15526412N13251K85489J11682j68722q40232n25556j109591j211612j597321
$$ plain form
16797 20298320 20954811 21636354 22484471 23030407 23889941 24281191 25046518 25867597 26786340
16788 26786340 27630324 28896470 29646851 30747646 31817100 33259178 33577161 35328390
16780 35328390 36622592 37888363 39058725 40542333 42313160 43578599 45097726 46580164
16772 46580164 48603629 50431276 52130410 53764994 56214590 58044001 60200690 62340159
16764 62340159 64631433 67107457 69287186 71838863 74477240 77174459 79496877 82276555
16756 82276555 84962758 87524394 90119720 92711619 95777575 98144302 100777937 102788172
16748 102788172 105056970 107558555 109249717 110993096 112496946 113840424 114825202 115526412
16740 115526412 116039663 116325152 116436834 116268112 115427880 114902324 113792733 112581121 110983800
16731A10983800j742249k079170k263160j995489k157646k418813k553066k493705
16723I3280502k488531k696685k421913k626954k582311k664311k390159k387282
16715G3022356k696729k046358k093121k604871j925677j687783k300247k271036
16707E5396534j507467j937121j422509j855173j804010j437256j259003j504796
16699D2669199j379101j310878j122675j206038j312446r64303j109203j050839
16691C3213716j144091p53332r10483q84861j016742p51796o53467r16394n48129
16682B5634421n94682j119083k64555p00860q79455l14215o84685n28462m76670
16673B0071754k04130q62189k35873p85174k81249n66222l64194K66769q51616
$$ plain form
16731 110983800 109241551 107162381 104899221 102903732 100746086 98327273 95774207 93280502
16723 93280502 90791971 88095286 85673373 83046419 80464108 77799797 75409638 73022356
16715 73022356 70325627 68279269 66186148 63581277 61655600 59967817 57667570 55396534
16707 55396534 53889067 51951946 50529437 48674264 46870254 45432998 44173995 42669199
16699 42669199 41290098 39979220 38856545 37650507 36338061 35373758 34264555 33213716
16691 33213716 32069625 31316293 30405810 29520949 28504207 27752411 27098944 26182550 25634421
16682 25634421 25039739 23920656 23656101 22955241 22075786 21761571 21076886 20548424 20071754
16673 20071754 19867624 19005435 18769562 17984388 17703139 17136917 16772723 17039492 16187876
16664A6187876m48773m85698k68230j74840k19930m45520l36265k59442k27443
16655A3321735p11151J32639m30843p1492n88273M5439m49332R3804j40640l91999
16645A0809887l74166k08900j51044k1172l03162k22473l43351R7459j86346K002
16635I098734l47356k69318m7372l41982j64049N2925M5009j97787l08391o1154
16625G459259p9718k85950q6322l73279O59413o19763N5507k51726l294l15507
16615F158620k95825L77815q6568k93859K16107k06527k15945Q9418L3264k83146
16605E493354J57757m45528k24828N77845l63640k10702N9061N0451l56500j22931
16595D614339K49631k15802L47805l94845m01344M13885k62767J24419k57757
$$ plain form
16664 16187876 15739103 15253405 14985175 14810335 14590405 14144885 13808620 13549178 13321735
16655 13321735 12610584 12743223 12312380 12240888 11652615 11698054 11248722 11342526 11201886 10809887
16645 10809887 10435721 10226821 10075777 10054605 9751443 9528970 9185619 9283078 9096732 9098734
16635 9098734 8751378 8482060 8434688 8092706 7928657 7981582 8026591 7828804 7520413 7459259
16625 7459259 7379541 7093591 7007269 6633990 7293403 6673640 6729147 6477421 6474127 6158620
16615 6158620 5862795 6240610 6154042 5860183 6076290 5869763 5653818 5743236 5776500 5493354
16605 5493354 5651111 5205583 4980755 5558600 5194960 4984258 5043319 5093770 4737270 4614339
16595 4614339 4863970 4648168 4995973 4601128 4199784 4613669 4350902 4475321 4217564
16586D217564j22969K11299l03184l0121J58723M09364k25125m15950j70115L16119
16576D045605q5857j3445k60782L38771n49419L0304m4524P2185J82902k87395
16566C428345Q2173K18206j57404J7501k94683P0957k54648J8845r3490L1127
16556C066929j19595J12913r2678N8470K15056m0052k00340k00893P8499K89J71124
16545C049722k92413J58951l55319L54830p1761m19219K78049Q6637K1430K1668
16535B832575j24056j33305j75558M41941o81355M88628k5496n5737R7594j89482
16525B475749k89921K42023l9770j59354J98388k23426L18687K45606n15239l417
16515B249326M0986R8918j29294o1478K50229l44638k51712M46353l2819k13643
$$ plain form
16586 4217564 4094595 4305894 4002710 3972589 4131312 4540676 4315551 3899601 3729486 4045605
16576 4045605 3959748 3946303 3685521 4024292 3474873 3505177 3460653 3532838 3715740 3428345
16566 3428345 3510518 3728724 3571320 3588821 3294138 3365095 3110447 3129292 3035802 3066929
16556 3066929 2947334 3060247 2967569 3026039 3241095 3201043 3000703 2799810 2878309 2878598 3049722
16545 3049722 2757309 2916260 2560941 2915771 2844010 2424791 2702840 2789477 2810907 2832575
16535 2832575 2708519 2575214 2399656 2841597 2160242 2648870 2623374 2567637 2665231 2475749
16525 2475749 2185828 2427851 2388081 2228727 2427115 2203689 2522376 2767982 2252743 2249326
16515 2249326 2290312 2389230 2259936 2198458 2448687 2104049 1852337 2298690 2265871 2052228
16505B052228P3160m1187N77251l41317j30641J18811l93048m6781L08228l9923
16495B136781k79973L47230R3494N2982k66905k3843N4523j18261J50508r897
16485B136639K0388j56095K91350l53756j46679L80622j78514P5507J05396l44027
16475A830831K02355K66351j56884k37684N1457j89381K72283M2105k02603O5667
16465A944497J0224l01804K56199Q298R4093r6557j62615R6529K30721k3512k30667
16454A825406O33o5646J51649n0651j88266M9823p5577M05703l66467J06206P4818
16443A867631l36204L16244J56962k45778m6505J8678J34270J43401k62783j24709
16433A621207M0034M24930l01535K6393n1082J01637k88747O2988n6071L88820
$$ plain form
16505 2052228 2125388 2084201 2661452 2320135 2189494 2308305 1915257 1868476 2176704 2136781
16495 2136781 1856808 2204038 2297532 2350514 2083609 2059766 2114289 1996028 2146536 2136639
16485 2136639 2157027 2000932 2292282 1938526 1791847 2172469 1993955 2069462 2174858 1830831
16475 1830831 2033186 2299537 2142653 1904969 1956426 1767045 2039328 2081433 1878830 1944497
16465 1944497 1954721 1652917 1909116 1917414 2011507 1914950 1752335 1848864 2079585 2056073 1825406
16454 1825406 1826039 1760393 1912042 1861391 1673125 1722948 1647371 2053074 1686607 1792813 1867631
16443 1867631 1531427 1847671 2004633 1758855 1712350 1731028 1865298 2008699 1745916 1621207
16433 1621207 1661241 2086171 1784636 1811029 1759947 1861584 1572837 1635825 1579754 1968574
16423A968574k1714j96838r4367K76529k14485K39102l38352Q5569l3725N10656
16413B180949l33759o1440L4577l45725M48321m35517J77056L5032r5486M56432
16403B060440m19076L80240r6775k87441L20558l2869p2561n02779N05571k81148
16393A574160j80800J66491J54105K21198o3387l29393o6519j54568M25649j66660
16383A580276l21605K75562J62424j48705n9818J87044J26431p5144P984k16744
16373A517705J14069j35693K62451L8377J1601n9648L82479k31692j25973j9825
16363A753851K74882l56725j98844M95288l13846j31120K45774l03483J3244j4270
16353A464751L44793k53035J68807o2530K39033l11043J17258j73130m4301m4506
$$ plain form
16423 1968574 1946860 1750022 1655655 1932184 1717699 1956801 1618449 1704018 1670293 2180949
16413 2180949 1847190 1785750 1820327 1474602 1922923 1487406 1664462 1699494 1604008 2060440
16403 2060440 1641364 2021604 1924829 1637388 1957946 1925077 1852516 1349737 1855308 1574160
16393 1574160 1393360 1559851 1713956 1935154 1871767 1542374 1475855 1321287 1746936 1580276
16383 1580276 1258671 1534233 1696657 1547952 1488134 1675178 1801609 1726465 1734449 1517705
16373 1517705 1631774 1496081 1758532 1796909 1808510 1748862 2131341 1899649 1773676 1753851
16363 1753851 2028733 1672008 1473164 1968452 1654606 1523486 1769260 1465777 1479021 1464751
16353 1464751 1809544 1556509 1725316 1662786 1901819 1590776 1708034 1534904 1490603 1446097
16343A446097L65145j61913l8032J67900j45799M7391j94445K85166j89536m3829
16333A538145L58776k54399K01810j37229j22535j92604K07559R3782j47343k1073
16323A524889J29594M51401m73045r1628r1428M9322J96386Q8460n1158P8481
16313A811274k22432R2417J33472l52211M9956O6384J3614l37209J94642K52079
16303A701986l83523K19439j19787L45022k83803q6802J82798J49187n42218L14972
16293A497271L71714k10569l8048J14844p4049k89546K58016O1073M12626n96719
16283A506613J26843j47618q433q9122J08643J41257n8570j18162J8350M8462
16273A528263L3458q0368N3951J22545J46458o1600j45465L9319l60288M1260
$$ plain form
16343 1446097 1811242 1649329 1611297 1779197 1633398 1680789 1486344 1771510 1581974 1538145
16333 1538145 1896921 1642522 1844332 1707103 1584568 1391964 1599523 1693305 1545962 1524889
16323 1524889 1654483 2105884 1632839 1541211 1449783 1499105 1695491 1783951 1732793 1811274
16313 1811274 1588842 1681259 1814731 1462520 1512476 1578860 1592474 1255265 1449907 1701986
16303 1701986 1318463 1537902 1418115 1763137 1479334 1392532 1575330 1724517 1182299 1497271
16293 1497271 1868985 1658416 1620368 1735212 1661163 1371617 1629633 1690706 2103332 1506613
16283 1506613 1633456 1485838 1477405 1388283 1496926 1638183 1579613 1461451 1479801 1528263
16273 1528263 1561721 1481353 1535304 1657849 1804307 1742707 1597242 1636561 1276273 1317533
16263A317533R9311O1347j82929J86090k30663K6459O1572j37607J88653m4881
16253A344885O1317j27626J0475j10071R4964m16k3953Q9611Q934J86113j61560
16242A372673k82672L78863k91892J55046m644J88851l20303j02681k21552J53499
16232A025188M1254L45639q2828K8610l30102K61647K83572l88552k3941K32156
16222A392643j82582J8810m3252J03705L5017l85551M44938l16993L78304j90510
16212A254529j38296l9314r3321J13657J3650R5236l28837O6734L77502r8624
16202A222916P1229l97567M03136k65850J20550j1137p7865k11702J81673m89070
16192E46313J40808L55621l41771N75562k93388j34138m2547k12253L67235j04113
$$ plain form
16263 1317533 1416844 1478191 1295262 1481352 1250689 1277148 1338720 1201113 1389766 1344885
16253 1344885 1406202 1278576 1289051 1178980 1273944 1273528 1249575 1339186 1348120 1534233 1372673
16242 1372673 1090001 1468864 1176972 1332018 1327374 1516225 1195922 1093241 871689 1025188
16232 1025188 1066442 1412081 1329253 1357863 1027761 1289408 1572980 1184428 1160487 1392643
16222 1392643 1210061 1228871 1185619 1289324 1324341 938790 1383728 1066735 1445039 1254529
16212 1254529 1116233 1076919 983598 1097255 1110905 1206141 877304 944038 1321540 1222916
16202 1222916 1294145 896578 1299714 1033864 1154414 1143277 1065412 853710 1035383 546313
16192 546313 687121 1042742 700971 1276533 983145 849007 806460 594207 961442 857329
16182H57329j6562N01465l29454k10629Q9239n4277R5789l2181R275l0482O289
16171H85801j05928j36570K68407J48758l64693J45444J6592l00217L39461k05422
16161F91633k570Q212R6371K25029l30873R6853L3077J9613k05870J98903l02548
16150E27830J95287j28296k33946J30198o3448N8339J9675o6116J84329J41434
16140G65286j56662j73421J70612k2205P4483j69811L95272l11351k14236L55062
16130G13029j07023J95229l52661L18223l62588L46773j27462k94506M04742j19841
16120F13915j8692k07414M01179l62621k8753J0457J04841o7889J40776N1436
16110F37235k39353J03634j64894M35833q3544k82472K3231B10725L86887j37623
$$ plain form
16182 857329 840767 1342232 1012778 802149 891388 837111 932900 900719 909994 879512 885801
16171 885801 779873 643303 911710 1060468 695775 841219 857811 557594 897055 691633
16161 691633 689063 697275 793646 1018675 687802 784655 817732 837345 631475 830378 527830
16150 527830 723117 594821 360875 491073 427625 485964 505639 439523 623852 765286
16140 765286 608624 435203 605815 583610 658093 488282 883554 572203 357967 713029
16130 713029 606006 801235 448574 766797 404209 750982 623520 329014 733756 613915
16120 613915 595223 387809 788988 426367 397614 408071 512912 445023 585799 637235
16110 637235 397882 501516 336622 772455 688911 406439 429670 210725 597612 459989
16100D59989A83114Q5848f0305B92732K64272j41503K36139A58813O2735d0990
16089D42876J49902j34912M1449j49043Q1802A85931K2069M14255a33090D53313
16078C30247k2451K94867e8929B75743J52059J06976J3311k43286J34809J79263
16068F18875k99433r5570J2176K00613a7150C95255j94263E8154M28893j93740
16058B93307j39051E5047L37509j68770L20978D1327J59733B5976g968A75197
16047B18192K35451A85487C128L67583h8056C5930Q6164J0397J93181j49463H857
16035b3835B25158a2828G341M0363K24293L0484J3164P851c1677A99345J85775
16024C85120A23107L649j0052K16680g8298A99630K6489l2534J1799F0224N2320
$$ plain form
16100 459989 183114 268962 -60305 292732 557004 415501 651640 158813 221548 -40990
16089 442876 592778 457866 499315 350272 432074 185931 208000 622255 -133090 453313
16078 330247 307796 602663 -58929 275743 427802 534778 548089 304803 439612 618875
16068 618875 319442 223872 236048 436661 -17150 395255 200992 58154 487047 293307
16058 293307 154256 55047 392556 223786 544764 41327 201060 25976 -7968 175197
16047 218192 453643 185487 3128 370711 -88056 35930 122094 132491 325672 176209 8857
16035 -23835 225158 -12828 7341 47704 271997 302481 315645 323496 -31677 199345 385120
16024 385120 123107 126756 116704 333384 -78298 199630 226119 193585 205384 60224 112544
16013A12544J21001J70144h0848A1464J10282a2073C2632r652K03339J67793K1396
16002D15508E7260i5454C19143a4074A81408H7148R1413M4563p7812E1466A5124
15990B74911p5852E4218L21186J10198J68425l6305j9119k07579j48301N2451
15980B95174r9051i9424A91188d4267C706K56099A14997j8301j2792a46570G6187
15968b47523B21039B5968M32298A13781a43953G0681A629b0365j06409A44782
15957H7200f9073k2344A35842b13788H4040J22925q8726H513P5177K10746A27333
15945g1209A25558B8675i3563A64176o8618J17206p1375j8789a80984G7459p816
15934F9643c6886m6957K4391j40233C48275e6330D4902c9599D1671J05968O5242
$$ plain form
16013 112544 233545 403689 -80848 11464 121746 -12073 32632 22980 226319 394112 415508
16002 415508 57260 -95454 319143 -14074 181408 87148 178561 223124 145312 51466 15124
15990 274911 199059 54218 375404 485602 654027 617722 598603 391024 242723 295174
15980 295174 196123 -99424 191188 -44267 3706 259805 114997 96696 83904 -146570 76187
15968 -247523 221039 25968 458266 113781 -143953 70681 1629 -20365 -126774 144782
15957 87200 -69073 -91417 135842 -213788 84040 206965 118239 8513 83690 294436 127333
15945 -71209 125558 28675 -93563 164176 95558 212764 141389 122600 -180984 77459 69643
15934 69643 -36886 -83843 -59452 -199685 348275 -56330 44902 -39599 41671 147639 212881
15923B12881b10070B18156r6081f3209H120J65881J99557a01489A4958R8225J02865
15912B16048G7777N4277o921a01032r8357e4131B76234c04732b6952j9332F148
15900c3740l31713A37376P2342j099K10947L415A12625a90003d0602j55612O7929
15889a28285D0428K8619a2902k8886B58387C7058a89799f1015k59052N5938J556
15878b62573h9608q4124Q5810A72723a67507B6709c03931O0948b5042o9372B04561
15866H4179g424A31461J81746c48673B62288a6537B89709c2374A33323M5777b19437
15854H7244j0292e386A7882k657K43804D8706i2863j47272F9771b18168B1601
15842i8973A17976g0396A70213b4533m5646H9902a20824B80828C5384L70733a52170
$$ plain form
15923 212881 -210070 218156 122075 -63209 8120 174001 373558 -101489 14958 113183 216048
15912 216048 77777 132054 125133 -101032 -199389 -54131 276234 -304732 -26952 -46284 6148
15900 -33740 -365453 137376 209718 208619 419566 422981 112625 -190003 -40602 -196214 -128285
15889 -128285 40428 69047 -12902 -41788 258387 37058 -189799 -61015 -320067 -264129 -262573
15878 -262573 -89608 -173732 -87922 172723 -167507 26709 -303931 -242983 -25042 -94414 204561
15866 84179 -7424 131461 313207 -348673 262288 -16537 289709 -32374 133323 179100 -219437
15854 87244 76952 -5386 17882 15225 259029 48706 -92863 -240135 69771 -218168 21601
15842 -98973 117976 -70396 170213 -24533 -70179 89902 -120824 280828 35384 406117 -152170
15830a67450A05575e2735j7768C80793j73268G512J48999e0220D843a38269o2430
15819b00699b4649B2787c6688k34188J24436a227l19782a33954A59193J6641d20651
15807f9311A71824a02860l4031A73568a1319C84157a17673c1983n4299A81299
15796B8004K34589E6661a44171m9875c6785Q16D0805L1635f4594j01228d4863
15784g7668B08540a1220k08378B11043g5850o8387m05937A30858E6003b64440
15773I3335b36507F885O0291J18907E2398H181c93216a88480P7688j84694D03495
15761A25860g4037C50344a3999m0122A35778K0663l4659J06838E5563M99231F4112
15749A44679l6105J08304f1732A8783M2006L77448a36590k5212E544c67420f0692
$$ plain form
15830 -167450 105575 -52735 -70503 380793 207525 7512 156511 -50220 4843 -138269 -200699
15819 -200699 -24649 22787 -36688 -270876 -146440 -1227 -321009 -133954 159193 175834 -420651
15807 -69311 171824 -102860 -136891 173568 -11319 384157 -117673 -31983 -86282 181299
15796 28004 262593 56661 -144171 -194046 -36785 -35969 40805 72440 -64594 -165822 -44863
15784 -77668 208540 -11220 -219598 211043 -75850 -144237 -550174 130858 56003 -264440
15773 93335 -236507 6885 67176 186083 52398 8181 -393216 -188480 -110792 -295486 403495
15761 125860 -74037 350344 -13999 -54121 135778 156441 121782 228620 55563 554794 64112
15749 144679 108574 216878 -61732 18783 60789 438237 -136590 -161802 5544 -367420 -60692
15737A89776a3206j66713N5306G3850b44906A42429b59915f6414j72461d3159
15726c4775A04259l3241a74244Q7018j93526B05640p4418f6325A89568b70858
15715a86502C6396P181N52085b39514B23515c4949B29142E6758c37470J45324
15705a92146A93750j8359a02392j16317B16480b23257c5956p8745H0178b5425
15694F8333a5298A53490e5115B0840h1410C32850F9558A2847f6493j59010h3045
15682A19254A8618a02938a495q6534m6075e7363L467B72185g8132F0513a89982
15670I6913k733a32666c3828j26947g0294G017e0621m0109j85719J32029C837
15658c46515a08223E3040e7316c584j58938A58577e5125A17964m0427L8506P4235
$$ plain form
15737 189776 -13206 -179919 -124613 73850 -244906 142429 -259915 -66414 -238875 -43159
15726 -34775 104259 71018 -174244 -87226 -280752 205640 131222 -66325 189568 -270858
15715 -186502 36396 43577 595662 -239514 223515 -34949 229142 56758 -337470 -192146
15705 -192146 193750 175391 -102392 -218709 216480 -223257 -35956 -114701 80178 -25425
15694 68333 -15298 153490 -55115 20840 -81410 332850 69558 12847 -66493 -225503 -83045
15682 119254 18618 -102938 -1495 -88029 -134104 -57363 -53896 272185 -78132 60513 -189982
15670 96913 94180 -132666 -33828 -160775 -70294 7017 -50621 -90730 -276449 -144420 3837
15658 -346515 -108223 53040 -57316 -3584 -162522 158577 -55125 117964 77537 116043 190278
15647A90278q8006j1851b38240D8415J49552G1307d02568a2460o2567B35438C4453
15635A71474b2820j12520j46761J16015Q0190c0920a2418A74509A4065c14311
15624a1713l3811a7557A79692c37283a32756A48995l6189a13348a7997F5631a84348
15612B23578I9082C0027d7584D4959F593b26029a01510B07930p9205N7573b9622
15600a03963J0296B94490a97200k7297f9731r6892g9710A46648J03210j09023
15590A40835M8455f9890k011K7959j08989J3390E4169A3186K43190j27683l7940
15579I0753a59458B19496L6416f5902B21257o1886Q213g5199k85813a52588k91040
15568d43628a27975e972I9414i0686A42439a40161B1567r564h3489C4716J06223
$$ plain form
15647 190278 102272 90421 -238240 48415 197967 71307 -402568 -12460 -75027 235438 34453
15635 171474 -22820 -135340 -282101 -166086 -85896 -30920 -12418 174509 14065 -314311
15624 -11713 -45524 -17557 179692 -337283 -132756 148995 112806 -113348 -17997 65631 -184348
15612 223578 99082 30027 -47584 44959 6593 -226029 -101510 207930 128725 186298 -29622
15600 -103963 -93667 294490 -197200 -224497 -69731 -166623 -79710 146648 249858 140835
15590 140835 189290 -69890 -71901 -43942 -152931 -139541 54169 13186 256376 128693 90753
15579 90753 -159458 219496 255912 -65902 221257 159371 167584 -75199 -361012 -152588 -443628
15568 -443628 -127975 -5972 99414 -90686 142439 -140161 21567 12003 -83489 34716 140939
15557A40939l7449J76433H0711h2264q3577d5530H7368a3930j71654D7957c78274
15545b85814e3359B02241q8700E40a87969j14434a5568G3681Q5150b95894e1052
15533d1543A94029a43210e0860j6615H6765a41735c4936E8470b87710a24401a17
15521D2366a05984j41657A8326a72574P6686A56788k0020B8967J0076a97569B68920
15509G7589a28204e4132H7728b5819B02518G2685B1209J06706b95354A15122e2014
15497b10337A28288K17780h5678j1486q967B30370G782a87564A51257a2897q128
15486b1025A98416n1836g6755A08971F32a16338A64959a83378C14142m8240j24979
15475A40923C685M21645A48808F9681J36615g8290q3505A70757A9967P1182f2920
$$ plain form
15557 140939 103490 279923 80711 -82264 -165841 -45530 87368 -13930 -185584 47957 -378274
15545 -285814 -53359 202241 113541 540 -187969 -302403 -15568 73681 158831 -295894 -51052
15533 -41543 194029 -143210 -50860 -67475 86765 -141735 -34936 58470 -287710 -124401 -117
15521 42366 -105984 -247641 18326 -172574 -95888 156788 136768 28967 39043 -197569 268920
15509 77589 -128204 -54132 87728 -25819 202518 72685 21209 127915 -295354 115122 -52014
15497 -210337 128288 346068 -85678 -97164 -106131 230370 7782 -187564 151257 -12897 -21025
15486 -21025 198416 146580 -76755 108971 632 -116338 164959 -183378 314142 265902 140923
15475 140923 3685 425330 148808 69681 206296 -78290 -161795 170757 19967 91149 -62920
15463F2035e8873F7026e9715B97056G4395b74820i2338A18696P8235f5098B58422
15451I6097J55971g8185b8446j62579G3248b4967D07270A37465O6578L30862B46641
15439B08968O1375j31847L6728p8653a33429L3140M6978j11323B16487q321a9440
15427b78823D23216A64894b12731A7963K17117a69807h4207B9107a81898I159
15416H2861J16318D18K6533L20149j47967n2657B5620b9753r28j18490A13314
15404a27762j01756A69837c9597C6189d8560C4640K14330b66189g6145c1646A31111
15392E9823g8404l9431j64642A56755d2234A6537a5888A23294d8072o9538A00409
15380b56833b1504A9369N6612K95K77824e3540k01058B45808P5916f2164f20C32968
$$ plain form
15463 62035 -58873 67026 -59715 297056 74395 -274820 -92338 118696 196931 -65098 258422
15451 96097 252068 -78185 -28446 -191025 73248 -24967 407270 137465 204043 534905 246641
15439 208968 270343 138496 175224 96571 -133429 -100289 -53311 -164634 216487 208166 -19440
15427 -278823 423216 164894 -212731 17963 235080 -169807 -84207 29107 -181898 9159
15416 82861 199179 418 26951 347100 199133 146476 25620 -29753 -30681 -149171 113314
15404 -127762 -229518 169837 -39597 36189 -48560 34640 248970 -266189 -76145 -31646 131111
15392 59823 -78404 -117835 -282477 156755 -42234 16537 -15888 123294 -48072 -117610 100409
15380 -256833 -21504 19369 75981 76276 354100 -53540 -254598 245808 321724 -62164 -620 332968
15367G1152l5406J5875J12817p541p3875J32590e2151I3463a4831o6667m6427
15356a27925j66406A1175J69706J31683H5822l1851b10709b8619C13111B2124
15345A38664n166a62704C3981L8620J04216k6358c3643B45489a60796D3845J97060
15334B40905c8791q904A21564c16114H2543L965J94009I1738J89288j37009J57454
15323C01471A45496d3366A23441e679F5397f2869A44139K57477j16046k6620C532
15311A00841a11072H4511K7679N5708J8129b27027B99501e0535E1487J3017J72542
15300B37046J85007j73664A18361a91174C13411J22415A72755n1696m0805k7432
15290E2822J12561b04886J1171B0478c73540A6652b09055M4241C23888b09415
$$ plain form
15367 71152 35746 51621 164438 156897 83022 215612 -52151 93463 -14831 -81498 -127925
15356 -127925 -294331 11175 180881 312564 85822 53971 -210709 -28619 313111 22124
15345 138664 133498 -162704 33981 72601 176817 150459 -33643 245489 -160796 43845 240905
15334 240905 -38791 -47695 121564 -316114 82543 86508 280517 91738 281026 144017 301471
15323 301471 145496 -43366 123441 -5679 65397 -62869 144139 401616 285570 258950 3532
15311 100841 -111072 84511 112190 167898 186027 -227027 299501 -50535 51487 64504 237046
15300 237046 422053 248389 118361 -191174 313411 435826 172755 121059 80254 52822
15290 52822 165383 -204886 -193715 20478 -373540 16652 -209055 -164814 323888 -209415
15279b14961a5096j28720c2361C09005A7078J1469a01498m6207H3954J13045b66346
15267a43165a4231A61860k5482E1592J8817a79444f4058B79137a817j03057c5487
15255F427b2760A89699b43025J19215H0730K20539b71517I2727J72434A2192a53462
15243A44459F9407L20945G9882a85563C9869J82530p0868L5130d9766E2710N2201
15232A04911b03567A42232n5926a5470k72661E2936J14879R7694c2819j14527
15222a47346B62732a549k8441F6579J44749p4723h8712A35393a21681D3699J61331
15211B05030G8307h3897c2710j09199h366D26309G5680a38660d7484B2458J89137
15200B11595b6B75816c6596A99146q3613F125K46038f3517C71362j63723q9681
$$ plain form
15279 -214961 -15096 -143816 -32361 309005 17078 28547 -101498 -147705 83954 196999 -266346
15267 -143165 -14231 161860 136378 51592 70409 -179444 -64058 279137 -1817 -104874 -35487
15255 6427 -22760 189699 -243025 -123810 80730 301269 -271517 92727 265161 12192 -153462
15243 144459 69407 390352 79882 -185563 39869 222399 151531 186661 -49766 52710 104911
15232 104911 -203567 142232 86306 -15470 -288131 52936 167815 265509 -32819 -147346
15222 -147346 262732 -1549 -29990 66579 211328 136605 -88712 135393 -121681 43699 205030
15211 205030 78307 -83897 -32710 -141909 -8366 426309 75680 -138660 -47484 22458 211595
15200 211595 -26 275816 -36596 199146 115533 6125 252163 -63517 371362 207639 117958
15189A17958R4040a06774E2096K57734A12997D0204L59329a0726r5444I2346J23552
15178B15898j04767J21995a51796B43237D6816b6825C08758a30664A86035a1194
15167a60726A38124F4749L40801g5981f68C92000H8533I686L12845a91259E1389
15155B53967b06868B98967A35093L14199D0420J43207R8189j23913J87098j69196
15145A75805F4084K47586J06487a96925A59104D0431L14315G3921c371A15504
15134b41031D44597c416G6477B7576J62653G7404b15907A78579n1115M7537J00059
15123B75060a9017C04720B4818J47020b29442D05268a03654B49808j21834K19300
15113C47274m7509l578i089A6243K34993L7865j10823H3999O6756k0842j3133
$$ plain form
15189 117958 211998 -106774 52096 309830 112997 40204 399533 -10726 -106170 92346 215898
15178 215898 111131 233126 -151796 243237 46816 -26825 308758 -130664 186035 -11194
15167 -160726 138124 64749 405550 -75981 -668 392000 88533 9686 322531 -191259 51389
15155 253967 -206868 298967 135093 449292 40420 183627 281816 157903 345001 175805
15145 175805 64084 311670 418157 -196925 159104 40431 354746 73921 -3371 115504
15134 -241031 444597 -3416 76477 27576 190229 77404 -215907 178579 127464 175001 275060
15123 275060 -19017 304720 24818 171838 -229442 405268 -103654 249808 127974 347274
15113 347274 299765 296187 -9089 16243 251236 289101 178278 83999 150755 129913 116780
15102A16780M6936B4952M08642k08596r3594L35247H8786a66376A19252n339f8576
15090D34906A89120L02486r0439A81927F0478L87707E8612K64831j35728R5241
15080B82956j21022J59248f2941A45986D2490A1573M4789b8476E68475g864j58039
15069a65903A12692a04918A47332n7235a53429C05912n0874C8023Q8512J67777
15059B94312A5638K50899f5819A01164R4071K76228A21793o114J27392L33589
15049E76660A78741P629O6269A10494L15566A85602M1519J427R5121A4844K49933
15038B64777n9270R9390K8478M47120f0858B08141K21011j15668A01131N1267
15028A52398p4121N02990J13605j56556A69725K76958a5293D91510j98564O272
$$ plain form
15102 116780 163716 24952 433594 224998 131404 466651 88786 -166376 119252 113913 -68576
15090 434906 189120 491606 401167 181927 60478 448185 58612 323443 187715 282956
15080 282956 161934 321182 -62941 145986 42490 11573 56362 -28476 568475 -7864 -165903
15069 -165903 112692 -104918 147332 90097 -153429 305912 255038 38023 126535 294312
15059 294312 15638 266537 -65819 101164 195235 471463 121793 115679 243071 576660
15049 576660 178741 186370 252639 110494 426060 185602 227121 228548 323669 14844 264777
15038 264777 205507 304897 333375 780495 -60858 208141 429152 313484 101131 152398
15028 152398 78277 581267 694872 538316 169725 446683 -15293 491510 292946 299218
15018B99218J18080A78239n1943m1509L24478A4886K90213e479B72493J71658
15008D44151A04431K52721k1620j65365L69005j67445E4290J26774q0173K44785
14998C45676j61397L27931A1469J95991K31416G5055K67716j21065m6535p7940
14988I7231O24311A54303L13084a08103C96615L5260A56158R984J63736B1761
14977F87776C20550O5222K92059B98079O5662j36593N31594f8586D72454p6300
14967C96154q5416J00618n6024N6750A57269J63997j05836G4734L92639j49735
14957C17638l867l3245l3j02149J49299J15721j96426k4133K34479j52723J59516
14946D64077B13822L58798j55873Q6518j10155J59421j04221o3331j35039J18732
$$ plain form
15018 299218 417298 178239 126296 84787 409265 14886 305099 -5479 272493 444151
15008 444151 104431 357152 335532 170167 539172 371727 54290 181064 100891 345676
14998 345676 184279 512210 11469 207460 438876 75055 342771 221706 175171 97231
14988 97231 721542 154303 467387 -108103 396615 431875 156158 166142 329878 21761
14977 687776 320550 385772 677831 298079 363741 227148 758742 -68586 472454 396154
14967 396154 310738 411356 355332 412082 157269 321266 215430 74734 467373 317638
14957 317638 313771 280526 280493 178344 327643 443364 246938 222805 457284 304561 464077
14946 464077 213822 572620 416747 503265 393110 552531 448310 384979 249940 368672
14936C68672m2997j6360L84486k20934P9795J9540K1377p5831r8922Q3951M78725
14925I81502j24053j77508K89143k33108k23700L99303k69328Q0950K18115m1200
14915I00116L50463l39669j56620k00162J25178j03211K7351K2477C02728J00116
14905D02844o8922J16051K26904k71652p076E3971L14100N8624r974L92769B89396
14893E36096j88742A57258K55133M8438n7536j0406o7126j30211M30309l1625
14883E94234J63304A71667O87559l48857p1619A57271J95052J95190m2575j02354
14873D02584J38988J42421j56285j02725o464m5255K65227m8468B90125J17394
14863D07519B01501J71620q2684L51615Q9276m8928k08035Q237A69193K67889
$$ plain form
14936 368672 325675 309315 693801 472867 552662 572202 593579 517748 418826 502777 981502
14925 981502 857449 679941 969084 735976 512276 911579 642251 723201 941316 900116
14915 900116 1250579 910910 754290 554128 679306 576095 603446 625923 302728 402844
14905 402844 333922 449973 676877 405225 398149 53971 368071 426695 416721 809490 289396
14893 536096 347354 157258 412391 460829 403293 392887 325761 195550 625859 594234
14883 594234 757538 171667 859226 510369 438750 157271 352323 547513 504938 402584
14873 402584 541572 683993 527708 424983 418519 373264 638491 590023 290125 407519
14863 407519 201501 373121 290437 642052 731328 682400 474365 482602 169193 437082
14853D37082o2418F2045M26132m1579J6207K08637j25803j54916J73425B09486
14842E17201B37561M40192B96496O94433k67570J48946n7361J76654j09880L0214
14832I11932m40089A56169N34654k01610M7143p2730K48456B61933L92401k58209
14822C96125M17966k21237j73496L9544J3503j62870K86075k22294Q0298K27789
14812F81403k69950o4842J91796p7842J1296Q5169l4680P9572j870k33667K88499
14801F54884J10167C73228N64761l02203K30436m11384L91451k25530J78085l05385
14791D93459k0690J12734n8293L28118q0074l16746J64852B38964N48011j19699
14781F67276J08029j37474R2621k41094n599R6241J96090j431k49425J51140J83927
$$ plain form
14853 437082 374664 62045 488177 446598 462805 671442 545639 390723 564148 209486
14842 517201 237561 677753 296496 990929 723359 872305 814944 991598 881718 911932
14832 911932 471843 156169 690823 489213 536356 463626 712082 261933 654334 396125
14822 396125 814091 592854 419358 458902 472405 309535 595610 373316 453614 681403
14812 681403 411453 346611 538407 460565 471861 557030 522350 601922 600052 366385 654884
14801 654884 765051 373228 937989 635786 866222 454838 846289 620759 798844 493459
14791 493459 472769 585503 527210 855328 775254 458508 623360 238964 786975 667276
14781 667276 775305 637831 730452 489358 483759 580000 776090 774659 525234 676374 860301
14770H60301k87030l0193K81494k49641J86453Q2062k80887J76535l05848J33902
14760E67148J36682B73267K50303K3283J53552q6170J30209j36100O7196J95972
14750H71512m30223M0108K21599K35785J57131l79362j86279L92982l29054P7522
14740F71721p353N2211k05549N6700K10079K38485j67632j31874N5942k10049
14730E62681K62356j71415K34963J63382l6956l91730K17406J40107l67462L12400
14720I25732M15368o12608K70704j4986K1859k91436K78028q6573k37029K15243
14710H84302P4800J68867k72489J1249l47868N57189q0097n135q9005J18830M3939
14699A064582j42794K1682L40903k68657K70102j16656L5067n5737M5685k33525
$$ plain form
14770 860301 573271 543078 824572 574931 761384 843446 562559 739094 433246 567148
14760 567148 703830 273267 523570 546853 700405 614235 744444 608344 675540 871512
14750 871512 441289 481397 702996 938781 1095912 716550 530271 923253 594199 671721
14740 671721 664368 716579 511030 567730 777809 1016294 848662 716788 772730 562681
14730 562681 825037 653622 888585 1051967 1015011 623281 840687 980794 613332 925732
14720 925732 1341100 728492 999196 984210 1006069 714633 992661 906088 669059 884302
14710 884302 959102 1127969 855480 866729 518861 1076050 995953 990818 901813 1020643 1064582
14699 1064582 921788 943470 1284373 1015716 1285818 1169162 1204229 1148492 1194177 960652
14689I60652k36799R7580J07498j35515J19295K81650m25217L15227j10803J94238
14679A167806n16462k15841O77550k20289j1623J79391n6647J28142k46861M39427
14669A324593q2613k64812k2044M73880o395m14350m5438N38040o55710L60325
14659A205476p622n9045J60356k12138L70601k62332J07605l16151J80222N5867
14649A222839k2167l6200k55360K06062J61107R0490Q7885k64866J2930J03889
14639A306609j18958L03298k29743k8660J81231l86874L04624j65043K08567o5783
14629A309268J47431J17506l40146K97722j57154L69904n69861J21787K4596n9277
14619A261776J3845L89168j90997j703q732K22726j19658k823l0575M9562l7797
$$ plain form
14689 960652 723853 821433 928931 793416 912711 1194361 769144 1084371 973568 1167806
14679 1167806 651344 435503 1113053 892764 881141 1060532 1003885 1132027 885166 1324593
14669 1324593 1241980 977168 955124 1429004 1422609 1008259 962821 1500861 845151 1205476
14659 1205476 1197854 1138809 1299165 1087027 1457628 1195296 1302901 986750 1166972 1222839
14649 1222839 1200672 1164472 909112 1115174 1276281 1366771 1454656 1189790 1202720 1306609
14639 1306609 1187651 1490949 1261206 1232546 1413777 1026903 1331527 1166484 1375051 1309268
14629 1309268 1456699 1574205 1234059 1531781 1374627 1744531 1174670 1296457 1321053 1261776
14619 1261776 1275621 1664789 1473792 1472089 1463357 1686083 1566425 1563602 1533027 1582589 1544792
14608A544792n13689M48876r1608M23056j43979L2731J8190j73379j69294J61271
14598A536967K26217J29591L9524l97379J38270j87713J75334J99837m2910j02920
14588A714818J21426j91490j32638N81261k13017K86563l60702L21267m50854
14579A676634M15590P922N2937J9381M7598N2970p5593J78319l56031M28844k38274
14568B210297J87429o4807J33367J71973o7947o0361M21983L4544l92770K00171
14558B773879L98237J77146k4076R04066l0629J28130Q68525P85432J296327K672880
14548I949917L746181N932533P550441M05791r864965p123073m372464j485914
14540D738447j295860p56044P6187l25901l95484L95645m02278L21998J00785
$$ plain form
14608 1544792 1031103 1479979 1388371 1811427 1667448 1700179 1718369 1544990 1375696 1536967
14598 1536967 1763184 1892775 1932299 1534920 1673190 1485477 1660811 1860648 1817738 1714818
14588 1714818 1836244 1644754 1512116 2093377 1880360 2166923 1806221 2127488 1676634
14579 1676634 2092224 2100146 2153083 2172464 2220062 2273032 2197439 2375758 2019727 2448571 2210297
14568 2210297 2397726 2332919 2466286 2638259 2570312 2509951 2931934 2966478 2573708 2773879
14558 2773879 3172116 3349262 3325186 4229252 4198623 4326753 5195278 5980710 7277037 9949917
14548 9949917 13696098 19628631 27179072 27584863 17719898 10596825 6224361 4738447
14540 4738447 3442587 2686543 2762730 2436829 2041345 2436990 2034712 2356710 2457495
14531B457495o1419j20434K84076l12888L9702K56165j87259J95787Q4747K02335
14521B838307l54833j70128K62351o9766M0927J21453R0729q062J33170k75270
14511B608878J24984N0697K06758j48982J97895m9060J52785l4509j11269K44443
14501C242620l03882K76082M8197l5172p5821J84346K98530k32267Q4871J407
14491C488911J36826q2170K79337k59976J76971k37080L33789j65424m1018J30915
14481C761081M11616K3494m77548M06469l22620K45655J70309o4935K82958j23679
14471D312800j79994L22584N1678r3857K94366j79861l5948L88616n2700Q6936
14461D914620k30488J98609L9858K37462K5497p4113k4722k1384J33771L7356
$$ plain form
14531 2457495 2396076 2275642 2559718 2246830 2286532 2542697 2355438 2551225 2635972 2838307
14521 2838307 2483474 2313346 2575697 2505931 2546858 2668311 2759040 2750978 2884148 2608878
14511 2608878 2733862 2784559 2991317 2842335 3040230 2991170 3143955 3109446 2998177 3242620
14501 3242620 2938738 3214820 3263017 3227845 3152024 3336370 3634900 3402633 3487504 3488911
14491 3488911 3625737 3543567 3822904 3562928 3739899 3502819 3836608 3671184 3630166 3761081
14481 3761081 4172697 4196191 3718643 4125112 3802492 4048147 4218456 4153521 4436479 4312800
14471 4312800 4132806 4455390 4507068 4413211 4707577 4527716 4491768 4880384 4827684 4914620
14461 4914620 4684132 4882741 4922599 5160061 5185558 5111445 5086723 5065339 5199110 5236466
14451E236466J92704j07925J17830K49806J94935J58226k24226N3904J92525J6692
14441F080937n9885J76115K77084m7182P5472k0190L38440k30958j93104M03838
14431F800567j26755K14891L65399J04640k410l0136K35413j90378K63800Q9573
14421G724604K62029j38228K85556K7245O35406k68745L52109k52936K25844K98192
14411I151076R5637K93628J29334l45977O72984j18002K84576r9713J31300M49230
14401A0644073k48326P97733l35612P20904O5477Q5317K17377o4734K56115K62887
14391A2401211K60098K30610K89837J35993J82187R720N46265M2906J28618O00412
14381A4827857M44635J44858L74221J19463J82412M48374j47687N17334K54926
$$ plain form
14451 5236466 5429170 5321245 5439075 5688881 5883816 6042042 5817816 5871720 6064245 6080937
14441 6080937 6021052 6197167 6474251 6427069 6502541 6482351 6820791 6589833 6396729 6800567
14431 6800567 6673812 6888703 7254102 7358742 7356332 7326196 7561609 7371231 7635031 7724604
14421 7724604 7986633 7848405 8133961 8161206 8796612 8527867 8879976 8627040 8852884 9151076
14411 9151076 9246713 9540341 9669675 9323698 9996682 9878680 10163256 10063543 10194843 10644073
14401 10644073 10395747 11193480 10857868 11578772 11644249 11729566 11946943 11882209 12138324 12401211
14391 12401211 12661309 12891919 13181756 13317749 13499936 13509656 14055921 14098827 14227445 14827857
14381 14827857 15272492 15417350 15791571 15911034 16093446 16541820 16394133 16911467 17166393
14372A7166393K26608O74866Q7503O23999M76753P4426N53589L36671P13506J00791
14362B1035105N49867O32403M49141O04255K16543O26249L53327Q10015K80776
14353B5557681J031187O70477O62641K22697J056269O84404O78994R90545N34391
14344C2089286O20711J274582N80341J261336J020052J020391Q54466J283021
14336D0004186Q79470J478323J241155J086406J360571J478276J306708J782843
14328E0617938J634175J604033J756762J781250K043395K034629K209857J973612
14320F5655651K202231K790932K622439K376553K742080L314407L196934L300524
14312H8201751L698667L605932L879230M237047M208730M571289M648746M983482
$$ plain form
14372 17166393 17393001 18067867 18155370 18779369 19256122 19330548 19884137 20220808 20934314 21035105
14362 21035105 21584972 22217375 22666516 23270771 23487314 24113563 24466890 25276905 25557681
14353 25557681 26588868 27259345 27921986 28144683 29200952 29885356 30564350 31554895 32089286
14344 32089286 32709997 33984579 34564920 35826256 36846308 37866699 38721165 40004186
14336 40004186 40883656 42361979 43603134 44689540 46050111 47528387 48835095 50617938
14328 50617938 52252113 53856146 55612908 57394158 59437553 61472182 63682039 65655651
14320 65655651 67857882 70648814 73271253 75647806 78389886 81704293 84901227 88201751
14312 88201751 91900418 95506350 99385580 103622627 107831357 112402646 117051392 122034874
14304A22034874N252178N297865N912976O032832O533716O774313P384397P438564
14296A72661715Q234141Q106716Q581701R267417J0025718J0081972J0686018
14289B37645398J1002115J1479824J1709177J2185323J2325315J2707887J2837164
14282C21892203J2766054J2723971J2948058J2411952J1506093J1116858R950306
14275D05315495Q700302O684991L761562K431411J493309J176655M47674k711485
14267D27299914m391321n316618p587064r547296j0911558j2164993j2943256
14260C64437808j3445545j3740856j3881647j3803271j3893583j3224236j3023512
14253B69425158j2867923j1936559j1622733j1280235j0271570j0107567r660760
$$ plain form
14304 122034874 127287052 132584917 138497893 144530725 151064441 157838754 165223151 172661715
14296 172661715 180895856 189002572 197584273 206851690 216877408 226959380 237645398
14289 237645398 248647513 260127337 271836514 284021837 296347152 309055039 321892203
14282 321892203 334658257 347382228 360330286 372742238 384248331 395365189 405315495
14275 405315495 414015797 420700788 424462350 426893761 428387070 429563725 430011399 427299914
14267 427299914 422908593 417591975 410004911 400457615 389546057 377381064 364437808
14260 364437808 350992263 337251407 323369760 309566489 295672906 282448670 269425158
14253 269425158 256557235 244620676 232997943 221717708 211446138 201338571 191677811
14246A91677811q895582q787091p310535p908427p069770p104802o279933n929220
14238A32392451n936672n095009n137349m942950m706232m153081l913960l670299
14230I4836899l637244l455387l468924l223669k808428k867519k615234k894698
14222F9865796k463685k112132j857594k617259j675599k161775j789590j851025
14214E3337137j419060j481854j365452j794392j182910j660885j390972q30967
14206D2210645q91115j243212j507081j055111q81312r53800q53779q61126r91841
14197C2972268r30687p83824m64906j057646k68513r61038p23615r44461n56801
14188B6280777r08563m73438m83327m56274p13423m89335m43597o83515l76309
$$ plain form
14246 191677811 182782229 173995138 166684603 158776176 151706406 144601604 138321671 132392451
14238 132392451 126455779 121360770 116223421 111280471 106574239 102421158 98507198 94836899
14230 94836899 91199655 87744268 84275344 81051675 78243247 75375728 72760494 69865796
14222 69865796 67402111 65289979 63432385 60815126 59139527 56977752 55188162 53337137
14214 53337137 51918077 50436223 49070771 47276379 46093469 44432584 43041612 42210645
14206 42210645 41319530 40076318 38569237 37514126 36632814 35679014 34825235 33964109 32972268
14197 32972268 32041581 31257757 30792851 29735205 29466692 28505654 27782039 26837578 26280777
14188 26280777 25372214 24898776 24415449 23959175 23245752 22756417 22312820 21629305 21252996
14179B1252996j6883r56936j49505o76668j87439l81755k01377m54204m21085
14170A7807144m50176j99234m48325l52138k26770n06210j97538O1950n63869
14161A4924834j94488n11786J54771n52829K55277m72925l63242l92520p8075
14152A2769017m54235O1568j59122k38573l69313K40057n46610q7058m78255K97298
14142A1034774n06819J89333m11281l60133R0243j99940l29651j59519J1510l58983
14132H999534M0659k4406j27301K86898m21492j08613k98337l70268M60726m14915
14122H022485j89764k5721J28197p63789J80887K60729k15133j36066l43198M8898
14112F967525n3325K46748l92682j41491l09508q7919M1969K11234j49716m26290
$$ plain form
14179 21252996 21236113 20279177 20129672 19453004 19265565 18883810 18682433 18228229 17807144
14170 17807144 17356968 17157734 16709409 16357271 16130501 15624291 15426753 15488703 14924834
14161 14924834 14730346 14218560 14373331 13820502 14075779 13602854 13239612 12847092 12769017
14152 12769017 12314782 12376350 12217228 11978655 11609342 11849399 11302789 11215731 10737476 11034774
14142 11034774 10527955 10717288 10306007 9945874 10036117 9836177 9506526 9347007 9358517 8999534
14132 8999534 9040193 9015787 8888486 9175384 8753892 8645279 8346942 7976674 8437400 8022485
14122 8022485 7832721 7807000 7935197 7171408 7352295 7613024 7397891 7261825 6918627 6967525
14112 6967525 6914200 7160948 6768266 6626775 6317267 6229348 6271317 6482551 6332835 5906545
14102E906545M58101m58001K08134m35219J56528k99050K22621j08562k19805
14093E431292O675L19820n44378R6216q2942l75833J18917L16093l89931K68793
14083E164722j72691j40553p0133O703O809k44096J23299p8203j39491o0065r5537
14072D300764R8712J16163k29777R6241n35246J70960J8905L29381l02942O4904
14062D128065j88736l9645J04339o6885L7098Q9945j75984k61584K50658r5331
14052C781940m54801J40628L06731l54636K33557m15870j91194L59169l585j18596
14042C283343R5089Q2640l05849k46753K68985Q8492m49158K30479N5890J60767
14032C263925j60392N4113R5208q73599N25367m0513L0076p7127p1947R711J65562
$$ plain form
14102 5906545 6364646 5906645 6114779 5679560 5836088 5537038 5759659 5651097 5431292
14093 5431292 5437967 5757787 5213409 5309625 5226683 4850850 4969767 5285860 4895929 5164722
14083 5164722 4992031 4851478 4781345 4788048 4794857 4550761 4674060 4595857 4456366 4396301 4300764
14072 4300764 4399476 4515639 4285862 4382103 3846857 4017817 4036722 4366103 4063161 4128065
14062 4128065 3939329 3899684 4004023 3937138 3974236 4064181 3888197 3626613 3877271 3781940
14052 3781940 3327139 3467767 3774498 3419862 3653419 3237549 3046355 3405524 3401939 3283343
14042 3283343 3378432 3461072 3155223 2908470 3177455 3265947 2816789 3047268 3103158 3263925
14032 3263925 3103533 3157646 3252854 2379255 2904622 2864109 2894185 2817058 2745111 2754822 2920384
14021B920384l90885J55921j01709p5439J16277K5921p4344k89825j7010K79978
14011B549269l93016P24448j7488o07887k31731M92624J49343n21974L4743K53908
14001B432239n5766l3071m97327M35708J92745n382K8735O39585k18182K78488
13991C197772J84671J244240J319041L406767N264477Q144089N685417o078131
13983B2368343p705238m816300k771025j469522j097333J1531r05948j92535j18548
13974C303425m94811P1641P9541j15178j68122j13819j26488K41959j34919l13470
13964B229759K509j26489O9070J04021k79459L00886j18678o7750N7679k28160
13954A943388L495J42028l44580L75670K42065n46498O3909j7196k182J14734
$$ plain form
14021 2920384 2529499 2685420 2583711 2508272 2624549 2650470 2576126 2286301 2269291 2549269
14011 2549269 2156253 2880701 2863213 2255326 2023595 2516219 2665562 2143588 2178331 2432239
14001 2432239 2376473 2343402 1846075 2281783 2474528 2469146 2497881 3137466 2919284 3197772
13991 3197772 3382443 4626683 5945724 9352491 14616968 22761057 28446474 22368343
13983 22368343 14663105 9846805 7075780 5606258 4508925 4520456 3614508 3421973 3303425
13974 3303425 2808614 2880255 2959796 2844618 2676496 2562677 2436189 2678148 2543229 2229759
13964 2229759 2232268 2105779 2174849 2278870 1999411 2300297 2181619 2113869 2171548 1943388
13954 1943388 1946883 2088911 1744331 2120001 2362066 1815568 1879477 1862281 1860099 1974833
13944A974833L8935k91518J26626k23620m8037L88506j13646j87296K10453j89742
13934A685494r6272Q8983j46004L12135o9562j47765J32497j33283j18368q2958
13924A424897K85063n9002j81951J33668m7048M56173n90534K83348l68327Q3188
13914A419475k65801q089N41201q8954j7022j52124k40755J38607j15907r229
13904A201402K95209l09356j21398L83546l4194J52330l32545J14877K4827j14314
13894A260384r2454J55766J62750j21828k38189j5182J32673l2334k28513R3280
13884A076353R0037j34322L84790k01104J14565j66141p7388J04806J10208l8224
13874A263580k7764l78971L34548k28641L08300J63614l82140R6745J7999k54648
$$ plain form
13944 1974833 2013768 1722250 1848876 1625256 1577219 1965725 1852079 1664783 1875236 1685494
13934 1685494 1589222 1678205 1532201 1844336 1774774 1627009 1759506 1626223 1507855 1424897
13924 1424897 1709960 1650958 1469007 1602675 1555627 2011800 1421266 1704614 1336287 1419475
13914 1419475 1153674 1145585 1686786 1597832 1580810 1428686 1187931 1326538 1210631 1201402
13904 1201402 1496611 1187255 1065857 1449403 1415209 1567539 1234994 1349871 1374698 1260384
13894 1260384 1167930 1323696 1486446 1364618 1126429 1111247 1243920 1211586 983073 1076353
13884 1076353 1166390 1032068 1416858 1215754 1330319 1164178 1086790 1191596 1301804 1263580
13874 1263580 1235816 856845 1191393 962752 1271052 1434666 1052526 1149271 1167270 912622
13864I12622K16593j87177j60694N07751J9877k31664p3647j66333O1052q9063
13854H09317J61813K94071n4443k28008L56986l81425P7116J36917k22095N4723
13844A004972o5809J24384q9848K55467F00694J30280L90978k75464j49601J36164
13834H33051K2007N0536o4193J89259J05323o3179l12679O0538q3193J34564n2148
13823H19886N1451L5167k03401K34161j44282l51518K66222K32824j16651K73310
13813A097169l26985r9702Q5645Q7762j61568J60817r4532K73164D71857L48729
13803H20586j42445J5701K74080l60344O2945o3338M5019K04823j20867J01254
13793H37414k15477N17122l20863j29092K38130k4266l42560A85468P73036k51537
$$ plain form
13864 912622 1129215 942038 781344 1289095 1308972 1077308 1003661 837328 898380 809317
13854 809317 971130 1265201 1210758 982750 1339736 958311 1035427 1172344 950249 1004972
13844 1004972 939163 1063547 973699 1229166 600694 730974 1121952 846488 696887 833051
13834 833051 855058 905594 841401 1030660 1135983 1072804 760125 820663 737470 872034 819886
13823 819886 871337 906504 703103 937264 792982 441464 707686 940510 823859 1097169
13813 1097169 770184 670482 756127 843889 682321 843138 748606 1021770 471857 820586
13803 820586 678141 693842 967922 607578 670523 607185 652204 857027 736160 837414
13793 837414 621937 1139059 818196 689104 927234 902968 560408 185468 958504 706967
13783G06967j50791L79499P544j68182p1912k4457Q6538j13474L03326l41934
13773F13124Q9537r5074M18028j19614m29919M55510j15836k55651J16925n3818
13763F23212J35057k29189A25494N12495J87037l10002M2544M05592l69597J50855
13753G44418j27691R5068l7591l00436J83422K1526k07661O50886k61523M2122
13743H02540k12528n4422j96693K93485m2046k20536J03161K95204C31925R8247
13733D30172L05856j0384l62224J27294j45921L38901j49245k42702n3211L65699
13723F04235j35154P2356j12884L22105l15625L22611k12240r89k1328J16163
13713F39250K1905m1041k44759j69739K70536R3876M9897M1896j07637k67346
$$ plain form
13783 706967 556176 935675 943219 775037 703125 678668 765206 651732 955058 613124
13773 613124 702661 607587 1025615 906001 476082 931592 815756 560105 677030 623212
13763 623212 758269 529080 125494 637989 825026 515024 557568 963160 593563 744418
13753 744418 616727 711795 674204 373768 557190 578716 371055 1021941 760418 802540
13743 802540 590012 535590 338897 632382 590336 369800 472961 768165 331925 430172
13733 430172 736028 725644 363420 490714 344793 683694 534449 291747 238536 604235
13723 604235 469081 541437 428553 750658 435033 757644 545404 544415 523087 639250
13713 639250 661155 620114 375355 205616 476152 570028 619925 661821 554184 286838
13703B86838L07420B43387Q7614Q0378n9028N3129K8961n433L8832p3321J00051
13692D94570p8761J11644Q3124m7907k22648J81973O2664j64547J3421j21780
13682C11753J5491K34386J55096j96568M3391B60836L03722k59173K46834j07043
13672D45176J41415B83004J30502j14229K99546B86688j0486K47067L4256j06249
13662D51276M08604C01613J58554K34751C19000R4492m4031K83185j75355j75185
13652C02106L95995k72080Q2448k44416K7372o0579J03208L16411k57148k468
13642C90849j59693J02295R1414o3456J92040F2073N65756k65635K77305p1082
13632E68417j20525J8917R3431k18401J4758J487J81839H0326M29396q5698J69518
$$ plain form
13703 286838 594258 243387 331001 411379 352351 405480 434441 429008 467840 394519 494570
13692 494570 415809 527453 610577 562670 340022 521995 584659 420112 433533 311753
13682 311753 327244 561630 716726 520158 563549 260836 564558 305385 552219 445176
13672 445176 586591 283004 413506 299277 598823 286688 276202 523269 557525 451276
13662 451276 859880 301613 460167 694918 319000 413492 369461 652646 477291 302106
13652 302106 698101 426021 508469 264053 291425 230846 334054 650465 393317 390849
13642 390849 231156 333451 424865 361409 553449 62073 627829 362194 639499 568417
13632 568417 447892 466809 560240 341839 356597 358084 539923 80326 509722 424024 593542
13621E93542A66504j571K20076P1973K4105k07306G873J28423J1195N10012A53126
13609C21728J61326j08575j31099M5323J58836j79589p2856k2086K98404A86711
13598E17213B22905M7126p3340L91860j85139j97888J03858j8590J32259j99811
13588B23240P0499j3619l2919K28794r8677A43341J58525N9724n2387J59001n8199
13577D10005j83924K50213M0397k57081L96794B06768J24041J80507G8082K49078
13567C27160j21255A5843K46639J225J13776p9769l8494J52442r7798R8062A75306
13555C56458J98292k44165A31439J40670l7006k2761J32412A2423L85073J09156
13545E06652j63956k0614j08447J52210R945J25308j01675A81363i0498A00235
$$ plain form
13621 593542 166504 164933 385009 456982 481087 273781 7873 136296 147491 657503 153126
13609 321728 483054 374479 243380 288703 447539 267950 195094 173008 471412 186711
13598 517213 222905 270031 196691 588551 403412 205524 309382 290792 423051 223240
13588 223240 293739 280120 247201 475995 377318 143341 301866 361590 309203 468204 410005
13577 410005 226081 476294 516691 259610 656404 206768 330809 511316 78082 327160
13567 327160 205905 15843 262482 263707 377483 297714 259220 411662 313864 411926 175306
13555 356458 554750 310585 131439 272109 235103 212342 344754 12423 397496 506652
13545 506652 342696 322082 213635 365845 375790 501098 399423 181363 -90498 100235
13534B72221J8547b04388B47222p2270J12257A5141M48532k08566J522N0603l0898
13523B76334K69974A28175n7857J76643H5019R2634A0009N09494p3287A65347
13512F03679j35214J98368A94434Q63M37110A27883c8861B47964l277M9785J0980
13501C05452k0506p9024K11176r6757A06218O884K30831p33n0528m571o8445L4453
13489B54109q0338K01976n9138a30688H122J75042J63750A71818P0378p7553j7539
13478A47104K14204k4210L6999A26644J5712Q3023L56553D2384L06123a07390
13467A06366J61197A10341O3183a14925C2981B995K23983G2139c6536B30051B9265
13455E65246a3445D64760k21598K57429p4479F6451M6011a84572B42041E3755
$$ plain form
13534 272221 290768 -204388 247222 174952 287209 15141 463673 255107 256629 307232 276334
13523 276334 546308 128175 70318 246961 85019 177653 10009 519503 446216 165347
13512 603679 468465 666833 194434 195297 632407 127883 -38861 247964 244687 294472 305452
13501 305452 284946 205922 417098 320341 106218 113102 343933 343200 292672 288101 219656 254109
13489 254109 173771 375747 316609 -130688 8122 183164 346914 171818 242196 164643 147104
13478 147104 361308 337098 374097 126644 142356 225379 581932 42384 348507 -107390
13467 106366 267563 110341 173524 -114925 32981 2995 226978 72139 -36536 230051 29265
13455 565246 -13445 464760 243162 500591 426112 66451 112462 -184572 242041 53755
13444D50256H7075J45936A2126J01515A8231K72355o6496J05920b1375D8939b1395
13432C28333d237E37832A7988J39574d5338D59781F0041E636Q8642J96854j42372
13421A48760K81577j51358a19645B23341Q6807H3290K57409a11275M0771A41560
13410B88515G2935K43923H0428P2984K44987j41719R6666A23004Q1448j7282J48543
13399C35713k2809J29215b45902A43035j0121j1685J84313O5071A65035B5200
13388B03177k0764Q1083L54706A4714K83192i4197A62113K1257b0136B15198J29647
13377C44845n727j03975F3472J28378J90213c1221j63499A49377L08522A97491
13366E3000L51597A53827Q3411J26556b06553E5075L16411Q4821A49577N4845
$$ plain form
13444 450256 87075 233011 12126 113641 18231 290586 224090 330010 -21375 48939 -21395
13432 328333 -4237 537832 17988 157562 -45338 459781 60041 5636 94278 291132 148760
13421 148760 430337 278979 -119645 223341 310148 83290 340699 -111275 -70504 141560
13410 288515 72935 316858 80428 153412 398399 256680 353346 123004 204452 187170 335713
13399 335713 312904 442119 -245902 143035 132914 121229 305542 370613 165035 25200
13388 203177 182413 263496 618202 14714 297906 -94197 162113 183370 -20136 215198 344845
13377 344845 339118 235143 63472 191850 382063 -31221 -194720 149377 457899 197491
13366 53000 404597 153827 237238 363794 -206553 55075 371486 456307 149577 204422
13356B04422E5123b1791q3055B01495r7734J17282a16521B97399H8314M64317
13346E52631B56117K49154J8512k39832j198K45131B12432P4038j34078J63119
13336C15511C0009a5775D44791j76517o6008J8985j5013j2731N0197J23948A64909
13324A38749h509A06009O3604K24264q1328I6262K73548F2467k8028M92573A47785
13312E9969j8468J01724K53317F0130K36298o2019q3512E8346A3209K25363g4191
13300I9014m0874d4691A92311a76730A37396A2464M147b31537A24591N5828M4765
13289B25184J01208j30550F9646k0977K12120g1251A13129J05669J5124a17929
13278c137j31687c825q0089L5243L21C27029B9173N8399J41884K9981N626c1632
$$ plain form
13356 204422 55123 -21791 -104846 201495 103761 221043 -116521 297399 88314 552631
13346 552631 256117 505271 523783 283951 282753 527884 212432 286470 152392 315511
13336 315511 30009 -15775 444791 268274 202266 221251 206238 193507 243704 367652 164909
13324 138749 -8509 106009 169613 393877 312549 96262 369810 62467 34439 527012 147785
13312 59969 41501 143225 396542 60130 296428 234409 150897 58346 13209 238572 -74191
13300 99014 58140 -44691 192311 -176730 137396 12464 16611 -231537 124591 180419 225184
13289 225184 326392 195842 69646 48669 260789 -71251 113129 218798 233922 -117929
13278 -3137 -134824 -3825 -83914 -48671 -48350 327029 29173 87572 229456 259437 265063 -31632
13265E26598a88690D3242K57153C190N03243a9250k4116C84611A21190n7401D323
13253d5681C36977A41036d2315D1373a01884D0934K11227n7923R1199J12316B9013
13241I5512l7899b3058m2487D035J24767j7742a595A02165K312a83163D2871M43506
13229D86377H2009J1475a37374A65488q1952R5438B8752a47557j12989C1604J23353
13218A54957a1911k2898N909B98549c3622k3332A45337J26852A09704J61080J59082
13207D29866a92428H3081Q955d160k1054B25363f358j39447C33394e1372j30245
13196a81617A60702B7238J51530i6580E9633G409K67403j11717k6008m914E7366
13184A22896d7845j73279A33500n9943J40659k5556C5467J95675a04272E6111
$$ plain form
13265 526598 -188690 43242 300395 3190 506433 -19250 -43366 384611 121190 63789 4323
13253 -45681 336977 141036 -42315 41373 -101884 40934 252161 194238 285437 397753 29013
13241 95512 57613 -23058 -65545 4035 128802 111060 -1595 102165 104477 -183163 42871 486377
13229 486377 82009 93484 -137374 165488 83536 178974 28752 -147557 -260546 31604 154957
13218 154957 -11911 -34809 -28900 298549 -33622 -56954 145337 272189 109704 270784 429866
13207 429866 -192428 83081 92036 -4160 -25214 225363 -6358 -145805 333394 -51372 -181617
13196 -181617 160702 27238 178768 -96580 59633 7409 274812 163095 137087 132173 57366
13184 122896 -47845 -221124 133500 73557 214216 188660 35467 231142 -104272 56111
13173C3911a99101A65222G8900L23668a52864B15040f6992A56284J6279g8468
13162B45807b9446j00918C4343A5927L08063j32642G319b4184A91145E9163K6995
13151H6158J16936f8568A85019e5681B6760f138k4855C073d8277j14799A2017
13139B386a40351l3583b506C27463g2176B40269h6559A07101R0866I4543a24331
13127H0392N7329a27525B9107J16794N3583G0139a40333A01983B0526d6958G8661
13115C4135A643P8472J99340H2932h2884A62854a47661m289B61629k0087d9611
13103A10932i0567A88253a65329A03435C1055J20891o6796k5730A1384J31692
13093A43076f2899C73929D7776a50493A65178k2539a80111E9411L9425J36622
$$ plain form
13173 33911 -199101 165222 78900 402568 -152864 215040 -66992 156284 172563 -78468
13162 245807 -29446 -130364 34343 15927 323990 191348 7319 -24184 191145 59163 86158
13151 86158 203094 -68568 185019 -55681 26760 -6138 -30993 3073 -48277 -163076 12017
13139 2386 -140351 -173934 -2506 327463 -72176 240269 -86559 107101 197967 94543 -124331
13127 80392 137721 -127525 29107 145901 199484 70139 -140333 101983 20526 -46958 78661
13115 34135 1643 80115 279455 82932 -82884 162854 -147661 -151950 261629 241542 -49611
13103 110932 -90567 188253 -165329 103435 31055 151946 85150 59420 11384 143076
13093 143076 -62899 373929 47776 -150493 165178 142639 -180111 59411 98836 235458
13083B35458p9521b9194A2792J42539h9093C07111j18534E0835J00085a01735
13072B92059A34176l1420d5B09895g7765H9913R9679e3240j83423C9204b33907
13060B57740b18255C03451I7849d2114A2520N5043g4331A70697J3559a5288l10255
13049c25543A41643J62334a6259M952B18804m1938i3121A1165J04538j2250a11481
13037B50187o137j14593m3881j6971B6404J19673c4990A54391M2991J03466f9896
13025A47961a68972i156E4718B5508j382M3898a70220D02337A17433a73073I3348
13013c3342B99020q9151f4052k61905A01645b77128E07515j30173A47476j7563
13003A29913J44370q4834K15385m3006D1811f2143D7020K95629M3704b80497A76346
$$ plain form
13083 235458 155937 -29194 12792 155331 -89093 307111 188577 50835 150920 -101735
13072 292059 134176 102756 -45 209895 -77765 89913 189592 -53240 -236663 39204 -233907
13060 257740 -218255 303451 97849 -42114 12520 67563 -74331 170697 184256 -15288 -325543
13049 -325543 141643 303977 -16259 -11307 218804 176866 -93121 11165 115703 103453 -111481
13037 250187 244050 129457 85576 68605 26404 146077 -34990 154391 197382 300848 -69896
13025 147961 -168972 -9156 54718 25508 24126 68024 -170220 402337 117433 -173073 93348
13013 -33342 299020 209869 -64052 -325957 101645 -277128 507515 377342 147476 129913
13003 129913 274283 189449 404834 361828 41811 -62143 47020 342649 386353 -280497 176346
12991I975J99930b87014c9994j40216L8035J4519D6969b63530h7578B4366O1423
12980H5789b11214i7275a276j18180B03061r7392J89764j19417R3702l3196K9205
12969B65727f6117j2107G077b75842C9034O8854Q5778G1055l4280K72580E3755
12957E4131Q5326e0330A24903g2755F1955J28794e599A57955a30861A96404J80646
12946C77050a56595A09634a72856C18437j45376o6153C5287g0766r8730N4894
12936a14602A42557c6353B90671A21351P5835B0391O3069a18681B22481g43j34035
12925a34778q0676A42890B8485b1091j09984N9448A49870K02094e2965j02954
12915a55919l6133g0882n266p7881B89009c04964a35974H5975K83283g6617n2380
$$ plain form
12991 9975 209905 -287014 -39994 -180210 -142175 -127656 46969 -263530 -87578 24366 85789
12980 85789 -211214 -97275 -1276 -119456 203061 105669 295433 176016 269718 236522 265727
12969 265727 -66117 -78224 7077 -275842 39034 107888 193666 71055 36775 309355 53755
12957 54131 139457 -50330 124903 -72755 61955 190749 -5599 157955 -130861 196404 377050
12946 377050 -156595 109634 -172856 318437 173061 106908 35287 -70766 -169496 -114602
12936 -114602 142557 -36353 290671 121351 197186 20391 83460 -118681 222481 -743 -134778
12925 -134778 -215454 142890 28485 -21091 -131075 -71627 149870 351964 -52965 -155919
12915 -155919 -192052 -70882 -76148 -154029 289009 -304964 -135974 85975 369258 -76617 -128997
12904a28997A94936c43003A39786c7751k03839B3590D103e7054B19255I2016e9373
12892a79536E5808K48815H7234Q7736b45437B76811P637p8568b30372c4740o4405
12881i9145c7814k1570D33952I0130a7633p8823D95592h5059A65675J13416d8
12869B35953j17691J28756m4040A5543g14m9707A82496j0522o179c24128G6247
12857a76202A17095P8335L03382j17008D8717O5735a12447L2439c5298C7733f9108
12845b95955A19158O185b9482j15600l4956J6158B49299m6684b06209h6211n3920
12834a40131B03129e0207j79760L7310j44776J56772f753k3679j58450D7029a32876
12822H9571a26125j294a2533k40339D7866a86565B2485D235a37493C7737i6379
$$ plain form
12904 -128997 194936 -343003 139786 -37751 -241590 23590 4103 -57054 219255 92016 -59373
12892 -179536 55808 304623 87234 174970 -245437 276811 284448 205880 -230372 -34740 -99145
12881 -99145 -37814 -59384 433952 90130 -17633 -96456 495592 -85059 165675 279091 -48
12869 235953 118262 247018 202978 15543 -714 -50421 182496 171974 165795 -324128 76247
12857 -176202 117095 195430 498812 381804 48717 114452 -112447 -80008 -35298 37733 -69108
12845 -295955 119158 125343 -29482 -145082 -180038 -163880 249299 202615 -206209 -86211 -140131
12834 -140131 203129 -50207 -229967 -192657 -337433 -180661 -6753 -30432 -188882 47029 -132876
12822 89571 -126125 -127419 -12533 -252872 47866 -186565 22485 4235 -137493 37737 -96379
12810a67572B23789M9925a22962A34069Q9088p7882a3990A12261D0227b41615
12799c0244B94557a93058B97567a23188j42528a0053c888C8187d2806H9146h9797
12787a82658e1439m0733B90921a13249n4240E0758c3435j51477n824O9722e8829
12775A07906J28551f8094H9062c5676E0873h7971C7319a41859A23488g7497A69163
12763A4354Q525L5159M82842k17631d7432j00350A28658a33589L4085G9536a88659
12751f6484A71291b85027b0998m0036j7239A89613F1631a98046C08460G687L17441
12740C25128A44554O624a9564A59301d102m4348B5717R5480m9774f9873I9307
12728a32593j54489D51491c1942B97558h5068g26j7957B20272e4801A5742P1113
$$ plain form
12810 -167572 223789 273714 -122962 134069 223157 145275 -13990 112261 40227 -241615
12799 -30244 294557 -193058 297567 -123188 -265716 -10053 -3888 38187 -42806 89146 -89797
12787 -182658 -51439 -92172 290921 -113249 -167489 50758 -33435 -184912 -190736 -121014 -58829
12775 107906 236457 -68094 89062 -35676 50873 -87971 37319 -141859 123488 -77497 169163
12763 14354 22879 58038 540880 323249 -47432 -147782 128658 -133589 -99504 79536 -188659
12751 -66484 171291 -285027 -20998 -61034 -78273 189613 61631 -198046 308460 7687 325128
12740 325128 144554 151178 -19564 159301 -4102 -48450 25717 121197 71423 -69873 99307
12728 -132593 -287082 451491 -31942 297558 -85068 -726 -18683 220272 -54801 15742 86855
12717H6855l5551A6614L57652H2348B7587K49284K445j30416f4899B26739b10626
12705A23992J3340E25Q9027f508C0995b5064k62675i0353A44896b7779I5281J77802
12693B73083C0523K41350j27907a47155f0731H0171b1862j73917B60362A25274
12682B93617j01093a8589D34649j43454l8350J55902E2939e0810j02237B9655
12671A41875l1919b4259k692A64843h4361A54218A1904M7103a12836C6869c73990
12659a55995I7399B0J74509B4634c6403B07813C6117K37962e2136A55144k5111
12648A30033a40409A84493c6362j20360J9580E3854P9101C8538J00422b6700m8159
12637g4859j03455I127K07061D5312b34070h0743A42779B6524J15222b08334B35217
$$ plain form
12717 86855 51304 16614 374266 82348 27587 276871 279316 148900 -64899 226739 -210626
12705 123992 137332 525 89552 -6508 30995 -25064 -287739 -90353 144896 -27779 95281 273083
12693 273083 30523 271873 143966 -147155 -60731 80171 -21862 -195779 260362 125274
12682 293617 192524 -18589 434649 291195 252845 408747 52939 -50810 -153047 29655
12671 141875 109956 -24259 -26951 164843 -84361 154218 11904 59007 -112836 36869 -373990
12659 -155995 97399 20 174529 24634 -36403 207813 36117 274079 -52136 155144 130033
12648 130033 -140409 184493 -36362 -156722 -137142 53854 132955 38538 138960 -26700 -74859
12637 -74859 -178314 9127 216188 45312 -234070 -80743 142779 26524 141746 -208334 235217
12625h5363d0258A25330L8225a17356F3207b43205A79961a35625l027A65562a25463
12613c4012A67178n4919g7451H8144J60734c27024a61728j00501i4394I165M1617
12602E0782b1666D7049J4461A8907L69786b3685j24711B83202A33649q965b63138
12590c3194k40675O3526a8698l1836A62199M575a79110E8419P7621F0420O6164
12579A26584M4675b67417B5864J44936l272b38351g5109D7839i2629F5574d46317
12567h5803n5569O6832D16676b5637B1662N1001a32736D9455C753J56696d0809
12555B68054d54063a07365C8439N0380b8395d791J168B7811g5544H6208f3948
12543e0341I6318a59140A1417J09499a09887f206B9054G728b59908i2017i658
$$ plain form
12625 -85363 -40258 125330 163555 -117356 63207 -243205 179961 -135625 -138652 165562 -125463
12613 -34012 167178 112259 -77451 88144 248878 -327024 -161728 -262229 -94394 9165 50782
12602 50782 -21666 47049 61510 18907 388693 -23685 -148396 283202 133649 124684 -263138
12590 -33194 -273869 -210343 -18698 -50534 162199 166774 -179110 58419 136040 60420 126584
12579 126584 171259 -267417 25864 170800 167528 -238351 -75109 47839 -92629 65574 -446317
12567 -85803 -141372 -74540 416676 -25637 21662 72663 -132736 49455 3753 160449 -40809
12555 268054 -454063 -107365 38439 88819 -28395 -4791 -3623 27811 -75544 86208 -63948
12543 -50341 96318 -159140 11417 120916 -109887 -6206 29054 7728 -259908 -92017 -9658
12531B44700l8060c89894a34110A75728C4743i9644n2937L8245A48759b9298j32845
12520a62143j23206A32218f0153C17361a91393A62340k0091a24224A78721k9946
12510A48775M9981D0330c70226B5259J05254b078B13018a16968F9983N8591h9089
12498c34090A33775a01398J6386K5790D7426a21545D1065c6501q9376K9961A61779
12486f4279A04775a67805l0567g4102F4604a09630K3667j82532A72602l1975F3439
12474G8958R6336J01918j8233b02418R6032k40678d4570A83708c38124H0021A4395
12462B04129d90169G1362I522a03865K2413A53766b35894B17996o7806a65485
12451a26496e7683E5646a23624a970o9545A6134h7900B6925q812b03752f6039
$$ plain form
12531 244700 206640 -389894 -134110 175728 34743 -99644 -152581 -114336 148759 -29298 -162143
12520 -162143 -285349 132218 -60153 317361 -191393 162340 142249 -124224 178721 148775
12510 148775 198756 40330 -370226 25259 130513 -2078 213018 -116968 69983 128574 -89089
12498 -334090 133775 -101398 -85012 -59222 47426 -121545 41065 -36501 -125877 -95916 161779
12486 -64279 104775 -167805 -198372 -74102 64604 -109630 -85963 -268495 172602 140627 63439
12474 78958 175294 277212 258979 -202418 -106386 -347064 -44570 183708 -338124 80021 14395
12462 204129 -490169 71362 9522 -103865 -81452 153766 -235894 217996 150190 -165485
12451 -126496 -57683 55646 -123624 -1970 -71515 16134 -87900 26925 18113 -203752 -66039
12439e6143A8508a06891k10154J29205M5923H9121B4050r312h7708k56474H4147
12427a19336j30457F7060J4340c5021B00588B0716K59091b59073a02200B1238
12416a22158q5258h1991a4615C27831e8358E2280b4519n1694B87142b90161q8727
12405c78888D24203A03991b88830e5921A5845i0283D50129b01282B17263a46778
12394A02984J23001a89639l3970q192n6355b2421f891m7365h659j83435J443N8711
12382a31940H8784O3052c8586n5036m64646B43266p3820a38968A62391D988O5871
12371G0859J24681a04652L3026B20127D67K65428o0677A2012i8909k15426P6048
12360b38287e6964a3038r0658I0211e1215N785C04343a23767A5683d743j51428
$$ plain form
12439 -56143 18508 -106891 -317045 -187840 -141917 89121 24050 14738 -87708 -344182 84147
12427 -119336 -249793 67060 81400 -35021 200588 20716 279807 -259073 -102200 21238
12416 -122158 -207416 -81991 -14615 327831 -58358 52280 -24519 -76213 287142 -290161 -378888
12405 -378888 424203 103991 -288830 -55921 15845 -90283 450129 -201282 217263 -146778
12394 102984 225985 -189639 -223609 -231801 -288156 -22421 -6891 -54256 -8659 -192094 -190651 -131940
12382 -131940 88784 151836 -38586 -93622 -558268 243266 169446 -138968 162391 4988 70859
12371 70859 195540 -104652 -71626 220127 467 265895 205218 12012 -98909 -314335 -238287
12360 -238287 -56964 -13038 -103696 90211 -51215 -45430 304343 -123767 15683 -4743 -156171
12349a56171k1388a9510B510b2446A14946c53111J25144B27043a30774N8989C92225
12337A79760K7347O283B9897K9160R8325A2819J72080b4779G1547a47957C38080
12325a71125A10051d66252K31016A69408o4909a34986J1348B35761E8874K5769
12315H4643f1506E8110b55942B29774b58715a9490k61935C77618i0371A11388
12304B22729A02657a47069b5064F390J3865N3801b47017M7168N1763j6946A73349
12292h3499e1o1447l0733B6016J57540f6096k69462J00735a02643c8848A28491
12280C772K00935J71365H2653a36475C4641K15774I2170e5325j27592P4544D9367
12268A54077B2389a71098n4942A18894N4109E481A887K39213f5237B83298q9366
$$ plain form
12349 -156171 -177559 -19510 2510 -22446 114946 -353111 -227967 227043 -130774 -71785 392225
12337 179760 207107 213390 29897 59057 157382 12819 184899 -24779 71547 -147957 338080
12325 -171125 110051 -466252 -235236 169408 104499 -134986 -123638 235761 58874 84643
12315 84643 -61506 58110 -255942 229774 -258715 -19490 -281425 377618 -90371 111388
12304 222729 102657 -147069 -25064 6390 20255 74056 -247017 -199849 -148086 -165032 173349
12292 -83499 -51 -61498 -92231 26016 183556 -66096 -335558 -234823 -102643 -38848 128491
12280 3772 204707 376072 82653 -136475 34641 250415 92170 -55325 -182917 -108373 49367
12268 154077 22389 -171098 -226040 118894 173003 5481 1887 241100 -65237 283298 193932
12257A93932c18779B12195K4871l2160h0947O723B42603a49415A16006a15783
12246B11720k5860K2782a13273j09149B94471a39256e6195l2851I7990c2995C95666
12234b52959j23410A48441K18257A38378k3815D6016c534A4210L4881a54088A64953
12222A61747J42915F9631g1809A08823a18677A80203p2155M7135b26561A73739
12211B17434J466b05470F1303R1252a44176c246A63542l0445M1273l4695J5274
12200A54949j9904p344c4332B2882L38851b72790A22480a8158A51795a096C23902
12188A6359L94706d3461k6686B76994r7219J64877A13438g1805A83257C2887g2314
12176D37005e110C42842A66367K3890k1775K91180J00672g1214j03381B22887
$$ plain form
12257 193932 -318779 212195 237066 204906 -80947 -74224 242603 -149415 116006 -115783
12246 211720 185860 208642 -113273 -222422 294471 -139256 -56195 -89046 97990 -32995 395666
12234 -252959 -376369 148441 366698 138378 114563 46016 -3534 14210 49091 -154088 164953
12222 161747 304662 69631 -71809 108823 -118677 180203 108048 155183 -226561 173739
12211 217434 218900 -205470 61303 152555 -144176 -3246 163542 133097 174370 139675 154949
12200 154949 135045 127701 -34332 22882 361733 -272790 122480 -18158 151795 -1096 323902
12188 16359 411065 -43461 -70147 276994 179775 344652 113438 -71805 183257 32887 -72314
12176 437005 -5110 342842 166367 190257 168482 459662 560334 -71214 -174595 222887
12165B4931K77998g1104K4614a3988C1984a43102E44781b64176C28441q7806a8848
12153C9485J35965E2610k6183M14262i6950I5776L51489A40912g6788A40590a87689
12141E1715a0151C50041l2301b08917h8621D43229c9435j79130i4482Q852F0746
12129B7553L73603E3197f6228B44532A00589b32888p1959F8453K51038A12052
12118A23975f8168l05102e604H0014M5775a993A98828c0557B97055p0059a92493
12106d37912d5860A41119J30292F3558c920C33932a28808F4488c23895A18377
12095c02932M7442M2034N9457A2280M9515e189j55002k7131C2756b20389A97968
12083a08248m2696P1706I9301b6260G1691k6120b7853E1140j3055N7954a38467
$$ plain form
12165 24931 302929 -71104 -46490 -13988 31984 -143102 544781 -264176 328441 240635 -18848
12153 39485 175450 52610 26427 440689 -96950 95776 447265 140912 -76788 140590 -187689
12141 51715 -10151 350041 317740 -208917 -88621 443229 -39435 -218565 -94482 -85630 60746
12129 27553 401156 53197 -66228 244532 100589 -232888 -304847 68453 319491 112052
12118 123975 -68168 -373270 -5604 80014 125789 -1993 198828 -30557 297055 226996 -192493
12106 -437912 -45860 141119 271411 63558 -3920 333932 -128808 64488 -323895 118377
12095 -302932 -255490 -213456 -153999 12280 61795 -5189 -160191 -187322 32756 -220389 197968
12083 -108248 -150944 -79238 99301 -26260 71691 45571 -27853 51140 38085 96039 -138467
12071I3679b08911O8108k4923B84590a1807j75732H8925a72831A36169m4948K32732
12060C23953A47005b26970A30295b73414G1026K30850i1791G4250b32245A32646
12049a51651d6938G905J36079d9907A31781k8578P6122j176B4938J46915J13148
12038B85001e4671k80826K2382D9958a14773B87965A13901a36781G5000J6055
12028I1055a57783L9834C80870e05288K39637a2190j11263c3324l03298d2846
12017g9045a4313E5300B7379c76802A75471J7936c55252A34168b74353A14864
12006b03310J00623k89692i0410K210A63112g7580E0477a15461A27649a80285
11995i1525I5186g5852J2470J0515j63621A864c902k20017l7957Q3568k41023
$$ plain form
12071 93679 -208911 -140803 -165726 284590 -11807 -187539 88925 -172831 136169 91221 323953
12060 323953 147005 -226970 130295 -273414 71026 301876 -91791 74250 -232245 132646
12049 -151651 -46938 7905 143984 -49907 131781 103203 179325 178149 24938 171853 285001
12038 285001 -54671 -335497 -313115 49958 -114773 287965 113901 -136781 75000 91055
12028 91055 -157783 -117949 380870 -505288 -265651 -12190 -123453 -33324 -336622 -42846
12017 -79045 -14313 55300 27379 -376802 175471 193407 -355252 134168 -274353 114864
12006 -203310 -102687 -392379 -90410 -88200 163112 -77580 50477 -115461 127649 -180285
11995 -91525 95186 -75852 -63382 -52867 -216488 1864 -3902 -223919 -261876 -178308 -419331
11984d19331a5738B8467a51923q623L0735I7046P2120J5464b51086B1110h0423
11972C5643h8052H4867B4789a64293d0493j95029N9907F6558d1018A4044a17424
11960a58890d979n3390j09635m6564I9991e965j54848j3188B61860a84946G1087
11948d10914R3948e6592K6711l75469J30195B4882K1749J00418b61067a6656l50
11937a7006A47790J00611A9968b69346J0793A23035A2969L04124B1360a90760
11926A14104c9794n0623A19791o865J09650F5797b16704H4145g0275g546l212
11915a0758A50442f5199G5468a03093A2579K4948M2204J22934C2615R073g4755
11903A4721R2093l6551h9813l13245J9455C4166a65425j43425d3344B4680F73
$$ plain form
11984 -419331 -15738 28467 -151923 -160546 -129811 97046 169166 184630 -251086 21110 -80423
11972 35643 -88052 84867 24789 -164293 -40493 -235522 -175615 66558 -41018 14044 -117424
11960 -158890 -4979 -58369 -168004 -214568 99991 -5965 -160813 -174001 261860 -184946 71087
11948 -410914 -316966 -56592 -29881 -405350 -275155 24882 46631 147049 -261067 -16656 -17006
11937 -17006 147790 248401 19968 -269346 -258553 123035 12969 317093 21360 -190760
11926 114104 -39794 -90417 119791 112926 222576 65797 -216704 84145 -70275 -7546 -10758
11915 -10758 150442 -65199 75468 -103093 12579 37527 79731 202665 32615 41688 -74755
11903 14721 106814 70263 -89813 -403058 -383603 34166 -165425 -308850 -43344 24680 673
11891c93354H4697b72824A31481o86K0547a18319j64107f1190A18725a21884j46225
11880b68109a5925A6711L1810i6405H8949N7482a41421B2428a69799g8351j04840
11869a83191r3852c2413j98428a01823L6240r0936d2610k6410j28760A74847b34198
11857B09332b30345g5001r6775B04093a63667C20877j22624g5826c5359j94192
11847b29551J10244d5854A5719J38206e227k22681m5256I316L15647a32296B9363
11835c58594f2444B76183a67533r5738A1834b9933A21045c32527A89859d7647
11824B85492a81246L0136P2078J1269C068N7207a45084k023j59398H7011a74045
11812A1177b13744q9517B00868J11244c8806k59771Q2490c0710A15135n1142J01885
$$ plain form
11891 -393354 84697 -272824 131481 130795 151342 -118319 -282426 -61190 118725 -121884 -268109
11880 -268109 -15925 16711 48521 -96405 88949 146431 -141421 22428 -169799 -78351 -183191
11869 -183191 -277043 -32413 -230841 -101823 -65583 -156519 -42610 -69020 -197780 174847 -234198
11857 209332 -230345 -75001 -171776 204093 -163667 320877 198253 -75826 -35359 -229551
11847 -229551 -119307 -45854 15719 153925 -5227 -227908 -273164 9316 324963 -132296 29363
11835 -358594 -62444 276183 -167533 -263271 11834 -29933 121045 -332527 189859 -47647
11824 285492 -181246 -151110 -79032 -67763 3068 60275 -145084 -147107 -306505 87011 -174045
11812 11177 -213744 -303261 200868 312112 -38806 -298577 -216087 -30710 115135 63993 165878
11801A65878i837B04920b36452e7450m2520r9717a3968k9365A13524N5022M5033
11790B13579b69466K7323k3474G4321e6280J1838l646B33506b82472E9408a1915
11778C0588a91240E6907a09469A35112m9534c34666i7381j1842p0312B3776Q121
11767C1897J51858H7073j9613f3921G1435K05953H0709a88398L5839B58777G1824
11755a3000A81713q3651M7384a74826H862c66070A80815d5836A41450n7870d05743
11743E0363d00119a1539A37367a56390A19013d3359A73467a39571M3796j13421
11733b09196B23535r3653n2550c4758A5284J69390c24862i1983A37421o3213K86667
11722C60875a66296e5586i509I3785c1428n0145A08379m7758J00608b64394A65347
$$ plain form
11801 165878 -9837 204920 -236452 -57450 -99970 -199687 -13968 -43333 113524 168546 213579
11790 213579 -269466 -242143 -265617 74321 -56280 -44442 -48088 233506 -282472 59408 -11915
11778 30588 -191240 56907 -109469 135112 85578 -334666 -97381 -109223 -179535 23776 31897
11767 31897 183755 87073 67460 -63921 71435 277388 80709 -188398 -152559 258777 71824
11755 -13000 181713 98062 145446 -174826 8862 -366070 180815 -45836 141450 83580 -405743
11743 50363 -400119 -11539 137367 -156390 119013 -43359 173467 -139571 -95775 -209196
11733 -209196 223535 129882 77332 -34758 15284 184674 -324862 -91983 137421 74208 360875
11722 360875 -166296 -55586 -9509 93785 -31428 -81573 108379 60621 161229 -264394 165347
11710b6428B0156N988M23229L9422G3967C930J4462c6861m4596j4087M3048J3771
11698c8725j28682c8871J6143D53660h5775r4834D8261J89281b53866G5476J57443
11687B32919m8019b05162A40531m7964a16561M5175O827E4813B7084g5921c2252
11675c82974D9177J4455a183C48707b20459A60165l8863a7078k2500A61168g5869
11663a43764B77286h549o8032E7421c81B21526A5800M02415F3649b68962D9067
11651h5992A64797q1033O600b0299j58697E7044c37804B95870h4655k77283a72586
11639a13732k2616B58759D8263B760d4618N880k03280i0541m4774B0587a2186
11627e0184B76349e07687C3090e8768M373B36383h4470o0F4797b2612D5648J00627
$$ plain form
11710 -26428 20156 26144 449373 488795 73967 3930 18392 -36861 -81457 -95544 -52496 -38725
11698 -38725 -167407 -38871 -22728 453660 -85775 -180609 48261 237542 -253866 75476 232919
11687 232919 184900 -205162 140531 92567 -116561 -71386 -64559 54813 27084 -75921 -32252
11675 -382974 49177 63632 -1183 348707 -220459 160165 121302 -17078 -39578 161168 -75869
11663 -143764 277286 -8549 -76581 57421 -381 221526 15800 418215 63649 -268962 49067
11651 -85992 164797 83764 90364 -20299 -178996 57044 -337804 295870 -84655 -361938 -172586
11639 -113732 -136348 258759 48263 2760 -44618 -38738 -242018 -90541 -135315 20587 -12186
11627 -50184 276349 -507687 33090 -58768 -54395 236383 -84470 -84530 64797 -22612 45648 146275
11615A46275c71q7778j45137j10483G8751a33461B02073G0780a53305m3000K7883
11604a68422D11931f9383l2776H7488g2815F1984L2392q49O8027a85993a9335
11592g1884A97359J17900j35003L682C1054j509O1893b01035A91856c24803A83004
11580a36673M5871C5236J25096b79967f543j038o5589B10528H9873Q007i7871
11568C17191b66987J25432A8855O581a76822e7658B00178a11534C09573H0932
11557C7862e9214p202C524K13155F1117N119j3874e8554A68863a00498n9610F6432
11544c56028a4748r3305B24724f0144D5089h0781L9520j22526K4972A09602J22994
11533B32596a54702B48482a11287M9905j11928A11946J51051q3993n7803K89936
$$ plain form
11615 146275 -371 -88149 -233286 -343769 78751 -133461 202073 70780 -153305 -196305 -168422
11604 -168422 411931 -69383 -102159 87488 -72815 61984 94376 93527 161554 -185993 -19335
11592 -71884 197359 315259 180256 183938 31054 29545 91438 -201035 191856 -324803 183004
11580 -136673 -90802 35236 160332 -279967 -6543 -7581 -73170 210528 89873 97880 -97871
11568 317191 -266987 -141555 18855 25436 -176822 -57658 200178 -111534 309573 80932
11557 37862 -59214 -66416 3524 216679 61117 66236 52362 -58554 168863 -100498 -160108 66432
11544 -356028 -14748 -108053 224724 -60144 45089 -80781 -41261 -163787 -138815 109602 232596
11533 232596 -154702 248482 -111287 -61382 -173310 111946 262997 179004 121201 411137
11523D11137h3196A15125C655f8701I2450b4728A06957a78661A16062J15122I5185
11511D26783a38376G2482a52635B59153D2318J3074J1297L5212L1773h117A12419
11499d50072G0122P0840M380D3629J04282j8394k2454J59234M0055E7018A3830
11487A74881E3592J72397g9997B1060N460J65854M6326H337a57083C3637K39625
11476B73262a46566D12942j89937J20237A65761O7653J99655A37245J2079a5513
11465I7023b59487C5659J2987f2410A80264p0090R0330n3453P6799H9443l5479
11454E3964J41500n7284I835K3128a1972A34795n989B2404K57668B8703i887o3306
11442g3193A23507D4146a19770D32012l2543B6256c2833j21023j10953a27277
$$ plain form
11523 411137 -83196 115125 3655 -68701 92450 -24728 106957 -178661 116062 231184 95185
11511 426783 -138376 72482 -152635 259153 42318 55392 66689 101901 133674 -8117 112419
11499 -450072 70122 140962 145342 43629 147911 129517 107063 266297 306352 57018 13830
11487 174881 53592 225989 -79997 21060 26520 192374 238700 8337 -157083 33637 273262
11476 273262 -146566 412942 223005 343242 165761 233414 433069 137245 149324 -15513
11465 97023 -259487 35659 48646 -62410 180264 110174 200504 147051 223850 89443 53964
11454 53964 195464 138180 9835 32963 -11972 134795 128806 22404 280072 28703 -9887 -73193
11442 -73193 123507 44146 -119770 432012 399469 26256 -32833 -153856 -264809 -127277
11431B4366b7488B03378B5845J7928b45205A4861a44234A27329b10068E0789a01423
11419c8165a7395E1135b98034a27038G5156K6205c88078A75260g9397F6420c22881
11407A81549a98497A0980J94228n3984J63763I321e5901n2970m25443a45940B8755
11395B41224D8690h4871A13414c505n254A32847m9911a42647A46676a92439h3737
11383B22967N0918E5430k0433a72464I6821J68401H3434J3167a35720a1118B07340
11371A10015B4332J26774a08575j01664A0230b43163H2339e305j14234A7807a30921
11359A9369d8639A09006a18600a876B41264b40372C1425K6279B8258Q4975m2943
11348G0290B1141J07099A2987f4798k9853k20424G6471d2710k14052N9307A56652
$$ plain form
11431 24366 -27488 203378 25845 43773 -245205 14861 -144234 127329 -210068 50789 -101423
11419 -38165 -17395 51135 -298034 -127038 75156 101361 -388078 175260 -79397 66420 -322881
11407 181549 -198497 10980 205208 151224 314987 9321 -55901 -108871 -534314 -145940 28755
11395 241224 48690 -84871 113414 -3505 -8759 132847 82936 -142647 146676 -192439 -83737
11383 222967 273885 55430 34997 -172464 96821 265222 83434 96601 -135720 -11118 207340
11371 110015 24332 151106 -108575 -210239 10230 -243163 82339 -5305 -119539 17807 -130921
11359 19369 -48639 109006 -118600 -1876 241264 -240372 31425 57704 28258 113233 70290
11348 70290 21141 128240 12987 -64798 -94651 -315075 76471 -42710 -256762 -197455 156652
11336a28661N0010b080A36021B7116e2858J9931j56025k42510A26068K48124a52173
11324b9821j13140I1778d2470l1151j53617P2883j32645f1863D769a9213A0246
11312E7349d0348k72746J22298k9585a07526l33404A03096m529F835a16976k48622
11301c65598A14986a78226k0012B14277b90301i7250B8788J4207A8120B865d86267
11289a62943B26412b18126h3822D7419b77073B95689i7316l6322q0617A48497
11278H9340K3856a62906j01751F2457b75339a03437C46164b96412E3561K39976
11268B93537a00597E6484K5426h1957k3751j54397P3524r8293G7007J14274C4762
11256a93116D3155a72923b7725A1748a82974N0548A04330b67953f0153A67696
$$ plain form
11336 -128661 -78651 -2080 136021 27116 -52858 -32927 -188952 -431462 126068 374192 -152173
11324 -29821 -142961 91778 -42470 -73621 -227238 -154355 -287000 -61863 4769 -19213 10246
11312 57349 -40348 -313094 -190796 -220381 -107526 -440930 103096 98567 6835 -116976 -365598
11301 -365598 114986 -178226 -198238 214277 -290301 -97250 28788 42995 18120 2865 -486267
11289 -162943 226412 -218126 -83822 47419 -277073 295689 -97316 -133638 -214255 148497
11278 89340 113196 -162906 -264657 62457 -275339 -103437 346164 -296412 53561 293537
11268 293537 -100597 56484 81910 -81957 -105708 -260105 -186581 -284874 77007 191281 34762
11256 -193116 43155 -172923 -27725 11748 -182974 -132426 104330 -267953 -60153 167696
11245A13412b22990E3498i2358p8781j12815a31414I5842c6840j79049m2363h5376
11233e6173A18426k2142f9888k09042g1644j7545j53633n7435a10308M2686l3460
11222a01082I858e4588l3617m2122j42240a19167G2390c0003C6645J1524J25191
11211A73360a06117j81829f5823j33753F959R7818E208M0325d86921b12651G5773
11199C95a78126A89643a02897B10509g0791l65406A70664a02493n4787k0514O5607
11188a12187p7829B7960K19371a91311i3086A1236c23400K8955B72688A2803e8055
11176b67777G5920d3285k640j05552o9364B73725a91688c1881j11580r3024L9554
11165a96931B8724d8839n800l9851d0037j53030q9819h6810j82667Q1899K9745
$$ plain form
11245 113412 -222990 53498 -92358 -171139 -283954 -131414 95842 -36840 -215889 -258252 -85376
11233 -56173 118426 96284 -69888 -278930 -71644 -89189 -242822 -300257 -110308 -67622 -101082
11222 -101082 9858 -54588 -88205 -130327 -272567 -119167 72390 -30003 36645 48169 173360
11211 173360 -106117 -287946 -65823 -199576 6959 104777 5208 45533 -486921 -212651 75773
11199 395 -178126 189643 -102897 210509 -70791 -436197 170664 -102493 -157280 -177794 -112187
11188 -112187 -190016 27960 247331 -191311 -93086 11236 -323400 -294445 272688 12803 -58055
11176 -267777 75920 -43285 -45925 -151477 -220841 273725 -191688 -31881 -143461 -236485 -196931
11165 -196931 28724 -48839 -54639 -94490 -40037 -193067 -282886 -86810 -269477 -187578 -157833
11154a57833g8805B24580r3985a23691K9524j78865j20279A61404j8876a78537
11143b21216A3016c08490A2957c49120a12925F1621J30265j164p291a19135A99362
11131i7838j1755A56898L1803D4273J29375J26528n6520b25529a0088l2476j77176
11120b19740C04223j10353a06557F7457a59560B91334C3320i536j51600C06019
11109f8062G9676B409g2829C63596k4019b54913f0184A75277C5223L87318C209
11097h435m5885j36214K6770A14686L21751g2842A28431l7194f2663A29384b13123
11085E63742A09277i2292A62029K45914j46247J6844j8772D8497r297i3129a3734
11073i4308A42959J26533b2941B48251j05890K39018j32768Q366k1877p0035J29564
$$ plain form
11154 -157833 -78805 224580 130595 -123691 -94167 -273032 -393311 161404 142528 -178537
11143 -221216 13016 -308490 12957 -349120 -112925 61621 191886 190722 183431 -119135 199362
11131 -97838 -109593 156898 188701 44273 173648 300176 243656 -225529 -10088 -42564 -219740
11120 -219740 304223 193870 -106557 67457 -159560 291334 33320 -9536 -161136 306019
11109 -68062 79676 2409 -72829 363596 339577 -254913 -60184 175277 35223 422541 3209
11097 -8435 -54320 -190534 -163764 114686 436437 -72842 128431 91237 -62663 129384 -213123
11085 563742 109277 -92292 162029 407943 261696 278540 259768 48497 39200 -93129 -13734
11073 -94308 142959 269492 -22941 248251 142361 381379 248611 256977 235100 165065 294629
11062B94629j16758J41338J27689L796A53510J53703R9381k5535M67912C22811
11051C13550j28983L32210L4740p9902K08281k8064P955o8165N0482o3181N5642
11040F34565B11394L22482j52044O0241K08441j34791K12416B73949Q5199J28909
11030D88057k04684K04066K614Q7716L1446B24644F8020M30855k29094K65195
11020E34976n8012G2251M08294K06524k26499r4108K76456I6252J05533L47603
11010E49388B11392N8220J47865r3435J39718K68166j98648j48189r2694R1436
11000C83831n9908K5615J34858L05206A86537L60122J25227j99016o3111J27064
10990E36823J6261K26960k35037K90449B30710L26454J59588k71719J52225J41559
$$ plain form
11062 294629 177871 319209 446898 450694 153510 307213 406594 381059 848971 322811
11051 313550 184567 516777 551517 471615 679896 651832 659787 591622 642104 578923 634565
11040 634565 211394 533876 381832 442073 650514 515723 728139 273949 359148 488057
11030 488057 283373 487439 490053 577769 609215 224644 68020 498875 269781 534976
11020 534976 476964 72251 480545 687069 460570 366462 642918 96252 201785 549388
11010 549388 211392 269612 417477 324042 463760 731926 533278 385089 292395 383831
11000 383831 323923 349538 484396 789602 186537 546659 671886 472870 409759 536823
10990 536823 553084 780044 545007 835456 230710 557164 716752 445033 597258 738817
10980G38817L1011K45043M5121m0745p6111K77340J30442K27281K27541N3970
10970A859710p9100N6186L9152k75722q9311K15134m52405k96233j67694K99180
10960A108897M7249j40483n6478K04112j73051k0043q6630P1425R1350j9425k94019
10949G32904J36197j07429B73588L14662k82067J71173K9502B10606a20978D82388
10938h919C53378K7987D0107b50769A17769J64299A32566a79723a7304n9436A84413
10926a57713b9645I7032c35601B50200G7273a15049H6398i3796C435N4979g96
10914c1871C12349D2562j0081b66838A52064a57986A76581b01068A59287j6613
10904A42674C8814P1619J5022a4317l01403B6705a92035G4828A7414K2340J11042
$$ plain form
10980 738817 769828 1014871 1059992 1019247 943136 1220476 1350918 1578199 1805740 1859710
10970 1859710 1780610 1836796 1875948 1600226 1510915 1726049 1273644 977411 809717 1108897
10960 1108897 1156146 1015663 959185 1163297 990246 970203 883573 954998 1046348 1026923 732904
10949 732904 869101 761672 273588 588250 306183 477356 506858 210606 -120978 482388
10938 -8919 353378 381365 40107 -250769 117769 282068 132566 -179723 -17304 -76740 184413
10926 -157713 -29645 97032 -335601 250200 77273 -115049 86398 -93796 3435 58414 -796
10914 -31871 312349 42562 32481 -266838 152064 -157986 176581 -201068 159287 142674
10904 142674 38814 110433 125455 -14317 -315720 26705 -192035 74828 17414 39754 150796
10893A50796f3247j06768h1509B59807a09776M0708a94o2309E6444b39448A19507
10881G5130J40903f5775B48595a79950B64747b14398f7239j62209J07791c8398
10870a2343F6682B6238J42326E5026b22439a03688D7139J37476a46395F738b35249
10858f0916j39826B91656c71201B53713p7265n3565b93908P5393a9883j39112
10848a58995P2511q3925P6830o3668A34885L9153j4618a32016j463k90367Q7143
10837c36703a43097J3045e0218K0495B3712b91916B15635a6689C18811o9987A610
10825b16671A29037n0253C1636a12306A07197a02329M8727K5974I1860J53383
10815B45243H307J49604B1330e0145k44068A61842i3080B24235c24618I7846J32306
$$ plain form
10893 150796 -63247 -170015 -81509 259807 -109776 -69068 -194 -62503 56444 -239448 119507
10881 75130 216033 -65775 248595 -179950 264747 -214398 -67239 -229448 -121657 -38398
10870 -12343 66682 26238 168564 55026 -222439 -103688 47139 184615 -146395 6738 -235249
10858 -60916 -200742 291656 -371201 253713 176448 122883 -293908 -218515 -19883 -158995
10848 -158995 -86484 -170409 -93579 -157247 134885 174038 159420 -132016 -133479 -423846 -336703
10837 -336703 -143097 -130052 -50218 -29723 23712 -291916 215635 -16689 318811 248824 1610
10825 -216671 129037 78784 31636 -112306 107197 -102329 -53602 -27628 91860 245243
10815 245243 8307 157911 21330 -50145 -294213 161842 -93080 224235 -324618 97846 230152
10804B30152p7932p1294a35492d5980A04611K51973j3008j58623h5239K261o0420
10793a43398j05502E5119A3933K40544A09584M3003J91210h6132j54115D4865
10782i9687D4463O743a74537n4928H2909l9079a44093B22387b07D3914h425q5556
10770i3981B50216o8773b88841g4145H3517c03220d7968j43584l3313J07460k60585
10759c77990A04434m6229b81072J27601q2983A10113b31380A48834b83542F0488
10748a35448F5052b5369A12789n4211f446j31783M9919j14081A69319B5982L9317
10737F5299J32010a62002O44B66562d5481F1291a83475f9282j00288C5664j2894
10726B2770a12571R180j65960a7873E2577b81794B04099b57177n3831J30341b9637
$$ plain form
10804 230152 152220 80926 -135492 -45980 104611 356584 343576 184953 -85239 -82978 -143398
10793 -143398 -248900 55119 13933 254477 109584 152587 343797 -86132 -240247 44865
10782 -99687 44463 51206 -174537 -229465 82909 43830 -144093 222387 -207 43914 -8425 -93981
10770 -93981 250216 181443 -288841 -74145 83517 -303220 -47968 -191552 -224865 -117405 -377990
10759 -377990 104434 58205 -281072 -153471 -236454 110113 -231380 148834 -283542 60488
10748 -135448 65052 -25369 112789 58578 -6446 -138229 -88310 -202391 169319 25982 65299
10737 65299 197309 -162002 -161358 266562 -45481 61291 -183475 -69282 -169570 35664 22770
10726 22770 -112571 -103391 -269351 -17873 52577 -281794 204099 -257177 -311008 -180667 -29637
10714a04858j02532l9142K3846J03091a7727k04246C0699g8180k2644B5097a8011
10702A4899c0235q5001e0897b2444m0971k1767k39097A02398b13241P9603A40178
10690c15353e1047r0855I3126J58353a73283a146A26496J29484F9949b23688C90904
10678a3822j00506A13843a39077f8536A96224c08426c3793C2202b23014k62276
10668d85290a22463A26786i2911m0172A13111A5435J03208a5155E3134a78555
10657a47164A16587a56327k11054A05418k6878f6548q0341e0566l69512L3397
10647c86681a51722c0557k12960n4190C801L39041F2652K7864A4714f3230B0271
10635a82281A38880D5377J14701A3811P8806c33233d517j14006n1319k3317L4602
$$ plain form
10714 -104858 -207390 -246532 -222686 -119595 -17727 -221973 30699 -78180 -100824 25097 -18011
10702 14899 -30235 -115236 -50897 -22444 -63415 -85182 -324279 102398 -213241 -133638 140178
10690 -315353 -51047 -141902 93126 251479 -173283 -1146 126496 255980 69949 -223688 390904
10678 -13822 -114328 113843 -139077 -68536 196224 -308426 -33793 32202 -223014 -485290
10668 -485290 -122463 126786 -92911 -133083 113111 15435 118643 -15155 53134 -178555
10657 -147164 116587 -156327 -367381 105418 78540 -66548 -146889 -50566 -420078 -386681
10647 -386681 -151722 -30557 -243517 -297707 3801 342842 62652 90516 14714 -63230 20271
10635 -182281 138880 45377 160078 13811 92617 -333233 -4517 -118523 -169842 -193159 -158557
10624a58557b9328l38706G0718a66446d6258j27509K5471A02476a4215j0442k47144
10613b71801A70650J51068A12591J93484b61870h5332j98301c5306j58384B00054
10602B1224Q8285A8259J7302O3255b5032f552k73804A09329a27592j12338N9719
10591a80211M2551c6816B15481P2034F751g3895A98186E3791Q68c8704k56962
10580b95666c7179D9322a29409c0937q5135r0212j34910A05388C5279a19114B8436
10568B01170b61297A47014a48793A98211a82546H6047L8705a78173c5300F20993
10557g4750J4887j89454G8155b86333R6578j60927a0440B8345g7624D07535A59921
10545G0976a41692A66913B3689N6146a05443l071A70378m2021L3921g2076B76126
$$ plain form
10624 -158557 -29328 -368034 70718 -166446 -46258 -173767 -148296 102476 -14215 -24657 -271801
10613 -271801 170650 321718 112591 306075 -261870 -85332 -283633 -35306 -193690 200054
10602 21224 109509 18259 35561 98816 -25032 -6552 -280356 109329 -127592 -239930 -180211
10591 -180211 -137660 -36816 215481 287515 6751 -73895 198186 53791 54659 -38704 -295666
10580 -295666 -37179 49322 -129409 -30937 -116072 -206284 -341194 105388 35279 -119114 28436
10568 201170 -261297 147014 -148793 198211 -182546 86047 124752 -178173 -35300 620993
10557 -74750 -59863 -249317 78155 -286333 -189755 -350682 -10440 28345 -77624 407535 159921
10545 70976 -141692 166913 23689 79835 -105443 -108514 170378 128357 162278 -72076 276126
10533e08715a30558A24998b7931F2222O0616B580a10486A40730n4642R0811H5575
10521b68792a25550A09221a27537j8007l08366a1389m49450h4604k23157H5020
10510h5719j46922Q8096j44422G625J03362n3110b78473J13804j08462O3806r8794
10499c08119B87078a22304l1405k52755a09977e061n6772l0364G5640J87879j137
10488B62382i983A75144Q5756m0909p7719k2325M51118q0790J19659k13760F0388
10476c111C09377a12548J1375A4521c1792E1054a32009j6907A21704a03172A9864
10464B5625b70631a02704k3471B55453A3230a00495L1691k6530l5153l1266O8013
10453i3740l58514A822c01761a08771C69727A55750H790J67207d6174j64532A1740
$$ plain form
10533 -508715 -130558 124998 -27931 62222 122838 2580 -110486 140730 86088 176899 85575
10521 -268792 -125550 109221 -127537 -145544 -453910 -11389 -460839 -84604 -307761 85020
10510 -85719 -232641 -144545 -288967 7625 110987 57877 -278473 -164669 -273131 -209325 -308119
10499 -308119 287078 -122304 -153709 -406464 -109977 -5061 -61833 -92197 75640 263519 262382
10488 262382 -9983 175144 260900 219991 142272 119947 571065 490275 609934 396174 60388
10476 -3111 309377 -112548 -101173 14521 -31792 51054 -132009 -148916 121704 -103172 19864
10464 25625 -270631 -102704 -126175 255453 13230 -100495 -68804 -95334 -130487 -161753 -93740
10453 -93740 -452254 1822 -301761 -108771 369727 155750 8790 175997 -46174 -210706 11740
10441A21509L2048K7409h0548j861A8180K3348b0119B6974P0151a33500q9488
10430b22988e4889l17750A27166n0728a50244j53981a37906j26767P1784g9429
10419h1256F1580b03307R1800C3918J9814c0026k08959E455J99441b11526B40226
10407c08836A25726K2299D4895b00112F2701b49933l98381E9504a38918c6350
10396c58076A38952E2926a74389E445J93628E1678J32303b2149H8882a97279D8558
10384a52454A06097b64312O1512A06177a81730B6051K87731A44394A152J19888
10374A21040l7897j7448K23934n4882P2894j36688L28314b6167B60267j00818
10364A59449K45621H2822b3751A7392K41011L2291L5250G0284q621J32878L7335
$$ plain form
10441 121509 153557 180966 -80548 -82409 18180 41528 -20119 26974 97125 -133500 -222988
10430 -222988 -54889 -372639 127166 76438 -150244 -304225 -137906 -264673 -192889 -79429
10419 -81256 61580 -203307 -111507 33918 53732 -30026 -238985 5455 204896 -211526 240226
10407 -308836 125726 148025 44895 -200112 62701 -249933 -648314 59504 -138918 -36350
10396 -358076 138952 52926 -174389 5445 199073 51678 183981 -22149 88882 -197279 48558
10384 -152454 106097 -264312 -202800 106177 -181730 26051 313782 144394 1152 121040
10374 121040 83143 65695 289629 234747 307641 170953 499267 -26167 260267 159449
10364 159449 405070 82822 -23751 17392 258403 290694 325944 70284 61663 194541 231876
10353B31876J8371b52057H5369K723J78357K06963A41785k6230J63650A29102
10342d457B08691K57951Q3795G1463K03543f518B915a15350d5977n6710B41095
10330C82046h6227p2788f575C49425g159A22492k6426M4480E5232Q117N2295c3125
10317A90466A0727b61672B20498e5091n0517A4254m019g8552E1102J3127M3846
10306A08075k9564K83474M3567A0959h6597A96328a94877A03959K32886b04448
10295B13953a87348m4168m6323A03161a86936F5004a75420C06029A03923a91156
10284A73175a16511a4529k3360B9271a03672H7964b19885H6561d5533B20709a29969
10272h4311o4648d7351m2425F9457b44410G9096Q274b51610F3063e9729D4544
$$ plain form
10353 231876 250247 -252057 85369 88092 266449 473412 141785 115555 279205 129102
10342 -4457 208691 466642 550437 71463 275006 -6518 2915 -115350 -45977 -102687 241095
10330 382046 -86227 -159015 -6575 349425 -7159 122492 96066 140546 55232 63349 115644 -33125
10317 190466 10727 -261672 220498 -55091 -105608 14254 10235 -78552 51102 64229 108075
10306 108075 78511 361985 405552 10959 -86597 196328 -194877 103959 336845 -204448
10295 213953 -187348 -231516 -277839 103161 -186936 65004 -175420 306029 103923 -191156
10284 173175 -116511 -14529 -37889 29271 -103672 87964 -219885 86561 -45533 220709 -129969
10272 -84311 -148959 -47351 -89776 69457 -244410 79096 87370 -251610 63063 -59729 44544
10260A32860n432a7070F2652K31915j31767f8601A61147n8084Q2583c9356l47739
10249c87095a87376n4141B2084a23815E3627A9739a01007C3087b98035A21937
10238D7801J09483J16156c73655J39902J04416j90635a48638g4121L1483p7075
10228a19713N2124a6060E5174e2558k16430A56634a55673M0850G0675N2635a28517
10216d8537l8039A93298e0563A90857a65246j18226e809A17001b58377g5807m05724
10205d81531g0607I5588b36687A43435n3312e9613n8719L7597j09734K5722D2971
10193a01608R542A45675a50935b7292A20955P0096c24084A75062h6892m0733D881
10181h2250k49657a14471A43782a55729F8404f3609K943p6364k9781B5640E354
$$ plain form
10260 132860 127428 -17070 62652 294567 162800 -68601 161147 103063 185646 -39356 -387095
10249 -387095 -187376 -241517 22084 -123815 53627 19739 -101007 33087 -298035 121937
10238 47801 157284 273440 -373655 -233753 -129337 -319972 -148638 -74121 -42638 -119713
10228 -119713 -67589 -16060 55174 -52558 -268988 156634 -155673 -114823 70675 123310 -128517
10216 -48537 -86576 193298 -50563 190857 -165246 -283472 -5809 117001 -258377 -75807 -481531
10205 -481531 -70607 95588 -236687 143435 90123 -59613 -118332 -80735 -190469 -164747 42971
10193 -101608 -92066 145675 -150935 -27292 120955 191051 -324084 175062 -86892 -127625 4881
10181 -82250 -331907 -114471 143782 -155729 68404 -63609 -60666 -137030 -166811 25640 5354
10169b32258d2929A2861J41673G2358a50616j44305a47198P2127A58039K16953
10159C74992A30091l9902j4152a80327a2565j53513O239A91324a31718r2054a9456
10147b69482o4767E8451K11478e3173j90992P394M3149B2235Q72c47126c1840
10135D73003A02115J07530a22153A87006a34940B45329J6616e7149k520B09805
10124a85353A85077f9891k03600A19719a51340J0224q2220B3618L4138i1387D11480
10112A43157a03942j21513A59560a57935k48677A33324A2910b22256N8551A48364
10101F146K93393j25320a73596A81469K0810r2741b05311a593l75091e2091a2147
10089A385a88692b6817j64763g0817a8913q6300B44784l5923b42908b9081n5745
$$ plain form
10169 -232258 -42929 12861 154534 72358 -150616 -294921 -147198 -75071 158039 374992
10159 374992 130091 90189 76037 -180327 -12565 -166078 -159839 191324 -131718 -223772 -19456
10147 -269482 -334249 58451 269929 -53173 -244165 -236771 -193622 22235 23107 -347126 -31840
10135 473003 102115 209645 -122153 187006 -134940 245329 261945 -57149 -59669 209805
10124 -185353 185077 -69891 -273491 119719 -151340 -141116 -223336 23618 57756 -91387 411480
10112 143157 -103942 -225455 159560 -157935 -406612 133324 12910 -222256 -163705 148364
10101 6146 299539 174219 -173596 181469 202279 109538 -205311 -1593 -376684 -52091 -12147
10089 1385 -188692 -26817 -191580 -70817 -18913 -105213 244784 208861 -242908 -29081 -84826
10078h4826G3587a4518l08907a05460e62j01138q3884L1116G5464J50586a59739
10066b05191D1959c16417O7334P4488f7593r2766m1506j05942A3640J2160f1665
10054b54958J27380n4140b8478I6967a22456j00830g3704k93430Q4993J29175
10044a52966a1163j17389j0351E2321J34119f9635F303a94153R513h5086l1695
10033a16781E3560a0388k17092A18472f1251A31762j8183e5665l43085a58271
10022A31840f4674k0272E2130b17345i3729D0715c44560B15877g4920q7278B03332
10010b94908g9653B49030c23593A07770b18570d9676a0969A23909b50320D3715
9999c8883a3535k2976q4873j9155I2237e7140C7089J313f8482D5469a29831G5290
$$ plain form
10078 -84826 73587 -14518 -323425 -105460 -562 -101700 -185584 -154468 75464 226050 -159739
10066 -205191 41959 -316417 -249083 -174595 -67593 -160359 -201865 -307807 13640 25800 -61665
10054 -254958 -127578 -181718 -28478 96967 -122456 -223286 -73704 -367134 -282141 -152966
10044 -152966 -11163 -128552 -138903 52321 186440 -69635 6303 -194153 -184640 -85086 -116781
10033 -116781 53560 -10388 -227480 118472 -61251 131762 113579 -55665 -398750 -158271
10022 131840 -64674 -84946 52130 -217345 -93729 40715 -344560 215877 -74920 -162198 203332
10010 -294908 -79653 249030 -323593 107770 -218570 -49676 -10969 123909 -250320 43715
9999 -38883 -13535 -36511 -121384 -140539 92237 -57140 37089 38402 -68482 45469 -129831 75290
9986A08897d1409k26466a04764p1695B22905f8372J6035D3228c67393P8804E9115
9974c25978f906C13782F9245a71F2712J59997a88686b9119D32098j71854C3176
9962b36932e5904m5640H9755B3978Q1884b6492k92198F0358c5585l93850c5969
9950A71338b19493d8772A30918O3952a03422E175a05334b3856l27473a25857k1810
9939a47667n335M1005K6408j26475l6391i9291j7983A9514a5861E8429b88498
9927a60125A03278h1728n06367a1060k47270B2212J01470b41142B75877d16575
9916b20533a6952n0740A61355d16191a81937d7642C24071a66075j7047b3342F6047
9904I9258a00817e845A18328b6572L351A26876g0087k0956k43467J17013B47107
$$ plain form
9986 108897 -41409 -267875 -104764 -176459 222905 -68372 -52337 43228 -367393 -288589 59115
9974 -325978 -6906 313782 69245 -171 62712 222709 -188686 -29119 432098 260244 33176
9962 -236932 -55904 -101544 89755 23978 105862 -26492 -318690 60358 -35585 -429435 -35969
9950 171338 -219493 -48772 130918 194870 -103422 5175 -105334 -23856 -351329 -125857 -147667
9939 -147667 -153002 -111997 -85589 -212064 -248455 -99291 -117274 19514 -15861 58429 -288498
9927 -160125 103278 -81728 -588095 -11060 -258330 22212 123682 -241142 275877 -416575
9916 -220533 -16952 -67692 161355 -416191 -181937 -47642 324071 -166075 -183122 -23342 66047
9904 99258 -100817 -5845 118328 -26572 -23221 126876 -70087 -91043 -334510 -217497 247107
9892a86529j50170J64144J6193L9872B42830P3802a17296E2405a86281O3349l01764
9881d24696h4349o9582M5704o74I1435c11611i0202n2203k02333e4937A2844Q2325
9869I5169J02339a11368k1089c4481j06128A44672c11340q3513C19943b30061
9858a58224K3382k8244K6222o0873A33710J28197A0188g279m9777p012A48554
9846A22088m090a75427O7501D0894d2813J9581I0338a33843j28233h0869C34700
9834i0536n7537K3002a1181l9045A87607b83286b1939B45717G0592J83455d0373
9822b58834A34507a79717g8573j88966J17322j23806A78730d48079a34384A35337
9811g6720k30020A39981a1274j0901H9003J69441I2947H781a12772r450A25a54760
$$ plain form
9892 -186529 -336699 -172555 -156362 -116490 242830 316632 -117296 52405 -186281 -122932 -424696
9881 -424696 -84349 -153931 -108227 -108901 91435 -311611 -90202 -142405 -344738 -54937 12844 95169
9869 95169 197508 -111368 -132457 -34481 -140609 144672 -311340 -394853 319943 -230061
9858 -158224 -134842 -163086 -136864 -197737 133710 261907 10188 -7279 -57056 -64068 148554
9846 122088 117998 -175427 -107926 40894 -42813 -23232 90338 -133843 -262076 -80869 334700
9834 -90536 -148073 -125071 -11181 -50226 187607 -283286 -21939 245717 70592 254047 -40373
9822 -258834 134507 -179717 -78573 -267539 -150217 -274023 178730 -448079 -134384 135337
9811 -76720 -306740 139981 -11274 -22175 89003 258444 92947 8781 -112772 -122222 125 -154760
9798a65683A5178M3641h7815l8017g269k81920C1881h8142J0286J3018q4516A43754
9785a76809h741A72458k5161b08351A44297d4231m5225c0852A18361L51136G9458
9773A6282a90650A01503K00631c45736P741A08095c14256k193D4743r170P8617
9762A14190b01585L0983J6069I0374c5873j73006B86052a83796a186A71475K4265
9751A95740B6637a76944A44473a40118j1614l7751c1118l3530B3520N5012b41919
9739a35754j14535a00216H5765e4682j28332D882N8453h6927j6128B28345f8942
9727e9491k91737B64014b11530C34784d1173G7802f2030H0490c05298J45623j19028
9716b78703J11951g4287q0287A42476i2319B11322b62579E1608c1666l00113c4686
$$ plain form
9798 -165683 15178 58819 -87815 -125832 -7269 -289189 31881 -88142 -77856 -64838 -149354 143754
9785 -176809 -8741 172458 147297 -208351 144297 -44231 -89456 -30852 118361 469497 79458
9773 16282 -190650 101503 302134 -345736 -337995 108095 -314256 -316449 44743 35573 114190
9762 114190 -201585 -170602 -154533 90374 -35873 -208879 286052 -183796 -1186 171475 195740
9751 195740 26637 -176944 144473 -140118 -151732 -189483 -31118 -64648 23520 78532 -241919
9739 -135754 -250289 -100216 85765 -54682 -183014 4882 63335 -86927 -103055 228345 -68942
9727 -59491 -351228 264014 -211530 334784 -41173 77802 -62030 80490 -305298 -159675 -278703
9716 -278703 -166752 -74287 -154574 142476 -92319 211322 -262579 51608 -31666 -331779 -34686
9704i3990q4758L0730I4978J33689d15994J53976a21684d1879B36153e36264b02488
9692H8913i732p7455A04629A9429b38844M5928E5315K4674J53095a92543N5758
9681a36785a0050G3275g0610j72222f9477m1127K6084k58101d3630j35937Q275
9670a71292P7648C26771c88A01935l9170Q1608a75408f8277j96048A22936g6918
9658B0667K12823A02767a75707L4400L7439l85256a02810j52040A72076a31439
9647D984a36797A18055L6796e7045F328a17750c5271B03755j8154c92873J1987
9636c80886f4847d181B4416b15149A63380a37476C19445a50726r4842I6942J10506
9625B07448b94111D44778a33372A16155c7636E2989b33449I4196f8187r3055H2275
$$ plain form
9704 -93990 -178748 -148018 94978 228667 -415994 -262018 -121684 -41879 236153 -536264 -202488
9692 88913 -9732 -87187 104629 19429 -238844 -192916 55315 79989 233084 -192543 -136785
9681 -136785 -10050 73275 -70610 -242832 -69477 -110604 -84520 -342621 -43630 -179567 -171292
9670 -171292 -93644 326771 -388 101935 62765 144373 -175408 -68277 -264325 122936 -76918
9658 20667 233490 102767 -175707 -141307 -103868 -489124 -102810 -254850 172076 -131439
9647 4984 -136797 118055 154851 -57045 6328 -117750 -35271 203755 185601 -392873 -380886
9636 -380886 -64847 -4181 24416 -215149 163380 -137476 319445 -150726 -245568 96942 207448
9625 207448 -294111 444778 -133372 116155 -37636 52989 -233449 94196 -68187 -161242 82275
9613b72251i1778C1030a55538a8566I6622J7493g3550r1063j56011G6945b84380
9601b13868h765C22420a53404j1591E2685a17407k09480A60619k9860a1967M403
9590g564j06085J7777q3649q3128d6979q4397G4111a28890e7017N838C12146a243
9577c97503a0913l21653A51933c186p5790o6688o8383C09510c92013C75020a21203
9565a54922A63265j9703C8027f0224j51842A28086b59387B03806a59988B05937
9554a46860C20633C7423L8634K7486b62463n7346E6530j3695b13226h7300A3116
9542B40370E8340a65102A13479Q6276b24591f0499j51033a99p1327A03667b53377
9530b19811A1547J9707a6051L66B59803B0101a46401C24559i106q7316b388k9320
$$ plain form
9613 -272251 -91778 31030 -155538 -18566 96622 114115 -73550 -164613 -320624 76945 -284380
9601 -213868 -8765 322420 -153404 -164995 52685 -117407 -326887 160619 130759 -11967 -7564
9590 -7564 -113649 -95872 -179521 -262649 -46979 -131376 74111 -128890 -57017 -51179 312146 -1243
9577 -397503 -10913 -332566 151933 -3186 -78976 -145664 -214047 309510 -392013 375020 -121203
9565 -154922 163265 143562 38027 -60224 -212066 128086 -259387 203806 -159988 205937
9554 -146860 320633 37423 76057 103543 -262463 -319809 56530 42835 -213226 -87300 13116
9542 240370 58340 -165102 113479 199755 -224591 -60499 -211532 -199 -71526 103667 -253377
9530 -219811 11547 31254 -16051 -15685 259803 20101 -146401 324559 -9106 -96422 -2388 -31708
9518c1708r5783G2531a78718j03890l1338a13525A77630a79872A67569D7947d0148
9506F8487b78208b8023q4115j74404Q3881e8941j27997F1695h5513j61464A38458
9494a97614B30140E3293Q8731g4813j04340B49777E3767a9878D1712b53627Q5711
9483a67916m3446C01403b49232I6787A9801d7211k07058q2258J29589j06C5224
9471e22937A79091B2268L4682B6228J3872m748c5025k8930C17328b24233H6946
9459C6856J54185G1005K49052a15253J2518a5133A4679b22481M5110f4171F6491
9447D9522f5199A3673c18392l1566a50537o222d896E5593J57480q5163h2172G1731
9434i0179R95K5679k80372f8022B22151a13866G0313h6247A45184p2080i8096
$$ plain form
9518 -31708 -127491 72531 -178718 -282608 -313946 -113525 177630 -179872 167569 47947 -40148
9506 68487 -278208 -28023 -112138 -286542 -202661 -58941 -186938 61695 -85513 -246977 138458
9494 -197614 230140 53293 142024 -74813 -179153 249777 53767 -19878 41712 -253627 -167916
9483 -167916 -211362 301403 -249232 96787 19801 -47211 -254269 -336527 -206938 -207044 35224
9471 -522937 179091 22268 56950 26228 40100 35352 -35025 -63955 317328 -224233 86946
9459 36856 191041 71005 320057 -115253 -102735 -15133 14679 -222481 -177371 -64171 66491
9447 49522 -65199 13673 -318392 -349958 -150537 -156759 -4896 55593 213073 127910 -82172 71731
9434 -90179 -89184 -63505 -343877 -68022 222151 -113866 70313 -86247 145184 73104 -98096
9422f8252E489c34179A64797h9429j70872O3061n666f6406F1036h7658J77j49061
9410b36542e2141F1072C28a30801A3024b68378h7657G312J45324g797A89183A2290
9397a83171O7555q646A5068f8126j56974H8588j9064A7178f2433A17838l381a00329
9384b01124C85247A24204d3272A62080b20709g6934J909j59160g6100F8162c10401
9372E1565d5837m5623k0300I2652g9173M307I896e48723F9551a42057J5540N5089
9360g1428j15753g2968A86437b44856d3617a6340k56265i6464C507a04255A88966
9348B13710q7889a46381B59738b05274j22311d5633k25567q3069A19769c19150
9337C0159b39541J3257A21155b0738k57873a0209E5850K05173b25885A4876a03830
$$ plain form
9422 -68252 5489 -334179 164797 -89429 -260301 -197240 -202906 -66406 61036 -87658 -87481 -236542
9410 -236542 -52141 61072 328 -130801 13024 -268378 -87657 7312 152636 -7797 189183 12290
9397 -183171 -115616 -124262 15068 -68126 -225100 88588 69524 17178 -62433 117838 114457 -100329
9384 -201124 385247 124204 -43272 162080 -220709 -76934 -75025 -234185 -76100 68162 -310401
9372 51565 -45837 -91460 -111760 92652 -79173 -74866 9896 -548723 69551 -142057 -126517 -71428
9360 -71428 -187181 -72968 186437 -244856 -43617 -16340 -272605 -96464 3507 -104255 188966
9348 213710 125821 -146381 259738 -205274 -327585 -45633 -271200 -354269 119769 -319150
9337 30159 -239541 -226284 121155 -20738 -278611 -10209 55850 261023 -225885 14876 -103830
9325i493n8016j12651A12741f5806j58991K7990A62421E0874b49329d6408J1623
9314c4785r601m7978n3405c2066B22686a80831g9517F8240J2780h7057I9546c82780
9301b22069A73184a16237p3325L1528l0713f7884m0789N3324C05076f8180q7165
9290a55345r5195h7603A17902P2359H9059R5542h376o52C753a38431A87177b00798
9277c6237n2145A91884a25714M8837j73016N6740A14938k5984a22723k6822l14599
9266d64144a2622D1242i9892j38625D7293b79469e8344o7704H7800P7524b05895
9254a02701E3361c324A13533J99951r9353a81468f7521A18044a44027J6335a3499
9242F9046j155b25704A04222a01927J9524K677p5460K6877B09188a73231a4483
$$ plain form
9325 -9493 -67509 -180160 112741 -65806 -224797 -196807 162421 50874 -249329 -46408 -34785
9314 -34785 -44386 -92364 -145769 -32066 222686 -180831 -79517 68240 81020 -87057 99546 -382780
9301 -222069 173184 -116237 -189562 -158034 -188747 -67884 -108673 -55349 305076 -68180 -155345
9290 -155345 -250540 -87603 117902 190261 89059 184601 -8376 -9028 3753 -138431 187177 -200798
9277 -36237 -88382 191884 -125714 -76877 -249893 -193153 114938 88954 -122723 -149545 -464144
9266 -464144 -12622 41242 -99892 -238517 47293 -279469 -58344 -126048 87800 165324 -205895
9254 -102701 53361 -3324 113533 313484 214131 -181468 -67521 118044 -144027 -127692 -13499
9242 69046 67891 -225704 104222 -101927 -82403 -79726 -155186 -128309 209188 -173231 -14483
9230c64679B25406Q6202d9465K0328d368A00577a15905B41332a1497j08163A8494
9218h8043d1027j03359e6596D9103a56025B7605j3257J02546K03036H112a17234
9206E5203K6247a22228A0613b17223k8357A35246D7511B0413g242B25239a43845
9194a83261k47304a867A04544e4427b2397B4436a09819M7396r6979p5424c7528
9182b41013O4311I346i5028k64465A61779a24366q3148i5350p2811p2168f9655
9170e6453A09818c6510j05252N451A7831O1051A3994Q1538a88289c0158A66856
9158I2198b5825B92108f4895K6708A8771c69984M3800K2463B45933a65070I940
9146a29161d3602A07407b84217A21615c5396j7016j15276O8058o7801A84214b89933
$$ plain form
9230 -364679 225406 311608 -49465 -29137 -4368 100577 -115905 241332 -11497 -119660 18494
9218 -88043 -41027 -144386 -56596 49103 -156025 27605 14348 116894 319930 8112 -117234
9206 55203 81450 -122228 10613 -217223 -245580 135246 47511 20413 -7242 225239 -143845
9194 -183261 -430565 -1867 104544 -54427 -22397 24436 -109819 -62423 -159402 -234826 -37528
9182 -241013 -176702 9346 -95028 -359493 161779 -124366 -207514 -95350 -168161 -240329 -69655
9170 -56453 109818 -36510 -141762 -136311 17831 78882 13994 95532 -188289 -30158 166856
9158 92198 -25825 292108 -64895 -38187 18771 -369984 -326184 -303721 245933 -165070 9940
9146 -129161 -43602 107407 -284217 121615 -35396 -52412 -167688 -99630 -167431 184214 -289933
9134D6706d3154A12602J1136a44342N0965d2010G2420J59839b9902A35852g736
9122a73073l4018F4177a26514j05027H8726d50140a70909g1098j05547j9999A13091
9110h258j4614C58732B4699Q2865e6483l8575A59173d9312A76058c96614c0683
9098c55401E2732c43986b8477k14601b6990l57362A69150a66964M2625A39245
9087i8486A9950b67593C52929e1723E4777a10707E4575f4876F5091J32958C6258
9075H9347c9248k87312i3441H0202a46963A47773a33960I3292Q4939b44971a7368
9063b1252A06269D4207P7756c29607a44088k95264f7292D20616a21958A00150
9052b21487C6745N2414a2704o6535k8494j46194n0458J03910B5986J81605b25847
$$ plain form
9134 46706 -43154 112602 123738 -144342 -93377 -42010 72420 232259 -29902 135852 -7736
9122 -173073 -207091 64177 -126514 -231541 88726 -450140 -170909 -71098 -176645 -196644 113091
9110 -8258 -22872 358732 24699 107564 -56483 -95058 159173 -49312 176058 -396614 -30683
9098 -355401 52732 -343986 -28477 -243078 -26990 -384352 169150 -166964 -124339 139245
9087 -98486 19950 -267593 352929 -51723 54777 -110707 54575 -64876 65091 198049 36258
9075 89347 -39248 -326560 -93441 80202 -146963 147773 -133960 93292 178231 -244971 -17368
9063 -21252 106269 44207 121963 -329607 -144088 -439352 -67292 420616 -121958 100150
9052 -221487 36745 89159 -12704 -79239 -107733 -253927 -304385 -200475 25986 207591 -225847
9040A15046g4750B0186J27412b02977c4900l1004B64648a36619e099j4560m4312
9029f3971e536o8864J9189k28506a15576p8120R0032M4786j63590B92774a92754
9017f0820j12758P3437A0972K79019E6577d23684A91822g3371J4646B14866b99921
9005a17385a45j20029A28614b72583J31273p6898g5547A03197i2979C3332I003
8993b1147q9762i15A022a5393E1130J70583h4882E07359a57716l1586A30397n7054
8981G3343D219a22804j20430l2114e7069j16986G5934a3032j63856j09466a3000
8969A50440c18600A18567e5682k64043A57645b56361C109i2320B8869c21944c4828
8957c08428a53124B86015b78635a28434D6538K48254d51110g3916m7546I8408
$$ plain form
9040 115046 -74750 20186 147598 -202977 -34900 -65904 264648 -136619 -5099 -19659 -63971
9029 -63971 -5536 -74400 -55211 -283717 -115576 -193696 -103664 -58878 -222468 292774 -192754
9017 -60820 -173578 -100141 10972 289991 56577 -423684 191822 -73371 -58725 214866 -299921
9005 -117385 -145 -120174 128614 -272583 -141310 -218208 -75547 103197 -92979 33332 9003
8993 -21147 -110909 -915 1022 -15393 51130 221713 -84882 507359 -157716 -189302 130397 73343
8981 73343 4219 -122804 -243234 -275348 -57069 -174055 75934 -13032 -176888 -286354 -13000
8969 150440 -318600 118567 -55682 -319725 157645 -256361 3109 -92320 28869 -321944 -34828
8957 -308428 -153124 286015 -278635 -128434 46538 294792 -451110 -73916 -121462 98408
8946a1075h57B64876j00249q178i725A66379b6173B8960a214A35668H747b17798
8933b2981A64870e5570l01435d2248p3681b9729j56070K0136I1809B7921K27939
8922B55860B5367M13957N87387k19457B63581H069g7355j39792f6614A24134a77211
8910a19752r3106C65215G8240g6983C79306A15050l206d1562E7957K82443E9881
8898a18922C09118a70256j9530h3695A75360a69117B25488b42598h165j21082
8888a29247k55831J58759j20327l6821B8828b06422N550M6922j26507D177f3191
8876E404c46540I1376C4679J61563a79025e3197m0004k8679e1151k26414q3077
8865c60642a26268A46706b66894B17877b81376A64683a0073j34249a0718j82956
$$ plain form
8946 -11075 -857 264876 164627 156449 -9725 166379 -26173 28960 -1214 135668 8747 -217798
8933 -22981 164870 -55570 -357005 -42248 -115929 -29729 -185799 -165663 91809 27921 255860
8922 255860 25367 439324 1026711 807254 263581 8069 -77355 -217147 -66614 124134 -177211
8910 -119752 -212858 365215 78240 -76983 379306 115050 111844 -41562 57957 340400 59881
8898 -118922 309118 -170256 -189786 -83695 175360 -169117 225488 -242598 -8165 -129247
8888 -129247 -385078 -226319 -346646 -383467 28828 -206422 -200872 -153950 -280457 4177 -63191
8876 5404 -346540 91376 34679 196242 -179025 -53197 -93201 -121880 -51151 -277565 -360642
8865 -360642 -126268 146706 -266894 217877 -281376 164683 -10073 -144322 -10718 -193674
8855a93674g4299c0757I282a48953A97676G9459c611j25134H3782K1351a84330
8843b74531A94163o0138b69902A48151a23817A07638l3033a87232E0245J95169
8833B45414p2859C7317O2378e44886g1435b0992F9215j7188B3957b63367G4520
8821c91707f7206p2568J9639C1394a20396B49589a35120A47159Q2387a05239G5473
$$ plain form
8855 -193674 -74299 -30757 9282 -148953 197676 79459 -3611 -128745 83782 105133 -184330
8843 -274531 194163 134025 -269902 148151 -123817 107638 74605 -187232 50245 245414
8833 245414 172555 37317 99695 -544886 -71435 -20992 69215 52027 23957 -263367 74520
8821 -391707 -67206 -139774 -120135 31394 -120396 249589 -135120 147159 229546 -105239 75473
$$ [...]
##END NTUPLES=NMR SPECTRUM
##END=
