##TITLE=NES1043_8708014013_9242921_HsXZwWY3Tl
##JCAMPDX= 6.0         $$ Bruker NMR JCAMP-DX V2.0
##DATA TYPE= NMR SPECTRUM
##DATA CLASS= NTUPLES
##ORIGIN= BRUKER
##OWNER= Administrator
$$ 1.72 TOPSPIN		Version 2.1
$$ 2015-06-23 20:45:38.686 -0700  Administrator@X
$$ Compression mode = diff/dup
##.OBSERVE FREQUENCY= 400.02188249412
##.OBSERVE NUCLEUS= ^1H
##.ACQUISITION MODE= SIMULTANEOUS (DQD)
##.ACQUISITION SCHEME= undefined
##.AVERAGES= 64
##.DIGITISER RES= 22
##SPECTROMETER/DATA SYSTEM= spect
##.PULSE SEQUENCE= noesygpps1d.comp
##.SOLVENT NAME= COFFEE_meoh
##.SHIFT REFERENCE= INTERNAL, COFFEE_meoh, 1, 14.96201
##AUDIT TRAIL= $$ (NUMBER, WHEN, WHO, WHERE, PROCESS, VERSION, WHAT)
$$ ##TITLE= Audit trail, TOPSPIN		Version 2.1
$$ ##JCAMPDX= 5.01
$$ ##ORIGIN= Bruker BioSpin GmbH
$$ ##OWNER= Administrator
$$ $$ E:\/data/COFFEE/nmr/NES1043_8708014013_9242921_HsXZwWY3Tl/12/pdata/1/auditp.txt
$$ ##AUDIT TRAIL=  $$ (NUMBER, WHEN, WHO, WHERE, PROCESS, VERSION, WHAT)
(   1,<2015-06-23 20:45:33.451 -0700>,<Administrator>,<X>,<go>,<TOPSPIN 2.1>,
      <created by zg
	started at 2015-06-23 20:34:03.608 -0700,
	POWCHK enabled, PULCHK disabled,
       configuration hash MD5:
       21 0F 79 D6 B3 7B B4 F6 88 20 88 DB 03 48 BD 9F
       data hash MD5: 64K
       2B 2F 10 F9 E5 ED 1E 82 77 6E D4 8B BD D8 4C 9F>)
(   2,<2015-06-23 20:45:36.670 -0700>,<Administrator>,<X>,<proc1d>,<TOPSPIN 2.1>,
      <Start of raw data processing
       efp LB = 0.3 FT_mod = 6 PKNL = 1 PHC0 = 0 PHC1 = 0 SI = 128K 
       data hash MD5: 128K
       80 75 B8 4E 58 C7 A3 7A F1 FA 2F 48 F5 6E 48 EF>)
(   3,<2015-06-23 20:45:37.514 -0700>,<Administrator>,<X>,<proc1d>,<TOPSPIN 2.1>,
      <pk PHC0 = -86.96228 PHC1 = 0 
       data hash MD5: 128K
       06 C2 99 B7 F5 A1 F4 6F 1C 03 A9 2E 1D 6C 41 D6>)
(   4,<2015-06-23 20:45:37.873 -0700>,<Administrator>,<X>,<proc1d>,<TOPSPIN 2.1>,
      <abs ABSG = 1 
       data hash MD5: 128K
       4C 88 A1 40 33 68 A0 73 69 F7 9B D5 16 E5 4B 8E>)
(   5,<2015-06-23 20:45:37.983 -0700>,<Administrator>,<X>,<proc1d>,<TOPSPIN 2.1>,
      <abs ABSG = 2 
       data hash MD5: 128K
       86 CB CF 04 61 8D E2 EB EE 96 E5 6C 9B 42 E7 0B>)
(   6,<2015-06-23 20:45:38.061 -0700>,<Administrator>,<X>,<proc1d>,<TOPSPIN 2.1>,
      <abs ABSG = 3 
       data hash MD5: 128K
       0A 89 D5 1A 03 24 C9 0D 13 90 FC C2 F8 18 57 1F>)
(   7,<2015-06-23 20:45:38.154 -0700>,<Administrator>,<X>,<proc1d>,<TOPSPIN 2.1>,
      <abs ABSG = 4 
       data hash MD5: 128K
       23 28 B0 26 B9 81 73 95 EA 73 CE 90 7D FA 2C 17>)
(   8,<2015-06-23 20:45:38.233 -0700>,<Administrator>,<X>,<proc1d>,<TOPSPIN 2.1>,
      <abs ABSG = 5 
       data hash MD5: 128K
       6A B7 A5 74 1A AB 6F 89 8C 42 6D 05 FA 14 A8 20>)
$$ ##END=
$$ 
$$ $$ hash MD5
$$ $$ 56 D3 77 46 67 36 8C 97 40 1A 5C 4E E5 DD 89 03
##$RELAX= 
##$RELAX= 
##$RELAX= 
##$RELAX= 
##$RELAX= 
##$RELAX= 
##$RELAX= 
##$RELAX= 
$$ Bruker specific parameters
$$ --------------------------
##$DU= <E:\>
##$EXPNO= 12
$$ [...]
##$TP07= 0
##$TPNAME0= <>
##$TPNAME1= <>
##$TPNAME2= <>
##$TPNAME3= <>
##$TPNAME4= <>
##$TPNAME5= <>
##$TPNAME6= <>
##$TPNAME7= <>
##$TPOAL= (0..7)
0.5 0.5 0.5 0.5 0.5 0.5 0.5 0.5
##$TPOFFS= (0..7)
0 0 0 0 0 0 0 0
##$TUNHIN= 0
##$TUNHOUT= 0
##$TUNXOUT= 0
##$USERA1= <user>
##$USERA2= <user>
##$USERA3= <user>
##$USERA4= <user>
##$USERA5= <user>
##$V9= 5
##$VALIST= <valist>
##$VCLIST= <CCCCCCCCCCCCCCC>
##$VD= 0
##$VDLIST= <DDDDDDDDDDDDDDD>
##$VPLIST= <PPPPPPPPPPPPPPP>
##$VTLIST= <TTTTTTTTTTTTTTT>
##$WBST= 2048
##$WBSW= 25
##$XGAIN= (0..3)
0 0 0 0
##$XL= 0
##$YL= 0
##$YMAX_a= 6220551
##$YMIN_a= -11185086
##$ZGOPTNS= <>
##$ZL1= 120
##$ZL2= 120
##$ZL3= 120
##$ZL4= 120
##$ABSF1= 14.96201
##$ABSF2= -5.596171
##$ABSG= 5
##$ABSL= 3
##$ALPHA= 0
##$AQORDER= 0
##$ASSFAC= 0
##$ASSFACI= 0
##$ASSFACX= 0
##$ASSWID= 0
##$AUNMP= <proc_prof1d_extract.lims>
##$AXLEFT= 0
##$AXNAME= <>
##$AXNUC= <1H>
##$AXRIGHT= 0
##$AXTYPE= 0
##$AXUNIT= <>
##$AZFE= 0.1
##$AZFW= 0.1
##$BCFW= 0
##$BC_mod= 0
##$BYTORDP= 0
##$COROFFS= 0
##$CY= 15
##$DATMOD= 1
##$DC= 0
##$DFILT= <>
##$DTYPP= 0
##$F1P= 0
##$F2P= 0
##$FCOR= 0.5
##$FTSIZE= 131072
##$FT_mod= 6
##$GAMMA= 0
##$GB= 0
##$INTBC= 1
##$INTSCL= 1
##$ISEN= 128
##$LB= 0.3
##$LEV0= 0
##$LPBIN= 0
##$MAXI= 10000
##$MC2= 0
##$MEAN= 0
##$ME_mod= 0
##$MI= 0
##$NCOEF= 0
##$NC_proc= -2
##$NLEV= 6
##$NOISF1= 0
##$NOISF2= 0
##$NSP= 0
##$NTH_PI= 0
##$NZP= 0
##$OFFSET= 14.96201
##$PC= 1
##$PHC0= -86.96228
##$PHC1= 0
##$PH_mod= 1
##$PKNL= yes
##$PPARMOD= 0
##$PPDIAG= 0
##$PPIPTYP= 0
##$PPMPNUM= 2147483647
##$PPRESOL= 1
##$PSCAL= 4
##$PSIGN= 0
##$PYNMP= <proc.py>
##$REVERSE= no
##$SF= 400.020009232344
##$SI= 131072
##$SIGF1= 0
##$SIGF2= 0
##$SINO= 400
##$SIOLD= 131072
##$SPECTYP= <>
##$SREGLST= <1H.CDCl3>
##$SSB= 0
##$STSI= 131072
##$STSR= 0
##$SW_p= 8223.68421052631
##$SYMM= 0
##$S_DEV= 0
##$TDeff= 65536
##$TDoff= 0
##$TI= <>
##$TILT= no
##$TM1= 0
##$TM2= 0
##$TOPLEV= 0
##$USERP1= <user>
##$USERP2= <user>
##$USERP3= <user>
##$USERP4= <user>
##$USERP5= <user>
##$WDW= 1
##$XDIM= 131072
##$YMAX_p= 308707444
##$YMIN_p= -12290
##$CURPLOT= <Network HP LaserJet P1505>
##$CURPRIN= <$Network HP LaserJet P1505>
##$DFORMAT= <normdp>
##$LAYOUT= <+/1D_H.xwp>
##$LFORMAT= <normlp>
##$PFORMAT= <normpl>
##$SURQMSG= 1
$$ End of Bruker specific parameters
$$ ---------------------------------
##NTUPLES= NMR SPECTRUM
##VAR_NAME=  FREQUENCY,     SPECTRUM/REAL,   SPECTRUM/IMAG
##SYMBOL=    X,             R,               I
##VAR_TYPE=  INDEPENDENT,   DEPENDENT,       DEPENDENT
##VAR_FORM=  AFFN,          ASDF,            ASDF
##VAR_DIM=   131072,        131072,          131072
##UNITS=     HZ,            ARBITRARY UNITS, ARBITRARY UNITS
##FACTOR=    0.0627417313425164, 1,          1
##FIRST=     8223.62146879497, -3181,        -46929
##LAST=      0,             -7,              -47679
##MIN=       0,             -12290,          0
##MAX=       8223.62146879497, 308707444,    0
$$ Real data points
##PAGE= N=1
##DATA TABLE= (X++(R..R)), XYDATA
$$ [...]
61265A156122r482r857r675q932q084p505o885n613l578j194J315M069O990R698
61251A107389J2049J4241J6202J7527J8356J9714K2358K5632K8190K9571L0349
61240A341578L0764L0123K7784K4130K0041J5845J1309O414J468l492q823j4496
61228A482645j9655k3416k5911k8037l0222l1900l2395l1863l1000l0188k9361
61217A168697k8543k7957k7586k7020k5857k3958k1370j8347j5473j3247j1470
61206I27869r555p566o451o864q305r738j0642j0985j0655r621q420p740p548
61193H13779p176o349n581n461n963o658p241p693q144q720r352r736r658r283
61179G06764q953q743q476q044p486o841o267o113o430o510n430l212r65K70N27
$$ plain form
61265 1156122 1146640 1136783 1127108 1118176 1110092 1102587 1095702 1090089 1086511 1085317 1086632 1090701 1097691 1107389
61251 1107389 1119438 1133679 1149881 1167408 1185764 1205478 1227836 1253468 1281658 1311229 1341578
61240 1341578 1372342 1402465 1430249 1454379 1474420 1490265 1501574 1507988 1509456 1505964 1497141 1482645
61228 1482645 1462990 1439574 1413663 1385626 1355404 1323504 1291109 1259246 1228246 1198058 1168697
61217 1168697 1140154 1112197 1084611 1057591 1031734 1007776 986406 968059 952586 939339 927869
61206 927869 918314 910748 904297 897433 889128 879390 868748 857763 847108 837487 829067 821327 813779
61193 813779 806603 800254 794673 789212 783249 776591 769350 761657 753513 744793 735441 725705 716047 706764
61179 706764 697811 689068 680592 672548 665062 658221 651954 645841 639411 632901 627471 624259 623294 623564 624091
61164F24091N64R02J374J471Q74k55j531k882m706p233r959j2096j3359j3850
61150E63405j3431j1940j0026q941r132r660r421q408p402o857o561o113n291
61137D50222m173l162k680k669k639k418k315k370j990q59L56Q12O90Q19J412
61122D29036J928K169K639L638M624M924M624M319M157L536J815q57l472m990
61108D58090n173m702m453m767n319n582n359n014n132n817o460o471o142o233
61094C81466o761o838n946m709l996l831l744l640l680l644l133k269j558j165
61080C26552r20q23r27q34m6J194K027K062J725J524J537J722K064K264J953J377
61064C42451J329K045K731K555J661Q86Q01J325J954K112J567O93no42j690k898
$$ plain form
61164 624091 624655 625557 626931 628402 629276 629021 627490 624608 619902 612669 602710 590614 577255 563405
61150 563405 549974 538034 528008 519067 509935 500275 490854 482446 475044 468187 461626 455513 450222
61137 450222 446049 442887 440207 437538 434899 432481 430166 427796 425806 424947 425303 426115 426805 427624 429036
61122 429036 430964 433133 435772 439410 444034 448958 453582 457901 462058 465594 467409 466552 463080 458090
61108 458090 452917 448215 443762 438995 433676 428094 422735 417721 412589 406772 400312 393841 387699 381466
61094 381466 374705 367867 361921 357212 353216 349385 345641 342001 338321 334677 331544 329275 327717 326552
61080 326552 325632 324809 323882 323048 323002 324196 326223 328285 330010 331534 333071 334793 336857 339121 341074 342451
61064 342451 343780 345825 348556 351111 352772 353658 354459 355784 357738 359850 361417 362110 362105 361463 359773 356875
61048C56875l265k470j573j627k231k271j635j205j321j274n17M94J017J037J125
61033C41159J705K812M314N970P385Q233Q612R013R934J1557J3702J6082J8661
61020D59139K1749K5768L0902L7116M4541N3815O5643P9190R0227R1597P7616
61009A077303M9686J7219q350k0956k1363j2752K399K0068L2004K8975Q225k3250
60997A149208n3549p3824q1985q0787p4167o5169n5698m6825l9135l2839k7711
60986E17519k3210j8969j5171j2226j0197q853q036p531o759n241l421k379k425
60973C93101k607j990q84j76J4L35J035J656J841J733J479R49K19l01n75j233
60957C94596k607l984m364l872l696m546n738o148n689n303n565n849n265m015
$$ plain form
61048 356875 353610 351140 349567 347940 345709 343438 341803 340598 339277 338003 337486 337980 338997 340034 341159
61033 341159 342864 345676 349990 355960 363345 371578 380190 389203 399137 410694 424396 440478 459139
61020 459139 480888 506656 537558 574674 619215 673030 738673 817863 908090 999687 1077303
61009 1077303 1126989 1144208 1135858 1114902 1093539 1080787 1083186 1103254 1135258 1164233 1172458 1149208
60997 1149208 1095659 1021835 939850 859063 784896 719727 664029 617204 578069 545230 517519
60986 517519 494309 475340 460169 447943 437746 428893 420857 413326 406567 401326 397905 395526 393101
60973 393101 390494 388504 387620 387444 387458 387793 388828 390484 392325 394058 395537 396486 396705 396404 395829 394596
60957 394596 391989 388005 383641 379769 376073 371527 365789 359641 353952 348649 343084 337235 331970 327955
60943C27955l222l430l871l592k761k248k217j903q10N53J422J762K094K669L235
60928C15636L446L168K435J406M24j22n8M29R26J125J018P39K33p27k022l016
60912C25040l212k876k587k396j990j580j804k648l187k792j988j638j798j854
60898B92690j380l99Q18J740J746Q42j29m59m13n44o35j20P65J224J150J249J753
60881B99898K014J663J384J937L091M048M537M902N313N495N188M461L570K742
60867C50243K107J686J450J412J595J793J574O38q59k385l359l492k937k162j502
60852C45802q87j70M20M84M3m43p10r64j427k013k577l092l438l400l058k845
60836C21725k932k897k329j409o15n6M37P96P69M20J87L35O50P60N66K50m9l62
$$ plain form
60943 327955 324733 321303 317432 313840 311079 308831 306614 304711 303901 304454 305876 307638 309732 312401 315636
60928 315636 319082 322250 324685 326091 326515 326393 326335 326764 327690 328815 329833 330572 330805 330078 328056 325040
60912 325040 321828 318952 316365 313969 311979 310399 308595 305947 302760 299968 297980 296342 294544 292690
60898 292690 291310 290911 291729 293469 295215 296057 295928 295469 295056 294512 293877 293757 294522 295746 296896 298145 299898
60881 299898 301912 303575 304959 306896 309987 314035 318572 323474 328787 334282 339470 343931 347501 350243
60867 350243 352350 354036 355486 356898 358493 360286 361860 362498 361639 359254 355895 352403 349466 347304 345802
60852 345802 344915 344745 345165 345649 345692 345249 344539 343575 342148 340135 337558 334466 331028 327628 324570 321725
60836 321725 318793 315896 313567 312158 311543 311487 311924 312720 313489 313909 314096 314431 315081 315841 316407 316657 316608 316246
60818C16246p05q23l64N99J423J547J154Q22O78L64k00o42q01r24j044p46M1O91
60800C17316P96Q14J260J746J591R61O11P04O98K84k61o35q06p93p04q92j455
60783C21235j791j358o73o92j320j580j227j070j411j397m57O46R66O85M88L62
60767C11406p7o29p78n25j37N27J546K242J916J038P44J253J772J881J986K298
60751C26463K393K076J765J602R92m41k121l219l615l629l318k627j874j540j672
60736C11235j876j789j272m58K03K47j34j05P61J763J978J521J311J674J932J422
60720C18413L28p81j687k425k847k767k411k246k383k483k303k040j937j899j776
60705B88756j789k214k719k585j672p13l65l83j84K15L01l8l91m39k42Q2M00L54
$$ plain form
60818 316246 315541 314718 314354 314953 316376 317923 319077 319899 320577 320941 320741 320099 319298 318374 317330 316584 316625 317316
60800 317316 318112 318926 320186 321932 323523 324484 325095 325799 326497 326781 326520 325885 325079 324286 323582 322690 321235
60783 321235 319444 318086 317413 316721 315401 313821 312594 311524 310113 308716 308259 308905 309871 310556 311044 311406
60767 311406 311329 310700 309922 309397 309260 309787 311333 313575 315491 316529 317273 318526 320298 322179 324165 326463
60751 326463 328856 330932 332697 334299 335291 334850 332729 329510 325895 322266 318948 316321 314447 312907 311235
60736 311235 309359 307570 306298 305840 306043 306290 306156 306051 306812 308575 310553 312074 313385 315059 316991 318413
60720 318413 318741 317960 316273 313848 311001 308234 305823 303577 301194 298711 296408 294368 292431 290532 288756
60705 288756 286967 284753 282034 279449 277777 277064 276699 276316 276132 276347 276648 276610 276219 275780 275538 275620 276020 276374
60687B76374k79r69q54J30J090J392J350J494J773J942K058K203K191K074K401
60672B94370L363M160L868K696J717J607K154K804L096K781K147K030K948M387
60658C34128N412N788N875N760N207M321L490K769K042J626J861K151J445k20
60644C81655j613j985j912k093k338k269k218k609l097l067k545j968j408p03
60630C51830NM80Q70J385J680J256L01m02m17o5Q1k55q84j313j135n81l60p31
60612C51745j050p06j17k19j206k422l332l889l988l372k257j424j354j625j483
60597C23301p10K84R86J192J047P71L68l21j188j646j194p0R95J534J569J234
60581C28152P00L22L52M93K25k71j79Q40K088K717K668K463K402K447K517K472
$$ plain form
60687 276374 276095 275126 274272 274402 275492 276884 278234 279728 281501 283443 285501 287704 289895 291969 294370
60672 294370 297733 301893 305761 308457 310174 311781 313935 316739 319835 322616 324763 326793 329741 334128
60658 334128 339540 345328 351203 356963 362170 366491 369981 372750 374792 376418 378279 380430 381875 381655
60644 381655 380042 378057 376145 374052 371714 369445 367227 364618 361521 358454 355909 353941 352533 351830
60630 351830 351835 352315 353185 354570 356250 357506 357807 357405 356988 356923 357004 356749 355865 354552 353417 352836 352476 351745
60612 351745 350695 349989 349872 349653 348447 346025 342693 338804 334816 331444 329187 327763 326409 324784 323301
60597 323301 322591 322875 323861 325053 326100 326871 327239 326918 325730 324084 322890 322820 323815 325349 326918 328152
60581 328152 328852 329174 329526 330019 330244 329973 329794 330634 332722 335439 338107 340570 342972 345419 347936 350408
60565C50408K029J148M47O94J849K913L005K364K058K725L891M643M767M865N389
60550C93195O112O764P666R190J0959J2330J3489J5278J7835K0268K1899K3016
60538E58001K3925K4001K2385J9078J4590R020K344m590j0338j4273j6983j9019
60526F08141k0006j9343j7238j4562j2004r868q366p625p302o628m986k390O25
60513D78448L442N788P884J0165J2803J5481J7730J9358K0433K0815K0006J7639
60501F49992J4003R857N704J440l157p652j0898j1802j0164o787k857R11M637
60488F33227Q880J3804J8792K3049K6494K9861L3880L8689M4143N0349N7556O5686
60476A044410P4369Q3288R2069R9684J04227J03524R5953Q0861N8654L0869L3
$$ plain form
60565 350408 352437 353585 354032 354726 356575 359488 362493 364857 366915 369640 373531 378174 382941 387806 393195
60550 393195 399307 406071 413737 422927 433886 446216 459705 474983 492818 513086 534985 558001
60538 558001 581926 605927 628312 647390 661980 671000 673344 668754 658416 644143 627160 608141
60526 608141 588135 568792 551554 536992 524988 515120 506754 499129 491827 485199 480213 477823 478448
60513 478448 481890 487678 495562 505727 518530 534011 551741 571099 591532 612347 632353 649992
60501 649992 663995 673852 679556 680996 677839 670187 659289 647487 637323 630536 627679 628590 633227
60488 633227 642107 655911 674703 697752 724246 754107 787987 826676 870819 921168 978724 1044410
60476 1044410 1118779 1202067 1294136 1393820 1498047 1601571 1697524 1778385 1837039 1867908 1867941
60465A867941l0900n9121q2253r8559j07473j09974j07983j03143r6211q7673
60455I84651p8417o9461o1218n3531m6403m0213l5128l0749k6636k2824j9557
60444E00514j6849j4633j3070j2182j1419j0091q221o473n321m743m676n083n475
60431C82278n056l727k357j697j557j442j454j891k392k329j792j483j624j690
60417C51787j294o08J04P68J131Q29J33k7P88J871K329K230K252K633L051L333
60401C71310L574L666L400L067L338M279M964M433K800J179O54J388K560L079
60387D13691K538J547J025J226J630J731J464Q98K4q54j041k50Q20J221R83J015
60371D27668J755K512K379J463P02O88J044J050N79K04M67J300K215K837L095
$$ plain form
60465 1867941 1837041 1777920 1695667 1597108 1489635 1379661 1271678 1168535 1072324 984651
60455 984651 906234 836773 775555 722024 675621 635408 600280 569531 542895 520071 500514
60444 500514 483665 469032 455962 443780 432361 422270 414049 407576 402255 397512 392836 387753 382278
60431 382278 377222 373495 371138 369441 367884 366442 364988 363097 360705 358376 356584 355101 353477 351787
60417 351787 350493 349885 349989 350757 351888 352717 352850 352823 353611 355482 357811 360041 362293 364926 367977 371310
60401 371310 374884 378550 381950 385017 388355 392634 397598 402031 404831 406010 406664 408052 410612 413691
60387 413691 416229 417776 418801 420027 421657 423388 424852 425750 425774 424920 423879 423629 424449 425670 426653 427668
60371 427668 429423 431935 434314 435777 436479 437167 438211 439261 439840 440044 440511 441811 444026 446863 449958
60356D49958K998K578K028J618J298O75l84j407j850j759j559j329q12j4O76J062
60340D53777J381J803K188K418K589K620K114R37n12j868l229m581n328m994m080
60325D45235l503l410l274l018l167l790m130l605k536j507o36J41N66M15l6l51
60309D13394m41l38K6L14l54k268m213m664l839l504m529n698n466m061l011l079
60293C68269l639l855l612l044j988m54Q31J032K57m52l95N3K04J89P22J852K630
60276C58600K379J720J756K602L373L523L394L384L317L036K936L346L862L871
60262D01099L441L018K575J800J022J008J706K049J454P94J210K455L238L036
60248D29905K758L444M907O061O285O033O157O931P895Q541Q941R593J0754J2227
$$ plain form
60356 449958 452956 455534 457562 459180 460478 461153 460769 459362 457512 455753 454194 452865 452053 452039 452715 453777
60340 453777 455158 456961 459149 461567 464156 466776 468890 469827 469315 467447 464218 459637 454309 449315 445235
60325 445235 441732 438322 435048 432030 428863 425073 420943 417338 414802 413295 412659 412800 413366 413781 413745 413394
60309 413394 412953 412615 412641 412955 412601 410333 406120 401456 397617 394113 389584 383886 378420 374359 371348 368269
60293 368269 364630 360775 357163 354119 352131 351677 352508 353540 353797 353345 352950 353003 353207 353396 354118 355970 358600
60276 358600 360979 362699 364455 367057 370430 373953 377347 380731 384048 387084 390020 393366 397228 401099
60262 401099 404540 407558 410133 411933 412955 413963 415669 417718 419172 419966 421176 423631 426869 429905
60248 429905 432663 436107 441014 447075 453360 459393 465550 472481 480376 488917 497858 507451 518205 530432
60234E30432J3743J5329J7110J9036K1014K3125K5424K7711K9836L2111L4944
60223G89815L8146M1024M3290M5344M7482M9267N0065M9802M8783M6960M3950
60212A293928L9696L4634K9163K3371J7374J1432N517p59p331j3150j7097j9302
60200A397476k0943k2558k3225k1783j8413j4423j0723p172l326R80N919J1813
60188A273622J8453K4867L0345L5377M0899M6831N2005N5562N7642N8607N8206
60177A752416N5897N1579M5600L8353L0182K1507J2761M158m257j2469k0457k8096
60165A947174l5009m0661m4736m7252m8263m7715m5601m2014l7033l0844k3998
60154A504048j7138j0428l632L216R764J5992K2187K8053L2603L5407L7148L8348
$$ plain form
60234 530432 544175 559504 576614 595650 616664 639789 665213 692924 722760 754871 789815
60223 789815 827961 868985 912275 957619 1005101 1054368 1104433 1154235 1203018 1249978 1293928
60212 1293928 1333624 1368258 1397421 1420792 1438166 1449598 1455115 1454356 1447025 1433875 1416778 1397476
60200 1397476 1376533 1353975 1330750 1308967 1290554 1276131 1265408 1258236 1254910 1255890 1261809 1273622
60188 1273622 1292075 1316942 1347287 1382664 1423563 1470394 1522399 1577961 1635603 1694210 1752416
60177 1752416 1808313 1859892 1905492 1943845 1974027 1995534 2008295 2012453 2008196 1995727 1975270 1947174
60165 1947174 1912165 1871504 1826768 1779516 1731253 1683538 1637937 1595923 1558890 1528046 1504048
60154 1504048 1486910 1476482 1472850 1476066 1485830 1501822 1524009 1552062 1584665 1620072 1657220 1695568
60142A695568L8240L5810L1463K6607K1902J6871J1139N064q27o195j0498j3075
60130A852069j3844j3271j1520q271l499K234Q370J4671K0923K7081L3802M1950
60118A950695N1253O0336O8419P6177Q4430R2841J00565J07479J13969J19982
60108B826146J25006J28588J30254J29193J24788J17180J06889R4197P9427O3397
60098C925065M6805K9517J1125p941k6609m4239o0735p5670q8072r7277j03374
60087C508595j06718j07556j06210j03184r8835r3304q6752p9396p1318o2652
60077B592670n3905m5660l8012l0610k3263j6065r117k588L085P574J1167J4306
60065B409582J6672J7498J6802J5536J4187J1985P979K416l507r017j4348k0065
$$ plain form
60142 1695568 1733808 1769618 1801081 1827688 1849590 1866461 1877600 1882664 1881837 1875642 1865144 1852069
60130 1852069 1838225 1824954 1813434 1805163 1801664 1803898 1812268 1826939 1847862 1874943 1908745 1950695
60118 1950695 2001948 2062284 2130703 2206880 2291310 2384151 2484716 2592195 2706164 2826146
60108 2826146 2951152 3079740 3209994 3339187 3463975 3581155 3688044 3782241 3861668 3925065
60098 3925065 3971870 4001387 4012512 4004571 3977962 3933723 3872988 3797318 3709246 3611969 3508595
60087 3508595 3401877 3294321 3188111 3084927 2986092 2892788 2806036 2726640 2655322 2592670
60077 2592670 2538765 2493105 2455093 2424483 2401220 2385155 2376038 2373450 2376535 2384109 2395276 2409582
60065 2409582 2426254 2443752 2460554 2476090 2490277 2502262 2510241 2512657 2509150 2500133 2485785 2465720
60053B465720k6126l1772l6308l9966m3699m7834n1260n2645n2199n1406n0802
60042A981703m9106m5018l9126l3149k7862k2584j6523r719k607M607J1869J9084
60030A771569K6189L3150L9762M5691N0843N5409N9425O2422O3605O2280N8102
60019B328447N1188M2177L2050K1650J1309R58r426j9595k9304l8545m7280n4892
60007B288737o0316o2957o3292o2234o0091n6548n1570m5832m0070l4418k8544
59996A722865k2110j4966p209P45Q428J5836K3391L1300L9375M7626N6384O5422
59984A967087P3483P9318Q2865Q4673Q4485Q1295P4799O5967N5857M4690L2424
59973B726943J9614P013n314j7810l0461m2440n2742o0746o6223o9214o9907o8449
$$ plain form
60053 2465720 2439594 2407822 2371514 2331548 2287849 2240015 2188755 2136110 2083911 2032505 1981703
60042 1981703 1932597 1887579 1848453 1815304 1787442 1764858 1748335 1738616 1736009 1740616 1752485 1771569
60030 1771569 1797758 1830908 1870670 1916361 1967204 2022613 2082038 2144460 2208065 2270345 2328447
60019 2328447 2379635 2421812 2453862 2475512 2486821 2487779 2478353 2458758 2429454 2390909 2343629 2288737
60007 2288737 2228421 2165464 2102172 2039938 1979847 1923299 1871729 1825897 1785827 1751409 1722865
59996 1722865 1700755 1685789 1678580 1679325 1687753 1703589 1726980 1758280 1797655 1845281 1901665 1967087
59984 1967087 2040570 2119888 2202753 2287426 2371911 2453206 2528005 2593972 2649829 2694519 2726943
59973 2726943 2746557 2753570 2748256 2730446 2699985 2657545 2604803 2544057 2477834 2408620 2338713 2270264
59961B270264o4846n9240n2190m4339l5873k6736j7334q465l57P613J5873K3838
59949B008208L0720L6738M2719M8618N3297N5941N6918N6866N5596N2515M7672
59938B545808M1826L5666K9461K3338J7401J1694O483K437J21n40J12K171N957
59925B721935J1237J7400K4412L2879M2911N3539O3562P2532Q0621Q7991R4495
59914C303514R9665J02722J03022J00622R5923Q8638P7828O3360M6607K9172J1537
59903D122610o383k4029m0489n5506o9124q0565q8612r3174r5373r5791r3725
59892C379839q8729q1913p4881o7911o0086n0959m1239l1807k2812j3973n282
59881B840247K942J0451J7235K3319K8652L3167L6875L9661M1030M0259L6986
$$ plain form
59961 2270264 2205418 2146178 2093988 2049649 2013776 1987040 1969706 1961241 1960884 1968497 1984370 2008208
59949 2008208 2038928 2075666 2118385 2167003 2220300 2276241 2333159 2390025 2445621 2498136 2545808
59938 2545808 2587634 2623300 2652761 2676099 2693500 2705194 2711677 2714114 2714235 2713695 2713807 2715978 2721935
59925 2721935 2733172 2750572 2774984 2807863 2850774 2904313 2967875 3040407 3121028 3209019 3303514
59914 3303514 3403179 3505901 3608923 3709545 3805468 3894106 3971934 4035294 4081901 4111073 4122610
59903 4122610 4116227 4092198 4051709 3996203 3927079 3846514 3757902 3664728 3569355 3473564 3379839
59892 3379839 3291110 3209197 3134316 3066405 3006319 2955360 2914121 2882314 2859502 2845529 2840247
59881 2840247 2843189 2853640 2870875 2894194 2922846 2956013 2992888 3032549 3073579 3113838 3150824
59870C150824L1569K4607J6245O314m821j6023k6321l5688m4538n2598n8912o2953
59858B927705o5314o7064o8669o9739o9709o8561o6898o5459o4501o3582o2054
59847B196155n9756n7106n4483n1767m8725m5589m2836m0417l7704l4380l0981
59836A692411k8251k6212k4402k2748k1628k0969j9965j8068j5841j4336j3815
59825A466176j3561j2837j1577j0131q812p855p347o928n855l734j044J410L390
59812A381295N293P430R671J1876J4192J6670J8880K0316K0976K1197K1016K0173
59800A568985J8788J7456J6436J5140J2927J0147P886O720O271O078O390P805
59788A701029J0493J4118J8361K3088K8104L3188L8507M4736N2488O1706P1729
$$ plain form
59870 3150824 3182393 3207000 3223245 3229559 3224738 3208715 3182394 3146706 3102168 3049570 2990658 2927705
59858 2927705 2862391 2795327 2726658 2656919 2587210 2518649 2451751 2386292 2321791 2258209 2196155
59847 2196155 2136399 2079293 2024810 1973043 1924318 1878729 1835893 1795476 1757772 1723392 1692411
59836 1692411 1664160 1637948 1613546 1590798 1569170 1548201 1528236 1510168 1494327 1479991 1466176
59825 1466176 1452615 1439778 1428201 1418070 1409258 1401403 1394056 1387128 1381273 1377539 1376495 1377905 1381295
59812 1381295 1386588 1394018 1403689 1415565 1429757 1446427 1465307 1485623 1506599 1527796 1548812 1568985
59800 1568985 1587773 1605229 1621665 1636805 1649732 1659879 1667765 1674485 1680756 1686834 1693224 1701029
59788 1701029 1711522 1725640 1744001 1767089 1795193 1828381 1866888 1911624 1964112 2025818 2097547
59777B097547Q2017R2640J04044J16396J29280J41797J52460J58705J56885J43466
59767C375237J16826P8262L1767j6811o0978r5405j17743j28857j31154j26791
59757B924353j17429j04879r1080p7307o3998n1393l9956l0035k1432j3539n775
59746B307530K089R759J6560K2097K6883L1979L7860M4009M9875N5792O2490O9952
59734B736875P7381Q4387R1657J00173J10031J20365J30362J40092J50366J61863
59724C903552J74458J87384J99996K12294K24450K35948K45477K51756K54128
59715E889443K52189K45335K33209K16456J96574J74963J52653J30859J11169
59706G602850R4809Q2087P2822O6862O3791O2462O1435N9887N7775N5244N2205
$$ plain form
59777 2097547 2179564 2272204 2376248 2492644 2621924 2763721 2916181 3074886 3231771 3375237
59767 3375237 3492063 3570325 3602092 3585281 3524303 3428898 3311155 3182298 3051144 2924353
59757 2924353 2806924 2702045 2610965 2533658 2469660 2418267 2378311 2348276 2326844 2313305 2307530
59746 2307530 2309619 2319378 2335938 2358035 2384918 2416897 2454757 2498766 2548641 2604433 2666923 2736875
59734 2736875 2814256 2898643 2990300 3090473 3200504 3320869 3451231 3591323 3741689 3903552
59724 3903552 4078010 4265394 4465390 4677684 4902134 5138082 5383559 5635315 5889443
59715 5889443 6141632 6386967 6620176 6836632 7033206 7208169 7360822 7491681 7602850
59706 7602850 7697659 7779746 7852568 7919430 7983221 8045683 8107118 8167005 8224780 8280024 8332229
59695H332229M8449M3830L8440L2791K7654K3379J9611J6118J3622J3286J5459
59684H624868J9610K5460L3505M4098N6651P0070Q3691R7539J11914J26963J42381
59673I436750J57285J70509J81142J88596J92365J92006J87270J77755J62504
59664A1046182J40516J11676P6705L6358q444n5656j02278j45988j85701k20206
59654A0693164k47324k65350k74578k76419k71629k60491k44509k26847k11299
59645H414718k01612k01315k12702k35092k64477k94991l20670l36722l40826
59636F006311l33980l19561l00962k80224k58513k36896k16211j96750j78637
59627C684577j62144j47399j34037j21519j09652r8722q9182q1178p4169o7261
$$ plain form
59695 8332229 8380678 8424508 8462948 8495739 8523393 8546772 8566383 8582501 8596123 8609409 8624868
59684 8624868 8644478 8669938 8703443 8747541 8804192 8874262 8957953 9055492 9167406 9294369 9436750
59673 9436750 9594035 9764544 9945686 10134282 10326647 10518653 10705923 10883678 11046182
59664 11046182 11186698 11298374 11375079 11411437 11402993 11347337 11245059 11099071 10913370 10693164
59654 10693164 10445840 10180490 9905912 9629493 9357864 9097373 8852864 8626017 8414718
59645 8414718 8213106 8011791 7799089 7563997 7299520 7004529 6683859 6347137 6006311
59636 6006311 5672331 5352770 5051808 4771584 4513071 4276175 4059964 3863214 3684577
59627 3684577 3522433 3375034 3240997 3119478 3009826 2911104 2821922 2740744 2666575 2599314
59617B599314o0242n4000m9320m5592m1407l6439l1787k8445k6227k4597k3607
59606B177651k3411k3552k3433k3208k3556k4697k6089k7036k7283k6977k6395
59595A902014k5648k4703k3653k2773k2080k0976j8889j6195j3969j2741j1981
59584A688406j0922r341p386n211l030j044Q89L029N057O319O927P888R727J1732
59570A703040J3144J4291J5888J7813J9505K1083K3154K5702K8078L0005L1815
59559A943518L3750L5731L7876M0523M3636M6831N0044N3606N7510O1337O5158
59548B469520O9715P4980P8768P7648O9699N6537M2595L2180K6789K4798K3401
59537C046630K0741J6467J1054N123p67o297j1477j6375k0822k4600k7830l0854
$$ plain form
59617 2599314 2539072 2485072 2435752 2390160 2348753 2312314 2280527 2252082 2225855 2201258 2177651
59606 2177651 2154240 2130688 2107255 2084047 2060491 2035794 2009705 1982669 1955386 1928409 1902014
59595 1902014 1876366 1851663 1828010 1805237 1783157 1762181 1743292 1727097 1713128 1700387 1688406
59584 1688406 1677484 1668143 1660757 1655546 1652516 1651472 1652361 1655390 1660447 1666766 1673693 1681581 1691308 1703040
59570 1703040 1716184 1730475 1746363 1764176 1783681 1804764 1827918 1853620 1881698 1911703 1943518
59559 1943518 1977268 2012999 2050875 2091398 2135034 2181865 2231909 2285515 2343025 2404362 2469520
59548 2469520 2539235 2614215 2692983 2770631 2840330 2896867 2939462 2971642 2998431 3023229 3046630
59537 3046630 3067371 3083838 3094892 3100015 3099248 3092951 3081474 3065099 3044277 3019677 2991847 2960993
59525B960993l3731l6153l7815l8650l8664l7798l5987l3133k9098k3890j7821
59514B598253j1193l951M101J2772K1530L0207L9268M9191N9658O9628P8285Q5783
59502C033532R2861R9494J04237J05338J02510R6990Q9610P9535O5496M7818K8361
59491C945782Q658j1026l0651m9210o5125p7395q6071r1721r4697r4832r1810
59480C261902q5861p8027o9504o0787n1752m2447l3298k4535j5992p765o90M268
59468B795512O915P905P969P336N787L050r16n934j1835j8532k5766l2968l9616
59455B698907m5730n1656n7347o2166o5578o7719o9046o9663o9343o8082o6305
59444B006272o4446o2622o0661n8251n4998n0763m6102m2136l9480l7457l4810
$$ plain form
59525 2960993 2927262 2891109 2853294 2814644 2775980 2738182 2702195 2669062 2639964 2616074 2598253
59514 2598253 2587060 2583109 2587210 2599982 2621512 2651719 2690987 2740178 2799836 2869464 2947749 3033532
59502 3033532 3126393 3225887 3330124 3435462 3537972 3634962 3724572 3804107 3869603 3917421 3945782
59491 3945782 3954440 3943414 3912763 3863553 3798428 3721033 3634962 3543241 3448544 3353712 3261902
59480 3261902 3176041 3098014 3028510 2967723 2915971 2873524 2840226 2815691 2799699 2791934 2791244 2795512
59468 2795512 2802427 2810332 2818301 2825637 2831424 2834474 2833558 2827624 2815789 2797257 2771491 2738523 2698907
59455 2698907 2653177 2601521 2544174 2482008 2416430 2348711 2279665 2210002 2140659 2072577 2006272
59444 2006272 1941826 1879204 1818543 1760292 1705294 1654531 1608429 1566293 1526813 1489356 1454546
59433A454546l1199k7485k4430k1725j8709j5415j2231q962n043l92M728J0337
59421A304020J5962J9318J7478J0168Q48o307r686r909p783m029M7L566P393J2468
59407A353554J6869J6604J0146O47p215j1315j2228j0862p719l781k90K516N450
59394A352376Q962J2512J5548J8194K0755K3187K5529K8279L1781L5516L8575
59383A611214M0793M2897M5530M8568N1731N5337N9830O4731O8923P2256P6101
59372B237911Q1785Q8987R6434J03728J11571J20330J29504J38786J48766J60003
59362C417805J72079J83991J95142K05439K14806K22834K28711K31316K29821
59353E301944K24256K15118K02345J85500J65129J43052J20719R8029P4497N0775
$$ plain form
59433 1454546 1423347 1395862 1371432 1349707 1330998 1315583 1303352 1294390 1289347 1288955 1293683 1304020
59421 1304020 1319982 1339300 1356778 1366946 1367794 1361487 1351801 1341892 1334109 1330080 1330127 1333693 1341086 1353554
59407 1353554 1370423 1387027 1397173 1397820 1390605 1379290 1367062 1356200 1348481 1344700 1344410 1346926 1352376
59394 1352376 1361338 1373850 1389398 1407592 1428347 1451534 1477063 1505342 1537123 1572639 1611214
59383 1611214 1652007 1694904 1740434 1789002 1840733 1896070 1955900 2020631 2089554 2161810 2237911
59372 2237911 2319696 2408683 2505117 2608845 2720416 2840746 2970250 3109036 3257802 3417805
59362 3417805 3589884 3773875 3969017 4174456 4389262 4612096 4840807 5072123 5301944
59353 5301944 5526200 5741318 5943663 6129163 6294292 6437344 6558063 6656092 6730589 6781364
59343F781364K8018O169j5962l8927o1979q4267j05849j27166j48176j68393j87205
59332E877627k03779k16997k25981k30649k31521k29044k23269k14200k02387
59323C899800j89069j75636j62872j50821j39272j28070j17025j06018r5525q6457
59313B549035p9093p2538o5853n9321n3910m9695m5760m1681l8153l5765l3877
59302A973389l1418k8354k5648k3907k2626k0937j8661j6375j4536j2895j0890
59291A747142q463o195m531l137j270J345M282P043R561J2047J4488J6525J7762
59278A806599J8245J8467J8803J8900J7986J5881J3312J0954Q581N541J819k051
59266A953037n901j0051j4497j8638k1952k4478k6503k8308l0293l2711l4928
$$ plain form
59343 6781364 6809382 6815551 6799589 6760662 6698683 6614416 6508567 6381401 6233225 6064832 5877627
59332 5877627 5673848 5456851 5230870 5000221 4768700 4539656 4316387 4102187 3899800
59323 3899800 3710731 3535095 3372223 3221402 3082130 2954060 2837035 2731017 2635492 2549035
59313 2549035 2469942 2397404 2331551 2272230 2218320 2168625 2122865 2081184 2043031 2007266 1973389
59302 1973389 1941971 1913617 1887969 1864062 1841436 1820499 1801838 1785463 1770927 1758032 1747142
59291 1747142 1738679 1732484 1727953 1724816 1723546 1724891 1729173 1736216 1745777 1757824 1772312 1788837 1806599
59278 1806599 1824844 1843311 1862114 1881014 1899000 1914881 1928193 1939147 1947728 1953269 1955088 1953037
59266 1953037 1947136 1937085 1922588 1903950 1881998 1857520 1831017 1802709 1772416 1739705 1704777
59255A704777l5668l4536l2818l2095l2334l1998k9973k6747k3576k1142j9260
59244A384630j7526j5785j4012j2093r903p506n126k863n43J998M617O969Q920
59231A321777J0573J1995J3229J4643J6827J9840K2943K5440K7578L0205L3607
59220A548657L7240M0555M3755M7487N2132N7530O3279O9058P4816Q0760Q7218
59209B202487R4402J02263J10453J18372J25351J31033J35517J38882J40483J38942
59199C438185J33021J22438J07805Q9942O9368M6257K0784o425l3995o0144q3479
59188C843757j03459j19950j32617j41106j45667j47038j45637j41365j34481
59179B632437j26146j17648j09336j00851r2199q3979p6560o9654o2917n6465
$$ plain form
59255 1704777 1669109 1634573 1601755 1569660 1537326 1505328 1475355 1448608 1425032 1403890 1384630
59244 1384630 1367104 1351319 1337307 1325214 1315311 1307805 1302679 1299816 1299273 1301271 1305888 1312857 1321777
59231 1321777 1332350 1344345 1357574 1372217 1389044 1408884 1431827 1457267 1484845 1515050 1548657
59220 1548657 1585897 1626452 1670207 1717694 1769826 1827356 1890635 1959693 2034509 2115269 2202487
59209 2202487 2296889 2399152 2509605 2627977 2753328 2884361 3019878 3158760 3299243 3438185
59199 3438185 3571206 3693644 3801449 3891391 3960759 4007016 4027800 4021375 3987380 3927236 3843757
59188 3843757 3740298 3620348 3487731 3346625 3200958 3053920 2908283 2766918 2632437
59179 2632437 2506291 2388643 2279307 2178456 2086257 2002278 1925718 1856064 1793147 1736682
59169A736682n0455m4672l8997l3945l0183k7605k5449k3272k1298j9758j8452
59158A402596j7240j6415j6260j6455j6431j6091j5788j5643j5424j5069j4926
59147A226854j5203j5593j5688j5531j5414j5306j4887j4045j3038j2115j1388
59136A068646j1011j1056j1095j0389q832p326o720o698o245n004l569k509j726
59123I76466r82l68O7O54J643K688L318L661M237N186O121O739P118P352P271
59108A031171O740N948N232M752M466M282M101L746L150K602K704L784N390O639
59094A094707P176P605Q666J0253J1616J2461J3249J4435J5885J7251J8382J9139
59082A250825J9305J9040J8887J8947J8497J7016J5069J3508J2175J0247P625
$$ plain form
59169 1736682 1686227 1641555 1602558 1568613 1538430 1510825 1485376 1462104 1440806 1421048 1402596
59158 1402596 1385356 1368941 1352681 1336226 1319795 1303704 1287916 1272273 1256849 1241780 1226854
59147 1226854 1211651 1196058 1180370 1164839 1149425 1134119 1119232 1105187 1092149 1080034 1068646
59136 1068646 1057635 1046579 1035484 1025095 1016263 1008937 1002217 995519 989274 984270 980701 978192 976466
59123 976466 975484 975116 975183 975837 977480 980168 983486 987147 991384 996570 1002691 1009430 1016548 1023900 1031171
59108 1031171 1037911 1043859 1049091 1053843 1058309 1062591 1066692 1070438 1073588 1076190 1078894 1082678 1088068 1094707
59094 1094707 1101883 1109488 1118154 1128407 1140023 1152484 1165733 1180168 1196053 1213304 1231686 1250825
59082 1250825 1270130 1289170 1308057 1327004 1345501 1362517 1377586 1391094 1403269 1413516 1421141
59071A421141N020K676k5l411o863r768j2414j5377j8475k0927k2295k2867k3276
59058A273139k4009k5058k5852k5705k4646k3449k2682k2078k1144j9971j8971
59047A019574j8123j7098j5933j4970j4128j2857j1003r242q298q046p676o676
59035H75524n353m353l909l776l784m151n089o303p150p339p172p105p325p781
59021G94934q340q744q689q157p479o983o700o508o302n908n163m221l502l080
59007G05158k513j555o71l92m72k24M70J116J509J990K737L374L618L775M254
58992G22174M932N482O075P224Q986J0675J1575J1619J1287J1078J1247J1853
58980H34207J2691J3153J2555J0851Q858P478O720N869M539L241K629K601K501
$$ plain form
59071 1421141 1426161 1428837 1428812 1425401 1418538 1408770 1396356 1380979 1362504 1341577 1319282 1296415 1273139
59058 1273139 1249130 1224072 1198220 1172515 1147869 1124420 1101738 1079660 1058516 1038545 1019574
59047 1019574 1001451 984353 968420 953450 939322 926465 915462 906220 897922 889876 882200 875524
59035 875524 870171 865818 861909 858133 854349 850198 845109 838806 831656 824317 817145 810040 802715 794934
59021 794934 786594 777850 769161 761004 753525 746542 739842 733334 727032 721124 715961 711740 708238 705158
59007 705158 702645 701090 700419 700027 699555 699331 699801 700917 702426 704416 707153 710527 714145 717920 722174
58992 722174 727106 732588 738663 745887 754873 765548 777123 788742 800029 811107 822354 834207
58980 834207 846898 860051 872606 883457 892315 899793 906513 912382 916921 920162 922791 925392 927893
58967I27893K074J806K230L177L952M145M083M353N045N633N711N510N501N727
58953I86840N933O227O991Q128Q938R038Q931R273J0023J0708J1109J1304J1303
58940A104746J1240J1568J2609J4036J5277J6180J6800J6938J6583J6494J7476
58929A269947J9176K0548K1475K2946K5432K8100L0076L1549L3138L4986L7094
58918A574467L9746M2758M5074M6061M6746M8694N1918N5008N7226N9320O2083
58907B129101O5175O7902P0381P3204P6445P9717Q3044Q7000R1928R7413J02762
58896C024072J07719J12536J17442J22281J26673J30229J32347J32090J28831
58887D134220J23067J16047J08438R9914R0449Q1301P3862O7894O1729N4177M5382
$$ plain form
58967 927893 929967 931773 934003 937180 941132 945277 949360 953713 958758 964391 970102 975612 981113 986840
58953 986840 992773 999000 1005991 1014119 1023057 1032095 1041026 1050299 1060322 1071030 1082139 1093443 1104746
58940 1104746 1115986 1127554 1140163 1154199 1169476 1185656 1202456 1219394 1235977 1252471 1269947
58929 1269947 1289123 1309671 1331146 1354092 1379524 1407624 1437700 1469249 1502387 1537373 1574467
58918 1574467 1614213 1656971 1702045 1748106 1794852 1843546 1895464 1950472 2007698 2067018 2129101
58907 2129101 2194276 2262178 2332559 2405763 2482208 2561925 2644969 2731969 2823897 2921310 3024072
58896 3024072 3131791 3244327 3361769 3484050 3610723 3740952 3873299 4005389 4134220
58887 4134220 4257287 4373334 4481772 4581686 4672135 4753436 4827298 4895192 4956921 5011098 5056480
58876E056480L5815K5349J3691J022j2176k5456l8215m9765o0018o9653p9139
58865D797935q8015r5552j01649j06524j10042j12038j13082j14025j14876j14777
58855C727355j13242j10708j07732j04312j00341r6165r2149q8067q3442p8390
58845B752807p3548o9167o4754n9853n4785n0282m6481m2787l8760l4701l1032
58834B186657k7469k3448j9233j5858j3751j1968r336n947k889p37J082L343O041
58821B066487Q589J0625J2394J4478J7241K0483K3592K6216K8662L1460L4712
58810B294939L8178M1861M5964N0351N4613N8842O3735O9614P5850Q1643Q6986
58799B962576R2397R7988J03401J08528J13753J19380J25174J30554J35052J38532
$$ plain form
58876 5056480 5092295 5117644 5131335 5132357 5120181 5094725 5056510 5006745 4946727 4877074 4797935
58865 4797935 4709920 4614368 4512719 4406195 4296153 4184115 4071033 3957008 3842132 3727355
58855 3727355 3614113 3503405 3395673 3291361 3191020 3094855 3002706 2914639 2831197 2752807
58845 2752807 2679259 2610092 2545338 2485485 2430700 2380418 2333937 2291150 2252390 2217689 2186657
58834 2186657 2159188 2135740 2116507 2100649 2086898 2074930 2065594 2059647 2056758 2056021 2057103 2060446 2066487
58821 2066487 2075076 2085701 2098095 2112573 2129814 2150297 2173889 2200105 2228767 2260227 2294939
58810 2294939 2333117 2374978 2420942 2471293 2525906 2584748 2648483 2718097 2793947 2875590 2962576
58799 2962576 3054973 3152961 3256362 3364890 3478643 3598023 3723197 3853751 3988803 4127335
58789D127335J41163J43112J44205J43912J41883J38316J33560J27590J20102
58780E361178J10875R9502Q4894O5750M1695J3557j7459n0124q2507j11746j35418
58769E380197j52980j65378j73514j77743j78575j76959j73572j68602j62564
58760C850310j56594j51354j46146j39845j32435j24920j17869j10966j04044
58751B666137r7642r2130q6928q1302p5452p0129o5425o0681n5626n0925m7358
58740A882539m4828m2510l9734l6570l3684l1721l0741l0196k9515k8630k7753
58729A506657k6893k5852k4630k3410k2161k0708j9270j8545j8944k0075k1084
58718A265085k1369k0861j9988j9448j9766k0772k1782k2417k2938k3615k4136
$$ plain form
58789 4127335 4268498 4411610 4555815 4699727 4841610 4979926 5113486 5241076 5361178
58780 5361178 5472053 5571555 5656449 5722199 5763894 5777451 5759992 5709868 5627361 5515615 5380197
58769 5380197 5227217 5061839 4888325 4710582 4532007 4355048 4181476 4012874 3850310
58760 3850310 3693716 3542362 3396216 3256371 3123936 2999016 2881147 2770181 2666137
58751 2666137 2568495 2476365 2389437 2308135 2232683 2162554 2097129 2036448 1980822 1929897 1882539
58740 1882539 1837711 1795201 1755467 1718897 1685213 1653492 1622751 1592555 1563040 1534410 1506657
58729 1506657 1479764 1453912 1429282 1405872 1383711 1363003 1343733 1325188 1306244 1286169 1265085
58718 1265085 1243716 1222855 1202867 1183419 1163653 1142881 1121099 1098682 1075744 1052129 1027993
58707A027993k3993k3212k2309k1632k0997j9942j8193j5921j3663j1849j0387
58696H25895q925p487o399n579m460k898j575j092j126r46m13K00R97K428M583
58681G93203P124R846J2803J5973J9306K2990K7169L1528L5706L9973M4781M9733
58669A110135N3705N6084N7119N6789N4014M7328L5995K0427K126j6509l2997
58658A444216m5930n5151o0751o2553o0897n7164n2828m8290m3178l7468l1757
58647H88249k6631k2301j8819j6229j4443j3299j2743j2736j2998j3019j2350
58636G12681j0880q968p303o311n635m495k715j004j0N06J185K154L052L724M358
58621F80339N050N615N941O191O643P489Q694R914J0730J1157J1740J2907J4437
$$ plain form
58707 1027993 1004000 980788 958479 936847 915850 895908 877715 861794 848131 836282 825895
58696 825895 816970 809483 803084 797505 793045 790147 788572 787480 786354 785408 784995 785195 786192 788620 793203
58681 793203 800327 810173 822976 838949 858255 881245 908414 939942 975648 1015621 1060402 1110135
58669 1110135 1163840 1219924 1277043 1333832 1387846 1435174 1471169 1491596 1493722 1477213 1444216
58658 1444216 1398286 1343135 1282384 1219831 1158934 1101770 1048942 1000652 957474 920006 888249
58647 888249 861618 839317 820498 804269 789826 776527 763784 751048 738050 725031 712681
58636 712681 701801 692833 685530 679219 673584 669089 666374 665370 665360 665866 667051 669205 672257 675981 680339
58621 680339 685389 691004 696945 703136 709779 717268 725962 735876 746606 757763 769503 782410 796847
58608G96847J5805J6886J8012J9384K0839K2093K3045K3870K4993K6781K9055
58597A037610L1070L2285L2980L3836L5061L6228L6788L6454L5190L3141L0540
58586A411183K7399K3474J8752J3832R411N580J935j831n758r835j3793j6858
58574A463491j8299j8304j7816j7516j7396j7296j7206j6895j5874j4066j2116
58563A280707j0669r639q487o917n084l342k056j437j303j275j494k882o297j1478
58549A208347j7167k2236k6389k9706l1972l2838l2488l1666l0869k9748k7686
58538H95582k4744k1654j8852j6047j2953j0056q154p439p399p591q030q879j0099
58525G33685j1404j2396j2767j2618j2402j2301j1926j0945r741q856q124p001
$$ plain form
58608 796847 812652 829538 847550 866934 887773 909866 932911 956781 981774 1008555 1037610
58597 1037610 1068680 1100965 1133945 1167781 1202842 1239070 1275858 1312312 1347502 1380643 1411183
58586 1411183 1438582 1462056 1480808 1494640 1504051 1509631 1511566 1509735 1503977 1494142 1480349 1463491
58574 1463491 1445192 1426888 1409072 1391556 1374160 1356864 1339658 1322763 1306889 1292823 1280707
58563 1280707 1270038 1260399 1251912 1244995 1239911 1236569 1234513 1233076 1231773 1230498 1229004 1226122 1219825 1208347
58549 1208347 1191180 1168944 1142555 1112849 1080877 1048039 1015551 983885 953016 923268 895582
58538 895582 870838 849184 830332 814285 801332 791276 783122 775683 768284 760693 752663 743784 733685
58525 733685 722281 709885 697118 684500 672098 659797 647871 636926 627185 618329 610205 603204
58513F03204n655m868m747m433l325j913r32m07j2J57j76p94j174j071n49L51
58497E73656J387J917J467M07m23o62n52l42m0K41L34L96P79J426J817J664J199
58480E84671P04J71l49m92n5N19M98l16j349j821j454o70j68l15q96j510k062
58463E75106k705l329l443k642j126L93J202J061L68j43p8J74k8n72n34P06K578
58446E66988L933M286M013L572L093K744K839L328L620L299K687K373K437K485
58432F11697K314K110K045K105K325K757L178L223K963K974L596M405M760M624
58418F55076M521M720M849M407L485K784K889L587M080L894L400L225L435L664
58404G08016L901M485N267N523N019M561M921N753O214O241O457O949P089O664
$$ plain form
58513 603204 597549 592681 587934 583501 580176 578263 577331 576924 576912 577069 576893 576099 574925 573854 573305 573656
58497 573656 575043 576960 578427 578834 578411 577749 577197 576855 576815 577056 577390 577786 578565 579991 581808 583472 584671
58480 584671 585375 585546 585197 584705 584650 585169 585667 585351 584002 582181 580727 580057 579889 579574 578678 577168 575106
58463 575106 572401 569072 565629 562987 561861 562254 563456 564517 564885 564742 564664 564838 564810 564238 563704 564410 566988
58446 566988 570921 575207 579220 582792 585885 588629 591468 594796 598416 601715 604402 606775 609212 611697
58432 611697 614011 616121 618166 620271 622596 625353 628531 631754 634717 637691 641287 645692 650452 655076
58418 655076 659597 664317 669166 673573 677058 679842 682731 686318 690398 694292 697692 700917 704352 708016
58404 708016 711917 716402 721669 727192 732211 736772 741693 747446 753660 759901 766358 773307 780396 787060
58390G87060O423P113Q500R686J0072R740R144Q656Q287P616O196M109J990M72
58376H85064k10j30N40J518K469L234L866M416M850N175N466N805O279O960P655
58361I42957P988Q007Q454R810J1338J1795J1095J0444J0674J1277J1453J1324
58349A066616J1424J1639J1436J0843J0494J0751J1322J1793J2074J2288J2536
58338A193216J2806J3000J3094J3303J3891J4748J5416J5691J5823J5986J5982
58327A352956J5778J5806J6408J7294J7998J8481J8876J9071J9107J9556K0835
58316A552166K2393K3268K3365K3493K4146K4985K5559K5902K6228K6574K6937
58305A825016K7339K7659K7799K8084K8996L0404L1596L2270L2962L4183L5630
$$ plain form
58390 787060 793483 800596 809096 818782 828854 838594 847738 856394 864681 872297 878493 882602 884592 885064
58376 885064 884854 884724 885264 886782 889251 892485 896351 900767 905617 910792 916258 922063 928342 935302 942957
58361 942957 950945 958952 967406 977216 988554 1000349 1011444 1021888 1032562 1043839 1055292 1066616
58349 1066616 1078040 1089679 1101115 1111958 1122452 1133203 1144525 1156318 1168392 1180680 1193216
58338 1193216 1206022 1219022 1232116 1245419 1259310 1274058 1289474 1305165 1320988 1336974 1352956
58327 1352956 1368734 1384540 1400948 1418242 1436240 1454721 1473597 1492668 1511775 1531331 1552166
58316 1552166 1574559 1597827 1621192 1644685 1668831 1693816 1719375 1745277 1771505 1798079 1825016
58305 1825016 1852355 1880014 1907813 1935897 1964893 1995297 2026893 2059163 2092125 2126308 2161938
58294B161938L6662L7205L7750L8647L9802M1044M2406M4020M5901M7923M9897
58283B623195N1707N3422N5203N7096N9014O0964O3124O5553O7873O9422O9822
58272C296395O9452O9194O9609P0402P1007P1622P3244P6411Q0435Q4256Q7744
58261D119771R1471R5528R9384J03005J07198J12411J17877J22659J27056J32260
58251E228620J38724J45702J52534J59608J67621J76363J84929J93006K01261
58242F748368K10371K20261K30671K41923K54555K68494K83277K98944L16001
58233I072865L34547L54192L75036L97943M23379M50734M79376N09818N43133
58224A2941023N79727O19429O62607P10419P64021Q24108Q91127R65432J047352
$$ plain form
58294 2161938 2198600 2235805 2273555 2312202 2352004 2393048 2435454 2479474 2525375 2573298 2623195
58283 2623195 2674902 2728324 2783527 2840623 2899637 2960601 3023725 3089278 3157151 3226573 3296395
58272 3296395 3365847 3435041 3504650 3575052 3646059 3717681 3790925 3867336 3947771 4032027 4119771
58261 4119771 4211242 4306770 4406154 4509159 4616357 4728768 4846645 4969304 5096360 5228620
58251 5228620 5367344 5513046 5665580 5825188 5992809 6169172 6354101 6547107 6748368
58242 6748368 6958739 7179000 7409671 7651594 7906149 8174643 8457920 8756864 9072865
58233 9072865 9407412 9761604 10136640 10534583 10957962 11408696 11888072 12397890 12941023
58224 12941023 13520750 14140179 14802786 15513205 16277226 17101334 17992461 18957893 20005245
58215B0005245J137767J238499J351822J479937J625545J792298J983906K203604
58207C2818623K455927K747638L083377L459257L864642M295104M764462N301632
58199F2790662N934173O675282P525767Q484977R557297J0749888J2067441J3507411
58191A37292898J5051580J6649417J8194365J9496484K0258355K0078284J8522348
58184B65543731J5284228J0377321M237436k359944q544347j3621308j7229831
58177B53687286j9342121k0159736j9988080j9140068j7881387j6411340j4867162
58170A25897392j3338300j1880323j0525195r288878q177076p188927o318959
58163E9179734n558349m896173m320890l821687l388998l014056k688517k404928
$$ plain form
58215 20005245 21143012 22381511 23733333 25213270 26838815 28631113 30615019 32818623
58207 32818623 35274550 38022188 41105565 44564822 48429464 52724568 57489030 62790662
58199 62790662 68724835 75400117 82925884 91410861 100968158 111718046 123785487 137292898
58191 137292898 152344478 168993895 187188260 206684744 226943099 247021383 265543731
58184 265543731 280827959 291205280 295442716 293082772 284538425 270917117 253687286
58177 253687286 234345165 214185429 194197349 175057281 157175894 140764554 125897392
58170 125897392 112559092 100678769 90153574 80864696 72687620 65498693 59179734
58163 59179734 53621385 48725212 44404322 40582635 37193637 34179581 31491064 29086136
58155B9086136k157307j940763j750764j583185j434863j303521j187104j083601
58147A6645028r91300r08782q34716p68045p08210o54653o06273n61958n21441
58138A0089650m84979m52246m22233l94233l68243l44382l22614l03098k85999
58129F711623k70665k55728k40490k25643k12305k00755j90532j81181j72477
58120D761847j64225j56310j48763j41483j34223j27087j20700j15420j10778
58111C542858j06023j01031r6219r1814q7657q3676q0092p7040p4309p1563o8711
58100B604723o6023o3831o2025n9967n7094n3644n0455m7987m5907m3775m1706
58089B012309m0097l9037l8329l7779l7160l6188l4945l4113l4269l5062l5449
$$ plain form
58155 29086136 26928829 24988066 23237302 21654117 20219254 18915733 17728629 16645028
58147 16645028 15653728 14744946 13910230 13142185 12433975 11779322 11173049 10611091 10089650
58138 10089650 9604671 9152425 8730192 8335959 7967716 7623334 7300720 6997622 6711623
58129 6711623 6440958 6185230 5944740 5719097 5506792 5306037 5115505 4934324 4761847
58120 4761847 4597622 4441312 4292549 4151066 4016843 3889756 3769056 3653636 3542858
58111 3542858 3436835 3335804 3239585 3147771 3060114 2976438 2896346 2819306 2744997 2673434 2604723
58100 2604723 2538700 2474869 2412844 2352877 2295783 2242139 2191684 2143697 2097790 2054015 2012309
58089 2012309 1972212 1933175 1894846 1857067 1819907 1783719 1748774 1714661 1680392 1645330 1609881
58078A609881l4831l3551l2298l1295l0252k8910k7429k6226k5398k4468k2979
58067A292244k1329k0508k0802k1213k0636j9188j7887j7256j6961j6663j6479
58056A083322j6473j6370j6043j5750j5592j5222j4440j3713j3527j3575j3097
58045I19520j1995j1018j0782j1050j1147j0788j0189r579q956q342q002q178
58033G99494q726r180r260r133r111r180r050q666q420q703r293r360q290o420
58019F76702m864m429m877n374n565n781o197o293n545m309l502l510l886m141
58005F08429m285m455m502m306m099m134m285m276m137m055l978l783l768m435
57991E49931n701o759o889o205n288m413l429k243j124l59J08N51J027J277J082
$$ plain form
58078 1609881 1575050 1541499 1509201 1477906 1447654 1418744 1391315 1365089 1339691 1315223 1292244
58067 1292244 1270915 1250407 1229605 1208392 1187756 1168568 1150681 1133425 1116464 1099801 1083322
58056 1083322 1066849 1050479 1034436 1018686 1003094 987872 973432 959719 946192 932617 919520
58045 919520 907525 896507 885725 874675 863528 852740 842551 832972 824016 815674 807672 799494
58033 799494 790768 781588 772328 763195 754084 744904 735854 727188 718768 710065 700772 691412 683122 676702
58019 676702 671838 667409 662532 657158 651593 645812 639615 633322 627777 623468 619966 616456 612570 608429
58005 608429 604144 599689 595187 590881 586782 582648 578363 574087 569950 565895 561917 558134 554366 549931
57991 549931 544230 537471 530582 524377 519089 514676 511247 509004 507880 507521 507629 508180 509207 510484 511566
57976E11566O09L13M94J022J501J588J178L77o11j641k712l835m833n413n469
57961D94134n185m729m124l417k802k302j683r46o06j003j534j186J45J471K009
57946D68242K063K360K971L374L183K309P49j307l185m191m401m575n172n809
57932D56611n879n479n378o145p416q155p754o703n977n858n720n061m163l408
57918C73515k568j369l31j90o82p50l4O62N90k0n65q52q77m22M82J196J159O33
57900C69577K66J66p3o19j189j498j538j445j483j936k726l280l132k513k002
57885C46575j799j732j685j583j191m35K85O36Q77J303J483R17J84M45J761K950
57869C48991L324L462L887M041L317K192J505J219P91K36j20n37j507k737l465
$$ plain form
57976 511566 512175 512488 512982 514004 515505 517093 518271 518648 518037 516396 513684 509849 505016 499603 494134
57961 494134 488949 484220 480096 476679 473877 471575 469892 468946 468340 467337 465803 464617 464762 466233 468242
57946 468242 470305 472665 475636 479010 482193 484502 485251 483944 480759 476568 472167 467592 462420 456611
57932 456611 450732 445253 439875 433730 426314 418159 410405 403702 397725 391867 386147 381086 376923 373515
57918 373515 370947 369578 369247 369057 368375 367625 367591 368253 368843 368823 368258 367406 366529 366107 366589 367785 368944 369577
57900 369577 369843 370009 369936 369317 368128 366630 365092 363647 362164 360228 357502 354222 351090 348577 346575
57885 346575 344776 343044 341359 339776 338585 338150 338435 339071 339948 341251 342734 343651 343835 344280 346041 348991
57869 348991 352315 355777 359664 363705 367022 369214 370719 371938 372729 372965 372845 372308 370801 368064 364599
57854C64599l657l901m213l968l185k805l222l485k613j008J83N72P43J245K054
57839C37339K908L570L830L796M041N028O308O788N804L604P90k203m972p033
57825C69598q131q462q343p874p117o347n830n474n011m487m250m447m665m272
57811B84888l072j554m04J90N90J099J522J566J455J690K317K893L290L927M949
57796C05346N726N669N190N175N710O060N788N204M561L576K163R51M78K55o95
57781C61157k494m234n158n493n871o398o625o244n506m864m472m149l778l533
57767B92338l598l811l716k997j729k51J037J784J858J503J111Q21N20K37K21
57752B85328N37R37J247J571J958K196K201K193K280K216J928J854K291K828K880
$$ plain form
57854 364599 360942 357041 352828 348860 345675 342870 339648 336163 333550 332542 332725 333297 334040 335285 337339
57839 337339 340247 343817 347647 351443 355484 360512 366820 373608 379412 383016 383806 381603 376631 369598
57825 369598 361467 353005 344662 336788 329671 323324 317494 312020 307009 302522 298272 293825 289160 284888
57811 284888 281816 280262 279858 280048 280638 281737 283259 284825 286280 287970 290287 293180 296470 300397 305346
57796 305346 311072 316741 321931 327106 332816 338876 344664 349868 354429 358005 360168 361119 361597 361852 361157
57781 361157 358663 354429 349271 343778 337907 331509 324884 318640 313134 308270 303798 299649 295871 292338
57767 292338 288740 284929 281213 278216 276487 276236 277273 279057 280915 282418 283529 284350 284870 285107 285328
57752 285328 285865 286802 288049 289620 291578 293774 295975 298168 300448 302664 304592 306446 308737 311565 314445
57737C14445K533K195J839J325J202K179L793M573L936L063L358M664N587N264
57723C59956M206L524L711M223M194L498K975L314M028M141L664L604M334M999
57709D14371M885M492M655N335O004O599P290P741P528O982O848P314Q027Q879
57695E06950R956J0970J1570J2058J3033J4409J5616J6678J8169K0058K1604K2712
57683F93783K4388K7436L1376L5199L8531M1703M5193M9445N4782O1093O7986
57672A170915P5535Q4385R5079J07722J21990J35792J43146J35263J06444N9921
57662B236192P276l8441o9530q5423r0063q8300q3683p8068p2390o7299o3011
57651A507260n9099n5057n0937m7098m3606m0366l7499l5056l2595k9759k6988
$$ plain form
57737 314445 316978 319173 321012 322337 323539 325718 329511 334084 338020 341083 344441 349105 354692 359956
57723 359956 364162 367686 371397 375620 379814 383312 386287 389601 393629 397770 401434 405038 409372 414371
57709 414371 419256 423748 428403 433738 439742 446341 453631 461372 468900 475882 482730 490044 498071 506950
57695 506950 516906 527876 539446 551504 564537 578946 594562 611240 629409 649467 671071 693783
57683 693783 718171 745607 776983 812182 850713 892416 937609 987054 1041836 1102929 1170915
57672 1170915 1246450 1330835 1425914 1533636 1655626 1791418 1934564 2069827 2176271 2236192
57662 2236192 2243468 2205027 2135497 2050074 1960011 1871711 1788028 1709960 1637570 1570271 1507260
57651 1507260 1448161 1393104 1342167 1295069 1251463 1211097 1173598 1138542 1105947 1076188 1049200
57640A049200k4892k3060k0451j6971j3735j1520r857q084o364n087l972k434
57628I02773m24J667L558N036N815O069O706Q475J0963J3099J4506J5745J7332
57615A011320J9127K0764K2158K3450K4752K6047K7154K7807K7976K7943K7752
57604A286250K6767K4258K0345J5994J2024Q485M883P17m217r557j4422j8169
57592A353358k1119k4109k7277k9816l1013l1057l0622l0146k9840k9811k9802
57581A038746k9114k7358k5070k3142k1813k0609j9146j7565j6139j4918j3858
57570H10014j2979j2200j1284j0081q784p743p064o511n769m822l998l553l287
57557G11939k703j621m58K21L70M24P55J350K055K797L490L916L982L983M362
$$ plain form
57640 1049200 1024308 1001248 980797 963826 950091 938571 928714 920630 914266 909179 905207 902773
57628 902773 902349 904016 907574 912610 918425 924494 931200 939675 950638 963737 978243 993988 1011320
57615 1011320 1030447 1051211 1073369 1096819 1121571 1147618 1174772 1202579 1230555 1258498 1286250
57604 1286250 1313017 1337275 1357620 1373614 1385638 1394123 1399006 1399723 1395506 1385949 1371527 1353358
57592 1353358 1332239 1308130 1280853 1251037 1220024 1188967 1158345 1128199 1098359 1068548 1038746
57581 1038746 1009632 982274 957204 934062 912249 891640 872494 854929 838790 823872 810014
57570 810014 797035 784835 773551 763470 754686 746943 739879 733368 727599 722777 718779 715226 711939
57557 711939 709236 707615 707157 707378 707748 708172 708927 710277 712332 715129 718619 722535 726517 730500 734862
57542G34862N240O314P288Q117Q754Q990Q847Q931R848J1339J2533J3136J3746
57529H57945J4784J5762J6155J6422J7353J8747J9654J9889K0342K1661K3437
57518A062151K4973K6115K6920K7221K7007K6700K6495K5952K4715K3172K1800
57507A343221K0240J7700J4004R627M990M01l567o467q681j1008j3545j5629j6913
57494A334373j7782j8524j8815j8284j7097j5701j4462j3667j3434j3305j2446
57483A160856j0536q126n932m170k811j955j538j085j60J131K435L698N082O581
57469A143470Q067R558J1103J2539J3692J4700J5868J7294J8817K0260K1499K2407
57457A329274K3004K3489K4025K4610K5264K6060K6785K6797K5632K3528K1030
$$ plain form
57542 734862 740102 746416 753704 761821 770575 779565 788412 797343 807191 818530 831063 844199 857945
57529 857945 872729 888491 904646 921068 938421 957168 976822 996711 1017053 1038714 1062151
57518 1062151 1087124 1113239 1140159 1167380 1194387 1221087 1247582 1273534 1298249 1321421 1343221
57507 1343221 1363461 1381161 1395165 1404792 1409782 1410183 1406616 1400149 1391468 1380460 1366915 1351286 1334373
57494 1334373 1316591 1298067 1279252 1260968 1243871 1228170 1213708 1200041 1186607 1173302 1160856
57483 1160856 1150320 1142194 1136262 1132092 1129281 1127326 1125788 1124703 1124543 1125674 1128109 1131807 1136889 1143470
57469 1143470 1151537 1161095 1172198 1184737 1198429 1213129 1228997 1246291 1265108 1285368 1306867 1329274
57457 1329274 1352278 1375767 1399792 1424402 1449666 1475726 1502511 1529308 1554940 1578468 1599498
57446A599498J8249J4907J1049P252M020J250j616n007q808j2372j5001j6569
57434A596852j7607j8617j9443j9623j9156j8543j8060j7447j6430j5201j4039
57423A402686j2768j1055r140p785p358p244o515m999l321k013j042l03l2l15
57409A328796n87j50R75K253L478M786N937O371O160O127O625O952O459N646N493
57394A395321O091O722O958P017P182P510Q166R301J0543J1119J0706R781R102
57381A505519R054R540J0137J0432J0453J0711J1459J2170J2140J1535J1173J1384
57369A635707J1681J1628J1409J1320J1298J1227J1214J1311J1392J1555J2168
57358A761910J3202J3953J3809J2957J2064J1650J2014J3264J4922J5944J5769
$$ plain form
57446 1599498 1617747 1632654 1643703 1650955 1654975 1656225 1654609 1649602 1640794 1628422 1613421 1596852
57434 1596852 1579245 1560628 1541185 1521562 1502406 1483863 1465803 1448356 1431926 1416725 1402686
57423 1402686 1389918 1378863 1369723 1361938 1354580 1347336 1340821 1335822 1332501 1330488 1329446 1329143 1329111 1328796
57409 1328796 1328209 1328059 1329034 1331287 1334765 1339551 1345488 1351859 1358019 1364146 1370771 1377723 1384182 1389828 1395321
57394 1395321 1401412 1408134 1415092 1422109 1429291 1436801 1444967 1454268 1464811 1475930 1486636 1496417 1505519
57381 1505519 1514573 1524113 1534250 1544682 1555135 1565846 1577305 1589475 1601615 1613150 1624323 1635707
57369 1635707 1647388 1659016 1670425 1681745 1693043 1704270 1715484 1726795 1738187 1749742 1761910
57358 1761910 1775112 1789065 1802874 1815831 1827895 1839545 1851559 1864823 1879745 1895689 1911458
57347A911458J5053J4867J5357J5822J5921J6038J6437J6755J6637J6359J6392
57336B087096J6752J7087J7252J7426J7733J8081J8366J8675J9155J9727K0012
57325B287362J9654J8744J7845J7487J7692J8165J8809J9749K0844K1540K1478
57314B499369K1004K0787K1027K1379K1583K1768K2078K2365K2527K2845K3597
57303B740329K4535K5145K5359K5566K5884K5895K5310K4514K4154K4446K5147
57292C016284K5922K6454K6448K5986K5602K5613K5555K4764K3366K2071K1065
57281C289130J9870J8427J7504J7569J7880J7335J5921J4704J4501J5129J5930
57270C473900J6538J6977J7360J7733J8074J8346J8616J9069J9768K0468K0867
$$ plain form
57347 1911458 1926511 1941378 1956735 1972557 1988478 2004516 2020953 2037708 2054345 2070704 2087096
57336 2087096 2103848 2120935 2138187 2155613 2173346 2191427 2209793 2228468 2247623 2267350 2287362
57325 2287362 2307016 2325760 2343605 2361092 2378784 2396949 2415758 2435507 2456351 2477891 2499369
57314 2499369 2520373 2541160 2562187 2583566 2605149 2626917 2648995 2671360 2693887 2716732 2740329
57303 2740329 2764864 2790009 2815368 2840934 2866818 2892713 2918023 2942537 2966691 2991137 3016284
57292 3016284 3042206 3068660 3095108 3121094 3146696 3172309 3197864 3222628 3245994 3268065 3289130
57281 3289130 3309000 3327427 3344931 3362500 3380380 3397715 3413636 3428340 3442841 3457970 3473900
57270 3473900 3490438 3507415 3524775 3542508 3560582 3578928 3597544 3616613 3636381 3656849 3677716
57259C677716K1054K1515K2591K4111K5594K6684K7278K7404K7204K7035K7306
57248C955492K8075K8908K9371K9561K9895L0389L0582L0301L0066L0334L0685
57237D283659L0259K8890K7290K6122K5474K5140K4929K4543K3709K2696K2169
57226D564880K2267K2297K1696K0780K0128J9655J8814J7426J5807J4256J2882
57215D770888J1750J0810R842Q843Q233Q229Q297P799O960O541O704O888O778
57202D878562O629O502N963M841L691L003K553J913J207Q29P21M84N8k18j31J66
57186D916773M55O28O16M17K29K60L62K02j92l59p8J46l79j608k721l044k798
57169D908909k713l100l657m073m491n206o229p358q503r587j0290j0334r980
$$ plain form
57259 3677716 3698770 3720285 3742876 3766987 3792581 3819265 3846543 3873947 3901151 3928186 3955492
57248 3955492 3983567 4012475 4041846 4071407 4101302 4131691 4162273 4192574 4222640 4252974 4283659
57237 4283659 4313918 4342808 4370098 4396220 4421694 4446834 4471763 4496306 4520015 4542711 4564880
57226 4564880 4587147 4609444 4631140 4651920 4672048 4691703 4710517 4727943 4743750 4758006 4770888
57215 4770888 4782638 4793448 4803290 4812133 4820366 4828595 4836892 4844691 4851651 4858192 4864896 4871784 4878562
57202 4878562 4885191 4891693 4897656 4902497 4906188 4909191 4911744 4913657 4914864 4915693 4916414 4916898 4916956 4916738 4916607 4916773
57186 4916773 4917228 4917856 4918472 4918889 4919118 4919378 4919740 4919942 4919750 4919391 4919313 4919459 4919080 4917472 4914751 4911707 4908909
57169 4908909 4906196 4903096 4899439 4895366 4890875 4885669 4879440 4872082 4863579 4853992 4843702 4833368 4823388
57156D823388r924j0502j1312j1783j1862j1918j2126j2229j1916j1192j0296
57145D698328r424q715q393q747r800j1141j2295j3180j4005j4728j4933j4346
57133D558621j3188j1802j0272q626p095n741m087j724Q50K634L457M311O127
57120D513465Q795J1701J4831J8806K4075L0527L7815M5730N4284O3760P4709
57109D898498Q7676J02883J20297J40072J62801J89309K20231K55804K96232L42312
57099F816115L95554M57264N27467O05117O89303P79834Q76429R77797J081758
57090A3206638J185696J286327J379399J460266J524616J568001J584746J568339
57082B4764028J513509J417720J280754J103631Q88909O42148L72520R1571j88884
$$ plain form
57156 4823388 4813464 4802962 4791650 4779867 4768005 4756087 4743961 4731732 4719816 4708624 4698328
57145 4698328 4688904 4680189 4671796 4663049 4653249 4642108 4629813 4616633 4602628 4587900 4572967 4558621
57133 4558621 4545433 4533631 4523359 4514733 4507638 4501897 4497810 4496086 4496936 4499570 4503027 4507338 4513465
57120 4513465 4522260 4533961 4548792 4567598 4591673 4622200 4660015 4705745 4760029 4823789 4898498
57109 4898498 4986174 5089057 5209354 5349426 5512227 5701536 5921767 6177571 6473803 6816115
57099 6816115 7211669 7668933 8196400 8801517 9490820 10270654 11147083 12124880 13206638
57090 13206638 14392334 15678661 17058060 18518326 20042942 21610943 23195689 24764028
57082 24764028 26277537 27695257 28976011 30079642 30968551 31610699 31983219 32074790 31885906
57073C1885906m58263p07656r29945j120130j275612j395867j481658j534560
57065B2982215j556926j551784j522372j471945j404174j323380j233977j139784
57057A1777873j044117r50211q60858p77613p00785o30289n66157n08251m56098
57048E283494m09264l67585l30846k98603k70385k45775k24183k04989j87941
57039B743923j72915j59251j46041j33331j22154j12856j04326r5655q7686q1662
57029A528046p6944p1622o5308n9716n6069n3487n0643m7643m5217m2989m0074
57018I18334l6798l4389l3099l1833k9806k7494k5702k4574k3856k3376k2841
57007F04566k1841k0444j9264j8592j7970j6959j5716j4423j2830j0933r561r413
$$ plain form
57073 31885906 31427643 30719987 29790042 28669912 27394300 25998433 24516775 22982215
57065 22982215 21425289 19873505 18351133 16879188 15475014 14151634 12917657 11777873
57057 11777873 10733756 9783545 8922687 8145074 7444289 6814000 6247843 5739592 5283494
57048 5283494 4874230 4506645 4175799 3877196 3606811 3361036 3136853 2931864 2743923
57039 2743923 2571008 2411757 2265716 2132385 2010231 1897375 1793049 1697394 1609708 1528046
57029 1528046 1451102 1379480 1314172 1254456 1198387 1144900 1094257 1046614 1001397 958408 918334
57018 918334 881536 847147 814048 782215 752409 724915 699213 674639 650783 627407 604566
57007 604566 582725 562281 543017 524425 506455 489496 473780 459357 446527 435594 426033 416620
56995D16620r869r587q139o343n002m075l171k231j400p16k16j0OJ42M66N93P1
56978C67139j229l142n276o924p433o865o007n466n083m514l909l548l075j795
56964C02873J94J855K454K552L308M926O348O550N811N167M796L594O61l216o238
56949C41635p561p917q212q309p631o349n258m664m089l103j863o90M24J645K951
56934B81009M221N493O828Q003Q520P968O307L784O56k972o910j0540j2908j3443
56920B86016j2580j1415j0718j0409j0028r446q910q529q023p012n432l624k134
56907A77756j430j663k476l099k855j747m61L98R47J681K609L154L007K674K862
56892A81357L625M462N135N886O853P721Q141Q102P705O788N192L200J406R4r96
$$ plain form
56995 416620 406751 397164 389025 382682 377680 373605 370434 368203 366803 366087 365871 365861 365867 366009 366475 367068 367139
56978 367139 365910 362768 357492 350568 343135 336270 330263 324797 319714 315200 311291 307743 304668 302873
56964 302873 303067 304922 307376 309928 313236 318162 324510 331060 336871 342038 346834 350428 351089 347873 341635
56949 341635 334074 326157 317945 309636 302005 295656 290398 285734 281645 278542 276679 275989 276413 278058 281009
56934 281009 285230 290723 297551 305554 314074 322042 328349 332133 332789 329817 322907 312367 299459 286016
56920 286016 273436 262021 251303 240894 230866 221420 212510 203981 195958 188946 183514 179890 177756
56907 177756 176326 174663 172187 169088 166233 164486 164025 164423 165370 167051 169660 172814 175821 178495 181357
56892 181357 184982 189444 194579 200465 207318 215039 223180 231282 238987 245775 250967 254167 255573 255667 254671
56877B54671k155l163l453k784j542l21O77J679K885M280N800P443R049J0309
56863B83375J1298J2675J4949J7563J9135J8657J6202J2430P932L219j076m479
56851D11880o967q620r155q240o250m226k904k022p51J421M459Q090J1935J5462
56837D04112J8301K0693K3270K6103K8209K8300K5785K0858J3909N414l657j1885
56825E99412j8142k2062k3781k3683k2454k0851j8996j6342j2702q828n516k576
56813D03479O62M191P482J0568J3978J7484J9843K0111J8435J5212J0258L452
56801E45155m386j1895j8081k2367k4312k4068k2721k1401k0109j8057j5040j1741
56789C30977q729n928l170n82J728L787N404O240O469O655O740N778L239p4l004
$$ plain form
56877 254671 252516 249353 245900 243116 241574 241253 241930 243609 246494 250774 256574 264017 273066 283375
56863 283375 294673 307348 322297 339860 358995 377652 393854 406284 414216 417435 416359 411880
56851 411880 404913 396293 387138 378898 372648 368422 365518 363496 362745 364166 368625 376715 388650 404112
56837 404112 422413 443106 466376 492479 520688 548988 574773 595631 609540 614954 611297 599412
56825 599412 581270 559208 535427 511744 489290 468439 449443 433101 420399 411571 406055 403479
56813 403479 404141 408332 415814 426382 440360 457844 477687 497798 516233 531445 541703 545155
56801 545155 540769 528874 510793 488426 464114 440046 417325 395924 375815 357758 342718 330977
56789 330977 322248 316320 313150 312568 314296 318083 323487 329727 336196 342851 349591 355369 358608 358534 355530
56774C55530n569q667j2409j5583j6973j6581j5330j3982j2789j1809j1057j0325
56762B04456r208p550n689m210l415l177l233l514m054m662m888m382l252j981
56748A41241j088q05j013j343j422j107o06k85l40n91o59l48J52M73M83L95M49
56731A33586O13O65M74J42r7l4K62L59j40r61j211m13P40J076L48n89q83n82k21
56712A33134j43l74q15j151r55k18M49M92P2k63k80j44K9K40L48J84j38l31l91
56693A29745n34p34o38m3P99J450J568J020J0q63r91l14O59J410J720J455N69
56676A36288n29j073o98M9L45J7l46j51N80J330J624J429J086Q32N42P8k51L4
56658A41186Q16J358J237Q95Q57Q83L66o35j368j401j077q09m56K82J183J618
$$ plain form
56774 355530 349961 341294 328885 313302 296329 279748 264418 250436 237647 225838 214781 204456
56762 204456 195248 187698 182009 177799 174384 171207 167974 164460 160406 155744 150856 146474 143222 141241
56748 141241 140153 139348 138335 136992 135570 134463 133857 133572 133232 132641 131982 131634 131786 132259 132742 133137 133586
56731 133586 134199 134864 135338 135480 135383 135349 135611 135970 135830 134869 133658 133245 133985 135061 135409 134820 133937 133355 133134
56712 133134 132991 132617 131802 130651 129696 129478 129927 130419 130491 130228 129948 129804 129833 130073 130421 130605 130467 130136 129745
56693 129745 129211 128477 127839 127796 128595 130045 131613 132633 132643 131780 130789 130475 131134 132544 134264 135719 136288
56676 136288 135759 134686 133988 134037 134382 134399 134053 133902 134482 135812 137436 138865 139951 140783 141325 141403 141152 141186
56658 141186 142002 143360 144597 145492 146349 147232 147598 146963 145595 144194 143117 142308 141852 142134 143317 144935
56642A44935J221J74j037j939k216j864j281r58r76r16m61P0N5o03j239j207n95
56625A31163N5M91P53O46j92j424j916r84O10J497J280O76K61j21o40r44p87n74
56607A29850q06j257j251n64L97J137J407J082K94l54j79Q03J794K052J584R41
56591A36930O10P17R94R76M90qJ27Q36J320J113O84O40P88N13j28m70k80n9j36
56572A45657n3P10J781K195J506K71m91j87R93K291K988K910K475K213K293K517
56556A70069K637K598K548K637K733K399J421K94j06M14R53M97q33j871j753q91
56540A83746m27r20j793k081j549q70o85q87j008j057j402j957k130j732j316
56525A63932j290j308j000p55j073j555j347l86N36R12R21P38K33m46p57n58l14
$$ plain form
56642 144935 146156 146330 145293 143354 141138 139274 137993 137035 136059 135143 134682 134752 134807 134204 132965 131758 131163
56625 131163 131218 131709 132462 133108 132916 131492 129576 128592 129202 130699 131979 132655 132916 132795 132155 131211 130424 129850
56607 129850 129044 127787 126536 125972 126369 127506 128913 129995 130289 129935 129756 130559 132353 134405 135989 136930
56591 136930 137540 138257 139251 140227 140717 140709 140836 141672 142992 144105 144789 145429 146217 146730 146602 146132 145852 145793 145657
56572 145657 145604 146314 148095 150290 151796 152067 151576 151389 152382 154673 157661 160571 163046 165259 167552 170069
56556 170069 172706 175304 177852 180489 183222 185621 187042 187336 187230 187644 188597 189094 188261 186390 184637 183746
56540 183746 183319 182399 180606 178525 176976 176106 175421 174534 173526 172469 171067 169110 166980 165248 163932
56525 163932 162642 161334 160334 159579 158506 156951 155604 155218 155754 156666 157587 158325 158558 158112 157355 156797 156483
56508A56483k55K7P03J154R19N47Q00J397J433Q04L01L59M77J96j39J7N22P41
56490A66486M31m7k99l52m18n45o25p08j071j814k568k718j985o60P18J743K236
56473A57804K247K027J861J745J422Q44L56K60L94M03L28N88J372K222K410J697
56457A77980O78K53O77J308J361Q07J80k72p42j265j455j102n13m3K81M78M74
56440A79085M56Q31J424J340J44j306j859j461q80m57kL31M7p53j287j141p41
56423A73771o11p01o90m57l9M45P53P15N65O75J060J472J850K185K111J351M57
56406A84912K87P61J003Q05R03J561J914J312M27K73Q55J523K010K357K301J654
56390B04858R54R13J442J946K282K719L101K913K177J569J523J752J763J446J005
$$ plain form
56508 156483 156228 156255 156958 158112 159031 159578 160378 161775 163208 164012 164313 164672 165149 165345 165206 165223 165745 166486
56490 166486 166917 166870 166571 166219 165801 165256 164631 163923 162852 161038 158470 155752 153767 153107 153825 155568 157804
56473 157804 160051 162078 163939 165684 167106 167950 168306 168566 168960 169363 169691 170279 171651 173873 176283 177980
56457 177980 178658 178911 179588 180896 182257 183064 183244 182972 182230 180965 179510 178408 177895 177852 178133 178611 179085
56440 179085 179541 180372 181796 183136 183280 181974 180115 178654 177774 177317 177315 177646 177693 176940 175653 174512 173771
56423 173771 173160 172459 171769 171312 171273 171718 172471 173186 173751 174426 175486 176958 178808 180993 183104 184455 184912
56406 184912 185199 185960 186963 187768 188671 190232 192146 193458 193885 194158 195013 196536 198546 200903 203204 204858
56390 204858 205812 206725 208167 210113 212395 215114 218215 221128 223305 224874 226397 228149 229912 231358 232363
56375B32363P12P14Q37O73J26l76m75m23n51n96j63M66P26P73J250K079K379J780
56357B42294R77O93Q00Q43Q34J034J380J577J528J319J037Q42R11J141J203J069
56341B59482J144J652K278K672K957L323L453K873J739Q59Q44J527K268K662K831
56326B92564L074L369L403L200L331M161N137N430N117N065N598O074N978N637
56312C57138N383M863L858L114L437M352M599L841L024L093M111N648P217Q152
56298D21830P858O536N107M179L603L290L692M979O342O818O505O265O476O754
56284E00234O897P343Q453R817J0742J1202J1940J3557J5812J7973J9741K1513
56272F55224K3673K5976K8019L0119L3131L7287M1836M6102N0401N5363O0930
$$ plain form
56375 232363 233075 233789 234626 235299 235425 235049 234574 234151 233600 233004 232841 233307 234033 234806 236056 238135 240514 242294
56357 242294 243271 243964 244764 245607 246441 247475 248855 250432 251960 253279 254316 255158 256069 257210 258413 259482
56341 259482 260626 262278 264556 267228 270185 273508 276961 279834 281573 282432 283276 284803 287071 289733 292564
56326 292564 295638 299007 302410 305610 308941 313102 318239 323669 328786 333851 339449 345523 351501 357138
56312 357138 362521 367384 371242 374356 377793 382145 386744 390585 393609 396702 400813 406461 413678 421830
56298 421830 429688 436224 441331 445510 449113 452403 456095 461074 467416 474234 480739 487004 493480 500234
56284 500234 507131 514474 522927 532744 543486 554688 566628 580185 595997 613970 633711 655224
56272 655224 678897 704873 732892 763011 796142 833429 875265 921367 971768 1027131 1088061
56261A088061O6653P2722P9702Q7301R4341J00224J05604J11129J16222J19761
56251B041720J21381J21260J18946J13411J04354R2641P9134O3852M6737K8705
56241B932141J1254m833j9816l4051m7169n8402o7428p4651q0768q6197r0871
56230B379209r4479r6821r7971r8161r7500r5878r3192q9657q5796q2012p8145
56219A369597p3678o8413o2833n7630n2957m8349m3405l8361l3905l0503k7921
56208H31642k5385k2236j8522j4985j2422j1049j0461j0057r428q460p271o082
56196F75284n008m062l346l046l095k972k186r04J99P22Q68J013J275J629K144
56181F58515K908L868M845N649O138O356O604P111P721Q082Q237Q609R412J0376
$$ plain form
56261 1088061 1154714 1227436 1307138 1394439 1488780 1589004 1694608 1805737 1921959 2041720
56251 2041720 2163101 2284361 2403307 2516718 2621072 2713713 2792847 2856699 2903436 2932141
56241 2932141 2943395 2938562 2918746 2884695 2837526 2779124 2711696 2637045 2556277 2470080 2379209
56230 2379209 2284730 2187909 2089938 1991777 1894277 1798399 1705207 1615550 1529754 1447742 1369597
56219 1369597 1295919 1227506 1164673 1107043 1054086 1005737 962332 923971 890066 859563 831642
56208 831642 806257 784021 765499 750514 738092 727043 716582 706525 697097 688637 681366 675284
56196 675284 670276 666214 662868 659822 656727 653755 651569 650665 650864 651586 652454 653467 654742 656371 658515
56181 658515 661423 665291 670136 675785 681923 688279 694883 701994 709715 717797 726034 734643 744055 754431
56167G54431J1206J1933J2694J3518J4497J5857J7573J9296K0884K2657K4863
56156I39409K7241K9537L2094L5467L9631M4113M8842N4457O1735P0977Q1823
56145A465326R3283J03851J11739J15117J12313J02457Q6620O8196N1528L9719
56135B350149L3486L1576L1588L0617K6063J6821M029r346j9904k5519k6473k5398
56123B417689k5873l0684m0755n5038p0982q5431r5739j00525r9746r4348q5918
56112A632650p6013o5467n4453m3434l3591k5862j9971j4942j0356o541l667j369
56100A276984P29K654M343N875P311Q681J0080J1596J3147J4598J5848J6671J6820
56087A405337J6705J7372J9125K0700K0666J9340J8292J8138J7981J7175J6349
$$ plain form
56167 754431 765637 777570 790264 803782 818279 834136 851709 871005 891889 914546 939409
56156 939409 966650 996187 1028281 1063748 1103379 1147492 1196334 1250791 1312526 1383503 1465326
56145 1465326 1558609 1662460 1774199 1889316 2001629 2104086 2190706 2258902 2310430 2350149
56135 2350149 2383635 2415211 2446799 2477416 2503479 2520300 2524329 2514983 2495079 2469560 2443087 2417689
56123 2417689 2391816 2361132 2320377 2265339 2194357 2108926 2013187 1912662 1812916 1718568 1632650
56112 1632650 1556637 1491170 1436717 1393283 1359692 1333830 1313859 1298917 1288561 1282020 1278353 1276984
56100 1276984 1277713 1280367 1284710 1290585 1297896 1306577 1316657 1328253 1341400 1355998 1371846 1388517 1405337
56087 1405337 1422042 1439414 1458539 1479239 1499905 1519245 1537537 1555675 1573656 1590831 1607180
56076A607180J6285J6723J6989J7027J7199J7649J8349J9329K0377K1057K1365
56065A809529K1924K3176K4849K6552K8271K9933L1160L1904L2700L3772L4567
56054B128337L4740L4946L5986L7737L9650M1616M3578M4901M5188M5237M6182
56043B578098M7898M9400N0588N2396N5191N8169O0623O2742O4861O6768O8254
56032C214988O9542P0709P1397P1711P2731P5371P9111Q2593Q5233Q7676R0735
56021D071797R4537R8858J03629J08764J13831J18361J22550J27250J33081J39664
56011E232322J46088J51965J57758J64033J70859J78096J85857J94265K03103
56002F784346K12120K21541K31793K42874K54439K66534K79759K94563L10811
$$ plain form
56076 1607180 1623465 1640188 1657177 1674204 1691403 1709052 1727401 1746730 1767107 1788164 1809529
56065 1809529 1831453 1854629 1879478 1906030 1934301 1964234 1995394 2027298 2059998 2093770 2128337
56054 2128337 2163077 2198023 2234009 2271746 2311396 2353012 2396590 2441491 2486679 2531916 2578098
56043 2578098 2625996 2675396 2725984 2778380 2833571 2891740 2952363 3015105 3079966 3146734 3214988
56032 3214988 3284530 3355239 3426636 3498347 3571078 3646449 3725560 3808153 3893386 3981062 4071797
56021 4071797 4166334 4265192 4368821 4477585 4591416 4709777 4832327 4959577 5092658 5232322
56011 5232322 5378410 5530375 5688133 5852166 6023025 6201121 6386978 6581243 6784346
56002 6784346 6996466 7218007 7449800 7692674 7947113 8213647 8493406 8787969 9098780
55993I098780L28156L46599L66444L88017M11566M37252M65064M94888N26861
55984A2863627N61559N99782O42141O88920P40199P96165Q57412R25035J000343
55975A9675183J084431J178174J282696J399776J531733J681050J850405K043116
55967C1726564K263393K515908K805414L137251L518176L956091M458503N031471
55959E9412771N680221O410267P227716Q139451R154060J0282461J1536345J2924150
55951A30767442J4444416J6074584J7753214J9355459K0663219K1340174K0943730
55944B61342238J9019536J5287202R839446L219022l710103j0042380j5103940
55937B79851021j8586116k0517511k1143688k0796770j9800699j8421826j6855937
$$ plain form
55993 9098780 9426936 9773535 10139979 10527996 10939562 11376814 11841878 12336766 12863627
55984 12863627 13425186 14024968 14667109 15356029 16096228 16892393 17749805 18674840 19675183
55975 19675183 20759614 21937788 23220484 24620260 26151993 27833043 29683448 31726564
55967 31726564 33989957 36505865 39311279 42448530 45966706 49922797 54381300 59412771
55959 59412771 65092992 71503259 78730975 86870426 96024486 106306947 117843292 130767442
55951 130767442 145211858 161286442 179039656 198395115 219058334 240398508 261342238
55944 261342238 280361774 295648976 305488422 308707444 304997341 294954961 279851021
55937 279851021 261264905 240747394 219603706 198806936 179006237 160584411 143728474
55930A43728474j5236175j3647639j2141328j0745910r476299q338102p329407
55923F6813614o442748n667730m992930m406777l898311l457704l076049k744852
55915C2126513k456325k204011j982775j788316j617013j465823j331902j212577
55907A8067771j105910j010846r26313q50688p82656p21955o68426o20597n76238
55898A0804142n34253m95323m60509m29876m02567l77590l54210l32005l10927
55889G106882k91199k72990k56206k40656k26348k13641k02980j94294j86706
55880E021862j79169j71378j63686j56151j48325j40143j32392j25830j20354
55871C684434j15447j10834j06302j01381r5990r0911q6943q3894q1032p8182
$$ plain form
55930 143728474 128492299 114844660 102703332 91957422 82481123 74143021 66813614
55923 66813614 60370866 54703136 49710206 45303429 41405118 37947414 34871365 32126513
55915 32126513 29670188 27466177 25483402 23695086 22078073 20612250 19280348 18067771
55907 18067771 16961861 15951015 15024702 14174014 13391358 12669403 12000977 11380380 10804142
55898 10804142 10269889 9774566 9314057 8884181 8481614 8104024 7749814 7417809 7106882
55889 7106882 6815683 6542693 6286487 6045831 5819483 5605842 5402862 5208568 5021862
55880 5021862 4842693 4671315 4507629 4351478 4203153 4063010 3930618 3804788 3684434
55871 3684434 3568987 3458153 3351851 3250470 3154480 3063569 2976626 2892732 2811700 2733518
55861B733518p5570p2992p0033o6913o4264o2106n9854n7321n4857n2503m9884
55850B047221m7050m4560m2604m0818l9203l8281l8082l7754l6707l5395l4446
55839A612321l3670l2529l1060k9672k8412k7072k5714k4463k3100k1325j9348
55828A315956j7670j6363j5168j4072j3369j3165j3269j3572j4116j4804j5449
55817A154939j6104j6991j7982j8595j8620j8450j8545j8806j8746j8147j7288
55806I56665j6563j6054j5584j4979j4167j3021j1369r310p362n976m923l500
55794H23857j542jk48k852p142j1786j5540j7640j7942j6869j5150j3418j2078
55781F91649j1440j1665j2512j3311j3409j2705j1712j1064j0922j0821j0105
$$ plain form
55861 2733518 2657948 2584956 2514923 2448010 2383746 2321640 2261786 2204465 2149608 2097105 2047221
55850 2047221 2000171 1955611 1913007 1872189 1832986 1794705 1756623 1718869 1682162 1646767 1612321
55839 1612321 1578651 1546122 1515062 1485390 1456978 1429906 1404192 1379729 1356629 1335304 1315956
55828 1315956 1298286 1281923 1266755 1252683 1239314 1226149 1212880 1199308 1185192 1170388 1154939
55817 1154939 1138835 1121844 1103862 1085267 1066647 1048197 1029652 1010846 992100 973953 956665
55806 956665 940102 924048 908464 893485 879318 866297 854928 845618 838256 832280 827357 823857
55794 823857 822315 822314 822066 819214 812072 800286 784746 767106 749164 732295 717145 703727 691649
55781 691649 680209 668544 656032 642721 629312 616607 604895 593831 582909 572088 561983
55770E61983q650p076o184o178o536o649o382o020n861o085o813q069r577j0858
55756D61045j1611j1865j1720j1153j0260r566r637j0390j0988j0724r756q803
55744C34572q182p534o471n211m284l800l356k611j777j319j382j734k177k703
55730B82031l207l314k788k005j714k244l151l748l842l773l864m013l875l276
55716B37217k356j445q80q75j351j896k092j901j645j474j147n21o3l48j087j294
55700B16842o22o1p38k405l721l822k982j847p56j1n9q78j657j561o43L98J046
55683A96523J249J144R42J006J513K116K263J873J405J257J356J350R44R0r07
55668B14124j527j537j358j577k175k590k610k736l407m229m396l722k875k528
$$ plain form
55770 561983 553333 546257 540073 533895 527359 520710 514328 508308 502447 496362 489549 481480 471903 461045
55756 461045 449434 437569 425849 414696 404436 394870 385233 374843 363855 353131 343375 334572
55744 334572 326390 318856 312385 307174 302890 299090 295734 293123 291346 290027 288645 286911 284734 282031
55730 282031 278824 275510 272722 270717 269003 266759 263608 259860 256018 252245 248381 244368 240493 237217
55716 237217 234861 233416 232536 231661 230310 228414 226322 224421 222776 221302 220155 219634 219571 219223 218136 216842
55700 216842 216220 216159 215421 213016 209295 205473 202491 200644 199888 199877 199818 198940 197283 195722 195079 195477 196523
55683 196523 197772 198916 199858 200864 202377 204493 206756 208629 210034 211291 212647 213997 214941 215031 214124
55668 214124 212597 211060 209702 208125 205950 203360 200750 198014 194607 190378 185982 182260 179385 176857
55654A76857k597k498j913j077l93k8Pk42n02k73N80J327R98l59j582j772j255
55637A65278q44o28k02L13L16k63q32j134j630k496l062k794k221k180k507k369
55621A42745j701j375j817k310k156j776k011k753l094k675k163k287k967l670
55607A09990m083m178l920l342k684k177j840j688j829k153k223j854j473j441
55593G5105j436j028o03q81j694k104j837j644j935k052j455p59p97j244j107
55578E4529k33N88Q90R56R65N70l39j127j158o96o07j258k017j932q47K87M21
55561D8992k91o30O6Q78M99r45j970j611m44L46L02k40q40j233j242q56l29J13
55543D0565N65J192J747J667P36m91j121q40k20J2j52j35K63N17J83m33p83r08
$$ plain form
55654 176857 174260 171762 169849 168772 168379 168351 168358 168116 167614 167341 167921 169248 170246 169887 168305 166533 165278
55637 165278 164434 163806 163604 163917 164233 163970 163138 162004 160374 157878 154816 152022 149801 147621 145114 142745
55621 142745 141044 139669 137852 135542 133386 131610 129599 126846 123752 121077 118914 116627 113660 109990
55607 109990 105907 101729 97809 94467 91783 89606 87766 86078 84249 82096 79873 78019 76546 75105
55593 75105 73669 72641 72038 71157 69463 67359 65522 63878 61943 59891 58436 57677 56880 55636 54529
55578 54529 54296 54884 55774 56730 57695 58265 57926 56799 55641 54945 54338 53080 51063 49131 48284 48571 48992
55561 48992 48701 48071 48137 49015 49514 48569 46599 44988 44544 44890 45192 44952 44112 42879 41637 40781 40452 40565
55543 40565 41130 42322 44069 45736 46472 45981 44860 44020 43800 43812 43660 43525 43788 44305 44488 44055 43272 42364
55525D2364j166j440j142j19J041J633J468Q26J63j65j91l80j017j681j724j108
55509C7362l51L23J084J862K238K169K140K339K298J632O61o0l85m30k25K5j99
55492E2483j105k061k208j448n42l20j035k253l125l028k194j533j536j700j335
55477B7060o04k96o98j285j482j245q15l51K4J09j86o47r08p94m90l75o94j301
55459A5022j777j782j341p49k94k7K40O89J203J417J169P30M28K20q4l92n13n99
55441A3560r44j343j238n39J57L61K01Qj51l30m72n38n23k15N87J490J712J060
55423A2843J98l32o76r78q27OQ59Q88R0r20j776k323k166j106J37M83j78q66p83
55404B573j58K84J67l03o38m50J64O73P40O23P22R30Q64M85Q6j87l52l30j37p3
$$ plain form
55525 42364 41198 39758 38616 38497 39538 41171 42639 43465 43628 43463 43272 42892 41875 40194 38470 37362
55509 37362 37011 37334 38418 40280 42518 44687 46827 49166 51464 53096 53757 53697 53312 52882 52657 52682 52483
55492 52483 51378 49317 47109 45661 45119 44799 43764 41511 38386 35358 33164 31631 30095 28395 27060
55477 27060 26456 26160 25462 24177 22695 21450 20635 20284 20308 20417 20231 19584 18676 17882 17392 17017 16323 15022
55459 15022 13245 11463 10122 9373 9079 9052 9292 9981 11184 12601 13770 14500 14928 15148 15064 14672 14159 13560
55441 13560 12616 11273 10035 9496 9653 10014 10215 10223 10072 9742 9270 8732 8209 7994 8581 10071 11783 12843
55423 12843 13041 12709 12033 11055 10228 10234 11093 11981 12071 11151 9375 7052 4886 3780 3917 4400 4222 3356 2573
55404 2573 2415 2699 2866 2563 1925 1475 1639 2312 3052 3675 4397 5327 6191 6676 6762 6575 6223 5893 5756 5683
55384E683k91l73O1O06O11K39K13N91O69J59l67m52l51l56k76l3o6o04j032o34
55364C997L63R99P43k8n80n64k20o6l90r31j178r56n26j36J91M04L26m6m64A68
55343h66j242j138n93J53P40R80R12b98E61J288J519R68j72j074j324E34d84m23
55325i07c26A012J315Q83P40R33R91O74P1p61j690A932c9j146m15o9Q2J78J98
55306a211K69c42F91J124P13J13l96q13B66a038j107o57j14M42R23c32I22J015
55288A937M86j89o43n62j07K51K85K42M79J061J708J993J588N60n02r31n82O7
55270G141M49L89P6k13l11k03m6n4l30p37r28n80K11Q19O23k69j066j213r03n51
55250B304j75L36O62M30p3j87J52L18p0o99j179C20a336j363n53K42M01o2o22
$$ plain form
55384 5683 5392 5019 5080 5686 6297 6536 6749 7340 8009 8168 7801 7349 6998 6642 6366 6333 6267 5663 4631 3997
55364 3997 4360 5359 6102 6074 5494 4930 4710 4644 4254 3323 2145 1189 663 527 718 1122 1448 1402 938 168
55343 -866 -2108 -3246 -3839 -3686 -2946 -1966 -1054 -298 561 1849 3368 4336 4164 3090 1766 534 -484 -907
55325 -907 -326 1012 2327 3210 3950 4883 5874 6548 6619 5858 4168 1932 -39 -1185 -1600 -1669 -1587 -1409 -1211
55306 -1211 -942 -342 691 1815 2528 2641 2245 1432 266 -1038 -2145 -2802 -2916 -2474 -1551 -332 922 1937
55288 1937 2423 2234 1591 1029 922 1173 1458 1700 2179 3240 4948 6941 8529 9089 8587 7656 7074 7141
55270 7141 7590 7979 8055 7842 7531 7328 7282 7228 6898 6161 5233 4653 4864 5683 6306 6037 4971 3758 2855 2304
55250 2304 2129 2465 3127 3557 3484 3297 3449 3767 3697 2998 1819 320 -1336 -2699 -3252 -3010 -2609 -2671 -3293
55231c293q48o23j02K81R8m94p32j82O55J075J097J165f18E01Q05P92R80P68P4
55212C920m13k76J50N41J085J713J615L08j367k079j610q88o34p17E92D6Q2J080
55194A208J769J373J62o57m52R1J42j14j16o6n67A371b27p52L82B71O30K37J00
55175A238J56J66M4r1o8J48L78L95J95RO6L02L88K9o24r96o75k0J81l22E0e53
55152a97A069J487J052N14M54R83J514J313M03m26o63o20o16k46Q08J797J663
55135A0486N95j70q9J37j14n49p40q51j001p50Q0P79O58J20N5N13P57M20p7j84
55115A0075K42J001J658J805J603J793K661L403L235K789L384M980O052N691M775
55100E5147M465M468L666J830j47j483k234k831l512m165m390l770k500j550j728
$$ plain form
55231 -3293 -4141 -4764 -4866 -4585 -4487 -4981 -5713 -5895 -5240 -4165 -3068 -1903 -618 501 1306 2098 3078 3846 3920
55212 3920 3507 3231 3381 3922 5007 6720 8335 8643 7276 5197 3587 2699 2065 1348 592 46 128 1208
55194 1208 2977 4350 4512 3855 3403 3494 3636 3522 3406 3340 2773 1371 -227 -979 -597 271 901 1138 1238
55175 1238 1394 1560 1604 1513 1445 1593 1971 2366 2561 2570 2636 2938 3326 3355 2731 1735 1060 1040 1221 899 50 -553
55152 -197 1069 2556 3608 4122 4576 5559 7073 8386 8789 8363 7700 7080 6464 6218 7026 8823 10486
55135 10486 11081 10911 10822 10959 10845 10296 9556 8705 7704 6954 7034 7813 8471 8591 8646 9159 9916 10336 10259 10075
55115 10075 10317 11318 12976 14781 16384 18177 20838 24241 27476 30265 33649 38629 44681 50372 55147
55100 55147 59612 64080 67746 69576 69429 67946 65712 62881 59369 55204 50814 47044 44544 42994 41266
55085D1266k658l261l050k448j870j228m97QK48P10J533J898R94p22j902j853
55069B7168j126n74m13m04m13m99o62p41n23Q5P77R39L05m89n12L16J155J402
55051B5791J320J277J062M39j53j67J86K77Q4J49O06R73R55Q43R46J201J497J898
55033C9184K285K269J752J129P13L47j15l70j13L99P05Q31J208J998K900L611
55017E8733M112M455M534M182L355K152P55o27j732k248j960j131n78r43j853
55002G1206k160j285M0O50K54n47j225j824k437k771k498j762j113r71j297j724
54986E0536j959j995j969j847j396n25M52J012Q39M4r09j437j184l49M40O87M17
54969D0857p3o14j104j265q43n2N33O09M07K33N0j85p3Q49K296L265L203K764
$$ plain form
55085 41266 38608 35347 32297 29849 27979 26751 26254 26262 26510 27220 28753 30651 31645 30923 29021 27168
55069 27168 26042 25468 25055 24651 24238 23739 23077 22336 21813 21898 22675 23614 23919 23430 22918 23234 24389 25791
55051 25791 27111 28388 29450 29889 29736 29569 29755 30032 30116 30265 30871 31844 32799 33642 34588 35789 37286 39184
55033 39184 41469 43738 45490 46619 47332 47679 47564 47194 47081 47480 48185 49016 50224 52222 55122 58733
55017 58733 62845 67300 71834 76016 79371 81523 82278 81651 79919 77671 75711 74580 74002 73059 71206
55002 71206 69046 67761 67801 68451 68705 68158 66933 65109 62672 59901 57403 55641 54528 53557 52260 50536
54986 50536 48577 46582 44613 42766 41370 40845 41297 42309 43148 43192 42283 40846 39662 39313 39753 40440 40857
54969 40857 40784 40170 39066 37801 36958 36906 37439 38048 38455 38688 38738 38553 38480 39329 41625 44890 48093 50857
54951E0857K994L975M846N145N442O364P644Q662R484J0620J1941J2623J2155
54938A52752J0774Q806O202K992l64l393n924p761q538q363q133q699r847j0562
54924A09942j0192r010p744o853o246n465m225k790j714j119o11QM05L57L52J020
54908E6115K244L289L692L656L655M064N065O472P673Q142Q018P864P820P348
54894A35117N881L448N43k430n263p656r082r248q680q451r012r488q680o645
54880F0354m679l688l310k888k476k333k135j486p78p21j236j619j566j307q45
54865B9287Q3J178J619J142N01M09O18L96l39q62n44L53R20O13p5k49J25O2j043
54846C4194k453l044k689k035j345n19k9o28j961k538j536J09R37O23n5l09J08
$$ plain form
54951 50857 53851 57826 62672 67817 73259 79623 87267 95929 105413 116033 127974 140597 152752
54938 152752 163526 172332 178534 181526 181162 177769 171845 164084 155546 147183 139050 130351 120504 109942
54924 109942 99750 90740 82996 76143 69897 64432 60207 57417 55703 54584 53973 53981 54386 54743 55095 56115
54908 56115 58359 61648 65340 68996 72651 76715 81780 88252 95925 104067 112085 119949 127769 135117
54894 135117 140998 144446 144989 142559 137296 129640 120558 111310 102630 94179 85167 75679 66999 60354
54880 60354 55675 51987 48677 45789 43313 40980 38845 37359 36581 35860 34624 33005 31439 30132 29287
54865 29287 29370 30548 32167 33309 33810 34219 34837 35233 34894 34032 33488 33841 34761 35374 35299 35050 35175 35237 34194
54846 34194 31741 28697 26008 23973 22628 22109 22080 21452 19491 16953 15417 15526 16463 17086 17031 16722 16830
54829A6830J027J932K166J528N01l36q54j111r48l08M00O90O03N25N50M15m3o72
54811B2895j235j527j354o69K40R82J471J974K628L116L024K438J997K220K872
54796D1072L344L489L791M577N588O514P480Q550R254R212Q870Q855Q817P747
54782A37160N368K418m22l087n433o948p448p401p143o485n448m636m359m024
54768H2112l090k065j875k480k901k503j677j177j222j407j266p87k49L56J445
54753F1214L064M345M451L862L919N077O453P367Q227R500J0684J1048J0584R520
54739A59315P554M392O06k878n734q019r534j0126j0298j0608j0797j0237q955
54726H4681p468n981m547l647l650l955l622k671j883j537j363j482k167k760
$$ plain form
54829 16830 17857 19789 21955 23483 23984 23648 22794 21683 20735 20427 20827 21517 22120 22645 23195 23610 23567 22895
54811 22895 21660 20133 18779 18110 18350 19332 20803 22777 25405 28521 31545 33983 35980 38200 41072
54796 41072 44416 47905 51696 56273 61861 68375 75855 84405 93659 102871 111741 120596 129413 137160
54782 137160 142528 144946 144524 141437 136004 129056 121608 114207 107064 100579 95131 90495 86136 82112
54768 82112 79022 76957 75082 72602 69701 67198 65521 64344 63122 61715 60449 59662 59413 59769 61214
54753 61214 64278 68623 73074 76936 80855 85932 92385 99752 107979 117479 128163 139211 149795 159315
54739 159315 166869 171261 171867 168989 163255 155236 145702 135576 125278 114670 103873 93636 84681
54726 84681 77213 71232 66685 63038 59388 55433 51811 49140 47257 45720 44357 42875 40708 37948
54712C7948k159o15K70k31r55o71K03N21J81p6pl7l11m33j15M28P55N14l22j279
54692C3609j633j148k95L86Q33J107J002M32j18j3Q16J936K898L360L043K060
54676D8275J078O58O19M14rj90J02N79Q82Q83N22k10j042j495j322p82l77m43
54658D8142r69j639k000j740r01J74J035J311R06J87k18M3P94J673K478K976K810
54641E5062J982J238J422K486L615M336M942N680O114N732M822M237M378M824
54627A10870M991M759M362L897L091J516q55l282m625m484l811l976n195o341
54613A00917o430n701m982m535m124l732l511l252k650j995j819j916j522o59
54599E4089l52j062j821j525m66K10P6l43n68n51k90J95N50M67K21K43K71k04
$$ plain form
54712 37948 35789 35174 35444 35213 34258 33587 33790 34311 34492 34416 34409 34372 34061 33628 33513 33941 34696 35210 34888 33609
54692 33609 31976 30828 30533 30919 31752 32859 33861 34293 34175 34162 34978 36914 39812 43172 46215 48275
54676 48275 49353 50011 50630 51044 51035 50845 50947 51526 52408 53291 53813 53603 52561 51066 49744 48962 48585 48142
54658 48142 47173 45534 43534 41794 40893 41067 42102 43413 44319 44506 44288 44331 45125 46798 49276 52252 55062
54641 55062 57044 58282 59704 62190 65805 70141 75083 80763 86877 92609 97431 101668 106046 110870
54627 110870 115861 120620 124982 128879 131970 133486 132631 129349 124724 120240 116429 112453 107258 100917
54613 100917 94487 88786 83804 79269 75145 71413 67902 64650 62000 60005 58186 56270 54748 54089
54599 54089 53737 52675 50854 49329 48863 49073 49149 48806 48238 47687 47397 47592 48142 48609 48830 49073 49344 49140
54581D9140q40p11J51N26l02j471j675p87K50O89N40K20J14M17R47J259J094N79
54563E0140q6p82j215j023l93l8k01k34M08J196J179K84o67j041q61l93J36L96
54545D6805J50l18m52j04L62O79R05J030Q47L36j74m38m77k94K24Q87J179R51
54527E2098Q28J436K465K996K678K187K349L141L821L814L219K477J836J224M92
54512H7061l74j227j849k130k148k104k153k338k629k906k865k257j292n77m02
54497E9810l70n4K96J74k63l07K83R59J229J209J116Q01K31j54RM46P40R82J371
54478F8508J539R22k61j083j030n23k50m31q19j095j093r11q55j016j006m97J64
54461F0263L50J23K09Q22J170N38o06j136o60R4J97m97j342j600j100l44N5K0
$$ plain form
54581 49140 48300 47589 47740 48266 47964 46493 44818 44031 44281 44970 45510 45730 45844 46261 47208 48467 49561 50140
54563 50140 50054 49272 48057 47034 46641 46603 46402 46168 46576 47772 48951 49235 48568 47527 46666 46273 46409 46805
54545 46805 46955 46637 46185 46081 46443 47122 48027 49057 49904 50240 50066 49628 49151 48857 49081 49968 51147 52098
54527 52098 52926 54362 56827 59823 62501 64688 67037 70178 73999 77813 81032 83509 85345 86569 87061
54512 87061 86687 85460 83611 81481 79333 77229 75076 72738 70109 67203 64338 62081 60789 60212 59810
54497 59810 59440 59386 59682 59856 59593 59286 59569 60528 61757 62966 64082 64883 65114 64960 64969 65415 66155 67137 68508
54478 68508 70047 70969 70708 69625 68595 68072 67822 67391 66572 65477 64384 63473 62618 61602 60596 60099 60263
54461 60263 60613 60736 60945 61767 62937 63475 62869 61733 61073 61167 61364 60867 59525 57925 56825 56481 56536 56556
54443E6556j8J47J55l21q69p46K8M98l6r79j098r4R76J107O59P36J469J729P77
54424F0676n38q39j9P69Q15O07Q21J291J475J335J157R27N08K19N81J446K024
54407G3255J929J654J767K028J765R01Q6j96k22n11j006j161p55k05kj14k43m19
54389G8551q77j497j787j550j159j000r57p50m82m57o50p23n15j50K47N82N66
54372F7392q9j106j730j553r92o14l81J22Q80J338J124N23R8J24M99R80J350J429
54354F9394J158P28N18Q36J636K419K524J625J26j063j257n84J26J07o73j613
54338G6007k127k156j963j681j304j013j101j481j614j225p47p04r24q45m49l01
54322E6372o01q90q85j004j618k266k186j389n87j58K44R41J593J531O04n69j136
$$ plain form
54443 56556 56538 56685 56840 56519 55650 54904 54932 55430 55394 54415 53317 53223 54199 55306 55965 56701 58170 59899 60676
54424 60676 60138 59299 59280 60049 60864 61471 62292 63583 65058 66393 67550 68477 68985 69204 69785 71231 73255
54407 73255 75184 76838 78605 80633 82398 83299 83385 83189 82967 82456 81450 80289 79534 79329 79327 79213 78970 78551
54389 78551 77674 76177 74390 72840 71681 70681 69724 68974 68492 68035 67385 66662 66147 65997 66244 66826 67392
54372 67392 67303 66197 64467 62914 61922 61308 60927 61049 61929 63267 64391 64914 65012 65136 65635 66615 67965 69394
54354 69394 70552 71280 71798 72634 74270 76689 79213 80838 80964 79901 78644 78060 78186 78293 77620 76007
54338 76007 73880 71724 69761 68080 66776 65763 64662 63181 61567 60342 59595 58891 57967 57122 56673 56372
54322 56372 55771 54881 53996 52992 51374 49108 46922 45533 44946 44788 45032 45973 47566 49097 49701 49132 47996
54305D7996q25k83m17j316k014j650n02M36O46L91m7o20j032p49J69Q36O20mj36
54286D1499L36O74K94o63j626k070j757r10j20J86J56J35O6l51r87j242p67J60
54268C3013J073J753K042J676O62l46n45J59J030J350J134Q89Q84R34Q42P86J006
54251D8342J322J234N27m34j127j344j194p86k02L42N10J90l37o40n88m82o57
54234D4676r78r19k78L82L52k10m02K22R56Q19k17j258j572j233p54n12o33j023
54216C7418j404j468j193q55p09p61q17o51j11O87J276J214N44j82m38j26M63
54199C2887Q41N32n52j806k264j526j50R90J549J728J677J300N86j45n27m49p0
54182C4601L31M96L30L4l4K29N10M77K40K19N77R84J009N84n7o50j005r88o84
$$ plain form
54305 47996 47171 46888 46471 45155 43141 41491 40989 41425 42071 42462 42415 41795 40763 40014 40183 41019 41639 41635 41499
54286 41499 41835 42509 42803 42140 40514 38444 36687 35777 35657 35843 35999 36134 36200 35849 34862 33620 32853 33013
54268 33013 34086 35839 37881 39557 40219 39873 39328 39487 40517 41867 43001 43890 44774 45708 46550 47336 48342
54251 48342 49664 50898 51425 50991 49864 48520 47326 46540 46338 46680 47190 47380 47043 46403 45815 45333 44676
54234 44676 43698 42779 42501 42883 43235 43025 42623 42845 43801 44620 44403 43145 41573 40340 39586 39074 38441 37418
54216 37418 36014 34546 33353 32498 31789 31028 30211 29560 29449 30136 31412 32626 33170 32988 32550 32424 32887
54199 32887 33728 34260 33708 31902 29638 28112 27962 28952 30501 32229 33906 35206 35792 35647 35120 34671 34601
54182 34601 34932 35428 35758 35792 35758 35987 36497 36974 37214 37433 38010 38994 40003 40587 40530 39880 38875 37887 37203
54163C7203m66o47j044j191r49o50n41m31m4N53J054J251J066M39m39j025q68
54146C3271j54M84O57M60J00l15n56l38J81L44j82q19p42l5L54q5o65m18N86J353
54126C3481J298Q86P65Q28N39q8m69l14RQ8OK8J03k1l26m50q0P13J457J629J128
54105D1210M40J41K71M45N60Q85J362J354N03o26j203j131r25q49o81k54L82J200
54087D3084K098K576K110R63N8p9J90L52L83M00J70m87j151j164m66L58Q51J115
54069E1361J401J588J304M77m12p08k25N19P87M09l4J65J088K170K819K921K717
54052F8347K399K002J653J658K147K804L139L072K934K897K697K104J356R25R95
54037A01129J366J736J843J534R93P20R70J333J153L28o57j399j894k212k269
$$ plain form
54163 37203 36737 36090 35046 33855 32906 32256 31715 31284 31240 31793 32847 34098 35164 35603 35164 34139 33271
54146 33271 33117 33601 34258 34718 34818 34503 33947 33609 33790 34134 33952 33133 32391 32356 32710 32625 31960 31542 32128 33481
54126 33481 34779 35665 36430 37258 37797 37709 37240 36926 36935 37023 37029 37057 37160 37139 36813 36363 36283 36996 38453 40082 41210
54105 41210 41650 41791 42062 42507 43067 43952 45314 46668 47171 46545 45342 44211 43286 42437 41756 41502 41884 43084
54087 43084 45182 47758 49868 50831 50889 50810 51000 51352 51735 52135 52305 51818 50667 49503 49037 49395 50246 51361
54069 51361 52762 54350 55654 56131 55719 55011 54786 55305 56092 56501 56467 56632 57720 59890 62709 65630 68347
54052 68347 70746 72748 74401 76059 78206 81010 84149 87221 90155 93052 95749 97853 99209 100134 101129
54037 101129 102495 104231 106074 107608 108601 109321 110291 111624 112777 113105 112448 111049 109155 106943 104674
54022A04674k089k023k402l113l615l480k875k475k676k976k481j144n4j19r21
54007G2231j353j083p16p43j010j223j304j136o08l0N1l72p01o11m25m11l02J00
53989F0354L90J19m61o66k22M39O15o4j217j881j435m32%l22l82M40J360J349
53971E7984O83M04O74O28j16q00o41P8N50N91P44J404K264K719K510J814R58K93
53953G2741K15Q82J780K029J443R08J229J983K143J633J366J841K595L266M209
53938A00263N644O994P599P508P078O446N904O046O902P523P155O238N492M687
53924A91479L259J610O73M79K33l28p34q90j242j778j907j582j544k153k821l041
53908A79713l159l645m251m443m157l687l249l009l073l216l051k760l061m072
$$ plain form
54022 104674 102585 100562 98160 95047 91432 87952 85077 82602 79926 76950 74469 73325 73271 73152 72231
54007 72231 70878 69795 69079 68336 67326 66103 64799 63663 63055 63025 63076 62704 62003 61392 60967 60556 60254 60354
53989 60354 60744 60863 60402 59736 59514 59953 60568 60504 59287 57406 55971 55539 55539 55217 54835 55275 56635 57984
53971 57984 58667 59071 59745 60373 60257 59457 58816 58894 59444 60035 60779 62183 64447 67166 69676 71490 72448 72741
53953 72741 72956 73838 75618 77647 79090 79998 81227 83210 85353 86986 88352 90193 92788 96054 100263
53938 100263 105907 112901 120500 128008 135086 141532 147436 153482 160384 167907 175062 181300 186792 191479
53924 191479 194738 196348 197021 197500 197733 197405 196671 195781 194539 192761 190854 189272 187728 185575 182754 179713
53908 179713 176554 172909 168658 164215 160058 156371 153122 150113 147040 143824 140773 138013 134952 130880
53894A30880m870m699m034l805l994l795k904j945j539j593j659j521j270j023
53880I2229q05n71k82K0J51r6p63j605k165k097j510r84r99j377j471q98R1R33
53862G7801J230R06K25l78o13n56m07k39j43l24p21q16l24K08J38k44j88J42j72
53843G5525j241j969j663j022r49j215j040l23M83J186J774J925J430P68N70P11
53827G4950O95O24R83J626J854J513J166J157J173R94R25J300J970K606L082L324
53811I9942L198K774K360K140K020J965K162K635K979K730J868Q30R9j44j52k63
53795A27143m65m15p8ro28j508j935j966k217k728k784k112j453j517j993k167
53779A03168k005k018k291k311j809j179r21j075j368j671k013k298k262j815
$$ plain form
53894 130880 126010 121311 117277 113472 109478 105683 102779 100834 99295 97702 96043 94522 93252 92229
53880 92229 91424 90853 90571 90591 90742 90646 89883 88278 86113 84016 82506 81522 80523 79146 77675 76777 76868 77801
53862 77801 79031 79937 80162 79784 79171 78615 78208 77969 77826 77502 76781 75965 75641 75849 75987 75743 75555 75697 75525
53843 75525 74284 72315 70652 69630 68681 67466 66426 66103 66586 67772 69546 71471 72901 73669 74239 74950
53827 74950 75645 76269 77252 78878 80732 82245 83411 84568 85741 86735 87660 88960 90930 93536 96618 99942
53811 99942 103140 105914 108274 110414 112434 114399 116561 119196 122175 124905 126773 127603 127702 127558 127406 127143
53795 127143 126678 126263 126185 126176 125548 124040 122105 120139 117922 115194 112410 110298 108845 107328 105335 103168
53779 103168 101163 99145 96854 94543 92734 91555 90634 89559 88191 86520 84507 82209 79947 78132
53765G8132j203p62n98o84j090j793k289j945r26k82o93j513j665j095o38o10
53749F0346n01o9J77p3l12r5K02O8k26j11L30O26P82J080J273Q44K2k84K43Q21
53729F5143O60j4m21k34K23N49O46O47P12Q01O39P3m78l38N55J413J477Q39J08
53710G3000l69n87m75R3R35J640J968J963J707J373J291J617J954J803J411J515
53694I0839K220K739K568K231K386K748K626K154K051K322K107J037j38n82m29
53679A16879k76k81l28o02j271j811j468l75N05O17M32N39Q10P61L29j59n69r65
53661A12767j218j003k31P42J443J607J221M39m08r48j007p20l30P3N62J169J734
53644A15892J999J827J276N17j95n38l50K1j08r75j897j994j251m58j03J18N77
$$ plain form
53765 78132 76929 76167 75569 74885 73795 72002 69713 67768 66842 66560 65867 64354 62689 61594 60956 60346
53749 60346 59845 59776 59953 59880 59568 59473 59675 59743 59517 59406 59736 60362 61144 62224 63497 64341 64363 64079 64322 65143
53729 65143 65803 65789 65368 65134 65357 65906 66552 67199 67911 68712 69351 69424 68946 68608 69163 70576 72053 72892 73000
53710 73000 72631 72044 71569 71662 72597 74237 76205 78168 79875 81248 82539 84156 86110 87913 89324 90839
53694 90839 93059 95798 98366 100597 102983 105731 108357 110511 112562 114884 116991 118028 117890 117308 116879
53679 116879 116603 116322 115994 115392 114121 112310 110842 110467 110972 111589 112021 112560 113370 114131 114460 114301 113732 112767
53661 112767 111549 110546 110315 111057 112500 114107 115328 115767 115359 114411 113404 112684 112354 112427 112989 114158 115892
53644 115892 117891 119718 120994 121511 121316 120778 120428 120449 120341 119366 117469 115475 114224 113766 113663 113781 114358
53627A14358J005R76O63O39J061J487J460R79L85J18M60J245J801J582Q32L81
53611A29432P08J544K329K771K801K475K075K084K670L343L387K645J671J125
53597A61060J091J147R27N95N80R40J300J390J431J644J776J450Q39M22K12j99
53581A76605q00j047p73n50p86j105j003o65m98m39k82l22q20j163n11Q35J600
53564A68276J145J11p42j341j634j117K51J372J201J48n46n79p79j533j983j196
53548A61054N37K075K723K677K423K165J846J474J160R97R49R52J082J483K097
53533A85694K544K517K222K274L033M216N212N661N642N431N241N157N208N403
53519B45455N781O445P489Q750R713R879R315Q623Q259Q117Q037Q388R657J1510
$$ plain form
53627 114358 115363 116339 117002 117641 118702 120189 121649 122628 123013 123131 123591 124836 126637 128219 129051 129432
53611 129432 130140 131684 134013 136784 139585 142060 144135 146219 148889 152232 155619 158264 159935 161060
53597 161060 162151 163298 164225 164820 165400 166340 167640 169030 170461 172105 173881 175331 176170 176592 176804 176605
53581 176605 175805 174758 173985 173435 172649 171544 170541 169876 169378 168939 168657 168335 167515 166352 165841 166676 168276
53564 168276 169421 169532 168790 167449 165815 164698 164949 166321 167522 167670 167124 166545 165766 164233 162250 161054
53548 161054 161591 163666 166389 169066 171489 173654 175500 176974 178134 179131 180080 181032 182114 183597 185694
53533 185694 188238 190755 192977 195251 198284 202500 207712 213373 219015 224446 229687 234844 240052 245455
53519 245455 251236 257681 265170 273920 283633 293512 302827 311450 319709 327826 335863 344251 353908 365418
53505C65418J2948J3560J4030J5034J6210J6722J6489J6194J6272J6496J6518
53494E35891J6274J5837J5311J4921J4809J4699J4266J3786J3972J5002J6194
53483G00962J6800J6691J6167J5554J5144J5048J4872J4034J2660J1587J1273
53472H60792J1236J0976J0787J1010J1014R834P581N393M032L183K232J031k65
53459I48836j529k691l767n020o653q298r312r643r853j0209j0313r964r782j0454
53445H41348j1771j2913j3389j3270j2756j2036j1424j1171j1137j1013j0796
53434G09672j0708j0682j0318r372p934o142m073j980l35N83R06R51R61J127J586
53419F54242K321L246M358N576O459O615O432O961Q689J0828J2265J2906J3602
$$ plain form
53505 365418 378366 391926 405956 420990 437200 453922 470411 486605 502877 519373 535891
53494 535891 552165 568002 583313 598234 613043 627742 642008 655794 669766 684768 700962
53483 700962 717762 734453 750620 766174 781318 796366 811238 825272 837932 849519 860792
53472 860792 872028 883004 893791 904801 915815 925649 933230 938623 942655 945838 948070 949101 948836
53459 948836 947307 944616 940849 935829 929176 920878 911566 901923 892070 881861 871548 861584 851802 841348
53445 841348 829577 816664 803275 790005 777249 765213 753789 742618 731481 720468 709672
53434 709672 698964 688282 677964 668592 660658 654516 650443 648463 648128 648711 649617 650568 651529 652656 654242
53419 654242 656563 659809 664167 669743 676202 682817 689249 696210 704899 715727 727992 740898 754500
53406G54500J4919J6578J8031J9065J9611J9576J9184J9187K0238K2158K4148
53395I67195K5678K6930K8256K9551L0416L0865L1520L2881L4586L5695L5800
53384A309373L5515L5656L6219L6598L6493L6121L5554L4451L2727L0914K9491
53373A689112K8181K6329K3778K0962J8241J5589J2907J0345Q200O615N285L385
53361A868929J23m357q892j2525j5586j9021k2916k6317k8605l0261l2013l3810
53349A634749l5079l5560l5450l5042l4633l4528l4621l4137l2284k9237k6178
53338A268000k4292k3919k4622k5777k6897k7583k7453k6372k4701k3060k1647
53327I91677k0029j7905j5852j4726j4350j3477j1360q708o789o130o573p906
$$ plain form
53406 754500 769419 785997 804028 823093 842704 862280 881464 900651 920889 943047 967195
53395 967195 992873 1019803 1048059 1077610 1108026 1138891 1170411 1203292 1237878 1273573 1309373
53384 1309373 1344888 1380544 1416763 1453361 1489854 1525975 1561529 1595980 1628707 1659621 1689112
53373 1689112 1717293 1743622 1767400 1788362 1806603 1822192 1835099 1845444 1853644 1860259 1865544 1868929
53361 1868929 1869052 1864695 1855803 1843278 1827692 1808671 1785755 1759438 1730833 1700572 1668559 1634749
53349 1634749 1599670 1564110 1528660 1493618 1458985 1424457 1389836 1355699 1323415 1294178 1268000
53338 1268000 1243708 1219789 1195167 1169390 1142493 1114910 1087457 1061085 1036384 1013324 991677
53327 991677 971648 953743 937891 923165 908815 895338 883978 875270 868481 862351 855778 847872
53315H47872r688j0853j0532r201q186q020p987p425o617o087n751n270m647l938
53301G43670k794r67R95K202K545K824L686M897N839O386P007Q118R551J0784
53287H04743J1537J2031J2659J3503J4370J5128J5772J6162J5998J5209J4085
53276I61197J2896J1597J0122Q758P867P325O579N267L543J750Q2j324k282k847
53262A030530l583n134p487r888j1690j3024j4398j5866j6974j7559j8065j8882
53250H77980j9726k0082k0024k0037k0226k0190j9723j9157j8714j8059j6797
53239F65245j5209j4010j3551j3551j3652j3852j4310j4900j5197j4865j3980
53228E08168j2924j1969j1014r797q334p051o367o239o141n572m582l806l819
$$ plain form
53315 847872 838184 827331 816799 807598 799412 791392 783405 775980 769363 763276 757525 752255 747608 743670
53301 743670 740876 739909 740904 743106 745651 748475 752161 757058 762897 769283 776290 784408 793959 804743
53287 804743 816280 828311 840970 854473 868843 883971 899743 915905 931903 947112 961197
53276 961197 974093 985690 995812 1004570 1012437 1019762 1026341 1031608 1035151 1036901 1036983 1035659 1033377 1030530
53262 1030530 1026947 1021813 1014326 1004438 992748 979724 965326 949460 932486 914927 896862 877980
53250 877980 858254 838172 818148 798111 777885 757695 737972 718815 700101 682042 665245
53239 665245 650036 636026 622475 608924 595272 581420 567110 552210 537013 522148 508168
53228 508168 495244 483275 472261 462464 454130 447079 440712 434473 428332 422760 418178 414372 410553
53215D10553m484n126n464o002p198q555r149q967r050j0081j1381j1750j0865
53202C02481r445q313p810p851q070p884o939n651m899n112n884o510o659o450
53188B05004o178o055o015n645m618l242k358k439l024l250k792k116j868k240
53174A53164k847l068k606j797j332j504j857j793j345j078j216j329j009m59
53160A29924j09L0K22L91K12k17l55n3J37j65m44k6Q45J220P11j36o72p66m89
53141A30260P5N15K09p59j407j064l00K4P7N70J242J005k77j272r69m9K04k28
53123A27856l48J41L75k67j189j434r68n93q46j461j855j772j410j128j138j361
53107A12602j484j257p09p6M33P05O34J15p99j791k431k465j975j289o77j78K46
$$ plain form
53215 410553 406069 400943 395479 389477 382279 373724 364575 355608 346558 336477 325096 313346 302481
53202 302481 293036 284723 276913 269062 260992 253108 246169 240518 235619 230507 224623 218113 211454 205004
53188 205004 198826 192771 186756 181111 176493 173251 170893 168454 165430 162180 159388 157272 155404 153164
53174 153164 150317 147249 144643 142846 141514 140010 138153 136360 135015 133937 132721 131392 130383 129924
53160 129924 129815 129845 130067 130458 130670 130453 130098 130045 130182 130017 129573 129547 130392 131612 132323 132187 131515 130749 130260
53141 130260 130335 130850 131059 130300 128893 127829 127529 127553 127630 128200 129442 130447 130170 128898 127929 127880 128084 127856
53123 127856 127508 127649 128024 127757 126568 125134 124166 123573 122727 121266 119411 117639 116229 115101 113963 112602
53107 112602 111118 109861 109152 109076 109509 110214 110848 110963 110164 108373 105942 103477 101502 100213 99536 99358 99604
53090I9604M55K20l74q66r61r39j202j533j253k22Q00R96M04l25p65r37r00o27
53072I1575k63j22k44l24j68M8R1J2mP6J83K60K07j44p57j259j271q59m66l71
53052H6200l94j04O28J376J504Q60nm64n63q26j352j561j011n2O30Q47Q38O61
53034H7212J87l86n39j20L77M96M37P29J467K168K347K014J598J526J860K277
53018A03650K361J976J358Q01L93J16Q4L58O00K45p48j672j867j563j499j812
53002A02781j878j357q06q16j113r90l83J53L34L62L32P6k67k88q8l59j289k033
52984I2371j803r63m10l00n5N68J151J339J269J131Q47L27k65o64o98l01L62Q29
52966I4735O77l6q82j550j862j490k38J337K123J640O06L8J00K81K95L73O63R06
$$ plain form
53090 99604 100059 100279 99905 99039 98078 97139 95937 94404 93151 92929 93729 94725 95129 94804 94039 93102 92202 91575
53072 91575 91312 91190 90946 90622 90454 90502 90593 90605 90601 90677 90860 91120 91327 91183 90426 89167 87896 87037 86571 86200
53052 86200 85806 85702 86330 87706 89210 90070 90065 89601 89038 88212 86860 85299 84288 84236 84866 85713 86551 87212
53034 87212 87399 87013 86474 86354 86731 87227 87664 88393 89860 92028 94375 96389 97987 99513 101373 103650
53018 103650 106011 107987 109345 110146 110539 110655 110739 111097 111697 111942 111194 109522 107655 106092 104593 102781
53002 102781 100903 99546 98740 97924 96811 95821 95438 95591 95925 96287 96619 96695 96428 96140 96052 95693 94404 92371
52984 92371 90568 89605 89195 88895 88840 89408 90559 91898 93167 94298 95145 95472 95207 94543 93845 93544 93906 94735
52966 94735 95412 95376 94494 92944 91082 89592 89354 90691 92814 94454 95060 95098 95198 95479 95774 96147 96810 97716
52948I7716Q01M36J67K32N88J008J231J109P31M31M91Q08R77P88M72L44L04O9
52930A08703k68l03J8K37P6r7J57O83J005R71P46L90j23n98p88p24n71l49j36
52911A09029k37o38n90M82J920K425J719P61K84N4k49l54j19o8n49j004q01k47
52893A11818n7k62l55k13j00nK85N44L41j79l41O4N25O14N52P46J201J595J650
52874A18423J353J053J308K281L308L520K925K377K431K716K657K231J681Q87
52860A49151m19j964k998l111k696k489k776l238l423l276l070k899k505j720
52846A12567r06n70p61j102j393j705j862j421m73N8n74j798k260j473l89j37
52830I5801o94j155j030p35p91j093j213j051q27n96j75M00P49O11J80j61l13
$$ plain form
52948 97716 98517 98953 99120 99352 99940 100948 102179 103288 104019 104450 104941 105749 106726 107514 107986 108330 108634 108703
52930 108703 108435 108132 108150 108387 108463 108366 108523 109206 110211 111182 111928 112318 112195 111597 110809 110085 109514 109165 109029
52911 109029 108792 108154 107564 108046 109966 112391 114110 114871 115155 115209 114960 114606 114487 114419 113870 112866 112065 111818
52893 111818 111761 111499 111144 110931 110831 110826 111111 111655 111996 111817 111476 111540 112065 112679 113231 113977 115178 116773 118423
52874 118423 119776 120829 122137 124418 127726 131246 134171 136548 138979 141695 144352 146583 148264 149151
52860 149151 148732 146768 143770 140659 137963 135474 132698 129460 126037 122761 119691 116792 114287 112567
52846 112567 111661 111091 110330 109228 107835 106130 104268 102847 102374 102432 101858 100060 97800 96327 95938 95801
52830 95801 95107 93952 92922 92187 91396 90303 89090 88039 87212 86616 86441 86841 87590 88201 88381 88220 87907
52813H7907m07n11n41n08n40p63j100j296j087n51j68l03o23l91N01J231J072
52796H1922K81l74o82j014j487j748j592j279j083r57p67n25k69J8K86M69O57
52779G1856R25J042P35J55k70m69o53p12l33J77M0o97q33M18K076K484J359k5
52761G7275n12j75K62L39O2k81k97J54P14R58J008J226J442J162N82O07J487K200
52743H8213J787P16K00M77O57J64n49r32j179j721k350k467j950j297r64r72j133
52726G6700j275j200p87k56p5l64o49m35J14M17K67R7L13P44Q45L72l80r02r27
52707G2619n61j28J30K25L39N35O73N44J26l38n15k62K07N05M88M28O34R32Q07
52688G7388J06o14o40P5Q89J220J132J092J216J008N1j141j411l58R09R77m9o83
$$ plain form
52813 87907 87500 86989 86448 85940 85400 84637 83537 82241 81154 80603 80435 80132 79509 79118 79619 80850 81922
52796 81922 82203 81829 81147 80133 78646 76898 75306 74027 72944 71987 71220 70695 70426 70444 70730 71199 71856
52779 71856 72781 73823 74558 74713 74443 73974 73321 72609 72276 72453 72493 71796 70963 71381 73457 75941 77300 77275
52761 77275 76763 76588 76850 77189 77251 76970 76673 76827 77541 78499 79507 80733 82175 83337 83919 84526 86013 88213
52743 88213 90000 90716 90916 91393 92050 92214 91665 90733 89554 87833 85483 83016 81066 79769 78805 77833 76700
52726 76700 75425 74225 73438 73182 73107 72743 72094 71659 71773 72190 72457 72554 72867 73611 74456 74828 74448 73546 72619
52707 72619 72058 71930 72060 72285 72624 73159 73832 74376 74502 74164 73649 73387 73594 74099 74587 75015 75649 76581 77388
52688 77388 77494 76880 76240 76315 77204 78424 79556 80648 81864 82872 82923 81782 80371 80013 80922 81899 81850 81167
52670H1167q7Q66R62L61Q3L29L41j36l66J33P62P51L23K11M73M49k09j031j305
52651H4077q50j28J97n8l54MQ17J024R6r96q82L26J096M56p76j119k36Q73J141
52632H4708N19j39k1P72J251O70m68r14k87M18K17n77r98q21n31k34M55J425J852
52613H7297J345O16N93J320K143K569K531K118J546J173J140J108P21J56j11K4
52597A06289K74N08Q68J375J768J872J720J279M68m84r92q02m10n20j185j754
52581A10274j688j153p50q42j258j610j719j635j378q69k26J66O6k30k46kln33
52563I6364j231j585j572j501j432j080l93K06L24J36J15L05L02J7m1M82J068
52546I0484R58L09M5M90R16P23L17K70K63l33j219j506j126r22j207j198l33O89
$$ plain form
52670 81167 81080 81946 82908 83269 83352 83681 84022 83886 83520 83653 84415 85166 85489 85700 86173 86622 86413 85382 84077
52651 84077 83227 83099 83296 83238 82884 82888 83705 84729 84825 83829 82947 83273 84369 84825 84049 82930 82694 83567 84708
52632 84708 85227 85088 85067 85839 87090 87760 87292 86378 86091 86509 86726 86149 85151 84330 83799 83565 84020 85445 87297
52613 87297 88642 89258 89851 91171 93314 95883 98414 100532 102078 103251 104391 105499 106220 106376 106265 106289
52597 106289 106563 107071 107939 109314 111082 112954 114674 115953 116421 115937 114945 114143 113733 113213 112028 110274
52581 110274 108586 107433 106683 105841 104583 102973 101254 99619 98241 97372 97146 97312 97378 97148 96902 96900 96897 96364
52563 96364 95133 93548 91976 90475 89043 87963 87570 87776 88100 88236 88351 88656 88958 88975 88934 89416 90484
52546 90484 91442 91751 91796 92286 93202 93925 94242 94512 94775 94442 93223 91717 90591 89669 88462 87264 86931 87620
52528H7620P92r9j147j733j916j941j775j224k76O19P34j88j382j760j242q05
52512G4277r86j118n02M24Q00O35N29N65M36L83R41J736J611J67j568k347j914
52495G4069q71N7L41p7n68l68M02Q71P05N58R30J327J095M67J51K95N30O25N73
52476H1112K95j11j00P41J934K564K338J750J271R43O51L19j41o54p98k82M85
52459I2317P81N17K95M59O73N49K55K00M51O87N56qo67q81m54K09O79J084J668
52440I9370J955J191l07j129n20N58P64J61j13L48P35L87k40l56K9K62P3j55j18
52421A02895p9l76p38n49K74R74Q46J21l15MO10P60L00k60l89q5J84Nn00p61l67
52400A02554M97J330J754J562O72n91j360r87Q6P36N52K18L35O09N70M74Q03J254
$$ plain form
52528 87620 88412 88313 87166 85433 83517 81576 79801 78577 78301 78920 79654 79466 78084 76324 75082 74277
52512 74277 73291 72173 71671 72095 72895 73530 74059 74624 75060 75443 76384 78120 79731 79898 78330 75983 74069
52495 74069 73198 73255 73596 73519 72951 72583 72985 73856 74561 75119 76049 77376 78471 78938 79089 79384 79914 80539 81112
52476 81112 81407 81296 81196 81937 83871 86435 88773 90523 91794 92737 93388 93707 93566 92912 92114 91832 92317
52459 92317 93098 93615 93910 94369 95042 95591 95846 96046 96497 97184 97740 97732 97065 96184 95730 95939 96618 97702 99370
52440 99370 101325 102516 102209 101080 100560 101118 101882 102043 101930 102278 103013 103400 103160 102804 102833 103095 103168 103013 102895
52421 102895 102816 102440 101702 101153 101427 102401 103247 103368 103053 103057 103667 104427 104727 104467 104078 103993 104177 104182 103682 102921 102554
52400 102554 103051 104381 106135 107697 108369 107778 106418 105431 105517 106253 106805 107023 107358 107967 108537 109011 109814 111068
52382A11068J061J90m50j14Q89J670J682J156P20P55J023J043Q33R73J698K381
52366A26578K340J829J616J805J831J523J383J622J716J301Q24Q85J346J690J802
52351A50091J860J777J412J180J772L163M458M864M472L928L705L880M331M876
52337A95769N428O083O979P897Q376Q349Q469R343J0626J1329J1106J0742J1102
52324C11598J2021J2737J3128J3800J4917J5657J5346J4566J4454J5096J5396
52313D68716J4621J3351J2556J2279J1777J0686R420Q471P753O824N483L884K257
52300E88078O88p09j682k036k033k329l315m605n485n769n881o081o057n502m690
52285E32592m081l691l200k438j357K24K357M504N943O649P254Q071Q700Q834
$$ plain form
52382 111068 112129 112319 111869 111755 112644 114314 115996 117152 117872 118627 119650 120693 121526 122499 124197 126578
52366 126578 128918 130747 132363 134168 135999 137522 138905 140527 142243 143544 144368 145253 146599 148289 150091
52351 150091 151951 153728 155140 156320 158092 161255 165713 170577 175049 178977 182682 186562 190893 195769
52337 195769 201197 207280 214259 222156 230532 238881 247350 256693 267319 278648 289754 300496 311598
52324 311598 323619 336356 349484 363284 378201 393858 409204 423770 438224 453320 468716
52313 468716 483337 496688 509244 521523 533300 543986 553406 561877 569630 576454 581937 585821 588078
52300 588078 588766 588057 586375 584339 582306 579977 576662 572057 566572 560803 554922 548841 542784 537282 532592
52285 532592 528511 524820 521620 519182 517825 518049 520406 524910 530853 537502 544756 552827 561527 570361
52271E70361Q832R159R666R983J0160J0453J0716J0610J0306J0260J0225R190
52259F89921O695L704J664R50P20J63o97j464k122l007m301n846p380q760r962
52244F60278j1012j1910j2511j2579j2109j1513j1250j1256j0968j0025q739p694
52232E28712p082o634o164n807n629n277m322k846j481p45n37l71J1M43P04Q74
52216D83849J211J786K365K672K616K293J896J704J938K518K953K749J909R28
52202E13387K73j5j74l37m70n00l15K31J053J612J305J82r78j499j493j464j514
52185E09284j341r20p34j174k060k895l309l165k528j777j446j681k075k246k311
52170D79622k447k331j542m12J37l45j337k028k064j620j012n79m45l54J9M85
$$ plain form
52271 570361 579193 588352 598018 608001 618161 628614 639330 649940 660246 670506 680731 689921
52259 689921 696616 700320 701984 702934 703654 703817 703120 701656 699534 696527 692226 686380 679000 670240 660278
52244 660278 649266 637356 624845 612266 600157 588644 577394 566138 555170 545145 536406 528712
52232 528712 521630 514996 508832 503025 497396 492119 487797 484951 483470 482725 482188 481817 481828 482271 482975 483849
52216 483849 485060 486846 489211 491883 494499 496792 498688 500392 502330 504848 507801 510550 512459 513387
52202 513387 513660 513645 513471 513134 512664 512164 511849 512080 513133 514745 516050 516232 515254 513755 512262 510798 509284
52185 509284 507943 507023 506289 505115 503055 500160 496851 493686 491158 489381 487935 486254 484179 481933 479622
52170 479622 477175 474844 473302 472890 473027 472682 471345 469317 467253 465633 464621 464042 463597 463243 463262 463747
52154D63747N35K09K33R21J515J158J74l07K52J370K373K994L125K704K130K191
52138D85324L196M553N496N966O477P349Q467R590J0568J1291J1783J2329J3259
52125E95648J4486J5461J5738J5455J5178J5263J5485J5316J4525J3356J2184
52114G58095J1097R984Q840P792O857N888M800L635K395R93m85j772k808l916
52100H11395n349o826p817q266q586q982r125q752q196p966p966p620o722n710
52086G03512m929m091k833j441m69J60J134K793M711O328P521Q342Q721Q840R300
52071G47599J0460J1857J2759J3072J3170J3047J2291J0871R284P774O039L928
52059H72151J907M60n60j576k688l855n251o954q498r391r965j1078j2863j4428
$$ plain form
52154 463747 464282 464491 464724 465645 467160 468318 468492 468185 468437 469807 472180 475174 478299 481003 483133 485324
52138 485324 488520 493073 498569 504535 511012 518361 526828 536418 546986 558277 570060 582389 595648
52125 595648 610134 625595 641333 656788 671966 687229 702714 718030 732555 745911 758095
52114 758095 769192 779176 788016 795808 802665 808553 813353 816988 819383 820376 819891 818119 815311 811395
52100 811395 806046 799220 791403 783137 774551 765569 756444 747692 739496 731530 723564 715944 709222 703512
52086 703512 698583 694492 691659 690218 689749 689909 691043 693836 698547 704875 712396 720738 729459 738299 747599
52071 747599 758059 769916 782675 795747 808917 821964 834255 845126 854410 862184 868223 872151
52059 872151 874058 874518 873958 872382 869694 865839 860588 853634 845136 835745 825780 814702 801839 787411
52045G87411j5100j5383j6165j7336j7916j7484j6788j6659j6874j6586j5606
52034F05514j4558j3804j2895j1437j0023r660j0441j1302j1227j0283r254q547
52022D72083p819o732n726n698o876q263q603p777o873o779p283p721p991q414
52008C69528r009r498r782r854r467q624q152q883j0277j0757r711q222p503p477
51994B42312p460p410p611p771p326o450n877n903o202o488o663o400n376l869
51980A51506k565j689r43l24l07j005j807k075j825j461j309j590k361l245l612
51965A25388l345l000l022l133k878k385k089j968j544o26K96N02k69j549k433
51950I7945k280j306l91j59l87l91J09P53J025P56J66m06p83r72r95p62k02N28
$$ plain form
52045 787411 772311 756928 740763 723427 705511 688027 671239 654580 637706 621120 605514
52034 605514 590956 577152 564257 552820 542797 533137 522696 511394 500167 489884 480630 472083
52022 472083 464264 457532 451806 446108 439232 430969 422366 414589 407716 400937 393654 385933 377942 369528
52008 369528 360519 351021 341239 331385 321918 313294 305142 296259 285982 275225 265514 257292 249789 242312
51994 242312 234852 227442 219831 212060 204734 198284 192407 186504 180302 173814 167151 160751 155375 151506
51980 151506 148941 147252 146309 145985 145678 144673 142866 140791 138966 137505 136196 134606 132245 129000 125388
51965 125388 122043 119043 116021 112888 110010 107625 105536 103568 102024 101398 101694 102196 101927 100378 97945
51950 97945 95665 94359 93968 93809 93422 93031 93140 93893 94918 95674 95840 95434 94651 93679 92684 91922 91720 92248
51932I2248J139J499J562J144J28j069j588j052o0M48J51n83j300j779j921j686
51916H7281j175n45J09O02N68k07j331k040j913j285q37q85j126r81k34O70J125
51899G7796J083J023J113Q81K8q02o97K37R24P25J32j32j28m12j039j480j401
51882G7851j043p55m76P2Q66J439J346P00J23R2M28O19N80P54J391K055K138J639
51864H9819J080Q01O68N09M06M10L57J84J78N99J223J562J532J467J495J309P50
51847A04349L18P02J890L085L510L173K741K906L841N148O253O924P362P736P786
51832A67724P182O073M872L504J427j440m268o123o863o913o584o112n956o359
51818A40164o746o303n154m299m213m195l474k314j555j468j660j806j927k002
$$ plain form
51932 92248 93387 94886 96448 97592 97720 96651 95063 94011 93951 94399 94550 93967 92667 90888 88967 87281
51916 87281 86106 85561 85670 86272 86840 86633 85302 83262 81349 80064 79227 78342 77216 76235 76001 76671 77796
51899 77796 78879 79902 81015 81896 81924 81122 80425 80662 81586 82311 82443 82311 82183 81771 80732 79252 77851
51882 77851 76808 76053 75577 75649 76515 77954 79300 80000 80123 80215 80643 81262 81842 82596 83987 86042 88180 89819
51864 89819 90899 91700 92368 92877 93283 93693 94050 94234 94412 95011 96234 97796 99328 100795 102290 103599 104349
51847 104349 104667 105369 107259 110344 113854 117027 119768 122674 126515 131663 137916 144840 152202 159938 167724
51832 167724 174906 180979 185851 189355 190782 189342 185074 178951 172088 165175 158591 152479 146523 140164
51818 140164 133418 127115 121961 117662 113449 109254 105780 103466 101911 100443 98783 96977 95050 93048
51804I3048j865j475r97n02J15Q41J400J429Q18j13p37o60j46K18L59P24J368
51787I3825J562Q44j44m89k81k63m79l51J5k78j407k242j832p30n1O5L33J018
51769H9115J582J516Q85R4m47n51m57n74p81l56R09K043K027J187O78Q34R35N06
51751I9145j02n26q64j108r31l52J19K94N99J163J465J299J281J768K041J346
51735A06637K69J6O89J180P86Nl91l57l59n88p77n86n7L41J70m14p73o39m49n80
51715A04123p19m11J17K78l4n41j191j929k146j261J62Q12K73n44q25p24n97k71
51697I4572L84R05R10O49L67j93r27q89L77J577J027r28k152j533l60l69j508
51680I1909k385k241j509p28J46J162J853J678P39k73p40n71r5K90L62J68o7j22
$$ plain form
51804 93048 91183 89708 88711 88209 88324 89165 90565 91994 92812 92699 91962 91302 91156 91374 91733 92457 93825
51787 93825 95387 96231 96087 95598 95317 95054 94575 94224 94239 93961 92554 90312 88480 87750 87699 87764 88097 89115
51769 89115 90697 92213 93098 93192 92745 92194 91737 91163 90382 90026 90935 92978 95005 96192 96870 97704 98639 99145
51751 99145 99043 98517 97653 96545 95614 95262 95381 95675 96274 97437 98902 100201 101482 103250 105291 106637
51735 106637 106906 106922 107611 108791 109577 109582 109191 108834 108475 107887 107110 106524 106467 106808 106978 106564 105791 105152 104703 104123
51715 104123 103404 102993 103110 103388 103354 102813 101622 99693 97547 96286 96448 97260 97533 96989 96164 95440 94843 94572
51697 94572 94956 95861 96771 97420 97787 97594 96667 95778 96155 97732 98759 97831 95679 94146 93786 93417 91909
51680 91909 89524 87283 85774 85046 85192 86354 88207 89885 90624 90351 89611 89040 88945 89235 89597 89765 89698 89576
51662H9576M7L42O96J138J617J873J648R90K48k78n24n59m57l59l80l75LQ21J600
51643I7667J776J303O62L55N80J300K307L175L418K883J943J251J262J838K310
51628A24030J998Q73l46r32q66o64n92l44L73J270J699J350N76Pl9K76N74O24
51610A29867L29m04j564k703l074k396j378j049j622k316k424k149k127k459k632
51595A01899k268j513o53J92Q50R79N02p0j53J66K14l77j268j906k132k084j802
51578I0576j234m70K26O56P44M26k51r81j324j073l89L98J026J383J493J411J094
51561I3711M93k10o18n43j94K56J004K102K948K806J852J012Q17R11Q10N86N31
51544A08274P07J149J991L021L512K986J821P60J39j5L94J244J930J988J768J836
$$ plain form
51662 89576 89623 89965 90661 91799 93416 95289 96937 97927 98175 97897 97373 96814 96357 95998 95618 95243 95246 96067 97667
51643 97667 99443 100746 101408 101763 102343 103643 105950 109125 112543 115426 117369 118620 119882 121720 124030
51628 124030 126028 126901 126555 125623 124757 124093 123501 123157 123530 124800 126499 127849 128425 128432 128393 128669 129243 129867
51610 129867 130196 129792 128228 125525 122451 120055 118677 117628 116006 113690 111266 109117 106990 104531 101899
51595 101899 99631 98118 97465 97657 98507 99486 99988 99918 99765 99931 100145 99768 98500 96594 94462 92378 90576
51578 90576 89342 88872 89098 89754 90498 90924 90673 89692 88368 87295 86906 87304 88330 89713 91206 92617 93711
51561 93711 94204 93994 93376 92833 92639 92895 93899 96001 98949 101755 103607 104619 105436 106347 107157 107743 108274
51544 108274 108981 110130 112121 115142 118654 121640 123461 124221 124360 124345 124739 125983 127913 129901 131669 133505
51528A33505J993J603P86M03P72J173R54M42L86R85J829K417K387J643O10M8K17
51511A52153M56K0q98j352q05K46Q22L97p15j753k194k076j671j030j97L45j3
51494A41735j010j456o62M84M97q35k207k473j913j574j916k519k830k753k501
51479A18067k244j968j591j174j020j360j904j953j261n48p57j847k723k490j395
51464I3832l21K15K86J02j54k51j23j17n53j031q33K7O43M37j24l91n29j036j696
51445H8383j780j184n98n37p95r96j042q44j41R77J846J850J033j46j306k051
51429H2669j823m59J237K066J728J083R84J297J327Q69L15q9n17r54q61J13J363
51412I0348J862J373N91P4l52q81j061m38N81J131R90O49M36J77j93l69j58J96
$$ plain form
51528 133505 135498 137101 137887 138290 139062 140235 141189 141631 142017 143002 144831 147248 149635 151278 151888 151936 152153
51511 152153 152609 152629 151731 150379 149574 149820 150642 151039 150324 148571 146377 144301 142630 141600 141403 141748 141735
51494 141735 140725 139269 138607 139091 139588 138753 136546 134073 132160 130586 128670 126151 123321 120568 118067
51479 118067 115823 113855 112264 111090 110070 108710 106806 104853 103592 103044 102287 100440 97717 95227 93832
51464 93832 93511 93726 94012 94114 93960 93709 93586 93469 92916 91885 91052 91079 91722 92159 92035 91644 91115 90079 88383
51445 88383 86603 85419 84821 84284 83489 82493 81451 80607 80466 81443 83289 85139 86172 86026 84720 82669
51429 82669 80846 80387 81624 83690 85418 86501 87485 88782 90109 90978 91293 91204 90687 89733 88872 88985 90348
51412 90348 92210 93583 94174 94248 93896 93015 91954 91516 92097 93228 94218 94867 95303 95480 95287 94918 94760 94956
51394I4956L79L24N4m15r35j341j759k385k866k541j422m23k40n02m58n2J69q1
51376H0462n48r31j201j460j737j857j452l75Q93J469J033K35j38p1r9m80r37
51359G2806j009l76Q55J980K169J375M59L6k57r30j619j596r87n97p17r17r27
51342F9748r70j109r77l54N39J395J997K033J349M57J41M35N72J71k56j93P6J0
51324G5064m14q14r28o45O0Q56J139P50K47J61L21K77K9j04j5J92M97Q20Q26L23
51304G8642l06n11k76o0j80n51r21j015o12K05R49J182R81P20N20K60l5j92j61
51285G8639l9J19K60K52J24J56M14M67o2q05j051o55p2L86P85J134J260J228J383
51266H3923J755J934J647J105O58M53N96J139J774J977J693J477J657J786J265
$$ plain form
51394 94956 95335 95659 95713 95298 94363 93022 91263 88878 86012 83471 82049 81626 81386 80884 80426 80374 80543 80462
51376 80462 79914 78983 77782 76322 74585 72728 71276 70901 71794 73263 74296 74531 74393 74322 74223 73743 72806
51359 72806 71797 71421 72276 74256 76425 77800 78259 78295 78038 77108 75489 73893 72906 72309 71592 70675 69748
51342 69748 68778 67669 66692 66338 66877 68272 70269 72302 73651 74108 74249 74684 75256 75427 75171 74978 75054 75064
51324 75064 74650 73836 72908 72263 72323 73179 74318 75068 75315 75476 75797 76074 76103 75999 75984 76176 76673 77493 78319 78642
51304 78642 78336 77825 77549 77489 77309 76758 75837 74822 74210 74415 75364 76546 77527 78247 78767 79027 78992 78800 78639
51285 78639 78600 78719 78979 79231 79355 79511 79925 80392 80330 79525 78474 77819 77747 78133 78918 80052 81312 82540 83923
51266 83923 85678 87612 89259 90364 91022 91475 92071 93210 94984 96961 98654 100131 101788 103574 104839
51251A04839K40o09r26r41r56r95r37p58n87o38j013j501j711j538j323j378j511
51234H7757j305o73R8P37J159J294J073O25K45J72M95J207K041K375J688K93p56
51217I8525p46r6K73J58J48N39P12K1j194k009k111j927j625q66J64M17n83j628
51199H8172j162N56J683J206L1n51m65l51m07m67o32j033j282r69m31l16n92o75
51181H2315m41l41n61p58o94n26l25Q6O12Q09N49L28O17J271J799J870J444O66
51163H8720r2m01k24M8R7kl9N3K90O50Q81O14j09p75r56p02k31L04O62N21j6l60
51141H8933j03N27J098J464J539J100K05n31n84j56K38M90P51Q49N06o4l31j56
51123I5775J75M34N60L92j09m76j92M68P22M64M55J131J841J779J131P74J056
$$ plain form
51251 104839 105079 104470 103544 102603 101647 100652 99715 98957 98370 97732 96719 95218 93507 91969 90646 89268 87757
51234 87757 86452 85779 85877 86614 87773 89067 90140 90765 91010 91182 91677 92884 94925 97300 98988 99281 98525
51217 98525 97779 97683 97956 98114 98262 98801 99513 99534 98340 96331 94220 92293 90668 89802 89966 90383 89800 88172
51199 88172 87010 87566 89249 90455 90486 89935 89470 89119 88712 88245 87613 86580 85298 84329 83898 83582 82990 82315
51181 82315 81874 81533 80972 80214 79520 78994 78669 78755 79367 80176 80725 81053 81670 82941 84740 86610 88054 88720
51163 88720 88628 88227 88003 88051 88148 88146 88107 88160 88450 89100 89981 90595 90486 89711 88755 88053 87822 88126 88788 89309 89293 88933
51141 88933 88830 89357 90455 91919 93458 94558 94763 94232 93648 93492 93730 94220 94971 95820 96326 96262 95931 95775
51123 95775 95950 96384 96944 97336 97227 96751 96559 97027 97749 98213 98668 99799 101640 103419 104550 105324 106380
51106A06380J425J290Q32P42J254J742J401L28m82l06M28P98N53J70o3l10n92
51089A15590n07J37R55J358J124M07l76o28k9R72J498J327J080J220J374J024
51073A26526L45j88n68j049j445j283n54J70M00J28l98q83j043p54k62Q0K24L99
51055A19845O89R42J052J044Q93N77L10M75J116J714J637Q24j23m81j18M57P39
51038A31592Q25J148J745K063J696R76O49J145K241L225L292K149M95m48j43P21
51022A53371J171J113J206J842K755L458L674L404K947K810L215L818M157M268
51008A93209M445M637M585M466M748N436O032O373O904P858Q748R018Q838Q845
50994B84142R367J0275J1366J2549J3752J4952J6279J7862J9640K1523K3701K6523
$$ plain form
51106 106380 107805 109095 109927 110669 111923 113665 115066 115394 114912 114606 115034 115832 116385 116555 116492 116182 115590
51089 115590 115083 115220 116175 117533 118657 119064 118688 118060 118031 119003 120501 121828 122908 124128 125502 126526
51073 126526 126871 126683 126115 125066 123621 122338 121784 121954 122354 122482 122084 121201 120158 119404 119142 119222 119446 119845
51055 119845 120534 121476 122528 123572 124465 125042 125352 125827 126943 128657 130294 131118 130995 130514 130396 130853 131592
51038 131592 132417 133565 135310 137373 139069 140045 140694 141839 144080 147305 150597 152746 153241 152793 152650 153371
51022 153371 154542 155655 156861 158703 161458 164916 168590 171994 174941 177751 180966 184784 188941 193209
51008 193209 197654 202291 206876 211342 216090 221526 227558 233931 240835 248693 257441 266459 275297 284142
50994 284142 293509 303784 315150 327699 341451 356403 372682 390544 410184 431707 455408 481931
50982D81931L0020L3678L6823L9221M1208M3259M5536M7911N0230N2270N3567
50971I55654N3664N2630N0893M8388M4387L8606L2010K5926K0623J5336R582L777
50959A351476j410n735r304j2351j5113j7441j8552j7821j5852j4128j3401j3140
50947A197228j2723j2487j3131j4709j6710j8705k0483k1952k3361k5255k7810
50936I89902l0491l2778l4693l6278l7054l6646l5501l4325l3104l1373k9168
50925F18491k6986k4959k2759k0339j8026j5922j3825j1820j0267r100p799o278
50913D30411n156m830m780m201k997j801j214j270j450j098KJ318K057K020J777
50898D08788J935K506L100L425L495L551L908M681N581O225O668P288Q139Q814
$$ plain form
50982 481931 511951 545629 582452 621673 662881 706140 751676 799587 849817 902087 955654
50971 955654 1009318 1061948 1112841 1161229 1205616 1244222 1276232 1302158 1322781 1338117 1347699 1351476
50959 1351476 1350066 1344331 1335027 1322676 1307563 1290122 1271570 1253749 1237897 1223769 1210368 1197228
50947 1197228 1184505 1172018 1158887 1144178 1127468 1108763 1088280 1066328 1042967 1017712 989902
50936 989902 959411 926633 891940 855662 818608 781962 746461 712136 679032 647659 618491
50925 618491 591505 566546 543787 523448 505422 489500 475675 463855 453588 444488 436689 430411
50913 430411 425255 420425 415645 411444 408447 406646 405432 404162 402712 401614 401616 402934 404991 407011 408788
50898 408788 410723 413229 416329 419754 423249 426800 430708 435389 440970 447195 453863 461151 469290 478104
50884D78104R100R372J0108J1310J2652J3924J5189J6686J8702K1272K3919K6100
50872F66438K7999L0466L3981L8188M2711M7785N3672O0013O6382P3014Q0263
50861A220912Q7655R4310J00122J05705J11159J15739J18865J20587J20756J18510
50851B314320J13075J04425R2772P8020O0515M1876K4152Q208o438k0140l2161
50840B778624m1386m7404n0585n1384m9887m5979l9780l2070k4349j8279j4803
50829B362718j3919j5322j8969k4806l2234m0211m7979n5394o2580o9408p5449
50818A906447q0258q3555q5264q5484q4390q2031p8253p2971o6561n9862n3623
50807A074195m7970m2536l7127l2053k7758k4230k1057j7982j5173j2846j0970
$$ plain form
50884 478104 487204 496576 506684 517994 530646 544570 559759 576445 595147 616419 640338 666438
50872 666438 694437 724903 758884 797072 839783 887568 941240 1001253 1067635 1140649 1220912
50861 1220912 1308567 1402877 1502999 1608704 1719863 1835602 1954467 2075054 2195810 2314320
50851 2314320 2427395 2531820 2624592 2702612 2763127 2805003 2829155 2837363 2830925 2810785 2778624
50840 2778624 2737238 2689834 2639249 2587865 2537978 2491999 2452219 2420149 2395800 2377521 2362718
50829 2362718 2348799 2333477 2314508 2289702 2257468 2217257 2169278 2113884 2051304 1981896 1906447
50818 1906447 1826189 1742634 1657370 1571886 1487496 1405465 1327212 1254241 1187680 1127818 1074195
50807 1074195 1026225 983689 946562 914509 886751 862521 841464 823482 808309 795463 784493
50796G84493r500q638q467q458p861o650n684n675o298o743o784o867p157p224
50782F82487o903o850p725r091r739r141p977p178o888o675o368o133n915n279
50768E80625l983k363r90p5P20J924L770N966P969R618J1326J3510J5924J7986
50754F61927J9690K1729K4554K7809L1019L4350L8202M2390M6417N0364N4794
50743A053245N9624O3818O6507O7902O8641O8745O7716O5427O2235N8267N3109
50732A755236M6241L7401K6534J3924N69j2016k2727l1404l8183m2685m4225m2717
50720A645948l8849l3450k7131k0626j4935j0765q016o174n020m769n744q257
50708A462212j2662j8893k5969l2427l7441m1162m3826m5118m4800m3472m1977
$$ plain form
50796 784493 774993 766355 757888 749430 741569 734919 729235 723560 717262 710519 703735 696868 689711 682487
50782 682487 675584 668734 661009 651918 642179 633038 625061 617883 610995 604320 597952 591819 585904 580625
50768 580625 576642 574279 573289 573214 573934 575858 579628 585594 593563 603181 614507 628017 643941 661927
50754 661927 681617 703346 727900 755709 786728 821078 859280 901670 948087 998451 1053245
50743 1053245 1112869 1176687 1243194 1311096 1379737 1448482 1516198 1581625 1643860 1702127 1755236
50732 1755236 1801477 1838878 1865412 1879336 1879905 1867889 1845162 1813758 1775575 1732890 1688665 1645948
50720 1645948 1607099 1573649 1546518 1525892 1510957 1500192 1492176 1486002 1480982 1476213 1470469 1462212
50708 1462212 1449550 1430657 1404688 1372261 1334820 1293658 1249832 1204714 1159914 1116442 1074465
50697A074465m0310l7786l4311l0704k7559k4481k0908j7146j4023j1685r431
50686H06121o745l961j699k5J578L522N662P500Q660R154R222R046Q622P966P296
50671H71919O905O867O969P006P057P424Q261R412J0633J1901J3307J4711J5749
50658I98121J6423J7428J9532K2585K5549K7654K9206L1031L3342L5501L6780
50647A293152L6932L6008L4013L0944K7016K2668J8341J4342J0726P303L744j04
50635A535085m108q046j1815j5320j8277k0226k0867k0306j8970j7335j5688j4072
50623A350055j2432j0774r245p935o786n735m815l909k540m13J846K923K221N36
50609A292997j196l409p318j2948j8756k3503k7569l1789l5784l8340l9048l8614
$$ plain form
50697 1074465 1034155 996369 962058 931354 903795 879314 858406 841260 827237 815552 806121
50686 806121 799376 795415 793716 793691 795269 798791 804453 811953 820613 829767 838989 848035 856657 864623 871919
50671 871919 878824 885691 892660 899666 906723 914147 922408 931820 942453 954354 967661 982372 998121
50658 998121 1014544 1031972 1051504 1074089 1099638 1127292 1156498 1187529 1220871 1256372 1293152
50647 1293152 1330084 1366092 1400105 1431049 1458065 1480733 1499074 1513416 1524142 1531445 1535189 1535085
50635 1535085 1530977 1522931 1511116 1495796 1477519 1457293 1436426 1416120 1397150 1379815 1364127 1350055
50623 1350055 1337623 1326849 1317604 1309669 1302883 1297148 1292333 1288424 1285884 1285471 1287317 1290240 1292461 1292997
50609 1292997 1291801 1288392 1281074 1268126 1249370 1225867 1198298 1166509 1130725 1092385 1053337 1014723
50597A014723l7689l6281l4290l1843k9024k5928k3036k0861j9101j6875j3973
50586G25822j1128q842o731m451k472j220k02J271K914L864L986M068M790O113
50572G17782P630Q948R772J0148J0634J1793J3492J5057J6134J6993J8050J9368
50560H75801K0623K1307K1156K0589K0454K1032K1691K2005K2700K4747K7798
50549A119903L0530L2425L4360L7165M0588M3973M7371N1409N6478O2342O8227
50538A624771P3216P7028Q0418Q4263Q8120R0390R0189Q8242Q5458Q1479P5352
50527B538926O7012N7186M6118L3425J9229M629r277k2313l4889m7074n8256o7538
50515B527178p4435p9127q2047q3206q2123p8585p3196o6827n9795n1911m3297
$$ plain form
50597 1014723 977034 940753 906463 874620 845596 819668 796632 775771 756670 739795 725822
50586 725822 714694 705852 699121 694670 692198 690978 690776 692047 694961 698825 702811 706879 711669 717782
50572 717782 725412 734360 744132 754280 764914 776707 790199 805256 821390 838383 856433 875801
50560 875801 896424 917731 938887 959476 979930 1000962 1022653 1044658 1067358 1092105 1119903
50549 1119903 1150433 1182858 1217218 1254383 1294971 1338944 1386315 1437724 1494202 1556544 1624771
50538 1624771 1697987 1775015 1855433 1939696 2027816 2118206 2208395 2296637 2382095 2463574 2538926
50527 2538926 2605938 2663124 2709242 2742667 2761896 2766525 2757248 2734935 2700046 2652972 2594716 2527178
50515 2527178 2452743 2373616 2291569 2208363 2126240 2047655 1974459 1907632 1847837 1795926 1752629
50504A752629l4709k6906j9961j3328o462O78P636J3849J8993K2917K5315K5708
50492A766359K3637J8715J0562q04j4368k8303m1016n1796o0332o6182o9117o9649
50480A417706o8634o6580o3732o0527n7378n4095n0176m5646m1124l7056l3352
50469H39406k9851k6571k3357j9867j6123j2705j0022p732n185k287M14K394L665
50456F92179M623N598O568P348P955Q705R761J0753J1188J1169J1350J2048J2767
50443H12012J2845J2246J1474J0877J0450J0180J0247J0780J1622J2496J3268
50432I38497J4045J5048J6449J8263K0300K2343K4360K6509K8949L1701L4700
50421A191164L7867M0944M3410M4847M5458M5956M6608M6611M4731M0600L4977
$$ plain form
50504 1752629 1717920 1691014 1671053 1657725 1651263 1651941 1659577 1673426 1692419 1715336 1740651 1766359
50492 1766359 1789996 1808711 1819273 1818469 1804101 1775798 1734782 1682986 1622654 1556472 1487355 1417706
50480 1417706 1349072 1282492 1218760 1158233 1100855 1046760 996584 950938 909814 872758 839406
50469 839406 809555 782984 759627 739760 723637 710932 700910 693178 687993 685706 686120 688514 692179
50456 692179 696802 702400 708968 716316 724271 732976 742737 753490 764678 775847 787197 799245 812012
50443 812012 824857 837103 848577 859454 869904 880084 890331 901111 912733 925229 938497
50432 938497 952542 967590 984039 1002302 1022602 1044945 1069305 1095814 1124763 1156464 1191164
50421 1191164 1229031 1269975 1313385 1358232 1403690 1449646 1496254 1542865 1587596 1628196 1663173
50410A663173K8783K2272J5300P913K35p847j6534k5673l4773m3187n0158n4995
50398A504509n7703n9103n9828n9426n7128n3289m9225m5501m1306l5881k9855
50387I56264k4494k0144j6053j1486o372j026M178Q822J2553J5226J6678J6462
50375I50608J4197J0185N267J8n573j1506j7302k2314k6245k9129l0979l1683
50363H05544l1238k9931k8295k6883k5950k5250k4232k2609k0614j8752j7249
50352E34541j5889j4251j2131r794p815o507n533m316k843j754j465j414o15J110
50338D51324K930M081M853O044P779R196R496Q945Q543Q827R280R049Q001O839
50324E55187O263O281O404O213N549M357K716J003k80j009j521k052k308j887
$$ plain form
50410 1663173 1691956 1714228 1729528 1737441 1737676 1729829 1713295 1687622 1652849 1609662 1559504 1504509
50398 1504509 1446806 1387703 1327875 1268449 1211321 1158032 1108807 1063306 1022000 986119 956264
50387 956264 931770 911626 895573 884087 877715 876689 880867 889689 902242 917468 934146 950608
50375 950608 964805 974990 980257 980275 974702 963196 945894 923580 897335 868206 837227 805544
50363 805544 774306 744375 716080 689197 663247 637997 613765 591156 570542 551790 534541
50352 534541 518652 504401 492270 482476 474661 468154 462621 458305 455462 453708 452243 450829 450214 451324
50338 451324 454254 458335 463188 469232 477011 486207 495703 504648 513191 522018 531298 540347 548348 555187
50324 555187 561450 567731 574135 580348 585897 590254 592970 593973 593693 592684 591163 589111 586803 584916
50310E84916j014n14r80k118l041l159k722k459k812l501l913l796l393k953k420
50295E46121j770j327j405j732j647r30n3M67O36P14O89L61j51m09k20n7o68k230
50277E36389l977m840m506l749l558m137m920n403n566n513n177m612m175m105
50263D72151m155l851l014j867q35m15q77j799k218j574l70M85P52Q89J149J293
50247D55744J137Q60N86K03k25k74K76J003J265Q34j33j438k838l899m341m455
50231D44305m752n194n216m630m124m417n255n647n121m287l963m150m151l558
50217C79840k691k082j859j774j567j148n82K2O18J292K000K362J974R65j09j017
50201C76244k071l351m201m019l203k745k962l208k868k123j549j378j346j079
$$ plain form
50310 584916 583902 583388 582408 580290 577249 574090 571368 568909 566097 562596 558683 554887 551494 548541 546121
50295 546121 544351 543024 541619 539887 538240 537310 537257 537724 538360 539074 539763 540124 539973 539564 539344 539287 538619 536389
50277 536389 532412 527572 523066 519317 515759 511622 506702 501299 495733 490220 485043 480431 476256 472151
50263 472151 467996 464145 461131 459264 458429 458014 457137 455338 453120 451546 451176 451661 452413 453302 454451 455744
50247 455744 456881 457741 458327 458530 458305 458031 458307 459310 460575 461409 461276 459838 457000 453101 448760 444305
50231 444305 439553 434359 429143 424513 420389 415972 410717 405070 399949 395662 391699 387549 383398 379840
50217 379840 377149 375067 373208 371434 369867 368719 368137 368159 368777 370069 372069 374431 376405 377370 377261 376244
50201 376244 374173 370822 366621 362602 359399 356654 353692 350484 347616 345493 343944 342566 341220 340141
50187C40141l72O84J725K356K512K474K590L041L812M752N678O631P897R646J1683
50172D05250J3786J5990J8235J9935K0460J9852J8605J6843J4449J1887J0083
50161E85375R254Q625P639O684O163N560M070J726r29l836p300j1107j4546j7278
50147E80100j9435k0860k1037k0022j8750j7975j7396j6296j4612j2897j1398
50136C89422r816q006o413n480m958m154k841j508o42j38L59P92Q17N03M05Q72
50120C49214J689K518L214L554L135J991R50Q51J589K329K526K288J911J610J649
50105C81018K235L189M036M586N064N625O136O518O952P614Q386R035R435R604
50091D69433R651R755R899R713Q903P819P217P389P956Q546R155R585R174P601
$$ plain form
50187 340141 339769 340453 342178 344534 347046 349520 352110 355151 358963 363715 369393 376024 383921 393567 405250
50172 405250 419036 435026 453261 473196 493656 513508 532113 548956 563405 575292 585375
50161 585375 594629 603254 610893 617577 623740 629300 633370 635096 634167 630331 623031 611924 597378 580100
50147 580100 560665 539805 518768 498746 479996 462021 444625 428329 413717 400820 389422
50136 389422 379606 371600 365187 359707 354749 350595 347754 346246 345604 345466 345825 346617 347434 347937 348342 349214
50120 349214 350903 353421 356635 360189 363324 365315 366265 367116 368705 371034 373560 375848 377759 379369 381018
50105 381018 383253 386442 390478 395064 400128 405753 411889 418407 425359 432973 441359 450394 459829 469433
50091 469433 479084 488839 498738 508451 517354 525173 532390 539779 547735 556281 565436 575021 584195 591796
50077E91796N598M313M122M498M829M874M610M168L946M289M994N570O014O869
50063F60490Q363J0038J1466J2903J4807J7068J9208K1218K3703K7050L0777L3771
50051H90862L5102L4638L3113L1583L0500K9324K7261K4412K1861K0460J9861
50040A198977J8949J6968J3844R636M252k216r250j6281k3093k9584l5322l9683
50028A107197m2453m4017m4854m5009m4249m2648m0727l8905l6970l4427l1297
50017F61641k8280k5929k3981k1835j9442j7248j5373j3418j1297r643q963q786
50005D57446q177o951n754n030m478l730l117l253m173n199n686n616n455n570
49991C85257n858n889n431m796m559m889n343n449n231n019m821m327l498k837
$$ plain form
50077 591796 597394 601707 605829 610327 615156 620030 624640 628808 632754 637043 642037 647607 653621 660490
50063 660490 668853 678891 690357 703260 718067 735135 754343 775561 799264 826314 857091 890862
50051 890862 925964 960602 993715 1025298 1055798 1085122 1112383 1136795 1158656 1179116 1198977
50040 1198977 1217926 1234894 1248738 1258374 1262626 1260410 1251160 1234879 1211786 1182202 1146880 1107197
50028 1107197 1064744 1020727 975873 930864 886615 843967 803240 764335 727365 692938 661641
50017 661641 633361 607432 583451 561616 542174 524926 509553 496135 484838 475195 466232 457446
50005 457446 449269 442318 436564 431534 427056 423326 420209 416956 412783 407584 401898 396282 390827 385257
49991 385257 379399 373510 368079 363283 358724 353835 348492 343043 337812 332793 327972 323645 320147 317310
49977C17310k808l223l431l104k551k221k175k166k068j996j984j820j248l21
49963B86194N79R83O26l52j362j658q99M70J621K146K384K832L433L726L598L566
49947C07887M119N045N699N878O083O922Q454J0215J1717J2766J3545J4445J5775
49934D28550J7483J9267K0935K2421K3422K3383K2120K0151J8084J5872J3181
49923F44869J0261P950O756O421O400O229N319L021p70n405j0168j4803j9133
49910F46947k2645k4913k6086k6528k6240k5116k3521k2045k0758j9200j7100
49899C92795j4693j2351j0390r077q360p637o395n087m701n299n709n029l795
49886B94272l113l115l037k482j868j521j177o10k25n11j202j475r16M1P09R22
$$ plain form
49977 317310 314502 311279 307848 304744 302193 299972 297797 295631 293563 291567 289583 287763 286515 286194
49963 286194 286773 287756 288382 288030 286668 285010 284111 284581 286202 288348 290732 293564 296997 300723 304321 307887
49947 307887 312006 317051 322750 328628 334711 341633 350087 360302 372019 384785 398330 412775 428550
49934 428550 446033 465300 486235 508656 532078 555461 577581 597732 615816 631688 644869
49923 644869 655130 663080 669836 676257 682657 688886 694205 697226 696456 691051 680883 666080 646947
49910 646947 624302 599389 573303 546775 520535 495419 471898 449853 429095 409895 392795
49899 392795 378102 365751 355361 346284 337924 330287 323892 318805 314104 308805 303096 298067 294272
49886 294272 291159 288044 285007 282525 280657 279136 277959 277349 277124 276613 275411 273936 273020 273061 273770 274692
49870B74692J035J392J948K355K313J834J247R03Q41Q31P59P59Q61P21J01n83
49854B92009o54j36K13k9m14m54l85n92p64l87J53r4j207k097j930j162p58r50
49836B80362j274j424j484j455j110m25K15M06J89R9O47J758K706K796K121J455
49820B85582J366J684J855J572R01J29l88m50l05m42r65j435j513j411j444j461
49804B83275j134o30m83r33j676k218k224j614o78j3n4o06j111j251j112q73o88
49787B65977p31j021j268j178q65o20l84R0O58Q80O73M54M76N01L04l8m49j031
49769B62428j616j615p26N02J282J515J698K071K315K072J457R03P14P88P91N58
49753B75137L16L69N54M11o8k51K71J091J566J691J820J873J459P56M88R19J430
$$ plain form
49870 274692 275727 277119 279067 281422 283735 285569 286816 287719 288560 289391 290150 290909 291770 292491 292592 292009
49854 292009 291355 291219 291432 291403 290989 290535 290150 289558 288794 288407 288560 288466 287259 285162 283232 282070 281312 280362
49836 280362 279088 277664 276180 274725 273615 273190 273405 273811 274000 274099 274746 276504 279210 282006 284127 285582
49820 285582 286948 288632 290487 292059 292960 293089 292701 292251 291946 291504 290539 289104 287591 286180 284736 283275
49804 283275 282141 281511 281028 280095 278419 276201 273977 272363 271685 271672 271618 271012 269901 268650 267538 266665 265977
49787 265977 265246 264225 262957 261779 260914 260294 259910 260000 260658 261538 262211 262665 263141 263642 263946 263908 263459 262428
49769 262428 260812 259197 258471 258973 260255 261770 263468 265539 267854 269926 271383 272286 273000 273788 274579 275137
49753 275137 275453 275822 276376 276787 276719 276468 276739 277830 279396 281087 282907 284780 286239 286995 287483 288402 289832
49736B89832J386R28N59L78J39k17n15p12r30j144j061m35O24J654K130J850J131
49719B95597N07J73m0k19j63J77M72M86N27J010J777K231K083J573J002N00K63
49702C07956M77R23J041P17N34R15J446J468J088R72J232J204N34j67j10O14J291
49685C22135J611J791J885J648J258J368K062K381J597M98M78J524K133J328p2
49670C43625p05l49J85L28J63k5N8P36J899K721K495J584R36P93O63M10N13J120
49652C57150J717J925J894J656R79J73J30J028J863J848J485J477J452Q47K94
49637C75918P91J858J924O91l44j3J030J582J626J952K775L543L851L781L499
49622D04464L115K891L024L291L278K954K730K832K994K860K508K371K724L371
$$ plain form
49736 289832 291218 292146 292705 293083 293222 293005 292490 291778 290848 289704 288643 288208 288832 290486 292616 294466 295597
49719 295597 296104 296277 296237 296018 295855 296032 296504 296990 297517 298527 300304 302535 304618 306191 307193 307693 307956
49702 307956 308433 309356 310397 311114 311648 312563 314009 315477 316565 317537 318769 319973 320507 320340 320230 320844 322135
49685 322135 323746 325537 327422 329070 330328 331696 333758 336139 337736 338234 338712 340236 342369 343697 343625
49670 343625 342920 342571 342756 343084 343247 343222 343280 344016 345915 348636 351131 352715 353651 354444 355107 355517 356030 357150
49652 357150 358867 360792 362686 364342 365321 365494 365624 366652 368515 370363 371848 373325 374777 375624 375918
49637 375918 376709 378567 380491 381182 380838 380825 381855 383437 385063 387015 389790 393333 397184 400965 404464
49622 404464 407579 410470 413494 416785 420063 423017 425747 428579 431573 434433 436941 439312 442036 445407
49608D45407L907M208M466M733M747M350L871L754L961M087M006M040M507N352
49594E05396O202O595O257N585N541O544P657P553O284N269N398O030O195N927
49580E92433N795N834N727N578N694N879N628M958M380M192M337M791N604O488
49566F67318O953O876O530O100N501M707L889L288L147L617M361M512L520J935
49552G32254R07R87J867L014L933M009K910J340O25J277K453L027K690J819R34
49537G64046N62J048K029K606K391J957J876J872J526J236J780L057M093M248
49523G94327L855L560L568L731L934M141M287M321M256M108L910L708L446K895
49509H48047J942Q66Q4l08n60r15j536k556l867m899n149m915n015n590n831n230
$$ plain form
49608 445407 449314 453522 457988 462721 467468 471818 475689 479443 483404 487491 491497 495537 500044 505396
49594 505396 511598 518193 524450 530035 535576 542120 549777 557330 563614 568883 574281 580311 586506 592433
49580 592433 598228 604062 609789 615367 621061 626940 632568 637526 641906 646098 650435 655226 660830 667318
49566 667318 674271 681147 687677 693777 699278 703985 707874 711162 714309 717926 722287 726799 730319 732254
49552 732254 733161 734148 736015 739029 742962 746971 749881 751221 751846 753123 755576 758603 761293 763112 764046
49537 764046 764608 765656 767685 770291 772682 774639 776515 778387 779913 781149 782929 785986 790079 794327
49523 794327 798182 801742 805310 809041 812975 817116 821403 825724 829980 834088 837998 841706 845152 848047
49509 848047 849989 850855 850939 850631 850071 849156 847620 845064 841197 836298 831149 826234 821219 815629 809798 804568
49493H04568m535m796n823o343n705m673m260m426m371l803l243l265l846m588
49479G40891n147n348n193m908m800m850m706m249l924m155m629m564l732k778
49465F77908k432k718l187l553l755l637l047k217j707j772k121k384k513k591
49451F40274k454j855r06r6J35k23p40q05j24R26J624J891K619M517O707P173
49435F58663M842P57k985n076n482m804l782l069k820k550j856j079p23m75L83
49420F29944J654K264J822J272J576K436K967L068L371M167N039N555N741N894
49406F76770O265O937P646P926P610P085O760O560O340O379O952P595P456O347
49392G74628M956M025L791M083M474M340L372K070J291J262J532J796K168K561
$$ plain form
49493 804568 800033 795237 789414 783071 777366 772693 768433 764007 759636 755833 752590 749325 745479 740891
49479 740891 735744 730396 725203 720295 715495 710645 705939 701690 697766 693611 688982 684418 680686 677908
49465 677908 675476 672758 669571 666018 662263 658626 655579 653362 651655 649883 647762 645378 642865 640274
49451 640274 637820 635965 635059 634963 635098 634875 634135 633330 633206 634132 635756 637647 640266 644783 651490 658663
49435 658663 663505 664262 661277 656201 650719 645915 642133 639064 636244 633694 631838 630759 630036 629561 629944
49420 629944 631598 633862 635684 636956 638532 640968 643935 647003 650374 654541 659580 665135 670876 676770
49406 676770 683035 689972 697618 705544 713154 720239 726999 733559 739899 746278 753230 760825 768281 774628
49392 774628 779584 783609 787400 791483 795957 800297 803669 805739 807030 808292 809824 811620 813788 816349
$$ [...]
##END NTUPLES=NMR SPECTRUM
##END=
