##TITLE=NES1043_8708014013_9242921_HsXZwWY3Tl
##JCAMPDX= 6.0         $$ Bruker NMR JCAMP-DX V2.0
##DATA TYPE= NMR SPECTRUM
##DATA CLASS= NTUPLES
##ORIGIN= BRUKER
##OWNER= Administrator
$$ 1.72 TOPSPIN		Version 2.1
$$ 2015-07-02 02:13:18.836 -0700  Administrator@X
$$ Compression mode = diff/dup
##.OBSERVE FREQUENCY= 400.02188249412
##.OBSERVE NUCLEUS= ^1H
##.ACQUISITION MODE= SIMULTANEOUS (DQD)
##.ACQUISITION SCHEME= undefined
##.AVERAGES= 8
##.DIGITISER RES= 22
##SPECTROMETER/DATA SYSTEM= spect
##.PULSE SEQUENCE= zg30
##.SOLVENT NAME= COFFEE_meoh
##.SHIFT REFERENCE= INTERNAL, COFFEE_meoh, 1, 14.98509
##AUDIT TRAIL= $$ (NUMBER, WHEN, WHO, WHERE, PROCESS, VERSION, WHAT)
$$ ##TITLE= Audit trail, TOPSPIN		Version 2.1
$$ ##JCAMPDX= 5.01
$$ ##ORIGIN= Bruker BioSpin GmbH
$$ ##OWNER= Administrator
$$ $$ E:\/data/COFFEE/nmr/NES1043_8708014013_9242921_HsXZwWY3Tl/20/pdata/1/auditp.txt
$$ ##AUDIT TRAIL=  $$ (NUMBER, WHEN, WHO, WHERE, PROCESS, VERSION, WHAT)
(   1,<2015-07-02 02:13:11.586 -0700>,<Administrator>,<X>,<go>,<TOPSPIN 2.1>,
      <created by zg
	started at 2015-07-02 02:12:05.695 -0700,
	POWCHK enabled, PULCHK disabled,
       configuration hash MD5:
       21 0F 79 D6 B3 7B B4 F6 88 20 88 DB 03 48 BD 9F
       data hash MD5: 64K
       E7 3A 9A C0 6C 43 6A 32 1F CD 20 60 B0 0E E1 38>)
(   2,<2015-07-02 02:13:14.727 -0700>,<Administrator>,<X>,<proc1d>,<TOPSPIN 2.1>,
      <Start of raw data processing
       efp LB = 0 FT_mod = 6 PKNL = 1 PHC0 = 0 PHC1 = 0 SI = 32K 
       data hash MD5: 32K
       05 A0 0F 1E 00 A8 7B 03 68 3B 5B 51 7E 25 02 AC>)
(   3,<2015-07-02 02:13:15.008 -0700>,<Administrator>,<X>,<proc1d>,<TOPSPIN 2.1>,
      <pk PHC0 = 92.10388 PHC1 = 0 
       data hash MD5: 32K
       F0 2D BB 36 F6 91 5F 6B FA C7 12 D9 DD 46 83 02>)
(   4,<2015-07-02 02:13:15.117 -0700>,<Administrator>,<X>,<proc1d>,<TOPSPIN 2.1>,
      <abs ABSG = 1 
       data hash MD5: 32K
       76 00 04 2A 3E AE FA 82 29 7D 05 7A 96 DE FE CE>)
(   5,<2015-07-02 02:13:15.180 -0700>,<Administrator>,<X>,<proc1d>,<TOPSPIN 2.1>,
      <abs ABSG = 2 
       data hash MD5: 32K
       C8 85 E5 A1 FA 20 3D 49 7B 33 D0 C7 74 52 7A 1A>)
(   6,<2015-07-02 02:13:15.227 -0700>,<Administrator>,<X>,<proc1d>,<TOPSPIN 2.1>,
      <abs ABSG = 3 
       data hash MD5: 32K
       81 85 5E E9 3A 7A E9 CE 4C FE 03 9C 1F FC C4 10>)
(   7,<2015-07-02 02:13:15.289 -0700>,<Administrator>,<X>,<proc1d>,<TOPSPIN 2.1>,
      <abs ABSG = 4 
       data hash MD5: 32K
       61 74 C2 DA 0D 9E 1E DF 86 3F 45 1B 7E CA 49 98>)
(   8,<2015-07-02 02:13:15.352 -0700>,<Administrator>,<X>,<proc1d>,<TOPSPIN 2.1>,
      <abs ABSG = 5 
       data hash MD5: 32K
       06 60 03 F4 D9 BE 36 CF 42 C4 8F 25 E7 C1 8F AC>)
$$ ##END=
$$ 
$$ $$ hash MD5
$$ $$ 7B 06 AE BD 12 4C CC A5 54 D3 0F EC AC 8C 98 F5
##$RELAX= 
##$RELAX= 
##$RELAX= 
##$RELAX= 
##$RELAX= 
##$RELAX= 
##$RELAX= 
$$ Bruker specific parameters
$$ --------------------------
##$DU= <E:\>
##$EXPNO= 20
##$NAME= <NES1043_8708014013_9242921_HsXZwWY3Tl>
$$ [...]
150 150 150 150 150 150 150 150
##$TP07= 0
##$TPNAME0= <>
##$TPNAME1= <>
##$TPNAME2= <>
##$TPNAME3= <>
##$TPNAME4= <>
##$TPNAME5= <>
##$TPNAME6= <>
##$TPNAME7= <>
##$TPOAL= (0..7)
0.5 0.5 0.5 0.5 0.5 0.5 0.5 0.5
##$TPOFFS= (0..7)
0 0 0 0 0 0 0 0
##$TUNHIN= 0
##$TUNHOUT= 0
##$TUNXOUT= 0
##$USERA1= <user>
##$USERA2= <user>
##$USERA3= <user>
##$USERA4= <user>
##$USERA5= <user>
##$V9= 5
##$VALIST= <valist>
##$VCLIST= <CCCCCCCCCCCCCCC>
##$VD= 0
##$VDLIST= <DDDDDDDDDDDDDDD>
##$VPLIST= <PPPPPPPPPPPPPPP>
##$VTLIST= <TTTTTTTTTTTTTTT>
##$WBST= 2048
##$WBSW= 25
##$XGAIN= (0..3)
0 0 0 0
##$XL= 0
##$YL= 0
##$YMAX_a= 581384
##$YMIN_a= -487384
##$ZGOPTNS= <>
##$ZL1= 120
##$ZL2= 120
##$ZL3= 120
##$ZL4= 120
##$ABSF1= 14.98509
##$ABSF2= -5.573092
##$ABSG= 5
##$ABSL= 3
##$ALPHA= 0
##$AQORDER= 0
##$ASSFAC= 0
##$ASSFACI= 0
##$ASSFACX= 0
##$ASSWID= 0
##$AUNMP= <proc_prof1d_extract_pilot.lims>
##$AXLEFT= 0
##$AXNAME= <>
##$AXNUC= <1H>
##$AXRIGHT= 0
##$AXTYPE= 0
##$AXUNIT= <>
##$AZFE= 0.1
##$AZFW= 0.1
##$BCFW= 0
##$BC_mod= 0
##$BYTORDP= 0
##$COROFFS= 0
##$CY= 15
##$DATMOD= 1
##$DC= 0
##$DFILT= <>
##$DTYPP= 0
##$F1P= 0
##$F2P= 0
##$FCOR= 0.5
##$FTSIZE= 32768
##$FT_mod= 6
##$GAMMA= 0
##$GB= 0
##$INTBC= 1
##$INTSCL= 1
##$ISEN= 128
##$LB= 0
##$LEV0= 0
##$LPBIN= 0
##$MAXI= 10000
##$MC2= 0
##$MEAN= 0
##$ME_mod= 0
##$MI= 0
##$NCOEF= 0
##$NC_proc= -8
##$NLEV= 6
##$NOISF1= 0
##$NOISF2= 0
##$NSP= 0
##$NTH_PI= 0
##$NZP= 0
##$OFFSET= 14.98509
##$PC= 1
##$PHC0= 92.10388
##$PHC1= 0
##$PH_mod= 1
##$PKNL= yes
##$PPARMOD= 0
##$PPDIAG= 0
##$PPIPTYP= 0
##$PPMPNUM= 2147483647
##$PPRESOL= 1
##$PSCAL= 4
##$PSIGN= 0
##$PYNMP= <proc.py>
##$REVERSE= no
##$SF= 400.02
##$SI= 32768
##$SIGF1= 0
##$SIGF2= 0
##$SINO= 400
##$SIOLD= 32768
##$SPECTYP= <>
##$SREGLST= <1H.CDCl3>
##$SSB= 0
##$STSI= 32768
##$STSR= 0
##$SW_p= 8223.68421052631
##$SYMM= 0
##$S_DEV= 0
##$TDeff= 65536
##$TDoff= 0
##$TI= <>
##$TILT= no
##$TM1= 0
##$TM2= 0
##$TOPLEV= 0
##$USERP1= <user>
##$USERP2= <user>
##$USERP3= <user>
##$USERP4= <user>
##$USERP5= <user>
##$WDW= 1
##$XDIM= 32768
##$YMAX_p= 437805768
##$YMIN_p= -725778
##$CURPLOT= <Network HP LaserJet P1505>
##$CURPRIN= <$Network HP LaserJet P1505>
##$DFORMAT= <normdp>
##$LAYOUT= <+/1D_H.xwp>
##$LFORMAT= <normlp>
##$PFORMAT= <normpl>
##$SURQMSG= 1
$$ End of Bruker specific parameters
$$ ---------------------------------
##NTUPLES= NMR SPECTRUM
##VAR_NAME=  FREQUENCY,     SPECTRUM/REAL,   SPECTRUM/IMAG
##SYMBOL=    X,             R,               I
##VAR_TYPE=  INDEPENDENT,   DEPENDENT,       DEPENDENT
##VAR_FORM=  AFFN,          ASDF,            ASDF
##VAR_DIM=   32768,         32768,           32768
##UNITS=     HZ,            ARBITRARY UNITS, ARBITRARY UNITS
##FACTOR=    0.250966925370066, 1,           1
##FIRST=     8223.43324360094, -51646,       -155959
##LAST=      0,             -15583,          -10001
##MIN=       0,             -725778,         0
##MAX=       8223.43324360094, 437805768,    0
$$ Real data points
##PAGE= N=1
##DATA TABLE= (X++(R..R)), XYDATA
$$ [...]
23809 -292343 -46039 50100 -24815 83868 -244171 -46851 -94121 249238 -92726 -464241 286254
23797 81932 230049 166545 195611 149884 59590 -73009 -54176 124544 87869 -109709 204015
23785 -114196 100183 -58243 -17433 36446 -64399 23968 156900 -88550 123030 -87673 107521
23773 -23261 -235779 -190095 12985 98459 -37180 161249 -101880 -88091 -229502 199886 -80201
23761 -71038 -47665 -270576 -107955 36071 -215841 -130637 263986 300574 -258658 16290 -44001
23749 -174857 43359 -200919 -12263 -95061 82053 72675 194754 -20968 142532 -69884 -73023
23738 -73023 -58996 -108118 104231 229888 -240598 -226986 114475 11153 -133161 65413 -109625
23726 130511 -34000 6984 -315319 323794 256142 -303237 -203872 -105759 207545 -270801 -106046
23714 -58062 -266972 54837 246562 -44735 -32704 -20575 -68190 109865 -115379 -161118 -163475
23703 -163475 -93264 -270095 -56894 22599 -109806 -1094 130693 338149 -143958 -230328 -62516
23691 10106 5306 52421 305531 -79796 -121068 47754 -58440 3311 155240 16447 -428156
23679 49562 437171 -516218 155065 73093 -39893 -256156 153504 -400136 361924 -397140
23668 160077 -219249 76625 -68267 -231916 241231 -234933 -43796 -88576 181912 307249
23658 307249 -331979 -388412 -57164 24900 -99905 -180520 -151600 -93064 210541 18796 -5866
23646 431112 13919 -136521 142846 -26104 192028 -107125 218618 13749 612867 287063
23635 181072 111582 6244 56166 93744 52586 159868 102247 115840 -159580 25211 -113481
23623 -141749 2384 -2838 184980 -321954 77230 90786 216453 125703 -117879 -204276 -173179
23612 -173179 -98404 -131144 97797 28227 230981 -107153 -176593 62061 -151744 34116 77114
23601 77114 206530 -91457 9619 -105761 -392357 -80109 316138 -151853 -66861 58648 307820
23590 307820 73993 73304 197413 95738 -24260 -71379 -24674 -136542 193133 -221538 189775
23578 330386 232944 246527 85232 -64956 158392 -288573 145311 -74083 -121203 -38169 -114662
23567 -114662 271096 -347358 9578 336782 -53007 158765 26770 94379 29873 -2448 -524160
23556 -524160 -225429 -110717 -277416 -9859 -226185 137179 -75576 -88101 -121369 55810 112760
23545 112760 -294112 99327 -133646 165232 58927 62723 -16747 94955 59983 -154563 -210310
23534 -210310 71485 36979 -152793 -76361 -148219 100758 170328 -234472 73816 -99046 7637
23522 81797 -45811 25055 33826 -33789 -234052 -278250 472778 -81846 104961 -139000 -18419
23510 118073 -96772 93950 -180072 -48076 -60644 -241546 -58826 53512 246871 -225096 -186243
23499 -186243 -151029 -3444 -176373 127826 -167204 61649 46373 144264 -284232 -119226 -223361
23488 -223361 -14334 326299 240122 -27442 -75754 71717 -74478 245649 -178028 -326516 -83301
23476 -200200 57228 -27074 140035 -438239 243921 139103 89465 278822 340022 22938
23465 95104 -10927 206776 -16962 89170 -2359 -280669 52923 -194131 83222 241127 -368540
23453 -175852 -181261 297947 214116 -25032 136315 -410055 -111808 22362 -234781 3259 134735
23442 134735 -75369 47858 -92365 -176061 -338026 -3456 -331514 246384 48094 112035 40879
23430 -65968 42503 -208079 -130572 -100256 -136 -11520 -122600 -117565 -289006 136906 71729
23419 71729 -100730 30381 153351 137588 1698 -223196 119380 -21151 -12511 10103 -68547
23407 -262309 -281586 -226727 169601 876 78627 -51699 -100760 101889 13456 -347521 47214
23395 70915 -176882 91964 -37375 -71206 -78979 -127334 53702 24769 190206 -104653 144619
23383 -147009 -280092 127772 1022 -98073 97426 437570 -320026 -1614 139488 -94170 189717
23371 157491 -15815 -19859 6871 -55275 213085 -70689 -129357 -40041 171755 -71569 -10351
23359 -159006 83614 -261126 182433 -97408 -115935 -472059 234972 399831 -23464 177262
23348 107540 101938 110288 -70023 -209044 -155670 13354 28503 -34034 183198 -171314 241855
23336 97777 12481 -189407 -7050 -300133 -302469 57246 -369384 107248 241802 -377282 -192872
23325 -192872 -96134 23246 -30979 -86250 -78366 39998 -63046 -296644 300626 -27637 124360
23313 -83329 -216210 -203152 -20093 79303 -27210 -31645 -160196 7483 -231216 -157404 34347
23301 -59415 125255 -183658 125048 68223 -247832 48001 -12823 -61116 -328199 231131
23290 121169 162572 231875 -184962 -72236 -61206 116524 -15703 -144767 28040 -15184 -46254
23279 -46254 389344 -425784 2167 207616 -371285 -111769 -545838 -227589 210203 -14601
23268 -77911 -157933 -56494 -133515 -19901 51823 -119011 267869 -211482 -105930 -314954 4803
23256 -172924 -113446 32590 322194 -109305 51311 -44819 122859 208956 137461 -70529 -202758
23245 -202758 243494 -187707 12859 104325 -55526 -143784 -25924 -166831 308784 -117336
23234 -76557 11612 153646 222335 55546 -121569 -14697 -221726 45451 -30606 258944 -95278
23222 -20329 55627 291494 28513 266894 -14317 -2368 -31032 93551 -206487 204523 -195155
23210 -71997 -211902 -261924 -114707 22477 -213043 64571 266421 4596 -75998 49657 218038
23199 218038 -188921 -100616 270962 -21544 -258143 -203626 -122063 -57858 -69923 132783 77272
23188 77272 -254076 98582 -38853 133821 -200452 -53694 -89041 -58985 -83971 38458 -270726
23176 30370 32372 -117931 74165 -51732 317700 -270784 84026 207992 -253436 138427 312127
23165 312127 -123472 13222 70723 163473 61895 -86046 -363348 41392 240268 -16785 38297
23153 -109522 -196173 -162999 -216569 -42909 124272 495639 -178401 -136663 -219184 129656 184927
23142 184927 -148017 -135503 -250731 45363 78297 83769 -271790 118584 33605 350121 -188692
23130 174834 -223285 -19339 35532 -147740 -89197 -46099 -308569 -2468 -202938 68851 -329944
23118 163812 220490 357801 30584 173677 401026 232752 212281 -136357 -215866 -160922
23108 -160922 31534 142182 57418 8790 -95549 -118048 249451 86389 244907 -31896 293817
23096 -42633 83715 -19641 -56429 2981 119389 -99457 -213818 14177 -159841 -15255 -183204
23085 -183204 -40527 -118404 97379 -244870 -35876 -173242 -60216 -143843 -478186 13192 39546
23074 39546 165372 220850 38119 17817 408297 -30554 179719 308193 -273928 34517 -36805
23062 -341931 -231272 -94672 42695 -31454 -138241 -159261 115008 -67626 21436 -93883 61778
23050 124510 -291408 32487 132435 136202 -204640 319893 133010 -82081 -24346 -148045 -393375
23039 -393375 -30802 -200051 129041 88776 -98850 -22316 -35748 37574 20469 13807 -133882
23027 -16272 -197649 -10843 15573 147880 -70818 249137 314587 -193836 -14355 55265 -269101
23015 -58565 -228628 159449 -267741 -147192 -170288 -142477 -196636 57305 69174 -31670 -9214
23003 203098 20141 -141972 -4203 118166 -109314 -26400 77806 -137276 -269502 -150199
22993 -150199 166075 -16909 -16176 37809 -72762 111594 -167144 149879 -88002 163975 22462
22981 -1680 13165 2888 115788 116330 169207 318945 -75187 -74491 96882 -14767 -313810 107905
22968 -246926 155246 -235149 105527 264410 28691 -98989 -183993 -70202 86711 -105256
22957 46410 53453 1854 150946 -123877 44935 -98784 80162 138697 -138138 2411 -32118 43083
22944 5819 -145283 40454 -262182 110512 -202336 -106093 -164675 78691 145296 -366040 237404
22932 153105 -321256 -51427 195813 -51097 19140 -325918 -3952 62839 130426 -274932 219847
22920 -242422 -336667 149163 84865 176396 73751 304395 359143 -64801 -27062 47963 47339
22909 47339 52105 164902 244513 -63985 92177 -205351 332431 32880 139703 219638 50953
22897 61039 -188449 -119270 405720 362891 65255 -257433 -121012 18621 114076 150629 -97828
22885 -153333 -414112 -61403 171477 164311 151007 -5087 -370665 -184331 39387 119130 -27366
22873 -282208 -106180 -126276 39079 71190 -146491 -163632 -73339 -315421 291876 -45511 -198258
22862 -198258 -216973 1697 -71960 135181 -305556 -66650 76406 139420 -18849 -8206 -40599
22851 -40599 -126442 30809 139187 -160567 -247171 10003 -163557 -11899 -85219 50165 -142591
22839 -67928 -292442 105936 -174368 8041 -104457 -242194 -195111 -1248 -25058 141469 -112768
22827 124211 97238 504410 -103363 67957 -187568 -17735 2340 72680 123515 -177153 219335
22815 -102557 -184275 145752 -272531 -32940 -147757 99818 105557 -301167 -154736 -283715
22805 -283715 -168562 -227220 -18202 -94579 -274473 -50815 -4267 77384 165087 -260261 28913
22793 112623 271719 -73830 -32631 50167 95661 60472 -160214 208000 -229595 137 53697
22782 53697 -205601 -4446 -48555 7422 -12023 47784 -287802 -60130 39552 -150178 43694
22770 -131399 214768 25619 -60222 -22807 -59275 150802 -257915 56924 73821 196548 1926
22758 -89261 -367373 187435 -200919 -117406 -59237 -238953 -196556 -200740 -62507 219480 257424
22747 257424 -113966 -46513 -115583 102315 -27970 -81611 -37618 -38333 127222 -159016 -129409
22736 -129409 108816 -13730 190782 -205997 -339391 164580 215078 20876 74973 -210303
22725 -2103 -54323 141908 -358317 125904 26587 -112034 15607 62997 -109873 -3930 -220258
22714 -220258 -176475 -162736 129022 -18787 63752 -318319 -375707 -145591 176352 56161 -12355
22702 -75323 47755 4728 309347 -268317 -52166 -135143 -27464 73139 -84732 94676 205950
22691 205950 114179 -124923 159769 43951 10120 208668 -40177 -274889 309704 284944
22681 284944 -262661 -245597 187633 176830 -9978 193605 160801 -42317 -60831 -51531 -52665
22670 -52665 58920 108003 21036 -1652 -134406 156846 28863 -25758 -76077 -53446 -56923 -8719
22657 36481 -260017 -148237 241626 44963 -71186 238053 -165416 -57435 143460 -12075
22646 -119584 115220 2643 -147703 -360538 31676 40288 6419 -144124 -151564 -202889 62565
22634 -295529 -95032 -58955 -97552 226056 -36157 -213055 77543 -225824 -80561 -10032 -438082
22623 -438082 -14897 318608 -140427 237204 128954 -217527 -169964 -191544 -142983 -71021
22612 -90442 -166843 -131999 -34608 -357054 15565 274825 323374 289113 3585 -419173 -173621
22600 -47871 57287 -178372 185141 197797 -108495 -200809 70887 44454 80932 -17173 -315028
22589 -315028 -275493 -10313 278572 -94102 -31974 190472 -179092 197827 -264080 -131434
22578 206084 57118 -229679 66083 284371 -263516 129957 126418 -132841 -33638 77889 187051
22567 187051 -116678 -12560 -188332 -216301 146037 -285033 -58213 52685 133748 46404 -100493
22555 -54263 -157880 -387203 90086 422224 -21464 -212359 -40035 161268 -187354 -239349
22545 -239349 -352439 168653 -389647 -154708 105010 5192 299864 -275268 56717 94197
22535 94197 -115455 -104459 139912 -26615 -564176 -221951 -34074 76575 -213446 -68310 -32931
22523 -212431 -216657 -94952 -93907 309108 -356733 -217071 165125 107652 196746 130814 -2935
22511 224312 -261634 -240209 126022 -297898 10600 123859 122703 189779 -183401 -19808 117752
22499 246837 119238 145514 -175902 7905 -136479 184404 -214429 16743 -253917 -77551
22488 -125949 52654 -98477 -12035 -218485 -18369 -183707 -29449 -97785 177548 -281004 -196797
22477 -196797 256836 -170248 80100 93817 26427 281076 192256 -8034 -59559 -138837 -152585
22466 -152585 -61416 55153 173265 -148307 -39701 231999 -343804 116406 141890 99693
22456 99693 -155826 24147 -57536 -38028 -458695 70111 -113733 17826 4539 -116754 42676
22444 -28749 -470686 90005 122650 -125567 -223397 -70228 -19796 61447 -159479 -197416 -90489
22432 -162045 82078 -1607 236357 274881 -69971 -195904 -384180 -201236 -164161 285114 66151
22420 152059 271840 -30580 -67799 4214 -32346 244345 -24675 27313 -249933 277323 -266877
22408 201261 -344127 5447 -182815 -178766 128324 167551 -39234 -260302 257587 -336360 -91167
22396 -76695 67438 -36544 -60632 -121159 -223005 -299928 87559 -14366 316554 -210761 208981
22384 226145 140331 -288801 44017 10503 -171735 -225997 -112274 -210792 -8299 -232920 -149753
22373 -149753 -160428 203001 -177941 -26746 101749 -138938 -122552 -194614 -259067 -157825
22363 -157825 -356479 -170577 138201 252142 27844 340390 -156676 131819 170169 108689
22353 108689 82934 -24423 61683 37671 355221 -58455 301996 30325 150123 -151943 -137556
22342 -137556 -368987 265509 68385 145442 499348 78246 10556 -183318 155780 173957
22332 173957 -374062 34406 187673 89987 -6191 -322762 226454 -76071 -191086 -170602 -271687
22321 -271687 -262551 -46080 -39513 -107971 -372409 -85732 74220 48684 77729 -63524 81525 88212
22309 88212 131489 21483 -101765 68988 217108 262276 26199 60370 -188736 -4868 51893
22297 335324 32847 251256 -129344 139180 49498 -165267 -93370 -74160 -193387 32205
22286 -109212 -239578 90963 179869 -215697 -129266 300599 19977 57303 6732 154969 -359727
22274 -79229 -240362 -199751 144564 90676 -86650 177434 -161362 -159136 -29514 -167524 258630
22262 -55806 -10555 -292357 196116 -402894 -23967 117578 44023 256836 -206113 15428
22251 191741 -254495 -74636 7197 -342935 -202132 21783 -90855 48540 -419613 75755 226442
22240 226442 212204 77599 328618 -383431 -169200 -140025 -125526 -143536 153264 191323 -10528
22228 280625 -68581 119713 -197928 -43873 62253 275871 6755 -251127 23054 -247332 8054
22216 312798 -431740 -116661 398811 -209373 -72612 -54357 32796 -406684 -110 47332 154076
22205 154076 -245141 48078 -246604 -202172 -142451 -125556 -146302 35394 -131170 230999 -123606
22193 37168 -96925 108278 175729 -312682 161077 21417 -152689 28959 218803 -11590 -123282
22182 -123282 -353120 -224704 173888 -372960 131051 121524 121697 -55619 -212654 20125 -195237
22170 -94353 254249 -195275 36328 -59974 -113433 -78668 65934 118761 -158032 -176554 -19357
22158 33874 -99649 41752 -272384 318511 -348877 -451259 -118237 -109030 210249 77497 34341
22146 -119256 25122 -3114 -83420 -125211 -28918 82818 -456427 -94260 87083 -43901 -112934
22135 -112934 148522 36648 -148419 296667 146682 -174366 -258162 -336873 -182184 127215
22124 -122057 48453 103990 -60839 -248877 -17370 -191499 -143772 189796 203388 178347 -84880
22112 -233949 -304466 -52939 -106841 22033 -74771 -4741 -135013 245264 -100601 48576 -224374
22100 -131449 -1660 290554 -26841 144486 -90568 5240 17651 94405 10683 -81479 -25817
22088 -240035 30183 -438549 -87817 -350865 -388656 -239345 -86326 58863 -106979 -115304 -453007
22077 -453007 -192501 -131736 32349 -79445 -79112 40006 344567 4536 -174919 138277 -552108
22065 17641 -182699 -179683 -168132 183822 75694 130748 219045 32548 -54519 250117 185034
22054 185034 38737 131350 -70971 -95868 115970 -113341 50617 -73093 119139 -245685 123660
22042 -287043 -65287 463216 -78401 36105 26917 -156686 -82189 54807 60268 -32772 88265
22030 210633 185569 -188496 12826 34765 217570 -255827 106576 -49307 9050 200309 -246877
22018 -81340 284613 -214342 -317748 -193368 86790 -332264 -30535 -147498 245770 47334
22007 3658 390899 210846 -156597 -124462 -24203 108334 -52827 -41469 -369548 180454 -184224
21995 228039 16317 109818 -96759 -216671 -88074 -180830 222498 -391162 -53857 83547 188849
21984 188849 313909 54175 -121454 -172587 120986 270362 163365 -2939 -6371 -200689 -149989
21973 -149989 259675 220575 -126049 138684 50236 -188101 237712 35680 325754 -286901
21962 -100386 -117605 -49544 -122465 -109984 -167065 -130666 61750 64098 -435708 -15797 88486
21950 80709 -73957 -190520 -204340 -192730 36329 -90361 -36727 291878 -65511 -197848 37731
21938 -8635 -273461 -107527 -11019 -80252 -64361 165189 63280 -66891 131298 68369 -359467
21926 -377 -106016 -124367 4623 -131544 215376 -130460 326673 318869 37783 -172340 36846
21914 -76141 -47375 -44360 191547 55341 -12860 29522 -70379 -12180 -165477 -10514 -86289
21903 -86289 -206059 163555 223783 336076 8149 -143343 -162198 -205764 -265108 104222 -54711
21891 -335603 -138536 -235239 -141065 85871 -261708 340786 144062 -415909 283434 126184
21880 45443 -175540 106106 -121504 -160847 -212720 137700 -106917 221930 -210026 -272044
21870 -272044 -199584 -24985 136444 -83720 -490357 -192868 152563 -127814 -74393 -24043
21859 -106706 183899 76275 16134 160529 -179075 -5982 61003 -155479 -165651 34468 -134698
21847 -147283 -34712 -158871 -285071 -152310 -316640 11721 -246020 -132428 -191833 39790
21836 -109746 -160185 104587 185334 320767 -301046 -435773 232807 84372 20684 -329120
21825 10619 -116979 14169 49105 44141 -202238 -473244 -204931 -46540 -474324 124946 -212053
21813 -253288 43314 -15374 -73035 -226022 -231093 91323 158158 -195573 1634 -447612 -80371
21801 99368 -70853 2828 122944 179142 -42529 -76669 -135917 159442 -48250 -66213 62071
21789 -476809 114351 10259 -253611 -117608 104497 44749 -55643 71138 55895 111936 -192341
21777 101987 -169566 -34965 35131 -55009 -182863 -241403 589044 -230790 -243924 127230
21766 26296 -35090 -57882 173825 234313 -127978 78293 -108602 -331974 30677 -161052 -323261
21755 -323261 192651 -247386 -201519 -24242 -11596 -139164 -27283 -295396 -120925 262983
21744 164556 -377185 79565 -75225 -109666 285805 -56038 -217639 -23740 16619 -131522 -156049
21733 -156049 -369042 324365 -178400 375 -339417 -14043 -27767 -75670 -12115 -414438 -141894
21721 230212 -189898 373246 -333389 16836 -59966 -312443 -101926 29076 -79841 86925
21710 39883 145168 -166738 -108177 -15382 -18828 46820 -70110 31697 -142378 13992 85347
21699 85347 -135951 -451632 -42078 -133196 -64156 151815 -120212 -46309 -111530 -39565 122726
21687 -143187 136651 136749 -130417 -139881 8711 -63083 97572 57486 8859 287027 -129708 -218011
21675 -218011 -22070 -277651 342328 -77379 -162505 -164199 -43235 247371 43429 -84977 129527
21663 -208088 191544 -36950 -20159 67269 -185098 218754 -110574 35448 -125538 -153729
21653 -153729 49492 -85030 36470 -108332 -376567 -252994 109550 -284547 26354 31303 -158962
21641 62934 -15021 123569 -372829 135647 674 3745 -131322 -145839 -144495 -255211 43303
21629 -171135 78366 -404477 184955 238037 7192 -240575 -197419 -234209 73924 -55391 -65498
21618 -65498 -552635 215181 -366702 -80864 7731 41362 -305632 -369390 902 4778 -27891 61821
21605 -216585 -492346 39077 -242913 211693 21315 -99574 -68756 173753 -239154 146169
21594 -144576 -26802 204436 -42973 254554 -387717 4572 392079 75520 20300 -60537 -95996
21583 -95996 139099 118633 -5772 193834 -257234 -168474 177337 -165219 -184693 108475 -193700
21571 -214046 71246 80332 95664 -256996 140302 -113358 81161 -151537 -90617 148856 73707
21559 -31252 217470 455775 2630 -136962 -148741 22646 -346085 -51918 227792 -180940 90220
21547 160991 -141793 29145 265711 -51146 -151059 187468 -119249 -177889 -382873 -725778
21537 -725778 -125469 -144880 12438 -281584 -206817 264861 18092 -223482 -162257 146869
21526 190878 337951 -298475 272311 -38372 142510 -198182 -92042 19906 -238269 197507
21515 -133878 -54909 -177231 53374 -264276 61405 -236957 -154252 25103 -167701 285333
21504 310667 -251185 -143450 118715 -135107 -179144 112215 -6945 219125 46696 -230640
21493 -140342 -127712 228600 40149 501945 -434225 246894 17689 33519 75729 42347 -181413
21481 -242627 111263 -78428 -269792 -28142 -107303 -204937 -171235 -88643 -168483 -181904 8509
21469 -2914 258 -177028 -104986 -58195 207126 61691 86760 -262809 -25228 29251 74956 -206385
21456 -275137 13845 1758 74243 231462 -140590 -184424 111884 376006 179036 -15790 -19967
21445 -19967 -18654 220428 -69700 -226490 144046 -96251 -278401 19459 152386 -159918 -164775
21434 -164775 -56461 -461523 -35921 -149909 -191444 -49941 -58892 -144192 -216842 -167941 82285
21422 128214 -247180 314737 371447 23576 -193795 -309241 161833 462417 -268632 -184370
21412 -184370 -26671 -124871 98407 -81540 -60091 -7165 146824 -219271 -172983 -468477 214267
21400 34490 44665 -9769 -258906 223200 21155 80186 -268097 143683 -195370 86681 -54592
21388 123196 276350 -208928 -61107 119395 133327 54644 -289149 8941 -183009 -299814
21378 -299814 -121035 16778 68229 -232306 78732 -138421 -46420 -13055 349063 -219625
21367 80877 383590 -327001 341300 5475 -86750 -216991 -89010 435462 -142972 -53895 -177034
21356 -177034 -119808 48238 -47531 -186150 61215 124102 -189699 100045 -18593 -15927 -48863
21345 -48863 110745 -190087 218498 -245162 121012 -73529 -445218 226866 74225 -45343
21334 -252880 143132 481083 287163 191821 -210482 -278364 -216110 82684 117543 -32720 -419276
21323 -419276 356870 -239354 25887 98334 10945 365967 -400739 76400 -623921 126380
21312 -71535 -50830 -85637 -104297 -153003 -93349 -66888 -124595 24311 89205 -381041 -130163
21300 -101396 170826 -30436 -189804 84846 -161273 122922 -35541 231872 39376 -99742
21289 -145064 -31006 49522 -87312 -108520 -409600 -135462 -25374 -311053 -387566 -116689 -10804
21277 -86010 225071 -206261 -80111 45131 60122 396922 94023 -301733 461786 114947
21266 41408 -195329 -156790 -49631 -119584 -204029 58983 136227 268096 52734 53834 190598
21255 190598 -241237 -53147 206782 94701 -76567 -144572 -55330 -91520 -67950 -31681 147126
21243 -49675 -157865 221680 -83301 -150102 -204420 -70417 57553 105398 -102303 -119014 -263040
21232 -263040 -235033 38244 59642 -172351 -246918 18040 -147493 -87976 -168719 31065 -348213
21220 -101361 10311 -201366 -30622 -62141 -337468 66979 41301 -311769 248903 -154957
21209 -153472 368850 -304894 -131093 -27834 -124613 281722 -174085 77517 154554 -136722
21198 172222 131420 -97860 103179 80301 -24393 -149864 -308380 -53709 -55747 69755 -51841
21186 79709 -95711 -188986 -57120 -198775 23631 -142396 132942 49346 10383 -97335 -91690
21175 -91690 -71338 61454 -192129 -204631 61589 -275437 -239072 -72715 -77211 159745 97204
21164 97204 -56411 -46139 -293262 -70674 -142534 -148984 134844 -60208 -26493 260890 -155698
21152 -112099 90291 6416 199591 -223741 1342 121917 -190161 54333 22766 165623 12074
21140 -152495 110660 256371 -390147 -206166 -558047 8191 120330 19202 64462 -224892
21129 -66837 -42999 -59794 146819 -323975 23966 18434 9053 -35080 -200633 321341 98072
21117 203437 156877 -1601 -162420 -72238 -594331 191405 -57465 -264993 116295 -52249 -10048
21105 -172889 104853 -218956 106987 129899 147124 -413544 -146034 -431633 -95300 101966
21094 -525442 -399261 -54567 96260 -89591 153772 -444176 -69169 -70884 14989 -190699 64637
21082 50732 3471 -484370 140516 350618 -129364 32698 -84271 -155598 -277899 -280373 -95851
21070 -123342 -56613 -36764 -170876 356475 -307117 -87653 -287853 -138572 -75595 -178130
21060 -178130 90007 -149276 46614 74385 152454 18151 24579 68269 -109544 58417 152782
21049 152782 -102390 -31781 68846 191563 57075 221849 95128 70783 -61079 167375 -69239
21037 154062 -201919 372523 -57277 -31103 85867 260943 104800 208106 17723 -85119
21026 49853 -74603 112839 -304105 1349 -226857 21825 -196956 -4365 -20115 164711 -58818
21014 -56178 -321545 -340331 313013 166657 -60090 88421 272281 259265 -4232 78582 229707
21003 229707 -6525 -84759 -108119 -217839 -25289 11267 -108933 25942 94376 -171823 -20441
20991 -195142 -51841 -171056 -124892 -124441 102252 -66449 -38460 74299 616 -203093 114761
20979 270583 -262644 -27648 -191815 31392 -79406 325743 -417 9122 -488140 -65887 162142
20967 81063 20535 13993 16573 -108701 405735 -570368 160513 255139 -479601 70583 100678
20956 100678 -323917 -122157 191230 21359 -37199 -226545 138744 108601 -289040 381327
20945 96631 -3275 -69074 -104634 229500 116274 16436 43451 19675 -96770 -124762 -156625
20934 -156625 -461280 -218695 -201030 25380 -69354 100167 -62459 -98149 -206534 -72718 -178693
20923 -178693 76113 33326 -67829 125404 318020 -245005 -196771 -49261 -301506 17807 -119992
20911 -175369 -215426 163416 120987 -283205 -233524 105834 -118387 -181190 -201905 49786 -20329
20899 -68888 12115 -112607 -79570 272346 181 -163076 2613 8426 104834 96768 -306571 -430687
20887 -430687 -343807 -269328 152889 -324538 314805 116713 -333550 78265 -143522 -186386
20877 -186386 -168350 15800 159516 51383 12948 -119710 -174168 169726 -67154 -55064 -95183
20866 -95183 -118111 54247 -64330 -306810 -260430 -58523 -82915 -1188 -145564 -60163 -187209
20855 -187209 230890 -380221 236 -71796 -20055 42628 -109205 220834 -293604 130073 -396020
20843 -237972 -58866 -146691 379458 -129128 9363 137215 67646 102217 -270634 4845 -55510
20831 140213 -57023 -199821 -71010 -125658 72408 161342 -244858 -140922 -16642 66198 -16578
20819 92708 158610 -111642 -111828 38750 -254395 -19533 -115439 -266414 -46049 -59898 59827
20807 15731 -6412 18459 -59642 -244337 144557 81866 -209348 -428111 -41940 -149026 187554
20795 153714 -146990 -75132 -132540 41876 -233287 -5787 155152 -278836 -122383 -32954 120035
20783 -470206 149058 162413 95204 -115266 11297 -312063 182893 34418 -59654 184036
20772 -11956 186492 -249574 -34196 -65978 40944 -88747 -159045 -117584 83986 -70703 -36668
20761 -36668 153291 -275859 194827 232720 16647 -240712 -22800 -95746 155760 -220376
20750 97284 1423 87313 -211207 -104573 -31466 -8928 -155921 175104 -239105 67334 93933
20739 93933 242593 183583 -62629 51412 125071 -189317 240571 -38399 -185975 -212795 -213371
20728 -213371 -347790 9446 60352 -253271 -237003 -99950 -72721 -266732 60082 80323 354738
20717 354738 -50603 -195814 -151063 30055 -25968 -3063 -42219 -101421 -369057 22620 87452
20706 87452 -285401 29740 -186089 140345 -30118 -135304 31284 222075 -217432 -199971
20696 -199971 288527 124506 -43995 -100879 -284970 128606 30672 158442 4784 2656 -1320
20684 188446 -78020 -90904 -133883 -335913 75051 -101876 152165 -91809 -72202 -221835 -207717
20673 -207717 -94859 -47873 -110932 -32332 -53394 -158436 -72604 103386 290801 -92061 147498
20661 -254584 -257789 45969 -140467 -272830 -54007 -82208 -301778 -92046 -107413 -11291 14342
20649 -59443 28515 239910 -402939 -239084 -280731 -92337 -33522 163457 -10062 129824 38366
20637 24181 -184324 86802 -13280 -21951 -216656 -141827 131900 -583848 4409 -84171 -213785
20626 -213785 -36873 114980 23618 -133939 -233453 118673 143455 44615 189588 -253225
20615 -15074 -336377 -114714 -128256 -198799 -342653 -177269 162870 -283263 293091 26010
20604 31245 -6923 -52302 50090 53438 97157 -145243 365941 148434 -358534 -153793 -441101
20593 -441101 8164 -280292 52884 -19340 44261 377273 179773 -186175 86360 311291 -68424
20581 -64088 -42566 -26369 -13021 235027 -158414 158303 7434 -108458 -359275 208200 -215616
20569 -149666 -74270 14308 -124070 416277 14636 74256 -44983 -216831 -109785 257402
20558 -146222 -254166 -142069 -206159 -103201 -194873 283601 98345 168718 -41857 28701 179050
20547 179050 -2891 -162288 28225 -80673 -32229 71590 -156479 -343000 214834 -125006 -80680
20536 -80680 -258036 -132795 -102264 -263591 31637 202066 -268952 -13717 173420 -199437
20525 -3794 -89522 111086 25410 179746 -13697 150797 -18385 -19218 -181099 -58605 -135390
20514 -135390 194174 -209480 -213594 280263 -340203 -65456 -89015 21392 245405 -14744 -33728
20503 -33728 -173148 -367626 74878 329149 -312689 -26070 -263936 84174 -99504 -189377 28710
20491 -361400 39838 -3141 -174280 -140087 142166 -267134 -204449 -120928 -72245 169714 -180666
20479 121528 -97039 -166900 -141502 39892 -78226 21102 -112983 36833 151067 91881 -231980
20467 76122 -83888 42994 -193184 11401 -216661 79756 -63986 -231887 -159562 220252 -3260
20455 140439 -157664 229685 -249503 25507 -110993 6170 -260265 -214627 123410 -146395
20444 -256045 -199889 68430 32135 -81203 -269783 211655 -28487 -65643 -321552 -131766 394342
20432 330913 -93693 100385 133910 279517 -339913 221122 165138 253522 22587 -256011
20421 -59112 -221161 258565 85738 83712 -255434 129972 -529471 -555123 -19143 -222857 41080
20409 -59740 291093 -125186 -284634 -89064 -50990 42614 -22629 -88387 -80270 21521 -109407
20397 -67960 -96836 -314895 -75575 -82794 -33681 117983 -131390 -60525 -129623 134772 48999
20385 -74157 14135 258852 305130 -238763 -70956 -33397 286759 148438 -173222 -206198 104989
20373 -229669 -318647 34853 -91788 236615 82925 -206787 343749 -283650 -286160 -87726 96458
20361 24602 -120131 -150950 -350369 -40384 -219590 -158561 -19986 -41432 206671 -104444 -272233
20350 -272233 -291675 -10402 -63048 -601349 221408 41441 -65287 -68944 284198 -73270 98814
20338 -16744 144657 -198984 -14205 -40650 -142386 -48204 -213219 82039 79651 -56192 -185751
20327 -185751 -98890 -391271 45394 -127479 -376331 -289807 -66195 -236792 -210553 73493 -110332
20315 -186024 36076 -56247 -47075 -27894 -26505 -453630 -86084 -116941 -48995 7361 -513804 -118756
20302 120143 -300510 -70718 -67698 -339069 -185770 100504 416598 56197 82930 154881 -311259
20290 7078 70893 -215183 -13057 -219023 -78213 14264 31731 -214539 121766 124450 -267970
20278 57400 -304992 -86526 82945 -329414 -92922 -45996 162008 51042 92725 193165 -46027
20266 -11845 127247 248489 -108620 69215 -23225 378907 -233316 78234 69129 -218355 -247462
20255 -247462 -114176 4085 -277650 -69454 -18257 -98408 87576 109295 102539 -153030 -43974
20243 229133 137341 112050 -225117 -126517 155286 -67289 -70553 79456 -55188 -8731 -143872
20232 -143872 -95907 125233 -159094 100671 28024 -34635 29110 -259314 -185871 -1309 -233492
20221 -233492 223700 -62732 145112 -123640 108440 116755 -81318 46628 39903 39114 -336267
20209 -161232 -140981 97128 -15600 95948 -247030 -100340 368475 12274 253753 -355733
20198 -126001 -164073 116160 -301629 -92095 31060 29992 166257 -5995 -167067 52410 -6596
20186 18601 -270801 -151456 -260114 215018 -59654 -61122 146493 -64488 100829 -134401
20175 163714 -289640 331320 96306 -993 152045 185616 99600 -112200 -16615 222492 -217227
20163 46086 -56595 2477 221629 51991 -3493 -111420 63120 -114953 143189 141476 30094
20151 -13631 473462 -105747 -47772 295655 -270693 -135986 97008 261817 -337904 -56169
20140 -261253 -311690 209324 198407 -126138 -6695 -473600 77206 -2250 -2150 -93909 -181543 -90425
20127 241608 -54013 45986 276770 -189949 -10030 -39773 -211741 -135034 -441606 39407 103723
20116 103723 -119768 77608 -87629 -211824 -276745 -109492 165245 -106583 -58423 -200249
20106 -200249 -91865 -91481 -268154 -249107 -136323 -4316 53439 -237347 1173 -72991 -115850 -256845
20094 -256845 125472 -11314 -82858 86873 -119792 118713 16336 -55394 -72396 -44918 -140549
20083 -140549 -193383 -170133 -19494 -491457 -80953 -194036 -287137 -209865 -357273 -416563 53678
20071 -169074 -201558 97158 -102970 19661 175420 167081 84393 -420229 54296 -165651 -24373
20059 129434 -66340 -76322 54677 3705 -205058 178222 -134919 124932 85595 -362115 -14266
20047 317066 -145281 -135475 153538 -113869 -101621 -252008 -129697 39829 -17391 -305022
20037 -305022 36832 -216297 10352 90211 228487 -44683 -54008 -56845 37658 -52626 90111
20025 -194436 -15419 76872 -16247 107855 -77658 203506 -65650 -66533 150607 174624 -76764
20013 56354 157177 -304882 -86990 154692 -64467 -196418 19181 -29699 -80546 -91443 115958
20001 -161248 -184935 103941 46729 -75861 14185 12476 12589 -54265 110542 37242 270131
19990 270131 248545 42825 -95529 211970 -75695 -144689 -263426 34568 -1867 -163694 -121426
19979 -121426 -166654 57900 -107937 5673 -5054 -199125 74281 49593 224028 -61650 -39794
19968 -39794 -221614 93616 466147 -173771 165312 -82461 312815 -63041 -143606 -180263 248805
19956 -289197 -102042 69277 114166 -67865 96264 102475 -150050 -144844 136127 -113069 26754
19944 -246651 36209 174873 -270386 -25228 415945 67178 167054 -86698 46709 -31237 49964
19932 69848 -171388 -223776 34798 -86466 98560 -121074 -231055 73869 -11952 156578 -168839
19920 -115957 120619 -155948 -307961 51790 -7279 -112640 -103195 65954 -23414 -136971 -293140
19909 -293140 -190189 342467 -116906 36244 345244 259757 499849 -116243 -289455 -202839
19899 -202839 98326 -281611 163718 -259283 171071 84793 -133210 -409552 -221817 -85524
19888 163961 50251 -393696 -59657 -271028 -315350 -56806 82545 58223 -151750 -256882 -229923
19877 -229923 -99917 -170281 -199505 89941 -129654 144469 -172120 -202722 318508 -398514
19866 -627801 -40622 -146718 -131729 1626 -218996 807 234458 123656 182986 96915 -167394
19854 50664 -3085 155337 111338 101117 -244867 438064 -145713 -100266 68424 -255025 -146592
19843 -146592 -37118 -247832 -120074 16766 -204862 -220658 -147691 -2293 -175553 -43165 103618
19831 -122063 135795 -25258 -3921 -245433 101695 90304 -106538 170008 -265499 -53477
19820 -20114 -31452 -248915 -513928 14552 51960 -154319 -105248 -23639 -108525 -206538 89158
19808 158486 -240452 205439 -8160 -185010 71212 -27836 -80764 -440629 -138109 -64055 180378
19796 -126236 103209 -7975 286163 -136811 94082 -87386 -28317 -11896 -174190 8415 -163915
19784 112777 -57058 -34815 -275570 -102809 77101 92209 -105876 -47571 -53916 -32400 -346270
19773 -346270 -135319 253389 -89617 -46727 -68007 -15374 -290560 -62869 -79851 -290819 -77991
19761 -105814 -107718 -178998 78784 29301 -332368 260648 -308252 -136659 123418 -115856
19750 193497 -255120 -374065 -163757 386807 -228838 -8332 -169270 -262865 -225566 -152336
19740 -152336 -72784 25161 -77738 -82254 -73697 181519 11083 415175 -259592 328908 138668
19728 -240140 58544 -103903 259665 -59753 113066 -56080 -10268 -12938 49518 407035 115164
19716 -73283 -35719 -216623 -200915 67511 26905 -168442 -48076 -164607 -162718 214855 -236362
19704 -178255 -98845 -53814 -19778 -61618 -58361 -18795 5496 242576 -106484 -260923 -37902
19692 426275 -138293 -352945 -159099 -10839 -194960 -207663 53596 188463 404490 -185798
19681 22299 48602 -128732 338286 137121 -149031 7460 -266329 -30870 86470 -114256 -55774
19669 143846 24493 12813 -63627 -106144 -7799 -139469 -11783 -62626 -16219 129106 -187459
19657 263955 -1846 -941 168108 407282 -182020 4432 -28494 -90946 23530 249228 -280912
19645 -313204 -73066 -4219 -109906 -334722 -137950 242625 -179120 109684 108852 30980 -112356
19633 -223479 -129667 -126302 -215328 -39359 25648 -20100 113153 -571188 -102965 -26568 -76771
19622 -76771 -193907 -439870 118248 102431 -57626 -140230 -258355 78006 -76081 -21633 -106242
19611 -106242 129083 -111027 141523 42922 87384 84335 294146 30483 55462 201442 226074
19600 226074 281213 123153 156173 294 -97966 69519 -250253 -3029 38734 -147758 211538
19588 -80068 173484 8274 60402 -62750 -63820 -43183 245755 115570 -243218 145855 -124707
19576 200683 59475 186047 -76842 -2971 255352 -31463 -54911 -135311 -212600 -48404 -4570
19564 63549 -306304 111453 152103 29253 -38892 231774 -72538 -34151 -117976 -207609 14097
19552 -103322 -112089 -103584 -257006 -95796 -140687 3334 -255416 152592 -10266 -2040 -30431 169302
19539 -262869 -120546 -124380 -94340 -131920 -29821 -288051 -342392 236880 106106 -41837 83652
19527 10305 -301908 45928 123531 21403 4855 -128478 -311861 -153250 -100422 -140999 -74431
19516 -74431 -128192 45384 139725 -242896 -516845 -252233 -206619 -3498 -135882 -192853 -159431
19505 -159431 -91811 -251270 -121181 184346 -224397 17941 -817 109367 -147564 -106781 -396029
19494 -396029 285038 -157000 -102718 -71119 -334191 206510 262033 -218912 -20434 -27695 10722
19482 172700 168209 111844 -181049 -367123 -67433 56043 364345 -323708 30526 -250878 -44270
19470 -159173 255190 39914 -272975 -165425 -175060 -13667 27434 -264472 -81386 -152652 -161051
19459 -161051 38807 -259243 -102430 91039 -288144 -110596 257998 -21908 -219607 61376
19448 215806 -358722 41844 -38650 -100031 -73397 -141312 96347 128758 111990 179009 -300596
19436 154240 89892 -331863 -285856 -263263 49536 -223281 -95044 -165091 198791 -79538 -78998
19425 -78998 119803 -75606 76984 40963 181133 206471 -375291 -36500 15564 228829 -120813
19413 310881 29206 -254203 -386619 -133226 113332 -285302 37276 -304499 15320 -65313
19402 155352 -146982 -33563 144646 120548 -79125 117548 304314 -304114 -207585 -99320
19391 -274558 -114356 -189870 -302150 323468 76241 -35055 -126198 80583 41540 -127423 -397963
19380 -397963 115956 99024 -159018 -576206 106886 -308006 151098 -30875 120880 80510
19370 80510 69402 -34391 -300211 55267 -46961 -155634 -31373 -226178 18588 112190 -266024
19358 -182592 181395 1790 -89623 -141095 -174666 84799 -120239 -139040 -318889 58167 11151
19346 -280819 79179 -208555 -207474 31822 -50857 73477 95279 120843 144870 60650 -37316
19334 109878 344531 77922 -63216 4491 -9634 -17483 14631 -155407 -50905 -32866 -70180 -109114
19322 -109114 -98068 198964 -183830 393154 -182993 -31032 -224696 -72907 31798 27181 212685
19311 212685 8765 167049 389579 -67687 -131353 -233300 188128 -12988 48630 -52254 -161308
19300 -161308 240474 -155582 -225708 -593745 220671 -318758 -134243 -334692 -205406 -4090
19289 27301 24479 -365820 37452 -96573 169902 214634 -160417 -33732 -169578 144453 -50772
19277 -130834 -127748 -39454 -353496 -248307 63996 -206838 -144592 374060 46441 -154480 2518
19265 -103888 -358644 -150626 -9785 123755 -161079 -22363 103528 -203451 146914 -350987
19254 -4544 -127873 71542 -72016 -29896 -313098 125835 -56134 284 -45543 -70077 -183750
19243 -183750 58284 -54770 -10399 -38044 -173911 -308549 -17698 -272796 -437342 -50046 -90238
19232 -90238 -214790 177937 129228 77960 -231799 -302410 -332870 351640 -261038 -174533 41264
19220 130637 -187783 -94072 152263 -175543 -90490 -213683 -293628 -115928 156660 -196992
19209 -168829 259106 -90834 189612 221166 83754 -169671 -41430 73983 -30946 55156 46244
19198 46244 101611 -333664 -75375 -51154 93102 120029 -49125 93024 -9005 227062 -112957
19186 -189321 -92241 5683 40564 191015 313106 174619 -75320 109944 117247 -5627 -6487 12843
19173 -285227 -406975 174126 128465 -138437 43369 258920 2982 27179 -135500 68012 -337604
19161 179308 -201784 34805 -229670 58494 95703 -55214 276700 -263061 -118863 -97347
19151 -97347 -229944 -237817 1196 -46534 -246794 -112522 139994 -225911 -172636 -109165 -217145
19140 -217145 49665 -247171 -240467 -140895 -148005 -102613 13580 166414 -2079 -26240 61954 -195537
19127 -158551 -108696 -111489 -120122 109816 -147941 -238577 -19856 -88487 306696 104295 -225534
19115 -57164 -313450 164402 229972 60852 -52477 -286035 -81320 210450 -226431 -208770 -67518
19103 -273202 -509863 89464 -7696 -62896 -226897 -456354 33197 -11235 57565 -159518 -44838
19091 -247635 -133428 156800 -375808 184927 17341 -18129 44508 -133568 -143837 361402
19080 108340 86338 184855 26786 29251 5403 -37580 -41337 -251410 34124 183415 270622 -264954
19067 -52356 -196575 265577 -359359 -261446 -161614 -69011 86265 -211270 -235614 61124 348718
19056 348718 5746 -240172 108557 -274733 69813 -196460 54616 -106096 -308670 119785
19045 -63869 -20419 16288 -109339 119879 138631 -85878 -581346 179595 -101897 320673
19034 70332 212394 73590 -172149 301346 -59677 278722 -100949 -131093 -3095 19719 -376102
19022 -61944 99336 -146482 12515 108480 55876 -118832 133298 -98123 -147429 189304 -39256
19010 -132338 187939 117920 8149 84413 107150 94276 -25816 275849 -113743 27534 -72954
18998 -162772 -135365 -147364 -128105 99370 -293227 -126089 -141704 78740 -65593 22629 147775
18987 147775 -222505 -24578 -282202 -86500 210595 121606 -90038 -123764 -150359 -76263 140101
18975 -94034 -78473 185364 148061 -343663 281166 21006 56361 -267237 133176 -406340
18964 -41163 -227135 25331 -118086 239191 276548 -25120 -189109 316255 -129638 -19156
18953 4713 -202071 1761 129830 -191034 213423 -40155 -196489 -66546 -57903 15483 24379
18942 24379 271182 -23746 -314132 -77829 -464219 -33265 -229991 -182616 151452 -19314 -58676
18931 -58676 -34509 416913 170065 57461 -62310 452660 -93180 16751 -22067 -48929 -195570
18920 -195570 -213479 -53762 221568 -251595 -28888 94114 -34167 -85236 -321885 97052 -56774
18908 310207 -26859 102094 212293 -143961 39379 -267157 -209792 -110113 28844 -307316
18897 -138404 170312 -111490 79950 -95892 -185558 -30161 111909 278188 -96955 -132730 -182466
18886 -182466 -20892 110426 190936 -102885 -38663 146820 -100061 -65626 224949 108293
18875 -180452 232806 -317393 -107164 -203250 -70487 -51241 -84780 -25352 63861 6605 -288548
18863 -49195 -230612 -248595 59132 -239369 44775 -425133 -59004 62909 42222 -21305 22295
18851 -192021 94866 194147 -198075 -231311 75848 144210 158159 5230 -337704 -121046 -76944
18840 -76944 -129098 -172514 -30640 253884 -37503 -98195 -191243 43404 135067 154524 104600
18829 104600 -168339 -366458 -391391 3285 -193163 140148 -367147 15486 -333925 -193963
18819 -193963 203976 -113545 -103362 217154 98209 -87999 -56730 312024 45173 -83498 -35168
18807 395115 -236365 -26715 -331271 -22545 1265 52625 -148050 50671 -19825 36505 62342
18796 62342 -2305 -128975 -28532 -135246 81819 266837 -14376 222451 -105863 -216158 107794
18784 60142 -129269 -406357 -104737 146272 75524 -115610 351114 89650 -343749 -250389
18774 -250389 -131551 -181777 -221776 154532 -188006 -223102 -114156 -250019 33344 -18000
18763 -178826 -141719 -14492 -172182 -88920 321989 37755 -44592 -154325 -308306 -157880
18753 -157880 -298033 -3999 51282 -65492 4908 21318 -284830 -106056 261773 129861 -329341
18741 -113918 -95823 185317 -208111 -129775 -194406 -111694 -144428 3023 100800 29540 140913
18730 140913 106038 -118873 108728 886 -93588 -76102 250922 117672 108881 23465 -498243
18718 167842 73517 148951 -279435 -118473 189936 58949 55755 -120655 -43438 112676 -61071
18706 62680 98994 192024 91366 -35564 52383 -114411 44295 131798 -237536 148288 -151163
18694 67381 -138161 -165879 -79621 -103508 314990 162977 -297059 -33935 214717 -152254
18683 -94650 16221 -125428 -97710 -33861 203731 -196210 -442831 -110373 -235745 74628
18672 -19588 -22140 12127 38903 -46765 -274787 -390465 -71719 -239818 -157489 -73690 -66690
18661 -66690 -96297 -152481 96913 182384 -108590 156838 112619 33274 212256 -58785 -103311
18650 -103311 179861 52839 54730 -62458 165657 354875 68195 68488 232249 -17589 -29650
18639 -29650 -69911 15179 -93549 74842 -29308 -88016 -186593 166307 165755 8476 97138 145306
18627 145306 120870 184708 -141924 -29247 -95512 341621 262847 -156609 -180382 -44098 -200574
18616 -200574 2036 467174 -156794 -427570 -30154 142076 142807 93475 120076 -165721 10695
18604 170316 49802 -211830 46801 -28308 -32508 182891 -108549 72825 -76689 97964 -22748
18592 -33647 -123787 31624 140765 -56000 -5437 -143131 285591 -301651 289715 -150747 199862
18580 -264840 88464 -173595 -144810 258294 9949 -25991 -122928 -241938 59040 -359647 184730
18568 -161969 -247313 -426353 -173989 -279786 -284356 5171 -420076 -205681 108953 -109214
18557 -2170 48704 -142656 -183912 -198063 -366519 -193826 93685 -283776 -207279 -333283 -334087
18546 -334087 -55790 94849 -86676 56659 -101457 94344 219009 -73668 -200329 10353 -203830
18534 -100537 16576 -296535 -29659 81511 -107312 -107625 -180469 -151204 -28270 -60893 3231 -38746
18521 92834 101264 -277622 -494141 -45566 -158698 -354617 -51057 56302 -126452 164065 211410
18510 211410 -166532 -41746 -97019 48962 -173112 208520 -39842 -147392 70353 -81548 120341
18498 -92197 -300876 73411 127835 -195245 -185007 -271844 -424403 229398 -109677 -28754 -16862
18487 -16862 68964 138671 -367262 -17378 -71840 -34919 -341279 -274113 -425162 -33296 145281
18475 180073 -205137 72239 -224033 -226438 62881 -181243 14274 40911 -252958 -133602 -79926
18464 -79926 -156829 -328110 -19180 185410 36331 -156078 -11957 -41200 7034 -57529 -103292
18453 -103292 -15919 -155064 -39789 179346 -223226 -41497 -152174 -1680 287736 -96862 4707
18441 -79905 -229053 -327267 -70273 -52970 -196061 -190611 -241456 -166579 -143171 -4504 -217326
18430 -217326 90082 117278 -32040 -354049 79116 121813 -49102 226035 243910 -122647 68660
18418 11527 -493817 53334 32900 19382 -97854 -131287 227520 -211403 12116 -256449 68193
18406 279320 -125740 231280 -36300 41178 289327 33196 -56921 -127465 -421846 -41142 -10400
18394 -259227 119800 331265 307268 -212836 -319750 -123369 -194648 305885 -99231 -34055
18383 235497 189527 -290474 254693 108984 -143348 -42973 -290761 -164082 -33813 446854
18372 -51014 35916 165008 -297803 212039 -176993 131191 -27923 124979 -19440 278064
18361 -222455 42691 -226216 365201 149483 43636 168426 43975 -7289 70576 62158 178064
18350 178064 140855 -9804 164376 -216263 -187937 -120335 -71516 -610889 -215304 -223250 -202173
18339 -202173 17920 111144 -64367 -44549 143344 25172 -1862 32090 -245921 -134659 -24626
18327 -244273 199030 119855 -379428 -40142 -177978 -432872 -347070 -80931 76238 -161676
18316 -129956 -436991 -30680 83840 147455 -252225 -105586 93867 53197 -93575 138240 -36857
18304 136151 -133149 -93059 -63039 -22018 -153865 150274 184694 -325494 74616 207915
18294 207915 57505 -113045 134069 -239243 160396 46830 -157225 11974 187596 -314840
18283 31106 253225 -155319 -212129 250677 16361 -152038 -127974 -19574 -107563 -55999 156356
18271 50746 62601 385087 -183039 -147837 76876 22920 -241187 -12835 358269 -212975 -90564
18259 -81757 69435 -111490 -50831 -31607 -76148 74659 84299 -11166 169193 -282072 323017
18247 -72705 95212 142986 -141643 -112232 -17737 -234186 85296 -196135 -33426 24964 -3298
18235 205832 -458762 -235675 -469717 -170543 271742 262442 81650 -270170 -118815 -141396
18225 -141396 145657 -223078 -54877 4962 96684 -32363 -230583 -19494 -66473 -187282 105174
18213 11350 96201 -219813 2951 358853 89713 173467 222586 330254 158812 -15160 -13465
18202 -13465 -35498 130454 374751 248605 50708 89375 40328 33788 2086 -109646 -50262
18190 -7763 7071 -89589 -245646 -155334 -102533 -169289 116680 -123483 59482 -246697 -331749
18179 -331749 12482 169331 -43101 18574 -46061 39617 342434 -81668 -231853 45585 -9595
18167 -25088 -250357 112192 -43967 -125531 -191100 -241150 -106915 -175424 17293 -10907 -273591
18156 -273591 -109619 7155 141545 -171404 -24858 -60392 -282092 229443 -282509 124321
18145 -71408 -175175 -92057 -128229 16053 187970 -9936 -47380 -201893 104851 39444 -285337
18133 77829 -120673 142830 41393 39917 -63173 -49086 58147 354921 -355805 -228076 -192495
18122 -192495 1959 93038 118488 -99882 -210363 273419 72042 -123429 -14805 -113176 -118988
18111 -118988 -145003 42053 93399 61138 -12474 59593 -43703 -35134 -153874 90080 -256078
18099 -60254 -94082 -209033 -33301 56136 -310918 61620 -247201 221989 43405 -403126 243702
18087 -42597 -87318 483174 -176790 8665 20340 297335 49096 -161406 -18814 -6119 15426
18075 170478 28549 -6296 -94727 165873 -110185 -207459 -118800 -127287 -186064 -277263 32923
18063 -34376 195508 94116 -15217 -138822 -263807 81195 -32268 293080 106531 147327 -203888
18051 97003 -4482 95573 41832 166657 -57749 -166316 98605 -4773 83085 -99861 114166
18039 -116764 -69300 287354 -108081 68226 -128590 -40956 -39085 -7598 -70765 -149336 104573
18027 127724 -68096 268468 -52163 -139162 -190942 -28215 -30154 -23298 -136197 31711 42618
18016 42618 -149766 62719 340814 127968 275040 259621 -78468 -124264 236242 -199634
18005 -111327 99007 72476 -138136 -56927 -192622 -115477 310151 -44536 -183035 -33669 -10799
17993 60544 61940 -55483 -76290 155452 141598 112562 -147577 10485 -48734 134161 -103138
17981 59345 277567 -82083 61033 241763 -14650 -84065 131021 66964 66555 -20135 -132917
17970 -132917 -107030 -454152 7816 54820 -68970 67973 -299296 -194842 196400 -89098 94478
17958 -379350 51272 -114588 46003 51158 -41868 -225710 68841 365943 60957 -95953 202755
17946 127225 -85251 -36825 -160854 267120 -65082 -28487 -110464 -33973 11795 362207 -93967
17934 -20750 52293 113115 -67584 51146 101304 44900 258279 -182732 59076 -62848 -47927
17923 -47927 -106279 180124 93116 -140814 -76496 -59528 -123089 -116746 -21922 277634 -141496
17911 36528 -63710 107126 2828 205674 302795 16625 -199221 -104625 45814 -44148 -387744
17900 -387744 294066 -119076 16244 -174862 -9302 165032 -50900 -275624 137995 -38963
17889 -33409 214648 -124894 -226307 449531 -82455 -115747 457560 128319 94076 98261 196237
17878 196237 -106101 259389 493 -272520 34779 124953 205667 60275 60118 -315096 203293
17866 226866 61877 -15149 272510 97502 36721 141361 149820 -337353 204348 149282 -137947
17854 -177687 -9869 402179 263943 198213 184763 -184690 -79421 -117363 -179953 122576 -148203
17842 -182112 164084 -9027 -21652 24778 149224 -27997 -240774 278728 -96251 122568 187806
17831 187806 -185396 -24130 28052 7904 -60278 57656 75758 128128 234823 -58274 -107814
17820 -107814 148995 -133327 65462 -176508 -115866 -381424 -62915 6679 235593 460765
17810 460765 237031 -184963 -108457 22140 -33654 -500568 -6398 -365379 97080 184234 -21192
17798 -28486 162019 96910 5563 58285 -67080 215876 -189055 -246977 85555 -23738 -256754
17787 -256754 410612 213327 -170758 209561 6049 -218552 32869 -104851 -5463 12421 211651
17776 211651 280305 -150454 -162968 -35302 143029 155558 -185150 -175202 333373 -106282 42680
17764 4221 155952 299063 -4645 225218 -137436 169682 -26675 50576 182493 46108 24131
17753 24131 317797 159366 7555 27788 -142484 188250 -81678 74966 16059 147760 -44300
17741 210488 -99238 334925 -19899 90245 114548 20230 57660 29419 164664 169858 67344
17729 -32036 -88852 -115594 68722 -59105 42780 10748 -3740 -19119 86253 -191319 175720
17717 99121 -59690 178177 362958 296099 230936 221269 52197 -99294 159370 187248 -245820
17705 59312 -2419 108915 216910 -403243 -233907 -186327 190680 -36679 -205322 148122
17694 -82778 -59824 234418 -1189 433765 134225 88955 147447 75853 -60968 257260 183288
17683 183288 181963 59119 -115904 -170992 67008 -152130 336568 168561 56094 -235853 27603
17671 20460 -156455 -69555 78088 -199545 63892 160200 86606 7700 -13829 -121885 286152
17659 156728 48466 269114 -77961 131974 -65708 -29581 -23384 -103837 70739 -21472 257193
17647 61753 -197042 362440 310301 -111159 253008 -183590 -4726 115123 -45513 -23165 47451
17635 44169 70536 -72194 -34445 -245448 240895 184831 -209667 -230105 -344310 252337 166270
17624 166270 -106658 -107412 -188421 226784 -171642 4332 132975 70503 41055 218772 -122337
17612 229249 -182521 128074 6768 112742 550192 -115189 -153290 150260 22870 151892
17602 151892 246982 -88112 -166317 -304244 -159188 -40658 63698 272889 146280 -87619 166930
17590 199690 -82601 269488 -105883 -100409 368607 409902 163036 68988 124003 287589 111076
17578 63261 156200 246718 -200674 79069 170524 330943 148257 102450 274015 -175305 -295256
17567 -295256 -113917 468207 220926 131550 163963 89581 37761 122912 432929 -215513
17556 195696 324724 170769 70977 -90316 23212 -78488 -832 167277 44292 135214 248337
17545 248337 77531 173956 449418 82378 398645 163103 256959 127137 -122688 422846
17534 229236 204908 -125335 319415 8090 88152 260207 -96248 500560 161458 266070
17524 266070 191652 188258 292506 274261 217847 374169 455640 107322 -74448 318796 113875
17512 128381 -71349 100839 -69897 268592 351259 325465 423192 289687 313964 289409 538846
17501 538846 -30271 250396 352837 -277925 -139191 509112 241525 94377 352578 219672
17491 219672 149460 113077 474247 145510 -162484 310843 16433 334357 93124 -125165
17480 -271689 245252 60282 180180 26393 -213084 285072 -91860 59097 410951 -69334
17469 35727 95788 355339 387830 174666 76718 195886 -88042 243195 164057 195175 -30793
17457 172273 7802 101538 213317 222489 164153 350314 420303 -6094 167267 370686 410357
17446 410357 272507 88826 381483 76417 457577 244287 171485 122397 431232 180382
17435 -142348 192301 313556 10509 37259 301069 254466 474890 133126 32964 178690
17425 178690 333363 111267 52657 147428 -41367 355460 588967 -153811 421533 389419
17415 389419 107035 327034 251530 -1669 298654 -193258 194531 88879 333491 435312
17405 435312 -94034 227757 330337 45969 244550 135063 97176 464343 40484 325329
17395 325329 53029 -31393 310684 357719 135828 41479 422217 275895 98090 104099 95144
17384 95144 270252 -286845 36062 282037 402073 268121 229062 -143639 -58632 33769
17373 32124 7977 66241 143234 172137 91283 58919 194854 160259 75440 519912 155656
17361 310913 -36268 48461 34329 174694 87495 153641 430495 292286 -2466 248268 -255356
17349 272270 216723 173227 -39648 312316 -292521 449357 273428 100633 274204 92461
17338 181705 6662 96596 165067 245803 -21124 -95995 71618 -54995 515616 361393 515295
17327 515295 15857 -33018 401775 164555 -252760 188186 219792 51431 -54796 453823
17316 71076 164495 241808 218959 -93029 -235911 -149445 214015 78802 215958 219861 204155
17305 204155 327825 141607 279161 525059 397810 -15365 -56699 221932 -47161 85297
17294 383429 124745 482851 42315 178706 146818 89356 148565 161598 54159 -27026 456048
17282 115851 190136 230066 21300 216203 265788 -9351 44313 123157 101125 447542 -52462
17270 140377 151787 282872 190019 455034 147229 277602 236134 65056 131898 507933
17260 507933 56487 218937 119697 206923 25022 196675 88600 -15140 246512 319835 52193
17248 92913 184306 233017 493021 144340 308017 325737 470296 308771 419914 41560
17237 164327 311734 -83400 193460 68795 47805 -202709 292413 73259 225355 -256970
17226 276215 -96103 80307 285680 -30729 183713 459876 66195 255563 202136 -43109 298385
17214 426138 135727 153981 54346 470323 -40410 257202 368677 400307 342106 295032 81123
17202 100896 -24253 173422 245965 611305 197666 40576 141607 418414 122051 16930
17191 261296 281288 438887 162218 382491 94960 97756 496952 226610 541543 327060
17181 327060 207180 -97740 422934 579093 538963 86159 399395 413220 410662 276430 13485
17169 281295 377401 268606 448304 400483 76506 107540 154409 212106 109150 484984 330358
17158 330358 238905 702684 96378 475207 462444 361476 489727 570024 306212 508690
17148 508690 -92665 188388 259084 371909 314020 139653 343228 337882 260242 415460 286470
17137 286470 465579 314758 537522 681646 382886 279994 100096 279173 84816 141308
17127 141308 265946 118760 371946 37159 265960 434638 439787 585573 394853 893317
17117 893317 564363 192226 384397 340214 474551 443473 521385 138226 349833 404441
17107 404441 485253 104669 395396 266983 443333 290435 532654 340908 933389 294112
17096 487051 600236 250502 661157 699870 523105 333053 472787 554659 378430 710866
17086 710866 432822 582181 646914 293297 413012 721371 355990 511036 209326 520200
17076 520200 495462 177427 582598 386195 645737 376014 730429 613481 506729 445685
17066 445685 289571 270022 576501 74229 643245 653361 281163 751331 414326 250722
17056 250722 648198 210629 448278 655894 677437 683069 544688 643599 404426 381741
17046 381741 260497 735920 939442 578689 696217 673629 790696 776579 446632 449982
17036 449982 744647 953807 798667 669170 677892 467931 712699 782477 590132 849117
17026 849117 826855 759384 830570 803471 707282 753678 646506 496620 705697 606571 650425
17015 650425 698584 592929 848895 740464 787404 654578 587683 606438 470272 974223
17005 974223 603418 891791 1200939 818001 867653 993332 822953 966583 911292 643334
16995 643334 861856 713501 1175299 850951 1023164 1045183 626144 1064034 816839 949539
16985 949539 1229470 955976 1059171 1098523 829532 1108981 1004135 1094675 852327 975035
16975 975035 944051 1201068 1038143 1034472 1110984 958296 880349 1073068 1246920 1214668 1067556
16964 1067556 752025 947251 1048166 1026441 1349750 1102049 1257745 1293923 1462234 975014
16954 975014 1158752 1010493 1556726 1437111 1391494 1130487 1173126 1369732 1277513 1315880
16944 1315880 1481833 1261300 1280527 1313972 1400632 1471375 1171675 1390963 1151943 1528734
16934 1528734 1420398 1367256 1473789 1787860 1682876 1681673 1673288 1601028 1349964 1922067
16924 1922067 1687322 1997939 1996386 1788722 1792080 1446766 1741537 1761326 2016307 2154955
16914 2154955 1986355 1992731 1662215 2143049 2203073 2301570 2026564 2246906 2138330 2053438
16904 2053438 2145708 2428546 2482529 2314123 2727123 2317692 2524893 2085474 2128726 2596817
16894 2596817 2733767 2486841 2487515 2815840 2659992 2847457 2527022 2770041 2941408 2580503
16884 2580503 2956360 3110017 2985542 2842715 3132229 3184703 3097006 3415366 3082211 3037442
16874 3037442 3242490 3135796 3314246 3520200 3650330 3620705 3691721 3674532 3869855 3751657
16864 3751657 4047638 3999341 3868466 4132010 4206190 4181916 4309898 4323890 4679013 4554287
16854 4554287 4591133 4769418 4764810 4969201 5134360 5231844 5140005 5471145 5511784 5231113
16844 5231113 5697833 5813211 5962854 6161871 5931890 6294941 6521221 6557245 6576686 6805187
16834 6805187 7095995 7103231 7522569 7320984 7551952 7699403 7936689 7947072 8058170 8549516
16824 8549516 8618716 8585461 8847058 9337552 9345470 9713527 10145022 10281759 10152527 10588201
16814 10588201 11140209 11015994 11196889 11702850 11805639 12455230 12762486 13037058 13449630
16805 13449630 13647625 14010403 14540715 14479157 15419165 15766770 16320161 16765026 17215542
16796 17215542 17804325 18083942 18523629 19343008 19846220 20677479 21196082 21512405 22477565
16787 22477565 23094853 23675699 24689277 25548127 26382524 26845902 28121767 29146613 29729512
16778 29729512 30947089 31885054 33281946 34492185 35728437 36979413 38195782 39762782
16770 39762782 41357879 42490478 44183454 45966274 47266818 49339479 50853075 53182114
16762 53182114 54762479 56866743 59126069 60976994 63487170 65617741 67523717 70395844
16754 70395844 72708603 75131125 77602536 80263772 82640585 85001753 87324658 89776329
16746 89776329 91762297 94371395 96176362 97961806 100035535 101846597 103424270 104266343
16738 104266343 105125914 105839780 106523319 106712968 107173100 106543465 105893458 105610264 104448835
16729 104448835 103634237 102039624 100282757 98498213 96970256 94861987 92896905 90782074
16721 90782074 88614935 86249151 83772805 81516891 79292941 76844071 74759923 72238302
16713 72238302 70394709 67885226 65744600 63741726 61333941 59642602 57572360 55555569
16705 55555569 53692445 51858910 50251604 48434192 47055677 45614037 43925312 42707385
16697 42707385 41210427 40160897 38644049 37562612 35994691 35083719 34094956 33092096
16689 33092096 31909669 31359977 30434188 29077348 28449120 27701779 26919750 25649371 25344010
16680 25344010 24599727 24112994 23371851 22754168 22458896 21649939 21012158 20297613 20054204
16671 20054204 19191292 18995550 18150842 18106794 17316765 16944103 16574805 16576109 15982810 15557653
16661 15557653 15371644 15083601 14542599 14302207 13853130 13639765 12950676 13053208 12612601
16652 12612601 12434318 12469915 11997589 11922163 11448969 11195715 11044783 10593065 10476559 10421453
16642 10421453 10147831 10140164 9725858 9617980 9713207 9309673 9188562 8946561 8782956 8840934
16632 8840934 8246561 8159098 8191237 8133461 8027442 8100119 7877607 7790119 7082506 7555920
16622 7555920 7808433 7110986 6903939 6795925 6486993 6642308 6493934 6552429 6270192 6238878
16612 6238878 5989431 6065437 5809071 5720766 5712037 5520812 5494840 5566279 5110313 5367699
16602 5367699 5161617 5270033 4984720 5195248 5154214 4911471 4958958 5063973 4631823 4999425
16592 4999425 4437563 4858506 4790060 4514166 4586727 4452954 4581098 3825805 4141371 4386660
16582 4386660 3727250 4187138 3816746 3940036 4200580 4085320 4117373 4073283 3895057 3701090
16572 3701090 4026311 3704518 3580322 3626234 3668588 3668843 3525327 3456914 3549857 3782714 3315382
16561 3315382 3248827 3436812 3606280 3126575 3206836 3309170 3240075 3286950 2821359 3092442
16551 3092442 3225666 3169503 2987170 3169674 3144510 2975806 3129039 3228758 2868849 3062927
16541 3062927 2839324 2711656 2707517 2580983 2736318 2938255 2888336 2701232 2565326 2865789
16531 2865789 2700287 2769895 2554574 2307154 2431815 2589740 2460067 2620235 2525675 2451462
16521 2451462 2036302 2731147 2635291 2280228 2408524 2225533 2463611 2629627 2345413 2327571
16511 2327571 2203093 2275044 2244993 2129163 2236263 2315225 2542986 2185363 2214939 2536671
16501 2536671 2136262 2077327 2099283 2402631 2253325 2061882 2340604 2213042 1999225 2281049
16491 2281049 2326979 2249007 2319502 1871244 2162614 1985888 2089273 2124805 2156054 1852932
16481 1852932 1894863 1850855 2197963 2011093 1962625 1620730 1722743 1911404 1651995 1771814
16471 1771814 2104715 1981912 1895601 1606973 2017547 1764098 2127421 2010259 2135801 1963789
16461 1963789 1818119 2083747 1982178 2142815 1877356 1846095 1488017 1717972 1726725 2059765
16451 2059765 1985368 1894609 1974256 1918192 1920640 1663353 1775185 1676530 1937632 1847583 2045114
16440 2045114 1913241 1774309 1781771 1511134 1865317 1723360 1654704 1753772 1634805 1853727
16430 1853727 1548389 1625805 1714776 1750138 1774245 1665676 1578233 1761769 1501996 1495569 1777766
16419 1777766 1815077 1466271 1688957 1726638 1546373 1597275 1632834 1615620 1543150 1358201
16409 1358201 1347382 1768470 1956905 1970798 1586122 1716141 1607763 1707975 1586104 1584195
16399 1584195 1534832 1589113 1735239 1638614 1913549 1673193 1635458 1702202 1820285 1616644
16389 1616644 1665114 1463638 1885764 1430972 1456915 1744157 1630350 1670614 1495984 1729165
16379 1729165 1790745 1469124 1993209 1685538 1572469 1517741 1653338 1581944 1418258 1587510
16369 1587510 1869652 1422094 1696338 1582469 1579514 1637459 1433826 1764105 1244649 2000170
16359 2000170 1484638 1513216 1477503 1683756 1714022 1698611 1516630 1439619 1758929 1636998
16349 1636998 1397735 1854264 1407571 1845496 1708337 1743683 1472738 1689787 1704564 1846697
16339 1846697 1720592 1624794 1574136 1434355 1810620 1577973 1465467 1712621 1279834 1701709
16329 1701709 1724284 1570670 1729857 1508728 1578612 1829804 1295426 1930422 1423137 1406795
16319 1406795 2015979 1942674 1541243 1408437 1636859 1843499 1419518 1476639 1617928 1664020
16309 1664020 1541091 1591249 1697973 1651715 1652683 1339101 1641955 1467908 1645352 1597350
16299 1597350 1266570 1561541 1509991 2036270 1572502 1473487 1214670 1646000 1266886 1400640
16289 1400640 1594941 1625447 1721487 1431224 1338137 1692107 1537673 1393135 1605465 1772162
16279 1772162 1313460 1106558 1062786 1801173 1400266 1267600 1366549 1429678 1326070 1447994
16269 1447994 1240732 1380491 1348848 1207345 1331678 1353306 1327256 1507171 1423853 1698032
16259 1698032 1124037 1198000 1109197 1182666 1239383 1358745 1297219 1311199 1197198 1409335
16249 1409335 1435975 1334307 1505150 1431409 977696 1244314 1056038 1321626 1158845 1393050
16239 1393050 1259805 1257977 1199873 1268711 1442847 1062835 1358451 1646581 1031766 1317844
16229 1317844 983584 1198351 1029684 1090900 1363690 1077218 1214157 1209452 968095 1227712
16219 1227712 1029077 1001201 1306451 948071 1195086 1134719 1131503 989072 1121531 912657
16209 912657 947312 970696 1036406 993160 1210301 1353452 1065105 797885 905563 773282
16199 773282 966340 1347803 688557 975517 1308495 1461349 946368 1091730 686919 855217
16189 855217 853815 1043589 944298 1228731 1005868 920745 831300 701042 1198690 724638
16179 724638 518887 668473 862630 747089 619361 874308 636095 583135 866251 1005870
16169 1005870 947530 976923 980052 601766 611422 958108 756457 821793 866233 638922 434397
16158 434397 668292 781233 787410 856805 782741 955345 647315 580350 906282 600287
16148 600287 722915 750230 961939 880968 626050 635126 908922 820788 530125 498461 545137
16137 545137 502173 742046 283729 674005 502138 506921 815967 877074 641425 513090
16127 513090 455277 286214 310495 495831 770303 535928 275196 434766 481514 304024
16117 304024 423962 601169 416535 539710 406573 648856 354499 411752 412534 492177
16107 492177 579220 523130 399122 271804 452360 509596 498415 298521 203150 278200 353989
16096 353989 194727 254307 476928 443047 369912 538847 185777 583412 405221 488097
16086 488097 331513 264552 636984 296499 167495 259273 340586 625212 416272 339222
16076 339222 536401 534614 114165 251549 277285 173929 528458 365942 342450 520663
16066 520663 278839 479524 330327 77300 -37179 228397 371198 701678 -7224 266755
16055 -27550 300199 267252 231366 44936 256621 -58618 218839 168584 52958 568914 401176
16044 401176 321035 -49541 344874 373449 17157 70146 250713 161473 550466 453811 281869
16033 281869 134500 145088 -8514 265416 147430 94500 414641 -68731 -121619 90000 214460
16022 214460 157669 171453 -25502 158035 160840 91240 -250400 -299502 281207 341791 119605
16010 89892 411830 -92515 77713 34775 213382 268909 354379 -14043 68601 54780 -338510
15998 47077 186812 487331 252164 568471 241055 273485 -89478 26875 209824 234181
15988 234181 601558 245698 753783 734475 577604 177206 535272 287704 166550 155847
15978 155847 211103 331427 71336 52546 -205138 -48758 450109 -132452 -18659 202341
15967 -62597 34263 -107133 14643 -1796 292661 146369 219143 73546 -122435 85985 154992
15956 154992 486498 82881 -30028 -15718 35258 47931 262732 234951 115118 154188 -167909
15944 -22157 376801 319341 118600 131221 -89094 -78141 38588 90681 76685 -9335 42423
15932 54304 -311278 -79896 26042 20892 -86540 303073 81194 -185567 266984 59755 32078
15921 32078 136051 -190414 -204640 -228530 49334 24889 -307785 8130 -34366 238372 -107947
15909 162020 193507 -178042 82127 212023 -279971 119287 -317712 307550 -155919 167073
15898 -185429 70747 -63092 190184 -225955 12364 284458 339578 -369929 197373 -51933
15887 245873 -63635 -124601 -300848 65469 -105484 -47524 -153103 104134 27962 351763
15877 351763 -66873 69557 -167249 101230 195528 -74546 1362 38954 45191 -5954 38212 -3987
15864 34075 -216843 -206633 13917 37206 66104 245625 48175 252187 -28708 -97408 201992
15852 -206987 264627 -26517 -126246 -370173 -291143 9686 -194464 -296556 214984 -199632
15841 110915 140854 34723 123150 185294 -245457 285022 255280 328774 -11044 122482 -50937
15829 -144146 -180522 -38172 69206 71249 37773 -47081 121714 -179418 83108 -40567 -91001
15818 -91001 188096 -90971 -252687 -45600 196271 -34855 90435 82458 -123304 -391565 -104254
15806 -12602 253713 -28742 138864 226994 -23019 -39889 -26940 20003 -204645 -22566 -221066
15795 -221066 91906 -4108 121133 -26525 32739 -364452 119185 -46574 54439 4113 201141
15784 201141 31121 -79040 -208658 -277652 -91950 -104295 137841 47056 74902 -444749 -26708
15772 -34305 39735 -141967 -19038 -65487 117394 131665 183723 14942 40707 -93475 -221928
15761 -221928 -107042 -242926 384421 51308 64040 -2854 -25470 353328 218811 236915 -14835
15749 -417030 -44123 -220087 -45908 -60000 -55466 -62047 30234 -168865 -7296 191217 50452
15737 173375 1958 -189695 -80107 126775 41062 -145925 279597 201963 -152024 36339 -51550
15725 375358 201412 -245711 -227500 359717 -210010 -292002 -36929 -276625 91798 -281659
15714 -378392 -241778 97723 -382394 40247 8713 -125665 126498 -84246 -158329 -212168 -90196
15702 -91358 19049 -217862 -12038 27457 76570 -131195 291347 -90069 230057 -200825 -109622
15691 -109622 52729 387611 18588 -284797 18272 -192389 -70538 -428771 -4209 -82431 65702
15679 -237682 197032 -102979 252965 -364543 -307701 -278652 6046 58740 -79010 80201 143124
15668 143124 -46527 -75393 -171483 138929 33659 115327 205557 -220336 -199201 58310 -212991
15656 -143255 -19117 91202 46613 175481 -92347 287727 68775 -157587 137224 212242 -80534
15644 48843 -85186 37392 -34804 -143427 -84725 -34831 55548 -195360 186358 -14253 214908
15632 63035 -468325 124311 -104400 -87095 -169935 189278 -55191 -150732 10045 -64378 148232
15620 73855 -94159 -128938 -58156 -107845 -69502 -192748 -359894 -37046 -260433 5897 52162
15609 52162 59757 -50324 -35554 313118 45959 45296 -42007 -308664 154870 125213 68135 15144
15596 -139893 -67828 300112 -170619 -193958 -276592 -233546 -71350 150408 5708 -113407 112267
15584 12160 -45457 -62780 -232414 -352122 -225962 92445 204609 -246867 302879 44218
15573 -165259 -83272 -53832 339200 71747 74423 69330 -165449 107458 100071 -64143 -367867
15562 -367867 -153217 197874 56652 186652 -96410 -99602 15484 33426 -185814 -180864 334626
15550 -383162 -72069 -7330 -367168 393571 -49010 371840 -57199 141223 430361 -177201
15539 115752 341837 302378 -91004 107040 201326 167741 -206275 -24086 -86705 -254868 167214
15527 -134954 153321 20382 -109398 -142137 -212508 144037 -5002 -129042 171888 -7143 120704
15515 77933 339304 -399539 -55931 41232 224116 -159718 -452341 79944 -218411 -181747
15505 -181747 231924 123824 41130 -306992 113509 140696 115046 103710 -391207 -71303
15494 -116558 24681 -14507 229032 114401 90394 80231 -205670 6718 -94313 -134569 -24371
15482 -67222 -173467 307188 -57823 208069 -112214 285991 -16905 281634 44646 -24899
15471 -153487 385354 165980 -43036 -588 -15151 262120 -140554 47348 -296618 160842 175212
15460 175212 -160442 -33252 89137 -168004 -387688 355594 -165359 -113932 92130 219533
15450 219533 -192203 -24467 -32655 249466 58231 2827 246860 394262 159558 333745 39652
15438 60840 133341 28518 -28581 256714 57140 -243367 75974 239046 145651 -22335 -147476
15427 -147476 -264570 256255 -278553 50746 99762 9596 -137813 63837 -354656 -190215
15417 -190215 103198 -2150 21710 -14758 28552 -86876 -111779 -15702 67646 -65590 -38641
15406 -38641 59589 -328963 -40398 366654 -42088 30643 97068 -281043 99750 -85237 48849
15394 219103 -1545 -140748 -189280 -64425 3945 44745 54028 -228794 114207 24124 137080
15383 137080 128161 -159952 202353 -183879 63932 -136539 229619 103861 -52022 -4030 431733
15371 259976 214591 179467 203464 207853 -119676 138561 39316 239855 178819 238174 -109727
15359 132360 -262840 96498 106279 57831 220850 -68395 3048 105568 -202404 585121 -384690
15347 67791 -231012 82764 506641 224683 -76304 477594 -23822 166314 117451 -28321 -130039
15336 -130039 1619 142975 -14068 94159 -2531 -43653 180418 -49115 164847 84330 220412
15325 220412 -131924 -59798 43102 -65476 -44622 96562 301867 207583 281746 68397 -44269
15313 297885 -207130 163049 -35511 2685 533973 303782 175485 122108 66556 -282018
15302 -458697 -174465 293692 175710 -154981 -105011 -183528 -31618 86520 -82134 -157032 -60621
15290 -60427 49910 -116316 -16885 406373 241254 37978 224937 -185909 -157750 -258508
15280 -258508 114662 -294422 -375573 275843 19457 -118366 81807 -22158 -143244 71740
15269 39192 77074 164949 -53945 -39616 195706 174578 -190920 337044 47081 4345 -185904
15257 4086 35838 -219804 181563 9422 196605 171134 228739 8558 338881 143027 97160
15246 97160 298704 92618 50887 110146 257671 -144511 214849 122768 284940 82338 -209267
15234 74306 228817 -364289 383800 -83892 -105446 173308 -162043 84933 457313 -97136
15223 135973 -215898 321411 206052 -23429 318381 -9728 203689 -36378 149030 190321
15213 190321 -184376 -307961 -175412 41320 96210 -12984 50649 242230 -3252 14623 -169298
15201 -72183 -74573 -66978 -181017 20987 39031 138289 -61629 -22633 324126 115559 72957
15190 72957 -96098 200091 -148200 338027 59698 28914 84037 249059 -139772 12913 -44026
15178 226920 104603 74862 231569 439920 -204848 44971 133362 -79308 160760 148745
15168 148745 161388 -90343 -91572 13534 198887 -5300 -132185 -164523 -132387 243100 -11042
15156 -49690 -179462 -114815 170625 4797 -291894 -45661 11761 169364 -102294 -69004 206950
15144 -35970 219332 46574 213765 91316 -87716 -310459 -37755 13919 138797 163120 91732
15133 91732 80817 71633 141146 191414 418146 -27515 166824 54986 35802 -205157 -5028
15121 216556 165421 23362 221423 518845 338164 343530 61599 138432 404145 -22624 25720
15109 104671 59416 -206905 -21042 556714 -27292 225752 368086 435272 264077 -129540
15098 178828 60181 1642 275680 -20456 -162977 20688 215874 -25383 -32946 36064 155405
15087 155405 101424 -66442 -141424 150512 -100242 260777 68169 81332 228953 129712 74086
15076 74086 388949 -77669 22224 226587 53181 486125 228960 -89036 333084 -193056
15065 213526 -114962 431369 101425 140813 -229382 6486 160472 232413 202293 1538 -56884
15053 -85188 75342 -83791 77888 141833 182796 348993 -31240 45262 342913 306749 168553
15042 168553 336030 148013 275884 103534 52152 206867 82698 296121 -27866 156044
15031 632067 136516 16138 101049 -95221 451963 333469 380684 192068 149405 610857
15021 610857 372804 205214 338426 -144188 319000 300394 78747 206443 17402 73641
15011 73641 459683 191799 -21288 273205 313918 282672 380118 -38092 127060 394607 -335062
14999 183172 292177 228117 266237 -3256 259899 247041 357426 459578 483824 276926 699459
14988 699459 345669 107076 70749 165296 193190 337198 212139 462206 125303 250932
14978 250932 589719 329956 760869 225771 301434 575796 376104 402175 379771 188196
14967 112502 282305 463821 373500 241263 142383 89787 218781 379336 348528 93224
14956 290845 103867 137693 275962 247877 72184 260404 280295 501514 112354 127857
14946 127857 355297 438380 36126 32574 361913 270377 242130 274222 449535 481837 363652
14935 363652 169132 216716 191855 584531 671773 390462 541372 663654 374294 376888
14925 376888 547013 808602 565951 765564 444397 452710 428127 620091 936153 743794
14915 743794 1067261 874749 832334 690102 419107 351092 608782 222029 221108 455265
14905 455265 593533 534809 587933 549704 290544 404999 316146 518620 508220 477552 115995
14893 200342 224242 341859 212604 370996 323840 345820 339460 379153 386384 527004 293116
14882 293116 415487 452713 493427 207164 643803 367893 445275 403465 546693 493790
14872 493790 343965 484807 78795 526104 313643 133269 870591 371792 437827 554138
14862 554138 149651 260090 316461 488633 371556 548223 532490 113071 247377 129919
14852 129919 125537 443044 412179 466524 311861 158433 207504 363015 258077 237985 300405
14841 300405 456541 410410 609339 755196 695959 570182 699033 611142 431325 577881
14831 577881 400004 469250 588286 253872 439089 576442 127396 511877 362761 206732
14821 206732 402836 351910 382969 400950 177277 129971 882252 644684 355322 506493
14811 506493 583443 440181 150722 358237 378053 721448 385665 648173 349456 519098
14801 519098 371377 625578 634796 871379 470044 269029 461020 424354 684629 304217
14790 374217 754018 620789 180080 568426 285508 303402 488044 526982 390269 479783
14780 479783 487498 362530 785227 507966 603372 324495 630043 710312 412922 387899
14770 387899 530938 930636 550791 342941 580961 515114 428348 719331 585351 890755
14760 890755 722260 388546 454145 503394 519620 556837 570767 321272 696098 387775
14750 387775 509050 281507 323086 537095 617107 282651 518221 479083 425154 911602
14740 911602 349600 650446 854524 703563 525979 525545 526243 737309 870679 637718 705397
14729 705397 350974 785137 656734 788396 666490 1026854 689682 969492 957984 491787
14719 491787 992707 710526 1119835 820981 805716 759876 639980 872564 820159 630285
14709 630285 493147 753611 591251 706801 681835 554575 534259 1344532 1106633 743538
14699 743538 919164 354444 1121606 854163 1031355 1110491 1063488 734520 767849 838780
14689 838780 621534 1093401 899071 661153 671275 985330 558310 1066302 1060803 787577
14679 787577 1029767 726746 544814 838020 1023612 804892 733370 1050724 614644 1030860
14669 1030860 709035 732391 817255 983441 487296 813725 898477 1058505 808365 897060
14659 897060 542842 720380 1078218 652518 639044 982462 714591 778576 1098257 1095442
14649 1095442 1042459 1036472 1076949 947052 878289 1008873 1000064 785236 1179474 936809 1297698
14638 1297698 1028163 895196 944248 1145765 1152125 944295 1145778 1061770 898638 1141333
14628 1141333 1198721 1326197 784151 864710 1150073 941857 1332037 1311993 1108618 1148199
14618 1148199 1157516 1334795 1074015 1222397 1204568 1136609 1176917 934130 1463846 1385146
14608 1385146 1014141 1436079 1018890 1641047 1281340 1355051 1208582 1100682 1254986 1053000
14598 1053000 830981 1067803 1538476 1643094 1499825 1583043 1321216 1283950 1426419 1767853
14588 1767853 1036716 1596306 1344538 1724744 1539971 1455838 1521083 1433621 1230172 1768359
14578 1768359 1651232 1644959 1513111 1837131 1839239 1453253 1618541 1791638 2086220 1849666
14568 1849666 1998457 1940021 1898812 2639843 2227953 2078005 2278059 2360346 2290053 2489485
14558 2489485 2716555 2772095 2756104 3060901 3470907 3406852 3997137 4931926 6475879 8747298
14548 8747298 13099614 19731454 27029046 25551830 16456520 8804484 5495675 3674781
14540 3674781 2979050 2565181 2198756 2191362 1823715 1844694 1857615 1787168 1503526 1597246
14530 1597246 1944065 1902806 1825361 1586324 1738743 2199342 1899831 2155463 1738850 2326577
14520 2326577 2137477 2299637 1956737 2004707 2254423 2107551 2209959 2625740 2058716 2419199
14510 2419199 2120884 2456638 2359388 2550766 2596630 2141499 2516346 2242878 2130392 2367511
14500 2367511 2873277 3025846 2564563 2654443 2744296 2870207 2556524 2863000 2693660 2995456
14490 2995456 2911053 2902914 2834813 3067345 2921422 3219794 3335332 2903077 3264779 3050824
14480 3050824 3062470 3180096 3040830 3581312 3246490 3404927 3326393 3224817 3551672 3552332
14470 3552332 3834962 3579666 3817105 3697077 3643533 3975025 3809377 3510729 4040507 3686471
14460 3686471 3752213 4108449 4132332 3904659 4195144 4276877 3917953 4368397 4374521 4329222
14450 4329222 4651260 4426961 4302050 4458250 4359803 4684036 4821170 4767596 5191796 4740023
14440 4740023 4667341 4762010 4945795 5417126 5170336 5623900 5615125 5479929 5361177 5662585
14430 5662585 5929131 5533183 5874299 5871346 5784720 6036889 6533940 6338125 6215307 6102739
14420 6102739 6664837 6973811 6758999 7013637 7118497 7120403 6878200 7351467 7542557 7179064
14410 7179064 7661288 7726853 7712735 7786147 8271171 8086477 8369648 8466320 8738701 8524527
14400 8524527 8723840 8944670 9131749 9450615 9350667 9461714 9909906 9749841 10252911 10033339
14390 10033339 10232313 10458963 10796235 10815733 10921891 11359807 11317375 11936661 11836026 12286428
14380 12286428 12340309 12926702 12832242 13469522 13432665 13783268 13721493 14176457 14597521 14659251
14370 14659251 15152259 15549330 15662628 15936454 16434943 16750137 16932552 17375782 17760648
14361 17760648 18185944 18695456 18996511 19230240 19968302 20184624 21090155 21514938 21768423
14352 21768423 22431129 22917335 23864158 24245665 24929966 25084293 25830474 26550779 27612917
14343 27612917 28129845 28921239 29650576 30641387 31365597 32556117 33329867 34264757 35099953
14334 35099953 36080422 37238027 38443906 39478106 40938876 42426213 43650886 44906856
14326 44906856 46423669 48202125 49657545 51279458 53242336 54980464 56584044 58883073
14318 58883073 61098005 63706349 65819885 68483807 71036438 73851028 76963555 79958743
14310 79958743 83702037 87050434 91002169 95115178 99271598 103918763 108855048 114379085
14302 114379085 119492791 125312385 131197340 137849552 144797920 152308935 160229425 168827012
14294 168827012 177770158 187495137 196759148 207594624 218641689 229984952 242606884
14287 242606884 255412720 268791076 282770669 296996049 312078967 326992101 342126176
14280 342126176 357395524 372254958 386439958 399493058 411735753 422156254 430557602
14273 430557602 435146579 437103033 437805768 437362640 436127948 433458824 429013844 421729717
14265 421729717 411998854 400187070 387307009 373622884 359189046 344157434 328590977
14258 328590977 313464118 298251828 283572623 269220653 255311058 242078779 229685664
14251 229685664 217740983 206490265 195502288 185543561 176070529 166951719 158788615
14244 158788615 151101667 143635074 136655476 129836803 124049751 117906560 112820062 107841271
14236 107841271 103285372 98356709 93996628 90174137 86174961 82692996 79636387 76461854
14228 76461854 72813535 69841094 67284378 64792254 62363208 59801311 57861060 55673498
14220 55673498 53790169 52211787 50104280 48160014 46818964 45062106 43735349 42828672
14212 42828672 41495963 39662721 38619038 37208349 36697933 35385902 34298142 33178476
14204 33178476 32112182 31360378 30629013 29977356 28980769 28365585 27767215 26815996 26041811
14195 26041811 25532469 24945409 24390290 23864586 23258208 22466237 21803004 21333184 21056132
14186 21056132 20614333 20054223 19655312 18847526 18604973 18285912 17752982 17349616 17013230
14177 17013230 16985270 16550108 16131908 15794881 15638273 15419110 14957862 14926968 14229899 14127442
14167 14127442 13933696 13653483 12951616 12866985 12793313 12423952 12176794 12180211 11664743 11789437
14157 11789437 11452726 11281444 11191222 10694336 10737368 10605351 10534583 10496819 10065214 9870979
14147 9870979 10048558 9586520 9231857 9057964 9078944 8839318 8926831 9124460 8360945 8252404
14137 8252404 8383583 8032348 8003259 8342705 7821395 7879307 7677611 7340035 7275814 6931540
14127 6931540 7150467 7250062 6981706 6983122 6769415 6862026 6408698 6559170 6659082 6576654
14117 6576654 6295977 6027211 6009594 5945122 5589369 5921153 5757929 5804834 5814191 5812880 5615129
14106 5615129 5447589 5415852 5346171 5575170 5228694 5127658 4935029 4642348 4700265 4793728
14096 4793728 4847073 4712723 4887274 4513954 4596530 4361969 4402735 4569671 4067748 4333511
14086 4333511 4269155 4187232 4126286 3969102 3954134 3948780 4059184 3997961 4081061 3898363 3837766
14075 3837766 3692224 3761544 3698660 3693268 3919667 3478863 3646439 3694416 3291644 3689464
14065 3689464 3344519 3519945 3142732 3271613 3259800 3708329 3306572 3497044 3075313 3085183
14055 3085183 3359802 2907856 2932843 3053354 3280252 2877418 2719439 2794486 2656547 2769686
14045 2769686 3021463 2737519 3045595 2515685 2737822 2701637 2341776 2801961 2542194 2715634
14035 2715634 2783764 2441086 2653690 2942028 2349307 2631046 2434390 2424696 2590158 2476521
14025 2476521 2345884 2229183 2200693 2252450 2293213 2391077 2429323 2107152 2009693 2055497 2154396
14014 2154396 2178670 1988929 1775611 2198327 2163163 1991754 2011100 2031625 1789533 2164997
14004 2164997 1859849 1938343 1975926 2055429 1904393 1910850 1942863 2019257 1772613 2093654 2196199
13993 2196199 2002264 2693480 2689530 3732217 5156409 8717778 14862358 24082967 26825123
13984 26825123 20333019 13032945 8347588 5815108 4890777 4374421 3558285 3027214 3104992
13975 3104992 2808487 2373346 2250581 2038195 2294128 2296730 1899422 1668156 2023839 1929735
13965 1929735 2095931 2015106 2024407 1766715 1852130 1796069 1888390 1715103 1572979 1521634 1667564
13954 1667564 1781050 1617022 1386796 1436935 1858369 1673834 1610655 1685426 1074860 1336053
13944 1336053 1326516 1376856 1533207 1388204 1365128 1373257 1695489 1700916 1660238 1665298 1240515
13933 1240515 1494883 1372745 1596067 1536849 1275657 1275240 1341215 1478735 1263234 1288846
13923 1288846 1493510 1043352 1239249 1005407 1185025 1234844 1391241 1497375 1033480 1248193
13913 1248193 1030671 1361398 1126964 972663 1414322 968770 1079755 1201947 1358437
13904 1358437 1136812 1202238 1068468 842153 1041338 1201379 1089507 1062212 906284 1209098
13894 1209098 828754 1082137 794121 1068379 843683 1113879 1004093 828285 1112883
13885 1112883 1234142 715882 925745 830532 961401 1165947 1118357 813004 770436 1091423
13875 1091423 1303027 951014 737390 1052524 777500 1130888 703968 972592 993323 969156
13865 969156 816269 1129450 548823 942239 1150395 943018 1003164 861421 1362651 844553
13855 844553 1002284 871043 977986 826294 626939 897490 1035538 877434 1204290 671505
13845 671505 517708 806292 725362 507756 844974 1012308 725286 681939 827307 743817
13835 743817 714231 563626 559487 669375 686116 557381 780056 850858 1104220 736847
13825 736847 738517 680941 608795 755948 828899 941574 769979 555134 959387 829426
13815 829426 953318 903724 759074 764631 632138 911368 856085 917024 782659 473892
13805 473892 765003 726613 980490 754766 723662 413036 319235 655726 679065 746572
13795 746572 699975 932606 791811 747552 357752 738578 524039 440785 449247 544293 476926
13784 476926 572901 451466 483115 573372 714693 671436 275292 892147 530720 448708
13774 448708 725752 450443 495670 725670 678100 503995 755438 574398 709130 481195
13764 481195 507109 497512 426270 557565 714789 465710 460892 738695 874558 329016 191746
13753 191746 599942 542938 815911 427699 646492 668730 636878 764179 591865 732700
13743 732700 617681 592302 333221 617115 353036 399329 462147 559327 558155 877354 505940
13732 505940 665526 658802 444215 419039 645853 385533 245001 753248 488520 388507
13722 388507 322806 514461 332967 231626 349337 474654 388526 485262 420768 421600 624894
13711 624894 392040 374895 298241 475340 438414 497195 296994 595235 336489 514782
13701 514782 357387 263189 343233 82146 385173 187402 465916 535271 240741 446268
13691 446268 487917 549009 747381 421949 215774 712581 562762 611641 411295 455251
13681 455251 577147 492036 734362 450984 674664 302776 539838 701602 31034 358142
13671 358142 158074 411808 209383 311096 353992 539946 414793 433473 23496 187973
13661 187973 357099 333686 490363 200218 243229 300934 512187 389816 519243 551378
13651 551378 349793 3603 509249 571137 403428 273147 149868 359216 622614 356880
13641 356880 523556 334146 339033 330603 162276 286954 241315 -124365 421148 463276 381464
13630 381464 511857 195760 462375 346691 406681 72815 547921 197999 96961 296097
13620 296097 449285 382848 177654 349543 151820 566937 571221 515641 440115 20622 246243
13609 246243 534043 288014 378252 134768 263785 -39290 470024 469716 363452 66116 579406
13598 579406 159379 196323 329832 297416 292822 392244 418180 283446 94912 -149544 365817
13586 320407 227653 434883 190740 567105 607803 426642 371165 18278 5721 167371 387559
13575 387559 54226 125321 230140 344217 401016 355350 584274 223401 -151043 324184
13564 201622 569453 285013 543678 472638 93186 317068 91655 397857 312238 185964
13554 185964 398673 379091 365523 283521 494749 107208 -11265 282732 211690 271557 441297
13543 441297 30144 644661 162404 224534 148171 155440 -127454 -7633 154840 188439 425533
13532 425533 310691 434956 136548 241457 265479 420824 318581 422965 107004 -14042
13521 -52790 -150538 -5032 21155 303032 -98526 293542 110783 -186416 61083 138704 34062
13509 7849 -200016 17813 298597 218693 211736 301784 209281 44436 -27562 426506 170780
13497 103318 245949 -17255 21983 381549 -54249 375657 255264 276665 148309 122782
13487 122782 140408 63017 496715 311392 80253 241574 253003 154191 61940 -68268 245593
13475 166004 174902 -97715 97889 210757 317096 127506 339274 278195 289834 3920 255586
13464 255586 -212106 67679 236917 -30900 203371 124235 344329 175481 507194 357547
13454 357547 574685 136700 -125040 310639 375673 190105 182823 209181 15452 -113443
13443 291085 164526 -17231 409792 273277 63588 13669 91577 98941 247266 342538 256635
13432 256635 99885 141738 123106 63993 -292382 154143 429803 194562 356931 -11976
13421 333401 13908 -268485 -130494 41115 7321 222628 22480 291559 196402 -23790 67482
13409 470277 32935 292070 25059 -40221 8129 257889 31212 233457 86121 228829 -289456
13397 496827 226210 19102 231522 180630 114271 -107671 465861 53163 290738 20819
13386 163782 257519 430208 222628 137470 160930 -9612 -265651 234264 52336 43719 103382
13375 103382 -128582 179426 482818 347624 318482 129280 179229 296192 167350 149889
13365 149889 -84459 591 178820 169584 -200939 201137 -13981 390814 216524 -103414 335272
13353 157027 169485 -97026 323268 91592 173596 271063 -5141 316924 -17295 400587 36215
13341 170598 -33168 232214 208521 331053 220581 137757 125806 -253712 375935 95582
13330 17888 83244 26363 41049 -110455 302822 377713 129788 238139 430393 -95238 -118801
13319 -118801 467151 294141 327553 45881 100219 211390 349832 173288 50336 -14499
13308 -31078 520566 310027 82177 137141 -76649 47361 -147870 114789 197525 174180 -21875
13296 -205116 46413 164913 262343 -117801 282675 -145382 86194 238523 213076 -86723
13285 425573 -49967 234515 39254 200860 -139319 55433 322788 168611 10269 3845 -34481
13273 134499 -394618 59581 -60425 2235 -47628 52468 203785 149443 -9567 110875 51031
13261 240300 409038 118950 242788 531147 148186 145191 121532 -126549 143098 137287
13251 137287 351377 171886 -31447 190836 -145840 -35330 165124 10378 339356 5751
13240 -3653 -108651 484529 92491 126082 232122 -16407 -71692 -129176 364567 -63361 204848
13228 61146 263078 64117 -86417 32160 -73334 156138 -263745 172850 162948 74319 41335
13217 41335 323615 -65090 -5782 21508 -94534 -86874 -252001 168857 187004 179053 -69861 -266114
13205 -266114 -37053 -26708 131184 181840 254778 -66156 119957 122527 -48932 277923 34792
13193 162974 17487 209620 336293 249049 -160206 -69392 312162 -183864 193329 118580
13183 118580 -167246 193351 85321 -43482 128707 -75371 -93968 64298 31480 248030 114558
13171 12161 -64278 157531 -148917 -139300 156834 161343 63110 -190277 142676 162288 -196056
13159 95420 136950 109626 327564 -69847 -64649 79604 -140210 238755 81109 -168642 -124994
13148 -124994 355832 137834 -122004 31475 -211182 73626 -59166 -257294 -7887 -62536 273363
13136 -15378 -200856 256034 36898 291335 -276013 193228 304651 -189481 140548 128613
13126 128613 56716 -137277 -308270 182265 232723 252935 -32534 114251 204187 102531
13116 102531 -101022 -4801 349237 -123205 -141161 -201120 -43261 -112186 109026 -68129 -48213
13105 -48213 263789 382060 61193 179070 175394 40482 94164 307294 -76218 312268 -93504
13093 -105447 88919 252696 -55649 -243339 103585 45313 -195453 5098 -65672 -54352 -341322
13082 -341322 114580 102962 95344 -42142 127683 -5275 -53085 -18978 -71920 86852 504115
13071 504115 21137 248303 -61027 72901 162342 2410 473036 -54047 -27902 259212 175232
13060 175232 273996 189383 40023 150856 3905 -223326 24848 49075 280289 -110905 -22738
13048 -59337 -366918 239942 295792 -89311 -137723 -192257 94461 -174168 283076 -14529 5231
13036 315327 121043 -154383 -23850 -124257 42291 193966 -33377 -85271 332382 90927
13025 136756 182199 -167327 256520 -69958 -32936 282771 29554 332685 -125792 412671
13014 292612 3547 -33168 199662 -12107 217607 -101331 193923 -158710 -59196 108508
13003 115784 -36305 291541 27893 -633775 165353 105714 77137 231486 -179884 187824
12992 80479 105821 390086 -28981 -98945 -64889 -101715 90012 -92437 111407 136304 434258
12981 434258 -62033 -220395 103852 20803 -64524 -273166 467904 67550 -221835 -41192
12970 -71838 -329023 237406 133575 -98553 -77709 109503 -137798 169635 -10016 105657
12959 40229 129944 -321620 -143523 -119028 155829 160103 -142622 288821 -166013 190475
12948 88839 -140267 -273662 -22012 271026 352677 -150946 463088 12900 54406 64989 -75059
12936 111930 105772 134059 -29831 229847 -171810 -15256 197525 -83525 -77298 41724 92277
12925 92277 69119 -174652 -34054 -81235 357198 90633 128045 -11271 228009 179764 31326
12913 -47383 -59204 -86270 -286180 155751 -57473 211 226248 87377 70251 -56748 214470
12901 306055 -94914 -44909 -28314 71642 -243472 72430 -130288 198940 -374876 -228489
12891 -228489 -50421 -74680 -113830 -125187 4698 180830 28557 30827 -17616 160425 218595
12880 218595 -188651 -59699 -212135 4788 -149899 16865 46397 120176 39878 12859 -187283
12868 -69402 -191732 181835 -25725 -378287 -72431 7916 -11851 324201 273137 -122476 166723
12856 -126546 87092 -83124 77723 -344481 -131499 -97348 229169 -70606 -61115 -402427 246335
12844 140015 205061 -27238 -221908 -175288 127842 142025 9116 -185349 -8355 -119631 -31355
12832 167736 -183053 153212 263397 236242 -305824 384195 214293 351771 191010 182137
12822 182137 -81592 -166827 287492 146094 133169 47273 178858 -106653 -53242 -49727 350349
12810 -244119 98991 -190398 -59233 -225019 -71793 -89510 -28766 -282985 -2633 11757 84454
12799 84454 -92648 174870 60026 -190787 3579 278691 -49602 -172494 13645 139728 -30400
12787 -104270 -52817 128851 470905 -77389 -226847 -72429 43302 2879 -67100 98443 264195
12776 264195 -177742 66612 -43782 14487 -33966 -127820 -57287 -156142 -284033 166101 -23265
12764 -147671 -234801 -101747 206341 -110724 -10309 -91569 136080 122824 89508 179614 -141
12752 127407 291890 -126003 27078 172735 75475 -84777 150175 -98402 -40411 -227323
12742 -227323 343512 -44399 89251 278537 200157 -155158 145063 55022 66640 309446
12732 309446 -69565 -209470 -105973 24444 -113678 -34701 -7993 -34006 10460 73310 234856
12721 234856 177708 204521 97986 150348 -95020 390773 66171 -191682 88504 67347 13667
12709 214511 42577 44538 138307 -64741 85975 268326 143761 -230038 -456113 -46970 160469
12697 -71830 -220515 128998 35234 -120800 -73490 176554 -182673 -102850 -67901 18326 143379
12686 143379 67009 -140378 202309 146836 -31181 160431 -344651 -38359 -136963 -63528 -11413
12674 95898 144862 201996 43060 -294425 -115187 139169 -229768 50053 86010 -2646 160273
12662 52420 -415500 25635 -26093 213603 77114 -60226 374332 453066 -81393 -93900 227622
12650 -67183 -202555 -247974 -171533 -58034 -244911 -79965 164144 138875 -118602 121149 -401039
12638 -257723 -192747 171442 -79264 63253 146100 129345 -18828 296263 312368 126684 65618
12627 65618 -38030 205667 -128430 31937 -209969 -21157 -54944 130951 177237 -2550 441713
12615 -1743 -349132 20729 122074 92386 -13991 245061 -73296 188001 106481 8655 -136210
12603 -19372 2918 297798 300802 214187 164457 -22735 -5340 181509 347139 -198166 136141
12591 -72444 9949 193565 -304323 190289 269848 -342861 193388 -14092 -15722 266106 -97619
12579 214639 -51611 21110 -193172 -4353 123587 -363194 324505 -525162 216173 -80902
12568 -15524 -144394 55246 131281 101902 -75532 80105 118671 30965 -142252 -114331 154130
12556 -168959 28558 -38095 -219809 353040 60588 -130732 184345 -155127 82192 201502
12546 201502 186438 -129515 66148 -235159 -136190 -85069 -335916 293556 -105400 42390
12535 -196350 -112971 72532 256503 253773 145791 -32539 135173 35205 -29716 84189 55699
12524 55699 128392 -449 -207555 -124671 -34124 31045 108932 19541 -56367 55831 -25269 98031
12511 130890 193541 -232771 -32755 -121954 127837 -167564 -207817 286200 -23281 -142079
12501 -142079 100453 156186 29743 -113899 10862 100603 -160880 -442098 -112620 -5263 -233262
12490 -233262 315410 -179778 283317 43574 -62801 -23977 -65855 -304671 -1589 -313769 -465423
12479 -465423 224264 -46112 114442 -158642 -10673 -184323 -38480 248775 21576 168550
12469 168550 -73472 82741 28080 105312 194618 -64601 -199330 257991 77571 19237 -62782
12457 -41329 106342 255753 381636 -53377 -280459 61952 43165 -209160 -60149 216483
12446 -120266 -293552 -416373 293172 64577 281586 4597 109210 9544 -241249 -123852
12436 -123852 60425 -113044 -223830 -35176 -88758 -246212 251280 -9694 127292 -167340
12425 -70894 17335 -10553 -53674 -70208 -259550 -37634 232642 354514 282810 -117266 133680
12413 93329 -114060 -21400 -18979 -35439 17449 -217852 60342 38265 162230 10846 -267710
12401 -6222 -206722 -206282 250788 -294473 -214756 354933 230527 -38512 88095 50830 182637
12390 182637 78409 263928 74557 213890 61202 159482 -48570 -49477 178730 100796 71052
12379 71052 -85976 -76285 -100322 -189274 -44204 330890 -222047 167882 -303781 -1260 113670
12367 -110397 94329 16153 -338398 105004 -219821 105922 87248 51033 100893 57822 -59624
12355 292013 -45173 -100874 -103124 -107838 -117116 -35999 -32856 -192648 374634 -15526 -19700 35555
12342 -33785 7535 86509 543332 -313263 -79053 -130403 -83152 71839 206138 -18749 47889
12330 253071 323071 164386 71740 -248555 134387 104792 79354 188762 -79898 13885 8889
12319 8889 -231768 11521 -228217 -111270 69932 27441 146302 181889 186695 147703 -86459
12307 6204 -43291 337291 148274 8078 -44212 -99765 173857 -262517 134908 194438 34395
12295 97255 209385 -178067 -65478 257562 -80386 -158605 22751 85589 15815 20225 -183135
12283 71942 -24248 258783 -189458 -7516 -44294 88474 147439 -47854 132412 -269632 -246284
12272 -246284 169572 165944 -50603 412356 -136461 172724 -302372 28126 59277 -101634
12261 -281559 -216234 195366 197188 -127362 -41688 -121297 -92388 101267 10570 302902 155034
12250 155034 218835 -253799 109632 7797 94276 -83465 151955 140942 12692 55042 30856
12239 30856 128187 -65972 -73687 125714 186278 86226 -211813 -128800 124935 246831 202848
12228 202848 -147687 373102 119835 -28947 56234 407586 184026 193439 366597 399137
12218 399137 314531 229030 81733 26272 -103629 -339785 -119250 -48961 -256376 116391
12207 435321 -146230 231938 26528 -174339 108001 260075 -198838 -274951 223662 136805
12197 136805 196545 300841 -11684 -117050 4171 -233459 442963 -217705 112997 494899
12187 494899 132892 99763 -383830 75995 248939 304600 -91415 134213 -130050 -107649
12177 -107649 114958 144591 -167637 320493 -201073 293712 239271 234288 102083 -107745
12166 -114016 -51000 -131544 233552 -105204 -203811 -204453 293263 -67980 182739 -30583 280552
12154 98781 -58981 15294 48582 373529 -233541 65706 273184 33655 135498 -166265 58711
12142 -228069 160734 192143 121508 -143484 32123 110042 325157 173923 -102405 -143020
12132 -143020 -150303 88380 -99021 96864 117761 358510 56768 343783 383890 36191 -135750
12120 279835 7985 35429 -113481 -24676 275816 102811 211930 114091 235349 -94335 -132545
12109 -132545 432553 -2548 209164 129324 294425 -488866 -176253 -645 -108198 -154369 -141465
12098 -141465 117750 9751 87098 168676 -6927 92209 -28223 -429801 382656 -221940 136936
12086 762 -252632 54240 145119 -63594 -13760 47161 -434292 131782 23357 297494 -255775
12074 9339 201190 88911 -202233 75433 -360792 174654 -15670 270942 66092 134672 -260082
12062 -22419 -210252 303051 -318809 -246480 170217 -74761 -282397 -68546 461 128336 37728
12050 94531 -34731 -316372 -195390 -80150 87900 168557 112871 353405 -152222 -366679 -16030
12038 -7044 247200 -67662 65611 -155025 34999 244830 218291 -26063 -327757 29418 -22691
12026 5995 -283245 -220422 -7809 -458332 -71475 19747 293445 65994 66373 -128962 -64732 93906
12013 -3371 292425 386121 44358 62281 118138 -8005 219763 -263344 7823 -312786 -135563
12001 -37389 -231032 64920 -28607 -304857 -126419 -57513 203865 13886 -15501 138481 -139914
11989 -59369 365617 -14022 -159904 34780 -214423 133596 -6279 -40664 106580 39339 99417
11978 99417 -51345 -52864 -115055 16244 -220004 -240317 -277411 44183 -180249 -346388 -26825
11966 265353 -237595 -185568 78659 -355786 -139697 306573 -290980 -49303 88679 252343
11956 252343 -293784 -234553 77922 213165 -425503 -135293 37714 284126 4087 -392505
11945 -102774 142511 -89569 -140766 129741 -274758 -3538 -99971 23939 -133703 106 95825
11934 95825 171553 423870 -144048 213405 -135302 219562 171866 117232 -199134 47526
11923 -29845 -28721 119983 224978 151262 95830 -103859 96663 -71848 200740 -39323 -23843
11912 -23843 1140 -98384 -123324 -26619 79259 -24810 161566 -109576 30892 420659 -181498
11900 -10634 -112148 -273836 62658 -104974 111671 -280084 -245318 -240254 -105202 187017
11889 5607 -48460 56403 -117701 -77185 -211797 173976 -63694 18663 219822 -11002 -465078
11878 -465078 -128932 -156704 329900 -2544 219209 -165337 47976 440075 177777 -38615
11867 -334201 -176404 -49741 224680 234293 -168278 13447 -286823 -1527 -358996 -22471 -46180
11856 -46180 103330 87815 222360 -66450 303646 -129978 -257349 -14034 -223622 -137379
11846 -137379 -265534 -290014 135882 20294 -293510 -133401 -211437 -48741 -87431 -199722
11836 -199722 -178917 174058 -119848 10623 25469 -42527 -32424 23355 87908 -286683 2515
11824 119665 407633 -49925 14651 -100025 293084 78783 -72828 -279596 190073 290276
11814 290276 296456 139581 -380332 -46513 -124307 -93678 -278807 -196850 46681 -181289 64186
11802 98135 -260860 -331140 -101312 -16576 46055 231928 -69602 329568 143067 138814 -62015
11790 -100091 196891 -78794 -172024 -312108 -84833 38594 473181 -248958 125883 18946
11779 -114046 135787 -40398 -201469 -17866 -159860 2742 214560 -262222 140299 -66441
11768 49918 230168 -241136 -79703 -79786 119898 -196899 -3416 -26150 102985 253484 -82856
11756 -335210 3185 71141 -143100 -125460 -33747 268061 -25587 -444522 -3952 -153887 126429
11744 -30659 -8742 -189463 -230964 -322274 -244632 73089 -309792 166937 -186084 -201382 -127476
11733 -127476 -40207 301401 -119699 72208 97850 22179 168454 -304878 152685 -254763
11722 -239507 460684 20888 238797 -186113 -115652 -205160 -351653 -11568 131539 -289995
11711 93811 -71574 63856 120585 70858 263813 55609 162705 -227081 -2824 -163271 257454
11699 43970 -84924 263570 -45254 49288 -111446 198900 -156708 -40662 217578 299030 65848
11687 161663 -69589 208562 23729 179109 -489553 -66260 -215512 -55669 -9630 341723 -73190
11675 42557 -4450 -103444 128020 -9457 222509 309056 19272 -175279 -82119 7317 7618 17616
11663 17616 23805 -69105 -42513 115939 -51866 4011 45830 93703 -97980 -88340 40308 -126140
11650 -24192 380634 -398272 308332 155778 93838 -173501 -67354 -18496 -75682 -400096
11640 -400096 -33510 -171354 7444 95609 -97339 97365 -305918 -5018 -206379 95527 -135028
11628 384482 -148954 93533 79737 165403 162506 -63758 104223 -147998 -272301 -134577 51891
11616 73651 -8842 -6071 -206726 -125408 -1896 54903 -46428 79838 73873 -102935 -61289 -224611
11604 -224611 37008 -263958 422109 -22581 171752 68763 141380 184616 2628 154571 -172506
11592 62477 -94091 146116 -268640 -11138 -221245 76948 332468 98426 98686 146179 87324
11581 87324 30726 -160570 421268 76497 -165897 -146105 -48815 -57886 59392 264288 128989
11569 540193 -2577 196598 -112144 53718 111767 96047 -64997 -36715 101800 -197583 -68570
11557 134972 -45598 99141 84 -42237 -51485 12095 21032 -111254 196379 34319 300694 109865
11544 -68686 -185868 -94119 57684 -318211 -279170 20050 -15793 -144797 26458 -115959 224385
11532 -162508 167544 289505 -256633 140240 303715 21487 -234613 -47295 39301 243683
11522 243683 210931 18201 5 159976 81243 108311 13244 266863 -32523 -421580 329200
11510 124680 -187079 -133514 209825 40377 72971 288631 102887 -206650 14124 -55491
11499 -61880 67061 104920 316343 95885 4468 152327 11289 -102213 42598 102304 -421143
11487 -41289 -74433 4160 -148610 -82906 51440 119408 -40231 352651 146898 -106738 102652
11475 -81022 164681 316713 282729 104180 -294775 74468 254994 131588 5300 202510
11465 202510 -40629 429566 193333 -147489 45450 153906 75915 -136738 86594 198620
11455 198620 -12587 450586 146470 47224 42083 203127 111729 63896 -5117 83705 -20468
11443 -211137 -34205 138783 6347 -44867 23465 -75758 10758 55767 -63458 390549 -184454
11431 -62874 235732 178004 -1974 -57538 53208 166449 -246067 407928 131616 -192543 91880
11419 31557 199085 -44372 467838 -30135 -194054 -128077 -252623 -312010 -121012 -90409 37473
11407 158378 109305 -281518 50627 177149 -132154 86403 355800 -235267 40275 91697
11397 91697 290049 -54432 -94397 -90902 175979 -117797 -196968 141682 -102549 25157 -67670
11385 22828 231426 -120555 -155627 -22443 -283978 137887 242291 -182387 168704 105769
11375 105769 34955 9491 268986 -330314 -20860 -39054 12041 22231 245398 -87523 -197579
11364 -197579 -384638 -303889 -154823 -162823 -182917 -216222 -84971 284185 -26944 87312 170348
11353 170348 -105351 248947 -51245 191501 146212 -89539 6269 -376074 -24635 -15753 -98185
11342 -98185 -43212 -185970 7767 308292 141401 89608 128321 50909 152266 -278281 -50725
11330 -322214 -209563 -108719 -113071 88347 -115196 -141862 -44138 211446 93412 -200046 31204
11318 -206493 -50948 -424981 40150 -122165 -40189 -189481 -254355 41763 -102179 -160403 -201246
11307 -201246 -211433 105892 -596731 186628 88189 -126349 243131 -59166 -146158 193199
11296 -112788 -25449 -41104 204944 56413 -361028 -78455 -186792 339011 -570130 -77326
11285 -165992 -120086 235080 -232850 -47157 -47491 31492 68888 -162002 -183982 -143137 -137111
11274 -137111 178044 -13800 273846 -358721 -135647 302698 -175894 53959 1986 -259864
11263 98570 319043 -63169 238199 -281009 45056 -461474 188871 -383195 -30304 -380437
11253 -380437 -318454 -202107 69505 -75961 -53112 -71011 4653 116770 -222565 431026 -26611
11241 -278687 89882 139383 -77546 240119 14282 152783 -200252 -154196 66862 -115311 261695
11229 -87094 258213 -216719 82735 -216331 -120338 -110291 -87956 -293076 -197720 98861 -34599
11217 473886 211914 21128 38444 -26431 144017 -237443 234353 -43571 390608 -56958
11206 -508201 -200894 -110258 -164574 -165960 -231719 21989 168813 -28822 -417207 27360 -356177
11194 -141724 -337328 138661 -4569 114436 55609 227427 -223186 163937 10861 -182330
11183 -3757 -19016 -58946 218196 -20046 -250050 -161955 -225110 145180 160356 -166659 -68684
11171 -202091 342689 -81368 68004 -113570 112120 94267 181025 30837 -109747 -5473 36514
11159 148179 -256337 -82778 170876 4290 -301 81884 -42471 28028 -68211 -8330 -80539 -171240
11147 -171240 -35656 -377407 -96667 234455 106663 398617 148003 -88916 127369 294962
11137 294962 -166824 54518 57460 -113616 173134 -61409 -21215 -104902 -1833 239478 80733
11125 21219 -163205 14320 -243719 -44911 -60342 -48207 116480 212140 -42567 -254234 -69832
11113 331891 278004 94622 37922 -36534 -13765 -98783 51144 -51488 365334 64309 -429690
11101 64609 72938 239478 79286 -14181 295486 296899 -73557 28752 174281 -32814 207359
11089 82704 -40043 172269 32391 190327 -21813 59234 203753 224135 244472 8845 66237
11078 66237 -24951 149302 -68936 43043 140585 333231 15736 -260825 130644 82642 65856
11067 65856 -74355 34812 426646 117854 -40564 224400 195607 626668 80985 436128 -3493
11055 444776 307566 723473 324646 508086 353609 296186 555313 532718 355489 220165
11045 220165 637359 483745 375863 809759 480804 625105 416026 221147 505896 638241
11035 638241 492365 517851 630082 646456 735127 376458 255536 484448 412774 422725 471682
11024 471682 575162 473939 141044 366140 745478 351297 307448 568942 374429 406749
11014 406749 241028 348789 439926 397679 272837 502390 346532 452535 287608 214123
11004 214123 307723 504576 303663 242127 206387 276636 449273 590246 261864 512361
10994 512361 267929 500248 431106 435861 384675 427213 543001 287358 837472 639124
10984 639124 466464 604765 380145 426909 823082 730300 901352 776750 692925 1138781
10974 1138781 1098565 1319428 1518140 1461489 1377963 1719790 1559028 1561109 1445611 1158109
10964 1158109 1304032 1225055 1233130 879158 833721 841328 636813 904846 832949 987268 1175664
10953 1175664 873193 1409080 914433 761643 640684 497678 570200 447763 319418 479678
10943 479678 322307 303757 365751 197807 -2452 -147127 76749 284828 -22298 115974 39137
10931 246973 112686 32051 95168 192189 -135743 -403925 -188480 87404 -205443 36766
10920 -184145 105416 -44943 -419437 207532 -97009 -270325 -100145 -134160 209365 23679
10909 76770 -290766 -177554 64210 -67553 139678 53052 54055 -201639 145369 -85896 170871
10897 -61125 -2955 119157 -229942 -140584 157269 -124874 255412 -45225 -321895 -100855
10886 -81583 121446 -276682 105446 189297 -58049 228573 -267513 -527757 -97165 79838
10875 -44668 -153934 2927 -59218 -110915 -48065 -150818 -30664 113240 -208792 -20546 -167925
10864 -167925 -512720 45361 47410 -122981 -159434 325966 306594 -48041 -52644 -3765 62034
10852 17893 126708 34654 292084 449446 -264212 658506 -170405 97381 -129516 -283511
10842 -283511 24117 89620 -93496 -59464 -256188 -520217 -328180 80 -114286 194023 -214137
10830 -159394 215209 -167864 130823 26008 -404147 34146 -129916 261549 -9197 -100681
10820 -100681 123489 37191 324106 -128182 254329 58051 63779 131123 -186359 -453621
10810 -453621 -177266 -8361 -100167 -139037 -53224 -155601 -282528 201514 245349 138380 213505
10799 213505 -380592 235991 -163825 189315 -298141 -141271 135168 55061 -53283 43682
10788 -57145 56904 -101222 -241357 -66144 -111716 -316323 54376 -25437 -273724 -212765 -47388
10776 -251708 -70837 -7386 -156481 3152 -86022 1355 237374 -128700 -13996 30045 -81133
10764 -155038 -80736 -170266 -26358 78331 -13401 366386 -46554 74698 -265144 -149852 -224101
10753 -224101 -73874 108826 -17597 -118005 70967 30730 39575 -135424 -157343 92826 29779
10741 121160 284717 -10092 10368 132390 8098 205832 59685 227175 94187 8848 151231
10730 151231 -69817 -362280 118661 4826 -278244 -55275 -168009 48310 -377269 157953
10719 -40630 180780 186299 -185030 -60436 149230 -171076 -35430 -156381 65537 -35065 -328235
10708 -328235 -420922 -17960 -62231 -218030 -43271 -30378 278772 -132993 52969 -333132 98206
10696 -103237 42840 197763 -87814 67040 11220 -109537 -61668 -174833 76690 -463562 -146016
10684 155217 84190 33145 -116853 150294 -88442 266066 -248800 -312900 250752 -58787
10673 230910 -119133 66054 67413 -99798 -273416 29392 16859 -282259 -220953 -30859 -241119
10662 -241119 242427 -71844 20100 249542 -224343 -75895 36757 227165 11505 95388 -138487
10650 64800 -76793 243345 -210619 -41103 185852 -240856 -21903 46603 62670 -195313 320266
10638 168349 23868 -215846 41483 -144367 -144552 205887 150004 108248 287676 44136 -117381
10626 -116987 -338077 534278 279156 90518 -169791 -52067 43051 -26506 -238738 -360566
10616 -360566 2188 73191 -8636 145151 -345682 -355513 -422125 79959 196096 -443473 -22655
10604 35585 -57838 66098 -12304 -221022 55380 -452238 158285 30676 43276 34193 109601
10593 109601 -1742 -177071 -148417 -165625 -244493 -19862 -108010 30996 73752 -22110 -311649
10582 -311649 -78260 34609 -145702 4488 -129412 -68390 63163 234967 -26323 -253367 -19829
10570 255998 2622 80221 282282 58800 -263647 266723 -157108 60861 -1400 264430 5609
10558 37877 -343575 -5149 163674 -91537 -29883 -155208 33007 -16043 -62343 -31093 37118
10546 -66800 42440 -74218 7745 -319723 31982 94321 84671 -212330 -98420 -134716 44578 -30284
10533 -418469 -78278 -111372 -59068 45717 -15936 -126409 -119071 134208 -190804 -123486 -306974
10522 -306974 -76297 147456 -506147 -233182 -200706 -64330 -229135 -177638 -120381 -12672 -110516
10511 -110516 -198895 -126454 153968 -68565 -213677 64035 -118257 -40731 -146153 -487988
10501 -487988 -62454 -36258 -11416 5255 59443 252288 74633 -348390 269804 -127549 29328
10489 -157474 -99669 -167869 383294 237883 104058 -245228 245111 34085 233431 437775
10479 437775 222468 286752 316717 612126 93344 102004 330840 159338 -40783 384279 116884
10467 196112 90199 -39895 59213 124125 -48124 -131694 -216469 57012 -191529 -5843 71107
10455 -78403 4116 58814 -151415 65434 240676 -290053 -9272 222354 140562 100234 -307261
10443 82742 2845 -405930 -71455 190189 -144535 -253311 -148044 -217942 -221887 30730 -242382
10431 -301908 54720 -54285 -129324 -37390 -35637 -218052 -228410 71647 89217 33812 -193918
10419 -185419 -174995 -370144 -137037 -43503 160666 -205835 83701 17679 23815 -261293 -258089
10408 -258089 35643 226268 70782 35796 -45170 -297548 -4640 -216743 -14054 -138758 -48858
10396 -142072 -191144 208703 502587 333815 -8559 264128 -213004 -261997 -74156 8708 154664
10385 154664 19569 -12688 144320 47712 331137 -54481 -118648 -46772 68043 -25978 183537
10373 334532 327374 92914 -38030 -174694 106015 137328 199233 345252 102722 302182 120157
10361 227319 413166 383442 444278 146123 378175 5396 177401 181520 309690 130365 218848
10350 218848 432235 166709 391616 126275 -61255 84005 92396 310562 344625 434295 68938
10338 -19376 306269 243394 113653 -112568 239729 -99600 3797 63762 69010 62118 -98763
10326 286929 101578 -494 30974 310556 186157 99816 446664 30892 131027 81004 56136
10315 56136 201924 202841 -29107 62872 -50109 285521 190448 -235417 -1279 -83126 26634 85387
10303 85387 -288317 -131657 -473821 -210102 -359650 157813 114465 65059 -117240 -190194
10293 -190194 184696 297544 -93702 30081 -172538 -241361 -184790 -209238 -52290 -274462 -53535
10281 -184045 -223671 -82763 -75361 -76005 198042 -35129 23108 -122689 156446 -350418 -271944
10270 -271944 373480 68217 -99725 139198 41643 97488 -470303 -70913 -28125 -58520 82029
10258 181757 180365 142685 -8951 64359 -253904 267700 79623 -287524 -119558 -39836 -23057
10247 -23057 202577 -117215 200036 156924 -38597 -344998 126878 -158693 171657 272706
10237 272706 30810 -82335 -35525 91230 66543 -226288 -174766 198688 -208861 48631 -290495
10225 -331826 -14738 66975 -215708 -77412 45262 -337444 -143867 45964 -60413 -228353 -124417
10214 -124417 262657 154431 67186 94903 -9083 -149356 -56305 -151779 460330 18877 5986
10202 -256775 -159748 -95747 66927 390689 -191077 -88283 -87149 195679 401053 -114267 -90433
10191 -90433 387371 -17220 -114816 218868 165584 151818 36753 -182190 -253512 -65397 -123256
10180 -123256 -161588 -170623 -181210 11883 -216013 50421 84354 -46946 53872 -134955 10294
10168 152301 2442 27381 -58128 -93313 99046 68384 -248821 320883 -190867 245750 -106373
10156 -633609 -160248 20574 -370944 -163683 -220733 -252750 -54463 -172111 -187642 117315
10145 212779 68005 -304910 5006 -22312 -39234 21212 188312 233842 -123154 -114347 222177
10133 20174 141791 -10201 87909 109111 -187944 -182250 18935 -25485 181087 140555 -7131
10121 -186119 -177861 -2575 -97050 46058 131571 -240209 -86662 -53521 -215563 -212182 -243114 112316
10108 -345318 126887 -66811 19646 394188 14137 36815 118647 -82877 -25746 -129543 -340505
10097 -340505 287336 -105019 -234241 -68502 43489 -215661 32432 32134 235712 -148023 53995
10085 -149061 266513 -98550 23240 71240 -224661 53761 -93805 -156022 -324387 -189408 -452542
10074 -452542 -361695 89392 93789 206139 32820 -414759 -284337 -73441 186907 -110163 -76065
10063 -76065 38181 116236 -35896 115738 12466 -239277 192783 -173973 54728 -229994 132534
10051 316800 155565 279543 -229653 -78564 181306 -40684 -160157 -197160 41138 -134289
10040 -219300 -65141 213874 -263912 -232866 145703 -191977 -84122 -283800 -390547 157048
10029 166443 -95163 -141602 68242 -58627 -53609 -137048 9024 70013 194396 122075 -5819 276136
10016 -280833 -72682 -211263 -149360 -157503 64032 161485 39915 54214 -273160 -30855 19992
10004 -35729 -104159 -204877 -98860 -126521 -90737 -153771 -157124 301338 201714 -87001 -25854
9992 333698 83340 -297168 -68762 9179 -10828 160815 92453 -170370 103972 49086 197522
9981 197522 79583 -259366 269042 -223477 -328516 116179 -205796 138053 26690 130114
9971 130114 -160740 -166004 -96468 81111 -146558 -165109 171336 149292 -50625 -105891 -26372
9959 91760 -245917 -89090 -178147 -40317 -400923 -15344 -162353 -82295 -211675 3078 -264194
9947 144239 -71157 -195182 -206814 16672 -87317 -161035 -178570 -310216 -378401 -75103 -108187
9936 -108187 -24871 -317521 126572 292171 -11998 -76209 -23250 167680 -221757 -324916
9926 -324916 -416898 -187137 -146276 -25580 -15231 7838 -215238 -136102 76857 105220 246955
9915 246955 -25077 -169834 -171805 -48697 -12080 -26711 -380381 -8890 -116645 263154 -54994
9903 9057 221610 -305064 -19169 -193702 54092 -110327 -186009 -355364 109656 93053 94126
9892 94126 -19978 -33459 -152402 -117866 226588 984 -100592 -38381 -24267 -1671 16500 -276129
9879 252907 5086 -223904 51523 -53430 85481 205038 -48308 81429 -11682 -241882 127054
9867 263730 -308897 -303622 -313312 154352 -82321 -63696 -89638 58906 -274034 -254095 -370860
9856 -370860 -260587 -408477 3107 31702 128855 -32657 90217 -231185 -394712 -121446 -49612
9844 -295505 62228 251798 -75825 -90297 -12535 -74700 88673 151219 -279340 35156 -43609
9832 109239 187647 -334305 92753 -418165 -60883 -17441 -279595 -210309 202636 -90898 -97053
9821 -97053 -31862 -444985 29636 181205 -132901 227287 -88626 93894 -86305 -1596 112405
9809 72738 -252985 90974 513636 -89263 -325097 -212173 -178880 -55442 -40593 239297 -23468
9797 194493 68825 66383 -82175 -124932 -63136 -211982 110077 -576 128937 -79125 -44045 150681
9784 300644 13979 -119830 -114047 -42747 -117283 -206381 52635 196026 -21199 12088 -51408
9772 -182262 -115299 106675 -90956 -113461 129808 -139279 -78914 -232560 44060 81415 -216304
9760 -113601 292538 -14631 -198703 104086 112046 -261678 -4297 -68062 125373 96224 3178
9748 127710 -143014 -174846 -108699 108654 -2803 -136639 39709 -56797 -112251 -90486 110900
9736 -110817 196248 -246592 -142170 -59269 -217621 299896 -39094 -946 -88710 -367273 -110569
9724 -228507 -120523 -296651 -282275 -130629 -147565 14033 -541371 -21942 -42812 68069 45402
9713 45402 -29179 189125 -357438 -436519 208252 387957 -33205 203459 -196188 168494
9702 82059 5500 -67813 -258405 -294779 105553 -228382 -128657 -108038 -83637 319564 -298446
9690 39307 8818 224844 -79321 -92837 91321 97850 -350481 -186316 109421 -205054 224190
9678 -191670 -358053 -183597 -373824 -207500 -198866 -167563 -430439 132722 -319912 -286640
9668 -286640 21496 -60369 211942 -318834 98337 -67386 -120543 116756 -113400 -54568 -51003
9657 -51003 -280153 489 294569 -132095 95771 7635 16890 -31780 -193545 -118310 -71932 -54090
9645 -54090 82324 51115 279725 32486 -325668 228364 -239299 109216 -85979 10528 -258326
9633 106427 280362 -210611 -144156 -219217 -316359 32268 -54049 -231658 75689 216211 -307244
9621 397817 -37949 -308570 -378697 -71172 31911 233907 -108848 -56646 -154375 -48164 -55143
9610 -55143 140360 25514 -96671 -164180 48664 -176743 -536478 -278065 -47349 -215144 -19334
9598 147787 112644 -183570 -11671 -38101 -111210 -153797 -233801 -205384 48732 -249537 -15336
9586 -366944 -273931 -151063 -193041 -232134 44883 -197670 -60840 -33527 -172450 -115992 71467
9574 -120948 -482911 -114078 -161105 -454695 184794 132429 72221 -132313 -140273 -156779 -54975
9562 -270680 90065 -204065 -87139 28496 42207 -105152 14451 -142155 10395 -100717 -42464
9550 -60199 35850 -218354 -13261 68685 -266233 -327213 -115821 -88277 76830 172056 44380
9538 -292172 187251 -248758 78006 -46114 -113639 56878 -56270 148185 -87994 9716 52328
9527 52328 -36433 37615 18153 50461 -36657 243423 -48876 -69256 -215147 24298 -198282
9515 -44886 -143435 -45325 -255556 349135 -119723 118842 -25487 -301696 105627 -123225
9504 -303248 -185198 -336942 -2180 78558 20493 158360 -128384 -131614 -322057 -215296 -68026
9492 -232555 -179628 -161537 -38613 432641 144161 324461 11093 -374452 7596 -39871 -15649
9480 39876 -184089 12330 190385 -118987 -268469 144902 -118351 162753 134296 54078
9469 45995 -8996 -123719 194637 171937 21244 169819 -30570 -39397 91883 -338184 48318
9457 -63487 97695 32100 -25412 -114497 -64779 -33684 -206713 255262 -162683 -267108 207176
9445 -95756 82279 -82786 -93271 -216069 41298 -20991 -105505 -141232 -79990 -214514 321102
9433 75065 53532 -148697 -110825 -205238 223885 37596 265859 63736 -87680 246234 125605
9422 125605 155389 -438203 -10185 43656 66008 -144517 -158243 -79165 -419057 -171847 17273
9410 66272 -326704 111220 12316 -33521 36689 15734 -54793 125816 -171791 -272248 84191
9398 711 -73870 56389 -111779 195862 -86420 86947 48766 -38513 315409 -178364 -245270
9387 -245270 -206248 186424 -218013 -407983 -57504 -219246 -176834 -216314 37509 -131501 -93086
9376 -93086 -105739 -147864 39007 78014 -440782 -54307 -89005 -20122 -238945 -96344 76791
9364 81401 -180193 242018 65191 18863 -203613 -462366 -132688 39645 -243151 -274473 -172351
9353 -172351 -225103 130558 68024 43831 61422 -37327 -200829 166489 -4882 50188 -175737
9341 77991 -5607 63562 4902 -22870 13911 -176705 -192810 -468729 -10609 -330368 -84763 -329460
9329 -329460 -128296 -48482 -157093 38206 -233853 -43407 -98713 -302922 4318 -51207 253573
9317 -126973 295995 -311952 -189425 14893 -72894 -248122 56191 -183512 76499 132702 101409
9306 101409 -603434 289981 -6132 47633 -94748 -134051 -37938 51946 -338771 28724 -89915
9294 -49101 -66786 80391 33696 -139776 -283891 75142 -104514 -82954 37173 -251306 143173
9282 219088 -18940 -228327 139417 -133917 -254772 -240787 76243 -202613 -366299 -213312
9272 -213312 -12895 -83284 -150807 -229409 -213948 -150150 4781 -312397 15933 -310433 -128563
9260 120514 186262 -38047 48787 -198738 -226711 -201136 -69722 -5323 -142037 8852 -21054 59847
9247 216246 207434 -24234 162239 29266 -58830 -306216 97580 -106990 -63711 165278 -64410
9235 -134025 146496 72095 132256 63691 -98713 -78216 58920 280275 -95833 49123 315149
9224 315149 19975 76652 9660 16139 -1927 64127 148502 107667 -116714 -436095 -123453 -230951
9212 -230951 -111327 -126882 -79286 -132416 -126273 -359787 -201013 509177 -276916 76837 -448965
9200 -76469 -160001 -298897 -99914 -142024 107844 64423 -18329 -42043 -182307 -105891 -64536
9189 -64536 43540 -103694 185146 -319307 -173561 61333 -176345 -275480 -351857 23939 -400
9177 59093 106620 -149187 -353596 259152 -62787 -58957 -207422 -265887 110664 94063 -289915
9165 228481 -60437 -71662 60799 -332099 -154785 -325334 -233746 -76401 374890 196481 -262708
9153 73699 -304290 -75597 -325162 -149474 141539 2522 -35553 -63385 -205192 -135904 -146354
9142 -146354 74498 113219 -32767 -309511 -41845 6475 -104385 163450 116359 -242500 -378965
9131 -378965 -423165 112890 77612 57371 101030 -52714 -96113 119274 -94203 -313535 171197
9119 -22765 -54053 187772 -174316 -150928 -172784 146519 268835 216627 20477 -217395 108018
9107 89031 -151636 -91153 47395 29546 -245499 46410 179981 -86276 6032 353829 -264044
9095 -113388 -6763 94873 50468 176474 77437 -130124 -97067 148001 -45749 120285 42170
9083 436757 321367 -92323 -55941 -118850 -28144 134360 5957 -235458 -92943 -230268 -4742
9071 87185 -115544 -145406 -172245 -126774 -176801 -27245 39409 51794 123527 59289 -95675 -117468
9059 -117468 -96858 -155182 -319304 8545 203259 -138376 210068 197586 -108068 -224243 58961
9047 -34198 -133689 -94917 -106125 -110741 -32161 196512 -22517 -237173 -204670 -140782 -2337 -58667
9035 -58667 181802 -219276 -242914 -120801 -23385 -56146 13193 219794 107528 128100 -18181
9023 -329440 -55836 -162059 21542 54396 -51578 123465 -131662 -104348 -185096 133682 164108
9012 164108 198236 -137979 96114 -2680 219516 -336804 259393 -361760 -245480 -155719 6089
9000 -139270 -157063 173663 -59169 17591 -333915 -229213 41518 -63296 -311477 -237818 -218028
8989 -218028 -225968 -192111 46447 -265516 100405 -187847 -86441 198478 -24369 -4361 96185
8977 335204 211261 -195828 39745 -144940 -35505 313318 232520 -78431 50567 -117011 -155909
8966 -155909 149644 93196 -2655 -63698 47588 199546 -299277 -114183 -278357 -90908 -25722
8954 180153 91938 -269142 -24816 95681 -255726 -43766 -238389 -179251 131073 -152377 -189455
8943 -189455 16646 126899 67505 42909 39493 406790 58067 -434030 -137348 -153751 -18193
8931 -43956 160539 47431 -246706 -425943 119674 38878 60944 25587 -333006 165776 131837
8920 131837 840563 780383 331819 -34570 50815 -191765 -172288 15389 -101876 -228505 -99182
8908 -50806 -347304 -68227 -202014 -204189 -51403 -7402 -274091 -324903 222409 20226 178625
8897 178625 -1262 -201771 -12608 144683 116271 57810 -56451 51123 -115348 8620 -215121
8885 -33796 133394 905 -82214 -94032 8982 -59931 129872 -303902 111693 -386128 -24841
8873 136925 58180 -90874 183301 -115785 57868 -28605 49058 151371 -32293 -33254 -82058
8862 -82058 -196611 -157960 304488 -2808 -140930 30293 -95357 -81994 74986 -5222 -76748 -273834
8850 -273834 13973 -47446 -302222 -36652 -77519 117781 213362 19211 15425 -83707 90800
8838 16694 3636 41020 -17784 -83573 -340693 -485693 -129305 -125009 -33932 152714 252029
8827 252029 96731 27283 10326 42684 -25239 -80845 88672 237846 78919 -171824 -173179
8816 -173179 -104194 -114492 -110918 35494 148662 49016 76577 -160000 -200867 -218298 62472
8804 -128846 84402 237237 -237613 -77115 155594 -13644 -183190 79410 -35855 -77302 -315213
8793 -315213 -154542 -273645 -1262 -49477 -29727 -84899 243103 -48181 166760 -363889 187255
8781 6480 -35170 4112 98657 -33646 -31938 35042 -167765 101907 -179485 -86521 53251 -226620
8768 -115448 -357628 -137312 25080 309741 85711 4399 -210072 -238243 -12252 -75064 120914
8756 -9541 -36915 -252234 2882 -133282 85517 -113453 299191 -86068 179364 346202 -24757
8744 172434 11564 873 -173702 -88347 -79535 187377 3456 -213302 -84887 130372 -335534
8732 87750 -22660 71710 -119448 210780 -15510 -34206 -120815 -34548 159678 -52635 283946
8720 -238621 144007 -69476 12763 -133817 -302522 157792 -114166 28741 143165 -85095
8709 116662 166103 21337 -145033 -130871 15843 247756 -79843 -291100 179064 -74125 -151360
8698 -151360 -47552 13971 -107837 156848 -191605 356879 4666 -113879 -273509 -130014
8687 -179922 -36409 18625 -415529 86645 101183 186066 258249 -143787 213604 -220119 -195095
8676 -195095 -59400 -15098 -28679 8781 -187549 -152539 263098 -111697 -58734 310253 -546230
8664 -65685 -98457 -196038 80075 22209 216560 17101 -268119 -261144 -355101 32997 180861
8653 180861 90535 -72330 -213480 118925 -126370 -102650 -88841 119336 -85411 321890 236955
8642 236955 -127923 -5146 -63652 89517 116620 51437 -68178 -130088 -17501 -37378 -223411
8631 -223411 102853 200181 -131428 -81603 44112 -117934 -80576 147589 -115214 -51855 232475
8619 284000 60915 93506 11017 -128117 -187702 3381 357178 -210107 46621 60885 55042
8608 55042 304182 90173 64592 -210595 -179596 136778 -125277 -176350 17873 -451 -32345
8597 -32345 -83471 67657 -416003 160550 -172739 20796 -60633 -94084 30332 13916 -134890
8585 56011 -93806 307657 36165 -232075 96740 299108 69393 -133634 212246 -14286 -47921
8574 -47921 -67259 1837 170180 -259759 -246233 273657 -132824 -55434 -196444 6068 -54298
8562 7553 27954 -291104 -281163 -57479 -168533 -68775 -35679 286041 22872 -183872 -150440
8551 -150440 -265736 -210740 -295298 -86722 61137 118230 3494 -82202 -181825 2948 -190528 -203173
8539 -203173 122372 -192114 35199 28261 -124925 149944 -115482 84973 2701 -167589 86155
8527 -113172 145145 -212586 -58511 -140152 -98971 171598 -167642 -203704 -205400 -113562 -39915
8515 -9064 3552 171071 139572 241206 70906 -213416 -178486 -53198 -404744 76060 -425725
8503 -223937 156487 -107041 -154326 -150423 -227376 -84220 -231229 -75031 -91728 -607835 138523
8491 -7406 163461 381056 -116124 -160381 130260 92221 156004 -153609 -313725 -46420 -133910
8480 -133910 -12961 43997 27567 -153192 -54342 43670 108857 97170 329622 -343112 154273
8468 -25989 -167689 -134565 22227 -360945 28811 -38310 -50605 187432 -339523 257550 -143619
8456 171463 77283 129731 -194974 -378858 -387162 126083 108103 12746 38806 -240925 -36186
8444 -159056 212418 -205200 -138793 -95580 -183859 100489 165229 66235 -68800 -95656 -18539
8432 -279631 75186 -112725 -175179 212271 13629 132505 -31184 -45100 -221407 258159 -34238
8420 173591 -39512 -263286 -143765 -345007 26312 -144842 144652 -66035 -61911 225391 278477
8409 278477 -58571 -218816 -37149 151065 -179193 89845 -113348 -221302 -149292 -68906 -110020
8398 -110020 123200 -194880 -51411 115162 26239 189997 65987 235870 -12201 291662
8387 -190967 66936 143621 150545 -24081 -517869 -2006 -56623 74776 106334 -311287 -83669 152246
8374 -244764 63211 -81772 -173588 198597 11793 -46847 210018 -224866 38377 -104860 437437
8362 -44943 -93481 -304608 47412 -51347 -9781 -84733 -56020 28414 101626 -394682 208142
8350 75549 111852 -253864 391709 15074 -312712 60399 31053 -78654 129586 -333502 -31146
8338 52369 147009 10504 97748 -102355 -37197 154348 -264761 35881 98926 38067 102020
8327 102020 82540 -249297 93246 -142057 66677 93528 -113008 -137279 -4810 -29900 -320452
8316 -320452 310501 -108345 -351383 -78225 -234542 26820 364570 -80325 350855 -234981
8305 -183560 -159268 52769 -77368 -187937 -158578 149120 -101522 183628 -199556 -188983 16448
8293 -12976 -165352 -45188 -208202 106968 -101903 17985 -123125 194810 171519 -56720 181151
8281 -110671 -199588 -198484 -137587 85775 67648 -21488 -530006 -120140 110919 -80277 28414
8269 148566 285663 -59966 -288518 72454 -241382 2561 -203460 -196270 -124367 215382 -20784
8257 -13577 -25240 -32977 -223510 181345 604 -10521 -432960 -259146 -547360 -112922 -87843
8246 -87843 81813 -57127 -87135 130186 345198 -88751 146595 44402 79621 -47944 75955
8234 111280 -89830 -71721 166732 -310909 -174338 144178 -134504 -303905 -58874 7335 -131147
8222 -281513 -151818 -110810 -318700 195688 -45796 -39396 -32981 -71426 79225 -282314 -111253
8210 -53157 33701 146724 -137146 88860 61770 116011 -137565 82447 -137136 -227445 -141724
8199 -141724 -190755 132296 -127844 106034 89502 -59422 -52296 115350 -139318 -169451 54388
8187 -87557 245057 -330364 -202718 15273 -26480 -54816 -178568 -234997 -43438 51182 -248602
8175 -360047 5076 -122960 174447 120809 265447 210649 -301001 212472 -35224 -204667 -418480
8164 -418480 61650 203880 278276 -246463 143252 -157834 95110 467988 72673 85587 7826
8152 -187522 48240 247890 87675 -465104 -78464 -69933 -128293 -160592 -40122 49784 -373746
8140 59573 346215 -79368 77023 401480 -68693 88242 -40099 121480 8630 -36221 120037
8128 -125896 237082 -13165 -171803 -19761 -80626 -195559 120164 -63890 146203 133619 393529
8117 393529 -72259 275042 -285336 153708 -392092 37508 -92692 -188368 54764 -166978 -170625
8106 -170625 -38599 -109238 10400 143697 -241272 -28233 -195095 -97721 -341522 7239 -68519
8094 -103346 16203 -16205 323032 131496 -386893 -106216 -133423 169417 -251250 136964
8083 -644760 -144411 104904 -274648 88097 -116223 -4846 -1910 -347396 -88106 374632 -147978
8071 173638 9969 132913 -49490 -41708 -6769 -171235 -65156 270351 -75578 180826 -138378
8059 -17848 -218632 53850 35446 314591 -79684 -365717 -140704 -71589 -308778 -78328 51533
8047 143816 -318410 -36676 138431 46309 50276 -178658 19879 -167737 -78312 217679 -428912
8035 -33355 -334732 -220119 107802 -293179 -249232 51861 122583 -205930 106229 -79254 30979
8023 243664 -208500 -303616 -321814 21876 -144127 -196812 171376 156986 -111623 90731 12326
8011 -97178 -167835 59594 146400 -64775 81162 -33361 -167013 195719 -111910 -154832 -202330
8000 -202330 -170834 -185980 -20073 252297 -146991 218840 -341887 -52623 45591 45129 7815
7988 -28709 -87725 -89204 -194429 151996 -124122 -323918 -319346 -160465 -362829 -159653 49921
7976 -323039 -57560 -30855 83015 -85255 424677 239468 -93994 -22686 171016 -217759 150061
7964 155078 -103202 131712 130842 85506 -178221 199477 -111303 -167693 -109929 -65820 -55196
7953 -55196 276182 -27564 -156595 116606 122537 -270321 -93084 -209517 -266702 -119444 153156
7941 -119470 -29692 -23441 -71985 12991 -16336 254029 64693 87318 206478 -78008 193139
7929 233161 -3921 -149920 -103261 45411 7628 154087 -120415 145731 -337601 29526 398273
7918 398273 73854 7107 -160769 -290355 -132466 50716 -293388 204322 -216740 118766
7907 -346276 -2744 -122252 61080 208944 -89037 48417 -232741 266711 -29119 105081 185319
7896 185319 128844 153816 17734 217143 132806 -210232 161860 -12986 -112426 137284 180611
7885 180611 -9773 76342 146820 -448919 33874 -74405 1786 201782 -45907 -303656 154906
7873 -188010 273479 109602 279293 -159387 -90666 28624 83302 -188071 -391056 -266510
7863 -266510 -159114 -227805 119910 -3097 191813 -346335 115078 -486651 -330350 -64023
7852 -48655 -63115 76728 -31351 51061 -29963 35946 -35483 206447 -133876 -40623 -179717
7841 -179717 69009 192197 95966 -203493 -229563 -261656 -67594 -117125 308540 -115003 270177
7829 -50607 71461 281583 -299331 61108 -42972 -59510 152507 170686 18911 -152103 234737
7817 72142 -66445 45493 38682 -205583 -18240 -190123 205096 12933 -216127 5355 54538
7806 54538 231348 251672 177828 136805 114738 163108 138682 -69443 288299 123018 -254839
7794 49139 -253512 -16060 29230 -24435 -103135 -23227 92835 -26161 17968 34076 17837 53767
7782 53767 -108627 298734 53867 97125 -122027 145517 -150621 -157015 45828 -293579 51569
7770 115209 -257824 -400683 176363 59253 -155694 -149706 -231002 -10855 215308 73111 4873
7758 -275435 239281 -302173 -50957 -225735 -221751 -118800 -343094 -3467 -287936 132495 -275427
7746 -90013 -98316 343485 106310 -83740 156131 -28108 149698 119579 130202 -355581 -146499
7734 141856 138594 -184771 130572 100504 -50898 83343 186006 67981 -201963 -51687 -88003
7723 -88003 184288 -141726 148418 107283 -255146 125696 100274 95517 108871 52340 57910
7712 57910 -130555 -4348 -165188 34094 -200379 -145983 -138471 -232355 -143378 -210698 102437
7700 -390524 -142893 -117051 -50688 -104447 -121228 -5263 159010 -5919 -322840 172119 115105
7689 115105 -105894 -85455 -262792 127438 33035 -425089 -66728 45902 8443 -398197 -280717
7678 -280717 -7385 -304073 -389122 118887 240576 -283104 -102179 -24952 -175436 153944
7667 -148823 -158947 159000 -292661 75012 -80634 -156059 124425 221278 181973 -70564 237850
7655 -54796 -444977 -94855 -149439 -162243 -244534 37977 -40164 203616 74890 -504290 -50775
7643 -241494 452198 252497 -1989 -68792 176951 209873 50876 67238 -182542 128524 4893
7631 -51072 170273 150836 142324 -353304 -71348 35531 196844 -78772 -126029 29416 -218245
7619 57526 88906 -187374 197814 241210 -128679 317126 273319 -329499 -273304 -30806 83211
7607 31255 940 128956 88612 74053 -213936 197864 -64681 -77636 -148248 -334065 -39458
7595 330240 -157464 195722 -213339 -128446 -151744 -54477 -30828 -157022 -175068 -419381 -218494
7584 -218494 35939 -58962 150265 -4239 -324076 61307 -87673 132836 7904 -15049 74320
7572 15260 126479 -133587 220110 164947 -273211 -161395 58793 66170 127760 -196066 293047
7560 -100216 -134733 -97886 -39561 148527 -194903 -201569 21995 -22754 -48961 -263451 -280739
7549 -280739 -426176 -134012 126937 79725 -30002 71966 41526 16982 -232663 57411 75260
7538 75260 -17049 -3589 25575 11656 82867 -5082 37406 146558 104702 -176550 216487 -33374
7525 -158575 249900 234487 234806 295708 266507 -148594 -270556 -8700 56873 -200759 -237280
7514 -237280 236410 -145231 -157816 -4472 -75063 455685 150902 -349182 -16487 109709 -27617
7502 -160608 -437025 -169797 -4761 -446825 -253531 -203658 78847 160548 -156175 190664 -255778
7490 25362 112159 -144395 -98551 -47084 -141873 358927 -73140 20608 62389 105532 241200
7479 241200 83044 50152 173061 217783 -172732 -127963 -66506 -186817 -193654 -147195 -219548
7468 -219548 58678 -421703 -118899 -57796 15551 -178529 261335 71382 -193850 -31173 -82037
7457 -82037 265970 -142638 -22902 -331629 -204376 -217429 -40817 103481 7118 -129875 -71547
7446 -71547 84801 192131 -291480 192317 28489 -61108 -276716 125874 123526 8604 62645
7435 62645 -74431 -18285 -148544 -130300 -285370 -299377 51275 -97127 -85441 303343 57366
7423 140849 -117731 -58100 -152788 -99687 -40066 -4088 -94642 -428594 19114 -158402 85346
7411 -123334 193335 -118619 -171802 -124147 -139043 64871 -199747 40841 39432 64672 173804
7400 173804 -86311 104576 -98899 -141563 -163889 65645 101994 135427 -89962 183280 232258
7389 232258 46965 37428 33783 -99093 80502 -757 255148 28802 -152919 -221893 95747 -191098
7376 -278556 -194280 67352 -70036 -352577 69363 201533 174887 190104 79029 -477982 12969
7364 -50029 -52240 -40988 -294828 -45411 42884 17402 28202 -165677 -91602 -59709 -114521 72661
7351 -278284 219553 21066 89278 338299 96799 154961 57213 -107722 -95077 -268194 23920
7339 329649 -266132 -22366 -162571 -165550 148946 286900 232765 108631 -19309 -264721 151977
7327 29644 -279595 62503 -37912 -245739 255711 38371 -85795 38098 -226022 322039 -242323
7315 158158 -174126 -168800 -26481 -248840 49034 -78303 41459 39062 168928 -247544 -21794
7303 -33136 -77821 -346333 -22613 196952 158245 219669 30370 1759 -45061 29148 -123385
7291 -222132 168483 -283780 -75819 63669 55665 -117085 -30981 -112663 23399 -300787 -175430
7280 -175430 -75017 210053 -131059 -466606 -274884 11867 -152553 4862 41343 278183 245648
7269 245648 -213082 -252512 -32319 42985 -50415 533705 -134856 -79 101646 -125251 297031
7257 -45619 -2941 -108699 47298 121402 140467 149207 -136017 170888 23677 -410799 55413
7245 233066 -62441 251557 97077 -242773 115583 92118 -349915 -247578 -233481 214198
7234 179250 -184621 -115865 242050 -278358 -105144 -360411 -278306 -78906 -84894 7097 -373287
7222 87344 -196741 -230974 327617 -139571 9234 8441 -377975 -323998 -193963 -598509 -211887
7210 -31371 -75961 237249 190686 -4595 310117 -166812 -99376 -45981 15036 21404 259191
7199 259191 -6587 -35095 140724 -258537 -29031 47129 -117151 103326 205505 49572 -158914
7187 -143119 2388 212509 -265839 -296111 -49171 -56430 670369 -296356 14305 -33750 -181073
7176 -181073 -118062 140043 -27477 -27583 304167 -50345 -130490 -63837 -114793 51079 73147 -32946
7163 152862 37318 199493 -24750 1811 411581 -14460 3395 -143997 -87403 251758 99320
7151 -6015 -46970 149947 -4147 -109748 30464 12018 -320046 379953 359534 199337 -303859
7139 236896 -99007 105681 73637 129836 420993 43336 16280 -262928 186413 216622 77653
7127 4770 -253311 -59336 -174581 -256256 158966 -38357 170335 -5633 -93533 -133393 -177829
7116 -177829 79870 -348359 269589 -84570 -148392 -296821 -8985 -19056 4362 -390669 159137
7104 364949 17109 3083 -13047 360773 36340 -67849 -116789 -8033 52325 -289709 -132084
7092 31781 -432681 -91979 -93330 44355 -42318 186737 -38223 18158 302729 164989 6291
7080 -14772 91593 -124878 -219114 -83590 300018 37016 -186495 -80105 -283909 -217016 117018
7068 216226 81727 108525 -133097 -71332 162205 322859 -118325 165481 278851 92899
7057 -172735 -190089 -125667 227793 -69875 -3279 58283 64643 -169451 67853 -269224 70830
7045 -256620 -16622 -13080 -9469 -122359 13431 -342105 -253439 -28337 -173279 44185 -187986
7033 -25196 17579 -236459 -482496 -128821 -190850 -52424 119339 -17379 -116573 235273 -38040
7021 -53412 -81673 173396 -472559 -45834 141698 -251823 107600 -342928 -180370 -117868
7011 -117868 62873 140090 -376957 194684 -179550 30762 -174245 -102561 141793 -145208
7000 284254 136075 -184122 -160537 19587 -241699 15878 70018 118584 7597 -103197 -176400
6989 -176400 115007 131904 32613 -162399 147220 -43117 88088 32840 -426376 394741 157239
6977 113335 -219152 -222192 -108872 92315 -520660 52989 142168 -142039 342245 221742 4742
6965 40254 177832 -179242 -102063 166973 64746 -85538 161907 210945 31506 164062 -310949
6953 -260418 -24239 11090 249602 -139040 103177 194116 -162205 27529 -75645 94898 174041
6942 174041 -132058 -220435 -148946 -287785 45803 333640 60614 -59806 41508 36390 -6033
6930 85042 -120476 -2750 -252155 -92702 -181137 45578 96178 53289 68116 -231453 248567
6918 -237570 236787 -158085 -99587 240678 -185554 -156969 72952 215539 30973 141545
6908 141545 -16936 -56005 95958 -98501 296777 -70684 183557 -33521 -177854 8935 75823
6897 75823 -2556 131724 52652 -229562 -275664 -98988 -142378 -108886 -161905 -163346 -231899 -260413
6885 -260413 -102752 96759 -255958 437472 -118971 -111702 57646 -89590 -171995 -41530 -96818
6874 -96818 -193988 -208723 -135811 107153 -51227 -168169 -83442 20150 -109793 -148442 138379
6862 185304 273308 156099 392867 -397890 16739 -84286 305701 43315 -279523 -319076 -191460
6851 -191460 27569 307061 27699 22472 81675 -157056 -348499 98632 -168085 -52222 -221653
6840 -221653 -55514 -248379 -143334 404354 -151409 200933 356486 133318 -23365 -78973
6830 -78973 315893 -344917 -128270 207796 141217 -19989 71046 271654 47383 -209314 156596
6818 147202 -23574 -28099 55715 -343135 -219890 96551 -353570 83341 -171595 -76146 104404
6806 -139598 -263467 28359 -23911 79189 109135 396157 -111540 -208399 48664 65857 75253
6795 75253 -67293 47446 -50262 -98383 208494 -6523 17678 28488 37209 -27817 -40750 97986
6782 -165237 55384 23377 54792 6046 -237474 93120 -127514 131753 -207702 -137543 -205821
6771 -205821 -210665 125789 -540203 77422 194578 -56095 -189906 -389536 430585 -330266
6760 -58544 257054 15708 -193580 -119140 202257 245346 -54029 79592 -8993 18166 51673
6749 51673 -380550 215641 -72323 -111277 -239289 116498 118221 201191 126525 -133135 40022
6737 -461647 291462 -236757 84356 224554 82846 -80702 -232089 -61944 -37709 142174 -12202
6725 -47884 -63383 -67851 274148 -9466 70517 -100312 185003 137121 -213143 -341429 85261
6713 -22889 -307846 141737 174846 -180423 -213585 33716 145046 -295217 145043 -136165
6702 -309156 -29073 -120758 -32506 243448 -27665 -206407 -39041 -156136 -4012 178873 208397
6691 208397 -169398 -35550 90856 -149074 142207 136942 -174558 -185884 31455 -215336 -244638
6680 -244638 151935 -255937 -255921 207984 127588 -141214 94038 -147144 -82501 -175338 -324470
6669 -324470 -50316 -39473 -304572 72019 353426 -59396 -186916 122491 -100776 121187
6658 84361 -169539 232952 -54027 26573 156715 -170582 83974 76878 -249777 -208805 -327980
6647 -327980 19842 181582 129904 -428922 -1892 79721 53058 199858 -200199 -173291 221014
6635 400598 -121977 407814 -297438 25700 22131 -40704 44972 -358722 -46152 -342719 -405381
6624 -405381 45907 -97022 -134516 -28673 -143697 30304 165588 11147 168763 47704 73344
6613 73344 202054 -106047 33656 -39450 -176925 196773 119503 -275771 -121118 -60775 129904
6601 311658 -172879 208348 106113 68528 352679 -272949 195333 -59462 -56874 291717
6590 -99978 -198600 153931 92916 51569 141365 -93137 -169334 75080 261847 -237062 -144433
6579 -144433 -101462 -173989 306559 93103 -14370 99105 280874 -125654 26022 397474 -79560
6567 -205548 -16507 -75369 26871 109891 206522 -177531 2973 367964 -187297 -48428 -59257
6556 -59257 32946 63376 159391 523001 -153101 192937 183244 -137560 -81328 176578 225184
6545 225184 54039 -272548 -132384 -354148 -134104 146728 207401 125159 -168156 229911
6534 105254 -84260 -388233 142349 -141347 -176338 132053 35433 -56893 -168201 124736
6523 106225 -146362 -140934 -255140 17519 -105128 460470 -8852 283471 -80609 -30713 -123897
6512 -123897 143356 -54600 -91915 -93644 112965 138852 12768 54570 -267803 139400 53251
6500 91642 97852 -70390 -131377 27433 297474 18811 -86801 -48464 24146 -98699 -104513 -284016
6488 -284016 108914 60309 -154984 -213824 -124107 -80116 -252805 253848 -163050 -254491 41256
6476 -11713 -64008 15383 -192082 -220856 163035 -83391 -352651 -114093 39927 145741 -327051
6464 -172595 120530 190679 -79453 80130 -119951 -41993 154239 -6596 298494 190934 -71625
6452 323640 -324615 11263 147585 -73901 -246120 25513 -153631 -251600 -212907 -297635 -288993
6441 -288993 2083 -98430 -111462 -128986 -196222 317284 -102092 176792 -214108 102108 -110028
6429 -124586 63486 226112 93466 437882 205060 -313628 -15414 167273 -15589 -165511
6419 -165511 41006 -48482 13363 96332 -4269 80444 -275493 -89479 148269 -131049 -197823
6408 -197823 125937 -108702 -127628 180295 92585 291341 -27508 -255394 -54953 -315505
6398 -315505 249264 -222841 -144628 -63791 115509 199724 -153665 -80761 -401421 -223124
6388 -223124 -242561 70181 -1673 183155 -168547 238519 43475 -152053 157164 237586 151795
6377 151795 -40034 -48401 -3292 -18057 76016 -310328 214991 -131352 16531 -40786 171904
6365 46875 55316 203126 14049 163444 17267 -79537 -109644 -50200 37455 103378 195790 278072
6353 278072 304363 -10937 -16566 135993 79606 32399 -523425 -202422 122901 110095 -112390
6341 181638 171704 -154669 134294 -54485 58331 -38677 -3857 200108 -69390 -96763 -137018
6330 -137018 -99541 -55336 -43739 102341 5676 84453 -19118 98805 110595 -259086 -134717
6319 -134717 -111606 -62061 32505 -74670 -19141 -40905 -70597 -134003 -157165 -22310 -172164
6308 -172164 218187 16990 174652 115369 -94612 -304708 -111500 14309 -2316 -99230 -198321
6297 -198321 96004 -307197 58805 -103122 59921 215501 123877 -46291 -167276 -123053 81650
6285 -112271 1997 -104982 72625 -25104 70183 -99572 12374 29060 -343503 257426 -339097
6273 246416 -92769 -269350 -98260 165104 58847 -264625 225170 12565 151132 56448 15779
6261 -171364 -405865 -21245 -101968 -204401 -171947 39409 99494 -190507 -288998 -47604 239746
6249 -179479 -173802 -215818 -218934 -131884 146366 -105188 119841 129371 18040 101471 -172857
6237 -113144 104819 123174 -492659 199399 40116 136623 104879 141898 223033 85959 21722
6225 -174601 -236805 82786 34772 95223 39376 144909 152400 171629 -19044 80517 -21786 -42094
6213 -42094 -208098 26828 125616 -68552 -42844 -239120 228787 -237962 46282 -63078 -139384
6202 -139384 -220208 85905 -115201 -19420 -107787 80015 21698 12422 126316 194516 -114204
6190 38912 -97679 -31754 -22216 -98427 -199752 95622 138829 -200880 95079 374888 -129282
6178 -239954 -129913 135739 -187159 216945 -89722 150213 224717 98974 163091 -365086
6167 191100 -44040 155448 144956 -385700 -279976 -79911 18975 -179646 -9673 -75918 -86220
6156 -86220 138520 177513 121529 130362 -74128 -138637 3342 -287362 93107 -74575 9703 92567
6144 92567 99784 27250 -199876 73939 70191 184331 155080 -14476 60158 -21911 200539 255204
6132 255204 -373885 -153769 28806 -63673 -284824 -78183 110925 -8225 132977 -281623 -60928
6120 243904 161646 21595 183287 253849 16053 -2213 -290435 1171 42964 244222 11841
6108 17811 -147780 377207 -50182 -63834 176887 28200 -392450 144889 -131986 -185042 -33279
6096 61783 -26789 123092 174608 -160474 -175927 -71027 -98359 -6762 46698 86000 -88425 286247
6083 71515 233464 101890 173218 208253 -9112 77960 -35731 23967 271815 150156 153438
6072 153438 32567 165765 -266604 -1439 177283 -166503 10271 -88121 -200698 90472 -41265
6060 -219536 -101716 -100980 132189 176240 -3001 344579 -16218 -52514 183906 49795 88567
6049 88567 -89222 -67814 48499 192157 -188699 -76378 254125 -116623 -7638 199363 -22626
6037 87335 -48621 29164 214046 11551 124901 -147467 -64575 281947 -22528 -370031 486
6025 57359 -246266 -189844 -71625 57629 -138649 104700 -89654 -522854 86784 14425 -83020
6013 101985 292414 -165642 -76321 -275505 -31114 107895 -200751 90594 73802 -38596 -171750
6002 -171750 -9874 26006 -3308 2765 -33578 275983 34768 27180 108793 82416 108438 404059
5990 404059 356302 169021 -194363 -5971 -146883 -88119 -342819 -63767 -110217 -46959 43817
5978 -216469 63796 40792 180254 93195 -11015 -306007 60823 76387 88806 -176430 29598
5966 163893 -53826 41004 193246 -102082 133431 -18569 -238375 62894 98164 37944 70802
5955 70802 42410 -217463 -149631 -193472 -27828 68296 -242213 -147842 249390 -225216 233715
5943 -181070 -272337 215511 -84275 -42817 445562 -39811 33646 50927 -242006 -112958 83418
5931 268788 92865 195237 -353064 133171 224324 -255510 -11754 32145 -66892 -73933 484379
5919 118309 29772 -110157 -180754 -177532 -4393 -362837 67539 -206620 57906 -374432 -351605
5908 -351605 174663 -92934 -75719 -43411 -177490 264970 164478 66070 35348 -192665 142422
5896 -200763 19206 -175131 -127645 26955 -89398 -298413 64284 -101244 91812 -138235 -280279
5885 -280279 -219407 53763 46540 -28709 154217 -48530 332515 227087 233292 191014 134800
5874 134800 -85854 270717 -15148 30755 39897 140323 -240081 359257 -105826 66724 65606
5863 65606 82000 -410448 -94271 54894 222660 -146913 129689 25858 -164735 187249 -2383
5851 -125280 -92857 -47801 232063 -162110 526669 129076 230813 -190333 -274823 -187364
5841 -187364 -108067 3040 -93231 -108745 180009 253651 -101088 204757 1925 -131930 -70582
5830 -70582 47766 -171012 -206489 96297 -56662 -62619 -60582 -79584 24440 15791 66009 -88177
5817 -287245 228316 -188773 6300 100893 -92224 87932 241560 -454013 -325990 143364 -42690
5805 -59536 -160651 248409 -237041 -30120 -186800 -122782 -70573 -95734 -139 -106128 143669
5793 -102456 -83336 131366 9607 229870 -137483 81565 -149277 -7418 -100125 -79506 355021
5781 -342170 -134644 -66003 -458504 -186330 194097 -26440 118260 113629 122686 120367 -211962
5769 60270 263923 -49955 -77158 -83912 -160345 145862 188528 110676 -276159 14560 -179621
5757 -132929 -183630 -87899 326356 -80527 -321656 125835 209428 66162 166421 -259738 -333919
5746 -333919 257779 -366153 101278 90277 -144558 79490 93076 249933 133521 -231026
5735 160806 -257765 -188287 -99023 -11803 -341549 132436 124411 -138835 289707 -77250 277407
5723 -146532 42216 23299 -218600 -183935 -23924 179955 120236 34969 -56844 -44589 -90982
5712 -90982 -117473 28734 -76604 370030 152599 169519 -15227 201780 173950 352030 103602
5700 -144759 22421 1866 -307036 -98415 281480 182393 122035 20336 16009 138610 -30552
5688 -299149 -96597 83211 -120037 -140535 68454 -270370 -377260 114117 -84305 169929 -325526
5676 364714 242400 -84090 268181 30464 -31308 132782 -342096 10574 -40845 -1906 443180
5664 144605 40576 62583 22530 20601 346265 -208230 159641 72785 273773 34497 49599
5653 49599 169015 136496 31139 -247170 229342 -91515 24664 161947 -384717 84222 331771
5642 331771 -45025 150056 161505 -43377 2449 44065 -49164 -181462 -81866 78341 210162
5631 210162 -16735 87447 63669 15662 97854 -223289 -111017 -29201 207830 -153609 284184
5619 -45495 -84436 -182746 -272670 95004 -6503 -146224 2932 -186528 -281321 249229 -159250
5607 -410653 -20730 232029 4668 -273917 -55125 -67959 -313865 86031 -85478 -285209 189500
5595 36145 -143306 -76571 108092 -212035 -111494 172058 49072 -361739 -255741 -199781
5585 -199781 -103814 132112 351471 -264110 64224 -267947 100303 62574 -209435 15039
5574 22976 88994 234480 8467 -196039 20822 146205 -73105 209891 116958 -254055 95160
5562 -266165 -249407 -8414 -132441 54958 -108547 25482 -67314 -135254 -6545 -11982 -232768 -277404
5550 -277404 320213 117613 -109572 -62593 -6639 48573 37241 295016 -27084 -234810 -112944
5538 345258 87622 -69525 -150165 -175938 90639 180095 -96019 -67209 316222 51397 -162944
5526 -338466 -222525 3467 -117423 -97894 46418 -230748 -218132 -187918 456123 37046 -168552
5514 -221186 -128430 -89321 -57348 190420 -128567 -136310 -40171 459058 98918 138254 -45879
5502 174763 -297000 -76579 -15744 -57113 -60593 26413 56293 -157158 172558 -169930 -155274
5491 -155274 -16027 -193671 -134259 121309 326301 -88211 135149 -319683 -117896 -253881
5481 -253881 -31079 -208609 67364 -48638 171372 -35876 267764 247489 -33999 -48457 -127479
5470 -127479 14494 153658 70940 338077 99977 -154057 333668 -61425 -60133 -207687 -296544
5459 -296544 -18622 116510 -233870 32063 -260452 -49244 371357 185581 322759 -148535
5448 99637 170855 196756 141308 137444 -37951 149448 -120195 174111 -32316 -55324 -111192
5437 -111192 61206 -192846 -127980 -206513 -174222 -115637 44208 -157264 -172185 -129092 -197205
5426 -197205 75209 -282839 -107597 -157069 212504 39639 -207655 91813 -100065 -80969 65472
5414 -60127 283973 -191 -6922 -4321 -3919 197664 -17766 -14305 83230 34197 -18088 -116547 -248464
5401 -248464 -94496 -303910 -314047 -8295 -108395 -49593 -153315 -19510 30477 139825 -297609
5389 1352 -44540 -285122 9316 170318 403355 30917 -97615 73223 236693 158662 122099
5378 122099 257300 21236 -225226 403702 54254 -143390 178528 185802 -38540 211370 -40204
5366 -156080 290761 -62038 -71001 -118227 -58826 -168081 -126022 -77932 93119 -222231 107616
5354 70088 32812 128473 433708 -273366 257642 -460701 -20094 -223001 -261773 -74821 -6334
5342 97664 -245195 113609 205194 55416 27167 -59514 6660 125718 127295 1588 -163137 -70788
5329 332976 84151 69528 76570 352804 -80945 -80388 18254 220324 35392 188713 6337 204303
5317 204303 -348869 -201326 -316980 -234414 -204528 -195556 -564719 43761 -70460 130747 2080
5305 -37185 -36460 -292045 -101618 233757 -33731 -253966 2079 -173264 -244883 -161071 516830
5293 210812 -220646 -103533 50004 127126 -77759 -27033 284357 -73087 -83315 -67200 96476
5281 -124740 -63883 103976 92300 -37866 170450 154144 -97981 114754 331369 -94797 -32505
5269 190158 18991 270069 126298 52275 -225014 268426 235409 -118198 -68725 30056 57403
5258 57403 26779 -338566 -143982 106597 185348 20428 98523 17667 301311 -38998 169984
5246 -106601 -25215 -527745 -313936 -12665 66871 -146655 -149453 439557 -230829 227120 -30325
5234 -268913 4373 -147198 -167330 177176 -16953 -50522 15274 -46401 -28348 -73453 208746
5222 -43442 -265193 -66369 91930 101938 -26853 493331 -124041 221298 338298 -67352 -243312
5211 -243312 149952 84142 -80702 -194539 208146 118538 99107 267674 217110 -107638 244080
5199 366041 230680 218967 146675 197716 176318 155081 134328 -38480 241323 -32989 -44361
5188 -44361 -70044 209019 -9467 71656 -6281 123569 28385 -135941 -23072 134654 144354 92232
5176 92232 -281129 61945 -228303 56014 192981 340727 -29434 -386706 -18470 -248675 17806
5164 -420657 228805 91529 26935 279843 97912 30827 325298 -322702 334694 -248524
5153 143877 -37604 151044 -157730 -167478 -276793 -59029 -127351 -92577 -55305 -12550 196012
5141 -120167 113788 -144920 -367576 32380 6761 -86996 -161021 -117842 107610 -80776 -258592
5130 -258592 148503 108239 -190184 -42701 161162 22081 -34587 26400 -142045 -47789 -211244
5119 -211244 -79251 -157169 -29671 35813 71629 96200 30991 135185 -37774 234508 -33840
5107 124313 150051 77219 115502 -27837 181124 207423 -137144 112375 -145670 -267728 435433
5095 -112299 -101388 29416 -27273 50481 -154721 -37670 69643 -270419 -124134 -65732 -80338
5084 -80338 -118902 23566 68105 350778 -19581 287449 -107456 134798 -321036 47464 -92105
5072 0 346013 42751 39843 201200 138517 -157212 50062 -38396 204475 -35861 -200150 7300
5059 -138529 26978 -32443 16147 12062 89509 132519 -156568 74007 -117099 270597 212140
5048 212140 -50705 44897 191256 40498 477674 -47966 6426 176193 325801 -222264 187159
5036 -193490 154279 38614 -2569 141074 -40487 -60215 78644 -299662 -25611 126889 -5008
5024 -345828 -477681 165155 -139397 -164123 91255 145028 -69865 27651 -99629 -47612 -290087
5013 -290087 222900 -358951 311814 -30050 189969 119168 -193268 -125032 146586 -318308
5002 -116776 344969 204821 -84017 45464 154682 380997 -56142 -54118 -163352 22971 312048
4991 312048 159608 -40117 -215274 -2234 -124439 -349539 -139172 -68873 120318 123922 43986
4979 -96202 -196588 213234 -65538 39989 95953 -103571 -69567 -9719 83868 -88244 -120022
4968 -120022 -190378 -52017 315081 139875 -217279 69437 -246331 -119598 111107 -123816
4957 265732 151869 181466 70247 -153002 -83684 -17057 -96383 139128 -200932 99482 -165820
4945 394337 -5524 -18428 208007 -139369 54444 -64128 97306 -240770 28941 -343711 25187
4933 -243819 -110166 -196506 72549 -213680 130403 -259705 -135933 233958 -86857 204254
4922 -82704 -264495 -126375 -148178 -113467 -106280 292535 -153237 169726 289700 344221 -225193
4910 -178836 523656 370139 -7027 -230728 -39945 135323 -24121 -134618 284112 166538
4900 166538 228216 -34626 23350 100230 65279 166406 131397 20294 30253 -73625 -14067 71063
4887 241539 311355 40358 -310063 117636 171030 -68782 -7233 409265 180462 -43390 66586
4875 240473 -271340 -51969 -75927 -160875 -211467 34159 -239058 -250136 185999 -75349 -64547
4864 -64547 -57614 -65333 223579 17244 -280695 2559 186372 11433 92416 71232 -68212 -188382
4852 -188382 -55468 -72040 52525 9107 -145291 88559 -130690 28010 122047 -70955 -171987
4841 -171987 -262565 -77929 -105817 132740 -98346 -119814 271474 50401 210186 247879 84439
4829 256969 134577 -70196 177574 20256 369844 -243843 -211846 -75231 -27845 164934 -8924
4817 -95653 -93799 -78461 -434515 -325005 79453 37953 169439 100001 77873 -182973 28832
4805 -308112 -1552 -38973 39721 83825 -311745 105301 60107 -509923 197097 72094 19528
4793 234965 44801 182693 -277965 90758 -13127 59261 104306 107119 8978 54999 -184723
4781 -110499 -114287 132359 114360 59263 -291441 -73582 -144367 -261010 -53294 137936 91996
4770 91996 -30097 -396947 -326827 -14173 288306 -168013 88729 -67776 25174 23965 -78628
4758 -116870 -74309 207065 81861 -336973 334230 185157 66805 -54935 164362 69484 234591
4747 234591 -138106 -80095 34092 366281 7722 78889 338036 290058 210660 26147 -265952
4735 -375827 249162 -34817 -199294 73733 99149 -134188 61161 350561 -120822 -139177 -52102
4723 -85808 85474 -51594 -37018 32334 -139205 -96948 -27948 -23540 88818 227873 72435 -58662
4710 300096 -13491 -78586 83475 332272 -147567 137265 -57694 -70102 346630 16671 42735
4699 42735 1795 35411 151221 -43404 75957 -11135 15244 399568 -90130 -89954 -149039 -259075
4687 -259075 1756 105352 87811 -69472 212440 -77116 -239212 46180 -225733 85187 -252706
4675 164991 10274 180084 158074 -40240 131099 234314 -44645 138124 -191522 17333 -100344
4663 -157428 -20686 115688 44899 -148975 3564 291341 246251 -74490 57677 174840 -185507
4651 157437 11210 113958 -169174 199323 -44166 103297 267459 -19120 101260 75801
4641 75801 97948 -340009 172552 -41110 225710 220101 -117745 -214782 -111431 317243 -200075
4629 181911 -40180 -249165 -187071 264789 -46827 4819 241130 166532 -146598 93487 90828
4618 90828 146113 -376644 -114345 213327 262777 -185868 163466 -134326 -182503 67907 -260943
4606 207005 17950 13447 -179625 -139869 80128 -42200 -299161 66032 -2585 -111322 -1140 -139356
4594 -139356 206484 -80834 -186732 -189222 -5497 -261059 93321 124652 214963 -14542 295300
4582 -52724 278228 44930 -127510 18600 -75823 -359422 9876 -156071 121814 103882 -91828
4570 233494 -171664 22517 61418 342213 -38216 -62412 191202 -134060 84292 -263985 -61729
4558 107536 141329 154455 -93291 -25911 188576 -184230 336604 170845 -268996 129988
4547 -81619 -206303 418399 332774 -58456 127023 -203673 574874 221768 -145839 -109699
4537 -109699 102521 -43476 49993 -218439 -223815 -208800 97266 -71056 103500 54407 -82968
4525 -1831 31399 148060 97374 -68259 -227655 23552 8957 119721 106798 -64633 275402
4513 -116156 120177 159426 26503 143400 65326 -326362 -189628 313936 -24254 -233320
4503 -233320 195886 -73998 198789 -76634 -148971 157031 25182 -91308 176902 123368 -4191
4491 -324111 -90415 -255318 -58113 157262 63095 -176818 109943 -190600 508856 -370987
$$ [...]
##END NTUPLES=NMR SPECTRUM
##END=
