##TITLE=NES1043_8708014013_9242921_HsXZwWY3Tl
##JCAMPDX= 6.0         $$ Bruker NMR JCAMP-DX V2.0
##DATA TYPE= NMR SPECTRUM
##DATA CLASS= NTUPLES
##ORIGIN= BRUKER
##OWNER= Administrator
$$ 1.72 TOPSPIN		Version 2.1
$$ 2015-07-02 02:26:22.367 -0700  Administrator@X
$$ Compression mode = diff/dup
##.OBSERVE FREQUENCY= 400.02188249412
##.OBSERVE NUCLEUS= ^1H
##.ACQUISITION MODE= SIMULTANEOUS (DQD)
##.ACQUISITION SCHEME= undefined
##.AVERAGES= 64
##.DIGITISER RES= 22
##SPECTROMETER/DATA SYSTEM= spect
##.PULSE SEQUENCE= noesygpps1d.comp
##.SOLVENT NAME= COFFEE_meoh
##.SHIFT REFERENCE= INTERNAL, COFFEE_meoh, 1, 14.96202
##AUDIT TRAIL= $$ (NUMBER, WHEN, WHO, WHERE, PROCESS, VERSION, WHAT)
$$ ##TITLE= Audit trail, TOPSPIN		Version 2.1
$$ ##JCAMPDX= 5.01
$$ ##ORIGIN= Bruker BioSpin GmbH
$$ ##OWNER= Administrator
$$ $$ E:\/data/COFFEE/nmr/NES1043_8708014013_9242921_HsXZwWY3Tl/22/pdata/1/auditp.txt
$$ ##AUDIT TRAIL=  $$ (NUMBER, WHEN, WHO, WHERE, PROCESS, VERSION, WHAT)
(   1,<2015-07-02 02:26:16.945 -0700>,<Administrator>,<X>,<go>,<TOPSPIN 2.1>,
      <created by zg
	started at 2015-07-02 02:14:47.586 -0700,
	POWCHK enabled, PULCHK disabled,
       configuration hash MD5:
       21 0F 79 D6 B3 7B B4 F6 88 20 88 DB 03 48 BD 9F
       data hash MD5: 64K
       09 C7 A4 89 34 33 66 E2 9C 27 18 67 DA 54 EE 1E>)
(   2,<2015-07-02 02:26:20.320 -0700>,<Administrator>,<X>,<proc1d>,<TOPSPIN 2.1>,
      <Start of raw data processing
       efp LB = 0.3 FT_mod = 6 PKNL = 1 PHC0 = 0 PHC1 = 0 SI = 128K 
       data hash MD5: 128K
       D6 59 CD 42 BD 51 3F FC B0 0D 19 7D A2 18 83 2C>)
(   3,<2015-07-02 02:26:21.180 -0700>,<Administrator>,<X>,<proc1d>,<TOPSPIN 2.1>,
      <pk PHC0 = -85.95154 PHC1 = 0 
       data hash MD5: 128K
       BD B7 2A 3A 7F 90 45 E6 C6 B1 87 1D 23 BE 32 FF>)
(   4,<2015-07-02 02:26:21.555 -0700>,<Administrator>,<X>,<proc1d>,<TOPSPIN 2.1>,
      <abs ABSG = 1 
       data hash MD5: 128K
       54 DC E8 5B 9A 06 5A A7 A0 AC DA 6C 59 FE 8E F3>)
(   5,<2015-07-02 02:26:21.649 -0700>,<Administrator>,<X>,<proc1d>,<TOPSPIN 2.1>,
      <abs ABSG = 2 
       data hash MD5: 128K
       8B DB 8A EA 56 6E 38 85 D0 64 A4 77 1D 19 15 FA>)
(   6,<2015-07-02 02:26:21.727 -0700>,<Administrator>,<X>,<proc1d>,<TOPSPIN 2.1>,
      <abs ABSG = 3 
       data hash MD5: 128K
       D4 BC AC 0A B5 CA 73 CF 6C 6B BE 27 23 62 80 66>)
(   7,<2015-07-02 02:26:21.820 -0700>,<Administrator>,<X>,<proc1d>,<TOPSPIN 2.1>,
      <abs ABSG = 4 
       data hash MD5: 128K
       21 37 1B 3C A5 E6 03 31 22 5B 65 05 8F 11 1D A0>)
(   8,<2015-07-02 02:26:21.899 -0700>,<Administrator>,<X>,<proc1d>,<TOPSPIN 2.1>,
      <abs ABSG = 5 
       data hash MD5: 128K
       90 10 1B 9F 86 58 16 38 C5 C4 78 56 71 A5 64 24>)
$$ ##END=
$$ 
$$ $$ hash MD5
$$ $$ 5D 77 F8 1F AA FE 02 AD 7D 30 ED E0 09 72 28 44
##$RELAX= 
##$RELAX= 
##$RELAX= 
##$RELAX= 
##$RELAX= 
##$RELAX= 
##$RELAX= 
##$RELAX= 
$$ Bruker specific parameters
$$ --------------------------
##$DU= <E:\>
##$EXPNO= 22
$$ [...]
##$TP07= 0
##$TPNAME0= <>
##$TPNAME1= <>
##$TPNAME2= <>
##$TPNAME3= <>
##$TPNAME4= <>
##$TPNAME5= <>
##$TPNAME6= <>
##$TPNAME7= <>
##$TPOAL= (0..7)
0.5 0.5 0.5 0.5 0.5 0.5 0.5 0.5
##$TPOFFS= (0..7)
0 0 0 0 0 0 0 0
##$TUNHIN= 0
##$TUNHOUT= 0
##$TUNXOUT= 0
##$USERA1= <user>
##$USERA2= <user>
##$USERA3= <user>
##$USERA4= <user>
##$USERA5= <user>
##$V9= 5
##$VALIST= <valist>
##$VCLIST= <CCCCCCCCCCCCCCC>
##$VD= 0
##$VDLIST= <DDDDDDDDDDDDDDD>
##$VPLIST= <PPPPPPPPPPPPPPP>
##$VTLIST= <TTTTTTTTTTTTTTT>
##$WBST= 2048
##$WBSW= 25
##$XGAIN= (0..3)
0 0 0 0
##$XL= 0
##$YL= 0
##$YMAX_a= 5635342
##$YMIN_a= -10305957
##$ZGOPTNS= <>
##$ZL1= 120
##$ZL2= 120
##$ZL3= 120
##$ZL4= 120
##$ABSF1= 14.96202
##$ABSF2= -5.596162
##$ABSG= 5
##$ABSL= 3
##$ALPHA= 0
##$AQORDER= 0
##$ASSFAC= 0
##$ASSFACI= 0
##$ASSFACX= 0
##$ASSWID= 0
##$AUNMP= <proc_prof1d_extract.lims>
##$AXLEFT= 0
##$AXNAME= <>
##$AXNUC= <1H>
##$AXRIGHT= 0
##$AXTYPE= 0
##$AXUNIT= <>
##$AZFE= 0.1
##$AZFW= 0.1
##$BCFW= 0
##$BC_mod= 0
##$BYTORDP= 0
##$COROFFS= 0
##$CY= 15
##$DATMOD= 1
##$DC= 0
##$DFILT= <>
##$DTYPP= 0
##$F1P= 0
##$F2P= 0
##$FCOR= 0.5
##$FTSIZE= 131072
##$FT_mod= 6
##$GAMMA= 0
##$GB= 0
##$INTBC= 1
##$INTSCL= 1
##$ISEN= 128
##$LB= 0.3
##$LEV0= 0
##$LPBIN= 0
##$MAXI= 10000
##$MC2= 0
##$MEAN= 0
##$ME_mod= 0
##$MI= 0
##$NCOEF= 0
##$NC_proc= -2
##$NLEV= 6
##$NOISF1= 0
##$NOISF2= 0
##$NSP= 0
##$NTH_PI= 0
##$NZP= 0
##$OFFSET= 14.96202
##$PC= 1
##$PHC0= -85.95154
##$PHC1= 0
##$PH_mod= 1
##$PKNL= yes
##$PPARMOD= 0
##$PPDIAG= 0
##$PPIPTYP= 0
##$PPMPNUM= 2147483647
##$PPRESOL= 1
##$PSCAL= 4
##$PSIGN= 0
##$PYNMP= <proc.py>
##$REVERSE= no
##$SF= 400.020009228423
##$SI= 131072
##$SIGF1= 0
##$SIGF2= 0
##$SINO= 400
##$SIOLD= 131072
##$SPECTYP= <>
##$SREGLST= <1H.CDCl3>
##$SSB= 0
##$STSI= 131072
##$STSR= 0
##$SW_p= 8223.68421052631
##$SYMM= 0
##$S_DEV= 0
##$TDeff= 65536
##$TDoff= 0
##$TI= <>
##$TILT= no
##$TM1= 0
##$TM2= 0
##$TOPLEV= 0
##$USERP1= <user>
##$USERP2= <user>
##$USERP3= <user>
##$USERP4= <user>
##$USERP5= <user>
##$WDW= 1
##$XDIM= 131072
##$YMAX_p= 289123877
##$YMIN_p= -13793
##$CURPLOT= <Network HP LaserJet P1505>
##$CURPRIN= <$Network HP LaserJet P1505>
##$DFORMAT= <normdp>
##$LAYOUT= <+/1D_H.xwp>
##$LFORMAT= <normlp>
##$PFORMAT= <normpl>
##$SURQMSG= 1
$$ End of Bruker specific parameters
$$ ---------------------------------
##NTUPLES= NMR SPECTRUM
##VAR_NAME=  FREQUENCY,     SPECTRUM/REAL,   SPECTRUM/IMAG
##SYMBOL=    X,             R,               I
##VAR_TYPE=  INDEPENDENT,   DEPENDENT,       DEPENDENT
##VAR_FORM=  AFFN,          ASDF,            ASDF
##VAR_DIM=   131072,        131072,          131072
##UNITS=     HZ,            ARBITRARY UNITS, ARBITRARY UNITS
##FACTOR=    0.0627417313425164, 1,          1
##FIRST=     8223.62146879497, -2419,        -43158
##LAST=      0,             -1135,           -43693
##MIN=       0,             -13793,          0
##MAX=       8223.62146879497, 289123877,    0
$$ Real data points
##PAGE= N=1
##DATA TABLE= (X++(R..R)), XYDATA
$$ [...]
61339A441587l7108l3773l0128k6059k2086j9018j7109j5480j2795q790m726k017
61327A212498o57N42K476N080P894J0602J2848J4132J4231J3465J2328J1004R433
61314A325876P638N892M557L803L449L117K714K606L142L983M292L604K283J003
61300A377959M2p62j549k299l070m114n602p349q921j0016j0682j1217j1841j2456
61286A288123j2658j2120j1052j0222j0287j1067j1663j1412j0421r091p497n716
61274A164917m362m200n161o427p508q663r973j0761j0440r458q693q224p396
61261A063651n931m219k432j75K679N432P338Q628J0226J2602J5357J7935K0326
61248A151417K2861K5588K8153L0198L1610L2364L2264L1060K8735K5488K1469
$$ y = [1441587, 1404479, 1370706, 1340578, 1314519, 1292433, 1273415, 1256306, 1240826, 1228031, 1219241, 1214515, 1212498, 1211841, 1212383, 1214859, 1219939, 1227833, 1238435, 1251283, 1265415, 1279646, 1293111, 1305439, 1316443, 1325876, 1333514, 1339406, 1343963, 1347766, 1351215, 1354332, 1357046, 1359652, 1362794, 1366777, 1371069, 1374673, 1376956, 1377959, 1378001, 1377239, 1375690, 1373391, 1370321, 1366207, 1360605, 1353256, 1344335, 1334319, 1323637, 1312420, 1300579, 1288123, 1275465, 1263345, 1252293, 1242071, 1231784, 1220717, 1209054, 1197642, 1187221, 1178130, 1170633, 1164917, 1160555, 1156355, 1151194, 1144767, 1137259, 1128596, 1118623, 1107862, 1097422, 1087964, 1079271, 1071047, 1063651, 1057720, 1053501, 1051069, 1050894, 1053573, 1059005, 1066343, 1074971, 1085197, 1097799, 1113156, 1131091, 1151417, 1174278, 1199866, 1228019, 1258217, 1289827, 1322191, 1354455, 1385515, 1414250, 1439738, 1461207]
61237A461207J6692J1275N585K6n249j0323j5294k0080k4393k7880l0400l2143
61225A329023l3390l4128l4123l3367l2178l0751k8952k6791k4807k3561k2863
61214A004112k1862j9999j7609j5483j4040j3009j1872j0514r362q914r156r601
61202H42691r820r700r271q569p805p268o899o351n627n270n601o191o535o827
61188G40957p474q228q491q322q321q589q576q045p507p350p245o749n972n266
61174F34822m710m262m006l833l323k293j158l12M13J288K029K104J422J56j793
61159F16544m510p406r525j0597j1226j1937j2557j2695j2336j1693j0845r790
61147D91427q674p727p099o839o811o649n976m849l750l102k904k868k697k252
$$ y = [1461207, 1477899, 1489174, 1494759, 1494785, 1489536, 1479213, 1463919, 1443839, 1419446, 1391566, 1361166, 1329023, 1295633, 1261505, 1227382, 1194015, 1161837, 1131086, 1102134, 1075343, 1050536, 1026975, 1004112, 982250, 962251, 944642, 929159, 915119, 902110, 890238, 879724, 870362, 861448, 852292, 842691, 832871, 823171, 813900, 805331, 797526, 790258, 783359, 777008, 771381, 766111, 760510, 754319, 747784, 740957, 733483, 725255, 716764, 708442, 700121, 691532, 682956, 674911, 667404, 660054, 652809, 646060, 640088, 634822, 630112, 625850, 621844, 618011, 614688, 612395, 611237, 610925, 611338, 612626, 614655, 616759, 618181, 618337, 616544, 612034, 604628, 595103, 584506, 573280, 561343, 548786, 536091, 523755, 512062, 501217, 491427, 482753, 475026, 467927, 461088, 454277, 447628, 441652, 436803, 433053, 429951, 427047, 424179, 421482, 419230]
61133D19230j730j625k202k919k800j604j93N54Q10J430K754M264N283N616N450
61118D32318N031M475L677K410O72j110k488l475m380n205n608n546n480n801
61104D09490o340o668o617o328n995n775n802o029o162n957n432m717l905l208
61090C30555k962l118l039k246j195p98j173j479j102m35j84l47l43J43Q69J481
61074C14627J863K053K107K072J940J698J511J672K160K433J964R90L37N07J173
61059C39107J617J424P19p1n82q00j081j723k592l230l390l152k652j966j348
61044C20280j179j493j805j621r66k18M53J230K314L644M928N806N975N403M535
61029C47286M221N202P508J0331J2716J4460J6263J8904K2511K6790L1758L7884
$$ y = [419230, 417500, 415875, 413673, 410754, 407954, 406350, 406157, 406711, 407521, 408951, 411705, 415969, 421252, 426868, 432318, 437349, 441824, 445501, 447911, 448583, 447473, 444985, 441510, 437130, 431925, 426317, 420771, 415291, 409490, 403150, 396482, 389865, 383537, 377542, 371767, 365965, 359936, 353774, 347817, 342385, 337668, 333763, 330555, 327593, 324475, 321436, 319190, 317995, 317197, 316024, 314545, 313443, 313008, 312824, 312477, 312134, 312277, 313146, 314627, 316490, 318543, 320650, 322722, 324662, 326360, 327871, 329543, 331703, 334136, 336100, 337090, 337427, 337934, 339107, 340724, 342148, 342867, 342796, 342214, 341414, 340333, 338610, 336018, 332788, 329398, 326246, 323594, 321628, 320280, 319101, 317608, 315803, 314182, 313216, 312998, 313451, 314681, 316995, 320639, 325567, 331373, 337348, 342751, 347286, 351507, 356709, 364217, 374548, 387264, 401724, 417987, 436891, 459402, 486192, 517950, 555834]
61017E55834M5665N5228O5965P5829Q1146P8319O6608M9049L0253J3638R99o113
61005A112420o299k80P689J1489O978n517k2170l8858n3320o4639p1671p3022
60993H02800o8691o0831n2262m4482l7473l0973k5212k0508j6801j3837j1466
60982D20264r561p981o599n346m170l108k311j781j255n54J12M54N36N47L74j47
60966C79474p05q46p43j067j988k868l122k886k661k773l333m241n014n056m417
60951C37754l839l849m195m440m530m456l923k913k105k065k328j981q97K57J137
60936B97627J973K720K743J822Q26R18K194L533L745K673J185K15j04l66j025
60921C20679j846k295k209j831j442j246j502k314l290l807l653l174k748k425
$$ y = [555834, 601499, 656727, 722692, 798521, 879667, 957986, 1024594, 1073643, 1103896, 1117534, 1118533, 1112420, 1106121, 1105841, 1113530, 1125019, 1131997, 1126480, 1104310, 1065452, 1012132, 947493, 875822, 802800, 734109, 673278, 621016, 576534, 539061, 508088, 482876, 462368, 445567, 431730, 420264, 410703, 402722, 396123, 390777, 386607, 383499, 381188, 379407, 378152, 377598, 377710, 378164, 378700, 379247, 379621, 379474, 378769, 377923, 377180, 376113, 374125, 371257, 368135, 365249, 362588, 359815, 356482, 352241, 347227, 342171, 337754, 333915, 330066, 325871, 321431, 316901, 312445, 308522, 305609, 303504, 301439, 299111, 297130, 296233, 296490, 297627, 299600, 302320, 305063, 306885, 307711, 308629, 310823, 314356, 318101, 320774, 321959, 322174, 322070, 321704, 320679, 318833, 316538, 314329, 312498, 311056, 309810, 308308, 305994, 302704, 298897, 295244, 292070, 289322, 286897]
60907B86897k120j848j637j473j399j512j722j728j307n01M65J275J623J436J063
60892B77512R03Q90O30Q7k87j89J90N78J002J462J657J454J318J873L167M670
60876B96917N929O806P180O834N753M295K926J884J156O47L07J54J82K45J19k69
60860C41065p93j304j747k054k106j918j637j251n45M22J046P78j33r12j167j226
60844C26518j553k220k982l551l690l378k914k607k279j489l89J57l43j199j313
60829B96768n41K89N98O82R97J436J598J410J118Q82P28O83O46K90n21j255j117
60812C04691j7J227J798J646J224Q02L82P6R4L55M65K01k17m34m10m22o94j132
60794C09635j422j296p44n1L74K61l32r71j170q79n96p61j136j106o23l94q65
$$ y = [286897, 284777, 282929, 281292, 279819, 278420, 276908, 275186, 273458, 272151, 271650, 272115, 273390, 275013, 276449, 277512, 278415, 279305, 279935, 280022, 279735, 279546, 279736, 280314, 281316, 282778, 284435, 285889, 287207, 289080, 292247, 296917, 302846, 309652, 316832, 323666, 329419, 333714, 336640, 338524, 339680, 340327, 340634, 340788, 340970, 341215, 341334, 341065, 340272, 338968, 337221, 335167, 333061, 331143, 329506, 328255, 327710, 328132, 329178, 329956, 329823, 328911, 327744, 326518, 324965, 322745, 319763, 316212, 312522, 309144, 306230, 303623, 301344, 299855, 299466, 299623, 299280, 298081, 296768, 296227, 296516, 297114, 297796, 298793, 300229, 301827, 303237, 304355, 305237, 305965, 306648, 307294, 307584, 307063, 305808, 304691, 304674, 305901, 307699, 309345, 310569, 311371, 311753, 311829, 311923, 312278, 312743, 312944, 312727, 312293, 311883, 311461, 310767, 309635, 308213, 306917, 306173, 306122, 306496, 306757, 306425, 305454, 304284, 303405, 302809, 302048, 300912, 299806, 299183, 298789, 297924]
60777B97924j487j425o95j0K97N47R18J042O57Q6k43l33l44j36M70J250J765J923
60759C02206J970K104K324K534K495J875O27o90j364j214o48j64q9o50j815l036
60743C06465l559l154k328j727j543j549j417r45k48K19Q1m01m66K25J100J407
60727B92160J152R80J218J438J129L80l33q31j289j736j881j648j498j847k426
60712B84968k640k460k425k689k704k103j361j114j264j279j039p90n17m7L89
60697B62925M11K75O01J209J119M6q77n61N27J011L83n44p45Q8J558K821K960
60680B73207J832N32M26J540K592K677K268K158K206J789J024P24J257K183L073
60665B99488M034N108N795N577M716L999L798L799L684L580L628L498K741J553
$$ y = [297924, 296437, 295012, 294317, 294307, 294604, 295151, 296069, 297111, 297768, 297854, 297611, 297278, 296934, 296798, 297268, 298518, 300283, 302206, 304176, 306280, 308604, 311138, 313633, 315508, 316135, 315445, 314081, 312867, 312219, 312055, 311966, 311316, 309501, 306465, 302906, 299752, 297424, 295697, 294154, 292605, 291188, 290243, 289995, 290214, 290295, 289894, 289428, 289653, 290753, 292160, 293312, 294292, 295510, 296948, 298077, 298457, 298124, 297293, 296004, 294268, 292387, 290739, 289241, 287394, 284968, 282328, 279868, 277443, 274754, 272050, 269947, 268586, 267472, 266208, 264929, 263890, 263100, 262583, 262536, 262925, 263336, 263611, 264212, 265421, 266540, 266586, 265709, 265148, 265675, 266686, 267069, 266525, 265780, 265868, 267426, 270247, 273207, 275039, 275571, 275997, 277537, 280129, 282806, 285074, 287232, 289438, 291227, 292251, 292975, 294232, 296415, 299488, 303522, 308630, 314425, 320002, 324718, 328717, 332515, 336314, 339998, 343578, 347206, 350704, 353445, 354998]
60651C54998P05O04P56M44l56j101j568k117k920l450l158k367j947k192k445
60636C33886k045j077o0P13J125R40J39o19m80M85J264J092L02k87l98l66m42
60619C34172m73j99M61J313J887J639N18p39j260j010q26j400k524l444l715l462
60603C20938l048k644k177j478n39L68P81M00n96j529j708j042j80K02J56K99
60587C08203Q29J197R26L35P7K84O08Q91J218J492J490J296J141R17L96o4K50
60570C21486J346K320K455K005J563J302J164J252J567J767J682J677K118K800
60556C46504L438M229N400O531P021P016P225P948Q948J0179J1900J3998J5915
60543D56252J7398J8795K0382K1870K2722K2530K0895J7525J2748P528K635j909
$$ y = [354998, 355703, 356307, 357063, 357507, 357151, 356050, 354482, 352365, 349445, 345995, 342837, 340470, 338523, 336331, 333886, 331841, 330764, 330704, 331417, 332542, 333482, 333621, 333002, 332522, 333007, 334271, 335363, 335665, 335378, 334980, 334614, 334172, 333699, 333500, 333961, 335274, 337161, 338800, 339318, 338579, 337319, 336309, 335483, 334083, 331559, 328115, 324400, 320938, 317890, 315246, 313069, 311591, 311052, 311420, 312201, 312601, 312005, 310476, 308768, 307726, 307546, 307748, 307904, 308203, 309032, 310229, 311155, 311490, 311567, 311851, 312459, 313350, 314568, 316060, 317550, 318846, 319987, 320904, 321300, 321236, 321486, 322832, 325152, 327607, 329612, 331175, 332477, 333641, 334893, 336460, 338227, 339909, 341586, 343704, 346504, 349942, 354171, 359571, 366102, 373123, 380139, 387364, 395312, 404260, 414439, 426339, 440337, 456252, 473650, 492445, 512827, 534697, 557419, 579949, 600844, 618369, 631117, 638645, 641280, 639371]
60531F39371o366j0628j4334j7233j9083j9496j8361j6250j4010j1984r979p934
60519D73713o154m778l355j271J489M272O518Q391J0443J2735J4678J5891J6815
60506E49387J7980J8914J8436J6067J2470Q346L620j713o601r646j0585j0238
60494F06437r074o703l056Q58L968O496R550J3653J8217K2466K6231K9842L3798
60481G52683L8716M5043N2523O0328O8067P6211Q5038R3481R9519J01484R8419
60470A571512Q9571P4488N3823K9299K524k5361n2591p6209r3551j04021j08762
60459A360722j08944j05148r8170q9438q0281p1288o2554n4119m6102l8831l2930
60448E72917k8806k5941k3185j9945j6686j4106j2312j1004j0014r276q536p545
$$ y = [639371, 633005, 622377, 608043, 590810, 571727, 552231, 533870, 517620, 503610, 491626, 481647, 473713, 467559, 462781, 459426, 458155, 459644, 463916, 470434, 478825, 489268, 502003, 516681, 532572, 549387, 567367, 586281, 604717, 620784, 633254, 641600, 645220, 643507, 636906, 627260, 616675, 606437, 597363, 590660, 587604, 588462, 592430, 598926, 608476, 622129, 640346, 662812, 689043, 718885, 752683, 791399, 836442, 888965, 949293, 1017360, 1093571, 1178609, 1272090, 1371609, 1473093, 1571512, 1661083, 1735571, 1789394, 1818693, 1821217, 1795856, 1743265, 1667056, 1573505, 1469484, 1360722, 1251778, 1146630, 1048460, 959022, 878741, 807453, 744899, 690780, 644678, 605847, 572917, 544111, 518170, 494985, 475040, 458354, 444248, 431936, 420932, 410918, 401642, 393106, 385561]
60436C85561o337n170m256l704l519l502l384l154k946k649j991j185r33j487
60422C41344k117j905q10L92R52O88j8m20L0R96J417P94n6k6Q63J684J991K219
60404C48018K742L333L718M049M488M791M604L982L277K772K542K541K649K716
60390C96222K613K279J776J403J497J930K058J479O20J21n0l15n78l43K71N09
60374D11492J68J2O07J410J581J124O91O77J043J704K443K792K540K148K087K023
60358D34542J419O53O71J504K010J407K45n00o26n18l01J16M90M34Q7P4Q10K151
60340D44668L648M711M708L437J635M42K17K14m12j714l289m926o464p356p036
60325D32483n736m438l908m077m418m533m214l326j961n74L39O53O34N73N21L00
$$ y = [385561, 379224, 374054, 369798, 366094, 362575, 359073, 355689, 352535, 349589, 346940, 344949, 343764, 342831, 341344, 339227, 337322, 336512, 336904, 337856, 338544, 338526, 338106, 338136, 339132, 340549, 341343, 341287, 341261, 342124, 343808, 345799, 348018, 350760, 354093, 357811, 361860, 366348, 371139, 375743, 379725, 383002, 385774, 388316, 390857, 393506, 396222, 398835, 401114, 402890, 404293, 405790, 407720, 409778, 411257, 411877, 411998, 411948, 411633, 411055, 410712, 410983, 411492, 411660, 411672, 412279, 413689, 415270, 416394, 417085, 417762, 418805, 420509, 422952, 425744, 428284, 430432, 432519, 434542, 435961, 436614, 437285, 438789, 440799, 442206, 442451, 441951, 441325, 440807, 440506, 440622, 441112, 441546, 441633, 441707, 442517, 444668, 448316, 453027, 457735, 461172, 462807, 463249, 463466, 463680, 463268, 461554, 458265, 453339, 446875, 439519, 432483, 426747, 422309, 418401, 414324, 409906, 405373, 401159, 397833, 395872, 395298, 395637, 396290, 396924, 397497, 398018, 398318]
60309C98318k57j050j762k261k887m006n325o020n767n194n009n056m675l734
60295C45315k734j998j343o48j47jk3o9l09p99j097p06K77J231J643J463J022
60278C41077Q38J350K489L588L955L540K841K265J884J675J666J765J802J789
60264C72524J927K272K610K727K615K376K095J878J776J658J394J209J510K251
60250D00822K882L118L369M054M903N419N743O465P712R066J0327J1708J3114
60237D88702J4039J4470J5245J7020J9408K1765K4321K7676L1500L4652L6755
60226G45553L8691M1253M4011M6041M7248M8279M9356M9784M8691M5944M2175
60215A247026L8113L3873K8977K3104J6723J0694N229k75o184j1861j6272j9080
$$ y = [398318, 398061, 397011, 395249, 392988, 390101, 386095, 380770, 374750, 368983, 363789, 358780, 353724, 349049, 345315, 342581, 340583, 339240, 338592, 338445, 338444, 338421, 338352, 338043, 337244, 336147, 335441, 335718, 336949, 338592, 340055, 341077, 341915, 343265, 345754, 349342, 353297, 356837, 359678, 361943, 363827, 365502, 367168, 368933, 370735, 372524, 374451, 376723, 379333, 382060, 384675, 387051, 389146, 391024, 392800, 394458, 395852, 397061, 398571, 400822, 403704, 406822, 410191, 414245, 419148, 424567, 430310, 436775, 444487, 453553, 463880, 475588, 488702, 502741, 517211, 532456, 549476, 568884, 590649, 614970, 642646, 674146, 708798, 745553, 784244, 825497, 869508, 915549, 962797, 1011076, 1060432, 1110216, 1158907, 1204851, 1247026, 1285139, 1319012, 1347989, 1371093, 1387816, 1398510, 1403739, 1403464, 1397280, 1385419, 1369147, 1350067]
60203A350067k0685k1493k1534k0714j8934j6120j2496q611m709k79N242J1414
60191A221148J7193K2342K7731L4016M0669M6634N1378N4876N7063N7797N7032
60180A687879N4680N0568M4917L8461L1685K4266J5746O480k699j1450j9942k7985
60168A892606l4890m0271m4378m7411m9035m8822m6799m3310l8644l3041k6749
60157A439256j9851j2298m302L531J0646J6864K2197K6673L0489L3903L6631L7739
60145A621478L6625L3848L0511K6979K2750J7516J1726O028O99m193q430j1799
60133A783738j4241j5578j5326j3166r420m765M22O285J3061K0700K8827L6988
60121A817525M4969N3067O1841P1423Q1171R0285R8618J06524J14000J20344J24839
$$ y = [1350067, 1329382, 1307889, 1286355, 1265641, 1246707, 1230587, 1218091, 1209480, 1204771, 1204492, 1209734, 1221148, 1238341, 1260683, 1288414, 1322430, 1363099, 1409733, 1461111, 1515987, 1573050, 1630847, 1687879, 1742559, 1793127, 1838044, 1876505, 1908190, 1932456, 1948202, 1954682, 1951983, 1940533, 1920591, 1892606, 1857716, 1817445, 1773067, 1725656, 1676621, 1627799, 1581000, 1537690, 1499046, 1466005, 1439256, 1419405, 1407107, 1402805, 1406336, 1416982, 1433846, 1456043, 1482716, 1513205, 1547108, 1583739, 1621478, 1658103, 1691951, 1722462, 1749441, 1772191, 1789707, 1801433, 1807461, 1808160, 1803967, 1795537, 1783738, 1769497, 1753919, 1738593, 1725427, 1716007, 1711242, 1711664, 1717949, 1731010, 1751710, 1780537, 1817525, 1862494, 1915561, 1977402, 2048825, 2129996, 2220281, 2318899, 2425423, 2539423, 2659767, 2784606]
60110B784606J27395J28315J27606J24709J18907J09890R8143Q4767P0665N5774
60100C830777L9332K1093K030j6376l3309m8753o2751p5023q5356r3786j00211
60089C377667j04141j05172j03573j00165r5663r0243q3691p5814o6811n7375
60079B495019m8306l9916l1839k3600j5323p698j268M050Q743J3096J6934J9821
60067B389713K1395K1567K0571J8780J6374J3065Q287J820n708j3072j9401k4846
60055B448545l0197l5820m1215m5677m9160n2113n4551n5759n5129n2981n0164
60044A925779m7037m3257l8516l2976k6860k0156j2960n703J339Q430J5817K3160
60032A747060L0067L6935M4374N1827N7639O0789O1861O1790O0379N6741N0735
$$ y = [2784606, 2912001, 3040316, 3167922, 3292631, 3411538, 3521428, 3619571, 3704338, 3775003, 3830777, 3870109, 3891202, 3893232, 3876856, 3843547, 3794794, 3732043, 3657020, 3571664, 3477878, 3377667, 3273526, 3168354, 3064781, 2964616, 2868953, 2778710, 2695019, 2619205, 2552394, 2495019, 2446713, 2406797, 2374958, 2351358, 2336035, 2328337, 2327069, 2331119, 2339862, 2352958, 2369892, 2389713, 2411108, 2432675, 2453246, 2472026, 2488400, 2501465, 2509752, 2511572, 2505864, 2492792, 2473391, 2448545, 2418348, 2382528, 2341313, 2295636, 2246476, 2194363, 2139812, 2084053, 2028924, 1975943, 1925779, 1878742, 1835485, 1796969, 1763993, 1737133, 1716977, 1704017, 1698314, 1699653, 1708083, 1723900, 1747060, 1777127, 1814062, 1858436, 1910263, 1967902, 2028691, 2090552, 2152342, 2212721, 2269462, 2320197]
60021B320197M3147L4617K5116J4546L256q175j9226k9470l8701m7089n4785o1252
60009B182181o5367o6450o4935o1931n8286n4117m9074m2967l6201k9504k3102
59998A630247j6446q983r56P044J5020K3424L2174M0605M8477N6291O4249P1550
59986A962696P7142Q0664Q2305Q2102P9808P5084O7607N7436M5521L3302K1363
59975B665030R013m298j7753l0000m0679n0264n8675o5018o8690o9931o9096o6090
59963B133549o0781n3536m5144l6402k7823j9445j0978k381N922J3685K1296K9036
59951A946998L6265M2091M6657N0770N4276N5910N4933N2076M8306M3666L7837
59940B469785L1201K4594J8389J2516P105K550r47l423m884n190m002p32M901
$$ y = [2320197, 2363344, 2397961, 2423077, 2437623, 2440879, 2432704, 2413478, 2384008, 2345307, 2298218, 2243433, 2182181, 2116814, 2050364, 1985429, 1923498, 1865212, 1811095, 1762021, 1719054, 1682853, 1653349, 1630247, 1613801, 1604818, 1603862, 1610906, 1625926, 1649350, 1681524, 1722129, 1770606, 1826897, 1891146, 1962696, 2039838, 2120502, 2202807, 2284909, 2364717, 2439801, 2507408, 2564844, 2610365, 2643667, 2665030, 2674043, 2669745, 2651992, 2621992, 2581313, 2531049, 2472374, 2407356, 2338666, 2268735, 2199639, 2133549, 2072768, 2019232, 1974088, 1937686, 1909863, 1890418, 1879440, 1877059, 1882981, 1896666, 1917962, 1946998, 1983263, 2025354, 2072011, 2122781, 2177057, 2232967, 2287900, 2339976, 2388282, 2431948, 2469785, 2500986, 2525580, 2543969, 2556485, 2563590, 2566140, 2565193, 2561770, 2556886, 2551696, 2547694, 2546962, 2551863]
59927B551863J2180J9817K7495L6267M6829N8131O8445P7406Q5941R4478J02136
59916C180988J07705J10599J10718J08114J02922R5146Q4394P0357N3556L5126
59906D059625J5946l537k2656m0442n6249o9882q1119q9673r5620r9100r9657
59895C417636r6854r1568q5592p9513p2143o2649n2148m2244l2916k3098j2757
59884B766154l042N391J3006K0250K6838L2437L7128M0951M3547M4529M3647M0557
59872C111393L5017K7504J8971R851j24j0926k1819l2146m1838n0705n7933o2946
59860B924299o6347o9265p1966p3710p3894p2892p1650p0783p0054o8668o6067
59849B149003o2513n8771n5278n1926m8603m5444m2416l9197l5816l2880l0785
$$ y = [2551863, 2564043, 2583860, 2611355, 2647622, 2694451, 2752582, 2821027, 2898433, 2984374, 3078852, 3180988, 3288693, 3399292, 3510010, 3618124, 3721046, 3816192, 3900586, 3970943, 4024499, 4059625, 4075571, 4072034, 4049378, 4008936, 3952687, 3882805, 3801686, 3712013, 3616393, 3517293, 3417636, 3320782, 3229214, 3143622, 3064109, 2991966, 2929317, 2877169, 2834925, 2802009, 2778911, 2766154, 2763112, 2768503, 2781509, 2801759, 2828597, 2861034, 2898162, 2939113, 2982660, 3027189, 3070836, 3111393, 3146410, 3173914, 3192885, 3202736, 3202612, 3191686, 3169867, 3137721, 3095883, 3045178, 2987245, 2924299, 2857952, 2788687, 2716721, 2643011, 2569117, 2496225, 2424575, 2353792, 2283738, 2215070, 2149003, 2086490, 2027719, 1972441, 1920515, 1871912, 1826468, 1784052, 1744855, 1709039, 1676159, 1645374]
59838A645374k9076k7070k4740k2547k0709j9128j7790j6715j5720j4685j3874
59827A423320j3508j3305j2827j2090j1261j0110q355o304m444k542N5L306O417
59814A338352Q873J0799J2339J3534J4826J6732J8802J9836J9483J8737J8406
59803A510719J7930J6416J4058J1753R860Q093O315M765L719L466M329O194Q450
59790A626067J0909J4392J9716K6467L3603M0968M9371N9174O9739Q0446R1530
59779B122382J03570J16549J29637J41494J50427J54444J51397J39323J17104
59770C326327Q5330M6540M512l6658p3037j01374j20093j29714j31818j27798
59760B742217j18840j06574r2767p8443o4048n0278l8049k7591j8438j0371l600
$$ y = [1645374, 1616298, 1589228, 1564488, 1541941, 1521232, 1502104, 1484314, 1467599, 1451879, 1437194, 1423320, 1409812, 1396507, 1383680, 1371590, 1360329, 1350219, 1341864, 1335560, 1331116, 1328574, 1328629, 1331935, 1338352, 1347225, 1358024, 1370363, 1383897, 1398723, 1415455, 1434257, 1454093, 1473576, 1492313, 1510719, 1528649, 1545065, 1559123, 1570876, 1580736, 1588829, 1595144, 1599909, 1603628, 1607094, 1611423, 1617617, 1626067, 1636976, 1651368, 1671084, 1697551, 1731154, 1772122, 1821493, 1880667, 1950406, 2030852, 2122382, 2225952, 2342501, 2472138, 2613632, 2764059, 2918503, 3069900, 3209223, 3326327, 3411657, 3458197, 3462709, 3426051, 3353014, 3251640, 3131547, 3001833, 2870015, 2742217, 2623377, 2516803, 2424036, 2345593, 2281545, 2231267, 2193218, 2165627, 2147189, 2136818, 2133218]
59749B133218K086P556J3437J9560K5554L1343L6883M2070M7190N2854N9201O5799
59737B536751P2581Q0169Q8856R8041J07188J16722J27327J38888J50781J62788
59727C680092J75070J87559J99998K12297K24135K34437K41791K45350K44886
59718E645615K40242K31313K18461K02389J83681J62991J41686J21766J04989
59709G253133R2161Q3115P6999P2774O9869O8333O8140O8551O8515O7429O5165
59698H054184O1626N6779N0984M4686L8032L1269K5294K1091J8619J7130J6688
59687H436382J8604K3997L2518M2914N4469O7430Q2309R9137J17273J35665J53282
59676I263980J69438J83705J95674K04933K11079K13304K10101J99930J82341
$$ y = [2133218, 2135304, 2142860, 2156297, 2175857, 2201411, 2232754, 2269637, 2311707, 2358897, 2411751, 2470952, 2536751, 2609332, 2689501, 2778357, 2876398, 2983586, 3100308, 3227635, 3366523, 3517304, 3680092, 3855162, 4042721, 4242719, 4455016, 4679151, 4913588, 5155379, 5400729, 5645615, 5885857, 6117170, 6335631, 6538020, 6721701, 6884692, 7026378, 7148144, 7253133, 7345294, 7428409, 7505408, 7578182, 7648051, 7716384, 7784524, 7853075, 7921590, 7989019, 8054184, 8115810, 8172589, 8223573, 8268259, 8306291, 8337560, 8362854, 8383945, 8402564, 8419694, 8436382, 8454986, 8478983, 8511501, 8554415, 8608884, 8676314, 8758623, 8857760, 8975033, 9110698, 9263980, 9433418, 9617123, 9812797, 10017730, 10228809, 10442113, 10652214, 10852144, 11034485]
59667A1034485J58042J27776R1741N0357N116m1806q8420j33018j73708k08556
59657A0822009k36196k55999k67744k71539k68256k59776k48706k37982k30654
59648H545157k29525k36373k51120k71715k94814l16679l33840l43550l44391
59639E923150l36758l22506l03912k82789k60492k38178k16726j96482j77471
59630C587836j59825j43874j29867j17824j07514r8333q9497q0692p2464o5528
59620B522418n9772n4354m8706m3074l8044l3977l0856k8332k5892k3461k1754
59609B114196k1443k2099k2611k2718k3325k5025k7118k8551k9125k9184k8766
59598A834231k7749k6473k5432k4556k3432k2009k0566j9150j7575j5835j3959
$$ y = [11034485, 11192527, 11320303, 11412044, 11462401, 11467517, 11425711, 11337291, 11204273, 11030565, 10822009, 10585813, 10329814, 10062070, 9790531, 9522275, 9262499, 9013793, 8775811, 8545157, 8315632, 8079259, 7828139, 7556424, 7261610, 6944931, 6611091, 6267541, 5923150, 5586392, 5263886, 4959974, 4677185, 4416693, 4178515, 3961789, 3765307, 3587836, 3428011, 3284137, 3154270, 3036446, 2928932, 2830599, 2741102, 2660410, 2587946, 2522418, 2462646, 2408292, 2359586, 2316512, 2278468, 2244491, 2213635, 2185303, 2159411, 2135950, 2114196, 2092753, 2070654, 2048043, 2025325, 2002000, 1976975, 1949857, 1921306, 1892181, 1862997, 1834231, 1806482, 1780009, 1754577, 1730021, 1706589, 1684580, 1664014, 1644864, 1627289, 1611454, 1597495]
59587A597495j1748r184o876n405m389k930q82J086K676M276O059P632Q924J0535
59573A597269J2676J4562J5507J6018J7084J8728K0108K0886K1730K3440K6162
59562A804170K9537L3167L6740M0086M3316M6697N0234N3610N6696O0008O4367
59551B318628O9898P5309P8384P7527P3017O6503N9296N1534M3108L4842K8013
59540B976059K2998J8916J4679R882M660p08n930j0838j5668k0806k6061l0567
59528B936616l3686l5639l7013l7989l8425l8350l7801l6360l3351k8589k2538
59517B556875j5605p702J307J1013K0650K9873L9151M9229O0217P1252Q1204Q9596
59505B987060R6616J02230J05717J06280J03685R8002Q9068P6749O1443M3824
$$ y = [1597495, 1585747, 1576563, 1569687, 1564282, 1559893, 1556963, 1556081, 1557167, 1559843, 1564119, 1570178, 1577810, 1586734, 1597269, 1609945, 1624507, 1640014, 1656032, 1673116, 1691844, 1711952, 1732838, 1754568, 1778008, 1804170, 1833707, 1866874, 1903614, 1943700, 1987016, 2033713, 2083947, 2137557, 2194253, 2254261, 2318628, 2388526, 2463835, 2542219, 2619746, 2692763, 2759266, 2818562, 2870096, 2913204, 2948046, 2976059, 2999057, 3017973, 3032652, 3042534, 3047194, 3046486, 3040556, 3029718, 3014050, 2993244, 2967183, 2936616, 2902930, 2867291, 2830278, 2792289, 2753864, 2715514, 2677713, 2641353, 2608002, 2579413, 2556875, 2541270, 2533568, 2534875, 2545888, 2566538, 2596411, 2635562, 2684791, 2745008, 2816260, 2897464, 2987060, 3083676, 3185906, 3291623, 3397903, 3501588, 3599590, 3688658, 3765407, 3826850, 3870674]
59495C870674K4254L140j8255l8166n5677p0974q4049r3883r9446j00914r9304
59484C237400r5387q9492q2026p3418o3788n3283m2612l2627k3448j4631o209
59473B660479J097O759J0988J4124J6031J6387J5256J2994R799N557N2o825j4847
59460B747851k3375l1652l9219m5979n1917n7004o1347o5057o8021p0060p1232
59449B162988p1699p1308o9773o7247o4250o0969n7208n3135m9471m6614m4104
59438A507210m1250l7874l4108l0065k6098k2883k0558j8266j5145j1506q227
59427A241230n175j211M016R066J1914J1824R631O550L153m85l967o228o154l555
59413A270609P06N470R815J2684J2801R718M757R3l178n416o956p218n707l044
$$ y = [3870674, 3894928, 3898068, 3879813, 3841647, 3785970, 3714996, 3630947, 3537064, 3437618, 3336704, 3237400, 3142013, 3052521, 2970495, 2897077, 2833289, 2780006, 2737394, 2704767, 2681319, 2666688, 2660479, 2661576, 2668335, 2679323, 2693447, 2709478, 2725865, 2741121, 2754115, 2763914, 2769471, 2769523, 2762698, 2747851, 2724476, 2692824, 2653605, 2607626, 2555709, 2498705, 2437358, 2372301, 2304280, 2234220, 2162988, 2091289, 2019981, 1950208, 1882961, 1818711, 1757742, 1700534, 1647399, 1597928, 1551314, 1507210, 1465960, 1428086, 1393978, 1363913, 1337815, 1314932, 1294374, 1276108, 1260963, 1249457, 1241230, 1236055, 1234844, 1238860, 1247926, 1259840, 1271664, 1281295, 1287845, 1290998, 1290513, 1286546, 1280318, 1274164, 1270609, 1271315, 1276785, 1286600, 1299284, 1312085, 1321803, 1326560, 1326653, 1323475, 1318059, 1311103, 1303885, 1298178, 1295134]
59399A295134k17K687O141R887J2998J5238J7565K0809K4514K7592K9761L1772
59387A493881L4393L7635M1018M4181M7140N0198N3688N7593O1523O5222O9130
59376B055602P4025Q0132Q6941R4060J01721J10242J19470J29231J39824J51490
59366C142738J63691J75600J87117J98662K10003K20006K27639K32517K34329
59357D992302K32507K26791K17464K04755J88703J69907J49626J28570J06300
59348F616925Q2490N8017L4004J0411j3495l7685o1468q4758j08084j31379j53763
59337F211215j74561j93568k10144k23001k31328k35321k35394k31664k24545
59328D251689k15087k04182j92029j78800j65185j51839j38924j26643j15599
$$ y = [1295134, 1294917, 1297604, 1303745, 1313632, 1326630, 1341868, 1359433, 1380242, 1404756, 1432348, 1462109, 1493881, 1528274, 1565909, 1606927, 1651108, 1698248, 1748446, 1802134, 1859727, 1921250, 1986472, 2055602, 2129627, 2209759, 2296700, 2390760, 2492481, 2602723, 2722193, 2851424, 2991248, 3142738, 3306429, 3482029, 3669146, 3867808, 4077811, 4297817, 4525456, 4757973, 4992302, 5224809, 5451600, 5669064, 5873819, 6062522, 6232429, 6382055, 6510625, 6616925, 6699415, 6757432, 6791436, 6801847, 6788352, 6750667, 6689199, 6604441, 6496357, 6364978, 6211215, 6036654, 5843086, 5632942, 5409941, 5178613, 4943292, 4707898, 4476234, 4251689, 4036602, 3832420, 3640391, 3461591, 3296406, 3144567, 3005643, 2879000, 2763401]
59319B763401j06017r7191q8477q0328p3549o7861o2150n6061n0529m6494m3767
59308A990977m1383l8649l5587l2632l0127k8047k6098k4080k2005j9842j7432
59297A675095j4935j2973j1845j0827q763n405j732J162L140M917P186R990J2778
59284A647788J5015J6749J8485K0414K1980K2536K2193K1597K0924J9615J7250
59273A864546J4243J1286Q361M747N2n129r801j3629j7113k0699k4119k6911k9214
59260A756620l1493l3586l4671l4385l3396l2568l2052l1521l0786k9718k8000
59249A404444k5569k3002k0854j8837j6219j2873r392o363m066k647j828n99J952
59236A264147N463Q676J1005J2948J4914J6642J8101J9921K2394K4847K6721K8595
$$ y = [2763401, 2657384, 2560193, 2471716, 2391388, 2317839, 2249978, 2187828, 2131767, 2081238, 2034744, 1990977, 1949594, 1910945, 1875358, 1842726, 1812599, 1784552, 1758454, 1734374, 1712369, 1692527, 1675095, 1660160, 1647187, 1635342, 1624515, 1615752, 1610347, 1608615, 1609777, 1612917, 1617834, 1625020, 1635010, 1647788, 1662803, 1679552, 1698037, 1718451, 1740431, 1762967, 1785160, 1806757, 1827681, 1847296, 1864546, 1878789, 1890075, 1898436, 1903183, 1903235, 1898106, 1888305, 1874676, 1857563, 1836864, 1812745, 1785834, 1756620, 1725127, 1691541, 1656870, 1622485, 1589089, 1556521, 1524469, 1492948, 1462162, 1432444, 1404444, 1378875, 1355873, 1335019, 1316182, 1299963, 1287090, 1277698, 1271335, 1267269, 1264622, 1262794, 1262195, 1264147, 1269610, 1278286, 1289291, 1302239, 1317153, 1333795, 1351896, 1371817, 1394211, 1419058, 1445779, 1474374]
59224A474374L1391L5122L9173M3412M8092N3019N7791O2752O8791P6030Q3575
59213B073522R0801R8190J06444J15319J23719J30711J36095J40124J42835J43519
59203C301279J40812J33554J21646J05859Q6843O4759L9957J3468j3436l9906
59193C954835o5358q8968j09623j26363j38613j46297j49884j50175j47695j42537
59183B689322j35015j26225j17367j08736r9843r0595q1682p3664o6258n8982
59173A730955n2074m6269m1815l8236l4978l1817k8693k5564k2676k0534j9339
59162A368960j8656j7897j6959j6201j5869j5812j5776j5753j6042j6908j8169
59151A184918j9137j9130j8161j6939j6087j5568j5018j4388j3985j3941j3940
$$ y = [1474374, 1505765, 1540887, 1580060, 1623472, 1671564, 1724583, 1782374, 1845126, 1913917, 1989947, 2073522, 2164323, 2262513, 2368957, 2484276, 2607995, 2738706, 2874801, 3014925, 3157760, 3301279, 3442091, 3575645, 3697291, 3803150, 3889993, 3954752, 3994709, 4008177, 3994741, 3954835, 3889477, 3800509, 3690886, 3564523, 3425910, 3279613, 3129729, 2979554, 2831859, 2689322, 2554307, 2428082, 2310715, 2201979, 2102136, 2011541, 1929859, 1856195, 1789937, 1730955, 1678881, 1632612, 1590797, 1552561, 1517583, 1485766, 1457073, 1431509, 1408833, 1388299, 1368960, 1350304, 1332407, 1315448, 1299247, 1283378, 1267566, 1251790, 1236037, 1219995, 1203087, 1184918, 1165781, 1146651, 1128490, 1111551, 1095464, 1079896, 1064878, 1050490, 1036505, 1022564, 1008624]
59140A008624j3503j2358j0650q937p940p914q268q105p137n856m790l891k802
59127I06473j419k2J038J632J964K448L332M447N465O313P079P662P904Q048Q497
59112I70861R027Q830P695O562O339O628O267M986L814L796M857O095O737O719
59098A059213O687P540R611J2153J3958J4651J5001J5828J7010J7877J8282J8733
59086A226544J9580K0485K0870K0584J9941J9161J8027J6206J3745J1075Q453
59075A414671N656K406j107m417p386j0294j3319j6343j9224k1865k3889k4787
59063A280102k4655k4387k4686k5233k5244k4618k3889k3251k2300k0900j9619
59052A021320j8952j8548j7690j6266j4810j3661j2580j1166r365p402n535m029
$$ y = [1008624, 995121, 982763, 972113, 963176, 955236, 947322, 939054, 930949, 923812, 917956, 913166, 909275, 906473, 905054, 905032, 906070, 907702, 909666, 912114, 915446, 919893, 925358, 931671, 938750, 946412, 954316, 962364, 970861, 979888, 988718, 996413, 1002975, 1009314, 1015942, 1022209, 1027195, 1031009, 1034805, 1039662, 1045757, 1052494, 1059213, 1065900, 1073440, 1083051, 1095204, 1109162, 1123813, 1138814, 1154642, 1171652, 1189529, 1207811, 1226544, 1246124, 1266609, 1287479, 1308063, 1328004, 1347165, 1365192, 1381398, 1395143, 1406218, 1414671, 1420327, 1422733, 1421626, 1417209, 1409823, 1399529, 1386210, 1369867, 1350643, 1328778, 1304889, 1280102, 1255447, 1231060, 1206374, 1181141, 1155897, 1131279, 1107390, 1084139, 1061839, 1040939, 1021320, 1002368, 983820, 966130, 949864, 935054, 921393, 908813, 897647, 888282, 880880, 875345, 871316]
59040H71316l180l076l401l700l823l952m196m353m260m159m493n320o220o796
59026H10387p109p426p762p873p609p050o398n919n878o220o368n762m631l829
59012G20553l727l724l164k285j759j603j204k95P10J461K097K757L208L334L510
58997G19869M116N009N878O780P833Q740R192R523J0366J1655J2646J2953J2935
58984H37495J2940J2760J2151J1280J0310R053P439N974N101M493L541K403J857
58971I36797K110K456K289J957K182K990L700L783L414L132L282L879M809N890
58957I82670O836P314P210O742O247N923N869O207O940P731Q221Q633R625J1285
58943A087453J2669J2766J1771J0902J1026J1976J3156J4261J5153J5579J5468
$$ y = [871316, 868136, 865060, 861659, 857959, 854136, 850184, 845988, 841635, 837375, 833216, 828723, 823403, 817183, 810387, 803278, 795852, 788090, 780217, 772608, 765558, 759160, 753241, 747363, 741143, 734775, 729013, 724382, 720553, 716826, 713102, 709938, 707653, 705894, 704291, 703087, 702792, 703502, 704963, 707060, 709817, 713025, 716359, 719869, 723985, 728994, 734872, 741652, 749485, 758225, 767417, 776940, 787306, 798961, 811607, 824560, 837495, 850435, 863195, 875346, 886626, 896936, 905989, 913428, 919402, 924503, 928996, 932537, 934940, 936797, 938907, 941363, 943652, 945609, 947791, 950781, 954481, 958264, 961678, 964810, 968092, 971971, 976780, 982670, 989506, 996820, 1004030, 1010772, 1017019, 1022942, 1028811, 1035018, 1041958, 1049689, 1057910, 1066543, 1076168, 1087453, 1100122, 1112888, 1124659, 1135561, 1146587, 1158563, 1171719, 1185980, 1201133, 1216712, 1232180]
58932A232180J5358J6061J7894K0414K2908K4950K6619K8323L0445L2908L5169
58921A503229L6873L8445M0724M3829M6818M8814N0258N2465N5970N9837O2955
58910B040217O5478O8360P1892P5438P8573Q1638Q4962Q8386R1948R6349J02064
58899B945305J08482J14579J20093J25275J29932J33492J35837J37091J36670
58890D086756J33564J27754J20411J12338J03194R2702Q1778P1599O2080N2069
58880E044245M0798K8456J5666K925r500k1732l4233m7177n9972p1718q1998r0895
58868D714865r8509j04838j09963j13932j16706j18467j19690j20417j19943j17795
58858C574605j14691j11759j09088j05892j01897r7662r3505q9024q3938p8603
$$ y = [1232180, 1247538, 1263599, 1281493, 1301907, 1324815, 1349765, 1376384, 1404707, 1435152, 1468060, 1503229, 1540102, 1578547, 1619271, 1663100, 1709918, 1758732, 1808990, 1861455, 1917425, 1977262, 2040217, 2105695, 2174055, 2245947, 2321385, 2399958, 2481596, 2566558, 2654944, 2746892, 2843241, 2945305, 3053787, 3168366, 3288459, 3413734, 3543666, 3677158, 3812995, 3950086, 4086756, 4220320, 4348074, 4468485, 4580823, 4684017, 4776719, 4858497, 4930096, 4992176, 5044245, 5085043, 5113499, 5129165, 5132090, 5122590, 5100858, 5066625, 5019448, 4959476, 4887758, 4805760, 4714865, 4616356, 4511518, 4401555, 4287623, 4170917, 4052450, 3932760, 3812343, 3692400, 3574605, 3459914, 3348155, 3239067, 3133175, 3031278, 2933616, 2840111, 2751087, 2667149, 2588546]
58848B588546p3378o8182o2951n7921n3191m8595m4205m0340l6818l2952k8716
58837B041297k5010k2264j9559j5977j2113r295p625n927l445o76J637L509N438
58824A929990P767J0600J3886J7316K0430K3013K5189K7169K9162L1514L4506
58813B170542L8055M1897M6089N0846N5985O1005O5787P0732P6103Q1717Q7449
58802B846207R3523R9978J06294J11936J16888J21381J25447J29116J32665J36148
58792D019583J38897J40030J39350J37296J34074J29373J23033J15373J06670
58783E183679R6574Q4469P0122N3698L5224J4330r330l5466o2886q9729j14114
58772E226571j34805j51459j64217j73117j77946j78675j75971j71135j65498
$$ y = [2588546, 2515168, 2446986, 2384035, 2326114, 2272923, 2224328, 2180123, 2139783, 2102965, 2070013, 2041297, 2016287, 1994023, 1974464, 1958487, 1946374, 1937079, 1929454, 1923527, 1920082, 1919406, 1921043, 1924552, 1929990, 1937757, 1948357, 1962243, 1979559, 1999989, 2023002, 2048191, 2075360, 2104522, 2136036, 2170542, 2208597, 2250494, 2296583, 2347429, 2403414, 2464419, 2530206, 2600938, 2677041, 2758758, 2846207, 2939730, 3039708, 3146002, 3257938, 3374826, 3496207, 3621654, 3750770, 3883435, 4019583, 4158480, 4298510, 4437860, 4575156, 4709230, 4838603, 4961636, 5077009, 5183679, 5280253, 5364722, 5434844, 5488542, 5523766, 5538096, 5528766, 5493300, 5430414, 5340685, 5226571, 5091766, 4940307, 4776090, 4602973, 4425027, 4246352, 4070381, 3899246, 3733748]
58763C733748j59761j53833j47239j39764j31793j24014j16813j10050j03387
58754B547094r6748r0309q4213p8481p3157o8240o3443n8365n3115m8454m5006
58743A787563m2442l9835l6735l3608l1140k9550k8639k8180k7994k7814k7414
58732A434212k6802k6128k5387k4339k2732k0618j8495j7108j6888j7525j8256
58721A199934j8629j8865j9349k0061k0726k1307k1985k2756k3353k3631k3658
58710I65614k3363k2452k0849j9107j8033j7965j8416j8486j7468j5254j2357
58699G61864r621p647o438n592m892m582m920n571n757n078l906k772j592P1K077
58684F95644L647M554N868Q915J3552J8043K0859K2191K3476K5803K9121L2813
$$ y = [3733748, 3573987, 3420154, 3272915, 3133151, 3001358, 2877344, 2760531, 2650481, 2547094, 2450346, 2360037, 2275824, 2197343, 2124186, 2055946, 1992503, 1934138, 1881023, 1832569, 1787563, 1745121, 1705286, 1668551, 1634943, 1603803, 1574253, 1545614, 1517434, 1489440, 1461626, 1434212, 1407410, 1381282, 1355895, 1331556, 1308824, 1288206, 1269711, 1252603, 1235715, 1218190, 1199934, 1181305, 1162440, 1143091, 1123030, 1102304, 1080997, 1059012, 1036256, 1012903, 989272, 965614, 942251, 919799, 898950, 879843, 861810, 843845, 825429, 806943, 789475, 774221, 761864, 752243, 744596, 738158, 732566, 727674, 723092, 718172, 712601, 706844, 701766, 697860, 695088, 693496, 693567, 695644, 699291, 703845, 709713, 718628, 732180, 750223, 771082, 793273, 816749, 842552, 871673, 904486]
58672I04486L6489M0081M3432M5990M6851M5115M0331L2655K2577J0622k478j5478
58660A250673k6933l6045m2891m7590m9638m8550m5001m0659l6696l2935k8779
58649H14956k4484k0975j8619j6817j4974j3295j2324j2061j1877j1174r834q104
58637F40418o407n117m291l517k301o59Q60J775K094K104K075K295L105M528N988
58622F42950O751O714O497O745P548Q655R920J1308J2667J3768J4626J5583J6962
58609G80694J8745K0596K2168K3405K4604K6151K8072K9923L1264L2219L3304
58598A071145L4750L6225L7331L8044L8392L7969L6234L3313L0006K6837K3457
58587A443703J9206J4081Q747L764q52n294r605j3709j7468k0533k2438k3112
$$ y = [904486, 940975, 981056, 1024488, 1070478, 1117329, 1162444, 1202775, 1235430, 1258007, 1268629, 1266151, 1250673, 1223740, 1187695, 1144804, 1097214, 1047576, 999026, 954025, 913366, 876670, 843735, 814956, 790472, 769497, 750878, 734061, 719087, 705792, 693468, 681407, 669530, 658356, 648522, 640418, 634011, 628894, 624603, 621086, 618785, 618126, 618986, 620761, 622855, 624959, 627034, 629329, 632434, 636962, 642950, 649701, 656415, 662912, 669657, 677205, 685860, 695780, 707088, 719755, 733523, 748149, 763732, 780694, 799439, 820035, 842203, 865608, 890212, 916363, 944435, 974358, 1005622, 1037841, 1071145, 1105895, 1142120, 1179451, 1217495, 1255887, 1293856, 1330090, 1363403, 1393409, 1420246, 1443703, 1462909, 1476990, 1485737, 1489501, 1488649, 1483355, 1473750, 1460041, 1442573, 1422040, 1399602, 1376490]
58575A376490k3058k2767k2203k1211k0151j9562j9211j8158j6003j3519j1652
58564A168995j0377r124p926p380p485p324o182m514l399l432m521o489r331j2909
58550A068602j6780k0450k3595k5958k7247k7271k6223k4706k3326k2164k0715
58539H10167j8489j5647j2853j0636r150q527q901r973j0999j1599j2173j3138
58527F68082j4049j4077j3189j2189j1601j1073j0083q660p186n857m747m064
58515E51307l913l971l732l106k423j875j292n87r7j92o88r80q01n12m68m52q6
58498E26132M44O17M48N47J096J465J191P75R28J468J653J356J124J221J310J159
58482E42934R25O18L1o81r99q90r27j294j362p67j56l44j163j827k056k126k123
$$ y = [1376490, 1353432, 1330665, 1308462, 1287251, 1267100, 1247538, 1228327, 1210169, 1194166, 1180647, 1168995, 1158618, 1149494, 1141568, 1134188, 1126703, 1119379, 1113197, 1108683, 1105284, 1101852, 1097331, 1090842, 1081511, 1068602, 1051822, 1031372, 1007777, 981819, 954572, 927301, 901078, 876372, 853046, 830882, 810167, 791678, 776031, 763178, 752542, 743392, 734865, 725964, 715991, 704992, 693393, 681220, 668082, 654033, 639956, 626767, 614578, 602977, 591904, 581821, 573161, 565975, 560118, 555371, 551307, 547394, 543423, 539691, 536585, 534162, 532287, 530995, 530408, 530311, 530119, 529431, 528451, 527650, 527138, 526670, 526218, 526132, 526576, 527193, 527641, 528188, 529284, 530749, 531940, 532715, 533643, 535111, 536764, 538120, 539244, 540465, 541775, 542934, 543859, 544477, 544508, 543827, 542828, 541938, 541011, 539717, 538355, 537588, 537432, 537088, 535925, 534098, 532042, 529916, 527793]
58465E27793j879j457j139j007r94j190j594j771j361p51o06q52q10k79K71N96
58449E12970J025J711K272K456K510K595K408J841J374J349J341Q48K19K30J018
58434E36167K058K992L821M336M097L213K523K661L321L742L657L393L224L037
58420E82242K649K106J558J083P88R53J759K959L953M323M155L778L417L189L227
58405F22139L509L717L568L260L262L680M123M276M248M208M099L973M215N002
58391F77279N749N648M695L695L146K682J804O95m0j96o9M2L8j77n46n31N41K605
58373G07060M762O198O833O870O332N524N378O515Q197R038Q718Q146P886P461
58359H04918O602O146O899Q299R215R561J0143J1065J1438J0810R931R622R695
$$ y = [527793, 525914, 524457, 523318, 522311, 521317, 520127, 518533, 516762, 515401, 514650, 514044, 513192, 512382, 512103, 512374, 512970, 513995, 515706, 517978, 520434, 522944, 525539, 527947, 529788, 531162, 532511, 533852, 534700, 534919, 535149, 536167, 538225, 541217, 545038, 549374, 553471, 556684, 559207, 561868, 565189, 568931, 572588, 575981, 579205, 582242, 584891, 586997, 588555, 589638, 590426, 591379, 593138, 596097, 600050, 604373, 608528, 612306, 615723, 618912, 622139, 625648, 629365, 632933, 636193, 639455, 643135, 647258, 651534, 655782, 659990, 664089, 668062, 672277, 677279, 683028, 688676, 693371, 697066, 700212, 702894, 704698, 705393, 705353, 705157, 705088, 705130, 705168, 704991, 704445, 703914, 704455, 707060, 711822, 718020, 724853, 731723, 738055, 743579, 748957, 755472, 763669, 772707, 781425, 789571, 797457, 804918, 811520, 817666, 824565, 832864, 842079, 851640, 861783, 872848, 884286, 895096, 905027, 914649, 924344]
58346I24344R436Q747Q145P946P981Q072Q358R036R944J0655J0914J0957J1208
58333A045743J1702J2015J1871J1506J1310J1423J1901J2880J4124J4910J4924
58322A184309J4922J5746J6982J7538J7359J7434J8061J8360J7926J7702J8498
58311A374837J9630J9971J9560J9237J9267J9371J9736K0777K2102K2769K2546
58300A599803K2146K2182K2730K3861K5655K7515K8417K8201K7947K8646L0132
58289A887235L1625L2804L3915L5276L7074L9229M1215M2378M2780M3309M4628
58278B311468M6472M8292N0122N2184N4113N5341N6132N7435N9552O1578O2549
58267B915238O2757O3477O5538O8472P1151P3002P4509P6579P9593Q3118Q6545
$$ y = [924344, 933780, 942527, 950672, 958618, 966599, 974671, 983029, 992065, 1002009, 1012664, 1023578, 1034535, 1045743, 1057445, 1069460, 1081331, 1092837, 1104147, 1115570, 1127471, 1140351, 1154475, 1169385, 1184309, 1199231, 1214977, 1231959, 1249497, 1266856, 1284290, 1302351, 1320711, 1338637, 1356339, 1374837, 1394467, 1414438, 1433998, 1453235, 1472502, 1491873, 1511609, 1532386, 1554488, 1577257, 1599803, 1621949, 1644131, 1666861, 1690722, 1716377, 1743892, 1772309, 1800510, 1828457, 1857103, 1887235, 1918860, 1951664, 1985579, 2020855, 2057929, 2097158, 2138373, 2180751, 2223531, 2266840, 2311468, 2357940, 2406232, 2456354, 2508538, 2562651, 2617992, 2674124, 2731559, 2791111, 2852689, 2915238, 2977995, 3041472, 3107010, 3175482, 3246633, 3319635, 3394144, 3470723, 3550316, 3633434, 3719979]
58256C719979Q9834R3595R8437J04314J10494J16209J21306J26309J31860J38154
58246D850491J44969J52089J59592J67699J76520J85964J95865K06204K17221
58237F456614K29271K42515K56755K71710K87380L04167L22622L43134L65727
58228I079895L90186M16477M45072M76701N11768N50356N92851O40198O93269
58219A3796773P52346Q17708Q90401R71998J063871J167433J285003J419836J575218
58210B3740587J754465J961991K203199K482015K799042L154087L552043M006193
58202D5653622M534879N154377N874924O702857P644982Q709794R905164J1235324
58194A05415923J2697340J4273563J5918425J7541185J8986410K0017002K0318075
$$ y = [3719979, 3809813, 3903408, 4001845, 4106159, 4216653, 4332862, 4454168, 4580477, 4712337, 4850491, 4995460, 5147549, 5307141, 5474840, 5651360, 5837324, 6033189, 6239393, 6456614, 6685885, 6928400, 7185155, 7456865, 7744245, 8048412, 8371034, 8714168, 9079895, 9470081, 9886558, 10331630, 10808331, 11320099, 11870455, 12463306, 13103504, 13796773, 14549119, 15366827, 16257228, 17229226, 18293097, 19460530, 20745533, 22165369, 23740587, 25495052, 27457043, 29660242, 32142257, 34941299, 38095386, 41647429, 45653622, 50188501, 55342878, 61217802, 67920659, 75565641, 84275435, 94180599, 105415923, 118113263, 132386826, 148305251, 165846436, 184832846, 204849848, 225167923]
58187B25167923J9548890J7448324J3951817R250721L756202k005828p507560
58180B79610489j2299635j6058756j8615850j9964339k0238851j9665613j8502212
58173A54265233j6987763j5314931j3622855j2002879j0508656r165923p981158
58166F8681068o949003o057616n291876m635656m073801l592912l180814k826320
58158C2073070k520129k255320k026114j826470j650585j494398j355716j232793
58150A7711545j123496j025794r38240q59630p88764p24790o67299o15787n69418
58141A0398327n27450m89372m54514m22114l92162l65410l42029l20834l00556
58132F783886k81381k64277k49136k34697k20384k07116j95854j86209j77034
$$ y = [225167923, 244716813, 262165137, 276116954, 285367675, 289123877, 287118049, 279610489, 267310854, 251252098, 232636248, 212671909, 192433058, 172767445, 154265233, 137277470, 121962539, 108339684, 96336805, 85828149, 76662226, 68681068, 61732065, 55674449, 50382573, 45746917, 41673116, 38080204, 34899390, 32073070, 29552941, 27297621, 25271507, 23445037, 21794452, 20300054, 18944338, 17711545, 16588049, 15562255, 14624015, 13764385, 12975621, 12250831, 11583532, 10967745, 10398327, 9870877, 9381505, 8926991, 8504877, 8112715, 7747305, 7405276, 7084442, 6783886, 6502505, 6238228, 5989092, 5754395, 5534011, 5326895, 5131041, 4944832, 4767798]
58123D767798j67780j58665j49987j41945j34861j28913j23691j18491j13012
58114C530453j07432j01983r6819r2183q8295q5047q2097p9110p5743p1693o7209
58103B582842o3235o0485n8548n6497n4171n2198n0787m9345m7457m5534m4148
58092B000437m3296m2612m1880m0999l9896l8748l7939l7530l7119l6422l5553
58081A568443l4538l3124l1373k9878k8964k8172k7069k6032k5615k5515k4878
58070A253285k3463k1869k0673j9953j9539j9221j8660j7661j6505j5646j5046
58059A045049j4259j3188j2349j2315j3165j4470j5521j5659j4800j3638j3018
58048H92667j3114j3395j3275j2519j1260j0004r407r590r876r572q834q214p765
$$ y = [4767798, 4600018, 4441353, 4291366, 4149421, 4014560, 3885647, 3761956, 3643465, 3530453, 3423021, 3321038, 3224219, 3132036, 3043741, 2958694, 2876597, 2797487, 2721744, 2650051, 2582842, 2519607, 2459122, 2400574, 2344077, 2289906, 2237708, 2186921, 2137576, 2090119, 2044585, 2000437, 1957141, 1914529, 1872649, 1831650, 1791754, 1753006, 1715067, 1677537, 1640418, 1603996, 1568443, 1533905, 1500781, 1469408, 1439530, 1410566, 1382394, 1355325, 1329293, 1303678, 1278163, 1253285, 1229822, 1207953, 1187280, 1167327, 1147788, 1128567, 1109907, 1092246, 1075741, 1060095, 1045049, 1030790, 1017602, 1005253, 992938, 979773, 965303, 949782, 934123, 919323, 905685, 892667, 879553, 866158, 852883, 840364, 829104, 819100, 809693, 800103, 790227, 780655, 771821, 763607, 755842]
58035G55842p183o698o845p472p847p833q008q453q399p535o710o659o864o486
58021F52850n768n617o102o370n925n164m556m002l234k362j751j616j890k312
58007E96181k568k536k411k505k898l355l535l231k611k274k787l999n089n506
57993E50876n575n897o517p026p222p205o974o432n709n013m253l222k118j396
57979D76317j080p83m52n40j204j843j859j537j684k571l690m473m876n121n218
57964D39386m931m132k996j893j164r75j201j436j214l99O50J377J542J369J285
57949D25268J539K061K510K534K087J500J027M76m73j695k727l498m408n518o214
57934D14469o115n819o137o870p059o446n932o290p004o877n563l963l166l303
$$ y = [755842, 748659, 741961, 735116, 727644, 719797, 711964, 703956, 695503, 687104, 679569, 672859, 666200, 659336, 652850, 647082, 641465, 635363, 628993, 623068, 617904, 613348, 609346, 606112, 603750, 601999, 600383, 598493, 596181, 593613, 591077, 588666, 586161, 583263, 579908, 576373, 573142, 570531, 568257, 565470, 561471, 556382, 550876, 545301, 539404, 532887, 525861, 518639, 511434, 504460, 498028, 492319, 487306, 483053, 479831, 477713, 476317, 475237, 474454, 474002, 473462, 472258, 470415, 468556, 467019, 465335, 462764, 459074, 454601, 449725, 444604, 439386, 434455, 430323, 427327, 425434, 424270, 423295, 422094, 420658, 419444, 419045, 419695, 421072, 422614, 423983, 425268, 426807, 428868, 431378, 433912, 435999, 437499, 438526, 439002, 438529, 436834, 434107, 430609, 426201, 420683, 414469, 408354, 402535, 396398, 389528, 382469, 376023, 370091, 363801, 356797, 349920, 344357, 340394, 337228, 333925]
57920C33925l610l374k625j838j316j064j134j668k489l001k767j951r78k0Q86
57905C06976J442J309O42J8k35k84l97n72p02p93r07j102j437j891k217k109j577
57888B96164j042r50j368j933k120j756j269j141j026L8K154L862L743K389J789
57873B97534K722L811L524K121J032R29J283J390J134P27L48O9j66n56j188j909
57857C12805k575l238l901m379m610m779m893m557l596k510j862j499q88J1Q50
57842B70379J631K708M025N047N587O080O778P166O589N105L334J608l83l042
57828C22612o083q500r401q940q171p874p762p172o185n517n432n430n093m611
57814B26441m245l762k793j431j28Q46J520K006K372K623K700K616K607K953L573
$$ y = [333925, 330315, 326941, 324316, 322478, 321162, 320098, 318964, 317296, 314807, 311806, 309039, 307088, 306110, 306090, 306976, 308418, 309727, 310369, 310387, 310152, 309868, 309471, 308899, 308197, 307404, 306497, 305395, 303958, 302067, 299850, 297741, 296164, 295122, 294172, 292804, 290871, 288751, 286995, 285726, 284585, 283559, 283597, 285751, 289613, 293356, 295745, 297534, 300256, 304067, 307591, 309712, 310744, 311673, 312956, 314346, 315480, 316207, 316555, 316624, 316458, 315902, 314714, 312805, 310230, 306992, 303091, 298712, 294102, 289323, 284430, 279873, 276277, 273767, 271905, 270406, 269518, 269529, 270379, 272010, 274718, 278743, 283790, 289377, 295457, 302235, 309401, 315990, 321095, 324429, 326037, 325654, 322612, 316529, 308029, 298628, 289688, 281517, 273643, 265881, 258709, 252524, 247007, 241575, 236145, 231052, 226441, 222196, 218434, 215641, 214210, 214082, 214928, 216448, 218454, 220826, 223449, 226149, 228765, 231372, 234325, 237898]
57799B37898M027M062L862L675L504L321L290L480L634L473L034K479J762P51
57785B82252m87j703k740l562m205m784n402n978o321o472o601o577o060n146
57771B16214m462m282m134l652l217l204l076k071m76O74J010J104J325J314P29
57756A93796j50q61j148p52M69J928K587K250J874K146K470K095J509J709K496
57741B12418K623J699Q62J164K091K368J765J385K204L863N089N046M047L007
57727B49631K464K279K116J927J870K040K431L004L554L680L215K583K486L157
57713B86437M158M880N109N077N098N294N552N738N888O133O442O614O701P106
57699C66227Q057R123R638R600R801J0989J3049J5159J6560J7227J7885J9345
$$ y = [237898, 241925, 245987, 249849, 253524, 257028, 260349, 263639, 267119, 270753, 274226, 277260, 279739, 281501, 282252, 281765, 280062, 277322, 273760, 269555, 264771, 259369, 253391, 247070, 240598, 233997, 227420, 221360, 216214, 211752, 207470, 203336, 199684, 196467, 193263, 190187, 188116, 187640, 188314, 189324, 190428, 191753, 193067, 193796, 193646, 192785, 191637, 190885, 191354, 193282, 195869, 198119, 199993, 202139, 204609, 206704, 208213, 209922, 212418, 215041, 216740, 217602, 218766, 220857, 223225, 224990, 226375, 228579, 232442, 237531, 242577, 246624, 249631, 252095, 254374, 256490, 258417, 260287, 262327, 264758, 267762, 271316, 274996, 278211, 280794, 283280, 286437, 290595, 295475, 300584, 305661, 310759, 316053, 321605, 327343, 333231, 339364, 345806, 352420, 359121, 366227, 374284, 383407, 393045, 402645, 412446, 423435, 436484, 451643, 468203, 485430, 503315, 522660]
57687E22660K1690K4224K6409K8697L2065L6805M2169M7317N2181N7238O2809
57676I54264O8974P5925Q4004R3403J04018J15291J25546J31238J27549J10898
57666A991110Q1691M4685O290k8767n8401q1596r7091j04164j03986r9232r2317
57655A458222q4513p6577o9290o2988n7285n1798m6767m2538l8801l4932l0876
57644H61857k7207k4336k2020j9679j6930j3843j0951q867p640o566m911k731
57632F96176o88P82J809K645L462M586O461R037J1555J3258J4273J5540J7829
57619G96725K0852K3416K4535K4519K4787K6368K8702L0232L0174K9198K8243
57608A087751K7139K4823K0751J5572J0405N703J055m069r547j4657j8839k2311
$$ y = [522660, 544350, 568574, 594983, 623680, 655745, 692550, 734719, 782036, 834217, 891455, 954264, 1023238, 1099163, 1183167, 1276570, 1380588, 1495879, 1621425, 1752663, 1880212, 1991110, 2072801, 2117486, 2123776, 2095009, 2036608, 1955012, 1857921, 1753757, 1649771, 1550539, 1458222, 1373709, 1297132, 1227842, 1164854, 1107569, 1055771, 1009004, 966466, 927665, 892733, 861857, 834650, 810314, 788294, 768615, 751685, 737842, 726891, 718024, 710384, 703818, 698907, 696176, 695488, 696270, 698079, 700724, 704186, 708772, 715233, 724270, 735825, 749083, 763356, 778896, 796725, 817577, 840993, 865528, 890047, 914834, 941202, 969904, 1000136, 1030310, 1059508, 1087751, 1114890, 1139713, 1160464, 1176036, 1186441, 1192144, 1193199, 1189130, 1179583, 1164926, 1146087, 1123776]
57596A123776k5745k9320l2377l4219l5066l5796l6732l7065l5814l3145l0376
57585G58121k8670k8006k7505k6439k4757k2864k1265k0239j9529j8399j6370
57574E04078j3909j2031j1177j0919j0707j0444j0068r238p924o812o490o554
57562C87805o100m947l737k935k423k055j903j813j429p90l14J0P33J979K992
57547C65073L132K757K658L084L813M731N751O553O977P387Q152R115J0071J1316
57533D50570J2953J4168J4243J3981J4922J7143J9057J9734K0118K1360K3074
57522F41323K4242K4932K5909K6973K7031K5761K4105K2885K1810K0220J8025
57511I03216J5474J2464Q711M305k43m480q192j1362j4155j6819j9352k1384k2652
$$ y = [1123776, 1098031, 1068711, 1036334, 1002115, 967049, 931253, 894521, 857456, 821642, 788497, 758121, 729451, 701445, 673940, 647501, 622744, 599880, 578615, 558376, 538847, 520448, 504078, 490169, 478138, 466961, 456042, 445335, 434891, 424823, 415585, 407661, 400849, 394359, 387805, 381705, 376758, 373021, 370086, 367663, 365608, 363705, 361892, 360463, 359673, 359359, 359369, 360102, 362081, 365073, 368205, 370962, 373620, 376704, 380517, 385248, 390999, 397552, 404529, 411916, 420068, 429183, 439254, 450570, 463523, 477691, 491934, 505915, 520837, 537980, 557037, 576771, 596889, 618249, 641323, 665565, 690497, 716406, 743379, 770410, 796171, 820276, 843161, 864971, 885191, 903216, 918690, 931154, 939865, 944170, 943927, 939447, 931255, 919893, 905738, 888919, 869567, 848183, 825531]
57498H25531k3408k4147k4909k5165k4385k2643k0581j8886j7802j7024j6054
57487E90527j4690j3167j1782j0579r447q388p374o098m238k061l59M01P08J458
57473E04911K965M796O442P785Q870R672J0329J1303J2952J5099J7212J8967K0387
57460F51690K1508K2227K2507K2488K2282K1807K0936J9626J7819J5379J2270
57449H70539Q671M825Q31l270p342j1178j4650j7720k0408k2856k5217k7335k8642
57436G06248k8666k7624k6325k5465k5119k4886k4325k3271k1940k0766j9904
57425D37957j8940j7348j5282j3522j2576j2141j1647j1028j0539j0113r341q096
57413B87384o759n784n260m972m656m119l358k689k513k846l234l230k843k419
$$ y = [825531, 802123, 777976, 753067, 727902, 703517, 680874, 660293, 641407, 623605, 606581, 590527, 575837, 562670, 550888, 540309, 530862, 522474, 515100, 509002, 504764, 502703, 502344, 502745, 503453, 504911, 507876, 512672, 519114, 526899, 535769, 545441, 555770, 567073, 580025, 595124, 612336, 631303, 651690, 673198, 695425, 717932, 740420, 762702, 784509, 805445, 825071, 842890, 858269, 870539, 879210, 884035, 884866, 881596, 874254, 863076, 848426, 830706, 810298, 787442, 762225, 734890, 706248, 677582, 649958, 623633, 598168, 573049, 548163, 523838, 500567, 478627, 457861, 437957, 419017, 401669, 386387, 372865, 360289, 348148, 336501, 325473, 314934, 304821, 295480, 287384, 280625, 274841, 269581, 264609, 259953, 255834, 252476, 249787, 247274, 244428, 241194, 237964, 235121, 232702]
57399B32702k224k238k262k073j614j071p49q03j158j587j800j523q00j58j35
57384B12507n82q74q73j180k045k658k123q81l01r07j781j907j385r13o82m11
57368A93004r5o0l34n79o95r49j434j808j781j595j658j955k065j724j088l88
57352A74796L59J189J877K056J672J116P82N87K63m2K04J068J778J526N31j95
57336A89567m9N73J039J260J454J561J378J121J242J663J763J209N13M26J073
57321B05793K006K838L445L751L719L579L641L827L806L645L919M871N854O024
57307B60718N364M663M571N088N837O492O866O964O994P053O852O051M960M391
57293C42864M701N331N526N120M429L662K831J917P71r12l103n092o098o077n657
$$ y = [232702, 230478, 228240, 225978, 223905, 222291, 221220, 220471, 219668, 218510, 216923, 215123, 213600, 212800, 212642, 212507, 211925, 211051, 210178, 208998, 206953, 204295, 202172, 201291, 200990, 200083, 198302, 196395, 195010, 194097, 193415, 193004, 192909, 192849, 192515, 191936, 191241, 190292, 188858, 187050, 185269, 183674, 182016, 180061, 177996, 176272, 175184, 174796, 175155, 176344, 178221, 180277, 181949, 183065, 183847, 184434, 184697, 184655, 184859, 185927, 187705, 189231, 189762, 189567, 189518, 190091, 191130, 192390, 193844, 195405, 196783, 197904, 199146, 200809, 202572, 203781, 204294, 204720, 205793, 207799, 210637, 214082, 217833, 221552, 225131, 228772, 232599, 236405, 240050, 243969, 248840, 254694, 260718, 266082, 270745, 275316, 280404, 286241, 292733, 299599, 306563, 313557, 320610, 327462, 333513, 338473, 342864, 347565, 352896, 358422, 363542, 367971, 371633, 374464, 376381, 377152, 376240, 373137, 368045, 361947, 355870, 350213]
57278C50213n385n466n998o847p349o793n381m154l758l751l416k720k039j377
57264B85779m84M79R74Q71O67Q54J398J938K290K537K814L170L627M223M937N546
57248C21620N680N239M711M836N733O664O889O554O399O720P063O983O677O709
57234D08477P313Q191Q898R258R450R727J0051J0158J0019J0056J0619J1414J1817
57221E35448J1756J1875J2664J3800J4635J4977J5134J5330J5529J5710J5967
57210F92825J6288J6517J6631J6875J7485J8382J9237J9809K0136K0424K0822
57199H95431K1332K1930K2674K3584K4511K5259K5874K6545K7239K7647K7629
57188A169655K7391K7007K6030K3889K0628J6845J3143R963P829P133P475P850
$$ y = [350213, 344828, 339362, 333364, 326517, 319168, 312375, 306994, 302840, 299082, 295331, 291915, 289195, 287156, 285779, 285295, 285774, 286748, 287619, 288286, 289140, 290538, 292476, 294766, 297303, 300117, 303287, 306914, 311137, 316074, 321620, 327300, 332539, 337250, 342086, 347819, 354483, 361372, 367926, 374325, 381045, 388108, 395091, 401768, 408477, 415790, 423981, 432879, 442137, 451587, 461314, 471365, 481523, 491542, 501598, 512217, 523631, 535448, 547204, 559079, 571743, 585543, 600178, 615155, 630289, 645619, 661148, 676858, 692825, 709113, 725630, 742261, 759136, 776621, 795003, 814240, 834049, 854185, 874609, 895431, 916763, 938693, 961367, 984951, 1009462, 1034721, 1060595, 1087140, 1114379, 1142026, 1169655, 1197046, 1224053, 1250083, 1273972, 1294600, 1311445, 1324588, 1334551, 1342380, 1349513, 1356988, 1364838]
57176A364838P787P927Q980J0550J1579J1709J1459J1138J0422R324Q801R672
57164A484186J1366J2490J2469J1912J1426J0881J0127R601R675R887R561Q898
57152A612479Q792R595J0720J1522J1985J2383J2782J3194J3798J4653J5481J6019
57140A763403J6391J6860J7445J8084J8909K0012K1120K1897K2487K3433K5064
57129A985105K7256K9672L2008L4052L5861L7767L9990M2351M4788M7893N2443
57118B409186N8376O4844P1365P8318Q6119R4432J02678J10996J20236J31265
57108C327815J44545J60240J78433J99401K24014K53707K89794L32867L83019
57099E493835M40380N05153N77275O56278P41208Q30343R21233J011455J099224
$$ y = [1364838, 1372625, 1380552, 1389532, 1400082, 1411661, 1423370, 1434829, 1445967, 1456389, 1465713, 1474514, 1484186, 1495552, 1508042, 1520511, 1532423, 1543849, 1554730, 1564857, 1574458, 1584133, 1594020, 1603581, 1612479, 1621271, 1630866, 1641586, 1653108, 1665093, 1677476, 1690258, 1703452, 1717250, 1731903, 1747384, 1763403, 1779794, 1796654, 1814099, 1832183, 1851092, 1871104, 1892224, 1914121, 1936608, 1960041, 1985105, 2012361, 2042033, 2074041, 2108093, 2143954, 2181721, 2221711, 2264062, 2308850, 2356743, 2409186, 2467562, 2532406, 2603771, 2682089, 2768208, 2862640, 2965318, 3076314, 3196550, 3327815, 3472360, 3632600, 3811033, 4010434, 4234448, 4488155, 4777949, 5110816, 5493835, 5934215, 6439368, 7016643, 7672921, 8414129, 9244472, 10165705, 11177160, 12276384]
57090A2276384J182772J259094J323627J371253J397352J398102J370382J311776
57082B2890742J220683J096496R40114P54326N43524L12837O7725j85699m40133
57073B7200615o86838r15748j116387j279872j401000j478613j514305j511252
57065A7296600j474257j409822j325174j227008j121256j013417r08277q09161
57057H008228p17877o35398n62266m98405m43058l95234l54021l18427k87291
57048C796251k59634k35007k13230j93887j76330j60218j45808j33496j23084
57039B155557j13705j04586r5776q7890q1282p5658p0554o5782o1290n6909n2545
57028A289580m8461m5049m2408m0384l8858l7651l6236l4120l1612k9735k8997
$$ y = [12276384, 13459156, 14718250, 16041877, 17413130, 18810482, 20208584, 21578966, 22890742, 24111425, 25207921, 26148035, 26902361, 27445885, 27758722, 27826447, 27640748, 27200615, 26513777, 25598029, 24481642, 23201770, 21800770, 20322157, 18807852, 17296600, 15822343, 14412521, 13087347, 11860339, 10739083, 9725666, 8817389, 8008228, 7290351, 6654953, 6092687, 5594282, 5151224, 4755990, 4401969, 4083542, 3796251, 3536617, 3301610, 3088380, 2894493, 2718163, 2557945, 2412137, 2278641, 2155557, 2041852, 1937266, 1841490, 1753600, 1672318, 1596660, 1526106, 1460324, 1399034, 1342125, 1289580, 1241119, 1196070, 1153662, 1113278, 1074420, 1036769, 1000533, 966413, 934801, 905066, 876069]
57017H76069k8598k7369k5345k3815k3695k4338k4340k3233k1846k1031k0605
57006F11854j9821j8465j7052j6080j5606j5488j5602j5599j4930j3445j1731
56995D38035j0571j0141r998r643q835p520n908m549l900l789l557k899k220k065
56981C52440k529l384m482n730o870p581p800p731p558p324o967o396n531m488
56967B68069l593l064k672j935o21J069K755M094M755M530L647K700K009J173
56953B82916m51k839n197o837p878q883r944j0449r792q089o027m183k652j286
56939A98409n1J002J967L131M764O842Q915J0238J0168Q631O169L434O81k162
56925B62138m996p475r393j0886j2039j2573j2234j1260j0195r263q278p181o249
$$ y = [876069, 847471, 820102, 794757, 770942, 747247, 722909, 698569, 675336, 653490, 632459, 611854, 592033, 573568, 556516, 540436, 524830, 509342, 493740, 478141, 463211, 449766, 438035, 427464, 417323, 407325, 397682, 388847, 381327, 375419, 370870, 366970, 363181, 359624, 356725, 354505, 352440, 349911, 346527, 342045, 336315, 329445, 321864, 314064, 306333, 298775, 291451, 284484, 278088, 272557, 268069, 264476, 261412, 258740, 256805, 256184, 257253, 260008, 264102, 268857, 273387, 277034, 279734, 281743, 282916, 282465, 279626, 274429, 267592, 259714, 250831, 240887, 230438, 220646, 212557, 206530, 202347, 199695, 198409, 198358, 199360, 201327, 204458, 209222, 216064, 224979, 235217, 245385, 254016, 260185, 263619, 264300, 262138, 257142, 249667, 240274, 229388, 217349, 204776, 192542, 181282, 171087, 161824, 153546, 146365, 140116]
56912A40116n648n113m292l203k161j450j183j313j535j399p82q5L04N43J047
56897A13846J861K683L404M184N009N690O244O948P855Q698R290R575R232P767
56883B02286N305K785J001j85j329k470l230l494l429k963j815j03J654L195M813
56868B02021O759Q775J0393J1514J2499J3740J5242J6562J7124J6677J5356J3275
56856C59937J0244O126J348l245o972r496j0605j0168q462o156l861j759L02K603
56842C19836N366Q540J1758J4743J7659K0796K3923K6327K7391K6815K4313J9648
56830E47115J3108N569k101r342j5600k0239k3047k4369k4477k3183k0442j6858
56818C86134j3144r386n346j213K522N735Q682J1384J3544J5036J5921J5949J4540
$$ y = [140116, 134468, 129355, 125063, 121860, 119699, 118249, 117066, 115753, 114218, 112819, 112037, 111952, 112256, 112799, 113846, 115707, 118390, 121794, 125978, 130987, 136677, 142921, 149869, 157724, 166422, 175712, 185287, 194519, 202286, 207591, 210376, 211377, 211192, 209863, 207393, 204163, 200669, 197240, 194277, 192462, 192359, 194013, 197208, 202021, 208780, 217555, 227948, 239462, 251961, 265701, 280943, 297505, 314629, 331306, 346662, 359937, 370181, 376307, 377655, 374410, 367438, 357942, 347337, 337169, 328707, 322551, 318690, 316931, 317233, 319836, 325202, 333742, 345500, 360243, 377902, 398698, 422621, 448948, 476339, 503154, 527467, 547115, 560223, 565792, 563691, 554349, 538749, 518510, 495463, 471094, 446617, 423434, 402992, 386134, 372990, 363604, 358258, 357045, 359567, 365302, 373984, 385368, 398912, 413948, 429869, 445818, 460358]
56805D60358J1487P238K344k941q324j3199j7048j9847k1694k2280k1227j8874
56793C35993j6188j3785j1425q715n964l830k271l99K359N290P161P698P741P762
56779C11427O937M240M9m030o907q920j0899j2892j4218j4422j3723j2697j1811
56766B12134j1217j0620r520p800o107n248n259n414n197m843m710m586m004l029
56752A24580k297k185k397k371j887j149n36l54o26r89r93n74j07R6R4K5j91o57
56734A07482j197j508j460j084m49K44O71P30O55N43J37o06j032n59L32N98Q8
56717A03585k71Q9N88N05M3j38O7K69L04K48k9o86j386j530j007l23M5L9k10n67
56697I9635p89o15j34K37K08q5l02k21J21M72N37L15J39K52M29L21K0q6R3K64
$$ y = [460358, 471845, 479083, 481427, 478486, 470162, 456963, 439915, 420068, 398374, 376094, 354867, 335993, 319805, 306020, 294595, 285880, 279916, 276086, 273815, 273416, 275775, 281065, 288226, 295924, 303665, 311427, 318364, 322604, 322653, 318623, 311716, 302796, 291897, 279005, 264787, 250365, 236642, 223945, 212134, 200917, 190297, 180777, 172977, 166870, 161622, 156363, 150949, 145752, 140909, 136199, 131613, 127609, 124580, 122283, 120098, 117701, 115330, 113443, 112294, 111758, 111404, 110778, 109789, 108796, 108222, 108115, 108211, 108305, 108330, 108139, 107482, 106285, 104777, 103317, 102233, 101784, 102028, 102699, 103429, 104084, 104627, 104764, 104158, 103126, 102567, 102899, 103497, 103585, 103314, 103403, 103991, 104496, 104539, 104401, 104468, 104737, 105041, 105289, 105260, 104574, 103188, 101658, 100651, 100328, 100373, 100412, 100202, 99635, 98846, 98231, 98097, 98334, 98542, 98457, 98155, 97934, 98055, 98527, 99064, 99379, 99518, 99770, 100199, 100520, 100540, 100454, 100547, 100811]
56677A00811K43J42Rk59n42l75M84J648K421K432J847J147Q03R59J313J420J168
56660A15671Q23N95M15J92M3J28M86J034J575J723J198K17o06r71j134j334j370
56643A18685j038o71q07j392j817j682j189p30m08j01K09L77K78K2o3L03R72J370
56625A12318J017L1j015j642j720j300n39J54K40l78j067j040k03P65J225J175
56609A08021Q90L35o75j764j991q84P93J720J444P81P53J422J980J754R12K13
56593A15704K36Q10J186P64k86j179j260n26N35J405J827J902J977K291K546K127
56577A30059R02l67p95l56J70K30J3p1O0L37Q56J608K140K003J507J432J975K439
56559A44142K220J665J489J735J791J352P78N04N55P67J029J136P84Qp27j106
$$ y = [100811, 101054, 101196, 101205, 100946, 100404, 100029, 100513, 102161, 104582, 107014, 108861, 110008, 110811, 111770, 113083, 114503, 115671, 116494, 117089, 117504, 117696, 117739, 117867, 118353, 119387, 120962, 122685, 123883, 124100, 123494, 122523, 121389, 120055, 118685, 117647, 116976, 116169, 114777, 112960, 111278, 110089, 109359, 108951, 108850, 109059, 109436, 109714, 109736, 109673, 109976, 110948, 112318, 113335, 113366, 112351, 110709, 108989, 107689, 107150, 107304, 107544, 107166, 106099, 105059, 104856, 105621, 106846, 108021, 108911, 109246, 108571, 106807, 104816, 103932, 104725, 106445, 107889, 108670, 109423, 110845, 112825, 114579, 115491, 115704, 115940, 116750, 117936, 118700, 118414, 117235, 115975, 115449, 115984, 117389, 119216, 121118, 123095, 125386, 127932, 130059, 130961, 130594, 129799, 129443, 129613, 129843, 129856, 129785, 129845, 130182, 131038, 132646, 134786, 136789, 138296, 139728, 141703, 144142, 146362, 148027, 149516, 151251, 153042, 154394, 155172, 155676, 156231, 156998, 158027, 159163, 159947, 159955, 159228, 158122]
56543A58122j349j701j922j657j032n01k34j37k75q21j669k494l094l241k485
56528A35510p26J094J681R22M7j3L07J58l62n10j44J12j82p76j219j292r37k07
56510A33463O20J154J307J287J146P09M5l28l4N95Q66N55M4l59q00j409j769j330
56492A35762l01L94J98l98n50j35K59K53P2M2J26J22Kj01l9L30J005J681J941
56473A40663J731J401J238J175J043Q47O93O70Q63J238J471J241P33N06P03Q72
56457A57088O99M51M20M06J26k69m86n64n60k05N43J007N06n72j148q60l82l31
56439A55869n70p99j108j539j595q35L81J159J039L09n04j108j374j195o46r0
56423A47394J28P5J73O36J149J243Q77M56L45N51R30J351J612J477R49L02k53
$$ y = [158122, 156773, 155072, 153150, 151493, 150461, 149960, 149726, 149589, 149314, 148493, 146824, 144330, 141236, 137995, 135510, 134784, 135878, 137559, 138481, 138528, 138515, 138822, 138980, 138618, 138108, 137964, 138076, 137894, 137118, 135899, 134607, 133670, 133463, 134083, 135237, 136544, 137831, 138977, 139686, 139731, 139403, 139369, 139964, 140830, 141385, 141429, 141070, 140270, 138861, 137092, 135762, 135461, 135855, 136053, 135655, 135105, 134970, 135229, 135482, 135554, 135596, 135722, 135844, 135846, 135745, 135706, 136036, 137041, 138722, 140663, 142394, 143795, 145033, 146208, 147251, 148098, 148791, 149461, 150324, 151562, 153033, 154274, 155007, 155513, 156216, 157088, 157787, 158238, 158658, 159064, 159190, 158921, 158435, 157871, 157311, 157106, 157649, 158656, 159162, 158590, 157442, 156582, 156200, 155869, 155299, 154500, 153392, 151853, 150258, 149423, 149804, 150963, 152002, 152311, 151807, 150699, 149325, 148130, 147484, 147394, 147522, 147597, 147770, 148406, 149555, 150798, 151675, 152131, 152476, 153027, 153957, 155308, 156920, 158397, 159346, 159648, 159395]
56406A59395o93q71m85M29J313J699J690J538J204P47P36J580K699L059K504J875
56390A78419J753J839J722J566J609J552J032L35J24M82P95O00J46o7j0n0k84
56373A91563l55o6K55L06M28J072J801J673P21J70P19J459J255M53K90R98J688
56356B04430J845J851J989K038K012K251K495J906M47o58m51N28J157J144R20
56341B23904P41O75R86J739K404K489K236K140K137K003K076K779L683L923L487
56326B57402L226L538L902L823L539L470L557L518L336L228L395L984M956N851
56312C10725O068N556M950M765M802M550L946L398L276L551L940M130L971L581
56298C71209L272L242L376L422L363L460L891M431M693M721N113O313P928R087
$$ y = [159395, 158702, 157831, 157346, 157775, 159088, 160787, 162477, 164015, 165219, 165966, 166702, 168282, 170981, 174040, 176544, 178419, 180172, 182011, 183733, 185299, 186908, 188460, 189492, 189827, 189951, 190433, 191228, 191828, 191974, 191907, 191897, 191847, 191563, 191208, 191142, 191397, 191703, 192131, 193203, 195004, 196677, 197398, 197568, 198287, 199746, 201001, 201454, 201744, 202742, 204430, 206275, 208126, 210115, 212153, 214165, 216416, 218911, 220817, 221264, 220606, 220155, 220683, 221840, 222984, 223904, 224645, 225320, 226306, 228045, 230449, 232938, 235174, 237314, 239451, 241454, 243530, 246309, 249992, 253915, 257402, 260628, 264166, 268068, 271891, 275430, 278900, 282457, 285975, 289311, 292539, 295934, 299918, 304874, 310725, 316793, 322349, 327299, 332064, 336866, 341416, 345362, 348760, 352036, 355587, 359527, 363657, 367628, 371209, 374481, 377723, 381099, 384521, 387884, 391344, 395235, 399666, 404359, 409080, 414193, 420506, 428434, 437521]
56284D37521R503R755J0402J1290J2000J2622J3673J5419J7662K0047K2243K4048
56272F16185K5721K7996L1401L5648M0134M4808N0072N5926O1925O7998P4591
56261A132405Q1803Q8946R5434J01551J07790J13717J18072J20051J19976J18583
56251B198328J15836J10780J02486R1018P7360O2471M6718L0235J3533k681j8019
56240B828065l2384m5458n6739o6108p3925q0401q5358q8811r1380r3726r5802
56229B017973r7015r6979r5766r3559r0445q6599q2342p7880p3177o8184o3101
56218A092926n8234n3631m8938m3784l8367l3486k9775k7015k4413k1586j8908
56207F94789j6814j5146j3436j1611j0078r133q579p971p093o094n321m963m849
$$ y = [437521, 447024, 456779, 467181, 478471, 490471, 503093, 516766, 532185, 549847, 569894, 592137, 616185, 641906, 669902, 701303, 736951, 777085, 821893, 871965, 927891, 989816, 1057814, 1132405, 1214208, 1303154, 1398588, 1500139, 1607929, 1721646, 1839718, 1959769, 2079745, 2198328, 2314164, 2424944, 2527430, 2618448, 2695808, 2758279, 2804997, 2835232, 2848765, 2846084, 2828065, 2795681, 2750223, 2693484, 2627376, 2553451, 2473050, 2387692, 2298881, 2207501, 2113775, 2017973, 1920958, 1823979, 1728213, 1634654, 1544209, 1457610, 1375268, 1297388, 1224211, 1156027, 1092926, 1034692, 981061, 932123, 888339, 849972, 816486, 786711, 759696, 735283, 713697, 694789, 677975, 662829, 649393, 637782, 627704, 618571, 609992, 602021, 594928, 588834, 583513, 578550, 573701]
56194E73701m605m012l173k316j514p17J04R12J632K131K307K281K412K873L445
56179E75461L828M090M558N298O005O445O761P244P993Q980J0208J1628J2950
56166F71449J3819J4221J4504J5004J5768J6743J8035J9825K2085K4606K7266
56155H73325L0164L3442L7176M1475M6591N2828O0379O9205P8792Q7971R5079
56144A506427R8565R7525R1987Q3041P2649O2763N4239M6861M0564L5933L2902
56133B223456K9535K3258J3605K848o314j3092j8315k2894k7494l3226m1295n1724
56121B078348o3087p3794q3017r0187r4336r4571r0892q4083p4972o4403n3616
56110A211390m3950l5955k9145k2864j7025j1920p711m425k071l71J322L398N409
$$ y = [573701, 569096, 565084, 561911, 559595, 558081, 557364, 557468, 558380, 560012, 562143, 564450, 566731, 569143, 572016, 575461, 579289, 583379, 587937, 593235, 599240, 605685, 612446, 619690, 627683, 636663, 646871, 658499, 671449, 685268, 699489, 713993, 728997, 744765, 761508, 779543, 799368, 821453, 846059, 873325, 903489, 936931, 974107, 1015582, 1062173, 1115001, 1175380, 1244585, 1323377, 1411348, 1506427, 1604992, 1702517, 1794504, 1877545, 1950194, 2012957, 2067196, 2114057, 2154621, 2190554, 2223456, 2252991, 2276249, 2289854, 2292702, 2286388, 2273296, 2254981, 2232087, 2204593, 2171367, 2130072, 2078348, 2015261, 1941467, 1858450, 1768263, 1673927, 1579356, 1488464, 1404381, 1329409, 1265006, 1211390, 1167440, 1131485, 1102340, 1079476, 1062451, 1050531, 1042820, 1038395, 1036324, 1035953, 1037275, 1040673, 1046082]
56097A046082O619P084P608Q623R671J0245J0615J1352J2405J3150J3198J2808
56085A169460J2484J2498J2716J2670J1926J0661R691R607J0035J0198J0000J0083
56073A302029J0816J1848J2800J3764J4807J5556J5799J6112J7288J9212K0798
56062A470829K1213K0794K0582K1257K2648K4166K5366K6141K6595K6921K7368
56051A733880K8184K9434L0936L2357L3375L3868L4095L4652L5969L7765L9238
56040B103753L9928M0166M0586M1477M2867M4815M7184M9478N1423N3519N6358
56029B611554N9558O2086O3672O5092O7024O9315P1692P4414P7643Q0912Q3814
56018C386776Q6745R0290R4280R8149J01926J06133J10817J15468J19913J24637
$$ y = [1046082, 1052701, 1059785, 1067393, 1076016, 1085687, 1095932, 1106547, 1117899, 1130304, 1143454, 1156652, 1169460, 1181944, 1194442, 1207158, 1219828, 1231754, 1242415, 1252106, 1261713, 1271748, 1281946, 1291946, 1302029, 1312845, 1324693, 1337493, 1351257, 1366064, 1381620, 1397419, 1413531, 1430819, 1450031, 1470829, 1492042, 1512836, 1533418, 1554675, 1577323, 1601489, 1626855, 1652996, 1679591, 1706512, 1733880, 1762064, 1791498, 1822434, 1854791, 1888166, 1922034, 1956129, 1990781, 2026750, 2064515, 2103753, 2143681, 2183847, 2224433, 2265910, 2308777, 2353592, 2400776, 2450254, 2501677, 2555196, 2611554, 2671112, 2733198, 2796870, 2861962, 2928986, 2998301, 3069993, 3144407, 3222050, 3302962, 3386776, 3473521, 3563811, 3658091, 3756240, 3858166, 3964299, 4075116, 4190584, 4310497, 4435134]
56008D435134J30076J36081J42224J48306J54448J61055J68618J77219J86253
55999E839414J95163K04408K15116K27677K41293K55095K69215K84411L01220
55990H033012L19855L40477L63101L87545M13883M42730M74631N09533N47328
55981A1832095N88697O34809O86324P43320Q06262Q76445R55414J044492J145097
55972A9312955J259110J388744J536561J706021J901777K129201K394142K703553
55964C4332064L066124L491764L990471M571532N242979O010868O879352P852561
55956G5437715Q937030J0141710J1474172J2933521J4500794J6126155J7711966
55949A67263063J9092669K0020018K0174217J9223967J6933726J3273379Q465398
$$ y = [4435134, 4565210, 4701291, 4843515, 4991821, 5146269, 5307324, 5475942, 5653161, 5839414, 6034577, 6238985, 6454101, 6681778, 6923071, 7178166, 7447381, 7731792, 8033012, 8352867, 8693344, 9056445, 9443990, 9857873, 10300603, 10775234, 11284767, 11832095, 12420792, 13055601, 13741925, 14485245, 15291507, 16167952, 17123366, 18167858, 19312955, 20572065, 21960809, 23497370, 25203391, 27105168, 29234369, 31628511, 34332064, 37398188, 40889952, 44880423, 49451955, 54694934, 60705802, 67585154, 75437715, 84374745, 94516455, 105990627, 118924148, 133424942, 149551097, 167263063, 186355732, 206375750, 226549967, 245773934, 262707660, 275981039, 284446437]
55942B84446437K938571k780289q175202j2814471j6394080j8765580j9943752
55935B08511634k0080892j9411807j8192713j6655658j4984888j3311186j1718064
55928I4156426j0253409q940322p784427o779301n911853n166876m529205l983998
55920D0807035l516945l115123k767982k467601k207872j983175j787788j616448
55912B1344101j465014j330318j209728j101313j004070r17284q39778p70167
55904A2706429p07627o51746o01772n56642n15732m78819m45333m14377l85657
55895G948724l59618l36366l15078k94924k75914k58496k42696k28184k14807
55886E422641k02593j91462j81326j72297j64472j57563j51032j44399j37407
$$ y = [284446437, 287385008, 284604719, 276429517, 263615046, 247220966, 228455386, 208511634, 188430742, 169018935, 150826222, 134170564, 119185676, 105874490, 94156426, 83903017, 74962695, 67178268, 60398967, 54487114, 49320238, 44791033, 40807035, 37290090, 34174967, 31406985, 28939384, 26731512, 24748337, 22960549, 21344101, 19879087, 18548769, 17339041, 16237728, 15233658, 14316374, 13476596, 12706429, 11998802, 11347056, 10745284, 10188642, 9672910, 9194091, 8748758, 8334381, 7948724, 7589106, 7252740, 6937662, 6642738, 6366824, 6108328, 5865632, 5637448, 5422641, 5220048, 5028586, 4847260, 4674963, 4510491, 4352928, 4201896, 4057497, 3920090]
55877C920090j30110j22992j16714j11436j06638j01803r6998r2546q8512q4781
55867B867560q1412p8464p5632p2449o8818o5123o1889n9433n7709n6203n4168
55856B136260n1310m8212m5870m4731m4365m3940m2943m1486m0033l8849l7690
55845A656831l6228l4626l3451l2899l2456l1461k9769k7738k5833k4351k3303
55834A324716k2339k1112j9738j8567j7460j5841j3723j2064j1624j2001j2343
55823A147904j2614j3457j5019j6623j7608j7890j7760j7628j7948j8796j9562
55812I62999j9536j8827j8112j7480j6261j4196j2098j0880j0406r829q778p633
55800G98963o678n498l522j000Q84R90p01l272o000q865j1835j4232j5379j5541
$$ y = [3920090, 3789980, 3666988, 3550274, 3438838, 3332200, 3230397, 3133399, 3040853, 2952341, 2867560, 2786148, 2707684, 2632052, 2559603, 2490785, 2425662, 2363773, 2304340, 2246631, 2190428, 2136260, 2084950, 2036738, 1990868, 1946137, 1901772, 1857832, 1814889, 1773403, 1733370, 1694521, 1656831, 1620603, 1585977, 1552526, 1519627, 1487171, 1455710, 1425941, 1398203, 1372370, 1348019, 1324716, 1302377, 1281265, 1261527, 1242960, 1225500, 1209659, 1195936, 1183872, 1172248, 1160247, 1147904, 1135290, 1121833, 1106814, 1090191, 1072583, 1054693, 1036933, 1019305, 1001357, 982561, 962999, 943463, 924636, 906524, 889044, 872783, 858587, 846489, 835609, 825203, 815374, 806596, 798963, 792285, 786787, 783265, 782265, 783149, 784139, 783438, 780166, 774166, 765301, 753466, 739234, 723855, 708314]
55786G08314j5498j5415j4830j3733j2765j2221j1692j0981j0546j0596j0458
55775E69579r507q109p012o276n605n267n701o430o351n259m200m071m614n139
55761D86038n596o353p382q310r064r901j0820j1454j1606j1547j1608j1706j1516
55748C59175j0981j0429j0139r986r556q671p569o575n747m916m060l341k814
55735B64391k310j746j375j545k201k898l284l414l414l141k464j797j898k905
55721B29999l922l957l146k555k796l270l005j853n62P0j87j013j834k171j979
55706A97819j603j235o50K52R23P22j16o76o05n20r34j404j293q39q26j329j552
55689A86134j035k89K2M9L90J105J631J686J700K164K867L159K735J821P29l70
$$ y = [708314, 692816, 677401, 662571, 648838, 636073, 623852, 612160, 601179, 590633, 580037, 569579, 560072, 551963, 544951, 538675, 533070, 527803, 522102, 515672, 509321, 504062, 499862, 495791, 491177, 486038, 480442, 474089, 466707, 458397, 449333, 439432, 428612, 417158, 405552, 394005, 382397, 370691, 359175, 348194, 337765, 327626, 317640, 308084, 299413, 291844, 285269, 279522, 274606, 270546, 267205, 264391, 262081, 260335, 258960, 257415, 255214, 252316, 249032, 245618, 242204, 239063, 236599, 234802, 232904, 229999, 226077, 222120, 218974, 216419, 213623, 210353, 207348, 205495, 204933, 205003, 204816, 203803, 201969, 199798, 197819, 196216, 194981, 194331, 194583, 195506, 196228, 196112, 195436, 194831, 194311, 193377, 191973, 190680, 189841, 189015, 187686, 186134, 185099, 184810, 184832, 184881, 185271, 186376, 188007, 189693, 191393, 193557, 196424, 199583, 202318, 204139, 204868, 204498]
55673B04498j155j247q05p30j663l062l773l491l089l409m269m908m891m254l220
55658A60532k236j872k178k364j737p33l51p39j014n59L34J201J998K609K544
55643A55435J721R76J076J636J681J026K99j62o64j332j737j592j258j246j616
55628A54243k096k493k729k764k707k737k795k634k291k130k235k239j982j889
55614A20522k279k730k691k375k439k872k971k392j640j335j512j878k225k341
55600H8842j909r97k79l75j119j835k196k367k438k234j823j641j884k122j863
55585F3760j291j003j153j213o80L63J461K264K566K194J199P7n63o29o31j046
55569F5675j785k345k384k014j614j401j283j120j034j297j774j790q57N74J478
$$ y = [204498, 203343, 202096, 201291, 200561, 198898, 195836, 192063, 188572, 185483, 182074, 177805, 172897, 168006, 163752, 160532, 158296, 156424, 154246, 151882, 150145, 149412, 149061, 148322, 147308, 146749, 147083, 148284, 150282, 152891, 155435, 157156, 158132, 159208, 160844, 162525, 163551, 163850, 163688, 163024, 161692, 159955, 158363, 157105, 155859, 154243, 152147, 149654, 146925, 144161, 141454, 138717, 135922, 133288, 130997, 128867, 126632, 124393, 122411, 120522, 118243, 115513, 112822, 110447, 108008, 105136, 102165, 99773, 98133, 96798, 95286, 93408, 91183, 88842, 86933, 85936, 85657, 85282, 84163, 82328, 80132, 77765, 75327, 73093, 71270, 69629, 67745, 65623, 63760, 62469, 61466, 60313, 59100, 58420, 58783, 60244, 62508, 65074, 67268, 68467, 68544, 67981, 67352, 66721, 65675, 63890, 61545, 59161, 57147, 55533, 54132, 52849, 51729, 50695, 49398, 47624, 45834, 44977, 45551, 47029]
55554D7029J351O36P2l3K13N77P67N12q1n67p04p90j115j485j582j516j553j516
55536D0215j007j71L38J77l31p26q51o58p6O93J139R72M82J60J80M54Q48J133
55518D2971J037N96K96N03R11Q81K52m48n58P4J018J625J579J176J032J387J826
55501E6158J806J262N09k27r03j425j633j545j359j217j163j302j724k222k358
55486D2657j955j395j285j862k699l047k513j481p72q00j190j308r89n47k95l37
55470B0182p18j274j469p97M38J209Q71j24q17q11m55k29l09o48j084j334j116
55453A1515m02N10J152J143M92k35l06L68J010R35M68M34Q11O30n62j810j968
55436A4185j249q67j248j480p06O62J529J451P92l1q50j406j340o91M5M79N99
$$ y = [47029, 48380, 49016, 49088, 49055, 49268, 49845, 50612, 51124, 51043, 50476, 49772, 48982, 47867, 46382, 44800, 43284, 41731, 40215, 39208, 39037, 39375, 39552, 39221, 38495, 37644, 36986, 36910, 37603, 38742, 39714, 40196, 40356, 40536, 40990, 41838, 42971, 44008, 44604, 44900, 45403, 46314, 47195, 47447, 46999, 46441, 46515, 47533, 49158, 50737, 51913, 52945, 54332, 56158, 57964, 59226, 59735, 59508, 58605, 57180, 55547, 54002, 52643, 51426, 50263, 48961, 47237, 45015, 42657, 40702, 39307, 38022, 36160, 33461, 30414, 27901, 26420, 25648, 24848, 23658, 22350, 21361, 20814, 20519, 20182, 19464, 18190, 16721, 15924, 16362, 17571, 18442, 18318, 17501, 16690, 16235, 16006, 15697, 15049, 13965, 12631, 11515, 11113, 11623, 12775, 13918, 14410, 14175, 13869, 14237, 15247, 16182, 16650, 17084, 17895, 18525, 17963, 16153, 14185, 12936, 12069, 10821, 9341, 8635, 9297, 10826, 12277, 13069, 13038, 12188, 10782, 9442, 8751, 8796, 9275, 9874]
55419I874M35j32r28j331r19p0M79M93M05O48J222J748J716Q84k61p03r6N08j34
55400A3838j645k251j145L92P11r3o26k12N68J093J330J211L88r42j796j491n13
55383H817K54O34R92J352J387J068O86K57m03j066j136n37l2l53j319k076k005
55366F520j125P5R44J006L60l08l36K51Q69J030O95N0o94j292j440j087o14n14
55348D390q18r89n02M96J281J364J017Q10P81M68k60q59q62n81o20r19q32j53
55330C212M96N39K07J04K90L05Nj74R7M74M13k3k13J59O52O28Lp60j239j297q96
55309B982n4Q67J243Q43Q2n43j059j630H64c30J37H26P92P6l4O54J314J162K28
55290E018q41j378j129m06J67K61J74L36O18N60J63k6K63O40P42P52R23R99O71
$$ y = [9874, 10309, 10177, 9249, 7918, 6999, 6929, 7408, 7901, 8306, 8954, 10176, 11924, 13640, 14524, 14263, 13560, 13464, 13972, 13838, 12193, 9942, 8797, 9189, 9900, 9807, 9181, 8969, 9537, 10630, 11960, 13171, 13559, 12617, 10821, 9330, 8817, 9071, 9705, 10697, 12049, 13436, 14504, 15190, 15447, 15044, 13978, 12842, 12305, 12273, 11920, 10601, 8525, 6520, 5395, 5470, 6414, 7420, 7780, 7472, 7136, 7387, 8256, 9286, 9981, 10031, 9337, 8045, 6605, 5518, 4904, 4390, 3572, 2583, 2081, 2577, 3858, 5222, 6239, 7049, 7830, 8298, 8038, 7179, 6317, 5736, 5116, 4197, 3365, 3212, 3708, 4247, 4454, 4558, 4848, 5153, 5158, 4984, 5081, 5555, 5968, 5945, 5732, 5891, 6543, 7171, 7174, 6414, 5175, 3878, 2982, 2928, 3795, 5038, 5881, 5963, 5420, 4361, 2731, 864, -330, -193, 826, 1618, 1694, 1660, 2314, 3628, 4790, 5018, 4177, 2799, 1670, 1264, 1431, 1692, 1866, 2202, 2820, 3380, 3543, 3517, 3780, 4420, 5162, 5914, 6837, 7836, 8507]
55271H507K92M85J115J279N06n88j077q08l70l29p40j267j436r73j10N05M88J66
55253E645Q0K17J18l18o47n70l90m90p73q99p99n73j07O78J315J093Q7p08n33
55234B426K36O87O06N04O24N66P0m20l45K34Q01R87O89j30j180j708j209k48J52
55215C342r0m9O46J105N78k26j30O91R51J95o53p98o33p55q67m32J73O2q37F28
55194a112j335q62l68J63M96N08N48h80A134K710K601J667L27q34j335j021k40
55177E009L38K64k87p50q10o83o79p29n54j51K13M69P96J170J296J147J107J314
55159H480J254N04m77q03l24K23J95k75o26n07M3O95J014Q06L81K02L05L33J49
55140A1572J1Q9K03K00K08L61N38N29K53k63q12r14k19Q42J315Q37O8k03M6M35
$$ y = [8507, 8799, 9284, 10399, 11678, 12184, 11596, 10519, 9711, 9341, 9012, 8272, 7005, 5569, 4596, 4486, 4991, 5479, 5645, 5725, 5942, 6060, 5742, 5095, 4525, 4135, 3645, 2872, 1973, 1174, 601, 494, 1172, 2487, 3580, 3667, 2959, 2426, 2662, 3349, 3955, 4459, 5083, 5649, 5719, 5299, 4954, 5188, 5989, 6976, 7665, 7535, 6355, 4647, 3438, 3190, 3342, 3252, 3203, 3849, 4954, 5532, 5306, 5176, 5867, 6818, 7013, 6360, 5562, 4929, 4174, 3307, 2875, 3048, 3110, 2273, 628, -1112, -2447, -3309, -3677, -3514, -3018, -2510, -1962, -880, 1134, 3844, 6445, 8112, 8439, 7605, 6270, 5249, 5009, 5347, 5611, 5324, 4574, 3764, 3081, 2402, 1673, 1119, 968, 1181, 1650, 2446, 3616, 4912, 6059, 7166, 8480, 9734, 10238, 9761, 8958, 8634, 8857, 9052, 8777, 8151, 7644, 7687, 8382, 9396, 10202, 10583, 10785, 11090, 11423, 11572, 11583, 11672, 11875, 12075, 12283, 12644, 13182, 13711, 13964, 13701, 12889, 11975, 11756, 12598, 13913, 14750, 14818, 14615, 14661, 15096]
55120A5096Q39J244J380J155J119J827K895L379L061K648K709L005L135L256L786
55105E0534M705N476N514M596L015J420K59o74j930l594n117n948o016n442m317
55090D2481l004k200k225k501k224j410p96p39p70l67K01K27m19r49m94P99J681
55073B7291J012q78k361k228j010k21m51q22m24M61R18P32M25L40L68N45J029
55056B4726J437J053J18j7J257K521J924k64j881j628m10L40N37Q98J436J607
55040C3654J498J853K887L876M070L397K216Q88j67n88m66l40n02o07j69P86J752
55023E4038K301K434K455K673L118L442L217K393J397O79K34l29j260k265k666
55008G1861k040p21M06P21L83K6L8K85L22k46j478k984m135m544m239l463k500
$$ y = [15096, 15935, 17179, 18559, 19714, 20833, 22660, 25555, 28934, 31995, 34643, 37352, 40357, 43492, 46748, 50534, 55239, 60715, 66229, 70825, 73840, 75260, 75519, 74845, 72915, 69321, 64204, 58256, 52240, 46798, 42481, 39477, 37277, 35052, 32551, 30327, 28917, 28121, 27382, 26612, 26245, 26446, 26673, 26254, 25305, 24811, 25610, 27291, 28303, 27425, 25064, 22836, 21826, 21605, 21154, 20332, 19908, 20369, 21287, 22019, 22444, 22784, 23152, 23697, 24726, 26163, 27216, 27334, 27317, 28574, 31095, 33019, 32755, 30874, 29246, 28836, 29176, 29713, 30611, 32047, 33654, 35152, 37005, 39892, 43768, 47838, 51235, 53451, 54339, 54172, 53584, 53118, 52778, 52276, 51669, 51500, 52286, 54038, 56339, 58773, 61228, 63901, 67019, 70461, 73678, 76071, 77468, 78147, 78381, 78052, 76792, 74527, 71861, 69821, 69100, 69506, 70227, 70610, 70636, 70674, 70959, 71281, 71035, 69557, 66573, 62438, 57894, 53655, 50192, 47692]
54991D7692j789j675j853j511m80L04M4o50n98J64M26l77j431j855j733j430p93
54974C2455K71J132J173O97M17L79J74j06R6Q05J333J218Q12P56J180J675J829
54957D6296J701J830K690M109N400O197O785P452P989Q248Q692R725J0791J0931
54943A38836J0092R082Q183O700M121R92j799m004n871p474q668r445r864r863
54929A21018r475q989q611q137p343o413n645m918l852k400q92L92J243J339N56
54914E7873m75p08J95J514K473L138L996N050N930O649P636Q850R524Q994P511
54899A28150N801M092K001o54l337n264o213o712p428q496r474r871r590q780
54885F4225p503n850m292l450l336l229k566j653j025o27j07L08P1o24q36k11
$$ y = [47692, 45903, 44228, 42375, 40864, 40384, 40688, 40732, 40082, 39484, 39648, 40074, 39697, 38266, 36411, 34678, 33248, 32455, 32726, 33858, 35031, 35728, 36145, 36524, 36698, 36592, 36688, 37493, 38826, 40044, 40856, 41612, 42792, 44467, 46296, 47997, 49827, 52517, 56626, 62026, 68223, 75008, 82460, 90449, 98697, 107389, 117114, 127905, 138836, 148928, 158010, 166193, 172893, 177014, 178006, 176207, 172203, 166332, 158858, 150190, 140745, 130881, 121018, 111543, 102554, 93943, 85806, 78463, 72050, 66405, 61487, 57635, 55235, 54343, 54735, 55978, 57317, 57873, 57398, 56690, 56885, 58399, 60872, 64010, 68006, 73056, 78986, 85635, 93271, 102121, 111645, 120639, 128150, 133951, 138043, 140044, 139390, 136053, 130789, 124576, 117864, 110436, 101940, 92466, 82595, 73005, 64225, 56722, 50872, 46580, 43130, 39794, 36565, 33999, 32346, 31321, 30694, 30587, 30895, 30966, 30342, 29506, 29295]
54869B9295N59Q38R07J232J509J229O62M65N70K49p33j793k368k470k313j932
54853B5906j405r79p85p52q38j043j114p25LN19N12K08r0l00l44j40N6j88o86
54834A7815o60J37Q48O59L7P8Q68J340Q29k2k51J25K90j64p94j018q12n33l40
54815A8432j41O6J82L67R64J879K403K065J355J140J544J970K159K504L151L574
54799D3614L435L352M174N821P385Q221Q437Q474Q606Q806Q731P862O017L634
54785A36569J259j050l426n527o761p069o925o534n731m718m205m427m656m172
54771G2627l284k763k643k242j290l28J19J79K24K81J97J29M14J104J926K664
54755F7314L271L721M086M828O523Q964J0859J0975R550Q090P601P416O162L533
$$ y = [29295, 29854, 30692, 31599, 32831, 34340, 35569, 36231, 36696, 37266, 37515, 36782, 34989, 32621, 30151, 27838, 25906, 24501, 23522, 22737, 21985, 21147, 20104, 18990, 18265, 18268, 18787, 19299, 19507, 19417, 19117, 18773, 18633, 18689, 18501, 17815, 17155, 17292, 18140, 18799, 18836, 18914, 19782, 21122, 21951, 21929, 21678, 21803, 22093, 21929, 21135, 20117, 19305, 18772, 18432, 18291, 18357, 18539, 18906, 19870, 21749, 24152, 26217, 27572, 28712, 30256, 32226, 34385, 36889, 40040, 43614, 47049, 50401, 54575, 60396, 67781, 76002, 84439, 92913, 101519, 110325, 119056, 126918, 132935, 136569, 137828, 136778, 133352, 127825, 121064, 113995, 107070, 100536, 94805, 90087, 85882, 81455, 76799, 72627, 69343, 66580, 63937, 61695, 60405, 60077, 60196, 60375, 60599, 60880, 61077, 61206, 61620, 62724, 64650, 67314, 70585, 74306, 78392, 83220, 89743, 98707, 109566, 120541, 130091, 138181, 145782, 153198, 159360, 162893]
54741A62893N79j720l541n641q089j0106j1016j0926j0376r710r014q327p587
54728F7419o499m882l127j946j577j563j479j488j880k433k664k472k031j256
54714C2122oJ218J537Q53Q5p8j9k93n92l08K69K42n09j144j156j040j301j535
54696B8345j013K06J313J700J415Q53L77K53N61J058J328J157O67J02l30m26P
54679C7573R60K049K689K540J806J034O05M16J59k45n63n63k39J52J97l90j367
54662D6813j967j656q29l79n03m63K61J129J270P21K85L24L47Pj29O99K255L336
54644E1521L128K146J667K342L608M453M474M160M268N114O295O981O544N137
54630A11838L613K633J965R43n24j825k616l338m388n270n143m094l199l250l881
$$ y = [162893, 163472, 161752, 158211, 152570, 144481, 134375, 123359, 112433, 102057, 92347, 83333, 75006, 67419, 60920, 56038, 52911, 50965, 49388, 47825, 46346, 44858, 42978, 40545, 37881, 35409, 33378, 32122, 32116, 33334, 34871, 35724, 35809, 35731, 35712, 35419, 34827, 34519, 34788, 35030, 34521, 33377, 32221, 31181, 29880, 28345, 27332, 27538, 28851, 30551, 31966, 32819, 33196, 33449, 34010, 35068, 36396, 37553, 38220, 38322, 37992, 37566, 37573, 38533, 40582, 43271, 45811, 47617, 48651, 49256, 49672, 49831, 49586, 49023, 48460, 48221, 48373, 48570, 48180, 46813, 44846, 43190, 42361, 41982, 41479, 41016, 41277, 42406, 43676, 44397, 44682, 45006, 45353, 45360, 45231, 45930, 48185, 51521, 54649, 56795, 58462, 60804, 64412, 68865, 73339, 77499, 81767, 86881, 93176, 100157, 106701, 111838, 115451, 118084, 120049, 120992, 120468, 118643, 116027, 112689, 108301, 103031, 97888, 93794, 90595, 87345, 83464]
54615H3464m196l941l594l481l255k482j517j268j983k699k392j392r67j478j836
54600D6983j144q2J08n68j021p87m79n28n16j03L05L19K47L64K17o86j838k225
54582C8566j583n10M44J117J317Q55L9m76m94l57k05K55J014J457J195O77N25
54565D3836O53N31P8k60j89J01L67O02Q23P88K44o82j441j531j002m43l95q57
54547D1223j411j736j697j076L45K192L411L112J511k21r44l46J004K140K362
54532D9869J753J075J005J544K222K654K770K666K543K637K897K866K167J063
54518G9731K16j06k87q37j817k788l152k641j706j199j406j655j316q21r99j563
54502E7654j260K03J452J213O2m80m6L64R8l08j32M28O63L37j55l99l95m06n67
$$ y = [83464, 79268, 75327, 71733, 68252, 64997, 62515, 60998, 59730, 57747, 55048, 52656, 51264, 50297, 48819, 46983, 45839, 45757, 45865, 45297, 44276, 43489, 43010, 42482, 41966, 41863, 42168, 42487, 42734, 43098, 43315, 42629, 40791, 38566, 36983, 36473, 36917, 38034, 39351, 40206, 40245, 39769, 39275, 38918, 38713, 38968, 39982, 41439, 42634, 43311, 43836, 44489, 45020, 45098, 44838, 44649, 44750, 45117, 45719, 46542, 47330, 47574, 46892, 45451, 43920, 42918, 42475, 42080, 41223, 39812, 38076, 36379, 35303, 35648, 37840, 41251, 44363, 45874, 45653, 44709, 44363, 45367, 47507, 49869, 51622, 52697, 53702, 55246, 57468, 60122, 62892, 65558, 68101, 70738, 73635, 76501, 78668, 79731, 79947, 79841, 79554, 78717, 76900, 74112, 70960, 68319, 66613, 65414, 64008, 62353, 61037, 60216, 59217, 57654, 56394, 56597, 58049, 59262, 59324, 58844, 58798, 59162, 59260, 58952, 58820, 59248, 59911, 60248, 60093, 59694, 59299, 58893, 58326]
54483E8326o51k81N66J308J329O92L5k59m28q12j303j501j118j90Q65J314O25
54466E8517p86j735j479n56j4q9j79P3L09J67o1J03O00R32Q34M91J51j56m54o67
54446E6001p12o28m89k62J81Q77J615J956J515L32j053j926j939j319n99j82j17
54429E3251j99k20j30M9L29O28O60K32l21l25L78J074J089P57R42J749K389K430
54411F4762K398K776L110K693J644O64O4k53j54N35J282J176J57q01r82p21o78
54394G7672r90j494k142k758k875k373j796j555j310o37J56N01M88N65O49K89
54378F2390m19r34j143j388j597j269m49J12P3L8N81J366J679J372P40m6p84r29
54360E9393j01J169J808J329L20k84r0N52J011R80O98O18Q58J108J049O13j29
$$ y = [58326, 57675, 57394, 57960, 59268, 60597, 61289, 61324, 61065, 60637, 59825, 58522, 57021, 55903, 55713, 56578, 57892, 58517, 57731, 55996, 54517, 53961, 53947, 53858, 53679, 53752, 54061, 54228, 54167, 54270, 54870, 55802, 56636, 57127, 57278, 57122, 56668, 56001, 55289, 54661, 54172, 53910, 54091, 54968, 56583, 58539, 60054, 60386, 59333, 57407, 55468, 54149, 53550, 53368, 53251, 53052, 52832, 52702, 52751, 53080, 53708, 54368, 54600, 54279, 53954, 54332, 55406, 56495, 57252, 58194, 59943, 62332, 64762, 67160, 69936, 73046, 75739, 77383, 78047, 78111, 77858, 77704, 78239, 79521, 80697, 80854, 80053, 79071, 78350, 77672, 76682, 75188, 73046, 70288, 67413, 65040, 63244, 61689, 60379, 59742, 59898, 60399, 60887, 61452, 62101, 62390, 61971, 61037, 59894, 58506, 56909, 55640, 55191, 55303, 55376, 55414, 55995, 57361, 59040, 60412, 61152, 61106, 60322, 59393, 59292, 60461, 62269, 63598, 63918, 63634, 63544, 64096, 65107, 66087, 66785, 67403, 68261, 69369, 70418, 71031, 70902]
54343G0902j008j615j611j307j419j985k071j091J41L37o00j565j786j539j351
54328E2432j313j364j550j650j148RJ044J184N51j48n07n57m29l24o41j501k274
54311D1814k146j175k52R1K71P98J408J497J051N64K72Mk33j09M68J051J185Q47
54293D7406K21o09j443j784j299k56P84J531J889J610N57p54j475j310o77k2M70
54276D4839N41l5q28r50k61K72j05q15q66k67K28M33P80J167Q63k24j076q46L7
54257D2887O08O84P91J106J208Q97N93O56P03Lj439k621k560j396j94L33M78P70
54239D3507J052Q12J25m09n62o58q35p61l44k6o1q7J33R4o29j445j379m65K59
54220C8321J69l46p57j095j458j466q18J3K40k32p17o94l88l31o89j142j260q75
$$ y = [70902, 69894, 68279, 66668, 65361, 63942, 61957, 59886, 58795, 58936, 59273, 58673, 57108, 55322, 53783, 52432, 51119, 49755, 48205, 46555, 45407, 45416, 46460, 47644, 48195, 48047, 47540, 46983, 46554, 46230, 45589, 44088, 41814, 39668, 38493, 38241, 38332, 38603, 39401, 40809, 42306, 43357, 43921, 44193, 44197, 43964, 43855, 44323, 45374, 46559, 47406, 47627, 47018, 45575, 43791, 42492, 42236, 43020, 44551, 46440, 48050, 48607, 47853, 46378, 45068, 44391, 44369, 44839, 45380, 45345, 44517, 43567, 43306, 43578, 43473, 42658, 41792, 41525, 41753, 42186, 42966, 44133, 44996, 44772, 43696, 42850, 42887, 43495, 44179, 44970, 46076, 47284, 48181, 48774, 49430, 50133, 50136, 48697, 46076, 43516, 42120, 41926, 42259, 42737, 43507, 44559, 45371, 45496, 45087, 44525, 43867, 43032, 42271, 41927, 41901, 41840, 41753, 41886, 41980, 41351, 39906, 38527, 38062, 38321, 38490, 38144, 37387, 36292, 34834, 33368, 32550, 32563, 32803, 32571, 31854, 31160, 30772, 30441, 29752, 28610, 27350, 26475]
54202B6475j91L67M97L32K78M95O49L38k63m62J30R94J189M61m03m43L92J265
54184C2100J356N75o15j629j961j369k22N99N75K25M69J296J621P15p15j325p78
54167C0917LJ15l46p33o95l17J73M92L09l37q36o21R1N51M46J90J88L26L29K68
54147C0513L27L94K12j52l55k48l8K9k6n0J9P7l7l49o47o13j62M19P74Q41P81
54126C1709O74M89K85J92J72O0j04j5M61J015J236J046O47K22o9K5N42J028R25
54107D0540L13q8J48N68M75j25o05n71k53n9m0L5L65R03J375J422R40K95RK40
54087D5887O91J031J107Q31J82n42r13r13r59j156j036l19M75P05N64O98J108
54070D7441J123N05j35j86J90M77N02L89J95o8k01L0O43J481K353K975L045K547
$$ y = [26475, 26284, 26651, 27148, 27480, 27758, 28253, 28902, 29240, 28977, 28515, 28645, 29639, 30828, 31289, 30886, 30443, 30835, 32100, 33456, 34031, 33416, 31787, 29826, 28457, 28235, 28834, 29409, 29634, 30103, 31399, 33020, 33735, 33020, 31695, 30917, 30920, 31035, 30689, 29956, 29261, 28944, 29117, 29609, 29918, 29581, 28745, 28124, 28215, 28766, 29212, 29402, 29590, 29916, 30245, 30513, 30840, 31234, 31446, 31294, 30939, 30691, 30653, 30682, 30656, 30606, 30625, 30702, 30665, 30316, 29669, 29056, 28894, 29313, 30087, 30928, 31709, 32383, 32872, 33157, 33349, 33521, 33581, 33477, 33462, 33923, 34938, 36174, 37220, 37867, 38089, 38020, 38045, 38587, 39615, 40540, 40853, 40765, 40913, 41481, 41956, 41831, 41226, 40655, 40402, 40343, 40303, 40338, 40703, 41606, 42981, 44403, 45343, 45638, 45647, 45887, 46578, 47609, 48716, 49547, 49729, 49187, 48274, 47361, 46402, 45246, 44210, 43891, 44366, 45071, 45635, 46333, 47441, 48564, 49069, 48934, 48748, 48938, 49415, 49917, 50306, 50501, 50433, 50232, 50262, 50905, 52386, 54739, 57714, 60759, 63306]
54052F3306J869J463J521K037K858L514L388K473J667J875K898L653L456K667
54038I8645K015J700J449J096P83O19M32L5m34o33n42o01j199k129k845l168l327
54021I1896l346k908k024j377j513k086k338k139k022k230k331j911j183o46m82
54006F3360n35p05j009j361j499j229o55q7K65N25R46J404J305K65j166j867j352
53989E6605l44Q4k19m49L9R01J282P94k02j156j753j814j220k22M70L55k38n42
53971E2371l22K0J75K96M67M00n2n12n23j01N03J191J839K092J814J440J402J500
53953F4000J360J186J474K138K649K862K991K889K218J438J630K963M236M464
53939I8498M178M528N648O681P056O962O762O624O668O837O661N747M491L757
$$ y = [63306, 65175, 66638, 68159, 70196, 73054, 76568, 79956, 82429, 84096, 85971, 88869, 92522, 95978, 98645, 100660, 102360, 103809, 104905, 105688, 106307, 106739, 106774, 106340, 105707, 105165, 104564, 103365, 101236, 98391, 95223, 91896, 88550, 85642, 83618, 82241, 80728, 78642, 76304, 74165, 72143, 69913, 67582, 65671, 64488, 63842, 63360, 62825, 62120, 61111, 59750, 58251, 57022, 56367, 56280, 56545, 57070, 58016, 59420, 60725, 60990, 59824, 57957, 56605, 56261, 56345, 56126, 55677, 55716, 56617, 57899, 58693, 58491, 57335, 55582, 53768, 52548, 52326, 52796, 53151, 52913, 52371, 52049, 52069, 52244, 52540, 53007, 53407, 53355, 52843, 52320, 52219, 52722, 53913, 55752, 57844, 59658, 61098, 62500, 64000, 65360, 66546, 68020, 70158, 72807, 75669, 78660, 81549, 83767, 85205, 86835, 89798, 94034, 98498, 102676, 107204, 112852, 119533, 126589, 133551, 140313, 146937, 153605, 160442, 167103, 172850, 177341, 181098]
53925A81098L708L539K533R61m16j300j921k358k346j872j514j868k707l110k519
53910A69908j454r32j364k288l108l646l942l939l644l264k993k839k892l378
53896A30225m198m686m287l331k712k875l403l615l199k303j362q87j148j885
53882I0334k518k639k195j311l19J70k99j364k001j629p65l31n18o85l56J25L2
53865G3731q05j721j883j131j04M02J20n59r59o14L82J326J377L89p87j072k87
53848F7805P26J070O50lm52o72q32r52q91m74K84J059J373R61N7p61r67l96O45
53829F8230J536J751J322Q50Q48J094R11R3o57m85O34J959K886L420L756L809
53813I1957L436K845K466K594L221M017M302L482J814M09mO1l00r72j151q26q73
$$ y = [181098, 184806, 188345, 190878, 191839, 191423, 190123, 188202, 185844, 183498, 181626, 180112, 178244, 175537, 172427, 169908, 168454, 167522, 166158, 163870, 160762, 157116, 153174, 149235, 145591, 142327, 139334, 136495, 133603, 130225, 126027, 121341, 117054, 113723, 111011, 108136, 104733, 101118, 97919, 95616, 94254, 93367, 92219, 90334, 87816, 85177, 82982, 81671, 81352, 81522, 81223, 79859, 77858, 76229, 75464, 75133, 74615, 73930, 73574, 73699, 73731, 72926, 71205, 69322, 68191, 68087, 68489, 68609, 68050, 67091, 66477, 66859, 68185, 69562, 69951, 69164, 68092, 67805, 68531, 69601, 70251, 70248, 69796, 69124, 68292, 67340, 66449, 65975, 66259, 67318, 68691, 69652, 69709, 68948, 67981, 67585, 68230, 69766, 71517, 72839, 73689, 74537, 75631, 76542, 76635, 75978, 75493, 76127, 78086, 80972, 84392, 88148, 91957, 95393, 98238, 100704, 103298, 106519, 110536, 114838, 118320, 120134, 120543, 120539, 120600, 120300, 119328, 118177, 117351, 116478]
53796A16478j542j931j401n72k45j93J37L67l03j711k807l036k749k350j846j331
53780I4965j119j251j486j798k309k685k366j500r21j012j269j232j113j193j334
53765G2377j445j754k162k012j101k61k48o52o84n59j043j898j947q15L90N60
53749E6746l0l55m1M33O76Q13J028J184J103R04Q05P65N45J15k24k57j95m10q67
53730F2738j084p09M3O81J017J314J792K161J753L64j195j700q28M40R74P22L57
53713F8840J36k18n95m09M18J080R31L14k3J46O42J372K128K363J768Q93O39J203
53695H1628K020K499K488K158J868J898K044J756J031O89J212J835J574P00K48
53680A05648L15Or03j401p54M46J246J546J678J463N35p38j442j161l63K44L70
$$ y = [116478, 114936, 113005, 111604, 111032, 110787, 110594, 110731, 111098, 110795, 109084, 106277, 103241, 100492, 98142, 96296, 94965, 93846, 92595, 91109, 89311, 87002, 84317, 81951, 80451, 79530, 78518, 77249, 76017, 74904, 73711, 72377, 70932, 69178, 67016, 65004, 63903, 63642, 63394, 62742, 62058, 61499, 60456, 58558, 56611, 55796, 56186, 56746, 56716, 56361, 56320, 56753, 57429, 58242, 59270, 60454, 61557, 62461, 63266, 64031, 64576, 64691, 64467, 64210, 64015, 63605, 62738, 61654, 60945, 60988, 61669, 62686, 64000, 65792, 67953, 69706, 70070, 68875, 67175, 66347, 66787, 67761, 68483, 68840, 68976, 68758, 68163, 67754, 68172, 69252, 70183, 70497, 70474, 70620, 71262, 72634, 74762, 77125, 78893, 79786, 80425, 81628, 83648, 86147, 88635, 90793, 92661, 94559, 96603, 98359, 99390, 100079, 101291, 103126, 104700, 105400, 105648, 105963, 105969, 105066, 103665, 102911, 103357, 104603, 106149, 107827, 109290, 109825, 109087, 107645, 106484, 106121, 106365, 106735]
53663A06735J80J8J22L68L83pm86n51p2N48P30K29n64r33o11r8Nj68l8M70Q34
53642A07094P78N85M16J8o07q79m01M42J070J384J432R43j57j192j343o44K28
53625A09167Q92J365J510J114N03L23O09O95K38k89k98J47O44J087J634K257K645
53608A24243K598K353K399K903L347K972J746N75K70O10R22J132J638K268K233
53593A52209J310K86q8j8o8k46k06L9K33M48R23J452J487R37L69K11K36Mm97r04
53573A58117j039j003q53n15j15q5o19j201j115m30j0l35p70m68L27N79n2p06
53555A49707n15L21R97J132Q63L46k93o69m17K39O65O18M28M16N55P92J240J742
53537A58167J732R48M6o6O47J399J775K249L237M236M530M331M535N355N985N829
$$ y = [106735, 106915, 106933, 107055, 107423, 107806, 107799, 107313, 106762, 106690, 107238, 107968, 108197, 107633, 106700, 106089, 105991, 105996, 105828, 105790, 106260, 107094, 107872, 108457, 108873, 108891, 108284, 107405, 107004, 107446, 108516, 109900, 111332, 112275, 112118, 110926, 109583, 108939, 109167, 110059, 111424, 112934, 114048, 114551, 114874, 115483, 116178, 116416, 116127, 115829, 115976, 116620, 117707, 119341, 121598, 124243, 126841, 129194, 131593, 134496, 137843, 140815, 142561, 143136, 143406, 144016, 144938, 146070, 147708, 149976, 152209, 153519, 153805, 153717, 153699, 153631, 153385, 153179, 153218, 153451, 153899, 154822, 156274, 157761, 158698, 159067, 159278, 159514, 159518, 159021, 158117, 157078, 156075, 155222, 154707, 154592, 154507, 153888, 152687, 151572, 151142, 151132, 150797, 150027, 149559, 149886, 150465, 150413, 149707, 149192, 149513, 150510, 151642, 152505, 152851, 152558, 151889, 151472, 151711, 152376, 152994, 153422, 153838, 154393, 155185, 156425, 158167, 159899, 160847, 160893, 160827, 161474, 162873, 164648, 166897, 170134, 174370, 178900, 183231, 187766, 193121, 199106, 204935]
53521B04935N362N292N548N684N892O767Q182R238R391Q990Q599Q393Q479R144
53507C09896J0359J1544J2264J2766J3444J4152J4514J4543J4431J4086J3418
53496D55417J2916J3223J4192J4999J5151J4950J4807J4710J4537J4462J4765
53485F14129J5456J6231J6648J6349J5341J4089J3075J2400J2039J2220J2990
53474G70967J3585J3018J1436J0112R825R951R569Q659P605O238M323K506J672
53461H79466J484O66j119k795l601m324n972q044r125q905q504q760r223r192
53447H02052q917r104r788j0489j1168j2088j2858j2556j1204j0200j0638j1830
53435F71212j2267j1620j0781j0120q924o830m758l716l399k774j592n20O7N48
$$ y = [204935, 210297, 215589, 221137, 226821, 232713, 239480, 247662, 256900, 266291, 275281, 283880, 292273, 300752, 309896, 320255, 331799, 344063, 356829, 370273, 384425, 398939, 413482, 427913, 441999, 455417, 468333, 481556, 495748, 510747, 525898, 540848, 555655, 570365, 584902, 599364, 614129, 629585, 645816, 662464, 678813, 694154, 708243, 721318, 733718, 745757, 757977, 770967, 784552, 797570, 809006, 819118, 828943, 838894, 848463, 857122, 864727, 870965, 875288, 877794, 879466, 880950, 881616, 880497, 877702, 874101, 869777, 863805, 855761, 846636, 837731, 829227, 820467, 811244, 802052, 793135, 784031, 774243, 763754, 752586, 740498, 727640, 715084, 703880, 693680, 683042, 671212, 658945, 647325, 636544, 626424, 617500, 610670, 605912, 602196, 598797, 596023, 594431, 593911, 593978, 594526]
53421E94526J285K050K481K678L079L886M817N416N590N896P043R037J1024J2323
53407F71131J3227J4436J5941J7063J7441J7434J7484J7684J8110J9034K0508
53396H59493K2084K3255K4035K4937K6462K8591L0636L1765L1856L1715L2101
53385A166930L2830L3318L3663L4427L5423L5663L4751L3451L2511L1705L0465
53374A535137K8802K7041K5215K3288K1458J9694J7454J4519J1597R518Q118O620
53362A748461M594J885j817o432j0878j4074j6412j9247k2912k6366k8793l0533
53350A577476l2047l3036l3120l2627l2152l1822l1482l1088l0532k9561k8268
53339A231741k7241k6798k6543k6006k5360k5030k4955k4689k3963k2878k1730
$$ y = [594526, 595811, 597861, 600342, 603020, 606099, 609985, 614802, 620218, 625808, 631704, 638747, 647784, 658808, 671131, 684358, 698794, 714735, 731798, 749239, 766673, 784157, 801841, 819951, 838985, 859493, 881577, 904832, 928867, 953804, 980266, 1008857, 1039493, 1071258, 1103114, 1134829, 1166930, 1199760, 1233078, 1266741, 1301168, 1336591, 1372254, 1407005, 1440456, 1472967, 1504672, 1535137, 1563939, 1590980, 1616195, 1639483, 1660941, 1680635, 1698089, 1712608, 1724205, 1733723, 1741841, 1748461, 1753055, 1754940, 1753123, 1746691, 1735813, 1721739, 1705327, 1686080, 1663168, 1636802, 1608009, 1577476, 1545429, 1512393, 1479273, 1446646, 1414494, 1382672, 1351190, 1320102, 1289570, 1260009, 1231741, 1204500, 1177702, 1151159, 1125153, 1099793, 1074763, 1049808, 1025119, 1001156, 978278, 956548]
53328I56548k0870k0329j9454j7456j4639j2404j1507j0955r417p239o082o674
53316G99522p885q313p882p519p724q077q014p578p279p331p288o567n193l750
53302F99122k647j704o97J53N08N64R40K025L659N325O545P199P667Q525R923
53287G47107J1389J2396J2901J3221J3615J4171J4779J5051J4595J3568J2640
53276H95433J2167J1754J0886R549P947O166M519L665L773L949L242J786L06j122
53262I74020k950n071o804q002r277j1063j3092j4952j6495j7638j8338j8777
53250H31561j9106j9040j8439j8002j8506j9434j9403j8129j6826j6313j5902
53239F32461j4755j3309j2493j2289j2082j1875j2199j3044j3730j3752j3148
$$ y = [956548, 935678, 915349, 895895, 878439, 863800, 851396, 839889, 828934, 819517, 812278, 806196, 799522, 791637, 783324, 775442, 767923, 760199, 752122, 744108, 736530, 729251, 721920, 714632, 708065, 702872, 699122, 696475, 694771, 694074, 694227, 694735, 695299, 696239, 698264, 701923, 707248, 713793, 720992, 728659, 737184, 747107, 758496, 770892, 783793, 797014, 810629, 824800, 839579, 854630, 869225, 882793, 895433, 907600, 919354, 930240, 939789, 947736, 953902, 958421, 962086, 965859, 969808, 973050, 974836, 975142, 974020, 971070, 965999, 959195, 951193, 941916, 930853, 917761, 902809, 886314, 868676, 850338, 831561, 812455, 793415, 774976, 756974, 738468, 719034, 699631, 681502, 664676, 648363, 632461, 617706, 604397, 591904, 579615, 567533, 555658, 543459, 530415, 516685, 502933, 489785]
53228D89785j2156j0986r906r106q519q036p679p293o484n206m071l660l893m421
53214C88369n229o285p090p327p576q579r967j0595j0093r327r140r401r512r245
53200B69003q748q135p423o593n595m546l910m154n063n853o060n962n947n883
53186A85131n434m719m236m164m147l813l353l335l913m412l961k567j269j008
53172A34800j609k097j863j146m64OL87P08P86M19k77p95o41M4N36L19l02o68
53154A28143o06m86n26m82k7Q24J614J710Q08n71j350r82o8M00K27n2j55l41p06
53135A27374r13q16p85j072j215n79P13J714J586M77n39n13L38P37k25j981l061
53118A21240k748j706j024j063j392j472j147o46l45m45q13j205j495j598j346
$$ y = [489785, 477629, 466643, 456737, 447631, 439112, 431076, 423397, 416104, 409620, 404414, 400343, 396683, 392790, 388369, 383140, 376855, 369765, 362438, 354862, 346283, 336316, 325721, 315628, 306301, 297161, 287760, 278248, 269003, 260255, 252120, 244697, 238104, 232509, 227963, 224053, 219899, 214836, 208983, 202923, 196961, 191014, 185131, 179697, 174978, 170742, 166578, 162431, 158618, 155265, 151930, 148017, 143605, 139644, 137077, 135808, 134800, 133191, 131094, 129231, 128085, 127621, 127627, 128014, 128722, 129508, 129927, 129650, 128855, 128214, 128258, 128794, 129113, 128811, 128143, 127537, 127051, 126525, 126043, 126016, 126840, 128454, 130164, 130972, 130401, 129051, 128069, 128001, 128401, 128628, 128576, 128421, 128080, 127374, 126461, 125645, 124860, 123788, 122573, 121994, 122707, 124421, 126007, 126484, 125945, 125432, 125770, 126507, 126282, 124301, 121240, 118492, 116786, 115762, 114699, 113307, 111835, 110688, 110042, 109697, 109252, 108439, 107234, 105739, 104141, 102795]
53103A02795p75l52m33o56l26M67Q23K40p07j203j248j379j617j363l53P24Q83
53086I5520J5r27j023m40o7k70n92p18j010j604j769r33J19J41q07j452j136m34
53068H2613Q4N43R27O44m25j381j411p49k7N69R17O07k95q74o27l18p28j213o73
53049G8183N77J153O87J77L90R79J359J401R93p8j372j820j022R0M05q1n14k39
53031H1268P31J925K690K612K001J664J936K285K070J326N64J59K00N74R28Q65
53015A03798M67K79N50Q23N99K3n21j064j803k462k472j757q67l28l05q46j893
52998I2221k952l214k425j313q23j001r48J3J397J974J105n23j527j089M24J946
52982H3265K578K130J070J14k81j58J39L35L05j0n12q54p33l16l0N3K65O82R04
$$ y = [102795, 102020, 101668, 101235, 100579, 100253, 100720, 101543, 101783, 101076, 99873, 98625, 97246, 95629, 94266, 93913, 94637, 95520, 95535, 94608, 93585, 93145, 93078, 92808, 92216, 91498, 90488, 88884, 87115, 86182, 86301, 86442, 85635, 84183, 83047, 82613, 82697, 83240, 84167, 84811, 84386, 83005, 81594, 80845, 80818, 81387, 82304, 82911, 82616, 81742, 81115, 80797, 80069, 78856, 78183, 78760, 79913, 80600, 80777, 81167, 82146, 83505, 84906, 85899, 85821, 84449, 82629, 81607, 81697, 82102, 82021, 81507, 81268, 81999, 83924, 86614, 89226, 91227, 92891, 94827, 97112, 99182, 100508, 101072, 101231, 101431, 102005, 102933, 103798, 104265, 104544, 105094, 105917, 106516, 106539, 106018, 104954, 103151, 100689, 98217, 96460, 95593, 95265, 94960, 94114, 92221, 89269, 86055, 83630, 82317, 81494, 80493, 79545, 79558, 80955, 82929, 84034, 83511, 81984, 80895, 81319, 83265, 85843, 87973, 89043, 89157, 88876, 88718, 88857, 89192, 89497, 89487, 88975, 88121, 87388, 87072, 87042, 87095, 87360, 88042, 88946]
52963H8946P02M77O61R98R49N82N05R54J452J485J073N82K90K75M14L58j43p57
52945I9803q30k56L01L78L67P36J061N34o85j473j170l22K12K30o5o36j310j441
52927I5434n84P32J556J669J571J463J020K32l31l75l27n15n30Q7R43J226P93
52910A04064K87J80K77J86j30l33j36M16R44J103R35P32N49J86k17j40M15N39
52892A09857m58j813j997n64J323K321K170J456P47L52L33M39K26k80l70N55K152
52875A16449L390L568K843J910J447J701K310K502J808N66m07p23p72j130j855
52860A33607k524k861k948k888k574k051j759k090k714k882k354j701j486j614
52846A01161j709j661j505j101m80j74o47j557k072j840j140k59O35J064N14p26
$$ y = [88946, 89648, 90125, 90786, 91784, 92733, 93315, 93820, 94774, 96226, 97711, 98784, 99366, 99656, 99931, 100345, 100703, 100560, 99803, 98973, 98717, 99018, 99396, 99763, 100499, 101560, 102094, 101409, 99936, 98766, 98444, 98656, 98886, 98821, 98185, 96875, 95434, 94850, 95582, 97138, 98807, 100378, 101841, 102861, 103093, 102762, 102387, 102060, 101545, 101015, 101102, 102045, 103271, 104064, 104351, 104531, 104808, 104994, 104864, 104531, 104395, 104811, 105755, 106858, 107793, 108525, 109074, 109260, 109043, 108903, 109318, 109857, 109399, 107586, 105589, 105025, 106348, 108669, 110839, 112295, 113042, 113394, 113727, 114166, 114392, 114112, 113742, 114297, 116449, 119839, 123407, 126250, 128160, 129607, 131308, 133618, 136120, 137928, 138494, 138087, 137364, 136592, 135462, 133607, 131083, 128222, 125274, 122386, 119812, 117761, 116002, 113912, 111198, 108316, 105962, 104261, 102775, 101161, 99452, 97791, 96286, 95185, 94705, 94531, 93884, 92327, 90255, 88415, 87275, 87016, 87651, 88715, 89229, 88503]
52830H8503j600j523j036r06j046q23j20M13J46p82j562j482o43J26K18q7j30
52813G7666J41J98j07k65K5M24N24M10J96l45j200j684j213k34K82Q2k03p0K51
52794G4878K99%l95o85q80j058j161r67l86K29L77P0j21J45N64P35P48P82O14
52775G3788j8p51r45m72K55R27J415J435P57j55l98K91J125J194M94j89j54N61
52757G9160J276J383J045J018J595K003J318j95j279j221n76j67kM54J295J976
52741H9083J919J080p9r55j325j549k078k800l112k742k110j727j619j495j223
52726F9268q45m19j18j99n71o87k34L48M67K61L66Q83J246J141R41R76R48N00
52708G4272n7j18L14O52N69L14J98J95K36L61M46J53n12j009r46n89l16M8P62
$$ y = [88503, 86903, 85380, 84344, 83438, 82392, 81569, 81449, 81862, 82008, 81226, 79664, 78182, 77539, 77665, 77883, 77796, 77666, 77807, 78005, 77898, 77633, 77658, 78082, 78606, 79016, 79212, 78867, 77667, 75983, 74770, 74536, 74818, 74900, 74697, 74627, 74878, 75177, 75177, 74782, 74097, 73217, 72159, 70998, 70031, 69645, 69874, 70251, 70321, 70200, 70345, 70909, 71644, 72392, 73174, 73788, 73770, 73019, 72074, 71602, 71857, 72784, 74199, 75634, 76391, 76236, 75838, 76129, 77254, 78448, 78942, 78753, 78599, 79160, 80436, 81819, 82864, 83882, 85477, 87480, 88798, 88603, 87324, 86103, 85527, 85360, 85358, 85812, 87107, 89083, 91002, 92082, 92003, 91048, 89723, 88174, 86096, 83296, 80184, 77442, 75332, 73605, 71986, 70491, 69268, 68423, 68004, 67886, 67687, 67116, 66429, 66195, 66543, 67010, 67271, 67637, 68520, 69766, 70907, 71848, 72824, 73772, 74272, 74215, 74097, 74411, 75063, 75632, 75946, 76144, 76339, 76575, 76936, 77382, 77535, 77023, 76014, 75068, 74479, 74163, 74211, 74973]
52689G4973J410J321O62K61K68n1r73j667j389n73k5K91Q59J439J307M82k41m68
52671G7886n79q46r83q15o16n04j19O76J353J431J124Q42M86j93q69r68n68l99
52653G6339q32j392j352n19O80J633J909J446O15k3j60P5L50M70M64M19L86L91
52635H0899M69O28P95Q30O44K91l5j10J44N29O62L28j79k73K82J039J399J270
52617H9612J022Q19M10l40r94q95N6J207J767J559J101R71J209J368J098N49J54
52600A00673J55M09N76M72K55K20L90M12J4n70r10j012j219j584j770j707j719
52583I3085j839j493l69R52J653J630J243O13k78j099j450j456j447j304p72k21
52567H7448k56o97p48k06L50N80P59R20N64m19j284j379r54o00m25k51j27j10
$$ y = [74973, 76383, 77704, 78366, 78627, 78895, 78844, 77871, 76204, 74815, 74242, 74217, 74508, 75367, 76806, 78113, 78595, 78354, 77886, 77307, 76461, 75478, 74663, 74047, 73543, 73424, 74100, 75453, 76884, 78008, 78850, 79336, 79143, 78274, 77306, 76738, 76339, 75507, 74115, 72763, 72244, 72924, 74557, 76466, 77912, 78527, 78504, 78344, 78419, 78769, 79239, 79703, 80122, 80508, 80899, 81368, 81996, 82791, 83621, 84265, 84556, 84521, 84411, 84555, 85084, 85746, 86074, 85895, 85622, 85904, 86943, 88342, 89612, 90634, 91453, 91863, 91523, 90529, 89634, 89690, 90897, 92664, 94223, 95324, 96295, 97504, 98872, 99970, 100519, 100673, 100828, 101237, 101813, 102285, 102540, 102760, 103150, 103562, 103576, 103006, 102096, 101084, 99865, 98281, 96511, 94804, 93085, 91246, 89753, 89384, 90336, 91989, 93619, 94862, 95475, 95197, 94098, 92648, 91192, 89745, 88441, 87669, 87448, 87192, 86495, 85747, 85541, 85891, 86471, 87230, 88150, 88714, 88295, 87011, 85632, 84678, 84078, 83653, 83402, 83275, 83165]
52549H3165N2N23R71R50M92J0j76L8N44R75R69O99O88R96J085P17L28J45l70j641
52529I1160l061l605l045j942q34K0L48P1l40k98J15K39l28j335k189k420j906
52512G0650r80k24J18K67M31M68K30j57n36q91j056p92l08r8n0M73J352J496N39
52493G0932k53K59J299J353L97k84j08L34N33N47K88l87r70p99k09mKO63J777
52474G5370K212J848J760K173J888M45p42m08P48J325J251J296J527J498J292
52459I3483J214R77L01k03J14O33K23j033j920j830j257o84r9K85j2p58r09L3
52441H8558J236J598J064M06J28N9j81p10j366j917k154j855q74N35J577J533
52425H7637O02k06k27K23N47O72P76P37M44K24M13P39P50N17L64J64l50q59q05
$$ y = [83165, 83217, 83740, 84711, 85661, 86153, 86163, 85987, 86025, 86569, 87544, 88513, 89212, 89900, 90896, 91981, 92698, 93026, 93171, 92801, 91160, 88099, 84494, 81449, 79507, 78673, 78693, 79041, 79112, 78772, 78474, 78589, 78828, 78500, 77165, 74976, 72556, 70650, 69670, 69446, 69564, 69831, 70262, 70730, 70960, 70803, 70267, 69376, 68320, 67528, 67220, 67122, 67072, 67545, 68897, 70393, 70932, 70679, 70938, 72237, 73590, 73987, 73703, 73595, 73929, 74462, 75009, 75297, 74910, 73940, 73141, 72932, 72928, 72930, 73593, 75370, 77582, 79430, 81190, 83363, 85251, 85696, 84954, 84546, 85294, 86619, 87870, 89166, 90693, 92191, 93483, 94697, 95674, 95975, 95772, 95886, 96519, 96742, 95709, 93789, 91959, 90702, 90018, 89919, 90204, 90192, 89434, 88525, 88558, 89794, 91392, 92456, 92862, 92990, 93049, 92868, 92158, 90792, 88875, 86721, 84866, 83992, 84527, 86104, 87637, 88239, 88033, 87806, 88029, 88576, 89248, 90024, 90761, 91205, 91429, 91842, 92581, 93331, 93848, 94212, 94376, 94026, 93167, 92362]
52406I2362l11pm8p6k3j68l38l9N65P02K35MN09J108J032M54J8q1L3L88Q91J024
52384I8234M94j10o4M92Q35P96Q45J175J392J193Q17O84R46J481K011K186J919
52367A15326J614J678J874J559O78J0K11J029J696J798J483J071P90P71R98J292
52351A33878J558J954K603L227L378K997K462K075J830J801K325L470M618N030
52337A73206M822M876N702O849P641Q121Q818R792J0476J0521J0337J0567J1279
52324B83007J2013J2475J2903J3606J4405J4693J4174J3302J2897J3272J3924
52313D30671J4102J3528J2483J1404J0534R877R269Q484P414O105M624L077J787
52300E43359J168J137R29r9j704l115m062m834n466n522m924m351m478n162n777
$$ y = [92362, 92051, 92044, 91996, 91920, 91897, 91729, 91391, 91352, 91917, 92619, 92854, 92858, 93367, 94475, 95507, 95961, 95979, 95898, 95931, 96319, 97210, 98234, 98728, 98618, 98554, 99046, 99881, 100677, 101522, 102697, 104089, 105282, 106099, 106783, 107729, 109210, 111221, 113407, 115326, 116940, 118618, 120492, 122051, 122729, 122739, 122950, 123979, 125675, 127473, 128956, 130027, 130817, 131588, 132586, 133878, 135436, 137390, 139993, 143220, 146598, 149595, 152057, 154132, 155962, 157763, 160088, 163558, 168176, 173206, 178028, 182904, 188606, 195455, 203096, 211217, 220035, 229827, 240303, 250824, 261161, 271728, 283007, 295020, 307495, 320398, 334004, 348409, 363102, 377276, 390578, 403475, 416747, 430671, 444773, 458301, 470784, 482188, 492722, 502599, 511868, 520352, 527766, 533871, 538495, 541572, 543359, 544527, 545664, 546593, 546494, 544790, 541675, 537613, 532779, 527313, 521791, 516867, 512516, 508038, 502876, 497099]
52285D97099n927n438m081j885M79K177L066L671M354N068N829O838P955Q642
52271E27847Q752Q959R942J1389J2304J2200J1537J0938J0328R129P168N192M257
52258F49942M592N201M810L207J316j16j388l059m731n424n111n052o242q161
52244F29784r602j0283j0865j1690j2270j2148j1564j0991j0557j0233j0149j0236
52232D99196r938q740o867n025l632k684k185k153k185j665n83K70K61k35l32
52217D53503K57R65J215J102J140J547K004K110J892J797K128K646K811K410J794
52202D79321J410J327J309J265J278J244Q48N1o33o58k54k68j116k184k519j929
52186D78492j213j275k271l503m022l444k332j663j737j824j209k77l5p21j583
$$ y = [497099, 491172, 485734, 481653, 479768, 480247, 482424, 485490, 489161, 493515, 498583, 504412, 511250, 519205, 527847, 536599, 545558, 555500, 566889, 579193, 591393, 602930, 613868, 624196, 633325, 640493, 645685, 649942, 654534, 659735, 664545, 667752, 669068, 668952, 667564, 664505, 659774, 654350, 649239, 644187, 637945, 629784, 620182, 609899, 599034, 587344, 575074, 562926, 551362, 540371, 529814, 519581, 509432, 499196, 489258, 480518, 473651, 468626, 464994, 462310, 460125, 457972, 455787, 454122, 453539, 453809, 454070, 453835, 453503, 453760, 454725, 455940, 457042, 458182, 459729, 461733, 463843, 465735, 467532, 469660, 472306, 475117, 477527, 479321, 480731, 482058, 483367, 484632, 485910, 487154, 488002, 488053, 487420, 486762, 486508, 486240, 485124, 482940, 480421, 478492, 477279, 476004, 473733, 470230, 466208, 462764, 460432, 458769, 457032, 455208, 453999, 453722, 453687, 452966, 451383]
52171D51383k023k241k458k347j712j062r43j150j230j294j614j810j307l72R9
52156D29919j91o90r46r77p54j23N84O94K75K43J081K120K555K515K601K909L105
52139D44920L105L156L439M054N091O382P489Q286R229J0679J2258J3303J3657
52126E45048J3701J3826J4149J4498J4458J3867J3330J3626J4350J4019J2107
52115F96979J0071R502R962R798Q503P004N906M874L784L090K717J762j85k355
52101G71412l932n055o188p252p970q426q751q758q407q109q116q073p553o613
52087F68209n424l951k368j213o19k3Q93J681K102K887M613O486P345P443Q041
52072F96102R468J0751J1201J1172J1023J0478R455Q628Q540Q786Q574P685O407
$$ y = [451383, 449360, 447119, 444661, 442314, 440602, 439540, 438597, 437447, 436217, 434923, 433309, 431499, 430192, 429820, 429919, 429728, 429038, 428092, 427115, 426361, 426238, 426822, 427516, 427791, 428034, 429115, 431235, 433790, 436305, 438906, 441815, 444920, 448025, 451181, 454620, 458674, 463765, 470147, 477636, 485922, 495151, 505830, 518088, 531391, 545048, 558749, 572575, 586724, 601222, 615680, 629547, 642877, 656503, 670853, 684872, 696979, 707050, 716552, 726514, 736312, 744815, 751819, 757725, 762599, 766383, 769473, 772190, 773952, 773767, 771412, 767480, 762425, 756237, 748985, 741015, 732589, 723838, 715080, 706673, 698564, 690448, 682375, 674822, 668209, 662785, 658834, 656466, 655253, 654634, 654611, 655504, 657185, 659287, 662174, 666787, 673273, 680618, 688061, 696102, 705570, 716321, 727522, 738694, 749717, 760195, 769650, 778278, 786818, 795604, 804178, 811863, 818270]
52059H18270M986L529K138P45q64k678m422o021p647r189j0278j1047j2207j3912
52045G51403j5286j5659j5689j6412j7654j8273j7782j6812j6002j5286j4404
52034E72144j3428j2532j1782j1335j1345j1461j1030r953q889q350q083p711
52022D46245p358p346p531p555p376p208p107p050p203p664q117q167p957q015
52008C40591q525r106r292q919q172p568p720q650r441r154q074p430p794q412
51994B22334q355p677o961o324n540m788m543m770m863m437l741l201k945k876
51980A51313k810k488j784j078j083k054l403m239m178l517k824k482k504k629
51966A14240k583k331j936j372o75k37n12j326j857j535o77o6j18p23j536k078
$$ y = [818270, 823256, 826785, 828923, 829668, 828804, 826126, 821704, 815683, 808036, 798847, 788569, 777522, 765315, 751403, 736117, 720458, 704769, 688357, 670703, 652430, 634648, 617836, 601834, 586548, 572144, 558716, 546184, 534402, 523067, 511722, 500261, 489231, 479278, 470389, 462039, 453956, 446245, 438887, 431541, 424010, 416455, 409079, 401871, 394764, 387714, 380511, 372847, 364730, 356563, 348606, 340591, 332066, 322960, 313668, 304749, 296577, 289009, 281289, 272639, 263198, 254044, 245970, 238540, 230746, 222334, 213979, 206302, 199341, 193017, 187477, 182689, 178146, 173376, 168513, 164076, 160335, 157134, 154189, 151313, 148503, 146015, 144231, 143153, 142070, 140016, 136613, 132374, 128196, 124679, 121855, 119373, 116869, 114240, 111657, 109326, 107390, 106018, 105343, 105106, 104594, 103268, 101411, 99876, 99199, 99133, 99015, 98292, 96756, 94678]
51950I4678j856q65J35L32j21l24J60P35O02k06r39j035n84p4J14o4l97o99r92
51931H8600j348j660j700j412r22k55O57J572J844J077k56j210j355j131j186
51916H1315j561j694j153j93M86M60pl61m08l62l54j91K93Q87J179R55K74n60
51898G9005j051q11m8N03M07K0j27j30m16q51q57l82p4k90n91n29l80o06r89r12
51878G0891k71M53R25J269J584J699J475J059N80po35q76l32Q23J832K046J540
51861H4055R87Q69R41O39nk66L32J334J954K087K222K490K459J938J480J693K459
51844A07668L168L503L674M003M600N428O384P269P772P629O802N528M077K401
51830A79906K29k318m427n370n494n875o902p763p602o627n654n048m616m161
$$ y = [94678, 92822, 91957, 92092, 92424, 92303, 91979, 92139, 92874, 93476, 93270, 92331, 91296, 90712, 90638, 90752, 90688, 90291, 89592, 88600, 87252, 85592, 83892, 82480, 81558, 81303, 81960, 83532, 85376, 86453, 86197, 84987, 83632, 82501, 81315, 79754, 78060, 76907, 76714, 77200, 77660, 77653, 77292, 76884, 76522, 76168, 75977, 76270, 77157, 78336, 79291, 79565, 79005, 77954, 77143, 77095, 77598, 78005, 78025, 77898, 77768, 77352, 76501, 75644, 75262, 75188, 74898, 74307, 73778, 73398, 72792, 71803, 70891, 70620, 71073, 71998, 73267, 74851, 76550, 78025, 79084, 79664, 79657, 79022, 78146, 77814, 78637, 80469, 82515, 84055, 85042, 85911, 86852, 87491, 87486, 87220, 87552, 88886, 90840, 92927, 95149, 97639, 100098, 102036, 103516, 105209, 107668, 110836, 114339, 118013, 122016, 126616, 132044, 138428, 145697, 153469, 161098, 167900, 173428, 177505, 179906, 180135, 177817, 173390, 168020, 162526, 156651, 149749, 141986, 134384, 127757, 122103, 117055, 112439, 108278]
51816A08278l569k690j672j205j652k252j948r38m94j059j562r86K43J060J215
51801I0769J096O86k34j137j042J0P23K16q09j089m89M6j5j73J12N21L77k85p59
51782H8524o62l59k78k34J75P94R90M79l02p29o48l78k67m04o41p58o52m08j35
51763H4107J70M56M85Q5m48o07k72K39P66J471K265K573K035J070L65K2k85n32
51745I3965k53P53J996K715K505J604O71K80L86M72L13L35Q85J495J358M34m57
51728A09457o52k86Q9Q8l24q49j014p32o39j358k474k887k245j325q12m61R5N72
51710I4243O23N89Q69J013L41q83j671j598j112o67l46l13p86j416j468q69l71
51693H6178l79l60J65P18N87j9k71R0N11M79M0n40j103j466j383q76l46k32n71
$$ y = [108278, 104709, 102019, 100347, 99142, 97490, 95238, 93290, 92352, 91858, 90799, 89237, 88251, 88494, 89554, 90769, 91865, 92551, 92317, 91180, 90138, 90148, 90871, 91087, 90278, 89189, 88700, 88746, 88731, 88558, 88670, 89191, 89568, 89283, 88524, 87862, 87503, 87225, 86991, 87166, 87960, 88950, 89429, 89127, 88398, 87750, 87372, 87105, 86701, 86060, 85302, 84650, 84242, 84107, 84277, 84733, 85218, 85303, 84855, 84248, 83976, 84215, 84981, 86452, 88717, 91290, 93325, 94395, 94760, 94782, 94497, 93965, 93712, 94465, 96461, 99176, 101681, 103285, 103956, 104236, 104622, 105094, 105407, 105742, 106627, 108122, 109480, 109914, 109457, 108805, 108519, 108608, 108696, 108372, 107523, 106509, 105777, 105138, 103780, 101306, 98419, 96174, 94849, 94037, 93576, 93671, 94243, 94866, 95455, 96324, 97337, 97678, 96795, 95124, 93526, 92414, 91747, 91401, 91088, 90302, 88886, 87418, 86549, 86178, 85799, 85439, 85604, 86322, 86909, 86890, 86619, 86709, 87220, 87699, 87739, 87199, 86096, 84630, 83247, 82371, 82025, 81793, 81222]
51674H1222j000j039m52N54J451J810J639J203O76J08m15p31p42m68J3N16P55
51657H5100N74J38k30l00P9R36J905K143J107n75j487q98M50J264J117O50N54
51640I2527Q29J055J071J115J442J951K312K345K186K030J903J779J809K147K539
51625A19040K406J497L05l99k81L80J056J309R12Nq42j105q93q63j366j989k171
51608A17001k020k074k362k218j292k64j00q69j773k265k504k609k179j049n3
51593I3370k58j521k513k339j478q84o76l13L26P34O38M89P24J051Q01n9p34n24
51575H6834L15Q69N96j31n97n52k83m2K47P20J305J774J886J418L48q16j236n40
51557I2115O99J503J472R97O41O14Q31J102J253J226J137J119J026N87j04m46
$$ y = [81222, 80222, 79183, 78731, 79285, 80736, 82546, 84185, 85388, 86064, 86172, 85757, 85026, 84284, 83816, 83829, 84345, 85100, 85674, 85812, 85582, 85282, 85361, 86297, 88202, 90345, 91452, 90877, 89390, 88492, 88942, 90206, 91323, 91973, 92527, 93356, 94411, 95482, 96597, 98039, 99990, 102302, 104647, 106833, 108863, 110766, 112545, 114354, 116501, 119040, 121446, 122943, 123248, 122849, 122568, 122948, 124004, 125313, 126225, 126230, 125388, 124283, 123390, 122527, 121161, 119172, 117001, 114981, 112907, 110545, 108327, 107035, 106771, 106671, 105802, 104029, 101764, 99260, 96651, 94472, 93423, 93370, 93112, 91591, 89078, 86739, 85261, 84377, 83701, 83388, 83714, 84448, 85086, 85575, 86299, 87350, 88151, 88092, 87358, 86834, 87149, 88018, 88614, 88483, 87886, 87334, 87051, 87009, 87256, 87976, 89281, 91055, 92941, 94359, 94707, 93891, 92655, 92115, 92814, 94317, 95789, 96786, 97427, 98041, 98872, 99974, 101227, 102453, 103590, 104709, 105735, 106322, 106218, 105772]
51541A05772N4J139J956J906J239O85O43Q38Q79Q57J140J701K064J970J669J432
51525A25944J165P88O54J106J844K221K032J606J238J021J076J343J264L48q80
51510A42770j240m49M17M06r4j49K79M86K18p9j48k95p56j241j334r89n21l16
51492A36965o03j288k010k511k852l103l058k566j997j836j990j878j282o19l65
51477A09007n38q96j215j341j273j290j643k095k094j502p91m01l12l43m64o48
51461I2161p38o97o99p96p97n94l44j87j22k57p45j328j371o82J45M97M34L21
51443H4201J97o9l18l32k28j92p9K91O41N40N1l90n62n08k12K50M59J31k84p6
51423H3511O80J195J054O31L38J54pjJ68K43J15RN1J34L01P30J235J307Q65M17
$$ y = [105772, 105826, 106965, 108921, 110827, 112066, 112751, 113394, 114232, 115111, 115968, 117108, 118809, 120873, 122843, 124512, 125944, 127109, 127897, 128551, 129657, 131501, 133722, 135754, 137360, 138598, 139619, 140695, 142038, 143302, 143650, 142770, 141530, 141081, 141498, 141904, 141810, 141661, 141940, 142426, 142644, 142565, 142417, 142122, 141366, 140125, 138791, 137802, 137281, 136965, 136362, 135074, 133064, 130553, 127701, 124598, 121540, 118974, 116977, 115141, 113151, 111273, 109991, 109372, 109007, 108469, 107573, 106358, 105017, 103744, 102454, 100811, 98716, 96622, 95120, 94329, 93928, 93616, 93273, 92809, 92161, 91423, 90726, 90027, 89231, 88434, 87840, 87496, 87309, 87187, 86930, 86185, 84857, 83486, 82804, 82949, 83446, 83880, 84201, 84398, 84329, 84011, 83679, 83451, 83259, 83180, 83471, 84112, 84652, 84703, 84313, 83751, 83243, 83031, 83281, 83740, 83871, 83587, 83511, 84191, 85386, 86440, 87071, 87409, 87563, 87556, 87555, 87723, 87966, 88081, 88090, 88141, 88275, 88576, 89306, 90541, 91848, 92713, 93130]
51403I3130K26m9n95j014j050j141j654k144k022j514j234j171q73l98k65n93
51387G7639r10q67n27mN42O48n1j069j474j135q51j031j059l82M46M31n23j583
51369F8240k009j761j162m87J33P23J301J595J125j13j277j464p67j22j25l93
51353F3437k87J96M88J77n45j163j296r16k23N50J220J584J464Q84J59l38m56
51336F4935l43k69m28q13j117q82O1J265J907J580P25K50O17J424J841J434M73
51319G2660m49r66j079r56p53n90m56j85L42Q94J051P10K74J46K30J57j27k96
51301G0607k19k23o29j189j298p50n2J44k48p51r31p10j76O14J442J898J841J697
51283G1067J838J877J099l53j333j061j19L61J63MK38L64Mk87K58J425K195K058
$$ y = [93130, 93356, 93307, 92712, 91698, 90648, 89507, 87853, 85709, 83687, 82173, 80939, 79768, 78895, 78497, 78232, 77639, 76729, 75862, 75335, 75331, 75873, 76521, 76470, 75401, 73927, 72792, 71941, 70910, 69851, 69469, 69915, 70346, 69823, 68240, 66231, 64470, 63308, 62821, 62954, 63677, 64978, 66573, 67698, 67585, 66308, 64844, 64077, 63955, 63830, 63437, 63150, 63346, 63834, 64011, 63466, 62303, 61007, 60091, 59868, 60418, 61638, 63222, 64686, 65570, 65729, 65391, 64935, 64592, 64323, 63895, 63082, 61965, 61083, 61144, 62409, 64316, 65896, 66621, 66871, 67488, 68912, 70753, 72187, 72660, 72211, 71245, 70166, 69210, 68457, 67867, 67411, 67226, 67568, 68462, 69513, 70223, 70497, 70643, 70873, 71030, 70903, 70607, 70388, 70165, 69536, 68347, 67049, 66299, 66247, 66391, 66143, 65392, 64461, 63751, 63575, 64189, 65631, 67529, 69370, 71067, 72905, 74782, 75881, 75528, 74195, 73134, 73015, 73376, 73539, 73543, 73781, 74145, 74149, 73862, 74120, 75545, 77740, 79798]
51265G9798J622J706K240K498K148J589J207Q64L70MJ11M26L76r2m43m28l59m27
51247I3210l10J54M43L8p47j203j233j292j492j419q55p8O44J288J649J354M91
51230I0642j81j21K93L10k53r07j107o28L19J086R71M4p03m50M06P85L45k21k51
51211I0379R5K21j51q33j413j576j389j334j692j948j349j20N54N0p88p97J3P34
51193G8656R90J186J444J273M53m13p52q28j195j688j573n81O92J438J331N84
51177H1017l32r11q51k96K67M78L59J66P7Q8O1j43m40m94p9M78N34n1o33n27J34
51156G8902O16N29J92M2M5r8m23o31m91p7L89P51R48R30O68K56l9P1N99J170J339
51135H5688J063P75Q15R75P81J83l70n55n10l91KP45J239Q02k26o06K52J446J696
$$ y = [79798, 81420, 83126, 85366, 87864, 90012, 91601, 92808, 93672, 94042, 94046, 94157, 94583, 94959, 94867, 94424, 93996, 93637, 93210, 92900, 93054, 93497, 93535, 92788, 91585, 90352, 89060, 87568, 86149, 85294, 85216, 85860, 87148, 88797, 90151, 90642, 90461, 90340, 90633, 90943, 90690, 89783, 88676, 88048, 88367, 89453, 90424, 90468, 89765, 89315, 89721, 90506, 90851, 90630, 90379, 90474, 90695, 90544, 89711, 88298, 86722, 85333, 83999, 82307, 80359, 79010, 78890, 79444, 79494, 78706, 77909, 77922, 78656, 79646, 80832, 82276, 83549, 84002, 83589, 82837, 82009, 80814, 79126, 77553, 76972, 77664, 79102, 80433, 81017, 80685, 79774, 78923, 78627, 78894, 79372, 79731, 79897, 79974, 80062, 80123, 79980, 79540, 79046, 78967, 79445, 79979, 79928, 79295, 78768, 78902, 79518, 80047, 80239, 80281, 80326, 80228, 79805, 79174, 78683, 78606, 78995, 79746, 80694, 81624, 82292, 82548, 82509, 82580, 83179, 84349, 85688, 86751, 87526, 88341, 89316, 90097, 90280, 89910, 89355, 88845, 88454, 88456, 89201, 90440, 91242, 91016, 90410, 90662, 92108, 93804]
51116I3804R45K24J93N19O93P60R57J171J143R12P11O18N68N73O50O97O86P40
51098A06564Q61P96M43J23O8p0p30j586j811j196m54k12k38MM71P00N65M44N84
51079A05326P08M73P5J50J024K186K669J992O04o42j264j328j124r84j185j605
51063A07075j639q95Q8L71m7j12P81J808J756O31m59p22l64P1M19P17R26J014
51045A11419J060J106J082R84R21R65J154J609K341K898K661J668P45N91J012
51030A32216J343J355J312J323J201Q94P01Q54J224J579J871K106K169K029J973
51015A54150K259K675K711K289J965K285L152M038M642N093N567N992O193O151
51001B09162O076O317P109Q253R128R256Q899Q909R911J1846J4266J6739J8885
$$ y = [93804, 94749, 94973, 95166, 95685, 96378, 97138, 98095, 99266, 100409, 101321, 102032, 102650, 103218, 103791, 104441, 105138, 105824, 106564, 107425, 108221, 108664, 108787, 108855, 108785, 108055, 106469, 104658, 103462, 103008, 102796, 102558, 102562, 103033, 103733, 104298, 104742, 105326, 106034, 106507, 106582, 106732, 107756, 109942, 112611, 114603, 115207, 114565, 113301, 111973, 110849, 109865, 108680, 107075, 105436, 104541, 104629, 105000, 104953, 104841, 105622, 107430, 109186, 109817, 109358, 108636, 108272, 108343, 108762, 109479, 110405, 111419, 112479, 113585, 114667, 115651, 116572, 117537, 118691, 120300, 122641, 125539, 128200, 129868, 130613, 131204, 132216, 133559, 134914, 136226, 137549, 138750, 139644, 140345, 141199, 142423, 144002, 145873, 147979, 150148, 152177, 154150, 156409, 159084, 161795, 164084, 166049, 168334, 171486, 175524, 180166, 185259, 190826, 196818, 203011, 209162, 215238, 221555, 228664, 236917, 246045, 255301, 264200, 273109, 283020, 294866, 309132, 325871, 344756]
50988C44756K0409K1425K2542K4324K6759K9479L2275L5140L7983M0698M3393
50977F79183M6198M8842N0762N1673N1705N0931M9185M6460M3147L9549L5423
50966A193058L0269K4073J7464J1141N302k23n440r946j3277j5338j6398j6691
50954A203994j6324j5539j4703j3900j2865j1613j0747j0758j1404j2244j3578
50943A060319j6072j9498k2720k5101k7137k9381l1436l2748l3620l4678l5604
50932G52324l5434l4041l2429l1324l0214k8229k5384k2462j9983j7831j5792
50921D59201j3913j2262j0738r260p952o971o245n548m793m057l354k557j654
50908C69897r08n71n03l34J03O30J080J473J824K078K342K878L648M195M255M212
$$ y = [344756, 365165, 386590, 409132, 433456, 460215, 489694, 521969, 557109, 595092, 635790, 679183, 725381, 774223, 824985, 876658, 928363, 979294, 1028479, 1074939, 1118086, 1157635, 1193058, 1223327, 1247400, 1264864, 1276005, 1281307, 1281084, 1275644, 1265698, 1252421, 1237083, 1220685, 1203994, 1187670, 1172131, 1157428, 1143528, 1130663, 1119050, 1108303, 1097545, 1086141, 1073897, 1060319, 1044247, 1024749, 1002029, 976928, 949791, 920410, 888974, 856226, 822606, 787928, 752324, 716890, 682849, 650420, 619096, 588882, 560653, 535269, 512807, 492824, 474993, 459201, 445288, 433026, 422288, 413028, 405076, 398105, 391860, 386312, 381519, 377462, 374108, 371551, 369897, 368989, 368418, 367915, 367581, 367684, 368314, 369394, 370867, 372691, 374769, 377111, 379989, 383637, 387832, 392087, 396299]
50892C96299M528N037N220N099N303O186P392Q403R141R811J0579J1529J2671
50879D97198J3812J4774J5925J8068K1458K5241K8373L0841L3621L7548M2704
50868G79563M8796N5517O2481O9273P5806Q2397Q9243R6108J02631J08582J13638
50857A684035J17175J18674J18079J15440J10357J02220R1063P7728O3107M7529
50847B645407L1120J4485j355j5565k7709l7379m4036m7418m7910m6199m2670
50836B380771l7453l1062k4644j9373j5830j4170j4636j7460k2292k8201l4447
50825B121203m0992m8085n5598o2997o9692p5093p8623q0097q0078p9346p8003
50814A372599p5417p1154o5595n9556n3642m8122m3038l8211l3390k8705k4698
$$ y = [396299, 400827, 405864, 411084, 416183, 421486, 427672, 435064, 443467, 452608, 462419, 472998, 484527, 497198, 511010, 525784, 541709, 559777, 581235, 606476, 634849, 665690, 699311, 736859, 779563, 828359, 883876, 946357, 1015630, 1091436, 1173833, 1263076, 1359184, 1461815, 1570397, 1684035, 1801210, 1919884, 2037963, 2153403, 2263760, 2365980, 2457043, 2534771, 2597878, 2645407, 2676527, 2691012, 2689657, 2674092, 2646383, 2609004, 2564968, 2517550, 2469640, 2423441, 2380771, 2343318, 2312256, 2287612, 2268239, 2252409, 2238239, 2223603, 2206143, 2183851, 2155650, 2121203, 2080211, 2032126, 1976528, 1913531, 1843839, 1768746, 1690123, 1610026, 1529948, 1450602, 1372599, 1297182, 1226028, 1160433, 1100877, 1047235, 999113, 956075, 917864, 884474, 855769, 831071]
50803H31071k1636j9148j6742j4425j2411j0568q688p095o304o153n895n291m903
50790F91812n124n528n550n338n455o010o624o992p134p198p402q030r088r991
50776E96348r992q974p521o214n176m294l596l165k905k480j531M8J932L648N109
50761E51237O740Q819J0936J2515J3798J5731J8792K2381K5643K8517L1647L5486
50749G82242L9869M4335M8579N2598N6605O0671O4384O7035O8387O8917O8912
50738A422534O7612O3940N8006N1135M4094L6041K5838J3874J852r018j8720k7314
50726A729874l4110l8375m0184l9974l7763l3508k7973k2425j7488j2966q835
50715A416273n731m160l930m731o854j0759j6254k2538k8792l4338l8533m1117
$$ y = [831071, 809435, 790287, 773545, 759120, 746709, 736141, 727453, 720358, 714054, 707901, 702006, 696715, 691812, 686688, 681160, 675610, 670272, 664817, 658807, 652183, 645191, 638057, 630859, 623457, 615427, 606339, 596348, 586356, 577382, 569861, 563647, 558471, 554177, 550581, 547416, 544511, 542031, 540500, 540548, 542480, 546128, 551237, 557977, 566796, 577732, 590247, 604045, 619776, 638568, 660949, 686592, 715109, 746756, 782242, 822111, 866446, 915025, 967623, 1024228, 1084899, 1149283, 1216318, 1284705, 1353622, 1422534, 1490146, 1554086, 1612092, 1663227, 1707321, 1743362, 1769200, 1783074, 1784926, 1775908, 1757188, 1729874, 1695764, 1657389, 1617205, 1577231, 1539468, 1505960, 1477987, 1455562, 1438074, 1425108, 1416273, 1410542, 1406382, 1402452, 1397721, 1390867, 1380108, 1363854, 1341316, 1312524, 1278186, 1239653, 1198536]
50703A198536m2534m3321m3247m1620l8536l5100l2172k9520k6564k3487k0968
50692H21467j9150j7424j5247j2654r861o891l783q59J586L706N840P913R342
50679G63985R736R372Q866Q456P908P102O400O248O661P254P689P891P943Q035
50665H73546Q419R181J0040J0662J1222J2399J4657J7679K0659K3001K4709K6193
50653A062367K7830K9634L1252L2279L2590L2287L1371K9673K7081K3682J9696
50642A379742J5473J1543Q331N677K884n69m558q611j2312j5223j6796j6829j5933
50629A332819j5074j4669j4363j3651j2436j1003r702q712p895o947n788m684
50617A207895l770k671j079M69R79J69j376l307o087j0018j4362j8175k1619k5631
$$ y = [1198536, 1156002, 1112681, 1069434, 1027814, 989278, 954178, 922006, 892486, 865922, 842435, 821467, 802317, 784893, 769646, 756992, 747131, 740240, 736457, 735598, 737184, 740890, 746730, 754643, 763985, 773721, 783093, 791959, 800415, 808323, 815425, 821825, 828073, 834734, 841988, 849677, 857568, 865511, 873546, 881965, 891146, 901186, 911848, 923070, 935469, 950126, 967805, 988464, 1011465, 1036174, 1062367, 1090197, 1119831, 1151083, 1183362, 1215952, 1248239, 1279610, 1309283, 1336364, 1360046, 1379742, 1395215, 1406758, 1415089, 1420766, 1423650, 1423081, 1418523, 1409912, 1397600, 1382377, 1365581, 1348752, 1332819, 1317745, 1303076, 1288713, 1275062, 1262626, 1251623, 1241921, 1233209, 1225314, 1218367, 1212579, 1207895, 1204125, 1201454, 1200375, 1200844, 1201823, 1201992, 1200616, 1197309, 1191222, 1181204, 1166842, 1148667, 1127048, 1101417]
50603A101417l0270l4193l6073l5938l4839l3582l2269l0742k8963k6927k4600
50592G53021k2086j9626j7328j5009j2519j0130q337p181n977m043j636K53J166
50579F30568J779K892M253N047N333O065P593R046R708J0185J1447J3221J4387
50566G31524J4731J5270J6697J8373J9269J9252J9001J9075J9536K0133K0505
50555I33366K0430K0144K0244K1148K2952K5819K9877L4470L8314M0882M3086
50544A250732M6043M9807N3925N8547O3879O9058P2905P5668P8608Q1781Q3547
50533A984500Q2766Q0137P6699P2163O5729N7613M8610L8727K7366J4623J278
50522B550211j2211k5671l8263m8723n6755o3269o8961p3364p5658p5684p3813
$$ y = [1101417, 1071147, 1036954, 1000881, 964943, 930104, 896522, 864253, 833511, 804548, 777621, 753021, 730935, 711309, 693981, 678972, 666453, 656323, 647986, 640805, 634828, 630785, 629149, 629402, 630568, 632347, 635239, 639492, 644539, 649872, 655937, 663530, 672576, 682284, 692469, 703916, 717137, 731524, 746255, 761525, 778222, 796595, 815864, 835116, 854117, 873192, 892728, 912861, 933366, 953796, 973940, 994184, 1015332, 1038284, 1064103, 1093980, 1128450, 1166764, 1207646, 1250732, 1296775, 1346582, 1400507, 1459054, 1522933, 1591991, 1664896, 1740564, 1819172, 1900953, 1984500, 2067266, 2147403, 2224102, 2296265, 2361994, 2419607, 2468217, 2506944, 2534310, 2548933, 2550211, 2538000, 2512329, 2474066, 2425343, 2368588, 2305319, 2236358, 2162994, 2087336, 2011652, 1937839]
50511A937839p0370o5609n9811n3092m5461l7305k9403k2204j5483q883k393L887
50499A531712R903J5260J9201K1399K2209K1722J9130J3617N465m366j5296k6930
50487A633026l8181m7575n4502n9375o2501o3716o3238o1930o0301n7914n4377
50476A009416n0226m6264m2465l8298l3791k9613k6218k3446k0972j8595j6105
50465F63423j3319j0335p371m419j407J367L425M793N956P117P979Q417Q791R394
50451F83811J0072J0698J1481J2395J2819J2385J1762J1855J2428J2344J1199
50440H13249R915R465R760J0230J0884J2075J3583J4705J5251J5795J6843J8255
50428I70010J9802K1776K4628K8187L1703L4640L6994L8803L9879M0299M0728
$$ y = [1937839, 1867469, 1801860, 1742049, 1688957, 1643496, 1606191, 1576788, 1554584, 1539101, 1530218, 1527825, 1531712, 1541615, 1556875, 1576076, 1597475, 1619684, 1641406, 1660536, 1674153, 1679618, 1675252, 1659956, 1633026, 1594845, 1547270, 1492768, 1433393, 1370892, 1307176, 1243938, 1182008, 1121707, 1063793, 1009416, 959190, 912926, 870461, 832163, 798372, 768759, 742541, 719095, 698123, 679528, 663423, 650104, 639769, 632398, 627979, 626572, 627939, 631364, 636157, 642113, 649230, 657209, 665626, 674417, 683811, 693883, 704581, 716062, 728457, 741276, 753661, 765423, 777278, 789706, 802050, 813249, 823164, 832629, 842389, 852619, 863503, 875578, 889161, 903866, 919117, 934912, 951755, 970010, 989812, 1011588, 1036216, 1064403, 1096106, 1130746, 1167740, 1206543, 1246422, 1286721, 1327449]
50417A327449M1689M2604M2116L9486L5212L0209K4838J9012J2713N862j946j0855
50405A608389k0101k8572l6027m2987m9420n4244n6591n6861n6066n4650n2472
50394A100398m9500m5892m1600l6531l0971k5392j9944j4659r876n896k324J488
50382H19301N455Q911J1724J4346J6515J6888J4574J0339N629R81l894q893j3412
50369H98464j7296k0982k4575k7455k9024k9416k9198k8765k8193k7320k5861
50358F10379k3731k1341j9303j7767j6394j4971j3622j2358j0933r322p871o726
50346D36040n593m263k888j523O9J765K882L181L507M682O303P426P986Q499Q769
50331D76842Q125O961O637P594Q736R156R191R147Q228N886L212J670J075K12
$$ y = [1327449, 1369138, 1411742, 1453858, 1493344, 1528556, 1558765, 1583603, 1602615, 1615328, 1621190, 1619244, 1608389, 1588288, 1559716, 1523689, 1480702, 1431282, 1377038, 1320447, 1263586, 1207520, 1152870, 1100398, 1050898, 1005006, 963406, 926875, 895904, 870512, 850568, 835909, 826033, 820137, 817813, 819301, 824756, 833667, 845391, 859737, 876252, 893140, 907714, 918053, 923682, 924663, 920769, 911876, 898464, 881168, 860186, 835611, 808156, 779132, 749716, 720518, 691753, 663560, 636240, 610379, 586648, 565307, 546004, 528237, 511843, 496872, 483250, 470892, 459959, 450637, 442766, 436040, 430447, 426184, 423296, 421773, 421842, 423607, 426489, 429670, 433177, 437859, 444162, 451588, 459574, 468073, 476842, 484967, 491928, 498565, 506159, 514895, 524051, 533242, 542389, 550617, 556503, 559715, 561385, 562460, 562672]
50317E62672j013j549j193j010j492j746j111l78o73j923l187l872l938l495k920
50302E33172k827l321l615l018j885j035o95o51r75j723k245j783o36J15M3l02
50286E08619m07l77l20j05N9l54j233j745j554j452k157l228l814l942m237m810
50270D78943n254n507n790n846n139l954l306l510l562k532q41M12R57J460K332
50255D38863L185L488L205K610J904J237P60M15l6o60j183j362j331j326j333
50240D48436j199r79r14j159j695k436l198l698l805l718l776m157m876n827o555
50225D00444o353n091l721l381m003m481m228l761l601l334k395j088j58L13P99
50210C55961J356J420O72m68j295j467j226j200j888k984l494k874j806j339j513
$$ y = [562672, 561659, 560110, 558917, 557907, 556415, 554669, 553558, 553180, 552507, 550584, 547397, 543525, 539587, 536092, 533172, 530345, 527024, 523409, 520391, 518506, 517471, 516776, 516125, 515150, 513427, 511182, 509399, 508763, 508878, 508921, 508619, 508212, 507835, 507515, 507410, 507469, 507115, 505882, 504137, 502583, 501131, 498974, 495746, 491932, 487990, 483753, 478943, 473689, 468182, 462392, 456546, 451407, 447453, 444147, 440637, 437075, 434543, 433702, 434114, 435071, 436531, 438863, 442048, 445536, 448741, 451351, 453255, 454492, 455252, 455667, 455631, 454971, 453788, 452426, 451095, 449769, 448436, 447237, 446258, 445344, 444185, 442490, 440054, 436856, 433158, 429353, 425635, 421859, 417702, 412826, 406999, 400444, 394091, 389000, 385279, 381898, 377895, 373414, 369186, 365425, 361824, 358490, 356095, 355007, 354849, 355162, 355961, 357317, 358737, 359409, 358941, 357646, 356179, 354953, 353753, 351865, 348881, 345387, 342513, 340707, 339368, 337855]
50195C37855j487r15l08k4K63P50R77O24K39N46J402K053K223K394L063M217N601
50178C59473P144Q952J1056J3272J5292J6901J8048J8681J8612J7793J6506J5092
50166E36822J3545J1796J0246R422R034Q100O236M251K981K140Q27j286l939p063
50152F03112j0733j4482j7486j9488k0907k1928k2153k1318j9772j7922j5753
50141D01170j3280j1031r570q781q064p119o099n083l902k578j537j136j128q82
50127C20980nJ292K413K813K385J614J279J705K316K202J269M90P65J812K567
50112C45897K533K257K405K867L033K634K040J840K321L296M277M882N134N340
50098C90756N680O128O684P401Q109Q428Q296Q152Q414Q896R061Q688Q109P834
$$ y = [337855, 336368, 335453, 335145, 335121, 335384, 336134, 337111, 337735, 337974, 338520, 339922, 341975, 344198, 346592, 349655, 353872, 359473, 366617, 375569, 386625, 399897, 415189, 432090, 450138, 468819, 487431, 505224, 521730, 536822, 550367, 562163, 572409, 581831, 590865, 598965, 605201, 609452, 612433, 614573, 615400, 614114, 610175, 603112, 592379, 577897, 560411, 540923, 520016, 498088, 475935, 454617, 434845, 416923, 401170, 387890, 376859, 367289, 358508, 350444, 343325, 337226, 332143, 328241, 325663, 324126, 322990, 321862, 320980, 320975, 322267, 324680, 327493, 329878, 331492, 332771, 334476, 336792, 338994, 340263, 340753, 341518, 343330, 345897, 348430, 350687, 353092, 355959, 358992, 361626, 363666, 365506, 367827, 371123, 375400, 380282, 385416, 390756, 396436, 402564, 409248, 416649, 424758, 433186, 441482, 449634, 458048, 466944, 476005, 484693, 492802, 500636]
50084E00636Q119Q816R461R599R118Q217P105N972N179N108N609O041O058O003
50070F01041O233O506O524O634P393Q694J0010J1418J3554J6472J9252K1163K2657
50057G57551K4702K7445L0059L1744L2393L2237L1303K9614K7673K6264K5619
50046A076604K5150K4223K2939K1665K0024J7099J2642P418K023l905j0733j7806
50034A197343k4067k9302l3879l7574l9698m0395m0807m1633m2258m1727l9923
50023G86080l7464l4892l2483l0400k8617k6834k4756k2356j9719j6984j4558
50012D97017j2978j2305j1957j1357j0392r036p095m753k941k545l383m419m916
49999C98940m934m864m893m976n008m903m716m641m727m720m424m052l967m157
$$ y = [500636, 508755, 517571, 527032, 536631, 545749, 553966, 561071, 567043, 572222, 577330, 582939, 588980, 595038, 601041, 607274, 613780, 620304, 626938, 634331, 643025, 653035, 664453, 678007, 694479, 713731, 734894, 757551, 782253, 809698, 839757, 871501, 903894, 936131, 967434, 997048, 1024721, 1050985, 1076604, 1101754, 1125977, 1148916, 1170581, 1190605, 1207704, 1220346, 1227764, 1229787, 1225882, 1215149, 1197343, 1173276, 1143974, 1110095, 1072521, 1032823, 992428, 951621, 909988, 867730, 826003, 786080, 748616, 713724, 681241, 650841, 622224, 595390, 570634, 548278, 528559, 511575, 497017, 484039, 471734, 459777, 448420, 438028, 428992, 421897, 417144, 414203, 411658, 408275, 403856, 398940, 394006, 389142, 384249, 379273, 374265, 369362, 364646, 360005, 355278, 350558, 346134, 342082, 338115, 333958]
49985C33958m241l996l611l382l444l687l811l516k848k275k138k194k013j761
49971B91041k011k797l352l061k264j671j366r13k36J36n3k64J31R44J395J145
49955B76804P19Q10J514K398L047L369L584M060M973N981O517O615P166Q969J1692
49940C48218J4224J5920J7119J8376J9738K0890K1688K2227K2554K2506K1747
49929E65207K0038J7607J5162J3248J1660R846P838O267N366M516K941M12k940
49916F77168p019j1532j5826j9430k2463k5091k6891k7247k6211k4485k2675k1009
49904D27289j9578j8314j6750j4403j1518r048p659p133o876o606o301n854n136
49891B92113m305l646l132k457j567r20r85j620k161k128j640j121q59r08j118
$$ y = [333958, 329717, 325721, 322110, 318728, 315284, 311597, 307786, 304270, 301422, 299147, 297009, 294815, 292802, 291041, 289030, 286233, 282881, 279820, 277556, 275885, 274519, 273606, 273370, 273506, 273453, 273189, 273320, 274264, 275659, 276804, 277523, 278333, 279847, 282245, 285292, 288661, 292245, 296305, 301278, 307259, 313776, 320391, 327557, 336526, 348218, 362442, 378362, 395481, 413857, 433595, 454485, 476173, 498400, 520954, 543460, 565207, 585245, 602852, 618014, 631262, 642922, 652768, 660606, 666873, 672239, 676755, 679696, 680108, 677168, 670149, 658617, 642791, 623361, 600898, 575807, 548916, 521669, 495458, 470973, 448298, 427289, 407711, 389397, 372647, 358244, 346726, 337678, 330019, 322886, 316010, 309404, 303103, 297249, 292113, 287808, 284162, 281030, 278573, 277006, 276086, 275101, 273481, 271320, 269192, 267552, 266431, 265572, 264664, 263546]
49876B63546j074l46R00J826J908J678J926K340J817K00j170j054J95J335J802
49861B75829J916J905J565Q38J10k49k33n3Q5L6k47p27j316j808j770r62N1K37
49843B75207o18j539j692j446j494j534q54K22N91O4k98K03R58J072N25j28n47
49826B68692n62OR72J641J628J401J542J795J447M63m22o76m88k22J14N63P24
49809B78618M9j372k648k970k464j902j671j490j189j171j642j914j222K5N55
49794B57592j50j245j653j215m73R8L70M73O21P64M43n67j539j464n01R8k18n53
49776B50881j44K98k17j164j062L74J830K162J651J193J108J103R16M94j12o93
49760B58618q63l96M13R13O64j02o67n67j41k3j75J14J058J783J458N48J92O29
$$ y = [263546, 262472, 262126, 263026, 264852, 266760, 268438, 270364, 272704, 274521, 274721, 273551, 272497, 272692, 274027, 275829, 277745, 279650, 281215, 282053, 282163, 281914, 281681, 281628, 281713, 281749, 281502, 280775, 279459, 277651, 275881, 274919, 274970, 275207, 274589, 273050, 271358, 269912, 268418, 266884, 266030, 266252, 266843, 266907, 266609, 266812, 267770, 268842, 269367, 269239, 268692, 268130, 268136, 269108, 270749, 272377, 273778, 275320, 277115, 278562, 279025, 278603, 277927, 277439, 277217, 277331, 277894, 278618, 278667, 277295, 274647, 271677, 269213, 267311, 265640, 264150, 262961, 261790, 260148, 258234, 257012, 257037, 257592, 257442, 256197, 254544, 253329, 252856, 252954, 253324, 253797, 254418, 255182, 255625, 255058, 253519, 252055, 251554, 251652, 251434, 250881, 250737, 251035, 250818, 249654, 248592, 248966, 250796, 252958, 254609, 255802, 256910, 258013, 258929, 259423, 259311, 258618, 257755, 257359, 257772, 258685, 259349, 259247, 258580, 258013, 257872, 257849, 257674, 257788, 258846, 260629, 262087, 262635, 262827, 263456]
49742B63456R92O73J26O3N08R34R52N94J79M7K24L10O6r3L58J068J180O76N60
49723B72873J260J819J284K33m9N61J058J058J309K226K897K260O27o85r15m04
49707B87412K31P64J179J386J423J547J908K268K344K135J783J282O50K04K97
49692C06813Q24J307J479J435J245Q43L86K87O81J233J728K352L031L034J952
49677C28630O76M62J154J317L61m93R2J660K582K127J042K84Qn5K2K79N55O43
49659C41346N57M63N24Q63J430J860J718J035M25M35J044J859K600L167L410L149
49643C65885K410J514Q96Q80J437K100K257J716R26N10P15J286J752J805J601
49628C87690J751K604L549L413J961M39K00J175K250K820L097L159K717K027K063
$$ y = [263456, 264448, 265121, 265247, 265310, 265818, 266752, 267704, 268298, 268477, 268524, 268748, 269058, 269124, 269031, 269389, 270457, 271637, 272313, 272873, 274133, 275952, 277236, 277469, 277420, 277981, 279039, 280097, 281406, 283632, 286529, 288789, 289416, 288731, 287816, 287412, 287643, 288407, 289586, 290972, 292395, 293942, 295850, 298118, 300462, 302597, 304380, 305662, 306312, 306516, 306813, 307637, 308944, 310423, 311858, 313103, 313946, 314332, 314619, 315300, 316533, 318261, 320613, 323644, 326678, 328630, 329306, 329768, 330922, 332239, 332600, 332107, 332199, 333859, 336441, 338568, 339610, 339894, 339902, 339847, 339869, 340148, 340703, 341346, 341903, 342366, 342890, 343753, 345183, 347043, 348761, 349796, 350221, 350656, 351700, 353559, 356159, 359326, 362736, 365885, 368295, 369809, 370705, 371585, 373022, 375122, 377379, 379095, 380021, 380531, 381246, 382532, 384284, 386089, 387690, 389441, 392045, 395594, 399007, 400968, 401407, 401607, 402782, 405032, 407852, 410949, 414108, 416825, 418852, 420915]
49613D20915L244M692N314N075M643M300L857L371L138L191L330L572M043M547
49599D77232M807N007N570O389O883O780O318N697M934M350M514N359N982N685
49585E55507M879M481M756N185N290N201N366N973O693O904O262N100M179L984
49571F29760M383M912N152M880M204L601L557M010M464M667M859N224N479N277
49557F94429M743M308M208M340M399M045L111J893R95P73J081J598K121K458K421
49542G36923K102J826J625J181M68M5L57J106J682J934K120K392K737L170L581
49527G63249L581K985K281K177K750L428L769L877M053M313M349L868L019K375
49513H10074K343K503K064R95J84J52K57l54j536k533l128l627m042m084l849
$$ y = [420915, 424159, 428851, 434165, 439240, 443883, 448183, 452040, 455411, 458549, 461740, 465070, 468642, 472685, 477232, 482039, 487046, 492616, 499005, 505888, 512668, 518986, 524683, 529617, 533967, 538481, 543840, 549822, 555507, 560386, 564867, 569623, 574808, 580098, 585299, 590665, 596638, 603331, 610235, 616497, 621597, 625776, 629760, 634143, 639055, 644207, 649087, 653291, 656892, 660449, 664459, 668923, 673590, 678449, 683673, 689152, 694429, 699172, 703480, 707688, 712028, 716427, 720472, 723583, 725476, 726471, 727244, 728325, 729923, 732044, 734502, 736923, 739025, 740851, 742476, 743657, 744125, 744170, 744527, 745633, 747315, 749249, 751369, 753761, 756498, 759668, 763249, 766830, 769815, 772096, 774273, 777023, 780451, 784220, 788097, 792150, 796463, 800812, 804680, 807699, 810074, 812417, 814920, 816984, 817979, 818163, 818315, 818572, 818218, 816682, 814149, 811021, 807394, 803352, 799268, 795419]
49498G95419l722l725l646l663m180n015n551n668n770n909n710n254n113n325
49484G27168n184m481m021m436n148n225m670m161l977l905l910m181m602m799
49470F64468m715m681m802m691l940k706j640j288j582j947j947j703j584j672
49456F25570j870k283l019l651l501k603j745j383j052k25Q47J631K148K754L397
49441F15015L778L975M247M260L215R79j475k993l376l331l485l782l804l392
49427F09831k738j986j072n9O56P89O30P75J412K275L150M020M697M833M442M102
49411F35757M372N212O061O330N876N243N287O221P242P504P234P217P424P104
49397G24084O168N450N380N389N058M792M854M709L994L247K865K300J181L73
$$ y = [795419, 791697, 787972, 784326, 780663, 776483, 771468, 765917, 760249, 754479, 748570, 742860, 737606, 732493, 727168, 721984, 717503, 713482, 709046, 703898, 698673, 694003, 689842, 685865, 681960, 678050, 673869, 669267, 664468, 659753, 655072, 650270, 645579, 641639, 638933, 637293, 636005, 634423, 632476, 630529, 628826, 627242, 625570, 623700, 621417, 618398, 614747, 611246, 608643, 606898, 605515, 604463, 604238, 605085, 606716, 608864, 611618, 615015, 618793, 622768, 627015, 631275, 634490, 635469, 633994, 631001, 627625, 624294, 620809, 617027, 613223, 609831, 607093, 605107, 604035, 603976, 604632, 605421, 606051, 606826, 608238, 610513, 613663, 617683, 622380, 627213, 631655, 635757, 640129, 645341, 651402, 657732, 663608, 668851, 674138, 680359, 687601, 695105, 702339, 709556, 716980, 724084, 730252, 735702, 741082, 746471, 751529, 756321, 761175, 765884, 769878, 773125, 775990, 778290, 779471, 779844]
49383G79844P71J781K219K167K533L166K983J955J422K061K852K639J688J080
$$ y = [779844, 780615, 782396, 784615, 786782, 789315, 792481, 795464, 797419, 798841, 800902, 803754, 806393, 808081, 809161]
$$ [...]
##END NTUPLES=NMR SPECTRUM
##END=
