##TITLE=NES1044_936998_9268534_vTlQDmBc9A
##JCAMPDX= 6.0         $$ Bruker NMR JCAMP-DX V2.0
##DATA TYPE= NMR SPECTRUM
##DATA CLASS= NTUPLES
##ORIGIN= BRUKER
##OWNER= Administrator
$$ 1.72 TOPSPIN		Version 2.1
$$ 2015-07-12 01:35:16.206 -0700  Administrator@X
$$ Compression mode = diff/dup
##.OBSERVE FREQUENCY= 400.02188249412
##.OBSERVE NUCLEUS= ^1H
##.ACQUISITION MODE= SIMULTANEOUS (DQD)
##.ACQUISITION SCHEME= undefined
##.AVERAGES= 64
##.DIGITISER RES= 22
##SPECTROMETER/DATA SYSTEM= spect
##.PULSE SEQUENCE= noesygpps1d.comp
##.SOLVENT NAME= COFFEE_meoh
##.SHIFT REFERENCE= INTERNAL, COFFEE_meoh, 1, 14.96277
##AUDIT TRAIL= $$ (NUMBER, WHEN, WHO, WHERE, PROCESS, VERSION, WHAT)
$$ ##TITLE= Audit trail, TOPSPIN		Version 2.1
$$ ##JCAMPDX= 5.01
$$ ##ORIGIN= Bruker BioSpin GmbH
$$ ##OWNER= Administrator
$$ $$ E:\/data/COFFEE/nmr/NES1044_936998_9268534_vTlQDmBc9A/12/pdata/1/auditp.txt
$$ ##AUDIT TRAIL=  $$ (NUMBER, WHEN, WHO, WHERE, PROCESS, VERSION, WHAT)
(   1,<2015-07-12 01:35:10.847 -0700>,<Administrator>,<X>,<go>,<TOPSPIN 2.1>,
      <created by zg
	started at 2015-07-12 01:23:41.066 -0700,
	POWCHK enabled, PULCHK disabled,
       configuration hash MD5:
       21 0F 79 D6 B3 7B B4 F6 88 20 88 DB 03 48 BD 9F
       data hash MD5: 64K
       A8 63 98 86 EA 12 46 C3 BE 40 6D 25 3A 40 E6 61>)
(   2,<2015-07-12 01:35:14.066 -0700>,<Administrator>,<X>,<proc1d>,<TOPSPIN 2.1>,
      <Start of raw data processing
       efp LB = 0.3 FT_mod = 6 PKNL = 1 PHC0 = 0 PHC1 = 0 SI = 128K 
       data hash MD5: 128K
       63 46 FF 1F D3 D9 8F CC E2 0F 56 07 B5 C3 8A 92>)
(   3,<2015-07-12 01:35:14.972 -0700>,<Administrator>,<X>,<proc1d>,<TOPSPIN 2.1>,
      <pk PHC0 = -84.71558 PHC1 = 0 
       data hash MD5: 128K
       95 7C BC C0 3E DC DF 1A 43 D1 F9 69 5E 53 EC 22>)
(   4,<2015-07-12 01:35:15.363 -0700>,<Administrator>,<X>,<proc1d>,<TOPSPIN 2.1>,
      <abs ABSG = 1 
       data hash MD5: 128K
       1A 56 D8 01 43 C2 9A B0 BA BE CF 56 C5 43 8C F4>)
(   5,<2015-07-12 01:35:15.472 -0700>,<Administrator>,<X>,<proc1d>,<TOPSPIN 2.1>,
      <abs ABSG = 2 
       data hash MD5: 128K
       70 96 94 DF EB 5F 85 29 80 36 9A A4 DF CD C6 25>)
(   6,<2015-07-12 01:35:15.566 -0700>,<Administrator>,<X>,<proc1d>,<TOPSPIN 2.1>,
      <abs ABSG = 3 
       data hash MD5: 128K
       30 3D 8A 57 03 F4 D1 BA 97 AE 3F A8 36 09 94 5D>)
(   7,<2015-07-12 01:35:15.660 -0700>,<Administrator>,<X>,<proc1d>,<TOPSPIN 2.1>,
      <abs ABSG = 4 
       data hash MD5: 128K
       58 E2 63 B5 38 81 5F 98 BC A8 F6 09 40 B5 FF EE>)
(   8,<2015-07-12 01:35:15.753 -0700>,<Administrator>,<X>,<proc1d>,<TOPSPIN 2.1>,
      <abs ABSG = 5 
       data hash MD5: 128K
       63 E4 7E 9E 7C 80 A0 36 F5 33 7F 01 F5 EB 4B 1D>)
$$ ##END=
$$ 
$$ $$ hash MD5
$$ $$ 06 80 C5 0B 17 D3 BF 37 B2 45 7C BD 51 EC 6F 76
##$RELAX= 
##$RELAX= 
##$RELAX= 
##$RELAX= 
##$RELAX= 
##$RELAX= 
##$RELAX= 
##$RELAX= 
$$ Bruker specific parameters
$$ --------------------------
##$DU= <E:\>
##$EXPNO= 12
$$ [...]
##$TP07= 0
##$TPNAME0= <>
##$TPNAME1= <>
##$TPNAME2= <>
##$TPNAME3= <>
##$TPNAME4= <>
##$TPNAME5= <>
##$TPNAME6= <>
##$TPNAME7= <>
##$TPOAL= (0..7)
0.5 0.5 0.5 0.5 0.5 0.5 0.5 0.5
##$TPOFFS= (0..7)
0 0 0 0 0 0 0 0
##$TUNHIN= 0
##$TUNHOUT= 0
##$TUNXOUT= 0
##$USERA1= <user>
##$USERA2= <user>
##$USERA3= <user>
##$USERA4= <user>
##$USERA5= <user>
##$V9= 5
##$VALIST= <valist>
##$VCLIST= <CCCCCCCCCCCCCCC>
##$VD= 0
##$VDLIST= <DDDDDDDDDDDDDDD>
##$VPLIST= <PPPPPPPPPPPPPPP>
##$VTLIST= <TTTTTTTTTTTTTTT>
##$WBST= 2048
##$WBSW= 25
##$XGAIN= (0..3)
0 0 0 0
##$XL= 0
##$YL= 0
##$YMAX_a= 7960819
##$YMIN_a= -16795519
##$ZGOPTNS= <>
##$ZL1= 120
##$ZL2= 120
##$ZL3= 120
##$ZL4= 120
##$ABSF1= 14.96277
##$ABSF2= -5.595411
##$ABSG= 5
##$ABSL= 3
##$ALPHA= 0
##$AQORDER= 0
##$ASSFAC= 0
##$ASSFACI= 0
##$ASSFACX= 0
##$ASSWID= 0
##$AUNMP= <proc_prof1d_extract.lims>
##$AXLEFT= 0
##$AXNAME= <>
##$AXNUC= <1H>
##$AXRIGHT= 0
##$AXTYPE= 0
##$AXUNIT= <>
##$AZFE= 0.1
##$AZFW= 0.1
##$BCFW= 0
##$BC_mod= 0
##$BYTORDP= 0
##$COROFFS= 0
##$CY= 15
##$DATMOD= 1
##$DC= 0
##$DFILT= <>
##$DTYPP= 0
##$F1P= 0
##$F2P= 0
##$FCOR= 0.5
##$FTSIZE= 131072
##$FT_mod= 6
##$GAMMA= 0
##$GB= 0
##$INTBC= 1
##$INTSCL= 1
##$ISEN= 128
##$LB= 0.3
##$LEV0= 0
##$LPBIN= 0
##$MAXI= 10000
##$MC2= 0
##$MEAN= 0
##$ME_mod= 0
##$MI= 0
##$NCOEF= 0
##$NC_proc= -2
##$NLEV= 6
##$NOISF1= 0
##$NOISF2= 0
##$NSP= 0
##$NTH_PI= 0
##$NZP= 0
##$OFFSET= 14.96277
##$PC= 1
##$PHC0= -84.71558
##$PHC1= 0
##$PH_mod= 1
##$PKNL= yes
##$PPARMOD= 0
##$PPDIAG= 0
##$PPIPTYP= 0
##$PPMPNUM= 2147483647
##$PPRESOL= 1
##$PSCAL= 4
##$PSIGN= 0
##$PYNMP= <proc.py>
##$REVERSE= no
##$SF= 400.020008929909
##$SI= 131072
##$SIGF1= 0
##$SIGF2= 0
##$SINO= 400
##$SIOLD= 131072
##$SPECTYP= <>
##$SREGLST= <1H.CDCl3>
##$SSB= 0
##$STSI= 131072
##$STSR= 0
##$SW_p= 8223.68421052631
##$SYMM= 0
##$S_DEV= 0
##$TDeff= 65536
##$TDoff= 0
##$TI= <>
##$TILT= no
##$TM1= 0
##$TM2= 0
##$TOPLEV= 0
##$USERP1= <user>
##$USERP2= <user>
##$USERP3= <user>
##$USERP4= <user>
##$USERP5= <user>
##$WDW= 1
##$XDIM= 131072
##$YMAX_p= 439787912
##$YMIN_p= -11470
##$CURPLOT= <Network HP LaserJet P1505>
##$CURPRIN= <$Network HP LaserJet P1505>
##$DFORMAT= <normdp>
##$LAYOUT= <+/1D_H.xwp>
##$LFORMAT= <normlp>
##$PFORMAT= <normpl>
##$SURQMSG= 1
$$ End of Bruker specific parameters
$$ ---------------------------------
##NTUPLES= NMR SPECTRUM
##VAR_NAME=  FREQUENCY,     SPECTRUM/REAL,   SPECTRUM/IMAG
##SYMBOL=    X,             R,               I
##VAR_TYPE=  INDEPENDENT,   DEPENDENT,       DEPENDENT
##VAR_FORM=  AFFN,          ASDF,            ASDF
##VAR_DIM=   131072,        131072,          131072
##UNITS=     HZ,            ARBITRARY UNITS, ARBITRARY UNITS
##FACTOR=    0.0627417313425164, 1,          1
##FIRST=     8223.62146879497, -958,         -57789
##LAST=      0,             1549,            -58708
##MIN=       0,             -11470,          0
##MAX=       8223.62146879497, 439787912,    0
$$ Real data points
##PAGE= N=1
##DATA TABLE= (X++(R..R)), XYDATA
$$ [...]
$$ plain form
60959 29460445 30169985 30206042 29275345 27404220 24869952 22033197 19200776 16572585 14247458
60950 14247458 12249689 10559605 9140882 7956255 6970868 6152090 5471526 4906138 4435831
60941 4435831 4041243 3705019 3414006 3158899 2932448 2728915 2544459 2376791 2224227
60932 2224227 2085360 1959246 1845393 1743519 1653290 1573828 1503120 1438198 1376258 1315711
60922 1315711 1256301 1198508 1142943 1090046 1040171 993886 951985 914983 882699 854544 830087
60911 830087 809029 790742 774236 758694 743924 730254 718174 707951 699375 691833 684822 678346
60899 678346 672773 668419 665421 663825 663557 664426 666382 669670 674404 680120 686057 691888 697841 704039 710055
60884 710055 715284 719496 722733 724777 725084 723300 719576 714184 707002 697763 686764 675001 663429 652343
$$ packed form
60959B9460445P09540L6057r30697j871125k534268k836755k832421k628191k325127
60950A4247458j997769j690084j418723j184627r85387q18778o80564n65388m70307
60941D435831l94588l36224k91013k55107k26451k03533j84456j67668j52564
60932B224227j38867j26114j13853j01874r0229p9462p0708o4922o1940o0547
60922A315711n9410n7793n5565n2897m9875m6285m1901l7002l2284k8155k4457
60911H30087k1058j8287j6506j5542j4770j3670j2080j0223q576p542p011o476
60899F78346n573m354k998j596k68Q69J956L288M734N716N937N831N953O198O016
60884G10055N229M212L237K044L07j784l724n392p182r239j0999j1763j1572j1086
$$ plain form
60870 652343 641610 631182 621121 611488 602612 595241 589929 586355 583695 581660 580690 581170 582925 585600
60856 585600 589062 593262 598106 603692 610433 618782 629034 641385 655731 671364 687307 703204 719569
60843 719569 737023 755618 775041 794927 814596 832785 848193 860279 869403 876352 881927 886749
60831 886749 891168 895338 899368 903165 906093 907145 905757 902251 897395 891737 885606 879374 873272 867025
60817 867025 859959 851543 841731 830804 819086 806748 793861 780602 767330 754314 741486 728755
60805 728755 716539 705650 696572 689140 682998 678026 674164 671221 669118 668046 668113 669079 670714 673203
60791 673203 676901 681767 687316 693039 698684 704263 710012 716291 723302 730836 738331 745158 750940 755754
60777 755754 760063 764263 768339 772132 775942 780483 786225 793112 801038 810149 820444 831410 842369
$$ packed form
60870F52343j0733j0428j0061r633q876p371n312l574k660k035r70M80J755K675
60856E85600L462M200M844N586O741Q349J0252J2351J4346J5633J5943J5897J6365
60843G19569J7454J8595J9423J9886J9669J8189J5408J2086R124O949N575M822
60831H86749M419M170M030L797K928J052j388l506m856n658o131o232o102o247
60817H67025p066q416r812j0927j1718j2338j2887j3259j3272j3016j2828j2731
60805G28755j2216j0889r078p432o142m972l862k943k103j072O7R66J635K489
60791F73203L698M866N549N723N645N579N749O279P011P534P495O827N782M814
60777G55754M309M200M076L793L810M541N742O887P926R111J0295J0966J0959
$$ plain form
60764 842369 852940 862925 872082 880315 887818 894615 900221 904262 907256 910172 913194 915509 916528 916785
60750 916785 917255 918161 918939 919212 919235 919310 919202 918383 916529 913501 909102 903298 896560 889524 882268 874399 865969
60733 865969 857747 850252 842929 834787 825573 815811 805896 795759 785359 774891 764399 753720 743018
60720 743018 732882 723663 715096 706885 699339 693054 688172 684278 680960 678206 676263 675265 675000 675015 675070
60705 675070 675543 677214 680433 684631 688819 692472 695772 699005 701997 704222 705275 705030 703371 700091 695166
60690 695166 688915 681564 672817 662257 650152 637462 624985 612933 601429 590840 581243 572079
60678 572079 562867 553978 546237 540065 535444 532352 530578 529336 527860 526417 526155 527863 531384 536161
60664 536161 541698 547379 552480 556710 560358 563727 566762 569378 571732 574027 576434 579370 583438 588824
$$ packed form
60764H42369J0571R985R157Q233P503O797N606M041K994K916L022K315J019K57
60750I16785M70R06P78K73K3P5j08q19j854l028m399n804o738p036p256p869q430
60733H65969q222p495p323q142r214r762r915j0137j0400j0468j0492j0679j0702
60720G43018j0136r219q567q211p546o285m882l894l318k754j943r98k65J5N5
60705F75070M73J671L219M198M188L653L300L233K992K225J053k45j659l280m925
60690F95166o251p351q747j0560j2105j2690j2477j2052j1504j0589r597r164
60678E72079r212q889p741o172m621l092j774j242j476j443k62J708L521M777
60664E36161N537N681N101M230L648L369L035K616K354K295K407K936M068N386
$$ plain form
60650 588824 595047 601504 608023 614742 621698 628751 635784 642811 649972 657437 665205 673104 681077 689333
60636 689333 698062 707266 717121 728182 740800 754524 768512 782258 795484 807637 818119 826830
60624 826830 833893 839085 842222 843875 844838 844941 843254 839481 834288 828177 820977 812655 803755 794696 785410
60609 785410 775993 766998 758808 751463 745385 741437 739937 740352 742234 745450 749108 751422 751487 750377 749556
60594 749556 748925 747418 744946 742728 741898 742668 744640 747229 749906 752640 755907 759791 763417 765887 767416
60579 767416 768858 770397 771446 771604 770924 769321 766494 762459 757562 751936 745487 738368 730903 723014 714339
60564 714339 705022 695926 687842 680755 673965 666757 659048 651686 645931 642349 640321 638967 638371 639409
60550 639409 642502 647102 652508 658753 666462 676086 687458 700067 713790 729376 748108 770940 798151
$$ packed form
60650E88824O223O457O519O719O956P053P033P027P161P465P768P899P973Q256
60636F89333Q729R204R855J1061J2618J3724J3988J3746J3226J2153J0482Q711
60624H26830P063N192L137J653R63J03j687l773n193o111p200q322q900r059r286
60609G85410r417q995q190p345o078l948j500M15J882L216L658K314O5j110q21
60594G49556o31j507k472k218q30P70J972K589K677K734L267L884L626K470J529
60579G67416J442J539J049J58o80j603k827m035m897n626o449p119p465p889q675
60564G14339r317r096q084p087o790p208p709p362n755l582k028j354n96J038
60550F39409L093M600N406O245P709R624J1372J2609J3723J5586J8732K2832K7211
$$ plain form
60537 798151 829872 866574 908754 956315 1008294 1062674 1116092 1164110 1202412 1227912 1238850
60526 1238850 1234587 1216022 1186005 1148728 1108419 1068537 1031590 999118 971950 950805 936436
60515 936436 928847 926804 928731 933861 941927 951926 962016 970848 978516 986026 994265 1003654 1014466 1027224
60501 1027224 1042944 1063031 1088788 1120973 1159966 1206410 1261607 1327287 1404925 1495032 1597002
60490 1597002 1709863 1833279 1967609 2113081 2269636 2438145 2621631 2824940 3053326
60481 3053326 3311007 3599436 3914538 4243982 4566809 4856403 5085460 5230775 5276527 5216115
60471 5216115 5053220 4802129 4485951 4131808 3764894 3404870 3065536 2755544 2478601
60462 2478601 2234306 2020436 1834749 1674737 1536871 1417377 1313549 1223529 1145146 1075932
$$ packed form
60537G98151L1721L6702M2180M7561N1979N4380N3418M8018L8302K5500J0938
60526A238850m263j8565l0017l7277m0309l9882l6947l2472k7168k1145j4369
60515I36436p589k043J927N130Q066R999J0090Q832P668P510Q239R389J0812J2758
60501A027224J5720K0087K5757L2185L8993M6444N5197O5680P7638R0107J01970
60490A597002J12861J23416J34330J45472J56555J68509J83486K03309K28386
60481C053326K57681K88429L15102L29444L22827K89594K29057J45315M5752o0412
60471E216115j62895k51091l16178l54143l66914l60024l39334l09992k76943
60462B478601k44295k13870j85687j60012j37866j19494j03828r0020p8383o9214
$$ plain form
60452 1075932 1014181 959218 910662 868048 831009 799054 771192 746402 724431 705482 689243
60441 689243 674854 661803 650089 639459 629177 618757 608382 598467 589238 580774 573056 565983
60429 565983 559688 554703 551299 548847 546407 543813 541559 539770 538081 536534 535803 536406 538312 541393 545502
60414 545502 549887 553290 555049 555669 556120 557058 558891 561871 565670 569294 571913 573574 575006 577035 580280
60399 580280 584906 590414 596025 601438 606842 612180 616982 621189 625516 630509 635645 639868 642839 645229
60385 645229 647812 650564 652629 653058 651629 648934 645558 641396 636140 630337 625359 622147 620457 619507 618844
60370 618844 618282 617507 616264 614740 613319 612109 611030 610243 610100 610670 611573 612333 612750 612971 613301 614030 615380
60353 615380 617624 621078 625813 631348 636866 641868 646486 651138 655994 660858 665383 669231 672124 673903
$$ packed form
60452A075932o1751n4963m8556m2614l7039l1955k7862k4790k1971j8949j6239
60441F89243j4389j3051j1714j0630j0282j0420j0375r915r229q464p718p073
60429E65983o295m985l404k452k440k594k254j789j689j547p31O03J906L081M109
60414E45502M385L403J759O20M51R38J833K980L799L624K619J661J432K029L245
60399E80280M626N508N611N413N404N338M802M207M327M993N136M223K971K390
60385F45229K583K752K065M29j429k695l376m162n256n803m978l212j690r50o63
60370F18844n62p75j243j524j421j210j079p87j43N70R03P60M17K21L30P29J350
60353F15380K244L454M735N535N518N002M618M652M856M864M525L848K893J779
$$ plain form
60339 673903 674685 674923 675237 675994 677002 677696 677682 677066 676322 675988 676432 677658 679308 681131 683467 686927 691525
60322 691525 696552 701376 705777 709269 710840 710043 707879 705879 704542 703263 701525 699325 696587 693079
60308 693079 689114 685651 683335 681827 680328 678421 676224 674036 672057 670302 668719 667424 666743 666815 667327
60293 667327 667894 668524 669435 670595 671821 673090 674368 675373 675989 676718 678170 680266 682498 684894 688132
60278 688132 692695 698463 705103 712305 719584 726460 732982 739665 746833 754465 762659 771740 781861 792960
60264 792960 805104 818345 832372 846962 862806 881098 902104 924843 948511 973609 1001244
60253 1001244 1031949 1065738 1102884 1143966 1189240 1238463 1291423 1348416 1410116 1477085 1549533
60242 1549533 1627669 1712204 1804050 1903139 2007847 2116008 2226263 2337827 2449164 2557700
$$ packed form
60339F73903P82K38L14P57J008O94j4o16p44l34M44J226J650J823K336L460M598
60322F91525N027M824M401L492J571p97k164k000j337j279j738k200k738l508
60308F93079l965l463k316j508j499j907k197k188j979j755j583j295o81P2N12
60293F67327N67O30R11J160J226J269J278J005O16P29J452K096K232K396L238
60278F88132M563N768O640P202P279O876O522O683P168P632Q194R081J0121J1099
60264G92960J2144J3241J4027J4590J5844J8292K1006K2739K3668K5098K7635
60253A001244L0705L3789L7146M1082M5274M9223N2960N6993O1700O6969P2448
60242A549533P8136Q4535R1846R9089J04708J08161J10255J11564J11337J08536
$$ plain form
60232 2557700 2660924 2757109 2844795 2922340 2988323 3041843 3082081 3108072 3119345 3116431 3100415
60221 3100415 3072380 3033774 2987054 2935453 2882146 2829871 2781138 2738262 2702998 2676353 2658913
60210 2658913 2651305 2654249 2668249 2693523 2730385 2779519 2841563 2916459 3003437 3101472 3209264
60199 3209264 3324767 3445316 3568293 3691060 3810122 3921201 4020567 4105735 4174694 4225573
60189 4225573 4257728 4272032 4269002 4247527 4206662 4148022 4075044 3990531 3896547 3796424 3694978
60178 3694978 3596337 3502888 3416590 3339976 3275388 3224387 3188275 3168121 3163931 3174897 3200915
60167 3200915 3242644 3299585 3369204 3448461 3534957 3625712 3715994 3800539 3875462 3938287 3987011
60156 3987011 4020249 4037870 4040577 4029067 4004300 3968252 3923741 3873653 3820841 3768484 3720044
$$ packed form
60232B557700J03224R6185Q7686P7545O5983N3520M0238K5991J1273k914j6016
60221C100415k8035l8606m6720n1601n3307n2275m8733m2876l5264k6645j7440
60210B658913p608K944J4000K5274L6862M9134O2044P4896Q6978R8035J07792
60199C209264J15503J20549J22977J22767J19062J11079R9366Q5168O8959N0879
60189D225573L2155J4304l030k1475m0865n8640p2978q4513r3984j00123j01446
60178C694978r8641r3449q6298p6614o4588n1001l6112k0154m190J0966K6018
60167C200915M1729N6941O9619P9257Q6496R0755R0282Q4545P4923O2825M8724
60156C987011L3238J7621K707j1510k4767l6048m4511n0088n2812n2357m8440
$$ plain form
60145 3720044 3678911 3648229 3630627 3627743 3640313 3668932 3714434 3777628 3859411 3961391 4085603
60134 4085603 4233223 4404196 4598509 4817136 5061241 5330997 5625524 5943116 6280882
60125 6280882 6634626 6999577 7370697 7741961 8106101 8455831 8784894 9087532 9357677
60116 9357677 9589440 9778043 9919808 10011893 10052607 10041459 9978269 9862814 9696093 9481685
60106 9481685 9225509 8934922 8618594 8286393 7948251 7613102 7289088 6983813 6703364
60097 6703364 6451449 6230314 6042183 5889092 5771812 5689880 5642492 5628653 5646649 5694136
60087 5694136 5768457 5866121 5982055 6110077 6243981 6377647 6504490 6617753 6711549 6781433
60077 6781433 6824453 6839547 6827751 6791246 6732025 6651734 6552414 6436641 6306887 6165183 6013272
$$ packed form
60145C720044m1133l0682j7602k884J2570K8619M5502O3194Q1783J01980J24212
60134D085603J47620J70973J94313K18627K44105K69756K94527L17592L37766
60125F280882L53744L64951L71120L71264L64140L49730L29063L02638K70145
60116I357677K31763J88603J41765R2085M0714j1148o3190j15455j66721k14408
60106I481685k56176k90587l16328l32201l38142l35149l24014l05275k80449
60097F703364k51915k21135j88131j53091j17280q1932m7388j3839J7996M7487
60087E694136P4321R7664J15934J28022J33904J33666J26843J13263R3796O9884
60077F781433M3020J5094j1796l6505n9221q0291r9320j15773j29754j41704j51911
$$ plain form
60066 6013272 5852730 5685241 5513316 5340526 5170457 5005667 4848132 4700360 4565236
60057 4565236 4444841 4340022 4251083 4178428 4122651 4084596 4065322 4065491 4084789 4122265 4177160
60046 4177160 4249041 4337302 4440750 4557367 4683965 4816244 4949533 5079218 5200296 5307191
60036 5307191 5394911 5460357 5502122 5519354 5511402 5478288 5420899 5340796 5240263 5122366 4990601
60025 4990601 4848694 4701004 4552464 4407467 4269045 4139598 4021839 3918225 3829803 3756445
60015 3756445 3698090 3655106 3627736 3616095 3620625 3641919 3680122 3735155 3807448 3897830 4006722
60004 4006722 4133847 4278447 4439036 4612893 4796172 4984188 5171118 5349896 5513530
59995 5513530 5656730 5776021 5868723 5932777 5967402 5972990 5950081 5898973 5820309 5715564 5587234
$$ packed form
60066F013272j60542j67489j71925j72790j70069j64790j57535j47772j35124
60057D565236j20395j04819q8939p2655n5777l8055j9274J69J9298L7476N4895
60046D177160P1881Q8261J03448J16617J26598J32279J33289J29685J21078J06895
60036E307191Q7720O5446M1765J7232p952l3114n7389q0103j00533j17897j31765
60025D990601j41907j47690j48540j44997j38422j29447j17759j03614q8422p3358
60015C756445n8355m2984k7370j1641M530K1294L8203N5033P2293R0382J08892
60004D006722J27125J44600J60589J73857J83279J88016J86930J78778J63634
59995E513530J43200J19291R2702O4054L4625N588k2909n1108p8664j04745j28330
$$ plain form
59984 5587234 5439382 5278000 5110028 4941707 4778128 4623957 4483536 4360074 4255440
59975 4255440 4170905 4107491 4065389 4043686 4040981 4055979 4087499 4134490 4196236 4272067 4360675
59964 4360675 4459980 4567649 4681265 4797906 4914034 5026069 5130970 5226335 5310315 5381552
59954 5381552 5439085 5482390 5511736 5528303 5533705 5529565 5517762 5500782 5481602 5463639 5451244 5449807
59942 5449807 5464744 5500435 5560368 5647753 5765358 5915199 6099124 6319456 6578230 6875796
59932 6875796 7210648 7580213 7980831 8406725 8849336 9297415 9737042 10151586 10522496
59923 10522496 10831002 11060087 11196589 11233223 11169374 11010171 10765327 10448874 10078389 9672390
59913 9672390 9247576 8818234 8396934 7994162 7617273 7270849 6958167 6681644 6442295
$$ packed form
59984E587234j47852j61382j67972j68321j63579j54171j40421j23462j04634
59975D255440q4535o3414m2102k1703k705J4998L1520M6991O1746P5831Q8608
59964D360675R9305J07669J13616J16641J16128J12035J04901R5365Q3980P1237
59954E381552N7533M3305K9346J6567N402m140j1803j6980j9180j7963j2395j437
59942E449807J4937L5691N9933Q7385J17605J49841J83925K20332K58774K97566
59932F875796L34852L69565M00618M25894M42611M48079M39627M14544L70910
59923A0522496L08506K29085J36502L6634o3849j59203k44844l16453l70485m05999
59913I672390m24814m29342m21300m02772l76889l46424l12682k76523k39349
$$ plain form
59904 6442295 6240016 6074657 5946072 5853239 5794399 5768224 5774039 5810857 5877088 5971324 6092536
59893 6092536 6239155 6408338 6595836 6795605 6999465 7198051 7382238 7543041 7670417
59884 7670417 7753756 7784518 7758319 7674769 7536465 7348632 7118906 6856602 6571937 6275375
59874 6275375 5976556 5683229 5401354 5135994 4891337 4669779 4471687 4296308 4142449
59865 4142449 4008360 3891610 3789313 3698191 3614758 3536122 3460490 3386466 3312517 3238253 3165815
59854 3165815 3098641 3038751 2986278 2941504 2905834 2880399 2864916 2858299 2859157 2865061 2872325 2877276
59842 2877276 2877159 2869620 2852398 2824272 2785768 2738618 2685272 2629038 2573524 2521055 2472205 2427316
59830 2427316 2387685 2354824 2329421 2311675 2301915 2300249 2306300 2319992 2341973 2372419 2409810 2451586
$$ packed form
59904F442295k02279j65359j28585r2833n8840k6175N815L6818O6231R4236J21212
59893F092536J46619J69183J87498J99769K03860J98586J84187J60803J27376
59884G670417Q3339L0762k6199q3550j38304j87833k29726k62304k84665k96562
59874F275375k98819k93327k81875k65360k44657k21558j98092j75379j53859
59865D142449j34089j16750j02297r1122q3433p8636p5632p4024p3949p4264p2438
59854C165815o7174n9890n2473m4774l5670k5435j5483o617Q58N904P264M951
59842B877276j17p539j7222k8126l8504m7150n3346n6234n5514n2469m8850m4889
59830B427316l9631l2861k5403j7746r760j666O051J3692K1981L0446L7391M1776
$$ plain form
59818 2451586 2495858 2542179 2591133 2643813 2701373 2764327 2831931 2901953 2970660 3033197 3084910
59807 3084910 3122978 3146824 3157263 3155958 3145574 3129405 3110313 3090529 3072484 3058947 3051973 3052571
59795 3052571 3061779 3081307 3112694 3156719 3214273 3287182 3377586 3487145 3617509 3771173 3951385
59784 3951385 4161591 4405200 4685122 5002720 5357037 5744251 6155602 6573720 6970863
59775 6970863 7312344 7564166 7701048 7711992 7602202 7390859 7105547 6775956 6429192 6087055
59765 6087055 5764822 5471579 5211716 4986370 4794306 4632947 4499640 4392094 4307848 4244166
59755 4244166 4198832 4170600 4158679 4162308 4180980 4214394 4261931 4322786 4396843 4484794 4587230
59744 4587230 4704349 4836775 4985802 5152507 5337448 5541689 5767353 6016674 6291278
$$ packed form
59818B451586M4272M6321M8954N2680N7560O2954O7604P0022O8707O2537N1713
59807C084910L8068K3846J0439j305j0384j6169j9092j9784j8045j3537o974N98
59795C052571R208J9528L1387M4025N7554P2909R0404J09559J30364J53664J80212
59784C951385K10206K43609K79922L17598L54317L87214M11351M18118L97143
59775F970863L41481K51822J36882J0944j09790k11343k85312l29591l46764l42137
59765F087055l22233k93243k59863k25346j92064j61359j33307j07546q4246o3682
59755D244166m5334k8232j1921L629J8672L3414M7537O0855P4057Q7951J02436
59744D587230J17119J32426J49027J66705J84941K04241K25664K49321K74604
$$ plain form
59735 6291278 6592898 6924019 7287153 7684052 8116079 8584505 9089507 9629084 10199156
59726 10199156 10793843 11404794 12020673 12628144 13213657 13764822 14271820 14729345 15138059
59717 15138059 15504482 15839889 16158909 16477596 16811248 17173220 17574647 18023431 18522416
59708 18522416 19068828 19655469 20271381 20900976 21523802 22116560 22655718 23119147 23487801
59699 23487801 23748297 23894747 23928537 23857505 23695744 23462652 23180375 22871508 22558424 22262578
59689 22262578 22002571 21792998 21645697 21571302 21578741 21674312 21862713 22148791 22537409 23031971
59679 23031971 23633789 24342173 25153578 26060008 27047756 28095989 29174531 30242398 31249061
59670 31249061 32137913 32850785 33333966 33545852 33463719 33086814 32435961 31550904 30485079
$$ packed form
59735F291278L01620L31121L63134L96899M32027M68426N05002N39577N70072
59726A0199156N94687O10951O15879O07471N85513N51165N06998M57525M08714
59717A5138059L66423L35407L19020L18687L33652L61972M01427M48784M98985
59708A8522416N46412N86641O15912O29595O22826N92758N39158M63429L68654
59699B3487801K60496J46450L3790p1032j61761k33092k82277l08867l13084k95846
59689B2262578k60007k09573j47301p4395P439R5571J88401K86078L88618M94562
59679B3031971O01818P08384Q11405R06430R87748J048233J078542J067867J006663
59670C1249061Q88852P12872M83181K11886q2133l76905o50853q85057j065825
$$ plain form
59661 30485079 29298044 28048448 26789846 25567991 24417781 23361211 22407917 21556191
59653 21556191 20791977 20088033 19407695 18713383 17975629 17179212 16325348 15429423 14514797
59644 14514797 13605955 12724354 11886684 11103634 10379554 9714405 9106634 8554260 8054330
59635 8054330 7602924 7196014 6829791 6500491 6204759 5939906 5703110 5490919 5300504
59626 5300504 5130914 4981886 4851821 4738101 4639135 4554606 4483679 4424269 4374281 4332302
59616 4332302 4296608 4264462 4232896 4199547 4162443 4119670 4069607 4011047 3943077 3865494 3779521
59605 3779521 3687602 3592378 3496195 3401377 3310161 3224129 3144120 3070689 3004249 2944927 2892768
59594 2892768 2848049 2811010 2781524 2759456 2745043 2738361 2738750 2745286 2757416 2774536 2795438 2818948
$$ packed form
59661C0485079j187035j249596j258602j221855j150210j056570r53294q51726
59653B1556191p64214p03944o80338o94312p37754p96417q53864q95925r14626
59644A4514797r08842q81601q37670p83050p24080o65149o07771n52374m99930
59635H054330m51406m06910l66223l29300k95732k64853k36796k12191j90415
59626E300504j69590j49028j30065j13720r8966q4529p0927n9410m9988m1979
59616D332302l5694l2146l1566l3349l7104m2773n0063n8560o7970p7583q5973
59605C779521r1919r5224r6183r4818r1216q6032q0009p3431o6440n9322n2159
59594B892768m4719l7039k9486k2068j4413o682L89O536J2130J7120K0902K3510
$$ plain form
59582 2818948 2844645 2872075 2899681 2925566 2949069 2970673 2990630 3008851 3026101 3044228 3064950
59571 3064950 3089201 3117698 3151306 3190781 3236885 3290796 3353681 3425878 3507267 3598410 3700612
59560 3700612 3814985 3942376 4084217 4242376 4417838 4610293 4819255 5044780 5286736
59551 5286736 5543970 5814503 6095953 6385295 6678522 6970944 7257853 7535046 7798992
59542 7798992 8046696 8275645 8484372 8673003 8842191 8990757 9114969 9211120 9278827 9321617
59532 9321617 9345216 9356192 9361642 9368736 9384183 9414332 9465128 9540839 9642747 9769294 9916567
59521 9916567 10077426 10240641 10392327 10518722 10607540 10647899 10630825 10550303 10403395 10189965
59511 10189965 9913460 9581600 9205012 8795003 8363064 7921285 7481121 7051418 6638725
$$ packed form
59582B818948K5697K7430K7606K5885K3503K1604J9957J8221J7250J8127K0722
59571C064950K4251K8497L3608L9475M6104N3911O2885P2197Q1389R1143J02202
59560C700612J14373J27391J41841J58159J75462J92455K08962K25525K41956
59551E286736K57234K70533K81450K89342K93227K92422K86909K77193K63946
59542G798992K47704K28949K08727J88631J69188J48566J24212R6151O7707M2790
59532I321617K3599J0976N450P094J5447L0149N0796P5711J01908J26547J47273
59521I916567J60859J63215J51686J26395Q8818M0359j7074q0522j46908k13430
59511A0189965k76505l31860l76588m10009m31939m41779m40164m29703m12693
$$ plain form
59502 6638725 6249195 5888522 5559894 5263491 4998233 4762879 4555493 4373624 4215625
59493 4215625 4080642 3966992 3871963 3793669 3731882 3686494 3656444 3640828 3639920 3654345 3684195
59482 3684195 3729598 3791196 3869292 3963380 4073256 4199968 4344928 4508625 4690728 4890844
59472 4890844 5108461 5342334 5590150 5848191 6110864 6370810 6619729 6848895 7049169
59463 7049169 7211361 7327167 7389866 7394951 7341294 7231836 7072316 6869298 6629994 6363293
59453 6363293 6079106 5786079 5490808 5199261 4917388 4649555 4397437 4161262 3941488
59444 3941488 3738809 3553361 3384670 3231934 3093986 2969513 2857641 2757875 2669433 2591267
59434 2591267 2522671 2463146 2411728 2367454 2330445 2301386 2279795 2263955 2252742 2246244 2244294 2245722
$$ packed form
59502F638725l89530l60673l28628k96403k65258k35354k07386j81869j57999
59493D215625j34983j13650r5029p8294o1787m5388l0050j5616r08J4425K9850
59482C684195M5403O1598P8096R4088J09876J26712J44960J63697J82103K00116
59472D890844K17617K33873K47816K58041K62673K59946K48919K29166K00274
59463G049169J62192J15806O2699N085n3657j09458j59520k03018k39304k66701
59453F363293k84187k93027k95271k91547k81873k67833k52118k36175k19774
59444C941488k02679j85448j68691j52736j37948j24473j11872r9766q8442p8166
59434B591267o8596n9525n1418m4274l7009k9059k1591j5840j1213o498j950J428
$$ plain form
59422 2245722 2249688 2256575 2266862 2280135 2295860 2314194 2335509 2360119 2388894 2422724 2460290 2497342
59410 2497342 2529395 2554942 2575787 2595399 2617695 2646317 2683624 2730598 2788314 2858788 2943413
59399 2943413 3040849 3147084 3257353 3368047 3478280 3591071 3712766 3850235 4008394 4190339
59389 4190339 4398860 4636903 4907042 5211486 5552563 5932665 6353674 6816358 7319469
59380 7319469 7858590 8425821 9010617 9600562 10181755 10740065 11263439 11743259 12173951
59371 12173951 12552637 12879791 13159154 13395881 13594848 13760534 13896842 14005519 14085076
59362 14085076 14131970 14142352 14112088 14036233 13910220 13732067 13503314 13228714 12916089 12575952
59352 12575952 12219642 11856695 11493487 11133394 10777152 10423119 10068105 9708762 9342781
$$ packed form
59422B245722L966O887J0287J3273J5725J8334K1315K4610K8775L3830L7566L7052
59410B497342L2053K5547K0845J9612K2296K8622L7307M6974N7716P0474Q4625
59399B943413R7436J06235J10269J10694J10233J12791J21695J37469J58159J81945
59389D190339K08521K38043K70139L04444L41077L80102M21009M62684N03111
59380G319469N39121N67231N84796N89945N81193N58310N23374M79820M30692
59371A2173951L78686L27154K79363K36727J98967J65686J36308J08677P9557
59362A4085076M6894J0382l0264p5855j26013j78153k28753k74600l12625l40137
59352A2575952l56310l62947l63208l60093l56242l54033l55014l59343l65981
$$ plain form
59343 9342781 8969608 8590666 8208876 7827928 7452167 7086850 6737352 6407468 6098828
59334 6098828 5812200 5548689 5309262 5093873 4901713 4731931 4583626 4455599 4346628
59325 4346628 4255694 4181630 4123031 4078880 4048777 4032205 4028052 4035206 4053110 4081268 4118466 4162706
59313 4162706 4211581 4262702 4314272 4365188 4413928 4457481 4492404 4516982 4531218 4534668 4525805 4504155
59301 4504155 4471667 4431090 4384181 4332508 4278771 4225992 4176078 4130359 4090913 4060162 4039584
59290 4039584 4029934 4032359 4048225 4078121 4122080 4180727 4255297 4346537 4454251 4577768 4716056
59279 4716056 4867294 5028913 5198155 5372224 5547873 5721081 5887231 6041631 6180010
59270 6180010 6298264 6391335 6453034 6478536 6467778 6425904 6360255 6277589 6183752 6083878 5981444
$$ packed form
59343I342781l73173l78942l81790l80948l75761l65317l49498l29884l08640
59334F098828k86628k63511k39427k15389j92160j69782j48305j28027j08971
59325D346628r0934p4064n8599m4151l0103j6572m153P154J7904K8158L7198M4240
59313D162706M8875N1121N1570N0916M8740M3553L4923K4578J4236L450q863k1650
59301D504155l2488m0577m6909n1673n3737n2779m9914m5719l9446l0751k0578
59290D039584r650K425J5866K9896M3959N8647P4570R1240J07714J23517J38288
59279D716056J51238J61619J69242J74069J75649J73208J66150J54400J38379
59270F180010J18254R3071O1699K5502j0758m1874o5649q2666r3837r9874j02434
$$ plain form
59259 5981444 5877844 5773763 5670231 5567671 5464986 5360821 5255190 5149071 5043046
59250 5043046 4937420 4833161 4731746 4634426 4542483 4457788 4382275 4317101 4263055 4221585 4194825
59239 4194825 4184902 4193745 4223142 4274512 4349026 4448443 4575383 4732363 4921137 5143283 5400529
59228 5400529 5693711 6021771 6382028 6770306 7179787 7600142 8018201 8418836 8785012
59219 8785012 9098751 9343979 9508815 9585223 9567996 9455595 9251660 8964825 8607523 8195359
59209 8195359 7746211 7277867 6805788 6342856 5899832 5484581 5101298 4751513 4435635
59200 4435635 4153017 3901530 3678412 3481322 3307912 3155122 3020029 2900966 2796777
59191 2796777 2705423 2624369 2551954 2487506 2430460 2380270 2336805 2299928 2268960 2243216 2222651
$$ packed form
59259E981444j03600j04081j03532j02560j02685j04165j05631j06119j06025
59250E043046j05626j04259j01415r7320r1943q4695p5513o5174n4046m1470k6760
59239D194825r923Q843K9397N1370P4514R9417J26940J56980J88774K22146K57246
59228E400529K93182L28060L60257L88278M09481M20355M18059M00635L66176
59219H785012L13739K45228J64836P6408j7227j12401k03935k86835l57302m12164
59209H195359m49148m68344m72079m62932m43024m15251l83283l49785l15878
59200D435635k82618k51487k23118j97090j73410j52790j35093j19063j04189
59191B796777r1354q1054p2415o4448n7046n0190m3465l6877l0968k5744k0565
$$ plain form
59180 2222651 2207281 2196541 2189899 2187485 2189362 2194871 2203559 2216007 2232870 2253848 2278576 2307696
59168 2307696 2341915 2380723 2423267 2469872 2521480 2578098 2638988 2703929 2773131 2846260 2922546
59157 2922546 3001347 3081547 3160947 3237288 3309319 3375861 3434622 3483225 3520759 3547090 3561407
59146 3561407 3562982 3552789 3532786 3503993 3466769 3422623 3374212 3323721 3272661 3223022 3177092
59135 3177092 3136177 3100765 3071857 3050899 3038582 3034972 3040671 3056679 3083313 3120451 3168572 3228368
59123 3228368 3299727 3382433 3477597 3586925 3710820 3848580 4000203 4166501 4347539 4542444
59113 4542444 4750740 4972543 5207484 5454593 5712883 5980398 6252612 6523021 6785182
59104 6785182 7032799 7258028 7451405 7603760 7707237 7755065 7742547 7668986 7537726 7354375
$$ packed form
59180B222651j5370j0740o642k414J877N509Q688J2448J6863K0978K4728K9120
59168B307696L4219L8808M2544M6605N1608N6618O0890O4941O9202P3129P6286
59157B922546P8801Q0200P9400P6341P2031O6542N8761M8603L7534K6331J4317
59146C561407J575j0193k0003k8793l7224m4146m8411n0491n1060m9639m5930
59135C177092m0915l5412k8908k0958j2317l610N699J6008K6634L7138M8121N9796
59123C228368P1359Q2706R5164J09328J23895J37760J51623J66298J81038J94905
59113D542444K08296K21803K34941K47109K58290K67515K72214K70409K62161
59104F785182K47617K25229J93377J52355J03477M7828j2518p3561j31260j83351
$$ plain form
59094 7354375 7126119 6862156 6572602 6266210 5949999 5630710 5314864 5007284 4711100
59085 4711100 4429313 4164758 3918430 3689552 3477644 3283045 3105259 2942481 2793160
59076 2793160 2656559 2531408 2415616 2307834 2207942 2115693 2030272 1951427 1879424 1813523
59066 1813523 1752154 1695064 1643607 1598268 1557536 1519953 1485673 1455080 1427355 1401498 1377611
59055 1377611 1356157 1336896 1319356 1303473 1289033 1275368 1262234 1250202 1239799 1231162 1224811 1221539
59043 1221539 1221061 1221849 1222812 1224014 1225426 1226377 1226956 1228692 1233053 1240307 1250486 1264301 1282247 1303826
59029 1303826 1328412 1355875 1385569 1415593 1443892 1469328 1491049 1507744 1518434 1523386 1523662 1520373
59017 1520373 1514878 1508893 1503719 1499901 1498032 1499190 1504055 1512179 1522472 1533876 1545394 1556220 1566048
$$ packed form
59094G354375k28256k63963k89554l06392l16211l19289l15846l07580k96184
59085D711100k81787k64555k46328k28878k11908j94599j77786j62778j49321
59076B793160j36601j25151j15792j07782r9892r2249q5421p8845p2003o5901
59066A813523o1369n7090n1457m5339m0732l7583l4280l0593k7725k5857k3887
59055A377611k1454j9261j7540j5883j4440j3665j3134j2032j0403q637o351l272
59043A221539m78P88R63J202J412R51N79J736M361P254J0179J3815J7946K1579
59029A303826K4586K7463K9694L0024K8299K5436K1721J6695J0690M952K76l289
59017A520373n495n985n174l818j869J158M865Q124J0293J1404J1518J0826R828
$$ plain form
59004 1566048 1574525 1580369 1581919 1578630 1571131 1559879 1544970 1527288 1508445 1489249 1469543 1449843
58992 1449843 1431713 1416132 1402880 1392066 1384735 1381213 1380175 1380248 1381392 1383976 1387715 1392389 1398528
58979 1398528 1406465 1415659 1425766 1437404 1451019 1465908 1481281 1497507 1515506 1535612 1557825 1582496
58967 1582496 1609915 1639739 1671443 1704880 1739921 1776137 1813205 1851045 1889228 1926886 1963438
58956 1963438 1998782 2032786 2065471 2097807 2131396 2167266 2205884 2248221 2295500 2347850 2404598
58945 2404598 2466055 2533570 2607691 2687867 2774257 2868056 2969491 3077283 3190883 3311618
58935 3311618 3440865 3578787 3725968 3884752 4057770 4246416 4451838 4676210 4921957
58926 4921957 5190878 5485080 5807533 6160703 6545817 6964510 7419929 7915025 8450851
$$ packed form
59004A566048Q477N844J550l289p499j1252j4909j7682j8843j9196j9706j9700
58992A449843j8130j5581j3252j0814p331l522j038P3J144K584L739M674O139
58979A398528P937R194J0107J1638J3615J4889J5373J6226J7999K0106K2213K4671
58967A582496K7419K9824L1704L3437L5041L6216L7068L7840L8183L7658L6552
58956A963438L5344L4004L2685L2336L3589L5870L8618M2337M7279N2350N6748
58945B404598O1457O7515P4121Q0176Q6390R3799J01435J07792J13600J20735
58935C311618J29247J37922J47181J58784J73018J88646K05422K24372K45747
58926D921957K68921K94202L22453L53170L85114M18693M55419M95096N35826
$$ plain form
58917 8450851 9027628 9646105 10306159 11004616 11735285 12489805 13256610 14019430 14757961
58908 14757961 15449706 16070632 16595596 17000647 17266331 17379820 17336000 17138360 16798754
58899 16798754 16335255 15769612 15125546 14426997 13696002 12951884 12211895 11490997 10800279
58890 10800279 10146773 9535344 8969424 8449343 7971723 7531889 7126085 6750905 6402531
58881 6402531 6078155 5777155 5499542 5244025 5008525 4791560 4591994 4408367 4239413
58872 4239413 4084335 3941827 3809987 3687980 3576405 3475104 3382110 3295914 3217202 3146900
58862 3146900 3083943 3026642 2975033 2930129 2891793 2858983 2831317 2808819 2790884 2777031 2768073
58851 2768073 2765219 2768632 2778063 2794015 2816858 2845538 2878632 2916184 2959320 3008705 3064515 3127178
$$ packed form
58917H450851N76777O18477O60054O98457P30669P54520P66805P62820P38531
58908A4757961O91745O20926N24964M05051K65684J13489m3820j97640l39606
58899A6798754m63499n65643o44066o98549p30995p44118p39989p20898o90718
58890A0800279o53506o11429n65920n20081m77620m39834m05804l75180l48374
58881F402531l24376l01000k77613k55517k35500k16965j99566j83627j68954
58872D239413j55078j42508j31840j22007j11575j01301r2994q6196p8712p0302
58862C146900o2957n7301n1609m4904l8336l2810k7666k2498j7935j3853q958
58851B768073k854L413R431J5952K2843K8680L3094L7552M3136M9385N5810O2663
$$ plain form
58839 3127178 3196934 3273332 3356329 3447100 3546731 3654939 3771309 3896904 4033411 4181579
58829 4181579 4341794 4515428 4704376 4910019 5133826 5378177 5645534 5937695 6256934
58820 6256934 6606715 6990079 7408524 7863774 8359258 8898033 9480118 10103161 10764179
58811 10764179 11458347 12176671 12906438 13632888 14338408 15000872 15595123 16096471 16482417
58802 16482417 16733360 16835346 16783271 16580847 16238418 15772205 15204013 14558343 13858583
58793 13858583 13126242 12381985 11644338 10926819 10237818 9583112 8967117 8392306 7859497
58784 7859497 7369019 6920507 6512115 6141584 5807775 5509793 5245205 5010734 4803959
58775 4803959 4622030 4458588 4303757 4147730 3983981 3810384 3629515 3447708 3271651
$$ packed form
58839C127178O9756P6398Q2997R0771R9631J08208J16370J25595J36507J48168
58829D181579J60215J73634J88948K05643K23807K44351K67357K92161L19239
58820F256934L49781L83364M18445M55250M95484N38775N82085O23043O61018
58811A0764179O94168P18324P29767P26450P05520O62464N94251N01348L85946
58802A6482417K50943J01986n2075k02424l42429m66213n68192o45670o99760
58793A3858583p32341p44257p37647p17519o89001o54706o15995n74811n32809
58784G859497m90478m48512m08392l70531l33809k97982k64588k34471k06775
58775D803959j81929j63442j54831j56027j63749j73597j80869j81807j76057
$$ plain form
58766 3271651 3105109 2949430 2806037 2676486 2560466 2455924 2361396 2276753 2201798 2135767
58756 2135767 2078202 2028849 1986670 1950265 1919105 1893069 1871108 1851836 1835106 1821558 1810950
58745 1810950 1802421 1795962 1791839 1788681 1783789 1775259 1762440 1744665 1721328 1693167 1661885 1628503
58733 1628503 1593416 1557902 1523954 1492584 1463425 1435782 1408850 1381410 1352824 1323965 1295836
58722 1295836 1267797 1238630 1208779 1179829 1152323 1125900 1101059 1078794 1058782 1039820 1021862
58711 1021862 1005808 991524 977981 965143 953802 943649 933422 922985 913466 905374 898234 891881
58699 891881 886302 880494 873417 865986 860027 855350 849972 843323 837107 832682 829534 826713 823863 820422
58685 820422 815587 809584 803596 798198 793243 789282 787487 788168 790939 796337 805504 818243 833133 849643
$$ packed form
58766C271651j66542j55679j43393j29551j16020j04542r4528q4643p4955o6031
58756B135767n7565m9353m2179l6405l1160k6036k1961j9272j6730j3548j0608
58745A810950q529o459m123l158m892q530j2819j7775k3337k8161l1282l3382
58733A628503l5087l5514l3948l1370k9159k7643k6932k7440k8586k8859k8129
58722A295836k8039k9167k9851k8950k7506k6423k4841k2265k0012j8962j7958
58711A021862j6054j4284j3543j2838j1341j0153j0227j0437r519q092p140o353
58699H91881n579n808p077p431n959m677n378o649o216m425l148k821k850l441
58685H20422m835o003n988n398m955l961j795O81K771N398R167J2739J4890J6510
$$ plain form
58671 849643 868422 889536 912310 937193 966042 1000339 1040609 1087321 1140031 1194876 1244368
58660 1244368 1280410 1297083 1291707 1265678 1224648 1176033 1125651 1077246 1034085 998676 971161
58649 971161 950077 934761 925302 920604 918868 919920 924884 933515 944040 955695 969302 985345 1003669
58636 1003669 1025066 1050826 1080579 1112854 1147887 1187595 1232721 1282496 1337289 1399003 1468491
58625 1468491 1545191 1629852 1725092 1832615 1952340 2084961 2232875 2397633 2578670 2775221
58615 2775221 2987060 3212278 3446281 3683619 3918465 4142359 4343725 4510977 4634940
58606 4634940 4708404 4726307 4687960 4597625 4462238 4290115 4091752 3878913 3661322 3445540
58596 3445540 3237023 3040667 2858552 2689683 2533133 2389541 2258931 2139673 2030802
$$ packed form
58671H49643J8779K1114K2774K4883K8849L4297M0270M6712N2710N4845M9492
58660A244368L6042J6673n376k6029m1030m8615n0382m8405m3161l5409k7515
58649I71161k1084j5316r459m698j736J052M964Q631J0525J1655J3607J6043J8324
58636A003669K1397K5760K9753L2275L5033L9708M5126M9775N4793O1714O9488
58625A468491P6700Q4661R5240J07523J19725J32621J47914J64758J81037J96551
58615B775221K11839K25218K34003K37338K34846K23894K01366J67252J23963
58606D634940P3464J7903l8347r0335j35387j72123j98363k12839k17591k15782
58596C445540k08517j96356j82115j68869j56550j43592j30610j19258j08871
$$ plain form
58587 2030802 1933181 1847162 1771157 1703675 1644882 1595028 1553133 1518156 1489670 1466570 1446975
58576 1446975 1430200 1416887 1406544 1397080 1387556 1379184 1372776 1367430 1362768 1360211 1360776 1363393 1366307
58563 1366307 1368236 1367374 1361349 1349240 1331963 1310299 1284665 1257246 1231793 1210552 1193663 1181902
58551 1181902 1176841 1177183 1177922 1174641 1166290 1152819 1133206 1107577 1078547 1048514 1017739 986580 957142
58538 957142 930947 907123 884575 863836 845374 828308 812303 798440 786659 774673 761103
58527 761103 747446 735277 723773 711737 699938 689603 680563 672530 666259 661810 657637 652884 648617
58514 648617 645497 642518 639401 637792 638426 639535 639845 640744 643690 647748 651629 655973 661666 668039 674577
58499 674577 682395 692217 702969 714074 727045 743111 761335 780561 800873 821550 840118 855269
$$ packed form
58587B030802r7621q6019p6005o7482n8793m9854m1895l4977k8486k3100j9595
58576A446975j6775j3313j0343r464r524q372o408n346m662k557N65K617K914
58563A366307J929q62o025j2109j7277k1664k5634k7419k5453k1241j6889j1761
58551A181902n061L42P39l281q351j3471j9613k5629k9030l0033l0775l1159k9438
58538I57142k6195k3824k2548k0739j8462j7066j6005j3863j1781j1986j3570
58527G61103j3657j2169j1504j2036j1799j0335r040q033o271m449m173m753m267
58514F48617l120k979l117j609O34J109L10Q99K946M058L881M344N693O373O538
58499F74577P818R822J0752J1105J2971J6066J8224J9226K0312K0677J8568J5151
$$ plain form
58487 855269 868407 880646 890703 897302 900875 901152 896073 885181 871251 856433 839737 820580
58475 820580 801613 785227 770065 753971 737786 723321 710094 697119 685646 677094 670314 663641
58463 663641 657561 652674 647419 640760 634843 631921 630717 628780 626403 625222 624913 624335 624009 624547 624538 622954
58447 622954 621799 623502 627569 632629 639657 650169 663183 677080 692552 710679 729892 747785
58435 747785 764028 778562 789111 793755 794139 793032 790611 786141 781160 777560 774379 769902 765160 762084
58421 762084 760033 757419 754973 754098 753841 752814 752308 754159 757448 760696 765389 773690 784443 794922
58407 794922 804762 814637 823025 827997 830457 831948 831065 825802 817699 809809 802279 793751 785365 779291
58393 779291 774821 769890 765105 762440 761364 760075 759143 760097 761786 761837 760274 758224 754810 749072 743101
$$ packed form
58487H55269J3138J2239J0057O599L573K77n079j0892j3930j4818j6696j9157
58475H20580j8967j6386j5162j6094j6185j4465j3227j2975j1473q552o780o673
58463F63641o080m887n255o659n917k922j204j937k377j181l09n78l26N38rj584
58447F22954j155J703M067N060P028J0512J3014J3897J5472J8127J9213J7893
58435G47785J6243J4534J0549M644L84j107k421m470m981l600l181m477m742l076
58421G62084k051k614k446q75k57j027n06J851L289L248M693Q301J0753J0479
58407G94922R840R875Q388M972K460J491q83n263q103p890p530q528q386o074
58393G79291m470m931m785k665j076j289r32R54J689N1j563k050l414n738n971
$$ plain form
58378 743101 739394 736894 733517 730570 730543 732515 734137 736338 741620 749380 757325 765822 776396 787660
58364 787660 797220 805992 816153 826598 835086 843056 853559 866134 878496 891483 907298 924493
58352 924493 939789 953224 966442 977573 983175 983836 982636 979625 973215 965434 960072 956828 952872
58339 952872 948954 948314 950652 952854 954800 958981 965365 972102 980173 991792 1005340 1017402 1028565
58326 1028565 1041721 1056181 1069301 1082367 1098709 1117426 1135233 1153105 1174596 1198908 1222095
58315 1222095 1243832 1266303 1287766 1304163 1316024 1326832 1335821 1339652 1340109 1342618 1347919 1352616 1357063
58302 1357063 1364973 1375873 1385819 1395253 1408406 1425273 1441893 1458175 1477703 1500259 1522436 1545071
58290 1545071 1571867 1601242 1628082 1653156 1682079 1715280 1748001 1780125 1816685 1858453 1901251
$$ packed form
58378G43101l707k500l377k947k7J972J622K201N282P760P945Q497J0574J1264
58364G87660R560Q772J0161J0445Q488P970J0503J2575J2362J2987J5815J7195
58352I24493J5296J3435J3218J1131N602O61j200l011o410p781n362l244l956
58339I52872l918o40K338K202J946M181O384O737Q071J1619J3548J2062J1163
58326A028565J3156J4460J3120J3066J6342J8717J7807J7872K1491K4312K3187
58315A222095K1737K2471K1463J6397J1861J0808Q989L831M57K509N301M697M447
58302A357063P910J0900R946R434J3153J6867J6620J6282J9528K2556K2177K2635
58290A545071K6796K9375K6840K5074K8923L3201L2721L2124L6560M1768M2798
$$ plain form
58279 1901251 1945023 1994200 2048529 2102782 2155928 2211133 2266325 2314722 2355561 2394448 2432423
58268 2432423 2464849 2492045 2520543 2552470 2583910 2615031 2651367 2693749 2737438 2782491 2834310
58257 2834310 2892797 2951987 3011591 3077583 3150234 3223376 3296819 3377315 3465643 3555238 3645316
58246 3645316 3742637 3848598 3957659 4070252 4193548 4327451 4463973 4602563 4751574 4912514
58236 4912514 5078139 5248437 5432502 5631884 5838570 6052368 6283132 6532714 6792805
58227 6792805 7064171 7359165 7681162 8021047 8378360 8765368 9185568 9629968 10100198
58218 10100198 10612779 11174555 11777626 12425123 13137078 13923744 14779650 15712055 16747567
58209 16747567 17902592 19177782 20591684 22188423 24002744 26053540 28384959 31078412
$$ packed form
58279A901251M3772M9177N4329N4253N3146N5205N5192M8397M0839L8887L7975
58268B432423L2426K7196K8498L1927L1440L1121L6336M2382M3689M5053N1819
58257B834310N8487N9190N9604O5992P2651P3142P3443Q0496Q8328Q9595R0078
58246C645316R7321J05961J09061J12593J23296J33903J36522J38590J49011J60940
58236D912514J65625J70298J84065J99382K06686K13798K30764K49582K60091
58227F792805K71366K94994L21997L39885L57313L87008M20200M44400M70230
58218A0100198N12581N61776O03071O47497P11955P86666Q55906R32405J035512
58209A6747567J155025J275190J413902J596739J814321K050796K331419K693453
$$ plain form
58201 31078412 34214988 37872208 42175692 47309463 53460071 60803787 69569304 80061288
58193 80061288 92620852 107657536 125756326 147669415 174191087 206142361 244291313
58186 244291313 288504779 336060672 380612118 413613374 427973717 421357501 396719359
58179 396719359 360161266 318146597 275762659 236241646 201172996 170980108 145450360
58172 145450360 124121548 106443136 91834960 79764254 69803015 61608065 54881338
58165 54881338 49377611 44923220 41392103 38671664 36671519 35352365 34720196 34794869
58157 34794869 35611142 37256993 39854699 43386103 47428033 51062124 53177119 53025585
58149 53025585 50594664 46499342 41563139 36472187 31673473 27406025 23743152 20648548
$$ packed form
58201C1078412L136576L657220M303484N133771O150608P343716Q765517J0491984
58193H0061288J2559564J5036684J8098790K1913089K6521672L1951274L8148952
58186B44291313M4213466M7555893M4551446L3001256J4360343o616216k4638142
58179C96719359l6558093m2014669m2383938l9521013l5068650l0192888k5529748
58172A45450360k1328812j7678412j4608176j2070706r961239q194950o726727
58165E4881338n503727m454391l531117k720439k000145j319154o32169P4673
58157C4794869Q16273J645851K597706L531404M041930L634091K114995j51534
58149E3025585k430921m095322m936203n090952m798714m267448l662873l094604
$$ plain form
58141 20648548 18052948 15894971 14108580 12616293 11355651 10292119 9396280 8630600
58133 8630600 7968146 7401672 6921809 6504334 6128787 5791411 5489296 5208534 4938363
58124 4938363 4681751 4442080 4213382 3992658 3788024 3605300 3438793 3283390 3143581
58115 3143581 3022663 2914925 2816047 2729486 2654913 2581716 2501871 2419026 2338008 2256094 2171915
58104 2171915 2092366 2022754 1959328 1898630 1844860 1800862 1760894 1719556 1679539 1643713 1607828
58093 1607828 1567826 1526512 1486505 1444397 1398292 1353549 1314677 1278770 1242783 1209768 1181823
58082 1181823 1154450 1124324 1095513 1071731 1049359 1024570 1000536 981018 963233 943726 925254
58071 925254 911267 899177 885471 872133 861878 852264 840566 829396 821561 814356 804814 795674
$$ packed form
58141B0648548k595600k157977j786391j492287j260642j063532q95839p65680
58133H630600o62454n66474m79863m17475l75547l37376l02115k80762k70171
58124D938363k56612k39671k28698k20724k04634j82724j66507j55403j39809
58115C143581j20918j07738r8878q6561p4573p3197p9845q2845q1018q1914q4179
58104B171915p9549o9612o3426o0698n3770m3998l9968m1338m0017l5826l5885
58093A607828m0002m1314m0007m2108m6105m4743l8872l5907l5987l3015k7945
58082A181823k7373l0126k8811k3782k2372k4789k4034j9518j7785j9507j8472
58071I25254j3987j2090j3706j3338j0255r614j1698j1170p835p205r542r140
$$ plain form
58059 795674 790238 785987 779160 771120 764342 756603 745154 732644 722985 715000 705739 696507 690051 685134
58045 685134 679262 673715 670773 668978 665968 663099 662618 663197 662649 662137 663540 665769 667717 671448 678246
58030 678246 684847 687823 688481 689384 689515 687269 684732 684413 684796 683543 681953 681860 681351 678158 674343 672961
58014 672961 672780 670825 667562 665143 663128 660314 658340 659124 661122 662276 664124 668806 674553 678463 681206
57999 681206 684539 686635 684545 679103 672789 664826 653065 638917 625648 613192 599106 583491 568784
57986 568784 555830 544162 535017 530130 528507 527897 528364 531116 535226 538946 542819 548086 553541 557372
57972 557372 560610 565279 570630 574608 577415 580048 581038 578495 574062 571024 569649 568014 566184 565795 566482
57957 566482 566423 565666 565500 565359 563633 560759 558477 556980 555764 556089 559365 564217 568304 571831 576037 579547
$$ packed form
58059G95674n436m251o827q040o778p739j1449j2510r659p985r261r232o456m917
58045F85134n872n547k942j795l010k869m81N79n48n12J403K229J948L731O798
58030F78246O601K976O58R03J31k246k537l19L83j253j590r3n09l193l815j382
58014F72961j81j955l263k419k015k814j974P84J998J154J848M682N747L910K743
57999F81206L333K096k090n442o314p963j1761j4148j3269j2456j4086j5615j4707
57986E68784j2954j1668r145m887j623o10M67K752M110L720L873N267N455L831
57972E57372L238M669N351L978K807K633R90k543m433l038j375j635j830l89O87
57957E66482n9p57j66j41j726k874k282j497j216L25L276M852M087L527M206L510
$$ plain form
57941 579547 579762 576860 573009 568497 562037 553932 545558 536492 525477 513502 502682 492891 482689
57928 482689 472673 464581 457867 450470 442249 434450 426642 417651 408806 402706 399265 396330 393728 393267
57914 393267 395138 397782 401078 406303 413134 419940 426934 435830 446563 457474 468581 481357 495269
57901 495269 507750 517780 526496 534169 539544 542335 543372 542094 536825 527943 518017 508449 498503 487878
57887 487878 477685 468496 459800 451678 444876 439239 434219 430687 429906 430989 431804 432192 433792 437040 440958
57872 440958 445648 452244 460494 468987 477631 487250 497019 505119 511677 518155 524024 527187 527690 527761 527881
57857 527881 526070 521568 516118 510909 505226 498888 493192 488602 484138 479864 477267 476349 475025 472390
57843 472390 470044 469093 468318 466505 464387 463007 462080 461083 460150 458951 456293 451706 445897 439135 430834
$$ packed form
57941E79547K15k902l851m512o460q105q374r066j1015j1975j0820r791j0202
57928D82689j0016q092o714p397q221p799p808q991q845o100l441k935k602m61
57914C93267J871K644L296N225O831O806O994Q896J0733J0911J1107J2776J3912
57901D95269J2481J0030Q716P673N375K791J037j278n269q882r926r568r946j0625
57887D87878j0193r189q696q122o802n637n020l532p81J083Q15L88J600L248L918
57872D40958M690O596Q250Q493Q644R619R769Q100O558O478N869L163N03P1J20
57857E27881j811m502n450n209n683o338n696m590m464m274k597r18j324k635
57843D72390k346r51p75j813k118j380r27r97r33j199k658m587n809o762q301
$$ plain form
57828 430834 421063 410677 399669 387341 374337 362378 351680 340910 330075 321004 314314 308364
57816 308364 302106 296642 292919 290044 287046 284364 282538 281199 280337 280789 282541 284312 285705 288050 292284
57801 292284 297745 303955 311771 321797 333339 345907 360124 376070 392191 406770 419147 428879
57789 428879 435356 439080 441735 444035 444912 443580 440932 438059 434794 430462 424734 417077 406891 394834
57775 394834 382637 371049 359469 348040 338275 330881 324746 318918 313932 310315 307545 305465 305082
57762 305082 306812 309345 311353 313026 314987 317052 319014 321357 324255 327046 329561 332776 337309 342440
57748 342440 347309 351890 356181 359740 362699 365877 369307 372055 374084 376724 380579 384547 387734 390723
57734 390723 394133 397561 401009 405699 412287 419610 426421 433127 440775 449543 459308 470451 483033 496244
$$ packed form
57828D30834r771j0386j1008j2328j3004j1959j0698j0770j0835r071o690n950
57816C08364o258n464l723k875k998k682j826j339q62M52J752J771J393K345M234
57801B92284N461O210P816J0026J1542J2568J4217J5946J6121J4579J2377R732
57789D28879O477L724K655K300Q77j332k648k873l265m332n728p657j0186j2057
57775C94834j2197j1588j1580j1429r765p394o135n828m986l617k770k080l83
57762C05082J730K533K008J673J961K065J962K343K898K791K515L215M533N131
57748C42440M869M581M291L559K959L178L430K748K029K640L855L968L187K989
57734C90723L410L428L448M690O588P323O811O706P648Q768R765J1143J2582J3211
$$ plain form
57720 496244 509681 524051 539764 556020 572185 588854 606633 625118 643998 663994 685798
57709 685798 709248 734428 762344 793691 828268 866388 909391 957807 1010647 1067657 1130788
57698 1130788 1202157 1282060 1370439 1468953 1579910 1704289 1842384 1995509 2165370 2352248
57688 2352248 2554968 2771842 3000161 3235020 3469357 3694466 3899861 4074015 4206948
57679 4206948 4292310 4327287 4312428 4252922 4158804 4042452 3916168 3792110 3682258 3596421
57669 3596421 3540833 3518795 3529459 3562469 3594551 3595287 3539687 3418109 3237966 3018782 2784192
57658 2784192 2554296 2341833 2153188 1990858 1854302 1740508 1646192 1569519 1508970 1461711
57648 1461711 1424691 1396734 1378139 1368728 1367594 1374175 1388198 1408984 1436108 1470429 1513307 1565201
$$ packed form
57720D96244J3437J4370J5713J6256J6165J6669J7779J8485J8880J9996K1804
57709F85798K3450K5180K7916L1347L4577L8120M3003M8416N2840N7010O3131
57698A130788P1369P9903Q8379R8514J10957J24379J38095J53125J69861J86878
57688B352248K02720K16874K28319K34859K34337K25109K05395J74154J32933
57679D206948Q5362L4977j4859n9506r4118j16352j26284j24058j09852q5837
57669C596421n5588k2038J0664L3010L2082P36n5600j21578j80143k19184k34590
57658B784192k29896k12463j88645j62330j36556j13794r4316p6673o0549m7259
57648A461711l7020k7957j8595r411j134O581J4023K0786K7124L4321M2878N1894
$$ plain form
57636 1565201 1626191 1697374 1780508 1876602 1985994 2109340 2247279 2399367 2564481 2741877
57626 2741877 2930480 3126994 3325429 3518169 3696619 3851191 3972022 4050418 4080076 4058189
57616 4058189 3986533 3871102 3719950 3541570 3345149 3140411 2935395 2734763 2541267 2358017
57606 2358017 2188092 2032686 1891147 1762533 1646086 1540744 1445475 1359858 1283368 1214570
57596 1214570 1151997 1095279 1044386 998486 956696 919312 886905 858690 833064 809296 787432
57585 787432 767075 747646 729464 713132 698188 683782 670331 659034 649910 641826 634362 628140
57573 628140 623245 618795 614381 610716 608530 607814 608363 610099 612691 615727 619431 624532 631432 640148 650806
57558 650806 663312 676830 690608 705121 721354 739174 757642 776887 798449 823571 852254
$$ packed form
57636A565201O0990P1183Q3134R6094J09392J23346J37939J52088J65114J77396
57626B741877J88603J96514J98435J92740J78450J54572J20831P8396K9658k1887
57616D058189p1656j15431j51152j78380j96421k04738k05016k00632j93496j83250
57606B358017j69925j55406j41539j28614j16447j05342r5269q5617p6490o8798
57596A214570o2573n6718n0893m5900m1790l7384l2407k8215k5626k3768k1864
57585G87432k0357j9429j8182j6332j4944j4406j3451j1297r124q084p464o222
57573F28140m895m450m414l665k186p16N49J736K592L036L704N101O900Q716J0658
57558F50806J2506J3518J3778J4513J6233J7820J8468J9245K1562K5122K8683
$$ plain form
57547 852254 884296 920289 961131 1007266 1058770 1115830 1178997 1249319 1328119 1416268 1513860
57536 1513860 1621002 1738464 1866904 2005792 2153614 2308531 2467896 2627345 2780901
57527 2780901 2921524 3041079 3130888 3183913 3196663 3168786 3102037 3000896 2873259 2728505
57517 2728505 2574474 2416894 2260806 2110714 1969411 1838057 1717501 1608394 1510335 1422369
57507 1422369 1344383 1276704 1218382 1167288 1122079 1082754 1049194 1020487 995989 975812 959921
57496 959921 947842 939556 935533 935522 938348 943278 950714 961319 975347 993108 1015137 1041628 1072501
57483 1072501 1108232 1149868 1198138 1253380 1316317 1387910 1468383 1557488 1655891 1765213 1886281
57472 1886281 2018190 2159131 2307028 2458771 2609503 2752883 2881440 2986771 3060738 3097322
$$ packed form
57547H52254L2042L5993M0842M6135N1504N7060O3167P0322P8800Q8149R7592
57536A513860J07142J17462J28440J38888J47822J54917J59365J59449J53556
57527B780901J40623J19555Q9809N3025J2750k7877o6749j01141j27637j44754
57517B728505j54031j57580j56088j50092j41303j31354j20556j09107r8059q7966
57507A422369p7986o7679n8322n1094m5209l9325l3560k8707k4498k0177j5891
57496I59921j2079q286m023j1K826M930P436J0605J4028J7761K2029K6491L0873
57483A072501L5731M1636M8270N5242O2937P1593Q0473Q9105R8403J09322J21068
57472A886281J31909J40941J47897J51743J50732J43380J28557J05331P3967L6584
$$ plain form
57462 3097322 3093386 3048324 2964379 2847424 2706021 2548769 2382698 2213793 2047560 1888355
57452 1888355 1738799 1600287 1473570 1358745 1255408 1163017 1080698 1006916 940189 880078
57442 880078 826728 779654 737841 700699 667812 638029 610141 584365 561811 542419 524811
57431 524811 508198 493049 479660 467569 456591 446970 438088 428618 418478 409187 401653 395055 388576
57418 388576 382740 378136 374194 370245 366651 363822 361149 357948 354640 352082 350557 350165 351209 353336
57404 353336 355230 356105 356591 357288 357584 357040 356915 358817 362438 366036 368805 371465 374673 378032 380784 382673
57388 382673 384050 385665 388224 391700 395317 398512 401458 404270 406412 407568 408449 410050 412556 415609
57374 415609 419040 422570 425395 427025 428149 429807 431968 433755 434817 435634 436674 438070 440068 443029
$$ packed form
57462C097322l936m5062q3945j16955j41403j57252j66071j68905j66233j59205
57452A888355j49556j38512j26717j14825j03337r2391q2319p3782o6727o0111
57442H80078n3350m7074m1813l7142l2887k9783k7888k5776k2554j9392j7608
57431E24811j6613j5149j3389j2091j0978r621q882r470j0140r291p534o598o479
57418C88576n836m604l942l949l594k829k673l201l308k558j525l92J044K127
57404C53336J894Q75M86O97K96n44j25J902L621L598K769K660L208L359K752J889
57388C82673J377J615K559L476L617L195K946K812K142J156Q81J601K506L053
57374D15609L431L530K825J630J124J658K161J787J062Q17J040J396J998K961
$$ plain form
57360 443029 446833 450785 454187 456809 458926 461112 463738 466469 468611 470179 472104 475062 478741 482703
57346 482703 487368 493479 501051 509455 518179 526932 535386 543457 551576 560191 569229 578445 587903 597640
57332 597640 607230 616183 624540 632686 640873 649280 658192 667729 677680 687840 698148 708396 718371
57319 718371 728388 738971 749886 760463 771141 783540 798328 814130 829389 844265 859712
57308 859712 875689 891639 908031 925934 945344 965268 985359 1006320 1028652 1052021 1075955
57297 1075955 1100389 1125455 1151410 1178803 1208147 1239512 1272849 1308407 1346217 1385468 1425083
57286 1425083 1464625 1504014 1542689 1579756 1614596 1646538 1674291 1696564 1713045 1723940 1728863
57275 1728863 1727146 1719157 1706426 1690524 1672640 1654166 1636730 1621445 1608715 1598730 1591520 1586666
$$ packed form
57360D43029L804L952L402K622K117K186K626K731K142J568J925K958L679L962
57346D82703M665O111P572Q404Q724Q753Q454Q071Q119Q615R038R216R458R737
57332E97640R590Q953Q357Q146Q187Q407Q912R537R951J0160J0308J0248R975
57319G18371J0017J0583J0915J0577J0678J2399J4788J5802J5259J4876J5447
57308H59712J5977J5950J6392J7903J9410J9924K0091K0961K2332K3369K3934
57297A075955K4434K5066K5955K7393K9344L1365L3337L5558L7810L9251L9615
57286A425083L9542L9389L8675L7067L4840L1942K7753K2273J6481J0895M923
57275A728863j717p989j2731j5902j7884j8474j7436j5285j2730r985p210m854
$$ plain form
57263 1586666 1583787 1583358 1586269 1592521 1601036 1610858 1621963 1634837 1649811 1666846 1685552 1705391 1726239
57250 1726239 1748501 1772261 1796719 1821111 1845769 1871502 1898294 1925509 1953144 1981894 2012085
57239 2012085 2043474 2076046 2109991 2144832 2179553 2213864 2248573 2284489 2321601 2359459 2397666
57228 2397666 2435884 2473982 2512333 2551409 2591142 2631289 2672359 2715356 2760586 2807412 2855217
57217 2855217 2903938 2953696 3004699 3057507 3112605 3169663 3227975 3287562 3348852 3411286 3473239
57206 3473239 3533596 3592399 3649734 3705023 3757934 3809094 3859370 3909088 3958371 4007563 4056892
57195 4056892 4106326 4156120 4206990 4259450 4313594 4369762 4428631 4490344 4554238 4619882 4687768
57184 4687768 4758657 4832826 4910321 4991216 5075226 5161648 5250051 5340316 5431572 5521729 5608522
$$ packed form
57263A586666k879m29K911O252Q515R822J1105J2874J4974J7035J8706J9839K0848
57250A726239K2262K3760K4458K4392K4658K5733K6792K7215K7635K8750L0191
57239B012085L1389L2572L3945L4841L4721L4311L4709L5916L7112L7858L8207
57228B397666L8218L8098L8351L9076L9733M0147M1070M2997M5230M6826M7805
57217B855217M8721M9758N1003N2808N5098N7058N8312N9587O1290O2434O1953
57206C473239O0357N8803N7335N5289N2911N1160N0276M9718M9283M9192M9329
57195D056892M9434M9794N0870N2460N4144N6168N8869O1713O3894O5644O7886
57184D687768P0889P4169P7495Q0895Q4010Q6422Q8403R0265R1256R0157Q6793
$$ plain form
57173 5608522 5690502 5766787 5836692 5900134 5957672 6009578 6055479 6095458 6130729 6162498 6190739
57162 6190739 6214784 6234592 6250639 6263039 6271563 6276268 6277449 6275298 6270252 6263482 6256410 6249876 6244138
57149 6244138 6239368 6235717 6233327 6232629 6234176 6237648 6241607 6244856 6247452 6249680 6250623 6248807 6243873 6236528
57135 6236528 6226991 6214549 6198739 6180070 6159414 6137533 6115434 6094493 6075905 6060435 6048704
57124 6048704 6040891 6035848 6031106 6024232 6013885 5999551 5981013 5958741 5934605 5911698 5893397 5882512
57112 5882512 5880912 5889667 5909740 5942709 5990656 6055271 6137517 6238713 6362152 6513774 6701690
57101 6701690 6935685 7227783 7593794 8054595 8635916 9366847 10278674 11404853 12780551
57092 12780551 14440087 16413369 18723694 21386423 24405725 27769650 31447662 35391807
$$ packed form
57173E608522Q1980P6285O9905O3442N7538N1906M5901L9979L5271L1769K8241
57162F190739K4045J9808J6047J2400Q524M705J181k151n046o770p072o534n738
57149F244138m770l651k390o98J547L472L959L249K596K228R43j816m934p345
57135F236528r537j2442j5810j8669k0656k1881k2099k0941j8588j5470j1731
57124F048704p813n043m742o874j0347j4334j8538k2272k4136k2907j8301j0885
57112E882512j600Q755K0073L2969M7947O4615Q2246J01196J23439J51622J87916
57101F701690K33995K92098L66011M60801N81321P30931R11827J126179J375698
57092A2780551J659536J973282K310325K662729L019302L363925L678012L944145
$$ plain form
57084 35391807 39536335 43792582 48046433 52168394 56032653 59527906 62550328 64991095
57076 64991095 66738794 67699806 67819956 67092233 65551963 63269388 60343700 56896210
57068 56896210 53061830 48980767 44790537 40617066 36566553 32721519 29141180 25863038
57060 25863038 22904474 20265906 17935597 15893717 14114665 12569410 11228743 10065660
57052 10065660 9055756 8176964 7409985 6738631 6149206 5629822 5170484 4763256 4401659
57043 4401659 4079920 3792784 3535619 3304340 3095477 2906361 2734941 2579307 2437692
57034 2437692 2308813 2191605 2084532 1985738 1894003 1809031 1730730 1658844 1593354 1534385 1481327
57023 1481327 1432698 1387327 1345120 1306369 1270971 1238823 1210312 1185724 1164491 1145699 1129217
$$ packed form
57084C5391807M144528M256247M253851M121961L864259L495253L022422K440767
57076F4991095J747699R61012J20150p27723j540270k282575k925688l447490
57068E6896210l834380m081063m190230m173471m050513l845034l580339l278142
57060B5863038k958564k638568k330309k041880j779052j545255j340667j163083
57052A0065660j009904q78792p66979o71354n89425n19384m59338m07228l61597
57043D401659l21739k87136k57165k31279k08863j89116j71420j55634j41615
57034B437692j28879j17208j07073r8794r1735q4972p8301p1886o5490n8969n3058
57023A481327m8629m5371m2207l8751l5398l2148k8511k4588k1233j8792j6482
$$ plain form
57012 1129217 1115891 1106741 1102335 1102998 1109492 1123445 1146914 1181385 1227607 1286947 1362787 1460469
57000 1460469 1586499 1747329 1944739 2166535 2379983 2539009 2604806 2564548 2433782 2243985
56990 2243985 2027946 1811583 1611639 1436330 1287847 1165528 1067712 991918 934613 891085
56980 891085 855304 820836 783379 742702 701424 661982 625437 592553 564444 541639 523460
56969 523460 508864 497356 488855 483275 480620 481129 485023 492315 502959 517062 535143 558418 588246
56956 588246 624342 663109 697989 721818 729505 719798 695635 662618 626195 589858 555689 525565
56944 525565 500859 481541 466719 456031 449603 446854 446574 448485 453855 464188 480021 501354 528662
56931 528662 562835 603941 649523 693486 726986 741949 735037 708765 669202 622904 575293 530269
$$ packed form
57012A129217j3326r150m406O63O494J3953K3469L4471M6222N9340P5840R7682
57000A460469J26030J60830J97410K21796K13448J59026O5797m0258j30766j89797
56990B243985k16039k16363j99944j75309j48483j22319r7816p5794n7305m3528
56980H91085l5781l4468l7457m0677m1278l9442l6545l2884k8109k2805j8179
56969E23460j4596j1508q501n580k655N09L894P292J0644J4103J8081K3275K9828
56956E88246L6096L8767L4880K3829P687r707k4163l3017l6423l6337l4169l0124
56944E25565k4706j9318j4822j0688o428k749k80J911N370J0333J5833K1333K7308
56931E28662L4173M1106M5582M3963L3500J4963o912k6272l9563m6298m7611m5024
$$ plain form
56919 530269 490096 455487 426095 401153 380023 362524 348652 337865 329000 321163 314297 308491
56907 308491 303316 298487 294596 292335 291351 290775 290583 291405 293248 295443 297838 300959 304995 309669 315246
56892 315246 322630 332264 343902 357700 374522 394912 418636 445316 474091 501997 523887 535215
56880 535215 534766 524496 507598 487354 466817 448159 432128 418625 407825 400412 396991 397635 401913
56867 401913 409291 419782 434395 454654 481575 515462 556722 606237 664275 728563 792868 847267
56855 847267 881097 887838 868404 829743 780331 727161 675724 630370 593426 564895 543933 530268
56843 530268 523962 524821 532827 548649 573170 607036 651074 706598 774985 857390 954400 1063629
56831 1063629 1175865 1274448 1340877 1362985 1339346 1278060 1192550 1097015 1002677 916040 839845
$$ packed form
56919E30269m0173l4609k9392k4942k1130j7499j3872j0787q865p837o866n806
56907C08491n175m829l891k261r84n76j92Q22J843K195K395L121M036M674N577
56892C15246P384R634J1638J3798J6822K0390K3724K6680K8775K7906K1890J1328
56880E35215m49j0270j6898k0244k0537j8658j6031j3503j0800p413l421O44M278
56867D01913P378J0491J4613K0259K6921L3887M1260M9515N8038O4288O4305N4399
56855H47267L3830O741j9434l8661m9412n3170n1437m5354l6944k8531k0962j3665
56843E30268o306Q59Q006J5822K4521L3866M4038N5524O8387Q2405R7010J09229
56831A063629J12236R8583O6429K2108k3639o1286q5510r5535r4338q6637p6195
$$ plain form
56820 839845 775120 722052 679819 647013 622679 606577 598561 598404 606433 623751 651536 690400
56808 690400 740679 802792 875947 954983 1028174 1079633 1096359 1074693 1020803 945871 861271
56797 861271 776647 699114 632118 575571 528208 489597 459645 437363 421359 411186 407232 409527
56785 409527 417558 431175 450992 477920 512528 554248 600084 643918 677738 694371 690049 665749
56773 665749 626747 580261 532383 486643 444880 408378 377690 352226 330892 312894 297582
56762 297582 284204 272456 262752 255287 249296 243910 239250 235954 234030 232912 232246 231865 231251 229785
56748 229785 227429 224591 221557 218530 215887 213808 211889 209698 207372 205199 203048 200772 198757 197399
56734 197399 196400 195219 193835 192471 191027 189514 188532 188464 188592 187882 186341 184739 183327 181826 180424 179754
$$ packed form
56820H39845o4725n3068m2233l2806k4334j6102q016j57Q029J7318K7785L8864
56808F90400N0279O2113P3155P9036P3191N1459J6726k1666n3890p4932q4600
56797H61271q4624p7533o6996n6547m7363l8611k9952k2282j6004j0173l954K295
56785D09527Q031J3617J9817K6928L4608M1720M5836M3834L3820J6633m322k4300
56773F65749l9002m6486m7878m5740m1763l6502l0688k5464k1334j7998j5312
56762B97582j3378j1748r704p465n991n386m660l296j924j118o66l81o14j466
56748B29785k356k838l034l027k643k079j919k191k326k173k151k276k015j358
56734A97399r99j181j384j364j444j513r82o8J28p10j541j602j412j501j402o70
$$ plain form
56718 179754 179850 180028 179859 179508 179131 178658 178214 178088 178247 178435 178609 178786 178641 178000 177483 177865 178921 179668 179642
56699 179642 179227 178798 178375 178117 178319 178835 179199 179430 180058 181247 182531 183547 184450 185468 186547 187574 188563
56682 188563 189578 190757 192284 193971 195086 195041 194036 192635 190991 189005 186899 185050 183503 182264 181703
56667 181703 182056 182829 183377 183755 184311 184860 185081 185327 186104 187012 187202 186692 186279 186237 186114 185733 185402 185110 184433
56648 184433 183339 182198 180965 179199 176972 174937 173412 172156 171095 170465 170183 169844 169395 169129 169029 168840
56632 168840 168740 169142 169886 170456 170875 171517 172149 172153 171707 171671 172182 172330 171484 170043 168736 167915 167693 168001 168359
56613 168359 168346 168287 168745 169509 169980 170438 171785 174022 176077 177255 177815 178038 177867 177664 178142 179271 180275
56596 180275 180917 181721 182740 183351 183546 184172 185442 186441 186656 186801 187508 188340 188827 189445 190745 192418 194028
$$ packed form
56718A79754R6J78j69l51l77m73m44j26J59J88J74J77j45o41n17L82J056P47k6
56699A79642m15m29m23k58K02N16L64K31O28J189J284J016R03J018J079J027R89
56682A88563J015J179J527J687J115m5j005j401j644j986k106j849j547j239n61
56667A81703L53P73N48L78N56N49K21K46P77R08J90n10m13m2j23l81l31k92o77
56648A84433j094j141j233j766k227k035j525j256j061o30k82l39m49k66j00j89
56632A68840j00M02P44N70M19O42O32Mm46l6N11J48q46j441j307q21k22L08L58
56613A68359j3n9M58P64M71M58J347K237K055J178N60K23j71k03M78J129J004
56596A80275O42Q04J019O11J95O26J270R99K15J45P07Q32M87O18J300J673J610
$$ plain form
56579 194028 195918 198600 201927 205573 209665 214229 218606 222166 225178 228381 232057 236014 240133 244529
56565 244529 249492 255452 262626 270601 278735 286890 295186 303234 310540 317575 325321 333605 340994 346606
56551 346606 350939 354611 357452 359226 360102 359909 357978 354283 349708 344695 338676 331358 323467 315598 307472
56536 307472 299034 291216 284763 279216 273834 268597 263555 258159 252121 246133 240900 236260 231954 228395
56522 228395 225788 223330 220188 216590 213166 209945 206832 204280 202611 201334 199966 198795 198054 197124 195584
56507 195584 194314 194427 195596 196463 196355 195693 195062 194707 194684 194752 194372 193388 192379 191863 191617 191246 190866 190732
56489 190732 190768 190975 191720 193071 194532 195945 197979 201097 204744 208072 210825 212999 214451 215438 216738
56474 216738 218585 220301 221506 222822 224745 226839 228750 230981 233846 236719 239202 241987 245546 248997
$$ packed form
56579A94028J890K682L327L646M092M564M377L560L012L203L676L957M119M396
56565B44529M963N960P174P975Q134Q155Q296Q048P306P035P746Q284P389N612
56551C46606M333L672K841J774Q76j93j931l695m575n013o019p318p891p869q126
56536C07472q438p818o453n547n382n237n042n396o038n988n233m640m306l559
56522B28395k607k458l142l598l424l221l113k552j669j277j368j171p41r30j540
56507A95584j270J13J169Q67j08o62o31l55k3O8l80r84j009n16k46l71l80j34
56489A90732L6K07P45J351J461J413K034L118L647L328K753K174J452R87J300
56474B16738J847J716J205J316J923K094J911K231K865K873K483K785L559L451
$$ plain form
56460 248997 251489 253749 256919 260537 263032 263710 263100 261866 260504 259584 259110 258080 255748 252911 250924
56445 250924 249899 248959 247823 247013 246815 247015 247503 248251 248954 249386 249734 249948 249295 247320 244677 242309 240412
56428 240412 238845 237762 236954 235438 232720 229785 227839 226723 225538 224107 222735 221159 218894 216132
56414 216132 213390 210850 208851 208145 208671 208955 207897 206325 205585 205495 205096 204603 204969 206092 207047 207774 209046
56397 209046 211015 213071 214923 216599 217666 217670 217157 217149 217868 218893 220182 221884 223596 224818 225715 226553 227052
56380 227052 227240 228163 230564 233601 236087 238255 240941 243841 246047 247652 249310 250838 251757 252643 254367
56365 254367 256502 258081 259412 261544 264367 266839 268715 270444 271787 272218 272412 273612 275713 277540 278832
56350 278832 280363 282295 283960 285185 286387 287532 288444 289868 292783 296839 300873 304662 308750 312932
$$ packed form
56460B48997K492K260L170L618K495O78o10j234j362r20m74j030k332k837j987
56445B50924j025r40j136q10j98K00M88P48P03M32L48K14o53j975k643k368j897
56428B40412j567j083q08j516k718k935j946j116j185j431j372j576k265k762
56414B16132k742k540j999p06N26K84j058j572p40r0l99m93L66J123R55P27J272
56397B09046J969K056J852J676J067Mn13qP19J025J289J702J712J222Q97Q38M99
56380B27052J88R23K401L037K486K168K686K900K206J605J658J528R19Q86J724
56365B54367K135J579J331K132K823K472J876J729J343M31J94J200K101J827J292
56350B78832J531J932J665J225J202J145R12J424K915M056M034L789M088M182
$$ plain form
56336 312932 316450 319452 322748 326390 329961 333795 338455 343481 348220 353279 359426 365633 370217 373496
56322 373496 377305 382218 387253 392015 396964 401704 405187 407620 410067 412223 412716 411701 410917 410957 410693
56307 410693 409775 409513 410691 412409 413713 414646 415212 415041 414575 414984 416403 417832 419110 421294 424707 428282
56291 428282 431418 435002 440109 446989 455574 465635 476221 486385 496711 508786 523065 538592
56279 538592 554711 571574 589140 607322 627090 649797 675483 703405 733926 768123 805949
56268 805949 846832 891835 943001 1000694 1063806 1132534 1208617 1292793 1384466 1484049 1593087
56257 1593087 1711558 1837353 1968819 2105497 2245831 2386520 2524758 2658863 2786071
56248 2786071 2902053 3003509 3089317 3158540 3209557 3242101 3258267 3260672 3251208 3232003 3205591
$$ packed form
56336C12932L518L002L296L642L571L834M660N026M739N059O147O207M584L279
56322C73496L809M913N035M762M949M740L483K433K447K156M93j015p84M0k64
56307D10693r18k62J178J718J304R33N66j71m66M09J419J429J278K184L413L575
56291D28282L136L584N107O880Q585J0061J0586J0164J0326J2075J4279J5527
56279E38592J6119J6863J7566J8182J9768K2707K5686K7922L0521L4197L7826
56268H05949M0883M5003N1166N7693O3112O8728P6083Q4176R1673R9583J09038
56257A593087J18471J25795J31466J36678J40334J40689J38238J34105J27208
56248B786071J15982J01456Q5808O9223N1017L2544J6166K405r464j9205k6412
$$ plain form
56237 3205591 3173425 3135842 3093746 3048525 3000109 2947196 2889616 2828385 2763217 2692313 2614903
56226 2614903 2531775 2443175 2348720 2249692 2148807 2047260 1944548 1841565 1741044 1644374
56216 1644374 1550760 1460274 1374981 1296241 1223603 1157037 1097419 1043974 994151 947019 904015
56205 904015 865520 829783 796332 767227 743568 723726 706482 692883 683303 675571 667846 660767
56193 660767 655031 649406 642984 636963 632458 628799 625546 623846 624230 625426 626839 629818 634954 640597
56179 640597 645593 651063 657996 665528 673074 681583 691185 700164 707824 715724 724568 732585 738612 744016
56165 744016 749875 755088 759008 763175 768642 774364 780006 787432 797588 808910 820771 835384 854177
56152 854177 875340 897287 921548 949911 981753 1016780 1057535 1106507 1163472 1228382 1304359
$$ packed form
56237C205591l2166l7583m2096m5221m8416n2913n7580o1231o5168p0904p7410
56226B614903q3128q8600r4455r9028j00885j01547j02712j02983j00521r6670
56216A644374r3614r0486q5293p8740p2638o6566n9618n3445m9823m7132m3004
56205I04015l8495l5737l3451k9105k3659j9842j7244j3599r580p732p725p079
56193F60767n736n625o422o021m505l659l253j700L84J196J413K979N136N643
56179F40597M996N470O933P532P546Q509R602Q979P660P900Q844Q017O027N404
56165G44016N859N213L920M167N467N722N642P426J0156J1322J1861J4613J8793
56152H54177K1163K1947K4261K8363L1842L5027M0755M8972N6965O4910P5977
$$ plain form
56141 1304359 1395312 1503051 1629092 1776456 1946704 2136931 2341261 2552307 2759325 2948924
56131 2948924 3111565 3246056 3356478 3448095 3527922 3604084 3679592 3748598 3801803 3833565 3842128
56120 3842128 3827459 3793096 3747210 3697302 3644648 3585503 3514432 3424032 3305842 3156614 2982331
56109 2982331 2793479 2599044 2407315 2227860 2067638 1927213 1804273 1698313 1608672 1531398
56099 1531398 1462362 1401069 1347890 1300388 1256205 1216678 1183645 1155284 1128868 1104911 1084842
56088 1084842 1067490 1051665 1039242 1031714 1026634 1021378 1017350 1016510 1017123 1017204 1018725 1023870 1030362 1035196
56074 1035196 1039798 1046711 1054459 1060641 1066990 1076180 1086592 1095352 1103678 1114188 1125845 1136629 1148216
56061 1148216 1162864 1178778 1193665 1209583 1228932 1249075 1266581 1283444 1303278 1324687 1344420
$$ packed form
56141A304359R0953J07739J26041J47364J70248J90227K04330K11046K07018J89599
56131B948924J62641J34491J10422R1617P9827P6162P5508O9006N3205L1762Q563
56120C842128j4669l4363m5886m9908n2654n9145p1071r0400j18190j49228j74283
56109B982331j88852j94435j91729j79455j60222j40425j22940j05960q9641p7274
56099A531398o9036o1293n3179m7502m4183l9527l3033k8361k6416k3957k0069
56088A084842j7352j5825j2423p528n080n256m028q40O13Q1J521N145O492M834
56074A035196M602O913P748O182O349R190J0412Q760Q326J0510J1657J0784J1587
56061A148216J4648J5914J4887J5918J9349K0143J7506J6863J9834K1409J9733
$$ plain form
56050 1344420 1363809 1385884 1409247 1431044 1452951 1478006 1504641 1530056 1556210 1586082 1617462
56039 1617462 1647017 1676933 1710734 1746149 1779202 1811713 1847452 1884601 1919612 1954869 1994739
56028 1994739 2037613 2079801 2123511 2172780 2225366 2277180 2330822 2390774 2454025 2514792 2574772
56017 2574772 2639163 2706311 2771364 2836615 2907911 2984106 3060321 3138291 3223015 3312689 3402741
56006 3402741 3496252 3599245 3709326 3820488 3935495 4061595 4197778 4338444 4485733 4645427
55996 4645427 4814662 4987038 5165899 5358883 5563646 5773276 5991267 6225946 6474823
55987 6474823 6730694 6998733 7290622 7606209 7938550 8292402 8679204 9098510 9543967
55978 9543967 10022916 10549611 11124273 11740587 12408518 13146529 13957440 14837403 15803010
$$ packed form
56050A344420J9389K2075K3363K1797K1907K5055K6635K5415K6154K9872L1380
56039A617462K9555K9916L3801L5415L3053L2511L5739L7149L5011L5257L9870
56028A994739M2874M2188M3710M9269N2586N1814N3642N9952O3251O0767N9980
56017B574772O4391O7148O5053O5251P1296P6195P6215P7970Q4724Q9674R0052
56006C402741R3511J02993J10081J11162J15007J26100J36183J40666J47289J59694
55996D645427J69235J72376J78861J92984K04763K09630K17991K34679K48877
55987F474823K55871K68039K91889L15587L32341L53852L86802M19306M45457
55978I543967M78949N26695N74662O16314O67931P38011Q10911Q79963R65607
$$ plain form
55969 15803010 16882595 18087253 19420255 20909287 22598352 24515701 26685958 29168786
55961 29168786 32050398 35408694 39333259 43974193 49525349 56170039 64098342 73570730
55953 73570730 84915360 98500154 114803366 134501967 158409737 187377743 222316272
55946 222316272 263909053 311345248 360541882 403787810 432202151 439787912 426074510
55939 426074510 395573241 355048435 310865401 267664702 228172111 193549150 163943198
55932 163943198 139013512 118237983 101014818 86732943 74864286 64988915 56747761
55925 56747761 49824677 43975942 39026164 34821386 31215978 28102059 25410846 23077003
55917 23077003 21030287 19222475 17630047 16225151 14970044 13841748 12835004 11936981
$$ packed form
55969A5803010J079585J204658J333002J489032J689065J917349K170257K482828
55961B9168786K881612L358296L924565M640934N551156O644690P928303R472388
55953G3570730J1344630J3584794J6303212J9698601K3907770K8968006L4938529
55946B22316272M1592781M7436195M9196634M3245928K8414341P585761j3713402
55939D26074510l0501269m0524806m4183034m3200699l9492591l4622961k9605952
55932A63943198k4929686k0775529j7223165j4281875j1868657r875371q241154
55925E6747761o923084n848735m949778m204778l605408l113919k691213k333843
55917B3077003k046716j807812j592428j404896j255107j128296j006744q98023
$$ plain form
55909 11936981 11122875 10379027 9707084 9101950 8546998 8033948 7566960 7143820 6752117
55900 6752117 6386738 6052851 5748725 5463007 5191752 4941522 4712988 4497403 4291852
55891 4291852 4102529 3930155 3766816 3609973 3465553 3334498 3209729 3088902 2977180
55882 2977180 2874986 2775683 2677759 2587061 2504694 2424670 2345689 2273360 2208450 2144593 2080099
55871 2080099 2020789 1968508 1917705 1866018 1817679 1773806 1729726 1684681 1644234 1610196 1577771
55860 1577771 1545445 1518341 1499005 1483893 1471588 1465347 1464480 1461699 1452086 1436907 1416508 1387936
55848 1387936 1352258 1316017 1282493 1248898 1214372 1182879 1155779 1129301 1101950 1076916 1054730
55837 1054730 1031074 1004483 978901 956127 933073 909044 888245 872155 856612 839488 824271
$$ packed form
55909A1936981q14106p43848o71943o05134n54952n13050m66988m23140l91703
55900F752117l65379l33887l04126k85718k71255k50230k28534k15585k05551
55891D291852j89323j72374j63339j56843j44420j31055j24769j20827j11722
55882B977180j02194r9303r7924r0698q2367q0024p8981p2329o4910o3857o4494
55871B080099n9310n2281n0803n1687m8339m3873m4080m5045m0447l4038l2425
55860A577771l2326k7104j9336j5112j2305o241q67k781r613j5179k0399k8572
55848A387936l5678l6241l3524l3595l4526l1493k7100k6478k7351k5034k2186
55837A054730k3656k6591k5582k2774k3054k4029k0799j6090j5543j7124j5217
$$ plain form
55826 824271 813009 802485 790606 779967 771739 762377 749821 737100 726640 716697 706403 698588
55814 698588 694445 690984 686676 684279 685231 686695 686992 688447 691910 693847 691980 688713 686019 682010 675555
55799 675555 669263 664754 659650 652183 644134 636445 626681 613763 600622 589263 577735 564798 552977
55786 552977 544031 535888 527077 519862 516011 513712 511541 511117 512661 512083 505792 494773 481212 465121
55772 465121 447196 430871 418114 406675 394456 383072 374227 366291 357584 349619 344039 339542 334729
55759 334729 330779 328567 326373 323153 320792 320359 319455 316046 311661 307918 303101 295133 284915 273913
55745 273913 261455 247381 234448 225075 218223 212055 207017 203794 201133 198347 197185 198639 200609
55732 200609 201311 202090 204256 206075 205731 204484 203975 203029 200051 196161 193078 190191 186411 182671 179985
$$ packed form
55826H24271j1262j0524j1879j0639q228r362j2556j2721j0460r943j0294p815
55814F98588m143l461m308k397R52J464K97J455L463J937j867l267k694m009o455
55799F75555o292m509n104p467q049p689r764j2918j3141j1359j1528j2937j1821
55786E52977q946q143q811p215l851k299k171m24J544n78o291j1019j3561j6091
55772D65121j7925j6325j2757j1439j2219j1384q845p936q707p965n580m497m813
55759C34729l950k212k194l220k361m33r04l409m385l743m817p968j0218j1002
55745B73913j2458j4074j2933r373o852o168n038l223k661k786j162J454J970
55732B00609P02P79K166J819l44j247n09r46k978l890l083k887l780l740k686
$$ plain form
55717 179985 177293 173776 170975 170188 170091 169340 169038 170211 171434 171588 172410 175590 179790 183292 187103 192588
55701 192588 198396 202678 206213 210390 214183 216081 217052 218753 220596 221292 221429 221868 221491 219317 217022
55686 217022 216698 217827 218921 220229 222245 223537 222890 221865 222499 224245 225792 227955 231891 236258 239079
55671 239079 240858 243011 244896 245328 245530 247512 250827 253708 256175 259217 262249 264235 266151 269477 273319
55656 273319 275748 276894 277944 278108 275526 270437 264795 259321 253307 246681 239947 232788 224871 217214
55642 217214 210675 204110 196167 187871 181135 175750 170215 164594 160155 156902 153782 150683 148082 145382
55628 145382 141666 137434 133737 130373 126755 123553 121588 120154 118367 117047 117179 117583 116353 113700 111268
55613 111268 109504 107796 106322 105645 105241 104407 103803 104215 104712 103937 102299 101058 100209 99133 98245 98068 97791
$$ packed form
55717A79985k692l517k801p87r7p51l02J173J223J54Q22L180M200L502L811N485
55701A92588N808M282L535M177L793J898R71J701J843O96J37M39l77k174k295
55686B17022l24J129J094J308K016J292o47j025O34J746J547K163L936M367K821
55671B39079J779K153J885M32K02J982L315K881K467L042L032J986J916L326L842
55656B73319K429J146J050J64k582n089n642n474o014o626o734p159p917p657
55642B17214o539o565p943q296o736n385n535n621m439l253l120l099k601k700
55628A45382l716m232l697l364l618l202j965j434j787j320J32M04j230k653k432
55613A11268j764j708j474o77m04q34o04M12M97p75j638j241q49j076q88j77k77
$$ plain form
55596 97791 96634 95541 95567 95856 95191 94163 93692 92837 90495 87929 87034 87223 86603 85199 84406 84228 83720
55579 83720 83320 84071 85210 85129 84104 83622 83718 83514 83717 85853 89457 92582 94761 97100 99858 102358 104847
55562 104847 107965 110770 111651 110923 110180 109490 107609 104619 101861 99445 96251 92292 88833 86308 84244
55547 84244 82954 83072 83728 83535 83155 84528 87689 90783 93222 96390 100993 106015 110599 114940 118963
55532 118963 122042 124360 126923 130029 133143 136072 138721 140012 138820 135780 132594 129869 127229 124876
55518 124876 123176 121289 118186 114502 111458 108617 104761 100305 96563 93292 89342 85188 82279 80347
55504 80347 77888 74955 72842 71332 68972 65924 63745 62431 60524 58216 57370 58091 58174 56584 54775
55489 54775 53863 53073 51880 51250 51724 52312 52189 51677 50930 49524 47891 47261 47646 47665 46811 46024 45695 45148
$$ packed form
55596I7791j157j093K6K89o65j028m71q55k342k566q95J89o20j404p93j78n08
55579H3720m00P51J139q1j025m82R6k04K03K136L604L125K179K339K758K500K489
55562A04847L118K805Q81p28p43o90j881k990k758k416l194l959l459k525k064
55547H4244j290J18O56j93l80J373L161L094K439L168M603N022M584M341M023
55532A18963L079K318K563L106L114K929K649J291j192l040l186k725k640k353
55518A24876j700j887l103l684l044k841l856m456l742l271l950m154k909j932
55504H0347k459k933k113j510k360l048k179j314j907k308q46P21Q3j590j809
55489E4775r12p90j193o30M74N88j23n12p47j406j633o30L85J9q54p87l29n47
$$ plain form
55471 45148 44462 44689 45762 46255 45791 45663 46515 47462 48037 48942 50217 50692 50072 49641 50188 50992 51448 51845
55453 51845 52012 51128 49532 48752 49085 49070 47994 46968 46819 46952 47081 47954 49436 49879 48513 46688 45695
55436 45695 45118 44386 44130 44809 45525 45411 44866 44451 43987 43626 44371 46502 48820 50397 51813 53830 56070
55419 56070 57814 58916 59311 58870 58227 58401 59090 58894 57635 56834 57356 58374 59242 60507 62280 63458 63539
55402 63539 63429 63550 62999 61577 60730 61232 61692 60784 59287 58473 57966 56787 55209 54043 53167 52179 51519
55385 51519 51598 51721 51104 50101 49361 48667 47637 46635 45943 44964 43198 41168 39538 38296 37615 38400 40953
55368 40953 44080 46423 47798 48436 48125 46997 46034 45765 45466 44591 43885 44026 44230 43335 41408 39269 37298
55351 37298 35659 34821 34846 34915 34437 33854 33678 33652 33602 34016 34942 35406 34824 33907 33245 32133 29918 27478 26197
$$ packed form
55471D5148o86K27J073M93m64j28Q52R47N75R05J275M75o20m31N47Q04M56L97
55453E1845J67q84j596p80L33j5j076j026j49J33J29Q73J482M43j366j825r93
55436D5695n77p32k56O79P16j14n45m15m64l61P45K131K318J577J416K017K240
55419E6070J744J102L95m41o43J74O89j96j259q01N22J018Q68J265J773J178Q1
55402F3539j10J21n51j422q47N02M60r08j497q14n07j179j578j166q76r88o60
55385E1519P9J23o17j003p40o94j030j002o92r79j766k030j630j242o81P85K553
55368D0953L127K343J375O38l11j128r63k69k99q75p06J41K04q95j927k139j971
55351C7298j639q38K5O9m78n83j76k6n0M14R26M64n82r17o62j112k215k440j281
$$ plain form
55332 26197 26272 27043 28130 29257 29844 29856 30237 31474 32515 32208 31065 30536 31085 32016 32700 33080 33381 33972
55314 33972 34991 35701 34974 32976 31437 31680 33249 34991 36324 36862 36106 34442 33339 33523 34010 33869
55298 33869 33753 34549 35590 35631 34788 34141 33992 33784 33371 33244 33686 34471 35189 35395 34876 34104 33802 33818 33370
55279 33370 32665 32991 34655 36157 36215 35363 34668 34131 33435 33104 33646 34463 34764 34754 34947 35197 35386 36113 37608
55260 37608 38884 39056 38620 38356 37929 36797 35627 35478 36147 36554 36253 35612 35007 34706 34883 35024 34138 32324
55242 32324 31180 31741 33072 33903 34536 35895 37698 38959 39490 39619 39172 38047 37066 36999 37316 37073 36409
55225 36409 36021 35883 35671 35757 36572 37603 38135 38374 38762 39005 38879 39124 40224 41133 40602 39127 38152 38023
55207 38023 38094 38232 38743 39311 39423 39416 39800 40085 39625 39086 39628 41051 42163 42626 43035 43484 43434 42807 42026 41178
$$ packed form
55332B6197P5P71J087J127N87J2L81J237J041l07j143n29N49R31O84L80L01N91
55314C3972J019P10p27j998j539K43J569J742J333N38p56j664j103J84M87j41
55298C3869j16P96J041M1q43o47j49k08m13j27M42P85P18K06n19p72l02J6m48
55279C3370p05L26J664J502N8q52o95n37o96l31N42Q17L01j0J93K50J89P27J495
55260C7608J276J72m36k64m27j132j170j49O69M07l01o41o05l01J77J41q86j814
55242C2324j144N61J331Q31O33J359J803J261N31J29m47j125r81o7L17k43o64
55225C6409l88j38k12Q6Q15J031N32K39L88K43j26K45J100R09n31j475r75j29
55207C8023P1J38N11N68J12pL84K85m60n39N42J423J112M63M09M49n0o27p81q48
$$ plain form
55187 41178 40221 39678 39993 40595 40689 40526 40759 41102 40883 40392 40389 40707 40704 40640 41221 42150 42512 42278 42079 41777 40639
55166 40639 38725 36866 35489 34577 34369 34824 34859 33516 31543 30485 30582 30951 31371 32275 33313 33658 33593 34141
55148 34141 35138 35331 34457 33643 33532 33491 32991 32368 31930 31598 31745 33191 35913 38757 40719 41701 41949 41735
55130 41735 41677 42456 44059 46027 48316 51041 53622 55227 55906 56273 56300 55505 54098 52803 51723 50516
55114 50516 49448 49053 48985 48501 47941 48366 49777 51019 51468 51486 51245 50444 49348 48863 49327 50246 51250 52256
55096 52256 52782 52338 51465 51198 51583 51874 52019 52598 53429 53697 53439 53417 53540 53013 52115 52165 53441 54802 55687
55077 55687 56861 58626 59957 60207 60228 60913 61814 62059 61637 60980 60143 59107 58163 57465 56876 56557 56935 57829
55059 57829 58517 58924 59696 60815 61243 60425 59127 58233 57684 57120 56700 56654 56844 57303 58519 60601 62751 64056
$$ packed form
55187D1178r57n43L15O02R4j63K33L43k19m91lL18lo4N81R29L62k34j99l02j138
55166D0639j914j859j377r12k08M55L5j343j973j058R7L69M20R04J038L45o5N48
55148C4141R97J93q74q14j11m1n00o23m38l32J47J446K722K844J962R82K48k14
55130D1735n8P79J603J968K289K725K581J605O79L67K7p95j407j295j080j207
55114E0516j068l95o8m84n60M25J411J242M49J8k41q01j096m85M64R19J004J006
55096E2256N26m44q73k67L85K91J45N79Q31K68k58k2J23n27q98N0J276J361Q85
55077E5687J174J765J331K50K1O85R01K45m22o57q37j036r44o98n89l19L78Q94
55059E7829O88M07P72J119M28q18j298q94n49n64m20m6J90M59J216K082K150J305
$$ plain form
55041 64056 64347 64015 63462 62950 62503 61854 60865 59865 59091 58190 57062 56750 58259 60818 62575 62989 63221
55024 63221 64145 65361 66370 67352 68375 69017 69207 69427 69778 69804 69451 69175 69032 68727 68573 69059 69416 68103
55006 68103 65070 62082 60451 59838 59671 60142 61136 61652 61131 60185 59305 58140 56754 56254 57191 58505 59063
54989 59063 59249 60071 61558 63000 64019 64542 64361 63513 62572 62029 61949 62573 64378 67172 70064 72715 75624
54972 75624 78747 81119 82494 84169 87330 91577 95925 100260 104935 109886 115139 121428 129343 138546
54958 138546 148612 159965 173132 187745 203035 218688 234479 249591 262932 273559 280338 281986
54946 281986 278090 269459 257063 241547 224194 207194 192034 178486 165893 154454 144479 135431
54934 135431 126826 119197 113125 108106 103473 99751 97885 97628 97785 97669 97396 97172 97215 98072 100111 103007
$$ packed form
55041F4056K91l32n53n12m47o49r89j000p74r01j128l12J509K559J757M14K32
55024F3221R24J216J009R82J023O42J90K20L51K6l53k76j43l05j54M86L57j313
55006F8103l033k988j631o13j67M71R94N16n21r46q80j165j386n00R37J314N58
54989E9063J86Q22J487J442J019N23j81q48r41n43q0O24J805K794K892K651K909
54972G5624L123K372J375J675L161M247M348M335M675M951N253O289P915R203
54958A38546J0066J1353J3167J4613J5290J5653J5791J5112J3341J0627O779J648
54946B81986l896q631j2396j5516j7353j7000j5160j3548j2593j1439r975r048
54934A35431q605p629o072n019m633l722j866k57J57j16k73k24M3Q57K039K896
$$ plain form
54918 103007 106385 110555 115995 122654 130564 140534 153293 168338 184377 200548 216433 231222 243678
54905 243678 252681 257317 256854 251299 241597 228810 213565 196712 179853 164463 150956 139107 128791
54892 128791 119810 111704 104402 98432 93934 90274 87215 85515 85523 86073 85790 84657 83296 81559 79109
54877 79109 76710 75559 75616 75725 75135 73945 72475 71192 70824 71399 71524 69805 66765 64245 63156 62911
54861 62911 62854 62947 63034 62650 61843 61278 61236 61257 60921 60315 59650 59023 58584 58347 57907 56979 56096 56074 56788 57171 56527
54840 56527 55198 53910 53045 52676 52843 53569 54852 56605 58473 59895 60680 61202 61784 62278 62642 63422 65047
54823 65047 66978 68174 68234 67645 67182 67508 69006 71431 74006 76272 78509 80981 83317 85271 87516 90963
54807 90963 95668 101164 107500 115183 124370 134900 146914 160748 176287 193023 210474 227921 243905
$$ packed form
54918A03007L378M170N440O659P910R970J2759J5045J6039J6171J5885J4789J2456
54905B43678R003M636m63n555r702j2787j5245j6853j6859j5390j3507j1849j0316
54892A28791q981q106p302n970m498l660l059j700QN50k83j133j361j737k450
54877G9109k399j151N7J09n90j190j470j283l68N75J25j719l040k520j089k45
54861F2911n7R3Q7l84q07n65m2K1l36o06o65o27m39k37m40r28q83k2P14L83o44
54840E6527j329j288q65l69J67P26J283J753J868J422P85N22N82M94L64P80J625
54823F5047J931J196O0n89m63L26J498K425K575K266K237K472K336J954K245L447
54807I0963M705N496O336P683R187J0530J2014J3834J5539J6736J7451J7447J5984
$$ plain form
54794 243905 256665 265035 268600 267287 261344 251545 238952 224689 210124 196706 185067 174710
54782 174710 165051 156218 148448 141407 134838 129237 125082 121946 119163 116851 115474 114917 114886 115642 117433
54767 117433 119695 121841 124467 128717 134748 141816 149498 157887 166977 176978 188958 203937 221349
54754 221349 239333 256382 271757 284601 293849 298998 299990 296440 288067 275854 261648 246593 230926
54741 230926 215152 200166 186113 172423 159198 147422 137458 128510 120032 112646 107100 103195 100299
54728 100299 98144 96592 95200 93628 91987 90427 88806 87051 85359 83827 82368 81162 80565 80399 79937
54713 79937 78920 77993 77792 78131 78464 78638 78818 79077 79459 80127 81098 82048 82637 82891 83052 83245 83438 83599 83764
54694 83764 83973 84101 83788 82754 81397 80701 81210 82378 83289 83764 84279 85039 85723 86048 86088 86050 86200 86941 88579
$$ packed form
54794B43905J2760Q370L565j313n943r799j2593j4263j4565j3418j1639j0357
54782A74710r659q833p770p041o569n601m155l136k783k312j377n57l1P56J791
54767A17433K262K146K626M250O031P068P682Q389R090J0001J1980J4979J7412
54754B21349J7984J7049J5375J2844R248N149R92l550q373j2213j4206j5055j5667
54741B30926j5774j4986j4053j3690j3225j1776r964q948q478p386n546l905k896
54728A00299k155j552j392j572j641j560j621j755j692j532j459j206n97j66m62
54713G9937j017r27k01L39L33J74J80K59L82O68R71R50N89K54J61J93J93J61J65
54694H3764K09J28l13j034j357o96N09J168R11M75N15P60O84L25M0l8J50P41J638
$$ plain form
54675 88579 91003 93745 96190 97605 97526 96517 96087 97264 99678 102491 105630 109348 113178 116388 119168
54660 119168 122338 125966 129227 131563 133100 133978 134209 134331 135288 137403 140037 142450 144480 146403 148697
54645 148697 151906 156139 160821 165497 170690 177186 184617 191583 197078 200925 202865 202291 199160 194289
54631 194289 188437 181744 174266 166351 158277 150148 142350 135459 129487 123819 118160 113053 109225 106943
54617 106943 106091 106342 107048 107542 107772 108304 109507 111061 112327 112902 112856 112741 113188 114161 114797 114411 113314 112218
54599 112218 111207 109955 108489 106917 104789 101664 98092 95089 92848 90905 89363 88754 88731 88137 86615
54584 86615 85074 84208 83586 82574 81315 80297 79643 79200 78846 78440 77954 77724 78008 78354 78061 77200 76464 76046
54566 76046 75530 74823 74259 73744 72786 71474 70452 69793 68947 68050 68158 69724 71833 73450 74619 75903 77345
$$ packed form
54675H8579K424K742K445J415p9j009m30J177K414K813L139L718L830L210K780
54660A19168L170L628L261K336J537Q78K31J22R57K115K634K413K030J923K294
54645A48697L209M233M682M676N193O496P431O966N495L847J940n74l131m871
54631A94289n852o693p478p915q074q129p798o891n972n668n659n107l828k282
54617A06943q52K51P06M94K30N32J203J554J266N75m6j15M47R73O36l86j097j096
54599A12218j011j252j466j572k128l125l572l003k241j943j542o09k3n94j522
54584H6615j541q66o22j012j259j018o54m43l54m06m86k30K84L46k93q61p36m18
54566G6046n16p07n64n15r58j312j022o59q46q97J08J566K109J617J169J284J442
$$ plain form
54549 77345 78549 79243 79352 79029 78802 79219 80185 81246 82452 84221 86363 88144 89440 90937 93053 95548
54533 95548 98277 101355 104464 107042 109346 112207 115501 118047 119278 119710 119386 117344 113356 108921 105540
54518 105540 103045 100509 97801 95267 92756 90098 87911 86941 86972 87184 87093 86559 85466 84132 83428 83804
54502 83804 84655 85234 85594 86040 86354 86273 86124 86238 86272 85819 85193 84937 85051 85326 85898 86839 87749 88322 88764 89109
54482 89109 88841 87857 87080 87331 88251 89105 89858 90601 90743 89937 89171 89689 91193 92320 92601 92737 93143 93520
54464 93520 93862 94655 95792 96321 95711 94586 93835 93585 93374 92855 92001 90946 89876 88883 87876 86807 85901
54447 85901 85406 85195 84913 84468 84089 83947 83997 84137 84319 84512 84671 84655 84228 83345 82430 82011 82050 82042 81787 81621 81788
54426 81788 82148 82594 83189 83728 83833 83647 83785 84362 84836 85111 85897 87516 89167 90029 90392 91037 92144 93470
$$ packed form
54549G7345J204O94J09l23k27M17R66J061J206J769K142J781J296J497K116K495
54533I5548K729L078L109K578K304K861L294K546J231M32l24k042l988m435l381
54518A05540k495k536k708k534k511k658k187r70L1K12r1n34j093j334p04L76
54502H3804Q51N79L60M46L14q1j49J14L4m53o26k56J14K75N72R41R10N73M42L45
54482H9109k68r84p77K51R20Q54P53P43J42q06p66N18J504J127K81J36M06L77
54464I3520L42P93J137N29o10j125p51k50k11n19q54j055j070r93j007j069r06
54447H5901m95k11k82m45l79j42N0J40J82J93J59j6m27q83r15m19L9qk55j66J67
54426H1788L60M46N95N39J05j86J38N77M74K75P86J619J651Q62L63O45J107J326
$$ plain form
54408 93470 95000 96720 98310 99775 101807 104760 107776 109800 111030 112605 115129 118277 121596 124985
54394 124985 128516 132291 136306 140014 142434 143162 142897 142554 142306 141871 141069 139569 136823 133001 129324 126706
54378 126706 124670 122342 119781 117435 115032 112146 109288 107200 105571 103670 101901 101308 101745 101942 101404
54363 101404 100866 100686 100168 98924 97743 97499 98017 98601 99009 99402 99847 100333 100927 101609 102253 102938 104014 105805
54345 105805 108524 112328 116989 121598 125188 127723 130026 132786 136011 139276 141894 142991 142150 140019
54331 140019 137699 135495 132872 129628 126352 123495 120695 117374 113571 109793 106386 103397 100901 99176
54317 99176 98437 98409 98201 96894 94391 91458 88822 86610 84745 83304 82085 80485 78410 76737 76202 76254
54301 76254 75846 74920 74227 74000 73778 73372 72998 72475 71319 69755 68668 68284 67765 66463 64840 63743 63394
$$ packed form
54408I3470J530J720J590J465K032K953L016K024J230J575K524L148L319L389
54394A24985L531L775M015L708K420P28k65l43k48m35q02j500k746l822l677k618
54378A26706k036k328k561k346k403k886k858k088j629j901j769n93M37J97n38
54363A01404n38j80n18j244j181k44N18N84M08L93M45M86N94O82O44O85J076J791
54345A05805K719L804M661M609L590K535K303K760L225L265K618J097q41k131
54331A40019k320k204k623l244l276k857k800l321l803l778l407k989k496j725
54317I9176p39k8k08j307k503k933k636k212j865j441j219j600k075j673n35N2
54301G6254m08r26o93k27k22m06l74n23j156j564j087l84n19j302j623j097l49
$$ plain form
54284 63394 63523 63995 64793 65687 66341 66618 66601 66426 66220 66091 66135 66470 67123 67763 67835 67171 66225 65470 65017 65097
54264 65097 66321 68766 71246 72335 71940 71166 70835 70889 71077 71356 71546 71430 71285 71691 72659 73600 74244 74967
54246 74967 76047 77164 77876 78116 78050 77840 77645 77470 77000 75934 74498 73244 72418 71880 71556 71434 71235 70597
54228 70597 69563 68473 67496 66759 66685 67564 68922 69988 70759 71880 73494 74886 75457 75412 75325 75517 76010 76659
54210 76659 77160 77245 76936 76411 75723 74876 73892 72595 70765 68878 68065 68713 69697 69861 69623 70096 71137 71577
54192 71577 71169 70890 71232 71541 71327 71016 71003 70983 70657 70216 69709 68790 67518 66621 66551 67015 67672 68485 69103 68894
54172 68894 68085 67979 69400 71594 73194 73635 73200 72377 71755 71853 72426 72514 71713 70865 70903 71622 72219 72557 73193
54153 73193 74475 76176 77751 78548 78122 76842 75804 75683 75995 75933 75466 75081 74820 74320 73628 73269 73443 73663
$$ packed form
54284F3394J29M72P98Q94O54K77j7j75k06j29M4L35O53O40P2o64r46p55m53Q0
54264F5097J224K445K480J089l95p74l31N4J88K79J90j16j45M06R68R41O44P23
54246G4967J080J117P12K40o6k10j95j75m70j066j436j254q26n38l24j22j99o38
54228G0597j034j090r77p37p4Q79J358J066P71J121J614J392N71m5q7J92M93O49
54210G6659N01Q5l09n25o88q47r84j297j830j887q13O48R84J64k38M73J041M40
54192G1577m08k79L42L09k14l11j3k0l26m41n07r19j272q97p0M64O57Q13O18k09
54172F8894q09j06J421K194J600M41m35q23o22R8N73Q8q01q48L8P19N97L38O36
54153G3193J282J701J575P97m26j280j038j21L12o2m67l85k61n00o92l59J74K20
$$ plain form
54135 73663 73351 72413 71159 69866 68632 67530 66717 66328 66376 66912 68177 70183 72048 72370 70700 68233
54119 68233 66472 65633 64999 64386 64257 64618 64911 65074 65678 66816 67774 68086 68053 67957 67602 66973 66521 66434 66339 66079
54099 66079 65973 66012 65628 64700 63926 63752 63788 63786 64275 65536 66826 67405 67615 68060 68462 68326 68176 68943 70411
54080 70411 71315 70971 69972 69205 68910 68788 68515 68048 67722 68015 68917 69759 69987 69827 69841 70106 70337 70598 71352
54061 71352 72873 74970 77206 79131 80472 81342 82114 82923 83601 84186 85034 86179 87144 87729 88416 89545 90684
54044 90684 91485 92597 94884 98008 100647 102068 102791 103786 105728 109038 113854 119663 125505 130934 136451
54029 136451 142798 150080 157796 165485 172961 179968 186000 190801 194927 199386 204484 209384 213147 215916
54015 215916 218521 221148 223164 224220 224695 224788 223996 221980 219297 216674 213999 210640 206474 202075 197997
$$ packed form
54135G3663l12r38j254j293j234j102q13l89M8N36J265K006J865L22j670k467
54119F8233j761q39o34o13j29L61K93J63O04J138R58L12l3r6l55o29m52q7r5k60
54099F6079j06L9l84r28p74j74L6kM89J261J290N79K10M45M02j36j50P67J468
54080G0411R04l44r99p67k95j22k73m67l26K93R02Q42K28j60J4K65K31K61P54
54061G1352J521K097K236J925J341Q70P72Q09O78N85Q48J145R65N85O87J129J139
54044I0684Q01J112K287L124K639J421P23R95J942L310M816N809N842N429N517
54029A36451O347P282P716P689P476P007O032M801M126M459N098M900L763K769
54015B15916K605K627K016J056M75R3p92k016k683k623k675l359m166m399m078
$$ plain form
54000 197997 194322 190813 187180 183309 179408 175779 172339 168664 164652 160822 157767 155572 153935 152489
53986 152489 150895 149052 147316 146076 145021 143451 141428 139961 139655 139887 139777 139357 139275 139886 141216 143306
53970 143306 145968 148510 150301 151389 152237 153189 154478 156232 158049 159088 159065 158627 158270 157529 155938 154138
53954 154138 153181 153110 153158 153010 152960 152965 152464 151220 149669 148353 147625 147900 149606 152730 156769 161129 165313 168995
53936 168995 172403 176382 181489 187084 191831 195064 197149 198588 199356 199175 198010 196178 194296 193154 193328
53921 193328 194788 197048 199613 202233 204927 207988 211741 216135 220786 225513 230433 235460 240322 245323
53907 245323 251408 258896 266768 273805 279884 285462 290381 294153 296987 299499 301449 301794 300142 297351
53893 297351 294492 291905 289466 287098 284622 281521 277242 271688 265334 258921 252913 247109 240976 234530
$$ packed form
54000A97997l675l509l633l871l901l629l440l675m012l830l055k195j637j446
53986A52489j594j843j736j240j055j570k023j467l06K32j10m20q2O11J330K090
53970A43306K662K542J791J088Q48R52J289J754J817J039k3m38l57p41j591j800
53954A54138r57p1M8j48n0Nn01j244j551j316p28K75J706L124M039M360M184L682
53936A68995L408L979N107N595M747L233K085J439P68j81j165j832j882j142J74
53921A93328J460K260K565K620K694L061L753M394M651M727M920N027M862N001
53907B45323O085P488P872P037O079N578M919L772K834K512J950L45j652k791
53893B97351k859k587k439k368k476l101m279n554o354o413o008n804o133o446
$$ plain form
53879 234530 228507 223382 218639 213479 207868 202363 197180 192144 187314 183000 179217 175672 172254 169014
53865 169014 165760 162194 158392 154674 151056 147316 143490 139849 136508 133537 131255 129867 128884 127502
53851 127502 125571 123729 122587 122124 121838 121114 119604 117598 115856 114738 113837 112814 112063 111920 111776 110929
53835 110929 109945 110108 111543 112934 113235 112731 112202 111872 111573 111204 110625 109592 108204 107011 106506 106786 107763
53818 107763 109210 110571 111295 111510 111812 112318 112542 112411 112678 113909 115623 117003 118117 119900 123007 127108
53802 127108 131297 134932 138066 141246 144999 149550 154850 160601 166243 171255 175675 180053 184650 189107
53788 189107 193149 197084 201101 204552 206700 207874 209060 210483 211493 211863 212310 213421 214751 215403 215043
53773 215043 213994 212646 211104 209218 206795 203877 200812 197873 194893 191534 187761 183821 179937 176416
$$ packed form
53879B34530o023n125m743n160n611n505n183n036m830m314l783l545l418l240
53865A69014l254l566l802l718l618l740l826l641l341k971k282j388r83j382
53851A27502j931j842j142m63k86p24j510k006j742j118r01j023p51j43j44q47
53835A10929r84J63J435J391L01n04n29l30k99l69n79j033j388j193n05K80R77
53818A07763J447J361P24K15L02N06K24j31K67J231J714J380J114J783L107M101
53802A27108M189L635L134L180L753M551N300N751N642N012M420M378M597M457
53788A89107M042L935M017L451K148J174J186J423J010L70M47J111J330O52l60
53773B15043j049j348j542j886k423k918l065k939k980l359l773l940l884l521
$$ plain form
53759 176416 173904 172967 173422 174382 174939 174570 173183 171353 170241 170641 172050 173256 173793 174304 175402 176698
53743 176698 177163 176130 173935 171780 170842 171166 171556 170840 168985 166687 164309 161844 159548 157838 156654
53728 156654 155552 154312 152924 151249 149304 147649 146747 146205 145391 144581 144553 145213 145626 145411 145191 145532 146355
53711 146355 147534 149216 151297 153293 154892 156063 156669 156759 157094 158413 160136 160912 160626 160833 162849 166504
53695 166504 171114 176547 182646 188586 193632 197920 201835 205180 207630 209513 211546 214094 217117 220422
53681 220422 223609 226248 228447 230776 233319 235354 236300 236508 236700 237112 237546 237781 237581 236753 235568 234715
53665 234715 234571 234861 235136 235091 234364 232755 230843 229690 229587 229764 229563 229104 228552 227641 226455 225860 226486 227918
53647 227918 229365 230453 230863 230021 227934 225732 224568 224370 224296 223951 223513 223148 222963 223154 223597 223724 223350
$$ packed form
53759A76416k512r37M55R60N57l69j387j830j112M00J409J206N37N11J098J296
53743A76698M65j033k195k155r38L24L90p16j855k298k378k465k296j710j184
53728A56654j102j240j388j675j945j655r02n42q14q10k8O60M13k15k20L41Q23
53711A46355J179J682K081J996J599J171O06R0L35J319J723P76k86K07K016L655
53695A66504M610N433O099N940N046M288L915L345K450J883K033K548L023L305
53681B20422L187K639K199K329K543K035R46K08J92M12M34K35k00q28j185q53
53665B34715j44K90K75m5p27j609j912j153j03J77k01m59n52r11j186n95O26J432
53647B27918J447J088M10q42k087k202j164j98p4l45m38l65j85J91M43J27l74
$$ plain form
53630 223350 223140 223593 224055 223537 222177 221191 221522 223029 224743 225516 224872 223709 223737 225685 228513 230877 232709
53613 232709 234682 236877 238971 241219 244142 247503 250632 253637 257248 261559 265882 269944 274283 279302
53599 279302 284740 290297 296044 301934 307536 312613 317486 322565 327863 333183 338376 343269 347691 351793
53585 351793 356128 361239 367249 373760 379944 384888 388193 390344 392312 394836 398130 401986 405885 409206
53571 409206 411739 413809 415678 417028 417476 417309 417278 417758 418550 419388 420174 420809 421218 421551 422033 422649 423235 423775
53553 423775 424221 424278 423750 423010 422691 422999 423657 424322 424648 424143 422665 420963 420119 420307 420641 420461 420192 420634
53535 420634 421845 423149 424062 424791 425843 427485 429686 432410 435727 439615 443805 447936 451829 455551 459319
53520 459319 463523 468660 474857 481579 488232 495115 503273 513232 524372 535870 547794 560857 575329
$$ packed form
53630B23350k10M53M62n18j360r86L31J507J714P73o44j163K8J948K828K364J832
53613B32709J973K195K094K248K923L361L129L005L611M311M323M062M339N019
53599B79302N438N557N747N890N602N077M873N079N298N320N193M893M422M102
53585C51793M335N111O010O511O184M944L305K151J968K524L294L856L899L321
53571D09206K533K070J869J350M48j67l1M80P92Q38P86O35M09L33M82O16N86N40
53553D23775M46N7n28p40l19L08O58O65L26n05j478j702q44J88L34j80k69M42
53535D20634J211J304R13P29J052J642K201K724L317L888M190M131L893L722L768
53520D59319M204N137O197O722O653O883Q158R959J1140J1498J1924J3063J4472
$$ plain form
53507 575329 590667 606099 621282 636499 652458 669775 688434 707870 727677 748050 769471
53496 769471 792258 816511 842130 868705 895745 923197 951344 980071 1008762 1037163 1065708
53485 1065708 1094606 1123221 1150988 1178455 1206690 1235954 1265657 1295401 1325294 1355287 1384979
53474 1384979 1414264 1443611 1473379 1503175 1532084 1559448 1585284 1610021 1633856 1656457 1677389
53463 1677389 1696750 1715023 1732246 1747802 1761225 1772850 1783382 1793219 1802453 1811197 1819511 1827227
53451 1827227 1834028 1839310 1841748 1839657 1832493 1821729 1809620 1797200 1783878 1768788 1751914 1733830
53439 1733830 1714809 1694450 1672129 1647738 1621922 1595493 1568747 1541595 1514153 1486649 1458893
53428 1458893 1430554 1402016 1374191 1347302 1320744 1294466 1269527 1246760 1225733 1205764 1187156
$$ packed form
53507E75329J5338J5432J5183J5217J5959J7317J8659J9436J9807K0373K1421
53496G69471K2787K4253K5619K6575K7040K7452K8147K8727K8691K8401K8545
53485A065708K8898K8615K7767K7467K8235K9264K9703K9744K9893K9993K9692
53474A384979K9285K9347K9768K9796K8909K7364K5836K4737K3835K2601K0932
53463A677389J9361J8273J7223J5556J3423J1625J0532R837R234Q744Q314P716
53451A827227O801N282K438k091p164j0764j2109j2420j3322j5090j6874j8084
53439A733830j9021k0359k2321k4391k5816k6429k6746k7152k7442k7504k7756
53428A458893k8339k8538k7825k6889k6558k6278k4939k2767k1027j9969j8608
$$ plain form
53417 1187156 1170543 1155704 1141985 1129480 1118882 1110487 1104152 1099907 1097787 1097304 1097904 1099807 1103752
53404 1103752 1110191 1119299 1131357 1146310 1163289 1181399 1200791 1222185 1245611 1270416 1296284 1323379
53392 1323379 1351745 1381391 1412834 1446642 1482532 1519718 1558062 1598107 1640117 1683943 1729765
53381 1729765 1778086 1828987 1882187 1937788 1996107 2056771 2118889 2182178 2247092 2313676 2381048
53370 2381048 2448173 2514480 2579672 2643684 2706927 2769850 2831999 2892018 2948516 3000415 3046762
53359 3046762 3087198 3122740 3155189 3185520 3213413 3238265 3259765 3277444 3290689 3299435 3304048 3304251
53347 3304251 3299084 3288237 3272577 3252800 3228138 3196839 3157545 3110103 3055618 2995966 2932792
53336 2932792 2866929 2799179 2731376 2665671 2602714 2541470 2480951 2421176 2362289 2303922 2245970
$$ packed form
53417A187156j6613j4839j3719j2505j0598q395o335m245k120m83O00J903L945
53404A103752O439R108J2058J4953J6979J8110J9392K1394K3426K4805K5868K7095
53392A323379K8366K9646L1443L3808L5890L7186L8344M0045M2010M3826M5822
53381A729765M8321N0901N3200N5601N8319O0664O2118O3289O4914O6584O7372
53370B381048O7125O6307O5192O4012O3243O2923O2149O0019N6498N1899M6347
53359C046762M0436L5542L2449L0331K7893K4852K1500J7679J3245Q746M613K03
53347C304251n167j0847j5660j9777k4662l1299l9294m7442n4485n9652o3174
53336B932792o5863o7750o7803o5705o2957o1244o0519n9775n8887n8367n7952
$$ plain form
53325 2245970 2188966 2133043 2077410 2021551 1966220 1912524 1860738 1810798 1763367 1719465 1679289
53314 1679289 1642198 1607770 1576269 1548044 1522815 1499552 1476943 1454228 1431772 1410651 1391612
53303 1391612 1374711 1359836 1346994 1335978 1326413 1318331 1312108 1307594 1303953 1300678 1298150 1296852 1296644
53290 1296644 1297187 1298473 1300463 1302806 1305572 1309772 1316513 1325898 1337294 1350435 1365680 1383345 1403297
53277 1403297 1425222 1448947 1474416 1501474 1529696 1558452 1587267 1616083 1644979 1673859 1702689
53266 1702689 1731693 1760742 1788750 1814407 1837450 1858496 1877808 1895114 1910623 1925129 1938785
53255 1938785 1950817 1960700 1968622 1974326 1976687 1975205 1970978 1965335 1958211 1948656 1936216 1920869 1902293
53242 1902293 1880255 1855368 1828511 1799794 1768973 1736592 1703774 1671004 1637965 1604531 1571156
$$ packed form
53325B245970n7004n5923n5633n5859n5331n3696n1786m9940m7431m3902m0176
53314A679289l7091l4428l1501k8225k5229k3263k2609k2715k2456k1121j9039
53303A391612j6901j4875j2842j1016r565q082o223m514l641l275k528j298k08
53290A296644N43J286J990K343K766M200O741R385J1396J3141J5245J7665J9952
53277A403297K1925K3725K5469K7058K8222K8756K8815K8816K8896K8880K8830
53266A702689K9004K9049K8008K5657K3043K1046J9312J7306J5509J4506J3656
53255A938785J2032R883P922N704K361j482m227n643p124r555j2440j5347j8576
53242A902293k2038k4887k6857k8717l0821l2381l2818l2770l3039l3434l3375
$$ plain form
53231 1571156 1538240 1505743 1473576 1441893 1411001 1381282 1353010 1325891 1299036 1271936 1245127
53220 1245127 1219333 1194191 1168574 1142050 1115299 1089093 1063595 1038823 1015168 993111 972842
53209 972842 954398 937861 923121 909660 896764 883866 870619 856811 842305 827023 810928
53198 810928 794020 776406 758406 740612 723670 707775 692503 677378 662541 648595 635872
53187 635872 624189 613150 602170 590367 577193 563242 549725 536849 523459 508672 493223
53176 493223 478660 465695 453879 442514 431324 420509 410530 401685 393604 385476 377006 368735 361169
53163 361169 354123 347264 340722 334712 329050 323564 318562 314321 310526 306711 302882 299140 295088 290283
53149 290283 284986 279938 275611 272139 269611 267834 266110 263894 261472 259477 257993 256696 255548 254726
$$ packed form
53231A571156l2916l2497l2167l1683l0892k9719k8272k7119k6855k7100k6809
53220A245127k5794k5142k5617k6524k6751k6206k5498k4772k3655k2057k0269
53209I72842j8444j6537j4740j3461j2896j2898j3247j3808j4506j5282j6095
53198H10928j6908j7614j8000j7794j6942j5895j5272j5125j4837j3946j2723
53187F35872j1683j1039j0980j1803j3174j3951j3517j2876j3390j4787j5449
53176D93223j4563j2965j1816j1365j1190j0815r979q845q081q128q470q271p566
53163C61169p046o859o542o010n662n486n002m241l795l815l829l742m052m805
53149B90283n297n048m327l472k528j777j724k216k422j995j484j297j148q22
$$ plain form
53135 254726 254074 253310 252608 252325 252287 251997 251450 251139 251288 251712 252410 253644 255343 256987 258284 259541 261193
53118 261193 263179 264904 265708 265465 264786 264407 264210 263222 260784 257355 253820 250511 247299 244160 241035 237537
53102 237537 233507 229554 226375 223773 220999 217811 214526 211273 207958 204743 201807 198787 195310 191959
53088 191959 189748 188609 187290 184941 181967 179074 176324 173529 170903 168797 167247 166178 165666 165628 165618
53073 165618 165205 164320 163048 161419 159604 157975 156734 155734 154846 154204 153891 153721 153524 153408 153521 153722 153693
53056 153693 153280 152648 152194 152309 153038 153887 154150 153531 152400 151463 151236 151697 152281 152311 151615 150589 149595 148539
53038 148539 147268 146061 145330 145021 144677 143963 142816 141272 139565 138218 137565 137260 136702 135828 135080 134675 134367
53021 134367 133918 133350 132766 132276 132096 132291 132498 132267 131650 131075 130746 130613 130791 131413 132120 132293 131904 131557 131568
$$ packed form
53135B54726o52p64p02k83l8k90n47l11J49M24O98J234J699J644J297J257J652
53118B61193J986J725Q04k43o79l79j97r88k438l429l535l309l212l139l125l498
53102B37537m030l953l179k602k774l188l285l253l315l215k936l020l477l351
53088A91959k211j139j319k349k974k893k750k795k626k106j550j069n12l8j0
53073A65618m13q85j272j629j815j629j241j000q88o42l13j70j97j16J13K01k9
53056A53693m13o32m54J15P29Q49K63o19j131r37k27M61N84L0o96j026r94j056
53038A48539j271j207p31l09l44p14j147j544j707j347o53l05n58q74p48m05l08
53021A34367m49n68n84m90j80J95K07k31o17n75l29j33J78O22P07J73l89l47J1
$$ plain form
53002 131568 131531 131001 130127 129320 128744 128418 128513 129151 130139 131117 131939 132678 133362 133846 134014 134103 134716 136363 138854
52983 138854 141371 143326 144969 146950 149449 152049 154323 156308 158485 161466 165472 169987 174138 177587
52969 177587 180757 183980 186904 189086 190642 191808 192259 191529 189766 187537 185188 182963 181330 180380 179284
52954 179284 177221 174660 172833 172096 171744 171340 171174 171294 171143 170473 169703 168936 167507 165014 162168 160072
52938 160072 159111 158891 158821 158368 157255 155828 154903 154928 155600 156452 157377 158417 159522 160750 162240 163787 164981
52921 164981 165914 167082 168349 168721 167750 166491 166346 167350 168349 168704 169032 170146 171856 173125 173221 172496 171990
52904 171990 172303 172951 172998 172206 171328 171285 172352 174089 175728 176598 176619 176546 177414 179560 182371 184944 186692 187367
52886 187367 187063 186306 185694 185258 184546 183428 182374 181831 181812 182292 183453 185228 187091 188688 190285 192164
$$ packed form
53002A31568l7n30q74q07n76l26R5O38R88R78Q22P39O84M84J68Q9O13J647K491
52983A38854K517J955J643J981K499K600K274J985K177K981M006M515M151L449
52969A77587L170L223K924K182J556J166M51p30j763k229k349k225j633r50j096
52954A79284k063k561j827p37l52m04j66J20j51o70p70p67j429k493k846k096
52938A60072r61k20p0m53j113j427r25K5O72Q52R25J040J105J228J490J547J194
52921A64981R33J168J267L72r71j259j45J004R99L55L28J114J710J269R6p25n06
52904A71990L13O48M7p92q78m3J067J737J639Q70K1p3Q68K146K811K573J748O75
52886A87367l04p57o12m36p12j118j054n43j9M80J161J775J863J597J597J879
$$ plain form
52870 192164 193936 194906 194990 194826 195057 195762 196546 196963 196862 196480 196226 196379 197077 198481 200764 203928 207788
52853 207788 212002 215968 218996 220986 222779 225327 228674 232188 235589 239029 242273 244661 246039 246954
52839 246954 247642 247525 246083 243586 240555 237057 232975 228518 223980 219386 214807 210711 207574 205372 203773
52824 203773 202545 201478 200254 198737 197184 195832 194452 192552 189947 187027 184587 183307 183033 182605 180911
52809 180911 178142 175516 173741 172411 171051 169971 169641 169855 169986 169649 168735 167321 165927 165287 165326 164943
52793 164943 163455 161779 161437 162587 163808 163720 162193 159972 157743 155815 154282 153137 152204 151082 149335
52778 149335 146929 144414 142446 141162 140338 139978 140233 140709 140549 139454 138080 137194 136857 136656 136183 135061
52762 135061 133064 130566 128342 126670 125113 123399 121833 120492 118836 116685 114828 113966 113636 112926 111773
$$ packed form
52870A92164J772R70Q4j64K31P05P84M17j01l82k54J53O98J404K283L164L860
52853B07788M214L966L028J990J793K548L347L514L401L440L244K388J378R15
52839B46954O88j17j442k497l031l498m082m457m538m594m579m096l137k202j599
52824B03773j228j067j224j517j553j352j380j900k605k920k440j280k74m28j694
52809A80911k769k626j775j330j360j080l30K14J31l37r14j414j394o40L9l83
52793A64943j488j676l42J150J221q8j527k221k229j928j533j145r33j122j747
52778A49335k406k515j968j284q24l60K55M76j60j095j374q86l37k01m73j122
52762A35061j997k498k224j672j557j714j566j341j656k151j857q62l30p10j153
$$ plain form
52747 111773 110781 110121 109449 108667 108036 107672 107449 107209 106616 105193 103085 101315 100662 100658 100451 100184 100620 101689
52729 101689 102426 102252 101384 100051 98237 96283 94833 93937 93046 92131 91981 92977 94273 94794 94571 94504 95053
52712 95053 95741 95999 96077 96873 98930 101812 104618 107004 109398 112241 115395 118410 120882 122352 122411 121365
52696 121365 120307 119994 120011 119591 118819 118274 117874 116970 115476 113998 112792 111435 109675 107868 106284 104643
52680 104643 102702 100744 99098 97569 95712 93431 91017 88809 87048 85896 85384 85327 85383 85172 84502 83619
52664 83619 83079 83121 83316 83122 82630 82395 82633 82968 82979 82638 82177 81833 81731 81747 81549 80930 80047 79113 78122 77187
52644 77187 76844 77519 78819 79884 80373 80628 80928 81153 81248 81515 82177 83057 83833 84416 84925 85466 85974 86184 85827
52625 85827 85029 84356 84220 84412 84447 84151 83614 82816 81750 80709 80004 79561 79221 79215 79854 80913 81846 82466 82923
$$ packed form
52747A11773r92o60o72p82o31l64k23k40n93j423k108j770o53mk07k67M36J069
52729A01689P37j74q68j333j814j954j450q96q91r15j50R96J296N21k23o7N49
52712I5053O88K58P8P96K057K882K806K386K394K843L154L015K472J470N9j046
52696A21365j058l13J7m20p72n45m00r04j494j478j206j357j760j807j584j641
52680A04643j941j958j646j529j857k281k414k208j761j152n12n7N6k11o70q83
52664H3619n40M2J95j94m92k35K38L35J1l41m61l44j02J6j98o19q83r34r91r35
52644G7187l43O75J300J065M89K55L00K25R5K67O62Q80P76N83N09N41N08K10l57
52625H5827p98o73j36J92L5k96n37p98j066j041p05m43l40oO39J059R33O20M57
$$ plain form
52606 82923 83201 83235 83383 84098 85200 86085 86633 87248 88000 88474 88553 88664 89107 89772 90661 91975 93441 94276 94175
52587 94175 93787 93872 94490 95370 96490 97856 99148 100125 101059 102365 103987 105530 106829 108036 109256 110396
52571 110396 111347 112236 113511 115653 118525 121131 122438 122484 122273 122602 123500 124821 126699 129062 131284 132770
52555 132770 133579 134122 134587 135001 135537 136384 137513 138920 140827 143296 145804 147587 148295 148123 147463 146701 146190
52538 146190 146115 146388 146816 147233 147395 147032 146275 145755 145952 146609 147136 147485 148161 149359 150553 151216 151573 152207
52520 152207 153084 153503 153201 152879 153204 153642 153061 151443 150212 150525 151921 153060 153203 152448 151115 149699 149016
52503 149016 149528 150634 151394 151772 152385 153188 153371 152649 151740 151301 151208 151179 151316 151608 151680 151498 151744 152881 154361
52484 154361 155317 155705 156229 157393 159120 161043 162718 163718 163950 163809 163789 164012 164312 164531 164550 164254 163767 163557
$$ packed form
52606H2923K78L4J48P15J102Q85N48O15P52M74P9J11M43O65Q89J314J466Q35j01
52587I4175l88Q5O18Q80J120J366J292R77R34J306J622J543J299J207J220J140
52571A10396R51Q89J275K142K872K606J307M6k11L29Q98J321J878K363K222J486
52555A32770Q09N43M65M14N36Q47J129J407J907K469K508J783P08j72o60p62n11
52538A46190p5K73M28M17J62l63p57n20J97O57N27L49O76J198J194O63L57O34
52520A52207Q77M19l02l22L25M38n81j618j231L13J396J139J43p55j333j416o83
52503A49016N12J106P60L78O13Q03J83p22r09m39r3k9J37K92P2j82K46J137J480
52484A54361R56L88N24J164J727J923J675J000K32j41k0K23L00K19J9k96m87k10
$$ plain form
52466 163557 164117 165585 167683 169830 171355 171971 172062 172187 172375 172388 172546 173502 175075 176220 176575 177187 179014
52449 179014 181427 183077 183829 184873 186998 189626 191710 192939 193760 194597 195363 195663 195289 194444 193346 191819
52433 191819 189565 186849 184383 182405 180449 178290 176468 175373 174349 172469 169860 167504 165866 164423
52419 164423 162623 160623 158949 157912 157550 157766 158280 158681 158681 158274 157660 157144 157019 157356 158002 158880 160083 161434
52401 161434 162279 162146 161431 160967 161052 161324 161557 162005 162922 164208 165675 167197 168450 168936 168660 168429 169098 170634
52383 170634 172262 173493 174637 176301 178721 181800 185445 189439 193021 195175 195640 195366 195620 196795 198449
52368 198449 200282 202496 205148 207780 209920 211587 213023 214298 215494 216938 218930 221395 224041 226619
52354 226619 228879 230598 231990 233718 236161 238906 241356 243526 245763 247936 249565 250729 252216 254573
$$ packed form
52466A63557N60J468K098K147J525O16R1J25J88J3J58R56J573J145L55O12J827
52449A79014K413J650P52J044K125K628K084J229Q21Q37P66L00l74q45j098j527
52433A91819k254k716k466j978j956k159j822j095j024j880k609k356j638j443
52419A64423j800k000j674j037l62K16N14M01%m07o14n16j25L37O46Q78J203J351
52401A61434Q45j33p15m64Q5K72K33M48R17J286J467J522J253M86k76k31O69J536
52383A70634J628J231J144J664K420L079L645L994L582K154M65k74K54J175J654
52368A98449J833K214K652K632K140J667J436J275J196J444J992K465K646K578
52354B26619K260J719J392J728K443K745K450K170K237K173J629J164J487K357
$$ plain form
52340 254573 257512 260461 263289 266163 268950 271217 272785 273991 275292 276744 278059 279146 280404 282379
52326 282379 285219 288625 292205 295636 298542 300630 302100 303633 305756 308312 310741 312730 314533 316782
52312 316782 320071 324490 329535 334657 339898 345648 351833 357897 363832 370635 379228 389265 399632 409920
52298 409920 420848 433139 446513 459950 472755 485139 497891 511576 526127 541279 557175
52287 557175 574171 592065 610020 627522 644928 662722 680615 697950 714705 731489 748521
52276 748521 765188 780760 795165 808853 822154 834894 846583 856915 866152 874917 883508 891527
52264 891527 898383 903993 908723 912788 916014 918190 919377 919848 919890 919706 919333 918634 917459 915823 913827 911494
52248 911494 908769 905699 902536 899723 897733 896767 896643 897129 898309 900420 903434 907227 912080 918494 926403
$$ packed form
52340B54573K939K949K828K874K787K267J568J206J301J452J315J087J258J975
52326B82379K840L406L580L431K906K088J470J533K123K556K429J989J803K249
52312C16782L289M419N045N122N241N750O185O064N935O803Q593J0037J0367J0288
52298D09920J0928J2291J3374J3437J2805J2384J2752J3685J4551J5152J5896
52287E57175J6996J7894J7955J7502J7406J7794J7893J7335J6755J6784J7032
52276G48521J6667J5572J4405J3688J3301J2740J1689J0332R237Q765Q591Q019
52264H91527O856N610M730M065L226K176J187M71M2j84l73o99j175j636j996k333
52248I11494k725l070l163k813j990r66j24M86J180K111L014L793M853O414P909
$$ plain form
52233 926403 935173 944533 954969 966871 979898 993535 1007713 1022343 1036810 1050574 1063867 1077086
52221 1077086 1089856 1101431 1111832 1121724 1131250 1139726 1146603 1152079 1156614 1160350 1163159 1164838 1165161
52208 1165161 1164100 1162040 1159436 1156289 1152274 1147212 1140991 1133252 1123788 1113218 1102642 1092614 1083042
52195 1083042 1074039 1066068 1059085 1052300 1045131 1037795 1030684 1023780 1017111 1011211 1006593 1003149 1000431 998133
52181 998133 995857 992896 988943 984745 981426 979175 977239 975121 973161 971763 970639 969250 967679 966585
52167 966585 966329 966507 966399 965572 963902 961296 957766 953712 949752 946160 942700 939097 935377 931638 927833
52152 927833 924060 920708 917898 915034 911322 906660 901612 896611 891652 886658 881605 876258 870275 863776
52138 863776 857376 851440 845642 839465 832836 826165 820001 814786 810622 807029 803181 798628 793656 788830
$$ packed form
52233I26403Q770R360J0436J1902J3027J3637J4178J4630J4467J3764J3293J3219
52221A077086J2770J1575J0401R892R526Q476O877N476M535L736K809J679L23
52208A165161j061k060k604l147m015n062o221p739r464j0570j0576j0028r572
52195A083042r003p971o983o785p169p336p111o904o669n900m618l444k718k298
52181I98133k276k961l953m198l319k251j936k118j960j398j124j389j571j094
52167I66585k56J78j08q27j670k606l530m054l960l592l460l603l720l739l805
52152I27833l773l352k810k864l712m662n048n001m959m994n053n347n983o499
52138H63776o400n936n798o177o629o671o164n215m164l593l848m553m972m826
$$ plain form
52124 788830 784352 780060 775827 771688 767628 763506 759284 755234 751785 749037 746503 743625 740662 738758
52110 738758 738792 740414 742540 744571 746605 748701 750683 752822 755946 760512 766073 772042 778552 786136 794954
52095 794954 804877 816127 829255 844447 861277 879230 898164 918132 939004 960484 982410 1004906
52083 1004906 1028078 1051599 1074678 1096638 1117501 1137814 1157853 1177160 1194976 1210966 1225449
52072 1225449 1239018 1251995 1264140 1274801 1283396 1289790 1294219 1297028 1298633 1299536 1299958 1299441 1297210 1293045
52058 1293045 1287479 1281018 1273585 1264980 1255586 1246203 1237312 1228886 1220836 1213338 1206560 1200355 1194371 1188422
52044 1188422 1182653 1177355 1172723 1168853 1165882 1164003 1163254 1163439 1164363 1166002 1168264 1170713 1172862 1174780 1177169
52029 1177169 1180771 1185829 1192063 1198865 1205470 1211278 1216287 1221012 1225829 1230561 1234813 1238525 1241894 1244865
$$ packed form
52124G88830m478m292m233m139m060m122m222m050l449k748k534k878k963j904
52110G38758L4J622K126K031K034K096J982K139L124M566N561N969O510P584Q818
52095G94954R923J1250J3128J5192J6830J7953J8934J9968K0872K1480K1926K2496
52083A004906K3172K3521K3079K1960K0863K0313K0039J9307J7816J5990J4483
52072A225449J3569J2977J2145J0661Q595O394M429K809J605R03M22n17k231m165
52058A293045n566o461p433q605r394r383q891q426q050p498o778o205n984n949
52044A188422n769n298m632l870k971j879p49J85R24J639K262K449K149J918K389
52029A177169L602N058O234O802O605N808N009M725M817M732M252L712L369K971
$$ plain form
52015 1244865 1246985 1247875 1247689 1246964 1245994 1244437 1241575 1236936 1230536 1222528 1212770 1200916 1186826 1170726
52001 1170726 1153054 1134270 1114726 1094509 1073457 1051533 1029040 1006276 983088 959102 934332
51990 934332 909225 884094 858907 833762 809102 785124 761267 736684 711236 685708 661022
51979 661022 637475 614834 592992 572248 552869 534616 516995 499897 483689 468607 454396
51968 454396 440805 428114 416803 406872 397903 389719 382533 376368 370699 364861 358631 352343 346572
51955 346572 341693 337548 333534 329208 324743 320588 316803 313065 309301 305939 303438 301810 300672 299486
51941 299486 297756 295314 292526 289966 287847 285957 284103 282266 280282 277753 274451 270580 266590 262958
51927 262958 260123 258210 256674 254616 251607 247966 244167 240371 236720 233627 231366 229579 227558 224930
$$ packed form
52015A244865K120Q90j86p25r70j557k862m639o400q008r758j1854j4090j6100
52001A170726j7672j8784j9544k0217k1052k1924k2493k2764k3188k3986k4770
51990I34332k5107k5131k5187k5145k4660k3978k3857k4583k5448k5528k4686
51979F61022k3547k2641k1842k0744j9379j8253j7621j7098j6208j5082j4211
51968D54396j3591j2691j1311r931q969q184p186o165n669n838o230o288n771
51955C46572m879m145m014m326m465m155l785l738l764l362k501j628j138j186
51941B99486j730k442k788k560k119j890j854j837j984k529l302l871l990l632
51927B62958k835j913j536k058l009l641l799l796l651l093k261j787k021k628
$$ plain form
51913 224930 221943 219177 217192 216248 216146 216381 216549 216524 216268 215724 214972 214215 213445 212396 210956 209418 208109
51896 208109 207039 206128 205480 205080 204452 203020 200848 198705 197291 196642 196321 195981 195573 195143 194678 194191 193829
51879 193829 193701 193672 193449 192917 192230 191621 191271 191407 192142 193129 193688 193535 193109 192916 192872 192630 192261 192162 192482 193139
51859 193139 194238 196002 198303 200752 203199 205746 208313 210618 212482 213773 214282 214219 214594 216293 218793
51844 218793 220591 221018 220865 221036 221416 221428 220979 220345 219667 219045 218751 218915 219325 219782 220309 220870 221334 221929 223137
51825 223137 224867 226305 226957 227311 228104 229419 230939 232555 234254 235827 237146 238374 239546 240388 240881
51810 240881 241469 242306 242846 242693 242290 242232 242431 242519 242486 242294 241482 239983 238800 238882 239726 240040 239536 239052 239062 239214
51790 239214 239440 240404 242453 244924 246909 248162 248915 249392 249834 250573 251689 252873 253830 254644 255570 256725
$$ packed form
51913B24930k987k766j985r44j02K35J68k5k56n44p52p57p70j049j440j538j309
51896B08109j070r11o48m00o28j432k172k143j414o49l21l40m08m30m65m87l62
51879A93829j28k9k23n32o87o09l50J36P35R87N59j53m26j93m4k42l69r9L20O57
51859A93139J099J764K301K449K447K547K567K305J864J291N09o3L75J699K500
51844B18793J798M27j53J71L80J2m49o34o78o22k94J64M10M57N27N61M64N95J208
51825B23137J730J438O52L54P93J315J520J616J699J573J319J228J172Q42M93
51810B40881N88Q37N40j53m03n8J99Q8l3j92q12j499j183Q2Q44L14n04m84J0J52
51790B39214K26R64K049K471J985J253P53M77M42P39J116J184R57Q14R26J155
$$ plain form
51774 256725 258123 259784 261665 263609 265391 266768 267657 268392 269555 271289 273049 274390 275645 277405 279617
51759 279617 281824 284054 286774 290062 293561 297244 301446 305952 309726 311940 312788 312974 312804 312119 310762
51744 310762 308790 306371 303691 300944 298339 296194 294870 294316 293882 292931 291585 290505 290057 290159 290844 292271
51728 292271 294057 295185 294924 293549 291988 291019 290832 290997 290728 289563 287865 286332 285016 283294 280846
51713 280846 278102 275603 273409 271391 269561 267823 265856 263606 261537 260044 258949 257844 256609 255228
51699 255228 253448 251093 248537 246479 245313 244890 244803 244677 244373 244064 243984 244128 244464 245408 247570 250899 254672
51682 254672 258587 263173 268626 273850 277403 278979 279224 278482 276705 274481 273027 272896 273527 274410 275863
51667 275863 278189 280726 282403 282830 282245 280834 278788 276745 275299 274058 271887 268239 263725 259191 254821
$$ packed form
51774B56725J398J661J881J944J782J377Q89P35J163J734J760J341J255J760K212
51759B79617K207K230K720L288L499L683M202M506L774K214Q48J86j70o85j357
51744C10762j972k419k680k747k605k145j324n54m34r51j346j080m48J02O85J427
51728B92271J786J128k61j375j561r69j87J65k69j165j698j533j316j722k448
51713B80846k744k499k194k018j830j738j967k250k069j493j095j105j235j381
51699B55228j780k355k556k058j166m23q7j26l04l09q0J44L36R44K162L329L773
51682B54672L915M586N453N224L553J576K45p42j777k224j454j31O31Q83J453
51667B75863K326K537J677M27n85j411k046k043j446j241k171l648m514m534m370
$$ plain form
51652 254821 250426 246129 242304 239115 236415 233898 231136 227746 223886 220358 217942 216756 216388 216284 215738
51637 215738 214004 211052 207898 205585 204016 202397 200608 199323 198790 198347 197342 195814 194088 192399 191181
51622 191181 190964 191589 192212 192514 193152 194518 195790 196014 195507 195258 195403 195287 194848 194808 195432 196004 195855 195202
51604 195202 194625 194298 194133 194278 194977 196107 197233 198140 199114 200625 202730 204902 206609 208040 210006 213106
51588 213106 217266 222168 227566 233043 237984 242262 246511 251254 256178 260772 265138 269472 273198 275524
51574 275524 276672 277649 278846 279707 279779 279228 278209 276612 274648 272873 271327 269347 266629 263834 261756
51559 261756 260516 260044 260769 263196 267106 271772 276816 282417 288750 295543 302161 307926 312443 315762 318226
51544 318226 320165 321880 323728 325813 327630 328477 328346 327987 328008 328329 328717 329317 330306 331377 332007 332077 331916
$$ packed form
51652B54821m395m297l825l189k700k517k762l390l860l528k416j186l68j04n46
51637B15738j734k952l154k313j569j619j789j285n33m43j005j528j726j689j218
51622A91181k17O25O23L02O38J366J272K24n07k49J45j16m39m0O24N72j49o53
51604A95202n77l27j65J45O99J130J126R07R74J511K105K172J707J431J966L100
51588B13106M160M902N398N477M941M278M249M743M924M594M366M334L726K326
51574B75524J148R77J197Q61P2n51j019j597j964j775j546j980k718k795k078
51559B61756j240m72P25K427L910M666N044N601O333O793O618N765M517L319K464
51544C18226J939J715J848K085J817Q47j31l59K1L21L88O00R89J071O30P0j61
$$ plain form
51527 331916 331836 331857 331847 331725 331517 331216 330571 329152 326822 323993 321082 317867 313817 309098 304751 301673 299702
51510 299702 297793 294878 290585 285531 280966 277825 276029 274869 273936 273279 272887 272619 272610 273073 273630 273552 272818
51493 272818 272272 272452 272937 273205 273479 274202 275146 275647 275463 274965 274671 274944 275984 277748 279967 282352 284630
51476 284630 286411 287493 288455 290453 294087 298766 303408 307437 310848 313832 316711 319965 323850 328127
51462 328127 332433 336786 341478 346636 351989 356919 360739 363171 364610 365630 366366 366794 367372 368617 369999
51447 369999 370175 368643 366451 364879 364087 363488 362701 361503 359441 356187 351944 346977 341141 334359 327134
51432 327134 320045 313115 306159 299305 292714 286263 280072 274870 271156 268387 265654 262804 260219 257897
51418 257897 255537 253279 251599 250620 250172 250327 251283 252888 254906 257456 260597 263800 266563 269196 272094
$$ packed form
51527C31916q0K1j0j22k08l01o45j419k330k829k911l215m050m719m347l078j971
51510B99702j909k915m293n054m565l141j796j160r33o57l92k68rM63N57p8p34
51493B72818n46J80M85K68K74P23R44N01j84m98k94K73J040J764K219K385K278
51476B84630J781J082R62J998L634M679M642M029L411K984K879L254L885M277
51462C28127M306M353M692N158N353M930L820K432J439J020P36M28N78J245J382
51447C69999J76j532k192j572p92n99p87j198k062l254m243m967n836o782p225
51432C27134p089o930o956o854o591o451o191n202l714k769k733k850k585k322
51418B57897k360k258j680r79m48J55R56J605K018K550L141L203K763K633K898
$$ plain form
51403 272094 274586 275489 274764 273551 272527 271203 268948 265678 261305 255533 248649 241651 235019 228144 220600
51388 220600 213309 207669 203902 200968 197914 194657 191521 188599 185757 182884 179954 176934 173784 170590
51374 170590 167627 165207 163339 161668 159875 158045 156442 155039 153581 152074 150957 150688 151238 151971 151943
51359 151943 150572 148227 146011 144751 144394 144510 145030 146092 147491 148731 149474 149556 148873 147714 146910 147005 147498
51342 147498 147554 147278 147542 148641 149951 150992 152038 153468 155210 157099 159162 161234 162882 164089 165590
51327 165590 168202 172162 177225 182896 188395 193022 196889 200836 205259 209486 212596 214358 214950 214293 212274
51312 212274 209339 206236 203230 199956 195973 191171 185803 180413 175617 171726 168632 166155 164209 162507
51298 162507 160504 157920 155076 152378 149762 147013 144364 142283 140876 139919 139355 139281 139450 139302 138580 137654
$$ packed form
51403B72094K492R03p25j213j024j324k255l270m373n772o884o998o632o875p544
51388B20600p291n640l767k934l054l257l136k922k842k873k930l020l150l194
51374A70590k963k420j868j671j793j830j603j403j458j507j117k69N50P33k8
51359A51943j371k345k216j260l57J16N20J062J399J240P43Q2o83j159q04R5M93
51342A47498N6k76K64J099J310J041J046J430J742J889K063K072J648J207J501
51327A65590K612L960N063N671N499M627L867L947M423M227L110J762N92o57k019
51312B12274k935l103l006l274l983m802n368n390m796l891l094k477j946j702
51298A62507k003k584k844k698k616k749k649k081j407r57n64p4J69j48p22r26
$$ plain form
51282 137654 137043 136911 137120 137524 138014 138421 138553 138322 137774 137017 136194 135527 135261 135453 135799 135869 135650 135672 136411
51263 136411 137652 138705 139188 139333 139537 139953 140522 141053 141143 140420 139069 137849 137321 137274 137113 136590 135867 135028
51245 135028 133867 132215 130329 128906 128658 129687 131280 132533 133244 133946 135026 136173 136921 137378 138037 139098
51229 139098 140326 141465 142470 143345 144073 144641 144917 144571 143430 141892 140724 140415 140841 141475 141745 141335 140470
51212 140470 139870 140051 140661 140846 140332 139728 139663 140091 140747 141840 143750 146219 148392 149725 150389 150674 150528
51195 150528 149998 149703 150302 151541 152321 151870 150562 149402 148884 148621 148060 147315 147114 147925 149317 150372 150687
51178 150687 150735 151149 151915 152459 152370 151766 151024 150443 150107 149852 149329 148281 146726 144763 142415 139932 137942
51161 137942 136834 136150 135123 133727 132557 131767 130855 129686 128901 128997 129639 130244 130598 130542 129808 128712 128289
$$ packed form
51282A37654o11j32K09M04M90M07J32k31n48p57q23o67k66J92L46P0k19K2P39
51263A36411J241J053M83J45K04M16N69N31R0p23j351j220n28m7j61n23p23q39
51245A35028j161j652j886j423k48J029J593J253P11P02J080J147P48M57O59J061
51229A39098J228J139J005Q75P28N68K76l46j141j538j168l09M26O34K70m10q65
51212A40470o00J81O10J85n14o04o5M28O56J093J910K469K173J333O64K85j46
51195A50528n30k95N99J239P80m51j308j160n18k63n61p45k01Q11J392J055L15
51178A50687M8M14P66N44q9o04p42n81l36k55n23j048j555j963k348k483j990
51161A37942j108o84j027j396j170p90r12j169p85R6O42O05L54n6p34j096m23
$$ plain form
51144 128289 129034 130148 130801 131517 133365 136261 139132 141444 143420 144892 145256 144772 144732 145834 147254 147800
51128 147800 147304 146364 145300 143915 141936 139275 136134 133155 131168 130545 130982 131990 133245 134403 135026
51113 135026 134935 134346 133573 132870 132575 132966 133917 135011 135968 136559 136355 135223 133997 133822 134779 136050 137523
51096 137523 140134 144136 148067 150269 150770 150881 151497 152562 153828 155208 156464 157222 157362 157094 156756 156759 157368
51079 157368 158265 158694 158403 158045 158234 158714 158934 158979 159311 159955 160634 161410 162496 163596 164067 163701 162841 161894
51061 161894 161215 161214 161962 162851 163264 163481 164315 165896 167466 168366 168719 169092 169953 171367 172778 173218 172298 170883
51043 170883 170169 170237 170230 169879 169883 170626 171467 171766 171863 172441 173484 174476 175232 175910 176463 176691 176752 177154 178196 179689
51023 179689 181210 182444 183383 184403 186003 188183 190237 191478 192113 193072 194901 197131 198925 200109 201296
$$ packed form
51144A28289P45J114O53P16J848K896K871K312J976J472L64m84m0J102J420N46
51128A47800m96r40j064j385j979k661l141k979j987o23M37J008J255J158O23
51113A35026r1n89p73p03k95L91R51J094R57N91k04j132j226j75R57J271J473
51096A37523K611M002L931K202N01J11O16J065J266J380J256P58J40k68l38LO09
51079A57368Q97M29k91l58J89M80K20M5L32O44O79P76J086J100M71l66q60r47
51061A61894o79jP48Q89M13K17Q34J581J570R00L53L73Q61J414J411M40r20j415
51043A70883p14O8pl51MP43Q41K99R7N78J043R92P56O78N53K28O1M02J042J493
51023A79689J521J234R39J020J600K180K054J241O35R59J829K230J794J184J187
$$ plain form
51008 201296 203077 205392 207836 210309 213075 216239 219555 222866 226417 230506 235050 239826 244914 250617
50994 250617 257054 264184 272111 280912 290184 299157 307459 315520 324204 334277 346242 360220 375796
50981 375796 392247 409193 426976 446345 467981 492357 519686 549878 582796 618771 658603
50970 658603 702789 750934 802193 856107 912743 972186 1034246 1098547 1164486 1230954 1296414
50959 1296414 1359401 1418817 1473705 1523056 1566086 1602527 1632346 1655230 1670722 1679047 1681557 1680026
50947 1680026 1675560 1668467 1659205 1649080 1639733 1632086 1626105 1621510 1618291 1616305 1614605 1611512 1605413 1595349
50933 1595349 1580855 1561498 1536823 1506668 1471241 1430773 1385379 1335472 1282186 1227048 1171148
50922 1171148 1114886 1058559 1002936 949066 897783 849579 804812 763682 726078 691757 660767
$$ packed form
51008B01296J781K315K444K473K766L164L316L311L551M089M544M776N088N703
50994B50617O437P130P927Q801R272Q973Q302Q061Q684J0073J1965J3978J5576
50981C75796J6451J6946J7783J9369K1636K4376K7329L0192L2918L5975L9832
50970F58603M4186M8145N1259N3914N6636N9443O2060O4301O5939O6468O5460
50959A296414O2987N9416N4888M9351M3030L6441K9819K2884J5492Q325K510j531
50947A680026m466p093r262j0125r347p647n981m595l219j986j700l093o099j0064
50933A595349j4494j9357k4675l0155l5427m0468m5394m9907n3286n5138n5900
50922A171148n6262n6327n5623n3870n1283m8204m4767m1130l7604l4321l0990
$$ plain form
50911 660767 633479 610097 590277 573338 558716 546101 535239 525835 517722 510971 505657 501504
50899 501504 497971 494783 492255 490908 490878 491813 493267 494930 496453 497381 497511 497232 497380 498709 501423 505094
50883 505094 509068 513165 517954 524101 531497 539357 547254 555631 565159 575995 587981 601139 615471
50870 615471 630568 646097 662607 681251 702584 726258 752101 780972 814003 851441 892901
50859 892901 938692 990222 1048825 1114731 1187628 1267910 1356762 1455072 1562788 1679387 1804390
50848 1804390 1937105 2076399 2221183 2370662 2523412 2676266 2824771 2964758 3092980
50839 3092980 3206371 3301682 3376457 3430099 3463675 3479029 3478337 3464112 3439159 3406575 3369973
50828 3369973 3333340 3300219 3272991 3253048 3241280 3238005 3242449 3252420 3264367 3273756 3275936 3267183
$$ packed form
50911F60767k7288k3382j9820j6939j4622j2615j0862r404q113o751n314m153
50899E01504l533l188k528j347l0R35J454J663J523R28J30k79J48J329K714L671
50883E05094L974M097M789O147P396P860P897Q377R528J0836J1986J3158J4332
50870F15471J5097J5529J6510J8644K1333K3674K5843K8871L3031L7438M1460
50859H92901M5791N1530N8603O5906P2897Q0282Q8852R8310J07716J16599J25003
50848A804390J32715J39294J44784J49479J52750J52854J48505J39987J28222
50839C092980J13391R5311P4775N3642L3576J5354o92j4225k4953l2584l6602
50828C369973l6633l3121k7228j9943j1768l275M444R971J1947R389K180q753
$$ plain form
50816 3267183 3245053 3207971 3155037 3086432 3003360 2907053 2798133 2677423 2547071 2410463
50806 2410463 2271405 2133751 2001228 1876578 1760842 1654063 1556615 1469292 1392331 1325263
50796 1325263 1267777 1219970 1181508 1151303 1128400 1112733 1104605 1103805 1109403 1120080 1134392 1151085
50784 1151085 1169406 1188823 1208286 1226114 1240810 1251634 1258283 1260577 1258803 1253878 1246603 1236930
50772 1236930 1224384 1208973 1191257 1171704 1150486 1127845 1104245 1080008 1055164 1029784 1004277
50761 1004277 979276 955458 933580 914470 898715 886357 877026 870441 866705 866030 868229 872691 879007
50748 879007 887508 898963 913853 932163 953862 979244 1008682 1042389 1080707 1124336 1173963 1229783
50736 1229783 1291754 1360271 1436137 1519697 1610251 1706365 1806400 1908437 2010067 2108786 2202600
$$ packed form
50816C267183k2130l7082n2934o8605q3072r6307j08920j20710j30352j36608
50806B410463j39058j37654j32523j24650j15736j06779r7448q7323p6961o7068
50796A325263n7486m7807l8462l0205k2903j5667q128q00N598J0677J4312J6693
50784A151085J8321J9417J9463J7828J4696J0824O649K294j774m925p275r673
50772A236930j2546j5411j7716j9553k1218k2641k3600k4237k4844k5380k5507
50761A004277k5001k3818k1878j9110j5755j2358r331o585l736o75K199M462O316
50748H79007Q501J1455J4890J8310K1699K5382K9438L3707L8318M3629M9627N5820
50736A229783O1971O8517P5866Q3560R0554R6114J00035J02037J01630R8719R3814
$$ plain form
50725 2202600 2289833 2368342 2435402 2488586 2526418 2547996 2552558 2540077 2512230 2472252 2423819
50714 2423819 2370326 2315042 2261304 2212258 2170520 2137910 2114964 2100696 2093338 2091479 2093973 2098775
50702 2098775 2102690 2102649 2096664 2083126 2059948 2025255 1978654 1921227 1854646 1780959 1702954 1623684
50690 1623684 1545490 1469978 1398855 1333993 1276410 1225855 1181762 1144215 1113717 1090430 1074090
50679 1074090 1064474 1061585 1065386 1075643 1092201 1115379 1145907 1184200 1229668 1280991 1337066 1397224
50667 1397224 1460277 1523845 1585160 1642306 1694298 1740389 1780044 1813441 1841243 1863721 1880616
50656 1880616 1891861 1897925 1899382 1896662 1890306 1880929 1868748 1853584 1835579 1815576 1794743 1774172
50644 1774172 1754832 1737455 1722465 1710466 1702836 1701178 1705974 1716265 1730792 1748803 1769448 1791154
$$ packed form
50725B202600Q7233P8509O7060N3184L7832K1578M562j2481k7847l9978m8433
50714B423819n3493n5284n3738m9046m1738l2610k2946j4268p358j859K494M802
50702B098775L915m1n985j3538k3178l4693m6601n7427o6581p3687p8005p9270
50690A623684p8194p5512p1123o4862n7583n0555m4093l7547l0498k3287j6340
50679A074090r616k889L801J0257J6558K3178L0528L8293M5468N1323N6075O0158
50667A397224O3053O3568O1315N7146N1992M6091L9655L3397K7802K2478J6895
50656A880616J1245O064J457k720o356r377j2181j5164j8005k0003k0833k0571
50644A774172j9340j7377j4990j1999p630j658M796J0291J4527J8011K0645K1706
$$ plain form
50632 1791154 1812288 1832112 1850527 1867081 1880766 1890773 1897065 1900196 1900872 1899742 1897546 1895451 1895085
50619 1895085 1897906 1904411 1914245 1927202 1943764 1964316 1987962 2012346 2034629 2052637 2065398 2072888
50607 2072888 2075323 2072626 2064565 2051284 2033373 2011336 1985158 1954405 1918558 1877272 1830539 1778701
50595 1778701 1722186 1661397 1597106 1530839 1464502 1399576 1336830 1276615 1219095 1164380 1112947
50584 1112947 1065765 1023508 985726 951394 920203 892677 869043 848783 831442 817112 805851
50573 805851 797281 791114 787478 786410 787585 790814 796303 804121 814005 825951 840316 857067 875716
50560 875716 896453 920558 949043 981524 1017128 1055933 1098729 1145829 1196886 1251532 1309463
50549 1309463 1370093 1432692 1496448 1559765 1620007 1674859 1723893 1768237 1809100 1847325 1883931
$$ packed form
50632A791154K1134J9824J8415J6554J3685J0007O292L131O76j130k196k095l66
50619A895085K821O505R834J2957J6562K0552K3646K4384K2283J8008J2761P490
50607B072888K435k697q061j3281j7911k2037k6178l0753l5847m1286m6733n1838
50595A778701n6515o0789o4291o6267o6337o4926o2746o0215n7520n4715n1433
50584A112947m7182m2257l7782l4332l1191k7526k3634k0260j7341j4330j1261
50573H05851q570o167l636j068J175L229N489P818R884J1946J4365J6751J8649
50560H75716K0737K4105K8485L2481L5604L8805M2796M7100N1057N4646N7931
50549A309463O0630O2599O3756O3317O0242N4852M9034M4344M0863L8225L6606
$$ plain form
50538 1883931 1919972 1955916 1991961 2028759 2066847 2105380 2142615 2177943 2212634 2248315 2285676
50527 2285676 2325105 2367695 2414748 2466611 2522623 2581954 2643940 2707685 2771728 2834230 2893344
50516 2893344 2947406 2994785 3033566 3061635 3077392 3080303 3070454 3047745 3012060 2964176 2905852 2838822
50504 2838822 2764270 2683715 2600027 2517095 2438514 2366743 2303288 2249307 2205916 2173945 2153368
50493 2153368 2143061 2141276 2146354 2156868 2171395 2188671 2208013 2228946 2249952 2267817 2278543 2278837
50481 2278837 2266595 2240311 2198734 2141551 2070385 1988785 1900887 1809882 1717682 1625806 1536159
50470 1536159 1450731 1370782 1296626 1228067 1164863 1106951 1054541 1007947 967110 931425 900213
50459 900213 873188 850155 830557 813803 799976 789642 782930 779170 777525 777554 779131 782258 787105
$$ packed form
50538A883931L6041L5944L6045L6798L8088L8533L7235L5328L4691L5681L7361
50527B285676L9429M2590M7053N1863N6012N9331O1986O3745O4043O2502N9114
50516B893344N4062M7379L8781K8069J5757K911r849k2709l5685m7884n8324o7030
50504B838822p4552q0555q3688q2932p8581p1771o3455n3981m3391l1971k0577
50493B153368j0307j785N078J0514J4527J7276J9342K0933K1006J7865J0726K94
50481B278837j2242k6284m1577n7183p1166q1600q7898r1005r2200r1876q9647
50470A536159q5428p9949p4156o8559o3204n7912n2410m6594m0837l5685l1212
50459I00213k7025k3033j9598j6754j3827j0334o712l760j645K9J577L127M847
$$ plain form
50446 787105 793843 802298 812108 823336 836509 851814 868644 886239 904481 923754 944291 966058
50434 966058 989187 1014167 1041524 1071426 1103504 1136983 1171066 1205330 1239753 1274440 1309500
50423 1309500 1345248 1382131 1420218 1458908 1497468 1535874 1574851 1615103 1656682 1699214 1742575
50412 1742575 1787062 1832828 1879258 1925099 1969124 2010527 2048728 2083139 2113342 2139269 2160915
50401 2160915 2177920 2189635 2195415 2194626 2186456 2170086 2145053 2111281 2068833 2017898 1958992 1892961
50389 1892961 1820911 1744455 1665855 1587392 1510550 1436191 1365592 1300731 1243273 1193699 1151751
50378 1151751 1117359 1090699 1071632 1059644 1054360 1055667 1063182 1075867 1092267 1110980 1130740 1150160
50366 1150160 1167435 1180251 1186209 1183762 1173030 1155531 1132876 1105842 1074937 1041554 1007819 975010
$$ packed form
50446G87105O738Q455R810J1228J3173J5305J6830J7595J8242J9273K0537K1767
50434I66058K3129K4980K7357K9902L2078L3479L4083L4264L4423L4687L5060
50423A309500L5748L6883L8087L8690L8560L8406L8977M0252M1579M2532M3361
50412A742575M4487M5766M6430M5841M4025M1403L8201L4411L0203K5927K1646
50401B160915J7005J1715N780p89q170j6370k5033l3772m2448n0935n8906o6031
50389A892961p2050p6456p8600p8463p6842p4359p0599o4861n7458m9574m1948
50378A151751l4392k6660j9067j1988n284J307P515J2685J6400J8713J9760J9420
50366A150160J7275J2816N958k447j0732j7499k2655k7034l0905l3383l3735l2809
$$ plain form
50354 975010 942672 909833 876758 844856 815040 787055 760592 736220 714665 695756 678803
50343 678803 663643 650623 639650 629952 620918 612646 605595 600051 596079 593604 592418 592376 593636 596507
50329 596507 601037 607026 614383 623109 632937 643383 654259 665806 678221 691463 705635 721161
50317 721161 738323 756926 776647 797418 819159 841413 863690 886132 909417 933868 958831
50306 958831 983146 1006173 1028219 1049803 1070613 1089461 1105406 1118667 1130096 1139907 1147361 1151751
50294 1151751 1153321 1153040 1151774 1149827 1146970 1142524 1135480 1124851 1110146 1091571 1069836 1045777 1020084
50281 1020084 993338 966212 939497 913772 889135 865424 842606 820740 799650 778929 758431
50270 758431 738613 720282 704022 689834 677242 665749 655233 645886 637853 631128 625768 621844
$$ packed form
50354I75010l2338l2839l3075l1902k9816k7985k6463k4372k1555j8909j6953
50343F78803j5160j3020j0973r698r034q272p051n544l972k475j186m2J260K871
50329E96507M530N989P357Q726R828J0446J0876J1547J2415J3242J4172J5526
50317G21161J7162J8603J9721K0771K1741K2254K2277K2442K3285K4451K4963
50306I58831K4315K3027K2046K1584K0810J8848J5945J3261J1429R811P454M390
50294A151751J570k81j266j947k857m446p044j0629j4705j8575k1735k4059k5693
50281A020084k6746k7126k6715k5725k4637k3711k2818k1866k1090k0721k0498
50270G58431j9818j8331j6260j4188j2592j1493j0516r347q033o725n360l924
$$ plain form
50258 621844 619029 616650 614468 613115 613284 614801 616933 619400 622456 626082 629850 633727 638357 644237
50244 644237 651041 658026 664705 670931 676723 682325 688048 693675 698295 701094 702215 702488 702423 701708 699676
50229 699676 696051 691214 685843 680338 674561 668189 661278 654386 648120 642688 637825 633090 628347 624121
50215 624121 621323 620402 620908 622161 624069 626845 630132 633113 635556 638159 641661 646112 651189 656657 662202
50200 662202 667350 671977 676577 681533 686373 690147 692375 693314 693416 692854 691515 689231 686029 682187 677887
50185 677887 672784 666274 658295 649490 640353 630622 619875 608433 597268 587163 578309 570524 563467
50172 563467 556781 550380 544601 539823 536011 532894 530431 528781 527805 526891 525337 522741 519074 514593 509761
50157 509761 505052 500681 496524 492302 487918 483671 480038 477105 474332 471190 468011 465732 464710 464147
$$ packed form
50258F21844k815k379k182j353J69J517K132K467L056L626L768L877M630N880
50244F44237O804O985O679O226N792N602N723N627M620K799J121K73o5p15k032
50229F99676l625m837n371n505n777o372o911o892o266n432m863m735m743m226
50215F24121k798r21N06J253J908K776L287K981K443K603L502M451N077N468N545
50200F62202N148M627M600M956M840L774K228R39J02n62j339k284l202l842m300
50185F77887n103o510p979q805r137r731j0747j1442j1165j0105q854p785p057
50172E63467o686o401n779m778l812l117k463j650r76r14j554k596l667m481m832
50157E09761m709m371m157m222m384m247l633k933k773l142l179k279j022n63
$$ plain form
50143 464147 462938 460797 458316 456257 455026 454509 454094 453041 451266 449573 448851 449201 450173 451620 453809
50128 453809 456733 459824 462536 464958 467660 471030 474884 478691 482155 485495 489039 492629 495750 498319
50114 498319 500893 503839 506611 508306 508768 508681 508649 508658 508548 508534 508940 509635 510099 510108 510099 510668 511869 513278 514805
50095 514805 517094 520838 525988 531993 538622 545993 553897 561769 569528 577851 587337 597910 609357 621892
50081 621892 635681 650240 664907 679660 694991 711123 727816 744738 761576 778005 794046
50070 794046 810283 827161 844180 860319 875256 889635 904141 918891 933842 949280 965682
50059 965682 983503 1003290 1025652 1050940 1079194 1110533 1145373 1184162 1227261 1275161 1328556
50048 1328556 1388075 1454163 1527193 1607133 1692734 1781257 1869284 1953622 2031320 2099415 2155549
$$ packed form
50143D64147j209k141k481k059j231n17m15j053j775j693p22L50R72J447K189
50128D53809K924L091K712K422K702L370L854L807L464L340L544L590L121K569
50114D98319K574K946K772J695M62q7l2Rj10j4M06O95M64RrN69J201J409J527
50095E14805K289L744N150O005O629P371P904P872P759Q323R486J0573J1447J2535
50081F21892J3789J4559J4667J4753J5331J6132J6693J6922J6838J6429J6041
50070G94046J6237J6878J7019J6139J4937J4379J4506J4750J4951J5438J6402
50059I65682J7821J9787K2362K5288K8254L1339L4840L8789M3099M7900N3395
50048A328556N9519O6088P3030P9940Q5601Q8523Q8027Q4338P7698O8095N6134
$$ plain form
50037 2155549 2199208 2232152 2257534 2278637 2298267 2318656 2341199 2365921 2391234 2414183 2430894
50026 2430894 2436916 2427756 2399835 2351467 2283280 2197997 2099903 1994096 1885474 1777909 1674185
50015 1674185 1576399 1486104 1404184 1331122 1267436 1213351 1167941 1129219 1095508 1066324 1041636
50004 1041636 1020833 1003028 987921 975515 965115 955424 945768 936556 928293 920672 912914 904555 895510
49991 895510 885716 875118 863886 852318 840531 828394 815778 802797 789858 777519 766190 755918
49979 755918 746490 737748 729673 722215 715230 708734 703096 698811 696048 694494 693684 693416 693757 694640 695734
49964 695734 696948 698930 702641 708300 715023 721629 727566 733022 738515 744677 752091 760929 770879 781667
49950 781667 793453 806407 820130 833983 847955 862899 879869 899451 921754 946807 974909
$$ packed form
50037B155549M3659L2944K5382K1103J9630K0389K2543K4722K5313K2949J6711
50026B430894O022r160k7921m8368o8187q5283r8094j05807j08622j07565j03724
50015A674185r7786r0295q1920p3062o3686n4085m5410l8722l3711k9184k4688
50004A041636k0803j7805j5107j2406j0400r691r656r212q263p621p758q359r045
49991H95510r794j0598j1232j1568j1787j2137j2616j2981j2939j2339j1329j0272
49979G55918r428q742q075p458o985o496n638m285k763j554q10k68L41Q83J094
49964F95734J214J982L711N659O723O606N937N456N493O162P414Q838R950J0788
49950G81667J1786J2954J3723J3853J3972J4944J6970J9582K2303K5053K8102
$$ plain form
49939 974909 1006657 1042631 1083107 1128398 1179579 1238489 1306756 1385084 1473749 1573292 1684062
49928 1684062 1805045 1933401 2064953 2194898 2318668 2433086 2536969 2630494 2714311 2789828
49918 2789828 2859913 2928269 2997693 3069186 3142294 3215204 3284231 3344049 3389006 3414035 3414645 3387502
49906 3387502 3332130 3251704 3151543 3036860 2911976 2780644 2645942 2509876 2373790 2239254
49896 2239254 2108007 1981170 1859217 1742907 1633631 1532545 1439786 1354868 1277496 1207578
49886 1207578 1144689 1088077 1037206 991854 951510 915100 881640 850939 823297 798667 776530
49875 776530 756537 738705 722784 707818 692714 677023 660952 644896 629202 614183 599955
49864 599955 586441 573823 562718 553538 545860 538886 532412 526940 522886 520128 518249 516749 515051
$$ packed form
49939I74909L1748L5974M0476M5291N1181N8910O8267P8328Q8665R9543J10770
49928A684062J20983J28356J31552J29945J23770J14418J03883R3525Q3817P5517
49918B789828P0085O8356O9424P1493P3108P2910O9027N9818M4957K5029O10k7143
49906C387502n5372q0426j00161j14683j24884j31332j34702j36066j36086j34536
49896B239254j31247j26837j21953j16310j09276j01086r2759q4918p7372o9918
49886A207578o2889n6612n0871m5352m0344l6410l3460l0701k7642k4630k2137
49875G76530j9993j7832j5921j4966j5104j5691j6071j6056j5694j5019j4228
49864E99955j3514j2618j1105r180p678o974o474n472m054k758j879j500j698
$$ plain form
49851 515051 512788 510176 507769 505789 504078 502603 501490 500571 499476 498324 497813 498427 500001 502198 504813
49836 504813 507400 509223 510106 510943 512887 516212 520342 524785 529644 535336 542174 550151 558985 568437 578754
49821 578754 590671 604880 621702 641308 663984 689959 719280 752079 788817 830207 877197
49810 877197 931108 993275 1064145 1142899 1228172 1318658 1412588 1506918 1597554 1680403 1752196
49799 1752196 1811080 1857318 1893422 1922895 1948633 1972725 1997407 2025150 2057221 2092355 2126855
49788 2126855 2155494 2172182 2170735 2146327 2097003 2024007 1930925 1822691 1705036 1583907 1464534
49777 1464534 1350628 1244369 1146993 1059260 981438 913192 853737 802160 757536 718846 685032
49766 685032 655294 629263 606816 587667 571196 556705 543789 532371 522357 513414 505298 498316
$$ packed form
49851E15051k263k612k407j980j711j475j113r19j095j152n11O14J574K197K615
49836E04813K587J823Q83Q37J944L325M130M443M859N692O838P977Q834R452J0317
49821E78754J1917J4209J6822J9606K2676K5975K9321L2799L6738M1390M6990
49810H77197N3911O2167P0870P8754Q5273R0486R3930R4330R0636Q2849P1793
49799A752196N8884M6238L6104K9473K5738K4092K4682K7743L2071L5134L4500
49788B126855K8639J6688j447k4408m9324p2996r3082j08234j17655j21129j19373
49777A464534j13906j06259r7376q7733p7822o8246n9455n1577m4624l8690l3814
49766F85032k9738k6031k2447j9149j6471j4491j2916j1418j0014q943q116o982
$$ plain form
49754 498316 493100 489771 487565 485495 483218 480978 478898 476681 474017 470968 467947 465558 464367 464504
49740 464504 465363 466025 466097 465969 466212 467004 468260 469959 472085 474388 476388 477562 477468 475907 473186 470134
49724 470134 467630 466039 465110 464363 463541 462702 461953 461187 460208 459120 458381 458286 458592 458889 459218 459976 461249 462549
49706 462549 463321 463525 463715 464687 466921 470039 472867 474423 474908 475400 476548 477975 479105 480105 481643 483898
49690 483898 486200 487618 487758 487012 486160 485741 485761 485918 485932 485577 484640 483187 481756 480988 481040 481587 482271 482901
49672 482901 483355 483658 484082 484779 485443 485762 486102 487140 488829 490287 490848 490673 490240 489833 489734 490295 491436 492557
49654 492557 493308 494032 495160 496582 497937 499094 499994 500466 500604 500940 501788 502706 503002 502508 501541 500437 499547
49637 499547 499341 500039 501334 502887 504840 507444 510407 513082 515113 516504 517301 517666 518097 519061 520428 521657
$$ packed form
49754D98316n216l329k206k070k277k240k080k217k664l049l021k389j191J37
49740D64504Q59O62P2j28K43P92J256J699K126K303K000J174r4j561k721l052
49724D70134k504j591r29p47q22q39p49p66r79j088p39r5L06K97L29P58J273J300
49706D62549P72K04J90R72K234L118K828J556M85M92J148J427J130J000J538K255
49690D83898K302J418J40p46q52m19K0J57J4l55r37j453j431p68N2N47O84O30
49672D82901M54L03M24O97O64L19L40J038J689J458N61j75m33m07r9N61J141J121
49654D92557P51P24J128J422J355J157R00M72J38L36Q48R18K96m94r67j104q90
49637D99547k06O98J295J553J953K604K963K675K031J391P97L65M31R64J367J229
$$ plain form
49621 521657 522440 522874 523212 523842 525344 528013 531400 534785 538081 541871 546514 551686 556854 561921 567315
$$ packed form
49621E21657P83M34L38O30J502K669L387L385L296L790M643N172N168N067N394
$$ [...]
##END NTUPLES=NMR SPECTRUM
##END=
