##TITLE=NES1045_Brazil_9268490_HpCFHjx8nf
##JCAMPDX= 6.0         $$ Bruker NMR JCAMP-DX V2.0
##DATA TYPE= NMR SPECTRUM
##DATA CLASS= NTUPLES
##ORIGIN= BRUKER
##OWNER= Administrator
$$ 1.72 TOPSPIN		Version 2.1
$$ 2015-07-12 00:59:00.269 -0700  Administrator@X
$$ Compression mode = diff/dup
##.OBSERVE FREQUENCY= 400.02188249412
##.OBSERVE NUCLEUS= ^1H
##.ACQUISITION MODE= SIMULTANEOUS (DQD)
##.ACQUISITION SCHEME= undefined
##.AVERAGES= 64
##.DIGITISER RES= 22
##SPECTROMETER/DATA SYSTEM= spect
##.PULSE SEQUENCE= noesygpps1d.comp
##.SOLVENT NAME= COFFEE_meoh
##.SHIFT REFERENCE= INTERNAL, COFFEE_meoh, 1, 14.96387
##AUDIT TRAIL= $$ (NUMBER, WHEN, WHO, WHERE, PROCESS, VERSION, WHAT)
$$ ##TITLE= Audit trail, TOPSPIN		Version 2.1
$$ ##JCAMPDX= 5.01
$$ ##ORIGIN= Bruker BioSpin GmbH
$$ ##OWNER= Administrator
$$ $$ E:\/data/COFFEE/nmr/NES1045_Brazil_9268490_HpCFHjx8nf/12/pdata/1/auditp.txt
$$ ##AUDIT TRAIL=  $$ (NUMBER, WHEN, WHO, WHERE, PROCESS, VERSION, WHAT)
(   1,<2015-07-12 00:58:54.660 -0700>,<Administrator>,<X>,<go>,<TOPSPIN 2.1>,
      <created by zg
	started at 2015-07-12 00:47:25.206 -0700,
	POWCHK enabled, PULCHK disabled,
       configuration hash MD5:
       21 0F 79 D6 B3 7B B4 F6 88 20 88 DB 03 48 BD 9F
       data hash MD5: 64K
       2C 93 AB 48 87 D3 86 64 89 E9 6F 8F 90 E6 2F 72>)
(   2,<2015-07-12 00:58:58.191 -0700>,<Administrator>,<X>,<proc1d>,<TOPSPIN 2.1>,
      <Start of raw data processing
       efp LB = 0.3 FT_mod = 6 PKNL = 1 PHC0 = 0 PHC1 = 0 SI = 128K 
       data hash MD5: 128K
       5D 44 09 9F 84 23 B3 1D BB 25 00 D5 D8 53 8E 79>)
(   3,<2015-07-12 00:58:59.066 -0700>,<Administrator>,<X>,<proc1d>,<TOPSPIN 2.1>,
      <pk PHC0 = -83.96851 PHC1 = 0 
       data hash MD5: 128K
       B0 FF C2 13 C8 BA 66 A7 A9 52 EF 32 9D 35 84 5C>)
(   4,<2015-07-12 00:58:59.456 -0700>,<Administrator>,<X>,<proc1d>,<TOPSPIN 2.1>,
      <abs ABSG = 1 
       data hash MD5: 128K
       68 88 7E FA 36 DE 62 95 FA 85 72 8B 6A E2 14 78>)
(   5,<2015-07-12 00:58:59.550 -0700>,<Administrator>,<X>,<proc1d>,<TOPSPIN 2.1>,
      <abs ABSG = 2 
       data hash MD5: 128K
       63 47 86 B1 91 05 70 4D 3D A4 00 85 F5 12 E6 47>)
(   6,<2015-07-12 00:58:59.628 -0700>,<Administrator>,<X>,<proc1d>,<TOPSPIN 2.1>,
      <abs ABSG = 3 
       data hash MD5: 128K
       A0 AA D2 AA F0 05 3C 1F 59 47 C6 11 D7 51 6A 81>)
(   7,<2015-07-12 00:58:59.722 -0700>,<Administrator>,<X>,<proc1d>,<TOPSPIN 2.1>,
      <abs ABSG = 4 
       data hash MD5: 128K
       F4 E2 74 54 E6 D4 A3 27 71 E8 65 53 80 95 43 7C>)
(   8,<2015-07-12 00:58:59.831 -0700>,<Administrator>,<X>,<proc1d>,<TOPSPIN 2.1>,
      <abs ABSG = 5 
       data hash MD5: 128K
       C9 42 B1 06 72 C6 E6 AE 85 25 7F 72 2D 36 41 FD>)
$$ ##END=
$$ 
$$ $$ hash MD5
$$ $$ 98 F4 E1 E3 F4 5A 75 10 FF DC DA 1C 34 E7 16 AC
##$RELAX= 
##$RELAX= 
##$RELAX= 
##$RELAX= 
##$RELAX= 
##$RELAX= 
##$RELAX= 
##$RELAX= 
$$ Bruker specific parameters
$$ --------------------------
##$DU= <E:\>
##$EXPNO= 12
$$ [...]
##$TP07= 0
##$TPNAME0= <>
##$TPNAME1= <>
##$TPNAME2= <>
##$TPNAME3= <>
##$TPNAME4= <>
##$TPNAME5= <>
##$TPNAME6= <>
##$TPNAME7= <>
##$TPOAL= (0..7)
0.5 0.5 0.5 0.5 0.5 0.5 0.5 0.5
##$TPOFFS= (0..7)
0 0 0 0 0 0 0 0
##$TUNHIN= 0
##$TUNHOUT= 0
##$TUNXOUT= 0
##$USERA1= <user>
##$USERA2= <user>
##$USERA3= <user>
##$USERA4= <user>
##$USERA5= <user>
##$V9= 5
##$VALIST= <valist>
##$VCLIST= <CCCCCCCCCCCCCCC>
##$VD= 0
##$VDLIST= <DDDDDDDDDDDDDDD>
##$VPLIST= <PPPPPPPPPPPPPPP>
##$VTLIST= <TTTTTTTTTTTTTTT>
##$WBST= 2048
##$WBSW= 25
##$XGAIN= (0..3)
0 0 0 0
##$XL= 0
##$YL= 0
##$YMAX_a= 8226875
##$YMIN_a= -15446883
##$ZGOPTNS= <>
##$ZL1= 120
##$ZL2= 120
##$ZL3= 120
##$ZL4= 120
##$ABSF1= 14.96387
##$ABSF2= -5.594312
##$ABSG= 5
##$ABSL= 3
##$ALPHA= 0
##$AQORDER= 0
##$ASSFAC= 0
##$ASSFACI= 0
##$ASSFACX= 0
##$ASSWID= 0
##$AUNMP= <proc_prof1d_extract.lims>
##$AXLEFT= 0
##$AXNAME= <>
##$AXNUC= <1H>
##$AXRIGHT= 0
##$AXTYPE= 0
##$AXUNIT= <>
##$AZFE= 0.1
##$AZFW= 0.1
##$BCFW= 0
##$BC_mod= 0
##$BYTORDP= 0
##$COROFFS= 0
##$CY= 15
##$DATMOD= 1
##$DC= 0
##$DFILT= <>
##$DTYPP= 0
##$F1P= 0
##$F2P= 0
##$FCOR= 0.5
##$FTSIZE= 131072
##$FT_mod= 6
##$GAMMA= 0
##$GB= 0
##$INTBC= 1
##$INTSCL= 1
##$ISEN= 128
##$LB= 0.3
##$LEV0= 0
##$LPBIN= 0
##$MAXI= 10000
##$MC2= 0
##$MEAN= 0
##$ME_mod= 0
##$MI= 0
##$NCOEF= 0
##$NC_proc= -2
##$NLEV= 6
##$NOISF1= 0
##$NOISF2= 0
##$NSP= 0
##$NTH_PI= 0
##$NZP= 0
##$OFFSET= 14.96387
##$PC= 1
##$PHC0= -83.96851
##$PHC1= 0
##$PH_mod= 1
##$PKNL= yes
##$PPARMOD= 0
##$PPDIAG= 0
##$PPIPTYP= 0
##$PPMPNUM= 2147483647
##$PPRESOL= 1
##$PSCAL= 4
##$PSIGN= 0
##$PYNMP= <proc.py>
##$REVERSE= no
##$SF= 400.020008486796
##$SI= 131072
##$SIGF1= 0
##$SIGF2= 0
##$SINO= 400
##$SIOLD= 131072
##$SPECTYP= <>
##$SREGLST= <1H.CDCl3>
##$SSB= 0
##$STSI= 131072
##$STSR= 0
##$SW_p= 8223.68421052631
##$SYMM= 0
##$S_DEV= 0
##$TDeff= 65536
##$TDoff= 0
##$TI= <>
##$TILT= no
##$TM1= 0
##$TM2= 0
##$TOPLEV= 0
##$USERP1= <user>
##$USERP2= <user>
##$USERP3= <user>
##$USERP4= <user>
##$USERP5= <user>
##$WDW= 1
##$XDIM= 131072
##$YMAX_p= 384620598
##$YMIN_p= -12125
##$CURPLOT= <Network HP LaserJet P1505>
##$CURPRIN= <$Network HP LaserJet P1505>
##$DFORMAT= <normdp>
##$LAYOUT= <+/1D_H.xwp>
##$LFORMAT= <normlp>
##$PFORMAT= <normpl>
##$SURQMSG= 1
$$ End of Bruker specific parameters
$$ ---------------------------------
##NTUPLES= NMR SPECTRUM
##VAR_NAME=  FREQUENCY,     SPECTRUM/REAL,   SPECTRUM/IMAG
##SYMBOL=    X,             R,               I
##VAR_TYPE=  INDEPENDENT,   DEPENDENT,       DEPENDENT
##VAR_FORM=  AFFN,          ASDF,            ASDF
##VAR_DIM=   131072,        131072,          131072
##UNITS=     HZ,            ARBITRARY UNITS, ARBITRARY UNITS
##FACTOR=    0.0627417313425164, 1,          1
##FIRST=     8223.62146879497, 2985,         -58065
##LAST=      0,             5972,            -57974
##MIN=       0,             -12125,          0
##MAX=       8223.62146879497, 384620598,    0
$$ Real data points
##PAGE= N=1
##DATA TABLE= (X++(R..R)), XYDATA
$$ [...]
63351C00984p909p552o527n345m475l757k863k082k046k791l550l641l186k727
63337B42533k435k010j279n67k84m22o60q64j112j218o64O96K176K894K741K306
63321B41831J954J452N58m59j138j298j066o70l72l35m38m51n10r97j804k246
63305B34011j983j553j544j648j209m32k11p81j290r71r8N39P05P47Q57Q04L96
63288B26339j38l51n5M82P67N20q0n91p04m62j67j45m98r39r80m45K77O92P48
63269B24270P30P25O05M67O12R48Q91J27q21j093m32O97J714K348K590K575K565
63252B39518K788L164L384L273K996K807K778K811K870L090L665M616N733O731
63238B90224P456P951Q401R047J0112J1586J3126J4314J5039J5522J5925J6131
$$ plain form
63351 300984 293075 285523 278996 273651 269176 265419 262556 260474 258428 255637 252087 248446 245260 242533
63337 242533 240098 238088 236809 236242 235958 235536 234876 234012 232900 231682 231018 231714 233890 236784 239525 241831
63321 241831 243785 245237 245795 245336 244198 242900 241834 241164 240792 240457 240019 239568 239058 238061 236257 234011
63305 234011 232028 230475 228931 227283 226074 225642 225431 224650 223360 222389 222291 222830 223535 224282 225139 225943 226339
63288 226339 226201 225850 225795 226277 227044 227564 227484 226893 226189 225727 225560 225415 224917 223978 222998 222553 222830 223522 224270
63269 224270 225000 225725 226330 226797 227409 228357 229248 229375 228554 227461 227029 227726 229440 231788 234378 236953 239518
63252 239518 242306 245470 248854 252127 255123 257930 260708 263519 266389 269479 273144 277760 283493 290224
63238 290224 297680 305631 314032 323079 333191 344777 357903 372217 387256 402778 418703 434834
63226D34834J5976J5493J4829J4156J3791J4104J5064J5998J6177J5594J4840
63215F00856J4275J3717J3042J2607J2758J3089J2638J0797P775M198N08l156
63203G13104o785j0391j3891j6933j8928j9562j9223j8662j8235j7661j6543j4878
63191E21412j2913j0805q562o240l950j760K94K134L803N565P618R774J1548J2652
63177E30570J3184J3437J3621J3788J3868J3782J3593J3468J3378J3066J2454
63166F78209J1902J1702J1517J0733R282P664O118M304J871j123m498q186j1881
63153G27614j4941j7020j8474j9792k0930k1526k1553k1308k0951k0382j9461
63142E11276j8028j5937j3426j1215r804q816p516n864m512l790l268k512j758
$$ plain form
63226 434834 450810 466303 481132 495288 509079 523183 538247 554245 570422 586016 600856
63215 600856 615131 628848 641890 654497 667255 680344 692982 703779 711554 715752 716260 713104
63203 713104 706319 695928 682037 665104 646176 626614 607391 588729 570494 552833 536290 521412
63191 521412 508499 497694 489132 482892 478942 477182 477476 479610 483413 488978 496596 506370 517918 530570
63177 530570 543754 557191 570812 584600 598468 612250 625843 639311 652689 665755 678209
63166 678209 690111 701813 713330 724063 733345 741009 747127 751431 753302 752179 747681 739495 727614
63153 727614 712673 695653 677179 657387 636457 614931 593378 572070 551119 530737 511276
63142 511276 493248 477311 463885 452670 442866 434050 426534 420670 416158 412368 409100 406588 404830
63129D04830j556k052k877l472l399k582j567j197j726k383k184j123k07k84j147
63114C77074j941k175k005j634r84j04N21N01J99L33R59J408J368J403K088L143
63098C80154L874M048L819L204K316J868K596M122N146M951M133L623L576L560
63084D30990L340L050K878K928L203L459L296K606J842J574J999K881L790M327
63070D72163M425M512N063N910O385O244O055O459P559R171J1121J2992J4209
63057E72268J4904J6078J8269K0598K1970K2760K4282K6753K8929K9881L0139
63046H26831L0667L1657L2772L3882L4824L5101L4446L3403L2664L2186L1551
63035A189984L0947L0916L1240L0978K9830K8705K8474K8603K7571K4391J9273
$$ plain form
63129 404830 403274 401222 398345 394873 391474 388892 387325 386128 384402 382019 379835 378712 378505 378221 377074
63114 377074 375133 372958 370953 369319 368335 368231 368752 369253 369452 369785 370744 372152 373520 374923 377011 380154
63098 380154 384028 388076 391895 395099 397415 399283 401879 406001 411147 416098 420231 423854 427430 430990
63084 430990 434330 437380 440258 443186 446389 449848 453144 455750 457592 459166 461165 464046 467836 472163
63070 472163 476588 481100 486163 492073 498458 504702 510757 517216 524775 533946 545067 558059 572268
63057 572268 587172 603250 621519 642117 664087 686847 711129 737882 766811 796692 826831
63046 826831 857498 889155 921927 955809 990633 1025734 1060180 1093583 1126247 1158433 1189984
63035 1189984 1220931 1251847 1283087 1314065 1343895 1372600 1401074 1429677 1457248 1481639 1500912
63024A500912J3037O268q41q219j5707k2990k9672l5448m0182m3778m6106m7127
63012A230147m6910m5444m2572l8479l3964k9844k6047k1778j6697j1494o988
63001I09930l162N63M389P982J1095J3815J6222J8302K0155K1902K3338K4119
62989A068650K4380K4700K5244K5485K4997K4100K3311K2511K1139J9008J6429
62978A319954J3582J0185N815L02o161j3014j9489k5184l0424l5808m1248m5867
62966A132643m8876n0280n0608n0258m9371m8068m6451m4408m1684l8220l4346
62955F30073l0584k7357k4846k2999k1559k0128j8317j5990j3496j1576j0789
62944D12432j0892j0978j0404r456q824q463p582n939m578m638n703o146n218
$$ plain form
63024 1500912 1513949 1520217 1519376 1511157 1495450 1472460 1442788 1407340 1367158 1323380 1277274 1230147
63012 1230147 1183237 1137793 1095221 1056742 1022778 992934 966887 945109 928412 916918 909930
63001 909930 906768 907331 911720 919702 930797 944612 960834 979136 999291 1021193 1044531 1068650
62989 1068650 1093030 1117730 1142974 1168459 1193456 1217556 1240867 1263378 1284517 1303525 1319954
62978 1319954 1333536 1343721 1349536 1349838 1343677 1330663 1311174 1285990 1255566 1219758 1178510 1132643
62966 1132643 1083767 1033487 982879 932621 883250 835182 788731 744323 702639 664419 630073
62955 630073 599489 572132 547286 524287 502728 482600 464283 448293 434797 423221 412432
62944 412432 401540 390562 380158 370702 361878 353415 345833 339894 335316 330678 324975 318829 313611
62931C13611l955l599l961m044l629l279l134k770k240k103k265j823n46M97L85
62916B77145l40n79k29J4j07l00n37j082j763k097k078k125k282k229k087k360
62900B56964k981l181k600j851j619j814j954j921j885j865j711j335p05N5M55
62885B32052Lj004j530r77P4O59N59K57J43K98P60J407J731J230J69n42l02N60
62867B35547J229J248Q64O10P10R09Q96P08N57M19J13k24k55J0J81J99N30J385
62849B45636K219K396J994J562J441J696K325L027L093K150Q79M17J031J913K241
62834B74020J985J606J414J394J381J261J134J240J599J879J851J758J894K156
62820B96572K348K647L203L652L627L597M255N212N283M286L529M006N000N219
$$ plain form
62931 313611 309656 306057 302096 298052 294423 291144 288010 285240 283000 280897 278632 276809 276263 276760 277145
62916 277145 276805 276226 275997 276011 275904 275604 275067 273985 272222 270125 268047 265922 263640 261411 259324 256964
62900 256964 253983 250802 248202 246351 244732 242918 240964 239043 237158 235293 233582 232247 231542 231597 232052
62885 232052 232055 231051 229521 228544 228618 229277 229836 230093 230236 230534 231294 232701 234432 235662 235831 235289 234987 235547
62867 235547 236776 238024 238888 239498 240208 241117 242013 242721 243278 243697 243810 243586 243331 243341 243522 243721 244251 245636
62849 245636 247855 250251 252245 253807 255248 256944 259269 262296 265389 267539 268418 268835 269866 271779 274020
62834 274020 276005 277611 279025 280419 281800 283061 284195 285435 287034 288913 290764 292522 294416 296572
62820 296572 298920 301567 304770 308422 312049 315646 319901 325113 330396 334682 338211 342217 347217 352436
62806C52436M633M317M806N580O086O525P452R030J0898J2477J3430J4054J5103
62793D66827J6963J9151K0990K2554K4541K7275L0290L2970L5131L6967L8867
62782G72526M1345M4658M8261N1062N2493N3026N3346N3372N2446N0177M6626
62771A319338M1794L5429K7472J8347Q710r20j0230j9068k7381l5026m1583m6590
62759A270292n0003n2232n3617n4146n3775n2761n1449m9876m7900m5523m2851
62748G16159l9810l6303l2603k9292k6653k4384k2083j9791j7846j6323j4836
62737D36235j2972j0780q803p565p068o845o484n907n112l923k313p09M25J205
62723C59384K055K873L132K932L282M860P045Q677R465J0076J1144J2742J4706
$$ plain form
62806 352436 357069 361386 366192 371772 377858 384383 391835 400865 411763 424240 437670 451724 466827
62793 466827 483790 502941 523931 546485 571026 598301 628591 661561 696692 733659 772526
62782 772526 813871 858529 906790 957852 1010345 1063371 1116717 1170089 1222535 1272712 1319338
62771 1319338 1361132 1396561 1424033 1442380 1451090 1450170 1439940 1420872 1393491 1358465 1316882 1270292
62759 1270292 1220289 1168057 1114440 1060294 1006519 953758 902309 852433 804533 759010 716159
62748 716159 676349 640046 607443 578151 551498 527114 505031 485240 467394 451071 436235
62737 436235 423263 412483 403680 396115 389047 382202 375718 369811 364699 360776 358463 357754 358179 359384
62723 359384 361439 364312 367444 370376 373658 378518 385563 394240 403705 413781 424925 437667 452373
62710D52373J6842J8916K0894K3138K5945K9001L1883L4859L8487M2389M5352
62699G80079M6879M7861M9273N0848N1560N0811M8530M4606L8964L2051K4517
62688A265979J6489P743j470j0342j8342k5636l2494l8744m3924m7826n0631n2622
62676I68180n3846n3915n2324m9147m5240m1543l8286l5230l2443l0237k8333
62665E07636k5860k2539j9334j7420j6818j6530j5840j4913j4102j3204j1740
62654C19336r715p739o452n974n990o099o075n834n423m909m233l192j820o96
62640B45185n34j283k010j960j451j326j727j923j403n64j24k81p07j099j348
62625B27445j358j033m11L57J108J706K055K220K446K874L439M060M786N610O362
$$ plain form
62710 452373 469215 488131 509025 532163 558108 587109 618992 653851 692338 734727 780079
62699 780079 826958 874819 924092 974940 1026500 1077311 1125841 1170447 1209411 1241462 1265979
62688 1265979 1282468 1290211 1288741 1278399 1260057 1234421 1201927 1163183 1119259 1071433 1020802 968180
62676 968180 914334 860419 808095 758948 713708 672165 633879 598649 566206 535969 507636
62665 507636 481776 459237 439903 422483 405665 389135 373295 358382 344280 331076 319336
62654 319336 309621 301882 295430 289456 283466 277367 271292 265458 260035 255126 250893 247701 245881 245185
62640 245185 244651 243368 241358 239398 237947 236621 234894 232971 231568 231004 230880 230599 229892 228793 227445
62625 227445 226087 225054 224643 225000 226108 227814 229869 232089 234535 237409 240848 244908 249694 255304 261666
62610B61666P014P830Q949R999J0556J0842J1525J2803J4177J5293J6555J8547
62598D05756K1094K3315K4545K4961K5187K5595K6075K6309K5998K4873K2768
62587F76476J9785J6301J2629Q754M565J76m242q811j3777j8743k2595k4518k4924
62574F21076k4982k5385k5951k6232k6033k5273k3856k1921j9884j8029j6349
62563C67181j4894j3902j3260j2280j0491q410p003o466o038n137m100l575l555
62550B58070l465l013k500k301k332k170j499l57R26J868K062J521P68M87R88
62535B49053K071L346M527N469O140O673P313Q166R160J0216J1336J2412J3279
62522C49161J4096J5332J7108J8877K0168K1419K3415K5981K7899K8301K7570
$$ plain form
62610 261666 268680 276510 285459 295458 306014 316856 328381 341184 355361 370654 387209 405756
62598 405756 426850 450165 474710 499671 524858 550453 576528 602837 628835 653708 676476
62587 676476 696261 712562 725191 733945 738510 738686 734444 725633 711856 693113 670518 646000 621076
62574 621076 596094 570709 544758 518526 492493 467220 443364 421443 401559 383530 367181
62563 367181 352287 338385 325125 312845 302354 293944 286941 280475 274437 269300 265200 261625 258070
62550 258070 254605 251592 249092 246791 244459 242289 240790 240433 241359 243227 245289 246810 247578 248065 249053
62535 249053 251124 254470 258997 264466 270606 277279 284592 292758 301918 312134 323470 335882 349161
62522 349161 363257 378589 395697 414574 434742 456161 479576 505557 533456 561757 589327
62511E89327K6590K5578K4112K1878J8955J5474J1409O745J631l568q346j2399
62499G17386j5896j9121k1736k2987k2837k2401k2695k3362k3176k1535j8873
62488D82767j5912j3186j1174j0162r843r574r155q938r154r564r865r975r859
62475C46406r471q923q349p627o657n774n359n137m570l887l846m386m474l636
62461B64310k767k774l255l203k431j502p32j23L3n94j599k078j700j018o50p20
62445B39197j033j315j201m49P21J790K505L016L504L968M336M528M554M706N422
62430B74249O618P506P532P157P150P472P614P765Q695J0359J1598J1487J0352
62417C85554R045P906O869N975N220M203K496K78j739k928l165k864k706l116
$$ plain form
62511 589327 615917 641495 665607 687485 706440 721914 733323 740068 741699 738131 729785 717386
62499 717386 701490 682369 660633 637646 614809 592408 569713 546351 523175 501640 482767
62488 482767 466855 453669 442495 432333 422490 412916 403761 394823 385669 376105 366240 356265 346406
62475 346406 336935 328012 319663 312036 305379 299605 294246 289109 284539 280652 276806 272420 267946 264310
62461 264310 261543 258769 255514 252311 249880 248378 247646 247523 247556 246962 245363 243285 241585 240567 239917 239197
62445 239197 238164 236849 235648 235199 235920 237710 240215 243231 246735 250703 255039 259567 264121 268827 274249
62430 274249 280867 288373 295905 303062 310212 317684 325298 333063 341758 352117 363715 375202 385554
62417 385554 394599 402505 409374 415349 420569 424772 427268 427546 425807 422879 419714 416850 414144 411028
62403D11028l869m401m514m462m292l651k366p78Q04K437M041N149N656O391Q239
62388D15412J0873J3097J4391J5512J7369J9839K2050K3543K4746K6321K8353
62377F31506L0361L1921L2922L3175L2184K9761K6600K3667K0934J7380J2473
62366I22884P046K297j520m946q213j1019j3254j5200j6938j8090j8365j8045
62354H06637j7782j8045j8848j9736k0045j9465j8363j7342j6460j5285j3722
62343F11544j2349j1615j1049r796p828o104n349n035m049k104j11R67J101Q71
62329E39094O03K65q7l38p69j845l440m824n591o153p054q161q903q953q371p400
62313D68073o478o162o573p088o978o178n148m167l202k288j538q81k35J59Nm33
$$ plain form
62403 411028 407159 402758 398244 393782 389490 385839 383473 382695 383499 385936 389977 395126 400782 407173 415412
62388 415412 426285 439382 453773 469285 486654 506493 528543 552086 576832 603153 631506
62377 631506 661867 693788 726710 759885 792069 821830 848430 872097 893031 910411 922884
62366 922884 929930 932227 930707 925761 917548 906529 893275 878075 861137 843047 824682 806637
62354 806637 788855 770810 751962 732226 712181 692716 674353 657011 640551 625266 611544
62343 611544 599195 587580 576531 566735 558907 552803 547454 542419 538370 536266 536155 537122 538223 539094
62329 539094 539697 539962 539875 539537 538768 536923 533483 528659 523068 516915 509861 501700 492797 483844 475473 468073
62313 468073 461595 455433 448860 441772 434794 428616 423468 419301 416099 413811 412273 411392 411157 411316 411321 410888
62297D10888n02L3P73J287J530J594J555J688K390L637M845N568O026O716P756
62282D55784Q815R587J0070J0556J1458J3018J5010J6857J8192J9120J9838K0276
62270F28581K0328K0173K0007J9488J7873J4842J1002P434M813L032J589J29j371
62257G67920k787m080n304o532p729q702r214r204q864q350p480o046m373l161
62243F76094k626k142j081L12J259J484J425J572K004K601L258L866M408N046
62229F97480N818O338O210N714N500N672N682N313N136N644O528P217P701Q317
62215G84270R066R733J0450J1579J3109J4618J5810J6723J7466J8169J9201K0944
62203I61138K3206K5179K6195K6322K6100K5807K5096K3289K0031J5736J1389
$$ plain form
62297 410888 410386 410419 411192 412479 414009 415603 417158 418846 421236 424873 429718 435286 441312 448028 455784
62282 455784 464599 474186 484256 494812 506270 519288 534298 551155 569347 588467 608305 628581
62270 628581 648909 669082 689089 708577 726450 741292 752294 759728 764541 767573 769162 769291 767920
62257 767920 765133 761053 755749 749217 741488 732786 723572 714368 705504 697154 689674 683628 679255 676094
62243 676094 673468 671326 670245 670557 671816 673300 674725 676297 678301 680902 684160 688026 692434 697480
62229 697480 703298 709636 715846 721560 727060 732732 738414 743727 748863 754507 761035 768252 775953 784270
62215 784270 793336 803069 813519 825098 838207 852825 868635 885358 902824 920993 940194 961138
62203 961138 984344 1009523 1035718 1062040 1088140 1113947 1139043 1162332 1182363 1198099 1209488
62192A209488P818N255L616K964L362M472N811P364R543J2405J5284J7385J8482
62179A323249J8819J8678J8301J7958J7708J7183J6023J4472J3223J2644J2418
62168A500676J2068J1499J0879J0158R081P622O191N222M674M144L500L196L728
62155A592638M870N824O210O603P745R415J0579J0659J0225J0130J0402J0397
62143A695697R885R408R518J0074J0572J0836J1014J1007J0456R409Q599Q685
62131A815160R350R594R045Q432Q529R002Q886Q003P208P121P343P354P509Q490
62117A931026J0157J1731J2940J4205J5618J6567J6626J6038J5009J3148J0242
62106B083307P158N316N392O906Q835J0244J0497R474P618N532L586K046J231
$$ plain form
62192 1209488 1217306 1222561 1226177 1229141 1232503 1236975 1242786 1250150 1259693 1272098 1287382 1304767 1323249
62179 1323249 1342068 1360746 1379047 1397005 1414713 1431896 1447919 1462391 1475614 1488258 1500676
62168 1500676 1512744 1524243 1535122 1545280 1554361 1561983 1568174 1573396 1578070 1582214 1585714 1588910 1592638
62155 1592638 1597508 1603332 1609542 1616145 1623890 1633305 1643884 1654543 1664768 1674898 1685300 1695697
62143 1695697 1705582 1714990 1724508 1734582 1745154 1755990 1767004 1778011 1788467 1797876 1806475 1815160
62131 1815160 1824510 1834104 1843149 1851581 1860110 1869112 1877998 1886001 1893209 1900330 1907673 1915027 1922536 1931026
62117 1931026 1941183 1952914 1965854 1980059 1995677 2012244 2028870 2044908 2059917 2073065 2083307
62106 2083307 2090465 2095781 2101173 2108079 2116914 2127158 2137655 2147129 2154747 2160279 2163865 2165911 2167142
62093B167142J160J213P33k37j195k047l250n117p465r936j2201j3857j4640j4858
62079B085445j5167j5859j6657j7317j7938j8663j9462k0314k1210k1938k2251
62068A878669k2288k2409k2613k2679k2856k3667k4780k4931k3471k1340j9815
62057A627820j8896j7635j5617j3260j0874q365o011m697n087o987r800j3141
62045A497450j6776k0263k3043k4788k5529k5642k5702k6056k6319k5540k3203
62034A234589k0076j7740j7097j7464j7316j5909j3946j2523j1797j1090j0114
62023A069517r376r207r062q285p084o071n159l671j592J48R23J334K341L874
62009A018630M824M294K369l51l530p200j1321j5468j8979k1278k2138k1770k0667
$$ plain form
62093 2167142 2168302 2169515 2170248 2170011 2168816 2166769 2163519 2158402 2150937 2141001 2128800 2114943 2100303 2085445
62079 2085445 2070278 2054419 2037762 2020445 2002507 1983844 1964382 1944068 1922858 1900920 1878669
62068 1878669 1856381 1833972 1811359 1788680 1765824 1742157 1717377 1692446 1668975 1647635 1627820
62057 1627820 1608924 1591289 1575672 1562412 1551538 1543173 1537162 1532465 1527378 1520391 1510591 1497450
62045 1497450 1480674 1460411 1437368 1412580 1387051 1361409 1335707 1309651 1283332 1257792 1234589
62034 1234589 1214513 1196773 1179676 1162212 1144896 1128987 1115041 1102518 1090721 1079631 1069517
62023 1069517 1060141 1050934 1041872 1033587 1026503 1020432 1015273 1011602 1010010 1010158 1011081 1012415 1014756 1018630
62009 1018630 1023454 1027748 1030117 1029766 1026236 1019036 1007715 992247 973268 951990 929852 908082 887415
61996H87415j9351j8112j7006j5904j4541j2658j0355q264p006o341n257l250
61984G49370j215m25p43n91J077L494N152N679N931O618P545Q335R134J0266J1626
61969H21253J2840J3809J4761J5769J6585J7057J7442J8117J9029J9799K0386
61958A006847K1376K3314K5985K8714L1270L3946L6755L9232M1302M3827M7746
61947A380314N2890N8227O3197O8348P4593Q2204R0639R9095J06995J14042J19909
61936B310453J24040J25828J25059J22096J17841J13834J12321J15550J24654
61927C391676J39416J59160J83283K10676K39326K67202K93116L16036L33956
61918E533847L44125L44132L31983L05517K63056K05102J34698N6064k6441j07913
$$ plain form
61996 887415 868064 849952 832946 817042 802501 789843 779488 771224 764218 757877 752620 749370
61984 749370 748155 747730 746987 746396 747473 750967 756119 761798 767729 774347 781892 790227 799361 809627 821253
61969 821253 834093 847902 862663 878432 895017 912074 929516 947633 966662 986461 1006847
61958 1006847 1028223 1051537 1077522 1106236 1137506 1171452 1208207 1247439 1288741 1332568 1380314
61947 1380314 1433204 1491431 1554628 1622976 1697569 1779773 1870412 1969507 2076502 2190544 2310453
61936 2310453 2434493 2560321 2685380 2807476 2925317 3039151 3151472 3267022 3391676
61927 3391676 3531092 3690252 3873535 4084211 4323537 4590739 4883855 5199891 5533847
61918 5533847 5877972 6222104 6554087 6859604 7122660 7327762 7462460 7518524 7492083 7384170
61908G384170j82856k46620k96807l32988l55555l65382l64141l54178l37987
61899D547656l17877k95824k73215k50943k29840k10739j93810j78301j63309
61890B433798j48610j34504j21224j08944r7917q8122p8975o9958o1331n3744
61880A470469m7311m1595l6314l1472k6846k2070j7277j3091r730o683l498m28
61868A214154K075M186O531R418J2579J5627J8432K0948K2950K4073K4135K3314
61856A398422K1981K0359J8417J6115J3658J1356R298P397N758M798M899N978
61844A538436P569R176J0538J1587J2304J2685J2833J2955J3181J3382J3288J2943
61832A680877J2880J3852J6335K0401K5888L2532L9925M7403N3979N8465N9809
$$ plain form
61908 7384170 7201314 6954694 6657887 6324899 5969344 5603962 5239821 4885643 4547656
61899 4547656 4229779 3933955 3660740 3409797 3179957 2969218 2775408 2597107 2433798
61890 2433798 2285188 2150684 2029460 1920516 1822599 1734477 1655502 1585544 1524213 1470469
61880 1470469 1423158 1381563 1345249 1313777 1286931 1264861 1247584 1234493 1224763 1218080 1214582 1214154
61868 1214154 1216229 1220415 1226946 1236364 1248943 1264570 1283002 1303950 1326900 1350973 1375108 1398422
61856 1398422 1420403 1440762 1459179 1475294 1488952 1500308 1509606 1517003 1522761 1527559 1532458 1538436
61844 1538436 1546005 1555181 1565719 1577306 1589610 1602295 1615128 1628083 1641264 1654646 1667934 1680877
61832 1680877 1693757 1707609 1723944 1744345 1770233 1802765 1842690 1890093 1944072 2002537 2062346
61821B062346N7456N1492M2563L1918K1431J3041P870O079P676J3053K2351L4594
61809B371870M8130O1902P5956R0784J06711J23890J42366J61959J82479K04243
61799C570290K28003K54199K82657L13194L46051L81371M18621M56846M95166
61790F746398N32470N66759N95036O13508O17611O02235N62939M97450M06101
61781A1740507K91496J58610J5196j28981k64362l83458m81199n54636o03134
61772I790039o28563o34495o24883o03268n72790n36312m96392m55238m14606
61763D823492l75563l38578l04113k73019k45974k22609k01613j81889j63392
61754B516742j46785j32472j20102j08942r8568q9184q1180p4415o8191o2033
$$ plain form
61821 2062346 2119802 2171294 2213857 2245775 2267206 2280247 2288117 2294196 2301872 2314925 2337276 2371870
61809 2371870 2420000 2481902 2557858 2648642 2755353 2879243 3021609 3183568 3366047 3570290
61799 3570290 3798293 4052492 4335149 4648343 4994394 5375765 5794386 6251232 6746398
61790 6746398 7278868 7845627 8440663 9054171 9671782 10274017 10836956 11334406 11740507
61781 11740507 12032003 12190613 12205809 12076828 11812466 11429008 10947809 10393173 9790039
61772 9790039 9161476 8526981 7902098 7298830 6726040 6189728 5693336 5238098 4823492
61763 4823492 4447929 4109351 3805238 3532219 3286245 3063636 2862023 2680134 2516742
61754 2516742 2369957 2237485 2117383 2008441 1909873 1820689 1739509 1665094 1596903 1534870
61744A534870n6219n1258m7099m3333l9943l7223l5019l2688l0043k7626k5760
61733A108659k3923k1579j9119j7301j6110j4898j3527j2553j2230j2014j1388
61722I34017j0555r962r485q635p300n916m819l782k270n4K455M492N581N850
61708H89617N570M468J869k323p144j1331j4391j6551j7875j8002j6866j5186
61696G81855j3784j2655j1109q850o537n103m807n195n757o280o652o793o952
61683F81381p631q930j0133j0392r747r116r232r863j0265j0094r593r017q229
61670E59139p014n579m532m259m540m856m924m795m527m083l537l061k667k292
61656D98473k224k984m505n841o069n265m192l342k744k441k527k767k788k647
$$ plain form
61744 1534870 1478651 1427393 1380294 1336961 1297018 1259795 1224776 1192088 1162045 1134419 1108659
61733 1108659 1084736 1063157 1044038 1026737 1010627 995729 982202 969649 957419 945405 934017
61722 934017 923462 913500 904015 895380 888080 882164 877345 873563 871293 871239 873694 878186 883767 889617
61708 889617 895187 899655 901524 899201 892057 880726 866335 849784 831909 813907 797041 781855
61696 781855 768071 755416 744307 735457 728920 723817 719010 713815 708058 701778 695126 688333 681381
61683 681381 673750 664820 654687 644295 634548 625432 616200 606337 596072 585978 576385 567368 559139
61670 559139 552125 546546 542014 537755 533215 528359 523435 518640 514113 510030 506493 503432 500765 498473
61656 498473 496249 493265 488760 482919 476850 471585 467393 464051 461307 458866 456339 453572 450784 448137
61642D48137k674k754k433j761j341j367j290p77l20m32p95p44k45K37M48M85
61626D32374M82N90R84J472J381L49j048j991k357k424k095j214l70m08j175j642
61610D22908j270l95P53K335L910M320L197J758J301J677K035K334L148M324N070
61595D57405N223N475O183O896P261P619Q263Q859R036R103R669J0792J1968J2850
61581E76602J3648J4879J6850J9382K1936K4124K6028K7870K9452L0255L0094
61570H31120K9199K7610K4967K1148J6719J2416Q552N130K249L2j547k488k669
61557I72438k230j626r44L79K598M886O167O462O655P105P372P196O824O266N107
61542A034655L407J875P33p60l067n370o504o370n684m846l832k860k233j653
$$ plain form
61642 448137 445463 442709 440276 438515 437174 435807 434517 433740 433420 432988 432193 431449 431204 431441 431889 432374
61626 432374 432856 433446 434430 435902 437283 437632 436584 434593 432236 429812 427717 426503 426133 425725 424550 422908
61610 422908 421638 421243 421996 424331 428241 432561 435758 437516 438817 440494 442529 444863 448011 452335 457405
61595 457405 462628 468103 474286 481182 488443 496062 504325 513184 522220 531323 540992 551784 563752 576602
61581 576602 590250 605129 621979 641361 663297 687421 713449 741319 770771 801026 831120
61570 831120 860319 887929 912896 934044 950763 963179 971731 976861 979110 979142 977595 975107 972438
61557 972438 970208 968582 967638 968017 970615 975501 981668 988130 994785 1001890 1009262 1016458 1023282 1029548 1034655
61542 1034655 1038062 1039937 1040670 1039910 1036843 1031473 1024969 1018599 1012915 1008069 1004237 1001377 999144 997491
61528I97491m48J517L799O189Q839J1623J4212J6864K0347K4712K8931L2181L5005
61515A201262L8641M3636M9669N6356O3656P1529P9738Q8086R6501J04866J13031
61504B006971J21008J28840J36170J42175J46074J47635J47107J44692J40256
61495C260928J33449J23992J11737R6667P9102N9911M0365K1609M460j0415k2489
61484C899316l1777l8958m4794m9669n3907n8250o3503o9773p6457q2944q8865
61473C240419r3711r6691r7109r4667q9443q1933p3120o4006n4943m5747l6542
61462B412507k7988k0567j4120q325l260Q51M075O682Q832J0670J2536J4728J7258
61449B413879J9912K2596K5455K8780L2814L7454M2233M6816N1480N6598O1679
$$ plain form
61528 997491 997043 998560 1002359 1008548 1017387 1029010 1043222 1060086 1080433 1105145 1134076 1166257 1201262
61515 1201262 1239903 1283539 1333208 1389564 1453220 1524749 1604487 1692573 1789074 1893940 2006971
61504 2006971 2127979 2256819 2392989 2535164 2681238 2828873 2975980 3120672 3260928
61495 3260928 3394377 3518369 3630106 3726773 3805875 3865786 3906151 3927760 3932220 3921805 3899316
61484 3899316 3867539 3828581 3783787 3734118 3680211 3621961 3558458 3488685 3412228 3329284 3240419
61473 3240419 3146708 3050017 2952908 2858241 2768798 2686865 2613745 2549739 2494796 2449049 2412507
61462 2412507 2384519 2363952 2349832 2341507 2338247 2339098 2343173 2349855 2358687 2369357 2381893 2396621 2413879
61449 2413879 2433791 2456387 2481842 2510622 2543436 2580890 2623123 2669939 2721419 2778017 2839696
61438B839696O5387O6659O5315O1359N4393M4189L1496J7784M408p718j7965k6054
61426C198949l2089l6186l8227l8217l6587l3733k9514k3654j6499r035k304K857
61414B905761N740N858L183j883q578j5672k1668k5670k7870k8805k8399k6240
61402B735757k2713j9139j6629j5124j3715j1650q916n995l190j40L918R324J5623
61389B647411K2146K8746L5732M3397N1908O1474P2205Q3861R6001J08330J20617
61378C371828J32432J43151J52074J58312J60730J58327J50611J37519J19280
61369D684264R6636P0958M3839J6580r849l4777n7932p9119r7649j12626j24174
61358D396151j33674j42092j48661j51978j51935j49691j46087j41120j34849
$$ plain form
61438 2839696 2905083 2971742 3037057 3098416 3152809 3196998 3228494 3246278 3250686 3242968 3225003 3198949
61426 3198949 3166860 3130674 3092447 3054230 3017643 2983910 2954396 2930742 2914243 2905208 2902904 2905761
61414 2905761 2911501 2917359 2920542 2918659 2910081 2894409 2872741 2847071 2819201 2790396 2761997 2735757
61402 2735757 2713044 2693905 2677276 2662152 2648437 2636787 2627871 2621876 2618686 2618546 2622464 2631788 2647411
61389 2647411 2669557 2698303 2734035 2777432 2829340 2890814 2963019 3046880 3142881 3251211 3371828
61378 3371828 3504260 3647411 3799485 3957797 4118527 4276854 4427465 4564984 4684264
61369 4684264 4780900 4851858 4895697 4912277 4902428 4867651 4809719 4730600 4632951 4520325 4396151
61358 4396151 4262477 4120385 3971724 3819746 3667811 3518120 3372033 3230913 3096064
61349C096064j27804j20308j12206j03427r4200q4663p4865o5162n5972m7104
61339B210353l8023k8782j9984j1740l464N111J3368K0487K6032K9709L1257L0815
61327B265139K8814K5229J9701J2622N510r5l651n452o101o358o772p084o585
61314B314917n259l944l075k059k51K210N008Q277J1993J5393J7675J8862J9325
61301B399072J9048J7910J6196J4000J0673N608o42o723j1792j5770j8634k0189
61289B408757k0491j9882j8598j6851j5151j4128j4079j5178j7756k1817k6328
61278B208498k9690l1024l0593k8998k6450k2947j8744j4445j0662p546m585j078
61266A981736L012O883R713J1364J2149J2384J2503J3130J4631J6875J9840K3931
$$ plain form
61349 3096064 2968260 2847952 2735746 2632319 2538119 2453456 2378591 2313429 2257457 2210353
61339 2210353 2172330 2143548 2123564 2111824 2108360 2113471 2126839 2147326 2173358 2203067 2234324 2265139
61327 2265139 2293953 2319182 2338883 2351505 2357015 2356920 2353269 2347817 2341716 2335358 2328586 2321502 2314917
61314 2314917 2309658 2305714 2302639 2300580 2300329 2302539 2307547 2315824 2327817 2343210 2360885 2379747 2399072
61301 2399072 2418120 2436030 2452226 2466226 2476899 2482507 2481865 2475142 2463350 2447580 2428946 2408757
61289 2408757 2388266 2368384 2349786 2332935 2317784 2303656 2289577 2274399 2256643 2234826 2208498
61278 2208498 2178808 2147784 2117191 2088193 2061743 2038796 2020052 2005607 1994945 1987399 1982814 1981736
61266 1981736 1984748 1991631 2001344 2012708 2024857 2037241 2049744 2062874 2077505 2094380 2114220 2138151
61254B138151K9261L5110M0699M6138N1883N7677O2882O7624P2712P8432Q4202
61243B764771Q9335R3256R4763R1925Q3103O7853M6679K0548r036l9755o8590
61232C234852r2396j08928j17861j20635j18753j12549j02035q8476p3869n9052
61222B240298m3459k7076j1545J072R607J3294J1058K502j0796k5891m0362n3042
61210B065660o3201o9986p2956p2705p0601o7881o4944o1399n6892n1844m7077
61199A366174m2740l8169l3131k8551k5341k2903j9706j5289j0876p758n797m006
61187A111907k006l04P10J342K082L022L978M935O123P787R981J2388J4143J4083
61173A190171J1471O421m57q547j7045k4687l0330l3862l5974l6973l6510l4639
$$ plain form
61254 2138151 2167412 2202522 2243221 2289359 2341242 2398919 2461801 2529425 2602137 2680569 2764771
61243 2764771 2854106 2947362 3042125 3134050 3217153 3285006 3331685 3352233 3343197 3303442 3234852
61232 3234852 3142456 3033528 2915667 2795032 2676279 2563730 2461695 2373219 2299350 2240298
61222 2240298 2196839 2169763 2158218 2159290 2168897 2182191 2193249 2195751 2184955 2159064 2118702 2065660
61210 2065660 2002459 1932473 1859517 1786812 1716211 1648330 1583386 1521987 1465095 1413251 1366174
61199 1366174 1323434 1285265 1252134 1223583 1198242 1175339 1155633 1140344 1129468 1121710 1115913 1111907
61187 1111907 1109901 1109597 1110307 1111649 1113731 1116753 1120731 1125666 1131789 1139576 1149557 1161945 1176088 1190171
61173 1190171 1201642 1208063 1207606 1199059 1182014 1157327 1126997 1093135 1057161 1020188 983678 949039
61161I49039l2365l0540k8831k6436k3510k1041j9527j8532j7575j6682j5920
61150F98080j5021j3797j2495j1423j0520r544q410p170n878m594l400k188o82
61137E92958J289L611O066Q460J0620J2397J3777J4706J4813J3530J0577O220
61125G09024J056m258r068j2921j5748j7676j8618j8296j6788j4731j2864j1451
61113E57661j0275r012p542o058m972m574m683m721m234l314k391j711j050k7
61099D93097J302K323K544K262K268K880L634M001M020M021M184M602N412O458
61085E43008P254P611P913Q396Q644Q369Q147Q589R218Q989P753O313N164M122
61071F49490L226K983L486M038L995L383K540J770J505K060L013L541L628M249
$$ plain form
61161 949039 916674 886134 857303 830867 807357 786316 766789 748257 730682 714000 698080
61150 698080 683059 669262 656767 645344 634824 625280 616870 609700 603822 599228 595828 593640 592958
61137 592958 594247 597858 603924 612384 623004 635401 649178 663884 678697 692227 702804 709024
61125 709024 710080 705822 696754 683833 668085 650409 631791 613495 596707 581976 569112 557661
61113 557661 547386 538374 530832 524774 519802 515228 510545 505824 501590 498276 495885 494174 493124 493097
61099 493097 494399 496722 499266 501528 503796 506676 510310 514311 518331 522352 526536 531138 536550 543008
61085 543008 550262 557873 565786 574182 582826 591195 599342 607931 617149 626138 633891 640204 645368 649490
61071 649490 652716 655699 659185 663223 667218 670601 673141 674911 676416 678476 681489 685030 688658 692907
61057F92907O016Q282J0018J0954J1477J2040J3059J4786J6899J8660J9903K1279
61045H56280K3165K4945K5950K6492K7362K8709L0021L0869L1133L0804L0147
61034A165877K9798L0200L1156L2279L3612L5463L8011M1461M6128N1887N7884
61023A593756O3307O8146P2824P7576Q2669Q8821R6671J06236J17471J31029J47692
61012B646198J67376J89336K13171K38992K67073K98354L35206L80793M37495
61003E173994N06679N89958O89791Q08883R50301J119335J324599J575760J878023
60994A4617323K225023K590434K919492L127343L116396K817625K239222J487809
60986C5140667P37050J56389j55435j95543m2106J74965L04599K14146j60535
$$ plain form
61057 692907 698923 707205 717223 728177 739654 751694 764753 779539 796438 815098 835001 856280
61045 856280 879445 904390 930340 956832 984194 1012903 1042924 1073793 1104926 1135730 1165877
61034 1165877 1195675 1225875 1257031 1289310 1322922 1358385 1396396 1437857 1483985 1535872 1593756
61023 1593756 1657063 1725209 1798033 1875609 1958278 2047099 2143770 2250006 2367477 2498506 2646198
61012 2646198 2813574 3002910 3216081 3455073 3722146 4020500 4355706 4736499 5173994
61003 5173994 5680673 6270631 6960422 7769305 8719606 9838941 11163540 12739300 14617323
60994 14617323 16842346 19432780 22352272 25479615 28596011 31413636 33652858 35140667
60986 35140667 35877717 36034106 35878671 35683128 35641022 35815987 36120586 36334732 36174197
60977C6174197p79729j511098k188909k684477k945008k987263k865269k639552
60969A7572892k361003k066470j779388j512667j272858j063254q84476p34416
60961E898360o09751n07831m26507l62632l12026k71123k37732k10172j86653
60952B773933j65815j46969j29539j13046r7883q5185p5540o8513o3712o1343
60942A766388o1159o1811o1922o1152n9554n6741n2528m7772m3547l9918l6372
60931A183912l3041l0523k8743k7030k5216k3701k2468k0963j9076j7385j6210
60920I19556j5276j4398j3801j3422j2722j1600j0883j1313j2513j3476j3741
60909G76411j3601j3435j3372j3429j3510j3333j2665j1648j0599r526q161o426
$$ plain form
60977 36174197 35394468 33883370 31694461 29009984 26064976 23077713 20212444 17572892
60969 17572892 15211889 13145419 11366031 9853364 8580506 7517252 6632776 5898360
60961 5898360 5288609 4780778 4354271 3991639 3679613 3408490 3170758 2960586 2773933
60952 2773933 2608118 2461149 2331610 2218564 2120681 2035496 1959956 1891443 1827731 1766388
60942 1766388 1705229 1643418 1581496 1520344 1460790 1404049 1351521 1303749 1260202 1220284 1183912
60931 1183912 1150871 1120348 1091605 1064575 1039359 1015658 993190 972227 953151 935766 919556
60920 919556 904280 889882 876081 862659 849937 838337 827454 816141 803628 790152 776411
60909 776411 762810 749375 736003 722574 709064 695731 683066 671418 660819 651293 643132 636706
60897F36706m644l218k321j861j597j198l55J033K694M020M352L481J927O20J94
60882F39833N25R70Q95Q8j116k054k260j919j560j260n51P04J817K089J780J695
60866F39676J987K112J953K161L112M213M758M911N220N508M983L395J359n00
60852F84848k208l982n634o762p361p885q708r651j0102r717q975q798r389r828
60838E75848r180p805o921o992p269o997o336n748n225m609m123l976l805l177
60824D93685k370k013k088j964j390p95n38m62l04p4K63R31J905K641K672K233
60808D92332K010K337K942L370L442L246K935K632K419K294K118J774J434J539
60794E26824K292L249L690L431K965K693K449J964J479J423J716J791J267K07
$$ plain form
60897 636706 632062 628844 626523 624662 623065 621867 621512 622545 625239 629259 633611 637092 639019 639639 639833
60882 639833 640358 641328 642223 642311 641195 639141 636881 634962 633402 632142 631591 632295 634112 636201 637981 639676
60866 639676 641663 643775 645728 647889 651001 655214 659972 664883 670103 675611 680594 683989 685348 684848
60852 684848 682640 678658 673024 666262 658901 651016 642308 632657 622555 612838 603863 595065 585676 575848
60838 575848 566668 558863 551942 544950 537681 530684 524348 518600 513375 508766 504643 500667 496862 493685
60824 493685 491315 489302 487214 485250 483860 483065 482527 482065 481761 481687 481950 482881 484786 487427 490099 492332
60808 492332 494342 496679 499621 502991 506433 509679 512614 515246 517665 519959 522077 523851 525285 526824
60794 526824 529116 532365 536055 539486 542451 545144 547593 549557 551036 552459 554175 555966 557233 557440
60780E57440j131k498l611m359m952n588o025n923n498n387n768o104n889n245
60766D89462m666m450m553m679m355l294j863q75p46j112j463j782k313k973l415
60751D46923l484l290k903k284j518q56m35k08r0p7q6J39Q03J744K475K572K011
60734D41436J092J89l80m59l59q07k192l925n072n636o433p578p935o761n086
60719C90094m553n346o256o431o037n339m336l407l200l556l488k603j592r63
60705C32987l17N54R02K78l57J86J625K751L274L953N032N728N419M469L513K707
60689C72704K035J811K309L151L514K931J837J191J454K010J892J151R51J966
60675D00907L279L579K994K804L451L974L628L144L630M944N839N572M669M162
$$ plain form
60780 557440 556309 553811 550200 545841 540889 535301 529276 523353 517855 512468 506700 500596 494707 489462
60766 489462 484796 480346 475793 471114 466759 463465 461602 460727 459981 458869 457406 455624 453311 450338 446923
60751 446923 443439 440149 437246 434962 433444 432588 432153 431945 431855 431778 431692 431831 432634 434378 436853 439425 441436
60734 441436 442528 442717 442337 441878 441519 440712 438520 434595 429523 423887 417454 409876 401941 395180 390094
60719 390094 385541 380195 373939 367508 361471 356132 351796 348389 345189 341633 338145 335542 333950 332987
60705 332987 332670 333224 334126 334404 334047 334233 335858 338609 341883 345836 350868 356596 362015 366484 369997 372704
60689 372704 374739 376550 378859 382010 385524 388455 390292 391483 392937 394947 396839 397990 398941 400907
60675 400907 404186 407765 410759 413563 417014 420988 424616 427760 431390 436334 442173 447745 452414 456576
60661D56576M515N391O106O185N585M532L232J780L24r71k139l344m409m744m085
60646D74534l101k772l167l309k469j145l45k50j39M54J129J327J118R22R11J035
60630D64733J323J674J613P91l84j111j151r52r49j232j817k613l106k701j589
60615D52529o30k24J86J191K525L480L702L366K889K711K948L135K774K198K246
60600D85026K878K992J917K66j201k587m088n121n174m828m899n169n008m731
60586D50273n061n597n204l832k694k421k307j680r58q39j235j549j497j230j112
60571D13057j440j983j778q4K389L908L553K047P10K95Q45J854K398J881Q42L10
60555D28804L08n3q84j141l31N78O76M48P40J335J588J763K641M239N943P613
$$ plain form
60661 456576 461091 466482 472588 478773 484358 488890 492122 493902 494226 493255 491116 487772 483363 478619 474534
60646 474534 471433 468661 465494 462185 459716 458571 458226 457976 457837 458291 459420 460747 461865 462787 463698 464733
60630 464733 466056 467730 469343 470134 469750 468639 467488 466536 465587 464355 462538 459925 456819 454118 452529
60615 452529 451899 451675 451861 453052 455577 459057 462759 466125 469014 471725 474673 477808 480582 482780 485026
60600 485026 487904 490896 492813 493079 491878 489291 485203 480082 474908 470080 465181 460012 455004 450273
60586 450273 445212 439615 434411 430579 427885 425464 423157 421477 420519 419680 418445 416896 415399 414169 413057
60571 413057 411617 409634 407856 407772 410161 414069 417622 419669 420379 420674 421519 423373 425771 427652 428494 428804
60555 428804 429112 429059 428175 427034 426703 427281 427957 428405 429145 430480 432068 433831 436472 440711 446654 454267
60539D54267R627J1938J3986J5570J7083J9009K1538K4568K7515K9426K9765K8882
60527G03174K7207K4385J9880J4069P985K149l488q645j2568j4918j6176j6948
60515G26106j7320j6973j5608j3277j0583q413p036n763l869j537N87K455M525
60502F33294O918R465J2329J5708J9031K1379K2854K4533K6862K8832K9128K7460
60490H77793K4461K0925J7593J5145J3957J4079J5616J8788K3580K9780L7475
60479A109192M6888N7584O8335P8178Q7134R5749J04396J13187J21873J29454
60469B011970J34240J34625J29345J16992R6144O6624L0307r676n0079q7689j19271
60458B453532j42460j56747j63119j62909j57298j47516j34950j21003j07038
$$ plain form
60539 454267 463894 475832 489818 505388 522471 541480 563018 587586 615101 644527 674292 703174
60527 703174 730381 754766 774646 788715 796700 798849 795361 786716 774148 759230 743054 726106
60515 726106 708786 691813 676205 662928 652345 643932 636896 631133 627264 625727 626314 628769 633294
60502 633294 640212 649677 662006 677714 696745 718124 740978 765511 792373 821205 850333 877793
60490 877793 902254 923179 940772 955917 969874 983953 999569 1018357 1041937 1071717 1109192
60479 1109192 1156080 1213664 1281999 1360177 1447311 1543060 1647456 1760643 1882516 2011970
60469 2011970 2146210 2280835 2410180 2527172 2623316 2689940 2720247 2710571 2660492 2572803 2453532
60458 2453532 2311072 2154325 1991206 1828297 1670999 1523483 1388533 1267530 1160492
60449A160492r4055q2174p0819n9857n0129m2392l6244l0716k5522k1051j7411
60438F30122j4368j2009j0660j0063r378q075o327m505k925k075k366l455m427
60425E39489m846n047n198m798l483j735k17J146K821M674N999O559P063Q355
60411E50782J0424J2427J3637J4162J4724J5816J7264J8595J9632K0519K1337
60400G29319K1942K2127K1677K0361J8095J5145J1940Q779N860L411J443l44j935
60387H77820k565j566L48J515J202K88j80k97o30j062j145j101j500k151k190
60372H66786j267J45J619L150M455M697L454J469j61j299k770n178q185j0981
60358H55934j3092j4544j5441j5748j5520j5092j4765j4317j3198j1382r665q817
$$ plain form
60449 1160492 1066437 984263 913444 853587 803458 761066 724822 694106 668584 647533 630122
60438 630122 615754 603745 593085 583022 573644 565569 559242 554737 551812 549737 547371 543916 539489
60425 539489 534643 529596 524398 519600 516117 514382 514165 515311 518132 522806 528805 535364 542427 550782
60411 550782 561206 573633 587270 601432 616156 631972 649236 667831 687463 707982 729319
60400 729319 751261 773388 795065 815426 833521 848666 860606 869385 875245 878656 880099 879755 877820
60387 877820 875255 873689 874037 875552 876754 877042 876862 876565 875935 874873 873728 872627 871127 868976 866786
60372 866786 865519 865664 867283 870433 874888 879585 883039 884508 884347 883048 880278 875100 866915 855934
60358 855934 842842 828298 812857 797109 781589 766497 751732 737415 724217 712835 703170 694353
60346F94353q633q308p607p074o942o525n114l123j702j309j237p05R6L72j03
60331F36439p04q51p70j105j979k855l303l514l827m100l965l566l548m132m641
60316E93579m235k980j789j344j446j490j314j229j418j636j655j661j977k532
60302E66873k858k622j991j402j146j127r45k21R52K012K529K720L044L462L617
60287E72897L721M571O431Q446R595R765R455R015Q750R225J0633J2152J2887
60274F87543J3246J4280J5791J6285J5194J3921J3887J4586J4486J3247J1880
60263H44346J1107J0706J0465J0721J1563J2361J2532J2406J2806J4006J5477
60252I78496J6651J7603J8942K1038K3572K5915K7870K9722L1656L3565L5599
$$ plain form
60346 694353 685720 677412 669805 662731 655789 649264 644150 641027 639325 638016 636779 636074 636170 636542 636439
60331 636439 635735 634884 634114 633009 631030 628175 624872 621358 617531 613431 609466 605900 602352 598220 593579
60316 593579 589344 586364 584575 583231 581785 580295 578981 577752 576334 574698 573043 571382 569405 566873
60302 566873 564015 561393 559402 558000 556854 555727 554782 554561 555513 557525 560054 562774 565818 569280 572897
60287 572897 576618 581189 587620 596066 605661 615426 624881 633896 642646 651871 662504 674656 687543
60274 687543 700789 715069 730860 747145 762339 776260 790147 804733 819219 832466 844346
60263 844346 855453 866159 876624 887345 898908 911269 923801 936207 949013 963019 978496
60252 978496 995147 1012750 1031692 1052730 1076302 1102217 1130087 1159809 1191465 1225030 1260629
60241A260629L8335M1994M5905M9316N2358N5616N9036O2049O4717O7830P1735
60230A869520P5781P9165Q1685Q3347Q3970Q3606Q2683Q1176P8175P2935O6002
60219B738045N8680N1612M4541L7233K9849K2474J4997P695J385l258o276q138
60207B988839r255r782r608q373n800k063K462P760J4064K1075K7923L4150M0244
60194C091636M6778N3447N9445O4454O8598P1530P2278P0186O5680N9774N3088
60183C776894M5448L6335K5548J3469P26j2375k5840l9397n2282o3860p4103q2987
60171C547576q9721r3283r3623r1609q7729q1702p3625o4646n5779m6688l6421
60160B732750k4936j3151j733R301J9733K8711L5407L9607M1425M0870L7924L2792
$$ plain form
60241 1260629 1298964 1340958 1386863 1436179 1488537 1544153 1603189 1665238 1729955 1797785 1869520
60230 1869520 1945301 2024466 2106151 2189498 2273468 2357074 2439757 2520933 2599108 2672043 2738045
60219 2738045 2796725 2848337 2892878 2930111 2959960 2982434 2997431 3005126 3006511 3003253 2996977 2988839
60207 2988839 2979584 2969802 2960194 2951821 2946021 2943958 2946420 2954180 2968244 2989319 3017242 3051392 3091636
60194 3091636 3138414 3191861 3251306 3315760 3384358 3455888 3528166 3598352 3664032 3723806 3776894
60183 3776894 3822342 3858677 3884225 3897694 3898420 3886045 3860205 3820808 3768526 3704666 3630563 3547576
60171 3547576 3457855 3364572 3270949 3179340 3091611 3009909 2936284 2871638 2815859 2769171 2732750
60160 2732750 2707814 2694663 2692930 2702231 2721964 2750675 2786082 2825689 2867114 2907984 2945908 2978700
60148B978700K5951J8060R773J393p142j5600k3032k8433l1671l3098l2547k9555
60136B832799k4531j8626j2150m206N660J6447K7123L8139N0520O4056P7500R0279
60124C143010J02929J15984J29416J43099J56853J69861J80976J89907J97357
60115D529392K03724K08297K09989K08212K02706J93205J79737J62868J43216
60106F241346J21060R6702P0717M3455J4824j4944m4634p2790r8907j23322j45981
60095F087526j65749j81124j91357j96719j97853j94928j87592j75836j60727
60086D435641j43837j25958j06791q6076o4463m2904k1786j205J8211L5508N0294
60075C946634O2820P3074Q0327Q3689Q2748P7582O8561N6337M1680K5187P349
$$ plain form
60148 2978700 3004651 3022711 3032484 3033877 3026735 3011135 2988103 2959670 2927999 2894901 2862354 2832799
60136 2832799 2808268 2789642 2777492 2773286 2778946 2795393 2822516 2860655 2911175 2975231 3052731 3143010
60124 3143010 3245939 3361923 3491339 3634438 3791291 3961152 4142128 4332035 4529392
60115 4529392 4733116 4941413 5151402 5359614 5562320 5755525 5935262 6098130 6241346
60106 6241346 6362406 6459108 6529825 6573280 6588104 6573160 6528526 6455736 6356829 6233507 6087526
60095 6087526 5921777 5740653 5549296 5352577 5154724 4959796 4772204 4596368 4435641
60086 4435641 4291804 4165846 4059055 3972979 3908516 3865612 3843826 3842621 3860832 3896340 3946634
60075 3946634 4009454 4082528 4162855 4246544 4329292 4406874 4475435 4531772 4573452 4598639 4605988
60064D605988j1093k9225m6488o2708p7452q9778r9042j05636j10421j13569j14435
60053C746141j12555j08303j02338r4813q5466p4345o2061m9347l6576k3860j1452
60042B985025J52J0569J9944K8939L8131M7336N5613O2127O6931P0698P3623P4844
60030C533932P3161O8091O0118N0017L8303K5181J0800m570k0381l5832n0164
60019C748656o2977p4117q3328r0247r4664r6514r5590r1657q5052p6839o8067
60008B829604n8924m8866l7456k4948j2013P81J3305K5768L8469N1524O4729P7603
59996B919576Q9649J00628J10617J19628J27115J32032J33461J31050J24759J14579
59986D103094J00870Q4747O7470M9433L0229R763j1186l1650n1128o9306q5565
$$ plain form
60064 4605988 4594895 4565670 4519182 4456474 4379022 4289244 4190202 4084566 3974145 3860576 3746141
60053 3746141 3633586 3525283 3422945 3328132 3242666 3168321 3106260 3056913 3020337 2996477 2985025
60042 2985025 2985177 2995746 3015690 3044629 3082760 3130096 3185709 3247836 3314767 3385465 3459088 3533932
60030 3533932 3607093 3675184 3735302 3785319 3823622 3848803 3859603 3855033 3834652 3798820 3748656
60019 3748656 3685679 3611562 3528234 3437987 3343323 3246809 3151219 3059562 2974510 2897671 2829604
60008 2829604 2770680 2721814 2684358 2659410 2647397 2648178 2661483 2687251 2725720 2777244 2841973 2919576
59996 2919576 3009225 3109853 3220470 3340098 3467213 3599245 3732706 3863756 3988515 4103094
59986 4103094 4203964 4288711 4356181 4405614 4435843 4445606 4434420 4402770 4351642 4282336 4196771
59975D196771r9161j09490j15883j17604j14580j07778r8363q6758p3102n8321
59965C215731m3827l0162j6640k632J1391K4400L5933M6198N5387O3297O9637
59954C428713P4380P7759P9943Q0722P9509P5828O9924O2665N4823M6583L7909
59943D168758K8948J9872J0563J080p637j4107j7559j8464j7423j3918o772M261
59931D137602J8043L3400N0331O9300Q9904J10944J31824J52974J74699J96127
59921E165148K15781K32760K46876K57736K64097K64109K56002K38707K12159
59912G353375J77158J34951Q7089L5740j6253o5929j10820j48959j78796j99551
59902G068005k11514k15533k12302k02384j86737j66666j43298j17461r0073o2137
$$ plain form
59975 4196771 4097610 3988120 3872237 3754633 3640053 3532275 3433912 3347154 3274052 3215731
59965 3215731 3171904 3141742 3125102 3122470 3133861 3158261 3194194 3240392 3295779 3359076 3428713
59954 3428713 3503093 3580852 3660795 3741517 3821026 3896854 3966778 4029443 4084266 4130849 4168758
59943 4168758 4197706 4217578 4228141 4229221 4221584 4207477 4189918 4171454 4154031 4140113 4133341 4137602
59931 4137602 4155645 4189045 4239376 4308676 4398580 4509524 4641348 4794322 4969021 5165148
59921 5165148 5380929 5613689 5860565 6118301 6382398 6646507 6902509 7141216 7353375
59912 7353375 7530533 7665484 7752573 7788313 7772060 7706131 7595311 7446352 7267556 7068005
59902 7068005 6856491 6640958 6428656 6226272 6039535 5872869 5729571 5612110 5522037 5459900
59892E459900l4406p441J7782L9843N7660P1000Q0089Q5182Q6886Q6577Q5888
59881F028960Q5710Q5766Q5070Q2508P7043O7783N4041L5457J2156j5092m4832
59870F554570p5136j03928j29326j49932j64994j74219j77400j74414j65682j52464
59860E087075j36336j18356r8895p8279n7292l6823j7219J564J9066L3913M4639
59849D643057N0729N2500N0084M3126L1759J7308J549j4549l0815m6732o0981
59838D737035p2330q0434q5513q7637q6942q4390q1659q0003p9451p9250p8837
59827C840589p8062p6643p3912o9352o3104n5779m7945m0102l3002k7524k4046
59816C251118k2143k1028k0144j9287j8309j6827j4154r631l208M474J2914K2571
$$ plain form
59892 5459900 5425494 5418053 5435835 5475678 5533338 5604338 5684427 5769609 5856495 5943072 6028960
59881 6028960 6114670 6200436 6285506 6368014 6445057 6512840 6566881 6602338 6614494 6599402 6554570
59870 6554570 6479434 6375506 6246180 6096248 5931254 5757035 5579635 5405221 5239539 5087075
59860 5087075 4950739 4832383 4733488 4655209 4597917 4561094 4543875 4545439 4564505 4598418 4643057
59849 4643057 4693786 4746286 4796370 4839496 4871255 4888563 4890112 4875563 4844748 4798016 4737035
59838 4737035 4664705 4584271 4498758 4411121 4324179 4239789 4158130 4078127 3998676 3919426 3840589
59827 3840589 3762527 3685884 3611972 3542620 3479516 3423737 3375792 3335690 3302688 3275164 3251118
59816 3251118 3228975 3207947 3187803 3168516 3150207 3133380 3119226 3109595 3106387 3110861 3123775 3146346
59804C146346L4271M7847O2179P6966R3570J13450J36209J60029J83571K06288
59794D260726K26834K42112K48199K41618K19782J81582J28730O6386J727n8488
59784E759208j09443j48441j74620j88564j91739j86039j73727j57364j39323
59775D289948j21311j04392q9129p5495o2946n0981l9638k9140j9343r929j008
59764C686636P038J4409K2028L0503L9325M7590N5217O2909P0939P8721Q5901
59753D201216R3297J02125J12528J23559J34649J46416J59793J75028J91828K09964
59743E650403K29119K48518K67295K85032L01400L15367L25297L29753L27811
59734H279995L18831L02728K80593K54593K27178K00671J77520J60053J49704
$$ plain form
59804 3146346 3180617 3228464 3290643 3367609 3461179 3574629 3710838 3870867 4054438 4260726
59794 4260726 4487560 4729672 4977871 5219489 5439271 5620853 5749583 5815969 5817696 5759208
59784 5759208 5649765 5501324 5326704 5138140 4946401 4760362 4586635 4429271 4289948
59775 4289948 4168637 4064245 3975116 3899621 3836675 3785694 3746056 3716916 3697573 3687644 3686636
59764 3686636 3693674 3708083 3730111 3760614 3799939 3847529 3902746 3965655 4036594 4115315 4201216
59753 4201216 4294513 4396638 4509166 4632725 4767374 4913790 5073583 5248611 5440439 5650403
59743 5650403 5879522 6128040 6395335 6680367 6981767 7297134 7622431 7952184 8279995
59734 8279995 8598826 8901554 9182147 9436740 9663918 9864589 10042109 10202162 10351866
59725A0351866J46887J51694J64093J83184K06913K32907K59227K84022L05120
59716A2285913L20530L29122L30335L23656L08877K86720K58611K25917J89688
59707A4859369J51175J12232P5232M2650J6467k257j3181j5922r807N480K9396
59696A5250834O0993R9521J44177J93548K45873K99690L53812M06749M56534N00980
59686A8012711N37594N63285N74554N68141N41466M92828M21908L30428K22129
59677B2265044J02213k3175j47340k63793l67167m53664n21180n69731o01925
59668A9419282o22502o36856o49645o63956o80746o98575p14073p23249p22810
59659A3306870p11067o88496o57706o22342n85424n48489n12144m76962m43668
$$ plain form
59725 10351866 10498753 10650447 10814540 10997724 11204637 11437544 11696771 11980793 12285913
59716 12285913 12606443 12935565 13265900 13589556 13898433 14185153 14443764 14669681 14859369
59707 14859369 15010544 15122776 15198008 15240658 15257125 15254868 15241687 15225765 15215958 15221438 15250834
59696 15250834 15311827 15411348 15555525 15749073 15994946 16294636 16648448 17055197 17511731 18012711
59686 18012711 18550305 19113590 19688144 20256285 20797751 21290579 21712487 22042915 22265044
59677 22265044 22367257 22344082 22196742 21932949 21565782 21112118 20590938 20021207 19419282
59668 19419282 18796780 18159924 17510279 16846323 16165577 15467002 14752929 14029680 13306870
59659 13306870 12595803 11907307 11249601 10627259 10041835 9493346 8981202 8504240 8060572
59650H060572m12682l83874l56797l31146l06968k84388k63124k42467k21900
59641E257226k01643j82294j64084j46794j30243j14489r9529q5307p2197o0974
59631C999672n1970m4532l7780l1721k7216k4836k4089k3985k4139k5080k7462
59620C656862l1186l5405l9301m2673m5813m8995n2138n4768n6182n5822n3739
59609C140840n0566m6954m3107l8956l4533k9926k5164k0374j5950j2145q617
59598B814548m773n38L506O845R569J2197J5144J8405K1408K3272K3492K2434
59586B965509K0972J9669J8670J8288J9153K1532K4911K8490L2002L5879M0848
59575C245923M7371N5125O3035P0160P6752Q4001R2597J01941J11042J19683J28194
$$ plain form
59650 8060572 7647890 7264016 6907219 6576073 6269105 5984717 5721593 5479126 5257226
59641 5257226 5055583 4873289 4709205 4562411 4432168 4317679 4218150 4132843 4060646 3999672
59631 3999672 3947702 3903170 3865390 3833669 3806453 3781617 3757528 3733543 3709404 3684324 3656862
59620 3656862 3625676 3590271 3550970 3508297 3462484 3413489 3361351 3306583 3250401 3194579 3140840
59609 3140840 3090274 3043320 3000213 2961257 2926724 2896798 2871634 2851260 2835310 2823165 2814548
59598 2814548 2809775 2809237 2812743 2819588 2829157 2841354 2856498 2874903 2896311 2919583 2943075 2965509
59586 2965509 2986481 3006150 3024820 3043108 3062261 3083793 3108704 3137194 3169196 3205075 3245923
59575 3245923 3293294 3348419 3411454 3481614 3558366 3642367 3734964 3836905 3947947 4067630 4195824
59564D195824J36407J43558J49245J53887J58011J61347J62922J61920J58259
59555E581380J52344J44393J34189J21495J06449Q9208O9322M6006J9366q884
59545F455268l6108o0134p9880r5038j05622j11737j13518j11131j04857r4967
59535E542276q1430o4014m2857j8748P422L5168O4027R2880J20206J44930J66401
59524E966261J83416J93810J95396J87205J69607J43529J09868O9592K4128k4536
59514G218276p4062j22012j65946k03515k32911k53464k65577k69963k67088k57580
59504E106158k42744k24199k03159j80608j57891j36301j15912r5632p4808n4174
59494C620730l4818j6862K90J6898L2847M8261O3280P7426R0022J01235J11803
$$ plain form
59564 4195824 4332231 4475789 4625034 4778921 4936932 5098279 5261201 5423121 5581380
59555 5581380 5733724 5878117 6012306 6133801 6240250 6329458 6398780 6444786 6464152 6455268
59545 6455268 6419160 6359026 6279146 6184108 6078486 5966749 5853231 5742100 5637243 5542276
59535 5542276 5460846 5396832 5353975 5335227 5342649 5377817 5441844 5534724 5654930 5799860 5966261
59524 5966261 6149677 6343487 6538883 6726088 6895695 7039224 7149092 7218684 7242812 7218276
59514 7218276 7144214 7022202 6856256 6652741 6419830 6166366 5900789 5630826 5363738 5106158
59504 5106158 4863414 4639215 4436056 4255448 4097557 3961256 3845344 3749712 3674904 3620730
59494 3620730 3585912 3569050 3569340 3586238 3619085 3667346 3730626 3808052 3898074 3999309 4111112
59483D111112J21569J29075J32954J32996J29385J21592J08682R0445O7598M1139
59473E186547J2052j8445m8925p8060j04711j27864j46907j61883j73023j80116
59463D158665j82748j81190j76586j70170j62576j53990j44595j34684j24580
59454B727546j14594j04916r5542q6470p7963p0318o3357n6485m9354m2236l5620
59443A930691k9689k4294j9193j4177r191m460l61K939N571P662R317J0887J2936
59430A878638J5679J8750K1671K4225K6173K6937K6012K3531K0238J7090J5118
59419B114062J5293J7978K2561K7941L3392L8700M3657M7796N0604N1739N1164
59408B514887M9524M8323M9198N2724N8161O4500P1554P9794Q9431J00068J11340
$$ plain form
59483 4111112 4232681 4361756 4494710 4627706 4757091 4878683 4987365 5077810 5145408 5186547
59473 5186547 5198599 5180154 5131229 5053169 4948458 4820594 4673687 4511804 4338781 4158665
59463 4158665 3975917 3794727 3618141 3447971 3285395 3131405 2986810 2852126 2727546
59454 2727546 2612952 2508036 2412494 2326024 2248061 2177743 2114386 2057901 2008547 1966311 1930691
59443 1930691 1901002 1876708 1857515 1843338 1834147 1829687 1829326 1832265 1837836 1845498 1854815 1865702 1878638
59430 1878638 1894317 1913067 1934738 1958963 1985136 2012073 2038085 2061616 2081854 2098944 2114062
59419 2114062 2129355 2147333 2169894 2197835 2231227 2269927 2313584 2361380 2411984 2463723 2514887
59408 2514887 2564411 2612734 2661932 2714656 2772817 2837317 2908871 2988665 3078096 3178164 3289504
59397C289504J23551J37323J52569J68243J83392J98250K13749K30116K46655
59388D943352K63147K80594L00017L21064L42585L64093L85502M05447M21001
59379H026802M29561M30254M23290M08803L87202L60117L29999K98714K67009
59370A1361751K35311K04323J74643J46084J17624Q7761N4867J7459k5484p4231
59360A2300108j28197j85910k45138l03164l57082m04023m41472m67785m82459
59351I284878m85947m79262m63861m41635m14573l84316l52112l19240k87159
59342E656773k57210k30283k06768j86588j69159j53645j39519j26731j15222
59333D071648j04480r4011q4032p5263o7914o1411n5270m9865m5915m3437m1643
$$ plain form
59397 3289504 3413055 3550378 3702947 3871190 4054582 4252832 4466581 4696697 4943352
59388 4943352 5206499 5487093 5787110 6108174 6450759 6814852 7200354 7605801 8026802
59379 8026802 8456363 8886617 9309907 9718710 10105912 10466029 10796028 11094742 11361751
59370 11361751 11597062 11801385 11976028 12122112 12239736 12327497 12382364 12399823 12374339 12300108
59360 12300108 12171911 11986001 11740863 11437699 11080617 10676594 10235122 9767337 9284878
59351 9284878 8798931 8319669 7855808 7414173 6999600 6615284 6263172 5943932 5656773
59342 5656773 5399563 5169280 4962512 4775924 4606765 4453120 4313601 4186870 4071648
59333 4071648 3967168 3873157 3789125 3713862 3645948 3584537 3529267 3479402 3433487 3390050 3348407
59322C348407l9871l8263l7442l7697l8517l8893l8041l5935l3074k9835k6302
59311B954537k2712j9524j6690j3306q566k823K955Q597J4787K1679K8326L3887
59299B981147L8775M4106N0416N7448O4833P2414P9980Q6982R2513R5314R4060
59288C757988Q7969P7096O2084M3850K3664L053j6771l5289n2374o7901q1767
59277C801602r3822j03439j09563j11655j10380j07038j02560r7257r1186q4301
59267B790401p6564o8349o0438n3357m7013m1302l6514l2628k8763k4030j8623
59256B302820j3361q434l343K148P789J3439J9212K5059L0817L6598M2620M8884
59244B504248N5546O3256P2430Q2599R3279J05077J18918J34472J50645J67396
$$ plain form
59322 3348407 3308536 3270273 3232831 3195134 3156617 3117724 3079683 3043748 3010674 2980839 2954537
59311 2954537 2931825 2912301 2895611 2882305 2873739 2870916 2873871 2882468 2897255 2918934 2947260 2981147
59299 2981147 3019922 3064028 3114444 3171892 3236725 3309139 3389119 3476101 3568614 3663928 3757988
59288 3757988 3845957 3923053 3985137 4028987 4052651 4055704 4038933 4003644 3951270 3883369 3801602
59277 3801602 3707780 3604341 3494778 3383123 3272743 3165705 3063145 2965888 2874702 2790401
59267 2790401 2713837 2645488 2585050 2531693 2484680 2443378 2406864 2374236 2345473 2321443 2302820
59256 2302820 2289459 2281025 2277682 2279830 2287619 2301058 2320270 2345329 2376146 2412744 2455364 2504248
59244 2504248 2559794 2623050 2695480 2778079 2871358 2976435 3095353 3229825 3380470 3547866
59234C547866J85761K05928K26695K47106K67215K86661L03763L16770L24896
59225E912661L27342L22309L08085K84331K51404K09215J57903R9240L6318k7958
59215G880850r1299j51232k04847k49515k83456l05957l17547l19761l14238l02199
59205E340799k84995k64585k42787k20403j97660j75213j54109j35052j18260
59196C547735j03754r1215p9769o8609n7665m7214l7180k7366j8041r669k312
59185C004941M006Q589J0477R528O460J994l382q987j4017j8184k1639k4238k5488
59172B930060k5227k3840k1748j9207j6618j4420j2563j0612q501o770n988o305
59160B758261p603r594j1736j3428j4453j4914j4762j3648j1301p687k987K287
$$ plain form
59234 3547866 3733627 3939555 4166250 4413356 4680571 4967232 5270995 5587765 5912661
59225 5912661 6240003 6562312 6870397 7154728 7406132 7615347 7773250 7872490 7908808 7880850
59215 7880850 7789551 7638319 7433472 7183957 6900501 6594544 6276997 5957236 5642998 5340799
59205 5340799 5055804 4791219 4548432 4328029 4130369 3955156 3801047 3665995 3547735
59196 3547735 3443981 3352766 3272997 3204388 3146723 3099509 3062329 3034963 3016922 3007253 3004941
59185 3004941 3008947 3017536 3028013 3037541 3044001 3045995 3042613 3033626 3019609 3001425 2979786 2955548 2930060
59172 2930060 2904833 2880993 2859245 2840038 2823420 2809000 2796437 2785825 2777324 2770554 2764566 2758261
59160 2758261 2750658 2741064 2729328 2715900 2701447 2686533 2671771 2658123 2646822 2639135 2636148 2638435
59148B638435P264J1283J4378J6819J8377J8621J7792J6728J5900J5057J3887
59137B804541J2344J0240P092K703k536q079j3573j8669k2900k5924k7639k7894
59125B689706k6488k3459j9038j3310o364J173Q209J3972J8455K2002K4855K7108
59113B716821K8787K9872L0549L1284L2368L3516L4366L5162L6361L7802L9012
59102C085900M0192M2075M4716M7413M9949N2943N6507N9468O0536N9587N7164
59091C656450N3292M7447L9203K8296J4506j845j9444l6599n2110o5241p5374
59080C588581q2288q6458q8540q8748q7291q4970q2644q0268p7151p3016o8072
59069B689135o2194n4840m6018l6604k7376j8215q569J567J1372J9443K4141K4004
$$ plain form
59148 2638435 2645699 2656982 2671360 2688179 2706556 2725177 2742969 2759697 2775597 2790654 2804541
59137 2804541 2816885 2827125 2834217 2836920 2834384 2826305 2812732 2794063 2771163 2745239 2717600 2689706
59125 2689706 2663218 2639759 2620721 2607411 2601047 2602220 2610429 2624401 2642856 2664858 2689713 2716821
59113 2716821 2745608 2775480 2806029 2837313 2869681 2903197 2937563 2972725 3009086 3046888 3085900
59102 3085900 3126092 3168167 3212883 3260296 3310245 3363188 3419695 3479163 3539699 3599286 3656450
59091 3656450 3709742 3757189 3796392 3824688 3839194 3837349 3817905 3781306 3729196 3663955 3588581
59080 3588581 3506293 3419835 3331295 3242547 3155256 3070286 2987642 2907374 2830223 2757207 2689135
59069 2689135 2626941 2572101 2526083 2489479 2462103 2443888 2435319 2436886 2448258 2467701 2491842 2515846
59057B515846J8444Q118n483k0738l6115n0017o0845o7529o9945o8751o4735n8353
59045B039897m9891l9934k9481j9509j0527k730L524P522Q629O921L401n87m211
59032A913024p369j0013j1549j1286r376o778m139j173K590O857J0828J4264J7699
59019A903579K1574K5473K8511L0373L1744L3616L6251L8980M1016M2236M2921
59008B276274M2904M1469L8071L2793K5968J7830Q824j09p990j4322j8886k1291
58996B421535k1239j9150j6068j2873r904p449o112o430q273j0913j3687j6352
58984B273085j8777k0522k0896j9458j6251j1542n627R00O978J1668J4966J7604
58972B212128J9903K1210K0717J8507J5453J2336R472P038N294M368M166M577
$$ plain form
59057 2515846 2534290 2542408 2536925 2516187 2480072 2430055 2369210 2301681 2231736 2162985 2098250 2039897
59045 2039897 1990006 1950072 1920591 1901082 1890555 1887825 1891349 1898871 1907500 1914421 1917822 1917235 1913024
59032 1913024 1905655 1895642 1884093 1872807 1863431 1856653 1852514 1851341 1853931 1860788 1871616 1885880 1903579
59019 1903579 1925153 1950626 1979137 2009510 2041254 2074870 2111121 2150101 2191117 2233353 2276274
59008 2276274 2319178 2360647 2398718 2431511 2457479 2475309 2484133 2484024 2476034 2461712 2442826 2421535
58996 2421535 2400296 2381146 2365078 2352205 2342301 2334852 2328740 2322310 2314037 2303124 2289437 2273085
58984 2273085 2254308 2233786 2212890 2193432 2177181 2165639 2160012 2160912 2167890 2179558 2194524 2212128
58972 2212128 2232031 2253241 2273958 2292465 2307918 2320254 2329726 2336764 2342058 2346426 2350592 2355169
58960B355169N551O851Q004Q685Q971R067Q893Q233P281O768P380R244J2126J5994
58946B478217K1039K7023L3015L8002M1650M4147M5378M4690M1651L6842L1719
58935B883373K7669K5308K4638K5663K8675L3887M0976M9306N8548O8773P9831
58924C346647R0990J01576J11777J22527J34603J48052J62406J77170J92152K07530
58914D795430K23546K39980K56038K70841K83860K94697L03003L09052L14049
58905G290496L19313L25279L31743L38716L46219L53331L58254L59347L55435
58896A0378133L45048L26294K97734K58692K08620J47170P5552k857q3763j63243
58886A1787380k37578l02993l56763l98308m28433m47866m57223m57907m51885
$$ plain form
58960 2355169 2360720 2367571 2375575 2384260 2393231 2402298 2411191 2419424 2426705 2433473 2440853 2450097 2462223 2478217
58946 2478217 2499256 2526279 2559294 2597296 2638946 2683093 2728471 2773161 2814812 2851654 2883373
58935 2883373 2911042 2936350 2960988 2986651 3015326 3049213 3090189 3139495 3198043 3266816 3346647
58924 3346647 3437637 3539213 3650990 3773517 3908120 4056172 4218578 4395748 4587900 4795430
58914 4795430 5018976 5258956 5514994 5785835 6069695 6364392 6667395 6976447 7290496
58905 7290496 7609809 7935088 8266831 8605547 8951766 9305097 9663351 10022698 10378133
58896 10378133 10723181 11049475 11347209 11605901 11814521 11961691 12037243 12034386 11950623 11787380
58886 11787380 11549802 11246809 10890046 10491738 10063305 9615439 9158216 8700309 8248424
58877H248424m40621m25013m06246l85770l64318l41786l18406k95230k73121
58868D997913k51926k31180k11157j92642j75883j60344j45479j31331j18330
58859C379641j06693r6187q6323p6703o7208n8008m9445m1859l5370k9748k4603
58848B707494j9717j5084j0677o398k350J172M178P277J1132J5772K0738K5823
58836B739360L1339L7533M4170N0862N7667O5019P3003Q0905Q7718R3098R7661
58825C458335J02227J07050J11965J17107J23111J30664J40090J51315J63990
58816D605854J77780J92831K09778K28829K48973K68758K87828L06953L26277
58807F853861L44318L59106L69736L76236L78273L74545L63225L42679L12073
$$ plain form
58877 8248424 7807803 7382790 6976544 6590774 6226456 5884670 5566264 5271034 4997913
58868 4997913 4745987 4514807 4303650 4111008 3935125 3774781 3629302 3497971 3379641
58859 3379641 3272948 3176761 3090438 3013735 2946527 2888519 2839074 2797215 2761845 2732097 2707494
58848 2707494 2687777 2672693 2662016 2655618 2653268 2654440 2658618 2665895 2677027 2692799 2713537 2739360
58836 2739360 2770699 2808232 2852402 2903264 2960931 3025950 3098953 3179858 3267576 3360674 3458335
58825 3458335 3560562 3667612 3779577 3896684 4019795 4150459 4290549 4441864 4605854
58816 4605854 4783634 4976465 5186243 5415072 5664045 5932803 6220631 6527584 6853861
58807 6853861 7198179 7557285 7927021 8303257 8681530 9056075 9419300 9761979 10074052
58798A0074052K71810K23209J67650J06460M1876k2615q3572j38954j87658k28188
58788A0224070k58581k77501k84756k80955k67400k46524k22046j98791j82453
58779H005063j78713j91070k18657k56110k95588l29153l50740l57698l51241
58770E476093l34880l12007k84943k55619k25909j97033j69327j43062j18852
58761C434461r6904p6422n6266l6031j6175K719K0601L7992N5344P2152Q6637
58750C428108R6649J00790R8348Q8437P0148M3903J2184k1508n4131q3484j07793
58739C671651j25683j36618j41136j40519j36183j29247j20532j10946j01578
58730B529209r3176q5815p9428p4391p1018o8675o6128o2790n9008n5043n0474
$$ plain form
58798 10074052 10345862 10569071 10736721 10843181 10885057 10862442 10778870 10639916 10452258 10224070
58788 10224070 9965489 9687988 9403232 9122277 8854877 8608353 8386307 8187516 8005063
58779 8005063 7826350 7635280 7416623 7160513 6864925 6535772 6185032 5827334 5476093
58770 5476093 5141213 4829206 4544263 4288644 4062735 3865702 3696375 3553313 3434461
58761 3434461 3337557 3261135 3204869 3168838 3152663 3155382 3175983 3213975 3269319 3341471 3428108
58750 3428108 3524757 3625547 3723895 3812332 3882480 3926383 3938567 3917059 3862928 3779444 3671651
58739 3671651 3545968 3409350 3268214 3127695 2991512 2862265 2741733 2630787 2529209
58730 2529209 2436033 2350218 2270790 2196399 2125381 2056706 1990578 1927788 1868780 1813737 1763263
58719A763263m4870l8386l1427k4326j7609j2133q548o977p419r939j4196j9317
58707A528116k4442k8901l1656l1507k8382k3845j9601j5925j2157q172m637k120
58695A296771p63n34j041j266k65J928M756Q400J3719K0926K9095L7321M5694
58682A454741N4725O4280P3520Q1764Q9145R6565J04962J14477J24380J34138
58672B392697J44254J55460J66714J74271J72722J56860J23396P2566R260n7842
58662C510358j19334j68160k00796k16805k18268k09037j93306j74225j53692
58653A856735j33103j13671r6059q0229o5993n3434m2721l3741k6161j9781j4653
58642A177189j0892q365o613n177m022l487l578l559k522l15K383M956P489J0429
$$ plain form
58719 1763263 1718393 1680007 1648580 1624254 1606645 1594512 1585964 1578987 1571568 1561629 1547433 1528116
58707 1528116 1503674 1474773 1443117 1411610 1383228 1359383 1339782 1323857 1311700 1303528 1298891 1296771
58695 1296771 1296008 1295474 1294433 1293167 1292902 1294830 1299586 1307986 1321705 1342631 1371726 1409047 1454741
58682 1454741 1509466 1573746 1647266 1729030 1818175 1914740 2019702 2134179 2258559 2392697
58672 2392697 2536951 2692411 2859125 3033396 3206118 3362978 3486374 3558940 3568200 3510358
58662 3510358 3391024 3222864 3022068 2805263 2586995 2377958 2184652 2010427 1856735
58653 1856735 1723632 1609961 1513902 1433673 1367680 1314246 1271525 1237784 1211623 1191842 1177189
58642 1177189 1166297 1157932 1151319 1146142 1142120 1138633 1135055 1131496 1128974 1128659 1131042 1135998 1143487 1153916
58628A153916J3908J7572K0947K3810K6396K9295L3039L7654M2729M7951N3388
58617A500605N9154O5127P1150P7389Q4187R1650R9496J07208J14140J19562J22853
58606B512521J23677J21924J17478J10065R9268Q4751O6720M6210K4668L221j7375
58595C293128l6086n1462o2497o9186p1868p0422o4692n5401m3947l1390j8156
58584B718021m621Q760K1883L4924M7771O0123P2368Q5608J00470J16251J31315
58573C392873J43692J50902J49872J37823J13418P7189L1546j9212o9451j13691
58563C994961j48007j70327j80162j78600j68232j52334j33916j15528r9658q8744
58553B559453q4528q7132r4541j03162j09597j12322j11594j07914j01329r2331
$$ plain form
58628 1153916 1167824 1185396 1206343 1230153 1256549 1285844 1318883 1356537 1399266 1447217 1500605
58617 1500605 1559759 1624886 1696036 1773425 1857612 1949262 2048758 2155966 2270106 2389668 2512521
58606 2512521 2636198 2758122 2875600 2985665 3084933 3169684 3236404 3282614 3307282 3310503 3293128
58595 3293128 3257042 3205580 3143083 3073897 3002029 2931607 2866915 2811514 2767567 2736177 2718021
58584 2718021 2713400 2722160 2744043 2778967 2826738 2886861 2959229 3044837 3145307 3261558 3392873
58573 3392873 3536565 3687467 3837339 3975162 4088580 4165769 4197315 4178103 4108652 3994961
58563 3994961 3846954 3676627 3496465 3317865 3149633 2997299 2863383 2747855 2648197 2559453
58553 2559453 2474925 2387793 2293252 2190090 2080493 1968171 1856577 1748663 1647334 1555003
58543A555003q2533p3638o6131n9435n3017m6742m0632l4892l0029k6291k3160
58532A018503j9957j6757j4165j2267j0405q084n542l314j509L49K892O275R915
58519I45934J3070J5779J8853K2752K6846L0190L2630L4738L7074L9945M3429
58508A261240M7145N0319N2806N5795O0813O8131P6674Q5255R3205R9910J04473
58497B055766J05932J03415R6087Q3644O6958M7782K7602O946j4291l6141n8035
58486B485665p8620r6167j09476j18299j22809j23075j19411j12762j04247r4620
58476A406179q4527p4747o5669n7038m8806m1684l6157l1583k7232k3610k1627
58465H93499k0884j9969j8341j6671j5436j4376j3457j3101j3188j2873j1760
$$ plain form
58543 1555003 1472470 1398832 1332701 1273266 1220249 1173507 1132875 1097983 1067954 1041663 1018503
58532 1018503 998546 981789 967624 955357 944952 936868 931326 928012 926503 926852 929744 936019 945934
58519 945934 959004 974783 993636 1016388 1043234 1073424 1106054 1140792 1177866 1217811 1261240
58508 1261240 1308385 1358704 1411510 1467305 1528118 1596249 1672923 1758178 1851383 1951293 2055766
58497 2055766 2161698 2265113 2361200 2444844 2511802 2559584 2587186 2594132 2579841 2543700 2485665
58486 2485665 2407045 2310878 2201402 2083103 1960294 1837219 1717808 1605046 1500799 1406179
58476 1406179 1321652 1246905 1181236 1124198 1075392 1033708 997551 965968 938736 915126 893499
58465 893499 872615 852646 834305 817634 802198 787822 774365 761264 748076 735203 723443
58454G23443j0443r506q864q258p615o661n029l055j638j072p22j44K74J91pJ53
58438F61047N03N75K51j76k33N24J976L154L115K137J344J250J463J768K448L411
58422F84557M045M244M611N415O182O620O968P119O469N061L852L332K813J681
58408G52969M15k47l71l56k27m1l27j365k598l354l605l583l230k614k214k273
58392G26979k385k211j952j704j001M07J996L295M671O630Q844J0518J1381J1657
58378G77125J1472J0795R761Q640P592O640N688M559L386K817L283M263M978N532
58364H66531O460P368P306O476O180O800P288O977O555O701P036P085P096P211
58350I63070P042O675O988Q290R673J0367J0594J0617J0292J0102J1181J3461
$$ plain form
58454 723443 713000 703494 694630 686372 678757 672096 667067 664012 662374 661302 660580 660436 660710 660901 660894 661047
58438 661047 661550 662125 662376 662200 661967 662491 664467 667621 670736 672873 674217 675467 676930 678698 681146 684557
58422 684557 688602 692846 697457 702872 709054 715674 722642 729761 736230 741291 745143 748475 751288 752969
58408 752969 753384 753137 752766 752410 752183 752142 751815 750450 747852 744498 740893 737310 734080 731466 729252 726979
58392 726979 724594 722383 720431 718727 717726 718133 720129 723424 728095 734725 743569 754087 765468 777125
58378 777125 788597 799392 809153 817793 825385 832025 837713 842272 845658 848475 851758 856021 860999 866531
58364 866531 872991 880359 887665 894141 900321 907121 914409 921386 927941 934642 941678 948763 955859 963070
58350 963070 970112 976787 983775 992065 1001738 1012105 1022699 1033316 1043608 1053710 1064891 1078352
58338A078352J5316J5899J6363J7726J9181J9746K0059K1019K1968K1888K1240
58327A288757K1008K0850J9773J7876J5865J3682J1095Q875P980Q123Q492R170
58315A451546J0594J2386J4020J5897J8404K0789K2326K3745K6040K8729L0752
58304A675228L2385L4657L7615M0652M3913M7876N2215N6520O1511O8109P6020
58293B226701Q4613R4379J06030J19055J32686J47378J63555J79702J93331K02928
58283C650358K07324K04168J91167J68245J36793R7861N3135O732l6327p3048
58273D606408j02094j21699j30553j30196j23937j13632r9599q3096o6331n0217
58263C585054l4490j9743p076M001J5015K5996L5706M4051N2017N9514O5694P1115
$$ plain form
58338 1078352 1093668 1109567 1125930 1143656 1162837 1182583 1202642 1223661 1245629 1267517 1288757
58327 1288757 1309765 1330615 1350388 1368264 1384129 1397811 1408906 1417781 1425761 1433884 1442376 1451546
58315 1451546 1462140 1474526 1488546 1504443 1522847 1543636 1565962 1589707 1615747 1644476 1675228
58304 1675228 1707613 1742270 1779885 1820537 1864450 1912326 1964541 2021061 2082572 2150681 2226701
58293 2226701 2311314 2405693 2511723 2630778 2763464 2910842 3074397 3254099 3447430 3650358
58283 3650358 3857682 4061850 4253017 4421262 4558055 4655916 4709051 4715783 4679456 4606408
58273 4606408 4504314 4382615 4252062 4121866 3997929 3884297 3784698 3701602 3635271 3585054
58263 3585054 3550564 3530821 3523745 3527746 3542761 3568757 3604463 3648514 3700531 3760045 3825739 3896854
58251C896854P7273Q4134R0408R5992J01844J07959J13810J20244J28313J36763
58241D953594J43506J49191J56456J65958J76063J86095J96944K08725K20832
58232F557364K34058K49657K66727K83581L01115L21536L44429L67785L92295
58223I318547M20742M53599M89278N28193N72339O21396O73866P31540P98084
58214A4607584Q73783R56995J050327J159791J288426J437018J610795J818742
58206B4803461K066616K357884K700943L107040L581577M127567M758581N497943
58198E3001612O365098P376224Q560507R961598J1621741J3585339J5923934J8725166
58190A45121219K2017873K5686330K9416557L2638202L4459290L3745653K9508752
$$ plain form
58251 3896854 3974127 4058261 4148669 4244661 4346505 4454464 4568274 4688518 4816831 4953594
58241 4953594 5097100 5246291 5402747 5568705 5744768 5930863 6127807 6336532 6557364
58232 6557364 6791422 7041079 7307806 7591387 7892502 8214038 8558467 8926252 9318547
58223 9318547 9739289 10192888 10682166 11210359 11782698 12404094 13077960 13809500 14607584
58214 14607584 15481367 16438362 17488689 18648480 19936906 21373924 22984719 24803461
58206 24803461 26870077 29227961 31928904 35035944 38617521 42745088 47503669 53001612
58198 53001612 59366710 66742934 75303441 85265039 96886780 110472119 126396053 145121219
58190 145121219 167139092 192825422 222241979 254880181 289339471 323085124 352593876
58183C52593876K1489980J0536742j569203j2767796k1454056k6890189k9175373
58176B92763981k8928422k6940946k3976943k0722352j7766657j5525038j4135060
58169A44768563j3435304j3076706j2705539j2107062j1241907j0188062r054518
58162F2959465p927408o861419n889442n027154m275499l628867l081677k625637
58154B3642362k246275j928394j662923j444205j263707j111790r83680q78304
58146A2123084p92298p19846o57557o04794n59565n18187m78956m42434m08205
58137F941242l74664l41869l11424k83579k57272k32732k11204j92420j75201
58128D560877j60355j50030j44210j40506j37410j35140j33181j29679j23653
$$ plain form
58183 352593876 374083856 384620598 383051395 370283599 348829543 321939354 292763981
58176 292763981 263835559 236894613 212917670 192195318 174428661 158903623 144768563
58169 144768563 131333259 118256553 105551014 93443952 82202045 72013983 62959465
58162 62959465 55032057 48170638 42281196 37254042 32978543 29349676 26267999 23642362
58154 23642362 21396087 19467693 17804770 16360565 15096858 13985068 13001388 12123084
58146 12123084 11330786 10610940 9953383 9348589 8789024 8270837 7791881 7349447 6941242
58137 6941242 6566578 6224709 5913285 5629706 5372434 5139702 4928498 4736078 4560877
58128 4560877 4400522 4250492 4106282 3965776 3828366 3693226 3560045 3430366 3306713
58119C306713j15721j06451r5930q4905p4357o3921n2611m0862k9864j9180p252
58108B615659N743J7727K7305L4337L7847L5671K6658J1489q831l3186n8792q1493
58096B630134r8556j09925j16426j18323j16028j10788j03900r6156q8156q0246
58086A591630p2223o4131n7105n2133m8447m4513m0293l6870l4195l1184k7955
58075A082581k5913k5325k4687k3028k1105j9708j8336j6352j4123j2292j0987
58064H70725j0231j0146j0267r736q498p409o900o596o459p088q517r798j0155
58051G58925r639q424o587m792m029m283m443l910l241k916k578j894j092k01
58037G00896J177K908M161M723N456O906Q378R048R168R469J0144J1044J2259
$$ plain form
58119 3306713 3190992 3084541 2988611 2903706 2829349 2765428 2712817 2671955 2642091 2622911 2615659
58108 2615659 2621402 2639129 2666434 2700771 2738618 2774289 2800947 2812436 2803605 2770419 2711627 2630134
58096 2630134 2531578 2421653 2305227 2186904 2070876 1960088 1856188 1760032 1671876 1591630
58086 1591630 1519407 1455276 1398171 1346038 1297591 1253078 1212785 1175915 1141720 1110536 1082581
58075 1082581 1056668 1031343 1006656 983628 962523 942815 924479 908127 894004 881712 870725
58064 870725 860494 850348 840081 830345 821847 814438 807538 800942 794483 787395 778878 769080 758925
58051 758925 749286 740862 734275 729483 725454 721171 716728 712818 709577 706661 704083 702189 701097 700896
58037 700896 702073 704981 709142 713865 719321 726227 734605 743653 752821 762290 772434 783478 795737
58024G95737J3914J5863J8087K0920K4504K8564L2958L7932M3495M9167N4696
58013A135837O0380O6307P1842P6159P8681P8650P4945O7050N5868M3079K9885
58002A838683J6708L895p712j7111k4038k9362l4199l8490m0995m0960l9121l6474
57990A550824l2832k7508k0806j3654o193J879R648J5187J7636J7785J6268J2346
57978A540580N107n092j6889k8805l9412m7455n2453n4696n4415n1466m6157l9576
57966A109271l2693k5703j8609j1816n827q86K786M979N933O225O024M936K764
57953A047384j34l338o632r633j1786j2854j2910j1838r465o134k376J855O784
57940I68923J1734J5504J7732J8782J8224J4749Q040m66r181j7585k5467l2199
$$ plain form
58024 795737 809651 825514 843601 864521 889025 917589 950547 988479 1031974 1081141 1135837
58013 1135837 1196217 1262524 1334366 1410525 1489206 1567856 1642801 1709851 1765719 1808798 1838683
58002 1838683 1855391 1859286 1851574 1834463 1810425 1781063 1746864 1708374 1667379 1626419 1587298 1550824
57990 1550824 1517992 1490484 1469678 1456024 1449831 1451710 1461358 1476545 1494181 1511966 1528234 1540580
57978 1540580 1545687 1540595 1523706 1494901 1455489 1408034 1355581 1300885 1246470 1195004 1148847 1109271
57966 1109271 1076578 1050875 1032266 1020450 1014623 1013737 1016523 1021502 1027435 1033660 1039684 1044620 1047384
57953 1047384 1047250 1043912 1037280 1027647 1015861 1003007 990097 978259 968794 962660 960284 962139 968923
57940 968923 980657 996161 1013893 1032675 1050899 1065648 1073688 1073222 1064041 1046456 1020989 988790
57928I88790l7433m1447m3948m3680m0165l4913k9913k5624k1360j6906j2666
57917F40735q788n254k544j232j029j013o95l58m71j299k835m665o207p361q568
57902E88416r928j0873j1034j0723j0105q653o160l526j700m20J096K684L515
57889E22589L624M132N913Q709J1533J3419J3879J3229J2413J1987J1480J0114
57877F43021P870N307K664k32l366o535r738j2943j5584j7002j7402j7650j8003
57864E40407j7669j5897j3095j0453q653p207n156k237Q87L570N949Q317J0201
57851D88964J0843J0505J0264J0346R678P605M951K737P88j492l785n426o720
57838E39258q399j0149j0916j0618j0326j0670j1061j0783r883q633o970m903
$$ plain form
57928 988790 951357 909910 865962 822282 782117 747204 717291 691667 670307 653401 640735
57917 640735 631947 626693 624149 622917 621888 620875 620180 619822 619351 618052 615217 610552 604345 596984 588416
57902 588416 578488 567615 556581 545858 535753 527100 520940 517414 515714 515294 516390 519074 522589
57889 522589 526213 530345 536258 544967 556500 569919 583798 597027 609440 621427 632907 643021
57877 643021 650891 656198 658862 658630 655264 648729 638991 626048 610464 593462 576060 558410 540407
57864 540407 522738 506841 493746 483293 474640 467433 462277 460040 460927 464497 470446 478763 488964
57851 488964 499807 510312 520576 530922 540600 548205 553156 555893 556681 555189 551404 545978 539258
57838 539258 530859 520710 509794 499176 488850 478180 467119 456336 446453 437820 430850 425947
57826D25947k957j618o32Q36L465P222J1375J5092J8253K1578K5607K9905L3728
57813E87801L7209M1099M5485M9482N2375N4244N5295N5265N3841N1051M6737
57802A129884M0141L0647J8792O018o465j8212k9003l8261m5339n0148n3175n4837
57790I30042n5066n3742n1274m8349m5186m1465l7133l2801k9093k6054k3462
57779D86417k1324j9636j8053j6298j4714j3805j3353j2510j0802q578o456m697
57767C26191l251k028r84n6Q10J602K206K470K561L161M848P144Q757R107R149
57752C71687J0117J1814J2842J2316J0688Q915P523O488N560M503L353K518K357
57739D70681K719L158L454L583L456L174L329M418O037P256P819Q372R481J1063
$$ plain form
57826 425947 422990 421372 420740 421576 425041 432263 443638 458730 476983 498561 524168 554073 587801
57813 587801 625010 666109 711594 761076 813451 867695 922990 978255 1032096 1083147 1129884
57802 1129884 1170025 1200672 1219464 1225482 1219017 1200805 1171802 1133541 1088202 1038054 984879 930042
57790 930042 874976 821234 769960 721611 676425 634960 597827 565026 535933 509879 486417
57779 486417 465093 445457 427404 411106 396392 382587 369234 356724 345922 337344 330888 326191
57767 326191 322940 320912 319928 319872 320682 322284 324490 326960 329521 332682 337530 344674 353431 362538 371687
57752 371687 381804 393618 406460 418776 429464 438379 445902 452390 457950 462453 465806 468324 470681
57739 470681 473400 476558 480012 483595 487051 490225 493554 497972 504009 511265 519084 527456 536937 548000
57725E48000J2843J4684J6216J6864J6643J6422J6917J7823J8417J8748J9647
57714G33224K1687K4607K7819L1115L4715L8836M3463M8499N3969N9902O6098
57703A183934P2205P8118Q4147R0604R7339J03817J09467J13822J16372J16478
57693B166303J13344J06074R4119P7895N8691L7699J5430p495k9360m7883o1725
57682B523092p0961p6012p6758p2900o4735n3027l8293k0566J96K3667M9109P5553
57670B198365J01585J24432J39071J38840J18224P6309J8470m5122j03153j47013
57660B620008j72974j82023j77986j65370j47926j28116j07326q6655o7449n0740
57650A333443l6215k2543r040L514J4152K3211L1911M0887M9920N8714O7172P4969
$$ plain form
57725 548000 560843 575527 591743 608607 625250 641672 658589 676412 694829 713577 733224
57714 733224 754911 779518 807337 838452 873167 912003 955466 1003965 1057934 1117836 1183934
57703 1183934 1256139 1334257 1418404 1509008 1606347 1710164 1819631 1933453 2049825 2166303
57693 2166303 2279647 2385721 2479840 2557735 2616426 2654125 2669555 2662060 2632700 2584817 2523092
57682 2523092 2452131 2376119 2299361 2226461 2161726 2108699 2070406 2049840 2050036 2073703 2122812 2198365
57670 2198365 2299950 2424382 2563453 2702293 2820517 2896826 2915296 2870174 2767021 2620008
57660 2620008 2447034 2265011 2087025 1921655 1773729 1645613 1538287 1451632 1384183 1333443
57650 1333443 1297228 1274685 1265645 1269159 1283311 1306522 1338433 1379320 1429240 1487954 1555126 1630095
57638A630095Q1687Q7354R2162R5645R6758R4821Q9795Q1622O9930N4564L5907
57627B510340J4624q339l1421n2790p1281q6564r8392j06321j10348j11218j09706
57616A738584j06085j00606r4062q7493q1435p5653o9465o2476n5302m9391m5581
57605I11035m2930l9625l5142l0720k7619k5651k3830k1665j9303j6997j5031
57594F12522j3751j3109j2428j1159r555q278p557p161o874o581o040n042l639
57581E01348k018l28J078J634J164L78L14J389L172M946O226O895P149P261P328
57566E47936P388P757Q854J0549J2072J2934J3498J4417J5846J7665K0091K3491
57554G12498K7695L1926L5541L8598M1793M5848N0872N6147O0841O4929O9071
$$ plain form
57638 1630095 1711782 1799136 1891298 1986943 2083701 2178522 2268317 2349939 2419869 2474433 2510340
57627 2510340 2524964 2516625 2485204 2432414 2361133 2274569 2176177 2069856 1959508 1848290 1738584
57616 1738584 1632499 1531893 1437831 1350338 1268903 1193250 1123785 1061309 1006007 956616 911035
57605 911035 868105 828480 793338 762618 734999 709348 685518 663853 644550 627553 612522
57594 612522 598771 585662 573234 562075 552520 544242 536685 529524 522650 516069 510029 504987 501348
57581 501348 499330 499002 500080 501714 502878 503256 503570 504959 508131 513077 519303 526198 533347 540608 547936
57566 547936 555324 563081 571935 582484 594556 607490 620988 635405 651251 668916 689007 712498
57554 712498 740193 772119 807660 846258 888051 933899 984771 1040918 1101759 1166688 1235759
57543A235759P3471P7401Q0127Q1609Q1808P9838P4559O5710N3847L9430K2761
57532A966320M696j3398l0430m5824n8996o9299p6600q1258q3390q2744p9554
57521A349523p4930o9988o4988n9652n4001m8409m3144l8212l3522k8958k4365
57510H09354j9844j5875j2881j0673q616o307l878j611M06K144L533M720O285
57497G46757Q740J1859J4877J7512K0420K4283K8752L2772L5940L9003M2890M7739
57485A071544N3083N8526O3830O8573P2242P4595P5583P4957P2228O6931N8657
57474A810749M6993L1939J4458l725k1183l7501n2801o6710p8016q5394q8497
57463A470312q8287q6327q3663q0387p6213p1130o5472n9515n3448m7581m2310
$$ plain form
57543 1235759 1309230 1386631 1466758 1548367 1630175 1710013 1784572 1850282 1904129 1943559 1966320
57532 1966320 1971016 1957618 1927188 1881364 1822368 1753069 1676469 1595211 1511821 1429077 1349523
57521 1349523 1274593 1204605 1139617 1079965 1025964 977555 934411 896199 862677 833719 809354
57510 809354 789510 773635 760754 750081 741465 735158 731280 729669 730075 732219 735752 740472 746757
57497 746757 755497 767356 782233 799745 820165 844448 873200 905972 941912 980915 1023805 1071544
57485 1071544 1124627 1183153 1246983 1315556 1387798 1462393 1537976 1612933 1685161 1752092 1810749
57474 1810749 1857742 1889681 1904139 1900414 1879231 1841730 1788929 1722219 1644203 1558809 1470312
57463 1470312 1382025 1295698 1212035 1131648 1055435 984305 918833 859318 805870 758289 715979
57452G15979l7783l3833l0320k7284k4701k2348k0082j8064j6506j5293j4041
57441D55724j2536j0909r431q272p499p084o892o756o676o713o687o185n111l988
57427C50985l415l330l186k763k329k001j546r82p98j144j333o88M68J256J403
57412C30597J378J515J723J922K133K154J773J360J557K256K588K180J736K018
57398C56890K835L476L713L825M022M239M310M003L169K074J365J357J628J587
57384C98493J222J045J503K606L820M276L551K358K014K927M192M880N084N277
57370D43248N369N070M666M669N032N381N709O165O472O348O242O880Q187R408
57356E28846J0175J0730J1177J1331J1381J1816J2568J2954J2659J2125J1745
$$ plain form
57452 715979 678196 644363 614043 586759 562058 539710 519628 501564 485058 469765 455724
57441 455724 443188 432279 422848 414576 407077 399993 393101 386345 379669 372956 366269 360084 354973 350985
57427 350985 347570 344240 341054 338291 335962 333961 332415 331433 330635 329491 328158 327470 327938 329194 330597
57412 330597 331975 333490 335213 337135 339268 341422 343195 344555 346112 348368 350956 353136 354872 356890
57398 356890 359725 363201 366914 370739 374761 379000 383310 387313 390482 392556 393921 395278 396906 398493
57384 398493 399715 400760 402263 404869 408689 412965 416516 418874 420888 423815 428007 432887 437971 443248
57370 443248 448617 453687 458353 463022 468054 473435 479144 485309 491781 498129 504371 511251 519438 528846
57356 528846 539021 549751 560928 572259 583640 595456 608024 620978 633637 645762 657507
57345F57507J1389J0965J0840J1221J1738J2005J2173J2527J2902J3025J3104
57334G89396J3540J4246J4642J4425J3933J3725J4005J4539J5065J5645J6508
57323I49669J7612J8624J9468K0536K2001K3296K3730K3609K4005K5392K7059
57312A195001K8073K8219K7689K6461K4499K2262K0332J8579J6186J2715Q757
57301A428773N247K391m07l449o039p202o957o314n902n215l518j060J217K889
57287A394454M314N792P139Q191R204J0524J2235J4246J6383J8302J9635K0321
57275A540740K0571K0526K0312K0366K1218K2834K4598K6035K7152K7975K8309
57264A800636K8223K8308K9000K9920L0267K9708K8661K7760K7348K7376K7662
$$ plain form
57345 657507 668896 679861 690701 701922 713660 725665 737838 750365 763267 776292 789396
57334 789396 802936 817182 831824 846249 860182 873907 887912 902451 917516 933161 949669
57323 949669 967281 985905 1005373 1025909 1047910 1071206 1094936 1118545 1142550 1167942 1195001
57312 1195001 1223074 1251293 1278982 1305443 1329942 1352204 1372536 1391115 1407301 1420016 1428773
57301 1428773 1434020 1436411 1436004 1432555 1426516 1419314 1412357 1406043 1400141 1394926 1391408 1390348 1391565 1394454
57287 1394454 1398768 1404560 1411699 1419890 1429094 1439618 1451853 1466099 1482482 1500784 1520419 1540740
57275 1540740 1561311 1581837 1602149 1622515 1643733 1666567 1691165 1717200 1744352 1772327 1800636
57264 1800636 1828859 1857167 1886167 1916087 1946354 1976062 2004723 2032483 2059831 2087207 2114869
57253B114869K8077K8485K8596K8083K7083K6259K6142K6528K6897K7215K7938
57242B416172K9261L0920L2678L4544L6471L8190L9463M0130M0112L9780M0086
57231B817807M1638M3616M4426M3517M1937M0952M0812M1118M1538M1836M1805
57220C281002M1675M2014M2927M3861M4558M5497M6943M8211M8549M8263M8267
57209C781767M8843M9491M9805M9882N0009N0330N0742N0849N0241M8993M7633
57198D328585M6393M5012M3457M2197M1455M0808M0000L9486L9523L9395L8407
57187D784718L7105L6611L7023L7409L7146L6428L5583L4740L4220L4396L5063
57176E180442L5541L5515L5206L4725L3983L3252L3138L3772L4516L4637L3857
$$ plain form
57253 2114869 2142946 2171431 2200027 2228110 2255193 2281452 2307594 2334122 2361019 2388234 2416172
57242 2416172 2445433 2476353 2509031 2543575 2580046 2618236 2657699 2697829 2737941 2777721 2817807
57231 2817807 2859445 2903061 2947487 2991004 3032941 3073893 3114705 3155823 3197361 3239197 3281002
57220 3281002 3322677 3364691 3407618 3451479 3496037 3541534 3588477 3636688 3685237 3733500 3781767
57209 3781767 3830610 3880101 3929906 3979788 4029797 4080127 4130869 4181718 4231959 4280952 4328585
57198 4328585 4374978 4419990 4463447 4505644 4547099 4587907 4627907 4667393 4706916 4746311 4784718
57187 4784718 4821823 4858434 4895457 4932866 4970012 5006440 5042023 5076763 5110983 5145379 5180442
57176 5180442 5215983 5251498 5286704 5321429 5355412 5388664 5421802 5455574 5490090 5524727 5558584
57165E558584L2176K9670K6687K3807K1354J9177J6940J4377J1376Q123N120K697
57153E770088N29j958m806p417r151r663q846o917m406j609J751N802R728J2390
57139E745515J3596J3992J3724J2017Q239K521m915j4237k5094l5781m3992m8305
57127E637280m8734m6120m1511l6020l0736k6380k2927j9660j5761j0905n234
57116E333292J133Q162J5415K2038K7684L3230M0330N0387O4194Q2056J03880
57105E781801J29469J59178J94197K36126K86749L48290M23114N12934O19115
57096H690973P43881Q89918J058311J248466J460962J698537J962462K249080
57088B0002590K550819K857496L153146L413775L614573L743197L806459L824573
$$ plain form
57165 5558584 5590760 5620430 5647117 5670924 5692278 5711455 5728395 5742772 5754148 5762271 5767391 5770088
57153 5770088 5770617 5768659 5763853 5756436 5747285 5737622 5728776 5721859 5717453 5715844 5717595 5723397 5733125 5745515
57139 5745515 5759111 5773103 5786827 5798844 5807083 5809604 5804689 5790452 5765358 5729577 5685585 5637280
57127 5637280 5588546 5542426 5500915 5464895 5434159 5407779 5384852 5365192 5349431 5338526 5333292
57116 5333292 5334425 5342587 5358002 5380040 5407724 5440954 5481284 5531671 5595865 5677921 5781801
57105 5781801 5911270 6070448 6264645 6500771 6787520 7135810 7558924 8071858 8690973
57096 8690973 9434854 10324772 11383083 12631549 14092511 15791048 17753510 20002590
57088 20002590 22553409 25410905 28564051 31977826 35592399 39335596 43142055 46966628
57080D6966628L816919L783424L687669L459125L028806K379740J566258O80175
57072F9368744k02887j046663j837245k558788l188164l702714m085257m325096
57064D8421930m420825m382873m230844l988194l679946l332314k970094k612886
57056A8803954k274225j963314j685771j443187j233917j055071r03584p75961
57048G468924o68402n77590n00944m36266l81514l34923k95062k60862k31714
57039C781647k07047j85802j66848j50005j35896j24507j14616j05073r5857q7374
57029B408622p9425p1514o3609n5880m8127l9950l1155k1520j0545K163J6704
57018B005764L3345N2504P3766R5336J14484J27399J28152J09712O8609R335n6454
$$ plain form
57080 46966628 50783547 54566971 58254640 61713765 64742571 67122311 68688569 69368744
57072 69368744 69165857 68119194 66281949 63723161 60534997 56832283 52747026 48421930
57064 48421930 44001105 39618232 35387388 31399194 27719248 24386934 21416840 18803954
57056 18803954 16529729 14566415 12880644 11437457 10203540 9148469 8244885 7468924
57048 7468924 6800522 6222932 5721988 5285722 4904208 4569285 4274223 4013361 3781647
57039 3781647 3574600 3388798 3221950 3071945 2936049 2811542 2696926 2591853 2495996 2408622
57029 2408622 2329197 2257683 2194074 2138194 2090067 2050117 2018962 1997442 1986897 1989060 2005764
57018 2005764 2039109 2091613 2165379 2260715 2375199 2502598 2630750 2740462 2809071 2818406 2761952
57007B761952j15551j58570j82024j87674j80456j65681j47092j27041j07611
56998A390252r0473p5886o2985n1258m1040l2614k5749k0273j6188j3054j0048
56987I50684o955m281k186j78J819K953K558R12j706n780j1456j7303k1299k2881
56973H64901k3077k2789k1904k0135j7745j5080j2162r145o502m314j927J170
56961G11291M534P445J0052J3119J6618J9289J9704J7318J2342N226l225j1572
56949H22141j8194k2122k3332k2383k0036j7093j4098j1060p692l981l55K793
56937F64588N540Q279J1290J4573J8000K1418K4450K6257K5628K1556J3864L348
56925H58791q536k0001k9228l5025l7498l7774l6727l4403l0921k7314k4631k2520
$$ plain form
57007 2761952 2646401 2487831 2305807 2118133 1937677 1771996 1624904 1497863 1390252
56998 1390252 1299779 1223893 1160908 1109650 1068610 1035996 1010247 989974 973786 960732 950684
56987 950684 943729 939448 937262 937084 938903 941856 944414 945326 943620 937840 926384 909081 887782 864901
56973 864901 841824 819035 797131 776996 759251 744171 732009 722864 716362 712048 710121 711291
56961 711291 715825 723270 733322 746441 763059 782348 802052 819370 831712 836938 833713 822141
56949 822141 803947 781825 758493 736110 716074 698981 684883 673823 666131 662150 661795 664588
56937 664588 670128 678407 689697 704270 722270 743688 768138 794395 820023 841579 855443 858791
56925 858791 850255 830254 801026 766001 728503 690729 654002 619599 588678 561364 536733 514213
56913E14213j9694j5869j2331j0309r565r027q189p279o452n520m330k955j591
56900D01102m90J77N27Q84J299J586J923K924M775O854Q672J0620J3175J5702
56886D69730J6960J6604J5381J3763J1205P064J732l563p700j0253j1365j1372
56874E08186j0478q770o500m184k104R1K933O441J0257J4365J9029K4026K8577
56861E81869L2278L5474L8197L9160L6509K9505J9104O974n419j6657k5045k9315
56849G42634k9692k7738k4808k1010j5888r692l297K934R438J6472K3595L0468
56837F93416L7592M5618N4282O2363O8258P0044O5536N3336L4196J1005j2517
56826A183129l3043m8232n7235o0850o0616n7549n2003m4531l6137k7599j9094
$$ plain form
56913 514213 494519 478650 466319 456010 446445 437418 429229 421950 415498 409978 405648 402693 401102
56900 401102 400612 400789 401316 402200 403499 405085 407008 409932 414707 421561 430233 440853 454028 469730
56886 469730 486690 503294 518675 532438 543643 550707 552439 548876 541176 530923 519558 508186
56874 508186 497708 488938 482438 478254 476150 476241 479174 485615 495872 510237 529266 553292 581869
56861 581869 614147 649621 687818 726978 763487 792992 812096 819070 813651 796994 771949 742634
56849 742634 712942 685204 660396 639386 623498 613806 610509 613443 622881 639353 662948 693416
56837 693416 731008 776626 830908 893271 961529 1031573 1097109 1150445 1184641 1195646 1183129
56826 1183129 1150086 1101854 1044619 983769 923153 865604 813601 769070 732933 705334 686240
56815F86240j0704k731M670J1803J9103K6765L4649M2152M8094N0958M9372M2304
56803A002675K9376J1781p376k4574l7903m7128n2140n2635m9469m4852m0344
56792F87411l5482k9286k2257j5876j0677n897q56M266R032J3299J7049K0155
56780F30881K2269K2531J9579J2599K463q627j8692k6788l2513l5481l5676l3843
56768E18702l1103k8209k5280k2135j8790j5697j3419j2014j0889r435p644n952
56756C18135m647l745l170k850k668k598k731k969k973k610k220k045j811j289
56742B79809r37j300j997k054j246l71l4J39P24J580K135K243K297K649L273L953
56726B90863M582N318O453Q006R480J0303J0515J0697J1139J1481J1350J0900
$$ plain form
56815 686240 675536 672805 677475 689278 708381 735146 769795 811947 860041 910999 960371 1002675
56803 1002675 1032051 1043832 1036456 1011882 973979 926851 874711 822076 772607 727755 687411
56792 687411 651929 622643 600386 584510 573833 567936 567080 571346 580378 593677 610726 630881
56780 630881 653150 675681 695260 707859 710322 701695 683003 656215 623702 588221 552545 518702
56768 518702 487599 459390 434110 411975 393185 377488 364069 352055 341166 331731 324087 318135
56756 318135 313488 309743 306573 303723 301055 298457 295726 292757 289784 287174 284954 282909 281098 279809
56742 279809 278872 277572 275575 273521 272275 271904 271870 272009 272733 274313 276448 278691 280988 283637 286910 290863
56726 290863 295445 300763 307216 315222 324702 335005 345520 356217 367356 378837 390187 401087
56714D01087J0459R934Q933P380N638M162L169K600K154J483O07l8q7K77O14Q42
56698D59214J254J931K544K792K762K685K543K150J415M21p41j984l200m353n544
56683D63889o771p697q024q045q403r193r654r109p870o828o363o154n867n491
56669C58420m953m073l050k424k369k384k048j561j281j101p25j63M63J308K487
56654C36546L644M279M302L891L055J907J093J203J842J967J245M20K16M84O14
56639C66708K90m92j640k842l614l757l667l838m265m429l819k358n24R25J617
56624C34295J967K634L630M345M445M242M044L691L056K501K371K397K069J454
56610C77141J129J392J890K057J700J095O73O10P17P53P46P95O69J6j002j711
$$ plain form
56714 401087 411546 421480 430413 437793 443431 447593 450762 453362 455516 456999 457606 457568 457481 457758 458372 459214
56698 459214 460468 462399 464943 467735 470497 473182 475725 477875 479290 479711 478970 476986 473786 469433 463889
56683 463889 457118 449421 441397 433352 424949 415756 406102 396993 389123 382295 375932 369778 363911 358420
56669 358420 353467 349394 346344 343920 341551 339167 337119 335558 334277 333176 332451 332288 332751 334059 336546
56654 336546 340190 344469 348771 352662 355717 357624 358717 359920 361762 363729 364974 365394 365610 366094 366708
56639 366708 366998 366506 364866 362024 358410 354653 350986 347148 342883 338454 334635 332277 331753 332678 334295
56624 334295 336262 338896 342526 346871 351316 355558 359602 363293 366349 368850 371221 373618 375687 377141
56610 377141 378270 379662 381552 383609 385309 386404 387077 387687 388404 389157 389903 390698 391367 391383 390381 388670
56594C88670j729j405j183j047q22o06m30J6Q15J285P39m82j304j267r19q57j033
56577C78441j189j413j862k320k410k056j444o85K79J412K467L200L608L956M472
56562C84456N065N423N388N079M544L674K565J687J227N88r80l281n314o501p233
56547C96387q013q656q700q234p878q075q714r289r255q411p195o434o495o871
56533B84167o842o388o039n988n814n181m363l895l928m168m262m055l583l071
56519B16590k861l104l465l302k334j010q1J61M3o3k21o34j098j136o25J7L68
56502A97245M33L46N0m69q41o17J37R41J525J997K360K316J791J293J364J869
56486B11740K164J979J760K034K690L136L088K915L115L674M146M255M096L689
$$ plain form
56594 388670 386941 385536 384353 383306 382484 381878 381448 381464 382279 383564 384303 383821 382517 381250 380331 379474 378441
56577 378441 377252 375839 373977 371657 369247 367191 365747 365062 365341 366753 369220 372420 376028 379984 384456
56562 384456 389521 394944 400332 405411 409955 413629 416194 417881 419108 419696 418716 415435 410121 403620 396387
56547 396387 388374 379718 371018 362784 354906 346831 338117 328828 319573 311162 303967 297533 291038 284167
56533 284167 277325 270937 264898 258910 253096 247915 243552 239657 235729 231561 227299 223244 219661 216590
56519 216590 213729 210625 207160 203858 201524 200514 200433 200594 200637 200574 200353 199719 198621 197485 196860 196877 197245
56502 197245 197678 198024 198074 197605 196764 196147 196284 197225 198750 200747 203107 205423 207214 208507 209871 211740
56486 211740 213904 215883 217643 219677 222367 225503 228591 231506 234621 238295 242441 246696 250792 254481
56472B54481K762J250k31q99p47n10p34j249j703k095k509k699k379j735j231
56457B39772j037r39p07l09J76N36M50j19o70o52j88J24L9j12j22k91q51j422
56439B33678j401p52r6l1m79p33j08J286K513K688J934J162J009J306J570J546
56423B45092J169M30l93q07o72m78o75j101j336j363j427j445j109n26l02q47
56407B34210j889k773l007k506j542n64P0K78K20P3p2j11P2N23J120J618J819
56390B27539J788J761J772J533Q96K61O6Q4k37p82p65P7R95J245R65O54L92J67
56372B38411L73J256K198K314J608Q63N90O54Q02R12Q35N72N42J091J873K262
56356B57156K198K050J846J331P07M77O33P12O94J040J714K041J675J003L87k45
$$ plain form
56472 254481 257243 258493 258262 257363 256616 256106 255372 254123 252420 250325 247816 245117 242738 241003 239772
56457 239772 238735 237796 237089 236780 236956 237492 237942 237823 237153 236501 236313 236437 236476 236364 236242 235951 235100 233678
56439 233678 232277 231525 231429 231398 230919 230186 230078 231364 233877 236565 238499 239661 240670 241976 243546 245092
56423 245092 246261 246691 246298 245491 244819 244341 243666 242565 241229 239866 238439 236994 235885 235359 235057 234210
56407 234210 232321 229548 226541 224035 222493 221929 221999 222277 222497 222570 222498 222387 222459 222982 224102 225720 227539
56390 227539 229327 231088 232860 234393 235289 235550 235616 235700 235463 234681 233916 233993 234988 236233 237198 237852 238244 238411
56372 238411 238784 240040 242238 244552 246160 247023 247613 248267 249069 249981 250816 251388 251930 253021 254894 257156
56356 257156 259354 261404 263250 264581 265288 265765 266398 267110 267804 268844 270558 272599 274274 275277 275664 275419
56340B75419q34r77o64m98p82r87n34L64J049J184R38P96J371K757M004L922K582
56323B89110J361J158J460J490J339J350J279Q52N15P44J205J351J316J396J230
56308C07156M26m26m36J99N41L93M38R62J487J739J942K053J636P58J61J23Q0
56291C19232l06m08L59J470J927J583J218J410J925K220K155K080K352K895L245
56276C43357L066K641K637L370M441N209N425N366N432N785O380P222Q408R808
56262D18547J0860J1017J0492J0126J0392J0873J1020J0937J1033J1220J1065
56251E37582J0578J0182R947R450Q499P494O780O046M658K394l05k671m148m783
56237F01703n197n972p055p918q266q324q356q168p264n441l203j584j355k268
$$ plain form
56340 275419 274585 273608 272944 272446 271664 270677 270143 270507 271556 272740 273678 274474 275845 278602 282606 286528 289110
56323 289110 290471 291629 293089 294579 295918 297268 298547 299399 299914 300658 301863 303214 304530 305926 307156
56308 307156 307582 307156 306720 306919 307460 307853 308291 309253 310740 312479 314421 316474 318110 318868 319029 319152 319232
56291 319232 318926 318518 318877 320347 322274 323857 325075 326485 328410 330630 332785 334865 337217 340112 343357
56276 343357 346423 349064 351701 355071 359512 364721 370146 375512 380944 386729 393109 400331 408739 418547
56262 418547 429407 440424 450916 461042 471434 482307 493327 504264 515297 526517 537582
56251 537582 548160 558342 568289 577739 586238 593732 600512 606558 611216 613610 613305 610634 606486 601703
56237 601703 596506 590534 583479 575561 567295 558971 550615 542447 535183 529742 526539 524955 523600 521332
56223E21332l238l447l112k925l023k954k523k079j919j891j788j736j865j921
56209D86911j460l72J016K319L388M249M910N268N244M941M607M417M390M514
56195E34342M809N209N585N932O365O867P326P862Q814J0112J1116J1356J1219
56182F36914J1477J2371J3537J4645J5668J6650J7671J8985K0788K2821K4640
56171H26167K6262K8156L0544L3164L5824L8867M2904M8314N5103O3070P2011
56160A300386Q1988R3543J07557J24765J45415J69385J96611K27333K61671K98497
56150C007151L34500L64605L83675L88133L76664L50482L13499K71775K31853
56141F022337J98796J74711J57854J42826J22963R4176N7254J6649k2372n5630
$$ plain form
56223 521332 518094 514647 511535 508610 505587 502633 500110 498031 496112 494221 492433 490697 488832 486911
56209 486911 485451 485079 486095 488414 491802 496051 500961 506229 511473 516414 521021 525438 529828 534342
56195 534342 539151 544360 549945 555877 562242 569109 576435 584297 593111 603223 614339 625695 636914
56182 636914 648391 660762 674299 688944 704612 721262 738933 757918 778706 801527 826167
56171 826167 852429 880585 911129 944293 980117 1018984 1061888 1110202 1165305 1228375 1300386
56160 1300386 1382374 1475917 1583474 1708239 1853654 2023039 2219650 2446983 2708654 3007151
56150 3007151 3341651 3706256 4089931 4478064 4854728 5205210 5518709 5790484 6022337
56141 6022337 6221133 6395844 6553698 6696524 6819487 6913663 6970917 6987566 6965194 6909564
56131F909564q0955r9350j15421j35359j63501k00440k43556k88137l28176l57719
56121D896950l72871l72917l59755l36612l07139k74763k42116k10932j82326
56112B237519j56886j34624j15278r8812q5407p4921o6708n9832n3399m6872m0402
56101A304378l4627k9907k5958k2516j9757j7705j5755j3465j1323r966r062p809
56089A086528o117m443k696m76J845L325L827M129M639M999N105N465O254O984
56075A119368P460Q182R394J0566J1247J1682J2177J2513J2494J2467J2830J3493
56063A253873J4224J5094J6170J7185J7812J8052J8150J8377J8915J9688K0385
56052A447925K0998K2142K4247K6657K8163K8314K7659K6920K6619K7208K8615
$$ plain form
56131 6909564 6828609 6729259 6613838 6478479 6314978 6114538 5870982 5582845 5254669 4896950
56121 4896950 4524079 4151162 3791407 3454795 3147656 2872893 2630777 2419845 2237519
56112 2237519 2080633 1946009 1830731 1731919 1646512 1571591 1504883 1445051 1391652 1344780 1304378
56101 1304378 1269751 1239844 1213886 1191370 1171613 1153908 1138153 1124688 1113365 1103399 1094337 1086528
56089 1086528 1080411 1075968 1073272 1072796 1074641 1077966 1081793 1085922 1090561 1095560 1100665 1106130 1112384 1119368
56075 1119368 1126828 1135010 1144404 1154970 1166217 1177899 1190076 1202589 1215083 1227550 1240380 1253873
56063 1253873 1268097 1283191 1299361 1316546 1334358 1352410 1370560 1388937 1407852 1427540 1447925
56052 1447925 1468923 1491065 1515312 1541969 1570132 1598446 1626105 1653025 1679644 1706852 1735467
56041A735467K9876L0134K9971L0716L2592L4593L6040L7077L7784L8195L9165
56030B111610M1670M5022M7306M8055M8916N1114N3754N5587N6951N8869O1267
56019B680121O3362O5127O7303P0327P4036P8107Q2256Q6382R0784R5774J01022
56008C554601J05945J10731J16019J21591J26567J30946J35694J40954J45708
55999D688756J49607J53843J59536J66498J74171J82679J92378K03446K16297
55990F287211K31224K47450K63864K80862K99954L21499L44586L69382L97458
55981I043490M29420M64366N02123N43813N89836O39753O94775P57531Q28767
55972A4493874R07395R94732J095404J213059J349014J506615J693149J915701
$$ plain form
56041 1735467 1765343 1795477 1825448 1856164 1888756 1923349 1959389 1996466 2034250 2072445 2111610
56030 2111610 2153280 2198302 2245608 2293663 2342579 2393693 2447447 2503034 2559985 2618854 2680121
56019 2680121 2743483 2808610 2875913 2946240 3020276 3098383 3180639 3267021 3357805 3453579 3554601
56008 3554601 3660546 3771277 3887296 4008887 4135454 4266400 4402094 4543048 4688756
55999 4688756 4838363 4992206 5151742 5318240 5492411 5675090 5867468 6070914 6287211
55990 6287211 6518435 6765885 7029749 7310611 7610565 7932064 8276650 8646032 9043490
55981 9043490 9472910 9937276 10439399 10983212 11573048 12212801 12907576 13665107 14493874
55972 14493874 15401269 16396001 17491405 18704464 20053478 21560093 23253242 25168943
55964B5168943K179343K491227K861596L298448L807074M398519N093135N912525
55956E5210810O875424Q006805R343455J0925581J2796110J5020493J7690076
55949A35868754K0868535K4503163K8349455L1903957L4330714L4484957L1216415
55942C41525950K3951387J3212877O38838j1606916k1666337k8548494l2181736
55935B85325569l3098353l2050178k9751933k6777208k3544565k0337180j7331778
55928A02434374j4627653j2268902j0258798q572402p171304o015620n067951
55921C8451744m292547l656442l132359k698795k337710k034218j777965j562028
55913A6959680j379724j223853j088925r72049q71114p83544p07094o40298n81644
$$ plain form
55964 25168943 27348286 29839513 32701109 35999557 39806631 44205150 49298285 55210810
55956 55210810 62086234 70093039 79436494 90362075 103158185 118178678 135868754
55949 135868754 156737289 181240452 209589907 241493864 275824578 310309535 341525950
55942 341525950 365477337 378690214 379329052 367722136 346055799 317507305 285325569
55935 285325569 252227216 220177038 190425105 163647897 140103332 119766152 102434374
55928 102434374 87806721 75537819 65279021 56706619 49535315 43519695 38451744
55921 38451744 34159197 30502755 27370396 24671601 22333891 20299673 18521708 16959680
55913 16959680 15579956 14356103 13267178 12295129 11424015 10640471 9933377 9293079 8711435
55904H711435n29441m82719m41205m04362l71463l42365l17051k94489k73314
55895E255026k53378k35288k18618k02274j86432j72399j60352j49053j38176
55886C539056j29148j22932j18427j13895j08769j03294r7481r1323q5222p9369
55876B489196p3236o6324n8987n2034m5948m0824l6763l4130l3694l6250m1432
55865A969574m7157n1021n2284n1767n0081m7062m2921l8610l4697l0940k7411
55854A495623k5060k4565k5350k6444k7703k9636l2391l5394l7805l9066l9195
55843A153014l8662l7868l6806l5347l3528l1253k8186k4475k1104j8757j6779
55832H30249j4188j1284r184p942o413m012j483L19J376J944J940J222j64k235
$$ plain form
55904 8711435 8181994 7699275 7258070 6853708 6482245 6139880 5822829 5528340 5255026
55895 5255026 5001648 4766360 4547742 4345468 4159036 3986637 3826285 3677232 3539056
55886 3539056 3409908 3286976 3168549 3054654 2945885 2842591 2745110 2653787 2568565 2489196
55876 2489196 2415960 2349636 2290649 2238615 2192667 2151843 2115080 2080950 2047256 2011006 1969574
55865 1969574 1922417 1871396 1819112 1767345 1717264 1670202 1627281 1588671 1553974 1523034 1495623
55854 1495623 1470563 1445998 1420648 1394204 1366501 1336865 1304474 1269080 1231275 1192209 1153014
55843 1153014 1114352 1076484 1039678 1004331 970803 939550 911364 886889 865785 847028 830249
55832 830249 816061 804777 795593 787651 781238 777226 775743 776062 777438 779382 781322 782544 782380 780145
55818G80145m819p155q543r400j0727j2469j3418j2911j1580j0169q631o717m495
55805F59111j879J402N034Q220J0964J4285J8672K3267K7071L0036L2307L3259
55793H61749L2034K8380K2419J4245M458n584j4711k2720k9714l5306l9069m1232
55781G74949m2273m2280m1197l9271l6769l3757l0572k7881k5798k3571k0721
55770D10859j7872j5842j4452j2943j1143r343p585n774m283l633l722l971m038
55757B96258l800l011j694n80l93p65n96N28J911K778L038K861K122O55j267l110
55741B94935m619n944p167p886p527o190m887m585n053n188m425l287k421j770
55727B23986j104q38j535k838l493k650q21N79O72J9j5J209K953M162M725N170
$$ plain form
55818 780145 775326 768171 759628 750228 739501 727032 713614 700703 689123 678954 670323 663606 659111
55805 659111 657232 658634 663668 671888 682852 697137 715809 739076 766147 796183 828490 861749
55793 861749 893783 922163 944582 958827 963285 957701 942990 920270 890556 855250 816181 774949
55781 774949 732676 690396 649199 609928 573159 539402 508830 480949 455151 431580 410859
55770 410859 392987 377145 362693 349750 338607 329264 321679 315905 311622 307989 304267 300296 296258
55757 296258 292458 289447 287753 287173 286780 286015 285419 285947 287858 290636 293674 296535 298657 299312 298045 294935
55741 294935 290316 284372 277205 269319 261792 255602 250715 246130 241077 235889 231464 228177 225756 223986
55727 223986 222882 222044 220509 217671 214178 211528 210707 211286 211958 211977 211962 213171 216124 220286 225011 230181
55711B30181N534N426N118N504O693P536O990N299L407J829N20p44k263m215o138
55696B70677p201p215o762o124m860k966j375o56l2J431L378M848N829P116R020
55681B65108J1187J3423J5794J8174K0464K3014K6060K9025L1187L2711L4134
55670E20281L5143L4851L3149L0637K7317K2426J5799Q413J353m864r759j2570
55658G02176j2981j1544r019n783k151J345M244O362P473P217N470K356k083p782
55644F85300j4156k0347k5996l1146l5323l7551l7585l6392l4973l3365l1189
55633C47277k8554k5781k2781j9365j5973j3451j2153j1613j1085j0154q930p835
55621A59602p144o681o106n433m888m362l526k569k229k742l376l360k818k386
$$ plain form
55711 230181 235715 241141 246259 251763 258456 265992 272982 278281 281688 283517 284037 283293 281030 276815 270677
55696 270677 263476 256261 249499 243375 238515 235549 234174 233518 233486 234917 238295 243143 248972 256088 265108
55681 265108 276295 289718 305512 323686 344150 367164 393224 422249 453436 486147 520281
55670 520281 555424 590275 623424 654061 681378 703804 719603 728016 729369 724505 714746 702176
55658 702176 689195 677651 668632 662849 660698 662043 666287 672649 680122 687339 692809 695165 693082 685300
55644 685300 671144 650797 624801 593655 558332 520781 483196 446804 411831 378466 347277
55633 347277 318723 292942 270161 250796 234823 221372 209219 197606 186521 176367 167437 159602
55621 159602 152458 145777 139671 134238 129350 124988 121462 118893 116664 113922 110546 107186 104368 101982
55607A01982k316k441k590k580k162j487j248j800k448k300j582j309j821k390
55593G3508k362j855j177k79P85J470J321N99j8j65R1N11Q32Q83Q25J031J490
55576G7490J733J667J935K895L735L443K421K112K933L603K972J587P39N81K09
55561A10055p47j624j767j342q84o69p15q26n40M43J601K032J716J740K823M369
55545A15665N458O128O943P777Q058Q019Q685J0443J2463J3863J4772J5833J7286
55532B51393J8961K0756K2548K3977K4780K5161K5252K4469K1958J7648J2235
55521D89138O117j037r295j7616k4445k8903l1036l1250l0065k8269k6606k5190
55509B41543k3583k1609j9595j7715j5633j3122j0668q940p964p237o476n801
$$ plain form
55607 101982 99666 97225 94635 92055 89893 88406 87158 85358 82910 80610 79028 77719 75898 73508
55593 73508 71146 69291 68114 67835 68620 70090 71411 72010 71992 71827 71918 72429 73261 74144 74969 76000 77490
55576 77490 79223 80890 82825 85720 89455 92898 95319 97431 100364 103967 106939 108526 109265 109846 110055
55561 110055 109308 107684 105917 104575 103691 103022 102307 101481 100941 101384 102985 105017 106733 108473 111296 115665
55545 115665 121123 127251 134194 141971 150029 158048 166733 177176 189639 203502 218274 234107 251393
55532 251393 270354 291110 313658 337635 362415 387576 412828 437297 459255 476903 489138
55521 489138 495255 494218 484923 467307 442862 413959 382923 351673 321608 293339 266733 241543
55509 241543 217960 196351 176756 159041 143408 130286 119618 110678 102714 95477 89001 83200
55497H3200n270m704l977l159k423k030k258k944l318k787j807j375j664j817
55483D3667j225l50L8q7k10j27j43n18j080j386j138n39k05n67j328j792j640
55466C1370j117n04J07N65P60R56J386J522N64j133k073j489l77j8l38n32n14
55449B9135o97q37l16O33J065P19K94K51L18L13O19J399K099K114J499O82p2o06
55431C8612p28m55j08O2J05J08l6l94q10j081j089p41o6O44J022J089J112J075
55413C8321O57o7m36O5J159K085K299J726N81p57j804k196j899j236p25p46j134
55396C5893j294r24n23p84j586k068j679p55M2M38N08L40Ml94p64j041j086q20
55378B3507n18n90r74j084n47K93Q09Q32P66R95J436J641J277N25r9l20l92o63
$$ plain form
55497 83200 77930 73226 69249 66090 63667 61637 59379 56435 53117 50330 48523 47148 45484 43667
55483 43667 42442 42092 42130 42043 41833 41706 41563 41045 39965 38579 37441 36902 36697 36130 34802 33010 31370
55466 31370 30253 29749 29856 30421 31181 32137 33523 35045 35609 34476 32403 30914 30537 30519 30181 29649 29135
55449 29135 28438 27601 27285 27918 28983 29702 29996 30247 30565 30878 31497 32896 34995 37109 38608 39290 39218 38612
55431 38612 37884 37429 37321 37383 37488 37596 37560 37166 36356 35275 34186 33445 33379 34023 35045 36134 37246 38321
55413 38321 38978 38911 38475 38540 39699 41784 44083 45809 46390 45633 43829 41633 39734 38498 37773 37027 35893
55396 35893 34599 33675 33152 32368 30782 28714 27035 26280 26322 26760 27268 27608 27612 27218 26454 25413 24327 23507
55378 23507 22989 22399 21425 20341 19794 20087 20896 21728 22494 23489 24925 26566 27843 28368 28269 27949 27557 26894
55360B6894j053j168p88l1P68J109N58o95j736j813j187o29l42k8K77J83k22l26
55342A9771N4L83L02P4o2l68r61j408j310q95o00n00m22k97PO78J551K077K038
55323B0112J795J552R98N4o24n09p9j35o06q15n81l49l36l12j82j68k82k45K9
55304A9317K28R8l14p83r93n87L94J220J103K23m75n15l83o23j017j086r49j084
55286A3774j444j392o04L70O91J91m68n40Q3Q99J323J196P73M52L94M15K41n7
55268A6297r8K99Q19J068J024Q48M17m44j420j901j779j497j318j000l56L58Q84
55251A2201J290J591J503R33K84p0k95o73j006q31n3R41J601J453M10q16j150
55234A7313l58N23N43J28L69J338J932J321j01j323j655j096j94L10J44j91j13
$$ plain form
55360 26894 25841 24673 23885 23854 24622 25731 26289 25594 23858 22045 20858 20229 19887 19859 20136 20319 20097 19771
55342 19771 19825 20208 20510 20584 20522 20154 19193 17785 16475 15580 14980 14480 14058 13761 13768 14446 15997 18074 20112
55323 20112 21907 23459 24457 24511 23887 23378 23299 23164 22558 21743 21162 20813 20477 20165 19983 19815 19533 19288 19317
55304 19317 19545 19643 19329 18546 17553 16966 17360 18580 19683 19906 19431 18916 18533 17910 16893 15807 14858 13774
55286 13774 12330 10938 10334 10704 11395 11586 11118 10578 10661 11560 12883 14079 14852 15304 15698 16113 16354 16297
55268 16297 16199 16498 17317 18385 19409 20257 20674 20230 18810 16909 15130 13633 12315 11315 10959 11317 12201
55251 12201 13491 15082 16585 17518 17802 17732 17437 16764 15758 14927 14874 15815 17416 18869 19279 18463 17313
55234 17313 16955 17478 18021 18149 18518 19856 21788 23109 23008 21685 20030 18934 18740 19050 19194 19003 18890
55217A8890K07K03j02q2M47R18Q35L63j35n68q49p33k65O4l3j66J40P19J042R89
55197B1884Q73Q59P30K97k83o93p55n02j01K51M03L15O0j98k82j20J65L45K79
55178B3527ll13m12k29Jm9l40n06l86l00n07o89m14J23L05k9l23m0P05J346J404
55157B2871Q43J03j88J36N09L52o9L2P96J510J591J241Q31L55j00QJ001K230K755
55138C6807K580K541L050L590L671L606L944M437M143K558L55j198j479j035q82
55123F6688j450k325k933l147l167l084k848k537k351k307k168j731j056l33L00
55108C5551P31P87L59l49r37j150j094r54o62n1P36J199R88K64m92r21r02m56
55090C2647K24P79R69R13Q87R21Q30O17N31P39J088J324J327J092P08L70K65L63
$$ plain form
55217 18890 19097 19300 19198 19116 19563 20481 21316 21679 21544 20976 20127 19394 19129 19193 19160 18994 19134 19853 20895 21884
55197 21884 22757 23616 24346 24643 24360 23667 22912 22410 22309 22560 22963 23278 23338 23140 22858 22738 22903 23248 23527
55178 23527 23524 23211 22799 22570 22571 22522 22182 21676 21290 20990 20483 19794 19380 19503 19808 19779 19456 19416 20121 21467 22871
55157 22871 23714 23817 23629 23765 24274 24626 24557 24589 25385 26895 28486 29727 30558 30913 30813 30821 31822 34052 36807
55138 36807 39387 41928 44978 48568 52239 55845 59789 64226 68369 70927 71282 70084 68605 67570 66688
55123 66688 65238 62913 59980 56833 53666 50582 47734 45197 42846 40539 38371 36640 35584 35251 35551
55108 35551 36282 37069 37428 37079 36142 34992 33898 32944 32282 32231 32967 34166 35154 35418 34926 34005 33103 32647
55090 32647 32871 33650 34619 35532 36419 37340 38170 38787 39318 40057 41145 42469 43796 44888 45596 45966 46231 46594
55072D6594M67N07N50N76M37J60J4K05O37J087J410J520J364J054Q50Q45R23J089
55054F0289J565K367L043L177K979K998L332L531L335L031K892K639J840O89m8
55039I7659KL22J35o37j361j524j251r66r18j134j551j986k223k344k719l420
55023G6084l910l745l281l137l134k523j236j86K9o2K68P88P96L22J0J3j48o14
55005E6334q57n64j09J90N97J285J668J135J87L4J130K686L715L945L560K726
54989G7662J792J523K485M301N996P001P514P977Q663R796J1522J3586J5403J6712
54975A91933J7903J9390K0889K1588K0887J8746J5508J1611P412K971j852o861
54963C40125j1254j4259j5985j7220j8342j8873j8307j6924j5443j4172j2839
$$ plain form
55072 46594 47061 47568 48118 48694 49131 49291 49305 49510 50147 51234 52644 54164 55528 56582 57432 58277 59200 60289
55054 60289 61854 64221 67264 70441 73420 76418 79750 83281 86616 89647 92539 95178 97018 97707 97659
55039 97659 97661 97983 98118 97481 96120 94596 93345 92379 91461 90327 88776 86790 84567 82223 79504 76084
55023 76084 72174 68429 65148 62011 58877 56354 55118 54932 54961 54899 55167 55955 56751 57073 57083 57096 56948 56334
55005 56334 55477 54913 54804 54994 55591 56876 58544 59679 59866 59900 61030 63716 67431 71376 74936 77662
54989 77662 79454 80977 83462 87763 93759 100760 108274 116251 124914 134710 146232 159818 175221 191933
54975 191933 209836 229226 250115 271703 292590 311336 326844 338455 345867 348838 346986 340125
54963 340125 328871 314612 298627 281407 263065 244192 225885 208961 193518 179346 166507
54952A66507j1243r600q258p296o515n671m550k998j081P63J945K245K103K329
54938A18680L471N398P471R126J0319J1529J3226J5287J6981J7618J7148J5907
54926B62161J3851J0425N405m09n668r660j2705j5412j7751j9046j8724j6950
54914A75517j4519j2241j0483r177q160p381o890o672o479n819m341k390r49o63
54900G9353j025r62j91N44N82J60j91m58q69j252j250r62q36r65j010q49q83j523
54882F7413k637l590l791l160k151j255n58N3L84R1n65q01l88jj06k19R9K47m85
54863D8580j521j705j039n17l48L03J635K589K390J598J053P46L92K48N36Q09
54847E5749O65N08Q14J133P53n6l69O8O67J013J285J610J815J893K199K953L969
$$ plain form
54952 166507 155264 145664 137406 130110 123595 117924 113374 110376 109295 110058 112003 114248 116351 118680
54938 118680 122151 127549 135020 144146 154465 165994 179220 194507 211488 229106 246254 262161
54926 262161 276012 286437 291842 291433 285765 276105 263400 247988 230237 211191 192467 175517
54914 175517 160998 148757 138274 129097 120937 113556 106666 99994 93515 87696 83355 80965 80016 79353
54900 79353 78328 77366 77175 77719 78301 78461 78270 77812 76943 75691 74441 73479 72643 71678 70668 69819 68936 67413
54882 67413 64776 61186 57395 54235 52084 50829 50271 50324 50708 50799 50234 49433 49045 49044 48938 48719 48818 49065 48580
54863 48580 47059 45354 44315 43798 43450 43753 45388 47977 50367 51965 53018 53764 54156 54404 54940 55749
54847 55749 56414 56922 57736 58869 59622 59566 59197 59265 59932 60945 62230 63840 65655 67548 69747 72700 76669
54830G6669M962N833O548P079P527Q141R150J0703J2740J4832J6355J7103J7394
54817B15036J7406J6746J4972J2191Q683M467l11m862q330j0695j2520j4011j4849
54804B23923j4828j4042j2587j0682q976q047p643o970n742m397l350k598k030
54791A22031j507p47L00J100J245J395K567M585O214P028P996R852J2014J3716
54777A87789J5221J7022J8641J9155J8462J7084J5178J2503R136N383J351k607
54765C34318n379o033n289n046o271q097r239r557r878j0792j2121j3257j3743
54752B19616j3622j3346j3157j2768j1850j0726r983r510q601p097n763n185m905
54739I3103m162l009k175k053k345k537k369j836j203r36j280j860j987j499r99
$$ plain form
54830 76669 81631 87464 94012 101091 108618 116759 125909 136612 149352 164184 180539 197642 215036
54817 215036 232442 249188 264160 276351 285034 289501 289190 284328 275998 265303 252783 238772 223923
54804 223923 209095 195053 182466 171784 162808 154761 147118 140148 134406 130009 126659 124061 122031
54791 122031 120524 119777 120077 121177 122422 123817 126384 130969 137183 144211 152207 162059 174073 187789
54777 187789 203010 220032 238673 257828 276290 293374 308552 321055 330191 335574 336925 334318
54765 334318 328939 322906 317617 312571 306300 298203 288964 279407 269529 258737 246616 233359 219616
54752 219616 205994 192648 179491 166723 154873 144147 134164 124654 116053 108956 103193 98008 93103
54739 93103 88941 85932 83757 81704 79359 76822 74453 72617 71414 70478 69198 67338 65351 63852 62853
54724F2853j140j800k138j479q2J092J368R91N81K77k23q97j198q70k91J88P50
54707E7982J527K019J751J075O26K65n54j504j491k78R76J270J003J036J259R32
54691F7894J01l52kO05R04J063J443J851J787J182M99K17M86J207K223L259L953
54674H8320M079L846L832M357M981M934M110L285L158L560L992M576N799P474
54660A50303Q741R325J0113J2006J4602J6596J7359J7546J8076J8897J9075J7807
54648C30446J5040J1111O181L46n842j1454j5872j9114k1269k2015k1148j9296
54636B27114j7549j6369j5284j3733j1816j0060q816q057p483o708n547m263l300
54623I8129k785k474k206k055j989j771j347r28o14l15j18l34r26j370j360j172
$$ plain form
54724 62853 61713 59913 57775 56296 56214 57306 58674 59665 60246 60523 60300 59403 58205 57335 57044 57232 57982
54707 57982 59509 61528 63279 64354 64980 65245 64691 63187 61696 61418 62394 63664 64667 65703 66962 67894
54691 67894 67995 67643 67641 68246 69150 70213 71656 73507 75294 76476 76975 77192 77678 78885 81108 84367 88320
54674 88320 92399 96245 100077 104434 109415 114349 118459 121744 124902 128462 132454 137030 142829 150303
54660 150303 159044 168369 178482 190488 205090 221686 239045 256591 274667 293564 312639 330446
54648 330446 345486 356597 362778 363124 357282 345828 329956 310842 289573 267558 246410 227114
54636 227114 209565 193196 177912 164179 152363 142303 133487 125430 117947 111239 105692 101429 98129
54623 98129 95344 92870 90664 88609 86620 84849 83502 82574 81960 81645 81527 81193 80267 78897 77537 76365
54607G6365j134j141j069j155j410j204j10J128J276K05r24j100m83J99O00Q07
54591G0850Q40N88P3n05r45j129j019p27m81m51n83o80n87k86J01M50P28R31R71
54572F8139P57L82L9k27m66m88L1R37J536J370Q30N98Q53J354K007K816L413L318
54554H7199K646K123K254K868L551M199M965N879O732P243P378P514Q071Q889
54540A61511R255Q790Q013P538O985N365K421r68l850o034p696q772r082q784
54526A64692q300p949p818p785p605p067o242n362m552l842l299k938k570k111
54512H7252j856j965j882r61L81R37L73k67p5M38K74m96r35o81k79j87k29j87
54494G9655j94l03k16J85M07p4j018j650j552j026n39j82J42L29J97p2n7L01N56
$$ plain form
54607 76365 75231 74090 73021 71866 70456 69252 69142 70270 71546 71751 70827 69727 69244 69443 70043 70850
54591 70850 71690 72278 72351 71846 70901 69772 68753 68026 67545 67094 66511 65831 65244 64958 65059 65509 66237 67168 68139
54572 68139 68896 69278 69317 69090 68624 68136 68167 69104 70640 72010 72840 73438 74291 75645 77652 80468 83881 87199
54554 87199 89845 91968 94222 97090 100641 104840 109805 115684 122416 129659 137037 144551 152622 161511
54540 161511 170766 179556 187569 195107 202092 207457 209878 208910 205060 199026 191330 182558 173476 164692
54526 164692 156392 148443 140625 132840 125235 118168 111926 106564 102012 98170 94871 91933 89363 87252
54512 87252 85396 83431 81549 80588 80969 81906 82279 82012 81937 82375 82649 82153 81218 80537 80258 80071 79842 79655
54494 79655 79461 79158 78942 79127 79534 79460 78442 76792 75240 74214 73675 73493 73635 73964 74161 74089 74032 74333 74889
54475G4889L63o7l83o09r52j329j516j621j874k032j593o80j09l06o35l08M56
54458F1694P28K01m11m03lJ34L0L70J334K049J663N79q5p5j92p81j034l63M04
54439F5839J78o17o37K66P53o1j395j957j405l25N26N50m05j611j982j290l46
54422E6081K96R43J723J932J181K98K16O67R28J156J870K535K043M97p40q60m40
54405G0326k32k01j11j65n30q67r16q93r81q51k71L25L57p6m52n84o32n51j51
54386F2544L64M33p8n48k86N81J223R86M4q77j226j013n93k68j09j1J47L55M95
54367F2163N51P28J108J292P49l62j135r14l3P02R16P41L30j75m15j20L96N34
54349F7056K28j2J16L57M12L80M43M17J4o81j173j071n25j17k14m82k70M60R54
$$ plain form
54475 74889 75252 75185 74802 74193 73241 71912 70396 68775 66901 64869 63276 62596 62487 62181 61546 61238 61694
54458 61694 62422 62623 62212 61809 61806 61940 61970 62340 63674 65723 67386 67965 67880 67805 67613 66832 65798 65435 65839
54439 65839 66017 65400 64763 65029 65782 65721 64326 62369 60964 60639 61165 61715 61310 59699 57717 56427 56081
54422 56081 56377 57320 59043 60975 62156 62454 62670 63337 64265 65421 67291 69826 71869 72366 71626 70766 70326
54405 70326 70094 69893 69782 69617 69087 68220 67304 66411 65430 64579 64308 64633 64990 64914 64462 63878 63246 62695 62544
54386 62544 62908 63341 63263 62715 62429 63010 64233 65219 65263 64386 63160 62147 61554 61286 61177 61166 61313 61668 62163
54367 62163 62714 63442 64550 65842 66591 66229 65094 64180 64147 64849 65765 66506 66836 66661 66246 66126 66522 67056
54349 67056 67284 67272 67388 67745 68157 68537 68980 69397 69411 68730 67557 66486 65961 65844 65630 65148 64878 65338 66292
54330F6292P07K16J92L90j5j039j699j377o16k46l66o05p95q48m74L26Q56M63
54312F1362m36p46j13O28N97q3o37o14k38M0m3m70r84j183q82l32K5P2Q7K74M96
54291E6820N62M92L08j44q43j276j018m59l98q99j147o44O3K95K25M50R36J149
54273E4472R81Q67R94J046Q01M88M11N77P92Q29N12m4l32n3L42J40o04j096q57
54254F0266k17L48P36Q94O86K55J07M17P57P86O85O60N30K85L97J000J253L63
54236G0208j047j502n88M87M44n79j457j445p45N2N95Q87J021R45N16k30r67j339
54218F5256j298j029n71K00J098J431O53p75j587r50N67J602J471P52L01J59k25
54201F7055r73j527j466j115j025j140q50J06J044Q99n17k085k522j879j411j800
$$ plain form
54330 66292 66999 67215 67407 67797 67782 66743 65044 63667 63051 62805 62439 61834 61039 60191 59717 60043 60899 61362
54312 61362 60926 60180 60067 60695 61292 61209 60572 59958 59720 59760 59717 59247 58263 57080 56198 55866 55891 55963 56050 56324 56820
54291 56820 57382 57874 58182 58038 57195 55919 54901 54442 54044 53145 51998 51354 51417 51712 51937 52387 53323 54472
54273 54472 55453 56320 57314 58360 59161 59649 60060 60637 61429 62258 62770 62726 62394 62341 62683 62823 62219 61123 60266
54254 60266 60049 60397 61133 62027 62713 62968 63075 63492 64249 65035 65720 66380 66910 67195 67592 68592 69845 70208
54236 70208 69161 67659 67071 67558 68002 67423 65966 64521 63776 63828 64423 65310 66331 67276 67792 67562 66595 65256
54218 65256 63958 62929 62358 62558 63656 65087 65740 64965 63378 62428 62995 64597 66068 66820 67121 67280 67055
54201 67055 66082 64555 63089 61974 60949 59809 58959 59065 60109 61008 60491 58406 55884 54005 52594 50794
54185E0794k215j610l05N42O50P67J174J215N37k11m11l57n34p25n11q6R8P6O8
54166D8956r9n76q34k49Q47J446J089J58q42j608j726q89M20J212J096O19M01
54149D9421N12Q08J276J711J622Q32j07m68m9Q17J673K135J983J338N88J4l80
54132F3726o27o36m34j93M5M15Q36Q80L31m06p08m56j02n4k70m24l66k66l85o93
54112F0213q78p52m99m22n40o66p38q55j003j038q59m85J0L99L67j2j04N46J438
54093E4122J592Q07j01l82j54Q8K50O10J293K064K489K225J375N35J98J58o1l11
54075F6797%Q27J344J136Q16J005J379J333R61P43O84M95L21M83P48N84J26J23
54057G9905R02J865K262J954J340P96M11P4j92o9P26J820K367K106J719J800K056
$$ plain form
54185 50794 48579 46969 46664 47206 47856 48623 49797 51012 51549 51338 50927 50570 50036 49311 48800 48714 48812 48888 48956
54166 48956 48857 48281 47447 47198 48045 49491 50580 50738 49896 48288 46562 45673 46093 47305 48401 49020 49421
54149 49421 49933 50741 52017 53728 55350 56182 56075 55607 55558 56375 58048 60183 62166 63504 64092 64106 63726
54132 63726 63099 62463 62029 61836 61881 62296 63132 64012 64343 63937 63229 62773 62671 62617 62347 61923 61557 61291 60906 60213
54112 60213 59335 58583 58084 57662 57122 56456 55718 54863 53860 52822 51963 51478 51488 51887 52254 52242 52138 52684 54122
54093 54122 55714 56521 56420 56038 55884 55972 56222 56832 58125 60189 62678 64903 66278 66813 67011 67169 67108 66797
54075 66797 66797 67624 68968 70104 70920 71925 73304 74637 75598 76341 77025 77520 77841 78324 79072 79656 79782 79905
54057 79905 80807 82672 84934 86888 88228 89024 89435 89509 89317 89248 89974 91794 94161 96267 97986 99786 101842
54040A01842K046K090K621L150K976K544K882L857M272L829L646M427N418N763
54026A51363N758N920N844N013L926L363L078K292J138M90O01Q91R71R48P56P8
54010A92430r32j729k157k538k887k951l024l828n184n754m635k638j356j427
53996A51390k248l034l472l512l120k397j675j393j834k836l689l614k515j107
53982A14944j97l3m08j054j782k425k878l055k808k113j344r60q70n14K84J030
53966I5817J269J149R45O16J99J69Q04J559J714J353J103J077Q23L12K49J145
53950A10303K578L655L922L605L247L283L813M576N243N693N962O049N967N904
53936A73800O050O330O497O346N633M051J700o00j986k442k577k599k086q90M19
$$ plain form
54040 101842 103888 105978 108599 111749 114725 117269 120151 124008 128280 132109 135755 140182 145600 151363
54026 151363 157121 163041 168885 173898 177824 181187 184265 186557 187695 188185 188786 189677 190648 191596 192352 192430
54010 192430 191498 189769 187612 185074 182187 179236 176212 172384 167200 161446 156811 154173 152817 151390
53996 151390 149142 146108 142636 139124 136004 133607 131932 130539 128705 125869 122180 118566 116051 114944
53982 114944 114747 114714 114306 113252 111470 109045 106167 103112 100304 98191 96847 95887 95017 94503 94787 95817
53966 95817 97086 98235 99180 99796 99995 100164 100968 102527 104241 105594 106697 107774 108597 108909 109158 110303
53950 110303 112881 116536 120458 124063 127310 130593 134406 138982 144225 149918 155880 161929 167896 173800
53936 173800 179850 186180 192677 199023 204656 208707 210407 209807 207821 205379 202802 200203 198117 197227 197646
53921A97646J246J658K063K619L244L890M513M975N212N398N718O156O574O815
53907B57727O729O353O033N992N843M960L412J917Q15k26j309j876j779j914l130
53892B89547m874n836n610m997m805n171n917o793p294p037o436o393p064p608
53878B03712p363o619n965n383m502l340k297j614j248j175j475k101k765l040
53864A54825k684j926j400j507j873j816j283r08r89j075p67l99m48p65r06r21
53848A35158j221j873k564l113l477l370k511j282n31n92r75j151j140j171j273
53833A08914j444j772k069j816q86K4J52l76p91p46n63n03l33J80P81J029R15
53816A00696Q80J242J771J963J690J476J910K835L434L305L074L605M757N494
$$ plain form
53921 197646 198892 200550 202613 205232 208476 212366 216879 221854 227066 232464 238182 244338 250912 257727
53907 257727 264456 270809 276842 282834 288677 293637 297049 298966 299781 299555 298246 296370 294591 292677 289547
53892 289547 284673 278837 273227 268230 263425 258254 252337 245544 238250 231213 224777 218384 211320 203712
53878 203712 196349 189730 183765 178382 173880 170540 168243 166629 165381 164206 162731 160630 157865 154825
53864 154825 152141 150215 148815 147308 145435 143619 142336 141428 140439 139364 138597 138198 137750 136985 136079 135158
53848 135158 133937 132064 129500 126387 122910 119540 117029 115747 115216 114624 113649 112498 111358 110187 108914
53833 108914 107470 105698 103629 101813 100927 100951 101103 100727 99936 99190 98627 98124 97791 97971 98752 99781 100696
53816 100696 101576 102818 104589 106552 108242 109718 111628 114463 117897 121202 124276 127881 132638 138132
53802A38132N189M355L920M182M738N122N180N007M767M576M365L904L070J992
53788A98499R47K14L5L77P79O91J58l10n68j109k204l298l769l838m102m458m256
53771A73788l450k770k693k914l018l062l167l168l024l095l560l991l919l492
53757A28465l141k843k281j518r93q78r02q04o19n18p00j356k331k930k538j491
53741A02622q07r31j201r27n07q78k039k813k256q32J56J28k76k24K43M41N4n43
53723H9410q89r59q85n25L02J299J744J199L7r11j141q51n58m81l74M5P00J243
53705H8405J494J561J628J688J585J201O37K43L41P92J020P73O20J281K563L466
53689A09298L398K755K204J981K117K702L439L535K670J723J807K760L307K731
$$ plain form
53802 138132 143321 147676 151596 155778 160516 165638 170818 175825 180592 185168 189533 193437 196507 198499
53788 198499 199446 199660 199695 200072 200851 201542 201700 201390 200822 199713 197509 194211 190442 186604 182502 178044 173788
53771 173788 170338 167568 164875 161961 158943 155881 152714 149546 146522 143427 139867 135876 131957 128465
53757 128465 125324 122481 120200 118682 117689 116811 115909 115105 114486 113968 113268 111912 109581 106651 104113 102622
53741 102622 101815 100884 99683 98756 98249 97371 95332 92519 90263 89431 89587 89715 89439 89215 89458 89899 89953 89410
53723 89410 88521 87562 86677 86152 86454 87753 89497 90696 90733 89822 88681 87830 87272 86791 86417 86462 87162 88405
53705 88405 89899 91460 93088 94776 96361 97562 98199 98442 98783 99575 100595 101368 101988 103269 105832 109298
53689 109298 112696 115451 117655 119636 121753 124455 127894 131429 134099 135822 137629 140389 143696 146427
53675A46427J674J191J562K330L033L546L917M179M280M123L707L226K844K534
53661A88573K274K283K658K938K552J725J341J731K101J593M84j95l1L00Oq62
53645B09471j566j520p80J31O77N90j7p68j283j493j590j689j637j307r61r68
53629A95290j275j418j191r04q18p49m98l63p42j409j678j215l08N75J142J207
53613A85646P82K79K32P36J357J644J500J090P69R61J708K466K731K737L027L453
53597B11118L355K718K318K506K750K785L234M413N337M918L612K831K965L129
53583B57989K856K885L876N250N933N711N265N129N218N223N048M827M690M619
53569C24519M413L916L321L037L192L429L364L054K813K685K369J602M04r68k169
$$ plain form
53675 146427 148101 149292 150854 153184 156217 159763 163680 167859 172139 176262 179969 183195 186039 188573
53661 188573 190847 193130 195788 198726 201278 203003 204344 206075 208176 209769 210253 210058 210027 210327 210333 209471
53645 209471 207905 206385 205605 205736 206413 207003 206986 206218 204935 203442 201852 200163 198526 197219 196258 195290
53629 195290 194015 192597 191406 190502 189684 188935 188437 188074 187332 185923 184245 183030 182722 183297 184439 185646
53613 185646 186428 186707 186939 187675 189032 190676 192176 193266 194035 194996 196704 199170 201901 204638 207665 211118
53597 211118 214473 217191 219509 222015 224765 227550 230784 235197 240534 245452 249064 251895 254860 257989
53583 257989 260845 263730 267606 272856 278789 284500 289765 294894 300112 305335 310383 315210 319900 324519
53569 324519 328932 332848 336169 339206 342398 345827 349191 352245 355058 357743 360112 361714 362118 361150 358981
53554C58981k827k775k275j871j890k208k475k488k343k301k545k991l298l221
53540C23473k947k876l077l202l075k988l194l342k881j825p19N2M38K98n13j508
53524B92114j664o16P61J380J227J084J332J566J363R04Q08J563L081M577N141
53509C14621M719M235M470N187N785O351P308Q440R202R809J0927J2296J2806
53496D16156J2279J1994J2887J4222J4918J5260J6267J7883J9076J9503J9963
53485E90408K1065K2432K3559K4626K5978K7317K7985K7775K7053K6213K5494
53474H69905K5247K5946K7688K9931L2026L3875L5818L7894L9579M0384M0300
53463A238593L9475L7794L5219L2217K9341K6594K3745K1069J9107J7839J6866
$$ plain form
53554 358981 356154 353379 351104 349233 347343 345135 342660 340172 337829 335528 332983 329992 326694 323473
53540 323473 320526 317650 314573 311371 308296 305308 302114 298772 295891 294066 293347 293399 293837 294135 293622 292114
53524 292114 290450 289834 290595 291975 293202 294286 295618 297184 298547 299451 300259 301822 304903 309480 314621
53509 314621 319340 323575 328045 333232 339017 345368 352676 361116 370318 380127 391054 403350 416156
53496 416156 428435 440429 453316 467538 482456 497716 513983 531866 550942 570445 590408
53485 590408 611473 633905 657464 682090 708068 735385 763370 791145 818198 844411 869905
53474 869905 895152 921098 948786 978717 1010743 1044618 1080436 1118330 1157909 1198293 1238593
53463 1238593 1278068 1315862 1351081 1383298 1412639 1439233 1462978 1484047 1503154 1520993 1537859
53452A537859J6397J7106J8876K0603K1601K2256K2868K2835K1726K0236J9094
53441A761457J7735J5158J1583Q141N183K033j718n664r405j2841j5656j7466
53429A758540j8704k0407k2864k5274k7059k8636l0453l2035l2580l2072l1222
53418A457234l0652l0587l1082l2068l3314l4473l5113l4708l2988l0367k7604
53407A104278k4956k2092j8867j5636j2674r926p468n507l659r80K676O070Q065
53394I99324R214J1030J4009J7235J9804K1746K3441K4948K6182K7257K8196K8778
53382A251164K8955K9178K9968L1322L2875L4582L6953M0516M5115M9868N3840
53371A664336N6774N9123O1450O3858O6030O7655O8775O9781P1085P2771P4455
$$ plain form
53452 1537859 1554256 1571362 1590238 1610841 1632442 1654698 1677566 1700401 1722127 1742363 1761457
53441 1761457 1779192 1794350 1805933 1814074 1819257 1821290 1819572 1813908 1804503 1791662 1776006 1758540
53429 1758540 1739836 1719429 1696565 1671291 1644232 1615596 1585143 1553108 1520528 1488456 1457234
53418 1457234 1426582 1395995 1364913 1332845 1299531 1265058 1229945 1195237 1162249 1131882 1104278
53407 1104278 1079322 1057230 1038363 1022727 1010053 1000127 992659 987152 983493 982513 985189 991259 999324
53394 999324 1008538 1019568 1033577 1050812 1070616 1092362 1115803 1140751 1166933 1194190 1222386 1251164
53382 1251164 1280119 1309297 1339265 1370587 1403462 1438044 1474997 1515513 1560628 1610496 1664336
53371 1664336 1721110 1780233 1841683 1905541 1971571 2039226 2108001 2177782 2248867 2321638 2396093
53360B396093P5560P5678P4761P3015P0824O8609O6583O4602O2434O0140N8060
53349C146359N6501N5668N5722N6578N7646N8142N7666N6119N3141M8057M0488
53338C742087L0466J7933K824j3988l0534m4995n6853o6388p3661p8632q1871
53327C346388q4277q6125q7013q6818q6070q5270q4444q3495q2612q2078q1966
53316B416220q2212q2650q2839q2167q0347p7729p4946p2338o9719o6517o2202
53305A582554n6755n0802m5089l9886l5061l0586k6596k3008j9583j6485j4299
53294A224404j3235j2643j1708j0361r136q323p655o838n970n337m922m321l084
53281A120871j122J149L093M376N204O013P087Q506J0333J2586J4971J6921J8076
$$ plain form
53360 2396093 2471653 2547331 2622092 2695107 2765931 2834540 2901123 2965725 3028159 3088299 3146359
53349 3146359 3202860 3258528 3314250 3370828 3428474 3486616 3544282 3600401 3653542 3701599 3742087
53338 3742087 3772553 3790486 3793310 3779322 3748788 3703793 3646940 3580552 3506891 3428259 3346388
53327 3346388 3262111 3175986 3088973 3002155 2916085 2830815 2746371 2662876 2580264 2498186 2416220
53316 2416220 2334008 2251358 2168519 2086352 2006005 1928276 1853330 1780992 1711273 1644756 1582554
53305 1582554 1525799 1474997 1429908 1390022 1354961 1324375 1297779 1274771 1255188 1238703 1224404
53294 1224404 1211169 1198526 1186818 1176457 1167321 1158998 1151343 1144505 1138535 1133198 1128276 1123955 1120871
53281 1120871 1119749 1120898 1123991 1128367 1133571 1139584 1146671 1155177 1165510 1178096 1193067 1209988 1228064
53268A228064J8684J9418K0789K2759K4879K6686K8023K9059L0112L1345L2603
53257A512421L3538L3964L4046L4081L4269L4829L6118L8217M0299M0882L9065
53246A911729L5361L1013K6684K2201J7335J2254P027J246n458j2815k0073k6627
53234A999877l2261l6992m0957m4337m7191m9423n1067n2291n2871n2008m9233
53223A491246m5338m1803l9305l7380l5655l4697l5278l7319m0004m2614m4744
53212A057109m6068m6431m6089m5321m3918m1510l8283l4905l1800k8907k6176
53201F27701k3670k1227j8532j5741j3486j2026j0904r680q516p798p643q088
53189D70390r224j0704j1623j1452j0751j0315j0072r439q566q289q897r683r889
$$ plain form
53268 1228064 1246748 1266166 1286955 1309714 1334593 1361279 1389302 1418361 1448473 1479818 1512421
53257 1512421 1545959 1579923 1613969 1648050 1682319 1717148 1753266 1791483 1831782 1872664 1911729
53246 1911729 1947090 1978103 2004787 2026988 2044323 2056577 2063604 2064850 2059392 2046577 2026504 1999877
53234 1999877 1967616 1930624 1889667 1845330 1798139 1748716 1697649 1645358 1592487 1540479 1491246
53223 1491246 1445908 1404105 1364800 1327420 1291765 1257068 1221790 1184471 1144467 1101853 1057109
53212 1057109 1011041 964610 918521 873200 829282 787772 749489 714584 682784 653877 627701
53201 627701 604031 582804 564272 548531 535045 523019 512115 502435 493919 486121 478478 470390
53189 470390 461166 450462 438839 427387 416636 406321 396249 386810 378244 369955 361058 351375 341486
53176C41486r496q856q158p508p076o853o593o225o021o133o287o153n776n391
53162B44960n059m747m502m324m037l551l035k684k407k038j650j512j744k170
53148B01500k468k344j750r79m86m73p63j127j508j846j836j223k78K67p9r74
53132A83633j587j572j492j960k588k277p90O33O92l51j174j202j098j452j896
53117A65519j867j461j187j184j209j053o93l01k24o76j271j286o22j3r0o41j108
53100A50633j266j104n61J72O12O71Q94J451J521M21j124j788j459j193j477j622
53084A44781j146p50j276k369k911k487j766j502j684j753j367p42l94o19j259
53069A22756j841j975j693j469j700k072j725l89R26R81j2o06j19M70Q2q56j186
$$ plain form
53176 341486 331990 323134 314976 307468 300392 293539 286946 280721 274700 268567 262280 256127 250351 244960
53162 244960 239901 235154 230652 226328 222291 218740 215705 213021 210614 208576 206926 205414 203670 201500
53148 201500 199032 196688 194938 193959 193473 193000 192237 191110 189602 187756 185920 184697 184419 184686 184607 183633
53132 183633 182046 180474 178982 177022 174434 172157 171367 172000 172692 172341 171167 169965 168867 167415 165519
53117 165519 163652 162191 161004 159820 158611 157558 156865 156564 156340 155664 154393 153107 152485 152472 152382 151741 150633
53100 150633 149367 148263 147702 147874 148486 149157 150051 151502 153023 153444 152320 150532 149073 147880 146403 144781
53084 144781 143635 142885 141609 139240 136329 133842 132076 130574 128890 127137 125770 125028 124634 124015 122756
53069 122756 120915 118940 117247 115778 114078 112006 110281 109892 110818 111799 111787 111181 111062 111532 111614 110758 109572
53052A09572p22j80J10L99O09L16k99m59L0M50K31l54q42j136j176p40J5M45K18
53033A06487k79o33r12j155j033n21k73p25j330j358r77q52r88q36l32q6m19q98
53015I2880r92o93l55k60m58p24o88k66M2l19j111j467r61j09L03M1o19j298j611
52996H1335j222k28O86Q87M98J90L75Q94J420J741J651R99L4o41p55o61p13o34
52978H5856M3J121J855J904J583J211O80m5n54n28k47j87l32k81J33P31J297J668
52960I5908J660J277Q71Q21J059J233J152Q00J66n25p59l56O8j11m87p1J230K411
52942A06347K679K258J665R67J70l47k48K44O63Q26O94K03m36p27n35l59n19n01
52924A13044K88J474K038J604P75L18M42Q50J084Q52L18k1J8rm65r05o25K61R58
$$ plain form
53052 109572 108850 108670 108780 109179 109788 110104 109805 109346 109376 109826 110057 109703 108861 107725 106549 105809 105824 106269 106487
53033 106487 106208 105575 104663 103508 102475 101954 101681 100956 99626 98268 97291 96439 95451 94615 94283 94197 93778 92880
53015 92880 91888 91195 90840 90580 90122 89398 88710 88444 88486 88167 87056 85589 84628 84519 84822 84863 84244 82946 81335
52996 81335 80113 79885 80571 81458 81956 82146 82521 83415 84835 86576 88227 89226 89260 88619 87864 87203 86490 85856
52978 85856 85899 87020 88875 90779 92362 93573 94253 94208 93654 93126 92879 92692 92360 92079 92212 92943 94240 95908
52960 95908 97568 98845 99716 100537 101596 102829 103981 104781 104947 104422 103663 103307 103375 103264 102777 102706 103936 106347
52942 106347 109026 111284 112949 113916 114086 113739 113491 113735 114398 115224 115918 116121 115685 114958 114423 114064 113545 113044
52924 113044 113332 114806 116844 118448 119223 119541 119983 120833 121917 122769 123087 123066 123084 123075 122610 121705 121080 121341 122299
52905A22299J159J309J639J689J163N80M86N51J14o28q39l45M1k09m65Q5J076
52888A29705J329M91n11q07o34o27o67k13N41P39J54m15k91J37R3m03n89j5R66
52869A28983J713J934J735J338R28O89Q25J389K074K335J880J007K59j47l62n83
52853A45997r91j815k959l699l377k377j754j784j677r35k13k66p99j058r66r31
52837A20396r06m74K59O39L42k84p24p27l65m1k86j101j735j637j245j239j301
52820A09571n57Q57J650J069j69r50j113j212j466j551j157l35N87J196J216P53
52804A08389K04j72m05n92p16p59p68q17j025j485j916j664n67M39K35r30j599
52787I5852r83J07N37K68m5k17n22q65q01l42q2l94r59j268j244j153j134j022
$$ plain form
52905 122299 123458 124767 126406 128095 129258 129838 130324 130875 130989 130361 129522 129177 129218 129009 128544 128629 129705
52888 129705 131034 131525 131014 130207 129573 128946 128279 128066 128607 129346 129500 129085 128794 128931 129024 128621 128032 128017 128983
52869 128983 130696 132630 134365 135703 136631 137320 138145 139534 141608 143943 145823 146830 147089 146942 146580 145997
52853 145997 145006 143191 140232 136533 133156 130779 129025 127241 125564 124629 124416 124150 123351 122293 121327 120396
52837 120396 119490 119016 119275 119914 120256 119972 119248 118521 118156 118115 117829 116728 114993 113356 112111 110872 109571
52820 109571 109014 109871 111521 112590 112421 111471 110358 109146 107680 106129 104972 104637 105224 106420 107636 108389
52804 108389 108593 108421 108016 107424 106708 105949 105181 104364 103339 101854 99938 98274 97707 98146 98381 97451 95852
52787 95852 94869 94976 95513 95781 95736 95519 94997 94132 93331 92989 92907 92513 91554 90286 89042 87889 86755 85733
52769H5733o40q8K90K82M5r3l7L4m9k29l22j77J90N03M00o3k94R4O17N08j84o95
52747H5825p38q64j496k253k619k620k410j780o61L74O85L44j46n78r14q62k96
52730F8991J51l14j488k293k120j396p89m70l14k71j92J42N99O98K98o4J15O05
52712F1888P78M24j35n24o00l82k8J86J45J23M67J052J324R69L08m4J66O84J083
52693F7884J063N09m47j270j253j77J271J990J547N64m4J3L09M13L40L33M60N26
52675G4031L82J60J85N91J104J292J003M29j55n47n32PP52J063O42j22p02j009
52657G8574j162r76k17P72J233R30N32P85J598K152J788O43m81q67n61k77n39
52640H3927r91q73p6O79P84M35J45k6l10n83l68M52J382J840J734J367J011P45
$$ plain form
52769 85733 85093 85005 85295 85577 85622 85529 85492 85526 85477 85248 84926 84749 84939 85442 85842 85779 85485 85579 86196 86704 86520 85825
52747 85825 85087 84223 82727 80474 77855 75235 72825 71045 70384 70758 71443 71787 71641 71063 70149 69287 68991
52730 68991 69142 68828 67340 65047 62927 61531 60742 60272 59958 59687 59495 59637 60236 60934 61232 61168 61283 61888
52712 61888 62666 63090 62955 62431 61831 61449 61421 61607 61752 61875 62342 63394 64718 65687 65995 65951 66117 66801 67884
52693 67884 68947 69456 69009 67739 66486 66309 67580 69570 71117 71681 71637 71650 71959 72372 72712 73045 73505 74031
52675 74031 74413 74573 74758 75349 76453 77745 78748 79177 79022 78475 77943 77950 78702 79765 80407 80285 79583 78574
52657 78574 77412 76436 76219 76991 78224 79154 79686 80471 82069 84221 86009 86652 86171 85304 84743 84466 83927
52640 83927 82936 82063 81987 82666 83450 83885 84030 84004 83694 83111 82743 83195 84577 86417 88151 89518 90529 91274
52622I1274N71M34K03k51q70j377j454r70r5P98J370J528J417J191Q78M84J16
52605I5247j48l87p47j125j220r32n07k02N3M38Q35R33O78L80L27M54M67J57m23
52586I4278r03q08j3R61J400J171Q03P67R64J079J071J098J175J192J099Q81N56
52569A06771L99Q30J750K278J599J3j284j416n10P02J560J737J354R11P62O12
52553A18068p9j128j549p26P01J523J338Q28P78J152J274P69Lm06l79l55n19m83
52535A20810j1L47r4j066j588j266p11m99m64k81q1l0J47O31R69P60N08R91J983
52516A21055K395J676L91o64j205j214o58J56N85L77ko8M0k6k64n44r66j454j448
52497A18162o69J54O7p19j035m07K86J58m25m78J86P76N59l63j307j610j076j20
$$ plain form
52622 91274 91845 92279 92482 92231 91361 89984 88530 87560 87465 88263 89633 91161 92578 93769 94647 95131 95247
52605 95247 95099 94712 93965 92840 91620 90688 90181 89979 90032 90470 91305 92238 92916 93296 93623 94077 94544 94701 94278
52586 94278 93375 92567 92554 93515 94915 96086 96889 97656 98620 99699 100770 101868 103043 104235 105334 106215 106771
52569 106771 107170 108000 109750 112028 113627 113640 112356 110940 110430 111132 112692 114429 115783 116694 117456 118068
52553 118068 117989 116861 115312 114586 115287 116810 118148 118976 119754 120906 122180 122949 122952 122546 122167 121812 121293 120810
52535 120810 120799 121146 121052 119986 118398 117132 116421 115922 115458 115177 115096 115066 115213 115844 116813 117573 118081 119072 121055
52516 121055 123450 125126 125517 124853 123648 122434 121776 121932 122517 122894 122892 122824 122864 122838 122574 122030 121064 119610 118162
52497 118162 117493 117647 117714 116995 115960 115553 115839 115997 115572 115094 115280 116056 116615 116252 114945 113335 112259 112139
52479A12139N16M27l0k09M4L24L43K28J43m7n18j084j286q10K32J344J939J792
52461A15487J216O47Q1p19j426j177K41J697J853Q74K53Q86J964K180J451R02
52445A26410J288K107K333J624N55r6j10J19P3l43p55p73m22m5J34K19L95O69
52427A33382R10J094J321J630J823J639J039L31j09k33l17n29p03o59n57o60q40
52410A38562p28l99n12j367k204j909m26J056J451Q91K58k4k76p58j111q60j34
52393A31510M43N23M13O01J068J305R66L46N6L47Q89J142Q78K74l05n62m27o9
52375A39398K68N51R40J426J631J238N61M18J238K475L117K724J801J151J060
52360A59997J184J152J019J115J570K143K520K655K725K775K557J811O48m02p99
$$ plain form
52479 112139 112655 113082 113052 112843 112887 113211 113554 113782 113925 113878 113360 112276 110990 110180 110412 111756 113695 115487
52461 115487 116703 117350 117431 116712 115286 114109 114350 116047 117900 118774 119027 119913 121877 124057 125508 126410
52445 126410 127698 129805 132138 133762 134317 134221 134111 134230 134303 133960 133205 132432 132010 131965 132099 132318 132713 133382
52427 133382 134292 135386 136707 138337 140160 141799 142838 143169 143060 142827 142510 141981 141278 140619 140062 139402 138562
52410 138562 137834 137435 136923 135556 133352 131443 131017 132073 133524 134415 134673 134649 134373 133615 132504 131644 131510
52393 131510 131953 132476 132889 133490 134558 135863 136829 137175 137231 137578 138467 139609 140487 140761 140456 139894 139467 139398
52375 139398 139666 140217 141157 142583 144214 145452 146013 146431 147669 150144 153261 155985 157786 158937 159997
52360 159997 161181 162333 163352 164467 166037 168180 170700 173355 176080 178855 181412 183223 183871 183469 182670
52345A82670m27L41R69J137R23O94Q05J196J299N77o82j361o33J002K106J744
52329A92360L09j094j683j415p27j49R0K49O52J012O69l35j012p05k5J34K1N21
52311A88872J549K037J670J397J906K568K639K596L364M717N478N129M404M226
52297B32552M733N483O085O406O556O756P023P019O533N920N682N744N671N549
52283C17712N995P163Q311Q728Q586Q528Q737Q860Q696Q551Q860R660J0477J0704
52269D39568J0230R665R764J0515J1139J1083J0749J0876J1494J1869J1503J0727
52257E69182J0219J0156J0134R810R327R029Q962Q878Q600Q125P339O058M512
52244F80331L445L351L807L976L611L152K979L052L340L912M470M372L430K284
$$ plain form
52345 182670 182243 182584 183553 184690 185613 186307 187112 188308 189607 190184 189502 188141 187508 188510 190616 192360
52329 192360 192669 191575 189892 188477 187750 187601 187691 187940 188592 189604 190273 189938 188926 188221 188196 188330 188351 188872
52311 188872 190421 192458 194128 195525 197431 199999 202638 205234 208598 213315 218793 223922 228326 232552
52297 232552 237285 242768 248853 255259 261815 268571 275594 282613 289146 295066 300748 306492 312163 317712
52283 317712 323707 330870 339181 347909 356495 365023 373760 382620 391316 399867 408727 418387 428864 439568
52269 439568 449798 459463 469227 479742 490881 501964 512713 523589 535083 546952 558455 569182
52257 569182 579401 589557 599691 609501 618828 627857 636819 645697 654297 662422 669761 675819 680331
52244 680331 683776 687127 690934 694910 698521 701673 704652 707704 711044 714956 719426 723798 727228 729512
52230G29512J598J290J029J030J787L142M332M962N389O037O784P281P534P854
52216G89561Q395Q991R400R559R583R593R552R275Q725Q227Q232Q782R373R458
52202I16706Q980Q294P611O750N482L996K808K155J706R67p4j003j590k144l115
52187I57529m536o060p328q138q414q256q005q004q279q545q585q429q147p676
52173H49127o982o332o229o893p860q209p388n819m523m093m236m418m647n272
52159G66226o107o312n374l826k693k343k308k089j746j568j541j452j283j131
52145G26453r02n22m06j147k611l767l840l262l028l374l652l432l127l346m128
52130F85909n005n500n394m805m209m095m455m829m964n064n251n282n025m782
$$ plain form
52230 729512 731110 732400 733429 734459 736246 739388 743720 748682 754071 760108 766892 774173 781707 789561
52216 789561 797956 806947 816347 825906 835489 845082 854634 863909 872634 880861 889093 897875 907248 916706
52202 916706 925686 933980 941591 948341 953823 957819 960627 962782 964488 965455 965381 964378 962788 960644 957529
52187 957529 952993 946933 939605 931467 923053 914797 906792 898788 890509 881964 873379 864950 856803 849127
52173 849127 842145 835813 829584 822691 814831 806622 799234 793415 788892 784799 780563 776145 771498 766226
52159 766226 760119 753807 748433 744607 741914 739571 737263 735174 733428 731860 730319 728867 727584 726453
52145 726453 725551 725029 724623 723476 720865 717098 713258 709996 706968 703594 699942 696510 693383 690037 685909
52130 685909 680904 675404 670010 665205 660996 656901 652446 647617 642653 637589 632338 627056 622031 617249
52116F17249m778m707m241l682l595l977m272m026l194j947o71M6m2l89k29M43
52100E77988R99J179J396K013K848L525L902M061M302N090O525P869Q257P943
$$ plain form
52116 617249 612471 607764 603523 599841 596246 592269 587997 583971 580777 578830 578159 578205 578163 577774 577545 577988
52100 577988 578987 580166 581562 583575 586423 589948 593850 597911 602213 607303 613828 621697 629954 637897
$$ [...]
##END NTUPLES=NMR SPECTRUM
##END=
