##TITLE=NES1045_Brazil_9268490_HpCFHjx8nf
##JCAMPDX= 6.0         $$ Bruker NMR JCAMP-DX V2.0
##DATA TYPE= NMR SPECTRUM
##DATA CLASS= NTUPLES
##ORIGIN= BRUKER
##OWNER= Administrator
$$ 1.72 TOPSPIN		Version 2.1
$$ 2015-08-24 20:26:30.842 -0700  Administrator@X
$$ Compression mode = diff/dup
##.OBSERVE FREQUENCY= 400.02188249412
##.OBSERVE NUCLEUS= ^1H
##.ACQUISITION MODE= SIMULTANEOUS (DQD)
##.ACQUISITION SCHEME= undefined
##.AVERAGES= 8
##.DIGITISER RES= 22
##SPECTROMETER/DATA SYSTEM= spect
##.PULSE SEQUENCE= zg30
##.SOLVENT NAME= COFFEE_meoh
##.SHIFT REFERENCE= INTERNAL, COFFEE_meoh, 1, 14.98509
##AUDIT TRAIL= $$ (NUMBER, WHEN, WHO, WHERE, PROCESS, VERSION, WHAT)
$$ ##TITLE= Audit trail, TOPSPIN		Version 2.1
$$ ##JCAMPDX= 5.01
$$ ##ORIGIN= Bruker BioSpin GmbH
$$ ##OWNER= Administrator
$$ $$ E:\/data/COFFEE/nmr/NES1045_Brazil_9268490_HpCFHjx8nf/20/pdata/1/auditp.txt
$$ ##AUDIT TRAIL=  $$ (NUMBER, WHEN, WHO, WHERE, PROCESS, VERSION, WHAT)
(   1,<2015-08-24 20:26:23.326 -0700>,<Administrator>,<X>,<go>,<TOPSPIN 2.1>,
      <created by zg
	started at 2015-08-24 20:25:17.561 -0700,
	POWCHK enabled, PULCHK disabled,
       configuration hash MD5:
       21 0F 79 D6 B3 7B B4 F6 88 20 88 DB 03 48 BD 9F
       data hash MD5: 64K
       B9 82 92 11 B9 1F CC 31 F6 ED 6B E0 2B 72 11 4B>)
(   2,<2015-08-24 20:26:26.701 -0700>,<Administrator>,<X>,<proc1d>,<TOPSPIN 2.1>,
      <Start of raw data processing
       efp LB = 0 FT_mod = 6 PKNL = 1 PHC0 = 0 PHC1 = 0 SI = 32K 
       data hash MD5: 32K
       96 11 E6 05 91 12 6E 80 C3 16 67 9A F3 22 A5 A0>)
(   3,<2015-08-24 20:26:26.983 -0700>,<Administrator>,<X>,<proc1d>,<TOPSPIN 2.1>,
      <pk PHC0 = 94.13086 PHC1 = 0 
       data hash MD5: 32K
       AC 8B C3 58 27 0D C6 49 A6 F2 7C 1F DD BB 62 92>)
(   4,<2015-08-24 20:26:27.092 -0700>,<Administrator>,<X>,<proc1d>,<TOPSPIN 2.1>,
      <abs ABSG = 1 
       data hash MD5: 32K
       5F C1 C7 56 78 C3 BB A1 7E 0D 94 50 42 A6 D2 DE>)
(   5,<2015-08-24 20:26:27.155 -0700>,<Administrator>,<X>,<proc1d>,<TOPSPIN 2.1>,
      <abs ABSG = 2 
       data hash MD5: 32K
       E0 F7 64 A6 25 21 C9 18 65 E7 E0 32 29 68 FE 81>)
(   6,<2015-08-24 20:26:27.233 -0700>,<Administrator>,<X>,<proc1d>,<TOPSPIN 2.1>,
      <abs ABSG = 3 
       data hash MD5: 32K
       28 78 4B F3 11 B7 87 3E 49 FE 35 47 9A CF 17 80>)
(   7,<2015-08-24 20:26:27.280 -0700>,<Administrator>,<X>,<proc1d>,<TOPSPIN 2.1>,
      <abs ABSG = 4 
       data hash MD5: 32K
       39 DB A9 F3 C5 A7 D5 A7 EB 6E D1 A8 A7 3A BB 47>)
(   8,<2015-08-24 20:26:27.358 -0700>,<Administrator>,<X>,<proc1d>,<TOPSPIN 2.1>,
      <abs ABSG = 5 
       data hash MD5: 32K
       60 BE CE 3F 73 5D 0A A1 43 C7 2E A4 09 41 65 65>)
$$ ##END=
$$ 
$$ $$ hash MD5
$$ $$ C5 44 65 BA 59 D1 1B 57 72 1A 48 25 18 11 15 72
##$RELAX= 
##$RELAX= 
##$RELAX= 
##$RELAX= 
##$RELAX= 
##$RELAX= 
##$RELAX= 
$$ Bruker specific parameters
$$ --------------------------
##$DU= <E:\>
##$EXPNO= 20
##$NAME= <NES1045_Brazil_9268490_HpCFHjx8nf>
##$PROCNO= 1
$$ [...]
150 150 150 150 150 150 150 150
##$TP07= 0
##$TPNAME0= <>
##$TPNAME1= <>
##$TPNAME2= <>
##$TPNAME3= <>
##$TPNAME4= <>
##$TPNAME5= <>
##$TPNAME6= <>
##$TPNAME7= <>
##$TPOAL= (0..7)
0.5 0.5 0.5 0.5 0.5 0.5 0.5 0.5
##$TPOFFS= (0..7)
0 0 0 0 0 0 0 0
##$TUNHIN= 0
##$TUNHOUT= 0
##$TUNXOUT= 0
##$USERA1= <user>
##$USERA2= <user>
##$USERA3= <user>
##$USERA4= <user>
##$USERA5= <user>
##$V9= 5
##$VALIST= <valist>
##$VCLIST= <CCCCCCCCCCCCCCC>
##$VD= 0
##$VDLIST= <DDDDDDDDDDDDDDD>
##$VPLIST= <PPPPPPPPPPPPPPP>
##$VTLIST= <TTTTTTTTTTTTTTT>
##$WBST= 2048
##$WBSW= 25
##$XGAIN= (0..3)
0 0 0 0
##$XL= 0
##$YL= 0
##$YMAX_a= 621380
##$YMIN_a= -517400
##$ZGOPTNS= <>
##$ZL1= 120
##$ZL2= 120
##$ZL3= 120
##$ZL4= 120
##$ABSF1= 14.98509
##$ABSF2= -5.573092
##$ABSG= 5
##$ABSL= 3
##$ALPHA= 0
##$AQORDER= 0
##$ASSFAC= 0
##$ASSFACI= 0
##$ASSFACX= 0
##$ASSWID= 0
##$AUNMP= <proc_prof1d_extract_pilot.lims>
##$AXLEFT= 0
##$AXNAME= <>
##$AXNUC= <1H>
##$AXRIGHT= 0
##$AXTYPE= 0
##$AXUNIT= <>
##$AZFE= 0.1
##$AZFW= 0.1
##$BCFW= 0
##$BC_mod= 0
##$BYTORDP= 0
##$COROFFS= 0
##$CY= 15
##$DATMOD= 1
##$DC= 0
##$DFILT= <>
##$DTYPP= 0
##$F1P= 0
##$F2P= 0
##$FCOR= 0.5
##$FTSIZE= 32768
##$FT_mod= 6
##$GAMMA= 0
##$GB= 0
##$INTBC= 1
##$INTSCL= 1
##$ISEN= 128
##$LB= 0
##$LEV0= 0
##$LPBIN= 0
##$MAXI= 10000
##$MC2= 0
##$MEAN= 0
##$ME_mod= 0
##$MI= 0
##$NCOEF= 0
##$NC_proc= -8
##$NLEV= 6
##$NOISF1= 0
##$NOISF2= 0
##$NSP= 0
##$NTH_PI= 0
##$NZP= 0
##$OFFSET= 14.98509
##$PC= 1
##$PHC0= 94.13086
##$PHC1= 0
##$PH_mod= 1
##$PKNL= yes
##$PPARMOD= 0
##$PPDIAG= 0
##$PPIPTYP= 0
##$PPMPNUM= 2147483647
##$PPRESOL= 1
##$PSCAL= 4
##$PSIGN= 0
##$PYNMP= <proc.py>
##$REVERSE= no
##$SF= 400.02
##$SI= 32768
##$SIGF1= 0
##$SIGF2= 0
##$SINO= 400
##$SIOLD= 32768
##$SPECTYP= <>
##$SREGLST= <1H.CDCl3>
##$SSB= 0
##$STSI= 32768
##$STSR= 0
##$SW_p= 8223.68421052631
##$SYMM= 0
##$S_DEV= 0
##$TDeff= 65536
##$TDoff= 0
##$TI= <>
##$TILT= no
##$TM1= 0
##$TM2= 0
##$TOPLEV= 0
##$USERP1= <user>
##$USERP2= <user>
##$USERP3= <user>
##$USERP4= <user>
##$USERP5= <user>
##$WDW= 1
##$XDIM= 32768
##$YMAX_p= 437162748
##$YMIN_p= -732646
##$CURPLOT= <Network HP LaserJet P1505>
##$CURPRIN= <$Network HP LaserJet P1505>
##$DFORMAT= <normdp>
##$LAYOUT= <+/1D_H.xwp>
##$LFORMAT= <normlp>
##$PFORMAT= <normpl>
##$SURQMSG= 1
$$ End of Bruker specific parameters
$$ ---------------------------------
##NTUPLES= NMR SPECTRUM
##VAR_NAME=  FREQUENCY,     SPECTRUM/REAL,   SPECTRUM/IMAG
##SYMBOL=    X,             R,               I
##VAR_TYPE=  INDEPENDENT,   DEPENDENT,       DEPENDENT
##VAR_FORM=  AFFN,          ASDF,            ASDF
##VAR_DIM=   32768,         32768,           32768
##UNITS=     HZ,            ARBITRARY UNITS, ARBITRARY UNITS
##FACTOR=    0.250966925370066, 1,           1
##FIRST=     8223.43324360094, -70406,       -249510
##LAST=      0,             -104666,         -33360
##MIN=       0,             -732646,         0
##MAX=       8223.43324360094, 437162748,    0
$$ Real data points
##PAGE= N=1
##DATA TABLE= (X++(R..R)), XYDATA
$$ [...]
19494b28064i5495j42008R0343m7284K0629M5037A96828a91586J908N5524d461
19482i0172b7285l4463j6671j49600c6169G0126a09088k65712A23752J53058a03708
19470B06655a45993q5418A92196C2241L8782a28371A4732D766i2511F9771b22045
19458C50i0923r5656j80456A60722F3255b23509K7673K4813j29606a45879j38608
19447b84487E9524c43556J31659k48699A28615h9192r3263h0108A35031c19536
19436b45078B06394B2200c46258a71147A45588E8940J36506d30217a31528k8866
19426a60394A04365a82489a3547j90496A33938o1377a69919B24249a58907O762
19416a52145F1039P6560f0051D4287h4306a1710n4015j79371m5242F6845a55633
$$ plain form
19494 -228064 -95495 -237503 -147160 -194444 -173815 -128778 196828 -191586 -189678 -134154 -4461
19482 -90172 -27285 -61748 -78419 -228019 -36169 70126 -109088 -374800 123752 276810 -103708
19470 206655 -145993 -231411 192196 32241 71023 -128371 14732 4766 -92511 69771 -222045
19458 350 -90923 -186579 -367035 160722 63255 -223509 -195836 -171023 -300629 -145879 -284487
19447 -284487 59524 -343556 -211897 -460596 128615 -89192 -182455 -80108 135031 -319536
19436 -245078 206394 22200 -346258 -171147 145588 58940 195446 -430217 -131528 -160394
19426 -160394 104365 -182489 -13547 -204043 133938 72561 -169919 224249 -158907 -152145
19416 -152145 61039 137599 -60051 44287 -84306 -11710 -65725 -245096 -290338 66845 -155633
19404b20883A99235M8780b59806A92812a48427j43511i1338K6345q1971B1133
19393A14463D5421J72037a44297G7183c42741G2160a38973A4094J97925e5389
19382a55601j17642e7326k39898R4172i3942o8105D4650J58750h9363k75770A76298
19370H501L609b01814p7463N8938B43232b19482A0063d2352q5183B5833J11762
19359A37595i2856A0687a29598B55300c14638a37039e3926p7827A93879b9042
19348A12401d01670a64961A93618f918E3649J82173b03437F9114A7560f6840A60497
19336b97272a42073C902a75073o2080Q6068A7622b65799c2794k9215r3916B49916
19324B1197a85622F8097c2234q4808k6948I8911b4158j52454r0255a25333L2358
$$ plain form
19404 -220883 199235 248015 -259806 192812 -148427 -291938 -91338 -64993 -146964 21133
19393 114463 45421 217458 -144297 77183 -342741 72160 -138973 14094 212019 -55389
19382 -155601 -273243 -57326 -297224 -203052 -93942 -162047 44650 203400 -89363 -365133 176298
19370 8501 12110 -201814 -279277 -220339 243232 -219482 10063 -42352 -127535 25833 137595
19359 137595 -92856 10687 -129598 255300 -314638 -137039 -53926 -131753 193879 -29042
19348 112401 -401670 -164961 193618 -6918 53649 235822 -203437 69114 17560 -66840 160497
19336 -297272 -142073 3902 -175073 -237153 -151085 17622 -265799 -32794 -62009 -155925 249916
19324 21197 -185622 68097 -32234 -117042 -143990 98911 -24158 -176612 -266867 -125333 -92975
19313i2975A39759R9244c454D0719f7266q0189j39296M8143C4209a03685l37160
19302d40845J33157H1442d5090j54924E3670Q0219O3677a65809B45935A05039
19291D8553i4254b3556B52135i1948c6158I1375q953e2272B06382f9329k24275
19280b93604d7819J4832B82225h5600B4426O5521b21215j3624a13038k07910B01980
19268c87310J12686I5804d073r9648b3638j53468O3017o3151A9968N7128b69589
19256c37923a38708e1147p7689L8112j42488c0873A03901g5582m7155F6543a89020
19244e495l7609A91629K8121c28506G2582b12859Q1506K0458m7234l4706A02249
19232a68811B0671J17626c7740j35856C6311g0717A67730f6496B15289a69079
$$ plain form
19313 -92975 139759 239003 -3454 40719 -67266 -147455 -286751 -238608 34209 -103685 -440845
19302 -440845 -307688 81442 -45090 -200014 53670 133889 197566 -165809 245935 105039
19291 48553 -94254 -23556 252135 -91948 -36158 91375 82422 -52272 206382 -69329 -293604
19280 -293604 -47819 -32987 282225 -85600 24426 89947 -221215 -234839 -113038 -320948 201980
19268 -387310 -274624 95804 -4073 -103721 -23638 -177106 -114089 -177240 19968 77096 -269589
19256 -337923 -138708 -51147 -128836 -90724 -233212 -30873 103901 -75582 -122737 66543 -189020
19244 -5495 -43104 191629 219750 -328506 72582 -212859 -131353 -110895 -158129 -192835 102249
19232 -168811 20671 138297 -37740 -173596 36311 -70717 167730 -66496 215289 -169079
19221B20532h2323j68483C4189c00673D32065b9354i414j52486e4766e917k26919
19210b32836b4097I9801K7349a87133J0928F1693b48976f0295D9888a09367d5286
19198e42090a63234A0116L1546i9590j75148a14334F5412J10749b45957J00904
19188a45053l3550D6493b0214m7563J7179j31340A22546d1184p0353E1792g7805
19176b45441e909m1404P43n253p4833G5258a25148a2955l80700a34767q036r504
19164a52307j6844j24060a44065F2297J22575a92048G953P361P4888C9977R9061
19153A39038C2423J67619b66810M5588Q2960k1935B62551E7193b2558I6950d24571
19141b0018r8128m32177a93002j03034g8902G1071D325a20183j2461f4855l43727
$$ plain form
19221 220532 -82323 -250806 34189 -300673 432065 -29354 -9414 -161900 -54766 -5917 -232836
19210 -232836 -24097 99801 127150 -187133 -176205 61693 -248976 -60295 49888 -109367 -45286
19198 -542090 -163234 10116 41662 -99590 -274738 -114334 65412 176161 -245957 -145053
19188 -145053 -178603 46493 -20214 -67777 -50598 -181938 122546 -41184 -111537 51792 -77805
19176 -245441 -5909 -47313 -46570 -51823 -126656 75258 -125148 -12955 -393655 -134767 -142803 -152307
19164 -152307 -169151 -293211 -144065 62297 184872 -192048 7953 15314 90202 39977 139038
19153 139038 32423 200042 -266810 -221222 -138262 -160197 262551 57193 -22558 96950 -424571
19141 -20018 -118146 -550323 -193002 -296036 -78902 71071 4325 -120183 -132644 -64855 -408582
19130d08582a58760l1181K4553e6694j64548Q2059j15763A4066O2166K1100g0451
19118B02314f4535B30069a26375a9116C0176a45943b9157m1700k22948L5889G651
19106A4995c51431F0003b50100B11110I9478l0736a73294Q0796G4429a39313K9231
19095a10082d4641j83553h7561N345j08076e8038j51671M8932K4995P933b0005
19083g5867G1406J2444M5519k9352J59020D2487J64837o9627f5981j43203J02061
19072a07123j710A94656E2174c425A30176I605J0021b26811b039C1830L5090h5076
19059g9977L3960o0825L7268A42189a48347o7607B0675h6350k69342a04195J8706
19048h5489n5919j45014h8887j93915A11387K59445h6640j64390b557m8291j09102
$$ plain form
19130 -408582 -158760 -189941 -165388 -56694 -221242 -139183 -254946 14066 76232 97332 -70451
19118 202314 -64535 230069 -126375 -19116 30176 -145943 -29157 -70857 -293805 -257916 7651
19106 14995 -351431 60003 -250100 211110 99478 68742 -173294 -92498 74429 -139313 -110082
19095 -110082 -44641 -228194 -87561 -82216 -190292 -58038 -209709 -160777 -135782 -127849 -20005
19083 -75867 71406 83850 129369 100017 259037 42487 207324 137697 -65981 -209184 -107123
19072 -107123 -108833 194656 52174 -3425 130176 9605 19626 -226811 -2039 31830 66920 -85076
19059 -79977 -46017 -106842 -69574 142189 -148347 -215954 20675 -86350 -355692 -104195 -85489
19048 -85489 -141408 -286422 -88887 -282802 111387 370832 -86640 -251030 -2557 -50848 -159950
19037a59950N6917A11823h7967j07968B43342a38960o4521A03192K00485b31970
19026B53468A19796c34521h2757j45181b0168D961b1953j12962O777e790B66985
19014A7942K04551A1671b3518I7971b02868f2790l84332b3837j36236A28608b54945
19002b40396F9897a7292j31598A98905b99770f3127B10936g4564n638h377j96048
18991b04425M4787A38994b54473g9718p18r4921G0c13012P1008i6124m7856o3288
18979b07268D0039a28984b2042q4922n9907c0456k11994f8436J6653A91371J4618
18968B05989Q9307A47533P9515R3527Q3205a58526A61282h5199A00383e740A54003
18956a81781a6267r7514M1230E9500N8428B8178b95065A86175b48434A56796a70291
$$ plain form
19037 -159950 -103033 111823 -87967 -195935 243342 -138960 -203481 103192 303677 -231970
19026 253468 119796 -334521 -82757 -227938 -20168 4961 -21953 -134915 -128138 -5790 266985
19014 17942 222493 11671 -23518 97971 -202868 -62790 -447122 -23837 -160073 128608 -254945
19002 -240396 69897 -17292 -148890 198905 -299770 -63127 210936 -74564 -80202 -8377 -204425
18991 -204425 -159638 138994 -254473 -79718 -80436 -175357 70 -313012 -242004 -96124 -143980 -207268
18979 -207268 40039 -128984 -22042 -106964 -166871 -30456 -242450 -68436 -51783 191371 205989
18968 205989 295296 147533 227048 320575 403780 -158526 161282 -85199 100383 -5740 154003
18956 -181781 -16267 -113781 -72551 59500 117928 28178 -295065 186175 -248434 156796 -170291
18944b7962j72919A2936e9092A18997a67434A95408e7707l86589G0144K39947
18934C10091b41244A58644l9869J4305a28133A97395a4982j67125N7712j12326
18924b36721a18217A88427p2898b07417e7273j36591P8970j56185I9799i1169
18913a96429A56614B396K8119c5891r6223J5830A15959l6997J67406J21848E8821
18901A68616e8702C77729b836j41786k4649r0626J00725A49874a95149r4506e9240
18889a88393A75127b15370A94373O4264K5741h1974A51785g0068j78465h881m60786
18878d69667A24175m4631a83220p1236A33178b19022L6542j3709A99076c16930
18867b42603r8714J24493L397Q3692C77773a32408B28208c88321e7410g358l55064
$$ plain form
18944 -27962 -200881 12936 -59092 118997 -167434 195408 -57707 -444296 70144 310091
18934 310091 -241244 158644 118775 133080 -128133 197395 -14982 -182107 -124395 -236721
18924 -236721 -118217 188427 115529 -207417 -57273 -193864 -114894 -271079 99799 -91169
18913 -196429 156614 2396 30515 -35891 -132114 -116284 115959 78962 246368 368216 58821
18901 168616 -58702 377729 -2836 -144622 -169271 -259897 -159172 149874 -195149 -289655 -59240
18889 -188393 175127 -215370 194373 258637 284378 -81974 151785 -70068 -248533 -8881 -469667
18878 -469667 124175 79544 -183220 -254456 133178 -219022 -182480 -196189 199076 -316930
18867 -242603 -341317 -216824 -213427 -129735 377773 -132408 228208 -388321 -57410 -7358 -362422
18856c62422i3816j56350N6884j29895c0346l97042J89506P5026B37397B8154
18845B1070P9477e8938A20838a76111e0232B1582b26607K167R0861B503a44205
18833A28735K9281a6710B7116J66542a25282j65688A60099n1987K4779e587p2690
18822g8277E9612K36104A240h4039b5301p4872D03538A3942L00115c8099M783
18811c3316A5200A807f7089A71144a04399A13968a0172C5968J83499O4036a25538
18799a43033F844J50105b58703C8036f3408c0873k10360p1232F1214a20784F4290
18787b96619g0252C05129a21463M9423Q848E4678a87761k1815F7692i8864j45163
18776b44027e5570A81931p2447a14322M283J1453I9016B0807g1785j04268J1671
$$ plain form
18856 -362422 -93816 -250166 -193282 -323177 -30346 -427388 -237882 -162856 237397 28154
18845 21070 100547 -58938 120838 -176111 -50232 21582 -226607 -224440 -133579 2503 -144205
18833 128735 158016 -16710 27116 193658 -125282 -290970 160099 108112 132891 -5587 -78277
18822 -78277 59612 295716 1240 -84039 -25301 -100173 403538 13942 314057 -38099 -33316
18811 -33316 15200 1807 -67089 171144 -104399 113968 -10172 35968 219467 283503 -125538
18799 -143033 6844 156949 -258703 38036 -63408 -30873 -241233 -312465 61214 -120784 64290
18787 -296619 -70252 305129 -121463 -72040 -63192 54678 -187761 -209576 67692 -98864 -244027
18776 -244027 -55570 181931 109484 -114322 -110039 -98586 99016 20807 -71785 -176053 -164382
18765a64382j40842C1811d61784a48659C5810c30991B32324j9762b41004a3785
18754h6660M2023j53617N8946l14769c4642A57570a31944e7565q0280P776j58946
18743b89015J18083J0817D4558a82902H3546a75641c0403E6863h8849E7699f8538
18731b40153J05544f1654k58878g0519F5817P2402a60726d0153i019D3216g9569
18719f4121A97304C6338A99b57219d6456q7460F8791c13472C3976O733a4957A64498
18706a47872p8201F0504J40141l2165a84114Q0368a0626n4545B4063a64077N5134
18695a08943G5743a15562r449j23020E6493P1655C0267C980a46087f7352A45336
18683B04281a54355e5992j73285E0572c31036B02683n1066a04228e096B8036c43792
$$ plain form
18765 -164382 -305224 31811 -461784 -148659 35810 -330991 232324 212562 -241004 -13785
18754 -86660 -44637 -198254 -139308 -454077 -34642 157570 -131944 -57565 -137845 -130069 -289015
18743 -289015 -170932 -160115 44558 -182902 83546 -175641 -30403 56863 -88849 57699 -68538
18731 -240153 -134609 -61654 -320532 -70519 65817 138219 -160726 -40153 -9019 43216 -79569
18719 -64121 197304 36338 199 -257219 -46456 -133916 68791 -313472 33976 40709 -14957 164498
18706 -147872 -226073 60504 200645 168480 -184114 -103746 -10626 -65171 24063 -164077 -108943
18695 -108943 75743 -115562 -125011 -248031 56493 128148 30267 3980 -146087 -67352 145336
18683 204281 -154355 -55992 -229277 50572 -331036 202683 151617 -104228 -5096 28036 -343792
18671D0034a60699A93869b61900H4900b64234a27548k7336B01707r9741m2423
18661E9543K4679A8690e6135D3777f9491k8531l8301B38388h9941D02383a51919
18649A40703h7237A3860J8026b63546b8363k03882i3443c9013r5303M2942M5510
18638d5864j11195A67202c67854j55275B72730d2142A50931n8688J18535c54666
18627C09727b83321A6380a23296D185b79131L2511B2102K73663A38060g3886A80006
18615a62471B9816b9227A03858f123k22104D0521a09821B7979b52155R8334B9789
18603a77576A98197L6061b82468O6857c706A14823a58273j1862c3645j83217C99549
18591A45762k3155f3166a1316l20425a21714c9182l49813J72626A55072a05319
$$ plain form
18671 40034 -160699 193869 -261900 84900 -264234 -127548 -154884 201707 101966 59543
18661 59543 84222 18690 -56135 43777 -69491 -98022 -136323 238388 -89941 402383 -151919
18649 140703 -87237 13860 31886 -263546 -28363 -232245 -93443 -39013 -134316 -91374 -45864
18638 -45864 -157059 167202 -367854 -523129 272730 -42142 150931 92243 210778 -354666
18627 309727 -283321 16380 -123296 4185 -279131 -246620 22102 295765 138060 -73886 180006
18615 -162471 29816 -29227 103858 -6123 -228227 40521 -109821 27979 -252155 -153821 29789
18603 -177576 198197 234258 -282468 -215611 -3706 114823 -158273 -170135 -33645 -216862 399549
18591 145762 122607 -63166 -11316 -331741 -121714 -39182 -388995 -216369 155072 -105319
18580b7840k7959l39447L0675h9098A54247b45228i6400D2704a85276e9813B7757
18568a91680i1567j59349d4884j73236j0631P8156O8194o3623A67162a55573A14803
18556A48001e6584R732n045k48014d9412A31439b8793k20337B68091a18194B5503
18544a43105A84072c8994A61622b09955j2578A0036P9838a31959b8138n7472d583
18532a58670E2645b7858A12267E3204a03552j28500G8821c15192f7842C99443
18521a30925n1815K8580B15699f7533B8662g8571F3393b20494e3396k25457B3114
18509f1835b2111q7962N3730k25625I9448M4170R9304k514a67273e0097A57908
18497e24253b28022E0868c5935a286o2667j06011g5005A3655a26595K530d5581
$$ plain form
18580 -27840 -55799 -395246 -364571 -89098 154247 -245228 -96400 42704 -185276 -59813 27757
18568 -191680 -91567 -250916 -44884 -218120 -228751 -150595 -82401 -146024 167162 -155573 114803
18556 148001 -56584 -46852 -51897 -299911 -49412 131439 -28793 -249130 268091 -118194 25503
18544 -143105 184072 -38994 161622 -209955 -222533 10036 89874 -131959 -28138 -85610 -4583
18532 -158670 52645 -27858 112267 53204 -103552 -232052 78821 -315192 -67842 399443
18521 -130925 -182740 -154160 215699 -67533 28662 -78571 63393 -220494 -53396 -278853 23114
18509 -61835 -22111 -110073 -56343 -281968 99448 143618 242922 240408 -167273 -50097 157908
18497 -524253 -228022 50868 -35935 -1286 -63953 -169964 -75005 13655 -126595 -124065 -45581
18485C28225a16033k2652L7067A8013a08902p3047A97424d1707k79203R4112A4061
18473b69691J21051B96073b1372k8749A7283J45285e9967j57620m4475a1737k730
18462a4467A70867a11019o8243G0601i5849n300L0651A21108b25719R124F3984
18450C8546i7924C0807a39244L8156j17507a402k31726G6665a17560K6578C7026
18438A01488J40895a63099A56744J34460A24861A5667d03622C47439H5657g2217
18427G32M6908G281g7969l25312C8218c31655D4614b53577g7885A37019a44742
18415b51382A0156O2518c2139j96732j2013b7696j25100N7989k75450b4633q5457
18404a10090A62365R5818b385A39872F8511a01996j04806l9667M4202e02m06516
$$ plain form
18485 328225 -116033 -138685 -101618 18013 -108902 -181949 197424 -41707 -320910 -226798 14061
18473 -269691 -148640 296073 -21372 -50121 17283 162568 -59967 -217587 -262062 -11737 -14467
18462 -14467 170867 -111019 -179262 70601 -95849 -101149 -70498 121108 -225719 -216595 63984
18450 38546 -97924 30807 -139244 -101088 -218595 -1402 -233128 76665 -117560 -90982 37026
18438 101488 242383 -163099 156744 291204 124861 15667 -403622 347439 85657 -72217
18427 732 47640 7281 -77969 -403281 38218 -331655 44614 -253577 -77885 137019 -144742
18415 -251382 10156 72674 -32139 -228871 -240884 -27696 -152796 -94807 -370257 -24633 -110090
18404 -110090 162365 258183 -2385 139872 68511 -101996 -206802 -246469 -202267 -502 -407018
18393d07018H1417a54893O5200B00613b68214B82840G350K68578c29035i4273
18382F2391f6860a941p7169j35583F7167L610J96943g1868m4888r735B14319G415
18369b09606f6163E8047a16242A00287K2202J9498l0761R9008G4019O2498F6819
18357E9346b32772K2158o8220j20732J32491D885c15266d1832j91168Q7101j62473
18346c08372a32899m54210C74048e7337k28680L3822C6843P542h6887p6401F1460
18334a59232E9547a33111H4161J81611a9543o1934j36232e5490E271P1918M51
18323G7640C1017b21643M1755B6950g7393A20231a11276k78033I1901L7844Q0153
18312B09898b7536m7235F8955b27879A42197p0742a50558A02506k2470B6910c9634
$$ plain form
18393 -407018 81417 -154893 -89693 200613 -268214 282840 7350 275928 -329035 -94273
18382 62391 -66860 -1941 -79110 -214693 67167 70777 267720 -71868 -116756 -126491 214319 7415
18369 -209606 -66163 58047 -116242 100287 122489 141987 111226 210234 74019 136517 66819
18357 59346 -232772 -210614 -278834 -399566 -267075 4885 -315266 -41832 -233000 -145899 -308372
18346 -308372 -132899 -587109 374048 -57337 -286017 -252195 36843 44385 -86887 -163288 61460
18334 -159232 59547 -133111 84161 265772 -19543 -81477 -217709 -55490 5271 77189 77640
18323 77640 31017 -221643 -179888 26950 -77393 120231 -111276 -389309 91901 129745 209898
18312 209898 -27536 -74771 68955 -227879 142197 71455 -150558 102506 80036 26910 -39634
18300G4964A3949b29629N9156j37234F3527c5940k32136k6528A58364m0833b75669
18288A9486P3341C7199H488P4326j5640c88095L7275D229J13682c26593i7815
18276b52179l5559A75397a53800k29840a39024H707J540L91250a46037J0458o8569
18265b04148l5746L2727B60998A10010N8135a49817c5138n5270m69B49816f1269
18253c8382C12030j45117D9199b47264J22881B45657j17417J06348D4228a01108
18242H4153K3529D1757a16215h162k18734C7877J62916p121c7821D2198f5847
18230C50643c4344A57527C8036J29645h8964C13611A11696c51033a4954n7507
18220g2461m08862K26427A31919d0150C63414I5454L7568b76434J10341j5069
$$ plain form
18300 74964 13949 -229629 -170473 -307707 63527 -35940 -268076 -294604 158364 117531 -275669
18288 19486 92827 37199 8488 82814 67174 -388095 -350820 4229 117911 -326593 -97815
18276 -252179 -287738 175397 -153800 -383640 -139024 8707 10247 401497 -146037 -135579 -204148
18265 -204148 -239894 -207167 260998 110010 168145 -149817 -35138 -90408 -90877 249816 -61269
18253 -38382 312030 166913 49199 -247264 -124383 245657 128240 234588 44228 -101108
18242 84153 107682 41757 -116215 -8162 -226896 37877 200793 193672 -37821 42198 -65847
18230 350643 -34344 157527 38036 167681 -88964 313611 111696 -351033 -14954 -72461
18220 -72461 -481323 -254896 131919 -40150 363414 95454 133022 -276434 -166093 -181162
18210a81162g8109o5998B8759R52c35648A58371a9602k2031m5272C0852b06399
18198b63417B18999a18904B66538j08802c50147d0944A18574B9707e1679J6909
18188c4770I6138k5093b23376A5956c1195D9155c942B12583k5283P3559g7572
18176b74374I7538N3668b08740A04644J24185E4638a73684h3834A34228a79795
18165F3906B389a06840J1989B58239A14173a5819F9646J09298b20926r9625G0946
18153a59565q3491A33610a95958J8561A75354a5443B02942a71054d2356j16439
18143a58795C24275A08984c11164B41217A8973a15358L7697H939b36562H6740
18132i3186B09348a35970A82696H7330K7724a8828n639q8577A68273a59553E6294
$$ plain form
18210 -181162 -78109 -144107 28759 29711 -335648 158371 -19602 -41633 -86905 30852 -206399
18198 -263417 218999 -118904 266538 157736 -350147 -40944 118574 29707 -51679 -34770
18188 -34770 96138 71045 -223376 15956 -31195 49155 -3942 212583 187300 260859 -77572
18176 -274374 97538 151206 -208740 104644 228829 54638 -173684 -83834 134228 -179795
18165 63906 2389 -106840 -94851 258239 114173 -15819 69646 178944 -220926 -320551 70946
18153 -159565 -243056 133610 -195958 -177397 175354 -15443 202942 -171054 -42356 -158795
18143 -158795 324275 108984 -311164 241217 18973 -115358 -77661 8939 -236562 86740
18132 -93186 209348 -135970 182696 87330 115054 -18828 -24467 -113044 168273 -159553 56294
18120d3101J1392j22638B97250f8653A08004c1812H1049a04429q7739A08086h4353
18108c07179B18677h6962c9754i667m24651a35758A29732m3953c84398A1279e7174
18096F6225e4691r9003d4125k26520G528e8566B00651k1656a53908L1824d2364
18084c6515L888A12344Q723K70558h931j31744b4227A05210C9621c75460c2477
18072b61581h6746A59392j1723a01264p4109B30150F2557b79832D9023K7834J6331
18061I3188J40651a37063D36940f7587l39597g529A51755J50352c2608A40603
18050h8709E9749a03174q1164J1263f5808A68013c05586a4285A6010a69149A19662
18038a32577l0914H2980J08765C4585b56911m2547A3017a89050C9405J83189a35782
$$ plain form
18120 -43101 -31709 -154347 297250 -68653 108004 -31812 81049 -104429 -192168 108086 -84353
18108 -307179 218677 -86962 -39754 -9667 -434318 -135758 129732 85779 -384398 11279 -57174
18096 66225 -54691 -153694 -44125 -270645 7528 -58566 200651 178995 -153908 -122084 -42364
18084 -36515 -32627 112344 121067 391625 -8931 -140675 -24227 105210 39621 -375460 -32477
18072 -261581 -86746 159392 147669 -101264 -175373 230150 62557 -279832 49023 76857 93188
18061 93188 233839 -137063 436940 -67587 -407184 -7529 151755 302107 -32608 140603
18050 -88709 59749 -103174 -184338 -173075 -65808 168013 -305586 -14285 16010 -169149 119662
18038 -132577 -163491 82980 191745 34585 -256911 -299458 13017 -189050 39405 222594 -135782
18026G1340C2572c9596C61517i9933A10241f7810j17093F4885f6701q1504A74308
18014D0051h5211F9781e0222j18870L1832j15094g8279A21133k0969K25306E4233
18002F3245N6759i461j17917A26857L0400c8607j7773o2693L6320c7025F909d3237
17989b23901A9152M5495j5932c16225Q3605A0672a32719B65273b44645A23764
17978A439e688C71432c4357A12098a25929f2673l337j52189e553k24406A45345
17966A54794b3661j88722A03458J15080h8267L2838G0353P4802p2012R9343i9793
17954F5013J48647o5929o7575l5019B1615P3396L29313e3624k8978J8828j65799
17943b29573d6466C12101a88852A1562c76088a03020B36128g3390C3337K17625
$$ plain form
18026 71340 32572 -39596 361517 -99933 110241 -67810 -184903 64885 -66701 -148205 174308
18014 40051 -85211 69781 -50222 -169092 -137260 -252354 -78279 121133 100164 325470 54233
18002 63245 120004 -9461 -127378 126857 157257 -38607 -56380 -119073 -82753 -37025 6909 -43237
17989 -223901 19152 64647 48715 -316225 -232620 10672 -132719 265273 -244645 123764
17978 1439 -5688 371432 -34357 112098 -125929 -62673 -66010 -218199 -5553 -229959 145345
17966 154794 -23661 -212383 103458 218538 -88267 -55429 70353 145155 73143 172486 -99793
17954 65013 213660 147731 80156 45137 21615 95011 424324 -53624 -82602 -63774 -229573
17943 -229573 -46466 312101 -188852 11562 -376088 -103020 236128 -73390 33337 250962
17933B50962a0458H8130M7193J8196M8751c4339l1990q1449o5862d5849A49546
17921G1994A0975P4110j4959C661L21068j47832F857e497C01010A40447a30733
17909F9185i381j18868A43336h4546b4713g186l17954B96220r9441r6112a12295
17897I6904L2886J1180M2911d0054M459E8571J0515J46152H1960l7470K28368
17886B72858E1554K4985g6805A28415C9403Q0244C7780J23741K46151c2456o6146
17875i8602M778K0191A81035A6667i3940A64765A9137a4200A80922A6662f3904
17863H4944d02278a11743D8952M5436A4481J05334a32206A18936a06552K9646
17853g6906m1126B4110R6073J5354C7926a60167E9040g5929A63228K72164G1158
$$ plain form
17933 250962 -10458 88130 135323 153519 202270 -34339 -66329 -147778 -213640 -45849 149546
17921 71994 10975 85085 70126 3661 324729 176897 6857 -5497 301010 140447 -130733
17909 69185 -9381 -128249 143336 -84546 -24713 -7186 -325140 296220 196779 100667 -112295
17897 96904 129790 140970 183881 -40054 -35595 58571 69086 215238 81960 44490 272858
17886 272858 51554 76539 -76805 128415 39403 119647 37780 161521 407672 -32456 -98602
17875 -98602 -93824 -73633 181035 16667 -93940 164765 19137 -14200 180922 16662 -63904
17863 84944 -402278 -111743 48952 94388 14481 119815 -132206 118936 -106552 -76906
17853 -76906 -118032 24110 120183 135537 37926 -160167 59040 -75929 163228 435392 71158
17841B70098a27788A68585H1402e4298j46728J0063A14606N152O3477K4597a74536
17829g5724C9959a23849B14960i6958C0191K19325B6371L615c08525E8928R4429
17818A53357a2107H8558a04405B07706b43605A27643c682k17301j1861B9821c8908
17806A72749a91851A63004D2653f5655C47650A49134q068J4432F6185R7031a05005
17794C1155M00854E3642b5924E8229f3382o5274F4715g0897i364j22052B0551
17782c2994H9769a10360b8260C59296G8891M1025j3248J84678A0978b63654E4585
17770A5348N4925b6847B85042A4040K14913J33590h5768A51750h514B29131E5217
17758G3499a02482r1551C66111e6002F1751a20239e7533e659q825C87304j15798
$$ plain form
17841 270098 -127788 168585 81402 -54298 -201026 -190963 114606 119758 183235 207832 -174536
17829 -75724 39959 -123849 214960 -96958 30191 249516 26371 29986 -308525 58928 153357
17818 153357 -12107 88558 -104405 207706 -243605 127643 -3682 -220983 -232844 29821 -38908
17806 172749 -191851 163004 42653 -65655 347650 149134 141066 155498 66185 163216 -105005
17794 31155 432009 53642 -25924 58229 -63382 -128656 64715 -70897 -9364 -131416 20551
17782 -32994 89769 -110360 -28260 359296 78891 119916 106668 291346 10978 -263654 54585
17770 15348 70273 -26847 285042 14040 228953 362543 -85768 151750 -8514 229131 55217
17758 73499 -102482 -194033 366111 -56002 61751 -120239 -57533 -5659 -14484 387304 271506
17747B71506E701R1923a72181j24714i8516j31088a05004G3011L93544d2916J6110
17736b6806A70581G6929j9964d9413A81349h2592H707J35466R0746j00166J77449
17725C12202J42237a74104A91699A5957E369a99513I0841a91331B3725a0491r3030
17714a03521K2552K7451A06174a3859k18104b6328B7931b54557C99845F0480J05667
17703A66147F3824a07456D62286E8665K61381e6630C26338o1740i7493D2935J25443
17692A68378c14249A81256P2846a13208B86952r7612m5894J30963l6529E2133
17681G5721I382Q7332c722N84A54603i8407B77222a88736h9610C8848a54925A84876
17668B07839P7058j20207p4443K92403A83368d0658B1314O6148b76692R7837C47550
$$ plain form
17747 271506 5701 97624 -172181 -296895 -98516 -229604 -105004 73011 466555 -42916 -26806
17736 -26806 170581 76929 56965 -49413 181349 -82592 8707 144173 234919 134753 312202
17725 312202 454439 -174104 191699 15957 5369 -199513 90841 -191331 23725 -10491 -103521
17714 -103521 -80969 -53518 106174 -13859 -231963 -26328 27931 -254557 399845 60480 166147
17703 166147 63824 -107456 462286 58665 320046 -56630 326338 264598 -97493 42935 168378
17692 168378 -314249 181256 254102 -113208 286952 189340 143446 274409 237880 52133
17681 75721 9382 96714 -3722 -3138 154603 -98407 277222 -188736 -89610 38848 -154925 184876
17668 207839 284897 164690 90247 382650 183368 -40658 21314 87462 -276692 -178855 347550
17656A35322N9016a02179B82812b27645a04039c8630C19005j30328M7585q9795
17646A46467d2515G2373i6503B29401b18233o2723E07273A57588K43914A36831
17635a54187O3879A56223J02808l4840i4521D2641a16923j62006F3014l553H943
17623D26161G9422J09839b0919A89580E6244O2626M7023J01383H1937O6661J41938
17612B90536g054k05685A89090a04718A58332o0923e0795B07639H6154f152C22253
17600C0902L12797D8838J6246J69161b70661d1365B05705j5948a51912M0461C76430
17588a8492r2926E8181a16581A34703a90995B79920H0382J2143d1378l6579D92807
17576a35119b117A74616a41041C61846j61402a9374r27C67398j45574j3409a18441
$$ plain form
17656 135322 194338 -102179 282812 -227645 -104039 -38630 319005 188677 236262 146467
17646 146467 -42515 72373 -96503 229401 -218233 -280956 507273 157588 401502 136831
17635 -154187 -90308 156223 259031 224191 -94521 42641 -116923 -278929 63014 59461 8943
17623 426161 79422 189261 -20919 189580 56244 118870 165893 267276 81937 148598 290536
17612 290536 -7054 -212739 189090 -104718 158332 97409 -50795 207639 86154 -6152 322253
17600 30902 343699 48838 65084 234245 -270661 -41365 205705 189757 -151912 -111451 376430
17588 -18492 -111418 58181 -116581 134703 -190995 279920 80382 92525 -41378 -77957 492807
17576 -135119 -2117 174616 -141041 361846 200444 -19374 -20301 367398 221824 208415 -118441
17564A00679J45140a22383A69335l8889K31682A18219M8844K67009A74203K67114
17554D41317j13462F2521O2152g8103F2391a08A0860J63138q5916J15375f6460
17542A77924j7937L4841J03492A00851M2027J88558D8756J33402Q0083I2062F222
17530D60300n2697H6424O9133k3844k7777J41597J90294N3138J33488J95710l05769
17519E12394j15973L5295j37185K6815e5328R803A21239K60396j58471A03812
17508D59042k17335K26066j49906J30234j80352J13255H5417j0286K8703I973
17497E43387k69177a16487B25298k2813P3429L82163B37867L27439o95b0932C54120
17485B65903A05216K13402j15774L12209B8683L52839j52100J51312J63643A36071
$$ plain form
17564 100679 245819 -122383 169335 130446 362128 118219 167063 434072 174203 441317
17554 441317 327855 62521 124673 -78103 62391 -108 10860 173998 88082 203457 -66460
17542 177924 159987 194828 298320 100851 142878 331436 48756 182158 262241 92062 6222
17530 460300 407603 86424 155557 131713 103936 245533 435827 488965 622453 818163 512394
17519 512394 396421 431716 294531 321346 -55328 -45525 121239 381635 223164 103812
17508 459042 241707 467773 317867 448101 267749 381004 85417 75131 103834 9973
17497 543387 274210 -116487 225298 202485 275914 658077 237867 565306 564611 -20932 354120
17485 265903 105216 318618 202844 515053 28683 381522 229422 380734 544377 136071
17474B44908n4007m1418m1486R1699O4249m8104J36828j13726K44948A33670P5997
17463B09667j2821l4483B7513a21113D46519j13035n5635I6957Q903b36685D51409
17451H0947K81650J9801n9359M3047K17502j63592l9465P3009O5210j82795L03076
17440F39031k64712K3829r5648n9482K1032K60448k23819K49659j52101j41195
17430B57042E3568L48249N6013I7257K95050k7305K92783k15657n8173K55910
17420F39865j93104n7574j7144A45086L98488k34182J36750K28573j64099R2529
17410F03145K07213B27657J20698j37850Q7612Q9593j5548m4456J00701c8694
17399B24332p535J18348l5193Q5342q7185C9362J81454E3299L59811n017j43248
$$ plain form
17474 244908 190901 149483 107997 199696 263945 215841 352669 238943 483891 133670 209667
17463 209667 196846 162363 27513 -121113 446519 333484 277849 96957 105860 -236685 451409
17451 80947 362597 382398 323039 366086 583588 419996 380531 453540 518750 335955 639031
17440 639031 374319 398148 302500 243018 264050 524498 300679 550338 398237 257042
17430 257042 53568 401817 457830 97257 392307 365002 657785 442128 383955 639865
17420 639865 446761 389187 372043 145086 543574 309392 446142 674715 510616 603145
17410 603145 810358 227657 348355 210505 298117 387710 372162 327706 428407 -38694
17399 224332 216797 335145 299952 385294 298109 39362 220816 53299 413110 408093 264845
17388B64845A19165K66537j92609G763M01120j23939K62879B44377M7244O8589
17378C60210j21159J92920a04504B66700J63341d0050F48888l13860J63643j46533
17368C52138A33613J87242R9499j61334n8033E6980K04198j27087D2877L81834
17358D24711A11994N16829A25805K94705j33923k1688R1096A60321K97620a02534
17347A07112J35134H9319J67856b0961C52632r7306j25611K07194A28538M8181
17337A76719J96870q7891l6594J82386G2578K94700j48632M1953J43676j40299
17327B63976j04916J47082J16932A30548K17587E718J57590J91720K07502N9774
17317F22304b82580A55828N4086L18278E8346L09735K1082p162A70891j2078L5427
$$ plain form
17388 264845 119165 385702 193093 7763 408883 284944 547823 244377 291621 360210
17378 360210 239051 431971 -104504 266700 430041 -40050 648888 335028 498671 352138
17368 352138 133613 320855 420354 259020 200987 56980 261178 134091 42877 424711
17358 424711 111994 628823 125805 420510 286587 264899 355995 160321 457941 -102534
17347 107112 242246 89319 257175 -20961 352632 255326 129715 336909 128538 176719
17337 176719 373589 285698 249104 431490 72578 367278 218646 260599 404275 263976
17327 263976 159060 306142 423074 130548 348135 5718 163308 355028 562530 622304
17317 622304 -282580 155828 209914 528192 58346 368081 389163 382001 170891 158813 194240
17306A94240M28790A60308K365c0881B74308K4468l2016J02079p9341p0725H7559
17294I7670k6758d7689A23760L03164A52919b764C93972j46999G0537N43792F9974
17282C70752A07342K51408j74330q5944K53365L41152B32299o1269P6772K14407
17272D62209K12253k68934j37344j6937K47619q3161M1691B09550M56501B42248
17261C02941N7984r6959J59380K6171J40559B73575R1384J58510A96955O4593
17251B61548p6133J61858A44140J20300J70308M8320A2962N61491B41425K31190
17241D72615J55962r3602j8057B30692N35100l68731R0572m3998j06188J30099
17231D67546A80009K20617j00046J68959j5082j43069L163J31104j03554J71323
$$ plain form
17306 194240 623030 160308 162673 -30881 274308 298776 266760 368839 289498 218773 87559
17294 97670 70912 -47689 123760 426924 152919 -2764 393972 246973 70537 614329 69974
17282 370752 107342 358750 184420 98476 351841 692993 232299 171030 247802 462209
17272 462209 674462 405528 268184 251247 498866 415705 457396 209550 666051 242248
17261 302941 360925 263966 423346 449517 590076 273575 364959 523469 196955 261548
17251 261548 185415 347273 144140 264440 434748 483068 12962 574453 241425 472615
17241 472615 628577 534975 516918 230692 765792 397061 487633 443635 337447 467546
17231 467546 180009 400626 300580 469539 454457 311388 314551 445655 342101 513424
17221E13424p6995J20673O0816B15509L83849B31797j15221l8335M26691M33080
17211I38012B46305J15874q8207L2895J95210N3666k62647K36549j89776J48987
17201D88856J39822A73713K36687R002j85471L94020j72119J57164l2270r0591
17191D90135j31774J58381Q7403J7175p8844n5054q113J32149C03362K74043J05606
17180F83011k37219M19590l05515J47383n2157O965k60777L16835B81243L79184
17170F60427C15772K93277j76531L39155O0191p7345C42084L54828j76250J86558
17160G07220J12745k31097L35397m05505L20007C16199A39155M13298O2812j10520
17150E04745L63895k97271k57871J15826J3460J79449j94559J26459Q4518j58217
$$ plain form
17221 513424 436429 557102 617918 215509 599358 231797 116576 78241 504932 938012
17211 938012 246305 362179 273972 306867 502077 555743 293096 529645 339869 488856
17201 488856 628678 173713 410400 419402 233931 627951 455832 612996 580726 490135
17191 490135 358361 516742 604145 621320 542476 487422 479309 611458 303362 577405 683011
17180 683011 445792 865382 559867 707250 655093 662058 401281 718116 281243 660427
17170 660427 315772 609049 432518 771673 831864 754519 342084 696912 520662 707220
17160 707220 819965 588868 924265 518760 838767 316199 139155 552453 615265 504745
17150 504745 868640 571369 313498 429324 442784 622233 427674 554133 638651 480434
17140D80434L32261k49151J31966p2166j8559j87892L8983O8429O1869J26234
17130G12408K10702D01200K35758m0011k43790L47225r5562K06070j6604o1595
17120G32691M1509l65954M68353D18833N36030k07188p2185k48179K22807q5067
17110E65051J99047j32679J78039J27098K57791n43624k0007J94151q2080R6628
17100H39415R0237k27251N14226m82051j72257J35206J00225P9534l94389L60752
17090H43647k03386q9959P9654L92797j38854J27221k07821M920K51877K26026
17080A286122l51972k24825K17517o4555j93789L62870J84897j09770k81209J67884
17070I93170j51273k07544L62333j22106L43636Q6141k14080j56055J65785q6050
$$ plain form
17140 480434 812695 563544 695510 623344 604785 416893 455876 524305 586174 712408
17130 712408 923110 401200 636958 596947 353157 700382 604820 810890 794286 732691
17120 732691 774200 408246 876599 418833 954863 747675 675490 427311 650118 565051
17110 565051 764098 631419 809458 936556 1194347 650723 630716 824867 742787 839415
17100 839415 929652 702401 1216627 734576 562319 697525 797750 877284 482895 843647
17090 843647 640261 550302 629956 1022753 883899 1011120 803299 808219 1060096 1286122
17080 1286122 934150 709325 926842 862287 668498 1031368 1216265 1106495 825286 993170
17070 993170 841897 634353 996686 874580 1218216 1304357 1090277 934222 1100007 1013957
17060A013957J95017k15179M44J67879l55686O6468L75353k84828J13163l212
17050A073376K6868P1057l39405K79970K78853k43292M4209K35275j46988k39953
17040A039970K89563m25722M46351J59208m02620J79176r563j27827l1339L91472
17030A508669m25138K51647j79984k5977p4094K2539L94011l8294m7908k10307
17020A175164J92366k84427N15408k31586J15143k05075Q9551j0925K76051k89881
17010A341789p3611J17858K6732J67698j97557J24068K9117P3737J34050j07469
17000A636412J23843m54522K28443J48541L0076J24889j96455L28605k66239k31505
16990A472088L63687l14190L39228k19286Q8873j24093L60444o9262k31132L20420
$$ plain form
17060 1013957 1208974 993795 994239 1162118 806432 872900 1248253 963425 1076588 1073376
17050 1073376 1100244 1171301 831896 1111866 1390719 1147427 1191636 1426911 1279923 1039970
17040 1039970 1329533 903811 1350162 1509370 1106750 1285926 1276363 1148536 1117197 1508669
17030 1508669 1083531 1335178 1155194 1129217 1055123 1077662 1471673 1433379 1385471 1175164
17020 1175164 1367530 1083103 1598511 1366925 1482068 1276993 1366544 1355619 1631670 1341789
17010 1341789 1268178 1386036 1412768 1580466 1382909 1506977 1536094 1609831 1743881 1636412
17000 1636412 1760255 1305733 1534176 1682717 1712793 1837682 1641227 1969832 1703593 1472088
16990 1472088 1835775 1521585 1860813 1641527 1730400 1606307 1966751 1897489 1666357 1986777
16980A986777m77796K01953M61428j92222M57168l83134k1726L4429o0102Q5798
16970B092573M686j91558J40366r8143J42655J20543J57514j22448l40807M38240
16960B343621j74252j24978R0024J50576J72810k21083M12060l60738j05522K62619
16950B445137J14841k36446J18803J23266l04574J90328Q1129j79427q2025M38823
16940B709855j31783P5351K26298j14064k16080K02885q0161Q6635L5133m3396
16930B750673k34441L44184M90499l58730J05217K42059k93219j07737K26912
16921C165417J0516M8201j33210j58924O05895j4300k68039J56066J32221k40220
16911C303623M77981k21317l26595M80689k77413N74995j74056n0644J94940o40275
$$ plain form
16980 1986777 1508981 1710934 2172362 1980140 2437308 2054174 2032448 2066877 2006775 2092573
16970 2092573 2097259 1905701 2046067 1947924 2090579 2211122 2368636 2246188 1905381 2343621
16960 2343621 2169369 2044391 2134415 2284991 2457801 2236718 2648778 2288040 2182518 2445137
16950 2445137 2559978 2323532 2442335 2565601 2261027 2451355 2532484 2353057 2271032 2709855
16940 2709855 2578072 2653423 2879721 2765657 2549577 2752462 2672301 2758936 2794069 2750673
16930 2750673 2516232 2860416 3350915 2992185 3097402 3339461 3046242 2938505 3165417
16921 3165417 3175933 3224134 3090924 2932000 3537895 3523595 3255556 3411622 3543843 3303623
16911 3303623 3781604 3560287 3233692 3714381 3436968 4011963 3837907 3787263 3982203 3341928
16901C341928O68097J19495l7870j63814J89058r9582J69240J25221J61643j97942
16891D275474J08110J30085k08012K96845k19288L93199j89297M33564k40198
16882D780482L06821k41173J66392k90083J69880L13322K65286R9948o4282J69673
16872E676266P7968Q1320L82056m37285J84402j75706O2004K17136k53670L93089
16862F207580j2039J32179j49937P94081l18873K74309q4256P4754P8146K85109
16852G281053K85249L2078m54286O34916M3001j4257M46455j93444K83543K80153
16842H624461k49820K77976L17644L6540K26089J27411n0275O7842M83662P7555
16832I939085k43860M88616J29646K16975L83610K43608N8327L18393J55661P9079
$$ plain form
16901 3341928 4010025 4129520 4091650 3927836 4116894 4017312 4186552 4311773 4473416 4275474
16891 4275474 4383584 4513669 4305657 4602502 4383214 4776413 4587116 5020680 4780482
16882 4780482 5087303 4846130 5012522 4722439 4892319 5205641 5470927 5570875 5506593 5676266
16872 5676266 5754234 5835554 6217610 5780325 5964727 5789021 5851025 6068161 5814491 6207580
16862 6207580 6195541 6327720 6177783 6971864 6652991 6927300 6843044 6917798 6995944 7281053
16852 7281053 7566302 7598380 7144094 7779010 7822011 7807754 8254209 8060765 8344308 8624461
16842 8624461 8374641 8652617 8970261 9006801 9232890 9360301 9310026 9377868 9861530 9939085
16832 9939085 9695225 10183841 10313487 10530462 10914072 11157680 11216007 11534400 11690061 11769140
16822A1769140M15369N3510M72414K5599J33246L40022j42522O31385K49536O7963
16812A4015662j34976P69508M60598L7114L58901N12288J92962J22951L52767
16803A6687775M24426M01027J60072O61300J84788L74001O13163N97425L7232
16794B0141209O32412K16756Q44388N78133L68757N04694M34918N78779O08482
16785B4908528L1690R56431M81098N71075M64126J020945M00260J078893L41634
16776C0254680O12501Q06385N92511J416201P80249Q14081P94070P55944R88728
16767C7815350N91332R41105J231545R48949J271490R13551J061026J231348R83751
16758D6989447J182434J281225J048946J506457J271666R15316J287994J302180
$$ plain form
16822 11769140 12184509 12238019 12710433 12736032 12869278 13209300 13066778 13698163 13947699 14015662
16812 14015662 13880686 14650194 15110792 15147906 15506807 16019095 16212057 16335008 16687775
16803 16687775 17112201 17513228 17673300 18334600 18519388 18893389 19506552 20103977 20141209
16794 20141209 20773621 20990377 21834765 22412898 22781655 23286349 23721267 24300046 24908528
16785 24908528 24940218 25896649 26377747 26948822 27412948 28433893 28834153 29913046 30254680
16776 30254680 30867181 31673566 32266077 33682278 34462527 35276608 36070678 36826622 37815350
16767 37815350 38406682 39347787 40579332 41528281 42799771 43713322 44774348 46005696 46989447
16758 46989447 48171881 49453106 50502052 52008509 53280175 54195491 55483485 56785665
16750E6785665J640835R56266J149405J411061J233267J446789J190885J488054
16742F7302227J457890J310837P60178J121658J421361J114477J213089Q39206
16734G6540923J064195R74960R09115N78908L58039R95915N36099K51644N14362
16725H2724160P1963N45956o05198K81667L9371n14195j71431k21123m96795q12086
16715H0842289p11208n24641q78401j069878r37292j130702p37566j305655j093109
16706G2453837j213873j389232j038182j362899j253607j280509j602979j067571
16698F2244985j152032j344838j353411j160996j638983r29476j138159r60935
16690E2566155j466003q45238j283615j533032p30958j463030j058210r16939
$$ plain form
16750 56785665 58426500 59382766 60532171 61943232 63176499 64623288 65814173 67302227
16742 67302227 68760117 70070954 70831132 71952790 73374151 74488628 75701717 76540923
16734 76540923 77605118 78580078 79489193 80068101 80426140 81422055 81958154 82209798 82724160
16725 82724160 82796123 83342079 82736881 83018548 83057919 82543724 82372293 82151170 81654375 80842289
16715 80842289 80131081 79606440 78728039 77658161 76720869 75590167 74852601 73546946 72453837
16706 72453837 71239964 69850732 68812550 67449651 66196044 64915535 63312556 62244985
16698 62244985 61092953 59748115 58394704 57233708 55594725 54665249 53527090 52566155
16690 52566155 51100152 50254914 48971299 47438267 46707309 45244279 44186069 43269130
16682D3269130j232265m76915j230416j031190o85330j180902p73684r92617q41428
16673C4824383o61882p06732q19377r54914m13273q42744o98956o51903p38905
16664B8335697l83223q76175p43323k95166n24797n36837q24393m35513p24320
16655B2991950j23822p81524l83928n26952m47177m50181k48559n3402o64936
16646A9311469m27880j05483j29503p60663j94593m44546l10222l20811n70709
16637A6047059k1442l82263l5977n14205j66818o03825k03614l09267L30371n55800
16627A3584219n25897j35813L4678k16937p5798n53103J89930m59771n1771J10661
16617A1900398m59040m58013N6333l83419j93406k95275J69286k11366R9965l25943
$$ plain form
16682 43269130 42036865 41559950 40329534 39298344 38613014 37432112 36658428 35665811 34824383
16673 34824383 34162501 33455769 32636392 31681478 31268205 30425461 29726505 29074602 28335697
16664 28335697 27952474 27076299 26332976 26037810 25513013 24976176 24151783 23716270 22991950
16655 22991950 22868128 22086604 21702676 21175724 20728547 20278366 20029807 19976405 19311469
16646 19311469 18883589 18778106 18648603 17887940 17693347 17248801 16938579 16617768 16047059
16637 16047059 16025617 15643354 15607377 15093172 14926354 14322529 14118915 13809648 14140019 13584219
16627 13584219 13058322 12922509 12957187 12740250 12664452 12111349 12301279 11841508 11789737 11900398
16617 11900398 11441358 10983345 11039678 10656259 10462853 10167578 10336864 10125498 10225463 9899520
16607I899520l1969l38972l52533k5322j40123K06204k50462j09481k07718J6785
16597H665929o07450O3984k4427k12519J22625k33158L62907m77502j00446m26009
16587G133934p4280L00923k81869J43887l59030J08913J3264k60550j57381M22418
16577F990229o57209O6412l00389K52847j67468L2876q0704l15824J12098q1046
16567E851822j9914l42734N19264n61377N0871k43026K48274k60907r9486P7050
16557E219837j92319j72559J46373m51421R03411m78385J60533m72202j33156
16548D530112J59517l0227K35274l18248K37916m19388j50115K31048k01111k29476
16538D045302K3492J72654m10293J18776N0439J23713j99483L2986k95955K41282
$$ plain form
16607 9899520 9867551 9528579 9176046 9150724 9010601 9216805 8966343 8856862 8649144 8665929
16597 8665929 8058479 8122463 8098036 7885517 8008142 7774984 8137891 7660389 7559943 7133934
16587 7133934 7059654 7360577 7078708 7222595 6863565 6972478 6985742 6725192 6567811 6990229
16577 6990229 6333020 6399432 6099043 6351890 6184422 6217298 6136594 5820770 5932868 5851822
16567 5851822 5831908 5489174 6008438 5447061 5497932 5254906 5503180 5242273 5142787 5219837
16557 5219837 5027518 4854959 5001332 4549911 5453322 4974937 5135470 4663268 4530112
16548 4530112 4689629 4659402 4894676 4576428 4814344 4394956 4244841 4475889 4274778 4045302
16538 4045302 4068794 4241448 3831155 3949931 4000370 4124083 3924600 3957586 3661631 3902913
16528C902913k9451k70922L22837j84910K05656l07343M503j07511O3451J60599
16518C759822m89173J69019j07366k37399N96751l51883l11343R4145O334o1363
16508C067544L15015j88409j61269j60796J29979M0129j30280K25278k12500j3952
16498B910739K08013l10810J24130j9441k21374K10621j54923J05773j18402j87111
16488B547215J86495k35805O3804q1407m385O1788q7243J03621l96654N8223q3328
16477B132324K63464k10965k3400M39230l37628K95086k46823r471J20817k51646
16467B170988J01572R4900j51025q2427K86356m29134J17683L2452J7913n4652
16457B104626J43669j8468j99913p8747k7549K03636j06397k16372J69410j9096
$$ plain form
16528 3902913 3873462 3602540 3925377 3740467 3946123 3638780 3643283 3535772 3599223 3759822
16518 3759822 3270649 3439668 3332302 3094903 3691654 3339771 3028428 3122573 3128907 3067544
16508 3067544 3382559 3194150 3032881 2872085 3002064 3042193 2911913 3137191 2924691 2910739
16498 2910739 3118752 2807942 2932072 2912631 2691257 2901878 2746955 2852728 2734326 2547215
16488 2547215 2733710 2497905 2561709 2480302 2475917 2537705 2450462 2554083 2157429 2215652 2132324
16477 2132324 2395788 2184823 2161423 2600653 2263025 2558111 2311288 2301817 2422634 2170988
16467 2170988 2272560 2367460 2216435 2134008 2420364 1991230 2108913 2141365 2159278 2104626
16457 2104626 2248295 2229827 2029914 1951167 1923618 2127254 2020857 1804485 1973895 1954799
16447A954799j11735o714K11521r6341j16697J26057P8670k90849P7093K13115
16437B038919m1977k9538l86245P5104O3614k79591J51750K53832R529j66346
16427A689051j55586M37892j92606j94440J14790J08194j21190j35888R5113l2977
16417A612353j3369R2137o2560j02160q4644K62964o8976l58088K78918j56415
16407A400160K48784j26133M7049J13222k27284M6486j99681K92311l68267k15763
16397A010884J43867K86392K03410l52792m5694j00163K14253R0372K3270k31928
16387A241871Q9036O3205l49707J46158Q6852K26896l0743l43920L1885M5494
16377A207027j01997K13012q1760M6375r3458K1970n6704j02680L0971J97105
$$ plain form
16447 1954799 1843064 1836350 2047871 1951530 1834833 1960890 2039560 1748711 1825804 2038919
16437 2038919 1996942 1967404 1581159 1656263 1719877 1440286 1592036 1845868 1855397 1689051
16427 1689051 1533465 1971357 1778751 1584311 1699101 1807295 1686105 1550217 1645330 1612353
16417 1612353 1598984 1691121 1628561 1526401 1441757 1704721 1635745 1277657 1556575 1400160
16407 1400160 1648944 1522811 1569860 1683082 1455798 1502284 1302603 1594914 1226647 1010884
16397 1010884 1154751 1441143 1644553 1291761 1246067 1145904 1360157 1450529 1473799 1241871
16387 1241871 1330907 1394112 1044405 1190563 1277415 1504311 1473568 1129648 1161533 1207027
16377 1207027 1105030 1318042 1236282 1282657 1189199 1211169 1154465 1051785 1082756 1279861
16367A279861k23625j55511N10035j77832j14550R7348n0887m5410j09235J44281
16357A154475m3765J52206n0638K04132l93929k5928K2184l82788L96793J97876
16347A230618n3875j09288j46639O0376M91037l68592J56104l45279J40897k09180
16337H46179j95688N81131j62075j78238J44248q0083j53470k39845P01487k29438
16327A034208k69719O9509L1575j0291j0621m2718J00968J47347K123K6078j98833
16316H79626k92839M51236r8386j58879K87050l48279R1787C83098K51585L45547
16306I80230j89291M7343n8070m6333K12720q8781R8756O575k5065r9240J42872
16295I81716j68452q4318J07845j20262n9345j5566O3584J478k2373P7720K62849
$$ plain form
16367 1279861 1056236 900725 1410760 1232928 1118378 1215726 1164839 1119429 1010194 1154475
16357 1154475 1110710 1262916 1212278 1416410 1022481 996553 1018737 635949 1032742 1230618
16347 1230618 1176743 1067455 920816 981192 1472229 1103637 1259741 914462 1055359 846179
16337 846179 650491 1231622 1069547 891309 1035557 955474 802004 562159 1263646 1034208
16327 1034208 764489 833998 865573 855282 844661 801943 902911 1050258 1052381 1078459 879626
16316 879626 586787 1038023 939637 780758 1067808 719529 811316 383098 634683 980230
16306 980230 790939 838282 780212 733879 946599 857818 956574 963149 938084 838844 981716
16295 981716 813264 728946 836791 716529 657184 641618 705202 706680 684307 762027 1024876
16284A024876l21750K33959K07704m02513P170k10428O00771m09626l8286M5821
16274G37698l20447J84911J68223N5450p0422B64719N41097L928j32039K7081
16264G04786l2659B08573K26431J97178J98169q8965n0953N0039l48475K39346
16254F31343j07956L78693k19230j81201J78468k61235J34160J43274q422j21579
16244E66315j50857K24038k23082N4438K59750C44727K75669j87269J53038J25023
16234G11188j3277l1634C29305J02678R5602j60396K73100j97543r465J74130
16224F07411J49283O026j99105Q0921j41427n596J67396k54812K414L8999j38472
16213C13038Q1557M29151m10701m3881M02948k65551j54919J95855j82736J03494
$$ plain form
16284 1024876 703126 937085 1144789 742276 749446 539018 1139789 730163 691877 737698
16274 737698 417251 602162 770385 825835 755413 264719 805816 809744 677705 704786
16264 704786 672127 208573 435004 632182 830351 741386 690433 740472 391997 631343
16254 631343 523387 902080 682850 501649 680117 418882 553042 696316 687894 566315
16244 566315 415458 639496 416414 470852 730602 344727 620396 433127 586165 711188
16234 711188 697911 666277 329305 431983 527585 367189 640289 442746 433281 607411
16224 607411 756694 762720 563615 644536 503109 497513 664909 410097 412511 451510 313038
16213 313038 394595 823746 413045 369164 772112 506561 351642 547497 364761 468255
16203D68255J49189A31094N16866B66146J65915j5909j631M28481k71956j86153
16193C84893J48640j33271J73739n2528M1674A21888K55072J52802j21994L90213
16183G97981A62549N5694l3393M56024A73501M6911j4562N87803j51474j84015
16173D58164K918j82948A08068K56464R1698j74115J44142k02762L45233n7156
16163E11572N3986J34059k01010k9873k21891K21446j54289Q8189n3239j8748
16153C30202M7815J38441q1856J09796k64918J88687j69370J90962j81571A21379
16142D75151m7947o0034K70424m5169A78749C6075O0539L39613k9465K25597k75821
16131C56538K98944B55558N85883C16183Q7773F5973J71846j16218A808b5755
$$ plain form
16203 468255 617444 131094 647960 266146 432061 416152 414521 843002 571046 384893
16193 384893 533533 400262 574001 521473 563147 121888 376960 529762 407768 797981
16183 797981 162549 218243 184850 640874 173501 220412 205850 793653 642179 458164
16173 458164 461082 278134 108068 364532 456230 282115 426257 223495 568728 511572
16163 511572 565558 699617 498607 468734 246843 468289 314000 402189 348950 330202
16153 330202 378017 516458 434602 544398 279480 468167 298797 489759 308188 121379
16142 475151 427204 367170 637594 592425 178749 36075 96614 436227 406762 632359 356538
16131 356538 655482 255558 841441 316183 403956 65973 237819 121601 1808 -25755
16120A19689B6112O3634J99976K17446j6280A03991l2864R8009K01416N6591j90817
16109B36326J8523M2032A18904J86669j38861N6651j8961I3883j2533B5518L49883
16098C75401A17216O7235L06791j41448q973H4477J19055H1731k8661i5376C98746
16086B61447J24773j78350J83823D4665J79238P0020F3623J91315O9232r2431
16076B31739J62506A34060Q72J75556J26179j00279b8155B51315C1781L34481
16066C66262j3495J51043A94995K6245N0815E3008K18382c407B16820J19624J19573
16055D56017n3615O0391A94849k9423K15419a91798H2777J43703b0781C3119P1717
16044A04836l2211J78279K79495b60326B19855N3507C9797h6942D02943A86432
$$ plain form
16120 119689 26112 89746 289722 507168 490888 103991 71127 169136 370552 427143 236326
16109 236326 254849 296881 118904 305573 166712 223363 204402 93883 81350 25518 375401
16098 375401 117216 184451 491242 349794 340821 84477 203532 81731 53070 -95376 398746
16086 261447 386220 207870 391693 44665 223903 293923 63623 254938 324170 231739
16076 231739 394245 134060 134932 310488 436667 336388 -28155 251315 31781 366262
16066 366262 352767 503810 194995 221240 272055 53008 271390 -3407 216820 336444 456017
16055 456017 402402 462793 194849 165426 380845 -191798 82777 226480 -20781 33119 104836
16044 104836 72625 250904 530399 -260326 219855 273362 39797 -86942 402943 186432
16033A55927G705J76583Q3695F9864K47996A48647M5788L3180J66948A28463a56122
16021A41896o5588J98499L8417H4227a34174A77791E3244L5688R8093q1495J08933
16010B14463K05785r9903L8483j71423H3808k4122K76553A28421a24824A50594
15999C58324j825A21297a9273A38965Q6453p5605K16056k4864K76968O226K39576
15988H63775P3160K71065E88628L2174N4434A82605N2132J06685F9401J04829
15978A74230g142A50315J56260G3220J35635p7877b3603B45220e4975D0018L06485
15967C46503D8811M06776B09050a07338I2573P2458n4872J23731M1491C2080a3429
15955f3555A91702K0298a69839A22674L5049J3015l443P9773H799a02201o8792
$$ plain form
16033 155927 7705 184288 267983 69864 317860 148647 194435 227615 394563 128463 -156122
16021 141896 76308 274807 313224 84227 -134174 177791 53244 88932 187025 105530 214463
16010 214463 420248 320345 358828 187405 83808 59686 336239 128421 -124824 150594
15999 358324 356499 121297 -19273 138965 225418 149813 365869 341005 617973 624199 863775
15988 863775 936935 1208000 588628 620802 675236 182605 234737 341422 69401 174230
15978 174230 -7142 150315 306575 73220 208855 130978 -23603 245220 -54975 40018 346503
15967 346503 48811 455587 209050 -107338 92573 165031 110159 233890 275381 32080 -13429
15955 -63555 191702 212000 -169839 122674 157723 170738 167295 247068 8799 -102201 -170993
15944a70993C4051O9417L15615j98648G1018d6114B3862K92278D0109L1349K43763
15933C15221e929B25308o8030F0617b02459R1605A36084e1029p8924A3361a7668
15921D18658j73176j18148K1602E2359J53040b8354l67648a21833A45053l3577
15911A11476P3235b05451c5930n3716o6111F4064f4123n310A80153E2207j81J33257
15899A85283Q1991j8448E6979L29000E3865J06028K06470b2159F0257e4450C3994
15887E03320C2745K78746a3503C0608f1941H7379R2269a38380A26871E4343A6244
15875C6738J36046O2848K0257b40358d4218D42941A09199L3952P3312e6103B62151
15863B48127b49016G7232M4585B7726J26622g664D2092b3056B404N8564K03705
$$ plain form
15944 -170993 34051 103468 419083 220435 71018 -46114 23862 316140 40109 71458 315221
15933 315221 -5929 225308 157278 60617 -202459 -110854 136084 -51029 -129953 13361 -17668
15921 418658 245482 127334 148936 52359 205399 -28354 -396002 -121833 145053 111476
15911 111476 184711 -205451 -35930 -89646 -155757 64064 -64123 -69433 180153 52207 52026 185283
15899 185283 267274 248826 56979 385979 53865 159893 366363 -22159 60257 -54450 33994
15887 503320 32745 311491 -13503 30608 -61941 87379 179648 -138380 126871 54343 16244
15875 36738 172784 235632 255889 -240358 -44218 442941 109199 143151 216463 -56103 262151
15863 248127 -249016 77232 121817 27726 154348 -7664 42092 -23056 2404 60968 264673
15852B64673d3000A90877O4400n0021i3733D0536K66654G0938J50792G6757l3282
15841D3475O6242J31489B3379Q3571J6648b2283E0262J80396H296b02837F4670
15829A28007N8799c0368B47397a73635D8365a09163j58610C35869a09357B4111
15818h0800A14697a88479H4616i1693k78309k8166A68373A1113K16170r6777e20671
15806i0678B99882r6425F1137K4248A9002a4221B92740c2779B9158K62728A0977
15794A61050j9897b13711j011E7325N3167C9651a1720A61385K13843B0872M8042
15783F8914j0170J59611a08114m3908A10238b29277i0882F3305e7526B11524D4142
15771B43438a12270N5702D0965R0810i2463I6714D5895b66667B52883g6478C51608
$$ plain form
15852 264673 -43000 190877 255277 205256 -93733 40536 307190 70938 221730 76757 43475
15841 43475 109717 241206 23379 106950 123598 -22283 50262 230658 8296 -202837 64670
15829 128007 186806 -30368 247397 -173635 48365 -109163 -267773 335869 -109357 24111
15818 -80800 114697 -188479 84616 -91693 -370002 -398168 168373 11113 227283 130506 -520671
15806 -90678 299882 203457 61137 85385 19002 -14221 292740 -32779 29158 291886 10977
15794 161050 141153 -213711 -214722 57325 110492 39651 -11720 161385 375228 20872 68914
15783 68914 58744 218355 -108114 -152022 110238 -229277 -90882 63305 -57526 211524 44142
15771 243438 -112270 -56568 40965 131775 -92463 96714 45895 -266667 252883 -76478 351608
15759f9429D6409J9367P3796M3574M1669L7648a3928C119d0179j74490F5474K84899
15747C50373A23966f2285B37929E819b76168D6395J2645O9831b8925D80077H4797
15735G3619K0515g4833l19290A77663a33332H4810l7083A8325J96889a19233A66998
15723a53149N4048b4750F1724a3106H7961M8896b47194E3293d7196j71122Q4818
15712a33500A90198j3269A2912c07537i2123A25976a19676A25371C8383c76934
15701A06285b34069A22837b98161e8428B97958j20709m2582e2666r01j52904a7667
15689G8864a03332j308I7476d8405H7539e1911A03240H075b76238a02541K3579
15678g8962j46183A28553m0554a35583A39787d2188H0416B019L55230d5200D0525
$$ plain form
15759 -69429 46409 65776 139572 183146 224815 262463 -13928 3119 -40179 -214669 65474 350373
15747 350373 123966 -62285 237929 5819 -276168 46395 59040 128871 -28925 480077 84797
15735 73619 94134 -74833 -394123 177663 -133332 84810 47727 18325 215214 -119233 166998
15723 -153149 -99101 -24750 61724 -13106 87961 136857 -247194 53293 -47196 -218318 -133500
15712 -133500 190198 176929 12912 -307537 -92123 125976 -119676 125371 38383 -376934
15701 106285 -234069 122837 -298161 -58428 297958 177249 134667 -52666 -53567 -206471 -17667
15689 78864 -103332 -104640 97476 -48405 87539 -51911 103240 8075 -276238 -102541 -78962
15678 -78962 -225145 128553 87999 -135583 139787 -42188 80416 2019 357249 -45200 40525
15666A8500P3657a85832I6755b59705P1624c7274A99450a50423a645A34N4987
15655E5121L15459j70092d9469b2534k41537a5440A26296b49687F664Q1452a10677
15643A8450a18622C6130b69854I1266J03577c13958B80143d49141a06784j75274
15633b82058e7230A83797C8541e4540k1037M980A77275b25695r3535A17997J93686
15622C11683a34300q5881a3350B89735f3429D14023q3528A34879B6674J83547
15612B10221b25878H3721J82416a35032B37224p5748a6046m9408A63197p8931
15602H4266K6740a27919B50635b6089g479E4058B3839J22773J69571C7339B76
15590F9925b20409Q0077L8192H6480C5165P077K33874a48631A3991a5591E4124
$$ plain form
15666 18500 92157 -185832 96755 -259705 -188081 -37274 199450 -150423 -1645 134 55121
15655 55121 370580 200488 -49469 -22534 -264071 -15440 126296 -249687 6664 88116 -110677
15643 18450 -118622 36130 -269854 91266 194843 -313958 280143 -449141 -106784 -282058
15633 -282058 -57230 183797 38541 -54540 -75577 -70597 177275 -225695 -319230 117997 311683
15622 311683 -134300 -220181 -13350 289735 -63429 414023 330495 134879 26674 210221
15612 210221 -225878 83721 266137 -135032 237224 161476 -16046 -65454 163197 84266
15602 84266 111006 -127919 250635 -26089 -7479 54058 23839 146612 316183 37339 276
15590 69925 -220409 -140332 -102140 86480 35165 42242 276116 -148631 13991 -15591 54124
15578C1793b13928K2490L3918J1381G1033b1292p1585A51378b13730B3201a41273
15566H4676d8493A8354L6434h9528D21891g2943I1999b75889e1021O440i547B31560
15553A32493a06377F7690a76112C8966J74779A7204P8475R1a55468G6460P6919
15542A53379e1096A76842J1342A3268J02776g2090l7227a5672o3097j62330k3862
15531b64961H9936J88665A5086J21356D3262Q0526J03328d5399C25588E1976A6149
15519B67965b23555B52124I1657k785j2302a99883B32336A10241n3382a02364
15508a36391c9503A70690j2491A914b5470A6777L3083a86239i238j51984c0176
15496A02579b20553a5917k60584C7635a70920a071A47310p1501k7485J51815e6663
$$ plain form
15578 31793 -213928 -191438 -157520 -146139 71033 -21292 -92877 151378 -213730 23201 -141273
15566 84676 -48493 18354 54788 -89528 421891 -72943 91999 -275889 -51021 -44581 -9547 231560
15553 132493 -106377 67690 -176112 38966 213745 17204 95679 95770 -155468 76460 153379
15542 153379 -51096 176842 188184 13268 116044 -72090 -109317 -15672 -78769 -241099 -264961
15531 -264961 89936 278601 15086 136442 43262 123788 227116 -45399 325588 51976 16149
15519 267965 -223555 252124 91657 88872 76570 -199883 232336 110241 56859 -102364
15508 -136391 -39503 170690 158199 1914 -25470 16777 49860 -186239 -9238 -161222 -30176
15496 102579 -220553 -15917 -276501 37635 -170920 -1071 147310 75809 48324 200139 -56663
15484a07579A90010i0152E3469b37533E0831K96099q5778L92015C26035E7665
15473a91309f0789B04006K1386j06113i5319B73911C9434a10878A79272Q0933
15463B60205j29579n9081J40308B3324j052K52398j36435b89264C37855C6276
15452B89171I9561A5618J1017J41463E0556a91221C26608K55095J78085l02633
15442D57155L8966B16099A3088a70872H2137K74783b66003P8796E6521J36600
15432A93121a43914H998J09382b03941C58261F1726R173J49511e4220D5274b04287
15420h2438j39566D24948b5137B44527D2088j8107J3870H898K54385I9741a99142
15408d28302C3401J29965N0610m5588a1078A2755O7097f0979A00675c84459a07749
$$ plain form
15484 -107579 190010 -90152 53469 -237533 50831 346930 261152 653167 326035 57665
15473 -191309 -60789 204006 225392 119279 -95319 273911 39434 -110878 179272 260205
15463 260205 130626 71545 211853 23324 22272 274670 138235 -289264 337855 36276
15452 289171 99561 15618 26635 168098 50556 -191221 326608 581703 759788 457155
15442 457155 496121 216099 13088 -170872 82137 356920 -266003 -187207 56521 193121
15432 193121 -143914 8998 118380 -203941 358261 61726 70899 220410 -54220 45274 -204287
15420 -82438 -222004 424948 -25137 244527 42088 23981 37851 8898 263283 99741 -199142
15408 -428302 33401 163366 213976 168388 -11078 12755 79852 -60979 100675 -384459 -107749
15396b0356B495K653b4343q661B38592A07668h9360c859B54342G799f118r2093
15384i8211C04712H7456a1378m00930i1013k3102c1483l289A00002b85453B4986
15372B57388M6662p44o3271k5050a27174F9742P6678B3773L72830a47818J2466
15361a35352j8497F3914B2316a63327g8686m0586A05745K39609H990N5812J74970
15350B39772m4935k9399J62998A21121L91641j24082A30292J6271l3590P7306
15340A90279m62E1407a10791N3467a2351j5115C48555F3109b5670F2676c7178
15328A4930J87531K09938G1125J02015Q9952d1822A56315c2217H3337J61464a69509
15316C75730j80444R4271A26612l931e3400C1950R2332g2937E68747F8069j2736
$$ plain form
15396 -20356 2495 5148 -24343 -33004 238592 107668 -89360 -3859 254342 7799 -6118 -98211
15384 -98211 304712 87456 -11378 -412308 -91013 -114115 -31483 -34772 100002 -285453 24986
15372 257388 304050 303306 240035 214985 -127174 69742 146420 23773 396603 -147818 -135352
15361 -135352 -153849 63914 22316 -163327 -78686 -119272 105745 345354 8990 64802 239772
15350 239772 194837 165438 328436 121121 512762 388680 130292 146563 112973 190279
15340 190279 189817 51407 -110791 -57324 -12351 -27466 348555 63109 -25670 62676 -37178
15328 14930 202461 412399 71125 173140 263092 -41822 156315 -32217 83337 244801 -169509
15316 375730 195286 289557 126612 122681 -53400 31950 124282 -72937 568747 68069 55333
15305E5333J46670I3581K91832r8222A9410g0862A37942a31955K3788D06976F049
15293a42265B637J80133F6203J43178c42786H6893f5330p2182B30224i1297O189
15282h5108k4997B33509I4360B8736P7852J12239d0571A10736K717E632f2174
15270a50903c5504B13701G4843O8241a92283L7809B79234j12916J19552l6798
15260B49072f0546k6371I6367f1968A03320J20720J34607A36833c5066C29800
15249A56043K34541K58708P09869Q63856m41640L92091p73543D54443A46737A5126
15238C01398a23261B36814e9098B24558G5445D242L4167f5081k04656J28766A55173
15226b73307C2119b394k9333H0656a09312i216C00720q7643i8373G879J98237
$$ plain form
15305 55333 202003 93581 385413 287191 19410 -70862 137942 -131955 -108167 406976 6049
15293 -142265 2637 182770 66203 209381 -342786 86893 -65330 -137512 230224 -91297 -85108
15282 -85108 -110105 233509 94360 28736 106588 218827 -40571 110736 113453 5632 -62174
15270 -150903 -35504 213701 74843 143084 -192283 -154474 279234 166318 285870 249072
15260 249072 -60546 -86917 96367 -61968 103320 224040 358647 136833 -35066 329800
15249 156043 390584 649292 1359161 2223017 1781377 2173468 1399925 454443 146737 15126
15238 301398 -123261 236814 -59098 224558 75445 4242 38409 -65081 -269737 -140971 155173
15226 -273307 32119 -2394 -31727 80656 -109312 -9216 300720 213077 -98373 7879 206116
15215B06116i7490B12024o4931E6444c3329A37332L16854H4067f1907D655f5260
15203B1870b36890A04908a27846B7142J37410D5498J01312l7377a69589c042B98419
15191A62355o0011g2667p8842d4446A22581a53784G655k795Q9161l9757g7416
15179D7667O5736J70732i3454A00358c16807e0420C04633a7566j14974F7786b5610
15167b57514B02725a9378E8089K91841c8703M514k8718K0399l1775C3544b82742
15155A22387a29453q5257e9682B23654F1670L8112J39131O213b0671k05384I0597
15143A3294a55745M0382m2456B49567a64519D8849J20535m1688O421n0844P2682
15132A55955c60221C24346A3148J8589K69499L1341E296K37192b4158j36106B03812
$$ plain form
15215 206116 -97490 212024 147093 56444 -33329 137332 454186 84067 -61907 4655 -65260
15203 21870 -236890 104908 -127846 27142 164552 45498 146810 109433 -169589 -3042 298419
15191 162355 102344 -72667 -151509 -44446 122581 -153784 7655 4860 94021 54264 -77416
15179 47667 113403 284135 -93454 100358 -316807 -50420 304633 -17566 -132540 67786 -25610
15167 -257514 202725 -19378 58089 349930 -38703 -34189 -62907 -42508 -74283 33544 -282742
15155 122387 -129453 -214710 -59682 223654 61670 99782 238913 245126 -20671 -226055 90597
15143 13294 -155745 -115363 -157819 249567 -164519 48849 169384 127696 134117 83273 155955
15132 155955 -360221 324346 13148 31737 301236 332577 5296 242488 -24158 -160264 203812
15120f7080D50891i838r350C64020A78702l8186j8425R8342F5473J13740p0916
15109A08297d5470B52348b07719Q5435e2862G9080J97687K6175f766A41292l9108
15098A02184L3987A1874J01660f5999A01301A6188f1833C40848p9367K98290B72960
15086d7526J5915n9630B03017K03394e8986H3182L78120D4900J99706m7312F0175
15074C09184j29923p4410J14013b7289A16935A02L17320m6436j35122K24335g5390
15062A83187B6125K15385C8618Q4437K96052A04686R3863M26003A30044J18298
15052B48342Q1317d477j8584A66305j3327L82641B21886n9705m7169J0658J15494
15041B41164M2663j17738C5684P7957K5532J42935L8352N8361j78743J37102L6416
$$ plain form
15120 -67080 450891 -9838 -19188 364020 178702 140516 122091 220433 65473 179213 108297
15109 108297 -45470 252348 -207719 -122284 -52862 79080 276767 302942 -6766 141292 102184
15098 102184 136171 11874 113534 -65999 101301 16188 -61833 340848 261481 559771 272960
15086 -47526 -31611 -91241 203017 406411 -58986 83182 461302 44900 244606 197294 60175
15074 309184 179261 104851 218864 -27289 116935 102 317422 270986 135864 360199 -75390
15062 183187 26125 241510 38618 123055 419107 104686 198549 624552 130044 248342
15052 248342 329659 -4477 -23061 166305 152978 535619 221886 162181 115012 125670 241164
15041 241164 283827 166089 35684 113641 139173 282108 320460 378821 200078 337180 373596
15030C73596j49984M29710C03648l6724Q3226K36220k76215q3418b2259B98718
15019E06800j51756J51096j77775o4415R6998j40962J16584J4472L7529A38238
15008c625j3618p7574A63912K47667k01123k7907J44530R0642o1044L6802A34803
14996D69828m0435B01248K5984L67289j90561j88577l4999L19556j85277A48936
14985D61195J46535j13298B20487q092n371N19066j27064A60828J85497L71164
14975G17489l31554o3942j43669K23990G3918K20024k6514L22646j67387j59062
14965B63625L37188n1851k39750J3554J2528K13775A69390D6322L32158q5493
14955B92987M4231r4711P2549P8759k2402a035B93442K37060A53294L00985J1779
$$ plain form
15030 373596 223612 653322 303648 266924 350150 586370 310155 226737 -22259 298718
15019 506800 355044 506140 328365 263950 360948 219986 336570 351042 388571 138238
15008 -3625 -17243 -94817 163912 411579 210456 182549 327079 417721 356677 393479 134803
14996 469828 429393 201248 227232 594521 403960 215383 180384 499940 314663 148936
14985 461195 607730 494432 220487 212395 207024 726090 599026 160828 346325 717489
14975 717489 385935 321993 178324 402314 73918 293942 267428 590074 422687 263625
14965 263625 600813 548962 309212 322766 335294 549069 169390 46322 378480 292987
14955 292987 337218 242507 315056 393815 371413 -1035 293442 530502 153294 454279 466058
14944D66058L5647K8865A88914J61234n9373L9992J09825L141P0778j17743j4322
14933C82446M96947N4434l27671L60217C55552N42372K2006J1888P9484J3944
14923A025246m8110J43670o5470J7983L30057k22622j79750k2642o8772l54556
14913E55034M8639K6749B32221J97082Q5412K1410j20857n1093o1011L53636A61117
14901E68420j15071j25654k86M4278B7273M51978J79377k62183K20298k30806
14891C85937J12178j13206n1064M13286p8438j95886O5368l6440Q2313k50017
14881C34031D4216L38240J83833F4967L73932j8804L9971a65228C82651L8655
14871D21306M0032J22837Q1600B44707L5723Q5774J65699p3530K24J6013m7999
$$ plain form
14944 466058 501705 530570 188914 350148 290775 330767 440592 443733 514511 396768 382446
14933 382446 879393 933827 606156 966373 355552 897924 919930 931818 1011302 1025246
14923 1025246 977136 1120806 1055336 1073319 1403376 1180754 1001004 978362 909590 555034
14913 555034 603673 630422 232221 429303 514715 536125 415268 364175 303164 656800 161117
14901 568420 453349 327695 327409 371687 27273 479251 658628 396445 616743 385937
14891 385937 498115 384909 333845 747131 668693 472807 538175 501735 584048 334031
14881 334031 44216 382456 566289 64967 438899 420095 460066 -165228 382651 421306
14871 421306 461338 584175 665775 244707 280430 366204 531903 458373 458597 474610 426611
14860D26611p476r8098N8132j73694L5103j0657K19262J01745J24668m8107B25868
14848E39048j30602J53434k62633M91475k39087K75773o0184J47178o7006l29224
14838E18172L01813C35153N1952M2247K07229j01205J02664k73007K63836C05808
14827B19173J09298J89077k22600J43540m3130P4134K11765B70298M40651L0006
14817G40955j96381n786O1785k32330K91017j42709k09360Q2085l0631L9754M99729
14806H98128j62144n4289K83122l93633J66677k6112p9968k04488K66013l25998
14796C67308N089K75893p4524M7854B48658j0342K21896J09170j98171J65094
14786E36305K56644l80565Q6010J50882j59542K77530k72530K58643k71278q6426
$$ plain form
14860 426611 419135 321037 379169 205475 240578 229921 449183 550928 675596 627489 225868
14848 539048 408446 561880 299247 790722 551635 827408 767224 914402 847396 518172
14838 518172 819985 335153 387105 429352 636581 535376 638040 365033 628869 305808
14827 219173 328471 517548 294948 438488 395358 469492 681257 270298 710949 740955
14817 740955 544574 538788 600573 368243 659260 516551 307191 389276 358645 398399 898128
14806 898128 735984 681695 964817 571184 737861 711749 631781 427293 693306 367308
14796 367308 372397 648290 573766 621620 248658 238316 460212 569382 371211 536305
14786 536305 792949 412384 498394 649276 489734 767264 494734 753377 482099 395673
14776C95673M81170C86668L16995k69465m1561K55134n7805o8040J91039k43821
14766D69144p6234m9988L17447k12970N7797N2607K10356l75549M7725L05369
14756G45704j91112J31858K08363l00008j57041K70046J32795r9815n8982j19000
14746E62808o5335K22703N4382k76423l1658J87566l6823J93205J17005D43846
14735H67369l78537M14853l13986o5019o0265L17985j74108L97085R7808k98856
14725H04329R7754K92125J7181q3765L7934m7452k41669k35892L44199j76451
14715H08293M09664k66895j66527j63492K38506Q7395j34443J90995K2956q0476
14705I45976j19786m4141j8477L38597P6503L58713m55064J37403k13730Q7968
$$ plain form
14776 395673 876843 386668 703663 434198 392637 647771 589966 521926 712965 469144
14766 469144 392910 342922 660369 447399 505196 557803 768159 392610 440335 745704
14756 745704 554592 686450 894813 594805 437764 707810 840605 740790 681808 562808
14746 562808 497473 720176 774558 498135 466477 654043 617220 810425 927430 443846
14735 867369 488832 903685 589699 524680 464415 782400 608292 1005377 1103185 804329
14725 804329 902083 1194208 1211389 1127624 1165558 1118106 876437 640545 984744 808293
14715 808293 1217957 951062 784535 621043 859549 946944 812501 1003496 1026452 945976
14705 945976 826190 782049 763572 1102169 1178672 1537385 1082321 1219724 1005994 1093962
14695A093962K12929n27222M23917j59356j27136k21783l9141K43540L5065j4773
14685I20002K18470n60777O65097k43712l70902N5299K26607Q503K46322k66125
14675H98784k5431K02167j65082L39560l04175j6692n0701j58238K79845j46756
14665H53281M91696k22781M3374j31148m16867K49734J60419J35680l37032J11975
14655I38331R2059k17670J49489K19896R7726J41070j75153n020J2226J32604
14645A385558j41551n8632O6337k5652N7353j17010j30850L34142l14660m7807
14635A007228l17333N00243k37341M37323k32174k07916K63093l33630K77336
14626A156829k71142L91740K32888k83189q5787L74530m16807Q0475J04267N8608
$$ plain form
14695 1093962 1306891 779669 1203586 1044230 917094 695311 656170 899710 934775 920002
14685 920002 1138472 577695 1242792 999080 628178 683477 910084 918587 1164909 898784
14675 898784 873353 1075520 910438 1249998 945823 929131 878430 720192 1000037 853281
14665 853281 1344977 1122196 1165570 1034422 617555 867289 1027708 1163388 826356 938331
14655 938331 1030390 812720 962209 1182105 1279831 1420901 1245748 1240728 1252954 1385558
14645 1385558 1244007 1185375 1251712 1226060 1283413 1166403 1035553 1369695 1055035 1007228
14635 1007228 689895 1190138 952797 1390120 1157946 950030 1213123 879493 1156829
14626 1156829 885687 1277427 1510315 1227126 1141339 1515869 1099062 1179537 1283804 1342412
14616A342412j48788L8979L91906n16930l465K01935K5179j16561K32140j32452
14606A314355J95028l60058J98788j2176n284R378j77911j9687O71626l07317
14596A506742J78258k75260J73805k76484J26348J02055K808o0253J67813k40278
14586A405554N42439l51210P0820p7242K27554j78992n9154K42851j93966J49611
14576A778265J70328r1481K85960k86062K43846j25473Q7008R8865j52806j8298
14566A990152K76501j24500j36334L58428k6248r7277L65426j62779K77086K73775
14556B994230m14521K45622L19950N01549J00275N84027J101637K418787L702536
14547A1554092Q190960J9434603K476699A6849987p932154j068992l228421B219692
$$ plain form
14616 1342412 1193624 1232603 1624509 1107579 1104114 1306049 1331228 1214667 1446807 1314355
14606 1314355 1509383 1149325 1348113 1335937 1330653 1340031 1162120 1142433 1814059 1506742
14596 1506742 1685000 1409740 1583545 1307061 1433409 1535464 1538272 1478019 1645832 1405554
14586 1405554 1947993 1596783 1667603 1590361 1817915 1638923 1579769 1822620 1628654 1778265
14576 1778265 1948593 1857112 2143072 1857010 2100856 1975383 2062391 2161256 2008450 1990152
14566 1990152 2266653 2142153 2005819 2364247 2337999 2240722 2606148 2443369 2720455 2994230
14556 2994230 2579709 2825331 3145281 3646830 3747105 4331132 5432769 7851556 11554092
14547 11554092 19745052 39179655 41656354 16849987 8917833 7848841 4620420 2219692
14538A908250l08908q5338M31915m18937K25194j67161J53592J15315J60488j71935
14528A842475j0229K22131j70554N53324m76636J57688l5939J09551j1481p6136
14518B104194O5997J29509m8674M48340j49258j91158K91942m05233P5206P5106
14508B395971q6799J01731O30863k48796j26736k8048K26001n54618O46348q7405
14498B868512R5730j47937J96690k9737M85211m89384J35701J635m18917L93644
14488C091148O5825J08736j7089Q0164o4385L21880k14230m9601N4244K23076
14478C599768j55992N322M41040l33395J72382l33370O25349k14247k3884J29093
14468C912066k1219J06443j87930N18321j91107j64007N41656k22790r3069L76461
$$ plain form
14538 1908250 1599342 1514004 1945919 1526982 1752176 1585015 1738607 1853922 2014410 1842475
14528 1842475 1832246 2054377 1883823 2437147 1960511 2118199 2082260 2191811 2180330 2104194
14518 2104194 2170191 2299700 2251026 2699366 2550108 2358950 2650892 2245659 2320865 2395971
14508 2395971 2309172 2410903 3041766 2792970 2666234 2638186 2864187 2309569 2955917 2868512
14498 2868512 2964242 2816305 3012995 2983258 3468469 2979085 3114786 3116421 2697504 3091148
14488 3091148 3156973 3265709 3248620 3328784 3264399 3586279 3372049 3322448 3376692 3599768
14478 3599768 3443776 3449098 3890138 3556743 3729125 3395755 4021104 3806857 3782973 3912066
14468 3912066 3890847 3997290 3809360 4327681 4136574 3972567 4514223 4291433 4198364 4574825
14458D574825n3021K8399q4482J10900J66561l22454N61205r9487L48115j53270
14448E077291r250K76442o57798L78401R5517P2577P8991Q5212L01608j09249
14438E589742J79217P8434k05736L66103K7768k19489M68999r6187L72519J63422
14428F724792k55251m2262L81839K232K42863P2595J37162j02751J92269L72590
14418G726078l4671J16964O2521K63566N9390k34790M39617P6308J83981L70269
14408I029233k9983J65389k5542M15317k86143l59307P16668N732J46119j9803
14398I757680O31907m1107j97125L70244P8496J63205O69110k7591M3723K88938
14388A1737480J66358M53341j1866K01325O3646O68079j8303P3183M30653K32575
$$ plain form
14458 4574825 4521804 4550203 4465721 4576621 4743182 4420728 4981933 4882446 5230561 5077291
14448 5077291 5068041 5344483 4686685 5065086 5160603 5233180 5312171 5397383 5698991 5589742
14438 5589742 5768959 5847393 5641657 6007760 6035528 5816039 6285038 6188851 6561370 6724792
14428 6724792 6469541 6427279 6809118 6811350 7054213 7126808 7263970 7161219 7353488 7726078
14418 7726078 7691407 7808371 7870892 8134458 8193848 7959058 8398675 8474983 8658964 9029233
14408 9029233 8999250 9164639 9139097 9554414 9268271 8908964 9625632 9631364 9777483 9757680
14398 9757680 10389587 10348480 10151355 10521599 10600095 10763300 11432410 11404819 11448542 11737480
14388 11737480 11903838 12357179 12345313 12546638 12610284 13278363 13260060 13333243 13763896 13996471
14378A3996471L5757N53080O510M38866K44975L28076L90436M65337J01019M27423
14368A6987950J97167L11798P85972J96062P3900O88166J38164P21022K28169
14359B0328370K81175K63855O09429N86194N67864R23396L18102K32411J247235
14350B5358031K50898O47726M95792J069396M70485P06597R41838O47567Q06497
14341C1394827R64595Q40930O85429J165359P25306J386535J097135R29977J133388
14332D0323481J412551J115921J212238J570905J601598J408129J652769J789107
14324E2086699J231521K009081J486558K091333K253187K266251K127438K579847
14316F8131915K323277K907151K719620K861434K950423L283712L719162L513646
$$ plain form
14378 13996471 14032228 14585308 14591818 15030684 15275659 15603735 15994171 16459508 16560527 16987950
14368 16987950 17185117 17496915 18282887 18478949 18552849 19241015 19379179 20100201 20328370
14359 20328370 20609545 20873400 21482829 22069023 22636887 23560283 23878385 24110796 25358031
14350 25358031 25608929 26256655 26752447 27821843 28292328 28998925 29940763 30588330 31394827
14341 31394827 32359422 33200352 33885781 35051140 35776446 37162981 38260116 39190093 40323481
14332 40323481 41736032 42851953 44064191 45635096 47236694 48644823 50297592 52086699
14324 52086699 53318220 55327301 56813859 58905192 61158379 63424630 65552068 68131915
14316 68131915 70455192 73362343 76081963 78943397 81893820 85177532 88896694 92410340
14308I2410340L869480M074793M341707M323311N258203M878335N995671M963756
14300A30115596O596756O052426P178496O756638P772356Q124714Q696918Q910701
14292A90204601R757281J0117602J0406441J1085700J1587399J2330889J2621295
14285B68111208J3275714J3575135J3883423J4079081J4425380J4356121J4342212
14278C66048274J3726974J3420622J2486067J1326455R161058M208374J728682
14271D32106506K499891K556351k59823k399208l034721m221472p533552r658796
14263D10055176j1197524j2897852j4096668j4969513j5014480j5124730j5282505
14256C11471904j4757264j4548213j4112693j3642676j1900600j0906849j2150807
$$ plain form
14308 92410340 96279820 100354613 104696320 109019631 114277834 119156169 125151840 130115596
14300 130115596 136712352 142764778 149943274 156699912 164472268 172596982 181293900 190204601
14292 190204601 199961882 210079484 220485925 231571625 243159024 255489913 268111208
14285 268111208 281386922 294962057 308845480 322924561 337349941 351706062 366048274
14278 366048274 379775248 393195870 405681937 417008392 426169450 430377824 432106506
14271 432106506 434606397 437162748 436902925 434503717 431468996 427247524 419713972 410055176
14263 410055176 398857652 385959800 371863132 356893619 341879139 326754409 311471904
14256 311471904 296714640 282166427 268053734 254411058 242510458 231603609 219452802
14249B19452802j1245878j0373293j0057308r403585q584496p802307p817664
14242A54168271p632428p068074o642667n610679n792833n064848n217791m898975
14234A06239976m832129m400179l557785l262041m060126l361632l103283l266461
14226G6396340k740579k944663k400766k665231k466924j931725j729079k225032
14218E7292341k262426j965517j906060j364269j448386j104377j477974j624282
14210D4139050j297193j349074j087357o42362j451556j113528j156686q39057
14202C5202237j157788o05608o16604j119148r85414q17105o84884n25141p76875
14193B7913670n97546p75910p42869n39288o78976o56794k39110m58360j088751
$$ plain form
14249 219452802 208206924 197833631 187776323 178372738 169788242 161985935 154168271
14242 154168271 146535843 139467769 132825102 127214423 121421590 116356742 111138951 106239976
14234 106239976 101407847 97007668 93449883 90187842 86127716 82766084 79662801 76396340
14226 76396340 73655761 70711098 68310332 65645101 63178177 61246452 59517373 57292341
14218 57292341 55029915 53064398 51158338 49794069 48345683 47241306 45763332 44139050
14210 44139050 42841857 41492783 40405426 39763064 38311508 37197980 36041294 35202237
14202 35202237 34044449 33438841 32822237 31703089 30717675 29900570 29215686 28690545 27913670
14193 27913670 27316124 26540214 25797345 25258057 24579081 23922287 23683177 23224817 22136066
14184B2136066j45241n60737n53313o1955o61317k86219k33703m90072m41106
14175A8702403k66954q56978j7686m08723k30297n56750j43599n26513k48546
14166A5446357k37299n17452P8740k00180k92412m18206j30066m24538J248n60920
14156A2745272J81917l44296j01542m74038R5269l82746J6891m87089K1316k46336
14146A1024618l19670J40933J27062p11591j11791m0282l2616j01842o62695K08193
14136I520319j74418j30899j72395K7674j70394p7412l13251j74220K50243o30516
14126G954731l833K56209l46088K26619m55521k03553J04686l21870M5365p2250
14116G184495q5261l72290J28215L0238r2668k84820q748j52351k11996L49620
$$ plain form
14184 22136066 21990825 21430088 20876775 20814820 20153503 19867284 19633581 19143509 18702403
14175 18702403 18435449 17578471 17560785 17152062 16921765 16365015 16221416 15694903 15446357
14166 15446357 15209058 14691606 14770346 14570166 14277754 13859548 13729482 13304944 13306192 12745272
14156 12745272 12927189 12582893 12481351 12007313 12102582 11719836 11736727 11249638 11270954 11024618
14146 11024618 10704948 10845881 10972943 10261352 10149561 10109279 10076663 9974821 9312126 9520319
14136 9520319 9345901 9215002 9042607 9070281 8899887 8822475 8509224 8335004 8585247 7954731
14126 7954731 7950898 8207107 7861019 8087638 7632117 7428564 7533250 7211380 7256745 7184495
14116 7184495 7099234 6726944 6855159 6885397 6792729 6507909 6499161 6346810 6134814 6484434
14106F484434k72055j73113L8764m0883j85187O4818m2216j5324p8211n2610j30515
14095E597902j63070j3943p5091p631j43609J17379k822k39853M7548p8854k81853
14084D756103L60536n7415p3447j34933m08266M25104k27661J29573n50604J80787
14074D399777k3876O1964l10478M92736l44865n6058J30447k54753j17881N7884
14064D034897k42942L88562m41834N2771L4833j09109L06467k04816n92369N86785
14054C813245j55065J02766p4814l34309K05422j01589j98215J79050k22217j00435
14044C113839R6080q3689j802k04940J23647L9715o7526K98534P2505m2713m9611
14033C294039K06229n2599k25126J49075k79383j34780j78501K15524j6713j39773
$$ plain form
14106 6484434 6212379 6039266 6078030 6037147 5851960 5916778 5874562 5859238 5781027 5728417 5597902
14095 5597902 5434832 5420889 5345798 5338167 5194558 5311937 5309115 5069262 5116810 5037956 4756103
14084 4756103 5116639 5059224 4985777 4850844 4442578 4867682 4640021 4769594 4218990 4399777
14074 4399777 4375901 4437865 4127387 4620123 4275258 4219200 4349647 4094894 3977013 4034897
14064 4034897 3791955 4180517 3738683 3791454 3826287 3717178 4023645 3818829 3226460 3813245
14054 3813245 3658180 3760946 3686132 3351823 3557245 3455656 3257441 3436491 3214274 3113839
14044 3113839 3209919 3126230 3124428 2919488 3043135 3082850 3015324 3313858 3386363 3343650 3294039
14033 3294039 3500268 3447669 3222543 3371618 3092235 2957455 2778954 2994478 2977765 2837992
14023B837992m2376l9948j78015k35610L78199j39408k8382j34262Q9649k3497
14013B484342j58801o2093K02896l1716j07644K84625l742l71125J41947l16425
14003B062264L28943l20674K28355k07778k14778L53096N4019K045M8336m54712
13993A879116l7326N28345L4053m5365J356861K668368M930268J4908039K0904756
13984D7127115k0398500j2996765n733466k310850j123890q92591l17285k68218
13976C085550J9495r4587l11789P1142k43587J24906Q9386l56243k31817O5836
13966B218292J53293n8651l06458L04653j37412j45715K73048k8318k41464j86634
13956A844634J62240P7982j14040p0032R3691J58423m01460l273k00970J71220
$$ plain form
14023 2837992 2795616 2755668 2577653 2342043 2720242 2580834 2552452 2418190 2507839 2484342
14013 2484342 2325541 2263448 2466344 2434628 2326984 2611609 2607867 2236742 2378689 2062264
14003 2062264 2391207 2070533 2298888 2091110 1876332 2229428 2283447 2285492 2333828 1879116
13993 1879116 1841790 2370135 2404188 2358823 3715684 6384052 11314320 26222359 47127115
13984 47127115 26728615 13731850 7998384 5687534 4563644 3671053 3353768 3085550
13976 3085550 3105045 3010458 2698669 2769811 2526224 2651130 2740516 2384273 2152456 2218292
13966 2218292 2371585 2312934 2006476 2311129 2173717 2028002 2301050 2272732 2031268 1844634
13956 1844634 2006874 2084856 1970816 1900784 1994475 2152898 1751438 1748165 1547195 1718415
13946A718415l2722R0800J48476j74062R0019k7151N4773n9528l07881J56700
13936A657839j539L40624j05040Q3615k71342j56311P1367j18269J39101J38626
13926A778671j33483l29491Q0507J15205N4370J8583m9027R7626M1685j0665q8549
13915A575432j92402j81029O8156j6902K40207j15708Q7708l17958J45124J12746
13905A405374J49396p8398K05694j65606k91063L48629k14281J12220j45189j35182
13895A191594L53269k16449q0556P4081p7347m3042K42588m67190K18767k60078
13885I35637J58650K68369l48060K64331n7773n9551r8734Q6972J8078J02481
13875A270400l06297J20005j4468J0068l0936L2571j7367K66631k99472R4881
$$ plain form
13946 1718415 1685693 1776493 1924969 1750907 1840926 1813775 1868548 1809020 1501139 1657839
13936 1657839 1656300 1996924 1891884 1975499 1704157 1547846 1619213 1500944 1640045 1778671
13926 1778671 1645188 1315697 1396204 1511409 1565779 1584362 1535335 1632961 1674646 1663981 1575432
13915 1575432 1383030 1202001 1270157 1253255 1493462 1377754 1465462 1147504 1292628 1405374
13905 1405374 1554770 1476372 1682066 1516460 1225397 1574026 1359745 1471965 1326776 1191594
13895 1191594 1544863 1328414 1247858 1321939 1244592 1201550 1444138 976948 1195715 935637
13885 935637 1094287 1362656 1014596 1278927 1221154 1161603 1062869 1149841 1167919 1270400
13875 1270400 964103 1084108 1069640 1079708 1048772 1081343 1063976 1330607 1031135 1126016
13865A126016J1302j49711j29511L49442P9672l63143L38749m03796L4931L35744
13855A229695l43505j42395N52716o1643n283l19246N7769J41998j47650K42671
13845A205127l63537J88247k34758L97847n80126N92404r5768m1660l64354J27560
13835H30982J86968p2496j62356J88767l4151l9899l62037L29922J89613l21649
13825G33664M8687J02629J94894K09260l13486j97935p4355K94377k19025p8182
13815G00528K46836n200M1022J28960k16077L32263m60085J59576k43945n7165
13805F26713Q9042J76465k93524K60521O3566D53497K06646J71828J98489j8356
13795A012104j33528l65823L07434j04555L33365k93128Q7284N6897k85334J43858
$$ plain form
13865 1126016 1137318 987607 858096 1207538 1287210 924067 1262816 859020 893951 1229695
13855 1229695 886190 743795 1296511 1234868 1229585 910339 968108 1110106 962456 1205127
13845 1205127 841590 1029837 795079 1192926 612800 1205204 1109436 1067776 703422 830982
13835 830982 1017950 945454 783098 971865 937714 897815 535778 865700 1055313 733664
13825 733664 782351 884980 1079874 1289134 975648 777713 703358 997735 778710 700528
13815 700528 947364 942164 983186 1112146 896069 1228332 768247 927823 683878 626713
13805 626713 715755 892220 598696 859217 922783 453497 660143 831971 1030460 1012104
13795 1012104 878576 512753 820187 715632 1048997 755869 843153 900050 614716 758574
13785G58574K2087j06192R2618M04871m99711Q1824L1984K85997n3900k14734
13775H03418Q9090J78644l38739j37743J31671L85524m92868M7969o2284K83899
13765H88581l28088J07007j35822K23506l1809k6160k14340L56021l68476L28851
13755G99271A60680L93054O4962N1458J04352M0388j20928j01963J31238M8470
13745G71711n1662M15055n46426j1077n8378K46925k1197k9750A92566O06893
13735G99459j43054k81293N15366C37182J66507N1273p6277L3986K86714J19489
13725I18874J19907m40603j4456n2066K05821m8204j90179J92451P8963r4257
13715F76251q8334O0011J00466p0082J56462k05437P6528k09074N4782J31454
$$ plain form
13785 758574 780661 674469 767087 1171958 672247 754071 786055 1072052 1018152 803418
13775 803418 892508 1071152 732413 594670 726341 1111865 618997 666966 604682 888581
13765 888581 560493 667500 531678 755184 723375 697215 482875 838896 470420 799271
13755 799271 160680 553734 618696 670154 774506 814894 693966 592003 723241 771711
13745 771711 720049 1135104 588678 577601 519223 766148 744951 715201 192566 799459
13735 799459 656405 375112 890478 337182 503689 554962 478685 512671 799385 918874
13725 918874 1038781 598178 583722 531656 737477 689273 499094 691545 770508 676251
13715 676251 587917 647928 748394 678312 834774 629337 705865 496791 551573 683027
13705F83027j6686p6960K6962j60632J87247j67586J4520q860n6705M4054J99946
13694F68327k00305L05862l44199J10045J06028B78381K90540j68847A40933L30558
13684D71491j615N05798m56937j45017J02679j70086L55376j70603m9643J02104
13674E43547B51681M14003l653j98488O6197m8546j30525N07550k50524B67609
13663E40156k56605K19537j23980j08383J90016N9296j02044j73255k5900J8550
13653B37388R2981P8389n8213M23793k68057k1579k1120J72090j52395r2592j7650
13642C73035J03100m1488O2642l8937j78892K57263p6423J65580k83724J21401
13632D63557J09841B24002K07586E941O96447j58419B18867K3798K60106B25035
$$ plain form
13705 683027 666341 589381 616343 455711 642958 475372 489892 481032 424327 468381 668327
13694 668327 468022 773884 429685 539730 645758 278381 568921 400074 140933 471491
13684 471491 469876 975674 518737 373720 476399 306313 661689 491086 441443 543547
13674 543547 251681 665684 662031 463543 529740 481194 350669 858219 607695 267609
13663 540156 283551 503088 379108 270725 460741 520037 417993 244738 218838 237388
13653 237388 330369 408758 350545 774338 506281 484702 463582 635672 483277 390685 373035
13642 373035 476135 434647 497289 458352 279460 536723 460300 625880 342156 463557
13632 463557 573398 224002 431588 5941 702388 543969 218867 242665 502771 225035
13621C85760A78745L09818O0854Q0975B04548L0988J64100J98408j28784p319
13611D61941O1225A31409K11383J31156j27245L0286J53499G3725L79221K62373
13601G15319A98102J72700J24604j35456P0169K61574B84245O0132A39622o1116
13591G8506J53293J98333o1533K23594j68458J69244B96484L2612m6890K62651
13581E44857j62341m264L15622j63206K33683B30468R1455d1466A94921m9729
13571A45192J03216K45507j99759F7916J39819P0836M7056R5871q0713R9932l5882
13560D04835K37436A94656G363J5928o231L44214L6667i341C99840J03322j03723
13549C99439o8641K07780j82508k4492j8825n2761m3388M2192E4278L02184d2997
$$ plain form
13621 385760 178745 488563 549417 630392 204548 235536 399636 598044 469260 461941
13611 461941 523166 131409 342792 473948 346703 376989 530488 73725 452946 715319
13601 715319 198102 370802 495406 359950 430119 691693 284245 344377 139622 78506
13591 78506 231799 430132 368599 592193 423735 592979 296484 329096 282206 544857
13581 544857 382516 378252 693874 530668 764351 230468 321923 -41466 194921 145192
13571 145192 248408 493915 294156 67916 207735 278571 325627 421498 340785 440717 404835
13560 404835 642271 194656 7363 23291 17060 361274 397941 -9341 399840 503162 399439
13549 399439 330798 538578 356070 331578 312753 259992 216604 258796 54278 356462 -42997
13537C31295A46347B6572N53129B86726L651N3881K89264A13286R34J98332J02875
13526D15427n6261A50097J90545k8517J07758j69874Q6338j8359q2915m814J42395
13515C72654q138A04874J29655K71906k02928m9365p5435b70130F2516K06857
13505B69373Q1014o5068q6418J89743j82474q3677K60852j39144O6927A7141K64713
13494B81854H2991M37603r6324A13307M4944K21356q1729A13328K65550A61044
13483B39984J88409e5513C91521A0539J38371J54055a8026C76946j02969q6764
13473A87213m3672P7927J38878j15933J7078K02634b6728C9293K09671J39974
13463C88938J976j60034m7844h687B75924N8724o2687P9721A05549L17458E5895
$$ plain form
13537 331295 146347 26572 579701 286726 290377 344258 633522 113286 114220 312552 415427
13526 415427 359166 150097 340642 312125 419883 250009 336347 317988 235073 230259 372654
13515 372654 364516 104874 234529 506435 303507 254142 178707 -270130 62516 269373
13505 269373 350387 285319 198901 388644 206170 122493 383345 244201 311128 17141 281854
13494 281854 82991 520594 424270 113307 158251 379607 297878 113328 378878 161044
13483 239984 428393 -55513 391521 10539 148910 302965 -18026 376946 273977 187213
13473 187213 143541 221468 360346 244413 261491 464125 -26728 39293 248964 388938
13463 388938 390914 230880 183036 -8687 275924 334648 271961 351682 105549 423007 55895
13451C4223J55203k5630K6241L66113p5803P5231k52635j10770K39742A42131
13440B28430N6693Q994d447B76621P7512A69911R4148j14892Q9983K8098I0748
13428B38632n283J27638F5347K33717A06791J38697H4189J21620R653n050M0139
13417B50551J27224D4409J27842n943E6854L05821K42861a08585a4889H9032O9572
13406A58604L9438E3934J53610R878n9045B0579R6864J93903j41097h5002C45634
13394C50678R2364A48982l8355K60556p8444n8076J28204G5321O6616J72617j33582
13383A80972P2636J25541K27945B99190R4186l3277m5582r0997J70084j27415
13373B66189j03752R8550A29603L2109P6330o2657R7452J23162b02019b9660B01281
$$ plain form
13451 34223 189426 163796 190037 556150 480347 555578 302943 192173 431915 142131
13440 228430 285123 294117 -4447 276621 354133 169911 264059 149167 239150 267248 90748
13428 238632 233349 360987 65347 299064 106791 245488 84189 205809 215462 210412 250551
13417 250551 377775 44409 172251 166308 56854 362675 605536 -108585 -14889 89032 158604
13406 158604 198042 53934 207544 217422 158377 20579 117443 311346 170249 -85002 345634
13394 350678 443042 148982 110627 371183 292739 234663 362867 75321 141937 314554 180972
13383 180972 253608 379149 607094 299190 393376 360099 314517 223520 393604 266189
13373 266189 162437 260987 129603 161712 238042 175385 272837 395999 -202019 -29660 201281
13361B68143r943J32972J37713j11757m0314H3444J48030l4664J02242j13344
13351A85708m4938K5441K30812j93264J12881Q6122I7739C699N33532B45360G1926
13339A88254K12058R8985j55401l0971J76849p5514j58106M62504B22085K12358
13329D34443J24898A88702M4448L5637o7772N9584D1597Q4623K08137c8139G5326
13317D54437A98052I6380J65377D8426J16044M3146a9447A15628L54661A50792
13306C92305j68273a007B42039j2068r9715n6532J05731K82553B29162m2530D0219
13294B56543E2290K81888g6608n747G1518a23573G9301K73204H2382K68380A39394
13282A24746Q5496J3077j7018i7956C81104G9985Q8654G3907J0448B7270M6481
$$ plain form
13361 268143 258200 391172 528885 417128 376814 83444 231474 196810 299052 185708
13351 185708 140770 166211 397023 203759 316640 402762 97739 3699 537231 245360 71926
13339 188254 400312 499297 343896 312925 489774 414260 256154 718658 222085 434443
13329 434443 559341 188702 233150 268787 201015 260599 41597 126220 334357 -38139 75326
13317 454437 198052 96380 261757 48426 164470 207616 -19447 115628 470289 150792
13306 392305 224032 -1007 242039 229971 130256 73724 179455 462008 229162 186632 40219
13294 256543 52290 334178 -76608 -82355 71518 -123573 79301 352505 82382 350762 139394
13282 124746 210242 223319 206301 -97956 381104 79985 168639 73907 84355 27270 73751
13271G3751d24345A59583m3264J36988A9332K90312M4209r7354q2221F7111J6374
13260H3485P0103c336F2167L4597R2887o1146E5757h1952l9956q5451A45515N4885
13248B00400a2812A8562O8009b00044B69706L0492c1314B21518r502d2718o913
13237d9631b2515E9614g4279A97124O9417O4850A6843c4165D04578e2230C45437
13225d7715H2399K7709i4614C28252H9046N8494f4501B59496O6658a54462a3681
13213d8483A75526D8673K00965J22785A37356a14669D74331k10083o0788C5138
13202A97792J22221J59056f8757A78710F1106c7008G484J01789N0726i5436A32619
13190B08663j9224a34802E8383M00890I6970O3072j0354D1429b36974G2975M59129
$$ plain form
13271 73751 -424345 159583 116319 253307 19332 309644 353853 256499 174278 67111 83485
13260 83485 153588 -3336 62167 96764 189651 128505 55757 -81952 -121908 -207359 145515 200400
13248 200400 -12812 18562 86571 -200044 269706 300198 -31314 221518 212016 -42718 -49631
13237 -49631 -22515 59614 -74279 197124 266541 331391 16843 -34165 404578 -52230 345437
13225 -47715 82399 110108 -94614 328252 89046 147540 -64501 259496 326154 -154462 -13681
13213 -48483 175526 48673 249638 372423 137356 -114669 474331 264248 203460 35138
13202 197792 320013 479069 -68757 178710 61106 -37008 7484 109273 159999 -95436 132619
13190 208663 189439 -134802 58383 459273 96970 160042 149688 41429 -236974 72975 532104
13179E32104f0435G4208J58502I3069K85335e9551l3799E7294A7057K28805j3899
13168B31963d2729A38404r745j2541a25774A77339J8620q34J41604D5015g047
13156C97564A44312J813a57725C03444F5152b21097f5803B53280h7118A9936K44956
13145B64892p9762b1981A91082e210C2053J85654p4374h6101q3124B28072G7127
13133G8975K2575o149j2352J74538k2117E8787b19852a8546m4638A24924M1865
13122A66789a05437F3604J86078p5205d2108G6231k8935c835A15904M1238a32807
13110B56867L7308k648b29617A86743G3474J67181E0985a44704f5215R025I4938
13098E9559J1960J6308J01552b6778A88651m8060n3183D2740K11347p0991a18529
$$ plain form
13179 532104 -60435 74208 232710 93069 378404 -59551 -93350 57294 17057 245862 231963
13168 231963 -42729 138404 128659 116118 -125774 177339 195959 195125 336729 45015 -7047
13156 397564 144312 146125 -157725 303444 65152 -221097 -65803 253280 -87118 19936 264892
13145 264892 185130 -21981 191082 -5210 32053 217707 143333 -86101 -169225 228072 77127
13133 78975 101550 95401 83049 257587 235470 58787 -219852 -18546 -63184 124924 166789
13122 166789 -105437 63604 249682 174477 -42108 76231 47296 -3835 115904 157142 -132807
13110 256867 294175 291527 -229617 186743 73474 240655 50985 -144704 -65215 -56190 94938
13098 59559 71519 87827 189379 -26778 188651 140591 87408 42740 254087 183096 -118529
13086A40884F5445c05876B90503A12550J08013b1484C94321A06292M1546M4275
13076A92113E9660A0007K85681A34907b2057B07094C1559K21342D0440K5149J60022
13065B25611i1090A00075M5588c907k5373A03660a02038n6262A1831L5202J01454
13054A48487E894J44232J8075J30219q0879J6025A06026a35181B39519E6938b0927
13042B37137E1270L35130A27335a65248a8302l2183B00834N7991n3645G6458e6757
13030B70365D6240k1604J8875K15933a05283C97390A12135J94973A40067K53505
13020C93572F1140K18408F9440J05737h1961J8234A5544M24996A75857a6531A13258
13008B50458H3821j8635M9756J03356m0056o0475O0752C8234L25047A05707J60900
$$ plain form
13086 140884 65445 -305876 290503 112550 220563 -21484 394321 106292 147838 192113
13076 192113 59660 10007 295688 134907 -22057 207094 31559 252901 40440 65589 225611
13065 225611 -91090 100075 145663 -3907 -29280 103660 -102038 -158300 11831 47033 148487
13054 148487 5894 150126 168201 298420 217541 233566 106026 -135181 239519 56938 -20927
13042 237137 51270 386400 127335 -165248 -18302 -50485 200834 258825 205180 76458 -56757
13030 270365 46240 24636 43511 259444 -105283 397390 112135 307108 140067 393572
13020 393572 61140 279548 69440 175177 -81961 -63727 15544 440540 175857 -16531 113258
13008 250458 83821 65186 114942 218298 178242 117767 178519 38234 363281 105707 266607
12997B66607J02003g4074H9761a59350H7256a12336B01662f1267R669G9799a12123
12985B42994b23066l1686b1718r5338A61314J71008l2762g077A98999m8867P1166
12974B21298Q9223E8294a10032p7068A38424f5672q6365B05969i7755A90750k3779
12963A66971L6880l6008h7096C27114a71137C5945j6670L3800b09254B52107G151
12951h1541F7506j6703M324E156N1585A1153a70738A86822f24p000o365C03503
12938a97122e3079A3045a10573B08983b96296A6100b31716D0230a6991A03649
12927A58047O862A231e8890D6590J7802K3413O0705J19974E7135d0470j42236
12916a82706A03151b8344C53603j9418K0769E772a22824A98307K12490f6996K5869
$$ plain form
12997 266607 368610 -74074 89761 -159350 87256 -112336 201662 -61267 -51598 79799 -112123
12985 242994 -223066 -254752 -21718 -117056 161314 332322 299560 -7077 198999 150132 221298
12974 221298 310521 58294 -110032 -187100 138424 -65672 -152037 205969 -97755 190750 166971
12963 166971 203851 167843 -87096 327114 -171137 35945 19275 53075 -209254 252107 7151
12951 -81541 67506 50803 55127 5156 56741 11153 -170738 186822 -624 -7624 -13989 303503
12938 -197122 -53079 13045 -110573 208983 -296296 16100 -231716 40230 -16991 103649
12927 158047 164909 1231 -58890 46590 64392 87805 148510 268484 57135 -40470 -182706
12916 -182706 103151 -28344 353603 334185 354954 5772 -122824 198307 410797 -66996 -41127
12905d1127I4549e8391J5772M570j07761A40402B673M79429G9398L351b03306
12893A59816e0043m4907M6086A12614a05737n3221A96010J01542H2425C9611e440
12881a78718d7837B47903p9126J25896a53099N4462A56698B3510J21389i2602
12870A36300a10226B3168O8386J50573b9680j43689A31970n1539J97764d3566
12859b59192K7515C53756e4840j06412e9966A66607c38654g0146H0766a79716
12848B4071i747D6089h7179A46720l6479b02868I5681l3002j4200M6126a68702
12836B8152K2299J5281J10537a58878A88473G6313L4320L01K83835a65608g2206
12824B61052b24959G0157b38817B36258b60168l9259a7746A66900E5931J93385
$$ plain form
12905 -41127 94549 -58391 -42619 -38049 -145810 140402 2673 482102 79398 82749 -203306
12893 159816 -50043 -94950 -48864 112614 -105737 -158958 196010 297552 82425 39611 -5440
12881 -178718 -47837 247903 168777 294673 -153099 -98637 156698 23510 144899 -92602
12870 136300 -110226 23168 91554 242127 -29680 -173369 131970 80431 278195 -43566
12859 -259192 -231677 353756 -54840 -161252 -59966 166607 -338654 -70146 80766 -179716
12848 24071 -9747 46089 -87179 146720 110241 -202868 95681 62679 48479 94605 -168702
12836 28152 50451 65732 176269 -158878 188473 76313 110633 110934 394769 -165608 -72206
12824 261052 -224959 70157 -238817 236258 -260168 -299427 -17746 166900 55931 249316
12814B49316A5856K40913a14630C954b05318c9773A9144J335b17087R8111b1329
12802g1744H4653J86218i4726A01439a67412F2078a39480B15964H6048a55675
12791a89772f6115m6050m093B01850i7795D8887a2896p4086C81559a61428A31961
12779b39716e451B76127a48659a6234k78106A33011R1094l7869b14793h3579C41878
12767a4179q082j83656p7054A05896b50321F1025L31379a37759B24094a38538
12756B19371m5705g0484k4337D896J98078B222g2505D6345p268K5045j3359L08327
12744C59090a9989g993E9884J34255D4084L7209M6544C3706a60785A90797a92461
12732A02516f6812E2665L88230a8789n8680j49703A85575d3865G8833b08397j4349
$$ plain form
12814 249316 15856 256769 -114630 3954 -205318 -39773 19144 20479 -217087 -118976 -21329
12802 -71744 84653 270871 -94726 101439 -167412 62078 -139480 215964 86048 -155675
12791 -189772 -66115 -112165 -116258 201850 -97795 48887 -12896 -86982 381559 -161428 131961
12779 -239716 -5451 276127 -148659 -16234 -294340 133011 224105 186236 -214793 -83579 341878
12767 -14179 -22261 -205917 -282971 105896 -250321 61025 392404 -137759 224094 -138538
12756 219371 173666 -70484 -94821 4896 202974 2222 -72505 46345 39077 64122 50763 359090
12744 359090 -19989 -7993 59884 194139 44084 81293 127837 33706 -160785 190797 -192461
12732 102516 -66812 52665 440895 -18789 -77469 -227172 185575 -43865 78833 -208397 -222746
12721b22746A51115p0363a18592k34648J0060B55749J2112b5375G7254j0411K71269
12710C38112l6335O8372A43277J28660r342f3694A25619a30918p4370A03204b79300
12698g1170q3985E9134k9491M60279a90501A7006g5602j4734A07697O5444A742
12686a18042n5098A43804l4177M1528a45309C9936J4543R5411j839j7101a02386
12674F5180f4166A91876a08022A65632F566J45231E5409J06760G7596R2414F2710
12662A33298K95871i0299D0375L7349L36840a26161A01232f0826k46104a09791
12651A7457J7708R3962b21121F0324Q2359b36769B78363a6323A10333J40681j19633
12640A31381a02418B11106a5321A77086C4560a73293e7458C9371M8421f620A28080
$$ plain form
12721 -222746 151115 80752 -118592 -353240 -343180 255749 267861 -25375 77254 66843 338112
12710 338112 301777 370149 143277 271937 262595 -63694 125619 -130918 -205288 103204 -279300
12698 -71170 -155155 59134 29643 489922 -190501 17006 -75602 -90336 107697 173141 1742
12686 -118042 -173140 143804 109627 151155 -145309 39936 54479 149890 148051 130950 -102386
12674 65180 -64166 191876 -108022 165632 6566 151797 55409 162169 77596 170010 62710
12662 133298 429169 -90299 40375 77724 414564 -126161 101232 -60826 -306930 -109791
12651 17457 35165 129127 -221121 60324 142683 -236769 278363 -16323 110333 251014 131381
12640 131381 -102418 211106 -15321 177086 34560 -173293 -57458 39371 87792 -6620 128080
12628B37401l3227i9658A07955a25319B61051G8866c0665C97705A31838g8027
12617a82443C00688o9322J2835d9624C7304h9596H2231a86192H5905a86962A11805
12605B04128a23143c4462C6475J70978a26771A24197a777m333k0576D6152B1914
12593i1308r9410j1005R9842C52894j23722A0465M3449e3977K1520j58924d5618
12581A57236l3292M2974a59335L0903D34327A55863E1592J16136R297a75728D5904
12569a7409B62631d09901D1580d5124j93893j27217B41405p1979f482k27563J7985
12558b16060B1532h5438j27817B10669g3838F8190G949b03966R7169H6390e2704
12546A72962J80662P8008M2933q1863j77269J83283q8623J49005A08180Q043a72184
$$ plain form
12628 237401 204174 -99658 107955 -125319 261051 78866 -30665 397705 131838 -78027
12617 -182443 300688 231366 244201 -49624 37304 -89596 82231 -186192 85905 -186962 111805
12605 204128 -123143 -34462 36475 207453 -126771 124197 -1777 -6110 -26686 46152 21914
12593 -91308 -190718 -201723 -101881 352894 229172 10465 53914 -53977 -32457 -191381 -45618
12581 157236 123944 166918 -159335 -128432 434327 155863 51592 167728 177025 -175728 45904
12569 -17409 262631 -409901 41580 -45124 -239017 -366234 241405 169426 -6482 -234045 -216060
12558 -216060 21532 -85438 -213255 210669 -73838 68190 7949 -203966 -106797 86390 -52704
12546 172962 353624 431632 474565 392702 215433 398716 310093 459098 108180 116223 -172184
12534d92556a77931a1332j73008Q6651A30225l025D0013R2747a04182B97388b23121
12522a06250A39884m0836J74243P993A34143C8244K10755L38289k60019J58997
12512D86266M5572J67245j99250k40122k9248b5061r6020e8059A29574b25746
12501A66592b08062M5261H3063a75547C27729a92811C5622g1029C11211H3832
12490A38313a13128B17820c8454C8472J07184a15914D02284J00471J6618j82459
12480C36914J01638h4638j76940g8502r5610O4362B3661J7697b17070H2644O81
12469H3325N1032b0211B3362c25374A3041J62753b99332a2815j1060B62915p4142
12458A88773a39317I0951N194k0565J93867c08050a26200E1918a57811F3746K9762
$$ plain form
12534 -492556 -177931 -11332 -184340 -97689 130225 127200 40013 132760 -104182 297388 -223121
12522 -106250 139884 99048 273291 281284 134143 38244 248999 587288 327269 486266
12512 486266 531838 699083 499833 259711 230463 -25061 -121081 -58059 129574 -225746
12501 166592 -208062 -162801 83063 -175547 327729 -192811 35622 -71029 311211 83832
12490 138313 -113128 217820 -38454 38472 145656 -115914 402284 502755 519373 336914
12480 336914 438552 -84638 -261578 -78502 -174112 -109750 23661 41358 -217070 82644 83325
12469 83325 134357 -20211 23362 -325374 13041 175794 -299332 -12815 -23875 262915 188773
12458 188773 -139317 90951 96145 75580 269447 -308050 -126200 51918 -157811 63746 93508
12447I3508c39829a37449j60912J5895j26048b3082j62219B1795o846J99905a27812
12435b32663J05322e8412B06568r4443g4482j85572I704e4339B30855a81324k27137
12424d08461a75307n3134r4966B71073b36701A83950k3748b43687A02136M7821
12414A49957M5133b26062J4466e1055A79184a57412A60402h5081E5916r697L02666
12403C48885I612P2711a14010A8250a63573K4167C0110b83674B19260i4288L1877
12392f2411k79574b6583l18968J9879B07271L4877M6787A07082m7430a54217D00382
12380g8248A74513E6098e9386A78981C5290J29543N2766K14190A87945E0627i8954
12368A01980a30371I3860L7947b04723B47M2970a6375A21085N018c07842I0146
$$ plain form
12447 93508 -339829 -137449 -298361 -282466 -408514 -23082 -185301 21795 14949 214854 -127812
12435 -232663 -127341 -58412 206568 112125 -74482 -260054 9704 -54339 230855 -181324 -408461
12424 -408461 -175307 -228441 -323407 271073 -236701 183950 160202 -243687 102136 149957
12414 149957 195090 -226062 -211596 -51055 179184 -157412 160402 -85081 55916 46219 348885
12403 348885 9612 82323 -114010 18250 -163573 -139406 30110 -283674 219260 -94288 -62411
12392 -62411 -341985 -26583 -345551 -325672 207271 242148 288935 107082 59652 -154217 400382
12380 -78248 174513 56098 -59386 178981 35290 164833 217599 431789 187945 50627 -98954
12368 101980 -130371 93860 131807 -204723 247 43217 -16375 121085 126103 -307842 90146
12356c3480A04259e37932f2863A27001K6302b22298A96663D4395M07303C3545
12345I3877H903a14041B74573I1750c9904k25K023B0723P1812a61141P9629A88913
12332D3779L6595J40480a4337C43094G6923a77019f3206B2746J29139R1584q9756
12321A53713m7730f0015j24361A22167L15205c7943C1830N0316M39655i4475B55115
12309B83720A15834P1603a6041A02523J51205Q6048F5925j6757J94186j7899e00188
12297G7622n812a52120A29027h2967a7145q0044a1156A60245a20029F6506H40
12285d09309I1985H28L69043a57811k82111A4962g4869A83659e5859j0047E7890
12273A55086n5602b41987f2858r0710A98858b26316E5768J71327J96602A06299
$$ plain form
12356 -33480 104259 -537932 -62863 127001 153303 -222298 196663 44395 451698 33545
12345 93877 8903 -114041 274573 91750 -39904 -40129 -38106 20723 92535 -161141 -81512 188913
12332 43779 80374 220854 -14337 343094 76923 -177019 -63206 22746 151885 243469 153713
12321 153713 105983 -60015 -184376 122167 437372 -37943 31830 82146 521801 -94475 255115
12309 283720 115834 187437 -16041 102523 253728 339776 65925 49168 243354 225455 -500188
12297 77622 71810 -152120 129027 -82967 -17145 -97189 -11156 160245 -120029 66506 840
12285 -409309 91985 828 369871 -157811 -439922 14962 -74869 183659 -55859 -65906 57890
12273 155086 99484 -241987 -62858 -153568 198858 -226316 55768 227095 423697 106299
12262B40169i4426j2827G2056a06925H1723J98497d512k12761a6137E6666J84218
12251B40884j18228h0338G5942J87286p2522J01164b26178Q2503f1800B86886
12240C35103A20720b6441q8416A09731p287b63714C9824A5924a87750D7826h5011
12228A49730l6171c13152A2964L97656o113a33329A99881K8122n6173P0200n3289
12217A88741M5376J71194j86321L52403k01569a80710C67991K08411a2414B63603
12206D06236a25586C44990j08435g937F1677h8603j6060B91389K25869k51805
12196B65453A0309K14620j10907l6130J79209K1263L1324J44973K11040j45702
12186E19999J23313j98689j88665j23820k6061J16075O1368j206F8323k4931a47919
$$ plain form
12262 240169 -94426 -107253 72056 -106925 81723 280220 -4512 -217273 -16137 56666 240884
12251 240884 122656 -80338 75942 263228 190706 291870 -226178 -143675 -61800 286886
12240 335103 120720 -26441 -114857 109731 102444 -263714 39824 15924 -187750 47826 -85011
12228 149730 113559 -313152 12964 410620 404507 -133329 199881 228003 171830 242030 188741
12217 188741 234117 405311 218990 571393 369824 -180710 367991 576402 -12414 263603
12206 406236 -125586 344990 236555 -7937 61677 -88603 -104663 291389 517258 265453
12196 265453 10309 224929 114022 77892 257101 278364 309688 454661 665701 519999
12186 519999 643312 444623 255958 132138 106077 222152 283520 282314 68323 43392 -147919
12174a6683C88266H646N4177L03196N6540A99055O7825C9850a57949B00794m8897
12163A51897M38558B75802k9827H8649L30352j7149A22180J435J09727a3981B44631
12151d3574B68432G9542k3677a46341H9793M2874D1675J8416J72247e9959j59226
12140b19185A57271C05L44582j19913e9025C99890G9097J06825m1137J75304b3776
12128B61429n31D6611b843G7793d1628H634J53397K08119o0854k9697C5375J89470
12116B24845h2392B50558n3117J17542A02506J75553E2103M679d7626B2819K51310
12105B74129A27055J31506H4962i3580A37319P7849b08961E3278K1598O9777b24839
12093C00368B1174a27926j97632D4594B0500h1660b4356I6735a51868A87996a38504
$$ plain form
12174 -16683 388266 8646 62823 366019 422559 199055 266880 39850 -157949 200794 151897
12163 151897 590455 275802 245975 88649 419001 401852 122180 123615 233342 -13981 244631
12151 -43574 268432 79542 55865 -146341 89793 132667 41675 60091 232338 -59959 -219185
12140 -219185 157271 305 344887 224974 -59025 399890 79097 185922 144785 320089 -23776
12128 261429 260898 46611 -2843 77793 -41628 8634 162031 370150 309296 279599 35375 224845
12116 224845 -82392 250558 197441 314983 102506 278059 52103 56782 -47626 22819 274129
12105 274129 127055 258561 84962 -93580 137319 215168 -208961 53278 74876 144653 -224839
12093 300368 21174 -127926 -325558 44594 20500 -81660 -24356 96735 -151868 187996 -138504
12081A16193c08198f6238j34237i8636H0836C6391J12709a61780g0300I5491i5888
12069A05497L2292c43563a46884B9314c06054D7696i9220c4044l16707C88813
12058A1197J31598b0178D64046j83266E9036a20240A71258j6521b05450A14881
12047a81570A24974k9785Q8919b38839A95033I0380b12503h493A87927a76326
12036h1867c9425E7050a17899B48383h8603B233b417F5417e5674p8107r5143A34786
12023B8726d3986k69986d5209B12262c439p5270p9524A90953J65222a14761J3657
12012a01104M7537j26897d709A99044I039d072k03657A4406a10504C6052a23388
12000b05546b3157j33482A40190b22082b9808k54102C47456h6540A24820b11389
$$ plain form
12081 116193 -308198 -66238 -200475 -98636 80836 36391 149100 -161780 -70300 95491 -95888
12069 105497 137789 -343563 -146884 29314 -306054 47696 -99220 -34044 -350751 388813
12058 11197 142795 -20178 464046 280780 59036 -120240 171258 154737 -205450 114881
12047 -181570 124974 95189 184108 -238839 195033 90380 -212503 -8493 187927 -176326
12036 -81867 -39425 57050 -117899 248383 -88603 2233 -2417 65417 -55674 -133781 -228924 134786
12023 28726 -43986 -313972 -45209 212262 -3439 -78709 -158233 190953 356175 -114761 -101104
12012 -101104 -53567 -180464 -4709 199044 9039 -4072 -207729 14406 -110504 36052 -123388
12000 -205546 -23157 -156639 140190 -222082 -29808 -283910 347456 -86540 124820 -211389
11989f0793B0320J97476j08433g805C1984b6179m3580q5746B97681i4271B45800
11977b03237B39768d1596k46626A37646h0163C355J39584b56992A44705m8534
11967I6171M9291a17847d1874D6631L84584A15538m0766d6458A24453J4009i7043
11955b6951p1175A11191B6365J77382i4252J2558k54933c2383B8270b8700A15650
11943B5349J50899C9496d4188m30063A91243d327E3599J37829f1359j10352A04558
11931a53852A1056d1222m7760B00192F1559a67004N0107A33526c02171E0002a19650
11919c866E0494d08159J55824A77491l8453a00535p7725a4526k31917B09174f833
11907a09204K8468q3472e3591q0116E0522O9456E3295b36905a7851j05165c9766
$$ plain form
11989 -60793 20320 217796 109363 -7805 31984 -26179 -69759 -155505 297681 -94271 245800
11977 -203237 239768 -41596 -288222 137646 -80163 3355 142939 -256992 144705 96171
11967 96171 145462 -117847 -41874 46631 431215 115538 74772 -46458 124453 138462 -97043
11955 -26951 -98126 111191 26365 203747 -94252 -81694 -336627 -32383 28270 -28700 115650
11943 25349 176248 39496 -44188 -474251 191243 -4327 53599 191428 -61359 -171711 104558
11931 -153852 11056 -41222 -88982 200192 61559 -167004 -116897 133526 -302171 50002 -119650
11919 -3866 50494 -408159 -252335 177491 139038 -100535 -178260 -14526 -246443 209174 -6833
11907 -109204 -80736 -164208 -53591 -133707 50522 119978 53295 -236905 -17851 -123016 -39766
11895I1354L06046b13282B2916O7559f7943J5080j29452Q6899B0305K41459E1543
11883h0515A99399a69001M3320G6138b31410a11942n1988A09830C949a17983A54528
11871a23503B14996h3820b6932D04466a68872O1814I2830b77729a28096G4286
11860B5104f2392A93309m1932h1148c8208k98703B63070c16327A3860h1537q1405
11849a62942p0064a1925p762C52802a06374k4505K8866M7635j37016Q2785E8473
11837b08596Q0151A03611l0623h7162a1232j90661O4375b9468J363D4778a74080
11825a56623n8989j24559a53048n494M0655j81265h4099A849a65118H2112a43326
11813a22050c7794k64126Q1087Q1040j72896e3784k50400M9976D1786a7660j08270
$$ plain form
11895 91354 397400 -213282 22916 90475 -67943 -52863 -182315 -95416 20305 261764 51543
11883 -80515 199399 -169001 -125681 76138 -231410 -111942 -163930 109830 3949 -117983 154528
11871 -123503 214996 -83820 -26932 404466 -168872 -107058 92830 -277729 -128096 74286
11860 25104 -62392 193309 151377 -81148 -38208 -336911 263070 -316327 13860 -81537 -162942
11849 -162942 -233006 -11925 -19687 352802 -106374 -130879 -102013 -54378 -191394 -108609 58473
11837 -208596 -128445 103611 72988 -87162 -11232 -201893 -137518 -29468 -28105 44778 -174080
11825 -156623 -215612 -340171 -153048 -158542 -117887 -299152 -84099 1849 -165118 82112 -143326
11813 -122050 -37794 -301920 -220833 -139793 -312689 -53784 -304184 -254208 41786 -17660 -125930
11802a25930A60657C2591J69412i3609k63928D62183H6254h238I4249c66331g8756
11790a13594d0533B9173d49364a17376A94593b64541c4911B9483E107J37879b0208
11778c59039G5600K2234e583l8119D13775h7204F0730L1140Q9174b70215J10528
11767a59687k9360A09185k4072F219e9322A83006b53004A04637a48872j31526
11757b80398B37717a00859F2757B9318a07629E5891c05041E246b78369I1892a77090
11745D3183J20760J193m8111M6201f4515D6291a13979A90220k9230E2018c83023
11733B16360j7358M9975b97410h6133A33173g5881E9424J41192b47376B06434
11722A26519i0697r0030C66458H5568f0164j11043A97285f8778j86308Q9478A39228
$$ plain form
11802 -125930 160657 32591 202003 -93609 -357537 462183 86254 -8238 94249 -366331 -78756
11790 -113594 -40533 29173 -449364 -117376 194593 -264541 -34911 29483 5107 142986 -20208
11778 -359039 75600 97834 -5583 -43702 413775 -87204 60730 91870 181044 -270215 -159687
11767 -159687 -189047 109185 85113 6219 -59322 183006 -253004 104637 -148872 -280398
11757 -280398 237717 -100859 62757 29318 -107629 55891 -305041 5246 -278369 91892 -177090
11745 43183 163943 165136 117025 163226 -64515 46291 -113979 190220 160990 52018 -383023
11733 216360 199002 248977 -297410 -86133 133173 -75881 59424 200616 -247376 206434
11722 126519 -90697 -180727 366458 85568 -60164 -171207 197285 -68778 -255086 -165608 139228
11710a84203b4974C40791j4986j43684E0635c4136j0940A26327a64812d7447A31266
11698I0492c84360J67853B48188g7330A16069b06778g1109A74666b41540d8847
11687b27875N1966B27372c10209r5605B24868F8297c01985i2485c2695D9156K38284
11676B87440a66579C46226a40764O9902A54977j8913d1869j18069m1050c4129
11665b67001A34386J14820E1371K71819b0295B49012L6520a34197A27120l3648
11655I3472L4688P8622n3839j4568b9071k81361A21364K98206c43957E8890c05521
11643F1765b12963A33072e1204G1841c1501r2616d9184K0538C36944c85066A10498
11631A95506P7040b6523j68235o4870a19869d0091b273j79882A46902l5692Q4619
$$ plain form
11710 -184203 -24974 340791 325805 182121 50635 -34136 -45076 126327 -164812 -47447 131266
11698 90492 -384360 -216507 248188 -77330 116069 -206778 -71109 174666 -241540 -48847
11687 -227875 -175909 227372 -310209 -405814 224868 68297 -301985 -92485 -32695 49156 287440
11676 287440 -166579 346226 -140764 -70862 154977 136064 -41869 -159938 -200988 -34129
11665 -267001 134386 249206 51371 323190 -20295 249012 285532 -134197 127120 93472
11655 93472 128160 206782 152943 138375 -29071 -310432 121364 419570 -343957 58890 -305521
11643 61765 -212963 133072 -51204 71841 -31501 -124117 -49184 -28646 336944 -385066 110498
11631 195506 272546 -26523 -194758 -259628 -119869 -40091 -2273 -182155 146902 111210 195829
11620A95829D6118b66390J05452B50165b28162f9600j39362A77428d1638B14088
11609B39820h6121a758E5881b63034F6148a48173O1925H6615N1296F4943J14793
11598A79736O9217P3983A14565b10205i9967j13693c1757E6394h4873B73394j15016
11587A58378f7281A90387I5103o422m1550O0779J21026H9864J60259E4619L7987
11576I2606h1321A11686h6127G6949J04397a11396C7371b6570A36141J94840b01601
11564A74869b22789C66654G0768A9663O3046c6897B4117g3451B7593L5485Q4800
11553A47878p2665R7968D359J47977b56855B53571p0333a47153j03436o0119g2077
11541a95149J3214I0597H815K47295B9451d6344A56828J66007b06381i919A0678
$$ plain form
11620 195829 46118 -266390 -160938 250165 -228162 -69600 -208962 177428 -41638 214088
11609 239820 -86121 -1758 55881 -263034 66148 -148173 -86248 86615 137911 64943 179736
11598 179736 248953 322936 114565 -210205 -99967 -213660 -31757 56394 -84873 273394 158378
11587 158378 -67281 190387 95103 88681 47131 107910 228936 89864 250123 54619 92606
11576 92606 -81321 111686 -86127 76949 181346 -111396 37371 -26570 136141 330981 -201601
11564 174869 -222789 366654 70768 19663 82709 -36897 24117 -73451 27593 63078 147878
11553 147878 75213 173181 4359 152336 -256855 253571 183238 -147153 -250589 -310708 -72077
11541 -195149 -181935 90597 8815 256110 29451 -46344 156828 322835 -206381 -9919 10678
11529B76204c29592f0929I6822P2044F3726j300Q4915k4856D6442R1658J10359
11518B48459d8683b2738A48415C6952P7564J21275o4910n9898J86036J69074l3536
11507D32557A42101b4052j15701B27545G0215K38491b66300A80054F6549K49036
11497C15585c46432a53567P1190C9782L13551A48751n1777h460A49880K47062
11487C96942a55263C43158q0306i2615A79700f3226H3192K8706J41644A02620
11476c1550G2440K02883I490J60904f4153C64604j34709E0862e5106H6188R0833
11465A77021m5979h1468B23747Q7603M3679A4959L95639N0728A06056J54654o1089
11454A99621e6336A29698b6887B77426E2585h160A79721K54238b2379j73787N9080
$$ plain form
11529 276204 -329592 -60929 96822 168866 63726 62426 147341 122485 46442 138100 248459
11518 248459 -48683 -22738 148415 36952 114516 235791 170881 110983 297019 466093 432557
11507 432557 142101 -24052 -139753 227545 70215 308706 -266300 180054 66549 315585
11497 315585 -346432 -153567 -82377 39782 353333 148751 96974 -8460 149880 396942
11487 396942 -155263 343158 262852 -92615 179700 -63226 83192 111898 253542 102620
11476 -31550 72440 275323 9490 170394 -64153 364604 229895 50862 -55106 86188 177021
11465 177021 131042 -81468 223747 311350 355029 14959 410598 461326 106056 260710 199621
11454 199621 -56336 129698 -26887 277426 52585 -8160 179721 433959 -22379 -196166 -137086
11443a37086O4893J8657D51574h0764D7415j7888L16379A62720c5389E3122M41690
11432D94812B8220M55119I4751a6237F9930L83512C5780a35669n5040O8797a7859
11420h0141A49181L2970a12056A10065d6089A32283J01526b17592A33148j1404
11410A21744E0717a4596j7290j26123C29463H8861K50613b57467d1023o8211A21495
11398a72040F2775K47494E4471k1932a84998A70704E1409J56787a12143A01626
11387a64950M0996k2378E6925b4095l6875B97190g4080k41834a789n575A23097
11375B8218J70540p265b67665I9273m2627a29374e8156j37723A72975b8481B29394
11363a61078G0542N4827o782K0422e4964A9290L58188E7012L0340k4499b81686
$$ plain form
11443 -137086 -72193 -53536 451574 -80764 47415 29527 345906 162720 -35389 53122 494812
11432 494812 28220 483339 94751 -16237 69930 453442 35780 -135669 -190709 -121912 -17859
11420 -80141 149181 182151 -112056 110065 -46089 132283 233809 -217592 133148 121744
11410 121744 50717 -14596 -31886 -158009 329463 88861 339474 -257467 -41023 -109234 121495
11398 -172040 62775 310269 54471 32539 -184998 170704 51409 208196 -112143 101626
11387 -164950 -123954 -146332 56925 -24095 -60970 297190 -74080 -315914 -1789 -7364 123097
11375 28218 198758 191493 -267665 99273 56646 -129374 -58156 -195879 172975 -28481 229394
11363 -161078 70542 125369 118587 139009 -54964 19290 377478 57012 87352 62853 -281686
11351A52056J04325d92561F5870e3232j91115e073r1956j08974A16761r683b42467
11339B64582h9527E3385a49147O9602F5498a59512B00337f3569n7149k1098o7503
11328b09319P5524c1802B89441q0853n185p9004C2096c8353H087b4337C17044
11316A88037J92185A07694A2649J3832P6449N9805c8899B405a49440A83777a89082
11304A554b57543c2442E6579b42670o7217B4337d51327G4542a81853C3842K2386
11293E6228c22422j6749D7193g774n0951j11116L8524A15643d3843K0116A37528
11281b74114h9338j37528h8585k31505a6403A99034n4986b80711j20097c4333
11270b18461p2236b6014k4817a0740k38805h1865k05083F8294b24749a6462A60929
$$ plain form
11351 152056 256381 -492561 65870 -53232 -244347 -5073 -97029 -206003 116761 107078 -242467
11339 264582 -89527 53385 -149147 -79545 65498 -159512 200337 -63569 -120718 -141816 -209319
11328 -209319 -133795 -31802 289441 208588 203403 124399 32096 -38353 8087 -24337 317044
11316 188037 380222 107694 12649 26481 102930 162735 -38899 2405 -149440 183777 -189082
11304 1554 -257543 -32442 56579 -242670 -309887 24337 -451327 74542 -181853 33842 56228
11293 56228 -322422 -339171 47193 -7774 -58725 -169841 -131317 115643 -43843 -23727 137528
11281 -274114 -89338 -226866 -88585 -320090 -16403 199034 144048 -280711 -400808 -34333
11270 -218461 -290697 -26014 -50831 -10740 -249545 -81865 -286948 68294 -224749 -16462 160929
11258b54332A2544L8721h4603q812B11007q4878o0982f347A35249a25326e1922
11246B46015d2475A26577b55803d3505I7617b0339n1238B08911a5159q0291J1261
11235h4189P466n1589J2377A091J37192a03669A5640O2251c46091B33852b4064
11223A67228J46694a75140q5349j59669A65233a48942O1821R738k25941C3040
11212B4956a54982c2155r9838j80094d6591j90033B84352H6401J60680f8017r2201
11201a60218A04308c6933p2376a4525B980b90220b1000m2685p6438o3955a8663
11189A87176b88916d4893I6992J13167D4705J58698A7321a44303E2610J2952h9242
11177b29413A26969J82993j51926C2898K84065f0296B60780f4796n5515d2804
$$ plain form
11258 -254332 12544 51265 -84603 -93415 211007 126129 65147 -6347 135249 -125326 -51922
11246 246015 -42475 126577 -255803 -43505 97617 -20339 -71577 208911 -15159 -95450 -84189
11235 -84189 -76723 -128312 -115935 1091 138283 -103669 15640 77891 -346091 233852 -24064
11223 167228 313922 -175140 -260489 -420158 165233 -148942 -87121 -77383 -303324 33040
11212 24956 -154982 -32155 -131993 -312087 -46591 -236624 284352 86401 247081 -68017 -160218
11201 -160218 104308 -36933 -109309 -14525 2980 -290220 -21000 -63685 -140123 -204078 -18663
11189 187176 -288916 -44893 96992 210159 44705 203403 17321 -144303 52610 65562 -89242
11177 -229413 126969 309962 158036 32898 316963 -60296 260780 -64796 -120311 -42804
11166b0571B8869K56418b58050A73947C4712L1495a22543A51152m3018B2468M706
11155B7174g4301J4901B23788g8890b628k1352j20341D0215i2809k61627b8399
11143d3600j27498n2494b7981j48794G2425a580A41335b40957J12346K9615e791
11131B72354J08848G1718L9768j324e0078E02045e9471B15699P8184a10407C8510
11119a18744p79B07074i4538b1588j39084d4959B85032F6155A0458K85521c2822
11107b0069k28091N8733B22515a00144A52762a79665A96711a66868P3782K9011
11097f4075A73855K26763o1074A54568A2560O71L00699H4916J20730j02220L4941
11086A38367N2019K02370j31706r7016M53519I8549J27090L65350j09064k23526
$$ plain form
11166 -20571 28869 285287 -258050 173947 34712 66207 -122543 151152 108134 22468 27174
11155 27174 -74301 -59400 223788 -78890 -2628 -23980 -144321 40215 -92809 -354436 -28399
11143 -43600 -171098 -223592 -27981 -176775 72425 -1580 141335 -240957 -128611 -98996 -5791
11131 272354 381202 71718 111486 110162 -50078 502045 -59471 215699 293883 -110407 38510
11119 -118744 -119523 207074 -94538 -21588 -160672 -44959 285032 66155 10458 295979 -32822
11107 -20069 -248160 -189427 222515 -100144 152762 -179665 196711 -166868 -93086 -64075
11097 -64075 173855 400618 339544 154568 12560 13231 313930 84916 205646 103426 138367
11086 138367 190386 392756 261050 164034 617553 98549 225639 590989 481925 258399
11076B58399A12886M92816k86695L8934A7119K25967j12858M24442I4780L71258
11066D66038k26366N4572L89451l37423R7817q1311j0827J68060J69104Q4306
11056G73421k83962J03011K16137k84631N00216n1577j25756K69075R7269K69721
11046A482924o03806K16804Q1722K64042j98509J54272j50991j36621k7616k08588
11036H73633K93741q0310m3459J41924l17887Q0664N7140o061N3912R3051k36733
11025I09615k00561L58059O915k45230N7695N7210Q0067l7214J20181l59799N00552
11014A247490m13298J36986k9588k97996o0385M10568j31886j45653N9294J16114
11004H91646J22951n8578L22179j77732n02728N60251j92701l0620l25691L90775
$$ plain form
11076 258399 112886 605702 319007 357941 17119 243086 130228 554670 94780 466038
11066 466038 239672 294244 683695 346272 444089 362778 351951 520011 689115 773421
11056 773421 489459 592470 808607 523976 1024192 972615 846859 1115934 1213203 1482924
11046 1482924 879118 1095922 1177644 1441686 1243177 1397449 1246458 1109837 1082221 873633
11036 873633 1167374 1087064 1043605 1185529 867642 948306 1005446 999385 1053297 1146348 909615
11025 909615 709054 1067113 1074028 828798 886493 943703 1023770 986556 1106737 746938 1247490
11014 1247490 834192 971178 941590 643594 583209 993777 861891 716238 775532 891646
11004 891646 1014597 956019 1278198 1100466 597738 1157989 965288 934668 608977 999752
10994I99752m85491K64776j23194K43569R5269j94526p8767M3470J36005j77538
10984G23325q2679L13426J17490N6232l2309j63498N6883K86308O0577J24352
10974A460107J10292L42421l51233K72471J95415l52016R61859K34755K62855
10965C136926N02460L89984M95773k1323J71209M9595j119913p50706n77087k01963
10955B074955k85062r0902k28050k79461N87683k76754j94767K37381l56506J44216
10945A332733k64265m57337k1938O624P8638j63948j1596B47784L08999D1788
10934A89767J92367j02484a14047B66288r0391K43400j72073N608l5037R928E8127
10922A3820K60112f8893H8195a61809A13713J08009f3083m3771A45254a27714
$$ plain form
10994 999752 514261 779037 655843 899412 994681 800155 721388 764858 900863 723325
10984 723325 640646 954072 1071562 1127794 1095485 931987 988870 1275178 1335755 1460107
10974 1460107 1570399 1912820 1561587 1834058 2029473 1677457 2639316 2874071 3136926
10965 3136926 3639386 4029370 4525143 4503820 4675029 4724624 3604711 2854005 2276918 2074955
10955 2074955 1789893 1698991 1470941 1191480 1779163 1502409 1307642 1545023 1188517 1332733
10945 1332733 1068468 611131 589193 595817 674455 510507 498911 247784 556783 41788
10934 189767 382134 279650 -114047 266288 175897 419297 247224 252832 217795 227723 58127
10922 13820 273932 -68893 88195 -161809 113713 221722 -63083 -106854 145254 -127714
10911A05601b66758D64436F3693j0852a6114E9327D780a9501g846B21594O4774
10900B86368a773j96082h598o4878k7722K3714B72997e75A3623b5473A39592J0119
10888A49711m928m437c40519a03776e0949B49304h7127H5843k0306a90851M8852
10877a41999A05065f6267j23460p6527F855h8989j22184N6911H5985b59286B1182
10865b25655M3098p520N3565a7721j14707G4835b60509B5759b7855A35330D9348
10853D573b3430k47057A25334a28314H2658B9593b15897m3450J04917O4684C29089
10841a75657O4949k4609E1590a44587C1547a63571n6277I1544c4740j10336C4046
10829A52137f2787B75669j55a95280P7210j56824B15a14835A15980l0963L82067
$$ plain form
10911 105601 -266758 464436 63693 52841 -16114 59327 4780 -19501 -7846 221594 286368
10900 286368 -1773 -197855 -8598 -73476 -101198 -77484 272997 -575 13623 -25473 139592 149711
10888 149711 144783 140346 -340519 -103776 -50949 249304 -87127 85843 65537 -190851 -141999
10877 -141999 105065 -66267 -189727 -266254 6855 -88989 -211173 -154262 85985 -259286 21182
10865 -225655 -182557 -190077 -136512 -17721 -132428 74835 -260509 25759 -27855 135330 49348
10853 4573 -23430 -270487 125334 -128314 82658 29593 -215897 -259347 -154430 -89746 329089
10841 -175657 -110708 -135317 51590 -144587 31547 -163571 -219848 91544 -34740 -145076 34046
10829 152137 -62787 275669 275514 -195280 -118070 -274894 215 -114835 115980 85017 467084
10818D67084B13464b0645C13381b0712A45304j4707J6405a8661j89579d7733l6241
10807h3974m299I694O7516l2711P4416P3126g5101A11117L16049A8506J15585
10796A34091A2767g8884D3351a68400A79639E9997j1389K99168a33886e4032B84029
10784A46743N368a82271I621Q0737l7707J5098g0507b7569A5840R990c53357a25103
10771d3454n3830A1290b3821p6762F418a29347A14116j9247A1767J18441o2104
10760F8104J5529Q0373M751d5667n2217c3616o8903m52L7064H6492K7152J64300
10748B77944a16397A21963a90069B20529c33511I4995b32607R4854F9238P5912
10738A45150J3923b56629A20870h4498H275a12466I7295i7172F0482b829A15430
$$ plain form
10818 467084 213464 -20645 313381 -20712 145304 130597 147002 -18661 -208240 -47733 -83974
10807 -83974 -88273 9694 77210 44499 118915 192041 -75101 111117 427166 18506 134091
10796 134091 12767 -78884 43351 -168400 179639 59997 48608 347776 -133886 -54032 284029
10784 146743 152111 -182271 9621 90358 52651 67749 -70507 -27569 15840 25830 -353357 -125103
10771 -43454 -97284 11290 -23821 -100583 6418 -129347 114116 94869 11767 130208 68104
10760 68104 83633 164006 168757 -45667 -97884 -33616 -102519 -102971 -65907 86492 113644 277944
10748 277944 -116397 121963 -190069 220529 -333511 94995 -232607 -137753 69238 145150
10738 145150 159073 -256629 120870 -84498 8275 -112466 97295 -97172 60482 -2829 115430
10726g3781D4613a6388H28e3194k75341F970c3866B42140G5027a98716f7513j55953
10714b23466P5935i768B69381F0607a79420h8337G50P0218b09841j29570J38421
10703b00990B66505c2152H1230E080b61193h4460j81546A39152J07280b27602
10692A58418m2373g8477C4012R3411a72916a6203B59554a08092d0311B93793f4452
10680H5283a00853l3616K9678d5551C3883b66130N1450O1449a8563c825k11946
10669b15771F734c20750H4173m0623Q8948a71796o053i722p8667j36409F2707
10657a13831l2091A78185f2141j4377j27648i4686j02017l3980h540l49012g5252
10645i8219p4783a2414j37823O7768D4415a08754D7530J28133f6172I1832a74586
$$ plain form
10726 -73781 44613 -16388 828 -53194 -328535 6970 -33866 242140 75027 -198716 -67513 -223466
10714 -223466 -147531 -9768 269381 60607 -179420 -88337 750 70968 -209841 -339411 -200990
10703 -200990 266505 -32152 81230 5080 -261193 -84460 -266006 139152 246432 -227602
10692 158418 116045 -78477 34012 127423 -172916 -16203 259554 -108092 -40311 293793 -64452
10680 85283 -100853 -134469 -104791 -45551 33883 -266130 -214680 -153231 -18563 -3825 -215771
10669 -215771 6734 -320750 84173 43550 132498 -171796 -177849 -9722 -88389 -224798 62707
10657 -113831 -145922 178185 -62141 -76518 -204166 -94686 -196703 -230683 -8540 -357552 -75252
10645 -98219 -173002 -12414 -150237 -82469 44415 -108754 47530 175663 -66172 91832 -174586
10633a36623m34484A13476a49553j49447a23923L1429k0422j72954F5046d732
10622g279B39326a92514f6238j17316A49664c34936G5686b06242H7431j1468a7368
10610d4637J4167I5803g112A63892o1515b7939q4794p7028Q8440A70502P042a46671
10597a69478j11233i703j0067k4654r4015p0063k3068F563a14075j34900B01922
10585D4152K5878R3127J11244b42505B99325r9185n7338Q3454b90537A33233j7460
10574A15773a93904Q1586B45430E3866c96869f0236r4987k67316C3644J50200
10564A83844G0785m147a72699M2624q1108A42043a473B24141h1308l4307A63309
10552d5625j84381A08195L24270c9403j46097E0694f3646C21882a56133k70155
$$ plain form
10633 -136623 -571107 113476 -149553 -299000 -123923 -92494 -112916 -285870 65046 -4732
10622 -7279 239326 -192514 -66238 -183554 149664 -334936 75686 -206242 87431 75963 -17368
10610 -44637 -30470 95803 -7112 163892 102377 -27939 -112733 -189761 -101321 170502 177544 -146671
10597 -169478 -280711 -9703 -19770 -44424 -138439 -208502 -231570 6563 -114075 -248975 201922
10585 44152 70030 163157 274401 -242505 299325 200140 142802 226256 -290537 133233 115773
10574 115773 -193904 -112318 245430 53866 -396869 -60236 -155223 -422539 33644 183844
10564 183844 70785 66638 -172699 -130075 -211183 142043 -1473 224141 -81308 -115615 163309
10552 -45625 -230006 108195 432465 -39403 -185500 50694 -63646 321882 -156133 -426288
10542d26288B83979A08302k4279d1198j78624l6711m4870Q2711R7749m2861K2043
10531a41761j68930A00436N0829b143j93756a0147o628j87716I7566B9662J03185
10520A32847b57609a14275e1068n3578j22518q3279B03059a2540B90931A3057
10509d4803A2712b16573Q6558j95224l6244R6702a03599I1511J85958B0738a69571
10497I1594g0209d48j31489A42830F5203o280L8118c14641e7495B23612H833R4243
10485A03076e2855k57640c475o9140G4770J23366L4051a59146E3708L0534J14699
10474A98941p9331R2825R2983J99051p019m8408j64740e306n3606A19887K42754
10463C62641e7029D3067M6931b33716F1520a68659i838A39410a50798D4222D034
$$ plain form
10542 -426288 283979 108302 84023 -41198 -219822 -256533 -301403 -218692 -120943 -163804 -141761
10531 -141761 -310691 100436 151265 -2143 -195899 -10147 -16775 -204491 97566 29662 132847
10520 132847 -257609 -114275 -51068 -104646 -227164 -310443 203059 -12540 290931 13057
10509 -44803 12712 -216573 -130015 -325239 -361483 -264781 -103599 91511 277469 20738 -169571
10497 91594 -70209 -448 -131937 142830 65203 58923 97041 -314641 -57495 223612 8833 103076
10485 103076 -52855 -310495 -3475 -72615 74770 198136 232187 -159146 53708 84242 198941
10474 198941 119610 212435 305418 504469 497450 449042 284302 -5306 -58912 119887 362641
10463 362641 -57029 43067 89998 -233716 61520 -168659 -9838 139410 -150798 44222 4034
10451a29580B37674c3061G4801c55571a33118J2262A62343a03759j97936A11078
10440b52281A0677J43983a29341a2631j8805B32309l6772a21941A83913b2203
10429a31504o2181C34238A5234a84478f7532c2789A30493m4546l8335J83086a86683
10417D20615A3973N1324j5431P1234a08545K9450j9399J731E5889d7767A15063
10405a10565m2260G9719c02344g5812j10825b9350k0593A09557b28020A76622
10394a90080P5459E2721a04952A5601a80023A52109c5769m2378C79281n8438p7355
10383B43488a3339A85850F826M17725A47404J56357a57959D43951A55777n8632
10373I7145K71552J6163r7500l1718L58395d4038A91024L82031j90622o2073Q0174
$$ plain form
10451 -129580 237674 -33061 74801 -355571 -133118 -120856 162343 -103759 -301695 111078
10440 -252281 10677 154660 -129341 -12631 -31436 232309 195537 -121941 183913 -22203
10429 -131504 -193685 334238 15234 -184478 -67532 -32789 130493 85947 47612 230698 -186683
10417 420615 13973 65297 49866 121100 -108545 -79095 -98494 -96763 55889 -47767 115063
10405 -110565 -152825 79719 -302344 -75812 -186637 -29350 -49943 109557 -228020 176622
10394 -190080 -114621 52721 -104952 15601 -180023 152109 -35769 -78147 379281 320843 243488
10383 243488 -13339 185850 6826 424551 147404 303761 -157959 443951 155777 97145
10373 97145 368697 384860 287360 255642 614037 -44038 191024 573055 382433 320360 400534
10362D00534M7991J78556k51563K72355K56524k86166a56689D61548B02952K53188
10352D56140j53892j05021o8039a268A84018K31573K12673K86855J45661k76269
10342G84511B37919K3562P2387j29955J13249R243o9771A21424K8814J7529J74689
10331C42456A19066J33785j11374J1790i7221H4840J76407j03556l9315D7732
10320C53267l0840A12381c962B49579c7099A56713K70241e3797A66840a65448
10309B87310D8592e1769A30139a31313A6817J23524K10869a44100F4486h3082
10298B21110i9075A70080k5726O7816e9761B56500c3444N419k3780j24916B51908
10286C69233i6415D17023b14991B02563C3527J16528a62362e0518B1257a49541
$$ plain form
10362 400534 448525 627081 375518 647873 904397 618231 -156689 461548 202952 456140
10352 456140 302248 197227 129188 -1268 184018 415591 628264 915119 1060780 784511
10342 784511 237919 261481 333868 203913 317162 326405 256634 121424 150238 167767 342456
10331 342456 119066 252851 141477 153267 -97221 84840 261247 157691 118376 47732
10320 353267 322427 112381 -3962 249579 -37099 156713 426954 -53797 166840 -165448
10309 287310 48592 -51769 130139 -131313 16817 140341 351210 -144100 64486 -83082
10298 221110 -99075 170080 144354 212170 -59761 256500 -33444 -28025 -51805 -176721 251908
10286 369233 -96415 417023 -214991 202563 33527 150055 -162362 -50518 21257 -149541
10275A01728M3630d7168J3967m60696A95439C7095R6676N9007a72506A80440e1045
10263a50980j65973a07933o24713a56679G3879a37496C35739A20306E2854K665
10253E5519c08290F8061J50783l807J39244j64835a94941A71104J53543a14042
10242H6882C9930e0841o6981d626A92847m0492f9155l3940p121Q265k32166a28982
10229A61061G289J6227K4541b06439C13546a29911q4104A89f6058F0414b88018
10217a37197L334c483H7921b1617B164b12493A8518a74354B9394a87473B6586
10205a32787j88222e8746G2846i9462l0533j46558h7035H5627J30208J46001H279
10193E2820p572a49755q054A690L9239R18A942P5044c64244B86309d64574a33048
$$ plain form
10275 101728 145358 -47168 -33201 -493897 195439 37095 133771 192778 -172506 180440 -51045
10263 -150980 -316953 -107933 -732646 -156679 73879 -137496 335739 120306 52854 55519
10253 55519 -308290 68061 218844 215037 354281 189446 -194941 171104 324647 -114042
10242 86882 39930 -50841 -117822 -4626 192847 152355 -69155 -103095 -110216 -101951 -334117 -128982
10229 161061 7289 23516 48057 -206439 313546 -129911 -214015 189 -66058 60414 -288018
10217 -137197 -133863 -3483 87921 -21617 2164 -212493 18518 -174354 29394 -187473 26586
10205 -132787 -321009 -58746 72846 -99462 -129995 -276553 -87035 85627 215835 361836 8279
10193 52820 45248 -149755 -157809 1690 40929 41847 1942 76986 -364244 286309 -464574 -133048
10180b37306C157Q0228Q6718a54983j4593j606A7635b75135h4656J7567k37978
10169c05067a07022B51685j8457a65641L3342B23206a83590j1263k85173A07408
10158G1964d35219R0826i2093l490k02464A65381l4173d2137B46832C6528b35745
10146a47019c3370A46031a70100C5631b23105h6770b8164r5007B0886Q3689a24049
10134a81111j82396A48347b28711B3841b32374d694j53301j53738G2636c24291
10123F7763i4981A81464B9568M0431a69197G2160b75241G2535K2325i2372k01207
10112b93579a16940N7607a990I5861l851d3219B2054e5903p4573B67697a86314
10100b56870e300A38276B6721c16935D2937b74917B2602K10506G8060B3136b90269
$$ plain form
10180 -237306 3157 83385 170103 -154983 -169576 -171182 17635 -275135 -84656 -67089 -305067
10169 -305067 -107022 251685 233228 -165641 -132299 223206 -183590 -194853 -480026 107408
10158 71964 -435219 -344393 -92093 -95583 -298047 165381 131208 -42137 246832 36528 -235745
10146 -147019 -33370 146031 -170100 35631 -223105 -86770 -28164 -123171 20886 104575 -124049
10134 -181111 -363507 148347 -228711 23841 -232374 -4694 -157995 -311733 72636 -324291
10123 67763 -94981 181464 29568 69999 -169197 72160 -275241 72535 94860 -92372 -293579
10112 -293579 -116940 -59333 -1990 95861 92010 -43219 22054 -55903 -130476 267697 -186314
10100 -256870 -5300 138276 26721 -316935 42937 -274917 22602 233108 78060 23136 -290269
10088b3314r307A78089K2349b55299a6767n8821J6587J6494j83087e9522I2049
10076I3742b15130B13492B1924b6592n9421A4543e3962j29092R05I5174c3408
10064H9229b50300K5068l3952j04796B50994J05093C9303O9135a40064A21828
10053c1092j95172I108a09508A18059C4884a76712A0612K765c0968C76000b20052
10041H4988a34362k4119m9305A97468F8851a07797n7191G013c0425j16288G0877
10029A28405c02407J24079J1879B06121f0202l17702a23214d3933R695n7306A16028
10017a72353e8534I3448J7268A9264J09774b1199B46464a93607d0789A6024a83169
10005a88557r9491C55127b28464o8794a19217C76606a05973L3815j20787A33665
$$ plain form
10088 -23314 -32621 178089 200438 -255299 -16767 -75588 -59001 -42507 -225594 -59522 92049
10076 93742 -215130 213492 21924 -26592 -86013 14543 -53962 -183054 -182149 95174 -33408
10064 89229 -250300 -225232 -259184 -363980 250994 356087 39303 108438 -140064 121828
10053 -31092 -226264 9108 -109508 118059 34884 -176712 10612 13377 -30968 376000 -220052
10041 84988 -134362 -158481 -207786 197468 68851 -107797 -164988 7013 -30425 -146713 70877
10029 128405 -302407 -178328 -166449 206121 -60202 -377904 -123214 -43933 -34238 -91544 116028
10017 -172353 -58534 93448 110716 19264 129038 -21199 246464 -193607 -40789 16024 -183169
10005 -188557 -288048 355127 -228464 -297258 -119217 376606 -105973 -72158 -192945 133665
9994b30804J03681j15987A86741c8424m2167B1468J01535i870B09699a12146k34479
9983c46625J40349r8742g7140p7059a7772j02778m5295A85035D7896f2782l5170
9972i7952d12k33213M4755P8673n3670B36059f1599A01030c45497G823i7481q0096
9960a77577P6400a2097B634J1397J40006c39670a21040N9422q9994o2334C2313
9948g1253A09294G454J90310b82837G9866e7885A29904c61678E616a21623j56768
9937b78391g4006A4597a04156L9303A19729m7383A2099i4102j55094C1953d3092
9925c27017A24145a9130j24501l924A24171c7304H7844b03816j4771A22088n7863
9914F4225a29155n9130h7751I4547J91440c14528e6634F9158a20619p7701A8873
$$ plain form
9994 -230804 -127123 -243110 186741 -38424 -80591 21468 123003 -9870 209699 -112146 -346625
9983 -346625 -206276 -305018 -77140 -154199 -17772 -120550 -165845 185035 47896 -62782 -97952
9972 -97952 -412 -233625 -188870 -110197 -163867 236059 -61599 101030 -345497 7823 -97481 -177577
9960 -177577 -101177 -12097 2634 14031 154037 -339670 -121040 -61618 -151612 -213946 32313
9948 -71253 109294 7454 197764 -282837 79866 -57885 129904 -361678 5616 -121623 -278391
9937 -278391 -74006 14597 -104156 -64853 119729 72346 12099 -94102 -249196 31953 -43092
9925 -327017 124145 -19130 -143631 -147555 124171 -37304 87844 -203816 -218587 122088 64225
9914 64225 -129155 -188285 -87751 94547 285987 -314528 -56634 69158 -120619 -198320 18873
9902b33897a549k8481A16806a25093k9902j50624j9200C2584P9459c13091i5489
9890A74756a32006G120K65483d5057m6815j79353E5490c13330J17320D9289e38771
9878I2199B5818Q64M7639C4533g9473B06597b37792a03801b0976B29903b18470
9866A7276e6353B92660N9007a29140E5431L30880a7005C7759a65483M7838e2147
9854c4848L379R480p0676q8674B50564a05154r051k1593e0989j64657D09535c75108
9841b02239i2441C4974f7434l7404q317g367l30571c7242J3042l34477G0045h58
9828a15715J2020k47735d4927G4291L6866a24013A90072f9140I3431d9538j24328
9817a73866j21240c6042A50570a29646d2794A33039b53596J26739l00817G1835
$$ plain form
9902 -233897 -1549 -30030 116806 -125093 -154995 -305619 -324819 32584 112043 -313091 -95489
9890 174756 -132006 7120 272603 -45057 -91872 -271225 55490 -313330 -196010 49289 -538771
9878 92199 25818 26682 74321 34533 -79473 206597 -237792 -103801 -20976 229903 -218470
9866 17276 -56353 292660 351667 -129140 55431 386311 -17005 37759 -165483 -117645 -52147
9854 -34848 -31469 -21989 -92665 -181339 250564 -105154 -114205 -135798 -50989 -215646 409535 -375108
9841 -202239 -92441 34974 -67434 -104838 -113155 -7367 -337938 -37242 -24200 -358677 70045 -858
9828 -115715 -103695 -351430 -44927 74291 111157 -124013 190072 -69140 93431 -49538 -173866
9817 -173866 -295106 -36042 150570 -129646 -42794 133039 -253596 -126857 -427674 71835
9806a72054a7847o9402F5542O426a18108r5853E9728a83238f3698p3986A38057
9794C0544a81570N9293A30998d90226f1510o3669B52550i4952j38952k03417i1060
9782I3935a3017A2735a89468d5673A84612a19237N6693A48767a61419k8059j56908
9771c46386A1401a8996B02008b1473H1263c59600J26669g647A87060r1874d18785
9759b62072j18681J87135k9136e4476A12406b05023q1930A00057n140a54941f2365
9747A12238a6198k58174k4108k0767a42186j58638i7512B83559c06929A95653
9736I8836J18278B9916h1382a5619r6072B54003q8112f2737K8435j60809a8068
9724a88274j02280M7390k1913A65412o1625n0778h0029A2921h9760o2176a1468
$$ plain form
9806 -172054 -17847 -87249 65542 71968 -118108 -213961 59728 -183238 -63698 -137684 138057
9794 30544 -181570 -122277 130998 -490226 -61510 -125179 252550 -94952 -233904 -437321 -91060
9782 93935 -13017 12735 -189468 -45673 184612 -119237 -62544 148767 -161419 -189478 -346386
9771 -346386 11401 -18996 202008 -21473 81263 -359600 -232931 -7647 187060 95186 -418785
9759 -262072 -380753 -193618 -222754 -54476 112406 -205023 -286953 100057 94917 -154941 -62365
9747 112238 -16198 -274372 -298480 -319247 -142186 -300824 -97512 283559 -306929 195653
9736 98836 217114 29916 -81382 -15619 -111691 254003 165891 -62737 -34302 -195111 -18068
9724 -188274 -290554 -243164 -265077 165412 103787 53009 -80029 12921 -89760 -151936 -11468
9712a93955e1712k4338A17777a53006A46972d7393C2270a85964P6876b3934B9557
9700H3287K20286C9871a57611L7164A04114a58022e9389A71735a27712M7082A76071
9688C9698I145h3055j01263d945B40096E7579c1837j2604A62723G6302N7097c48774
9675g6184B73262f2643C67360H1839K05235r4401a15763M853J7173k32791b7945
9663f4987L956D5105Q2191a47799Q117j67540D1425a67256F7358a11325H561b18274
9650E1593K278K01334a39631a3042l5284j71809a9774i649j86284o4860d8200
9638d3533H228b76847P4467B31110D0473L1041b47298a3735q0051l5771A72184
9626B0607a13298j24614d2036l20954a01688F8015M5178b41308f7733n144c2845
$$ plain form
9712 -193955 -51712 -76050 117777 -153006 146972 -47393 32270 -185964 -109088 -23934 29557
9700 83287 303573 39871 -157611 -120447 104114 -158022 -59389 171735 -127712 -80630 176071
9688 39698 9145 -83055 -184318 -4945 240096 57579 -31837 -44441 162723 76302 133399 -348774
9675 -76184 273262 -62643 367360 81839 287074 192673 -115763 -110910 -93737 -326528 -27945
9663 -64987 -61031 45105 127296 -147799 -139682 -307222 41425 -167256 67358 -111325 8561 -218274
9650 51593 53871 255205 -139631 -13042 -48326 -220135 -19774 -9649 -195933 -260793 -48200
9638 -43533 8228 -276847 -202380 231110 40473 71514 -247298 -13735 -93786 -129557 172184
9626 20607 -113298 -237912 -42036 -362990 -101688 68015 113193 -241308 -67733 -72877 -32845
9614b49431A45313h180m28741F194J21029b05195G1585a56906N6352K3640j28752
9603b05666d8950B46668c06942M7544N9379h5358j78845G3584b93228D5289K35094
9592B80383a06431A67504P6685c67986f5690K1789J30p2508j27142d3330k37233
9581b80563A81312a07912j87394M7390A26091h5396p5998A28311a1449j46376
9571a57825e2984q3204d7389j58984b576A70923b93836A09321e7343j38982M4617
9560a51708C18438a39876c1850l9098j8591I596O1348b07965a01128A68961b6505
9548C1271O015J00927b3366C2555f9334j05352o1609A94151A4192J38143E9768
9536b01469q4544B25172B41a89059D4808j6216a73743A37233b64105C5598d8810
$$ plain form
9614 -249431 145313 -8180 -436921 6194 127223 -205195 71585 -156906 -100554 -76914 -205666
9603 -205666 -48950 246668 -306942 -259398 -200019 -85358 -264203 73584 -293228 45289 280383
9592 280383 -106431 167504 244189 -367986 -65690 -43901 -43771 -116279 -243421 -43330 -280563
9581 -280563 181312 -107912 -295306 -247916 126091 -85396 -161394 128311 -11449 -157825
9571 -157825 -52984 -136188 -47389 -206373 -2576 170923 -293836 109321 -57343 -196325 -151708
9560 -151708 318438 -139876 -31850 -70948 -89539 9596 70944 -207965 -101128 168961 -26505
9548 31271 37286 138213 -23366 32555 -69334 -174686 -236295 194151 14192 152335 59768
9536 -201469 -286013 225172 241 -189059 44808 28592 -173743 137233 -264105 35598 -48810
9524B70226d2446E8172d1787O43j09825C015f1383K1148a0927j89240j3075j4529
9512b27771A02278b47220a03605b6951A49729c37574C13493g8539r4423B75364
9501A620J06952m6683K55864c3639j86841c862I6696d39343a54321b7447A21144
9489f7545C9573f1748A33018a11887m2548A86184a74068n9454e3158A07128a4245
9477a48851q0583k08962a56264l0354k9606B7463c38822C43988A03385A8598Q4651
9466A03249R6543H0137J30924n1314c61826B48825d5273K0924r045q8006A21961
9454B6436J36569a47803c418k69011c7014B78513j07067f5270r6578j4633g124
9442A52671j3329a25832O1222m1587j22670j27814A54861D3339h6118j69667B3616
$$ plain form
9524 270226 -42446 58172 -41787 -41144 -150969 3015 -61383 -40235 -10927 -200167 -213242 -227771
9512 -227771 102278 -247220 -103605 -26951 149729 -337574 313493 -78539 -172962 275364
9501 1620 108572 61889 317753 -33639 -220480 -3862 96696 -439343 -154321 -27447 121144
9489 -67545 39573 -61748 133018 -111887 -154435 186184 -174068 -233522 -53158 107128 -14245
9477 -148851 -229434 -438396 -156264 -186618 -216224 27463 -338822 343988 103385 18598 103249
9466 103249 199792 80137 211061 159747 -361826 248825 -45273 -24349 -33394 -121400 121961
9454 26436 163005 -147803 -3418 -272429 -37014 278513 171446 -65270 -161848 -176481 -7124
9442 152671 139342 -125832 -64610 -106197 -228867 -356681 154861 43339 -86118 -255785 23616
9430b83510J16809O6473K6871k3826B30639a95076h2447A42321E7671c18915c2397
9418a01352A36829e4224E6631c24661A3465b90219J4507j34676B7340d31575a18588
9406a35391A64739a5545E2925f6904A9215b8968k31582k754Q5101m0930B26679
9394i7016r1971d2491H5662J7952a01542J3400j75232O1819o8772j933A74678
9382b25087l6229B99907r5881N9477a54210j6570k0580k46699a93705i0254M487
9371h5767k05612c9011B69851b76036g9405A8109a54685M4515l4254A993J84730
9360A86723b51821F9656b33027D9810a26317j47138A50021b48302B14752g8425
9349b9137F4601f1205p8218j98313C5875a067j44276g447A51443F2601d28654
$$ plain form
9430 -283510 -166701 -100228 -73357 -97183 230639 -195076 -82447 142321 57671 -318915 -32397
9418 -101352 136829 -54224 56631 -324661 13465 -290219 -275712 -410388 27340 -431575 -118588
9406 -135391 164739 -15545 52925 -66904 19215 -28968 -260550 -263304 -178203 -219133 226679
9394 -97016 -188987 -42491 85662 103614 -101542 -88142 -263374 -201555 -270327 -272260 174678
9382 -225087 -261316 299907 204026 263503 -154210 -170780 -191360 -438059 -193705 -90254 -85767
9371 -85767 -291379 -39011 269851 -276036 -79405 18109 -154685 -110170 -144424 1993 186723
9360 186723 -251821 69656 -233027 49810 -126317 -273455 150021 -248302 214752 -78425
9349 -29137 64601 -61205 -139423 -337736 35875 -1067 -145343 -7447 151443 62601 -428654
9337c72299a1051C7540a81938A61690a33667M7072F1094d09037b6542A99765g4536
9325E18821A52882D2204J16571a21147A74038J76030a65366E9584c157q6242n16043
9314f05442C6579k526b61553N1992g9986B95965E1818a5251A32176a60952P735
9303a53217A40153a69584A34718b66661e7377C866g0225p9372H3134J5141a79283
9291b70889C1988J64850c11265a52465d9804j82226N9126N2840m15782K25594
9281c10252a17852M8286m7932m43G220K26272C1369M7306q225i8844M0557j70387
9269b28674C6298i657k97338C40524a14848j047m48045A92350a20815A08337P554
9258A15891b48355A30906b98050B40887a96962j29879J46050C66655f9398A18796
$$ plain form
9337 -372299 -11051 37540 -181938 161690 -133667 -86595 61094 -409037 -26542 199765 -74536
9325 518821 152882 42204 158775 -121147 174038 350068 -165366 59584 -3157 -89399 -605442
9314 -605442 36579 34053 -261553 -209561 -79986 295965 51818 -15251 132176 -160952 -153217
9303 -153217 140153 -169584 134718 -266661 -57377 3866 -70225 -149597 83134 98275 -179283
9291 -270889 31988 196838 -311265 -152465 -49804 -232030 -172904 -120064 -535846 -310252
9281 -310252 -117852 -69566 -117498 -117941 7220 233492 31369 78675 70450 -98844 -58287 -228674
9269 -228674 36298 -9657 -306995 340524 -114848 -115895 -563940 192350 -120815 108337 115891
9258 115891 -248355 130906 -298050 240887 -196962 -326841 -180791 366655 -69398 118796
9247a9564k75416A92405p9130a70022P1178k13357f0048B39630a400B41789c61826
9235F6772b88455A42420b03740g1268k3308L0722a546A8705i1567j70282N0686
9224b11163B4922a85360M0161f7635C54850D6195c5205j68292k41375H7821B1791
9212B07739a93448a2794j88251D1909b7242F204b81475a02414A4528a12466k67982
9201c80448b3368l63490R8582k09618G7947a38375c0077B87478e50j71257E7300
9189a36736k03029F315b37862k6184M0875A19883P0505a38095d9051F0365L09990
9178C70355a80444h8621B08661B6793L4824I543a57528g5286c4298k6630f758
9166A39496c36583J06674A13593l9479d55595J90225K2562f3848B2689b80507
$$ plain form
9247 -19564 -294980 192405 113275 -170022 -98844 -312201 -60048 239630 -1400 241789 -361826
9235 66772 -288455 142420 -203740 -71268 -94576 -63854 -1546 18705 -91567 -261849 -211163
9224 -211163 24922 -185360 -145199 -67635 354850 46195 -35205 -203497 -444872 87821 21791
9212 207739 -193448 -12794 -201045 41909 -27242 6204 -281475 -102414 14528 -112466 -380448
9201 -380448 -23368 -386858 -288276 -497894 77947 -138375 -30077 287478 -550 -171807 57300
9189 -136736 -339765 6315 -237862 -264046 -223171 119883 190388 -138095 -49051 60365 370355
9178 370355 -180444 -88621 208661 26793 61617 9543 -157528 -75286 -34298 -60928 -6758
9166 139496 -336583 -229909 113593 74114 -455595 -265370 -242808 -63848 22689 -280507
9155I6251C3888e5680q964A13176a06245D7965g8950J1474J0162D9277c2750B42941
9142g499j60196N9311A38468D0969P1176d0593k23060m1794a7768j90774h7285
9130D4590a37684J1054b5329c579k6737l9760K4059R199k02018a03778B83124
9118G7800q499a18651j2928G7833J00772a95669F8279i2941a1587j04803D0599
9106b53747M9825B04574A9344a8504A2027a38514e5308K1345F0934B3798L73294
9095C97092a69411C31546a7797B8105b95781i2213o6735H026a02132r7731l5084
9084b34947O7122O4636B19578D0221j3562K86273h650j86509F6886K4597K27834
9073C19317a62653p6548G8860h2459H3694a98960M0699I3776k6141A096a45765
$$ plain form
9155 96251 33888 -55680 -64644 113176 -106245 47965 -78950 -67476 -57314 49277 -32750 242941
9142 -7499 -167695 -108384 138468 40969 112145 -40593 -263653 -305447 -17768 -208542 -87285
9130 44590 -137684 -126630 -25329 -3579 -30316 -70076 -46017 -36818 -238836 -103778 283124
9118 77800 69301 -118651 -131579 77833 178605 -195669 68279 -92941 -11587 -116390 40599
9106 -253747 -203922 204574 19344 -18504 12027 -138514 -55308 -33963 60934 23798 397092
9095 397092 -169411 331546 -17797 28105 -295781 -92213 -158948 8026 -102132 -199863 -234947
9084 -234947 -167825 -103189 219578 40221 26659 312932 -8650 -195159 66886 91483 319317
9073 319317 -162653 -239201 78860 -82459 83694 -198960 -158261 93776 67635 1096 -145765
9061D636e5435j08097A6564c58429J49798J03688o8098d8360B9030K9263b33834
9049b33504J6698B58455j4579h4907p1891j66440F7335d44047a71700Q0305A751
9037d16379A36375b8274j92588O6833j23115J23479A03002c5180E1112L20992
9027C72104f2357b3270m8190J8510A1285b70995i3839l0730q2531E8092L1700
9016H9792b48980R6806j34055d9365A56736j5197a00270l5945r9309B42698F6756
9004C3316J77414b04226i2359j2902j39905C599e3851r1444A03585c39452O4409
8993b75043b6172R969k56077a31612F3733J65478a93593N0238A00148C5651b57426
8981A03214N4778D5918j6574b30061b6589j62711B07980a65736j31913A85961
$$ plain form
9061 4636 -55435 -163532 16564 -358429 -208631 -104943 -173041 -48360 29030 58293 -233834
9049 -233504 -216806 258455 243876 -84907 -156798 -323238 67335 -444047 -171700 -91395 1751
9037 -416379 136375 -28274 -220862 -154029 -277144 -153665 103002 -35180 51112 372104
9027 372104 -62357 -23270 -71460 -52950 11285 -270995 -93839 -124569 -207100 58092 89792
9016 89792 -248980 -152174 -286229 -49365 156736 141539 -100270 -136215 -235524 242698 66756
9004 33316 210730 -204226 -92359 -105261 -245166 3599 -53851 -145295 103585 -339452 -275043
8993 -275043 -26172 -16203 -272280 -131612 63733 229211 -193593 -143355 100148 35651 -257426
8981 103214 157992 45918 29344 -230061 -26589 -189300 207980 -165736 -297649 185961
8970D0740a25985A17629d8835C8136L506A1242h4241j01351P7909C128b04430
8958C7028f7301A89534E405N0298f6537A92048q4236R9692j00375b60470I0569
8946F9803d05543D2650b62835d2040j63705n2275j47549a07648a8842k57934j7428
8935b94204E03213c7883F0047e2746m5401A13989b38315k9764f6397n3134A33253
8923a45299M8494L8276j10918e3887J579A118515K537035j383814H09698C12631
8912A48902C4428J8931N0257a07134A82116p9536h8874j6275A62360D3190L9234
8901H2424i9625q7248f4584a2648l32957J33455A36466b3602j23775A20345l1002
8890H9343d7244B6687M4322c66640e0087B2384a05004E4273b46045a15780J5164
$$ plain form
8970 40740 -125985 117629 -48835 38136 41642 11242 -84241 -185592 -107683 3128 -204430
8958 37028 -67301 189534 5405 55703 -66537 192048 107812 207504 107129 -260470 90569
8946 69803 -405543 42650 -262835 -42040 -205745 -258020 -405569 -107648 -18842 -276776 -294204
8935 -294204 503213 -37883 60047 -52746 -98147 113989 -238315 -268079 -66397 -119531 133253
8923 -145299 -96805 -58529 -169447 -53887 -52308 1118515 3655550 2271736 809698 312631
8912 148902 34428 53359 103616 -107134 182116 102580 -88874 -105149 162360 43190 82424
8901 82424 -99625 -186873 -64584 -12648 -345605 -212150 136466 -23602 -147377 120345 89343
8890 89343 -47244 26687 71009 -366640 -50087 22384 -105004 54273 -246045 -115780 -100616
8879a00616b7045N19m9654l53859a83223B07266b11184B11068a57539r9921A73883
8867a16760j15411a2545j94002J00855q6050P4483k91950J62771a9652n0525j06458
8856a76635C00349j42577b12501D4508O1222b2311k65682Q1532C35353b99885
$$ plain form
8879 -100616 -27045 -26526 -76180 -430039 -183223 207266 -211184 211068 -157539 -257460 173883
8867 -116760 -232171 -12545 -206547 -105692 -191742 -117259 -409209 -246438 -19652 -70177 -176635
8856 -176635 300349 157772 -212501 44508 105730 -22311 -287993 -206461 335353 -299885
$$ [...]
##END NTUPLES=NMR SPECTRUM
##END=
