##TITLE=NES1046_SeabridgeLH_9268578_QvbKUYwuHT
##JCAMPDX= 6.0         $$ Bruker NMR JCAMP-DX V2.0
##DATA TYPE= NMR SPECTRUM
##DATA CLASS= NTUPLES
##ORIGIN= BRUKER
##OWNER= Administrator
$$ 1.72 TOPSPIN		Version 2.1
$$ 2015-07-11 15:18:00.285 -0700  Administrator@X
$$ Compression mode = diff/dup
##.OBSERVE FREQUENCY= 400.02188249412
##.OBSERVE NUCLEUS= ^1H
##.ACQUISITION MODE= SIMULTANEOUS (DQD)
##.ACQUISITION SCHEME= undefined
##.AVERAGES= 8
##.DIGITISER RES= 22
##SPECTROMETER/DATA SYSTEM= spect
##.PULSE SEQUENCE= zg30
##.SOLVENT NAME= COFFEE_meoh
##.SHIFT REFERENCE= INTERNAL, COFFEE_meoh, 1, 14.98509
##AUDIT TRAIL= $$ (NUMBER, WHEN, WHO, WHERE, PROCESS, VERSION, WHAT)
$$ ##TITLE= Audit trail, TOPSPIN		Version 2.1
$$ ##JCAMPDX= 5.01
$$ ##ORIGIN= Bruker BioSpin GmbH
$$ ##OWNER= Administrator
$$ $$ E:\/data/COFFEE/nmr/NES1046_SeabridgeLH_9268578_QvbKUYwuHT/10/pdata/1/auditp.txt
$$ ##AUDIT TRAIL=  $$ (NUMBER, WHEN, WHO, WHERE, PROCESS, VERSION, WHAT)
(   1,<2015-07-11 15:17:53.019 -0700>,<Administrator>,<X>,<go>,<TOPSPIN 2.1>,
      <created by zg
	started at 2015-07-11 15:16:47.113 -0700,
	POWCHK enabled, PULCHK disabled,
       configuration hash MD5:
       21 0F 79 D6 B3 7B B4 F6 88 20 88 DB 03 48 BD 9F
       data hash MD5: 64K
       EC D2 5B C4 BB E7 22 71 C0 D7 E5 45 78 27 A6 05>)
(   2,<2015-07-11 15:17:56.191 -0700>,<Administrator>,<X>,<proc1d>,<TOPSPIN 2.1>,
      <Start of raw data processing
       efp LB = 0 FT_mod = 6 PKNL = 1 PHC0 = 0 PHC1 = 0 SI = 32K 
       data hash MD5: 32K
       F3 F9 D6 2A 49 77 85 13 C9 88 49 CB 6B 4E 29 E1>)
(   3,<2015-07-11 15:17:56.472 -0700>,<Administrator>,<X>,<proc1d>,<TOPSPIN 2.1>,
      <pk PHC0 = 91.8457 PHC1 = 0 
       data hash MD5: 32K
       18 0A 1F 49 D1 E9 7D 13 A1 EC 4D B9 81 92 2E A5>)
(   4,<2015-07-11 15:17:56.581 -0700>,<Administrator>,<X>,<proc1d>,<TOPSPIN 2.1>,
      <abs ABSG = 1 
       data hash MD5: 32K
       A6 8D 51 10 73 86 55 96 B8 0A 66 8F 67 E7 74 98>)
(   5,<2015-07-11 15:17:56.660 -0700>,<Administrator>,<X>,<proc1d>,<TOPSPIN 2.1>,
      <abs ABSG = 2 
       data hash MD5: 32K
       7D D8 99 88 C3 C6 09 CD 30 D0 46 AA 75 2F 9B 0C>)
(   6,<2015-07-11 15:17:56.722 -0700>,<Administrator>,<X>,<proc1d>,<TOPSPIN 2.1>,
      <abs ABSG = 3 
       data hash MD5: 32K
       90 77 CA AA 04 9B 97 E2 22 12 33 8B 02 24 24 1F>)
(   7,<2015-07-11 15:17:56.785 -0700>,<Administrator>,<X>,<proc1d>,<TOPSPIN 2.1>,
      <abs ABSG = 4 
       data hash MD5: 32K
       54 5F D6 6B C1 46 80 F1 CB 57 52 C3 47 B6 FE 38>)
(   8,<2015-07-11 15:17:56.847 -0700>,<Administrator>,<X>,<proc1d>,<TOPSPIN 2.1>,
      <abs ABSG = 5 
       data hash MD5: 32K
       FF 05 92 BB F8 3B 5B 36 07 69 98 96 BD EA F5 7B>)
$$ ##END=
$$ 
$$ $$ hash MD5
$$ $$ F3 CF 0B 7A 18 91 EB EF 1D 19 D9 B6 4D 83 67 B9
##$RELAX= 
##$RELAX= 
##$RELAX= 
##$RELAX= 
##$RELAX= 
##$RELAX= 
##$RELAX= 
$$ Bruker specific parameters
$$ --------------------------
##$DU= <E:\>
##$EXPNO= 10
##$NAME= <NES1046_SeabridgeLH_9268578_QvbKUYwuHT>
$$ [...]
150 150 150 150 150 150 150 150
##$TP07= 0
##$TPNAME0= <>
##$TPNAME1= <>
##$TPNAME2= <>
##$TPNAME3= <>
##$TPNAME4= <>
##$TPNAME5= <>
##$TPNAME6= <>
##$TPNAME7= <>
##$TPOAL= (0..7)
0.5 0.5 0.5 0.5 0.5 0.5 0.5 0.5
##$TPOFFS= (0..7)
0 0 0 0 0 0 0 0
##$TUNHIN= 0
##$TUNHOUT= 0
##$TUNXOUT= 0
##$USERA1= <user>
##$USERA2= <user>
##$USERA3= <user>
##$USERA4= <user>
##$USERA5= <user>
##$V9= 5
##$VALIST= <valist>
##$VCLIST= <CCCCCCCCCCCCCCC>
##$VD= 0
##$VDLIST= <DDDDDDDDDDDDDDD>
##$VPLIST= <PPPPPPPPPPPPPPP>
##$VTLIST= <TTTTTTTTTTTTTTT>
##$WBST= 2048
##$WBSW= 25
##$XGAIN= (0..3)
0 0 0 0
##$XL= 0
##$YL= 0
##$YMAX_a= 630085
##$YMIN_a= -521559
##$ZGOPTNS= <>
##$ZL1= 120
##$ZL2= 120
##$ZL3= 120
##$ZL4= 120
##$ABSF1= 14.98509
##$ABSF2= -5.573092
##$ABSG= 5
##$ABSL= 3
##$ALPHA= 0
##$AQORDER= 0
##$ASSFAC= 0
##$ASSFACI= 0
##$ASSFACX= 0
##$ASSWID= 0
##$AUNMP= <proc_prof1d_extract_pilot.lims>
##$AXLEFT= 0
##$AXNAME= <>
##$AXNUC= <1H>
##$AXRIGHT= 0
##$AXTYPE= 0
##$AXUNIT= <>
##$AZFE= 0.1
##$AZFW= 0.1
##$BCFW= 0
##$BC_mod= 0
##$BYTORDP= 0
##$COROFFS= 0
##$CY= 15
##$DATMOD= 1
##$DC= 0
##$DFILT= <>
##$DTYPP= 0
##$F1P= 0
##$F2P= 0
##$FCOR= 0.5
##$FTSIZE= 32768
##$FT_mod= 6
##$GAMMA= 0
##$GB= 0
##$INTBC= 1
##$INTSCL= 1
##$ISEN= 128
##$LB= 0
##$LEV0= 0
##$LPBIN= 0
##$MAXI= 10000
##$MC2= 0
##$MEAN= 0
##$ME_mod= 0
##$MI= 0
##$NCOEF= 0
##$NC_proc= -8
##$NLEV= 6
##$NOISF1= 0
##$NOISF2= 0
##$NSP= 0
##$NTH_PI= 0
##$NZP= 0
##$OFFSET= 14.98509
##$PC= 1
##$PHC0= 91.8457
##$PHC1= 0
##$PH_mod= 1
##$PKNL= yes
##$PPARMOD= 0
##$PPDIAG= 0
##$PPIPTYP= 0
##$PPMPNUM= 2147483647
##$PPRESOL= 1
##$PSCAL= 4
##$PSIGN= 0
##$PYNMP= <proc.py>
##$REVERSE= no
##$SF= 400.02
##$SI= 32768
##$SIGF1= 0
##$SIGF2= 0
##$SINO= 400
##$SIOLD= 32768
##$SPECTYP= <>
##$SREGLST= <1H.CDCl3>
##$SSB= 0
##$STSI= 32768
##$STSR= 0
##$SW_p= 8223.68421052631
##$SYMM= 0
##$S_DEV= 0
##$TDeff= 65536
##$TDoff= 0
##$TI= <>
##$TILT= no
##$TM1= 0
##$TM2= 0
##$TOPLEV= 0
##$USERP1= <user>
##$USERP2= <user>
##$USERP3= <user>
##$USERP4= <user>
##$USERP5= <user>
##$WDW= 1
##$XDIM= 32768
##$YMAX_p= 448613346
##$YMIN_p= -724528
##$CURPLOT= <Network HP LaserJet P1505>
##$CURPRIN= <$Network HP LaserJet P1505>
##$DFORMAT= <normdp>
##$LAYOUT= <+/1D_H.xwp>
##$LFORMAT= <normlp>
##$PFORMAT= <normpl>
##$SURQMSG= 1
$$ End of Bruker specific parameters
$$ ---------------------------------
##NTUPLES= NMR SPECTRUM
##VAR_NAME=  FREQUENCY,     SPECTRUM/REAL,   SPECTRUM/IMAG
##SYMBOL=    X,             R,               I
##VAR_TYPE=  INDEPENDENT,   DEPENDENT,       DEPENDENT
##VAR_FORM=  AFFN,          ASDF,            ASDF
##VAR_DIM=   32768,         32768,           32768
##UNITS=     HZ,            ARBITRARY UNITS, ARBITRARY UNITS
##FACTOR=    0.250966925370066, 1,           1
##FIRST=     8223.43324360094, -127875,      -37135
##LAST=      0,             -121252,         -175059
##MIN=       0,             -724528,         0
##MAX=       8223.43324360094, 448613346,    0
$$ Real data points
##PAGE= N=1
##DATA TABLE= (X++(R..R)), XYDATA
$$ [...]
$$ plain form
19466 -79616 -149176 -120246 -110589 -61314 -69211 -62954 25935 -1671 61355 -97258 -214182 197395
19453 -350504 -52844 82152 57142 -77438 -229415 56465 -270671 -50838 -340782 118628 -99340
19441 170236 -141016 24816 -131989 -72892 -310758 -159638 -24498 22233 -119874 62779
19430 209757 -97169 -310285 8717 -80299 -73014 -295055 53004 -344995 346 38574 -42049 81255
19417 -199011 -72780 -315896 -104759 321239 -11619 112614 -112745 -159816 25639 -29317
19406 -146578 -25435 -232162 -27555 83864 404777 -394028 -200832 37959 -71035 26476 -228904
19394 -128561 -422702 -179692 5721 -103473 30313 -11591 -23597 52224 -3374 100425 37078
19382 -251460 -101504 105402 -76859 -163341 -78186 8198 -55403 54563 125625 -77432 261860
$$ packed form
19466g9616o9560K8930R657M9275p897O257B5935a671F1355i7258j16924A97395
19453c50504e2844H2152k5010g7438j51977E6465b70671e0838k89944A18628i9340
19441A70236a41016B4816a31989N9097k37866J51120b4498B2233a19874F2779
19430B09757i7169k13116H717h0299P285k22041E3004c44995C46L8228d2049H1255
19417a99011g2780k43116a04759C21239a1619A12614a12745m7071B5639b9317
19406a46578b5435k06727b7555H3864L20913c94028J93196C7959g1035B6476b28904
19394a28561k94141a79692E721a03473C0313a1591j2006E2224c374A00425C7078
19382b51460a01504A05402g6859q6482g8186H198e5403E4563P1062g7432B61860
$$ plain form
19370 339870 60980 27265 -398017 -70230 -83127 -82966 59587 -119399 -43221 -373857 78335
19358 49977 -47443 -131618 164884 -133360 137172 -129375 122698 15820 -222535 -179085
19348 -179085 -238255 -314755 155014 -36314 -218932 53245 -75177 -101301 43678 -481096 -124702
19336 -76286 -100629 30413 38879 -41503 -117647 -140993 -126600 -57557 31783 -106648 174702
19324 -175896 -72517 -224038 -208484 20645 226893 53702 292779 102103 -74862 -234289
19314 -234289 -94599 -172934 -517740 268837 -127677 -105907 -280220 -80270 -196167 40183
19303 -117062 158518 -220584 130430 -139707 -141242 -186120 222251 -77413 -6989 97649 -163921
19291 -17981 -170425 289588 -347274 -216560 72428 -151420 146725 143103 -103694 -57196
$$ packed form
19370C39870F0980B7265c98017g0230j2897J61E9587a19399d3221l30636G8335
19358D9977d7443q4175A64884a33360A37172a29375A22698A5820b22535M3450
19348a79085n9170p6500A55014c6314j82618E3245g5177k6124D3678d81096a24702
19336g6286k4343C0413Q466d1503p6144k3346J4393e7557C1783a06648A74702
19324a75896g2517j51521J5554B0645K06248E3702K39077A02103g4862j59427
19314b34289i4599p8335l44806B68837a27677K1770j74313h0270j15897D0183
19303a17062A58518b20584A30430a39707j535m4878B22251g7413f989I7649a63921
19291a7981j52444B89588c47274J30714G2428a51420A46725l622a03694M6498
$$ plain form
19281 -57196 -57525 -12197 -297522 -178144 -349836 -347740 -188446 -60906 -174957 -87243 71383
19269 -111606 -137972 33201 -152401 -6386 39177 -302361 -18108 177629 184516 -97219 3375
19257 -194263 111751 51121 38102 -271646 -342204 -76795 51993 -325620 87142 -154616 -188630
19246 -188630 -193659 247616 4745 -164604 -67574 -145023 -79604 -49999 121178 -89397 118783
19234 69051 1988 -178288 -382445 -369182 -276302 43956 -98593 73585 -141975 -79985 94590
19222 81056 294988 -140636 -128880 -233047 285661 -305364 -238779 -166421 29439 -31552 30439
19210 -44275 -5230 -228824 -148337 -357305 -15809 -107131 198558 -255443 241922 -258828 98557
19198 -96158 -231096 139984 -145169 -51741 33656 56908 -42048 -209429 20240 -131461 296445
$$ packed form
19281e7196l29a2197k85325J19378j71692K096J59294f0906j14051h7243G1383
19269a11606k6366C3201a52401f386C9177c02361a8108A77629O887i7219C375
19257a94263A11751E1121j3019b71646p0558g6795E1993c25620H7142a54616l4014
19246a88630n029B47616D745a64604f7574p7449O5419K9605A21178h9397A18783
19234F9051A988a78288k04157J3263R2880D3956i8593G3585a41975O1990I4590
19222H1056K13932a40636J1756j04167B85661c05364O6585P2358B9439c1552C0439
19210d4275e230k23594Q0487k08968a5809r1322A98558b55443B41922b58828I8557
19198i6158j34938A39984a45169e1741C3656K3252d2048j67381B0240a31461B96445
$$ plain form
19186 46530 162824 -8374 -240410 -120852 -211541 -184658 -91721 -110538 1829 -39817 86743
19174 -27056 -103625 259630 -53928 118707 -67547 70617 68528 131499 134547 -157206 -180335
19163 -180335 -109536 55248 -173472 -383930 -2960 209904 -281811 -229361 -51108 100881 333981
19152 333981 -222484 314971 -355015 -41815 -177960 -123179 210020 -144544 11337 -175642
19141 17063 -399961 119302 -34343 -14242 104097 218022 552 -129239 -111134 -195809 -123557
19130 -123557 -385703 -23587 193452 83744 20753 211808 -43229 131904 -295045 -219872
19120 -219872 -66237 -7518 -99254 96642 -286144 -52825 -306661 71661 81361 -166328 -120861
19109 -120861 -40008 -319394 -76608 -306180 307081 -69765 109270 81350 -41089 10119 -387898
$$ packed form
19186D6530J16294h374k32036J19558r0689K6883i1721j8817A829c9817H6743
19174b7056p6569B59630e3928A18707f7547G0617k089O2971L048a57206k3129
19163a80335P0799E5248a73472k10458b960B09904b81811N2450e1108A00881K33100
19152C33981b22484C14971c55015d1815j36145N4781B10020a44544A1337a75642
19141A7063c99961A19302c4343a4242A04097J13925E52a29239J8105q4675P2252
19130a23557k62146b3587A93452H3744B0753J91055d3229A31904b95045P5173
19120b19872f6237g518r1736I6642b86144e2825k53836G1661R700a66328M5467
19109a20861d0008k79386g6608k29572C07081f9765A09270k7920d1089A0119c87898
$$ plain form
19097 -158266 -63591 -44246 -275573 102896 -132220 183347 -46202 51024 -78724 26787 325147
19086 325147 -68075 -70316 11878 -312533 -109668 150391 198514 -101498 -282335 -136652
19075 82538 -113585 -146570 -218319 -119302 -109333 -82722 -251118 122626 -83377 -71665 -145487
19064 -145487 -194193 174196 -84924 -2607 -221846 -135320 -169392 -164420 174095 -49851 -68477
19053 -68477 -62699 138185 -63881 289232 143974 -106369 -196012 127576 160779 24129 -239874
19041 171230 -206195 236642 182426 -66753 -184034 8811 -51736 -298961 120077 -209456
19030 12862 -39690 -114077 82645 40504 12908 445663 51427 162793 174809 -10485 -34868
19019 -34868 -117876 -293471 -267438 114740 -97271 47911 -50465 146590 -22654 -346735 -337983
$$ packed form
19097a58266f3591J9345k31327A02896a32220A83347d6202E1024g8724B6787K98360
19086C25147f8075k241A1878c12533a09668A50391M8123a01498j80837a36652
19075H2538a13585l2985p1749R9017R969K6611j68396A22626h3377J1712p3822
19064a45487m8706A74196h4924b607k19239Q6526l4072M972A74095d9851j8626
19053f8477N778A38185f3881B89232A43974a06369q9643A27576L3203B4129b39874
19041A71230b06195B36642n4216f6753j17281H811e1736k47225A20077b09456
19030A2862c9690p4387H2645D0504A2908M32755E1427J11366J2016a0485k4383
19019c4868q3008j75595K6033A14740i7271D7911e0465A46590b2654l24081Q752
$$ plain form
19008 -337983 167955 -101148 -213070 -42101 133697 12190 113013 -14842 -260107 -221832
18998 -221832 -464671 -219277 -62425 101779 -141450 41225 9796 29743 -151594 24158 -437571
18986 -104437 -101392 -20554 79149 16958 -327527 226499 -140724 255203 154146 128000 -261643
18974 -16543 -149985 -30032 -101450 -45033 -28737 374518 460132 111828 64078 56735 48948
18963 48948 166933 21280 -285267 -144613 -54803 63144 49280 -29446 73078 -57845 -100541
18952 -100541 -122416 34200 -271104 161308 107289 -123453 -253906 -58581 29398 -189170
18941 -25445 -164934 -247216 -127475 -276321 55699 -43481 41544 -384997 -5515 146420 172496
18930 172496 -45946 -190764 21207 -165697 291659 258651 109673 -21978 -178902 293117
$$ packed form
19008c37983A67955a01148j11922d2101A33697A2190J00823a4842k45265L8275
18998b21832k42839b19277f2425A01779a41450D1225I796J9947a51594B4158d37571
18986a04437L045b0554G9149A6958c27527B26499a40724B55203j01057k6146b61643
18974a6543j33442c0032p1418d5033J6296C74518Q5614A11828m7750p343p787
18963D8948J17985B1280b85267J40654e4803F3144j3864b9446G3078e7845m2696
18952a00541k1875C4200b71104A61308n4019a23453j30453e8581B9398a89170
18941b5445j39489q2282J19741j48846E5699d3481D1544c84997e515A46420K6076
18930A72496d5946j44818B1207a65697B91659l3008A09673b1978j56924B93117
$$ plain form
18919 -218321 143147 -128835 -42548 30825 -195792 417 -178480 15044 -98500 230224 -33666
18907 -92060 94511 298052 423594 -10649 157380 -466581 122257 -298000 155707 -211608
18896 119529 161618 46311 -165908 -92240 31546 133380 -95323 40703 -379202 -107253 -162366
18885 -162366 20258 -61279 -301470 -23811 -101383 -229038 21014 -172610 -163868 -122436 -31004
18873 160544 -185400 341068 -101292 -39796 -27245 -55044 -75229 -230847 130317 -68527
18862 -15013 12485 -127017 46279 -123413 -88429 251768 -155381 -133391 -48432 -310300 -459004
18851 -459004 100410 -143294 107977 161056 215573 169212 193889 -141326 139379 -121039
18840 303864 -209808 3159 432830 -19852 27322 -128660 3097 25775 -193689 -122434 -217024
$$ packed form
18919b18321A43147a28835d2548C0825a95792D17a78480A5044i8500B30224c3666
18907i2060I4511K03541J25542a0649A57380d66581A22257b98000A55707b11608
18896A19529M2089D6311a65908P3668C1546J01834i5323D0703c79202a07253n5113
18885a62366B0258f1279k40191b3811p7572j27655B1014a72610Q742M1432c1004
18873A60544a85400C41068a01292c9796J2551k7799k0185j55618A30317f8527
18862a5013A2485a27017D6279a23413L4984B51768a55381K1990d8432k61868j48704
18851d59004A00410a43294A07977N3079N4517m6361K4677a41326A39379a21039
18840C03864b09808C159M29671a9852B7322a28660C097K2678a93689P1255r4590
$$ plain form
18829 -217024 -45440 -35898 60333 -173098 -97454 -10158 1260 114572 -155248 106609 -58482
18817 -103276 -17778 -46734 34880 208015 -211367 157883 -2364 251465 231874 26628 -21667
18805 372909 -30736 -213492 -180796 36318 110682 216386 235723 -293279 120049 -158485
18794 44752 168096 97363 -56552 -234061 103135 71828 -22404 -138207 56551 22002 -177643
18782 75552 -205688 -164682 -118240 -37305 -146906 -124523 44454 203547 161108 -90176 193494
18770 -277621 -218707 -265332 6127 -30207 25121 -291205 86755 -282827 -125696 94490 -117309
18758 -19836 -117151 -70223 30863 7493 -99035 165201 48315 111107 -125284 -207134 -15101
18746 -219927 64957 28890 -18984 -200006 110640 -154118 -145720 -161642 -279911 -82903 71249
$$ packed form
18829b17024d5440R542F0333a73098P5644a0158A260J13312a55248A06609e8482
18817a03276a7778k8956C4880J73135b11367A57883b364B51465j9591B6628b1667
18805C72909c0736j82756L2696C6318P4364J05704J9337b93279A20049a58485
18794D4752J23344p0733e6552j77509A03135l1307b2404j15803E6551B2002a77643
18782G5552b05688M1006M6442c7305j09601K2383D4454J59093m2439i0176A93494
18770b77621N8914m6625F127c0207B5121b91205H6755b82827a25696I4490a17309
18758a9836r7315M6928C0863G493i9035A65201D8315O2792a25284q1850a5101
18746b19927F4957B8890a8984j81022A10640a54118Q398j5922j18269h2903G1249
$$ plain form
18734 61235 -275610 -236134 28770 -51894 -169849 -56019 9698 -182589 -19942 -108839 -204225
18723 -204225 -75384 -27745 68236 67002 -42263 -1859 -47342 -77041 171841 -233731 -5178 -165680
18711 -165680 -100805 -161849 -387258 300533 220306 16027 91097 62557 -138835 -336141 -6606
18699 30441 4510 22743 -237192 54013 -74493 -233076 84731 -98762 9608 269735 -54768
18687 -172383 116662 -224706 48879 319530 -36261 -240268 -279406 138726 26527 -14290
18676 -16841 219757 -334165 25492 -309882 247135 142042 171083 -86634 -181723 -278045 -106681
18664 -65646 150618 47335 -415849 274190 86060 -325189 -150206 -18159 -88862 -36032 -65807
18653 -65807 -310878 -72920 -152711 -202803 159134 1901 -55794 -257056 193491 158097 113022
$$ packed form
18734F1235b75610L9476B8770e1894j17955e6019I698a82589a9942q8897r5386
18723b04225g5384b7745F8236j234d2263a859m5483k9699A71841b33731e178j60502
18711a65680O4875o1044k25409C00533q0227A6027P5070k8540a38835j97306f606
18699C0441D510J8233b37192E4013g4493j58583H4731i8762I608K60127e4768
18687a72383A16662b24706D8879K70651c6261k04007l9138A38726B6527a4290
18676a6841B19757c34165B5492c09882B47135j05093K9041h6634r5089r6322a06681
18664f5646A50618D7335d15849B74190H6060c25189a50206a8159p0703c6032k9775
18653f5807k45071g2920p9791n0092A59134A901e5794k01262A93491l5394m5075
$$ plain form
18642 113022 -95539 -155286 -42234 -146979 -139337 -161766 139973 -277893 42026 -216378 151559
18630 -178961 -79400 -184612 -131838 17167 75095 -53460 38215 -62507 -47947 334591 -92377
18618 30491 269418 87320 -335208 -49637 72059 260684 68198 -70238 -101989 44820 -5376
18606 -113263 72612 41176 273099 127979 -37748 -86866 -30409 84298 134201 -44524 210537
18594 -187621 78512 -330744 -294015 85406 -319905 84939 -168976 -483082 -15981 -136922
18584 -136922 -55486 -204762 -212962 -194413 -42654 -4582 -178536 83173 61787 262988 256160
18573 256160 737 -323012 -44121 -103038 336389 -386874 79180 -200481 -344710 -218057 -107980
18561 151720 118932 -166179 10593 99461 82946 -113466 301780 -290549 -67989 -183648
$$ packed form
18642A13022i5539n9747d2234j04745P642k2429A39973b77893D2026b16378A51559
18630a78961g9400j05212N2774A7167N7928e3460C8215f2507J4560C34591i2377
18618C0491K38927H7320c35208d9637G2059J88625F8198g0238l1751D4820e376
18606a13263G2612l1436K31923A27979c7748m9118c0409H4298M9903d4524B10537
18594a87621G8512c30744L6729H5406c19905H4939a68976l14106a5981j20941
18584a36922e5486j49276q200J8549d2654d582j73954H3173k1386K01201o828
18573B56160G37c23012d4121n8917C36389c86874G9180b00481j44229J26653a07980
18561A51720l2788a66179A0593Q8868j6515a13466C01780b90549f7989j15659
$$ plain form
18551 -183648 216879 -345704 14235 -119447 175438 91935 -196228 18207 -322857 -74172
18540 118634 645 -3556 31030 78386 235868 -248484 114928 102184 -99651 2121 -121775
18528 239275 -114972 -173123 68067 -164788 -140142 -137953 -276192 178349 -138102 30940 24584
18517 24584 52835 -230282 138288 47932 112914 5429 -142518 152420 15245 -380447 -96934
18505 97962 -57552 -166112 310921 258208 -202654 -12328 178688 180260 -51248 -120062 114439
18493 23742 -209490 -37549 -64760 8538 -57450 -184578 -161434 -175922 110495 -84217 -185084
18482 -185084 -297007 -217939 -173843 141720 27539 -35266 290703 -95334 -41461 -328589 18620
18470 -228267 -23660 91516 32204 -113667 103675 5282 -42137 -218521 -36053 56997 196634
$$ packed form
18551a83648B16879c45704A4235a19447A75438q3503a96228A8207c22857g4172
18540A18634F45c556C1030M7356J57482b48484A14928j2744i9651B121a21775
18528B39275a14972n8151F8067a64788K4646K189j38239A78349a38102C0940o356
18517B4584K8251b30282A38288D7932O4982E429a42518A52420A5245c80447i6934
18505I7962e7552j08560C10921n2713b02654a2328A78688J572e1248o8814A14439
18493B3742b09490c7549k7211H538e7450j27128K3144j4488A10495h4217j00867
18482a85084j11923P9068M4096A41720B7539c5266B90703i5334d1461k87128A8620
18470b28267b3660I1516C2204a13667A03675E282d2137j76384c6053E6997J39637
$$ plain form
18459 196634 69790 -14944 160226 143032 71673 -21230 1864 59712 244389 141756 52439
18447 -57637 21093 -320713 -4993 -47195 128773 -87004 110461 -348838 -62739 -172003 -184219
18436 -184219 -426612 142374 -172315 175632 -400294 16376 -68574 -5935 -196149 151983
18425 130864 94533 66059 236913 -78176 -214839 -135584 -58732 159087 184115 316017 -34291
18413 299322 -91060 40412 185164 224686 319612 8185 221002 -10802 79389 13909 88163
18402 88163 19552 85377 -120745 -26957 73722 -78915 128523 248735 -87328 -261129 22662
18390 126073 56531 -178811 32845 1253 9045 454544 -196975 -40487 -109270 -45096 -143811
18379 -143811 261926 29345 -57369 -117639 -64733 166930 -71591 247662 67127 -166563 26934
$$ packed form
18459A96634F9790a4944A60226j7194p1359b1230A864N7848J84677j02633E2439
18447e7637B1093c20713d993m2202A28773h7004A10461c48838f2739j09264j2216
18436a84219k42393A42374a72315A75632d00294A6376f8574e935j90214A51983
18425A30864l6331k8474J70854g8176j36663P9255e8732A59087K5028J31902c4291
18413B99322i1060D0412J44752L9522R4926H185K12817a0802G9389A3909P4254
18402H8163A9552O5825a20745b6957G3722g8915A28523J20212h7328j73801B2662
18390A26073E6531a78811C2845A253P792M45499a96975d0487o8783d5096r8715
18379a43811B61926B9345e7369o0270N2906A66930g1591B47662F7127a66563B6934
$$ plain form
18367 -42956 -61383 101528 226559 -195284 344588 -157271 91549 -1364 240877 198980 212654
18356 212654 -55918 -302247 -66151 88736 -117274 -159809 -75306 3933 -37762 -223947 -92403
18344 -152680 -172906 -143299 42077 -99035 47485 -59556 102836 -128333 131674 17302 153863
18333 153863 -136171 132197 136413 -133829 -349029 -126932 -84811 -34661 -10501 183853
18322 -141164 -136510 234465 89129 -17503 -204485 -430218 -309532 -166916 -132373 -121916 21331
18310 204238 -18179 -168656 119205 103543 -152528 -203776 185545 -212730 32604 -78131
18299 34135 -102577 233491 -17617 -148166 -71993 -138046 174324 -34025 75190 2271 -398229
18287 22567 -228387 -195284 -240111 -85168 104707 207346 -512841 -135775 84958 -364088
$$ packed form
18367d2956j8427A01528J25031a95284C44588a57271I1549a364B40877m1897J3674
18356B12654e5918k46329f6151H8736a17274m2535g5306C933c7762j86185i2403
18344a52680k0226K9607D2077i9035D7485e9556A02836a28333A31674A7302J36561
18333A53863a36171A32197M216a33829k15200a26932M2121c4661a0501A83853
18322a41164M654B34465H9129a7503j86982k25733J20686J42616L4543J0457B1331
18310B04238a8179j50477A19205j5662a52528n1248A85545b12730C2604g8131
18299C4135a02577B33491a7617j30549g1993o6053A74324c4025G5190B271c98229
18287B2567b28387L3103m4827h5168A04707J02639e12841a35775H4958c64088
$$ plain form
18276 -69434 79816 -142107 -21012 -52963 -190731 -47046 95259 -181317 -225648 -554518 108521
18264 328197 166565 -372690 -136816 -200074 -450091 -102974 86718 31461 -25858 20794
18253 -14755 -312803 155782 -152524 66387 59320 142128 -254341 -58981 -225905 -65956 122431
18241 103 -31995 -222658 -29779 -139004 -7886 -207647 -12472 -67725 254682 57799 -69204
18229 48234 591994 -22511 -108462 -274601 -25183 -91593 74380 85335 111111 3586 -54198
18217 360872 -195987 9462 11294 -83197 -161188 -388002 157696 37814 -72652 -56871 191125
18205 59072 -45566 -195954 264155 7308 -181399 292801 117136 -121559 332309 -78604
18194 -68646 97984 202283 -87138 380040 170341 100096 -59866 84684 112584 279335 -81655
$$ packed form
18276f9434G9816a42107b1012l1951j37768d7046I5259a81317m4331l28870A08521
18264C28197j61632c72690a36816o3258k50017a02974H6718C1461b5858B0794
18253a4755k98048A55782a52524F6387p067Q2808b54341e8981j66924f5956A22431
18241A03c1995j90663b9779j09225g886j99761a2472n5253B54682E7799f9204
18229D8234N43760b2511q5951j66139b5183o6410G4380J0955K5776C586e4198
18217C60872a95987I462J832h3197p7991k26814A57696C7814g2652J5781A91125
18205E9072d5566j50388B64155G308a81399B92801A17136a21559C32309g8604
18194f8646I7984J04299h7138C80040A70341p0245e9866H4684K7900J66751h1655
$$ plain form
18182 -11218 51337 27812 66204 -339195 -380773 -235172 291709 -158024 128792 -115877
18171 137669 -22577 342375 -131678 -180881 -122990 148704 19677 165929 8960 8761 -130432
18159 -200042 -302701 -90006 -36878 149760 74272 -61440 -141407 -357643 -100439 -9099 169823
18147 378453 -35668 71735 200860 -239339 16511 -81910 5235 -11590 -109452 -73990 -57954
18136 -57954 -193498 -281226 -72278 245714 -113938 -215690 65066 -60620 72515 -18525 221040
18124 288945 163065 -173931 -82807 27122 -154412 68724 348828 -42028 132592 -131504
18113 -196953 27356 -65751 42631 -49325 -55672 204423 -184135 -122283 -73540 -100212 -135492
18102 -135492 -119943 -171406 -164209 -68259 12463 -58892 -55813 -165992 -444388 -19671 -170676
$$ packed form
18182a1218E1337k3525L8392c39195m1578J45601B91709a58024A28792a15877
18171A37669b2577C42375a31678m9203N7891A48704A9677J46252H960j99a30432
18159b00042j02659i0006c6878A49760G4272f1440p9967k16236a00439i099A69823
18147C78453c5668G1735J29125b39339A6511h1910E235a1590r7862L5462J6036
18136e7954j35544q7728g2278B45714a13938j01752F5066f0620G2515a8525B21040
18124B88945j25880a73931h2807B7122a54412F8724K80104d2028A32592a31504
18113a96953B7356f5751D2631d9325o347B04423a84135O1852M8743k6672l5280
18102a35492J5549n1463P197f8259A2463e8892L079j10179k78396a9671j51005
$$ plain form
18091 -170676 7611 270815 -305873 79385 -263610 209703 -35022 -143241 -7467 -221122 379802
18079 -6011 15953 -17424 39131 -107946 44455 210895 -218690 20796 -169017 -117718 222640
18067 119499 -68564 -150516 -184365 289215 15861 -55327 391955 -71568 210132 -136085 20296
18055 -209668 169812 223460 20056 -313985 319756 -55156 -260305 131764 93583 -113703
18044 -182124 -176635 -133826 -315095 87570 -118399 129855 -55543 388548 27644 -103846 -303053
18033 -303053 -46674 -410358 140978 259394 -71793 -213972 -198152 -153784 124902 -183265
18022 -163110 51574 -165767 -134350 41512 112806 38896 -84193 67624 -81889 256358 21826
18010 318310 -152732 59999 469933 153107 -72763 109818 299020 -57406 -22988 -138820
$$ packed form
18091a70676G611K63204c05873G9385b63610B09703c5022j08219g467k13655C79802
18079f011A5953a7424C9131a07946D4455J66440b18690B0796a69017N1299B22640
18067A19499f8564q1952l3849B89215A5861e5327C91955g1568B10132a36085B0296
18055b09668A69812N3648B0056c13985C19756e5156k05149A31764l8181a13703
18044a82124N489M2809j81269H7570a18399A29855e5543C88548B7644a03846j99207
18033c03053d6674l63684A40978J18416g1793j42179J5820M4368A24902a83265
18022a63110E1574a65767L1417D1512P1294C8896h4193F7624h1889B56358B1826
18010C18310a52732E9999M09934A53107g2763A09818J89202e7406b2988j15832
$$ plain form
18000 -138820 -27777 175262 -155368 373184 -93003 -61470 -174001 -170035 -181835 68019 61809
17989 61809 -180560 119510 -171944 -150651 115453 -39368 241328 -19009 -90357 102619
17978 86509 154426 52990 -5965 -159174 -187913 -2529 107485 -154205 201913 116017 27787
17966 -32735 -46954 151727 -111999 327 332566 -37668 -127976 -246670 -167770 69471 -397740
17954 -40405 108511 268100 -75896 36480 46581 61686 -88774 31300 323387 233676 1532
17942 173160 -16343 -312967 122622 -187437 -69697 294128 172873 -120673 -38899 -70296
17932 -70296 -87805 367759 -3513 -112229 12602 211157 196754 97298 -247103 1733 160907
17921 160907 195791 -90865 -5280 157022 -64244 -381876 3379 135719 -34588 118259 324547
$$ packed form
18000a38820b7777A75262a55368C73184i3003L1533j12531L966j1800F8019o210
17989F1809a80560A19510a71944K1293A15453c9368B41328a9009p1348A02619
17978H6509O7917E2990e965j53209k8739b529A07485a54205B01913q5896B7787
17966c2735j4219A51727a11999C27L32239c7668r0308j18694P8900F9471c97740
17954d0405A08511J59589g5896C6480J0101J5105h8774C1300K92087q9711A532
17942A73160a6343k96624A22622a87437f9697B94128j21255a20673c8899l1397
17932g0296j7509C67759c513j08716A2602J98555j4403I7298b47103A733J59174
17921A60907L4884i0865e280A57022f4244l17632C379J32340c4588A18259K06288
$$ plain form
17910 324547 60606 -54575 424417 -139110 11098 -29067 -46644 57625 407710 -9932 39196
17898 -210810 -264510 93872 64926 52750 -78688 146739 -412806 -18544 121071 34020 36576
17887 36576 207441 177730 370435 -111667 -261813 91342 -151067 134189 167251 -94303
17876 83353 44782 215856 88593 -89468 147769 -125305 94518 -300930 227377 -80510 149855
17864 -95942 -62461 191843 81639 115163 -16494 44661 -176298 -88127 193713 6282 262365
17853 262365 -60537 73050 -45296 122280 3903 201533 -41849 348635 -485892 -93131 -316024
17842 -316024 -89052 8229 -13223 -19764 62371 107794 62377 74209 26959 53967 101762 468154
17830 468154 19970 42163 14118 -69478 52757 -6656 73643 -139920 107906 -57099 124530
$$ packed form
17910C24547F0606e4575D24417a39110A1098b9067j7577E7625L50085i932C9196
17898b10810n3700I3872k8946j2176g8688A46739d12806a8544A21071C4020K556
17887C6576J70865k9711J92705a11667j50146I1342a51067A34189L3062i4303
17876H3353l8571J71074H8593h9468A47769a25305I4518c00930B27377h0510A49855
17864i5942L3481A91843H1639L3524a6494D4661a76298h8127A93713F282K56083
17853B62365f0537G3050d5296A22280C903J97630d1849C48635d85892i3131k22893
17842c16024h9052H229a3223o541F2371M5423m5417J1832B6959K7008M7795L66392
17830D68154A9970K2193A4118f9478E2757f656G3643a39920A07906e7099A24530
$$ plain form
17818 86963 -81402 269279 -51153 -237912 -4911 129970 175617 -290843 148167 264736 351598
17807 351598 -185773 340644 -17027 114411 310268 30585 344785 144786 -37407 88842
17796 103131 235621 -127253 -51833 114074 -51074 -315511 141258 260492 -104562 252623
17785 203411 176110 253829 12734 151070 203778 454977 -136104 -73928 40795 -168026 389216
17773 -77370 226456 -106070 -33347 236427 -76700 180824 435685 126820 223002 65125
17762 112598 398517 -289304 398195 67734 -86960 60626 193730 177033 27770 41690 248980
17751 248980 19573 106718 58209 201883 192516 195169 403571 38184 -40763 106983 -154554
17739 103522 -441619 115538 200108 43002 108114 125903 42102 217333 213889 106114 122857
$$ packed form
17818H6963h1402B69279e1153j86759d911A29970M5647b90843A48167J16569Q6862
17807C51598a85773C40644a7027A14411J95857C0585L14200A44786c7407H8842
17796A03131J32490a27253e1833A14074e1074k64437A41258J19234a04562B52623
17785B03411k7301P7719A2734J38336N2708K51199a36104O2176D0795a68026C89216
17773g7370B26456a06070c3347B36427g6700A80824K54861A26820R6182F5125
17762A12598K85919b89304C98195F7734h6960F0626J33104j6697B7770J3920K07290
17751B48980A9573Q7145m8509J43674r367K653K08402C8184d0763A06983a54554
17739A03522d41619A15538Q4570D3002O5112J7789D2102J75231l444A06114J6743
$$ plain form
17728 122857 -240359 -18769 254968 -77133 -49692 -43302 45188 -222871 -127637 113147 52178
17716 75098 -157007 -106873 -194138 205097 -18876 569531 -146239 -72925 150364 292793
17706 292793 -8867 189066 60491 60375 16386 76951 -153395 96471 108971 139462 -19255 88787
17693 317385 -144015 159587 55604 86748 191194 88439 -82730 139600 157132 356926
17683 356926 592896 32496 185622 333674 172553 71328 230633 136042 198075 388836
17673 388836 221336 438972 315064 291760 414974 -20966 -272447 43637 210829 -152278
17662 223832 145932 139088 138440 117516 -91573 93137 33129 191992 4188 273273 87708 167862
17650 167862 6702 -63648 482179 267438 226324 111829 136328 315137 55656 -142758 244143
$$ packed form
17728A22857b40359a8769B54968g7133K7441O390D5188b22871R5234A13147E2178
17716G5098a57007N0134q7265B05097a8876E69531a46239g2925A50364J42429
17706B92793h867A89066F0491j16A6386O0565a53395I6471J2500L0491a9255H8787
17693C17385a44015A59587E5604L1144J04446H8439h2730A39600J7532J99794
17683C56926K35970C2496J53126J48052j61121G1328J59305r4591O2033J90761
17673C88836j67500K17636j23908k3304J23214b0966k51481D3637J67192a52278
17662B23832p7900o844o48k0924i1573I3137C3129J58863D188K69085H7708Q0154
17650A67862F702f3648D82179k14741m1114A11829K4499J78809E5656a42758B44143
$$ plain form
17638 310789 224254 198393 164470 -418581 -105693 -78645 74199 292111 -116128 -106758 212615
17626 67130 -16263 372231 -127336 435017 339265 70683 137474 23116 90530 -3619 -143558
17615 -143558 -137664 225942 196155 286081 157056 27880 214874 364261 90921 302659 138957
17603 148027 279222 -204157 307120 269252 278253 200052 233822 -137044 247653 234497 145408
17592 145408 379412 225975 139446 66178 246624 141456 30940 175125 -98475 331373
17581 -37838 -140307 -117274 230420 66879 321398 153519 119737 76868 200946 -144637
17570 94429 122242 -158906 139105 -28587 -58369 396406 67039 489359 -6483 306955 -6842
17558 27934 167931 298198 146866 345172 -30259 141266 363144 136233 147652 188188
$$ packed form
17638C10789q6535k5861l3923d18581a05693K7048G4199K17912a16128R370B12615
17626F7130a6263C72231a27336D35017r5752G0683O6791B3116O7414c619j39939
17615a43558N894B25942k9787Q9926j29025B7880J86994J49387I0921K11738A38957
17603A48027J31195b04157C07120l7868R001p8201L3770a37044B47653j3156q9089
17592A45408K34004j53437q6529F6178J80446j05168C0940J44185i8475C31373
17581c7838j02469K3033B30420F6879K54519A53519l3782m2869J24078a44637
17570I4429K7813a58906A39105b8587k9782C96406F7039M22320f483C06955f842
17558B7934J39997J30267A46866J98306c0259A41266K21878A36233J1419M0536
$$ plain form
17548 188188 190674 313827 276128 363862 1038 301817 207320 298558 221691 401157 335567
17537 335567 271612 198967 101829 144815 329850 145038 455777 447464 203976 548651 345194
17526 345194 387375 451500 568989 745545 803964 863025 696471 629971 307789 275583 250068
17515 250068 424096 375704 104610 365816 247376 684474 625733 477224 765776 922915
17505 922915 383405 360904 716707 557491 405776 401254 420968 146756 72908 -39415 112037
17493 379971 393714 312444 252046 427831 453319 121641 605686 462618 -113422 253440
17482 51836 54747 471490 290169 474372 269546 218726 369947 23060 321814 426967
17472 426967 624354 100099 573503 -109746 329041 212839 -10511 205881 334426 263308
$$ packed form
17548A88188K486J23153l7699Q7734A038L00779r4497R1238p6867J79466o5590
17537C35567o3955p2645r7138M2986J85035A45038L10739q313B03976L44675k03457
17526C45194M2181O4125J17489J76556N8419N9061j66554o6500C07789l2206k5515
17515B50068J74028m8392A04610K61206j18440M37098n8741j48509K88552J57139
17505I22915C83405k2501L55803j59216j51715m522J9714A46756G2908c9415A12037
17493C79971J3743q1270o0398J75785K5488A21641M84045j43068a13422B53440
17482E1836K911M16743j81321J84203k04826n0820J51221B3060K98754J05153
17472D26967J97387A00099M73404a09746C29041j16202a0511B05881J28545p1118
$$ plain form
17462 263308 135948 -34494 173118 -23530 235623 157151 258560 113382 240819 335871
17452 335871 380850 234476 300288 523020 443944 326475 575404 719783 473488 664316
17442 664316 652149 300424 291513 632283 223732 347420 425669 244308 122439 241748
17432 241748 391068 293611 503097 558372 565680 296646 110355 128858 177236 381490 277564
17421 277564 365783 257200 185330 695917 628961 398693 453820 421068 692683 523033
17411 523033 537113 458762 400703 352383 324535 35429 320959 252763 338506 259578 300129
17400 300129 288593 24373 439838 183141 255546 265014 131207 119805 501720 164838 310211
17389 310211 188939 393074 114355 249195 39847 321580 38467 420125 225273 281472
$$ packed form
17462B63308j27360c4494A73118b3530B35623p8472J01409A13382J27437R5052
17452C35871M4979j46374O5812K22732p9076j17469K48929J44379k46295J90828
17442F64316j2167C00424q911L40770B23732J23688P8249j81361j21869J19309
17432B41748J49320r7457K09486N5275P308k69034A10355J8503M8378K04254j03926
17421B77564Q8219j08583p1870N10587o6956k30268N5127l2752K71615j69650
17411E23033J4080p8351n8059m8320k7848C5429K85530o8196Q5743p8928M0551
17400C00129j1536B4373M15465A83141P2405R468A31207j1402L81915A64838J45373
17389C10211j21272K04135A14355J34840C9847K81733C8467L81658j94852N6199
$$ plain form
17379 281472 319481 339384 384376 303743 403299 192436 305026 355234 343908 259295 8341
17367 112564 301805 390989 244230 539281 318488 422869 203336 329898 318230 150654
17356 314746 222374 201345 53571 166962 222405 552447 214939 497313 102433 286039
17346 286039 531655 228645 680190 191159 592885 653287 241808 90480 440154 411762
17336 411762 366656 148253 5802 432081 228683 652248 141642 619566 -83928 264298
17325 270832 109809 375299 327163 500340 511902 282399 108310 485188 185437 107369
17315 107369 613715 312390 340894 326884 352854 303175 44336 223673 107076 439078
17305 439078 362488 639214 319974 281637 517613 475018 330603 545567 454068 385309
$$ packed form
17379B81472L8009J9903M4992q0633R9556A92436J12590N0208j1326q4613H341
17367A12564J89241Q9184j46759K95051k20793J04381B03336J26562j1668A50654
17356C14746r2372k1029E3571J13391N5443L30042B14939K82374A02433J83606
17346B86039K45616B28645M51545A91159M01726O0402B41808I0480L49674k8392
17336D11762m5106A48253E802M26279k03398M23565A41642M77924h3928B64298
17325B70832A09809K65490m8136J73177J1562k29503A08310L76878A85437p8068
17315A07369N06346l01325K8504j4010K5970m9679D4336J79337A07076L32002
17305D39078p6590K76726l19240l8337K35976m2595j44415K14964r1499o8759
$$ plain form
17295 385309 345795 451661 331735 490134 562256 513885 51092 276260 538147 164646
17284 205873 444127 168057 -132871 333937 246402 406896 366604 352584 370602 351721
17274 351721 256180 403684 485650 429607 530156 285694 279960 597324 697760 450029
17264 450029 186831 337912 823226 284418 452399 487475 257833 312797 409408 318330
17254 318330 314240 430805 205397 473927 446411 236482 676568 552814 688474 455084
17244 455084 393230 474692 315999 282462 180260 307616 387649 307504 584653 582851 324139
17233 324139 322680 498570 348745 551713 573382 557702 392062 11873 294136 564063
17223 564063 757799 522503 504738 345747 677908 376760 604410 329206 649052 533158
$$ packed form
17295C85309l9514J05866j19926J58399P2122m8371E1092K25168K61887A64646
17284B05873K38254A68057a32871C33937q7535J60494m0292j4020J8018j8881
17274C51721r5541J47504Q1966n6043J00549k44462n734L17364J00436k47731
17264D50029A86831J51081M85314B84418J67981L5076k29642N4964R6611r1078
17254C18330m090J16565B05397K68530k7516k09929M40086j23754J35660k33390
17244D55084o1854Q1462j58693l3537j02202J27356Q0033q0145K77149j802k58712
17233C24139j459J75890j49825K02968K1669j5680j65640A1873K82263K69927
17223E64063J93736k35296j7765j58991L32161l01148K27650k75204L19846j15894
$$ plain form
17213 533158 467704 850460 650141 745722 376862 695872 383224 557700 505817 619681
17203 619681 388833 624602 302792 737001 645946 561533 413857 327536 721228 421187
17193 421187 570716 765871 495274 847582 562159 641401 245630 628372 432752 324089
17183 324089 587253 469110 554844 603513 275083 919281 764670 614781 556081 652740
17173 652740 758706 723232 608490 658806 538769 521014 665267 691796 385045 294830
17163 294830 637748 830288 520881 1029334 780023 729314 751475 590873 735267 437422
17153 437422 648523 732968 112260 755258 756650 760124 664635 735989 514378 480630 666433
17142 666433 830689 758592 428978 708560 736883 911068 570360 650239 912804 737541
$$ packed form
17213E33158o5454L82756k00319R5581l68860L19010l12648J74476n1883J13864
17203F19681k30848K35769C02792M34209r1055q4413j47676q6321L93692l00041
17193D21187J49529J95155k70597L52308k85423P9242B45630L82742j95620j08663
17183C24089K63164j18143Q5734M8669B75083O44198j54611j49889n8700R6659
17173F52740J05966l5474j14742N0316j20037j7755J44253K6529l06751r0215
17163B94830L42918J92540l09407N08453k49311n0709K2161j60602J44394k97845
17153D37422K11101Q4445A12260O42998J392L474r5489P1354k21611l3748J85803
17142F66433J64256p2097l29614K79582K8323J74185l40708P9879K62565j75263
$$ plain form
17132 737541 892401 539456 647102 829576 490820 666516 591980 471863 609502 875650
17122 875650 377198 951688 924962 780377 739574 773842 743547 633328 589570 857122
17112 857122 904966 877464 723594 951252 577182 661657 1101072 426607 784719 991398
17102 991398 1217194 825631 730311 1009777 927869 1123804 905264 824919 968266 820548
17092 820548 966126 839023 884852 765163 949036 1150465 796049 1034222 613687 988705
17082 988705 1030680 1103050 491032 970026 1108109 830925 968548 1280495 1058235 1335974
17072 1335974 974743 921556 1248371 1283853 1147930 1240291 1020394 1114604 1014565 1173627
17062 1173627 1256951 1313550 978914 1082036 1048131 1145847 1042933 894112 1215349 1290209
$$ packed form
17132G37541J54860l52945J07646J82474l38756J75696p4536j20117J37639K66148
17122H75650C77198N74490k6726j44585m0803L4268l0295j10219m3758K67552
17112H57122M7844k7502j53870K27658l74070Q4475M39415D26607L58112K06679
17102I91398K25796l91563r5320K79466q1908J95935k18540q0345J43347j47718
17092H20548J45578j27103M5829j19689J83873K01429l54416K38173m20535L75018
17082I88705M1975P2370D91032M78994J38083k77184J37623L11947k22260K77739
17072A335974l61231n3187L26815L5482j35923R2361k19897R4210j00039J59062
17062A173627Q3324N6599l34636J03122l3905R7716j02914j48821L21237P4860
$$ plain form
17052 1290209 1247521 1135602 1527248 1355810 943983 1361296 1336007 1032344 1585870 1506697
17042 1506697 1288611 1342271 1608172 1397357 1182155 1637241 1498302 1100937 1166407 1286399
17032 1286399 1331814 1533367 1231371 1201178 1343268 1261747 1482724 1259058 1295433 1469564
17022 1469564 1609930 1515472 1361922 1394536 1357793 1444319 1596573 1481898 1691671 1494745
17012 1494745 1624261 1771255 992125 1561298 1451427 1537279 1577780 1645243 1634632 1774342
17002 1774342 1644482 1555680 1810824 1732057 1729498 1803056 1853497 1856586 1856646 2103992 1815768
16991 1815768 1762452 2082324 1695698 2096537 1834835 1821162 1669180 2084013 2286596 1993040
16981 1993040 2286249 2215348 2122527 2095194 1731580 2055054 2218913 1867300 2274257 2186145
$$ packed form
17052A290209m2688j11919L91646j71438m11827M17313k5289l03663N53526p9173
17042A506697k18086N3660K65901k10815k15202M55086j38939l97365O5470J19992
17032A286399M5415K01553l01996l0193J42090q1521K20977k23666L6375J74131
17022A469564J40366r4458j53550L2614l6743Q6526J52254j14675K09773j96926
17012A494745J29516J46994p79130N69173j09871Q5852M0501O7463j0611J39710
17002A774342j29860q8802K55144p8767k559P3558N0441L089O0K47346k88224
16991A815768n3316L19872l86626M00839k61702j3673j51982M14833K02583k93556
16981A993040K93209p0901r2821k7333l63614L23474J63859l51613M06957q8112
$$ plain form
16971 2186145 2122847 1920502 2031592 2209324 1944765 2209937 2255612 2342433 2424451 2362259
16961 2362259 2350289 2531023 2617830 2464845 2480391 2507037 2431178 2329498 2371011 2793978
16951 2793978 2612830 2733227 2798374 2758481 2837592 2548226 2727758 2802198 3101733 2929287
16941 2929287 2883765 2740817 2949731 3046296 2801701 3199240 3023344 2937972 3189824 3062541
16931 3062541 2948095 3362079 3209079 3044219 3144771 3154169 3305345 3251075 3203379 3288602
16921 3288602 3406173 3376323 3602012 3980666 3623129 3770678 3728794 3769923 3193031 3889084
16911 3889084 3767941 3710363 4092263 3784620 3749173 3813708 4002526 4069433 4212224 4450730
16901 4450730 4438359 4543647 4706430 4350476 4453092 4393762 4677621 4467946 4846041 4766681
$$ packed form
16971B186145o3298k02345J11090J77732k64559K65172M5675Q6821Q2018o2192
16961B362259j1970J80734Q6807j52985J5546K6646p5859j01680M1513M22967
16951B793978j81148J20397O5147l9893P9111k89366J79532P4440K99535j72446
16941B929287m5522j42948K08914R6565k44595L97539j75896q5372K51852j27283
16931C062541j14446M13984j53000j64860J00552R398J51176n4270m7696Q5223
16921C288602J17571k9850K25689L78654l57537J47549m1884M1129n76892O96053
16911C889084j21143n7578L81900l07643l5447O4535J88818O6907J42791K38506
16901D450730j2371J05288J62783l55954J02616n9330K83859k09675L78095p9360
$$ plain form
16891 4766681 4731569 4862662 4846253 4848460 5085572 5056866 5278095 5069331 5606200 5422895
16881 5422895 5273734 5707886 5417842 5525475 5857335 5795729 5978616 5880373 6129936 5866006
16871 5866006 6332053 6209458 6107199 6600866 6522275 6622637 6804955 6361163 6887475 6852031
16861 6852031 7272510 6778352 7217704 7386886 7581235 7261537 7949234 7621914 7835633
16852 7835633 8295527 7934293 8304664 8221621 8533864 8352458 8845725 8568534 9167530 9296416
16842 9296416 9621917 9415620 9791323 9890614 9972759 10104975 10340986 10438404 10724348 10832969
16832 10832969 11294081 11269938 11641156 11454792 11542784 12040588 11891245 12328050 12655336 13084706
16822 13084706 13474125 13322836 13451870 13954733 13938579 13987928 14665161 14848858 15113419 15342529
$$ packed form
16891D766681l5112J31093j6409K207K37112k8706K21229k08764N36869j83305
16881E422895j49161M34152k90044J07633L31860o1606J82887r8243K49563k63930
16871E866006M66047j22595j02259M93667p8591J00362J82318m43792N26312l5444
16861F852031M20479m94158M39352J69182J94349l19698O87697l27320K13719
16852G835633M59894l61234L70371q3043L12243j81406M93267k77191N98996J28886
16842I296416L25501k06297L75703R9291Q2145J32216K36011R7418K85944J08621
16832A0832969M61112k4143L71218j86364Q7992M97804j49343M36805L27286M29370
16822A3084706L89419j51289J29034N02863j6154M9349O77233J83697K64561K29110
$$ plain form
16812 15342529 16105769 16140087 16137266 16512453 16869151 17289401 17340780 17911774 18365995 18787635
16802 18787635 19182708 19479502 19572597 20016607 20598556 20741897 21071736 21986338 22274966
16793 22274966 22648616 23415326 24004485 24360067 24809632 25769773 26322017 26693055 27367714
16784 27367714 27650405 28519883 29222458 29596652 30151126 31040859 31647796 32713853 33350339
16775 33350339 33987722 34844794 35602354 36372757 37020059 37803429 38903749 39999209 40666225
16766 40666225 41489167 42609724 44086585 44461915 45701936 46661608 47830051 48543478 49812545
16757 49812545 51050429 51853701 53263957 54260010 55041087 56551964 57553086 58641438
16749 58641438 59703182 61127748 62017146 63167179 64120603 65306704 66289535 67620681
$$ packed form
16812A5342529P63240L4318k821L75187L56698M20250N1379N70994M54221M21640
16802A8787635L95073K96794R3095M44010N81949J43341L29839R14602K88628
16793B2274966L73650P66710N89159L55582M49565R60141N52244L71038O74659
16784B7367714K82691Q69478P02575L74194N54474Q89733O06937J066057O36486
16775C3350339O37383Q57072P57560P70403O47302P83370J100320J095460O67016
16766D0666225Q22942J120557J476861L75330J240021R59672J168443P13427J269067
16757D9812545J237884Q03272J410256R96053P81077J510877J001122J088352
16749E8641438J061744J424566Q89398J150033R53424J186101R82831J331146
$$ plain form
16741 67620681 68432835 69833173 70642812 71260718 71853942 73054342 73489071 74304858 74834545
16732 74834545 75685182 76131346 76547956 77077307 77389722 77766596 77525571 77653685 77862055
16723 77862055 78067491 77491711 77048603 77258347 77249256 76656189 76038076 75570128 74801321 73921612
16713 73921612 73710401 72649797 71761154 70860206 70088575 69198875 68065120 67552982 66273054
16704 66273054 65159818 64585258 63110273 62128907 61153252 60006069 58743220 58029237 56645978
16695 56645978 55837945 54414890 53450790 52488742 51611927 50418445 49344687 48308758 47079374
16686 47079374 46231670 45582794 44410682 43402687 42776310 41860511 40762533 39981585 39211229
16677 39211229 38371976 37599920 36677373 36164432 34861820 34653527 33738787 33009756 32353734
$$ packed form
16741F7620681Q12154J400338Q09639O17906N93224J200400M34729Q15787N29687
16732G4834545Q50637M46164M16610N29351L12415L76874k41025J28114K08370
16723G7862055K05436n75780m43108K09744r091n93067o18113m67948p68807q79709
16713G3921612k11211j060604q88643r00948p71631q89700j133755n12138j279928
16704F6273054j113236n74560j474985r81366r75655j147183j262849p13983j383259
16695E6645978q08033j423055r64100r62048q76815j193482j073758j035929j229384
16686D7079374q47704o48876j172112j007995o26377r15799j097978p80948p70356
16677C9211229q39253p72056r22547n12941j302612k08293r14740p29031o56022
$$ plain form
16668 32353734 31768191 30938298 30448307 29830290 29241378 28706632 27998120 27608678 27006896
16659 27006896 26269386 25972094 25256953 24735409 24406590 24000411 23633142 23166025 22671098
16650 22671098 22262031 21971468 21543966 20881334 20769275 20260167 19754732 19547817 19196123
16641 19196123 18828049 18884272 18462781 17899748 17684125 17317024 16936574 16590832 16475857
16632 16475857 16139555 15794486 15503589 15445294 15611562 15064396 14766766 14281000 14196552 14141505
16622 14141505 13918653 13711300 12950328 13327173 12926841 13017246 12465331 12425340 12237189 12040972
16612 12040972 11955173 11640598 11347092 11382154 11392888 11116665 11103100 10749841 10604032 10497919
16602 10497919 10405670 10195118 10006347 9863837 9756495 9625669 9464305 9735143 9312316
$$ packed form
16668C2353734n85543q29893m89991o18017n88912n34746p08512l89442o01782
16659B7006896p37510k97292p15141n21544l28819m06179l67269m67117m94927
16650B2671098m09067k90563m27502o62632j12059n09108n05435k06915l51694
16641A9196123l68074N6223m21491n63033k15623l67101l80450l45742j14975
16632A6475857l36302l45069k90897n8295J66268n47166k97630m85766q4448n5047
16622A4141505k22852k07353p60972L76845m00332R0405n51915l9991j88151j96217
16612A2040972q5799l14575k93506L5062J0734k76223j3565l53259j45809j06113
16602A0497919r2249k10552j88771j42510j07342j30826j61364K70838m22827
$$ plain form
16593 9312316 9283412 8831300 8925639 8803245 8935468 8697865 8444929 8591687 8652635 8296202
16583 8296202 7974119 8040927 7734217 7664238 7588216 7412576 7434646 7541395 7201096 7345070
16573 7345070 7258397 7125810 6959840 6802175 6740525 6911148 6615093 6791508 6422345 6552162
16563 6552162 6593525 6385647 6145955 6160839 5994083 5793330 6139888 6179740 6080850 5856187
16553 5856187 6144635 5649364 5795706 5874316 5539445 5859181 5652056 5494954 5530013 5249140
16543 5249140 5667930 5300861 4906643 4967759 5106661 5283226 5137904 4817770 4744318 4897421
16533 4897421 5082716 4590307 4585061 4870383 4218784 4694018 4410978 4636431 4422321 4479507
16523 4479507 4203690 4605623 4746834 4316206 4434803 4325219 4307748 4052296 4377129 4277469
$$ packed form
16593I312316k8904m52112R4339j22394J32223k37603k52936J46758O0948l56433
16583H296202l22083O6808l06710o9979p6022j75640K2070J06749l40299J43974
16573G345070q6673j32587j65970j57665o1650J70623k96055J76415l69163J29817
16563F552162M1363k07878k39692J4884j66756k00753L46558L9852r8890k24663
16553E856187K88448m95271J46342P8610l34871L19736k07125j57102L5059k80873
16543E249140M18790l67069l94218O1116J38902J76565j45322l20134p3452J53103
16533D897421J85295m92409n246K85322o51599M75234k83040K25453k14110N7186
16523D479507k75817M01933J41211m30628J18597j09584j7471k55452L24833r9660
$$ plain form
16513 4277469 3844573 4061001 4370925 3691333 3944457 3893509 3734787 3875866 3766379 3655080
16503 3655080 3658355 3461409 3629341 3846805 3805256 3345802 3436113 3699860 3191784 3491837
16493 3491837 3258521 3240000 3590062 3186785 3378770 3274541 2917476 3434836 3188693 3077715
16483 3077715 3062565 3108663 3088282 2716912 3144492 3078384 3090976 3089509 2883147 2963891 2938044
16472 2938044 3036787 2781896 2637584 2940128 2892063 2737757 2870691 2774752 2735207 2589875
16462 2589875 2765843 2852705 2913677 2342085 2828276 2792586 2254228 2679282 2554436 2406396
16452 2406396 2482889 2378629 2324304 2431575 2653615 2471178 2370480 2467738 2412883 2295391
16442 2295391 2297548 2380923 2282727 2333744 2160197 2207041 2042716 2027282 2342439 2188051 2224944
$$ packed form
16513D277469m32896K16428L09924o79592K53124n0948j58722J41079j09487j11299
16503C655080L275j96946J67932K17464m1549m59454R0311K63747n08076L00053
16493C491837k33316j8521L50062m03277J91985j04229l57065N17360k46143j10978
16483C077715j5150M6098k0381l71370M27580o6108J2592j467k06362Q0744k5847
16472B938044R8743k54891j44312L02544m8065j54306J32934r5939l9545j45332
16462B589875J75968Q6862O0972n71592M86191l5690n38358M25054j24846j48040
16452B406396P6493j04260n4325J07271K22040j82437j00698R7258n4855j17492
16442B295391K157Q3375r8196N1017j73547M6844j64325j5434L15157j54388L6893
$$ plain form
16431 2224944 2197595 2418169 2252689 2027160 2434869 2161873 2101512 1853968 2033033 2262194
16421 2262194 2452967 2036662 2162837 2067653 2083701 2111997 1912710 1853795 2183797 2055114
16411 2055114 1968034 1840951 2054160 1791011 2046280 1924311 2243850 1764388 1654032 2184694
16401 2184694 1863497 2356892 1979434 2172616 1744202 1806656 2093136 2090434 1798536 1964909
16391 1964909 1948013 1533778 1807168 1651776 1740351 1768336 1492499 1635376 1743540 1488825
16381 1488825 1364770 1543967 1814661 1798583 1331487 1629563 1257116 1587466 1570515 1732969
16371 1732969 1630302 1469386 1604635 1779344 1732567 1517134 1462662 1379271 1406672 1745850
16361 1745850 1639027 1286744 1348264 1387033 1662193 1331501 1364155 1183534 1523021 1401390
$$ packed form
16431B224944k7349K20574j65480k25529M07709k72996o0361k47544J79065K29161
16421B262194J90773m16305J26175r5184J6048K8296j99287n8915L30002j28683
16411B055114q7080j27083K13209k63149K55269j21969L19539m79462j10356N30662
16401B184694l21197M93395l77458J93182m28414O2454K86480k702k91898J66373
16391A964909j6896m14235K73390j55392Q8575K7985k75837J42877J08164k54715
16381A488825j24055J79197K70694j6078m67096K98076l72447L30350j6951J62454
16371A732969j02667j60916J35249J74709m6777k15433n4472q3391K7401L39178
16361A745850j06823l52283O1520L8769K75160l30692L2654j80621L39487j21631
$$ plain form
16351 1401390 1507369 1233978 1651375 1195074 1353421 1406163 1418838 1289231 1722802 1456442
16341 1456442 1243558 1131076 1251051 1768761 1104636 1429718 1027236 1480360 1415393 1139451
16331 1139451 1602697 1575776 1125670 1337993 1329179 1350495 1396215 1175722 1149081 1006346
16321 1006346 1231170 1522758 1296034 1338636 1437002 731153 1071834 1328610 980848 1080739
16311 1080739 1325734 1026149 1304286 901280 1619855 962023 1179949 1184557 1303701 979799
16301 979799 641250 923208 994716 1228853 913590 978908 1195812 1032647 772273 860517
16291 860517 1249952 857943 1200567 929298 1125964 842196 936070 1134364 1211816 920388
16281 920388 760089 927715 762337 788809 988406 956109 969812 709628 1289725 1209522
$$ packed form
16351A401390J05979k73391M17397m56301J58347N2742J2675j29607M33571k66360
16341A456442k12884j12482J19975N17710o64125L25082m02482M53124o4967k75942
16331A139451M63246k6921m50106K12323q814K1316M5720k20493k6641j42735
16321A006346K24824K91588k26724M2602R8366p05849L40681K56776l47762R9891
16311A080739K44995k99585K78137m03006P18575o57832K17926M608J19144l23902
16301I79799l38549K81958P1508K34137l15263O5318K16904j63165k60374Q8244
16291H60517L89435l92009L42624k71269J96666k83768R3874J98294P7452k91428
16281I20388j60299J67626j65378K6472J99597l2297J3703k60184N80097q0203
$$ plain form
16271 1209522 1038294 791217 760370 1012502 884289 883089 551165 612034 1212747 913875
16261 913875 1026601 771459 928062 464297 610632 951269 1256013 497385 778570 906972
16251 906972 755198 802950 824569 858257 543136 939741 938289 771578 833073 1153411 715482
16240 715482 850311 857927 771237 557442 832621 812680 848289 1014876 780694 586723
16230 586723 715540 578635 587981 763065 646985 1048636 594292 835905 751056 578590
16220 578590 753387 862313 653819 616754 349077 745862 625419 682096 642692 611278
16210 611278 153615 352623 364791 598028 627895 719296 817978 968670 593368 424676
16200 424676 1064318 371391 678603 817006 900802 403395 727018 784216 603535 899301
$$ packed form
16271A209522j71228k47077l0847K52132j28213j200l31924O0869O00713k98872
16261I13875J12726k55142J56603m63765J46335L40637L04744D97385K81185J28402
16251I06972j51774M7752K1619L3688l15121L96605j452j66711O1495L20338m37929
16240G15482J34829P616q6690k13795K75179j9941L5609J66587k34182j93971
16230E86723J28817j36905R346J75084j16080M01651m54344K41613q4849j72466
16220E78590J74797J08926k08494l7065k67677L96785j20443N6677l9404l1414
16210F11278A53615J99008J2168K33237K9867R1401R8682J50692l75302j68692
16200D24676O39642C71391L07212J38403Q3796D03395L23623N7198j80681K95766
$$ plain form
16190 899301 577081 472304 447615 353696 339109 542749 299360 962760 410636 533487
16180 533487 400189 508662 604843 469341 649163 763317 581464 608305 794422 678706
16170 678706 472227 578015 718969 344634 431588 564083 744482 299555 694123 676340
16160 676340 361259 654947 740554 562035 261724 633051 393335 267211 429530 592158
16150 592158 340640 595508 564246 291541 365829 263895 503867 469414 513755 538991
16140 538991 531094 470846 459417 556012 391321 567564 472051 608369 907212 143155 390526
16129 390526 369403 340091 662431 338577 459027 438440 663360 383138 248755 185605
16119 185605 361391 480306 -58456 491270 393968 273549 351588 601758 118084 420687
$$ packed form
16190H99301l22220j04777k4689r3919j4587K03640k43389O63400D10636J22851
16180E33487j33298J08473R6181j35502J79822J14154j81853K6841J86117j15716
16170F78706k06479J05788J40954C44634Q6954J32495J80399B99555L94568j7783
16160F76340l15081K93688Q5607j78519B61724L71327k39716j26124J62319J62628
16150E92158k51518K54868l1262k72705P4288j01934K39972l4453M4341K5236
16140E38991p897o0248j1429R6595j64691J76243r5513J36318K98843A43155K47371
16129C90526k1123k9312L22340l23854J20450k0587K24920k80222j34383o3150
16119A85605J75786J18915e8456D91270r7302j20419P8039K50170A18084L02603
$$ plain form
16109 420687 536407 463506 255480 438378 444972 236773 406861 202924 562624 268320
16098 45600 215300 94910 443097 391513 309484 501630 212246 239228 380080 376668 281532
16087 281532 307138 312274 319162 533839 279633 206521 530525 -16080 487556 562554 522374
16076 522374 386381 136043 235823 103112 316034 79763 37326 326548 336528 554656
16066 554656 394244 76722 432116 635231 241362 526758 155670 81875 327629 415151
16056 415151 287103 178157 242916 293458 408561 305615 566198 205259 -35649 552717
16045 542300 323063 -74793 286829 134415 92729 -20773 351559 239399 211903 201683
16035 201683 396799 148807 -174406 354226 335264 69558 256442 21328 145139 186920
$$ packed form
16109D20687J15720p2901k08026J82898O594k08199J70088B02924L59700B68320
16098D5600J69700I4910L48187n1584q2029J92146B12246K6982J40852l412r5136
16087B81532K5606N136O888K14677k54206p3112L24004a6080D87556P4998m0180
16076E22374j35993A36043R9780A03112K12922G9763C7326K89222R980K18128
16066E54656j60412G6722L55394K03115B41362K85396A55670p3795K45754Q7522
16056D15151j28048j08946O4759N0542J15103j02946K60583B05259c5649E52717
16045E42300k19237g4793B86829A34415m1686b0773C51559j12160k7496j0220
16035B01683J95116A48807a74406C54226j8962F9558J86884B1328J23811M1781
$$ plain form
16025 186920 226196 445844 327688 404172 14115 423651 286249 234999 478172 94303
16014 2250 145035 472097 163117 31501 72039 348683 359448 175535 190304 272687 84830
16002 254640 255729 202467 102972 134849 140059 -46646 233212 322895 -12873 330443 455186
15991 455186 707636 721268 1300628 1058746 992997 842935 635232 389540 369653 112249
15980 231123 454650 299779 -19947 319021 217002 273318 446096 137738 120532 253721
15970 253721 -41445 -39177 109558 388110 337223 17791 125318 12599 -77227 -65856 -63233
15959 -63233 261494 14367 104728 185519 379710 -220219 207196 61002 183569 285306
15949 285306 123442 339896 39105 144956 58979 -2694 399155 -149645 -262728 82299
$$ packed form
16025A86920L9276K19648j18156P6484A4115M09536j37402n1250K43173I4303
16014B250J42785L27062A63117C1501M0538K76644J0765A75535J4769Q2383H4830
16002B54640J089n3262r9495L1877N210d6646B33212Q9683a2873C30443J24743
15991D55186K52450J3632N79360k41882o5749j50062k07703k45692j9887A12249
15980B31123K23527j54871a9947C19021j02019N6316J72778A37738j7206J33189
15970B53721d1445K268A09558K78552n0887A7791J07527A2599g7227J1371K623
15959f3233B61494A4367R0361Q0791J94191b20219B07196F1002J22567J01737
15949B85306A23442K16454C9105J05851E8979b694C99155a49645j13083H2299
$$ plain form
15938 3589 205256 -15361 424869 157022 146569 373903 32749 205028 160444 433644 -52259
15926 -96354 125518 -79379 239115 270645 248225 -101264 -73851 99199 393915 386775 110329
15914 136136 20723 344971 -42916 -21293 -54591 275793 137344 181896 -28808 257955 91207
15902 306440 -1085 -11307 -117737 -9298 -156582 88211 183642 117045 193555 -30773 -205975
15891 -205975 37026 113400 -10592 203524 22675 37210 253426 -42896 315303 408909 -40907
15879 239546 176842 229755 -62416 -84815 91316 66400 20844 34965 -57092 27312 117169
15868 117169 11946 56661 -112796 70459 347749 362926 10163 147729 -101148 558834
15857 173164 -208794 16100 -97337 147834 43230 -4464 250664 -71577 -97315 112091 39940
$$ packed form
15938C589K01667a5361D24869A57022j0453K27334C2749J72279m4584K73200e2259
15926i6354A25518g9379B39115L1530k2420a01264K7413I9199K94716p140A10329
15914A36136B0723L24248d2916b1293l3298B75793A37344M4552b8808B57955I1207
15902C06440a085j0222j06430i298j47284H8211R5431o6597P6510c0773j75202
15891b05975C7026P6374a0592B03524B2675J4535K16216d2896C15303R3606d0907
15879B39546o2704N2913f2416k2399I1316k4916B0844J4121e7092B7312Q9857
15868A17169A1946M4715a12796G0459K77290J5177A0163J37566a01148E58834
15857A73164b08794A6100i7337A47834D3230d464B50664g1577k5738A12091C9940
$$ plain form
15845 -99172 60043 163217 134113 345105 287808 -17292 -841 -286898 186751 -104210 -118865
15834 -118865 105452 316305 15613 186327 94596 155837 167534 124489 75944 19116 487600
15823 487600 -154350 -2887 194085 206793 110961 106235 131014 204515 254016 128535 -174068
15811 139018 139021 -91711 33416 -23424 -233219 191151 150629 210636 182607 -149472 -275325
15800 -275325 212742 218547 -54757 261317 -31081 1379 91658 10891 -100028 202536 77116
15788 -163125 210342 -255711 138488 8100 195659 -133272 64426 -141708 -89916 108169
15777 -55604 92633 75756 192647 -139468 -86763 207475 44680 143322 147191 -257941 -1539
15765 223122 -199818 -294779 10952 -266335 -230668 55818 226323 89068 210831 10211 123143
$$ packed form
15845i9172F0043J03174k9104K10992n7297a7292h41k86057A86751a04210j4655
15834a18865A05452K10853A5613J70714r1731O1241J1697m3045m8545A9116M68484
15823D87600a54350b887A94085J2708r5832m726K4779P3501M9501j25481a74068
15811A39018Li1711C3416b3424k09795A91151m0522O0007k8029a49472j25853
15800b75325B12742N805e4757B61317c1081A379R0279A0891a00028B02536G7116
15788a63125B10342b55711A38488H100J87559a33272F4426a41708N1792A08169
15777e5604I2633j6877J16891a39468N2705B07475D4680R8642L869b57941a539
15765B23122a99818r4961A0952b66335L5667E5818J70505H9068J21763A0211J12932
$$ plain form
15754 123143 162832 26602 19624 -30970 136228 -218835 -67013 108376 193212 55022 -117137
15742 -88162 359769 -181617 -98852 366441 -100584 117530 -25723 -172284 -28899 119306
15731 -75103 -3934 82748 -32444 441434 -70119 119065 51280 -246350 -302049 267205 -23449
15719 216785 -20528 -34784 -215445 2958 26706 24108 331707 125530 -413027 -11735 391354
15707 129393 -96416 -71004 172329 22740 24706 123927 -240089 -39453 304709 -139780 122689
15695 84911 392396 -5329 -199463 -78857 -186348 60453 288752 128314 100880 -43914 121147
15683 -211621 1321 243182 260456 -16246 -287496 28915 -366053 -151242 -300409 366970
15672 -44803 207524 -49027 -91850 188 131374 -154429 501698 296106 161890 -217218 34657
$$ packed form
15754A23143L9689B6602o978c0970A36228b18835f7013A08376Q4836E5022a17137
15742h8162C59769a81617Q2765C66441a00584A17530b5723j46561b8899A19306
15731g5103c934H2748c2444D41434g0119A19065E1280b46350n5699B67205b3449
15719B16785b0528j4256j80661B958K3748k598L07599A25530d13027a1735C91354
15707A29393i6416K5412A72329B2740J966R9221b40089c9453C04709a39780A22689
15695H4911L07485e329j94134g8857j07491F0453K28299A28314k7434d3914A21147
15683b11621A321K41861J7274a6246k71250B8915c66053a51242j49167C66970
15672d4803B07524d9027m2823A88J31186a54429E01698k05592j34216b17218C4657
$$ plain form
15660 8002 170358 36893 -184491 -30444 -16207 153412 -200957 -107091 -5953 231376 45655
15648 16812 53986 299474 -23512 -75405 -184744 10245 -121445 91639 5557 -18109 121269
15636 452025 -35802 -66770 45903 109751 -134480 228849 24545 -231528 292848 204459 97257
15624 -144061 -18849 153 277605 71776 -305790 -261768 206603 -253872 -250786 -241120 -352009
15613 -352009 -301779 103117 -2233 112414 92685 -3482 -19777 53163 212027 77862 -246376
15601 -232797 306946 4714 -47878 -227631 -264190 19417 261330 12943 -319413 -174947 149359
15589 -21800 104367 -156071 -63953 -8567 -9857 115116 233996 -154200 -87262 -191425 33545
15577 -220135 101106 376546 -81510 246514 292473 30488 -30254 -295859 76072 198008
$$ packed form
15660H002J62356C6893a84491c0444J4237A53412b00957R3866e953B31376D5655
15648A6812L7174K45488b3512n1893j09339A0245a21445I1639E557a8109A21269
15636D52025c5802l0968D5903O3848a34480B28849B4545b31528B92848q8389I7257
15624a44061a8849A53K77452G1776c05790M4022B06603b53872L086R666j10889
15613c52009N0230A03117b233A12414j9729c482j6295E3163J58864G7862b46376
15601b32797C06946D714d7878j79753l6559A9417K41913A2943c19413J44466A49359
15589b1800A04367a56071f3953h567j290A15116J18880a54200O6938j04163C3545
15577b20135A01106K75440h1510B46514M5959C0488c0254k65605G6072J21936
$$ plain form
15567 198008 -92189 134283 47731 299194 313088 -362835 40835 -19792 147870 -66096 142238
15555 -48114 -77793 21125 116572 -246248 166413 -125620 261092 -55103 365389 -289158
15544 -39084 261231 96452 -130328 -426024 -70543 298810 410252 -28656 101643 -10536
15533 -131413 129886 -26015 245264 13223 22989 109021 -132321 8637 -101881 -144335 375455
15521 44309 1505 -105079 -25632 1438 89871 -250879 -175888 -348747 113536 101389 13026
15509 197730 397622 64971 82909 169505 38782 -62371 -248502 20441 -173982 63444 45467
15498 45467 50541 299174 56086 -4782 98376 169507 -175215 -89443 -42343 -64084 -75466 418281
15485 -39709 33696 -45809 -33482 13447 211151 366673 519737 588498 279266 157657 94897
$$ packed form
15567A98008i2189A34283D7731K51463J3894c62835D0835a9792A47870f6096A42238
15555d8114k9679B1125R5447b46248A66413a25620B61092e5103C65389b89158
15544c9084B61231I6452a30328k95696g0543B98810J11442b8656A01643a0536
15533a31413A29886b6015B45264A3223R766Q6032a32321H637a01881m2454C75455
15521D4309A505a05079b5632A438Q8433b50879P4991j72859A13536j2147A3026
15509A97730J99892F4971J7938Q6596C8782f2371j86131B0441a73982F3444j7977
15498D5467N074K48633E6086d782I8376P1131a75215Q5772d2343k1741j1382D18281
15485c9709C3696d5809J2327A3447J97704J55522J53064O8761B79266j21609o2760
$$ plain form
15474 94897 17647 180211 -35793 216781 250364 64268 87629 199960 -68315 -103334 77604
15462 -53583 -152111 162778 143757 217897 253581 300776 -163985 -29153 -56979 132163 136229
15451 136229 114463 -33936 75477 186433 734228 438251 498009 504759 582335 213161 74283
15439 103328 139776 -25088 -167494 421019 -244415 -119579 202353 189585 49180 263487
15429 263487 -89388 -27493 56753 -75142 -321540 -204533 114235 -217559 -46971 121078
15418 107710 65906 -170625 230466 -229959 -42700 78158 5933 247257 262332 97495 -85621
15406 235219 -268986 -51404 163586 140471 41106 262286 -22767 157737 -283444 208883
15395 179506 144404 474227 325833 -176999 -156948 41537 208671 42496 188857 -109700
$$ packed form
15474I4897A7647J62564c5793B16781L3583F4268K3361J12331f8315l5019G7604
15462e3583r8528A62778j9021P4140L5684M7195a63985b9153k7826A32163M066
15451A36229k1766c3936G5477J10956N47795k95977N9758O750P7576B13161G4283
15439A03328L6448b5088j42406D21019b44415a19579B02353j2768D9180K14307
15429B63487h9388b7493E6753g5142k46398J17007A14235b17559d6971A21078
15418A07710m1804a70625B30466b29959d2700G8158E933K41324J5075I7495h5621
15406B35219b68986e1404A63586k3115D1106K21180b2767A57737b83444B08883
15395A79506l5102L29823j48394a76999K0051D1537J67134D2496J46361a09700
$$ plain form
15384 -70023 -54967 115921 -152334 232404 -134722 -7167 -10751 -83637 4517 -137307 -80899
15373 -80899 272564 328955 173522 -82710 -79060 146146 104386 107131 59266 -8776 240364
15361 200115 66757 21843 15131 86497 414796 188263 120998 186841 142573 180219 191340
15350 191340 -137733 152030 103548 306039 232645 225430 -58273 307215 443691 -11219 74357
15338 58410 131053 169926 45705 -45987 -95410 176944 186866 288587 405930 23349 12022
15327 12022 1042 -43811 36932 -104309 322196 44685 571034 199270 227781 332874 -72447
15315 221574 388394 152734 -76259 192156 48199 72395 101940 359994 181668 188704 260561
15304 260561 238209 -164146 361336 176489 137049 137475 -148289 128615 74572 26998 -47331
$$ packed form
15384g0023J5056A15921a52334B32404a34722g167l584p2886D517a37307N6408
15373h0899B72564N6391j55433h2710L650A46146m1760K745m7865h776B40364
15361B00115F6757B1843o712P1366L28299A88263o7265O5843m4268L7646J1121
15350A91340a37733A52030m8482K02491p3394p215e8273C07215J36476a1219G4357
15338E8410P2643L8873D5705d5987m9423A76944R922J01721J17343B3349j1327
15327A2022A042d3811C6932a04309C22196D4685N26349A99270K8511J05093g2447
15315B21574J66820A52734g6259A92156D8199K4196K9545K58054j78326P036P1857
15304B60561k2352a64146C61336A76489l9440M26a48289A28615n4043B6998d7331
$$ plain form
15292 72220 574761 20643 -63176 -271075 227232 29987 -149507 255879 88749 168139 12017
15280 340827 -82912 -135019 -32574 303940 42595 39951 20306 -102137 123165 91147 -117811
15268 209813 85320 72140 344869 -101577 -242067 227561 -224170 -277260 147655 317638
15258 317638 289352 -171674 -127845 75610 225295 99624 125390 -70127 -29587 479338 792363
15247 792363 2753083 1305486 2144603 1605839 714404 32272 304123 133085 -258592
15237 -99421 312635 -157844 179637 -89544 -47109 -105672 167809 84666 442934 -55280 -116109
15226 -116109 230400 -71538 -157571 56902 -60283 241195 17431 49177 200466 -283501 262772
15214 111818 -33365 234171 108748 -72127 41506 -29930 -64826 304880 362407 -285916 -17140
$$ packed form
15292G2220N02541B0643f3176k07899B27232B9987a49507B55879H8749P9390A2017
15280C40827h2912n2107c2574C03940D2595k644j9645a02137A23165l2018a17811
15268B09813H5320j3180K72729a01577j40490B27561b24170n3090A47655J69983
15258C17638k8286a71674M3829G5610J49685I9624K5766g0127b9587D79338L13025
15247G92363J960720A305486Q39117n38764G14404C2272K71851A33085b58592
15237i9421C12635a57844A79637h9544M2435n8563A67809q3143L58268e5280o0829
15226a16109B30400g1538q6033E6902f0283B41195A7431L1746J51289b83501B62772
15214A11818c3365B34171A08748g2127D1506b9930l4896C04880N7527b85916a7140
$$ plain form
15202 -40152 158435 114316 -24778 276012 -5719 -171086 227981 111232 393344 130626
15191 264394 -113163 117351 71482 265050 -77574 98552 315718 -130856 38113 274904
15181 274904 16815 -43516 149482 42544 -348021 973 -79306 219789 266854 -63327 16411
15169 -32587 210872 74291 501698 194072 -39793 267101 15899 310421 269975 337670 200960
15158 200960 -51142 -16546 54181 54305 193467 35884 -56571 -26234 237433 358549 237406
15147 237406 88856 8869 292655 3782 -15187 -157486 69757 184696 216807 -34220 109757
15135 422486 46286 -85553 -159133 309141 228453 100460 382485 525976 69323 -60605 108395
15123 -18447 292617 381166 142756 -182586 235821 186215 1911 362364 132560 383990
$$ packed form
15202d0152A58435m4119b4778B76012e719j65367B27981A11232K82112A30626
15191B64394a13163A17351m5869J93568g7574I8552K17166a30856C8113K36791
15181B74904A6815d3516A49482D2544c48021I73g9306B19789M7065f3327A6411
15169c2587B10872G4291M27407A94072c9793B67101A5899K94522m0446O7695j36710
15158B00960e1142a6546E4181J24J39162C5884e6571b6234B37433J21116j21143
15147B37406H8856H869K83786C782a5187j42299F9757J14939L2111c4220A09757
15135D22486D6286h5553p3580C09141q0688A00460K82025J43491F9323f0605A08395
15123a8447B92617Q8549A42756a82586B35821m9606A911L60453A32560K51430
$$ plain form
15113 383990 123623 30554 127979 -346944 4548 51364 409386 24533 86539 178778 333574
15102 333574 119722 -100285 146611 211501 56749 -67710 -121519 -82972 275343 61274 269991
15091 269991 -54195 -136331 284225 69183 -8378 122959 -198601 196303 363507 238150
15081 238150 79477 63994 129557 462134 122218 102620 -9485 -161676 66105 351709 213261
15070 213261 23156 -45278 101786 260692 44858 303680 232565 198043 -217396 199829
15059 222227 426854 379188 -18235 274667 293291 141417 245469 350517 289621 594864
15049 594864 170269 74216 -65602 286463 268427 465677 494746 790471 107688 294203
15039 294203 231761 393342 600843 223969 50775 376596 533232 282628 202319 -44545
$$ packed form
15113C83990A23623C0554R7425c46944D548M6816L58022B4533O2006R2239J54796
15102C33574A19722a00285A46611O4890E6749f7710n3809L8547B75343F1274K08717
15091B69991e4195q2136B84225F9183h378A22959a98601A96303J67204j25357
15081B38150G9477j5483O5563L32577A22218j9598i485j52191F6105K85604j38448
15070B13261B3156d5278A01786J58906D4858K58822p1115l4522b17396A99829
15059B22227K04627m7666a8235B74667J8624A41417J04052J05048o0896L05243
15049E94864A70269G4216f5602B86463j8036J97250K9069K95725A07688J86515
15039B94203o2442J61581K07501B23969E0775L25821J56636k50604q0309d4545
$$ plain form
15028 129054 266057 359178 434393 161938 418851 631236 447889 16298 271662 277062
15018 277062 322226 183140 603227 584689 385890 -22080 240245 418754 223362 466799
15008 466799 516482 490007 563020 299941 431762 375692 349089 487202 215525 180476 170530
14997 170530 615418 501983 301495 392925 579388 -15081 484042 -303012 272087 269433
14987 269433 307171 81539 694820 463650 387155 263969 563899 255364 426913 432567
14977 432567 785094 782247 461506 446983 293625 375180 386837 543295 482570 856452 281093
14965 264314 512582 706768 417725 620064 665539 514192 237611 237562 312668 355555 468330
14954 468330 550191 420645 499320 550722 726842 477855 695853 748798 710227 325055
$$ packed form
15028A29054J37003R3121P5215A61938K56913K12385j83347A6298K55364N400
15018B77062M5164j39086M20087j8538j98799b2080B40245J78509j95392K43437
15008D66799M9683k6475P3013k63079J31821n6070k6603J38113B15525l5049r946
14997A70530M44888j13435k00488R1430J86463a5081D84042c03012B72087k654
14987B69433L7738H1539O13281k31170p6495j23186K99930B55364J71549N654
14977D32567L52527k847l20741j4523j53358Q1555J1657J56458o0725L73882B81093
14965B64314K48268J94186k89043K02339M5475j51347B37611m9P5106M2887J12775
14954D68330Q1861j29546P8675N1402J76120k48987K17998N2945l8571C25055
$$ plain form
14943 677995 700650 306239 -96661 331165 470027 291812 468794 604869 754321 788192
14933 788192 990988 771203 860500 765858 1485763 1190232 1326692 939800 1186172 904284
14923 904284 1135111 1459205 1494293 1789990 1883937 1520823 1162839 1142658 759861 811279
14913 811279 518304 506072 556953 468983 437764 411576 438487 333416 457754 733096 279240
14901 265114 342618 590520 314629 456931 609169 273140 227814 563501 502051 289005
14891 289005 700344 457774 526370 714710 687413 486990 415138 798542 504369 272727
14881 272727 610899 654696 640557 394118 645173 180271 540065 587451 457035 474155
14871 474155 839755 651358 684245 972012 1008317 360368 274365 430996 443040 399360
$$ packed form
14943F77995K2655C06239i6661C31165J38862j78215J76982J36075J49452L3871
14933G88192K02796k19785Q9297r4642P19905k95531J36460l86892K46372k81888
14923I04284K30827L24094L5088K95697R3947l63114l57984k0181l82797N1418
14913H11279k92975j2232N0881q7970l1219k6188K6911j05071J24338K75342B79240
14901B65114P7504K47902k75891J42302J52238B73140m5326L35687o1450k13046
14891B89005M11339k42570O8596J88340k7297k00423p1852L83404k94173k31642
14881B72727L38172M3797j4139k46439K51055A80271L59794M7386j30416J7120
14871D74155L65600j88397L2887K87767L6305C60368q6003J56631J2044m3680
$$ plain form
14861 399360 464146 387915 508226 569323 331117 465920 551429 391812 818800 601505
14851 601505 422295 703777 428407 729901 626174 746659 850889 1085655 945950 1012747
14841 1012747 1140499 843420 1032308 805700 651831 652024 751503 413669 618527 638138
14831 638138 698124 454511 459977 170591 606716 482988 210050 804570 610976 273443
14820 524336 764654 546730 503489 527040 243292 278337 766161 181071 526421 619705
14810 619705 763728 551441 574806 950819 1069665 693550 828923 1010582 866987 644936
14800 644936 426550 559854 663085 583488 807373 714317 580610 302860 806276 627761
14790 627761 844863 465570 727407 437987 346396 969393 610700 335500 416814 884255
$$ packed form
14861C99360O4786p6231J20311O1097k38206J34803Q5509j59617M26988k17295
14851F01505j79210K81482k75370L01494j03727J20485J04230K34766j39705O6797
14841A012747J27752k97079J88888k26608j53869J93R9479l37834K04858J9611
14831F38138N9986k43613N466A70591M36125j23728B10050N94520j93594B73443
14820E24336K40318k17924m3241K3551B43292L5045M87824A81071L45350R3284
14810F19705J44023k12287K3365L76013J18846l76115J35373J81659j43595k22051
14800F44936k18386J33304J03231p9597K23885r3056j33707k77750N03416j78515
14790F27761K17102l79293K61837k89420r1591O22997l58693k75200Q1314M67441
$$ plain form
14780 884255 518805 289479 870561 631692 633722 416490 528717 731796 845928 874320
14770 874320 478321 815630 539439 656993 542665 780965 736615 601339 659165 304753
14759 515892 421942 699736 642802 915115 523616 444127 784708 466164 542435 609099
14749 609099 805317 609416 973390 597189 796323 461252 606051 431165 867932 732324
14739 732324 996864 727987 822062 692492 510851 816839 1015448 1032361 790094 847619
14729 847619 1059580 1049344 733767 1134875 1081943 1608943 1477227 1107690 1329382 1324920
14719 1324920 929172 1419357 1057974 1039176 893631 745070 741213 1124099 606975 661985
14709 661985 766460 879003 1008603 873435 1073250 1056616 1143436 1288926 1305106 1371788
$$ packed form
14780H84255l65450k29326N81082k38869K030k17232J12227K03079J14132K8392
14770H74320l95999L37309k76191J17554j14328K38300m4350j35276N7826C04753
14759E15892r3950K77794n6934K72313l91499p9489L40581l18544P6271O6664
14749F09099J96218j95901L63974l76201J99134l35071J44799j74886M36767j35608
14739G32324K64540k68877R4075j29570j81641L05988J98609J6913k42267N7525
14729H47619K11961j0236l15577M01108n2932N27000j31716l69537K21692m462
14719A324920l95748M90185l61383j8798j45545j48561l857L82886n17124N5010
14709F61985J04475J12543J29600j35168J99815j6634Q6820J45490J6180O6682
$$ plain form
14699 1371788 1746176 1700003 1590387 1236815 1164550 1011199 944285 1175170 830993 1308269
14689 1308269 665888 740803 1138117 1183982 929663 1074030 831259 845425 1025209 1020199
14679 1020199 825238 867585 1238532 948897 1030788 931220 812091 669706 1011790 771608
14669 771608 784560 1036635 1261000 929540 1049022 1112300 1187542 839909 1161420 874526
14659 874526 1113724 984658 689742 925013 1082160 849922 1104145 964321 1058355 1172851
14649 1172851 1350374 1089373 1269867 1120024 1302933 1219230 1375763 1508870 1525596 1617702
14639 1617702 1007305 1146540 1263908 1304388 1054926 1094131 1253618 1234562 1457303 1223897
14629 1223897 1403595 1308097 1168013 1296781 1213104 1583641 1398344 1025259 1407679 1210943
$$ packed form
14699A371788L74388m6173j09616l53572p2265j53351o6914K30885l44177M77276
14689A308269o42381P4915L97314M5865k54319J44367k42771J4166J79784n010
14679A020199j94961M2347L70947k89635Q1891r9568j19129j42385L42084k40182
14669G71608J2952K52075K24365l31460J19482O3278P5242l47633L21511k86894
14659H74526K39198j29066k94916K35271J57147k32238K54223j39824R4034J14496
14649A172851J77523k61001J80494j49843J82909q3703J56533J33107J6726R2106
14639A617702o10397J39235J17368M0480k49462L9205J59487j9056K22741k33406
14629A223897J79698r5498j40084J28768q3677L70537j85297l73085L82420j96736
$$ plain form
14619 1210943 1241783 1310878 1290534 1084407 1313926 1603569 1510859 1231816 1266876 1344228
14609 1344228 1305675 1515859 1365778 1092808 1365247 1470575 1301151 1229771 1566397 1524267
14599 1524267 1211804 1411887 1723675 1785099 1722547 1583553 1957174 1726376 1725515 1569528
14589 1569528 1671676 1844039 1747381 1704543 1389438 1873755 1853622 1621296 1796855 1517454
14579 1517454 1890227 1899158 2047927 2042829 1723438 1939928 1976110 1900636 2141575 2117142 2306474
14568 2306474 2065745 2497826 2089338 2352357 2470847 2312788 2546204 2472424 2545779 2599415
14558 2599415 2853156 3125347 3181640 2915649 3173033 3748803 4183639 4434223 5071858 6975995
14548 6975995 10873587 19753213 39330830 42776195 20491896 12661873 6277640 3525703
$$ packed form
14619A210943L0840O9095k0344k06127K29519K89643r2710k79043L5060P7352
14609A344228l8553K10184j50081k72970K72439J05328j69424p1380L36626m2130
14599A524267l12463K00083L11788O1424o2552j38994L73621k30798q61j55987
14589A569528J02148J72363r6658m2838l15105M84317k0133k32326J75559k79401
14579A517454L72773Q931J48769n098l19391K16490L6182p5474K40939k4433J89332
14568B306474k40729M32081m08488K63019J18490j58059K33416p3780P3355N3636
14558B599415K53741K72191N6293k65991K57384N75770M34836K50584O37635J904137
14548F975995L897592Q879626J9577617L445365B0491896p830023F277640k751937
$$ plain form
14540 3525703 2443642 2053045 1649276 1694543 2069326 2111702 2106367 1819558 2018202 1751572
14530 1751572 1957523 2039978 1944121 2353388 1975499 1953651 2417335 2263287 2049069 2232703
14520 2232703 2262323 2143301 2385422 2625502 2332191 2611964 2463688 2726489 2476744 2324272
14510 2324272 2512753 2483453 2804065 2429493 2427081 2614144 2531899 2952241 2887653 2954137
14500 2954137 2926568 2966144 2945431 2943829 2748994 2850676 3223877 3229912 3028731 3260582 3306945
14489 3306945 3329101 3339461 3267848 3369425 3520360 3446350 3349664 3253912 3346771 3540002 3575413
14478 3575413 3536798 3669653 3630989 3795862 4115395 4109649 3821211 3848881 4006186 4222916
14468 4222916 4081855 3990583 4520418 4182212 4316163 4110255 4497729 4368532 4525136 4623565
$$ packed form
14540C525703j082061l90597m03769M5267L74783M2376n335k86809J98644k66630
14530A751572K05951Q2455r5857M09267l77889k1848M63684j54048k14218J83634
14520B232703K9620j19022K42121K40080k93311K79773j48276K62801k49745j52472
14510B324272J88481k9300L20612l74572k412J87063q2245M20342o4588O6484
14500B954137k7569L9576k0713j602j94835J01682L73201O035k01181K31851M6363
14489C306945K2156J0360p1613J01577J50935p4010r6686r5752R2859J93231L5411
14478C575413l8615J32855l8664J64873L19533n746k88438K7670J57305K16730
14468D222916j41061r1272N29835l38206J33951k05908L87474j29197J56604R8429
$$ plain form
14458 4623565 4773059 4626934 4711127 4786073 5365981 4791604 5098364 4877950 4757144 5148885
14448 5148885 5188986 5559832 5323733 5203821 5342452 5281094 5415231 5569456 5767089 6007036
14438 6007036 6053154 5935765 6036701 5909313 6071015 6488819 6278609 6385145 6363538 6740459
14428 6740459 6665619 6414030 6838794 7005052 7519253 7656825 7296454 7459834 7315907 7666584
14418 7666584 7641525 7830407 8110354 8178695 7873342 8269990 8684105 8505460 8856502 8418081
14408 8418081 9043683 9257730 9329298 9262185 9434544 9371641 9431629 9671628 9760652 10148807
14398 10148807 10314043 10596198 10557041 10742513 10891824 11007802 11121502 11444343 11688288
14389 11688288 11789903 12305793 12064268 12759031 12479027 13267090 13170684 13565047 13637643 13998300
$$ packed form
14458D623565J49494j46125Q4193P4946N79908n74377L06760k20414j20806L91741
14448E148885M0101L70846k36099j19912J38631o1358J34137J54225J97633K39947
14438F007036M6118j17389J00936j27388J61702M17804k10210J06536k1607L76921
14428F740459p4840k51589M24764J66258N14201J37572l60371J63380j43927L50677
14418G666584k5059J88882K79947O8341l05353L96648M14115j78645L51042m38421
14408H418081O25602K14047P1568o7113J72359o2903N9988K39999Q9024L88155
14398A0148807J65236K82155l9157J85472J49311J15978J13700L22841K43945
14389A1688288J01615N15890k41525O94763k80004P88063r6406L94363P2596L60657
$$ plain form
14379 13998300 14017744 14403249 14537124 14860758 14969558 15085774 15601816 16175943 16528200
14370 16528200 16706862 17058387 17389135 17623320 18206754 18559045 18823515 19165589 19398548
14361 19398548 19926189 20721842 20429848 21230234 21593100 22147422 22769463 22966396 23630102
14352 23630102 24152973 24838496 25447039 25886288 26670738 27388326 28084393 28794341 29388732
14343 29388732 30226022 31140219 31984336 33239163 33898765 34659062 35588369 36887742 37822658
14334 37822658 39235053 40200821 41533077 42695564 44378692 45230899 46823520 48851547
14326 48851547 50263479 51643832 53663204 55226429 57299460 59265872 61751174 63563720
14318 63563720 66000573 68249568 70977618 73581127 76606122 79708958 82769866 85957164
$$ packed form
14379A3998300J9444L85505J33875L23634J08800J16216N16042N74127L52257
14370A6528200J78662L51525L30748K34185N83434L52291K64470L42074K32959
14361A9398548N27641P95653k91994Q00386L62866N54322O22041J96933O63706
14352B3630102N22871O85523O08543M39249P84450P17588O96067P09948N94391
14343B9388732Q37290R14197Q44117J254827O59602P60297R29307J299373R34916
14334C7822658J412395R65768J332256J162487J683128Q52207J592621K028027
14326D8851547J411932J380353K019372J563225K073031J966412K485302J812546
14318F3563720K436853K248995K728050K603509L024995L102836L060908L187298
$$ plain form
14310 85957164 89549824 93393142 97569423 101628515 106111428 111188636 115958481 121411763
14302 121411763 126676995 132867887 139384038 146067142 153200773 160631738 168518836 177208839
14294 177208839 186323082 196103338 206019734 216780194 227927636 240064940 251964024
14287 251964024 264885123 278248896 292457132 306863168 321447427 336499702 351184493
14280 351184493 365961756 380646225 394465169 407797729 420087147 430926567 440289875
14273 440289875 446676209 448613346 448505187 448193688 446654495 443031846 437145489 431384716
14265 431384716 424891844 415675798 404016277 390527802 376402856 361002541 345846832
14258 345846832 329953301 314562213 299302311 284435833 270018114 257217444 245265855
$$ packed form
14310H5957164L592660L843318M176281M059092M482913N077208M769845N453282
14302A21411763N265232O190892O516151O683104P133631P430965P887098Q690003
14294A77208839R114243R780256R916396J0760460J1147442J2137304J1899084
14287B51964024J2921099J3363773J4208236J4406036J4584259J5052275J4684791
14280C51184493J4777263J4684469J3818944J3332560J2289418J0839420R363308
14273D40289875O386334J937137j08159l11499j539193l622649n886357n760773
14265D31384716o492872r216046j1659521j3488475j4124946j5400315j5155709
14258C45846832j5893531j5391088j5259902j4866478j4417719j2800670j1951589
$$ plain form
14251 245265855 232649582 220928129 209402887 198885099 189228681 179492759 170754318
14244 170754318 162743430 154993298 147397800 140506988 133916631 127636743 122382562 117354298
14236 117354298 111777572 107019807 102226368 98168973 94201563 90611720 86787415 83769586
14228 83769586 80129081 76962613 74022546 71508004 68462986 66473223 63788745 62061477
14220 62061477 60076670 57787706 55717812 53678517 52000412 50857132 49120553 47964542
14212 47964542 46450625 44735372 43461340 42305051 40872196 40163244 39119152 37880535
14204 37880535 37060467 35734170 34796643 34011571 33382124 32420982 31268461 30357996 29609009
14195 29609009 29208771 28430216 27978743 27065587 26263680 25797265 25011016 24491904 24112489
$$ packed form
14251B45265855j2616273j1721453j1525242j0517788r656418r735922q738441
14244A70754318q010888p750132p595498o890812o590357o279888n254181n028264
14236A17354298n576726m757765m793439m057395l967410l589843l824305l017829
14228H3769586l640505l166468k940067k514542l045018j989763k684478j727268
14220F2061477j984807k288964k069894k039295j678105j143280j736579j156011
14212D7964542j513917j715253j274032j156289j432855p08952j044092j238617
14204C7880535q20068j326297r37527p85072o29447r61142j152521r10465p48987
14195B9609009m00238p78555m51473r13156q01907m66415p86249n19112l79415
$$ plain form
14186 24112489 23367254 22953985 22612611 22145216 21366177 20911844 20489380 19953946 19588582
14177 19588582 19126609 18772457 18378680 17823308 17747256 17542251 16940098 16552074 16317530
14168 16317530 15999706 15583815 15355582 15396269 14865134 14774686 14433951 13879716 13729271 13502474
14158 13502474 13277238 13061607 12811797 12551615 12485141 12028297 11960041 11580657 11834017 11384158
14148 11384158 11434668 10896605 10973124 10566119 10502215 10091904 9905780 10257596 9997962 9779209
14138 9779209 9112768 9392970 9489485 9044918 9276406 9187368 8476850 8833146 8701440 8715440
14128 8715440 8260604 8454280 8071426 7925368 7547331 7508411 7399480 7234109 7501055 7259551
14118 7259551 7312790 7019702 7001571 6830355 6699813 6843110 6610479 6620885 6835977 6422451
$$ packed form
14186B4112489p45235m13269l41374m67395p79039m54333m22464n35434l65364
14177A9588582m61973l54152l93777n55372p6052k05005o02153l88024k34544
14168A6317530l17824m15891k28233M0687n31135r0448l40735n54235j50445k26797
14158A3502474k25236k15631k49810k60182o6474m56844o8256l79384K53360m49859
14148A1384158N0510n38063P6519m07005o3904m10311j86124L51816k59634k18753
14138I779209o66441K80202R6515m44567K31488q9038p10518L56296j31706J4000
14128H715440m54836J93676l82854j46058l78037l8920j08931j65371K66946k41504
14118G259551N3239k93088j8131j71216j30542J43297k32631J0406K15092m13526
$$ plain form
14108 6422451 6244434 6352651 6433449 6395051 5980533 5800883 5867716 6185564 5915989 5829172
14098 5829172 5863928 6151294 5310355 5530522 5446606 5123896 5526782 4837011 5091055 4752349
14088 4752349 5228426 4577695 4925183 4966209 4608936 4633580 4711028 4651994 4709250 4677535
14078 4677535 4429219 4328589 4509808 4278377 4171548 4430097 4291014 4020864 4152619
14069 4152619 3860130 3691677 4000114 4054032 3743916 3945592 3801639 3944639 3581718 3611901
14059 3611901 4002737 3513164 3467543 3796309 3614837 3570541 3658792 3231979 3368499 3255977
14049 3255977 3233653 3422562 3217866 3150592 3358453 3361055 3190305 3392705 2892522 3360591
14039 3360591 3229203 3239102 3166798 3038275 3031049 3569153 3194906 3278076 3335730 2954324 2708502
$$ packed form
14108F422451j78017J08217Q0798l8398m14518j79650O6833L17848k69575q6817
14098E829172L4756K87366q40939K20167q3916l22710M02886o89771K54044l38706
14088D752349M76077o50731L47488M1026l57273K4644P7448n9034N7256l1715
14078D677535k48316j00630J81219k31431j06829K58549j39083k70150J31755
14069D152619k92489j68453L08437N3918l10116K01676j43953J43000l62921L0183
14059C611901L90836m89573m5621L28766j81472m4296Q8251m26813J36520j12522
14049C255977k2324J88909k04696o7274K07861K602j70750K02400n00183M68069
14039C360591j31388R899p2304j28523p226N38104l74247Q3170N7654l81406k45822
$$ plain form
14028 2708502 2678226 2817803 3008161 2852137 2706259 2881282 2607379 2681068 2532300 2337120
14018 2337120 2738154 2549400 2636039 2426011 2404736 2315056 2289680 2463109 2250254 2339369
14008 2339369 2290973 2427007 2227053 1852297 2150085 1629610 2238081 1637194 1957142 2151166
13998 2151166 2119543 2097065 2130316 2130271 2244430 1962428 1850847 2237014 2499999 2892481 5156753
13987 5156753 10209895 25034967 47248153 28770376 15458344 8761861 6183249 4457697
13979 4457697 3931961 3630965 3353263 3201688 2498930 2816554 2865088 2620614 2006733 2134567
13969 2134567 2116650 2282543 2374140 2102674 2330716 2179279 2052975 2370523 2020343 2105111
13959 2105111 1759982 1769518 2169808 2202444 1832795 2034270 1863169 1927988 1631713 1957300
$$ packed form
14028B708502l0276J39577J90358j56024j45878J75023k73903P3689j48768j95180
14018B337120M01034j88754Q6639k10028k1275q9680k5376J73429k12855Q9115
14008B339369m8396J36034j99954l74756K97788n20475O08471o00887L19948J94024
13998B151166l1623k2478L3251m5J14159k82002j11581L86167K62985L92482K264272
13987E156753N053142J4825072K2213186j8477777j3312032o696483k578612j725552
13979D457697n25736l00996k77702j51575p02758L17624M8534k44474o13881J27834
13969B134567j7917J65893R1597k71466K28042j51437j26304L17548l50180Q4768
13959B105111l45129R536M00290L2636l69649K01475j71101O4819k96275L25587
$$ plain form
13949 1957300 1581640 1867657 1899426 1949094 2023689 1912731 1583576 1721000 2079192 1561518
13939 1561518 1547068 1726251 1315340 1500533 1204122 1618926 1819231 1802255 1388904 1269016
13929 1269016 1415970 1756463 1329146 1653141 1932859 1567266 1683435 1290813 1386174 1536386
13919 1536386 1145017 1121121 1541862 1802979 1324546 1657124 1255321 1230650 1144901 1205531
13909 1205531 1487214 1150507 1246388 1414156 1582397 1251799 1476163 1139321 1060971 994674
13899 994674 1341818 1331577 1509306 1256152 1252275 1311676 1335834 1103288 1284406 1179996
13889 1179996 1317664 1300278 962280 1182160 1177073 1136615 683683 1169725 974045 1420248
13879 1420248 1394560 1113714 1124404 1104786 882810 999383 1157269 991062 1452622 907438
$$ packed form
13949A957300l75660K86017L1769M9668P4595j10958l29155J37424L58192n17674
13939A561518j4450J79183m10911J85193k96411M14804K00305j6976m13351j19888
13929A269016J46954L40493m27317L23995K79718l65593J16169l92622R5361J50212
13919A536386l91369k3896M20741K61117m78433L32578m01803k4671q5749O0630
13909A205531K81683l36707R5881J67768J68241l30598K24364l36842p8350o6297
13899I94674L47144j0241J77729k53154l877N9401K4158k32546J81118j04410
13889A179996J37668j7386l37998K19880n087m0458m52932M86042j95680M46203
13879A420248k5688k80846J0690j9618k21976J16573J57886j66207M61560n45184
$$ plain form
13869 907438 1453637 1119025 1158825 801178 1102984 855186 946565 739382 1109157 1072291
13859 1072291 1006128 1051453 1031603 1159620 1222131 760237 781742 1168307 1075119 1236931
13849 1236931 1170405 804059 1152974 1242163 952662 718490 834654 614197 886553 774224
13839 774224 796125 949237 657702 716252 665525 833928 936883 1005357 1173450 889273
13829 889273 1041967 648089 884534 541790 767766 966372 1153633 644890 729780 637206
13819 637206 962656 1067750 467427 1052181 669906 842292 805487 1016900 668247 836492
13809 836492 512841 1005077 862100 691241 929446 759803 1055294 836101 887424 896278
13799 896278 809175 982697 901245 585517 1030786 1027180 883208 1024846 1005987 550141
$$ packed form
13869I07438N46199l34612L9800l57647L01806k47798R1379k07183L69775l6866
13859A072291o6163M5325j9850J28017O2511m61894K1505L86565r3188J61812
13849A236931o6526l66346L48915Q9189k89501k34172J16164k20457K72356j12329
13839G74224K1901J53112k91535N8550n0727J68403J02955O8474J68093k84177
13829H89273J52694l93878K36445l42744K25976J98606J87261n08743Q4890r2574
13819F37206L25450J05094D67427N84754l82275J72386l6805K11413l48653J68245
13809H36492l23651M92236j42977j70859K38205j69643K95491k19193N1323Q854
13799H96278q7103J73522q1452l15728M45269l606j43972J41638j8859m55846
$$ plain form
13789 550141 473487 485643 748600 555610 748027 385730 932110 582508 845876 482972
13779 482972 621687 1023335 371942 706714 625756 630832 902625 851734 744395 748067 943849
13768 943849 828673 505773 894833 568302 665389 734643 321859 389023 748827 801768
13758 801768 1040476 600292 701842 790232 531123 829656 550017 593872 462584 384100
13748 384100 679554 493878 749021 684809 900799 580417 654576 340590 690133 513310
13738 513310 649950 458683 526036 615042 609710 645466 637027 522301 434675 725563 469562
13727 469562 504597 566657 293945 559571 703760 750196 531290 332210 605476 326735
13717 326735 870932 448556 371163 306598 201070 570111 296160 858970 312759 987521
$$ packed form
13789E50141p6654J2156K62957j92990J92417l62297N46380l49602K63368l62904
13779D82972J38715M01648C71942L34772q0958N076K71793n0891j07339L672J95782
13768I43849j15176l22900L89060l26531R7087O9254C21859O7164L59804N2941
13758H01768K38708m40184J01550Q8390k59109K98533k79639M3855j31288p8484
13748C84100K95454j85676K55143o4212K15990l20382P4159l13986L49543j76823
13738E13310J36640j91267O7353Q9006n332L5756q439j14726q7626K90888k56001
13727D69562L5035O2060k72712K65626J44189M6436k18906j99080K73266k78741
13717C26735N44197m22376p7393o4565j05528L69041k73951N62810C12759O74762
$$ plain form
13707 987521 387364 203490 47449 630446 570424 441074 398899 474227 343166 700417
13697 700417 322299 415636 325237 662441 555202 534036 258870 652692 264186 622562
13687 622562 198755 362215 285605 337212 418883 678440 385589 492925 363293 86078
13676 161291 351173 592158 342409 225420 474489 599272 195294 342164 602559 404437
13666 404437 401473 310036 360303 323138 314738 135417 539672 360485 214854 284334 506591
13655 506591 456492 225395 302560 39581 265303 300783 494407 586562 476139 614698
13645 614698 390940 553241 176863 581687 353792 546411 245898 349750 139393 408831
13635 408831 182526 455217 447442 124015 311072 496153 463795 641478 164282 362301
$$ packed form
13707I87521C87364j83874D7449N82997o0022j29350m2175P5328j31061L57251
13697G00417C22299R3337r0399L37204j07239k1166B58870L93822B64186L58376
13687F22562A98755J63460p6610N1607Q1671K59557k92851J07336j29632H6078
13676A61291J89882K40985k49749j16989K49069J24783A95294J46870K60395j98122
13666D04437k964r1437N0267l7165q400A35417M04255j79187j45631O9480K22257
13655E06591n0099B25395P7165C9581K25722L5480J93624R2155j10423J38559
13645F14698k23758J62301A76863M04824k27895J92619B45898J03852A39393K69438
13635D08831A82526K72691p775A24015J87057J85081l2358J77683A64282J98019
$$ plain form
13625 362301 110559 332719 657709 493784 444533 351636 288954 558175 328394 172423
13615 172423 209612 203658 98454 360685 95806 463364 330604 110483 626060 261171
13604 452304 554950 542269 447763 393075 111085 378422 241669 441186 252306 153995
13594 153995 519275 282902 53189 400060 532457 79250 410718 516957 106265 226627
13584 226627 29369 246470 470735 219978 423351 100305 114790 227517 155666 673201
13574 673201 187039 387069 137686 527990 349515 244055 4448 600717 343354 8921
13563 240146 453072 220511 310825 114157 323141 640689 -13360 438014 184894 234710
13553 234710 227588 442317 163795 453297 343911 571691 109309 582839 272897 155055
$$ packed form
13625C62301A10559K22160L24990j63925m9251r2897o2682K69221k29781j55971
13615A72423L7189n954I8454K62231I5806L67558j32760A10483N15577B61171
13604D52304J02646j2681r4506n4688A11085K67337j36753J99517j88880r8311
13594A53995L65280k36373E3189L46871J32397G9250L31468J06239A06265J20362
13584B26627B9369K17101K24265B19978K03373A00305J4485J12727p1851N17535
13574F73201A87039K00030A37686L90304j78475j05460D448N96269k57363H921
13563B40146K12926B20511R0314A14157K08984L17548a3360D38014A84894M9816
13553B34710p122K14729A63795K89502j09386K27780A09309M73530B72897j17842
$$ plain form
13543 155055 282422 230662 202713 319448 180733 319856 433064 308812 342192 391267
13533 391267 -1233 275467 281729 224835 637179 299884 228054 169473 436783 286920 162194
13522 162194 78855 288437 648156 525108 8368 163828 457197 359308 275902 300986 146972
13510 290332 396886 59013 351043 81305 257071 374762 357623 449561 324661 105528
13499 309639 -5812 315534 130386 334896 577559 166034 197707 48504 480381 442350
13489 442350 368446 106047 330827 146444 185998 241846 241027 480381 311191 329318 208566
13478 208566 165710 -104346 294146 309576 68397 619862 326166 63417 382306 385303 91117
13466 246897 251482 35052 264414 386728 360485 217334 278164 91365 -29646 9630 311551
$$ packed form
13543A55055J27367n1760k7949J16735j38715J39123J13208j24252L3380M9075
13533C91267a233B75467O262n6894M12344B99884p1830n8581K67310j49863j24726
13522A62194G8855K09582L59719j23048H368J55460K93369r7889q3406K5084A46972
13510B90332J06554E9013K92030H1305J75766J17691j7139R1938j24900A05528
13499C09639e812C15534A30386K04510K42663A66034L1673D8504M31877l8031
13489D42350p3904A06047K24780A46444L9554N5848q19K39354j69190J8127j20752
13478B08566m2856a04346B94146J5430F8397N51465k93696F3417L18889K997I1117
13466B46897M585C5052K29362J22314k6243j43151O0830I1365b9646I630L01921
$$ plain form
13455 311551 138139 48156 -126159 133683 146922 364580 119482 264100 81807 394985
13445 394985 229927 112756 169189 208269 530100 304794 420833 324414 262459 330821
13435 330821 -150941 207976 29720 310472 323531 -4544 260810 -108419 54519 175776
13425 175776 -223263 -254244 -97908 631172 -69454 20122 107416 28433 203811 -100855 54106
13413 445804 -55749 -161643 393058 236794 3978 121924 163277 253753 516400 -249861
13402 164 152688 -226025 529312 344375 -8196 237607 239079 392117 104856 79488 -13702
13390 320425 185630 64515 13786 -58270 276149 399603 -6692 -151073 -58219 141490 135067
13379 135067 73370 364913 142300 19280 394670 140928 371467 289112 114971 25375
$$ packed form
13455C11551A38139D8156a26159A33683J3239K17658A19482J44618H1807L13178
13445C94985j65058A12756N6433L9080L21831k25306J16039r6419o1955O8362
13435C30821a50941B07976B9720K80752J3059d544B60810a08419E4519J21257
13425A75776b23263l0981i7908F31172f9454B0122Q7294B8433J75378a00855E4106
13413D45804e5749j05894C93058j56264C978J17946M1353R0476K62647b49861
13402A64J52524b26025E29312j84937h196B37607J472J53038A04856k5368a3702
13390C20425j34795F4515A3786e8270B76149J23454f692j44381e8219A41490o423
13379A35067o1697K91543A42300A9280L75390A40928K30539q2355A14971B5375
$$ plain form
13368 432082 285877 117456 52810 208969 64396 333768 220082 513079 224490 319247
13358 319247 434044 306607 598405 327894 -1836 -19694 157662 -224088 252711 101950
13347 370627 66675 45447 103721 195307 136538 326938 518576 -12984 349694 103455 292083
13336 292083 499492 267813 445519 330015 357977 224173 48493 225377 231266 258548
13326 258548 51630 56477 154935 -81112 450909 282486 109045 424544 63568 253557 32606
13314 629942 246819 273162 275817 104770 433622 457084 230109 381537 520517 390466
13304 390466 -293433 314999 170293 193028 -210710 169432 -13951 120151 204443 222414
13294 222414 -96482 -31914 119731 254714 4566 92198 231926 -46117 136831 -136239 -22041
$$ packed form
13368D32082j46205A17456E2810J56159F4396K69372j13686K92997B24490R4757
13358C19247J14797j27437K91798k70511a836j7858A57662b24088B52711A01950
13347C70627F6675k1228N8274R1586n8769J90400J91638a2984C49694A03455J88628
13336B92083K07409k31679J77706j15504K7962j33804D8493J76884N889K7282
13326B58548E1630M847R8458h1112D50909j68423A09045L15499F3568J89989C2606
13314F29942B46819K6343K655A04770L28852K3462k26975J51428J38980j30051
13304C90466b93433C14999j44706K2735b10710A69432a3951A20151Q4292J7971
13294B22414i6482c1914A19731J34983D566Q7632J39728d6117A36831a36239b2041
$$ plain form
13282 129285 255568 231147 336735 129099 282670 406801 32329 55876 171950 236029
13272 236029 73265 5277 -153320 240569 179512 364077 -146451 83602 96476 561173 177800
13260 242221 -72114 143091 229898 125677 -10278 213447 -205756 157226 138353 54135
13249 116490 -16480 195379 39601 -59212 60373 173572 -589463 109530 89622 195505
13239 195505 47683 111666 147052 -124662 233988 57767 123215 -59784 343542 209979 -134185
13227 108581 62322 -256834 241019 196547 -235737 181203 228170 329576 129105 303607
13217 303607 -162276 6218 123972 -149708 -143326 167682 200788 285942 67629 -73812 119418
13205 188542 -54698 -192104 53367 349197 54609 257223 1127 311436 60259 250593 12668
$$ packed form
13282A29285J26283k4421J05588A29099J53571J24131C2329K3547J16074O4079
13272B36029G3265E277a53320B40569o1057J84565a46451H3602J2874M64697A77800
13260B42221g2114A43091Q6807j04221a0278B13447b05756A57226j8873E4135
13249A16490a6480A95379C9601e9212F0373J13199e89463A09530j9908J05883
13239A95505D7683O3983L5386a24662B33988E7767O5448e9784C43542j33563a34185
13227A08581m6259b56834B41019m4472b35737A81203M6967J01406A29105J74502
13217C03607a62276F218J17754a49708O382A67682L3106Q5154F7629g3812A19418
13205A88542e4698j37406E3367K95830E4609K02614A127L10309F0259J90334A2668
$$ plain form
13193 439085 -162542 -61981 -57070 202119 206275 66966 55795 282190 326125 214932 412603
13182 412603 186481 -254481 181432 69154 268670 509425 196103 430448 -47125 -91227
13172 -91227 253878 233107 108606 310760 196518 329521 -60584 246219 -244168 155650
13161 54974 -62627 -61765 155996 -16954 -112152 334765 165079 211477 262982 -3962 262200
13149 -163615 226225 302619 189547 87901 26888 -193764 -227027 -70419 192670 352819
13139 352819 238629 250946 148083 194892 103652 -23267 64733 362273 -235492 -50906 303112
13127 -320872 112605 171118 77511 483738 -132307 135300 272432 -14166 55091 132808
13117 132808 66599 -115897 141681 342292 -260708 236968 -256472 -17613 128813 -138401
$$ packed form
13193D39085a62542f1981M911B02119M156F6966j1171K26395M3935j11193J97671
13182D12603A86481b54481A81432F9154J99516K40755A96103K34345d7125m4102
13172i1227B53878k0771A08606K02154j14242J33003f0584B46219b44168A55650
13161E4974f2627Q62A55996a6954r5198C34765A65079M6398N1505c962B62200
13149a63615B26225P6394j13072H7901B6888a93764l3263g0419A92670J60149
13139C52819j14190J2317j02863M6809r1240b3267F4733K97540b35492e0906C03112
13127c20872A12605N8513G7511M06227a32307A35300J37132a4166E5091P7717
13117A32808o6209a15897A41681K00611b60708B36968b56472a7613A28813a38401
$$ plain form
13106 51487 80867 -138639 -153264 -104434 101204 -125230 -382097 95303 276405 -264901
13095 -38507 -73242 87284 191012 -52895 53463 206071 219861 -26851 -199317 -86854 134325
13083 32861 111194 -91051 16386 221657 -44739 -98285 -127168 9430 15187 427615 -27925 -20912
13071 -20912 -94264 398159 263269 190319 -142134 118434 47503 -27473 -55997 -42292 174661
13059 -86280 36158 135381 285941 -56502 23468 -198520 -29798 277761 89778 215568 -61725
13047 297301 -138187 24061 224841 252939 187236 -77654 170220 73241 -325040 -18564 -113787
13036 -113787 321969 131803 193549 233728 -125346 178554 49361 220102 121497 253692
13026 253692 -198499 -181406 22364 217884 193322 134713 209241 -368698 46951 -32128 69887
$$ packed form
13106E1487K9380a38639j4625M8830A01204a25230k56867I5303J81102b64901
13095c8507l4735H7284J03728e2895E3463J52608J3790b6851j72466h6854A34325
13083C2861P8333i1051A6386K05271d4739n3546k8883I430N757M12428b7925P013
13071b0912p3352C98159j34890p2950a42134A18434D7503b7473k8524J3705A74661
13059h6280C6158R9223J50560e6502B3468a98520b9798B77761H9778J25790f1725
13047B97301a38187B4061K00780K8098o5703g7654A70220G3241c25040a8564r5223
13036a13787C21969A31803O1746M0179a25346A78554D9361J70741r8605J32195
13026B53692a98499J7093B2364J95520k4562n8609P4528c68698D6951c2128F9887
$$ plain form
13014 -257641 -10975 57721 21952 -52092 -23470 -240410 60489 -45031 148335 290506 -172247
13002 211711 75771 11247 -242309 47649 137419 -63959 251998 186052 145396 -16990 -3653
12990 108266 61409 -138929 69566 75606 -72506 -132000 145775 82916 -138127 145964 150863
12979 150863 9257 61582 183988 33953 -245761 80509 -7106 -51006 -250461 175996 27618
12967 207984 103007 -69667 -4363 12397 -118414 131221 25746 152795 136571 -189521 135531
12955 258156 192012 89082 165727 76183 138270 58786 73273 167262 -330666 -236328 -132722
12944 -132722 -118788 105218 -67459 29177 3793 -38315 -22142 36003 -141191 -46310 55701
12932 44033 -29448 183627 210561 16749 34526 100673 -21425 74337 83812 161397 72828 -19653
$$ packed form
13014b57641a0975E7721B1952e2092b3470k16940F0489d5031A48335J42171a72247
13002B11711G5771A1247b42309D7649Q9770f3959B51998o5946m0656a6990c653
12990A08266m6857a38929F9566O040g2506n9494A45775o2859a38127A45964M899
12979A50863I257N2325J22406C3953b45761H0509g106m3900j99455A75996B7618
12967B07984A03007f9667d363A2397a18414A31221B5746J27049j6224a89521A35531
12955B58156o6144H9082P6645G6183O2087E8786J4487R3989c30666R4338J03606
12944a32722J3934A05218f7459B9177C793c8315J6173C6003a41191d6310E5701
12932D4033b9448A83627K6934A6749J7777O6147b1425G4337R475P7585G2828a9653
$$ plain form
12919 -60269 33811 541 149807 -278802 -180152 128738 -8550 86700 -22806 -135516 -100034
12908 -100034 45877 -2072 -79185 -11505 -94290 5041 201517 9287 -547323 24476 -238181
12896 -236101 51648 22002 143530 -148013 82167 50155 215913 -121765 200935 -50859
12885 92725 253027 -78847 12424 82658 233220 -21102 -171620 192681 132868 17921 -54358
12873 111281 65022 29602 196592 -9365 -121402 156894 167028 -159690 -77689 105300 124503
12862 124503 11031 -108113 -219907 212996 158356 -214074 -194578 -126596 -16703 -236763
12852 -236763 -262977 -93132 39018 -202219 -29737 -11846 61646 -78462 -210060 33411 6813
12840 6100 -15270 72839 -257931 -109147 100968 82960 68240 174677 254901 -142766 255001
$$ packed form
12919f0269C3811E41J49266b78802R8650A28738h550H6700b2806j12710L5482
12908a00034D5877b072p7113a1505q2785E041J96476I287e47323B4476b38181
12896b36101E1648B2002J21528a48013H2167l2012J65758a21765B00935e0859
12885I2725J60302g8847A2424P0234J50562b1102j50518A92681n9813A7921e4358
12873A11281m6259B9602J66990i365j12037A56894J0134a59690g7689A05300J9203
12862A24503A1031a08113j11794B12996n4640b14074J9496O7982a6703k20060
12852b36763k6214i3132C9018b02219b9737a1846F1646g8462j31598C3411F813
12840F100a5270G2839b57931a09147A00968j8008j4720J06437Q0224a42766B55001
$$ plain form
12828 96113 -87229 64136 -97043 -56263 -18132 92324 -50530 -230522 154664 -163928 313059
12816 -246440 -76131 56476 -127484 -226755 -66801 119892 -372729 -11905 43473 7930 -219604
12804 187897 -347576 -148901 140501 -304918 47202 -14094 -172662 86724 84345 -177537
12793 101489 266350 5348 -3126 -97967 19746 -194739 152567 -120497 75234 -52559 -94863
12782 -94863 71394 49130 -166534 -436347 -76054 325047 -37687 82887 -148406 66597 -131923
12770 -93891 39402 -42907 51939 21040 -66324 95350 -31675 147929 88799 235044 -243216
12758 23255 -72929 -121229 -71974 -81031 286929 -83353 128394 121491 -18241 293411 -75649
12746 -313801 248041 73414 -220623 64940 105016 -311767 -7200 106116 -224211 45155 -84232
$$ packed form
12828I6113h7229F4136i7043M0780a8132I2324e0530j79992A54664a63928C13059
12816b46440g6131E6476a27484r9271f6801A19892c72729a1905D3473G930b19604
12804A87897c47576a48901A40501c04918D7202a4094j58568H6724k379a77537
12793A01489J64861E348c126r4841A9746a94739A52567a20497G5234e2559m2304
12782i4863G1394k2264a66534k69813g6054C25047c7687H2887a48406F6597a31923
12770i3891C9402d2907E1939B1040f6324I5350c1675A47929n9130J46245b43216
12758B3255g2929m8300M9255r057B86929h3353A28394o903a8241B93411g5649
12746c13801B48041G3414b20623F4940M0076c11767g200A06116b24211D5155h4232
$$ plain form
12734 5301 12251 143253 -393298 -77830 -115041 -3228 -150137 205790 212032 40157 -134877
12722 -135809 -62822 -63748 -69077 249883 262494 34500 95061 145573 7858 263810 219616 -8700
12709 210306 -9054 1452 -23509 151010 -111254 33972 121745 -203525 -119178 36668 -86125
12697 -56944 -137525 84289 -16404 -209289 51345 6306 203356 204728 104978 -54271 -169966
12686 -169966 94796 74282 -238569 138931 236870 54186 -51424 -310230 -126682 4139 117828
12675 117828 98244 -108474 -241100 2223 74671 114266 172717 -203119 -199501 -95618 -101214
12664 -101214 166445 -379057 -21854 -34814 -156413 245454 156195 240013 -154707 -100165
12654 -100165 -98624 65439 125455 83927 52815 -84113 -30363 56312 78956 63061 -68823 183595
$$ packed form
12734E301O950J31002c93298g7830l7211c228j46909B05790O242D0157a34877
12722a35809f2822r26n329B49883J2611C4500O0561N0512G858K55952m4194h700
12709B10306i054A452b3509A51010a11254C3972Q7773b03525Q4347C6668h6125
12697e6944q0581H4289a6404j92885E1345F306J97050J372r9750e4271j15695
12686a69966I4796k0514b38569A38931R7939E4186e1424k58806a26682D139J13689
12675A17828j9584a08474j32626B223P2448L9595N8451b03119L618i5618n596
12664a01214A66445c79057b1854j2960j21599B45454q9259Q3818a54707N4542
12654a00165J541F5439O0016m1528l1112h4113c0363E6312K2644j5895f8823A83595
$$ plain form
12641 -9051 111828 -105528 -2510 60962 -75346 8426 376196 -153941 2576 -230691 69709
12629 -80919 118292 130873 -252034 -104327 98035 168937 38374 -61942 -320219 3269 -59004
12617 -36236 -90912 -122574 -41052 77998 -443539 277844 -74095 -248821 -208 -63690 -170035
12606 -170035 -1470 130593 -61500 -162965 -285909 85371 -267354 123197 99438 -140884
12595 6539 -194652 85090 -274200 -4612 155322 -49837 -203258 -61760 118110 94072 186475
12584 186475 255325 120574 9479 -184106 103024 -282900 -90301 242633 -20354 34382 -125220
12572 -447083 -40598 223080 -134965 39710 148665 -268027 248944 -117295 326896 -205935
12561 50217 37788 149119 70165 13592 186013 -62852 26501 -14715 -184974 -226827 43132
$$ packed form
12641i051A11828a05528b510F0962g5346H426L67770a53941B576b30691F9709
12629h0919A18292J2581b52034a04327I8035P0902C8374f1942k58277C269e9004
12617c6236n4676l1662d1052G7998d43539B77844g4095j74726b08o3482j06345
12606a70035a470A30593f1500j01465j22944H5371b67354A23197k3759a40884
12595F539a94652H5090b74200d612A55322d9837j53421f1760A18110k4038R2403
12584A86475O8850A20574I479a84106A03024b82900i0301B42633b0354C4382a25220
12572d47083d0598B23080a34965C9710J08955b68027B48944a17295C26896b05935
12561E0217j2429J11331G0165A3592J72421f2852B6501a4715j70259m1853D3132
$$ plain form
12549 90950 121446 74013 -207700 195097 448188 64685 405501 395015 409544 99874 54770
12538 54770 29614 -5778 155150 82224 297790 367302 265821 -20813 160495 -2898 141147
12526 181205 -17128 -52101 66808 -196669 134602 -20018 -118311 161948 -116968 69357 324768
12515 324768 26472 405979 645474 284111 654535 106759 -1383 143398 72378 153495
12505 153495 38536 124512 28366 58491 -170117 164535 -129537 -196274 -194766 158813 187723
12494 187723 -204828 172197 163050 197344 113171 307197 30598 41553 131414 330516 594700
12483 594700 391410 223246 203069 160119 -23003 -73014 154609 -120001 103371 -66759
12472 -325741 -15232 -100151 225687 -108641 100838 -52684 -157901 77768 -57682 99745 -72865
$$ packed form
12549I0950L0496m7433b07700A95097K53091F4685L40816j0486J4529I9874m5104
12538E4770k5156e778A55150p2926K15566O9512j01481b0813A60495b898A41147
12526A81205a7128l4973F6808a96669A34602b0018r8293A61948a16968F9357K55411
12515C24768B6472L79507K39495B84111L70424A06759a383A43398p1020Q1117
12505A53495C8536Q5976B8366L0125a70117A64535a29537o6737J508A58813K8910
12494A87723b04828A72197r147L4294q4173J94026C0598J0955Q9861J99102K64184
12483E94700k03290j68164k0177m2950b3003n0011A54609a20001A03371f6759
12472c25741a5232q4919B25687a08641A00838e2684j05217G7768e7682I9745g2865
$$ plain form
12460 -161263 39906 39026 166389 -184148 -49023 -103838 100113 39879 -175823 -209239 -151000
12449 -151000 28846 -95376 -164526 365405 95463 -194620 60151 28956 20361 -84021 -2267
12437 -66253 -5268 235297 -254386 -63142 249958 10717 -211764 -67815 84796 -62599 -41519
12426 -41519 -194874 -190108 -30373 -178966 -17729 227036 29800 -139240 161873 -227320 82645
12414 -36310 -84038 -74438 135552 40495 -168896 76586 98470 -112754 -149162 -298891 55095
12402 -14368 -13185 160713 188022 8638 397407 241600 74279 -48127 224694 -51022 -180398
12391 -180398 197104 -78870 197826 -131938 -28081 -7664 -172432 -258806 -230107 40766 -9954
12379 45520 -8349 150790 10656 98489 -128414 -105300 -183889 -124275 82747 -144361 -132438
$$ packed form
12460a61263C9906q80J27363a84148d9023n4815A00113C9879a75823l3416N8239
12449a51000B8846i5376o9150C65405I5463a94620F0151B8956q595h4021b267
12437f6253e268B35297b54386f3142B49958A0717b11764f7815H4796f2599K1080
12426d1519j53355M766c0373j48593a7729B27036B9800a39240A61873b27320H2645
12414c6310m7728R600A35552D0495a68896G6586K1884a12754l6408j49729E5095
12402a4368J183A60713K7309H638L88769j55807G4279d8127B24694e1022j29376
12391a80398A97104g8870A97826a31938b8081g664j64768q6374K8699D0766i954
12379D5520h349A50790A0656Q7833a28414K3114p8589N9614H2747a44361J1923
$$ plain form
12368 -132438 -85780 580 -35788 97335 348187 -94917 64155 -123772 207456 -21148 -335511
12357 -335511 -226194 -99597 6890 13624 5467 -104987 -235094 -176801 124191 339053 207737
12346 207737 -151515 -295430 -177302 -156516 126967 -85080 -127583 391687 126450 7879
12335 -51992 -28849 -137010 364643 -174991 30317 197388 27144 155557 265851 108057
12324 213999 -202361 212663 147903 188289 108432 37306 154629 258038 154451 247095
12314 247095 -66344 257158 142833 36831 -85553 50098 -240024 -95128 198727 -141516
12303 -254316 143234 114539 264212 93340 -136954 302004 35084 71719 -101723 -258221
12293 -258221 54596 27152 237216 343096 140027 -140364 158969 129244 2751 -182814
$$ packed form
12368a32438M6658E80c5788I7335K50852i4917F4155a23772B07456b1148l14363
12357c35511J09317i9597F890O734E467a04987j30107N8293A24191K14862j31316
12346B07737a51515j43915J18128K0786A26967h5080m2503C91687A26450G879
12335e1992K3143j08161C64643a74991C0317J67071B7144J28413J10294A08057
12324B13999b02361B12663o4760M0386p9857C7306J17323J03409j03587R2644
12314B47095f6344B57158j14325C6831h5553E0098b40024i5128A98727a41516
12303b54316A43234k8695J49673I3340a36954C02004C5084L6635a01723j56498
12293b58221E4596B7152K10064J05880A40027a40364A58969k9725B751a82814
$$ plain form
12282 299301 16604 -135879 136780 -166350 -20246 -251644 -71838 -498 24789 -43073 -240768
12271 -240768 21885 183905 39030 -41558 67550 176568 193820 -62566 40023 99396 226604
12260 226604 -40226 189194 60682 90006 9649 105878 -41673 -245231 131356 -11997 53419
12248 33544 -83637 -16433 56707 172163 163400 -283144 216906 248345 -2931 -35774 -204976
12237 -204976 -36027 -51424 9686 109728 -67520 -104840 69856 142574 382090 311047 -521945
12225 388711 -41522 -195588 141720 31774 314977 -35926 338228 100428 134648 -30024
12214 541427 219541 -9793 -17588 -116532 108202 235637 150288 303439 -19051 116128 -143111
12202 207815 -82384 319953 411545 -95282 141680 -8466 443885 298238 336195 386042 -20203
$$ packed form
12282B99301A6604a35879A36780a66350b0246k31398g1838d98B4789d3073j97695
12271b40768B1885J62020C9030d1558F7550J09018J7252f2566D0023N9373J27208
12260B26604d0226A89194F0682K9324I649R6229d1673k03558A31356a1997E3419
12248C3544h3637a6433E6707J15456q763b83144B16906L1439b931l2843j69202
12237b04976c6027j5397I686J00042f7520l7320F9856P2718K39516p1043e21945
12225C88711d1522j54066A41720C1774K83203c5926C38228A00428L4220c0024
12214E41427B19541i793p795r8944A08202J27435q5349J53151a9051A16128a43111
12202B07815h2384C19953R1592i5282A41680h466D43885j45647L7957M9847b0203
$$ plain form
12190 240725 304513 143126 148942 531810 -137466 -22198 -9052 73765 145428 175857 -150067
12178 66400 455908 313716 429215 243966 -302500 -3574 -122897 7208 109038 -50262 221707
12166 139920 -170173 203333 199413 -48348 61993 -181484 287889 274842 324245 326280 -52791
12154 -80677 -183093 -53389 143374 68617 43540 156193 177064 -307286 -247781 -4658 505662
12142 174872 133743 271098 4561 361152 -314324 336941 195708 -43346 430444 161411
12131 69010 168951 56872 172013 226140 -115186 162454 217293 154512 160556 -89281 133082
12119 296239 -288953 -75557 161458 -17936 -171780 91532 64388 48905 75507 -276386 153338
12107 155929 126615 278291 -174245 -152732 -55218 220359 385714 83268 85337 -337168 -140470
$$ packed form
12190B40725O3788A43126N816L82868a37466b2198i052G3765P1663L0429a50067
12178F6400L89508j42192J15499j85249c02500c574j19323G208J01830e0262B21707
12166A39920a70173B03333l920d8348F1993a81484B87889j3047M9403K035e2791
12154h0677j02416e3389A43374F8617k5077J12653K0871c07286N9505d658E05662
12142A74872m1129J37355D561L56591c14324C36941j41233d3346D30444A61411
12131F9010R9941E6872J15141N4127a15186A62454N4839o2781O044h9281A33082
12119B96239b88953g5557A61458a7936j53844I1532k7144j5483K6602b76386A53338
12107A55929k9314J51676a74245K1513e5218B20359J65355H3268K069c37168a40470
$$ plain form
12095 40763 -5530 -100178 94953 62182 9106 213806 134035 2339 29434 -405725 390297 -198477
12082 -260192 -173269 242852 76474 -40218 -46658 -218331 24715 107638 9192 -124596 67836
12070 75682 141721 34274 63922 84186 164115 196999 14799 82045 115494 130573 -73359 -24706
12057 95242 626009 488336 254103 -160371 115244 -103895 -40628 -76674 195869 98121
12047 98121 123931 23098 203489 66166 268284 -100431 41553 240998 376962 -110184
12036 16241 -133866 -166681 190507 -99094 141191 -78359 136669 -116885 405734 -66510
12025 -354378 -80922 81534 -46384 101455 312322 -150093 119252 -180853 185536 -94038
12014 -118501 -199784 -107547 -46620 280095 190095 -47266 -49323 164404 308087 4976 -142532
$$ packed form
12095D0763e530r4648I4953l2771I106K04700p9771B339K7095d05725C90297a98477
12082b60192Q6923B42852G6474d0218o440j71673B4715Q2923I192a24596F7836
12070G5682O6039C4274K9648K0264P9929L2884A4799O7246L3449J5079g3359b4706
12057I5242N30767j37673k34233a60371A15244a03895d0628l6046A95869r7748
12047I8121K5810B3098J80391F6166K02118a00431D1553J99445J35964a10184
12036A6241a33866l2815A90507i9094A41191g8359A36669a16885D05734f6510
12025c54378h0922H1534d6384A01455K10867a50093A19252a80853A85536i4038
12014a18501q1283R2237d6620B80095r0000d7266k057A64404J43683D976a42532
$$ plain form
12002 -54419 57098 71676 -121761 -384360 -362893 -5308 304125 -209901 66319 -169807 100401
11990 276800 -148046 -211483 -97602 112351 94631 -139572 -152717 175054 -34714 128033
11979 255073 69998 -11221 -320461 34886 -119980 58233 -45613 -221104 -27618 119572 48198
11967 -155975 267004 58383 99758 90584 -182334 -96498 21647 -330397 -84295 -491370 68612
11955 170357 222496 -92376 -111321 182385 -12193 2024 -136541 -113408 -114898 -79919 -180543
11944 -180543 -54650 58301 -488057 85006 -244704 272795 -242202 -166192 75436 120105 17452
11932 -108683 -186685 -184481 -124719 -74172 160052 -180014 -123683 24895 297608 268919 167266
11921 167266 45082 5970 -82541 -245319 -25392 170373 -144726 -296710 -11096 113481 103099
$$ packed form
12002e4419E7098J4578a21761k62599K1467e308C04125b09901F6319a69807A00401
11990B76800a48046o3437i7602A12351j7720a39572j3145A75054c4714A28033
11979B55073F9998a1221l09240C4886a19980E8233d5613j75491b7618A19572D8198
11967a55975B67004E8383M1375r174a82334Q5836B1647c30397h4295m07075F8612
11955A70357N2139i2376j8945A82385a2193B024a36541K3133j490L4979j00624
11944a80543e4650E8301d88057H5006b44704B72795b42202P6010G5436M4669A7452
11932a08683p8002K204N9762N0547A60052a80014N6331B4895K72713k8689j01653
11921A67266D5082E970h2541j62778b5392A70373a44726j51984a1096A13481j0382
$$ plain form
11910 103099 106910 -95534 207885 -215483 -25121 -101959 132831 -322381 4659 -427353 8489
11898 63839 90855 424480 -226651 -171833 -210482 -234159 -175353 67687 -9027 -53571 101093
11886 -3436 -187278 80587 -12659 294551 -149221 99435 -165590 -81863 -287193 293864 -44839
11874 -197386 42127 -323388 -61388 -18261 186062 140399 -18313 54663 426922 -282526 28587
11862 -159309 46677 -55607 56141 102919 -197192 -284760 -163302 -124079 175005 -25574 -104531
11851 -104531 74158 -159156 188091 -183087 -106907 155442 -103263 54545 -287940 -195551
11841 -195551 -203116 3638 -695 -14671 -218212 -70676 86614 -108994 8159 2799 288719 -161098
11828 -60878 45862 -174318 -152498 -14080 161387 -197632 -652 -376269 -467762 -140531 -30419
$$ packed form
11910A03099L811i5534B07885b15483b5121p6838A32831c22381D659d27353H489
11898F3839K7016L33625b26651N4818l8649k3677N8806F7687i027m4544A01093
11886c436j83842H0587a2659B94551a49221I9435a65590h1863k05330B93864d4839
11874a97386D2127c23388f1388a8261A86062m5663a8313E4663L72259b82526B8587
11862a59309D6677e5607E6141M6778a97192q7568J21458L9223A75005b5574p8957
11851a04531G4158a59156A88091a83087P6180A55442a03263E4545b87940R2389
11841a95551p565C638f95j3976k03541g0676H6614a08994H159B799K85920a61098
11828f0878D5862a74318K1820a4080A61387a97632f52l75617r1493a40531c0419
$$ plain form
11816 -71870 -109599 -323524 -13697 154097 -216824 -108595 -118825 -34958 -227783 -191292 158608
11804 54695 13801 68519 36256 -263278 117006 208758 134375 -56822 51873 46287 151281
11793 151281 8800 40208 278103 -7164 25843 -262566 -21688 -23466 -89981 211080 338160
11782 338160 -205695 -32674 -110032 -136611 12964 -337505 114641 -221510 -288314 225567
11771 57758 215793 28479 119486 -114446 88530 -858 -331470 -253315 -162411 -191570 -197524 -145267
11759 -145267 -243775 -242323 -27216 69710 -184069 -290174 133219 211500 68088 22511 124719
11748 124719 -283544 -80140 -16019 -46088 -45015 133299 61013 -93701 20240 -353678 354925
11736 26877 123293 -30318 219211 21623 -103811 -218 -146069 112343 -142604 -16059 88202
$$ packed form
11816g1870l7729k13925a3697A54097b16824J08229j0230c4958j92825L6491A58608
11804E4695A3801N4718l2263b63278A17006R1752p4383e6822E1873n586J04994
11793A51281H800L1408K37895g164B5843b62566b1688j778o6515B11080J27080
11782C38160b05695c2674p7358k6579A2964c37505A14641b21510o6804B25567
11771E7758J58035B8479R1007a14446H8530h58l30612P8155R0904k9159n954N2257
11759a45267r8508J452b7216F9710a84069j06105A33219P8281F8088B2511J02208
11748A24719b83544h0140a6019l0069J073A33299F1013i3701B0240c53678C54925
11736B6877R6416c0318B19211B1623a03811b18j45851A12343a42604a6059H8202
$$ plain form
11724 -27250 -4066 66032 -235425 45118 185770 201230 -231931 -29963 -17039 102957 -152042
11712 206674 -357892 -89810 179269 4191 44200 86223 576587 87118 -4671 -632 60599 38825
11700 38825 55391 -31285 -3147 -213235 113291 3568 40484 -93190 159153 -109533 107991
11688 -1337 -204533 10442 113186 249678 245240 256673 -32347 56519 106921 153311 -197456
11676 39275 161802 248270 12980 -121667 -183437 38619 203868 -127696 92651 -4340 136287
11664 -95275 118114 73312 -20927 282209 -143289 88170 -142358 260324 -186230 40787
11653 216340 169583 -81298 102243 65412 93138 -124105 17320 -47871 120791 -363077 663480
11641 -30956 -122212 -205691 -325786 -8581 28503 46695 -2038 -107912 53661 -35152 -288923
$$ packed form
11724b7250d066F6032b35425D5118J40652J5460b31931b9963J2924A02957a52042
11712B06674c57892h9810A79269D191M0009M2023M90364H7118d671f32F0599k1774
11700C8825J6566c1285c147k10088A13291C568L6916i3190A59153a09533A07991
11688a337k03196A0442J02744J36492m438J1433c2347E6519N0402M6390a97456
11676C9275J22527Q6468A2980a21667o1770C8619J65249a27696I2651d340A36287
11664i5275A18114m4802b0927B82209a43289H8170a42358B60324a86230D0787
11653B16340m6757h1298A02243l6831K7726a24105A7320d7871A20791c63077F63480
11641c0956r1256q3479j20095h581B8503J8192b038j05874E3661c5152k53771
$$ plain form
11630 -288923 -240616 300877 276397 148376 261702 -6984 345676 -165584 -71943 112519
11619 148189 251392 358530 45873 94636 -66914 110320 128034 -134279 9908 -212921 -188896
11608 -188896 -107155 -190513 -46811 -67852 145732 -74259 18541 170572 92056 -184203 77329
11596 -278418 -238642 107345 257040 184729 207933 132364 167533 241930 257418 -3050 233521
11584 -41433 223864 -209387 -30764 -205397 228474 -84804 405225 -67395 74452 -243864
11573 38849 -131305 110503 -130489 47808 134599 -16403 10427 149832 -164992 -303182
11563 -303182 213859 134859 -27553 199626 325433 -246010 55356 -175794 105972 -41597
11552 -267407 191104 -116974 -222760 457494 -74462 -65213 -259200 -197134 129789 8666 297204
$$ packed form
11630b88923M8307C00877k4480j28021J13326f984C45676a65584g1943A12519
11619A48189J03203J07138D5873M8763f6914A10320J7714a34279I908b12921K4025
11608a88896Q1741q3358d6811k1041A45732g4259A8541J52031p8516a84203G7329
11596b78418L9776A07345J49695p2311K3204p5569L5169P4397J5488c050B33521
11584d1433B23864b09387c0764j74633B28474h4804D05225f7395G4452b43864
11573C8849a31305A10503a30489D7808Q6791a6403A0427J39405a64992j38190
11563c03182B13859p9000b7553A99626J25807b46010E5356a75794A05972d1597
11552b67407A91104a16974j05786D57494g4462R249j93987O2066A29789H666K88538
$$ plain form
11541 297204 221391 -36414 -6655 -155443 -90606 -145493 -259309 51858 300140 -41677 -57622
11530 -57622 151881 -3821 123351 -162934 -94162 212364 -52505 94692 234846 -189448 58317
11518 250996 -179508 -245776 70132 257242 63937 138388 -6351 270887 51089 -402695 -134694
11506 105356 -2770 -29663 111518 -36267 -32781 168448 -126177 -65536 -100393 -118432 -171446
11495 -171446 -212415 -70871 -14965 -53081 113790 295672 169150 180801 81227 158163 136471
11484 136471 38789 144654 160853 -45616 12265 310301 122664 203486 113490 239062 217862
11473 217862 151099 318717 164349 93843 72545 -37667 69829 264342 131493 78700 57046
11462 57046 244927 153297 286983 134145 459696 -39263 465846 247285 310272 -40732
$$ packed form
11541B97204p5813c6414f655j48788O4837n4887j13816E1858K48282d1677j5945
11530e7622A51881c821A23351a62934O8772B12364e2505I4692J40154a89448E8317
11518B50996a79508o6268G0132J87110F3937P4451f351B70887E1089d02695a34694
11506A05356b770k6893A11518c6267L486A68448a26177O0641l4857j8039n3014
11495a71446m0969g0871a4965l8116A13790J81882j26522J1651H1227P6936k1692
11484A36471C8789J05865J6199d5616A2265K98036A22664Q0822q9996J25572k1200
11473B17862o6763J67618j54368p0506k1298c7667F9829J94513A31493n2793k1654
11462E7046J87881r1630J33686A34145L25551c9263D65846k18561O2987d0732
$$ plain form
11451 100747 220016 422281 199979 -71355 -42096 115550 160175 -23267 -116158 307765
11440 -68989 2309 330655 -165900 -2831 241072 -51954 249168 323261 282427 263526 -53030
11428 351670 120272 -405003 -28337 161845 -3590 59645 120995 -215281 -91230 -16444 -227935
11417 -227935 343536 260032 151752 -86942 -419325 -37364 359106 -86659 -222645 369577
11406 71245 216175 18881 223181 367121 -43040 23689 81485 201964 -112664 142523
11395 -264314 61893 227497 97527 -104755 179754 -111354 142073 -284546 98394 15614
11384 -90998 -125404 509793 -172864 37060 -225770 -14976 -303322 -251042 102355 -96413 2763
11372 -14372 215153 -112041 -410536 -94341 -160015 -136215 -138956 -272801 -254515 168733 122238
$$ packed form
11451A00747J19269K02265A99979g1355K9259A15550M4625b3267r2891C07765
11440f8989B309L28346a65900b831B41072e1954B49168P4093m0834j8901e3030
11428C51670A20272d05003b8337A61845c590E9645O1350b15281i1230a6444k11491
11417b27935C43536q3504j08280h6942l32383c7364C59106h6659j35986C69577
11406G1245J44930A8881K04300J43940d3040B3689N7796J20479a12664A42523
11395b64314F1893J65604I7527a04755A79754a11354A42073b84546I8394A5614
11384i0998l4406E09793a72864C7060b25770a4976k88346N2280A02355i6413B763
11372a4372B15153a12041k98495i4341o5674K3800k741j33845J8286A68733m6495
$$ plain form
11361 122238 -128646 285188 -34138 -258999 38605 271158 35019 -83275 74715 -333741
11350 295270 145207 58417 104675 202108 -116240 50261 92064 5910 197735 -151132 -230568
11339 -230568 -105985 35506 -123792 -151175 -80647 -203323 -168492 271271 -20602 -181495
11329 -181495 37743 -161759 95144 295939 -65032 54854 69569 -44532 -252845 -254421 -191632
11318 -191632 166471 93638 -22404 205139 -39824 -22029 -293604 -123640 -28678 168564
11307 203783 186319 -137850 82738 114036 216409 -207130 -60118 25870 49383 98925 -240713
11295 283432 14042 -102021 182214 -193888 -73672 -140063 -150997 -34947 288757 49330 -436348
11283 -28323 -289891 -107841 -158391 4185 -96000 -230334 -39239 180451 -140339 -176548 78221
$$ packed form
11361A22238a28646B85188c4138k24861C8605K32553C5019h3275G4715c33741
11350B95270A45207E8417M6258R7433a16240E0261M1803E910J91825a51132p9436
11339b30568a05985C5506a23792k7383P0528j22676L4831B71271b0602j60893
11329a81495C7743a61759I5144K00795f5032E4854J4715d4532k08313j576O2789
11318a91632A66471p2833b2404B05139c9824J7795k71575a23640b8678A68564
11307B03783j7464a37850H2738L1298J02373b07130f0118B5870K3513M9542b40713
11295B83432A4042a02021A82214a93888g3672o6391j0934c4947B88757D9330d36348
11283b8323k61568a07841n0550D185i6000j34334c9239A80451a40339l6209G8221
$$ plain form
11271 193077 244509 -268789 187753 -101151 69012 155343 -186435 -295806 75985 94893
11261 94893 -16667 88692 -18479 112186 403833 -122083 258369 -4021 136476 -224933 -222250
11250 -222250 156184 -310494 101085 -68919 135540 223975 93030 -186389 60894 150737
11240 150737 226904 -274509 -20208 36369 -213679 -70688 -381244 36459 -2435 -139335 -163899
11229 -163899 -18855 148070 170141 -149396 22309 -65693 26702 -206483 -100470 -15564 -178825
11218 -178825 -252389 -156646 247661 -147145 -140714 60705 9290 -153003 63558 -230474 160646
11206 183976 -244868 -39606 15279 -78902 -49093 -53158 83956 -442940 -260260 41413 64685
11195 64685 -188100 51934 67355 -14754 -72616 -362244 -169644 4776 -233273 101658 200496
$$ packed form
11271A93077N1432b68789A87753a01151F9012Q6331a86435j09371G5985J8908
11261I4893a6667H8692a8479A12186K91647a22083B58369d021A36476b24933K683
11250b22250A56184c10494A01085f8919A35540Q8435I3030a86389F0894Q9843
11240A50737P6167b74509b0208C6369b13679g0688l10556C6459b435j36900k4564
11229a63899a8855A48070K2071a49396B2309f5693B6702b06483a00470a5564j63261
11218a78825p3564R5743B47661a47145O431F0705I290a53003F3558b30474A60646
11206A83976b44868c9606A5279g8902K9809m065H3956d42940J82680D1413K3272
11195F4685a88100E1934J5421a4754n7862k89628a69644D776b33273A01658R8838
$$ plain form
11184 200496 202638 -195485 -192237 -268495 -192050 -90054 -35678 -128565 -31630 74285 102408 1264
11171 -325049 -155315 -282078 75544 -361766 -29361 97799 77390 114309 -22460 -106978 -198870
11160 -198870 -90697 -551136 147111 7935 -467087 -11350 -77421 209929 -231592 294193
11149 129656 -133775 -317249 288600 38838 -42310 -127606 -116291 -395295 -82252 96132 -267046
11137 173311 -4944 166152 23342 -85364 78038 -65595 20523 -209585 210440 43816 -45868
11125 15640 -307019 239115 -225061 262340 148823 61190 -105007 -4277 392362 114648
11114 267324 -114573 96147 -216243 -77467 182190 245696 -262325 162541 -40483 37983
11103 87922 -107673 74063 294591 12441 -286548 286757 186231 236309 -67625 203652
$$ packed form
11184B00496K142a95485L248p6258P6445i0054c5678r2887c1630G4285K8123A264
11171c25049a55315j26763G5544c61766b9361I7799k0409L6919b2460q4518r1892
11160a98870i0697m60439A47111G935d67087a1350o6071B09929b31592B94193
11149A29656a33775j83474B88600C8838d2310q5296J1315k79004h2252I6132b67046
11137A73311d944A66152B3342h5364G8038f5595B0523b09585B10440D3816d5868
11125A5640c07019B39115b25061B62340j13517F1190a05007d277C92362A14648
11114B67324a14573I6147b16243g7467A82190O3506b62325A62541d0483C7983
11103H7922a07673G4063K20528A2441b86548B86757j00526N0078f7625B03652
$$ plain form
11092 193228 11800 195906 -16810 -50603 292231 513807 98362 -3973 81523 361575 200921
11081 200921 159894 -155503 -94910 38902 -58227 411419 -66741 367767 180585 154129 383697
11070 383697 649586 480920 369819 302140 160670 285959 604867 400772 443291 622810
11060 622810 337084 280471 -99765 669647 489989 509235 323973 373030 313163 395730 581381
11049 581381 824807 941257 716987 774029 693835 881036 858723 1024804 1008056 1094753
11039 1094753 1019183 734765 876578 842663 820512 812437 960787 973648 830004 886776 855091
11028 855091 806786 802125 852490 880013 609904 659934 619344 876146 941847 657148 462508
11017 462508 781197 874191 694603 782680 271800 636938 514846 653943 868633 645957
$$ packed form
11092A93228A1800J84106a6810l3793B92231K21576I8362c973H1523K80052j60654
11081B00921m1027a55503O0593C8902e8227D11419f6741C67767A80585k6456K29568
11070C83697K65889j68666j11101o7679j41470J25289L18908k04095M2519J79519
11060F22810k85726n6613i9765F69647j79658J9246j85262M9057n9867Q2567J85651
11049E81381K43426J16450k24270N7042q0194J87201k2313J66081j6748Q6697
11039A094753p5570k84418J41813l3915k2151q075J48350J2861j43644N6772l1685
11028H55091m8305m661N0365K7523k70109N0030m0590K56802O5701k84699j94640
11017D62508L18689R2994j79588Q8077B71800L65138j22092J39097K14690k22676
$$ plain form
11007 645957 993945 877782 594926 601993 772268 693350 886202 705621 811505 600984
10997 600984 429896 611897 702493 501659 544956 756259 536599 847302 772255 597035
10987 597035 785740 561597 575630 736732 867768 760563 726867 763930 811023 844189
10977 844189 895965 1118415 1105270 1071772 1206323 1037583 1404731 1557863 1908283 1953030
10967 1953030 2272364 2916533 2716833 3107676 3406630 3805207 3838883 3535558 3343121 2730652
10957 2730652 2001467 1551872 1405037 1258411 1484084 1186263 1341784 1034660 1108013 1097724
10947 1097724 1525738 1209904 915218 603394 249208 703630 480341 286535 603349
10938 603349 388612 556212 121433 326559 -139922 540105 113552 307709 62626 114408
$$ packed form
11007F45957L47988j16163k82856P067J70275p8918J92852j80581J05884k10521
10997F00984j71088J82001R0596k00834M3297K11303k19660L10703p5047j75220
10987E97035J88705k24143J4033J61102J31036j07205l3696L7063M7093L3166
10977H44189N1776K22450j3145l3498J34551j68740L67148J53132L50420M4747
10967A953030L19334O44169j99700L90843K98954L98577L3676l03325j92437o12469
10957B730652p29185m49595j46835j46626K25673k97821J55521l07124P3353j0289
10947A097724M28014l15834k94686l11824B49208M54422k23289j93806L16814
10938F03349k14737J67600A21433K05126a39922E40105A13552J94157F2626N1782
$$ plain form
10928 114408 331937 -161072 200827 -82936 -11645 171348 -81549 -24706 -242371 -105637
10917 -29278 -158752 -98232 234304 128498 -73090 -247579 -125150 199172 -223329 13743
10906 -57308 -52863 313345 -73545 -310665 126440 -128288 -17262 37610 169544 -121446 -86328
10895 -86328 -130998 146458 11861 -155119 207913 -83632 134434 54237 -13264 101057 -39230
10883 186573 -208730 -82065 -57939 137164 -208566 116603 74275 -72433 -140129 173885
10872 -184596 29806 -241862 265701 -80547 29243 -136192 -201702 -92650 58447 -182845 -13926
10860 -321206 84189 116034 -175204 29050 44987 314087 -138206 -330064 108409 -94551
10849 -319408 -83688 234299 52866 22952 137559 -79767 235620 138380 -74989 -133092 -302563
$$ packed form
10928A14408K17529a61072B00827h2936a1645A71348h1549b4706k17665a05637
10917b9278j29474O0520B34304j05806g3090j74489J22429A99172b23329A3743
10906e7308M445C13345g3545k37120A26440a28288a7262C7610J31934a21446L5118
10895h6328m4670A46458A1861a55119B07913h3632A34434E4237a3264A01057c9230
10883A86573b08730h2065K4126A37164b08566A16603m2328g2433o7696A73885
10872a84596B9806b41862B65701h0547B9243a36192o5510i2650E8447a82845a3926
10860c21206H4189L1845a75204B9050J5937K69100a38206j91858A08409i4551
10849c19408h3688B34299E2866B2952J14607g9767B35620r7240g4989n8103j69471
$$ plain form
10838 -302563 -82812 2475 2515 -122520 -276091 -123950 -212138 -142766 -155863 237168 92518
10826 22626 -37496 146809 150348 -289123 -321108 -48198 -164145 110385 -38524 32627 -312244
10814 85169 -1919 -250275 -69186 174072 -188994 175152 -199051 233580 84960 -198416
10803 -25320 177761 -317297 6989 51583 197665 153801 181490 85366 -216578 1692 -422591
10791 -136792 137023 -76852 -353295 -366349 148967 -182149 -67335 -321389 100619 -144716
10780 117824 7402 -154041 -212160 110714 -230717 -46588 -36125 -21992 -132694 106179 -23567
10768 187175 -73665 -105135 -206623 156742 -432766 -226425 155054 -445676 171741 -444672
10757 -120095 -195273 -69307 7630 17753 -343282 -172636 65871 -70750 -501697 -101712 136755
$$ packed form
10838c02563h2812B475M0a22520j53571a23950q8188O9372j3097B37168I2518
10826B2626c7496A46809L539b89123l1985d8198j15947A10385c8524C2627c12244
10814H5169a919k48356f9186A74072a88994A75152a99051B33580H4960a98416
10803b5320A77761c17297F989M4594J46082m3864K7689H5366b16578A692d22591
10791a36792A37023g6852k76443j3054A48967a82149f7335k54054A00619a44716
10780A17824G402a54041n8119A10714b30717d6588J0463J4133j10702A06179b3567
10768A87175g3665l1470j01488A56742d32766K06341A55054d45676A71741d44672
10757a20095p5178f9307G630J0123c43282J70646F5871g0750m30947a01712A36755
$$ plain form
10745 126271 -71671 -4323 -230177 -241805 116323 125517 -147924 -323254 -251998 109141 -211200
10733 -345061 -12658 -8872 91650 -36478 -346138 119083 -26562 -37013 -291684 63911 -324961
10721 -44881 206796 564 35755 -171814 53380 279497 -56334 202578 -154149 -954 -21564
10710 -21564 154451 -14196 -128411 -259784 55360 -89505 -300827 -49098 -87795 -226141 248992
10698 111719 -362836 -157620 452455 -228230 12381 150206 288167 -160793 89772 19537
10687 322779 -210767 -98573 133908 -41046 312534 -214286 -241428 -67866 -131783 -138517 76529
10675 204486 -102550 538600 -6910 -26899 -226955 -267435 -333482 -220050 -39987 -66351 -40753
10664 -40753 79586 -71915 -164515 283718 47631 127216 91533 -24832 -78826 -190076 43196
$$ packed form
10745A26271g1671d323k25854j1628A16323R194a47924j75330P1256A09141b11200
10733c45061a2658L786I1650c6478l09660A19083b6562j0451k54671F3911c24961
10721d4881B06796E64L5191a71814E3380K26117e6334B02578a54149i54k0610
10710b1564A54451a4196j14215j31373E5360h9505k11322d9098l8697j38346B48992
10698A11719c62836a57620D52455b28230A2381J37825J37961a60793H9772A9537
10687C22779b10767i8573A33908d1046C12534b14286k7142f7866o3917o734G6529
10675B04486a02550E38600f910j9989k00056m0480o6047J13432c9987k6364K5598
10664d0753G9586g1915r2600B83718D7631P9585l5683b4832n3994j11250D3196
$$ plain form
10652 -39726 -189522 -101069 23516 -21498 -26476 -187979 -210308 -138816 -220113 204441 -220039
10640 149001 192999 -6589 -47007 -32347 365730 -140968 40183 -53528 278263 127142 40294
10628 126504 254384 32673 -268349 -117293 -4003 -98294 -151257 224854 -287458 -198545 -73634
10616 -201165 -339378 -6224 -92772 -169968 -10339 -181239 -166187 -777 123379 -145741 126383
10604 155403 -10412 -196056 -132376 69441 -72672 16800 -20477 -101715 -60513 -259495 -122471
10592 -245048 -181247 301590 -327912 35169 -48260 -63520 -152685 -47237 -117855 -323087 -99245
10580 36169 -89567 -393923 -246427 145901 -226663 -48805 -307283 93114 -117237 -409721
10570 -409721 -93728 142025 -270122 -101444 33499 -417643 -525597 238978 -310035 -200887
$$ packed form
10652c9726j49796Q8453B3516b1498m978j61503k2329P1492q1297B04441b20039
10640A49001M3998f589m0418J4660C65730a40968D0183e3528B78263A27142D0294
10628A26504J27880C2673b68349a17293d003r4291n2963B24854b87458Q8913g3634
10616b01165j38213f224q6548p7196a0339j70900J5052g77A23379a45741A26383
10604A55403a0412j85644O3680F9441g2672A6800b0477q1238M1202j98982a22471
10592b45048O3801C01590c27912C5169d8260j5260q9165d7237p0618k05232i9245
10580C6169h9567l04356J47496A45901b26663d8805k58478I3114a17237k92484
10570d09721i3728A42025b70122a01444C3499d17643j07954B38978c10035J09148
$$ plain form
10560 -200887 -90255 -100083 -290812 -113639 14953 -25561 -67292 111116 -117350 -404923 224227
10548 276973 139203 182432 -198396 -255931 -25067 -208713 172176 -283985 -62385 -246887
10538 -246887 50712 17084 -82731 -249043 150661 121004 -296321 133153 -271870 102945
10527 182526 -17457 4357 -36087 -94642 -11138 -151085 -67771 49939 -109826 -141357 37160
10515 -104439 -79924 148674 -144292 -116049 34179 226601 -131388 -364463 -130311 111464
10504 -58243 -233135 210338 55579 -9218 2979 -117518 -348822 -174957 -143016 232238 194007
10493 194007 -73395 -7717 -158759 -161595 21580 56160 111697 82293 -186062 41437 -9339 64557
10480 105723 51913 -194427 -87348 -184526 81288 -46223 33523 338086 141688 321673 262141
$$ packed form
10560b00887i0255r828j90729a13639A4953b5561m1731A11116a17350k87573B24227
10548B76973j37770M3229a98396n7535b5067j83646A72176b83985f2385j84502
10538b46887E0712A7084h2731j66312A50661k9657b96321A33153b71870A02945
10527A82526a7457D357c6087n8555a1138j39947f7771D9939a09826l1531C7160
10515a04439K4515A48674a44292K8243C4179J92422a31388k33075a30311A11464
10504e8243j74892B10338E5579i218B979a17518k31304J73865L1941B32238l8231
10493A94007g3395g717j51042k836B1580L4580N5537k9404a86062D1437i339F4557
10480A05723E1913a94427h7348r7178H1288d6223C3523L04563A41688J79985n9532
$$ plain form
10469 262141 -35016 72981 281393 202582 47347 104129 -129629 -37035 201138 -110459 302058
10457 10561 156113 -219167 -115945 -211283 -223146 145060 208070 190462 37867 122542 -53909
10445 -31044 45926 92388 94957 -241212 11990 -328375 -39869 -69839 -313933 17051 -68767
10433 -270871 116060 52740 4270 -105081 191187 -16013 -274061 59063 -68938 -42192 -31682
10422 -31682 -100706 -132302 -37980 -23387 -157416 -87970 -144035 166987 -19629 -329819 7368
10410 69561 -124690 -39604 -135571 263441 78069 -62209 13189 -135466 -220140 -161141 -183537
10399 -183537 40369 137319 -110801 151943 -30017 34233 146512 -10643 188212 -275417
10388 59661 -226886 113497 269512 70596 -34825 -176838 43898 218984 187464 64124 111075
$$ packed form
10469B62141c5016G2981K08412p8811D7347N6782a29629c7035B01138a10459C02058
10457A0561J45552b19167J03222r5338j1863A45060O3010j7608C7867Q4675e3909
10445c1044D5926M6462K569b41212A1990c28375c9869k9970k44094A7051f8767
10433b70871A16060E2740D270a05081A91187a6013k58048E9063f8938K6746J0510
10422c1682o9024l1596c7980J4593j34029O9446n6065A66987a9629l10190G368
10410F9561a24690c9604r5967B63441G8069f2209A3189a35466q4674N8999k2396
10399a83537D0369R6950a10801A51943c0017C4233J12279a0643A88212b75417
10388E9661b26886A13497J56015G0596c4825j42013D3898J75086l1520F4124M6951
$$ plain form
10377 111075 258027 276188 -252914 402239 -78187 249404 163113 63221 285857 276859 233714
10366 233714 335373 109773 162542 247291 188498 511728 375065 385703 775823 518404
10356 518404 473527 487710 382858 96853 540964 246649 383974 -14963 221127 29591
10345 597176 811749 895962 606255 333706 215630 289540 45363 434773 252936 222578
10335 222578 155363 -58170 290293 57251 512145 467160 344259 -103747 -18450 30383 -121712
10323 -46756 160632 -163230 -170504 -155301 -98604 140225 7760 275681 542162 812793 -46188
10311 149656 -114992 70964 220624 -152370 -122431 245016 -40010 -128083 38517 108174 -61556
10299 16579 -502155 -169152 242370 121780 26845 248313 181756 -195456 -20567 -179075
$$ packed form
10377A11075J46952J8161b52914D02239g8187B49404q6291F3221K22636q998m3145
10366B33714J01659A09773N2769Q4749n8793L23230j36663J0638L90120k57419
10356E18404m4877J4183j04852I6853M44111B46649J37325a4963B21127B9591
10345E97176K14573Q4213k89707k72549j18076P3910D5363L89410j81837l0358
10335B22578o7215e8170B90293E7251M54894m4985j22901a03747a8450C0383a21712
10323d6756A60632a63230p274J5203N6697A40225G760K67921K66481K70631d6188
10311A49656a14992G0964J49660a52370K9939B45016d0010q8073C8517O9657f1556
10299A6579e02155a69152B42370j20590B6845K21468o6557a95456b0567j58508
$$ plain form
10289 -179075 -126297 243300 -76269 -289763 -209730 131734 -339593 -72404 -99430 134684
10278 -213605 70066 -168723 144953 -200074 -36065 -120286 104017 -92228 -206152 -43047
10267 140062 232327 -174700 -128297 -140674 11763 32303 147452 10827 -470812 68145 289204
10256 289204 -2047 -2678 -128248 -141989 188896 289391 464448 77019 588450 -30808 422986
10244 -43743 124212 -113300 70732 -22931 -253905 223811 85290 200987 -120385 142641
10233 33679 -1835 19746 -74719 -371855 84106 -363179 -31693 -135848 114088 32324 84865
10222 84865 -42207 146824 28998 144745 33432 -329072 91695 -105993 -412553 -191777
10211 27104 146568 -307780 -114209 4170 76846 -104309 -288666 88321 20170 289434 -162622
$$ packed form
10289a79075N2778B43300g6269k13494Q0033A31734c39593g2404k7026A34684
10278b13605G0066a68723A44953b00074c6065q4221A04017i2228j13924d3047
10267A40062R2265a74700M6403j2377A1763K0540J15149A0827d70812F8145K21059
10256B89204b047o31j25570j3741A88896J00495J75057G7019N11431c0808D22986
10244d3743A24212a13300G0732b2931k30974B23811H5290J15697a20385A42641
10233C3679a835A9746g4719k97136H4106c63179c1693j04155A14088C2324N2541
10222H4865d2207A46824B8998J15747C3432c29072I1695a05993l06560a91777
10211B7104J19464c07780a14209D170P2676a04309j84357H8321B0170K69264a62622
$$ plain form
10199 -118839 -98815 193155 -189778 -79501 -13368 111381 135486 82151 -30146 -133045 -147554
10188 -147554 56235 66512 -90931 45298 -209994 99872 -74336 76526 44846 392293 4806
10176 -210711 655 -153273 225913 -188655 -157388 -93436 -127774 127910 81627 185957 -313616
10164 69289 -302571 -216432 -274522 -98613 -214875 -18596 -262021 119896 58166 62997 -238864
10152 -103903 -53114 -369874 102742 -88721 -133164 -395751 -87759 170885 298336 -387994
10141 -557634 245405 73774 144414 322866 -179139 -76812 163458 -269518 156002 -124244
10130 -724528 -188074 57137 -148299 78612 -194488 -58492 -103399 8669 -94058 -73899 -331430
10119 -331430 -145469 -144612 -27224 63289 -39189 27716 -64720 -76153 -78862 -269388 -312988 -60379
$$ packed form
10199a18839K0024A93155a89778g9501a3368A11381K4105n3335c0146j02899j4509
10188a47554E6235J0277i0931D5298b09994I9872g4336G6526l1680L47447D806
10176b10711F55a53273B25913a88655L1267O3952l4338A27910m6283J04330c13616
10164F9289c02571Q6139n8090i8613j16262a8596k43425A19896E8166M831b38864
10152a03903N0789l16760A02742h8721m4443k62587h7759A70885J27451c87994
10141e57634B45405G3774P0640J78452a79139g6812A63458b69518A56002a24244
10130g24528a88074E7137a48299G8612a94488e8492m4907H669i4058K0159k57531
10119c31430a45469Q57b7224F3289c9189B7716f4720j1433k709j90526m3600f0379
$$ plain form
10106 56403 172844 -399027 24764 -153656 -145361 -160534 102420 -107784 -433612 -180413
10095 -42773 -164256 291614 -97416 -301356 38526 -1903 193691 -132832 -56387 -263103 178298
10083 -201115 -209896 -41767 110576 31441 63985 -283839 72772 224015 -193585 43832 -174065
10071 -110105 -325624 -230862 -138447 -220441 -135169 212105 -136892 13965 -284601 -31065 -263714
10060 -263714 128937 -76870 -254817 115503 -9875 87282 113862 177511 -121381 -121085 8430
10048 -300966 -68657 -126026 -149627 -89319 23707 -29050 15139 75075 -116037 -107259 69739
10036 -92687 69309 7001 -72226 -160550 152856 -76077 -110492 -57347 -27800 -253270 -290006
10025 -290006 -132145 -131189 -46943 -60649 -357670 162000 90828 -110291 22558 216522 -85032
$$ packed form
10106E6403J16441c99027B4764a53656Q295j5173A02420a07784l25828a80413
10095d2773j21483B91614i7416k03940C8526a903A93691a32832e6387k06716A78298
10083b01115q781d1767A10576C1441L2544b83839G2772J51243a93585D3832a74065
10071a10105k15519R4762R2415q1994Q5272B12105a36892A3965b84601c1065k32649
10060b63714A28937g6870j77947A15503i875H7282K6580O3649a21381K96H430
10048c00966f8657n7369k3601O0308B3707b9050A5139N9936a16037Q778F9739
10036i2687F9309G001g2226q8324A52856g6077l4415N3145b7800k25470l6736
10025b90006a32145R56d6943j3706k97021A62000p1172a10291B2558J93964h5032
$$ plain form
10013 -367837 -325874 13158 -113635 16613 279682 120803 -305712 -585322 45987 -79493
10002 65875 -251920 93954 -55428 35050 -35904 -134062 13289 -411701 259737 76858 118523
9991 118523 -195273 7824 -196331 -181508 -235535 -24286 263378 -277367 -203936 233104 271368
9980 271368 -373647 -320463 -69260 -165748 -152745 -463205 -42402 170064 50294 -165856 156614
9968 188288 52618 116789 -258173 -107479 -96640 -190121 -141259 114479 -256604 158587 -60048
9956 42884 67881 127021 16122 153383 185594 -272955 -138165 -69755 10197 -1892 -61674
9945 -61674 127439 8325 39196 17791 -23001 72149 -206132 -135659 -175533 -164961 24673 -225967
9932 137430 -28175 -162895 -42959 -86765 -74399 104496 106508 -135740 -119425 198 -148120
$$ packed form
10013c67837M1963A3158a13635A6613K63069A20803c05712k79610D5987g9493
10002F5875b51920I3954e5428C5050c5904r8158A3289d11701B59737G6858M1665
9991A18523a95273G824a96331J4823n4027b4286B63378b77367P3431B33104L8264
9980B71368c73647N3184f9260r6488J3003l10460d2402A70064E0294a65856A56614
9968A88288E2618O4171b58173a07479J0839r3481M8862A14479b56604A58587f0048
9956D2884K4997N9140A6122J37261L2211b72955J34790O8410A0197a892n9782
9945f1674A27439H325L0871A7791b3001G2149b06132P0473l9874J0572B4673b25967
9932A37430b8175j34720d2959m3806J2366A04496K012a35740J6315A98a48120
$$ plain form
9920 147941 -176778 106799 -30934 83666 -197791 121228 -136221 -57149 -77694 -236563
9910 -236563 -230656 -164202 -312905 201503 -49431 224636 -299402 -24711 -211191 -201939 -39966
9898 56640 114418 148791 -54873 -37762 -160638 125843 -10536 -22592 -112128 -32107 31751
9886 122007 -99263 -137407 48886 -78512 -160986 24438 139369 -20614 153901 6963 -41449
9874 -111979 -185309 -213630 -316929 -282110 -38942 -155889 -298510 -133228 -372549 11663 184744
9863 184744 -410990 -269888 -344920 -321319 -222650 -174140 161177 173439 52547 -288750 -216924
9852 -216924 -188895 -2942 -214044 134131 42043 -132102 -54958 163308 -384306 -195187 -44104
9840 -106731 -208518 80593 216287 -289898 -140614 -298894 245730 -143699 -324459 -242917
$$ packed form
9920A47941a76778A06799c0934H3666a97791A21228a36221e7149k0545j58869
9910b36563N907O6454j48703B01503d9431B24636b99402b4711j86480R252c9966
9898E6640N7778L4373e4873J7111j22876A25843a0536j2056q9536c2107C1751
9886A22007i9263l8144D8886g8512q2474B4438J14931b0614A53901F963d1449
9874a11979p3330k8321j03299L4819c8942j16947j42621a33228k39321A1663J73081
9863A84744d10990J41102p5032K3601R8669M8510A61177J2262E2547b88750P1826
9852b16924K8029b942k11102A34131D2043a32102e4958A63308c84306J89119d4104
9840a06731j01787H0593J35694b89898a40614j58280B45730a43699j80760Q1542
$$ plain form
9830 -242917 -95574 -170168 21959 11194 -199063 -16854 -112603 -139780 74918 -93907 12902
9818 128824 -18855 -458393 -655 11064 -6316 117194 171275 -220947 11980 -126184 177151
9806 -180146 -417654 63576 -124655 116879 -422812 318671 102493 -262900 -111625 -129860
9796 -129860 -502412 118993 40647 -199906 -149647 -322997 213064 -229131 -182110 -358774
9786 -358774 8635 -521196 -17192 141525 52212 -174409 -56202 -260795 -363815 -73363 -203534
9775 -203534 288161 -80347 115054 -34751 -67958 -212455 -21384 134515 -211527 -471923
9765 -471923 -82882 -204166 116172 -89097 -163785 155321 -292042 -191376 64895 12137 -14513
9753 206138 102903 2864 -95645 -129453 -73501 122116 40423 -306827 200106 -43814 150727
$$ packed form
9830b42917i5574p4594B1959j0765a99063a6854r5749k7177G4918i3907A2902
9818A28824a8855m39538f55A1064f316A17194N4081b20947A1980a26184A77151
9806a80146k37508F3576a24655A16879d22812C18671A02493b62900a11625j8235
9796a29860l72552A18993D0647a99906N0259j73350B13064b29131M7021j76664
9786c58774H635e21196a7192A41525E2212a74409e6202k04593j03020g3363j30171
9775b03534B88161h0347A15054c4751l3207j44497b1384A34515b11527k60396
9765d71923h2882j21284A16172h9097p4688A55321b92042J00666F4895A2137a4513
9753B06138A02903B864i5645l3808N5952A22116D0423c06827B00106d3814A50727
$$ plain form
9741 50057 -53142 -222876 -320950 40425 -245581 -101468 68124 -49947 31342 -103350 286870
9729 7355 145010 -227494 -126584 -127274 -66476 -25537 -32067 -384571 -324572 1034 121617 -49402
9716 -26625 -142492 -147070 -172813 -165971 25002 -120158 -113160 -181615 -51246 -4441 -116275 231275
9703 -213637 -21738 -42324 -234749 -89213 -78487 -116996 -104943 -24431 -208453 -42434 -135953
9692 -135953 -64422 226956 222294 -7593 -331411 28075 -86478 231486 135591 -13981 -250728
9681 -250728 15792 -176118 73974 -27223 -80598 -12291 125224 12641 -246943 -45207 -263000
9670 -263000 367913 -129498 -282663 64683 -65254 -308757 -50184 -52630 -34732 38020 -208344
9658 -253401 194656 -90541 211386 -108919 -257918 -89732 142698 -96807 -299068 127311
$$ packed form
9741E0057e3142j69734r8074D0425b45581a01468F8124d9947C1342a03350B86870
9729G355J37655b27494J00910o90O0798b5537o530l52504N9999A034J20583d9402
9716b6625j15867m578k5743O842B5002a20158O998o8455e1246d441j11834B31275
9703b13637b1738k0586j92425h9213J0726l8509J2053b4431j84022d2434r3519
9692a35953f4422B26956m662g593l23818B8075h6478B31486r5895a3981k36747
9681b50728A5792a76118G3974b7223n3375a2291A25224A2641b46943d5207k17793
9670b63000C67913a29498j53165F4683f5254k43503e0184k446J7898C8020b08344
9658b53401A94656i0541B11386a08919j48999h9732A42698i6807k02261A27311
$$ plain form
9647 -31158 -285635 233551 111211 69244 -33229 -208661 -248171 -118484 -138535 292248 -263988
9635 -248680 38632 81169 146358 141387 -163944 -319442 146173 347625 315109 -161603 -435655
9624 -435655 -8215 381584 -31111 18929 -92474 -116790 13407 -223702 164536 -66000 -67454
9613 -67454 -280705 -77068 255298 -49108 27698 -62105 -142990 -74369 157177 166622 -195935
9601 -173840 -233806 -34025 -131324 -164959 -1458 -198644 -127956 336058 17899 -139645 130616
9589 116839 -55735 142290 26628 -281700 236038 -265929 310563 60696 -181221 -42827
9578 41918 -61142 -358931 12104 18551 -251909 7661 -195140 -170533 -426647 -359738 243388
9566 -195325 -247077 -46809 82402 -160265 232255 -339746 196611 12708 40414 -263483 -29185
$$ packed form
9647c1158k54477B33551A11211m1967c3229j75432l9510a18484k0051B92248b63988
9635b48680C8632M2537O5189m971a63944j55498A46173K01452l2516a61603k74052
9624d35655h215C81584c1111A8929i2474k4316A3407b23702A64536f6000j454
9613f7454k13251g7068B55298d9108B7698f2105q0885O8621A57177R445a95935
9601a73840n9966c4025r7299l3635a458j97186P0688C36058A7899a39645A30616
9589A16839e5735A42290B6628b81700B36038b65929C10563F0696a81221d2827
9578D1918f1142k97789A2104O447b51909G661a95140K4607k56114O6909B43388
9566a95325n1752d6809H2402a60265B32255c39746A96611A2708K7706b63483b9185
$$ plain form
9554 65928 -103649 -226010 -103130 254701 -229619 -270082 -250272 -169802 -108538 -214370 -109560
9543 -109560 -144750 47631 24251 -126614 -390606 -16610 -403085 359752 -178149 -344218
9533 -344218 -85447 -34377 181472 -308323 220808 110481 -165281 95154 119240 -74515 -111775
9522 -111775 28170 -91704 -326138 -10310 -66592 -56174 -97795 -14462 -390141 -207279 4653
9510 -82598 -241091 -165647 -168440 208321 83944 -356988 -29284 -5043 -122496 -10078 -105242
9499 -105242 -43775 -103601 -104336 -195120 -177334 -117126 -258725 115955 -151917 -266262 67240
9487 -293878 244259 46681 -135067 -346999 -986 -84957 -296028 353520 169089 -114426 -42088
9475 170301 77824 -381980 -449839 243123 65556 119458 -152528 -50114 -236611 51043 -160098
$$ packed form
9554F5928a03649j22361a03130B54701b29619m0463J9810Q0470O1264j05832J04810
9543a09560l5190D7631k3380a26614k63992a6610l86475C59752a78149j66069
9533c44218h5447c4377A81472c08323B20808j10327a65281I5154K4086g4515l7260
9522a11775B8170i1704k34434a0310n6282J0418m1621a4462l75679J82862D653
9510h2598j58493P5444k793B08321H3944c56988b9284e043j17453a0078r5164
9499a05242d3775n9826p35r0784J7786O0208j41599A15955a51917j14345F7240
9487b93878B44259D6681a35067k11932i86q3971k11071C53520A69089a14426d2088
9475A70301G7824c81980o7859B43123F5556N3902a52528e0114j86497E1043a60098
$$ plain form
9463 191848 -30311 -12404 -109993 -145863 -54586 -152892 -71802 -306254 39013 -185333 -35553
9451 -172798 -82715 154380 -245891 -402826 20771 145554 198591 142512 -103492 4321 301236
9440 301236 -70343 187405 -41514 -300182 -214323 37974 -328869 160762 -360577 78567 86918
9429 86918 -201687 39229 111540 -13709 17133 -174209 18080 -267486 -14539 -288077 -211827
9418 -211827 -353482 188066 283787 -7699 -49556 -48872 -185643 353347 199194 -231760 -9670
9406 69093 -323479 231117 -33042 -20338 -27553 286193 80630 -90531 35977 -343300 -147344
9394 2475 -88930 5011 189117 6157 272928 -27456 283393 -41077 64900 -167583 112289
9382 62361 150521 32118 -13905 -100570 -11743 73600 18882 -35293 45691 -210177 -156398 -94325
$$ packed form
9463A91848c0311a2404r7589l5870e4586r8306g1802k34452C9013a85333c5553
9451a72798h2715A54380b45891j56935B0771J24783N3037n6079a03492D321K96915
9440C01236g0343A87405d1514k58668Q5859C7974c28869A60762c60577G8567Q351
9429H6918b01687C9229P2311a3709A7133a74209A8080b67486a4539k73538P6250
9418b11827j41655A88066R5721g699m1857O84j36771C53347j54153b31760i670
9406F9093c23479B31117c3042J2704p215B86193H0630i0531C5977c43300a47344
9394B475h8930E011J84106F157K66771b7456B83393d1077F4900a67583A12289
9382F2361Q8160C2118a3905q6665a1743G3600A8882c5293D5691b10177N3779O2073
$$ plain form
9370 -94325 22045 -214763 15362 -137968 -79061 216225 17663 73738 -163142 -126373 -108380
9359 -108380 27149 -79673 -182500 -53439 -177407 239064 -160292 100051 -53847 -14823 -60831
9348 -60831 -166707 122167 -159724 -18828 163457 15648 175664 -105359 -193477 833 -211572
9336 63377 -385760 52624 -221432 41530 9176 4467 83368 190303 61614 -66400 -117129 -125332
9324 -125332 -502318 -10682 -380942 -89139 26447 16598 -18230 -290142 -249709 68908 -233826
9312 -35504 -200419 12797 93647 -126873 35836 129746 -119097 25996 91020 111563 67236
9301 67236 128433 -128068 -301335 -215132 -187494 -185584 -28647 -56063 -79489 43201 70264 17600
9288 -34168 -3679 -56108 -47445 -89290 -132848 -187677 -125372 183751 237580 -178944 283634 -132057
$$ packed form
9370i4325B2045b14763A5362a37968N8907B16225A7663N6075a63142L6769J7993
9359a08380B7149g9673j02827e3439j23968B39064a60292A00051e3847a4823m6008
9348f0831j05876A22167a59724a8828A63457A5648J60016a05359q8118H33b11572
9336F3377c85760E2624b21432D1530I176D467P8901J06935F1614f6400n0729q203
9324a25332l76986a0682l70260h9139B6447r849a8230k71912M0433F8908b33826
9312c5504j64915A2797Q0850a26873C5836R3910a19097B5996O5024K0543m4327
9301F7236O1197a28068j73267Q6203K7638J910b8647k7416k3426D3201K7063A7600
9288c4168c679n2429Q663m1845m3558n4829O2305A83751N3829a78944B83634a32057
$$ plain form
9275 -29242 312558 -307859 -243307 -60202 90562 -129991 109234 32082 186691 -206380 101738
9263 12957 175561 -146874 -81316 -346592 -145955 -42239 159133 -99951 -320901 -354049 348037
9251 -69079 -146343 -460064 47367 -117506 49251 -92737 -64184 184049 -155488 167162 -355798
9239 50903 150188 29241 -8364 -282896 -357864 20914 -120393 27675 168060 79127 17155
9227 -227866 -208378 -10017 -427789 22970 26794 225661 -183496 -58844 -116314 -296661 227542
9215 -67560 -391821 -180098 -38805 72423 115854 -24891 64995 40386 307331 65101 172014
9204 172014 -77806 103978 -470916 55764 -18555 -119869 253603 20950 -198376 -204250 -234593
9193 -234593 17717 272321 -35775 -152775 119883 188714 -326586 -61446 -81876 -356633 -105576
$$ packed form
9275b9242C12558c07859O4552f0202I0562a29991A09234C2082J54609b06380A01738
9263A2957J62604a46874O5558k65276a45955d2239A59133i9951k20950l3148C48037
9251f9079p7264l13721D7367a17506D9251i2737K8553A84049a55488A67162c55798
9239E0903R9285B9241h364k74532p4968B0914a20393B7675J40385G9127A7155
9227b27866J9488a0017m17772B2970L824J98867a83496e8844n7470j80347B27542
9215f7560l24261a80098c8805G2423M3431b4891F4995k4609K66945F5101J06913
9204A72014g7806A03978d70916E5764a8555j01314B53603B0950a98376n874l0343
9193b34593A7717K54604c5775j17000A19883O8831c26586f1446k0430k74757a05576
$$ plain form
9181 -147677 101177 49860 -15091 136568 -348663 -27114 14092 67565 51529 -10821 -210601
9170 -210601 14548 -114884 36255 -79930 -55377 -7418 2536 -61486 32764 -18089 -35898 260699
9157 -89946 -122353 -79742 -166355 39864 -395362 -64826 -604 -81308 -116508 -147822 218385 -134151
9144 -19135 -246649 -286639 31703 -17423 9292 -120136 -103250 -239989 -34623 160975 29028
9132 240541 61202 -35639 27660 -1221 -292646 -273985 39115 19140 74866 175601 55084
9120 -205976 330099 43055 205168 -37499 48438 -235005 -85778 -376678 -317364 -118286 -164990
9109 -164990 -87419 -341257 -84936 239567 -179120 -227725 -292009 25470 148726 -420287 -279127
9098 -279127 -59001 -163506 70904 -255409 -206902 34387 -168123 -103110 6151 145328 75995
$$ packed form
9181a47677A01177D9860a5091A36568c48663b7114A4092N3473j6036a0821j99780
9170b10601A4548a14884C6255g9930K4553g418B536f1486C2764a8089j7809B60699
9157h9946l2407M2611q6613C9864c95362f4826f04q0704l5200l1314B18385a34151
9144a9135k27514l9990C1703a7423I292a20136J6886j36739c4623A60975B9028
9132B40541F1202c5639B7660a221k91425J8661C9115A9140N5726J00735E5084
9120b05976C30099D3055J62113c7499D8438b35005h5778k90900N9314a18286m6704
9109a64990P7571k53838h4936B39567a79120m8605o4284B5470J23256d20287J41160
9098b79127e9001j04505G0904b55409M8507C4387a68123O5013F151J39177o9333
$$ plain form
9087 75995 -277099 -35875 -124974 -45831 103481 226060 46756 -73099 43153 237401 124071
9076 124071 219557 164880 -75815 81499 56216 -344494 -279771 361130 -14287 -215068 -86828
9064 -226230 -205948 142435 153363 -47549 281800 109915 -233283 -471203 -58197 78941 55853
9053 55853 -315577 -66156 -7053 -67995 -203147 46929 -81447 -294034 23697 -137944 -231983
9042 -231983 46166 218919 -40109 -279969 121063 19812 -125368 17672 10321 -74023 -12298
9030 -160784 -44129 -103615 252272 -189192 -228112 -636 -106892 -306990 178799 -75782 182430
9018 386823 228090 -108734 23541 -134463 14472 -10347 -355815 -365400 -23031 86555 -75057
9006 -110834 12990 -107424 -113216 52378 -18057 11004 -509787 -163997 190871 -139067 -214567
$$ packed form
9087G5995b77099c5875q9099d5831A03481J22579D6756g3099D3153J94248j13330
9076A24071R5486n4677g5815H1499k5283c44494O4723C61130a4287k00781h6828
9064b26230K0282A42435J0928d7549B81800A09915b33283k37920e8197G8941k3088
9053E5853c15577f6156g053o0942j35152D6929h1447k12587B3697a37944r4039
9042b31983D6166J72753d0109k39860A21063A9812a25368A7672p351g4023a2298
9030a60784d4129n9486B52272a89192l8920f36j06256k00098A78799g5782A82430
9018C86823j58733a08734B3541a34463A4472a0347l45468r585b3031H6555g5057
9006a10834A2990a07424n792E2378a8057A1004e09787a63997A90871a39067p5500
$$ plain form
8995 -214567 138989 -97208 -176316 307189 -403783 -188352 65813 -208780 165658 -123796
8984 -359322 72835 -198040 -188292 -178519 -48692 -261703 44933 2350 -93820 23399 361927 -141156
8971 -115344 -124688 -431897 77173 77979 -125577 129401 -252075 -11466 96781 -226583 48256
8959 -307088 18681 283391 -158772 -294093 -248616 -217489 -72760 160746 -20043 -81861 -177929
8948 -177929 385923 -120003 -149171 38500 -157298 47641 85050 -161744 -31175 20263 126864
8937 126864 -79082 35512 -217641 -80445 -168229 162683 -256547 -1522 -1314 81939 323835
8926 323835 41010 -501524 -130131 -307033 -47996 76981 237466 1816 220270 590193 300745
8915 300745 210284 -100405 -113701 92019 147256 -14643 76275 -31203 5544 23662 12810 -116074
$$ packed form
8995b14567A38989i7208p9108C07189d03783a88352F5813b08780A65658a23796
8984c59322G2835a98040R748R773d8692k13011D4933B350i3820B3399L38528a41156
8971a15344r344l07209G7173Q06a25577A29401b52075a1466I6781b26583D8256
8959c07088A8681K64710a58772j35321M5477L1127g2760A60746b0043o1818r6068
8948a77929C85923a20003k9168C8500a57298D7641L7409a61744c1175B0263J06601
8937A26864g9082C5512b17641h0445q7784A62683b56547a522K08H1939K41896
8926C23835D1010e01524a30131j76902d7996G6981J60485A816K18454L69923k89448
8915C00745r0461a00405j3296I2019N5237a4643G6275c1203E544J8118j0852a16074
$$ plain form
8902 -156042 -145977 -4224 -295515 196861 -49581 18686 199122 7459 -2043 32505 134720
8891 134720 -329713 -218830 -37554 -283930 3923 236221 25264 -120306 -37789 -354305 -225455
8880 -225455 116045 -80166 -142153 127982 -372638 295253 -238163 164090 -58465 3458 -203136
8868 -113071 81166 43815 -327049 -355040 223939 -231974 -215362 -111538 -47927 -60322 170966
$$ packed form
8902a56042J0065d224k91291A96861d9581A8686J80436G459b043C2505J02215
8891A34720c29713J10883c7554k46376C923K32298B5264a20306c7789l16516J28850
8880b25455A16045h0166o1987A27982c72638B95253b38163A64090e8465C458b03136
8868a13071H1166l7351c27049k7991B23939b31974J6612J03824d7927j2395A70966
$$ [...]
##END NTUPLES=NMR SPECTRUM
##END=
