##TITLE=NES1046_SeabridgeLH_9268578_QvbKUYwuHT
##JCAMPDX= 6.0         $$ Bruker NMR JCAMP-DX V2.0
##DATA TYPE= NMR SPECTRUM
##DATA CLASS= NTUPLES
##ORIGIN= BRUKER
##OWNER= Administrator
$$ 1.72 TOPSPIN		Version 2.1
$$ 2015-07-11 15:31:04.706 -0700  Administrator@X
$$ Compression mode = diff/dup
##.OBSERVE FREQUENCY= 400.02188249412
##.OBSERVE NUCLEUS= ^1H
##.ACQUISITION MODE= SIMULTANEOUS (DQD)
##.ACQUISITION SCHEME= undefined
##.AVERAGES= 64
##.DIGITISER RES= 22
##SPECTROMETER/DATA SYSTEM= spect
##.PULSE SEQUENCE= noesygpps1d.comp
##.SOLVENT NAME= COFFEE_meoh
##.SHIFT REFERENCE= INTERNAL, COFFEE_meoh, 1, 14.96396
##AUDIT TRAIL= $$ (NUMBER, WHEN, WHO, WHERE, PROCESS, VERSION, WHAT)
$$ ##TITLE= Audit trail, TOPSPIN		Version 2.1
$$ ##JCAMPDX= 5.01
$$ ##ORIGIN= Bruker BioSpin GmbH
$$ ##OWNER= Administrator
$$ $$ E:\/data/COFFEE/nmr/NES1046_SeabridgeLH_9268578_QvbKUYwuHT/12/pdata/1/auditp.txt
$$ ##AUDIT TRAIL=  $$ (NUMBER, WHEN, WHO, WHERE, PROCESS, VERSION, WHAT)
(   1,<2015-07-11 15:30:59.394 -0700>,<Administrator>,<X>,<go>,<TOPSPIN 2.1>,
      <created by zg
	started at 2015-07-11 15:19:29.753 -0700,
	POWCHK enabled, PULCHK disabled,
       configuration hash MD5:
       21 0F 79 D6 B3 7B B4 F6 88 20 88 DB 03 48 BD 9F
       data hash MD5: 64K
       72 93 84 96 1F 4E 5F 7A AD 08 12 00 EA C7 00 84>)
(   2,<2015-07-11 15:31:02.613 -0700>,<Administrator>,<X>,<proc1d>,<TOPSPIN 2.1>,
      <Start of raw data processing
       efp LB = 0.3 FT_mod = 6 PKNL = 1 PHC0 = 0 PHC1 = 0 SI = 128K 
       data hash MD5: 128K
       10 40 CC 22 1F 5F 2F C0 27 4C 2B 1D 57 64 B9 5A>)
(   3,<2015-07-11 15:31:03.472 -0700>,<Administrator>,<X>,<proc1d>,<TOPSPIN 2.1>,
      <pk PHC0 = -86.29211 PHC1 = 0 
       data hash MD5: 128K
       99 FA CC 72 26 AC A1 3A 86 D9 20 28 F0 52 05 99>)
(   4,<2015-07-11 15:31:03.878 -0700>,<Administrator>,<X>,<proc1d>,<TOPSPIN 2.1>,
      <abs ABSG = 1 
       data hash MD5: 128K
       5B AC FD 5A 5A 68 2F FA BF 94 26 5F DE AA 67 C2>)
(   5,<2015-07-11 15:31:03.972 -0700>,<Administrator>,<X>,<proc1d>,<TOPSPIN 2.1>,
      <abs ABSG = 2 
       data hash MD5: 128K
       F7 36 DE C7 FD CB 03 56 60 9D AC 3B D8 31 75 8F>)
(   6,<2015-07-11 15:31:04.066 -0700>,<Administrator>,<X>,<proc1d>,<TOPSPIN 2.1>,
      <abs ABSG = 3 
       data hash MD5: 128K
       70 EC CE EE 1E DA 65 E4 0C 09 6F 17 08 B8 4E D6>)
(   7,<2015-07-11 15:31:04.144 -0700>,<Administrator>,<X>,<proc1d>,<TOPSPIN 2.1>,
      <abs ABSG = 4 
       data hash MD5: 128K
       C9 71 E0 03 DC 1B 7C 95 A4 5C 10 E0 C2 05 61 F8>)
(   8,<2015-07-11 15:31:04.238 -0700>,<Administrator>,<X>,<proc1d>,<TOPSPIN 2.1>,
      <abs ABSG = 5 
       data hash MD5: 128K
       D7 73 A7 F6 78 1A 40 24 EF 94 BD A3 B3 5E 89 9C>)
$$ ##END=
$$ 
$$ $$ hash MD5
$$ $$ 43 FC 99 F9 55 65 A7 55 B1 97 7D C6 FA 38 1B 7A
##$RELAX= 
##$RELAX= 
##$RELAX= 
##$RELAX= 
##$RELAX= 
##$RELAX= 
##$RELAX= 
##$RELAX= 
$$ Bruker specific parameters
$$ --------------------------
##$DU= <E:\>
##$EXPNO= 12
$$ [...]
##$TP07= 0
##$TPNAME0= <>
##$TPNAME1= <>
##$TPNAME2= <>
##$TPNAME3= <>
##$TPNAME4= <>
##$TPNAME5= <>
##$TPNAME6= <>
##$TPNAME7= <>
##$TPOAL= (0..7)
0.5 0.5 0.5 0.5 0.5 0.5 0.5 0.5
##$TPOFFS= (0..7)
0 0 0 0 0 0 0 0
##$TUNHIN= 0
##$TUNHOUT= 0
##$TUNXOUT= 0
##$USERA1= <user>
##$USERA2= <user>
##$USERA3= <user>
##$USERA4= <user>
##$USERA5= <user>
##$V9= 5
##$VALIST= <valist>
##$VCLIST= <CCCCCCCCCCCCCCC>
##$VD= 0
##$VDLIST= <DDDDDDDDDDDDDDD>
##$VPLIST= <PPPPPPPPPPPPPPP>
##$VTLIST= <TTTTTTTTTTTTTTT>
##$WBST= 2048
##$WBSW= 25
##$XGAIN= (0..3)
0 0 0 0
##$XL= 0
##$YL= 0
##$YMAX_a= 8097150
##$YMIN_a= -15085324
##$ZGOPTNS= <>
##$ZL1= 120
##$ZL2= 120
##$ZL3= 120
##$ZL4= 120
##$ABSF1= 14.96396
##$ABSF2= -5.594222
##$ABSG= 5
##$ABSL= 3
##$ALPHA= 0
##$AQORDER= 0
##$ASSFAC= 0
##$ASSFACI= 0
##$ASSFACX= 0
##$ASSWID= 0
##$AUNMP= <proc_prof1d_extract.lims>
##$AXLEFT= 0
##$AXNAME= <>
##$AXNUC= <1H>
##$AXRIGHT= 0
##$AXTYPE= 0
##$AXUNIT= <>
##$AZFE= 0.1
##$AZFW= 0.1
##$BCFW= 0
##$BC_mod= 0
##$BYTORDP= 0
##$COROFFS= 0
##$CY= 15
##$DATMOD= 1
##$DC= 0
##$DFILT= <>
##$DTYPP= 0
##$F1P= 0
##$F2P= 0
##$FCOR= 0.5
##$FTSIZE= 131072
##$FT_mod= 6
##$GAMMA= 0
##$GB= 0
##$INTBC= 1
##$INTSCL= 1
##$ISEN= 128
##$LB= 0.3
##$LEV0= 0
##$LPBIN= 0
##$MAXI= 10000
##$MC2= 0
##$MEAN= 0
##$ME_mod= 0
##$MI= 0
##$NCOEF= 0
##$NC_proc= -2
##$NLEV= 6
##$NOISF1= 0
##$NOISF2= 0
##$NSP= 0
##$NTH_PI= 0
##$NZP= 0
##$OFFSET= 14.96396
##$PC= 1
##$PHC0= -86.29211
##$PHC1= 0
##$PH_mod= 1
##$PKNL= yes
##$PPARMOD= 0
##$PPDIAG= 0
##$PPIPTYP= 0
##$PPMPNUM= 2147483647
##$PPRESOL= 1
##$PSCAL= 4
##$PSIGN= 0
##$PYNMP= <proc.py>
##$REVERSE= no
##$SF= 400.020008452484
##$SI= 131072
##$SIGF1= 0
##$SIGF2= 0
##$SINO= 400
##$SIOLD= 131072
##$SPECTYP= <>
##$SREGLST= <1H.CDCl3>
##$SSB= 0
##$STSI= 131072
##$STSR= 0
##$SW_p= 8223.68421052631
##$SYMM= 0
##$S_DEV= 0
##$TDeff= 65536
##$TDoff= 0
##$TI= <>
##$TILT= no
##$TM1= 0
##$TM2= 0
##$TOPLEV= 0
##$USERP1= <user>
##$USERP2= <user>
##$USERP3= <user>
##$USERP4= <user>
##$USERP5= <user>
##$WDW= 1
##$XDIM= 131072
##$YMAX_p= 418776968
##$YMIN_p= -11550
##$CURPLOT= <Network HP LaserJet P1505>
##$CURPRIN= <$Network HP LaserJet P1505>
##$DFORMAT= <normdp>
##$LAYOUT= <+/1D_H.xwp>
##$LFORMAT= <normlp>
##$PFORMAT= <normpl>
##$SURQMSG= 1
$$ End of Bruker specific parameters
$$ ---------------------------------
##NTUPLES= NMR SPECTRUM
##VAR_NAME=  FREQUENCY,     SPECTRUM/REAL,   SPECTRUM/IMAG
##SYMBOL=    X,             R,               I
##VAR_TYPE=  INDEPENDENT,   DEPENDENT,       DEPENDENT
##VAR_FORM=  AFFN,          ASDF,            ASDF
##VAR_DIM=   131072,        131072,          131072
##UNITS=     HZ,            ARBITRARY UNITS, ARBITRARY UNITS
##FACTOR=    0.0627417313425164, 1,          1
##FIRST=     8223.62146879497, 2342,         -55438
##LAST=      0,             4553,            -55086
##MIN=       0,             -11550,          0
##MAX=       8223.62146879497, 418776968,    0
$$ Real data points
##PAGE= N=1
##DATA TABLE= (X++(R..R)), XYDATA
$$ [...]
61011B484516J60593J75707J92679K12832K40240K81317L39234M12346M99934
61002D999398O05002P29424Q73072J042425J253888J523508J861173K277637K770877
60993A7936404L267577L578978L469592K831712J810742P39560o7569m65905m64779
60984C2636312j36611M00835R30394J151488Q36502K878j080933k072810k750732
60975B9917323l069232l090625k905224k602050k262360j943764j668603j435236
60967A0940229j237366j069815r25391p97375o84623n89091n09851m43456l87939
60958D295322l42223l03329k68059k36260k09043j85065j61772j39146j19139
60949B331286j02376q8323p7750p2008p0369p0499p1129p2055p2354p0945o8358
$$ y = [2484516, 2645109, 2820816, 3013495, 3226327, 3466567, 3747884, 4087118, 4499464, 4999398, 5604400, 6333824, 7206896, 8249321, 9503209, 11026717, 12887890, 15165527, 17936404, 21203981, 24782959, 28252551, 31084263, 32895005, 33634565, 33566996, 33101091, 32636312, 32499701, 32900536, 33830930, 34982418, 35818920, 35821798, 34740865, 32668055, 29917323, 26848091, 23757466, 20852242, 18250192, 15987832, 14044068, 12375465, 10940229, 9702863, 8633048, 7707657, 6910282, 6225659, 5636568, 5126717, 4683261, 4295322, 3953099, 3649770, 3381711, 3145451, 2936408, 2751343, 2589571, 2450425, 2331286, 2228910, 2140587, 2062837, 1990829, 1920460, 1849961, 1778832, 1706777, 1634423, 1563478, 1495120]
60938A495120o5741o2705n8213n2923m8514m5249m2250l9526l7645l5993l3527
60927I72834l0733k8749k7044k4200k0635j8262j7494j6762j5107j3244j1903
60916G48701j0928j0232r975r766r132q704r325j0220r874q587q118q774q945
60903F26121p877o773o450n910m173j935k67R22K051K605J982Q26M08J074K114
60888F04718K786K863K426J730J102P72Q16J149J296N26j253k970l507l131k963
60873F06360l200k957j894q95p65j209j539j572j400r26j67N39J094J919L238
60858E96626M463M729L879K481J129k7j052j854k241k370k939m556o855q712r424
60843E73277r292q798p874o461n200m797n054n183m912m570m262l630k450r95
$$ y = [1495120, 1429379, 1366674, 1308461, 1255538, 1207024, 1161775, 1119525, 1079999, 1042354, 1006361, 972834, 942101, 913352, 886308, 862108, 841473, 823211, 805717, 788955, 773848, 760604, 748701, 737773, 727541, 717566, 707800, 698668, 689964, 680639, 670419, 660545, 651958, 643840, 635066, 626121, 618244, 611471, 605021, 599111, 594938, 593003, 592736, 593658, 595709, 598314, 600296, 601122, 601530, 602604, 604718, 607504, 610367, 612793, 614523, 615625, 616397, 617213, 618362, 619658, 620184, 618931, 615961, 612454, 609323, 606360, 603160, 600203, 598309, 597414, 596649, 595440, 593901, 592329, 590929, 590003, 589836, 590375, 591469, 593388, 596626, 601089, 605818, 609697, 612178, 613307, 613280, 612228, 610374, 608133, 605763, 602824, 598268, 591413, 582701, 573277, 563985, 555187, 547313, 540852, 535652, 530855, 525801, 520618, 515706, 511136, 506874, 503244, 500794, 499799]
60829D99799K55R32R68P31P77J135J274J022R81J536K090J958J462J343J597J722
60813E19582J724J917K093J851J533J797K358K232J266M68N97J259J628J293K56
60798E41854j238k555k973k388j434q63j098k191l710m837n132n121n563o317
60784D96434o625o280n790n464n126m755m607m584m214l388k496j744r62k10J03
60769D40292j02l15r8M40R62J280J332J196J193J611K349L120L825M269L861K247
60753D67462R6j490k266k755l039k560j328l51m37j227j869k072k117k246k529
60738D41272l012l569l864l718l417l436l894m458m708m539m224m096m165m179
60724C85993m006l710l319k833k516k630k844k538j807j433j547j259j31R38J149
$$ y = [499799, 500054, 500986, 501954, 502685, 503462, 504597, 505871, 506893, 507874, 509410, 511500, 513458, 514920, 516263, 517860, 519582, 521306, 523223, 525316, 527167, 528700, 530497, 532855, 535087, 536353, 536821, 537418, 538677, 540305, 541598, 541854, 540616, 538061, 535088, 532700, 531266, 530403, 529305, 527114, 523404, 518567, 513435, 508314, 502751, 496434, 489809, 483529, 477739, 472275, 467149, 462394, 457787, 453203, 448989, 445601, 443105, 441361, 440399, 440189, 440292, 440190, 439875, 439777, 440217, 441179, 442459, 443791, 444987, 446180, 447791, 450140, 453260, 457085, 461354, 465215, 467462, 467558, 466068, 463802, 461047, 458008, 455448, 454120, 453769, 453332, 452105, 450236, 448164, 446047, 443801, 441272, 438260, 434691, 430827, 427109, 423692, 420256, 416362, 411904, 407196, 402657, 398433, 394337, 390172, 385993, 381987, 378277, 374958, 372125, 369609, 366979, 364135, 361597, 359790, 358357, 356810, 355551, 355420, 356358, 357507]
60709C57507J137J836K790K913K430K577L614M503M605M399M338M091L298K155
60695D02193J043K45J23P61J492J558J202J222J613J700J513J724K205J967R30
60680D21491L68J031J953J913J145P70J259K164K869L015K644K306K575L184L258
60665D51945K613K074K180K446K372K301K644K979K645J699O64k22r06j206j153
60650D73075j213j611j824j300k56P20J468K085K381K058J257M64O5K87J094J861
60634D80611J640L15r48r79j8P38P12L40R5k28j028k115k756k387j210L6R32J765
60616D75515K764L367K932K027K030L271M537M839M737N228O076O244N505M684
60602E33756M390M323L870K845J469M7j261k573m042n406o038n689m908m411m332
$$ y = [357507, 358644, 360480, 363270, 366183, 368613, 371190, 374804, 379307, 383912, 388311, 392649, 396740, 400038, 402193, 403236, 403481, 403604, 404365, 405857, 407415, 408617, 409839, 411452, 413152, 414665, 416389, 418594, 420561, 421491, 421859, 422890, 424843, 426756, 427901, 428671, 429930, 432094, 434963, 437978, 440622, 442928, 445503, 448687, 451945, 454558, 456632, 458812, 461258, 463630, 465931, 468575, 471554, 474199, 475898, 476562, 476340, 475434, 474228, 473075, 471862, 470251, 468427, 467127, 466871, 467591, 469059, 471144, 473525, 475583, 476840, 477304, 477369, 477656, 478750, 480611, 482251, 482566, 481618, 480639, 480621, 481359, 482071, 482411, 482506, 482278, 481250, 479135, 476379, 473992, 472782, 472818, 473750, 475515, 478279, 481646, 484578, 486605, 488635, 491906, 496443, 501282, 506019, 511247, 517323, 523567, 529072, 533756, 538146, 542469, 546339, 549184, 550653, 550700, 549439, 546866, 542824, 537418, 531380, 525691, 520783, 516372, 512040]
60587E12040m386m382m220l708k915k372k434k640k322j602j234j496j843j684
60573D74802j018j42P34J435J729J518J030O57O71J076J597J818J484O81l28j338
60557D86406k188k684k794k808l063l460l558l182k712k560k540k030p73P35J944
60542D54733L012M498O388P977Q922R804J1305J3309J5354J7521K0219K3339K6366
60529F22747K9178L1936L4118L4468L2146K7451K1289J4421P369M86o065j1954
60517H37590j6253j8055j7703j6730j6302j6222j5728j4595j3036j1166r074p038
60505F65688n153l133q28J456L572O061R562J3881J8179K1787K4484K6156K6637
60492H08349K5738K3241J9087J3870Q954N647M343M684O336R340J3803J9449K5468
$$ y = [512040, 507654, 503272, 499052, 495344, 492429, 490057, 487623, 484983, 482661, 481059, 479825, 478329, 476486, 474802, 473784, 473642, 474376, 475811, 477540, 479058, 480088, 480745, 481416, 482492, 484089, 485907, 487391, 488072, 487744, 486406, 484218, 481534, 478740, 475932, 472869, 469409, 465851, 462669, 459957, 457397, 454857, 452827, 452054, 452789, 454733, 457745, 462243, 468631, 476608, 485530, 495334, 506639, 519948, 535302, 552823, 573042, 596381, 622747, 651925, 683861, 717979, 752447, 784593, 812044, 833333, 847754, 855123, 855609, 849544, 837590, 821337, 803282, 785579, 768849, 752547, 736325, 720597, 706002, 692966, 681800, 672726, 665688, 660535, 657402, 656574, 658030, 661602, 667663, 677225, 691106, 709285, 731072, 755556, 781712, 808349, 834087, 857328, 876415, 890285, 899239, 904886, 909229, 913913, 920249, 929589, 943392, 962841, 988309]
60479I88309L0808L4846L7861M0607M3524M6718N0740N6757O5721P7857R3053
60468A566801J11171J31605J52939J73244J90122K00220J99558J85261J56929
60459C067850J16221O5837R525m7534r9545j41818j71758j88883j94545j91417
60449B223933j82364j69452j54058j37596j21642j07437r5520q5677p7017o8452
60439A024718n9590n1108m3963l8447l4213l0843k7913k4872k1427j7956j5120
60428F59266j3191j2042j1490j1226j0669r493q059o884n784m157j984P8J633
60415E65998K970M475O041P325Q181Q744R299J0138J1373J2796J4136J5405J6799
60402F93680J8291J9549K0201J9987J8746J6566J3899J1267Q880O678M655K888
$$ y = [988309, 1019117, 1053963, 1091824, 1132431, 1175955, 1222673, 1273413, 1330170, 1395891, 1473748, 1566801, 1677972, 1809577, 1962516, 2135760, 2325882, 2526102, 2725660, 2910921, 3067850, 3184071, 3249908, 3259433, 3211899, 3112354, 2970536, 2798778, 2609895, 2415350, 2223933, 2041569, 1872117, 1718059, 1580463, 1458821, 1351384, 1255864, 1170187, 1093170, 1024718, 965128, 914020, 870057, 831610, 797397, 766554, 738641, 713769, 692342, 674386, 659266, 646075, 634033, 622543, 611317, 600648, 591155, 583096, 576212, 570428, 566271, 564287, 564365, 565998, 568968, 573443, 579484, 586809, 594990, 603734, 613033, 623171, 634544, 647340, 661476, 676881, 693680, 711971, 731520, 751721, 771708, 790454, 807020, 820919, 832186, 841066, 847744, 852399, 855287]
60390H55287J412K81k68p4N77J089J128Q85P25P22O07Q5q03j612j891j618j085
60373H55447l34R45K841M837O212O653O291N329L833J763r26l998o737q393r020
60358H64743r488j0348j1065j0845r909r390r991j1229j2085j2037j1322j0442
60346G36592r587q600p439o474o108o153n908m998l762k768k237k092k137k013
60332F66316j449q34j048k337l805m482m516m696n127n132m414l558l253l460
60318F18205l655l463k907k241j713j383j100p34m83p19j501k335k624k313k038
60303E88996k458l426m067l791k973k313j740n87J228K855L582L623L571L559
60289E86059L448L386L653M196M721N140N565O014O472P114Q116R276J0103J0340
$$ y = [855287, 856699, 856980, 856712, 856638, 857215, 858304, 859432, 860317, 861042, 861764, 862371, 862456, 861653, 860041, 858150, 856532, 855447, 855113, 856058, 858899, 863736, 869948, 876601, 882892, 888221, 892054, 893817, 892891, 888893, 882156, 873763, 864743, 855255, 844907, 833842, 822997, 813088, 803698, 793707, 782478, 770393, 758356, 747034, 736592, 727005, 718405, 710966, 704492, 698384, 692231, 686323, 681325, 677563, 674795, 672558, 670466, 668329, 666316, 664867, 664033, 662985, 660648, 656843, 652361, 647845, 643149, 638022, 632890, 628476, 624918, 621665, 618205, 614550, 611087, 608180, 605939, 604226, 602843, 601743, 601009, 600526, 599807, 598306, 595971, 593347, 591034, 588996, 586538, 583112, 579045, 575254, 572281, 569968, 568228, 567641, 568869, 571724, 575306, 578929, 582500, 586059, 589507, 592893, 596546, 600742, 605463, 610603, 616168, 622182, 628654, 635768, 643884, 653160, 663263, 673603]
60275F73603J0298J0603J1557J2658J2955J2121J0901J0133R615Q623P381P063
60263G97511Q176R833J0967J1532J1985J2432J2830J3447J4448J5472J6221J7013
60251I51867J8272J9906K1684K3637K5595K7045K8070K9763L2853L6544L9592
60240A254828M2039M4831M8154N1439N4702N8682O3528O8504P3194P7971Q3021
60229A920893Q7863R2197R6315J00132J02541J02380R9642R5179Q9545Q2686P4558
60218B943931O5605N6488M7511L8414K8754J8636Q920N83o077j1410j5747j9006
60206C156602k0907k1267k0046j7330j3208p614n07P681J6087K4235L2589M1942
60194C178257N2415O3269P3486Q2215Q8919R3543R6377R7461R6282R2294Q5510
$$ y = [673603, 683901, 694504, 706061, 718719, 731674, 743795, 754696, 764829, 774444, 783067, 790448, 797511, 805687, 815520, 826487, 838019, 850004, 862436, 875266, 888713, 903161, 918633, 934854, 951867, 970139, 990045, 1011729, 1035366, 1060961, 1088006, 1116076, 1145839, 1178692, 1215236, 1254828, 1296867, 1341698, 1389852, 1441291, 1495993, 1554675, 1618203, 1686707, 1759901, 1837872, 1920893, 2008756, 2100953, 2197268, 2297400, 2399941, 2502321, 2601963, 2697142, 2786687, 2869373, 2943931, 3009536, 3066024, 3113535, 3151949, 3180703, 3199339, 3208259, 3208842, 3202765, 3191355, 3175608, 3156602, 3135695, 3114428, 3094382, 3077052, 3063844, 3056230, 3055723, 3063404, 3079491, 3103726, 3136315, 3178257, 3230672, 3293941, 3367427, 3449642, 3538561, 3632104, 3728481, 3825942, 3922224, 4014518, 4100028]
60183D100028P6267O4782N1353L6591K0953M299j3481l1647m8956o4709p8872
60172D116608r1197j00805j06714j08525j06640j02046r5733q7993p8482o7048
60162C171425n4161m0238k5171r077P014K1838L4936M6336N5563O1642O3886O2097
60150C396090N6288M6933L5286K2764J0201j896j2877k2485l1285l9529m5999
60139C413491m9087m8815m6528m2719l6558k7784j7615p169L939J6608L0739M5467
60127C233969O0377P5741R1784J08385J25335J42523J59846J77133J94106K10387
60117D579586K25667K39575K51205K59114K62409K61512K57243K49397K37057
60108F822765K20162J99679J76169J49241J18836Q6032N1976J6740j9992n7590
$$ y = [4100028, 4176295, 4241077, 4292430, 4329021, 4349974, 4354273, 4340792, 4309145, 4260189, 4195480, 4116608, 4025411, 3924606, 3817892, 3709367, 3602727, 3500681, 3404948, 3316955, 3238473, 3171425, 3117264, 3077026, 3051855, 3042778, 3049792, 3071630, 3106566, 3152902, 3208465, 3270107, 3333993, 3396090, 3452378, 3499311, 3534597, 3557361, 3567562, 3565666, 3552789, 3530304, 3499019, 3459490, 3413491, 3364404, 3315589, 3269061, 3226342, 3189784, 3162000, 3144385, 3137216, 3141155, 3157763, 3188502, 3233969, 3294346, 3370087, 3461871, 3570256, 3695591, 3838114, 3997960, 4175093, 4369199, 4579586, 4805253, 5044828, 5296033, 5555147, 5817556, 6079068, 6336311, 6585708, 6822765, 7042927, 7242606, 7418775, 7568016, 7686852, 7772884, 7824860, 7841600, 7821608, 7764018]
60098G764018r4458j29143j60870j89030k12613k30314k41129k44923k42418k34618
60088E784502k22353k06405j87676j66869j44313j20451r6166p2043m7775k2991
60078D497460J595K4678M5735O4855Q1344R3569J00461J02173R9041R0880P7810
60067E279601O0909M1549K0634j005k2214m2130o0744p8304r4467j08564j20261
60056D875004j29511j36064j39522j39779j37134j31921j24246j14095j01776
60047C720956q8248p4727o1720m8752l5374k2018r299L103J6042K9613M3095N6074
60035C528745O8616Q0311R0046R6883J00389J00003R5073Q5801P3325N8629M2073
60024D419894K4133N620j3136l2340n1548o9310q4527r7209j07452j14505j17593
$$ y = [7764018, 7669560, 7540417, 7379547, 7190517, 6977904, 6747590, 6506461, 6261538, 6019120, 5784502, 5562149, 5355744, 5168068, 5001199, 4856886, 4736435, 4640269, 4568226, 4520451, 4497460, 4499055, 4523733, 4569468, 4634323, 4715667, 4809236, 4909697, 5011870, 5110911, 5201791, 5279601, 5340510, 5382059, 5402693, 5401688, 5379474, 5337344, 5276600, 5198296, 5103829, 4995265, 4875004, 4745493, 4609429, 4469907, 4330128, 4192994, 4061073, 3936827, 3822732, 3720956, 3632708, 3557981, 3496261, 3447509, 3412135, 3390117, 3380818, 3383921, 3399963, 3429576, 3472671, 3528745, 3597361, 3677672, 3767718, 3864601, 3964990, 4064993, 4160066, 4245867, 4319192, 4377821, 4419894, 4444027, 4449647, 4436511, 4404171, 4352623, 4283313, 4198786, 4101577, 3994125, 3879620, 3762027]
60013C762027j16885j13006j06265r7141q6801p6180o4933n2136l7848k3196r092
60002B978544M511J8160L2306M7216O3033P9733R7052J14429J31054J46115J58981
59991C871134J68825J74290J74027J67665J55937J40068J21443J01448Q0689N8451
59981E213977L3791P075k0383m7954p5524j01716j23829j40066j50373j54648
59971D440350j51897j42303j28708j14291r9625q3392o5413m7330l0635j5389
59961C561367j003J2912K6590M0187N3476O5946P7123Q6464R3206R6887R7763
59950D210918R6249R2284Q5788P7357O7775N7236M5686L3602K1659R958j608j2319
59938D784585k0791k6054k7861k6039k0280j0676K154J7587L5253N4806P5834
$$ y = [3762027, 3645142, 3532136, 3425871, 3328730, 3241929, 3165749, 3100816, 3048680, 3010832, 2987636, 2978544, 2983055, 3001215, 3033521, 3080737, 3143770, 3223503, 3320555, 3434984, 3566038, 3712153, 3871134, 4039959, 4214249, 4388276, 4555941, 4711878, 4851946, 4973389, 5074837, 5155526, 5213977, 5247768, 5254843, 5234460, 5186506, 5110982, 5009266, 4885437, 4745371, 4594998, 4440350, 4288453, 4146150, 4017442, 3903151, 3803526, 3720134, 3654721, 3607391, 3576756, 3561367, 3560364, 3573276, 3599866, 3640053, 3693529, 3759475, 3836598, 3923062, 4016268, 4113155, 4210918, 4307167, 4399451, 4485239, 4562596, 4630371, 4687607, 4733293, 4766895, 4788554, 4798512, 4796904, 4784585, 4763794, 4737740, 4709879, 4683840, 4663560, 4652884, 4655038, 4672625, 4707878, 4762684, 4838518]
59927D838518R8026J21159J45021J69531J94712K20285K45577K69984K92966L13145
59917F908924L27923L34504L31006L16277K89414K50326K00441J42183P8171J1600
59907I190769n3212j11891j61746k01836k31569k50133k57419k54642k43835k27117
59897G197369k06343j82694j56402j27442r6645o5851l7072j1815Q979K5100L7408
59886F384592M7542N7120O7251P8501R0777J03233J14570J23331J27644J25149
59876G319710J13982R3981O6634L3951k261m0252p8110j13787j45112j70060j87556
59865F891120j97926k02071k00273j92351j78926j61835j43051j23621j03866
59856E387200q4271o5759m9164l4771k2620j3226p717o886j0324j6794k5218l4786
$$ y = [4838518, 4936544, 5057703, 5202724, 5372255, 5566967, 5787252, 6032829, 6302813, 6595779, 6908924, 7236847, 7571351, 7902357, 8218634, 8508048, 8758374, 8958815, 9100998, 9179169, 9190769, 9137557, 9025666, 8863920, 8662084, 8430515, 8180382, 7922963, 7668321, 7424486, 7197369, 6991026, 6808332, 6651930, 6524488, 6427843, 6361992, 6324920, 6313105, 6322084, 6347184, 6384592, 6432134, 6489254, 6556505, 6635006, 6725783, 6829016, 6943586, 7066917, 7194561, 7319710, 7433692, 7527673, 7594307, 7628258, 7625997, 7585745, 7507635, 7393848, 7248736, 7078676, 6891120, 6693194, 6491123, 6290850, 6098499, 5919573, 5757738, 5614687, 5491066, 5387200, 5302929, 5237170, 5188006, 5153235, 5130615, 5117389, 5109672, 5102786, 5092462, 5075668, 5050450, 5015664]
59844E015664m4343n2727n9848o6548p2980p7987q0516q0782p9406p6366p1655
59833D252506o6289o1586n8017n5590n4584n4706n4080n0544m4059l6673l0228
59822C686150k5141k1441j9559j9605k0806k2272k3692k4908k5423k4740k2665
59811C435898j8908j2897m367O247J8400L2193M8279O7136Q8612J12176J37550
59800C910319J65089J95394K28295K62034K93178L16625L25700L13374K75141
59791F285149K11772J29731L9282m8172j22665j77915k12437k28622k30651k22686
59781E422786k08035j89058j67749j46297j26597j09042r2633p6776o2296n0070
59771D194233l9457k9007j8124p150L627J4036K3590L2041M0051M8274N6158O2750
$$ y = [5015664, 4971321, 4918594, 4858746, 4792198, 4719218, 4641231, 4560715, 4479933, 4400527, 4324161, 4252506, 4186217, 4124631, 4066614, 4011024, 3956440, 3901734, 3847654, 3797110, 3753051, 3716378, 3686150, 3661009, 3639568, 3620009, 3600404, 3579598, 3557326, 3533634, 3508726, 3483303, 3458563, 3435898, 3416990, 3404093, 3399726, 3405973, 3424373, 3456566, 3504845, 3571981, 3660593, 3772769, 3910319, 4075408, 4270802, 4499097, 4761131, 5054309, 5370934, 5696634, 6010008, 6285149, 6496921, 6626652, 6665934, 6617762, 6495097, 6317182, 6104745, 5876123, 5645472, 5422786, 5214751, 5025693, 4857944, 4711647, 4585050, 4476008, 4383375, 4306599, 4244303, 4194233, 4154776, 4125769, 4107645, 4100495, 4104122, 4118158, 4141748, 4173789, 4213840, 4262114, 4318272, 4381022]
59759D381022O8344P4192Q0819Q7879R5478J04247J14194J24952J37143J52080
59749E420350J69814J89005K09101K31082K55475K81082L06451L31240L54860
59740G748460L74855L88010L92498L87970L74195L50961L19378K82350K43733
59731A0862410K07455J77057J55255J43709J43326J54295J75402K03855K36591
59722A2459355K71674L07869L43115L74169L97839M12103M16144M09948L94105
59713A5786321L69530L37059K97559K52542K04447J56007J09480O6689K9671P06
59703A7610011j8595k7872k7252j6124O671M1313Q6331J39705K00041K66178L36306
59692A8596713M08254M80254N50569O16405O73899P18951P47396P54442P35090
$$ y = [4381022, 4449366, 4523558, 4604377, 4692256, 4787734, 4891981, 5006175, 5131127, 5268270, 5420350, 5590164, 5779169, 5988270, 6219352, 6474827, 6755909, 7062360, 7393600, 7748460, 8123315, 8511325, 8903823, 9291793, 9665988, 10016949, 10336327, 10618677, 10862410, 11069865, 11246922, 11402177, 11545886, 11689212, 11843507, 12018909, 12222764, 12459355, 12731029, 13038898, 13382013, 13756182, 14154021, 14566124, 14982268, 15392216, 15786321, 16155851, 16492910, 16790469, 17043011, 17247458, 17403465, 17512945, 17579634, 17609305, 17610011, 17591416, 17563544, 17536292, 17520168, 17526839, 17568152, 17654483, 17794188, 17994229, 18260407, 18596713, 19004967, 19485221, 20035790, 20652195, 21326094, 22045045, 22792441, 23546883, 24281973]
59683B4281973O85703O05231M95521L61542K11388N4915r8573k41503l67629m71854
59673B5516714n51445o07471o44985o72011o97706p29456p69863q15609q59234
59664A9168934q92417r08786r05613q84148q48556q04084p55690p07420o61867
59655A1800353o19901n81327n45939n13615m83622m54707m26178l98261l71250
59646G405553l44951l19233k94438k70818k48042k25678k03719j82391j61866
59637E154417j42487j24746j08696r3790p9772o7235n6886m8607m1736l5986l1585
59626D322891k8672k7085k6750k7900l0750l5124m0435m6086n1915n8103o4443
59615C885628o9867p3120p3921p3005p0938o7428o2104n5553m9084m3582l8893
$$ y = [24281973, 24967676, 25572907, 26068428, 26429970, 26641358, 26696273, 26597700, 26356197, 25988568, 25516714, 24965269, 24357798, 23712813, 23040802, 22343096, 21613640, 20843777, 20028168, 19168934, 18276517, 17367731, 16462118, 15577970, 14729414, 13925330, 13169640, 12462220, 11800353, 11180452, 10599125, 10053186, 9539571, 9055949, 8601242, 8175064, 7776803, 7405553, 7060602, 6741369, 6446931, 6176113, 5928071, 5702393, 5498674, 5316283, 5154417, 5011930, 4887184, 4778488, 4684698, 4604926, 4537691, 4480805, 4432198, 4390462, 4354476, 4322891, 4294219, 4267134, 4240384, 4212484, 4181734, 4146610, 4106175, 4060089, 4008174, 3950071, 3885628, 3815761, 3742641, 3668720, 3595715, 3524777, 3457349, 3395245, 3339692, 3290608, 3247026, 3208133]
59604C208133l4319k9461k4473j9584j4549q860k549L576Q754J3117J7290K1327
59592C138402K4462K5990K5972K5019K3659K2064K0252J8525J7731J8775K1739
59581C382590K5848L0568L6294M3522N1832O0399O9116P8440Q8377R8476J08737
59570D074199J19651J31228J42791J53850J64485J74571J83372J90168J94816
59561E529131J97329J97430J94811J89478J81563J71055J58004J42776J25868
59552G087445J07329Q6238O0947L0520l561l7573o8020r3610j14455j30028j39084
59541F786148j41318j37914j30262j18817j03334q3452n8978l0285J558L5521
59531F018867P1306J08607J45830J80493K10626K34887K51381K57601K51778K33451
$$ y = [3208133, 3173814, 3144353, 3119880, 3100296, 3085747, 3076887, 3074338, 3077914, 3086668, 3099785, 3117075, 3138402, 3162864, 3188854, 3214826, 3239845, 3263504, 3285568, 3305820, 3324345, 3342076, 3360851, 3382590, 3408438, 3439006, 3475300, 3518822, 3570654, 3631053, 3700169, 3778609, 3866986, 3965462, 4074199, 4193850, 4325078, 4467869, 4621719, 4786204, 4960775, 5144147, 5334315, 5529131, 5726460, 5923890, 6118701, 6308179, 6489742, 6660797, 6818801, 6961577, 7087445, 7194774, 7281012, 7341959, 7372479, 7368918, 7331345, 7263325, 7169715, 7055260, 6925232, 6786148, 6644830, 6506916, 6376654, 6257837, 6154503, 6071051, 6012073, 5981788, 5983346, 6018867, 6090173, 6198780, 6344610, 6525103, 6735729, 6970616, 7221997, 7479598, 7731376, 7964827]
59521G964827K02787J60494J08685N0719j0310p2133j32222j87233k34152k71227
59511G580235k97491l12349l16197l10778k98309k80705k59737k37081k13689
59502E053899j89660j65109j40599j16567r3033p0082m8018k6833o214J3835L3151
59491D244770N2142P1374R0418J08191J24542J40171J54660J65924J72169J73125
59481E497486J68732J57997J40056J15368Q4937M9555J0735k8692o6203j01044
59471F028927j33021j60760j82487j97946k08161k13688k14409k10914k04818
59462D302723j97463j89169j79861j69693j58944j47829j36638j25715j15367
59453B882044j05850r7214q8906q0040p0425o0991n2771m5796l9337l2843k6260
$$ y = [7964827, 8167614, 8328108, 8436793, 8487512, 8477202, 8405069, 8272847, 8085614, 7851462, 7580235, 7282744, 6970395, 6654198, 6343420, 6045111, 5764406, 5504669, 5267588, 5053899, 4864239, 4699130, 4558531, 4441964, 4348931, 4278849, 4230831, 4203998, 4197784, 4211619, 4244770, 4296912, 4368286, 4458704, 4566895, 4691437, 4831608, 4986268, 5152192, 5324361, 5497486, 5666218, 5824215, 5964271, 6079639, 6164576, 6214131, 6224866, 6196174, 6129971, 6028927, 5895906, 5735146, 5552659, 5354713, 5146552, 4932864, 4718455, 4507541, 4302723, 4105260, 3916091, 3736230, 3566537, 3407593, 3259764, 3123126, 2997411, 2882044, 2776194, 2678980, 2590074, 2510034, 2439609, 2378618, 2325847, 2280051, 2240714, 2207871, 2181611]
59442B181611j9824j3919q830m349O0M512Q553J1931J4949J7855K0515K2971K5743
59429B261778K9174L2870L5861L6834L4524K8993K2719J9204J9936K3571K8293
59418B573757L3763M0372M7934N5912O3596O9308P0839O8081O4167O2664O4322
59407C214715O7765P2325P8510Q6242R4456J02588J11174J20807J31502J43227
59397D223311J56182J70315J85192K00562K16671K33967K52696K72739K93799
59388F205434L16044L40403L67495L96167M23863M48452M68504M81725M84872
59379I932959M76446M58355M33968M05502L74290L42220L11400K82976K57449
59370A3275565K35220K15382J94707J69329J37049R6933M7583j2341q2053j58527
$$ y = [2181611, 2161787, 2147868, 2139038, 2134689, 2134749, 2139261, 2147814, 2159745, 2174694, 2192549, 2213064, 2236035, 2261778, 2290952, 2323822, 2359683, 2396517, 2431041, 2460034, 2482753, 2501957, 2521893, 2545464, 2573757, 2607520, 2647892, 2695826, 2751738, 2815334, 2884642, 2955481, 3023562, 3087729, 3150393, 3214715, 3282480, 3354805, 3433315, 3519557, 3614013, 3716601, 3827775, 3948582, 4080084, 4223311, 4379493, 4549808, 4735000, 4935562, 5152233, 5386200, 5638896, 5911635, 6205434, 6521478, 6861881, 7229376, 7625543, 8049406, 8497858, 8966362, 9448087, 9932959, 10409405, 10867760, 11301728, 11707230, 12081520, 12423740, 12735140, 13018116, 13275565, 13510785, 13726167, 13920874, 14090203, 14227252, 14324185, 14371768, 14359427, 14277374, 14118847]
59360A4118847k38160l17218l90982m54274n03381n36769n54287n56947n47272
59351A0019557n28446n02774m71699m37136m01553l66801l33831l03610k77256
59342F396451k55093k36510k20843k07715j96603j86809j77825j69170j60207
59333D585676j50874j42055j34433j27488j20589j14401j09885j06433j02460
59324C477058r7609r2874q8596q3842p7977p1475o4897n8131n0980m3552l5881
59313B711244k7999k0413j3603p064J69Q100J5920K3488L1524M0251M8969N7205
59301B867791O5279P3552Q2020R0830J00335J10487J20774J30487J38155J41007
59291C920717J36516J24662J07791Q8283O7454M6325K5763N470j5674l7660n8796
$$ y = [14118847, 13880687, 13563469, 13172487, 12718213, 12214832, 11678063, 11123776, 10566829, 10019557, 9491111, 8988337, 8516638, 8079502, 7677949, 7311148, 6977317, 6673707, 6396451, 6141358, 5904848, 5684005, 5476290, 5279687, 5092878, 4915053, 4745883, 4585676, 4434802, 4292747, 4158314, 4030826, 3910237, 3795836, 3685951, 3579518, 3477058, 3379449, 3286575, 3197979, 3114137, 3036160, 2964685, 2899788, 2841657, 2790677, 2747125, 2711244, 2683245, 2662832, 2649229, 2642165, 2642334, 2650434, 2666354, 2689842, 2721366, 2761617, 2810586, 2867791, 2933070, 3006622, 3088642, 3179472, 3279807, 3390294, 3511068, 3641555, 3779710, 3920717, 4057233, 4181895, 4289686, 4377969, 4445423, 4491748, 4517511, 4522981, 4507307, 4469647, 4410851]
59280D410851p7362r2669j04294j11684j15091j15703j14170j10107j03663r6368
59270C369740q9543q2853p5360o7200n9297n2037m5169l8578l2392k6514k0677
59259B780120j4730q551j921N201J2539J9809K6874L3474L9344M4717N0260N6256
59247C043392O2422O8644P5386Q3149R1946J01632J12321J24319J37972J53649
59237D054832J71521J91232K12178K34048K56765K79943L02823L24569L43978
59228F371889L58986L66931L65379L52443L26778K87941K36730J74768J04109
59219H945954K7756n0149j25550j95557k57551l08049l43891l64509l71910l68564
59209F587980l56459l37858l15294k90389k63757k36347k09801j85247j62763
$$ y = [4410851, 4333489, 4240820, 4136526, 4024842, 3909751, 3794048, 3679878, 3569771, 3466108, 3369740, 3280197, 3197344, 3121984, 3054784, 2995487, 2943450, 2898281, 2859703, 2827311, 2800797, 2780120, 2765390, 2756839, 2754918, 2760119, 2772658, 2792467, 2819341, 2852815, 2892159, 2936876, 2987136, 3043392, 3105814, 3174458, 3249844, 3332993, 3424939, 3526571, 3638892, 3763211, 3901183, 4054832, 4226353, 4417585, 4629763, 4863811, 5120576, 5400519, 5703342, 6027911, 6371889, 6730875, 7097806, 7463185, 7815628, 8142406, 8430347, 8667077, 8841845, 8945954, 8973710, 8923561, 8798011, 8602454, 8344903, 8036854, 7692963, 7328454, 6956544, 6587980, 6231521, 5893663, 5578369, 5287980, 5024223, 4787876, 4578075, 4392828, 4230065]
59200D230065j42368j24504j09253r5966q4102p3626o4400n5956m8110m1038l4583
59189C356159k8290k2270j7255j3807j2169j2809j6132k1715k8812l7412m7665
59178C097823n8315o7022p2508p5272p6129p5255p2856o9462o5086n9255n2217
59167B354446m5096l8494l2048k5661k0129j6059j3144j0821q761o517l730p94
59155B133192J791M799R684J6373K2950K7838L0983L2614L2476L0884K9133K8057
59143B400774K7343K6789K6788K6931K5594K1889J6811J1505N651j362q803j5358
59131B564552k0694k5083k8157k9047k7381k3379j7462j0386l237L250Q970J3786
59119B405732J7432K0198K2744K4952K6157K6894K8986L3145L7838M1434M4253
$$ y = [4230065, 4087697, 3963193, 3853940, 3757974, 3673872, 3600246, 3535846, 3479890, 3431780, 3390742, 3356159, 3327869, 3305599, 3288344, 3274537, 3262368, 3249559, 3233427, 3211712, 3182900, 3145488, 3097823, 3039508, 2972486, 2899978, 2824706, 2748577, 2673322, 2600466, 2531004, 2465918, 2406663, 2354446, 2309350, 2270856, 2238808, 2213147, 2193018, 2176959, 2163815, 2152994, 2144233, 2137716, 2133986, 2133192, 2134983, 2139782, 2149466, 2165839, 2188789, 2216627, 2247610, 2280224, 2312700, 2343584, 2372717, 2400774, 2428117, 2454906, 2481694, 2508625, 2534219, 2556108, 2572919, 2584424, 2590075, 2588713, 2579910, 2564552, 2543858, 2518775, 2490618, 2461571, 2434190, 2410811, 2393349, 2382963, 2379726, 2382976, 2391946, 2405732, 2423164, 2443362, 2466106, 2491058, 2517215, 2544109, 2573095, 2606240, 2644078, 2685512, 2729765]
59108B729765M7426N0853N3605N5553N7394N9588O2233O5538O9566P3992P8673
59097C404186Q3882Q9348R3788R5979R5585R2473Q6050P5920O2382M5695K5792
59086D251080L363j9626m1122n9965p5347q6634r4336j00071j04644j07263j07295
59075C458140j05567j02882r8580r1846q3395p4508o5227n4742m2913l0220j6915
59064B691345l338R420J9968K7056K8950K3609J0824o610k4925m1867n6376o7168
59052B610888p3315p5479p5070p2541o7633o0640n2216m2540l1978k2008j4296
59041B023172r285o745o874r557j3250j6204j8379k0765k3210k4421k3785k1778
59029A828919j8794j5006j1194q269n872k713J612O233J0437J4311J7901K0831
$$ y = [2729765, 2777191, 2828044, 2881649, 2937202, 2994596, 3054184, 3116417, 3181955, 3251521, 3325513, 3404186, 3488068, 3577416, 3671204, 3767183, 3862768, 3955241, 4041291, 4117211, 4179593, 4225288, 4251080, 4254443, 4234817, 4193695, 4133730, 4058383, 3971749, 3877413, 3777342, 3672698, 3565435, 3458140, 3352573, 3249691, 3151111, 3059265, 2975870, 2901362, 2836135, 2781393, 2738480, 2708260, 2691345, 2688007, 2697427, 2717395, 2744451, 2773401, 2797010, 2807834, 2801224, 2776299, 2734432, 2678056, 2610888, 2537573, 2462094, 2387024, 2314483, 2246850, 2186210, 2133994, 2091454, 2059476, 2037468, 2023172, 2013887, 2007142, 2000268, 1990711, 1977461, 1961257, 1942878, 1922113, 1898903, 1874482, 1850697, 1828919, 1810125, 1795119, 1783925, 1775656, 1769784, 1767071, 1768683, 1774916, 1785353, 1799664, 1817565, 1838396]
59017A838396K3034K5012K7104K9117L0761L1921L2592L2987L3516L4092L3836
59006B172368L1939K8489K3854J7974J0969L958j611n084o508o010m139k167j100
58993B262932q16r73k125n008r229j3622j7399k0142k1273k0585j8725j6168j2257
58980B104610o340P12P230J2480J6617J9442K0480J9895J8283J5883J2961J0378
58968B252631Q753P698O907P209R178J1564J2705J2819J3075J2985J0777O409
58956B372710K103m08j493j984j609L17L820Q585J4417K0811K6890L2155L6584
58943B512898L9867M1227M0289L7473L3506K9178K5552K3643K3781K5837K9827
58932B863078L5658M2602M9914N7755O6676P6437Q6289R6200J06782J18083J29544
$$ y = [1838396, 1861430, 1886442, 1913546, 1942663, 1973424, 2005345, 2037937, 2070924, 2104440, 2138532, 2172368, 2204307, 2232796, 2256650, 2274624, 2285593, 2289551, 2287940, 2282856, 2276348, 2270338, 2266199, 2264032, 2262932, 2262116, 2261143, 2259018, 2254010, 2244781, 2231159, 2213760, 2193618, 2172345, 2151760, 2133035, 2116867, 2104610, 2098270, 2098982, 2106212, 2118692, 2135309, 2154751, 2175231, 2195126, 2213409, 2229292, 2242253, 2252631, 2261384, 2269082, 2275989, 2283198, 2292376, 2303940, 2316645, 2329464, 2342539, 2355524, 2366301, 2372710, 2374813, 2374405, 2372912, 2370928, 2369319, 2369636, 2373456, 2382041, 2396458, 2417269, 2444159, 2476314, 2512898, 2552765, 2593992, 2634281, 2671754, 2705260, 2734438, 2759990, 2783633, 2807414, 2833251, 2863078, 2898736, 2941338, 2991252, 3049007, 3115683, 3192120, 3278409, 3374609, 3481391, 3599474, 3729018]
58921C729018J41103J53403J66823J81111J96050K11731K28093K44784K61390
58912E513506K77283K91530L03718L14579L25298L36647L49402L64854L83722
58903H460539M04833M25769M44526M59690M69500M71825M64992M47814M19192
58894A2468680L78422L25469K60376J83333R6440M643q6343j72533k51270l19655
58884A2887562l75263m18070m50012m72787m87313m94667m95816m90681m79050
58875H723903m62226m42376m20522l96730l71890l47544l24079l00858k78153
58866E379525k57152k38012k19567k01341j84241j68967j55117j42140j29904
58857C683084j18078j06209r4600q3956p4271o5153n7035n0559m4958l8689l1665
$$ y = [3729018, 3870121, 4023524, 4190347, 4371458, 4567508, 4779239, 5007332, 5252116, 5513506, 5790789, 6082319, 6386037, 6700616, 7025914, 7362561, 7711963, 8076817, 8460539, 8865372, 9291141, 9735667, 10195357, 10664857, 11136682, 11601674, 12049488, 12468680, 12847102, 13172571, 13432947, 13616280, 13712720, 13717363, 13631020, 13458487, 13207217, 12887562, 12512299, 12094229, 11644217, 11171430, 10684117, 10189450, 9693634, 9202953, 8723903, 8261677, 7819301, 7398779, 7002049, 6630159, 6282615, 5958536, 5657678, 5379525, 5122373, 4884361, 4664794, 4463453, 4279212, 4110245, 3955128, 3812988, 3683084, 3565006, 3458797, 3364197, 3280241, 3205970, 3140817, 3083782, 3033223, 2988265, 2949576, 2917911]
58846B917911k5116j9337j3400p279k170J750O032J1717J8058K4269L0921L8731
58834B982087M7234N5698O4265P3262Q2227R0346R7272J03130J08392J13912J20365
58823C938190J27582J35151J43600J53931J66261J80060J95551K13454K33540
58814E487320K54913K77674L02643L29443L56439L82705M08260M32187M52387
58805H683971M67502M77228M80097M72897M53154M20652L75878L18765K49998
58796A2400142J72124Q8470K261q2602j61652k32010k93192l44873l85243m12773
58786A0750652m28382m34398m32278m22649m07092l88702l71133l57390l48715
58777G159913l43758l39192l31836l20179l04228k85014k64406k44254k25057
$$ y = [2917911, 2892795, 2873458, 2860058, 2852779, 2850609, 2852359, 2858391, 2870108, 2888166, 2912435, 2943356, 2982087, 3029321, 3085019, 3149284, 3222546, 3304773, 3395119, 3492391, 3595521, 3703913, 3817825, 3938190, 4065772, 4200923, 4344523, 4498454, 4664715, 4844775, 5040326, 5253780, 5487320, 5742233, 6019907, 6322550, 6651993, 7008432, 7391137, 7799397, 8231584, 8683971, 9151473, 9628701, 10108798, 10581695, 11034849, 11455501, 11831379, 12150144, 12400142, 12572266, 12660736, 12662997, 12580395, 12418743, 12186733, 11893541, 11548668, 11163425, 10750652, 10322270, 9887872, 9455594, 9032945, 8625853, 8237151, 7866018, 7508628, 7159913, 6816155, 6476963, 6145127, 5824948, 5520720, 5235706, 4971300, 4727046, 4501989]
58768D501989k06168j87338j69145j51777j34624j17383j00408q3605o6225m8136
58758C237180l0139j2531N572K5036M5720O6827Q6963J03492J13055J13258J03175
58747C857608Q2603N2482J6333k0499n3691q1086j01306j13241j17496j16521
58737C405186j12510j06459r9570r3650q9320q5613q2176q0137q0032q0706q1209
58726B413804q2007q3104q2820p9846p5031o9612o3166n4900m5785l7689l1265
58715A708579k6212k2838k1857k3094k5502k8110l0120l0757k9836k7958k5630
58704A416665k3001k0800k0277k1493k2884k3310k3360k3789k4003k3123k1345
58693A169280j9129j6134j2071p629l438J010O364J2224J7915K3555K9334L4573
$$ y = [4501989, 4295821, 4108483, 3939338, 3787561, 3652937, 3535554, 3435146, 3351541, 3285316, 3237180, 3207041, 3194510, 3200082, 3225118, 3270838, 3337665, 3424628, 3528120, 3641175, 3754433, 3857608, 3940211, 3992693, 4009026, 3988527, 3934836, 3853750, 3752444, 3639203, 3521707, 3405186, 3292676, 3186217, 3086647, 2992997, 2903677, 2818064, 2735888, 2655751, 2575719, 2495013, 2413804, 2331797, 2248693, 2165873, 2086027, 2010996, 1941384, 1878218, 1823318, 1777533, 1739844, 1708579, 1682367, 1659529, 1637672, 1614578, 1589076, 1560966, 1530846, 1500089, 1470253, 1442295, 1416665, 1393664, 1372864, 1352587, 1331094, 1308210, 1284900, 1261540, 1237751, 1213748, 1190625, 1169280, 1150151, 1134017, 1121946, 1114317, 1110879, 1111889, 1118253, 1130477, 1148392, 1171947, 1201281, 1235854]
58681A235854L8573M1579M4103M6015M7127M7824M8333M8255M7582M7264M7916
58670A740425M8683M7797M3205L2441J3765j1234l7331n9204p4570q3535q6489
58659A573953q4050p7858o9894o1491n3586m6893m1058l4880k8255k2616j8637
58648A034735j5014j0709o783m511l046p17K304M412M940M647M358M481N433P289
58634A031819R337J0922J2357J4317J6866J9739K2848K5939K8499L0640L3189
58623A256472L6447L9922M3655M8516N4600O0872O7066P4404Q3495R3065J01890
58612A960404J10450J19588J28886J37586J45604J52294J55595J53768J46830
58603C211005J35206J18425R6489P1140M4429J7322r020l2136n0051o2876p1188
$$ y = [1235854, 1274427, 1316006, 1360109, 1406124, 1453251, 1501075, 1549408, 1597663, 1645245, 1692509, 1740425, 1789108, 1836905, 1880110, 1912551, 1926316, 1915082, 1877751, 1818547, 1743977, 1660442, 1573953, 1489903, 1412045, 1342151, 1280660, 1227074, 1180181, 1139123, 1104243, 1075988, 1053372, 1034735, 1019721, 1009012, 1002229, 997718, 994672, 993955, 996259, 1000671, 1005611, 1010258, 1014616, 1019097, 1024530, 1031819, 1041156, 1052078, 1064435, 1078752, 1095618, 1115357, 1138205, 1164144, 1192643, 1223283, 1256472, 1292919, 1332841, 1376496, 1425012, 1479612, 1540484, 1607550, 1681954, 1765449, 1858514, 1960404, 2070854, 2190442, 2319328, 2456914, 2602518, 2754812, 2910407, 3064175, 3211005, 3346211, 3464636, 3561125, 3632265, 3676694, 3694016, 3684996, 3652860, 3602809, 3539933, 3468745]
58592C468745p4272p1659o5159n7551n0141m2965l6186k9662k2204j2908k325
58581C003713R024K2151L8215N6725P6539R7296J18210J36396J47957J49677J38561
58570C994464J11512O7932J2122m8355j06126j55191j90910k11364k18180k14469
58560C041435k02661j85250j65869j47689j31669j17867j07146r9934r4703q9528
58550A699119q4143p8943p3399o7112o1101n6230n1676m6566m1646l7594l3427
58539A067282k8550k4560k2801k1765j9410j6484j4898j4255j2777j0510q898
58528H72374q003o757n114l591j514J848N383P665R369J1868J4653J6691J9003
58515I33875K3070K7791L1056L3383L6827M1121M4151M5834M8334N2633N7908
$$ y = [3468745, 3394473, 3322814, 3257655, 3200104, 3149963, 3106998, 3070812, 3041150, 3018946, 3006038, 3003713, 3012737, 3034888, 3073103, 3129828, 3206367, 3303663, 3421873, 3558269, 3706226, 3855903, 3994464, 4105976, 4173908, 4186030, 4137675, 4031549, 3876358, 3685448, 3474084, 3255904, 3041435, 2838774, 2653524, 2487655, 2339966, 2208297, 2090430, 1983284, 1883350, 1788647, 1699119, 1614976, 1536033, 1462634, 1395522, 1334421, 1278191, 1226515, 1179949, 1138303, 1100709, 1067282, 1038732, 1014172, 991371, 969606, 950196, 933712, 918814, 904559, 891782, 881272, 872374, 864371, 857614, 852500, 848909, 847395, 849243, 854626, 862291, 871660, 883528, 898181, 914872, 933875, 956945, 984736, 1015792, 1049175, 1086002, 1127123, 1171274, 1217108, 1265442, 1318075, 1375983]
58504A375983O4211P2699Q3012R3059J01493J08046J11425J09420J01352Q8346
58494B309046P1518N1843L1307J1595q103k9614n2321p3309r0496j03312j10966
58483B007188j12797j10172j05541r9668r2003q3291p5356o8625o2287n6530n2225
58472A088693m8791m4880m0835l8019l6212l4104l1831l0471k9441k7106k3524
58461G03479k0074j6891j3259r914q138p136n169k695j509j325l32J363J964J328
58447F21692J020J338J357J465K767M368M453L546L437L517J775j036k144j385
58433F46170j130j723j195L62M11j409k369j195L17J065K245M161N203N059N511
58418F61483O839O889M869K817K059J410M5r00q36q97j559j799j480j714k229
$$ y = [1375983, 1440194, 1512893, 1595905, 1688964, 1790457, 1898503, 2009928, 2119348, 2220700, 2309046, 2380564, 2432407, 2463714, 2475309, 2467206, 2437592, 2385271, 2311962, 2221466, 2118154, 2007188, 1894391, 1784219, 1678678, 1579010, 1487007, 1403716, 1328360, 1259735, 1197448, 1140918, 1088693, 1039902, 995022, 954187, 916168, 879956, 845852, 814021, 783550, 754109, 727003, 703479, 683405, 666514, 653255, 643341, 635203, 628067, 622898, 620203, 618694, 617369, 617037, 618400, 620364, 621692, 622712, 624050, 625407, 626872, 629639, 634007, 638460, 642006, 645443, 648960, 650735, 649699, 647555, 646170, 645040, 643317, 642122, 642484, 642895, 641486, 639117, 637922, 638239, 639304, 641549, 645710, 650913, 655972, 661483, 668322, 675211, 680080, 682897, 684956, 686366, 686411, 685511, 684675, 683778, 682219, 680420, 678940, 677226, 674997]
58403F74997j368N35R59p99k523k772k567k612k094j108j115j953j496P21K554
58388F59359K721K268J907J007p0J89J561K204K124L223N450O562O213O494P658
58373G08870P420N359M074M775N679N906P003R140R889Q414P131P531Q020P415
58359H06626O989P420P263N994N160N131M253K528K377M373N950N704N284N763
58345H80815O013N948P280R715J0553R498R660J2177J4276J4347J4484J6110J7508
58332A028384J7720J8568K0724K1992K1469K1203K1805K0839J7516J4450J2829
58321A237499J0489O918N127O340P590P207P654J0340J2563J2546J2706J4963
58309A351942J7436J8670K0444K3470K5171K4646K5079K8228L1443L3148L6148
$$ y = [674997, 673629, 674164, 675123, 674324, 671801, 669029, 666462, 663850, 661756, 660648, 659533, 657580, 656084, 656805, 659359, 662080, 664348, 666255, 667262, 667192, 667381, 668942, 671146, 673270, 676493, 681943, 688505, 694718, 701212, 708870, 716290, 721649, 725723, 730498, 736177, 742083, 749086, 758226, 768115, 776529, 783660, 791191, 799211, 806626, 813615, 821035, 828298, 834292, 839452, 844583, 848836, 851364, 853741, 858114, 864064, 869768, 875052, 880815, 886828, 892776, 900056, 909771, 920324, 929822, 939482, 951659, 965935, 980282, 994766, 1010876, 1028384, 1046104, 1064672, 1085396, 1107388, 1128857, 1150060, 1171865, 1192704, 1210220, 1224670, 1237499, 1247988, 1254906, 1260033, 1266373, 1273963, 1281170, 1288824, 1299164, 1311727, 1324273, 1336979, 1351942, 1369378, 1388048, 1408492, 1431962, 1457133, 1481779, 1506858, 1535086, 1566529, 1599677, 1635825]
58298A635825M2342M9233N5079O2404P2981Q4419R5282J08409J25548J43764J60698
58287B635984J78129J96517K11240K18118K17408K08698J87561J51831J06218
58278D311704N6763N953m2996q3236j10535j27450j37204j38762j31878j20915
58268C481444j09197r5211p8615o3713n2620m1443k7822j5710p927p98Q786J7907
58256C015081K4260L1062M0143M7492N1133N5714O3780P0434P2549P4942Q1151
58245C627741Q6767Q8594R1485R8972J06216J09753J14888J25472J35882J41541
58235D727311J47677J58894J70127J77172J85967K01570K18341K31124K45510
58226F463693K66538K88407L06279L26659L54676L83434M07996M36934M77203
$$ y = [1635825, 1678167, 1727400, 1782479, 1844883, 1917864, 2002283, 2097565, 2205974, 2331522, 2475286, 2635984, 2814113, 3010630, 3221870, 3439988, 3657396, 3866094, 4053655, 4205486, 4311704, 4368467, 4374420, 4331424, 4248188, 4137653, 4010203, 3872999, 3734237, 3602359, 3481444, 3372247, 3277036, 3198421, 3134708, 3082088, 3040645, 3012823, 2997113, 2989186, 2988388, 2997174, 3015081, 3039341, 3070403, 3110546, 3158038, 3209171, 3264885, 3328665, 3399099, 3471648, 3546590, 3627741, 3714508, 3803102, 3894587, 3993559, 4099775, 4209528, 4324416, 4449888, 4585770, 4727311, 4874988, 5033882, 5204009, 5381181, 5567148, 5768718, 5987059, 6218183, 6463693, 6730231, 7018638, 7324917, 7651576, 8006252, 8389686, 8797682, 9234616, 9711819]
58217I711819N21330N63127O11419O73604P41378Q08781Q87834R89037J104000
58208A6612329J226214J370440J551492J764454K008605K309453K693335L165129
58200C2701451L738412M459798N370722O473759P773214R320240J1184438J3424063
58192I4446097J6130851J9458112K3549360K8464152L4109937L9920819M4302206
58185C00381534M4629652L8547125K5882640R336017o955062j9685060k7515941
58178C64620905l0666543l0117832k7294328k3877721k1247852j9889630j9408074
58171A92118925j9106699j8509137j7469881j6047776j4393825j2684566j1061167
58164H2845874r600894q333003p255328o337478n539402m838555m228341l696889
$$ y = [9711819, 10233149, 10796276, 11407695, 12081299, 12822677, 13631458, 14519292, 15508329, 16612329, 17838543, 19208983, 20760475, 22524929, 24533534, 26842987, 29536322, 32701451, 36439863, 40899661, 46270383, 52744142, 60517356, 69837596, 81022034, 94446097, 110576948, 130035060, 153584420, 182048572, 216158509, 256079328, 300381534, 345011186, 383558311, 409440951, 418776968, 411821906, 392136846, 364620905, 333954362, 303836530, 276542202, 252664481, 231416629, 211526999, 192118925, 173012226, 154503089, 137033208, 120985432, 106591607, 93907041, 82845874, 73244980, 64911977, 57656649, 51319171, 45779769, 40941214, 36712873, 33015984]
58156C3015984l227015k812917k457569k155930j896297j674120j489191j333580
58148A5969365j196775j078132r80602q97222q17184p40384o72964o13362n55528
58139H417212n01145m55917m17550l79351l41994l10515k83318k55345k28820
58130E243257k10211j99317j91000j84595j82043j79830j72372j60879j50279
58121C612731j40145j27135j13205j02688r3868q1992o8190n7170m8272l6916
58111B743150k2949r882K378J6606L1476M2396M7579M7077L8095J7881j0270l9918
58099B903619o8442r5577j17816j30803j35341j34980j29867j18875j05380r4432
58089A772106q5945p6764o7505o1142n6741n1041m4771m1204l9643l6574l2137
$$ y = [33015984, 29788969, 26976052, 24518483, 22362553, 20466256, 18792136, 17302945, 15969365, 14772590, 13694458, 12713856, 11816634, 10999450, 10259066, 9586102, 8972740, 8417212, 7916067, 7460150, 7042600, 6663249, 6321255, 6010740, 5727422, 5472077, 5243257, 5033046, 4833729, 4642729, 4458134, 4276091, 4096261, 3923889, 3763010, 3612731, 3472586, 3345451, 3232246, 3129558, 3035690, 2953698, 2885508, 2828338, 2780066, 2743150, 2720201, 2710319, 2712697, 2729303, 2760779, 2803175, 2850754, 2897831, 2935926, 2953807, 2943537, 2903619, 2835177, 2739600, 2621784, 2490981, 2355640, 2220660, 2090793, 1971918, 1866538, 1772106, 1686161, 1609397, 1541892, 1480750, 1424009, 1372968, 1328197, 1286993, 1247350, 1210776, 1178639]
58078A178639k9462k8481k6246k2745k0737k0315j9042j7031j6657j7649j7430
58067I42844j5938j5359j5579j4530j2528j1658j1469r783p214o384p186p262
58055H07954o559p009q269q264p456q144r897j0105q708q041q250p225n021m053
58041G00953m715m828l635k564j912l94J815L133L716N234P527Q743Q614Q465
58027G30152Q353P508P103R106J2757J5727J8299K2756K8925L4254L8346M3626
58015I76912N1182N9436O7204P4648Q0808Q3439Q1832P6931O8557N5640L9400
58004A715989K3231R094l319j3875k1585k6885l1398l5184l7025l7360l7861l8169
57992A465653l6086l1208k5304j9035j1490l155L828Q751J2613J4929J3366P144
$$ y = [1178639, 1149177, 1120696, 1094450, 1071705, 1050968, 1030653, 1011611, 994580, 977923, 960274, 942844, 926906, 911547, 895968, 881438, 868910, 857252, 845783, 836000, 828786, 822402, 815216, 807954, 801395, 794386, 786117, 777853, 770397, 762253, 752356, 742251, 733543, 725502, 717252, 710027, 705006, 700953, 696238, 691410, 687775, 685211, 683299, 682905, 684720, 687853, 691569, 696803, 704330, 713073, 721687, 730152, 738505, 746013, 753116, 762222, 774979, 790706, 809005, 831761, 860686, 894940, 933286, 976912, 1028094, 1087530, 1154734, 1229382, 1310190, 1393629, 1475461, 1552392, 1620949, 1676589, 1715989, 1739220, 1748314, 1744995, 1731120, 1709535, 1682650, 1651252, 1616068, 1579043, 1541683, 1503822, 1465653, 1429567, 1398359, 1373055, 1354020, 1342530, 1339375, 1343203, 1351954, 1364567, 1379496, 1392862, 1400006]
57980A400006j971j2438k3855l4782m2736m7065m9217m9630m7215m2313l7169
57969A011615l2703k7579k1218j4992r698m498Q39N188Q374J1572J4699J5971
57957I57570J4887J3095J1467Q931N058J222j839n100q757j1144j1351j0581r718
57944I53740p812m221q2L696P684J1865J4309J3408R697M150l372j2590k1451
57931I69021k7975l2105l4428l4590l2360k9010k6065k3642k1157j8792j7068
57920F71829j5743j4085j1707q567m865j299J344L151M758O061O396N955N573
57907F48801N069L321K51k916n637q543j1602j3453j3330j2083j0732r402q189
57894E61555p527p063n584k715N42L354N835P987R349J0152J1333J3013J4323
$$ y = [1400006, 1398035, 1385597, 1361742, 1326960, 1284224, 1237159, 1187942, 1138312, 1091097, 1048784, 1011615, 978912, 951333, 930115, 915123, 905425, 900927, 901766, 906954, 915328, 926900, 941599, 957570, 972457, 985552, 997019, 1005950, 1011008, 1012230, 1010391, 1005291, 996534, 985390, 974039, 963458, 953740, 945928, 941707, 941625, 945321, 953005, 964870, 979179, 992587, 1002284, 1006434, 1003062, 990472, 969021, 941046, 908941, 874513, 839923, 807563, 778553, 752488, 728846, 707689, 688897, 671829, 656086, 642001, 630294, 621727, 616862, 615563, 616907, 620058, 624816, 630877, 637273, 643228, 648801, 653870, 657191, 657442, 654526, 648889, 640346, 628744, 615291, 601961, 589878, 579146, 569744, 561555, 554028, 546965, 541381, 538666, 539208, 542562, 548397, 556384, 565733, 575885, 587218, 600231, 614554]
57881F14554J4951J5298J5002J3168J0376Q328P011M398k25m862p768r788j2336
57868F68107j4954j6497j7187j7883j8396j7995j6733j4998j2718r942p429n559
57856D97816l595q64K182M860P205R298J0677J1194J1453J1638J0972R085O821
57843E88742M844K588n55l997o854r084j0879j1886j1975j1838j1944j1677j0404
57830D95081q604p117n973m706l152j323Q95L384N843Q486J1918J6063K0195K4178
57816E55168K8473L2734L5849L7782L9738M1947M2992M2282M1477M2153M3364
57805I83959M2864L9584L3656K5216J4745L865n634j3202j9082k3257k5746k7372
57793A029596k9127l1255l3547l5822l7530l7797l6692l5496l4965l4241l2391
$$ y = [614554, 629505, 644803, 659805, 672973, 683349, 691677, 698688, 703086, 702861, 697999, 690231, 680443, 668107, 653153, 636656, 619469, 601586, 583190, 565195, 548462, 533464, 520746, 510804, 503375, 497816, 494221, 493357, 495539, 500399, 507604, 516902, 527579, 538773, 550226, 561864, 572836, 581921, 588742, 593586, 596174, 595619, 591622, 584768, 575684, 564805, 552919, 540944, 529106, 517162, 505485, 495081, 486477, 479360, 473387, 468681, 465529, 464206, 465101, 468485, 474328, 482814, 494732, 510795, 530990, 555168, 583641, 616375, 652224, 690006, 729744, 771691, 814683, 856965, 898442, 940595, 983959, 1026823, 1066407, 1100063, 1125279, 1140024, 1143889, 1138255, 1125053, 1105971, 1082714, 1056968, 1029596, 1000469, 969214, 935667, 899845, 862315, 824518, 787826, 752330, 717365, 683124, 650733]
57782F50733k9927k7881k6336k4966k4017k3552k2537k0042j6720j3979j2160
57771D08616j0629r102p842o934o301n986n734m829l098j367k28Q12K245L616
57757C53239M631O190Q988J1943J3375J3201J2649J2342J1883J1028R950Q645
57745D78064P126N981N793O281O809P258P592P193N822M581M709N844O740P257
57731E67050Q300J0052J1709J2936J4239J5752J6910J7547J8263J9397K0472K0959
57719G53586K0941K0838K1157K2512K5262K8939L2680L6359M0803M6834N4506
57708A104417O3272P2482Q1684R0824J00117J09606J19053J28335J37405J45588
57698B152783J51452J53784J51988J45182J31855J11293Q4763N4532K2365j0045
$$ y = [650733, 620806, 592925, 566589, 541623, 517606, 494054, 471517, 451475, 434755, 420776, 408616, 397987, 388885, 381043, 374109, 367808, 361822, 356088, 351259, 348161, 346794, 346566, 347378, 349623, 353239, 357870, 364060, 373048, 384991, 398366, 411567, 424216, 436558, 448441, 459469, 469419, 478064, 485190, 491171, 496964, 503245, 510054, 517312, 524904, 532097, 537919, 542500, 547209, 553053, 559793, 567050, 575350, 585402, 597111, 610047, 624286, 640038, 656948, 674495, 692758, 712155, 732627, 753586, 774527, 795365, 816522, 839034, 864296, 893235, 925915, 962274, 1003077, 1049911, 1104417, 1167689, 1240171, 1321855, 1412679, 1512796, 1622402, 1741455, 1869790, 2007195, 2152783, 2304235, 2458019, 2610007, 2755189, 2887044, 2998337, 3083100, 3137632, 3159997, 3149952]
57688C149952m0120o5342q5022r9942j10354j15546j15443j11479j05341r7559
57678B203804q7686p5403o1056m5285k8335r704J1429L5443O1758Q8105J08973
57667B202043J15434R9340O0040O725m6875q9979j17614j29135j26849j15514
57657A857616j00314q4296o8333n3126l9583k7491j5644l735P370J7500K7858
57646A517822L9269N1108O2582P3940Q5633R7176J07702J16864J24489J29822
57636B406407J31730J29194J21228J07013Q6762O2045L4765O125k2995n1151p6380
57625B934743r6985j12110j21823j26984j28710j27737j24455j19572j14189j08979
57615A753199j03673r7724r1118q4301p7621p1240o5339o0032n5119n0260m5383
$$ y = [3149952, 3109832, 3044490, 2959468, 2859526, 2749172, 2633626, 2518183, 2406704, 2301363, 2203804, 2116118, 2040715, 1979659, 1934374, 1906039, 1896335, 1907764, 1943207, 2004965, 2093070, 2202043, 2317477, 2416817, 2476857, 2483582, 2436707, 2346728, 2229114, 2099979, 1973130, 1857616, 1757302, 1673006, 1604673, 1551547, 1511964, 1484473, 1468829, 1465094, 1472464, 1489964, 1517822, 1557091, 1608199, 1670781, 1744721, 1830354, 1927530, 2035232, 2152096, 2276585, 2406407, 2538137, 2667331, 2788559, 2895572, 2982334, 3044379, 3079144, 3085269, 3062274, 3011123, 2934743, 2837758, 2725648, 2603825, 2476841, 2348131, 2220394, 2095939, 1976367, 1862178, 1753199, 1649526, 1551802, 1460684, 1376383, 1298762, 1227522, 1162183, 1102151, 1047032, 996772, 951389]
57604I51389m0770l6687l3126k9912k7041k4692k2854k1095j9007j6746j4806
57593F64653j3310j1982j0866j0389j0444j0098q676o631m803l347k009r71o32
57580E70495p55o51n3Q22J978L585N315O341O239N490M992N388O634P970Q552
57565F32342Q475Q895J0710J3556J6519J9375K2397K5432K8143L0888L4452L9040
57553H90224M4331N0356N7358O4868P1920P8285Q4628R1369R8132J04330J09359
57542A745160J12047J10916J05344R5724Q2323O4859M3657K0360l061k5456m6182
57531B305691o4254p8481q8235r3788r6021r5877r3858q9983q4548p8726p3791
57520A368129o9742o5327n9622n3005m6518m0841l6074l2003k8302k4864k1833
$$ y = [951389, 910619, 873932, 840806, 810894, 783853, 759161, 736307, 715212, 696205, 679459, 664653, 651343, 639361, 628495, 618106, 607662, 597564, 588888, 582257, 577454, 574107, 572098, 571127, 570495, 569740, 569089, 569036, 569858, 571836, 575421, 580736, 587077, 593316, 598806, 603798, 609186, 615820, 623790, 632342, 640817, 649712, 660422, 673978, 690497, 709872, 732269, 757701, 785844, 816732, 851184, 890224, 934555, 984911, 1042269, 1107137, 1179057, 1257342, 1341970, 1433339, 1531471, 1635801, 1745160, 1857207, 1968123, 2073467, 2169191, 2251514, 2316373, 2360030, 2380390, 2377329, 2351873, 2305691, 2241437, 2162956, 2074721, 1980933, 1884912, 1789035, 1695177, 1605194, 1520646, 1441920, 1368129, 1298387, 1233060, 1173438, 1120433, 1073915, 1033074, 997000, 964997, 936695, 911831, 889998]
57509H89998j9030j5655j1325p134m613l640k504k12K473M718P064J0459J4743
57496H65342J9055K3121K7305L1824L6702M2199M8653N5957O3643P1277P8532
57485A363610Q5256R1609R7586J02245J03996J01936R6248Q6956P3242N4699L2533
57474B289916Q799j5016l7922n8651p5887q9031r8049j02929j04061j02717j00248
57463A514204r6979r2604q7369q2004p6704p1146o5467o0345n5987n1818m7425
57452G26356m3123l9338l5985l2729k9472k6414k3875k2113k0965j9699j7655
57441D14988j5041j2725j1252j0468j0081j0001j0056r834r108q128p292o800
57429B94202o643o666o531n935n014m268l979l915l726l405l205l221l228k885
$$ y = [889998, 870968, 855313, 843988, 836854, 832241, 828601, 826097, 825885, 828358, 833076, 840140, 850599, 865342, 884397, 907518, 934823, 966647, 1003349, 1045548, 1094201, 1150158, 1213801, 1285078, 1363610, 1448866, 1540475, 1638061, 1740306, 1844302, 1946238, 2042486, 2129442, 2202684, 2257383, 2289916, 2298715, 2283699, 2245777, 2187126, 2111239, 2022208, 1924159, 1821230, 1717169, 1614452, 1514204, 1417225, 1324621, 1237252, 1155248, 1078544, 1007398, 941931, 881586, 825599, 773781, 726356, 683233, 643895, 607910, 575181, 545709, 519295, 495420, 473307, 452342, 432643, 414988, 399947, 387222, 375970, 365502, 355421, 345420, 335364, 325530, 316422, 308294, 301002, 294202, 287559, 280893, 274362, 268427, 263413, 259145, 255166, 251251, 247525, 244120, 240915, 237694, 234466, 231581]
57415B31581k149j431j213j430j480r67k26J68J27koR8L87R95J785K449K894L225
57397B34805L389L190K622J863R84M8o01n93j25J67lk93l03JM64R59J329J453
57379B49356J576K117L033L771L980L913L865L696L231K757K706L004L159K924
57365B93088K549K411K610K969L265L439L582L693L574L141K774L023L893M853
57351C38864N638O598P959R188R590R301R130R502R974R884R055P762O327M915
57337D53687L566K224R36j2k34L30J363K572L990N749P699R508J1073J2578J4142
57322E29171J5521J6372J6755J7232J8364K0034K1462K1997K1843K1694K1607
57311G42052K0637J7902J3790R535N689J596l375q708j3378j7169k0595k3699
$$ y = [231581, 229432, 228001, 226788, 225358, 223878, 222911, 222685, 222853, 222980, 222978, 222972, 223070, 223457, 224452, 226237, 228686, 231580, 234805, 238194, 241384, 244006, 245869, 246853, 246901, 246300, 245707, 245582, 245749, 245746, 245453, 245150, 245151, 245615, 246574, 247903, 249356, 250932, 253049, 256082, 259853, 263833, 267746, 271611, 275307, 278538, 281295, 284001, 287005, 290164, 293088, 295637, 298048, 300658, 303627, 306892, 310331, 313913, 317606, 321180, 324321, 327095, 330118, 334011, 338864, 344502, 351100, 359059, 368247, 377837, 387138, 396268, 405770, 415744, 425628, 434683, 442445, 448772, 453687, 457253, 459477, 460413, 460401, 460167, 460497, 461860, 464432, 468422, 474171, 481870, 491378, 502451, 515029, 529171, 544692, 561064, 577819, 595051, 613415, 633449, 654911, 676908, 698751, 720445, 742052, 762689, 780591, 794381, 803916, 809605, 811201, 807826, 799118, 785740, 768571, 747976, 724277]
57299G24277k5752k6279k5700k4646k3223k1339j9223j7160j5115j3103j1567
57288E01170j0771j0150q886p027n321m074k852j417j96M14P36J420K675M144
57274D59865N299N788N684N504N711O079N956N248M741N143O243P244P707P781
57260E43993P753P724P580P116O285N486N267N632N955N771N410N456N955O536
57246F31919P031P552Q083Q471Q765R192R718J0068J0210J0473J1020J1520J1532
57233G55554J1097J0720J0787J1192J1581J1867J2318J3072J3838J4267J4446
57222H90739J4729J5229J5749J6206J6673J7009J6938J6568J6418J6670J6915
57211A069843J6776J6428J6166J5995J5965J6415J7406J8271J8281J7542J6740
$$ y = [724277, 698525, 672246, 646546, 621900, 598677, 577338, 558115, 540955, 525840, 512737, 501170, 490399, 480249, 471363, 464336, 459015, 454941, 452089, 450672, 450476, 450890, 451626, 453046, 455721, 459865, 465164, 470952, 476636, 482140, 487851, 493930, 499886, 505134, 509875, 515018, 521261, 528505, 536212, 543993, 551746, 559470, 567050, 574166, 580451, 585937, 591204, 596836, 602791, 608562, 613972, 619428, 625383, 631919, 638950, 646502, 654585, 663056, 671821, 681013, 690731, 700799, 711009, 721482, 732502, 744022, 755554, 766651, 777371, 788158, 799350, 810931, 822798, 835116, 848188, 862026, 876293, 890739, 905468, 920697, 936446, 952652, 969325, 986334, 1003272, 1019840, 1036258, 1052928, 1069843, 1086619, 1103047, 1119213, 1135208, 1151173, 1167588, 1184994, 1203265, 1221546, 1239088, 1255828]
57200A255828J6229J5828J5372J4915J4448J3879J3278J2845J2610J2516J2620
57189A410368J3061J3857J5009J6540J8219J9493K0108K0522K1365K2697K4088
57178A615327K5202K5958K6403K6834K7655K8723K9254K8920K8504K8827K9474
57167A921081K9421K8598K7795K7289K6567K5474K4554K4078K3700K3290K3275
57156B205122K3782K4196K3982K3313K2528K1567K0339J9044J7832J6596J5470
57145B433771J4951J5192J5681J5951J6134J6401J6513J6352J6425J7128J7928
57134B612427J8020J7681J8145J9930K1977K2934K3024K3888K6697L0977L5736
57123B871436M0852M6446N1256N3075N1181M7319M3666M0870L8721L7682L8605
$$ y = [1255828, 1272057, 1287885, 1303257, 1318172, 1332620, 1346499, 1359777, 1372622, 1385232, 1397748, 1410368, 1423429, 1437286, 1452295, 1468835, 1487054, 1506547, 1526655, 1547177, 1568542, 1591239, 1615327, 1640529, 1666487, 1692890, 1719724, 1747379, 1776102, 1805356, 1834276, 1862780, 1891607, 1921081, 1950502, 1979100, 2006895, 2034184, 2060751, 2086225, 2110779, 2134857, 2158557, 2181847, 2205122, 2228904, 2253100, 2277082, 2300395, 2322923, 2344490, 2364829, 2383873, 2401705, 2418301, 2433771, 2448722, 2463914, 2479595, 2495546, 2511680, 2528081, 2544594, 2560946, 2577371, 2594499, 2612427, 2630447, 2648128, 2666273, 2686203, 2708180, 2731114, 2754138, 2778026, 2804723, 2835700, 2871436, 2912288, 2958734, 3009990, 3063065, 3114246, 3161565, 3205231, 3246101, 3284822, 3322504, 3361109]
57112C361109M1617M6429N3160O1952P2301Q3981R8123J16271J38880J65949J98577
57101D438349K38750K88284L49541M26644N24361O46026P93638R68886J171945
57092I846424J399763J647192J908786K177094K439917K681577K885895L035726
57084B8022374L112067L097726K979206K739822K357654J828099J196811N57796
57076D5891555J273m41413p99427j115843j408258j669216j886607k053668k166800
57067C4351596k224970k232319k197266k128802k035513j926333j809129j688886
57059A8108378j568831j452217j341234j235393j133167j034743r41701q54718
57051H546374p73212o96795o25688n60038n00071m46738m01097l62935l30624
$$ y = [3361109, 3402726, 3449155, 3502315, 3564267, 3636568, 3720549, 3818672, 3934943, 4073823, 4239772, 4438349, 4677099, 4965383, 5314924, 5741568, 6265929, 6911955, 7705593, 8674479, 9846424, 11246187, 12893379, 14802165, 16979259, 19419176, 22100753, 24986648, 28022374, 31134441, 34232167, 37211373, 39951195, 42308849, 44136948, 45333759, 45891555, 45892828, 45451415, 44651988, 43536145, 42127887, 40458671, 38572064, 36518396, 34351596, 32126626, 29894307, 27697041, 25568239, 23532726, 21606393, 19797264, 18108378, 16539547, 15087330, 13746096, 12510703, 11377536, 10342793, 9401092, 8546374, 7773162, 7076367, 6450679, 5890641, 5390570, 4943832, 4542735, 4179800, 3849176]
57042C849176l02261k76564k53087k31927k13071j95792j79110j62904j47877
57033A886583j34320j21654j09385r7641q6468p5443o4317n3367m2681l1844k0530
57022A048933q689M116J8983L7053N8660Q2078J01635J07955R2985N6621P891
57011A608221m0649p9291j03322j12321j09338r9405q6976p4634o4000n6266n1124
57000G30895m6661m1561l6461l2382k9066k5825k2834k0357j7769j4560j1416
56989D32003r104p132m646j829Q42L853P687J1150J2181J0045N702L36n211r876
56975D46001j2576j3161j2435j1206r920q851p920o686n056l650k820j875QK651
56961C52504N473Q594J2443J6689K0458K3067K3724K1154J4831O214k275r233
$$ y = [3849176, 3546915, 3270351, 3017264, 2785337, 2572266, 2376474, 2197364, 2034460, 1886583, 1752263, 1630609, 1521224, 1423583, 1337115, 1261672, 1197355, 1143988, 1101307, 1069463, 1048933, 1040244, 1044360, 1063343, 1100396, 1159056, 1241134, 1342769, 1450724, 1543709, 1600330, 1608221, 1567572, 1488281, 1384959, 1272638, 1163300, 1063895, 976919, 902285, 838285, 782019, 730895, 684234, 642673, 606212, 573830, 544764, 518939, 496105, 475748, 457979, 443419, 432003, 422899, 415767, 411121, 409292, 410134, 413987, 421674, 432824, 445005, 455050, 460752, 461088, 455877, 446001, 433425, 420264, 407829, 396623, 386703, 377852, 369932, 363246, 358190, 354540, 351720, 349845, 349853, 352504, 357977, 366571, 379014, 395703, 416161, 439228, 462952, 484106, 498937, 505151, 502876, 493643]
56949D93643j4373j7268j7412j5434j2883j0616q358n861l457j331P83K991N151
56936C95575P491J0553J4335J8227K1925K5529K8461K8937K5083J6412M266q731
56924E88063j9750k6956l0226l0700k9666k7965k6062k4138k2082j9795j7495
56913C13228j5502j3847j2322j0844r495q357p519o932o200m917l383k515k674
56900B08721l121k975k198j169R2J687L309M616N812P227Q712J0011J1485J3730
56886B65939J6635J9221K0222J8622J4019P122l80o805j1261j3534j3867j3085
56874C02848j2145j1072r055n932k761l72J777M605Q197J2276J7014K2430K7835
56861C55645L2886L8197M3610M6534M3646L4120K0132M660r907k1401k8052k9673
$$ y = [493643, 479270, 462002, 444590, 429156, 416273, 405657, 397299, 391438, 387981, 386650, 387433, 390424, 395575, 403066, 413619, 427954, 446181, 468106, 493635, 522096, 551033, 576116, 592528, 596794, 588063, 568313, 541357, 511131, 480431, 450765, 422800, 396738, 372600, 350518, 330723, 313228, 297726, 283879, 271557, 260713, 251218, 242861, 235342, 228410, 222210, 217293, 213910, 211395, 208721, 205600, 202625, 200427, 199258, 199350, 201037, 204346, 208962, 214774, 222001, 230713, 240724, 252209, 265939, 282574, 301795, 322017, 340639, 354658, 361780, 361400, 354595, 343334, 329800, 315933, 302848, 290703, 279631, 270576, 264644, 261883, 261511, 263288, 267893, 276090, 288366, 305380, 327810, 355645, 388531, 426728, 470338, 516872, 560518, 594638, 614770, 619430, 609523, 588122, 560070, 530397]
56849E30397k7801k4294k0307j6456j3001r603n588o50N042J1303J8017K5064
56837D72123L2578M1085N0790O0997P0168P5739P3729O0402L6126O859j9699l9281
56825I21616n1677n7636n7473n2502m5512l8778l2704k6759k0756j4840r104l620
56813E10255J799P866J5170K3513L2560M2578N3131O1146O1964N2957L5495J3541
56801I11975q457k6538l8067m2828m2735l9949l5660l0587k5560k1181j7504j4412
56789E68497j1763r179o259l006N83N105J1012J7481K2836K5936K6175K2577J4334
56776F84329K500j0116k0988k9035l3922l5550l4527l2025k8822k5307k2257k0436
56764C93844j9326j7685j5498j3980j3432j2606j0761q842p819p257o401n600
$$ y = [530397, 502596, 478302, 457995, 441539, 428538, 418935, 413347, 412697, 417739, 429042, 447059, 472123, 504701, 545786, 596576, 657573, 727741, 803480, 877209, 937611, 973737, 980596, 960897, 921616, 869939, 812303, 754830, 702328, 656816, 618038, 585334, 558575, 537819, 522979, 513875, 510255, 512054, 519920, 535090, 558603, 591163, 633741, 686872, 748018, 809982, 862939, 898434, 911975, 903518, 876980, 838913, 796085, 753350, 713401, 677741, 647154, 621594, 600413, 582909, 568497, 556734, 547555, 541296, 538290, 538873, 543978, 554990, 572471, 595307, 621243, 647418, 669995, 684329, 686829, 676713, 655725, 626690, 592768, 557218, 522691, 490666, 461844, 436537, 414280, 393844, 374518, 356833, 341335, 327355, 313923, 301317, 290556, 281714, 273895, 266638, 260237, 254637]
56752B54637n548o017o218n785m723l154j694j244j762k057j489r02j152j671
56738B11221j483q10n00n30j74O92J513K081K682L351L849M301N133O333P432
56723B45091Q244R076J0164J1358J2405J3100J3134J2144J0179P854N922M649
56711C63320L739K870K158J912K005J882J340Q40Q13J075J273J432J594J461J025
56696C88739R90J777K541K161Q58j55m53o91j328k194l338n130p248q699r116
56681C58714r139r162q702p403n794m602l959l639l492l386l241l336l937m654
56667B84268m811m448m174m037l463k320j123m6J235K618L445L578L544L454K830
56652B80550J717R18P87P69N04L55M76M28J22J12M51L96l38j047j313j722k658
$$ y = [254637, 249089, 243072, 236854, 231069, 226346, 223192, 221498, 220254, 218492, 216435, 214946, 214044, 212892, 211221, 209738, 208928, 208428, 207898, 207724, 208416, 209929, 212010, 214692, 218043, 221892, 226193, 231326, 237659, 245091, 253335, 262411, 272575, 283933, 296338, 309438, 322572, 334716, 344895, 352749, 358671, 363320, 367059, 369929, 372087, 373999, 376004, 377886, 379226, 380066, 380879, 381954, 383227, 384659, 386253, 387714, 388739, 389729, 391506, 394047, 396208, 397066, 396911, 396458, 395767, 394439, 392245, 388907, 383777, 376529, 367830, 358714, 349575, 340413, 331711, 324308, 318514, 313912, 309953, 306314, 302822, 299436, 296195, 292859, 288922, 284268, 279457, 275009, 270835, 266798, 263335, 261015, 259892, 259846, 261081, 263699, 267144, 270722, 274266, 277720, 280550, 282267, 283185, 283972, 284741, 285245, 285600, 286076, 286504, 286626, 286738, 287189, 287585, 287247, 286200, 284887, 283165, 280507]
56635B80507l445l394k774k047j057J89R79R81J057J993L179L562L193K828K528
56620B88279J774P42L50J057K296L158L165K485J746J524J720J703J271J011J438
56605C13719K142K277J565N20j53j52J76Q7p98j957k547k388j975j654j449j479
56589C05934j790j877j237l82l92j358k253k512k700l383m195m553m509m547n068
56574B65178o197p425p544n781l077j233p52n55J21Q07R83R55J039R87P70Q76
56558B39152J385J645J320Q76O66M76K60L49N76K42p19j518j821k167k796l206
56542B34720l267l574m242m521m141l894m299m834m989m973m832m051k663j634
56528A78806j521j737j703j611j568j154m21j44n47q96q66j116j921k543k517
$$ y = [280507, 277062, 273668, 270894, 268847, 267790, 267979, 268958, 269939, 270996, 272989, 276168, 279730, 282923, 285751, 288279, 290053, 290795, 291145, 292202, 294498, 297656, 300821, 303306, 305052, 306576, 308296, 309999, 311270, 312281, 313719, 315861, 318138, 319703, 320223, 320070, 319918, 320094, 320181, 319383, 317426, 314879, 312491, 310516, 308862, 307413, 305934, 304144, 302267, 301030, 300648, 300256, 298898, 296645, 294133, 291433, 288050, 283855, 279302, 274793, 270246, 265178, 258981, 251556, 244012, 238231, 235154, 233921, 233169, 232614, 232735, 233542, 234525, 235480, 236519, 237506, 238276, 239152, 240537, 242182, 243502, 244378, 245044, 245520, 245780, 246129, 246705, 246947, 246228, 244710, 242889, 240722, 237926, 234720, 231453, 227879, 223637, 219116, 214975, 211081, 206782, 201948, 196959, 191986, 187154, 183103, 180440, 178806, 177285, 175548, 173845, 172234, 170666, 169512, 169091, 168947, 168400, 167504, 166638, 165522, 163601, 161058, 158541]
56513A58541k256j855p61P97J566J252J141J913K413J643M69J26M29O34Q51J335
56497A68238J541J056N77Q62J609K230K670K785K133J130J055K118K966K856K663
56482A96489K866K473J092K26R54K077K168J776J888J867Q66j76k9N61J48r43
56466B14303j462j518k013k620k421j832j945k482k298j392o51j26P72J745J940
56451A98000J418Q56K74n66j134q67m12o35j101r07l23k10l97j82K53K95J30J79
56433A94671J10k92j07J269K652K591J515P95O11M28N30J208J385P0j592j796
56417B04048q79n95j234j614j491j715k229k025j104n69p85j108j341j790k048
56402A83521j397k24M54O94J232J824J590P16J44j35p91j435r92L85J396J524
$$ y = [158541, 156285, 154430, 153669, 154466, 156032, 157284, 158425, 160338, 162751, 164394, 164863, 164989, 165418, 166052, 166903, 168238, 169779, 170835, 171412, 172274, 173883, 176113, 178783, 181568, 183701, 184831, 185886, 188004, 190970, 193826, 196489, 199355, 201828, 202920, 203146, 204100, 206177, 208345, 210121, 212009, 213876, 214742, 214566, 214537, 215098, 215246, 214303, 212841, 211323, 209310, 206690, 204269, 202437, 200492, 198010, 195712, 194320, 193669, 193543, 194315, 196060, 198000, 199418, 200274, 200548, 199982, 198848, 197981, 197569, 196934, 195833, 194926, 194603, 194393, 193996, 193814, 194067, 194362, 194492, 194671, 194781, 194489, 194382, 195651, 198303, 200894, 202409, 203204, 203815, 204243, 204773, 205981, 207366, 207436, 205844, 204048, 203169, 202574, 201340, 199726, 198235, 196520, 194291, 192266, 191162, 190593, 189808, 188700, 187359, 185569, 183521, 182124, 181900, 182354, 183048, 184280, 186104, 187694, 188410, 188554, 188419, 187628, 186193, 185201, 185586, 186982, 188506]
56386A88506J401J395J336J387J799J978J190m7o65o74q07j004o58J06P45J334
56370A97322J982K004J108N14J265K343K188J125M74J96m28p48K95J841K171J537
56354B15189J595K427K543J611Q25O06J95m89o29j95J7LL49P37M23j54m2M64O07
56335B26082J016K589M282M361L295K901L096K262M86l84J32O75P05R75J257L63
56319B54093j246j587l04P57O21M02R09J401J363J447J942K214K053J901J584
56304B67550O29k31J25J015P52n25j084o19m75q83n11Q38J655J261O65N33M88
56287B71183O65J680K815K568J212O15J300K045K397L060L714L127J787J735L341
56272C03244M729M891M797N095N182N128O019P885R508J0596J1846J2873J2669
$$ y = [188506, 189907, 191302, 192638, 194025, 195824, 197802, 198992, 198945, 198280, 197606, 196799, 195795, 195137, 195243, 195988, 197322, 199304, 201308, 202416, 202930, 204195, 206538, 208726, 209851, 210325, 210521, 210093, 209345, 209640, 211481, 213652, 215189, 216784, 219211, 221754, 223365, 224190, 224796, 224991, 224502, 223873, 223678, 223695, 223698, 224047, 224784, 225207, 225053, 225011, 225475, 226082, 227098, 229687, 233969, 238330, 241625, 244526, 247622, 249884, 250370, 249986, 250118, 250793, 251498, 252473, 253730, 254093, 252847, 251260, 250956, 251713, 252334, 252736, 253645, 255046, 256409, 257856, 259798, 262012, 264065, 265966, 267550, 268179, 267948, 268073, 269088, 269840, 269315, 268231, 267612, 267137, 266254, 265743, 266581, 268236, 269497, 270162, 270695, 271183, 271848, 273528, 276343, 278911, 280123, 280738, 282038, 284083, 286480, 289540, 293254, 296381, 298168, 299903, 303244, 307973, 312864, 317661, 322756, 327938, 333066, 339085, 346970, 356478, 367074, 378920, 391793, 404462]
56259D04462J2050J2824J4471J4741J3715J3892J5828J7064J6209J4794J4079
56248E64129J3192J1579J0273R527P965N255K862J194j227m818p952r953j2124
56235E89902j4777j6195j5775j5327j5965j6460j5921j5287j4964j3716j1290
56224D24225r377q626p416m895k578j573q70K79R01N57N17J397K087K078K340
56209C99046K927K553J460J729L604M672L950L582N096P072Q074Q826R852R890
56195D72333Q433O991O330N262L601L201M508N249M251L448M353N668O220P155
56181E47003R214J0872J1194J1685J3373J4920J5462J6416J8550K0271K0673K1364
56169G30997K3345K5169K5951K7226K9922L2729L5300L9705M6776N4393O1581
$$ y = [404462, 416512, 429336, 443807, 458548, 472263, 486155, 501983, 519047, 535256, 550050, 564129, 577321, 588900, 599173, 608700, 616665, 621920, 624782, 625976, 624749, 619931, 611979, 602026, 589902, 575125, 558930, 543155, 527828, 511863, 495403, 479482, 464195, 449231, 435515, 424225, 414848, 406222, 398806, 393911, 391333, 389760, 388890, 389169, 390070, 390627, 391144, 392541, 394628, 396706, 399046, 401973, 404526, 405986, 407715, 411319, 415991, 419941, 423523, 428619, 435691, 443765, 452591, 462443, 472333, 480766, 487757, 494087, 499349, 502950, 506151, 510659, 515908, 520159, 523607, 527960, 533628, 539848, 547003, 556217, 567089, 578283, 589968, 603341, 618261, 633723, 650139, 668689, 688960, 709633, 730997, 754342, 779511, 805462, 832688, 862610, 895339, 930639, 970344, 1017120, 1071513, 1133094]
56158A133094P0826Q4105J00108J17829J39483J67237K00233K37244K78589L22353
56148B851101L61670L88592L98300L88122L57073L09964K58713K15672J86917
56139E716124J72766J69982J70274J61321J34872R3190M5549J101l3234n3064
56129F578881o0147o4058p6528j04485j48992k06607k68788l23483l61551l80659
56119D583583l82007l67041l39581l06784k74283k42976k12875j86344j64775
56110B106917j45883j27632j11411r8504q7140p5966o6650n9980n3385m5478l8881
56099A196007l5254l1804k6329k1357j9378j8267j5495j2629j1558j0330p115
56088I86491m217l816l714j660K37k59r77M35J992J630J700M402O986O521N265
$$ y = [1133094, 1203920, 1288025, 1388133, 1505962, 1645445, 1812682, 2012915, 2250159, 2528748, 2851101, 3212771, 3601363, 3999663, 4387785, 4744858, 5054822, 5313535, 5529207, 5716124, 5888890, 6058872, 6229146, 6390467, 6525339, 6618529, 6664078, 6665179, 6631945, 6578881, 6518734, 6454676, 6378148, 6273663, 6124671, 5918064, 5649276, 5325793, 4964242, 4583583, 4201576, 3834535, 3494954, 3188170, 2913887, 2670911, 2458036, 2271692, 2106917, 1961034, 1833402, 1721991, 1623487, 1536347, 1460381, 1393731, 1333751, 1280366, 1234888, 1196007, 1160753, 1128949, 1102620, 1081263, 1061885, 1043618, 1028123, 1015494, 1003936, 993606, 986491, 982274, 978458, 974744, 973084, 973321, 973062, 972085, 972520, 974512, 976142, 977842, 982244, 989230, 995751, 1001016]
56073A001016O250P710P062O243P723R377Q652P866R766J1955J1254R686J0482
56060A115042J2124J1884J1339J2778J4214J3530J3375J6280J9319J9379J9104
56049A278368K1692K4468K3981K2681K4123K6212K5847K5471K8271L1574L1930
56038A564618L1903L4897L8127L7821L6263L6478L5294K9285K2350J9590J9129
56027A905755J7680J8246K3925L0166L2056L3348L9210M6116M8573M9664N4902
56016B299641O1609O4706O7049P3443Q0402Q2617Q3562Q8693R4418R5188R4930
56005C186258R9491J04453J02887R8639R9140J01858J01088J01006J08036J17414
55995D220270J21736J25506J36349J49487J56720J62869J76705J93697K05221
$$ y = [1001016, 1007266, 1014976, 1022038, 1028281, 1036004, 1045381, 1054033, 1061899, 1071665, 1083620, 1094874, 1104560, 1115042, 1127166, 1139050, 1150389, 1163167, 1177381, 1190911, 1204286, 1220566, 1239885, 1259264, 1278368, 1300060, 1324528, 1348509, 1371190, 1395313, 1421525, 1447372, 1472843, 1501114, 1532688, 1564618, 1596521, 1631418, 1669545, 1707366, 1743629, 1780107, 1815401, 1844686, 1867036, 1886626, 1905755, 1923435, 1941681, 1965606, 1995772, 2027828, 2061176, 2100386, 2146502, 2195075, 2244739, 2299641, 2361250, 2425956, 2493005, 2566448, 2646850, 2729467, 2813029, 2901722, 2996140, 3091328, 3186258, 3285749, 3390202, 3493089, 3591728, 3690868, 3792726, 3893814, 3994820, 4102856, 4220270, 4342006, 4467512, 4603861, 4753348, 4910068, 5072937, 5249642, 5443339, 5648560]
55986E648560K16572K37325K62179K80714K97820L24168L55101L80364M05871
55977H408674M43316M87305N26499N67744O24043O88823P49273Q14673R02446
55968A4212796J007200J114810J235961J392302J581940J795483K053705K389984
55960B6784181K810352L315903L949280M767844N784927O993042Q430744J0169395
55952G3005668J2259192J4763486J7824106K1608949K6209383L1605830L7479685
55945B34756299M2655498M4742577M0981903L0196732J4144042l239073j8093577
55938C86144401k8359330l3844100l5352158l4013664l1027875k7445851k3939291
55931A72162132k0789203j8067874j5764602j3803145j2085684j0567372r249286
$$ y = [5648560, 5865132, 6102457, 6364636, 6645350, 6943170, 7267338, 7622439, 8002803, 8408674, 8851990, 9339295, 9865794, 10433538, 11057581, 11746404, 12495677, 13310350, 14212796, 15219996, 16334806, 17570767, 18963069, 20545009, 22340492, 24394197, 26784181, 29594533, 32910436, 36859716, 41627560, 47412487, 54405529, 62836273, 73005668, 85264860, 100028346, 117852452, 139461401, 165670784, 197276614, 234756299, 277411797, 322154374, 363136277, 393333009, 407477051, 404237978, 386144401, 357785071, 323940971, 288588813, 254575149, 223547274, 196101423, 172162132, 151372929, 133305055, 117540453, 103737308, 91651624, 81084252, 71834966]
55924G1834966q112105p111800o229095n468325m812426m226077l698576l241377
55916B8935185k847916k494677k177284j908905j686048j489240j314125j170519
55908A3846471j053627r45926q45179p62764o96595o32035n67718n15091m73997
55899G353539m32691l90706l58560l35578l10059k80924k58243k42618k24216
55890D519944k02187j85717j75512j62798j47082j37179j33844j28299j18779
55881C128547j12275j09055j01278q8184p7650p1388o2783n0668m1680l7882l4969
55870B340735l3374l8169m7092n1312m9118m6898m6099m1435l2863k7178k6353
55859A900844k5623k4287k7304l4917m1318m4880m9413n4499n5004n1258m9479
$$ y = [71834966, 63722861, 56611061, 50381966, 44913641, 40101215, 35875138, 32176562, 28935185, 26087269, 23592592, 21415308, 19506403, 17820355, 16331115, 15016990, 13846471, 12792844, 11846918, 11001739, 10238975, 9542380, 8910345, 8342627, 7827536, 7353539, 6920848, 6530142, 6171582, 5836004, 5525945, 5245021, 4986778, 4744160, 4519944, 4317757, 4132040, 3956528, 3793730, 3646648, 3509469, 3375625, 3247326, 3128547, 3016272, 2907217, 2805939, 2717755, 2640105, 2568717, 2505934, 2455266, 2413586, 2375704, 2340735, 2307361, 2269192, 2222100, 2170788, 2121670, 2074772, 2028673, 1987238, 1954375, 1927197, 1900844, 1875221, 1850934, 1823630, 1788713, 1747395, 1702515, 1653102, 1598603, 1543599, 1492341, 1442862]
55848A442862n0846n0130m6218m4119m5130m4709m1614l9803l9799l7277l1764
55837I71453k7938k6826k4315j9729j7236j7387j5738j1425q790q969q001m778
55825G80321k942l348k639p02j748o332r945j1018j2753j5560j5553j2270j0264
55812F75247j0983j0459p096m428l983k504J469M986O989J0536J6531K1559K4260
55799G22124K7729L3331L8074M0024M0370L8234K9824J5113l26j2420k2217l0766
55787I19094l6206l8096l9137m0371l9685l6851l4781l4156l2135k8099k5258
55776E34319k4816k3950k1436j9799j9928j8971j5721j2907j1990j0774q182o478
55764C39367o622o326m759m314n723o211m531l111l242k897j295p59j942k033
$$ y = [1442862, 1392016, 1341886, 1295668, 1251549, 1206419, 1161710, 1120096, 1080293, 1040494, 1003217, 971453, 943515, 916689, 892374, 872645, 855409, 838022, 822284, 810859, 802069, 793100, 785099, 780321, 777379, 774031, 771392, 770690, 768942, 762610, 752665, 741647, 728894, 713334, 697781, 685511, 675247, 664264, 653805, 646709, 642281, 638298, 635794, 637263, 642249, 649238, 659774, 676305, 697864, 722124, 749853, 783184, 821258, 861282, 901652, 939886, 969710, 984823, 984497, 972077, 949860, 919094, 882888, 844792, 805655, 765284, 725599, 688748, 653967, 619811, 587676, 559577, 534319, 509503, 485553, 464117, 444318, 424390, 405419, 389698, 376791, 364801, 354027, 345845, 339367, 332745, 326419, 321660, 317346, 311623, 305412, 300881, 297770, 294528, 291631, 290336, 289577, 287635, 285602]
55750B85602P2J532O47m47l12p60k586l398k174j550l071m476m106l793m836n286
55734B51058l832k418k510k520j324n99j312j575l18O15J55J22J507K407J838
55719B41294J918L994O262P334Q660J1141J2960J2892J2347J2152J0891Q301O515
55706C56661N989M168K27k913l584m222o756r231r807j0069j1335j1566r142o339
55692B82081n700n994m935k983j413O20M136P977J1002J4102J7623J9649J9290
55679C55455J8921K0689K3639K6553L0478L5770L9753M0246L8711L7012L3870
55668G01097K7491J9181J1359M187l046r443j3955j7117j9054j8126j3877q874
55656F59823n192j665K995P100Q616Q258P240M406j477q982j6145k3096k9994
$$ y = [285602, 285674, 287206, 287853, 287406, 287094, 286334, 283748, 280350, 278176, 276626, 273555, 269079, 264973, 261180, 256344, 251058, 247226, 244808, 242298, 239778, 238454, 237855, 236543, 234968, 234650, 235265, 235420, 235542, 237049, 239456, 241294, 243212, 247206, 253468, 260802, 269462, 280603, 293563, 306455, 318802, 330954, 341845, 350146, 356661, 362650, 366818, 367045, 364132, 360548, 356326, 349570, 340339, 330532, 320463, 309128, 297562, 288420, 282081, 276381, 270387, 265452, 262469, 261056, 261676, 265812, 273789, 284791, 298893, 316516, 336165, 355455, 374376, 395065, 418704, 445257, 475735, 511505, 551258, 591504, 630215, 667227, 701097, 728588, 747769, 759128, 763315, 760269, 750826, 736871, 719754, 700700, 682574, 668697, 659823, 654631, 652966, 655961, 663061, 671677, 679935, 687175, 691581, 690104, 681122, 664977, 641881, 611887]
55643F11887l4920l6593l6698l6852l5697l1921k7594k5300k4192k2113j9487
55632B80520j7910j6854j4999j3095j2381j1825r992p880p047o549m873l157l327
55619A50631m516m503l403k888k955k459j794k117k862k720k101k152k394j853
55605A11914j302j896k703k181r63o91j169j152q60j248j784j445q83j309k176
55590I0152k203j624j316r13J14Q39M39L0O23R80j50j253k85J886L074L434M481
55573I8308N773N742M907M981N456M294J608l49p48r53j821k693l169l532l543
55558A14261k756j925k122k756k336q59L99R86J443J894K165K738L932M963N344
55543A25371O186Q297J0326J0831J0995J2826J5750J7586J8115J9061K1078K3291
$$ y = [611887, 576967, 540374, 503676, 466824, 431127, 399206, 371612, 346312, 322120, 300007, 280520, 262610, 245756, 230757, 217662, 205281, 193456, 183464, 175584, 168537, 161988, 157115, 153958, 150631, 146115, 141612, 138209, 135321, 132366, 129907, 128113, 125996, 123134, 120414, 118313, 116161, 113767, 111914, 110612, 108716, 106013, 103832, 102869, 102178, 101009, 99857, 98997, 97749, 95965, 94520, 93637, 92328, 90152, 87949, 86325, 85009, 84096, 84210, 85049, 85488, 85518, 86141, 87121, 86971, 85718, 85433, 87319, 90393, 93827, 98308, 104081, 109823, 114730, 119711, 125167, 129461, 131069, 130720, 129972, 129019, 127198, 124505, 121336, 117804, 114261, 111505, 109580, 107458, 104702, 102366, 101507, 101906, 102892, 104335, 106229, 108394, 111132, 115064, 120027, 125371, 131557, 139854, 150180, 161011, 172006, 184832, 200582, 218168, 236283, 255344, 276422, 299713]
55531B99713K5330K7453K8856K8209K5594K1981J7196J0453K357n639j3207k0409
55519D47887k5810k7750k7140k6575k6853k6635k5197k3253k1146j8558j6055
55508A82915j4780j4430j3478j1492r527q222p198o272n652n016l927k896k637
55495G7388k665k113j385j426j970k188k373l173l837l173j677q33q16p57o73
55480D8329j092j418p99rl40j088n28R93J396J78j041j262j168j199p66J83O99
55463D1068L94q6l79p68j133r91n75n07n44l2O74N92k61j008j316j412j180n84
55445C1952l68r45j328o60J69L8l24L26J386J470R06Q78J043M02k32N99K031J890
55427C9233K98n53n5K54j60j0J071J673J069K56p8l78o36j19Q54R57J37j40O09
$$ y = [299713, 325043, 352496, 381352, 409561, 435155, 457136, 474332, 484785, 487142, 481503, 468296, 447887, 422077, 394327, 367187, 340612, 313759, 287124, 261927, 238674, 217528, 198970, 182915, 168135, 153705, 140227, 128735, 119208, 110986, 103788, 97516, 91864, 86848, 82921, 80025, 77388, 74723, 72610, 71225, 69799, 67829, 65641, 63268, 60095, 56258, 53085, 51408, 50575, 49759, 49002, 48329, 47237, 45819, 45020, 45011, 44671, 43583, 43055, 44048, 45444, 45622, 44581, 43319, 42151, 40952, 40186, 40369, 41068, 41462, 41376, 40997, 40229, 39096, 38105, 37530, 37023, 36479, 36447, 37121, 37713, 37452, 36444, 35128, 33716, 32536, 31952, 31584, 30639, 29311, 28651, 28820, 28858, 28534, 28860, 30246, 31716, 32622, 33500, 34543, 34945, 34713, 35312, 37343, 39233, 39531, 38978, 38923, 39177, 39017, 39007, 40078, 41751, 42820, 43076, 42998, 42620, 41984, 41865, 42719, 43676, 43813, 43673, 44282]
55408D4282J177Q34K69j28r10k004k325j566p21m16k67j27l30n62k15J70m07j329
55390C5425j007L92J061N33K29P04O68o01j963k269j723q36K38R42O33n5M2M62
55372C2875k23j574j511K54J534J041k4n20j011j858j965q18L30N21N56J219J818
55355C0644J652J233R67K33j149k118k102j954k179j904p11K21N7k38L58J152
55339B4162J070M57J81J08k01l18K33Q28O13j70o89o44j35Q12J917K481K185J386
55321C4276M25n59j105q61n73j219k135j644K30J520J230N62N42M40m16j091o87
55304B8935Qo1m58j83N75Q92N01k66j101j575j175j58N02M84M39O23M69l8q5L60
55284B8688J81r45j761j463r45j054j132m49K91J30n81r41p93k94O88J789J923
$$ y = [44282, 45459, 46293, 46562, 46434, 45524, 43520, 41195, 39629, 38908, 38492, 38225, 38098, 37768, 37206, 36991, 37161, 36754, 35425, 34418, 34810, 35871, 36404, 36633, 37337, 38005, 37404, 35441, 33172, 31449, 30613, 30851, 31793, 32426, 32371, 32413, 32875, 32652, 31078, 29567, 29821, 31355, 32396, 32372, 31852, 30841, 28983, 27018, 26200, 26530, 27051, 27607, 28826, 30644, 32296, 33529, 34496, 34729, 33580, 31462, 29360, 27406, 25227, 23323, 22612, 22833, 22890, 22652, 23010, 24162, 25232, 25689, 25870, 25978, 25777, 25459, 25692, 26520, 27133, 26963, 26274, 25630, 25495, 26307, 28224, 30705, 32890, 34276, 34701, 34142, 33037, 32176, 31603, 30384, 28249, 26605, 26835, 28355, 29585, 30147, 30689, 31129, 30713, 29622, 28935, 28943, 28882, 28424, 28241, 28816, 29708, 30209, 29943, 28842, 27267, 26092, 25934, 26436, 26920, 27359, 27982, 28451, 28413, 28328, 28688, 28869, 27924, 26163, 24700, 23755, 22701, 21569, 21120, 21411, 21541, 20960, 20019, 19226, 18932, 19620, 21409, 23332]
55267B3332Q36k03k21J18r0m67l32j8m9o6L02M96P0l32r9K30Q5J9O02J139P84
55246B6136J7k18n1j21k29J71P23O46M2l06o7N40J278J731J275j6j020r44l71
55227B9216k56n12m74r0K55N17Q07R00O19K39j3l02o39o43k97j45l15k26K61L75
55207B9277l20j176j483j315q51J00J261J640Q53k30p39p92o89k74L41N22K16
55190B6341J70N00L36m41o49K01P65j18j606k191j688q16J19R48J129O19K75M36
55172B4330J65j005j869j315r4M88N55R40J507J607J442J463J240L14n60l67N49
55155B9390J096J024P52K95l84n91K03J277J574J238J083J204J205J195J494J902
55139D3957K256L029M355N321N291N056N509N960N162L199J060r38k920m317m451
$$ y = [23332, 24168, 23965, 23744, 23862, 23772, 23305, 22973, 22955, 22906, 22840, 23142, 23638, 23708, 23376, 23277, 23507, 23592, 23611, 24213, 25352, 26136, 26153, 25935, 25884, 25763, 25534, 25705, 26428, 27074, 27116, 26810, 26743, 27283, 28561, 30292, 31567, 31551, 30531, 29587, 29216, 28960, 28448, 27974, 27884, 28139, 28656, 29463, 30363, 30982, 31221, 31208, 30906, 30267, 29624, 29327, 29182, 28867, 28641, 28902, 29277, 28957, 27781, 26298, 24983, 24132, 24232, 25493, 27133, 27986, 27756, 27017, 26225, 25536, 25262, 25603, 26125, 26341, 26511, 27011, 27347, 26906, 26257, 26458, 27223, 27105, 25499, 23308, 21620, 20804, 20923, 21871, 23000, 23619, 23894, 24330, 24495, 23490, 21621, 20306, 20212, 20700, 21255, 22195, 23702, 25309, 26751, 28214, 29454, 29768, 29208, 28841, 29390, 30486, 31510, 32262, 32557, 32173, 31582, 31785, 33062, 34636, 35874, 36957, 38161, 39366, 40561, 42055, 43957, 46213, 49242, 53597, 58918, 64209, 69265, 74774, 80734, 85896, 89095, 90155, 89217, 86297, 81980, 77529]
55124G7529l815l433l379l060k519k169j796j086n94r89j757j939j631j498j358
55109D6506o46J97K02m80p93l86J55M52O01N21J19j71lJ29k95p02l09M50N29k8
55089D6048k72N1L20K90L34N76P58Q54R77Q47J74o91j185j134m57R95K584K828
55071E3897J306l06k78R12J633J578J652K040K028J460Q71L81k18n14J12J273
55055F7827J996K114K206K488K819L409M311M670L716K136J213J061Q18J93m30
55040A00547r65j490j474n10O30R08N71N47P52L90n13j277j959l070m254m601
55024H4232m090l418k751j934j502j967k514j922m97L52K39mO3J75L04M27k09
55007F4984j952l378k845j068j99n74m99P53J979K323K469K964L238K939K638
$$ y = [77529, 73714, 70281, 66902, 63842, 61323, 59154, 57358, 56272, 55678, 54689, 52932, 50993, 49362, 47864, 46506, 45860, 46057, 46259, 45779, 44986, 44600, 44755, 45207, 45808, 46329, 46448, 46277, 46274, 46403, 46108, 45406, 45097, 45547, 46076, 46048, 45776, 45827, 46147, 46437, 46771, 47347, 48105, 48959, 49936, 50783, 50957, 50266, 49081, 47947, 47490, 48485, 51069, 53897, 55203, 54897, 54619, 55531, 57164, 58742, 60394, 62434, 64462, 65922, 66793, 67174, 66956, 66442, 66554, 67827, 69823, 71937, 74143, 76631, 79450, 82859, 87170, 91840, 95556, 97692, 98905, 99966, 100784, 100977, 100547, 99582, 98092, 96618, 96108, 96738, 97646, 98217, 98764, 99516, 99906, 99393, 98116, 96157, 93087, 88833, 84232, 80142, 76724, 73973, 72039, 70537, 68570, 66056, 64134, 63637, 63989, 64228, 64224, 64287, 64462, 64766, 65193, 64984, 63032, 59654, 56809, 55741, 55542, 54968, 54469, 55222, 57201, 59524, 61993, 64957, 68195, 71134, 73772]
54992G3772K561K142J409J333K232L193L664M260N473O743P506Q062Q845R887
54978A41082J1284J3242J5334J6598J6649J5720J3734J0456O555L179M56k293
54966B61996m863o283o742p730r839j1860j2640j2421j1898j1226j0530j0139
54954A45825r796q755p048n605m817m113l239k738k740k549j786q63j5J067K355
54939I5183L419M424N997P985R551J0590J1680J2604J2415J1128R672Q052N228
54926B07928J151k847o081r069j1645j2574j1738j0749j0459r739p856o099n736
54913A04487o028n675m809m112l320k088j124j060j205p97m18q03j296r16q7J77
54897G0926pO0J29m56j288j428r99q87j164j141p51o32r22j108j017j008j143
$$ y = [73772, 76333, 78475, 79884, 81217, 83449, 86642, 90306, 94566, 100039, 106782, 114288, 122350, 131195, 141082, 152366, 165608, 180942, 197540, 214189, 229909, 243643, 254099, 260654, 263833, 264289, 261996, 257133, 250850, 244108, 236378, 226539, 214679, 202039, 189618, 177720, 166494, 155964, 145825, 136029, 127274, 120226, 114621, 109804, 105691, 102452, 99714, 96974, 94425, 92639, 91776, 91761, 92828, 95183, 98602, 103026, 109023, 117008, 126559, 137149, 148829, 161433, 173848, 184976, 194648, 202700, 207928, 209079, 206232, 200151, 191082, 179437, 166863, 155125, 144376, 133917, 124178, 116322, 110223, 104487, 98459, 92784, 87975, 83863, 80543, 78455, 77331, 76271, 75066, 74269, 73851, 73048, 71752, 70836, 70749, 70926, 70919, 70979, 71108, 70652, 69364, 67936, 66937, 66050, 64886, 63745, 62994, 62362, 61440, 60332, 59315, 58307, 57164]
54880E7164j064p55o91j088j550j530q83K6N83M72O0j21j83o01j140r55M7Q63
54862D8654P70K17r0j37j77j30K8J2j50j1M23N38K79M29J270J928J684J005N31
54843E7073N6p05j220r48k51L60J152K423L512L557K814K365K784L799M905N771
54827H7447O347P014Q308J0108J1691J2713J3521J4200J4179J3069J1034Q047
54815B17678L877q10m483o477p684q929r770r625q920q266p593o789o212n797
54801A30200m855l534l114l939m424l339j694r49p06J95J428J937K001K678L789
54786A15674M323M370M912O024P045Q196J0254J2754J4336J4841J5330J5880J5208
54773B49147J2809R805P138M509J753j65m90K2J55k71q10j658l514o402r390j1547
$$ y = [57164, 56100, 55345, 54654, 53566, 52016, 50486, 49603, 49629, 50212, 50684, 50744, 50623, 50440, 49839, 48699, 47744, 47791, 48654, 49424, 49641, 49551, 49414, 49237, 49107, 49135, 49147, 48997, 48986, 49409, 49947, 50226, 50655, 51925, 53853, 55537, 56542, 57073, 57129, 56424, 55204, 54256, 54005, 54365, 55517, 57940, 61452, 65009, 67823, 70188, 72972, 76771, 81676, 87447, 93794, 100808, 109116, 119224, 130915, 143628, 157149, 171349, 185528, 198597, 209631, 217678, 221555, 220745, 216262, 209785, 202101, 193172, 183402, 173777, 164857, 156591, 148998, 142209, 135997, 130200, 125345, 121811, 118697, 114758, 110334, 106995, 105301, 104352, 103646, 103841, 105269, 107206, 109207, 111885, 115674, 119997, 124367, 129279, 135303, 142348, 150544, 160798, 173552, 187888, 202729, 218059, 233939, 249147, 261956, 271761, 278899, 283408, 285161, 284996, 284506, 284528, 284683, 284412, 283602, 281944, 278430, 272028, 262638, 251091]
54757B51091j2724j3385j3873j4050j3594j2639j1748j1112j0183q482o544n475
54745A17282n582n978n575m207k676j884j905k027j698j260j361j826j841j185
54731G8277n63n19p84r61j026q70k63M33L75m04p13P0J000J042N31L33M06K74
54713G6638J18L41N80K76k39k50J88M70M40K64j87r16j194m21Q30J463J260P75
54695H0436L86K43O68J611K206J840J209J318J971K328K400K770L257L141K496
54680A08280K081K070K082K178K621K946K538J933K240L377M219M432M765N469
54666A51231N876N815O156P484R405J1434J3580J5678J7272J8557K0383K2859
54654C05730K4754K4774K2692J8889J3618P179K31o547j2675j7653k1075k3014
$$ y = [251091, 238367, 224982, 211109, 197059, 183465, 170826, 159078, 147966, 137783, 129301, 122757, 117282, 111700, 105722, 100147, 95940, 93264, 91380, 89475, 87448, 85750, 84490, 83129, 81303, 79462, 78277, 77714, 77195, 76411, 75450, 74424, 73554, 73291, 73724, 74099, 73695, 72982, 73052, 74052, 75094, 75625, 75958, 76364, 76638, 76756, 77097, 77677, 77953, 77714, 77464, 77652, 78122, 78562, 78826, 78639, 77723, 76529, 76108, 76938, 78401, 79661, 80436, 80822, 81065, 81733, 83344, 85550, 87390, 88599, 89917, 91888, 94216, 96616, 99386, 102643, 105784, 108280, 110361, 112431, 114513, 116691, 119312, 122258, 124796, 126729, 128969, 132346, 136565, 140997, 145762, 151231, 157107, 162922, 169078, 176562, 185967, 197401, 210981, 226659, 243931, 262488, 282871, 305730, 330484, 355258, 377950, 396839, 410457, 417636, 417867, 411320, 398645, 380992, 359917, 336903]
54642C36903k3753k3175k1152j8420j6223j4919j3806j2423j1120j0147r106p703
54630A54956o272n177m373l819l682l779l511k646j643r68o03m57o59j181j663
54615A14523j821j649j148m17N4k24r85j493j604j799k140k051j323n51k30j74
54599I6968j98n44j240j655j247l61J71m2p42j378j433p73J01M14m1p10r63p36
54581H5591m29m83j009j523j198J62J577J858J007M5m08n97p01l64N59J517J866
54564H7470J540R04M20N76J524K605K905K502K490L464M595M784M249M289N656
54549A29973P663R035R332R337J0046J1463J2605J2629J1584R884P631M810J736
54536B47728j244m123o772q608r397r928j0982j1922j1438r567p835p205p023
$$ y = [336903, 313150, 289975, 268823, 250403, 234180, 219261, 205455, 193032, 181912, 171765, 162659, 154956, 148684, 143507, 139134, 135315, 131633, 127854, 124343, 121697, 120054, 119086, 118483, 118026, 117367, 116186, 114523, 112702, 111053, 109905, 109488, 109542, 109318, 108333, 106840, 105236, 103437, 101297, 99246, 97923, 97372, 97142, 96968, 96770, 96226, 94986, 93331, 92084, 91723, 91894, 91852, 91110, 89732, 88299, 87526, 87627, 88041, 88000, 87290, 86327, 85591, 85162, 84679, 83670, 82147, 80949, 81111, 82688, 84546, 85553, 85598, 85190, 84593, 83892, 83528, 84087, 85604, 87470, 89010, 89914, 90334, 90910, 92434, 95039, 97944, 100446, 102936, 106400, 110995, 115779, 120028, 124317, 129973, 137636, 146671, 156003, 165340, 175386, 186849, 199454, 212083, 223667, 233551, 241182, 245992, 247728, 246484, 242361, 235589, 226981, 217584, 207656, 196674, 184752, 173314, 163747, 155912, 148707, 141684]
54523A41684o348n370m832m754m445l541k392j564j256j210j070q29q19j133j363
54508A00758j171q42p47o03J17J200J744J247O8j126j861j862j228n91n65j001
54492I3537j245j061p85o35m72k75k87n75q29p23j98M43O31M3p14n74M92J113
54474H7886M00o74o98J07M89K33J71M64L68k53o64o01n74o50k77M45N93o6n88
54455H6111l83m2j70m91o01o78q09o06rL53J69k9J26J97r1j82L30P64K95p49j321
54434H2184r93k26L53M44P0m00m22J65R41J348J152M89j93l42J41O93Q62R94J507
54415H8767J915J554R11J063J941K425K171J864J633O94r20j873j411m50o0q7
54399A00137q1l06r29j274r52p44j389k280k433j931j461j103o61m62p66r46l19
$$ y = [141684, 135336, 129966, 125134, 120380, 115935, 112394, 110002, 108438, 107182, 105972, 104902, 104073, 103254, 102121, 100758, 99587, 98745, 97998, 97395, 97512, 98712, 100456, 101703, 101771, 100645, 98784, 96922, 95694, 95103, 94538, 93537, 92292, 91231, 90446, 89811, 89339, 89064, 88777, 88202, 87373, 86650, 86452, 86895, 87526, 87569, 86855, 86281, 86773, 87886, 88286, 87612, 86914, 87021, 87510, 87743, 87914, 88378, 88746, 88493, 87829, 87228, 86654, 86004, 85727, 86172, 86765, 86699, 86111, 85728, 85686, 85516, 85025, 84424, 83746, 82937, 82331, 82322, 82675, 82844, 82815, 82941, 83138, 83047, 82865, 83195, 83959, 84254, 83505, 82184, 81191, 80965, 81318, 81762, 81832, 81432, 81010, 81175, 82116, 83464, 84616, 85105, 84912, 84570, 84711, 85404, 86266, 87260, 88767, 90682, 92236, 93147, 94210, 96151, 98576, 100747, 102611, 104244, 104938, 104018, 102145, 100734, 100284, 100224, 100137, 100056, 99750, 98821, 97547, 96595, 95851, 94462, 92182, 89749, 87818, 86357, 85254, 84593, 84131, 83365, 82419, 82100]
54382H2100O44R20M02j93n10o76o15j31M25M79R7r0K21P86J300J584J447Q59J36
54363H9185l72n57l51K94R70R91M45L71J295K302K210J109k9p32j202j562j817
54346I2550k208k809l002k185q83l00p67j322r80J26J038J056L68l15o24q37j162
54329G7744j121k60P10N61o24j313p07O1l36j412j624n61O79J038M99l34r35j152
54311G0913j242j515j756j373l69L57J25o17j005q43n30l32k90m50o80o65l99
54294E9329k80m46n67n07n65o90l87K56L16n05j162p30K63Q32R86J220J334R37
54276E9634M68N86R93R63O28O68J010R56L65j97l89k76J52Q54J320J160Q42J023
54258G0760J457J394P49J08k33l78k57J16J37p28j895k230j517o15k13k94o14
$$ y = [82100, 82744, 83664, 84066, 83873, 83363, 82687, 82072, 81941, 82366, 82845, 82942, 82852, 83073, 83859, 85159, 86743, 88190, 89049, 89185, 88813, 88256, 87905, 88199, 89169, 90160, 90605, 90976, 92271, 94573, 96783, 97892, 97863, 97131, 95929, 94367, 92550, 90342, 87533, 84531, 82346, 81463, 81163, 80396, 79074, 78094, 78220, 79258, 80314, 80682, 80367, 79743, 78906, 77744, 76623, 76363, 77073, 77634, 77010, 75697, 74990, 75051, 74715, 73303, 71679, 71118, 71797, 72835, 73334, 73000, 72065, 70913, 69671, 68156, 66400, 65027, 64658, 65015, 65140, 64523, 63518, 62675, 62145, 61813, 61523, 61073, 60393, 59728, 59329, 59049, 58603, 58036, 57529, 56964, 56274, 55887, 56143, 56459, 55954, 54792, 54062, 54325, 55157, 56143, 57363, 58697, 59634, 60102, 60688, 61681, 62644, 63272, 63940, 64950, 65906, 66271, 66074, 65685, 65409, 65561, 66415, 67735, 68895, 69737, 70760, 72217, 73611, 74360, 74468, 74235, 73857, 73600, 73716, 73853, 73125, 71230, 69000, 67483, 66868, 66655, 66361, 65747]
54241F5747r16p68J4Q66J068O73K44n7l79n62m32l48o12o46J72J216J234J16j018
54222F5612j404j292r65l15N10R96J031J011J039Q07L66K13M59O63N71L44M7m31
54204F9262q43p18r8M32M77J22m34r24r15l49J13o2l94j88J87j57j105j710j753
54185F0943j886k260k234j590q83l39L56J017Q60j19p76l89M03P41P17P87Q45
54168E6193N87J53j86n23r49j151q32k42J45J86P4J9J25L12L70L08M96J060J377
54149E7522Q26j71o61n09m37o93o88n0P95J283J249O28n05j487j491n84L40Q17
54131E6184J148J394J071J67n38n86m22m20k33L46P10L29l37m82o1L09J76m28
54113E8327j192j673j557j030n95l93j76R8J58K3K7J48L8k00n0M42N88K16K1L67
$$ y = [65747, 64831, 64063, 64077, 64943, 66011, 66684, 66928, 66871, 66492, 65930, 65498, 65150, 64538, 63892, 64064, 65280, 66514, 66630, 65612, 64208, 62916, 61951, 61636, 62146, 63142, 64173, 65184, 66223, 67030, 67396, 67609, 68068, 68731, 69302, 69646, 69693, 69262, 68419, 67701, 67603, 68035, 68512, 68634, 68200, 67276, 66361, 66012, 66125, 66063, 65669, 65481, 65668, 65511, 64406, 62696, 60943, 59057, 56797, 54563, 52973, 52090, 51751, 52107, 53124, 53984, 53865, 53089, 52700, 53103, 53844, 54561, 55348, 56193, 56780, 56933, 56747, 56224, 55275, 54124, 53292, 53050, 53195, 53381, 53455, 53474, 53599, 53911, 54281, 54589, 55085, 56145, 57522, 58348, 58177, 57516, 57007, 56570, 55877, 55189, 55139, 55934, 57217, 58466, 59094, 58589, 57102, 55611, 55027, 55367, 56184, 57332, 58726, 59797, 59964, 59426, 58840, 58418, 57998, 57765, 58111, 58821, 59150, 58813, 58331, 58270, 58579, 58755, 58327, 57135, 55462, 53905, 52875, 52280, 51887, 51711, 51809, 51967, 51990, 52017, 52165, 52203, 52003, 51953, 52395, 52983, 53199, 53220, 53587]
54093E3587O21K27l53m36j58j4O9M57R56R35K24o40r91o66r5J57N6J12N55Q13
54073E5416M14k6L73J276J520R54N91Q02P22p2n93N7J301J986J967J881K054K300
54055G2923K368J966Q94l85q78k42P19J115R14N08K00M12J442K645K859K154J950
54038I1564K764L247K414J454J889L151L657L399L651M577M977M346L494L008
54024A37592K553J935J603J740J951K148K622L060K532R53m40o35o6J92j95q09
54008A56736j286j589j851k325l231m289m789m422l725l430l541l443k758j779
53994A14278j080q60q29o95n94q84j520j990j935j505r61l95l6k94j105j676j456
53977I6463r89j107j656j743j092l65p9n3p6l66r89j403j102l87J3q6j81J02M20
$$ y = [53587, 54208, 54435, 54082, 53646, 53488, 53474, 53543, 54000, 54956, 55891, 56115, 55475, 54484, 53818, 53723, 53880, 53936, 54048, 54603, 55416, 55830, 55804, 56177, 57453, 58973, 59927, 60518, 61320, 62042, 61970, 61377, 61434, 62735, 64721, 66688, 68569, 70623, 72923, 75291, 77257, 78151, 77766, 76888, 76646, 77365, 78480, 79394, 79902, 80102, 80514, 81956, 84601, 87460, 89614, 91564, 94328, 97575, 99989, 101443, 103332, 106483, 110140, 113539, 117190, 121767, 126744, 131090, 134584, 137592, 140145, 142080, 143683, 145423, 147374, 149522, 152144, 155204, 157736, 158689, 158249, 157614, 157548, 157740, 157545, 156736, 155450, 153861, 152010, 149685, 146454, 142165, 137376, 132954, 129229, 125799, 122258, 118815, 116057, 114278, 113198, 112338, 111509, 110814, 110220, 109336, 107816, 105826, 103891, 102386, 101425, 101030, 100994, 100700, 99595, 97919, 96463, 95474, 94367, 92711, 90968, 89876, 89511, 89432, 89379, 89303, 88937, 87948, 86545, 85443, 85056, 85069, 84983, 84802, 84904, 85324]
53958H5324K20m63r11n82K68R85J353J660K032K193K020J830J867J929J829J913
53942A03467K745M300N866O640O400N668N252N382N397M610L307K295J591M29
53928A63349j229k244j868q42j62L06J077J741J633J257J655K636L028K694K847
53913A75878M071N345N682N532N741N989N367L949K747K240J897J232N57L56M82
53898B27065L49k70j030j502j616j605j771k312l225m188m724m637m191l758l441
53883A89144l282l515m221m851m753m119l776l842l448k174j030j219k419l264
53869A43231l212k996l206l425l109k521k225k129j717j019p40j317k228k480
53855A10907j668m08K87q2j255k583l485l587k827j625o97m38n68n57l19k43n74
$$ y = [85324, 85544, 85081, 84170, 83588, 83856, 84841, 86194, 87854, 89886, 92079, 94099, 95929, 97796, 99725, 101554, 103467, 106212, 110512, 116378, 123018, 129418, 135086, 140338, 145720, 151117, 155727, 159034, 161329, 162920, 163349, 162120, 159876, 158008, 157166, 157004, 157310, 158387, 160128, 161761, 163018, 164673, 167309, 170337, 173031, 175878, 179949, 185294, 190976, 196508, 202249, 208238, 213605, 217554, 220301, 222541, 224438, 225670, 226227, 226583, 227065, 227414, 227144, 226114, 224612, 222996, 221391, 219620, 217308, 214083, 209895, 205171, 200534, 196343, 192585, 189144, 185862, 182347, 178126, 173275, 168522, 164403, 160627, 156785, 153337, 151163, 150133, 148914, 146495, 143231, 140019, 137023, 133817, 130392, 127283, 124762, 122537, 120408, 118691, 117672, 116932, 115615, 113387, 110907, 109239, 108831, 109118, 109036, 107781, 105198, 101713, 98126, 95299, 93674, 92977, 92539, 91971, 91414, 91095, 90852, 90278]
53838I0278r44p54O8Q47Q50J39n36o65n04m67m55j65K27K71m8k88k50p8K08O96
53818H8430J137J161R77J158J656J757J314J126J785K801L323L105K367J344N15
53803A13956N59J492K402K618K626L198M154M653M374L679K957K419K243K282
53789A53612J908Q47k18m28J78R65J674K345K583J862M00r84j872k402k644k574
53773A55252k516k840l215k991k320k079k547k952k584j693j006q53j131j629
53759A24896k106k327k278k195k218k272k238k069j756j396j184j157j042o69
53745I9989k97k75n69r45j326j597j438p99k58l14p12r19r84j202j320r11k86
53728H5837j66m93n17l0L70L48K67L49K41j86l53K26J103J335N04q92j839j585
$$ y = [90278, 89334, 88580, 88648, 89495, 90345, 90484, 89948, 89283, 88779, 88312, 87857, 87692, 87919, 88190, 88142, 87854, 87604, 87526, 87734, 88430, 89567, 90728, 91705, 92863, 94519, 96276, 97590, 98716, 100501, 103302, 106625, 109730, 112097, 113441, 113956, 114515, 116007, 118409, 121027, 123653, 126851, 131005, 135658, 140032, 143711, 146668, 149087, 151330, 153612, 155520, 156367, 156149, 155721, 155899, 156864, 158538, 160883, 163466, 165328, 165728, 164744, 162872, 160470, 157826, 155252, 152736, 149896, 146681, 143690, 141370, 139291, 136744, 133792, 131208, 129515, 128509, 127656, 126525, 124896, 122790, 120463, 118185, 115990, 113772, 111500, 109262, 107193, 105437, 104041, 102857, 101700, 100658, 99989, 99692, 99417, 98848, 97903, 96577, 94980, 93542, 92743, 92485, 92171, 91459, 90540, 89556, 88354, 87034, 86123, 85837, 85671, 85178, 84661, 84631, 85001, 85349, 85616, 85965, 86206, 86020, 85667, 85893, 86996, 88331, 88835, 87943, 86104, 84519]
53710H4519l28Q39J085P85Q75J497J938J813J462J120O15O1M8P68J652K214K619
53693A03582L089L396L338L176L187L216L005K522J777Q54L17R06K378L416L201
53678A41360K501K559L413M059L913L364L006L007L144L036K442J668J542K442
53664A81456L613L938L277K500K259K361K474K724L281L772L644K905K100J556
53650B21860J058L70l26p31r53j339j838j920j230j02Q05J053O46n3n07m64l90
53633B15939r22j816j972j023j00l54j260j419o74k43p72j432j393j091j391k164
53617A97913k458j828q40l58o55j166j049n3J160J798J814J685J490R74M53P58
53601A99638J954K982L032K603K621L098L424L508L845M518M945M714M133L795
$$ y = [84519, 84191, 85030, 86115, 86900, 87775, 89272, 91210, 93023, 94485, 95605, 96220, 96281, 96329, 97097, 98749, 100963, 103582, 106671, 110067, 113405, 116581, 119768, 122984, 125989, 128511, 130288, 131142, 131459, 132365, 134743, 138159, 141360, 143861, 146420, 149833, 153892, 157805, 161169, 164175, 167182, 170326, 173362, 175804, 177472, 179014, 181456, 185069, 189007, 192284, 194784, 197043, 199404, 201878, 204602, 207883, 211655, 215299, 218204, 220304, 221860, 222918, 223288, 222962, 222231, 221278, 219939, 218101, 216181, 214951, 214849, 215654, 216707, 217353, 217300, 216793, 216329, 215939, 215017, 213201, 211229, 210206, 210106, 209752, 208492, 207073, 206399, 206156, 205384, 203952, 202559, 201468, 200077, 197913, 195455, 193627, 192787, 192429, 191774, 190608, 189559, 189506, 190666, 192464, 194278, 195963, 197453, 198427, 198880, 199638, 201592, 204574, 207606, 210209, 212830, 215928, 219352, 222860, 226705, 231223, 236168, 240882, 245015, 248810]
53587B48810L866L996L798L314L014L252L806M156M195M380N073O042O712O614
53573C11028N580L978K858L262N014O622O791N718M472L588K830K034J426J060
53559C66261O99L20K77O54R13M94n09j553k306k800l020k842k409k175k365k617
53543C47022k481k102k025k385k783k988l275l800m189m110l818l660l409k689
53529C03308j788j407j687k071k088j716j023q7O60P15K39k2K36N05L41K2J9L39
53511B94495Q01J575K863M297N163N204M937N073N832O886P830Q610R406J0220
53497C73192J0857J1322J1894J2640J3234J3610J4289J5559J6837J7508J7988
53486E28930J9147K0873K2292K3250K4529K6383K7888K8215K7707K7189K6893
$$ y = [248810, 252676, 256672, 260470, 263784, 266798, 270050, 273856, 278012, 282207, 286587, 291660, 297702, 304414, 311028, 316608, 320586, 323444, 326706, 331720, 338342, 345133, 350851, 355323, 358911, 361741, 363775, 365201, 366261, 366960, 367280, 367557, 368211, 369124, 369618, 369109, 367556, 365250, 362450, 359430, 356588, 354179, 352004, 349639, 347022, 344541, 342439, 340414, 338029, 335246, 332258, 328983, 325183, 320994, 316884, 313066, 309406, 305997, 303308, 301520, 300113, 298426, 296355, 294267, 292551, 291528, 291441, 292101, 292816, 293055, 293033, 293269, 293774, 294115, 294137, 294156, 294495, 295296, 296871, 299734, 304031, 309194, 314398, 319335, 324408, 330240, 337126, 344956, 353566, 362972, 373192, 384049, 395371, 407265, 419905, 433139, 446749, 461038, 476597, 493434, 510942, 528930, 548077, 568950, 591242, 614492, 639021, 665404, 693292, 721507, 749214, 776403, 803296]
53475H03296K6661K6659K7287K8690L0686L2970L5166L7053L8850M0857M2737
53464A170912M3682M3323M1873L9402L5825L1750K8312K5837K3519K0962J8971
53453A524368J8227J8185J8205J8841K0890K3734K5887K6734K6675K5835K3983
53442A771564K1636J9976J9282J8313J5710J1345O057P31m006p743j0494j2754
53430A849617j5004j7343j9741k2383k5494k8874l1830l3630l4061l3575l2911
53419A554771l2617l2912l3780l5019l6310l7504l8731l9865m0059l8400l5129
53408A154445l1582k8788k6659k4664k2560k0174j7185j3684j0304p349m300p61
53396I46435K767N693Q272J0985J3527J5386J6986J9161K1651K3306K3866K4463
$$ y = [803296, 829957, 856616, 883903, 912593, 943279, 976249, 1011415, 1048468, 1087318, 1128175, 1170912, 1214594, 1257917, 1299790, 1339192, 1375017, 1406767, 1435079, 1460916, 1484435, 1505397, 1524368, 1542595, 1560780, 1578985, 1597826, 1618716, 1642450, 1668337, 1695071, 1721746, 1747581, 1771564, 1793200, 1813176, 1832458, 1850771, 1866481, 1877826, 1883883, 1884614, 1880608, 1872865, 1862371, 1849617, 1834613, 1817270, 1797529, 1775146, 1749652, 1720778, 1688948, 1655318, 1621257, 1587682, 1554771, 1522154, 1489242, 1455462, 1420443, 1384133, 1346629, 1307898, 1268033, 1227974, 1189574, 1154445, 1122863, 1094075, 1067416, 1042752, 1020192, 1000018, 982833, 969149, 958845, 951496, 947196, 946435, 949202, 954895, 963167, 974152, 987679, 1003065, 1020051, 1039212, 1060863, 1084169, 1108035, 1132498]
53384A132498K5999K7860K8841K8743K8599K9519L1756L4730L7673M0311M3018
53373A489547M6302N0256N4557N8807O2589O5436O7156O8150O9130P0582P2718
53362B175230P5629P8941Q1592Q2546Q1796Q0107P7843P4672P0575O6515O3704
53351C009150O2574O2734O3652O4970O6448O7956O9484P0910P1777P1574P0074
53340C751303O7086O1706N2324L7854J9069j603k1600l9376n4192o5604p3630
53329C733337p8973q2547q4876q6424q8055r0290r2366r3001r2147r1094r0708
53318B762856r0633r0492r0783r1786r2630r2307r0983q9368q7274q3898p9288
53307A783414p4515p0337o6427o2016n6734n0716m4287l7751l1319k5375k0677
$$ y = [1132498, 1158497, 1186357, 1215198, 1243941, 1272540, 1302059, 1333815, 1368545, 1406218, 1446529, 1489547, 1535849, 1586105, 1640662, 1699469, 1762058, 1827494, 1894650, 1962800, 2031930, 2102512, 2175230, 2250859, 2329800, 2411392, 2493938, 2575734, 2655841, 2733684, 2808356, 2878931, 2945446, 3009150, 3071724, 3134458, 3198110, 3263080, 3329528, 3397484, 3466968, 3537878, 3609655, 3681229, 3751303, 3818389, 3880095, 3932419, 3970273, 3989342, 3987739, 3966139, 3926763, 3872571, 3806967, 3733337, 3654364, 3571817, 3486941, 3400517, 3312462, 3222172, 3129806, 3036805, 2944658, 2853564, 2762856, 2672223, 2581731, 2490948, 2399162, 2306532, 2214225, 2123242, 2033874, 1946600, 1862702, 1783414, 1708899, 1638562, 1572135, 1510119, 1453385, 1402669, 1358382, 1320631, 1289312, 1263937, 1243260]
53296A243260j7816j6318j4940j3239j2085j2027j1958j0440p747n500m471l970
53284A112749l228k334j533o50M26J406K140K934M115N671P474R385J1104J2437
53270A162096J3759J5692J8120K0078K0870K0948K1526K3506K6821L0495L3337
53259A407248L4939L5913L6935L7791L7863L7359L7396L8796M1298M3956M5869
53248A835363M6570M6080M4682M2367L8698L3591K7780K1932J5750Q662J037o314
53236B156198j3569k1539k9868l6904m1806m5591m9431n2935n4964n5339n4732
53225A699520n3373n0909m7420m3748m0715l8614l7532l7662l9056m1319m3760
53214A225412m5899m7793m9745n1634n2684n2238n0569m8439m5960m2510l7986
$$ y = [1243260, 1225444, 1209126, 1194186, 1180947, 1168862, 1156835, 1144877, 1134437, 1126690, 1121190, 1116719, 1112749, 1109521, 1107187, 1105654, 1105004, 1105430, 1106836, 1108976, 1111910, 1116025, 1121696, 1129170, 1138555, 1149659, 1162096, 1175855, 1191547, 1209667, 1229745, 1250615, 1271563, 1293089, 1316595, 1343416, 1373911, 1407248, 1442187, 1478100, 1515035, 1552826, 1590689, 1628048, 1665444, 1704240, 1745538, 1789494, 1835363, 1881933, 1928013, 1972695, 2015062, 2053760, 2087351, 2115131, 2137063, 2152813, 2161475, 2162512, 2156198, 2142629, 2121090, 2091222, 2054318, 2012512, 1966921, 1917490, 1864555, 1809591, 1754252, 1699520, 1646147, 1595238, 1547818, 1504070, 1463355, 1424741, 1387209, 1349547, 1310491, 1269172, 1225412, 1179513, 1131720, 1081975, 1030341, 977657, 925419, 874850, 826411, 780451, 737941, 699955]
53203F99955l3385k9714k6783k3696k0150j6721j3976j1920j0427r641r623r908
53191D84011r819r271q891r169r718r868r752j0208j1372j2058j1175r267q015
53178C55428q219r019r132q249p027o285o377p051p680p828p621p397p133o623
53164B49787n997n578n300m910m695n235o255o455n008k704j098q42j305j598
53150A92807j510j419j652k108k387k260j915j725j773j788j503r69n29n52j123
53135A69594j907k463k723k918k965k396j214l01m01j115j439j067n21k40k25
53120A47699m89j087j662j685j205q04p56q08p84q07q18n47m2L68O84J241J979
53103A40477K444K565K777L176L235K664J885J374J104Q71O63M02r5p21j137j405
$$ y = [699955, 666570, 636856, 610073, 586377, 566227, 549506, 535530, 523610, 513183, 503542, 493919, 484011, 474192, 464921, 456030, 446861, 437143, 427275, 417523, 407315, 395943, 383885, 372710, 363443, 355428, 347209, 338190, 329058, 320809, 313782, 307497, 301120, 294069, 286389, 278561, 270940, 263543, 256410, 249787, 243790, 238212, 232912, 228002, 223307, 218072, 211817, 205362, 200354, 197650, 196552, 195710, 194405, 192807, 191297, 189878, 188226, 186118, 183731, 181471, 179556, 177831, 176058, 174270, 172767, 171798, 171269, 170717, 169594, 167687, 165224, 162501, 159583, 156618, 154222, 153008, 152707, 152306, 151191, 149752, 148685, 148164, 147924, 147699, 147210, 146123, 144461, 142776, 141571, 140767, 140011, 139203, 138419, 137612, 136794, 136247, 136205, 136573, 137257, 138498, 140477, 142921, 145486, 148263, 151439, 154674, 157338, 159223, 160597, 161701, 162572, 163235, 163637, 163542, 162821, 161684, 160279]
53087A60279j904k439k254j279n88j071k313l355l905m176m007l065j687p83q39
53072A26614j459j917j864j539j457j828k246k128j446p53m31l34k82l36m90m96
53056A07608k60MJ65L34N51P07Q82J211J364Q44p1m66j09J45l20r47r73o16n94
53037A09459r91j299j241r45o11m96q85j548j714j024j40J47oL6L54M77J95l67
53019I9401j124j915k235j814j187j070j310j175n51n8n7k41l46n74j055j376
53003H3313j094l61J53J1n39q07m25K10M17J16j21O4L33K84M8n3q1j98j71K54
52983H1353P73Q02L40K0L39J163J926K068J396K93m47l46L51J090J548J622J196
52966I5487M15j52n7L80M52j3m45k60N05J335J771J838J954K406K905K908K398
$$ y = [160279, 158375, 155936, 153682, 152403, 151815, 150744, 148431, 145076, 141171, 136995, 132988, 129923, 128236, 127453, 126614, 125155, 123238, 121374, 119835, 118378, 116550, 114304, 112176, 110730, 109977, 109546, 109212, 108930, 108594, 108104, 107608, 107348, 107352, 107517, 107851, 108402, 109109, 109991, 111202, 112566, 113410, 113339, 112873, 112764, 112909, 112589, 111642, 110669, 110053, 109459, 108468, 107169, 105928, 104983, 104372, 103876, 102991, 101443, 99729, 98705, 98565, 98712, 98706, 98742, 99096, 99573, 99768, 99401, 98277, 96362, 94127, 92313, 91126, 90056, 88746, 87571, 87020, 86962, 86905, 86664, 86318, 85744, 84689, 83313, 82219, 81858, 82011, 82022, 81483, 80676, 80251, 80461, 80878, 80994, 80873, 80937, 81270, 81554, 81602, 81549, 81468, 81270, 81099, 81353, 82126, 82928, 83268, 83288, 83627, 84790, 86716, 88784, 90180, 90473, 90026, 89680, 90031, 91121, 92669, 94291, 95487, 95902, 95750, 95693, 96073, 96525, 96512, 96067, 95807, 96312, 97647, 99418, 101256, 103210, 105616, 108521, 111429, 113827]
52949A13827J959J996K237K184J705J022M34K26M12N09J8p54r68n18k93p82j269
52932A21945r70k69j5j93j56J55J85k48p08r01r70r95p79k24M81J052J201P51
52914A19342q5p22q00n17j40M04J120J574J434R79N90J46n30j072r97m84k4K68
52896A20486N06N19J90o4J34M37L20LM5M02O35P97J093J143M90l66n40k09l23
52877A25698r37j056l51K64R6l43l96k64l32l00K92J199J844K134K342K518K503
52860A34911K319K138K005J793J363O32k99j059j407j625k166k874l088k537j700
52845A28406j103q22p77r89j302j313q58k56Q8P8j43k93MQ63J754J987J580J156
52827A28060R61O02p5n66m60p3N1k13p11j385k118k627k799k818k704k123r69
$$ y = [113827, 115786, 117782, 120019, 122203, 123908, 124930, 125364, 125590, 126002, 126511, 126529, 125775, 124807, 124289, 123996, 123214, 121945, 120975, 120706, 120691, 120498, 120342, 120497, 120682, 120434, 119726, 118825, 117855, 116860, 116081, 115857, 116338, 117390, 118591, 119342, 119257, 118535, 117735, 117218, 117078, 117482, 118602, 120176, 121610, 122589, 123179, 123325, 122795, 121723, 120726, 120242, 120218, 120486, 120992, 121511, 121701, 121637, 121771, 122208, 122528, 122531, 122576, 122978, 123613, 124410, 125503, 126646, 127136, 126770, 126230, 126021, 125698, 124761, 123705, 123354, 123618, 123714, 123371, 122975, 122711, 122379, 122079, 122371, 123570, 125414, 127548, 129890, 132408, 134911, 137230, 139368, 141373, 143166, 144529, 145161, 144862, 143803, 142396, 140771, 138605, 135731, 132643, 130106, 128406, 127303, 126481, 125704, 124715, 123413, 122100, 121242, 120986, 121074, 121152, 121009, 120716, 120720, 121583, 123337, 125324, 126904, 128060, 129021, 129623, 129548, 128982, 128522, 128449, 128500, 128287, 127576, 126191, 124073, 121446, 118647, 115829, 113125, 111002, 110033]
52810A10033K41R26J051Q57L60m59j222j402r68m37l23o82j183j452j342r97o39
52793A02362m18n23j211k308k954k359q96K17L78J72K31K48l23j153j388q82m60
52776H8733p65j474j760j263l46L69N46K94Jk3J90L07R9j80J8Q29J584J438M32
52757H9029m65m80J16N25L53k69j162k135k703k411j536r66j227j908k219j894
52741G0648j371j203j397j382o81M58J276J319Q06J82l29o46p32p48q81q87l53
52724F4079M41O06m6n46k14K93P3n34n88p2L70P21J446K198J940N31q75j177l45
52705F8301R31J797J542K68p95n57M16O64Kl22K81R09P85L54J99O9k83l52J43
52686G4352N18K41RP38K061K831K672K184J889J812J878K022J998J581R05K06
$$ y = [110033, 110274, 111200, 112251, 113108, 113468, 113009, 111787, 110385, 109417, 108980, 108657, 107975, 106792, 105340, 103998, 103001, 102362, 101944, 101421, 100210, 97902, 94948, 92589, 91693, 91910, 92288, 92460, 92691, 92939, 92616, 91463, 90075, 89193, 88733, 87968, 86494, 84734, 83471, 83125, 83494, 84040, 84334, 84335, 84312, 84502, 84809, 84908, 84728, 84746, 85575, 87159, 88597, 89029, 88564, 88084, 88200, 88725, 89078, 88809, 87647, 85512, 82809, 80398, 78862, 77896, 76669, 74761, 72542, 70648, 69277, 68074, 66677, 65295, 64614, 65072, 66348, 67667, 68473, 68655, 68326, 67680, 66948, 66200, 65319, 64432, 64079, 64520, 65126, 65080, 64534, 64320, 64613, 64686, 64152, 63564, 63492, 63862, 64583, 66029, 68227, 70167, 70698, 69823, 68646, 68301, 69232, 71029, 72571, 72839, 72044, 71487, 71903, 72567, 72569, 72247, 72528, 73437, 74222, 74576, 74775, 74844, 74561, 74209, 74352, 74870, 75111, 75120, 75858, 77919, 80750, 83422, 85606, 87495, 89307, 91185, 93207, 95205, 96786, 97691, 97897]
52670I7897n01j145j351q84r0N21Q85J271J771K246K591K832L115L651M349M557
52654A21715L605J673m01k160l672m682m619l690k974k945k854k115j310j055
52640I4516q35j7P57M51o15j135p28k99m87q79r30p25n19k44J30K55j32p04q53
52621H7007l53M17Q30N68r9n93o34m30k95k63k21j57j00oJ78M88R47J381J361
52602I0026P38J43L24J038J229M73m68p71n13j82J52P15J506K297K727K333J051
52585A02818j76j77Q30J301M78n80o03K07Q84J149J171P09l80j337j267m54J00
52568A04673J12J38M54P70Q93R29Q52N90K92R4j55m27k58M33Q24K54p19j090p61
52549A07898k28M72J419J934J245j45r12o77k16j25k94n74q94p69J65J124Q46
$$ y = [97897, 97396, 96251, 94900, 94016, 93926, 94447, 95332, 96603, 98374, 100620, 103211, 106043, 109158, 112809, 117158, 121715, 125320, 126993, 126592, 124432, 120760, 116078, 111459, 107769, 104795, 101850, 98996, 96881, 95571, 94516, 93681, 93664, 94421, 94872, 94257, 93122, 92394, 92095, 91608, 90729, 89799, 89074, 88555, 88311, 88441, 88696, 88564, 87860, 87007, 86654, 87071, 87901, 88469, 88370, 87777, 87143, 86713, 86418, 86155, 85934, 85777, 85677, 85671, 85849, 86337, 87284, 88665, 90026, 90764, 90907, 91231, 92269, 93498, 93971, 93503, 92732, 92219, 92037, 92189, 92904, 94410, 96707, 99434, 101767, 102818, 102642, 102465, 103295, 104596, 105074, 104494, 103891, 104098, 104982, 106131, 107302, 108011, 107631, 106294, 105027, 104573, 104673, 104785, 104923, 105377, 106147, 107040, 107969, 108821, 109411, 109703, 109797, 109642, 109215, 108957, 109390, 110214, 110468, 109749, 108659, 107898, 107670, 108142, 109561, 111495, 112740, 112595, 111683, 111006, 110790, 110665, 110371, 109797, 108903, 108134, 108299, 109423, 110269]
52532A10269o33j945k228j928j608j174o18m05o12o28j31L99N57N51N21J15p35
52515I9767j330j096k98M50Q75Q70L30m77r23q02m95j56N45J478J716P37o67j321
52497I9203j079o46m57l54j81o2j51m37p13n93J40J075J391Q07k7k82K11J041
52479I8886J792K214K171J712J064M18j02l14r7L39O71Q83J085J051N17j17r2
52462A12081N51R12M82k32o13o85o38l35K26N84M98M23P32J058R51P12R18J449
52444A19074J663J323P51K57j1J49P68J299J041R4n70j69R54J642J161pp60o87
52426A27972m25n71p18k03O55Q89L35l26q48j638k393j934j07J363J020k98p35
52409A22038l2M99K05j64N7N54Q69J046J183J129J001J123J246O59n57j276q31
$$ y = [110269, 109636, 107691, 105463, 103535, 101927, 100753, 100135, 99730, 99118, 98490, 98359, 98758, 99315, 99866, 100387, 100502, 99767, 98437, 97341, 97043, 97493, 98368, 99238, 99568, 99091, 98168, 97366, 96871, 96715, 97260, 98738, 100454, 101191, 100524, 99203, 98124, 97478, 97021, 96667, 96486, 96424, 96273, 95836, 95123, 94530, 94670, 95745, 97136, 97943, 97916, 97634, 97845, 98886, 100678, 102892, 105063, 106775, 107839, 108257, 108155, 107841, 107744, 108083, 108754, 109637, 110722, 111773, 112290, 112173, 112081, 112632, 113544, 114026, 113794, 113181, 112496, 111858, 111523, 111749, 112333, 112831, 113254, 113986, 115044, 115995, 116707, 117625, 119074, 120737, 122060, 122811, 123068, 123057, 123206, 123974, 125273, 126314, 126408, 125838, 125669, 126623, 128265, 129426, 129419, 128659, 127972, 127547, 126976, 126258, 126055, 126710, 127599, 127934, 127608, 126760, 125122, 122729, 120795, 120688, 122051, 123071, 122773, 122038, 122006, 122505, 122710, 122546, 122603, 123157, 124026, 125072, 126255, 127384, 128385, 129508, 130754, 131413, 130856, 129580, 128749]
52392A28749J3K21n8k1M11O23M60L87N56N69L14K30M70M60k50j192j525j057l27
52373A29033J06K2n00j028r30j11O21N24P3L45J302J663Q19k12k75K74L47j24
52355A31949k56K95R46J236J295J224R13N83P20J210J309P39J15PK03L09M62R52
52337A44211J582J888J650R50j1p90q35j06P29J017P15R9o17j089q08K04J136
52320A49925J288R06O11M75K12oL45J267K155K543K428J905J091M32N04J274K032
52303A69387K297K439L078M188N063N117M450L686L439L880M671N222N159M677
52289B26753M429M903N843O482O428O126O192O568O697O417O177O384O947P612
52275C13958Q248Q687Q714Q442Q325Q532Q681Q476Q215Q326Q763R267R849J0577
$$ y = [128749, 128762, 128983, 128925, 128904, 129315, 129938, 130398, 130785, 131341, 131910, 132224, 132454, 132924, 133384, 133134, 131942, 130417, 129360, 129033, 129139, 129161, 128661, 127633, 126703, 126592, 127213, 127737, 127810, 128155, 129457, 131120, 131939, 131727, 131452, 131726, 132073, 131949, 131693, 131988, 132934, 134170, 135465, 136689, 137602, 138185, 138905, 140115, 141424, 142163, 142278, 142285, 142488, 142797, 143259, 144211, 145793, 147681, 149331, 150281, 150270, 149480, 148645, 148539, 149268, 150285, 151000, 151099, 150482, 149393, 148585, 148789, 149925, 151213, 152119, 152730, 153205, 153417, 153411, 153756, 155023, 157178, 159721, 162149, 164054, 165145, 165577, 166081, 167355, 169387, 171684, 174123, 177201, 181389, 186452, 191569, 196019, 199705, 203144, 207024, 211695, 216917, 222076, 226753, 231182, 236085, 241928, 248410, 254838, 260964, 267156, 273724, 280421, 286838, 293015, 299399, 306346, 313958, 322206, 330893, 339607, 348049, 356374, 364906, 373587, 382063, 390278, 398604, 407367, 416634, 426483, 437060]
52261D37060J1079J0861J0068R446R449R769R823R487R129R018Q887Q167O684
52248E58927N021L962L636L467K933K032R94Oo14m81L19J045J016L27m04p36o34
52231E80816k55J62M39P23J355K241K795K836L087M277O031P319P739P759P832
52216F35156P962Q194Q755R528R905R531Q797Q330Q292Q423Q464Q245P600O496
52202G53678N249M289L712L209K475J516N83j85q88j737k807l948m889n425n607
52187G49225n717o022o426o561o351o255o700p405p706p465p175p097o954o664
52173F54727o784p649q511q286p016n900n758o034n608m218k705k014k350l234
52159E78660m072m453m146l185j985j149r43j099j196j092p99l09K00K62l42j116
$$ y = [437060, 448139, 459000, 469068, 478514, 487963, 497732, 507555, 517042, 526171, 535189, 544076, 552243, 558927, 563948, 567910, 571546, 575013, 577946, 579978, 580972, 580978, 580364, 579883, 580202, 581247, 582263, 582590, 582186, 581450, 580816, 580561, 580723, 581162, 581885, 583240, 585481, 588276, 591112, 594199, 598476, 604507, 611826, 619565, 627324, 635156, 643118, 651312, 660067, 669595, 679500, 689031, 697828, 706158, 714450, 722873, 731337, 739582, 747182, 753678, 758927, 763216, 766928, 770137, 772612, 774128, 774711, 774526, 773638, 771901, 769094, 765146, 760257, 754832, 749225, 743508, 737486, 731060, 724499, 718148, 711893, 705193, 697788, 690082, 682617, 675442, 668345, 661391, 654727, 647943, 640294, 631783, 623497, 616481, 610581, 604823, 598789, 593181, 588963, 586258, 584244, 581894, 578660, 574588, 570135, 565989, 562804, 560819, 559670, 558727, 557628, 556432, 555340, 554541, 554232, 554432, 554694, 554352, 553236]
52143E53236j393j267j405j976k447k528k649l147l620l531l048k702k611k532
52129E18380k506k874l698m513m750m317l721l686m461n436n726n136m306l790
52115D59460l461k960k304j775j535j621j986k331k253j762j293r67m12M43R74
52100D36217P22J63RK45M93R32J978L307L993L729L242L404M370N715O941P801
52084D83261Q333Q732R057R228R440J0188J1560J2894J3538J3624J3662J3682
52072F17199J3466J3278J3601J4280J4624J4364J3833J3162J2068J0540R162Q389
52060G67966Q054P752P332O821O229N585M852L711J941K2j108j211j210k130l853
52045H10753n291n709n532n754o746p845q217p902p700q029q367q098p365o683
$$ y = [553236, 551843, 550576, 549171, 547195, 544748, 542220, 539571, 536424, 532804, 529273, 526225, 523523, 520912, 518380, 515874, 513000, 509302, 504789, 500039, 495722, 492001, 488315, 483854, 478418, 472692, 467556, 463250, 459460, 455999, 453039, 450735, 448960, 447425, 445804, 443818, 441487, 439234, 437472, 436179, 435212, 434800, 435243, 436217, 436939, 437102, 437111, 437356, 437849, 438781, 440759, 444066, 448059, 451788, 455030, 458434, 462804, 468519, 475460, 483261, 491594, 500326, 509383, 518611, 528051, 538239, 549799, 562693, 576231, 589855, 603517, 617199, 630665, 643943, 657544, 671824, 686448, 700812, 714645, 727807, 739875, 750415, 759577, 767966, 776020, 783772, 791104, 797925, 804154, 809739, 814591, 818302, 820243, 820265, 819157, 817946, 816736, 814606, 810753, 805462, 799753, 794221, 788467, 781721, 773876, 765659, 757757, 750057, 742028, 733661, 725563, 718198, 711515]
52031G11515o058n186m206l623l436l013j967o68K62O37P56J062J855K987L971
52016F94888M514M918N590O430P060P510Q048Q439Q124P110O074N425M843L998
52002G82971L075K336J606N57p99k214l498m533n283n966o970q383r892j1255
51988G31752j2546j3849j5067j6226j7553j9003k0056k0300j9995j9772j9900
51977E37485k0069j9824j9032j8008j7227j6887j6666j6032j4848j3501j2482
51966C52909j1925j1561j1019j0200r452r227r383r077p661n534l778l045l134
51953B47913l481l636l371k765k218j995j863j464r19o19o03o23p15j113j657
51938B20871j889j746j588j526j290r34r76j639k476k973l076k987k850k802k887
$$ y = [711515, 705457, 700271, 696065, 692442, 689006, 685993, 684026, 683358, 683620, 684257, 685013, 686075, 687930, 690917, 694888, 699402, 704320, 709910, 716340, 723400, 730910, 738958, 747397, 755521, 762631, 768705, 774130, 778973, 782971, 786046, 788382, 789988, 790545, 789746, 787532, 784034, 779501, 774218, 768252, 761282, 752899, 743007, 731752, 719206, 705357, 690290, 674064, 656511, 637508, 617452, 597152, 577157, 557385, 537485, 517416, 497592, 478560, 460552, 443325, 426438, 409772, 393740, 378892, 365391, 352909, 340984, 329423, 318404, 308204, 298752, 289525, 280142, 271065, 263404, 257870, 254092, 251047, 247913, 244432, 240796, 237425, 234660, 232442, 230447, 228584, 227120, 226201, 225582, 224979, 224356, 223641, 222528, 220871, 218982, 217236, 215648, 214122, 212832, 211898, 210922, 209283, 206807, 203834, 200758, 197771, 194921, 192119, 189232]
51923A89232k878k617k465k893l642l979l782l661l879l984l683l227k695j787
51909A44060p85o70j621k342j678k82L12l06j223j709j843j856j714j506j478
51894A25359j562j383q35k50L0k1k21l12j17K01K08k61q65j261j447j314m70R80
51876A16459K014J798Q74M35P08R37Q19R02J415J730J365P57N19N80O10P51J319
51859A33992K125K704L091L735M705N573O121O769Q015R821J1773J3667J5606
51846B27697J7609J9364K0367K0128J8240J4503R214L116k973q435j2756j5508
51834C10566j6683j6844j6583j5976j4853j3402j2074j0961r723q219o708n411
51822A63129m339l632l547l925m124l791l237k866k663k490k400k255j623m89
$$ y = [189232, 186354, 183737, 181272, 178379, 174737, 170758, 166976, 163315, 159436, 155452, 151769, 148542, 145847, 144060, 143275, 142605, 140984, 138642, 136964, 136682, 136994, 136688, 135465, 133756, 131913, 130057, 128343, 126837, 125359, 123797, 122414, 121579, 121329, 121359, 121338, 121117, 120805, 120688, 120889, 121097, 120836, 119971, 118710, 117263, 115949, 115479, 116459, 118473, 120271, 121145, 121580, 122288, 123225, 124044, 124946, 126361, 128091, 129456, 130213, 130732, 131312, 131922, 132673, 133992, 136117, 138821, 141912, 145647, 150352, 155925, 162046, 168815, 176830, 186651, 198424, 212091, 227697, 245306, 264670, 285037, 305165, 323405, 337908, 347122, 350238, 347265, 338830, 326074, 310566, 293883, 277039, 260456, 244480, 229627, 216225, 204151, 193190, 183467, 175248, 168540, 163129, 158790, 155158, 151611, 147686, 143562, 139771, 136534, 133668, 131005, 128515, 126115, 123860, 122237, 121748]
51808A21748L85L93n1j68l0l16j053j473j137n67m37p21r08o66j01M03M24j40
51790A15585p89q45k66K84L14J52L48P81P79Q9p13r03m35J19K98R0k48n27o23
51771A13490m55j66j20n32j141j477j369r48l64K14L83j62j039j343o70L68Q64
51754A05533N72q3o15q45p90n22j16M01R94J449J475J040N26L63O43J075J230
51737A12330Q52J58k61m2M46O27N31O51J001R82L87j52m8L98N51L61K44L34L68
51718A19718J14m22j137j840k275k363k258k025j589j096r60j249j514j461j361
51703I8282j446j370p20L40J359K102K336J686L70m97j2J396K709L667M553M988
51687A19743M151K145J12j207k086k807l002k419j612j293j481j691j569r93l
$$ y = [121748, 122133, 122526, 122475, 122307, 122277, 121961, 120908, 119435, 118298, 117731, 117294, 116573, 115665, 114999, 114898, 115301, 115725, 115585, 114796, 113951, 113685, 113969, 114283, 114435, 114783, 115564, 116343, 116432, 115719, 114816, 114381, 114500, 114798, 114888, 114640, 114113, 113490, 113035, 112869, 112749, 112217, 111076, 109599, 108230, 107282, 106918, 107132, 107515, 107353, 106314, 104971, 104301, 104669, 105533, 106105, 106022, 105407, 104562, 103772, 103250, 103134, 103535, 104529, 105978, 107453, 108493, 109019, 109382, 110025, 111100, 112330, 113182, 113340, 113079, 113037, 113483, 114110, 114641, 115292, 116293, 117275, 117662, 117510, 117462, 117860, 118411, 118772, 119016, 119350, 119718, 119832, 119410, 118273, 116433, 114158, 111795, 109537, 107512, 105923, 104827, 103867, 102618, 101104, 99643, 98282, 96836, 95466, 94746, 95086, 96445, 98547, 100883, 102569, 102939, 102442, 102430, 103826, 106535, 110202, 114755, 119743, 123894, 126039, 126151, 124944, 122858, 120051, 117049, 114630, 113018, 111725, 110244, 108553, 106984, 105991, 105988]
51672A05988R78J288O84k85r07r74o75j69L57N79L03k42p36j203j786k236k063
51655I8901j180k01J70j43n70n97k92K8L77R78J560J383L34n39j66J126K021J976
51637A05166J836K486L599M126L586K442J415Q56P92J190K004K991L628L391K318
51622A41826J106M74M85P25J007J473K020K079J288O5p71r00p71r75j537j980
51606A45614j950j619j365j325j450j830k523l105k916j974j169j262k032k721
51592A18373k920k651j975j052l32j32k13k27k99o83j091j010n84m84q99j327
51576A02494j331r73m52J27N22M94K81M48J100J679J708J249O12J7l27k82J8M02
51558A07786J064K181L149K956J498j08p54m17L35J175J948K320K055J430R18
$$ y = [105988, 106966, 108254, 108938, 108653, 107746, 106772, 106097, 105928, 106285, 106864, 107167, 106925, 106189, 104986, 103200, 100964, 98901, 97721, 97520, 97690, 97547, 96977, 96380, 96088, 96116, 96493, 97471, 99031, 100414, 100748, 100209, 100043, 101169, 103190, 105166, 107002, 109488, 113087, 117213, 120799, 123241, 124656, 125512, 126304, 127494, 129498, 132489, 136117, 139508, 141826, 142932, 143406, 143891, 144616, 145623, 147096, 149116, 151195, 152483, 152548, 151777, 150877, 150106, 149131, 147594, 145614, 143664, 142045, 140680, 139355, 137905, 136075, 133552, 130447, 127531, 125557, 124388, 123126, 121094, 118373, 115453, 112802, 110827, 109775, 109443, 109311, 109098, 108871, 108572, 107889, 106798, 105788, 105204, 104720, 103821, 102494, 101163, 100190, 99738, 99865, 100387, 100881, 101162, 101610, 102710, 104389, 106097, 107346, 107958, 107975, 107648, 107366, 107384, 107786, 108850, 111031, 114180, 117136, 118634, 118526, 117772, 117355, 117690, 118865, 120813, 123133, 125188, 126618, 127536]
51543A27536O69N78O26Q38J066J133J053R15P47O04N61N61M44K69L07O43J075
51526A39625J382J445J113M01j44J69J205J982J845J183P39O74O85O20O04P65
51510A54293J133J516J442O29l86o21P6P11M72j96l96j05r1q03j955l008l570
51493A49141l448k827k284k245k512k601k341j894j430j136j227j567j574j008
51479A21047n24q93j843k280j668o22j04l81r36j146r68r61j499k030j612l34
51463A03246M40k09j464j921j535j371j700j582n59M06L00n16r93q58n94l28K99
51446I1061J175J535J016K90K38Q07J198J009O08M44M58M20L91M10J25p41j652
51429I8792j703q33J2J60L7L03P54P17K10K0N99J541K164K223J876J344Q02M08
$$ y = [127536, 128205, 128783, 129409, 130247, 131313, 132446, 133499, 134414, 135161, 135765, 136326, 136887, 137331, 137600, 137907, 138550, 139625, 141007, 142452, 143565, 143966, 143822, 143991, 145196, 147178, 149023, 150206, 150945, 151619, 152304, 152924, 153528, 154293, 155426, 156942, 158384, 159013, 158627, 158006, 158082, 158793, 159265, 159069, 158673, 158568, 158477, 157674, 155719, 152711, 149141, 145693, 142866, 140582, 138337, 135825, 133224, 130883, 128989, 127559, 126423, 125196, 123629, 122055, 121047, 120523, 119630, 117787, 115507, 113839, 113217, 113113, 112732, 111796, 110650, 109682, 108721, 107222, 105192, 103580, 103246, 103686, 103477, 102013, 100092, 98557, 97186, 95486, 93904, 93345, 93751, 94051, 93535, 92542, 91684, 91090, 90762, 91061, 92236, 93771, 94787, 95077, 95315, 96122, 97320, 98329, 98937, 99381, 99839, 100259, 100650, 101060, 101185, 100444, 98792, 97089, 96256, 96268, 96428, 96465, 96768, 97522, 98239, 98449, 98469, 99068, 100609, 102773, 104996, 106872, 108216, 109018, 109426]
51411A09426K58L58O39Q74O57k39j480k343k418j959j531j351j095m10M68P73
51395A00627J13q96j280r69q16j212j356m48R09J333M83n81r01p07p14r75j008
51378I1602o57k94k84n75q90j012r01o81o16q72j281j443j117n07n4l2l59p54
51360G9273r24o67n2M56K94n07j130p95L28J276J334O08l70j112j307r09k75J84
51342G5705N12J010J474J253K16q76j312j179q33k44N80J072P12j72p92q85o72
51325G5569k20M84R95Q03J90l3L23O26M45R0n8q8j49l9M22R48J006L53p96j830
51305G9041j993j029L99J273J281R25N92R5o88j299j219n67O6K53nl76l72K43
51287G6620J074J383R02J47k16J3O54J397J851J795J601J868K440K344J137k82
$$ y = [109426, 109684, 110042, 110681, 111555, 112212, 111973, 110493, 108150, 105732, 103773, 102242, 100891, 99796, 99386, 99854, 100627, 100740, 99844, 98564, 97595, 96779, 95567, 94211, 93763, 94672, 96005, 96488, 95907, 95006, 94299, 93585, 92610, 91602, 90945, 90651, 90367, 89792, 88902, 87890, 86989, 86308, 85692, 84820, 83539, 82096, 80979, 80472, 80418, 80386, 80027, 79273, 78349, 77682, 77630, 78086, 78380, 77873, 76743, 75948, 76276, 77552, 78886, 79494, 79124, 78012, 76705, 75796, 75521, 75705, 76217, 77227, 78701, 79954, 80170, 79294, 77982, 76803, 75970, 75726, 76306, 77378, 78090, 77918, 77126, 76241, 75569, 75349, 75833, 76828, 77631, 77821, 77788, 78111, 78737, 79182, 79272, 79214, 79126, 78977, 78938, 79360, 80308, 81314, 81667, 80871, 79041, 77048, 76019, 76418, 77691, 78972, 79897, 80489, 80584, 79896, 78597, 77378, 76811, 76877, 77130, 77125, 76749, 76377, 76620, 77694, 79077, 79979, 80126, 79910, 79923, 80577, 81974, 83825, 85620, 87221, 89089, 91529, 93873, 95010, 94728]
51271I4728p43k52K77L59K57J91N2n5K18P77R48L59m75p81l84K64P00P56N25K94
51251I8015L61O82Q58O32L21M20Q84J114P62K54K62Q34J299J079L61k13l37k58
51233A07330k24r6L74J051J524J622J594J704J839J638R67J46l60m02k63l35p11
51216A17398j188j508j542j189m14N64J198J019J00r62j593j730j704j720j580
51201A05149j005j42L97J58o19j195j158p78n82p03q32o94l46QK97N78Q57J057
51183A00447J109J079J118J305J547J625J439J189J183J363J192K30j175k055
51169A11596j784o64N11J253J448R47l34j918k905k840k121j325n73J27L33l63
51153A01388j521k139j775r09j61K92L50j93j083j325j94J703K929K776J842J094
$$ y = [94728, 93985, 93733, 94010, 94369, 94626, 94817, 94869, 94814, 95032, 95809, 96757, 97116, 96641, 95860, 95476, 95740, 96440, 97196, 97721, 98015, 98376, 99058, 99916, 100548, 100869, 101289, 102173, 103287, 104049, 104303, 104565, 105399, 106698, 107777, 108138, 107925, 107588, 107330, 107106, 107010, 107384, 108435, 109959, 111581, 113175, 114879, 116718, 118356, 119323, 119469, 119109, 118707, 118444, 118109, 117398, 116210, 114702, 113160, 111971, 111557, 112121, 113319, 114338, 114438, 113476, 111883, 110153, 108449, 106729, 105149, 104144, 104002, 104399, 104557, 103938, 102743, 101585, 100807, 100225, 99522, 98690, 97996, 97650, 97658, 97955, 98533, 99390, 100447, 101556, 102635, 103753, 105058, 106605, 108230, 109669, 110858, 112041, 113404, 114596, 114826, 113651, 111596, 109812, 109148, 109659, 110912, 112360, 113307, 112973, 111055, 108150, 105310, 103189, 101864, 101291, 101418, 101751, 101388, 99867, 97728, 95953, 95044, 94883, 95175, 95525, 95332, 94249, 92924, 92730, 94433, 97362, 100138, 101980, 103074]
51137A03074Q40Q46Q84Q35N22n8m61k08M97Q51L77m62q50o01k30j63k34j10J42
51118A05491K27K15M98J134J565J298O16K49M51P52P01M21K45J09k46p13q50n14
51100A11649l1K78L86K99q1o39r46p50k86J45N92J173J643J677J330Q31J81n55
51082A16896q32j32J101J765J468R66R86J252J067M28J8K68Q77J247J170J045
51066A29590J436K396L234L279K730K361K453K513K200J816J649J403P94K21K56
51051A58331Q03J282J388J216Q01J19o36j195j542j714j528r36m22m51p19n49
51035A54248M3L08j36p79r03m01L13P84P70L37j05j15L50R67J468J796J914J818
51017A62677J714J883K358K925L337L359K803J940J574K259L545M551N043N464
$$ y = [103074, 103914, 104760, 105644, 106479, 107001, 106943, 106482, 106274, 106771, 107622, 107999, 107537, 106687, 106086, 105856, 105693, 105459, 105349, 105491, 105718, 105933, 106431, 107565, 109130, 110428, 111044, 111293, 111744, 112496, 113197, 113618, 113863, 113972, 113726, 113013, 112163, 111649, 111618, 111896, 112282, 112581, 112500, 111861, 110915, 110165, 109879, 110024, 110616, 111789, 113432, 115109, 116439, 117270, 117451, 116896, 116064, 115932, 117033, 118798, 120266, 121232, 122218, 123470, 124537, 124965, 124983, 125251, 126128, 127375, 128545, 129590, 131026, 133422, 136656, 139935, 142665, 145026, 147479, 149992, 152192, 154008, 155657, 157060, 157854, 158075, 158331, 159134, 160416, 161804, 163020, 163821, 163940, 163304, 162109, 160567, 158853, 157325, 156389, 155967, 155516, 154797, 154248, 154291, 154599, 154463, 153684, 152781, 152380, 152693, 153477, 154247, 154584, 154479, 154364, 154714, 155681, 157149, 158945, 160859, 162677, 164391, 166274, 168632, 171557, 174894, 178253, 181056, 182996, 184570, 186829, 190374, 194925, 199968, 205432]
51003B05432O011O427O609O777P022P347Q141R819J1905J3344J3945J4712J6425
50990C33916J8747K1104K3494K5877K7648K8627K9834L2337L5707L8536M0168
50979F55995M1062M1669M1918M1750M1286M0277L8194L4969L1077K6769K1925
50968A056891J6705J1762P438L436m69l963o811r329j1705j3299j3288j1836j0039
50955A015493q806q213p965p961q251q830r626j0549j1408j2108j3042j4953j8127
50942H75654k1869k5109k7396k8995l0122l0511k9914k8601k7126k5815k4670
50931E75526k3645k2692k1634k0287j8649j6833j4843j2702j0724r334q579q005
50919C87599p138n876m416l039k057j691j833k045j979j696j478j451j473j278
$$ y = [205432, 211443, 217870, 224479, 231256, 238278, 245625, 253766, 263585, 275490, 288834, 302779, 317491, 333916, 352663, 373767, 397261, 423138, 450786, 479413, 509247, 541584, 577291, 615827, 655995, 697057, 738726, 780644, 822394, 863680, 903957, 942151, 977120, 1008197, 1034966, 1056891, 1073596, 1085358, 1092796, 1096232, 1095763, 1091800, 1084989, 1075660, 1063955, 1050656, 1037368, 1025532, 1015493, 1006687, 998474, 990509, 982548, 974297, 965467, 955841, 945292, 933884, 921776, 908734, 893781, 875654, 853785, 828676, 801280, 772285, 742163, 711652, 681738, 653137, 626011, 600196, 575526, 551881, 529189, 507555, 487268, 468619, 451786, 436943, 424241, 413517, 404183, 395604, 387599, 380461, 374585, 370169, 367130, 365073, 363382, 361549, 359504, 357525, 355829, 354351, 352900, 351427, 350149]
50905C50149p30K9N88O22L27L37J126K501L784M392M240L733L442L685M340N127
50889C87692N978O935P806Q293Q571R355J1024J2956J4126J4379J4760J6461J9680
50876E38016K3682K7701L1541L5340L9228M3364M8150N3954O0652O7678P4579
50865A043885Q1240Q7516R2978R7318J00664J03119J04156J02884R8925R2578
50855B005263Q4112P3366O0280M5570L0567J6457L804p265j6634k4004k9073l1749
50843B210694l2154l0399k6624k1277j5197r314m436j340p20k768p044j2922j9996
50830B026503k7873l6038m4197n2299n9855o5788o9620p2288p4933p7199p7682
50819A368731p5881p2674o8827o4209n8733n3009m7472m1839l6024l0763k6538
$$ y = [350149, 349419, 349448, 350036, 350658, 350985, 351322, 352448, 354949, 358733, 363125, 367365, 371098, 374540, 378225, 382565, 387692, 393670, 400605, 408411, 416704, 425275, 434630, 445654, 458610, 472736, 487115, 501875, 518336, 538016, 561698, 589399, 620940, 656280, 695508, 738872, 787022, 840976, 901628, 969306, 1043885, 1125125, 1212641, 1305619, 1402937, 1503601, 1606720, 1710876, 1813760, 1912685, 2005263, 2089375, 2162741, 2223021, 2268591, 2299158, 2315615, 2319419, 2312154, 2295520, 2271516, 2242443, 2210694, 2178540, 2148141, 2121517, 2100240, 2085043, 2075729, 2071293, 2069953, 2069233, 2066465, 2059421, 2046499, 2026503, 1998630, 1962592, 1918395, 1866096, 1806241, 1740453, 1670833, 1598545, 1523612, 1446413, 1368731, 1292850, 1220176, 1151349, 1087140, 1028407, 975398, 927926, 886087, 850063, 819300, 792762]
50808G92762k2538j7683j2229p408l700l43L429P461J1105J4048J6383J8267J9643
50795H19197K0184J9538J7781J5504J3175J0594P349L661L35k212m436o963r720
50782I03987j2084j3740j5045j6392j7640j8423j8928j9761k0976k1749k1386
50771G07863k0151j8633j6790j4371j1793r638p496m459p60K268M192O194R232
50758F25658J2611J5309J7796K1385K6332L1648L6569M1231M6064N1289N7020
50747I82912O3132O9058P4132P8085Q0814Q1946Q1060P8021P2673O4614N4024
50736A780471M2205L0524J9170P713l436j3094k0678k6425l0389l2252l2297l1528
50724A689984l0484k8835k6437k3960k2003k0416j9062j8652k0138k3648k8434
$$ y = [792762, 770224, 752541, 740312, 732904, 729204, 728861, 732290, 739751, 750856, 764904, 781287, 799554, 819197, 839381, 858919, 876700, 892204, 905379, 915973, 923322, 926983, 927318, 925106, 920670, 913707, 903987, 891903, 878163, 863118, 846726, 829086, 810663, 791735, 771974, 750998, 729249, 707863, 687712, 669079, 652289, 637918, 626125, 616487, 608991, 604532, 603772, 606040, 610232, 616426, 625658, 638269, 653578, 671374, 692759, 719091, 750739, 787308, 828539, 874603, 925892, 982912, 1046044, 1115102, 1189234, 1267319, 1348133, 1430079, 1511139, 1589160, 1661833, 1726447, 1780471, 1822676, 1853200, 1872370, 1880083, 1876647, 1863553, 1842875, 1816450, 1786061, 1753809, 1721512, 1689984, 1659500, 1630665, 1604228, 1580268, 1558265, 1537849, 1518787, 1500135, 1479997, 1456349, 1427915]
50713A427915l3571l8322m2241m5311m7803m9710n0611n0323m9215m7530m4873
50702I28405m0934l6403l2470k9468k6564k2918j8611j4288j0283o440k550J372
50690F88848N241R092J3002J7079K1533K6515L1706L6365M0085M3224M6237M8725
50678A027652M9805M9201M7289M3993L8767L1975K5348K0206J5957J1250N982
50667A367425J145l024p444j2715j8213k2908k6346k8632l0057l0994l1609l1532
50655A125096l0204k7628k4285k0480j6345j2299q751n387j650K118M903O508
50643I91596P755R018R677R522R513J0342J1188J0932R987R872J1334J3878J6851
50630A131465K0016K3103K5630K7410K8570K8971K8098K5683K1951J7221J1612
$$ y = [1427915, 1394344, 1356022, 1313781, 1268470, 1220667, 1170957, 1120346, 1070023, 1020808, 973278, 928405, 887471, 851068, 818598, 789130, 762566, 739648, 721037, 706749, 696466, 690026, 687476, 688848, 694089, 703181, 716183, 733262, 754795, 781310, 813016, 849381, 889466, 932690, 978927, 1027652, 1077457, 1126658, 1173947, 1217940, 1256707, 1288682, 1314030, 1334236, 1350193, 1361443, 1367425, 1368570, 1365546, 1358102, 1345387, 1327174, 1304266, 1277920, 1249288, 1219231, 1188237, 1156628, 1125096, 1094892, 1067264, 1042979, 1022499, 1006154, 993855, 985104, 979717, 978067, 980185, 985088, 991596, 999351, 1008369, 1018046, 1027568, 1037081, 1047423, 1058611, 1069543, 1079530, 1089402, 1100736, 1114614, 1131465, 1151481, 1174584, 1200214, 1227624, 1256194, 1285165, 1313263, 1338946, 1360897, 1378118, 1389730]
50619A389730N293j393q150j4832k1140k6487l0351l2602l3496l3448l2860l2058
50607A128206l1245l0457k9647k8767k7891k7223k6969k7170k7713k8400k8911
50596H13813k8891k8232k7171k5916k4358k2394k0347j8575j6856j4704j2270
50585E74099j0332r292q682p846o600n099l588k474k044j822p86J361L746N536
50571E26177P087R346J2523J5994J9232K2167K4823K7209K9507L1878L4022L5305
50559G95270L5391L4486L2994L1198K9223K7087K4844K2776K1332K0672K0468
50548A095741K0256J9803J9064J8145J7429J7352J7844J8430J9110K0567K3138
50537A306879K6142K8739L0939L3119L5020L6043L6141L5650L4419L1912K8088
$$ y = [1389730, 1395023, 1393630, 1385480, 1370648, 1349508, 1323021, 1292670, 1260068, 1226572, 1193124, 1160264, 1128206, 1096961, 1066504, 1036857, 1008090, 980199, 952976, 926007, 898837, 871124, 842724, 813813, 784922, 756690, 729519, 703603, 679245, 656851, 636504, 617929, 601073, 586369, 574099, 563767, 554475, 545793, 537947, 531347, 526248, 522660, 520186, 518142, 516320, 515534, 516895, 520641, 526177, 533264, 542610, 555133, 571127, 590359, 612526, 637349, 664558, 694065, 725943, 759965, 795270, 830661, 865147, 898141, 929339, 958562, 985649, 1010493, 1033269, 1054601, 1075273, 1095741, 1115997, 1135800, 1154864, 1173009, 1190438, 1207790, 1225634, 1244064, 1263174, 1283741, 1306879, 1333021, 1361760, 1392699, 1425818, 1460838, 1496881, 1533022, 1568672, 1603091, 1635003, 1663091]
50526A663091K3384J7843J1206L837l283r696j5788k1755k7029l1140l4348l6947
50514A539375l8536l8654l7611l6012l3781l0450k6240k2240j9386j7740j6832
50503A221893j6312j6167j6510j7295j8090j8074j6526j3444r637o052l016k07
50491A070563K638N133O473O248M680K006k037p636j4132k0379k5849l0709l4728
50478I62271l6964l7065l6118l5426l4866l3356l0747k8211k6610k5449k3818
50467F13641k1559j9029j6385j3865j2118j1439j0963r536p276n410m554m044
50455D77463l123j931r56k48K91N25N78J129K584M348N653O713Q295J0406J2248
50440E23975J3446J4505J5932J7627J9309K0987K2803K4901K7605L1177L5182
$$ y = [1663091, 1686475, 1704318, 1715524, 1719361, 1716078, 1706382, 1690594, 1668839, 1641810, 1610670, 1576322, 1539375, 1500839, 1462185, 1424574, 1388562, 1354781, 1324331, 1298091, 1275851, 1256465, 1238725, 1221893, 1205581, 1189414, 1172904, 1155609, 1137519, 1119445, 1102919, 1089475, 1079838, 1073786, 1070770, 1070563, 1073201, 1078334, 1084807, 1091055, 1095735, 1097741, 1095704, 1088068, 1073936, 1053557, 1027708, 996999, 962271, 925307, 888242, 852124, 816698, 781832, 748476, 717729, 689518, 662908, 637459, 613641, 592082, 573053, 556668, 542803, 530685, 519246, 508283, 498747, 491471, 486061, 481507, 477463, 474340, 472409, 471453, 471205, 471496, 472021, 472599, 473728, 476312, 480660, 486313, 493026, 501321, 511727, 523975, 537421, 551926, 567858, 585485, 604794, 625781, 648584, 673485, 701090, 732267, 767449]
50429G67449L8625M0929M2386M3502M4367M4956M5478M6077M6529M6558M5988
50418A252844M4455M1411L6867L1705K6748K1828J6215R761L063l402r812j6562
50406A455121k3577l0246l5943m0520m4238m7247m9323n0293n0430n0095m9149
50395I84060m7237m4462m1323l8029l4560l1262k8539k5933k2478j8195j4380
50384F37662j1896j0062p791m941j918J223M403O995Q524R437J0268J0667J0146
50371F62717R105Q026O216K764j591n052p112q944j1263j3316j4353j4739j4913
50358E97545j4493j3231j1933j1444j1443j1083j0273r457q589p285n762m746
50346D77806m400m065l223k127j278o63J25J159J840J479J97j028j379j061q22
$$ y = [767449, 806074, 847003, 889389, 932891, 977258, 1022214, 1067692, 1113769, 1160298, 1206856, 1252844, 1297299, 1338710, 1375577, 1407282, 1434030, 1455858, 1472073, 1481834, 1484897, 1481495, 1471683, 1455121, 1431544, 1401298, 1365355, 1324835, 1280597, 1233350, 1184027, 1133734, 1083304, 1033209, 984060, 936823, 892361, 851038, 813009, 778449, 747187, 718648, 692715, 670237, 652042, 637662, 625766, 615704, 607913, 602972, 601054, 602277, 606680, 613675, 622199, 631636, 641904, 652571, 662717, 671822, 679848, 686064, 688828, 687237, 682185, 675073, 666129, 654866, 641550, 627197, 612458, 597545, 583052, 569821, 557888, 546444, 535001, 523918, 513645, 504188, 495599, 488314, 482552, 477806, 473406, 469341, 466118, 463991, 462713, 462050, 462175, 463334, 465174, 466653, 466850, 465822, 464443, 463382, 462560]
50331D62560q27n90J33J061K098L584N510P217Q279R174J0459J1777J2341J2153
50317E44929J2044J2641J3810J5080J6096J6652J6775J6725J6620J6089J4753
50306G12214J2995J1722J1260J0862R619P511N297L546K006j10l306p311j1331
50293G64974j4808j7805k0534k2686k3541k2862k1347j9971j8990j7832j5997
50282E48601j3735j1733j0292r072p663o145m911m080l364k515j705j303j355
50269D70728j497j382j111j147j694k348k500k064j503j157q82n27l51n74q01
50254D51190m69L11Q71J009J309K293L741N086O020O436O244N709N587O399P620
50239E09356Q147P654P013P235Q295R288R531R227Q957Q845Q507P773P096O997
$$ y = [462560, 461733, 461143, 461276, 462337, 464435, 468019, 473529, 480746, 489025, 498199, 508658, 520435, 532776, 544929, 556973, 569614, 583424, 598504, 614600, 631252, 648027, 664752, 681372, 697461, 712214, 725209, 736931, 748191, 759053, 768672, 776183, 781480, 785026, 787032, 786922, 783616, 776305, 764974, 750166, 732361, 711827, 689141, 665600, 642738, 621391, 601420, 582430, 564598, 548601, 534866, 523133, 512841, 503769, 496106, 489961, 485050, 480970, 477606, 475091, 473386, 472083, 470728, 469231, 467849, 466738, 465591, 463897, 461549, 459049, 456985, 455482, 454325, 453443, 452916, 452565, 451991, 451190, 450721, 451032, 451903, 452912, 454221, 456514, 460255, 465341, 471361, 477797, 484041, 489750, 495337, 501736, 509356, 517503, 525157, 532170, 539405, 547700, 556988, 566519, 575746, 584703, 593548, 602055, 609828, 616924, 623921]
50225F23921P374P695P782P924Q226Q374Q222Q150Q550R327J0193J1091J2016
50212G38845J2792J3487J4650J6554J8524J9763K0653K2290K4746K6807K7829
50201I56940K8842L1152L4598L8202M1872M6417N2044N8119O4601P2603Q3113
50190A508503R5987J10710J27329J45901J65661J85537K04933K23121K37993K46565
50180C252240K46742K38079K21086J97061J68913J40934J16719R7423Q2298P0064
50170D831559N8905M5656K6309j827l8394q0213j22989j62912j97231k24006k41839
50159C893018k50231k49978k42817k30584k14954j97811j80989j65352j50577
50150B009725j36194j22385j09531r7690q7013p8062p0936o4552n7697n0554m4394
$$ y = [623921, 631295, 638990, 646772, 654696, 662922, 671296, 679518, 687668, 696218, 705545, 715738, 726829, 738845, 751637, 765124, 779774, 796328, 814852, 834615, 855268, 877558, 902304, 929111, 956940, 985782, 1016934, 1051532, 1089734, 1131606, 1178023, 1230067, 1288186, 1352787, 1425390, 1508503, 1604490, 1715200, 1842529, 1988430, 2154091, 2339628, 2544561, 2767682, 3005675, 3252240, 3498982, 3737061, 3958147, 4155208, 4324121, 4465055, 4581774, 4679197, 4761495, 4831559, 4890464, 4936120, 4962429, 4960602, 4922208, 4841995, 4719006, 4556094, 4358863, 4134857, 3893018, 3642787, 3392809, 3149992, 2919408, 2704454, 2506643, 2325654, 2160302, 2009725, 1873531, 1751146, 1641615, 1543925, 1456912, 1378850, 1307914, 1243362, 1185665, 1135111, 1090717]
50139A090717l9797l6002l2112k8171k4790k2226k0208j8330j6388j4463j2780
50128H25450j1360r916q270o692n514m605l583k386j274l70M17J227K338M119
50114G79581O433Q373R201R282R536J0221J1001J1944J3517J5608J7406J8432
50102I20535J8979J9484K0175K1334K3080K4856K5992K6860K8487L0900L2935
50091A193617L4079L5316L7513L9994M1660M2759M4547M7673N1748N6232O1072
50080A686210O6652P3696Q2955R4608J08273J23943J42398J64277J89293K16968
50070B949273K47516K81232L17257L53453L87002M14408M31597M35313M24875
50061F241926M02510L72302L39173L07851K81286K59557K40556K21235J97728
$$ y = [1090717, 1050920, 1014918, 982806, 954635, 929845, 907619, 887411, 869081, 852693, 838230, 825450, 814090, 804174, 795904, 789212, 783698, 779093, 775510, 773124, 771850, 771480, 771897, 773124, 775462, 779581, 786014, 794387, 803588, 812870, 822406, 832627, 843628, 855572, 869089, 884697, 902103, 920535, 939514, 958998, 979173, 1000507, 1023587, 1048443, 1074435, 1101295, 1129782, 1160682, 1193617, 1227696, 1263012, 1300525, 1340519, 1382179, 1424938, 1469485, 1517158, 1568906, 1625138, 1686210, 1752862, 1826558, 1909513, 2004121, 2112394, 2236337, 2378735, 2543012, 2732305, 2949273, 3196789, 3478021, 3795278, 4148731, 4535733, 4950141, 5381738, 5817051, 6241926, 6644436, 7016738, 7355911, 7663762, 7945048, 8204605, 8445161, 8666396, 8864124]
50052H864124J65269J19919O1215p363q0518j53146k20714k79384l26817l62626
50042G779959l87596m02759m09237m08290m01014l88265l71062l50708l28347
50033D332681l04694k80345k55963k32071k09027j87369j67747j50360j34847
50024B410258j20926j08763r8523q9876q2249p5230o8613o2322n6572n1909m8745
50013A546530m6890m5601m4099m2053l9703l7540l5769l4135l2337l0388k8374
50002A129641k6129k3550k0975j8832j7012j5168j3368j1874j0441q631o850o145
49990I50666o634p074o471n320m623m377l833k869k055j596j109m74m9J66P53
49975I05101J863K718K659K359L209N654Q638J0809J1843J2489J3703J6011J9492
$$ y = [8864124, 9029393, 9149312, 9210527, 9203164, 9122646, 8969500, 8748786, 8469402, 8142585, 7779959, 7392363, 6989604, 6580367, 6172077, 5771063, 5382798, 5011736, 4661028, 4332681, 4027987, 3747642, 3491679, 3259608, 3050581, 2863212, 2695465, 2545105, 2410258, 2289332, 2180569, 2082046, 1992170, 1909921, 1834691, 1766078, 1703756, 1647184, 1595275, 1546530, 1499640, 1454039, 1409940, 1367887, 1328184, 1290644, 1254875, 1220740, 1188403, 1158015, 1129641, 1103512, 1079962, 1058987, 1040155, 1023143, 1007975, 994607, 982733, 972292, 963661, 956811, 950666, 944032, 936958, 930487, 925167, 920544, 916167, 912334, 909465, 907410, 905814, 904705, 904231, 904182, 904348, 905101, 906964, 909682, 912341, 914700, 917909, 923563, 932201, 943010, 954853, 967342, 981045, 997056, 1016548]
49962A016548K3911K8780L3579L8177M3084M9174N7116O7054P8786R2197J07456
49951A635862J24730J43841J64397J86245K09442K33287K55441K72402K81095
49942C506742K79924K68521K47351K18317J85475J54086J28186J08809R4412Q2389
49932E274212O9716N2694K7373q545n4012j05102j57067k05651k46855k76982
49922D369781k94126k99283k95147k83905k66907k46130k24497k04094j84983
49913B070709j66438j48750j32955j19329j07095r5585q4909p5443o7206n9922
49903A013077n3358m7480m2392l8125l4351l0625k7008k4100k2167k0658j8957
49892F53856j7227j6000j5272j4642j3981j3357j2538j1305j0110r604r620r384
$$ y = [1016548, 1040459, 1069239, 1102818, 1140995, 1184079, 1233253, 1290369, 1357423, 1436209, 1528406, 1635862, 1760592, 1904433, 2068830, 2255075, 2464517, 2697804, 2953245, 3225647, 3506742, 3786666, 4055187, 4302538, 4520855, 4706330, 4860416, 4988602, 5097411, 5191823, 5274212, 5343928, 5396622, 5423995, 5415450, 5361438, 5256336, 5099269, 4893618, 4646763, 4369781, 4075655, 3776372, 3481225, 3197320, 2930413, 2684283, 2459786, 2255692, 2070709, 1904271, 1755521, 1622566, 1503237, 1396142, 1300557, 1215648, 1140205, 1072999, 1013077, 959719, 912239, 869847, 831722, 797371, 766746, 739738, 715638, 693471, 672813, 653856, 636629, 620629, 605357, 590715, 576734, 563377, 550839, 539534, 529424, 519820, 510200, 500816]
49880E00816q725q212q050p743p087o598o533o223n065l586k893l274l961m140
49866D18726l794l496l621l914l785l065k214j661j244o88l34o82j359j374n17
49851C86978L05L53q1m10p10j330k136k624k519j898j051m93o72j342j692j401
49835C69277j003r06p50k56Rn38j430j747j368p64O1J387K725L051K174J028L72
49818C71322M8k41k74P5K87j62r75j426j310j071j096j308j393j226j041j243
49802C58966j990k938l570l737l642l371k774j911j177q28p21o84p62q38m83L49
49786C29889R02M33o78j278q97k56k03o78j071j145j125j104q83m21j7J33K49
49769C21850O19J112J326J124Q55Q88J145J183P25j3n74q29j070j488j707j104
$$ y = [500816, 492091, 483879, 475829, 468086, 460999, 454401, 447868, 441645, 436580, 432994, 430101, 426827, 422866, 418726, 414932, 411436, 407815, 403901, 400116, 397051, 394837, 393176, 391932, 391244, 390910, 390228, 388869, 387495, 386978, 387283, 387636, 387555, 387145, 386435, 385105, 382969, 380345, 377826, 375928, 374877, 374384, 373712, 372370, 370678, 369277, 368274, 367368, 366618, 366362, 366371, 365833, 364403, 362656, 361288, 360524, 360585, 361972, 364697, 367748, 369922, 370950, 371322, 371370, 371129, 370855, 370930, 371217, 371055, 370080, 368654, 367344, 366273, 365177, 363869, 362476, 361250, 360209, 358966, 356976, 354038, 350468, 346731, 343089, 339718, 336944, 335033, 333856, 333028, 332307, 331623, 330861, 330023, 329540, 329889, 330791, 331224, 330546, 329268, 328371, 328115, 327912, 327234, 326163, 325018, 323893, 322789, 321906, 321485, 321468, 321601, 321850, 322469, 323581, 324907, 326031, 326886, 327774, 328919, 330102, 330827, 330814, 330240, 329411, 328341, 326853, 325146, 324042]
49753C24042L42J785K309J856J180R26R96Q27J56o38r15m44K70M65q2p64q31k29
49735C31251L87M56Q4j76J01Q26J515J603R19j27q18p33m5P46J275J461J421J269
49717C41415J022O08M7m12m13J69J067J798J986J591R48N34N96R38J216J318J394
49700C55822J496J450J144P63O63J008J648K264K641K755K644K218J401M39r6
49685C78260J52R24J619J860J716J496J520J854K140J906J316J177J884K697K684
49670D03205K064J872K380K760K437J925J943K471L123L856M625M882M125K761
49656D44429J747J550J912K504L268M083M582M483L912L324L196L585L900L435
49642D89910K399J960K802M073M367L574K921L238M043M471M406M229M065L791
$$ y = [324042, 324384, 326169, 328478, 330334, 331514, 332440, 333436, 334263, 334419, 333781, 332866, 332422, 332692, 333157, 333075, 332311, 331480, 331251, 331638, 332094, 332178, 332002, 332103, 332929, 334444, 336047, 336966, 336839, 336021, 335288, 335243, 335989, 337264, 338725, 340146, 341415, 342437, 343045, 343092, 342680, 342267, 342436, 343503, 345301, 347287, 348878, 349826, 350360, 350956, 351894, 353110, 354428, 355822, 357318, 358768, 359912, 360675, 361338, 362346, 363994, 366258, 368899, 371654, 374298, 376516, 377917, 378356, 378260, 378412, 379336, 380955, 382815, 384531, 386027, 387547, 389401, 391541, 393447, 394763, 395940, 397824, 400521, 403205, 405269, 407141, 409521, 412281, 414718, 416643, 418586, 421057, 424180, 428036, 432661, 437543, 441668, 444429, 446176, 447726, 449638, 452142, 455410, 459493, 464075, 468558, 472470, 475794, 478990, 482575, 486475, 489910, 492309, 494269, 497071, 501144, 505511, 509085, 512006, 515244, 519287, 523758, 528164, 532393, 536458, 540249]
49628E40249L483L298L200L118L181L458L665L576L498L818M301M317L821L469
49614E90452L707M270M771N267N929O649P327Q073Q709Q570P533O713P270Q760
49600F84000R691R644R634J0181J0369R544Q733R276J0812J1854J1885J1631J1544
49587H18798J1368J1200J1726J2995J4082J4370J4350J4671J5125J5176J4782
49576I68643J4200J3489J2692J2108J1950J2103J2497J3241J4064J4240J3447
$$ y = [540249, 543732, 547030, 550230, 553348, 556529, 559987, 563652, 567228, 570726, 574544, 578845, 583162, 586983, 590452, 594159, 598429, 603200, 608467, 614396, 621045, 628372, 636445, 645154, 653724, 661257, 667970, 675240, 684000, 693691, 703335, 712969, 723150, 733519, 743063, 751796, 761072, 771884, 783738, 795623, 807254, 818798, 830166, 841366, 853092, 866087, 880169, 894539, 908889, 923560, 938685, 953861, 968643, 982843, 996332, 1009024, 1021132, 1033082, 1045185, 1057682, 1070923, 1084987, 1099227, 1112674]
$$ [...]
##END NTUPLES=NMR SPECTRUM
##END=
