##TITLE=NES1046_SeabridgeLH_9268578_QvbKUYwuHT
##JCAMPDX= 6.0         $$ Bruker NMR JCAMP-DX V2.0
##DATA TYPE= NMR SPECTRUM
##DATA CLASS= NTUPLES
##ORIGIN= BRUKER
##OWNER= Administrator
$$ 1.72 TOPSPIN		Version 2.1
$$ 2015-07-12 00:09:47.628 -0700  Administrator@X
$$ Compression mode = diff/dup
##.OBSERVE FREQUENCY= 400.02188249412
##.OBSERVE NUCLEUS= ^1H
##.ACQUISITION MODE= SIMULTANEOUS (DQD)
##.ACQUISITION SCHEME= undefined
##.AVERAGES= 8
##.DIGITISER RES= 22
##SPECTROMETER/DATA SYSTEM= spect
##.PULSE SEQUENCE= zg30
##.SOLVENT NAME= COFFEE_meoh
##.SHIFT REFERENCE= INTERNAL, COFFEE_meoh, 1, 14.98509
##AUDIT TRAIL= $$ (NUMBER, WHEN, WHO, WHERE, PROCESS, VERSION, WHAT)
$$ ##TITLE= Audit trail, TOPSPIN		Version 2.1
$$ ##JCAMPDX= 5.01
$$ ##ORIGIN= Bruker BioSpin GmbH
$$ ##OWNER= Administrator
$$ $$ E:\/data/COFFEE/nmr/NES1046_SeabridgeLH_9268578_QvbKUYwuHT/10/pdata/1/auditp.txt
$$ ##AUDIT TRAIL=  $$ (NUMBER, WHEN, WHO, WHERE, PROCESS, VERSION, WHAT)
(   1,<2015-07-12 00:09:40.347 -0700>,<Administrator>,<X>,<go>,<TOPSPIN 2.1>,
      <created by zg
	started at 2015-07-12 00:08:34.472 -0700,
	POWCHK enabled, PULCHK disabled,
       configuration hash MD5:
       21 0F 79 D6 B3 7B B4 F6 88 20 88 DB 03 48 BD 9F
       data hash MD5: 64K
       6E 85 4C BE C9 C9 6B DD A3 52 FB 5D 35 3E 11 E5>)
(   2,<2015-07-12 00:09:43.472 -0700>,<Administrator>,<X>,<proc1d>,<TOPSPIN 2.1>,
      <Start of raw data processing
       efp LB = 0 FT_mod = 6 PKNL = 1 PHC0 = 0 PHC1 = 0 SI = 32K 
       data hash MD5: 32K
       BF F3 4C 66 5B EE 89 31 82 EC 3E 6F DA 1E F8 3E>)
(   3,<2015-07-12 00:09:43.769 -0700>,<Administrator>,<X>,<proc1d>,<TOPSPIN 2.1>,
      <pk PHC0 = 93.32886 PHC1 = 0 
       data hash MD5: 32K
       A7 3D C5 EF 89 F6 9D A5 BE F7 5F 1D 72 69 C3 74>)
(   4,<2015-07-12 00:09:43.878 -0700>,<Administrator>,<X>,<proc1d>,<TOPSPIN 2.1>,
      <abs ABSG = 1 
       data hash MD5: 32K
       33 92 4E B2 F2 ED F0 C1 1D 7F FC 65 8B 2B CF 9E>)
(   5,<2015-07-12 00:09:43.941 -0700>,<Administrator>,<X>,<proc1d>,<TOPSPIN 2.1>,
      <abs ABSG = 2 
       data hash MD5: 32K
       6F 29 DB BF C1 16 B2 A0 D6 56 2D D9 A5 2B 54 C1>)
(   6,<2015-07-12 00:09:44.019 -0700>,<Administrator>,<X>,<proc1d>,<TOPSPIN 2.1>,
      <abs ABSG = 3 
       data hash MD5: 32K
       59 C9 C7 6F 08 87 BC DF 0E AF F8 C4 C3 C8 2F 68>)
(   7,<2015-07-12 00:09:44.081 -0700>,<Administrator>,<X>,<proc1d>,<TOPSPIN 2.1>,
      <abs ABSG = 4 
       data hash MD5: 32K
       8D CA 2D 5A 84 06 4A AD 2D 40 69 BD 7C CB C9 29>)
(   8,<2015-07-12 00:09:44.144 -0700>,<Administrator>,<X>,<proc1d>,<TOPSPIN 2.1>,
      <abs ABSG = 5 
       data hash MD5: 32K
       B7 61 9F DE 12 F1 80 21 89 22 05 CF 76 FE 7F 6A>)
$$ ##END=
$$ 
$$ $$ hash MD5
$$ $$ 2F 0D 62 9A C2 D4 F8 DE DB 15 A5 A9 81 0F 24 68
##$RELAX= 
##$RELAX= 
##$RELAX= 
##$RELAX= 
##$RELAX= 
##$RELAX= 
##$RELAX= 
$$ Bruker specific parameters
$$ --------------------------
##$DU= <E:\>
##$EXPNO= 10
$$ [...]
##$TP= (0..7)
150 150 150 150 150 150 150 150
##$TP07= 0
##$TPNAME0= <>
##$TPNAME1= <>
##$TPNAME2= <>
##$TPNAME3= <>
##$TPNAME4= <>
##$TPNAME5= <>
##$TPNAME6= <>
##$TPNAME7= <>
##$TPOAL= (0..7)
0.5 0.5 0.5 0.5 0.5 0.5 0.5 0.5
##$TPOFFS= (0..7)
0 0 0 0 0 0 0 0
##$TUNHIN= 0
##$TUNHOUT= 0
##$TUNXOUT= 0
##$USERA1= <user>
##$USERA2= <user>
##$USERA3= <user>
##$USERA4= <user>
##$USERA5= <user>
##$V9= 5
##$VALIST= <valist>
##$VCLIST= <CCCCCCCCCCCCCCC>
##$VD= 0
##$VDLIST= <DDDDDDDDDDDDDDD>
##$VPLIST= <PPPPPPPPPPPPPPP>
##$VTLIST= <TTTTTTTTTTTTTTT>
##$WBST= 2048
##$WBSW= 25
##$XGAIN= (0..3)
0 0 0 0
##$XL= 0
##$YL= 0
##$YMAX_a= 640207
##$YMIN_a= -530795
##$ZGOPTNS= <>
##$ZL1= 120
##$ZL2= 120
##$ZL3= 120
##$ZL4= 120
##$ABSF1= 14.98509
##$ABSF2= -5.573092
##$ABSG= 5
##$ABSL= 3
##$ALPHA= 0
##$AQORDER= 0
##$ASSFAC= 0
##$ASSFACI= 0
##$ASSFACX= 0
##$ASSWID= 0
##$AUNMP= <proc_prof1d_extract_pilot.lims>
##$AXLEFT= 0
##$AXNAME= <>
##$AXNUC= <1H>
##$AXRIGHT= 0
##$AXTYPE= 0
##$AXUNIT= <>
##$AZFE= 0.1
##$AZFW= 0.1
##$BCFW= 0
##$BC_mod= 0
##$BYTORDP= 0
##$COROFFS= 0
##$CY= 15
##$DATMOD= 1
##$DC= 0
##$DFILT= <>
##$DTYPP= 0
##$F1P= 0
##$F2P= 0
##$FCOR= 0.5
##$FTSIZE= 32768
##$FT_mod= 6
##$GAMMA= 0
##$GB= 0
##$INTBC= 1
##$INTSCL= 1
##$ISEN= 128
##$LB= 0
##$LEV0= 0
##$LPBIN= 0
##$MAXI= 10000
##$MC2= 0
##$MEAN= 0
##$ME_mod= 0
##$MI= 0
##$NCOEF= 0
##$NC_proc= -8
##$NLEV= 6
##$NOISF1= 0
##$NOISF2= 0
##$NSP= 0
##$NTH_PI= 0
##$NZP= 0
##$OFFSET= 14.98509
##$PC= 1
##$PHC0= 93.32886
##$PHC1= 0
##$PH_mod= 1
##$PKNL= yes
##$PPARMOD= 0
##$PPDIAG= 0
##$PPIPTYP= 0
##$PPMPNUM= 2147483647
##$PPRESOL= 1
##$PSCAL= 4
##$PSIGN= 0
##$PYNMP= <proc.py>
##$REVERSE= no
##$SF= 400.02
##$SI= 32768
##$SIGF1= 0
##$SIGF2= 0
##$SINO= 400
##$SIOLD= 32768
##$SPECTYP= <>
##$SREGLST= <1H.CDCl3>
##$SSB= 0
##$STSI= 32768
##$STSR= 0
##$SW_p= 8223.68421052631
##$SYMM= 0
##$S_DEV= 0
##$TDeff= 65536
##$TDoff= 0
##$TI= <>
##$TILT= no
##$TM1= 0
##$TM2= 0
##$TOPLEV= 0
##$USERP1= <user>
##$USERP2= <user>
##$USERP3= <user>
##$USERP4= <user>
##$USERP5= <user>
##$WDW= 1
##$XDIM= 32768
##$YMAX_p= 449568335
##$YMIN_p= -761870
##$CURPLOT= <Network HP LaserJet P1505>
##$CURPRIN= <$Network HP LaserJet P1505>
##$DFORMAT= <normdp>
##$LAYOUT= <+/1D_H.xwp>
##$LFORMAT= <normlp>
##$PFORMAT= <normpl>
##$SURQMSG= 1
$$ End of Bruker specific parameters
$$ ---------------------------------
##NTUPLES= NMR SPECTRUM
##VAR_NAME=  FREQUENCY,     SPECTRUM/REAL,   SPECTRUM/IMAG
##SYMBOL=    X,             R,               I
##VAR_TYPE=  INDEPENDENT,   DEPENDENT,       DEPENDENT
##VAR_FORM=  AFFN,          ASDF,            ASDF
##VAR_DIM=   32768,         32768,           32768
##UNITS=     HZ,            ARBITRARY UNITS, ARBITRARY UNITS
##FACTOR=    0.250966925370066, 1,           1
##FIRST=     8223.43324360094, -147395,      -67782
##LAST=      0,             -135419,         7777
##MIN=       0,             -761870,         0
##MAX=       8223.43324360094, 449568335,    0
$$ Real data points
##PAGE= N=1
##DATA TABLE= (X++(R..R)), XYDATA
$$ [...]
23737 -68086 268247 212307 -82907 -86077 -282041 369219 -72038 128038 -231687 -114008 181313
23725 113181 219687 167261 140978 34732 -145884 -82598 66933 -31674 348376 -75667 -133179
23714 -133179 260588 132404 -61585 -24564 -316883 -349730 38829 150334 -45031 118711
23703 199321 -211457 120445 -159386 115109 3785 -281589 -269595 -5108 -433556 -301399
23693 -301399 41124 -64005 332580 -260775 -145823 -267739 -159676 -134375 66 132855 -219313
23681 97032 73184 62216 60369 -52878 -157445 -76582 -89651 -124799 53419 85588 256463
23670 256463 -39551 -138302 31127 -179641 -403811 -143422 -67075 129167 -139157 288590
23659 -77139 -76501 -17916 67826 -94779 -51403 116615 157720 -136853 270937 118504 -227767
23647 -382356 378616 -106121 -17987 34632 139618 -327017 -262982 73399 -270946 72450
23636 -208395 -288722 24062 -249449 367960 136264 -160168 -55791 -154518 -288527 -390402
23626 -390402 238453 -125275 -58491 -251841 -179501 3199 22416 56896 75252 -9943 121577
23614 -219702 -362638 87661 -284640 -232639 -19167 -288057 -107605 105339 195690 -110584
23603 50605 88595 -89849 186884 98114 273467 155089 -23670 -10725 213590 -378790 -245198
23592 -245198 -281063 152590 66896 154225 -40762 286556 -9639 71992 252362 -28255 -38766
23581 -38766 300938 56333 223520 31916 -188157 -35195 99933 85461 175499 172102 -177247
23569 -82299 -291584 31446 -23778 -55619 -124906 -58655 26998 137627 -75782 98804 -61526
23557 -76901 -1683 267993 -194832 44375 80392 135201 -169714 418581 -172580 -57814 191479
23545 -223833 -120801 -5040 92638 44107 -20592 -51816 158443 109625 308118 -111337 -279683
23534 -279683 -256790 241479 -485 -91181 -102787 -141825 -117673 -171019 -270387 -257122 -227832 134415
23521 -44437 29962 -12746 -56830 -73713 -38692 -40712 225361 174196 87601 -12599 -382793
23510 -382793 27706 -50668 137404 -84525 112749 356828 -55417 197178 -119642 163917
23499 -189848 -68440 -76426 78015 -14249 -234736 -97778 -77042 145915 -10339 -285576 -114825
23487 5096 -121520 -266571 138979 -59405 -210968 -290605 -330683 46939 107260 -154972 74100
23475 -145716 -88878 166945 -288796 280206 -162155 153460 471193 246388 97430 -7832
23464 -361238 -227024 -74783 -26966 15274 -100289 -107856 -81773 469986 -116654 221920 107387
23452 -59126 -265186 105222 -184168 -78523 -82241 -49782 -175146 -139703 145015 55959 -122144
23440 -36760 -9891 63586 -41194 -187567 -25404 122095 -169056 -166701 -29059 -148934 31292
23428 97701 -177420 165576 -182886 68293 144167 84150 -125896 111882 96896 -145136
23417 -171149 102319 58784 208633 -162964 -86695 -61639 268412 -54129 360591 143305
23406 24741 220497 -46743 149203 -182954 231232 -40084 78053 26185 -181744 -379061
23396 -379061 3916 -270878 -20836 -186587 -155214 -25489 229856 -143698 -222837 -175283 -40362
23384 189157 49852 -200002 23468 -22119 -16476 -43462 -73665 214603 143388 -95842 -55104
23373 -55104 -59128 -46694 -59128 -81745 137005 -123328 41567 54331 193757 -89593 -201815
23362 -201815 29157 -285315 -207438 310124 -79254 -189586 -107545 42723 -40993 -43952 -109360
23351 -109360 -248490 102220 -221383 -1997 -64881 28609 -398603 165210 75163 117265 -85360
23339 63788 236758 -208021 435963 193034 226185 -40298 147543 -243446 -85329 -73585
23329 -73585 -95807 -239191 92373 -7784 184969 -83016 -85445 -42735 111521 7754 86442 21485
23316 -149862 62947 -388268 -193185 220848 242481 -20170 86015 -11597 48288 -122765 9376
23304 -81948 122394 -22599 7205 -86102 -248674 -10413 -166619 -112809 121349 -223451 -98364
23292 -19574 129437 -69247 -61514 146181 -309584 -235863 228862 -187166 345191 -102538
23281 181551 -59610 -963 -97030 25261 -55159 -71116 -129879 -65244 -170448 -105243 -206981
23270 -206981 79470 -171498 -381860 119101 -112755 -270527 -761870 -126730 25991 59880
23260 59880 143739 -100549 136283 -13227 32870 -310883 23334 182722 -72726 -91232 198663
23248 119227 15816 -289367 37900 59881 -151134 -33720 -122610 90114 371072 136790 277660
23237 277660 -88513 76468 47410 -315279 142678 138815 -92578 84638 -63247 215676 128630
23226 128630 149853 -63798 75642 -188152 -189285 75467 -82920 -12609 43685 -90654 -58114
23215 -58114 -274019 -248784 -197566 84497 142967 120 31542 204920 119198 -421989 -192368
23203 -42 -184890 -232583 93085 -76590 -174027 92791 -138199 218706 -84835 275697 239560
23192 239560 -264470 -270457 115121 -21281 9087 10507 62115 -5927 -161128 75883 87636 -152060
23179 65337 -232448 251456 -52401 -37885 37559 101229 48040 182349 -254729 179684 116462
23168 116462 -294769 -34086 105222 -59046 285894 317350 -19620 124034 56893 107219 -90960
23156 -30783 205390 -160295 -90218 312029 56168 48926 -14018 -17330 -20046 -98616 -90753 -59456
23144 -59456 -151479 136453 -48544 -19745 22981 14504 -364357 207238 -74210 18731 -226160
23132 -197503 -59858 160319 -91411 20007 78304 -184701 69610 -178512 104513 125149 106390
23121 106390 -77481 116854 22253 -6763 285485 181482 133008 299157 -18655 -251345 156228
23109 29065 -65702 -196955 390027 55364 -12319 222275 -80178 -185085 -142251 49709 143062
23098 143062 -86386 241210 -46909 -180258 -211797 173973 138574 -203880 -31211 -251442
23088 -251442 33790 50638 44787 19528 -143001 -137450 22785 16574 -77569 1794 -74756 -45057
23076 -45057 51271 -25218 -110639 -192185 -154614 35632 -28116 -164089 -10993 -305641 23246
23064 185211 -9707 -246020 -250577 -377014 -12447 255795 37137 -272594 72295 -303429 -32710
23052 194072 181549 14500 -10229 -12222 186271 -9679 -60358 -4128 -251827 76630 55913 -286170
23039 -136654 117919 -242389 33442 -219344 -46555 -195878 129219 7003 -339080 -228197
23029 -228197 107717 84593 225367 324324 116198 150148 125119 519726 96177 76877 -44269
23017 145001 -88007 140603 90485 -25632 -237481 8216 190696 -145442 -210792 -40355 43773
23005 146666 -34601 13577 335616 -169661 47312 -132739 -14332 24284 -396971 244291
22994 -152614 -89895 -235521 -145969 -63992 41963 -51962 130978 125222 -129362 -246749 263476
22982 -89001 -136174 19242 -378403 -222828 102446 -41861 -121390 130214 -4622 -24833 -137455
22971 -137455 -183976 -214277 132046 139378 173702 -118389 267115 -102792 35209 14407 118873
22960 118873 80590 33358 -280393 156340 105858 -74988 -49251 -52087 48440 -83117 -251762
22949 -251762 -124347 -94599 -105626 -11789 -69327 -111565 -299653 -16230 288084 -4793 223554
22937 -80708 -117343 144358 -189310 -47135 152876 -95495 135964 238785 248319 202970 -98294
22925 -125542 -358163 70862 108955 -121673 -133570 4099 57365 -106185 -18852 -107789 22698
22913 249804 -75584 -20268 -4822 -180437 -23031 -79496 -11691 -94592 -14716 50197 -181455
22901 -132742 -201263 -7130 199885 -130805 39103 209416 -231183 -152895 222824 16429 -49502
22889 7883 -77167 -61560 111745 220453 13696 -96132 206508 -97053 -377495 249071 -43308
22877 -37599 -47210 273359 28893 110448 -325961 -271395 -168498 -139298 -202828 42129 805 56134
22865 56134 -44253 -147235 213091 175288 190885 -143239 -119545 38812 143515 -176784 -47770
22853 -285234 -229688 16617 -4296 -157337 -10573 -99753 -51002 -255781 1650 236266 -252053
22841 -327555 -319746 29716 -262197 116521 -205144 -77301 151764 480276 334281 -21656
22830 -76415 -249464 -83672 -129275 -132254 229335 -195579 245304 -47417 -113863 -3286 297450
22818 -33840 -228793 -159026 -94433 -162021 -35128 168723 -57793 -560410 -139619 196080 -123021
22806 76935 88582 263304 -49640 -25948 141905 265919 183839 1219 -307202 -122979 -150701
22795 -150701 5840 59598 -287868 -71258 188220 -59443 -182144 131388 -133291 -98367 55013
22783 186057 -261155 -117493 32517 -502486 -60731 -143386 -91725 187895 -129331 -3366 98611
22771 -439068 292199 -247331 -156895 38227 113107 -3045 193080 -327789 -50622 -46713 20749
22759 -178508 -122625 -124273 -159538 -77505 -104967 -155825 242770 -68865 360537 -129700 -377288
22748 -377288 -5893 -135956 -88389 52039 62013 101340 139508 67439 -55288 -254916 -67583
22736 -93677 188097 -310122 -131049 131772 -13059 -216230 -341981 -248809 69921 152714
22726 152714 -253218 2981 -52098 162067 92163 148729 -118893 -101291 31232 95650 68065
22715 68065 -117384 -81634 3103 -6596 165822 180381 753 112844 141477 -138015 -428365
22704 -428365 -51513 130053 -554 -107659 -156483 136186 -78368 78934 -56880 46397 54050
22693 54050 -3827 35342 -81804 -285278 62483 -42996 -32331 -31677 -139569 397468 -275983
22681 69963 245732 143819 -300041 57088 -85057 -87855 -385223 -214702 -90827 -34426 26363
22669 -162976 -82757 -33746 33554 15772 192223 -129421 28761 -125650 -164527 -293784 -152269
22658 -152269 66986 -66557 34704 -150133 -289517 -13860 137041 56485 -176034 145178
22647 -135666 71411 -137622 58059 86954 55848 -167070 -146439 -141377 27125 48054 25989
22636 25989 144612 -246730 212443 30362 9206 105867 -336126 -122098 -225545 -35596 -152926
22625 -152926 -32708 -283441 338554 -500333 -309335 -5477 -163541 15281 -54718 -255341
22615 -255341 -40800 -104027 -373757 192214 -140969 -3799 76536 -62143 -206780 208806 183638
22604 183638 -46642 204942 184878 210922 -382634 -183075 291646 54267 -170517 -19481
22593 154165 41330 122062 -31654 -12909 -186844 57744 -140048 -245895 -288335 -283376 47410
22581 57119 40089 -48069 -20779 -115853 -74325 188121 285886 105117 -200882 128634 -103982
22569 -191704 -269643 64887 -163884 -120731 229427 -98182 -147101 -46260 -107835 181605 25754
22557 62555 -137246 107442 -126988 -107418 -95971 -147706 -95788 221556 -71280 45165 45527
22546 45527 40248 -339823 304003 -403222 -368798 -396544 -244420 2434 6918 -67031 92261
22534 -76617 -152654 -96103 -31275 103746 189645 46136 -59954 -150313 -164300 40912 -115050
22522 -8541 -159107 -122759 -242763 267248 -82155 109617 135386 -293838 -128706 -54902 21958
22510 -178942 -83204 -99863 55259 -232457 -95392 76788 -32998 -277724 -183614 20047 -35155
22498 18734 41250 6110 -34520 305600 -59807 197996 -206865 -290456 86841 -8304 42475
22486 121115 38249 -117893 -115916 150224 61411 25230 15460 -18707 -195366 134 -193630
22474 34637 118483 -112025 224700 63240 -140529 -272885 111500 159734 14673 -80670 -28617
22462 -87699 -37850 -75775 -204845 92765 50141 129956 -14225 -60108 -124021 49559 -284361
22450 -297082 -29532 -132655 -104331 -51068 -38644 -161815 -227405 -44383 225321 55805 -207145
22438 290543 19653 55195 -162167 -57611 -269713 173867 -80567 150439 -22834 -5763 -375686
22427 -375686 116964 -222831 -154354 56861 -141115 187994 -36242 -25382 -9955 -116621 -37926
22415 119019 -28865 -8719 250892 64559 -62238 129797 -105444 -220700 -311837 -323874 286886
22403 -144732 163673 -32756 -277632 -262416 -183038 91783 -28335 31039 51316 -115943 -29633
22391 -96546 -161351 -86779 41623 -199357 112461 213881 -72377 -281859 -214540 181587 26936
22379 -158336 -19483 129223 -57353 -196301 -131550 192557 131294 130257 -113958 -189551 -132747
22368 -132747 108126 148429 -297247 -66531 85834 -74935 -20482 48485 143077 4290 -104532
22356 222499 -187353 -176808 135034 -84492 -97195 370372 -296151 -17384 -57962 -11419 -74570
22345 -74570 99188 -165693 294805 -202194 18559 -81340 -124467 -49473 -134028 -112162 -163574
22334 -163574 -131252 -199300 -50289 -104113 -154573 -274789 -113198 -309222 -110121 -15979 -168582
22323 -168582 49408 -76517 -115290 -342939 -262081 -9381 -97168 -11327 -373563 -147714 1115
22311 60505 28721 -118957 -147122 -212176 1236 -570153 -302216 -193893 244548 -163894 12001
22299 84598 82647 44517 18725 -88411 71559 64323 -318031 32824 3557 133016 -27338 131443
22286 -7820 -26034 -55009 -13132 19386 -54353 30814 130064 -95455 -208987 17262 -293062
22274 249226 -29982 -212839 -418922 -234508 21832 -74154 -44461 100476 169074 286222
22264 286222 23029 61470 89521 -33530 -251554 72482 -137965 26346 -449756 -139670 156508
22252 -212234 -34392 74674 -98038 -200934 -120249 68075 -20013 193113 -49691 -1569 -37964
22241 -37964 -152284 39600 -86071 154303 115158 -257297 -99174 110953 -105957 -97062 -98559
22230 -98559 115526 -13642 -200776 -84087 -290135 -273418 72507 130642 -218077 34025 96435
22219 96435 -122614 79605 -143639 -63521 -73260 -194211 -333113 -141285 -47772 250809 -155137
22207 -139055 -182126 -270831 139262 -123030 -63476 53218 -150133 1689 -63990 -126949 2881
22195 -229992 300430 -120017 -203859 -455354 -16695 44280 -76993 20132 159815 24985 210147
22184 210147 128251 -90228 77448 93261 71760 289351 -238153 66206 -32640 16532 82107
22173 82107 79006 41724 -48863 -201549 -86442 217651 27304 -70773 29628 -154389 217479
22161 -56274 -163947 -316441 -19495 38348 -113721 -100192 -91664 29774 75694 98069 48033
22149 -27238 7548 -362980 60987 -258455 -155509 -331790 42219 49059 69521 15624 -192352
22137 24784 -68658 -299247 178880 -200402 132437 4428 419784 -158134 114959 75087
22127 75087 -62523 182470 197438 -111669 -130607 -48125 -110802 144516 155746 175368 -146477
22115 41975 -140501 146375 103199 109143 11234 -350883 -44701 291925 133007 79896 885
22103 123671 -454395 -41582 -267388 -97394 -183256 -89772 170464 -99923 -76670 -79425 -188696
22092 -188696 -161544 -323529 93440 -357015 62579 -205111 -71906 -34383 -22036 -76915 197940
22080 -67896 75872 59229 -78734 -70554 37318 -305451 107547 297553 -49396 327054 -313330
22068 140640 205144 109408 -173022 8524 -50145 -343281 249449 52321 -357926 -132142 88111
22056 8106 -109879 -8826 -289968 -127831 -154034 67506 -111108 191556 168798 -121089 57865
22044 -76599 6950 -4637 -183108 122674 -190826 -24232 69884 143893 -114259 -354167 -114712
22032 -80995 132240 -402380 -140078 87892 189032 -155831 -151289 -245206 181526 -14268 -253477
22021 -253477 -163910 145426 -222164 186169 1344 -28883 -37613 -310083 -88666 -348885 -28444
22009 56196 49997 -161781 188965 -122538 -284128 97314 -118955 -386233 -85442 -383036
21999 -383036 -220905 -160059 114152 360110 -78777 329501 -10933 274312 -87707 -262387
21989 -262387 -277378 -295970 -75341 277144 -428239 -53580 62 128521 7561 50172 31984 -224864
21976 18715 -386521 -130306 259377 -79272 4124 193650 66511 37965 -23475 182074 -262284
21964 -201649 63130 -225295 -119206 20802 -34276 171192 -446 -262605 -242344 -263011 8778
21952 64292 -57546 45795 -188520 -16638 -201732 130980 -159805 150502 -186198 158462
21941 -107126 -1892 -86497 -168923 -70216 174775 -279523 -72565 -231843 53530 18145 67497
21930 67497 -12603 -40196 -78218 -153241 -32917 35382 -50059 87292 -134755 69345 -250190
21918 -96583 -41855 -192667 -96122 163310 47122 -441338 -87697 158070 136755 223320 167727
21907 167727 -68199 328502 191714 -49925 -124448 173010 365776 46161 13181 -69204 -210663
21896 -210663 174059 -235260 -448824 88489 182413 -314899 36888 -63834 -222384 -155541
21886 -155541 16126 -153980 285433 -100311 -151022 -86717 -72074 -46751 57914 -67066 -111812
21875 -111812 -309661 -183335 -118796 -116415 121233 -14449 -278583 -175060 31436 120950 -317457
21863 -96087 -254444 86314 -132606 -168334 -94095 -100687 217042 -23406 -83039 -267780 -177482
21852 -177482 -15647 -50641 122277 8841 -39484 -201835 -48181 23382 -259498 148792 81519
21841 81519 195066 118268 166913 -132127 -190372 -28697 -142202 129084 -121031 157362
21830 43745 -110104 -318802 -156243 -69142 -103210 61845 -64123 155061 304684 -25365 -67618
21819 -67618 2288 10765 -137920 208123 -279238 140604 -137521 194367 161898 -255522 -179562
21808 -179562 -165439 170748 -24071 264258 -88859 21688 241022 -120319 205864 -183023
21797 -327184 -300282 101289 148953 -133109 144575 -60241 -44410 202239 -114076 220500
21786 -29057 -4861 -228964 -468721 -290427 -194867 -299613 -90099 -27237 -76584 -6640 -100483
21775 -100483 6108 -59500 169579 51924 -74712 -63614 -103352 -76788 -189432 46175 -87111
21763 -195971 3983 44355 200284 -243317 -182842 251521 -81714 -416851 -114607 14634 135135
21752 135135 -338204 -233319 -159928 -256402 303519 86828 116399 231610 100673 136467
21742 136467 269449 -87759 -442888 -24233 -17229 272759 255016 99736 267934 -44485 4439
21730 -49726 -67320 57050 -205269 -307446 293697 -20962 -142867 37427 -542832 89787 -291236
21718 -172869 -59264 53479 8299 -61741 -310843 -83605 -497805 -168495 -99609 93421 -68304
21706 183189 -132971 -353949 -99040 -236204 8292 -241307 142365 12403 328089 -149049
21695 -9413 52975 -122846 49566 353100 205821 96412 -45096 171379 15882 -190083 27996
21683 91621 50394 41125 -91080 -235845 -75710 27361 -145965 -160324 -330848 1976 -653729
21671 283824 -57225 45364 -375896 -747 -149298 243180 115559 -323680 -181666 -17769 -187682
21660 -187682 121420 -62014 87623 104430 52441 175447 -66032 -139893 28103 22538 -282201
21648 -435255 6955 -125245 58825 -11219 -60469 -357897 -261812 -262156 -140464 -218902 -395626
21637 -395626 10424 -85888 -270479 -41671 94336 289264 -30155 -232168 92548 -291916 -50024
21625 -287093 -44212 194597 32538 203899 -25940 39006 -109951 127696 -236938 -34383
21614 -20310 -513117 384009 280180 -200831 -274822 28962 -163572 -127502 80370 61149 -86330
21602 -156034 35212 -22927 -176420 -89721 77176 -384883 39942 -153986 294153 -99161 -90034
21591 -90034 -231760 -151533 -278205 -142972 -39970 -118520 -199867 -130081 -131267 172036 49674
21579 102330 -47270 -35292 -28087 -139411 12378 120820 132418 -336768 26030 -97816 62833
21567 71131 -10904 288973 -433415 -99095 -113294 -105901 -332606 -260045 31485 -526833 6152
21555 -317744 -295399 239285 186709 30207 -146820 -81687 -187849 -48505 5425 1406 388490
21544 388490 16738 49826 60279 -193426 -314396 -281445 90952 -16923 -2466 -241376 -260098
21533 -260098 -359900 -155672 -42937 -258193 44605 1865 -107862 -251400 -213570 -179178 -410205
21522 -410205 -91020 8604 48620 -161132 -297032 160400 -90379 30816 -48396 -39058 -164284
21511 -164284 -87939 -35683 -54619 -114503 167299 35913 -98181 -166591 -122051 105446 -67329
21499 4895 -80728 -186749 -31926 38625 -58671 -33354 100123 47363 34588 260593 3893
21487 249286 88685 1834 117604 -119742 79438 -54780 44087 14739 -384360 332301 42361
21475 53955 94316 -284241 -120808 -257061 -269318 12402 -148144 133223 106018 -42810 97916
21463 515664 -235976 18916 -41332 13336 3246 -127998 -161696 114158 -66272 395383 125131
21451 -170615 -61779 42837 -35520 512158 111333 191105 420021 487365 316319 747772
21441 747772 266554 238873 202993 -74358 -117913 60165 115049 -171997 147681 -246332 4535
21429 -95691 -32155 183713 -95611 -51139 -258638 -71378 -116583 -92150 -242713 143789 -18420
21417 59822 7625 -354611 19623 -308691 -197128 -92605 -80242 -203445 -170474 86446 -194266
21405 20452 122083 -52975 174160 -28765 -45619 149663 -223111 25099 210228 -473068
21394 -366199 -96657 -45874 -30500 35316 -187658 83718 88352 257000 270010 287752 201016
21383 201016 -86928 82381 82174 -68448 56783 -106033 248212 -112220 -13143 -156543 90453
21371 -237123 51303 -259372 -233937 -168121 327233 -43041 -16139 -132806 155124 -257895
21360 -256186 -119521 33792 70732 202565 18442 -33595 -117632 110403 71891 -141683 -359206
21349 -359206 -84829 45218 -41433 142913 -180790 171005 -334146 -165594 74909 -557927
21338 73657 175695 -120344 -154424 -329202 170686 -84367 -468221 388470 -191021 206608
21327 125162 16078 -182747 143200 333720 -13016 101289 159701 -154480 257383 -92165
21316 -95834 -216898 22033 -8966 186040 198 32568 -166010 -124317 172186 -117947 -99360
21305 -99360 -57194 350423 144538 -15159 198174 -179650 65289 -181919 -358651 -294163
21295 -294163 40188 -86145 256607 -17841 -419360 -178439 313194 11926 -36961 -73042 90099
21283 112854 -333679 214484 -151975 6465 -68139 -126735 -19065 -80479 -301374 108074 -133562
21271 319576 -432154 109245 196582 -58834 -247858 18553 120277 -244801 124586 -78204
21260 -61900 -30940 -212119 10687 -6083 52048 299039 496379 -93491 -214527 -385193 101315
21248 -177204 162365 -337092 91400 -142106 -98093 -190706 298347 415310 -27547 -149153
21238 -149153 -13281 -124880 -336730 -96038 -196416 -101569 -96681 -48197 225220 -377792 -142580
21226 -130389 59368 199822 -42168 26302 -126423 -96892 589 86758 92328 247699 183784
21215 183784 -231116 -14892 -265612 -145344 172642 -127931 127022 -99771 -195121 -154675
21205 -154675 -353303 -148562 -418 -234797 -20523 -18265 300536 48606 21683 13775 37648
21194 37648 -55911 -174555 -260632 95786 204290 -382936 -114596 156613 -123409 -1196 -42989
21183 -42989 75173 -126037 535347 -53955 -189529 198908 -51732 45907 -71876 -278839 248785
21171 14750 -60491 -379519 85739 29890 245760 -15863 228528 90934 -245295 -300820 251380
21159 -94746 -153797 -210636 74739 -265032 -93117 -51517 -31919 -203314 -82453 -167490 -174813
21148 -174813 235630 -133752 -6151 -66149 -79334 50678 -264880 -306861 -220298 -161106 -154180
21137 -154180 48345 -180736 -138496 -100547 -50247 -105254 135736 -278386 149262 182982 -481843
21125 104736 -186616 219129 7835 -455061 30980 67997 171831 -140926 -69871 280671
21114 -90320 -140728 -95664 -202477 84177 -267878 -119460 -156419 106256 132602 45107 141959
21103 141959 -310105 130662 141460 402489 -65704 -201420 -124066 2333 -64933 -216633 -47824
21091 -154901 -411914 -44826 -332438 72794 -250777 -3445 239037 254564 5522 11470 -119708
21079 -8127 -157054 4170 -39532 -123642 2645 62940 86131 -374436 -226146 62776 129828 -19751
21066 -189982 -2093 -203790 39034 47656 -172987 -177693 23283 132486 15270 -98543 180311
21054 -341175 -247863 245693 13022 -259760 -36123 57674 -22012 -20442 11728 -159993 14122
21042 -100689 -233563 -50617 -90176 -76395 245318 37151 -126757 -50365 -169003 -317405
21032 -317405 31325 -3613 23472 -22893 266837 -189454 236685 -282075 223479 -32140 353658
21020 14184 157626 -19759 120806 -45414 74120 -134784 -32994 92848 -374057 142947 92550
21009 92550 -149428 198902 -211897 117122 -112556 -18158 -6678 -260189 30912 -91350 173415
20997 -134313 -197709 139399 -158494 -15096 -334781 -252182 304691 1913 -402322 -199135
20986 90536 -315590 -124147 -119222 -149357 31955 -249582 264584 -107423 80660 45815 -85460
20974 -77417 -126951 16637 79515 72205 -50300 233546 -113000 -164885 114636 42862 -152767
20962 -75565 193210 -65357 19678 78442 41855 -42876 26548 12964 75938 -115542 -139144
20951 -139144 26322 -256548 77612 -33314 30906 -133418 -76044 197122 54939 24627 98465
20940 98465 -263347 106856 210887 165944 170750 80485 -109924 293809 150090 -113159
20929 -464689 -119629 -218058 13843 -62184 -9485 -124228 9656 -199529 -159020 -425755 -176633
20917 -245191 128908 -145073 -122503 -143290 -135382 -41494 -196504 -235299 28817 -225482 -169974
20906 -169974 -294055 -106581 -35306 105448 -37892 -266245 59952 281378 26891 63996
20896 63996 -96738 -90625 113639 165225 -290113 95918 -235803 -96415 -40188 -410155 -70449
20884 30983 -197834 -180724 -179050 -123758 -186326 212688 237951 32562 -222061 70197 75603
20873 75603 236488 -288302 25536 80070 -231489 -138527 -261242 47688 -86468 -234049 183081
20861 -276298 -317927 -151250 -109884 -339933 -268555 -250231 -70366 69037 -79041 -166753 95573
20849 122132 -151007 59239 -48662 -39314 -11891 -102499 -191109 -35241 -91778 256250 20668
20837 48964 -93702 -139905 -109149 250662 -57956 -72643 -183781 -141755 -16561 -77005 -458560
20826 -458560 -303086 -89213 96544 15234 -55098 -75369 -442213 92308 -206956 -101537 -64253
20815 -64253 237012 -117515 -88497 32167 95647 31391 -200393 -120641 92025 43916 76128
20804 76128 -109634 -54832 21370 -356441 -167995 39117 296055 -184439 28690 199959
20794 199959 -128344 122967 169614 310266 -215922 -239644 61438 -261846 -63055 -307270
20784 -307270 -22421 53321 -258060 -103381 -21331 -277848 -52579 -199255 -117840 -162426 -37562
20772 -341251 -118472 22749 111434 -112559 -78637 -264821 323891 121516 60035 -184152
20761 211270 -206858 -97402 -156487 -292152 -26011 -146214 -203979 61523 -255916 213354
20750 -28242 51588 -112290 -228009 225729 1537 113672 -178538 86666 98624 -126030 -119770
20739 -119770 141890 -224895 -56741 270181 194395 -202056 -405288 56178 -278945 131297
20728 98573 -89939 -331101 31482 -244037 -124475 -278407 77216 -92009 -138989 -21834 -59288
20717 -59288 159558 -133275 -19821 -97526 -232441 -129920 108136 -110800 -192531 -122787
20707 -122787 175034 -220439 214330 61288 -42075 -64791 -310656 -289429 6069 -174761 -11297
20695 -79779 130553 -33495 -241086 -96760 -22955 152821 -244512 47232 22299 124521 -259046
20683 -146938 -49197 -502842 127887 56775 -403411 -26959 -36651 -189919 -49334 -63463 -172385
20672 -172385 -34261 -203012 1337 -180899 77636 -234166 -297179 271826 124120 -117670
20661 -143600 271664 -187374 198895 114802 -12473 -44196 42970 20884 223964 97603 305816
20650 305816 26984 -108030 207497 -363822 34174 -319501 -267174 -55243 53502 -28027 -299188
20639 -299188 -213462 -72895 267847 -45937 -63273 -255065 148890 -329599 -382676 -201726
20629 -201726 -123850 -44115 97716 -168807 -135066 -47830 27308 204310 -141410 54266 25490
20617 -153491 -351450 247141 96471 26276 -34461 -183383 -134683 -192054 -50712 -148782 43471
20605 -103704 -371941 82372 -74653 -241542 -24837 -94549 141300 -107921 -101457 -295396 5353
20593 -370212 -18644 326394 -8509 243073 -5008 67916 -140880 157702 -31668 -103147 16398
20581 184959 -150750 -92751 -273986 72595 198313 -269101 207562 86507 101871 -299396
20570 -2212 -99027 -40710 -219344 -65428 99687 -99730 -99931 -199890 175545 123223 -318934 93261
20557 -157673 -222670 -48194 -77273 -54734 -92648 -64841 -126270 109824 -371468 105368 -121214
20545 121087 -270782 128016 144391 -264462 92011 -16803 -284185 -46053 22751 -66906 -118166
20534 -118166 415737 -169035 -306166 -64373 41576 -161419 170101 -395109 -35380 18643
20523 -243651 -76037 -184008 -388206 160731 8737 -95977 -121419 197077 9889 172644 -59566
20511 -40057 -206011 17492 45749 -461370 -86765 223189 107912 53317 108658 -105701 -201521
20500 -201521 -56635 -344857 88161 -183063 -24631 90264 171065 -282427 164578 -137624
20489 243473 -197929 116399 -41499 168918 -114886 -24575 -11074 -211144 -101398 -151115
20479 -151115 -78737 208309 -61994 163700 211048 -33862 -150610 99086 -137026 177862
20468 -146987 84121 224504 -265181 -89660 202163 -81292 -60325 -156997 -108654 24715 4046
20456 131477 -246850 -32753 -282351 351243 -155393 -201405 -65824 -239631 291114 274570
20446 274570 125358 -251484 57142 -630985 -406736 -253590 -5713 -364979 -275462 -462049
20436 -462049 -40696 40476 -136742 -17032 -257617 -66675 479323 -8164 -71009 -245361 -365541
20425 -365541 -25691 -286567 -74169 -12217 -12154 48846 63175 24734 -224013 -143896 26145 -35844
20412 -239233 23549 -158268 53327 100337 -204654 -105255 -314936 -81668 20667 260127 -197283
20400 -205046 -32369 87307 -249259 -5383 56922 -28080 -153685 -9238 -71109 -40363 -22034
20389 -22034 -56105 -250817 -29882 -46528 10920 -220708 407724 -135786 -69128 217567 -90228
20377 47799 145937 -76425 219121 -274130 -230367 166091 -195527 85405 18515 -90451 -63806
20366 -63806 -229192 -147641 118159 62865 -224796 83187 -242078 205875 -14567 115361
20355 -31863 135106 304568 -245218 54502 -283994 -408839 31470 -65208 -73824 -128376 -58103
20343 -147255 435532 -82685 -246135 -115076 -123370 -224323 133193 136731 -108878 47311 -219439
20331 -58975 165156 -372931 41192 -80841 71428 -38597 -391612 145696 -278392 302630
20320 -85974 -101306 -281989 -318295 -272166 68197 63340 -247456 -179269 -27974 -418203 37572
20308 29667 36821 134288 7776 37786 -219766 -269474 -238745 -82317 -209781 46608 13091 186973
20296 186973 5990 43040 -98415 -278707 217767 -209067 -330986 37664 -276707 -20809 -202107
20285 -202107 -110213 -79686 -348977 -235156 -94659 179689 -47779 -23987 -147801 17277 -113755
20273 43301 -112895 -81567 -9549 -343632 72001 -312660 29021 -138872 -110286 -8340 131674
20261 124816 58131 -29953 154471 158534 -366502 -292803 -85947 -329054 58228 -46009 10083
20249 68729 115687 -108346 -239318 -32078 -107974 97451 -58637 15962 -47259 -351514 87996
20237 -116845 -17330 -92489 -60264 6738 234497 227189 123161 -288975 107694 -163393 -159212
20226 -159212 -206667 234091 -164994 -86822 -11118 -197111 -118063 22490 -168466 -29205 -243215
20215 -243215 -126712 275174 -111398 229219 -102837 60181 -322239 -55857 -191887 139202
20204 -146502 51379 -164126 -125662 -63935 -139281 -86018 49523 -159851 209433 116511 -50588
20192 -383975 243547 -52404 -222572 -12120 9155 213684 -91292 -245797 -23317 -194058 -279310
20181 -279310 -122009 146864 27794 -88942 -61386 -55388 177763 -255942 -97537 232095 132097
20170 132097 -69233 -93567 -123390 -111509 -7390 28867 348096 -333066 -60014 -51119 73131
20158 -238269 -182922 100377 -102831 -476509 -144431 23089 170946 279657 254815 279001
20148 279001 403824 135783 297378 -249827 195585 -66263 88037 366263 110722 -124814
20137 9630 -130942 -288385 -369668 92460 221182 -51193 -47205 -464148 27666 -12246 28635
20125 -88955 -45604 -16089 4056 -271892 225922 61028 34348 -85342 -223251 -265345 -321382
20114 -321382 -37143 -243600 161844 -15937 8412 -297140 -152725 -138444 85513 46109 -207846
20102 50699 -333367 -148075 -132676 -175270 -62346 -154420 -270299 274706 -253432 112839
20091 -16169 39999 -162645 27262 -147056 -425697 -190893 17471 69450 -38226 40921 113379
20080 113379 -98044 -110393 -107272 -170447 -44454 197383 -73627 126166 -149062 100296 177072
20069 177072 206800 -200148 118475 -128991 107496 -202932 -101364 -206513 36271 -137548
20058 63527 61209 23747 -286405 -76922 -87561 -99805 -331666 -3960 -234804 -158765 -160345 -52387
20045 143993 -256674 -78617 -52373 -139027 28955 213871 163146 105642 -102614 320105 202708
20034 202708 -80964 81953 219495 61101 -248285 -24598 -187205 394310 -67563 -27137 228949
20022 -224865 -135689 -26467 184643 -155040 -148534 -44101 -17448 -65484 -3282 -132055 -297683
20011 -297683 2051 -366043 111311 58501 130200 -243747 129595 -253549 -123948 129377
20000 -211364 -89638 320582 102712 179755 -403695 -18612 13906 -213961 450174 -52127
19989 -104383 -13779 128046 75836 90669 349463 5189 220618 60600 -106162 -70870 -187333
19978 -187333 167657 88255 6839 -187600 9490 -314157 9059 208681 -253192 -189459 -254629
19967 -254629 381808 -60719 -412689 272333 -15189 351967 164697 -201832 134918 166843
19957 166843 -372852 352003 191021 -112284 367573 -25121 -17260 143912 11386 309806
19947 309806 -209874 -13071 -260140 93162 -168009 -199868 -179804 -76039 -183443 14598 39996
19936 39996 85451 150450 -94443 -62323 26324 -40707 -206098 -29378 -248096 41887 -327255
19924 -96639 160720 -15299 -206376 -148500 -312194 286927 43606 188000 -40731 -260519
19914 -260519 -129762 -350291 -204368 -30226 -220194 -122984 -107102 127930 49976 -50876
19903 -15223 95740 -190895 -141955 -331838 -370416 -118028 -62884 -435944 130556 33562 -25291
19891 -212439 3167 -153612 290006 11047 -55610 258465 -74851 -92916 -248130 261723 12182
19879 43024 161194 -171388 114926 -407029 175032 44805 -94835 -14916 -221008 -215027 95007
19867 -90554 -326372 -233460 167696 -164547 172611 -11876 -69485 -246308 20428 -115043
19856 -104682 -22546 -115072 -278021 5672 395252 -102258 -271442 135408 -192763 -19898
19845 -318666 11093 -312402 327951 74707 -99672 -264517 -219340 -1552 -244149 -265674 -183540
19834 -183540 -23965 -222527 -214728 323418 -120169 -31157 135807 -79696 98782 -30480 -78957
19823 -78957 59183 121079 67134 89795 -190084 280974 -228563 188011 60314 192456 88914
19811 203768 38621 94661 -198288 48969 -305741 -305361 -321022 120605 44793 155093 -63466
19799 57785 -227614 -75535 -106923 -286361 -243552 -262659 -86490 -38215 152183 21524 -309080
19787 71051 160854 -274019 -155296 -51542 -206727 193940 -219667 -5605 -12847 -217893 -256896
19776 -256896 70407 -6605 -173911 -38677 -162043 -220614 -184772 -117509 301814 -136792 -240068
19765 -240068 -86665 -440370 -186258 102786 175390 -197578 14150 -192184 -241938 -11323
19754 214097 -250612 86343 -44908 -151881 -145371 -149633 136820 -227119 119831 204975 -26771
19742 -132100 264054 178830 -70239 -137713 -350291 21132 -96731 198167 136272 299127 93655
19730 162782 20802 -21616 -76930 281139 337044 46569 275712 -374735 -142067 61272 -128440
19718 -27209 -37606 -328125 55444 102464 158893 99884 -303015 -160286 -53664 64378 -174582
19706 -50591 112370 17776 -65378 -76120 -135117 380337 275529 174705 307384 17100 253238
19695 253238 -252001 79676 258528 -29363 -110780 76587 -138860 20801 11210 -106889 -17258
19683 116112 -165987 -45699 -95844 -172554 25017 -152263 356429 -31214 406448 -218001
19672 98104 -324845 157198 89059 -14301 -79657 -44264 -454988 -10531 -57696 -180142 39178
19660 -233172 -304880 38392 -83965 -303552 -2489 27439 23855 103708 143147 -75803 94971 -59238
19647 -46679 146176 -133057 -368152 -414153 -80167 -75415 -41689 -75608 -469935 16865 6430
19635 32888 -287731 -105308 -160731 140933 -13493 -292236 -183259 -207602 243686 -389038
19624 4313 38972 -58117 49798 217338 -155522 -138876 105279 49870 -198261 8637 -292523
19612 414653 273739 -263354 -104722 -249337 138344 -385562 33408 -2618 -65088 -367823
19602 -367823 -134793 95120 29816 -171701 -230540 -248414 -62945 -294156 -119275 -206303 -367349
19591 -367349 57443 -24623 23884 -31647 -277479 44588 57476 -107980 278009 39887 -281674
19579 328232 -333944 140041 -206368 63870 62731 46705 105429 57449 -230869 -242762 117418
19567 84347 14382 -136293 334189 30507 -292108 -159701 -242900 16712 -51088 295218 148051
19556 148051 51196 -288331 187071 65632 101587 -193271 152745 128008 18626 135074
19546 135074 -197461 109810 104258 81740 -287049 97210 31633 -164972 -281943 -186791 -67229
19534 134711 335151 -49346 61782 -223550 -238908 -418802 -260447 200882 -13695 196939
19523 -231751 -6912 -205109 -90462 50915 -176129 88255 117044 -210033 -16165 87581 -109657
19511 -117364 155865 44395 -13665 -133688 -118711 157382 -325233 11183 149993 158597 175961
19500 175961 -19851 -76165 81205 -229285 -397746 152555 160122 -198581 173808 53302 11735
19488 -134132 44657 -277506 -26285 -69572 -14686 53087 -124453 -164514 -152781 -117207 -280103
19477 -280103 137536 -363147 -1059 99741 -313369 -23916 101210 -273446 -116514 -148373
19467 -148373 -281426 181711 -249967 -90047 -130281 -198299 56389 -184484 -487229 171481
19456 -159943 118283 -251216 -15887 -98784 -346613 -178568 -156895 -93719 62676 -135296
19445 -126553 62714 -371278 46924 152750 -65375 -68485 -31073 -399845 -54683 130283 48299
19433 -64552 -135258 13158 -27597 -176245 77290 -36579 -201258 82138 -36414 21594 -64964
19421 -136500 -57146 -284151 53004 -109446 227996 250731 -118729 -117574 4431 5473 147210
19410 147210 -246354 20292 -60249 -269229 199335 -335614 80199 -209333 -175356 78227
19399 32573 -45066 -224794 -703 116151 -36248 -166062 -39328 -39495 -249268 -113255 -416813
19388 -416813 -119093 -143986 -115805 236999 -48992 -20122 -196444 -62341 -192640 -187454 217888
19376 117771 -401127 -154357 -207124 -58038 90351 -85626 -258795 139896 -59885 -192907
19366 -192907 -42332 -249630 -93780 -84314 210439 -162076 -3389 27258 -152336 -229712 -33071
19354 144297 -197578 -355290 -61886 -86002 51574 -45438 156423 -257141 -430084 -322299
19344 -322299 14492 63950 -51797 368782 -67479 -11997 2171 37107 -118916 102613 13752
19332 -349778 -54578 -125587 -261040 -92682 -87296 -155812 -27692 -42630 15749 -205913 -104200
19321 -104200 -150837 183571 -11972 54363 71559 -184274 -56025 -243849 -92491 17477 -111417
19309 -290448 -83979 -14316 -149538 -50423 32055 11985 44960 -272991 -99080 -315619 -151078
19297 52987 -101267 20928 82506 -196772 102417 -240300 227327 79382 1900 -104433 73789
19285 -18030 110846 -221667 -322519 234856 -35920 -157526 54270 14098 175331 -220937
19274 -143338 57060 -146064 38196 -124432 -289064 -240358 63129 -166851 -31209 -123118 64832
19262 -14262 -486441 333149 358249 -213133 -180612 -108539 -93390 -195580 -49754 197664 52678
19250 62100 93258 -58627 -255332 69579 -219892 61710 -109926 -146761 -62942 -22866 -234948
19239 -234948 -417375 149572 8031 -189132 -150789 54371 119569 -107258 3354 82649 -273023
19227 -18695 336276 135770 162612 228091 -21473 157093 209644 -63389 7041 -168102 100982
19215 -6848 -173348 185373 -55570 15708 19584 -131525 241974 -117660 -32047 -60198 -240273
19204 -240273 313886 -288621 -91646 -31094 90551 -282964 -4793 -164086 33799 -278973 267345
19192 60674 -66457 -304794 38297 -62568 -112317 5614 15939 -129378 -75501 -108108 -103931 -48741
19179 35412 -162133 112396 -198361 -104171 -79051 39626 -136706 -93707 -62199 -151234 209661
19167 210340 -50450 -437936 -23683 -79652 -146920 85070 35087 284068 93435 -117793 152330
19155 -134226 1237 -9601 196183 -16161 127148 94040 -85728 -106133 -159190 -156188 180448
19143 -71525 34762 62028 -82209 -213704 -96379 0 195547 -85792 -85817 -389123 -58239 -198666
19131 -198666 57684 -172423 110152 262944 -179153 -234792 -71642 57947 -356384 -228338
19121 -228338 -180428 -131106 227023 16696 -125206 -79548 -30180 -100898 -252445 -537286 -317704
19110 -317704 127000 -20768 -302280 -252322 -9928 -155252 -197913 41981 -11617 -62421 344539
19098 -39649 -111495 -71121 11563 -386516 -368074 -39289 31623 6132 -104462 30988 59300
19087 59300 88636 18567 -162067 -81552 5320 -84925 -242078 319219 23984 -268375 168089
19075 269015 -23829 95235 -84845 132868 271235 31959 -326988 -144197 256344 183392
19065 183392 -164908 -183405 -75489 -290469 -182256 -60345 25960 -261467 228893 -184921
19054 -150671 -19340 83365 -132444 -230900 -192404 16707 -32408 64016 -85333 240757 219974
19043 219974 -44204 -94693 69746 -642521 134438 -172790 5801 289797 -523758 106471
19032 -110176 -123175 -367757 -159995 277937 -288367 206143 27084 94891 -19936 -248301
19022 -248301 89978 85191 6239 -413315 33397 54408 -199914 -30466 -282717 99791 -306720
19010 -80244 -309177 206321 72013 -5278 11609 211418 -178441 202602 -224541 76535 -174352
18998 -157320 151875 -90939 -480563 -103884 -327512 -257110 -81067 41514 -114612 -323000
18988 -323000 -38919 167247 114998 159948 165805 -303213 196440 182910 -29670 32317 -244361
18976 113380 25255 -80572 -21937 356106 -412483 -282142 181155 492686 375280 100800
18965 -10302 -110931 -14338 127581 -216957 -394526 59551 6283 -83414 -252947 -13530 -179509
18954 -179509 -40479 -163065 -191598 116935 -222161 -146551 129725 -199706 -54292 43978
18943 13517 206584 -307028 -104754 39958 -73429 96945 -305872 402569 -40533 -161366
18933 -161366 -55071 -234228 -267151 -318045 56234 326600 -231275 99189 -274742 -77231 177750
18921 263943 72771 -189537 -171431 -92146 47810 125987 -34024 -267819 6413 174068 78900
18909 -88019 -304674 -25062 -68632 140667 -72151 -22514 325706 291366 151744 325371 -264681
18897 51061 -13365 -151668 -285762 -98612 -58400 -149359 -16755 -301541 -33512 54676 -149577
18885 39875 25345 -259553 -108530 -61804 -27602 -94167 42127 66610 -36944 -161041 -174846
18874 -174846 -45971 255271 -339218 -82679 27020 -253059 -184946 134817 -40628 151439
18863 -81581 -236295 -206873 -152511 108171 40143 -307545 95949 -98954 146155 -82747 172410
18851 39039 -94951 -60367 13046 223680 -327552 -84246 -224977 207607 65695 -55220 79001
18839 58989 19293 -70015 85584 48816 -85521 -112974 128345 -301789 213687 -200637 -109284
18828 -109284 219 -77670 4769 340719 -127253 -262491 -143821 -48699 163597 58495 68593
18817 68593 -269262 130434 -65203 196512 -3374 -234406 186330 -75536 -20086 -86219 33733
18805 11495 -212990 -31806 79706 44461 -21173 -177766 -114615 159116 -139258 -352219 -385668
18794 -385668 -295329 -126009 -177258 320411 168560 -169186 -171885 -107048 -281386 277950
18783 131919 -100719 21909 206032 -203805 -409699 -313423 126301 25672 149281 83402
18773 83402 -197246 96759 -267631 -108444 46283 28010 -42363 39483 42085 -134495 -102166
18762 -102166 -114931 -16215 -172378 -201427 82241 -308337 -44744 218347 -98368 101799 -105327
18750 80966 -4499 69849 -108575 -66921 -40441 -153695 -42986 -336947 83953 -19634 62412
18738 -364889 139580 -69326 -129781 -67318 -55312 54483 -157346 -138183 -74659 -159522 73798
18726 -65673 -293155 -254367 -107235 111290 -100042 -130658 -73538 -171393 -290255 -24877 116355
18714 -157905 -159414 -128152 -155092 -51922 -129709 294771 -354091 -146989 -85616 -85836 1611 190430
18702 190430 -376922 25348 -212534 -204149 -3677 32143 -108676 -45917 4421 77221 201654
18691 201654 -160311 -287231 -250344 -281644 -52967 -1076 85069 -77612 -144866 115706 21844
18679 101128 -38099 -150826 -412399 4357 -229118 -364317 -210291 6029 113630 -166475
18668 5655 71334 77894 -242698 -344916 75023 -114672 402247 224989 1147 -10904 187592
18656 -307661 -119319 -437519 -68216 -81428 41022 170020 -74434 -111530 -40640 -25249 -186936
18645 -186936 -257588 253393 -388005 41394 -89313 226697 37818 217779 160461 -140804
18634 111528 82931 -215973 280698 -510143 -59355 -177615 -159879 128703 -143472 151823
18623 21430 14319 437880 -102341 -23352 53839 147179 -130228 -172898 98404 -289652 -16190
18611 -203557 277644 78675 198551 80859 -3295 55982 -87879 70015 -289027 3785 13673
18600 13673 131546 8192 -83938 -147240 239088 -14154 125730 266249 -353919 -99971 25422
18588 -196763 -95510 -111647 -114106 127610 -157345 39205 -137298 58272 -128683 -167184 -50725
18576 -17503 137034 -151449 58841 -85706 100140 -300010 -179009 56631 64628 -101920 -372830
18565 -372830 -33382 110807 -293097 25115 190475 7187 17820 -156492 -289598 -183314
18555 -183314 -48146 -186703 -35698 -30944 56988 85545 -102291 101820 112674 -165170 -169507
18544 -169507 -9191 241670 -153588 -273557 -14986 -69220 -125345 -190906 -283213 20718 72423
18533 72423 -120381 -52967 -13925 -74488 -56976 201608 -14314 -6275 360497 177465 193222
18522 193222 -129629 -57294 -8478 147375 -67386 -116187 446825 -411827 -127268 -179689 -47662
18510 42716 -283831 -49658 -137310 195445 96904 30719 -133446 -154400 99044 -21526 -340569
18499 -340569 -313727 207090 167695 -106298 -140134 75151 -77800 -174812 -12338 -66663 -301963
18488 -301963 18860 27381 -34418 229463 54348 96265 176495 59060 -111687 -140192 -66634
18476 -32168 237363 -29839 -11887 38730 -8207 -243770 -97236 -363498 -49756 250797 110833
18464 -352326 44548 -128157 228663 -186736 -151516 -90706 -176877 138394 -253882 -87874
18453 -158709 -230055 70002 -135616 114595 -268818 82596 126626 -89486 -85044 -188932 -168770
18442 -168770 -12789 -226274 60481 -299734 105593 -31058 -3649 217219 -305988 195647
18431 -255860 270691 -262767 -464045 -88803 -205066 -142887 -231757 450368 -291047 65880
18420 101215 -225119 -121564 110956 92194 -61723 7100 -245178 -86742 80497 52441 103178
18409 103178 -127135 -155129 88561 -9663 -276583 -104870 95597 -12292 234349 -140102 124139
18397 -112752 -52070 35049 -345734 92944 121695 337791 -169122 190239 -159636 -69619
18386 -47010 156032 118720 -122794 81997 77232 -7380 56596 -253748 299642 21261 -330207
18374 -291075 -197936 93534 219560 96450 -112075 31053 -180760 -233116 109857 -242191
18363 17408 136854 -44458 46939 51437 72463 -163069 -47001 193715 -95628 31615 -117031
18351 86819 -179941 -83131 -17364 -98312 6237 37130 -69628 140348 -327002 252177 184572
18340 184572 177093 -102724 4669 -83751 -233426 114344 -41594 -147584 -41399 -58151 -28317
18328 223997 -67676 -36500 -186809 80359 -19107 -82905 123420 -196433 86043 -275975 -77188
18316 -148489 310008 -141982 43420 2627 254068 -383424 618821 -58075 81975 90232 33065
18304 -134261 87712 289278 -118322 -68284 234424 -226891 -197865 -15434 -183064 109148
18293 242572 -24793 144862 -2739 131596 53289 -19919 47117 21050 -71498 117413 112360
18282 112360 -48780 -88441 154741 -50372 -138151 132405 -367722 153771 195151 -37423 -173992
18271 -173992 -6638 121346 2682 156003 148794 -110271 140104 -37969 -205523 -99230 130079
18259 64542 174265 -107968 -321257 208319 182883 -71382 137985 -244691 -93790 97184
18248 222433 -171492 -78285 -156520 20609 -288422 4667 -40448 -40020 235282 -15561 14059
18236 -59302 17639 -93169 -30339 -158825 6260 333876 -142000 130564 32462 28960 -267651
18224 531477 -168909 278068 291053 163107 193924 -31380 98059 7503 -43385 132274 -86438
18212 -231311 -50037 -256902 -181017 -201563 -112641 -297827 -219701 134140 84803 70983 2524
18200 -49214 -117520 -94313 -68408 -31149 24842 -243711 6535 -465474 208241 -95345 104705
18188 111248 -234450 2322 -217897 -36560 166333 -214841 343462 -2899 -207565 -133684 212251
18176 96896 -12933 -175490 -402012 30908 -36360 -265414 106995 80614 -372669 -460901 385797
18164 158225 288171 119048 -229096 -103 36453 109725 146612 13359 105834 51486 36829
18153 36829 108637 47008 -6694 -45399 -187036 142871 133456 -67208 -355528 -279952 46851
18141 22747 -144487 -197856 -121596 -442158 -279938 -303760 -54940 308556 -458084 96229 106063
18130 106063 -149658 127112 -170176 349121 178329 -222535 114213 112057 -34740 -119207
18120 -119207 -80192 -26503 -249716 155357 -266923 86192 99517 -122024 100469 15459
18109 -233145 244097 -8435 182538 191323 -69974 -111398 -28604 9847 48087 -284662 496939
18097 165745 -270843 49145 -69043 -209754 78779 40184 175052 253693 37366 122459 272870
18086 272870 106207 42639 96509 20150 29097 -84987 -56710 -81026 247654 -178178 67700
18074 57643 -131479 -380067 -254450 237635 41108 31062 -176533 5165 285259 -28340 165123
18062 -265136 14016 307090 -189547 -411620 219063 20894 96342 90858 -155385 -141224 123967
18050 -8690 -185255 -334715 15685 -95168 -59557 116635 34327 143335 125862 -73405 54317
18038 -210409 -115459 29618 147148 30460 -113924 263501 72554 172273 -372543 -139028
18027 40270 126240 62325 143348 -269419 474625 -58377 -64348 261972 165145 -220353 292915
18015 303762 52624 -248605 -41016 -47116 51493 357605 -182647 -21386 184492 264027 135931
18004 135931 -58070 -89292 254269 -14 64834 -193906 -137052 -96215 -314647 -375884 280281
17992 116272 -227058 -150000 -277917 126213 -85054 351869 353502 50215 -204143 -106872 225006
17980 -27726 -186433 258440 39669 320414 6298 199299 240567 -80955 228349 -37249 -70193
17969 -70193 42375 -70464 310667 -11666 131541 235631 -28244 157985 -132227 66507 -87846
17957 -131148 165539 196082 172898 -28255 99484 -96657 117674 153969 116247 -125487 76854
17945 -82063 2346 -91221 144756 265760 -28172 -4863 403736 145350 -249515 -144211 -121137
17934 -121137 -235117 179539 214155 -18016 327340 -170005 105380 84914 183142 51019
17923 -22030 92741 99091 -106927 -36914 72781 327043 -136626 -125743 -389442 109842 -78418
17911 51057 -113296 83232 12523 195983 45073 -62524 168515 -15812 78938 48525 41402
17900 41402 -228164 -277688 -215284 2128 131863 -261277 -259539 79731 -77115 49156 87193
17889 87193 187394 89942 210247 -44872 -137090 -116030 -348504 111022 331425 347406 -186803
17877 297727 -220184 -28371 -227193 276697 382087 -18462 72911 177502 -61833 141702
17866 -34821 60551 157209 286304 27887 -126143 -52994 -68294 -172280 55817 80036 -70957
17854 25824 121037 -54080 -133347 213017 44763 -9721 -77684 203209 392335 471136 340285
17843 340285 -27838 -188695 80334 85679 50511 280555 184859 196389 181826 219284 124608
17832 124608 22635 324298 -179270 -94199 221104 -10625 135922 21972 229411 38868
17821 299280 -91113 333104 118824 259247 -182078 -102657 -279668 -20031 314631 184471
17811 184471 -136802 309599 -54242 171275 42551 39995 83595 -280991 -5053 321544 286490
17800 286490 59352 -96661 -144351 40534 -191287 45548 209000 -116215 108989 35311 -191572
17788 -97188 -84248 -309592 84590 26378 221005 -12105 16631 89487 -80630 -141692 104150
17776 -85542 59917 236375 297836 103799 162673 230860 419147 341543 143639 402251 -37577
17764 9065 -141347 71107 -203497 -188509 172575 -197856 63631 167435 210217 -86764 -4606
17752 380117 -15735 196232 216677 468971 304168 284289 21104 -181047 -7200 64521 64246
17741 64246 -155128 229161 -210585 45557 21120 -41907 61069 215341 -72720 14081 402629
17730 402629 -68216 53469 56211 -323876 -149369 225099 96554 -26662 -354250 112218 22318
17718 210099 -80861 -82207 182160 -180692 94893 -58910 367349 104096 23199 -45668 376944
17706 100385 -27694 213420 120973 -34742 -63459 32713 -122930 171059 150389 105703 -4539
17694 347960 247186 24599 111709 56303 200924 114861 254479 -302656 8002 13629 -87413
17682 30252 229124 -186454 -163346 -59524 425775 522174 -31384 167085 -924 254035 87814
17670 -55498 -36558 18636 266107 -76959 94964 104924 -114993 141707 102773 308284 -37139
17658 -66989 68438 -90178 80945 250956 192351 248560 171748 252272 -7657 -75379 -9909 366
17645 31391 19553 -47516 220776 97939 158192 -231164 61599 -120897 83258 269390 384779
17634 384779 179235 385685 104754 -776 -202944 194847 -25001 -180691 358249 109868
17623 270115 -135170 -41594 28971 220079 54303 -35676 -241350 213022 -174337 147808
17612 -68285 407616 106037 40223 16180 88110 53604 389580 19909 49660 153622 251597
17601 251597 166813 231804 282483 1312 -70661 259749 424207 207117 152011 340066 27601
17589 124100 -76619 -329873 332808 87082 61623 394722 195365 -12127 129334 86187
17579 86187 -2081 85581 55891 148948 -27028 31771 395491 38869 380329 155395 -185210
17567 162398 53087 -222751 264843 -40316 156303 263595 248829 185660 275769 168445
17557 168445 602184 175357 298083 -131164 182835 -15860 205239 170545 209068 191636
17547 191636 305426 -35076 227209 403718 257244 -148935 49676 428754 120436 181330
17537 181330 138973 73019 -40739 308843 236306 294210 70575 681099 365838 321918 364976
17526 364976 206851 615488 534339 861132 850870 792950 676741 898235 734853 80086
17515 430128 73552 455369 298988 730373 594517 263365 402767 990379 980195 1055878
17505 1055878 839521 413657 364315 441886 445384 264465 163875 252219 413856 57260
17494 281958 329086 289280 288213 224663 55730 179536 302383 311617 326358 36617 15008
17482 239466 362297 -101775 225965 346205 408974 464968 60595 125987 280482 305963
17472 305963 142001 190985 346850 436427 154470 311654 160021 340221 91634 219016
17462 219016 336813 387053 135300 317201 242206 229465 272998 377207 457191 357557 238221
17451 238221 149733 278927 368102 487990 259849 427990 422377 522828 554371 500540 488004
17440 488004 406230 296299 191809 415716 451912 277278 311079 192210 224811 428159
17430 428159 577120 307447 323101 332400 136163 141241 110827 644694 503157 375556 290154
17419 290154 651391 511893 303793 483608 401952 676383 566760 468745 638311 239315
17408 457970 497058 351290 397748 338276 182883 199806 335913 -26491 258518 408327
17398 408327 89882 269967 386187 394481 493522 408258 324112 307857 400505 365318 312347
17387 312347 321596 433206 332526 347792 506297 493985 790342 388077 384688 412111 14397
17375 44359 260962 393080 154445 273694 472680 340096 149078 448698 195742 61618
17364 283610 192813 30530 252929 96449 268942 117371 423582 -12543 214262 86996
17353 200909 54960 715878 461255 336692 324042 72685 176636 180804 517898 4941 193516
17342 193516 154047 360679 115148 63615 662783 153013 223323 476930 327753 379557
17332 379557 515767 298868 327548 477648 245640 372700 480990 59323 288643 182372
17322 182372 287349 381124 188143 377968 402531 331673 286425 792884 235390 122967
17312 122967 364818 505346 322630 156562 122112 379015 345865 239409 93571 511364
17302 511364 65788 321957 281649 505083 207410 264991 -33240 297723 60509 520042
17292 520042 135168 230143 217588 392975 380184 -129108 182702 363303 426960 435897 222776
17281 222776 126183 317292 264422 232093 344448 565254 342470 502097 146853 408684
17271 408684 225122 59283 78560 391960 255413 62724 260909 505659 230856 58771
17260 499357 210626 -119270 465441 219715 405855 644829 411543 355931 516975 508793
17250 508793 167154 680624 343373 762119 408967 269199 47897 412786 411150 648977
17240 648977 351723 316739 72110 586171 648384 111490 506594 586352 605868 351427
17230 351427 336365 508737 425322 290467 308132 455661 470493 373542 636312 509969
17220 509969 624704 810820 490148 626165 577608 590823 596059 289289 321660 682007
17210 682007 381150 364174 291344 772889 657666 453585 508040 329570 671491 792934
17200 792934 589747 541013 398172 483216 457080 615767 639280 547246 600071 531717 621108
17189 621108 753742 680768 532547 344276 330415 501860 622501 655297 702017 463197
17179 463197 523625 839004 555843 443054 387503 556153 517847 229406 448850 614659
17169 614659 594084 885578 470007 659046 492662 741140 788131 699153 487800 463571
17159 463571 694767 595810 474516 758121 553069 911373 697618 479294 590959 735252
17149 735252 676308 622722 701818 523465 655316 643540 588935 716738 651925 593760 832958
17138 832958 1041007 325750 693361 547667 606052 812314 781207 1143202 593988 893239
17128 893239 886139 1150439 1028678 891601 802472 646062 898852 600815 797098 698477
17118 698477 997394 343027 595876 619930 1037410 756470 480500 932520 918755 859779
17108 859779 917247 912404 945244 1092972 996462 777059 910336 1253906 901243 868130 608697
17097 608697 992831 898201 791639 1004140 929647 741044 865512 948265 1243127 996221
17087 996221 1034372 851367 1129583 756787 1334868 1162260 899891 1122604 1093907 1087215
17077 1087215 1088085 1138020 1135677 713045 1097064 1095746 994890 884537 987427 1264902 1152860
17066 1152860 1320256 1208080 1368946 1264612 1011569 1066572 1172281 892597 964441 996272
17056 996272 1355383 1455931 1114529 965048 922827 1083430 988985 929088 1011407 947100
17046 947100 1491653 1400568 1450528 995090 1301087 1300986 1463981 1287331 1236195 890641 1595379
17035 1595379 961535 1310520 1298931 1368362 1135324 1342433 1205506 1487795 1289065 1395653
17025 1395653 1379338 1266518 1282288 1770291 1085806 1614938 1245337 1695142 1363220 1335179
17015 1335179 1364658 1693230 1814918 1187677 1531306 1727420 1686965 1696476 1584487 1280197
17005 1280197 1939095 1524815 1273263 1731083 1797265 1634806 1974957 1743635 1685891 1608589
16995 1608589 1839370 2053775 1761861 1873031 1873325 1817939 1722298 2087799 2159809 1740755
16985 1740755 2023749 2053756 2339099 1851489 1988738 1862919 1804355 2066793 1937862 1916762
16975 1916762 2106731 2074700 2085713 2121741 1924748 1794725 1930692 2391189 2372446 2020217
16965 2020217 2278039 2020348 1927103 2269350 2303941 2379763 2592539 2461051 2296270 2466905
16955 2466905 2232423 2223846 2399390 2714762 2583580 2398692 2718008 2267694 2449526 2883335
16945 2883335 2389699 2825823 2611712 3255611 2701040 2934367 2718216 3255054 2978267
16936 2978267 2779920 2898266 3064968 3518084 3230792 3278380 3212571 2918460 3125509 3185797
16926 3185797 3134731 3382870 3355788 3275795 3561159 3392141 3419695 3619645 3304130 3546169
16916 3546169 3477625 3884812 3619049 3583769 3998879 3628025 3881043 4097857 3989721 4038155
16906 4038155 3955991 4114904 4246288 4197636 4363714 4240648 4221062 4576751 4472824 4313292
16896 4313292 4438215 4504725 4582766 5084865 4779011 4631613 4892135 4563672 4965019 5184616
16886 5184616 5220673 5027853 5023030 5261409 5243695 5260971 5290991 5864018 5818091 5920233 5799709
16875 5799709 5732665 5929309 5872959 6020230 5876958 6311839 6130447 6267333 6513493 6694538
16865 6694538 6880765 6753288 6600663 6918863 7016015 7509946 7150127 7508375 7612593 7609655
16855 7609655 7882501 8038285 8147842 7913657 8117544 8293029 8498078 8831768 8702159
16846 8702159 8862997 9240500 9116266 9083212 9441556 9545502 9531036 10054530 10124702 9952908
16836 9952908 10515202 10559863 10860209 10776609 10940482 11481558 11496335 11734498 11761390 12043823
16826 12043823 12025053 12543394 12675115 12702945 13050998 13216464 13023000 13686454 14382552 14092655
16816 14092655 14319851 14684245 14743519 15133547 15516465 16018604 16148710 16371292 16809652
16807 16809652 17129496 17543696 18198855 18340074 18733391 19233565 19450433 19632875 19940748
16798 19940748 20411974 20938341 21417325 21706850 22376665 22701781 23259238 23806599 24371205
16789 24371205 24767516 25367519 25829885 26553667 27186154 27658683 28228964 28836048 29597641
16780 29597641 30320237 30972476 31640991 32180072 33213628 33969890 34569633 35334876 36278880
16771 36278880 36988638 37936129 38660679 39651256 40403686 41541931 42193145 43329526 44279378
16762 44279378 45620690 46464947 47299810 48065967 49275528 50482343 51698411 52779342
16754 52779342 53897672 55392612 56060336 57420183 58689280 59582241 60675984 61841017
16746 61841017 62462161 63868606 64974360 65974730 67399488 68476076 69225371 70179554
16738 70179554 71113240 72069758 72694093 73690409 74575939 75134236 75521240 76474287 76533144
16729 76533144 77253860 77844158 78030136 78112680 78200284 78303597 78471118 78259651 78321034 78002038
16719 78002038 77829082 77027647 76837421 76364285 75634236 75171154 74875986 73870893 73082986
16710 73082986 72259498 71484682 70877675 69551243 68918923 67478155 66792071 65608230 64670762
16701 64670762 63297025 62698266 61439424 60276859 59244469 58115715 56815327 55993103
16693 55993103 54881103 53954870 52758394 51783928 50429794 49601561 48635438 47723929 46624095
16684 46624095 45731559 45001015 43772562 42735543 41607201 40979508 40213436 39435405 38740310
16675 38740310 37694990 37139763 36093855 35441894 34930437 33968766 33255998 32586049 31941490
16666 31941490 31748192 30502071 30090021 29842202 28936713 28393022 27652328 27382067 26764588
16657 26764588 25985036 25607560 25027836 24510596 23998123 23710015 23247703 22989446 22310188
16648 22310188 22128733 21264845 21118741 20570714 20496192 19952803 19916951 19614658 19064944 18787024
16638 18787024 18351829 17697625 17583199 17678978 17240014 16817321 16487202 16303378 16083500
16629 16083500 16028935 15534202 15194790 14911696 14609621 14561331 14604124 14268160 14099777 13875174
16619 13875174 13353240 13179655 12939977 13044706 12932035 12880015 12499461 12207750 11998536
16610 11998536 11715421 12045914 11514725 11288978 11121727 10840503 10773738 10898065 10608859
16601 10608859 10392801 10563904 10458333 9734362 10104073 9885519 9502042 9791505 9235072
16592 9235072 9264738 9065516 9109024 8989009 8945529 8973221 8560217 8431707 8165827 8310931
16582 8310931 8230267 8182245 8217812 7720679 7450194 7847089 7486892 7612132 7567683 7575765
16572 7575765 7366972 7303922 7032126 6966941 6957064 6940931 6741256 6262379 6613569 6420109
16562 6420109 6500200 6424531 6494687 6573532 6235294 6255577 6446556 5841041 6166628 5749549
16552 5749549 5798450 5453160 5687875 5848761 5368576 5607160 5487948 5724245 5364672 5046678
16542 5046678 5471676 4995800 5153741 5242350 5127228 4985680 4964353 4742481 5253582 4908226
16532 4908226 5065228 4823255 4882729 4972310 4870539 4439710 4413012 4515726 4448328 4260978
16522 4260978 4419517 4276598 4474159 4615072 4141558 4389878 4162763 4110055 3973135 4061683
16512 4061683 4327564 4160414 4060486 4204521 4088443 3726281 4118335 3707638 4082321 3797057
16502 3797057 3963702 3823337 3703979 3394283 3680785 3550323 3749625 3733914 3315558 3630200
16492 3630200 3545039 3409674 3494590 3322905 3370968 3490572 3736060 3502621 3040629 3053765
16482 3053765 2977124 3081116 3002746 3051956 3147850 3006800 2666439 3198781 3088878 2873357
16472 2873357 2929515 3116343 2941917 2659096 2758807 2792207 2799397 3005038 2947968 2830376
16462 2830376 2557366 2841503 2784757 2762010 2505448 2617049 2775672 2774208 2429055 2698463
16452 2698463 2819075 2561516 2574901 2512154 2644938 2732598 2583539 2768752 2541264 2719785
16442 2719785 2541310 2190960 2380146 2526094 2338919 2249884 2434707 2124909 2493595 2298082
16432 2298082 2296038 2081732 2049468 2438348 2091771 2459470 2273822 2275239 1972753 2191214
16422 2191214 2126867 2007401 2027455 2055622 1617203 1890634 1877495 1892442 1960398 2040834 2014315
16411 2014315 1961135 1973376 1926574 1983867 1724110 1779392 2164682 1791253 1985719 1794871
16401 1794871 1866654 2182647 1717070 1717178 1728612 1737445 1959033 2042539 2064219 1870927 1916687
16390 1916687 1530950 1876984 1777764 1761323 1275010 1853271 1424678 1896143 1560138 1593814
16380 1593814 1804847 1384978 1591571 1505424 1550913 2036149 1607549 1638511 1467870 1873343
16370 1873343 1723270 1568770 2079294 1835525 1507430 1653125 1384013 1300952 1281398 1549995
16360 1549995 1453119 1599558 1740546 1450650 1264470 1547018 1806792 1352888 1586736 1416670
16350 1416670 1547916 1061990 1602432 1450556 1255557 1457888 953665 1324265 1255899 1325784
16340 1325784 1629369 1351372 1588253 1327768 1042561 1461131 1602470 1208024 1521646
16331 1521646 1059580 1461069 1570301 1131159 1450392 1210762 1152749 1087481 1473555 1164453
16321 1164453 1027625 1092841 1154502 970533 1084597 1304414 1184130 1136216 940314 1347566
16311 1347566 1225422 949875 976301 1042754 1093271 963682 931018 954579 1008958 961935 1035843
16300 1035843 1090510 1124394 969792 937855 1084597 1385136 1110932 1091221 1207628 1037103
16290 1037103 1077827 1253126 1052232 1168289 961215 1349897 879417 968065 1307001 831009
16280 831009 660644 839060 850559 1002176 1066545 886041 946253 1286922 1065173 1117087
16270 1117087 505849 910687 1025138 719036 561376 1180205 758387 852067 1063412 1044342
16260 1044342 888943 1085885 853183 930816 990776 760289 893782 985517 841829 579134
16250 579134 796579 953876 755147 530736 594489 719894 874114 890109 757332 777090
16240 777090 958620 659716 844050 945448 546697 903460 890565 796014 823414 991297
16230 991297 586607 584123 544055 919151 730021 771897 729623 547846 939708 426865
16219 650419 479882 703592 517679 1047529 469177 599710 602762 436109 731789 837945
16209 837945 879978 776379 859042 688090 623162 731662 530711 857976 610064 514223
16199 514223 493432 359976 926236 781459 461693 519972 309743 631794 747617 748707
16189 748707 676779 299218 673453 528789 614217 659550 766616 667221 385044 635330
16179 635330 737393 431190 316270 302395 399517 717310 761711 740278 435294 526630
16169 526630 528696 311883 435851 666118 510884 646701 474341 682768 657972 763616
16159 763616 419800 562762 454181 503361 769126 312773 414143 776630 522207 376594
16149 376594 666597 591523 420301 419133 374616 323530 538419 35587 674671 515517 547883
16138 547883 276515 369398 495348 452406 548360 434399 742928 332045 237003 585248
16128 585248 326545 261482 269112 592993 287533 439119 352952 323766 710633 631492 124726
16116 212873 114254 256697 254711 343772 529460 650249 372559 421423 432872 368495 543070
16105 543070 200596 328502 635878 207775 158941 589525 561755 167162 369354 23513
16094 149540 301547 431382 503689 558104 193631 245396 350520 357856 308074 276930 287513
16083 287513 178266 382507 270759 341263 611664 236133 74467 72248 235721 88447
16072 290666 397784 359497 58423 305601 277176 163993 470156 409736 312230 168896
16062 168896 366204 249948 348096 283611 474392 382725 307230 503206 305113 179359
16052 179359 237160 376699 338102 266826 143883 322640 178836 301506 437451 620913
16042 620913 230602 122404 368520 102231 109321 214059 172914 362737 716894 207890
16031 162675 355862 380967 350848 224559 176029 206865 92017 311846 16102 452001 427393
16020 427393 241387 122235 465526 199116 -532 45282 146777 33564 144373 215097 297181
16009 297181 266645 209535 388037 101679 145310 -131566 168711 101560 139320 365549
15999 365549 262931 75932 208562 379983 215814 209771 478848 428613 806030 827636
15989 827636 922969 1002207 970936 1014704 464879 530915 290213 392704 74428 165759 105738
15978 105738 -56445 314215 348049 36446 136267 98587 256274 26980 89657 279172 66812
15966 122630 89600 -178649 343062 206441 143335 216916 482769 357404 364885 295124 5071
15954 129459 22767 -21309 -35433 184459 6860 -73042 268276 34615 164281 150291 289372
15943 289372 6923 196541 130170 58615 570758 17654 -177562 322874 -3132 -75004 154385
15931 174818 36384 348975 98310 297296 103490 372567 -44491 -145202 54985 340721
15921 340721 398997 57696 182296 197295 416066 196369 -181869 28918 41012 186112
15911 186112 250004 192696 251104 -42853 111166 173524 53566 128888 -194511 210013 -138399
15899 208542 -98545 104321 -165162 245161 363214 -69283 295801 43464 57295 456152
15889 456152 -182335 -315551 434357 220662 8232 134600 10858 -40035 33574 332686
15879 332686 88984 282669 -70594 -62970 163987 -119020 -88398 99738 235527 -75024 -67861
15868 -67861 71346 67973 330913 147842 48845 -92409 293897 121464 33222 -67579 -22245
15856 -151377 69805 205720 201879 170517 -346265 109599 -48059 -41328 44622 188123 220578
15845 220578 81156 -148824 213273 246568 99527 155222 -193039 5097 -172416 159442 349264
15834 349264 299588 -272583 316253 135667 -54245 174715 415480 -139182 55461 -42818
15823 -122522 91584 -123655 -59702 -46359 -13894 23146 112765 247185 -184617 -42139 -62284
15812 -62284 141333 46519 138250 -133704 343718 -30985 -149761 49021 -205659 152949
15801 82821 68278 186858 805 140411 491300 90861 362379 -121070 69617 -179780 240051
15789 131664 174764 349113 138385 -77688 115137 390788 -123582 152311 143973 125918
15779 125918 -5649 35470 156646 49561 -328239 236474 -112350 -246146 19014 94716 -77638
15767 584502 130154 172582 63476 124244 61209 -87868 -2056 176269 -47019 280127 177018
15756 177018 -53336 244091 148026 187556 -245419 -47667 215858 -16780 350662 -1415 33593
15744 351335 145500 3797 -168140 293816 -239847 -4509 -242972 5964 -7314 138292 -26743
15732 167877 76598 -45979 -513 131762 226589 206879 141153 -16807 55504 172601 423344
15721 423344 16446 -14538 -191850 -188509 -194141 -389969 -145331 -106097 -107676 116392 110646
15710 110646 -25901 -152740 -187350 244515 -57672 494280 37833 -203185 -135089 289169
15699 147463 41119 16245 77360 179957 117954 -70690 421603 245932 14477 284765 -168016
15687 17664 -157230 105134 98714 -35542 -38920 176595 152905 334873 -261228 -202326 117334
15675 -172146 -236645 81640 53289 106891 -250635 99067 -76253 -49002 -483082 67281 -141297
15663 -113359 43400 -136884 -176689 241171 -80974 -134712 -11756 77832 249406 341270 -44160
15651 168450 198528 -129633 -34474 -283793 -132641 114941 -65285 -343569 -235200 111511
15640 42827 195857 185788 -45546 -77260 -104263 59021 -231793 145726 -59094 133287 12183
15628 -155278 -113267 -227607 -148045 92746 146692 -70369 -237792 167528 -12863 115202 14613
15616 -356580 -27619 157488 -349657 -53401 37714 -16140 144578 70676 177390 -205510
15605 22043 -106428 42329 382 200151 211375 -77388 -151397 -314217 6858 -252144 33452
15593 48219 155332 370730 -344056 303945 -166375 308438 247724 16681 -96513 -38957
15582 223401 -28604 -2854 -119251 -126302 -46708 60121 360982 256672 94350 -246708 -67014
15570 149465 -87253 -237609 3577 62412 -120936 -139856 -20093 -237323 -84524 211958 -159402
15558 287260 92761 -75512 -121671 -27979 -183839 99197 -30209 -162356 340268 -56 -7548 6602
15545 300587 -180096 117737 121712 -88340 116492 51134 33241 -296909 213419 -152285
15534 164207 13128 -284584 377784 73266 154881 113247 192033 339233 -365841 78687 54816
15523 54816 -51110 -98659 120209 264226 -163266 -97526 140055 -66773 -303665 -43378 124811
15511 93956 144539 -17058 52169 186179 -235618 89814 298909 -67872 275283 -508880 -121823
15499 -309096 -179622 -166687 -90574 -100497 -13422 -322554 -24881 17871 382580 141404 -199973
15487 202225 182287 3689 -52302 -160674 128151 59557 52788 396022 353751 609913 203075
15475 192887 141969 224090 184380 196135 -3023 -55127 306081 140305 -20709 -16046 70047
15463 10472 347817 200857 71171 244756 -19846 -112427 -291892 -39588 263592 -94570 175360
15451 194627 481482 149547 120634 251154 362831 397022 998813 986103 440849 191172
15440 52204 -43322 213935 -19425 -186222 403714 113761 -143817 224 370680 19661 160026
15429 160026 111720 394773 116392 -526704 162876 296311 250304 246802 21865 200644
15419 200644 55157 -176014 -44178 -188707 33527 1060 -450571 -51196 383715 -76579 -41211
15408 -41211 -97536 56087 -61329 107575 17660 -109222 57107 94025 -1404 49695 183801
15397 183801 -110273 -123096 14948 11114 234146 28952 189952 -60555 -129445 -209885 -52791
15385 69479 76594 159178 -9125 -198221 -166448 282324 40320 57539 -80364 138140 -89593
15373 621284 -194148 306050 196993 96910 300637 360264 -89930 108010 -189726 59945
15362 -75580 57768 14031 131405 78251 159501 273596 158357 7203 215103 -105328 83790
15350 258411 -49619 63402 146099 -5494 66005 330795 217913 66434 382641 341582 275638
15339 275638 306266 108487 242030 323750 265450 169387 305212 -44012 281978 112298
15328 149882 261932 -39874 -300855 374627 167399 80051 71193 239888 222183 -32728 -7026
15316 163585 143798 250937 135395 -106801 239913 218160 443695 184474 108878 330737
15306 330737 16401 -94650 72205 100944 123691 -151105 136709 375138 142436 31945 71945
15295 71945 -34632 67531 31133 395404 307072 35744 51730 -169989 203690 31334 169552
15284 169552 101385 -293341 137655 -182812 -159358 -281621 82682 102344 189219 -139496
15273 249591 88660 112032 76369 80906 44018 -50254 151309 -40167 -30126 271556 1828
15261 -217599 87561 125410 -23449 163965 130383 -227591 261870 362400 -92294 -19385 327053
15249 534018 686292 1147415 2200769 2002809 1639185 2042501 747422 153297 143633 51530
15238 124817 69328 290956 209219 45217 86443 -70397 70448 -195554 -245835 -171986 -298313
15227 -298313 -231384 239978 -108196 109048 -138108 -140516 -4214 139610 201908 -594817 98326
15215 96715 48837 -4229 34833 15026 -152719 -266086 232822 53080 123000 63650 237284
15204 237284 109703 257943 12380 -6503 135117 81835 385245 -404854 239689 140326
15194 140326 -152622 240483 111515 92651 -159017 30174 236904 -237805 -169083 108338
15183 23004 -95373 -146034 140395 -273791 355570 67049 -44750 47488 231357 -101892 110566
15171 93588 94855 -279009 -139338 -133631 205816 193423 198405 -86492 -167544 36814 137745
15160 137745 -138502 83900 126248 206670 -1387 -166238 299898 52666 90947 276970 -194323
15148 -30673 -205224 107256 161351 209407 108130 -61265 15907 255441 156414 -85549 202242
15136 -136497 127060 397082 73791 78776 323790 44969 -66085 144375 -104435 29066 3124
15124 166941 364970 184523 -247620 231453 -21143 183107 319322 184464 294244 227752
15114 227752 164896 98298 460498 140517 17793 66488 173240 85583 24481 262292 1011
15102 155353 201654 219678 -123837 373264 296265 255163 266489 41742 79231 311705 304724
15091 304724 64309 92707 44338 -90992 -153626 79937 308202 264040 -87491 232345 315938
15080 315938 20687 182160 75503 278100 137276 32633 -117462 210553 188135 -91839
15069 80256 239697 373934 262731 98653 16409 -182141 125480 -47213 95130 36726 298006
15058 298006 363085 121456 419326 178192 186380 277744 656259 18780 451658 130897
15047 -28724 154736 267725 343191 479603 347665 307643 311145 521716 322019 460144
15037 460144 546034 286636 465026 286203 1533 83455 232282 321332 576524 779825
15027 779825 577600 601388 489085 449824 493905 340378 -62562 240801 685483 414359
15017 414359 242886 554309 615371 100327 230014 -230895 228967 47062 527090 405107
15007 405107 357230 169616 314737 303837 130874 145556 184570 211917 -12268 243579 485039
14996 485039 492930 484285 620797 93775 603742 335558 423017 557615 395270 191253 316716
14985 316716 328091 198136 240128 290195 315644 408159 639504 758245 1016949 748853
14975 748853 865944 475626 414761 427391 440491 625210 803036 558560 412579 388602
14965 388602 347395 506587 724956 574687 723045 277247 568024 189595 263347 270292
14955 270292 111307 471533 728333 620412 355106 464196 430731 297278 606719 435498
14945 435498 329233 377124 523112 368402 467434 228664 310980 637715 625228 491946
14935 491946 482366 503717 806375 745366 738973 936160 963469 1154097 1225275 959525 993553
14924 993553 1078690 1196748 1423362 1727892 1507532 1298370 1185259 1219579 1325665 1145576
14914 1145576 627402 723597 311603 145165 537146 542955 358123 376360 379351 541620
14904 541620 264763 359888 250594 337499 580066 363277 860842 609963 571134 540555
14894 540555 522603 698333 533141 497065 492496 344829 669023 560409 737673 824839
14884 824839 349169 426256 16151 851093 637625 512289 700973 220612 722804 603121
14874 603121 690813 496035 255097 612956 600461 486123 914647 615581 400137 577987
14864 577987 266699 187138 627433 563488 657589 -300359 522391 393753 140356 578206
14854 578206 244679 119065 524549 546791 688008 833812 630381 825571 662835 511215
14844 511215 870730 799778 835034 1338623 1086314 786159 386324 712327 656227 533180
14834 533180 739043 623340 544917 293612 342201 588802 341279 656703 333985 570016
14824 570016 389145 284048 356580 566863 597192 802140 543566 538029 891214 563561
14814 563561 568716 580002 800971 795978 574972 359752 641450 641179 541574 1062784 840900
14803 840900 710585 659184 683438 435513 565924 597935 693964 391801 513167 756087
14793 756087 492807 118862 400805 570085 601000 556040 866127 423242 391108 614823
14783 614823 408116 672173 575357 447257 457780 754746 767353 768840 620652 431775
14773 431775 712989 552597 482851 585737 726243 712635 715323 858223 663813 993105
14763 993105 803842 709236 429418 475228 462084 797195 720575 461564 722002 1041727
14753 1041727 316808 484239 743679 634800 644052 623101 839609 752815 468174 865055
14743 865055 596743 552359 430275 822826 834750 832031 773835 898028 745674 1050615
14733 1050615 916986 888435 761717 777142 771087 1128293 1097849 1016338 1159692 1309642
14723 1309642 1304263 1481054 1431619 1383589 1043106 1297085 1324668 773829 897939 909718
14713 909718 599265 687391 827054 735984 884994 909933 657089 915299 1431966 952233
14703 952233 948586 787591 1364377 1846859 1576855 1570097 1257963 1092344 1240916 989080
14693 989080 1141855 906480 682317 1140861 1031711 560988 1009118 1302919 1032422 1143823
14683 1143823 1247201 988114 839535 891921 605787 1173080 873199 753753 790713 1008421
14673 1008421 800714 779099 1175397 1085458 975797 1102935 904372 596996 971358 1205728
14663 1205728 605684 873630 995420 1061766 900329 1230635 850174 982158 987562 1338551
14653 1338551 1117039 985355 1066445 1609981 1195937 1061328 980136 1154762 1238189 1470106
14643 1470106 1251131 1206731 1191171 1273923 1065252 1015640 1151005 998954 1109055 1205833
14633 1205833 1062878 1109831 1448986 1386144 1119421 1157913 1127640 1225234 1476128 1604553
14623 1604553 1222912 1448117 1075964 1168492 1108899 1255902 1271099 1187904 1548821 1502018
14613 1502018 1400673 1660089 1258956 1173796 863971 1351120 1213187 1556975 1507030 1570462
14603 1570462 1777775 1324447 1131617 1788653 1440355 1534055 1500002 1704385 1757372 1704393
14593 1704393 1474887 1346357 1463908 1370794 1307848 1513006 1896914 1746242 2303768 1561741
14583 1561741 1680199 1768312 1989704 1706093 1997055 1899719 1858233 1592912 1899444 1839001
14573 1839001 1831869 2005139 2177178 2398964 2145021 1909420 2330200 2237313 2415699 2313072
14563 2313072 2525548 2414362 2538790 2921229 2406437 2759302 2988269 3065049 3234171 3309448
14553 3309448 3672164 4039082 4477661 5445385 7839303 11754001 18458014 33363301 45289445
14544 45289445 23445617 12305882 6963786 3385306 2555141 2074025 1619678 1851931
14536 1851931 1638776 1661296 1590079 2066722 1723378 2025859 1662609 1892977 1865173 2311833
14526 2311833 2202485 2035205 1974184 2353507 2449371 1997515 2337536 2214844 2471275 2418961
14516 2418961 2639837 2176900 2564564 2432915 2293089 2788767 2509219 2612336 2631886 2803244
14506 2803244 2872340 2438375 2800477 2967295 2320160 3009777 3117632 3003334 2932905 3021306
14496 3021306 2982673 3246828 3054791 3255062 3199035 3254574 3140272 3076282 3170489 3574553
14486 3574553 3416782 3473809 3520866 3461210 3375276 3535844 3615718 3170002 3543261 3687683
14476 3687683 3796049 3759370 3924095 3881684 3957336 4264750 3976589 4045394 3929724 4418200
14466 4418200 4032809 4459495 4139492 4245861 4674479 4639833 4421333 4524751 4728146 4872404
14456 4872404 4629472 4754198 4996306 4817828 5093824 4770902 5229270 5209530 5108006 5258725
14446 5258725 5089184 5528981 5621694 5571808 5478618 5781567 5479964 5613578 5479321 6186060
14436 6186060 6067596 6239341 6294415 6359497 6259556 6297566 6107170 6684325 6774012 6894904
14426 6894904 7222605 7088118 7108741 7725446 7197928 7495551 7335719 7722714 8006133 7891341
14416 7891341 8059729 7863883 7857013 7996793 8229922 8187502 8529532 8812161 9071124 9170971
14406 9170971 9392403 8740735 9358403 9697066 9584791 9591434 9915843 10044538 10459164 10459598
14396 10459598 10598179 10792799 10825555 10904380 11315875 11223697 11649739 12037586 11695863 12357475
14386 12357475 12703866 12681469 12952483 13264895 13508463 13370048 13911152 14110328 14330462
14377 14330462 14644004 14973790 15130784 15528812 15430857 16080029 16320586 16787520 17522693
14368 17522693 17503109 17993689 18315442 18297944 18689211 19210982 19617757 20352465 20750723 20979603
14358 20979603 21326041 21775194 22559472 23255999 23408267 24114919 24806130 25238723 25826773
14349 25826773 26610887 26950687 27732405 28405356 29090576 30053482 30851767 31282752 32338441
14340 32338441 33197955 34235561 35101013 36172126 37410697 38113483 39175136 40427231
14332 40427231 42169421 43144743 44534795 46350043 47631033 48691052 50566319 52014149
14324 52014149 53691185 55432015 57548754 59516540 61556730 64054321 66193573 68520860
14316 68520860 71091032 73651457 76883675 79926927 82782083 86232968 89758045 93905246
14308 93905246 97581049 101738481 106048470 110548587 115921892 121037664 126601286 132738953
14300 132738953 138887744 146039056 152951953 160143933 168917895 177164368 186264491 195557051
14292 195557051 205342587 215996685 227070972 238888421 251037872 264043851 276897840
14285 276897840 290743356 305008066 319465467 334142869 348464401 363536124 377972708
14278 377972708 392167641 405816058 418200546 429948548 439219619 443903301 444279329
14271 444279329 445672096 447060565 449568335 449075516 445265071 441413447 433748972 423999632
14263 423999632 412274942 398826897 384133171 368936768 353335828 337658164 322407404
14256 322407404 306562935 291767525 277171436 263575310 251936835 239306740 226869250
14249 226869250 215348397 204781392 194426612 184862232 175657972 167293653 159438610
14242 159438610 151706362 144498763 137687701 131694404 125816571 120488931 115252057 110129669
14234 110129669 105187576 101121787 96804855 93190941 89645802 86013358 82242111 79168976
14226 79168976 76295915 73386851 70880860 68270718 65480682 63495740 61181913 59345525
14218 59345525 57187355 55459002 53721733 51924310 50135476 49032179 47657014 45822935
14210 45822935 44189397 43020761 41856084 41134426 39894569 38604706 37380600 36427769
14202 36427769 35724570 34867558 33754988 32588086 31781863 31142399 30049501 29267915 28844353
14193 28844353 28215768 27212264 26825363 25999353 25183538 24785843 24407389 24020939 23121195
14184 23121195 22731293 21938202 21545493 21339287 20806929 20230196 20008942 19709043 19200956
14175 19200956 18819246 18658638 17857422 17851210 17443243 17030647 16883869 16484746 15996250 15600218
14165 15600218 15308647 15101716 14834502 14862052 14275669 14218229 13939437 13470158 13320115 13376125
14155 13376125 13176300 12824637 12698013 12318244 12093054 12186829 11907433 11892746 11516729 11425757
14145 11425757 11219919 10940865 10479398 10116172 10414607 10322453 10454865 10030753 9874174
14136 9874174 9734658 9434981 9074042 9195053 9013128 8838256 8897512 8448530 8449305 8292293
14126 8292293 8094055 8408515 7892678 7954918 7892040 7774235 7947105 7510745 7541142 7343817
14116 7343817 7142393 7364835 7023892 6883218 6609710 6737314 6846582 6422874 6370824 6633120
14106 6633120 6435886 6363574 6358274 6040380 5878985 6097884 5839866 5753690 5784017 5569775
14096 5569775 5593362 4975602 5421708 5784773 5648483 5397661 5110315 5493520 4976875 5058477
14086 5058477 4944352 4832374 4929669 4764745 4929496 4596736 4681692 4943371 4568609 4287156
14076 4287156 4544471 4586292 4433584 4469306 4457320 4015005 4066958 4261433 4303831 4226971
14066 4226971 4257056 3976795 4276286 4257914 3628814 3762558 3772048 3779227 3809231 3825883 3600760
14055 3600760 3336960 3446550 3525579 3824615 3281603 3672375 3243416 3825409 3579979 3571119
14045 3571119 3162664 3299371 3293398 3409512 3202684 3096186 3158698 2995158 3472539 3406515
14035 3406515 3392382 3167539 3728524 3245520 3370527 3546762 2583773 2936314 3167706 2745478
14025 2745478 2357368 3019633 2771696 3076300 2822875 2461545 2526274 2397706 2451795 2564585
14015 2564585 2488727 2655457 2470140 2339291 2393560 2052315 2330136 2199969 1996474 2109750
14005 2109750 2210816 2339520 2303419 2277814 1780610 2257465 2093745 2354010 2095675 2004399
13995 2004399 2321693 2129026 1883812 2424155 2514416 2707998 3354858 6183760 10909424
13986 10909424 21360311 40394634 36230671 17020328 9316161 6248332 4841698 3739527
13978 3739527 3407851 3297720 2942454 3157380 2855136 2721073 2505425 2790428 2661898
13969 2661898 2350270 2359932 2293799 2347049 2241529 2351120 2257616 2158171 2292562 1990693
13959 1990693 2024333 2101840 1969046 1802171 2021430 1933902 2169433 2173972 1866283 1514214
13949 1514214 1911703 1752427 1684967 1948385 1405412 1731941 1593719 1747812 1966911 1630021
13939 1630021 1942869 1945183 1721807 1673759 1742962 1260787 1584209 1450803 2125741 1990469
13929 1990469 1861950 1510947 1443813 1408619 1424687 1599611 1643801 1435824 1437395 1902817
13919 1902817 1798452 1293185 1449022 1456622 1672090 1331725 1246301 1482067 1516022 1587459
13909 1587459 1434048 795837 1256203 1254974 1350027 1655009 1292025 1376607 1420216 1700554
13899 1700554 1511235 1438982 1395350 1217968 1121987 1164090 1142227 1242220 1273246 1325182 1163859
13888 1163859 1262419 1210620 1316830 1650297 1072856 1239758 1078432 1550184 1070122 1393505
13878 1393505 1493479 1198316 1156173 926527 1337007 1441581 1121468 1009917 1098139 1217058
13868 1217058 1587378 1141532 1172224 1009872 1124219 1111219 1140234 1433457 693136 990808
13858 990808 1163411 896991 744223 1338988 1127980 945821 1003678 1278187 1172437 902302
13848 902302 942522 894613 933803 1025945 1034731 871660 1048733 1066740 1008967 773505 788985
13837 788985 971090 987153 1052297 1265256 741217 901981 665064 836174 799653 730589
13827 730589 952919 670089 886760 1020927 932214 853012 793556 791460 938481 863231 1269579
13816 1269579 723380 903706 1213917 599969 717479 1223904 827338 1238293 704666
13807 704666 758021 934266 490375 464250 513104 876030 830852 768196 721139 548787 672234
13796 672234 789203 916523 369313 549352 623994 788307 838809 509886 793894 651982
13786 651982 737597 754928 889273 645529 937746 423154 678601 663909 634083 896164
13776 896164 578434 726689 798421 691405 659383 538851 783203 756039 835464 700281
13766 700281 698353 527108 690953 798401 377445 768538 651469 762212 828186 644752
13756 644752 481248 616997 557896 772027 662794 873635 644121 424070 785738 568236
13746 568236 760541 731175 668465 511468 410806 588112 969111 486817 575852 1031067
13736 1031067 519324 616206 893175 684414 675780 345213 415297 666681 254489 682033
13726 682033 491544 433986 411954 612533 837309 372204 530989 409943 629038 432526
13716 432526 368076 654906 496001 357919 651719 525516 571096 664261 372746 424649
13706 424649 769971 583532 533298 527731 674718 403860 284008 489824 413519 361733
13696 361733 467814 427608 631040 649847 344000 525599 642427 614869 597773 503258
13686 503258 544958 456980 389714 197479 283557 575140 463304 587979 557935 715258
13676 715258 661533 299297 566223 58340 637484 562908 291662 499143 567423 301698
13666 301698 442037 749701 446079 244982 28182 229985 624969 535081 705336 297824
13655 580989 370794 453069 381873 549505 632164 275287 18801 659387 363761 -18247
13644 530002 521883 547610 230493 369733 696799 254270 482939 306120 373331 795342
13634 795342 372490 220513 192676 446893 706064 347586 386825 419902 562389 290497
13624 290497 353660 446093 586924 418750 371901 498582 345396 277771 454810 345948
13614 345948 696091 421831 398877 502675 16899 462696 287944 185807 514983 201649
13603 223588 348658 513048 490396 419345 109466 283718 129568 433513 101094 205434
13593 205434 480612 527115 448216 313158 352529 294245 571307 296021 403081 329831
13583 329831 210042 463307 242115 134497 79740 295885 342618 312286 341243 223868
13573 223868 323107 393052 528470 138152 603869 410842 452092 594012 558719 483960
13563 483960 343683 172725 291108 349460 377073 200819 -61592 43742 374862 144941
13552 329822 7595 373906 254895 23562 200091 138818 296041 455027 347668 -100196
13541 387975 332716 194287 72464 499404 191531 418368 58190 236379 237965 150325 118423
13530 118423 282991 310110 214198 -4782 147140 189650 373387 193953 327959 659348
13520 659348 -17051 208112 185640 407476 289394 44075 433303 377932 285481 516883
13510 516883 626963 306350 179184 -93630 629146 149185 450424 585 119205 644130
13500 644130 359307 148718 304245 316190 366472 156636 395323 493266 77017 259535
13490 259535 611963 277419 206161 199744 597425 45921 335426 151401 -189281 102113
13479 252661 497272 409999 268155 259770 221688 219942 289541 517327 44887 241738 261525
13468 261525 36594 432396 205203 42215 254988 -321388 26538 290203 146559 169913
13458 169913 58891 401571 73682 237772 105090 250228 411854 228296 300346 42537
13447 268192 420679 220958 472585 300504 286713 242271 -2154 179446 405747 73441
13436 -32373 -150970 219401 176662 56779 213219 105919 84613 506654 342749 81404
13425 209614 49142 174049 -39224 252009 168904 285685 348090 295854 232033 515817 217454
13413 324336 -26123 382500 115157 278786 157683 369855 180652 -298906 152927 45625
13402 176884 122951 532456 322117 -114720 419774 91798 306746 6172 4780 435955 89346
13390 263768 122709 41130 448761 389994 230492 175050 65886 152415 184664 175133 337418
13379 337418 -30602 269829 45757 127838 308982 -5624 316321 202158 175410 561932 172416
13367 38654 39946 161775 258040 -21457 147639 240799 86908 406628 -77850 249363 60520
13355 148761 231267 241632 45311 284880 140478 224314 199686 276450 214082 -135231 294257
13343 79156 236625 420953 106073 69174 351298 450437 238127 341622 450454 483023
13333 483023 170244 561406 202387 332141 143967 -80874 433507 196676 60202 363091
13323 363091 277246 -149568 64851 -144933 309219 -86359 35464 68266 110316 375233 418850
13312 418850 249192 408492 64281 49537 -129195 146846 114221 146475 335615 112401
13301 -120374 42879 153526 197030 426194 371667 201469 149082 75983 266578 14305 288773
13290 288773 185321 308421 316357 298381 189247 -77625 -90619 -54505 222715 102388 32608
13278 243099 39769 -75459 231068 -56510 333668 432565 198640 111954 218742 232505 148409
13267 148409 92937 103544 96232 613657 18285 84731 138927 63806 247946 -154199 -38128
13255 247514 290675 -37861 -169234 -129466 116353 102417 232724 172494 -28788 -24340 23434
13243 329141 216012 71409 173371 53003 87756 281736 -52693 372759 -251722 -51537
13232 13328 121731 469345 127154 343294 134257 258213 290045 415809 -81350 318079
13221 -4082 197763 -156656 -207389 198635 309767 -107891 156020 -14625 -39927 63584 88134
13210 88134 182179 118318 201032 57992 278455 234666 -120241 232678 18337 185157 95366
13199 95366 159400 112730 -156259 380803 125503 91968 -45566 303478 188833 170582 24864
13187 302897 233082 -75581 134819 -170038 -75737 -171514 100394 63573 -534 43836 -78833
13175 134713 264384 239602 293798 192467 199375 316861 21315 215643 155922 106447 -105379
13163 36587 15166 194910 -244365 -173808 62142 135918 198975 -131064 32480 283254 -2795
13151 437852 -6337 61288 112475 28806 -96150 125855 91204 -61216 228365 53390 109512
13140 109512 234422 270003 46152 307970 202231 -224128 386200 -157113 379941 237397
13130 237397 303335 751761 -181720 195007 -141283 197147 254106 154760 -69589 211153
13119 133695 151437 -287213 -363209 127737 123920 32477 274096 48251 281475 -102556 333601
13107 174794 52364 -230991 260231 -173316 -144428 112630 291645 -39409 14469 -67413
13096 121005 204813 41968 -274468 292834 48385 -29805 76838 -114926 -195356 311008 -51872
13084 -64451 -149329 -16966 113669 201806 -939 247048 167814 -27535 -7280 -146089 219350
13072 -29645 37949 -265997 -9004 200006 26835 1171 51059 79516 9930 -30913 -187928 169815
13059 240836 2014 -95479 271541 133413 86642 -80030 14360 -250816 147226 -117421 34151
13047 131696 -43916 90289 525998 -169608 326179 -246314 52339 371944 -33299 -12994
13036 -101102 -228916 -146496 -108747 -78659 603515 -66975 206525 54900 -66067 109414 -135378
13024 -195505 166915 -123861 118698 -1993 142237 -40551 17580 46363 11719 -88110 95538
13012 -203250 14222 -90245 16232 434226 199858 326078 54570 158663 78609 51455 292441
13001 292441 292281 -87155 153879 285393 -97958 -79487 -30198 198019 -121657 252450 -139946
12989 121174 -158259 196521 -129538 -72791 55145 2239 97338 175136 381820 89738 213801
12978 213801 -51431 81608 171648 112603 151527 -52968 -87676 -175307 95639 -309077 201506
12966 -13291 -312226 51326 110039 362682 -210271 32750 211130 -105160 197827 -196121
12955 240128 70025 195438 187538 -8887 73164 -65742 -190527 -247436 58012 19636 45695
12944 45695 -66294 45521 -127243 246344 -112984 46503 169125 229055 -109334 -152983 7416
12932 170584 72844 304637 255954 65452 10721 11301 167488 140665 51799 161389 93895
12921 93895 -33958 -96899 -218758 47011 347971 109960 -256397 40402 105728 -29634 52567
12909 -310182 281060 -123841 -109060 -3506 11256 -216616 87301 96150 -38019 -316060 -280127
12898 -280127 -195609 14031 -139596 265343 -33822 -201472 135254 161321 -101790 350128
12887 -27536 -100618 -104679 -266232 6642 178459 -246790 256708 -60071 282202 -39873 -113813
12876 -113813 -166997 -99427 -65906 161109 243097 96921 -268172 48746 78902 -154088 -17635
12864 92445 -184773 136259 -274835 -4969 180631 -149953 -106892 -48353 -98120 87741 -50455
12852 184854 124393 -153866 36127 -117548 -179666 46988 174366 265765 -284432 -33321 -178875
12841 -178875 -85160 -128995 46774 -100766 249763 -68510 255507 260696 -139311 -165883 133090
12829 99092 61515 -93360 113956 73761 -2236 127232 -407235 173822 11184 -96244 -21209
12817 165636 28893 -42704 -74349 64008 19169 205313 168724 -69255 374862 152609 161405
12806 161405 -192082 -135279 126929 66427 -91952 60575 42043 115770 -155754 3839 37471
12795 37471 -116801 -251289 485129 -339713 -50061 -80460 199551 -213174 -44841 37198
12784 -330891 117339 -454480 79604 -302301 217275 30731 -166891 -57477 -235563 -101802
12773 81305 183607 34843 115802 -19929 198010 323881 120477 188006 98904 3154 172422
12762 172422 347785 206804 -191994 -164371 107688 -37469 -176402 -156446 297367 97748
12751 -301134 -49574 221303 264963 -166215 101677 -168256 73228 65161 44699 109791 403471
12740 403471 210760 272494 -93352 186398 -160897 -92871 73804 -163850 -141983 -259795
12730 -259795 77372 30204 63764 45283 52412 28796 -148477 145949 3983 -130871 -46722
12718 -44242 -353713 -231696 13077 -53726 -307973 114322 367698 232230 145389 -187911
12707 212492 356497 -180719 -27723 259922 -51514 -147572 -300919 -384691 -386549 -65473 27195
12695 -159371 -105804 -31186 242290 96816 -56987 -42382 -180559 -492253 5277 18274 106420
12684 106420 -213036 -106493 27018 70658 159493 245682 216514 251094 81507 103491 -8248
12672 62073 -62892 -202911 357820 114986 -33511 121285 418305 85646 199274 298466
12662 298466 -103059 7896 82336 -9828 247619 222098 283426 -87721 -144743 388422 -113736
12650 107175 -130591 42763 71151 60959 64988 355572 -144497 113284 11900 -48308 -214566
12639 -214566 249975 -51131 -131932 55937 31628 -70121 -144594 78593 165089 229970 39629
12627 -32945 -198278 -13728 119251 -110355 -268141 -345322 9432 -53881 13562 298456 -55121
12615 -89280 166671 -187666 -97063 53487 187353 -70409 955 35737 -365495 -85213 -179113
12604 -179113 117766 427420 -1787 -102607 180879 -143390 -45849 -295455 362140 -189397
12593 143103 -2794 -25938 205225 -138276 -77864 -112375 -145675 -46425 314827 176147 217161
12582 217161 9150 -24343 -244010 -35354 59669 -19409 1143 -204707 -45472 181301 61704
12570 -82744 -37671 36872 -343658 -199720 150213 14490 -267279 23206 -17448 -20334 332774
12558 91843 3219 -282823 73199 275796 254679 368867 -8143 -44073 -174919 61454 -128612
12546 51789 118809 238410 128948 80764 203493 45566 -20226 29307 143775 -49540 198189
12534 23320 -260166 -61882 152269 22919 112232 -144760 -147509 123400 -59688 -82373 -231341
12523 -231341 273136 225796 -200166 -20833 -124516 -48700 163034 307835 404319 577608
12513 577608 326616 620760 295652 237545 316234 -134900 230560 -18301 196073 51308
12502 -186277 -19810 -80584 135123 350845 -188069 -134322 -69053 -153414 -213635 -188338 -133235
12491 -133235 158383 38473 246302 256838 -116176 220781 -67103 139061 337245 335242
12481 335242 297581 44652 -20826 103836 179889 -284954 -1697 -79383 -27058 103101 -47715
12469 -132449 -357603 -355534 -190755 -62930 -44160 206180 -158309 -190421 209548 -256832
12458 -262321 205033 -193200 -297622 -111430 159842 337628 114230 -295829 200358 -86438
12447 -93641 -43699 128427 -358033 191244 -73635 271687 140993 185667 -28038 -64517 153458
12435 -145114 46660 82129 29972 228743 -78225 212439 219905 322595 -114385 129550 -70793
12423 -21641 -100058 -166597 126320 -62390 -175731 -306641 148192 59902 130509 -133922 99394
12411 29566 -14695 -574386 102763 137892 250138 102668 -78712 -36385 -56322 -76550 394656
12399 189904 -60330 23809 -73608 65073 -205853 -218481 67539 52190 90800 470664 103574
12387 -51920 -104551 215344 -63104 261543 200843 -96205 -186656 -137968 -145091 145751 -98735
12375 128418 -122340 8124 -332511 -264965 53178 -114504 78995 -267881 21772 304086 236827
12364 236827 233844 258044 -173361 31869 -3404 174758 83851 -166165 282968 25609 -90767
12352 -28582 149843 69937 151380 12714 -92838 55787 158177 192791 529630 123109 -73275
12340 -112947 -201626 -35988 -360724 -64063 25841 198310 -1731 58713 121807 7467 154846
12329 154846 29445 128167 -238037 73037 61950 -258050 -65146 -61630 -30892 19523 132293
12318 132293 26104 -135155 130396 110508 126669 95555 -141048 168171 111547 -6422 238303
12306 99440 -135078 180894 127510 15894 131797 43300 36100 39854 9879 -164391 -161362 44638
12293 -47629 -394211 453931 -147399 -37400 -214796 268515 -117309 -87744 -15968 220346
12282 107785 -173303 267222 -53246 8036 288900 -119863 237221 -218005 -58760 88544
12271 320693 -92203 205724 -171356 41954 197599 -93118 230149 -140533 291199 -145208
12260 91194 47746 122522 124181 247736 -263024 66841 -24233 241960 -165280 -70729 26602
12248 53842 -64096 -143543 -302480 160180 -289103 -54805 -198371 -389919 -120592 89374
12237 95617 245523 -14884 -36428 98981 6683 -203421 17572 25702 50452 25778 302103
12226 302103 105302 315297 204377 146842 177150 128909 227537 199769 293822 137782 13015
12214 533332 437322 -107763 111431 192976 117378 172389 190251 102117 284773 -164001 226057
12202 360478 -243072 -1613 231580 -72803 229290 614075 205865 240765 310211 248662 105136
12190 124397 129096 -110006 185124 526096 219259 140510 221430 337830 226660 323588
12180 323588 180614 90823 141418 133284 -46436 -79059 206865 -582 187987 76268 -151073
12168 -89002 208501 84334 477601 -103233 144078 142043 281300 288705 289153 55591 -46968
12156 256484 212777 90994 118270 109074 -22013 -158238 -20390 243578 54595 300155 352451
12145 352451 257150 299950 446547 239439 -99143 114615 105495 -273377 280407 178748
12135 178748 110275 -25654 220159 315035 670636 80309 211622 -47743 -78925 203252 158180
12124 158180 -74576 130663 197553 -55425 108001 257964 37712 -114703 100694 57716
12114 57716 69012 343095 -247920 231382 -14292 48997 -43882 167912 76603 -196617 -76626
12102 55507 239315 -158149 -13735 187646 4534 309896 17962 -275024 13908 -457114 16995
12090 -198898 146532 249290 209747 13822 155371 4051 -199804 326088 -25488 454224
12079 157240 -63791 -69653 -144223 -225551 -152829 -12062 177180 15135 246719 91154 -19048
12067 52347 18775 18865 70347 -111501 52219 188086 221547 -14399 111353 184562 293788
12056 293788 187787 259419 -165869 -30045 66297 113242 380196 -214642 -331776 -19479
12045 392068 98305 196344 6288 -85317 187390 204096 -93699 15021 70962 45375 232571
12034 232571 -57927 -167877 -212652 -131812 -92257 -218978 -97821 57208 -147886 -136895 260473
12022 -7224 -49496 250487 -340602 138964 -173784 -222178 -134962 -99045 -49668 76550 -216657
12010 -47932 142735 111626 97627 28375 -405149 25021 -86896 131141 -210469 -31678 -66481
11999 -66481 -109896 -213988 -107262 -294169 43546 262013 162500 195430 -116253 -180758 124239
11987 -340846 -88677 -39916 -341610 -200073 -35654 -85491 125988 -180681 -149372 -138817 -135361
11976 -135361 -1173 111552 270405 -117644 -157888 113005 258331 -164586 34331 -26991
11965 83527 -190002 -173611 296726 -213486 241214 -45844 2015 -176078 136646 53492 -94753
11953 -135258 54618 189932 67955 -7314 133719 197492 -68067 45054 -108877 14214 211616
11942 211616 -147225 -127276 -56959 8126 102377 210676 24814 -8389 -162245 217851 -112826
11930 69937 114648 162629 -63138 446680 -258147 68983 44204 -42099 69506 -126800 165206
11918 -17655 -200862 -269097 286970 -322820 51721 102905 -10999 38616 -67544 -182570 -107351
11907 -107351 -62097 121468 178091 16696 -245106 -175073 53432 -92378 45007 234223 -280680
11895 -178570 112527 -32976 -158254 -42373 -230635 -134371 -79492 -94667 -298832 216277
11884 -242325 129211 -9327 230363 -117563 98340 -104255 -329142 -334835 171899 141277 -29244
11872 -90880 -249371 -186283 -205935 -6780 77581 -221367 -222533 155061 -8485 -39379 -79735 -271048
11860 -271048 -234563 -223962 237179 50120 -18962 -287919 -8903 -53738 -20221 -220860 170011
11848 117062 -93971 -48480 338793 47076 203648 30613 -144597 -353256 45245 23114 194026
11837 194026 -272064 -100870 -70400 -107653 -185601 -342873 -11246 -169221 -294349 5043 -262970
11825 73355 118377 -188176 60621 -48827 -116196 272184 -220489 137412 99643 -147812 -183227
11814 -183227 -302600 -508 -197544 68057 1946 60681 173701 -133890 61525 -52635 -125035
11803 -125035 -25925 -82199 -167256 -103119 -408012 -180288 133333 34131 -349706 -66360 -173520
11792 -173520 29249 120871 42306 113570 -281271 -504640 -126916 49201 -376076 46998 -158524
11780 -218217 -296716 -4620 199611 342511 189228 -149774 -157706 131273 226103 -7250 -223201
11769 -223201 -67221 -26479 -74331 -133292 56197 181270 49154 -301846 -43565 67007 -150589
11757 46062 -106472 -13487 74716 195543 316058 62074 -263953 -320015 -116365 -158345 -10936
11745 97364 -159493 -269078 112466 151551 41033 -18906 -42164 155323 -69740 169784 5468
11733 -10942 79540 211920 -1483 270972 -230222 30429 -266285 190647 -165046 111957
11722 30589 -427886 -34633 -144620 -89301 -141029 -330069 -24899 -30294 216991 161926 -100432
11710 -146604 -78531 195815 -116957 246454 417252 -170753 59870 125661 113404 8042 -260423
11698 -278240 244555 76218 51655 -106654 -94458 128028 91597 259686 -197793 -121106
11688 -121106 130755 95598 -62726 -157879 255663 -90045 -108197 -21828 -11018 305374 -49327
11676 186306 347737 111730 197243 233188 241513 16795 -49278 23081 -90886 245820 -211471
11664 -385464 -133498 -285144 266826 -14 -21317 136136 -14458 -160682 451748 -302178 27937
11652 83694 181344 -209679 258889 -283324 -71794 -324323 69999 320056 -26410 68587 39331
11641 39331 -128970 13468 208648 13824 162407 59332 219650 -152051 58295 237044
11631 237044 -139820 86948 -116239 48820 293569 -4868 -23691 218737 -86068 52564 -232078
11619 72108 -79127 329595 210764 -366293 -282712 -238605 -218230 -15280 -169827 -158052 -122743
11608 -122743 30343 243744 66995 -80705 -156563 167234 -34850 124734 197517 154802 -46833
11596 22030 -57994 87027 -272136 109921 -140566 76215 114635 -155684 -160464 -15552 205331
11584 -108564 263074 -22058 63853 397104 -60846 63067 82881 320289 -57499 86313 -170489
11572 146532 -148334 33002 95455 -88260 191436 -24886 -31865 105308 -6704 -258913 -77941
11560 241176 149272 -236556 331712 -72139 219688 -72410 45514 126156 174530 -45695 258857
11548 153618 98573 -131711 147137 -155501 -158054 -48702 199455 480473 -183294 173578
11537 -164774 -130658 217447 140630 67208 319609 -41239 107289 131080 80893 -52648 154739
11525 301219 -93269 -130013 65969 179950 245900 174046 -59980 16213 218809 229865 42813
11513 -11156 141561 -62960 160494 -336320 -116945 131493 161746 117556 -55985 -55251 -217274
11502 -217274 -57484 -235871 93664 22075 113645 112119 172287 91137 18842 -145153 277951
11490 88906 -181825 -123556 -142655 195996 30596 572794 533249 160260 -55693 182044 -89660
11478 -19651 294741 -300565 107290 242294 166062 32698 110993 218487 -182267 -788 511780
11466 164269 143098 -38087 390380 245669 466216 23230 143994 414406 173775 224326
11456 224326 280221 40168 173974 40983 196925 198848 -79192 32657 -68709 76730 -301436
11444 14850 -63048 512903 -177434 201274 172268 -71543 435980 3832 -179167 -62683 282070
11432 225980 319315 114331 -84288 -164948 -101424 123950 289865 -66921 -40886 2058 83754
11421 83754 -522600 82915 424190 29624 164744 255078 194554 -50776 93170 250376 100005
11409 13392 -151014 254448 17480 254116 54105 63974 155548 -71404 139677 -80435 58201
11397 156249 -270419 -65139 -337640 -206090 -78581 -3010 79296 -2185 18394 178086 120748
11386 120748 220321 -53623 168578 -82924 16063 -327651 70931 -92587 -52745 111798 -118402
11374 17621 312921 14188 199948 29445 14578 101189 -208038 -213375 -237706 90197 383185
11363 383185 122756 252501 -102505 -217401 -23526 -207884 -212624 -170075 -19257 -37427 218957
11351 19936 -216475 92178 -13891 -387019 -78554 92342 214160 -56302 221649 94313 187018
11340 187018 -99052 -156443 38170 194991 8985 177991 715 -288995 62904 -24487 260828
11328 -259263 -82650 112992 20358 -225743 -121647 -122375 -86460 -299017 -56067 -549320 -149794
11316 -76476 98788 -45673 -127898 -210299 -68824 -266208 -236343 -31622 252507 -410749 -339553
11305 -339553 -198922 -213439 -108406 381071 -335343 -222926 -185944 34899 78307 -146136
11294 -114800 -225777 41871 -45983 82979 -547525 340962 -175279 -237039 192991 96602
11284 96602 120581 -71569 159534 246827 118578 112980 -294655 254139 147772 -165341 -192335
11273 -192335 -99623 -28816 -97583 352415 -359939 112009 37803 13565 41494 197866 -256624
11261 -124982 -140399 134448 -50977 -257021 -173430 -8030 46728 264756 162275 57551 -66949
11249 187213 116084 -111999 -53677 -189686 -161414 -111203 -346380 281978 134514 -24251
11238 -19210 249530 -330830 -227534 -388637 50251 -66460 -37415 11167 115762 -175123
11227 44862 -219080 -313018 -224833 -173847 -105492 -151105 -3447 -12271 175162 94249 -2092 -143296
11215 -143296 -23773 132532 -90597 -127615 15316 -197909 -98594 -210195 -73460 -290885 -4087
11203 148439 -105623 -319013 -91848 -126999 287072 110852 -75822 -51030 -128429 141798
11192 -83581 -114626 -207650 100361 9012 160600 -94082 87467 60446 44592 -3289 63081 -68198
11179 -136290 141530 -148239 148601 13993 -215842 -191674 175425 -486760 -41164 -100955
11169 -100955 113654 -123988 -370494 -49962 -298653 -290119 -4781 -161158 -147443 90565 160563
11158 160563 -5614 -360723 -76267 79300 -263703 -72421 238873 253485 -49621 -91448 -114672
11147 -114672 189447 16002 193042 2347 307097 -45514 79125 82330 126134 151103 -56468
11135 -13561 -16884 59220 -116713 -115541 -129579 4525 184762 -385451 166955 89580 -92843
11123 -121169 -161659 291214 -91063 -129852 20757 -3537 -11337 188749 256259 -226659 395066
11111 78673 -66406 -338058 -40423 -36495 85622 -313277 156076 72718 174804 157736 250125
11100 250125 -15923 350910 284858 265154 65642 215971 -167954 262339 123454 76258
11090 76258 517662 326350 -109830 290863 237494 -23427 250812 243533 291496 37624 85395
11079 85395 372610 260272 220452 369347 500788 235048 13693 181166 1338 310014
11069 310014 -108594 469574 387590 171466 356725 197607 525064 517396 473673 700286
11059 700286 349436 542605 304425 545038 359456 413015 667829 392088 589104 560523
11049 560523 871989 921363 817275 601395 767613 1137716 864583 929560 1125206 802300
11039 802300 1321331 1060073 1006191 1003000 871101 857222 1019785 892321 795358 855466 773873
11028 773873 954794 730254 750558 840923 741182 929219 876101 646446 696933 675182 667482
11017 667482 953237 737834 396904 827586 926011 809330 573324 779852 583919 751822
11007 751822 630395 417472 783129 669618 905509 1136459 701011 593612 593531 749291
10997 749291 598467 769823 296332 1185879 974226 577153 611283 525073 866560 856357
10987 856357 851869 617445 718279 835265 805178 494791 598530 502496 857167 788924
10977 788924 823993 1042547 880762 1336265 1043415 1183406 1549356 1512642 1911918 2126122
10967 2126122 2622311 2339054 2951011 2937761 3363858 3801021 3889624 4046916 3199582 2910244
10957 2910244 2332512 1759999 1585544 1579479 1141527 1010168 1171946 1307444 901014 1342072
10947 1342072 928046 1360867 781428 743691 724280 684020 167420 644886 346995 417359
10937 417359 114701 302568 257205 189151 206896 340065 -138903 43030 218542 -142116
10926 5289 180495 106424 227903 -56929 -169539 142638 -81539 38527 244465 -267133 -39965
10914 314359 -51317 -75572 139545 -27281 103129 -9930 -64057 -327126 116866 -235329 189237
10902 -196548 -110461 -264432 205674 140533 -325166 51689 -248537 179193 88148 94819 31309
10890 -34688 -78953 -73286 57183 187810 15303 -56269 -238021 -326403 58042 194793 -8655
10878 -280533 -88846 15462 -145548 -47888 -355990 -193901 -172647 -9770 -219178 11684 -5766
10866 -17580 -112453 -142468 57382 -19262 -270206 235375 -121026 -252260 -202637 27210 -402806
10854 119525 95843 -247131 183151 28704 175837 -93108 69133 -288371 40191 -91243 -94416
10843 -94416 -50862 -124303 89057 -312598 63532 72246 4915 23380 32586 173472 162689 214850
10831 214850 -99394 317796 297359 -65844 -215664 -210325 22 -130066 55514 85546 -618842
10819 -92361 -159839 -480730 -137017 -96951 151842 -101963 275755 -253992 -109241 -20559
10808 168384 129122 33195 -109859 -441298 -123198 -108968 32896 -402301 -202004 -219012
10798 -219012 171763 -302328 -74362 39907 43452 -127213 -104672 269738 -95814 121487 -126640
10786 304368 -105396 -52302 -70430 345215 -208858 -144681 235514 -172358 -153123 -123835
10776 -123835 -315259 -83769 -403954 204050 239653 117460 217255 -57203 -156829 141847
10765 82158 -262463 -2646 131680 -113040 154126 319126 -29474 -112007 -109476 -54816 -105898
10754 -105898 -45997 -38753 75701 -25075 -222056 165655 -3064 -258363 -428902 -284942 117185
10742 132189 -118748 26223 -64062 31858 -27403 29247 13497 247739 17412 99200 -86885
10730 -188271 257870 -164709 -11954 -110308 -87935 112083 -71764 -300866 63358 118056 -534558
10718 -120797 59753 -38788 43187 59404 -141178 88273 -66464 -115478 -179313 253164 -104147
10706 -119503 261622 49694 -130961 -143975 93759 177252 152478 -307498 51738 -212324 -109516
10695 -109516 61919 -36754 -12781 -446480 -171049 -185951 -139350 -311377 127324 153661 -83787
10683 -90647 -128553 -137745 87030 -426811 312387 -199967 236 -197411 -124824 -131183 -340580
10672 -340580 37285 -28169 -122867 -216532 -341620 -196512 -35148 -25063 154114 9577 -16323
10660 -251013 -121218 39481 -84345 -247204 -311717 -74716 56678 168240 -68867 -31255 -68358
10649 -68358 -74763 -151468 -75958 -314945 495771 -41557 109096 90748 12879 146948 -121662
10637 -284891 -21466 -112974 -82138 -94966 -42784 -45392 -259925 277741 -202726 321317 -180413
10625 85036 -142999 -94338 -218456 64223 -364885 97888 -107512 -222379 -261129 534824
10614 -38862 95994 136024 29851 -130183 186677 -355635 -64181 303358 4198 -296267 34388
10602 -62740 -334479 -50584 -6136 -105037 -84240 87947 -47272 -167744 266135 -343506 9397
10590 18788 114809 -118714 -129682 -506571 128841 97968 90435 109485 -233561 366126 13558
10578 186887 -69131 43746 25911 133217 184137 7035 28537 -8198 -173016 -78995 -67495
10567 -67495 -226910 -163004 -58519 79966 -37687 191904 -126152 -324736 -78908 -39744 150469
10555 -226003 189911 58970 -181538 308244 118974 -343898 120515 -100582 -81927 -241299
10545 -241299 -230112 -69764 42398 4850 -223839 361885 -254755 86779 10088 -162404 -97777
10534 -97777 39461 1722 139161 331742 280616 5021 -518450 -6078 -166430 184730 24001
10522 286736 -79199 -44009 -276525 85045 53999 63705 117649 29686 -178612 96979 63615
10511 63615 -2685 -162434 -511129 39408 -411422 -78072 11 -269574 62803 -252092 -120363
10499 37598 69691 77767 -54745 -240829 17579 227751 117079 -30920 -89618 77827 -170545
10487 -54579 -392224 -66061 -198301 171013 -34338 -220590 -107788 -222028 -108586 -84652
10477 -84652 -186307 171091 66089 -53892 50837 524644 -115772 43925 81332 328555 179660
10466 179660 -34455 97329 356351 149282 402398 46233 144011 152236 -165990 -26500 -65544
10455 -65544 344760 -135896 -316689 162050 166417 -377336 -273294 -66329 -102798 -39505 -98570
10444 -98570 -214380 -115260 41162 98672 18676 118812 -1379 -87902 -190009 -181668 -283553
10433 -283553 -140577 190162 -179136 -68126 203395 115391 -414798 -106742 -84872 -250296
10423 -250296 331651 235547 46970 206273 -230178 -102530 69061 16469 136182 -15139
10412 -325272 136741 211516 -133819 27914 -5063 -169648 106985 86245 -268658 41399 -200883
10400 38819 -68156 -143612 -118311 55791 277101 -55931 -174768 -182687 3233 -23134 -28858 -452
10387 103007 -238071 123556 217348 102757 -141630 -37080 -92882 -142139 72587 9692 155671
10376 155671 276838 -55824 -185801 210792 -127467 89721 45516 210760 203204 51859 267393
10365 267393 33228 8115 107067 37062 363719 469350 542053 242274 703077 689517 155607
10353 190205 176530 61223 309091 278673 -174625 146718 612915 687551 353306 689552
10343 689552 738655 516101 80141 194597 -65987 338954 220493 358180 204743 129417
10333 129417 -62123 135804 699836 254155 -263226 -13231 17250 69465 173022 -112205
10322 183254 106908 -120323 216248 32177 457195 204043 305435 -24805 48978 199694
10312 199694 96778 -18582 272713 -270705 149197 -71095 82330 -209865 -162010 91030 16020
10300 7357 -95162 -107960 -28805 3818 82949 32860 -76898 -167200 -79540 -106310 -149874 -157382
10288 -157382 269 -78305 -254943 -65938 142738 21698 -219085 -213028 174333 -49755 242990
10276 -97347 -231195 126077 -35382 57282 17793 81402 -6616 57500 -51342 -178335 -15502
10264 76940 -9997 237893 -76912 -301209 130550 -305583 208651 -460487 240025 -62441
10253 188318 -183071 -75577 3193 -48761 52101 46906 -48102 252349 -38487 77493 -53530
10241 -173118 71490 -218610 -46458 -347472 120822 -182487 -213041 357621 70900 8323 239444
10230 239444 44700 -47893 -224057 -475390 -128206 75222 -154379 -122498 78119 118019 -269183
10218 10209 70749 60084 15152 328956 -8103 -76307 180115 -169849 406519 28223 66829
10207 66829 70103 -101956 -201228 -104760 -52267 -100694 -233669 -268071 -69321 -192267 -155272
10196 -155272 65311 306866 47003 -419976 188940 112714 -79705 -389959 -121460 -14537
10185 -406145 -67693 -81137 -137884 -91757 -109123 250069 -52876 -157510 -242423 10328 -264761
10173 -119508 58121 -89019 -98511 -28505 25151 -13112 -98743 12383 -4549 59890 137132 -109808
10160 -6251 -239844 103840 -8130 -48474 14445 -182739 18747 -94086 -113507 -222506 -385537
10149 -385537 -259867 -190274 50058 -87476 131607 150103 266642 -25257 -331266 68284 -330933
10137 -681061 118032 -241752 -153805 354833 86592 69911 -50542 36819 108043 -177818 145496
10125 -283487 -61673 -259602 115246 -50873 -145046 63806 -262718 -146990 -98997 -55878 -35248
10114 -35248 137542 -44775 -263732 182445 84266 43374 104917 -425529 65873 55442 -436595
10102 -464190 -224779 111005 -168070 26081 -286595 57706 -14297 -248064 -141777 -353779
10092 -353779 -57535 294608 101740 143780 94647 38946 -219378 20239 57398 81954 50646
10081 50646 229907 466126 -110222 -394971 109152 156766 -126174 -55496 -111579 -104192 -165649
10070 -165649 -215378 -135543 -269872 -331782 -62312 -179485 -266038 -19845 -33759 -79596 -69700
10059 -69700 -62535 -11642 -326088 82194 -280123 -107505 -1223 -65931 -152437 -194456 -75489
10047 -407499 71023 61358 -88399 -195861 -208801 179064 -7987 208038 -129729 -247132 29467
10035 -276615 134978 -134395 132766 -247301 29811 -194912 -37222 25750 -116830 -337453
10025 -337453 -4169 -27816 -275840 -67626 123430 -233656 -140043 -92227 -161212 208711 181030
10014 181030 8867 -161615 -1441 24733 75850 -159184 -234267 -26051 -46062 43184 45091 -36670
10001 -5006 -125473 -64342 -32004 -177021 -323453 -134407 -139477 -181463 72223 120748 22079
9989 -322463 -157650 101527 -355312 41166 -361100 6514 -176995 24399 108284 -42015 20102
9977 40641 16283 -156264 100616 -216198 211616 -20620 104235 -190445 -150474 -112551 -209816
9966 -209816 71065 218851 -325634 -134574 -108588 -221706 -45456 69963 -85549 -103828 -109783
9955 -109783 196093 -110325 121897 5302 -51080 170274 -93358 -65025 -180210 -39207 -2855
9943 -101550 -105698 84522 -330382 95227 -250731 -130505 193961 -158325 -159442 -68426 -216054
9932 -216054 261289 -311657 4947 -113781 -261939 -45592 -275984 -97938 -389550 122995
9921 -167070 -123098 -106628 132764 -214418 -165774 -271060 -113431 -69457 -96649 -400265 188391
9909 38830 -104468 -33461 15465 -310709 410655 -149909 45182 -50835 89505 62548 165076
9898 165076 164205 92867 129142 41810 45037 -199575 -247393 -182746 -473849 -239342 -52477 -178674
9886 -178674 -70410 -135546 -176857 123079 -138776 -300832 203137 -64113 -120344 -35024 -144327
9875 -144327 -158379 -175007 -186924 -70489 -132154 25082 -41329 200037 14480 -474315 6882
9863 -288731 -63962 28742 31213 308973 16727 -125024 49727 -38684 -142170 29338 -168749
9851 237185 65716 208299 -207426 10196 -270758 -798 -405119 -287141 -5353 -115097 7825
9839 223883 -229649 -75513 -42043 -44947 30129 -176586 -381927 -97616 -227013 33548 -3352
9827 -33011 -327211 -50509 -414788 57648 -286610 76191 31967 -264168 -306572 32517 -33080
9815 66748 110720 -29665 -299205 -81120 -55596 -74261 -34008 -174772 26326 -227266 -341461
9804 -341461 256930 38078 -62212 -271987 -127147 58444 -138432 -135854 101098 -311490 114270
9792 156411 -276910 -209454 -108368 -245701 -59787 -373285 -290339 -11723 -331415 133298
9781 23421 47923 48161 -236586 -160029 -337454 -67102 -141308 255395 -77670 -164274 -51296 -244066
9769 -244066 -211881 -360411 -27933 -352393 -38642 -258719 -253496 -232792 45055 -193726 132726
9757 -58422 65847 -56990 -182122 -239290 -198908 -208279 35651 -185818 -133656 -194680 262849
9745 -211432 -252965 -165092 -622559 -5948 -138503 297970 -191229 -242719 125639 -172664 2865
9733 -17589 64312 -139743 113830 -70662 -63068 -296666 -318669 -171204 254976 -95353 173382
9721 46463 -6200 390852 -71283 159320 -229754 402334 -58438 -296174 -27242 201955 66630
9709 42084 -19354 143231 -201324 -180284 -177076 -5331 -77080 12003 112838 -384030 170979
9697 -661597 89190 -15004 -177455 -4674 419838 158764 193820 -220984 177726 -84375 1336
9685 -266713 -120302 63419 28823 -308307 -39733 41308 -412832 -366958 -125109 -461395 143040
9673 120462 -159057 -95226 -440441 -228851 234172 -33643 35612 -150610 69158 123204 -16991
9661 -78123 -85557 -110411 57286 -141872 360530 -76905 -251852 -154632 130783 221085 73707
9649 213256 -72283 19772 -230116 -188373 -102771 -123868 157448 328822 -358067 47458 -249704
9637 67873 -343059 -23705 46279 -304787 112382 -68978 -73226 -105915 -234984 -84952 270304
9625 56255 -316748 -159892 62106 169845 135300 153485 -37660 -45123 -201699 -151817 20853
9613 20119 -263799 -26929 15344 -82881 -22240 288363 -345611 205326 -209389 -111817 241103
9601 -35116 -152342 -48029 37488 -75246 -18545 -163402 -137315 -224291 53332 -101623 -245822
9590 -245822 417947 -12555 -243685 -8214 -246230 -335116 16067 -141977 -101234 -379608 100889
9578 -70444 -109093 26869 -89529 212193 -204058 9598 -43387 213427 -167795 205317 -30730
9566 -110731 -498261 -112626 -230679 -48566 -303660 42224 -5856 -25990 -112368 224101 51990
9554 138801 -296984 -98844 -8727 187312 394770 241229 -154576 -234168 29166 138189 86221
9543 86221 -62300 154565 -424703 -35858 -148857 -34092 39286 -25514 -61558 -238094 -364481
9532 -364481 101973 -190168 -112454 -95496 -347130 121831 -103287 -129410 -140175 191419
9521 267231 -45210 -248291 -144447 18651 90137 -64018 -276939 242347 -71987 76279 -66242
9509 -286466 44621 -159909 -33473 187043 -260516 -371527 56394 -236197 44745 166417
9499 166417 13405 68329 -190110 -31782 310826 109852 -182655 13288 -89606 -282792 28179
9487 -235113 -7619 274473 52359 -944 225455 -341464 -100258 -59005 70554 -69852 110480
9475 -172740 -64401 -197132 31128 35415 -226083 -331655 -43058 -142912 35835 -76313 242178
9463 -52139 65270 -91045 84041 50499 -35971 -253598 13490 -66012 -5041 -166412 -72942 -105242
9451 -105242 -163766 -151528 -107364 -33280 -205573 -437571 -215004 -370592 268805 364463 95868
9439 -47879 -132801 -150870 75824 104745 -32703 -249574 76000 -47291 172511 55285 -223009
9427 -77753 168939 -184737 286222 101161 183059 31159 -253961 -106597 -94160 -207127
9417 -207127 -250405 -226217 -164899 -122154 56100 -241641 -57636 -279622 -194564 -380331 86804
9405 -190865 -87258 -383684 556 51597 -260884 -134141 52087 -81948 128136 -203634 -331689
9394 -331689 -150391 4667 -199787 -199434 -41304 -158732 55687 95912 -311657 -359583 -108229
9382 -2467 -99423 -325222 -120306 158608 -47095 16202 35819 256990 32856 -222659 -108082
9370 -64591 98885 224928 125867 -306172 -342213 137811 -60385 -94143 -217219 -116240 127623
9358 -447704 -136888 -48485 -82189 -74480 -44494 -90 45308 -221887 -385455 -12537 -24100 30426
9345 -54530 106519 25832 -140030 -169936 8464 -277595 -272548 -358177 159697 297779 -119790
9333 35417 -351189 66712 308497 254611 -363515 14852 -177093 -36631 -92994 -193661 149779
9321 -191919 -197733 -115115 41035 -248871 -127390 -369848 -22655 -87734 -8479 33707 412979
9310 412979 -227046 440055 431484 -63635 -383795 79612 40287 223655 42160 -39694 122735
9298 135412 -157792 -157821 -194572 156300 -160277 30731 221390 130187 -405619 -272376 117871
9286 -78357 -279622 -176517 -359302 -63 -53934 -31457 122908 5096 13706 -212341 88700 53579
9274 53579 332760 50962 -167933 300540 -107513 170033 -243042 46102 -230568 -31187
9263 -375504 -24307 -49714 -197552 171345 -251288 -280243 -285795 55902 165756 -82999 -249582
9252 -249582 78131 -26693 -350357 -14437 -100091 -71346 -19741 -79695 -119926 -128404 84726 104522
9240 104522 -114098 105308 31263 195046 -53478 13144 -160945 84363 -94954 -183678 -121042
9229 -121042 25641 -214049 91687 -191627 42611 -250216 -188633 382815 59950 123669 112594
9218 112594 -109358 203032 56913 -187164 7863 145472 25078 -117482 73678 -144730 -244863
9207 -244863 -58186 117559 -259314 -104858 -64030 -58945 281360 -51806 -49029 177229 131484
9196 131484 -24592 -201762 -395514 3628 -176377 97983 21446 -151735 152260 180097 -216706
9184 -289016 -312744 -218556 -153175 3504 -157361 71266 -210914 209115 -40662 8471 -150378
9172 230756 -22214 -233760 -210466 11121 -87115 -50737 31390 -182046 17134 -30047 152163
9160 18012 -44831 -16172 -4597 187658 57315 -128358 37952 111236 34247 -3204 224169 -171322
9147 -386283 86824 139714 -193831 116680 -77130 -23766 -204039 -180449 -33909 -68736 -46766
9136 -46766 265577 -59955 -281705 -271484 -116801 63227 -53359 -306249 -86725 107696 -44887
9124 162718 -82316 -58663 -83493 -203718 250399 12455 -78886 -157621 45030 275200 15395
9112 -137532 -200727 47150 -231231 -241273 -39748 208569 -143173 120919 -153353 -7630 45473
9100 -53267 -39061 54493 -20436 -347040 72971 8547 112143 -217827 269972 -182667 -251809
9089 -251809 -60784 -4104 -10365 197716 -230484 -59071 145359 93357 -231307 146910 -32443
9077 -255865 75957 -71884 -246343 -375969 107899 -104181 75089 -182510 -314100 -721 -153213
9066 -153213 -41118 -199824 170060 -502564 -365719 266115 -26301 -75667 280614 -8984 -151727
9055 -151727 -3764 -147058 -199573 -183471 71228 -44663 85697 135874 -68954 -75168 17367 -7627
9042 -93107 65731 178107 35032 -95742 -257247 98896 152011 47656 -239752 -387968 -247438
9031 -247438 -132001 -3816 -58915 118381 -118380 159124 223331 -58899 -128665 -116526 273878
9019 -170468 -23273 116847 195659 -247240 193488 -242755 -97132 60818 -140447 -222486 61518
9007 26370 -145541 138358 -168164 -83271 161462 -261935 -392804 293244 186655 -3791
8996 108105 -353857 -103553 231099 -171618 -229699 -50818 11804 50620 -7369 -154311 106305
8984 36631 32670 61199 34799 -113097 373540 202019 -445128 -94539 184719 -209664 124813
8972 -1906 -5368 215955 230055 52215 54312 -345497 54911 -14615 -90032 145780 -299061 127654
8959 -26892 -183086 -73303 30434 -113829 -33476 -195341 -10694 -313500 -172968 24836 -58077
8947 -240721 -299078 69182 -74518 -96361 2607 180670 -528156 36014 43371 -135374 -205182
8936 -205182 -48626 98058 93556 -153127 -418941 -33688 41526 129262 7071 -144059 195952
8924 -13249 -21770 -416130 45782 -307664 -6457 -2441 398923 223981 616208 168767 241904
8913 241904 -194729 13380 95798 -116491 59500 -953 -3303 -134288 -55923 678 -229741 145559
8900 -137993 -78316 12158 236369 71448 -106009 -211647 -17622 25398 8087 169775 -155309
8888 32652 -245721 -167963 24852 -226932 37691 -39043 -12693 -145423 -81803 175826 -303238
8876 190936 -307711 86094 -15511 -129530 -7254 10886 134131 -97230 -173289 230582 106074
8864 -73366 327081 -57560 -160404 -64495 28578 -68488 -208668 -4912 117301 -154357 -156750
8853 -156750 121751 -176994 -179526 -43153 -231607 -772 16758 -9575 75136 72780 -294868 102878
8840 157288 -273508 210947 96584 -346778 4626 -37028 -170111 185909 14190 -134160 85043
8828 -387359 -251285 -1885 159328 270163 -56360 -285368 -43926 -293304 -73441 192744 121689
8817 121689 -210002 -269583 -305462 -187007 5042 220019 200461 -74301 227190 17871 15370
8806 15370 25324 4729 130562 59385 -63120 162891 -167276 -448809 -129049 -144468 30536
8794 -239806 44168 160670 -166668 -195256 -293659 310717 -75599 -125284 -329174 261245 56902
8782 -70490 253380 170156 -88084 -37241 -247795 -277313 -1321 -89526 -585 -198113 -63386 94848
8769 197010 -37877 63515 -410385 152969 69272 -28621 -67705 -217960 -35254 -65342 188501
8757 -82772 228411 -12017 -321782 -61326 -32056 -113712 114259 55979 212992 -293082 -149839
8746 -149839 121462 -193541 -128132 -427770 1458 28288 -197221 6115 -123031 -45301 -330334
8735 -330334 50820 6246 -327791 179455 142893 33414 -72223 212624 -129677 -295271 -54830
8723 -276864 -188466 -87274 18455 -54054 119738 32359 -13923 -171231 -199825 150261 -59222
8711 -99794 159880 67369 276136 -162132 -201828 -247395 217700 -138008 85578 84629 -119146
8699 -52313 224362 75107 -159791 -217210 -207374 -37661 -79987 -33771 58902 163515 -479476
8687 -8507 11232 50960 -24052 -173401 25809 199256 -255286 -109887 131526 -165698 220315
8675 -161130 19862 2211 -42715 -141153 177153 37435 -214882 -235012 261358 -15 -43268 125172
8662 305597 -225430 1026 96457 52923 -1502 -259689 -445096 -184441 -117147 -279097 -23651
8650 158129 181376 -107037 78755 25536 -53185 2511 130644 -196940 20311 -136701 23172
8638 -432969 -228161 -135082 261478 -257298 383782 8562 351181 -37633 -38489 -44998 258869
8626 224687 -228573 -279322 -236890 54338 -61639 -248051 344183 107794 -256178 -68737 -215853
8615 -215853 20661 -315951 -190481 -37975 18638 333148 20021 -62952 131181 181280 -58034
8603 -55280 -90100 -212315 43114 115520 72921 -260560 -260016 72649 -192816 -335193 298733
8591 122012 183628 -46467 -342062 -66052 53100 52697 222698 -124019 163689 -298721 -275907
8580 -275907 -179061 -107123 -250481 18339 -80214 -112438 188459 -118973 -93067 118425 -95655
8568 215161 -125234 40000 171193 130746 101123 -165997 -162135 7791 -155848 -173885 3375
8556 -188245 -110353 -253040 -253150 86076 211763 31145 -180407 41501 -43410 -172946 -158024
8545 -158024 -93444 159574 -47780 79188 103266 59605 -129403 99641 169046 93178 257942
8534 257942 -105870 213097 179469 210241 89691 -209656 -25662 -173757 -221092 -37556 216906
8522 89141 -274297 229002 -255416 -62638 92128 70750 -131067 -215634 -69641 -260441 23423
8510 90695 157668 88711 224843 -299555 52303 -133113 -264804 -41156 54660 203914 231830
8499 231830 -453867 142323 91417 -169733 95992 -346584 350449 45368 108805 -164457
8488 -46928 -319689 -77867 72703 -253893 87627 -123446 -56905 -116500 34375 -252863 -4869
8476 108840 62337 -149236 78981 -174481 -220248 -27612 -154736 -339492 70678 3424 -173951
8464 -129115 278229 -140403 -95171 257138 -51431 -2592 -347265 87040 190535 272049 -202752
8452 -182934 -49585 -177429 -370239 -78851 3521 -566199 -79802 -184010 -18960 10691 -83268
8440 -190942 66870 94084 -278134 -208026 -98424 -229569 37526 -66773 -111512 273368 -146998
8428 65856 -149462 158518 56145 -183251 181923 -154438 -87077 -269650 -340167 -203757
8418 -203757 217025 40429 170920 -5838 -414967 -189811 271777 -38995 -46232 15592 -178133
8406 117030 -280371 11969 -89293 51487 141399 -21637 -150476 -5825 -48726 -181278 -160870
8395 -160870 -21356 4931 107047 -94537 -231427 329553 21598 -146714 -82183 132445 -130777
8383 -348902 86497 34782 79717 -7859 -342743 -211440 -219757 99735 -108458 -36156 -45194 26715
8370 -161802 33251 -200297 76116 -30985 329423 -89256 -370424 -9678 259043 31535 181891
8359 181891 149684 -2103 109209 -120442 56949 151713 -187050 12246 -93832 -128740 107226
8347 -132867 31217 52477 -268283 -11197 88165 -80958 -142884 -47987 353964 -94147 -211063
8336 -211063 544532 179891 -29226 162305 77643 -215226 -286553 -337393 -110864 -127637 174986
8324 -293234 -171260 222928 -223899 -419363 -20086 -100658 95494 174510 -207626 209 -13338
8312 -184141 173450 -104456 345553 109496 -395744 37687 -199511 -137978 25930 -178397
8301 182152 122427 -160424 72849 28732 175037 101509 98716 -188823 130442 -239200 -121364
8290 -121364 -134963 35647 156033 -208980 81123 35294 -202562 169959 -148238 -404287
8280 -404287 -36731 -24650 -162262 -69316 126587 -60647 60854 -145836 -27418 -72815 65211
8268 -130290 262475 -106000 55478 -44966 -221845 -110936 151252 -3702 -13406 78493 54978
8257 54978 -125648 -223433 339961 -233577 -40536 -275642 -340858 458 103480 9755 138459
8246 138459 -198903 -104962 -44960 -27340 155795 182925 22250 -114063 30240 -343638 33933
8234 -35270 80910 31378 85681 35816 14174 -108040 -110949 235720 64300 -140698 260573
8222 11333 140200 -29507 -65796 -350892 -113950 -140717 101165 -10505 153346 109325 -126522
8210 -55663 190032 -69618 -274316 -35711 -193916 -32393 -116666 -164446 120179 -1615 -32672
8199 -32672 -206745 -284560 92880 92284 -13303 79118 -49631 -312243 -271678 -173684 -424998 11289
8186 -25252 23386 -228058 -217697 -94014 47958 215368 4213 216661 -83050 -12004 22488
8174 -194313 -189051 -415844 -161628 -22695 -252258 181300 333259 99476 -106337 -166650 -145320
8163 -145320 64205 -254155 -117419 162443 34853 -161801 55544 -236729 6978 2434 8939
8152 8939 -22457 -160861 -106492 -134855 83981 212871 -59458 304536 -105889 -67191 50758
8140 -131344 66417 -91117 30235 265686 -55397 -131305 60473 421160 105446 235896 -20756
8128 175896 135574 29498 130584 -73333 -16138 -162731 173650 110748 -421000 -403091 -152111
8116 -383613 -205153 28127 -326362 104341 153269 35648 45268 -144020 102898 -414909 -135749
8104 -14056 279634 -226601 -300373 -12619 -197228 -189158 -67196 204799 45561 116739 144072
8093 144072 90256 -144441 -47527 -174570 -126402 -301183 -371660 -164966 -101231 -301440 -171572
8082 -171572 -164024 -176028 83439 262500 -160217 95100 -27789 -123277 11865 2950 -29525 -8941
8069 306541 -42094 -228938 -401697 -62835 -87497 182586 -304038 -107735 -139953 235205
8058 -163440 -200910 388051 158734 60632 61183 1397 -37977 -107017 -179973 -178274 3876 10273
8046 10273 167172 210065 147865 -253970 169120 100714 203950 -251029 -139054 51108 -108299
8034 -37511 5527 134710 354549 -410344 -7495 89577 114700 143172 78568 -185955 -80308
8022 -34690 81541 -418125 -133012 -122191 113192 176584 -114265 -306562 -9021 72502 -35415
8010 -298906 -326908 17732 -136579 38523 156356 -134997 70935 -255290 -43361 21165 -30901
7998 -350739 3452 -51850 192342 303015 151298 -13805 89455 -166781 49907 40276 -430405
7986 -194828 70164 37439 -99401 5808 179757 -71215 -151482 -135266 -276830 203854 -109159
7974 -14434 -149782 66622 -172762 44461 -204592 -194526 131402 101430 234615 -26046 -59170
7963 -59170 -66815 327271 16460 -152147 -122648 -221478 -285640 -95685 -418979 -152786 -67250
7951 176501 -117556 -46429 -163276 131833 200320 193836 -108680 -147072 210986 -78669 40700
7939 -228359 -191066 -150430 -149704 -10603 166743 157781 -341003 152217 6297 108288 185283 -131013
7926 -37544 -393060 38753 -3659 -164519 -152404 10735 155702 165204 -194218 -16355 -59482
7915 -59482 -428682 41195 126332 -61049 -26755 -109737 -217902 179853 13889 67201 101712
7904 101712 -232286 -178806 51376 -102276 46848 75608 -47588 113652 -152809 143029 316785
7893 316785 936 30736 -49201 -258737 -322263 -74695 87878 113763 1515 -86462 396345 238262
7881 238262 427447 41917 48407 57136 454531 -20684 154967 -197627 187764 -75692 -530926
7870 -530926 340171 -287306 -128367 7460 -281847 69083 217680 60228 153157 -118172 -29036
7858 48511 -168459 207529 255458 -220876 -62801 -43760 53019 -121957 72134 90185 -331766
7846 199577 -92657 -40483 -150605 -169310 -177296 58129 -47346 -72552 30973 59176 19103 106951
7834 106951 -224363 -144984 113666 -62690 -112189 -47076 -142957 137263 -62372 -159109 -156043
7823 -156043 -68173 17991 293703 56808 24772 -57387 -42344 145883 -89273 -165741 -236789
7812 -236789 27983 -232884 -113005 -338276 60288 -93074 -107346 -9534 186373 -142833 -76479
7801 -76479 -91286 -32659 189285 52248 -180128 -123683 -195799 -88026 -233843 60789 28425
7789 69079 -43621 57993 -122266 -29335 -335781 157573 -313200 -43793 -139071 -362542 -384066
7778 -384066 -260864 -316784 281412 81790 -79714 34253 -44048 235921 -60508 -229998 -133294
7767 -133294 159 66764 143881 141002 -9106 -23293 24524 -81910 89218 -109966 -159158 80357
7754 -60705 -125912 51287 -53209 -12233 62519 110779 -434890 -186835 -36142 -218611 -185358
7743 -185358 41366 37503 38621 -153957 -73865 212924 -27358 51191 80703 -60704 -250881
7732 -250881 -8546 211786 -305206 -163978 136596 -47495 105315 -231192 -128764 -67429
7722 -67429 53813 -147042 145451 89335 -226823 -89424 -70342 -211294 56785 -116058 36427
7710 -124886 -96585 98862 294795 318614 207220 -139474 245630 19896 -246819 101519
7699 -134137 -108617 -191542 317451 7403 158559 -363358 120398 -94186 -82676 -14421 -152731
7688 -152731 45607 52723 182001 13372 -311741 164343 236826 -73545 51710 -86592 13271
7676 -39977 -338783 173598 -172880 11495 26420 -218550 228399 -195969 257550 -235432
7665 161384 -106515 -212137 -291263 100554 58791 -423259 -50391 382862 -213397 -12837
7654 -191394 5444 31692 -201355 -122775 56060 -14029 -174720 39567 -328347 -39348 852 -73686
7641 85409 -308153 107625 101309 202823 -103271 -61017 -117967 -114183 -72429 84588 -12340
7629 -69135 -40809 -94425 -157088 62604 -241095 261893 -94164 -169652 -110227 -119389 168506
7617 -137515 -115795 -73756 -7967 -122405 54881 -137418 -26493 17366 -589 -209933 171173
7605 15531 -33702 30298 -228578 -205011 -103234 244588 -55800 -147737 197443 20036 22984
7594 22984 -48277 -67096 -160054 7327 68990 -464478 -352122 -74382 -225923 -213742 -281590
7583 -281590 -180845 -129261 -17314 -316672 140189 169995 266474 -98878 36038 -40180 142364
7571 104160 114787 168269 -99611 -130524 298502 -109158 -290778 -328940 -7812 -180350 -19026
7559 -193762 -337992 -116751 241876 -37621 -12483 -15283 -305004 245162 -58926 -236536 160179
7547 -218739 -177213 35400 -280603 -101063 -126544 -299045 179412 33685 -252890 18001 28236
7536 28236 -150269 -41182 -334925 31738 79203 61989 -198461 -193885 258316 -107319 2155
7524 -37273 88671 13427 -132953 -116602 203160 -183488 -214561 -151037 27240 -139823 374195
7512 -299402 -193577 -23210 -305784 66652 61436 51504 174318 -207059 248073 -96164 492575
7500 91143 174712 178786 113091 339938 -186081 168720 -147624 11382 188624 -213004 -48798
7488 -223071 153958 253485 -8578 -40539 55500 -158271 -25529 -339859 -20881 234460 147334
7477 147334 157895 246934 -73397 221529 -231233 -18627 -107479 -224785 -46255 -160380 -287552
7466 -287552 196452 228719 -176126 43311 -218133 -16162 -248361 -214124 -246007 -188056 32927
7454 -191944 -136932 148575 247370 -27917 43657 101463 13350 174774 -110446 141240 -20811
7442 -119732 -148602 -320236 35935 347405 -53130 -32226 -37016 -269816 113808 78939 -101338
7430 -251311 333951 90001 -98090 -31565 -10071 96546 -209564 2184 63414 -10910 136371
7418 151412 -27245 64273 -60694 182205 297902 -309975 -241001 -82006 -33528 -8165 -232930
7407 -232930 47143 -4985 -8545 348489 83962 140287 202402 3485 -335236 -262277 32220 97329
7395 97329 33137 -206635 -147411 -124892 211622 72568 202051 313732 117363 123434 108971
7384 108971 -133232 99424 176733 -56711 -5595 -33343 168053 22430 -307983 -35165 58388
7372 -84125 185321 -541 86698 335524 -207806 -198844 -183972 94286 -274281 23348 189951
7361 189951 58064 99976 -232709 156777 -33872 -190749 -275489 -78844 31703 164966 150231
7350 150231 76133 -165108 -178127 -45798 89025 -66958 -306738 39020 79185 -51274 -253971
7339 -253971 337112 -113476 38173 -70544 -108587 -410268 -11868 -89679 152605 74615 80553
7328 80553 -86467 -161903 149506 -60352 -72056 215655 -275277 -65409 32590 -199204 193414
7316 218782 142583 199402 9909 -56264 64673 -269738 235284 34201 -236935 123201 -28510
7304 6007 -146469 -111630 298900 117886 -241371 141282 23502 -62640 242596 20467 -77484
7292 -211599 -174180 104469 -187277 -209591 -249050 178354 102911 197245 187407 -60015 161952
7280 -2562 -80223 -25400 -126207 -248363 -130655 -132289 -67298 240628 -91237 91025 8606 -198548
7267 4630 -37865 -212726 -230133 207751 218244 210098 -198039 -42663 -144244 28697 90701
7256 90701 -124836 -83520 75642 -82898 270854 -99715 8639 311917 50808 -306775 121154
7244 73229 50781 -274816 -122746 126642 299529 -122873 -419532 -33994 -208854 5270 175714
7233 175714 -286988 190456 -95235 -161073 -121982 -27893 -194232 -228815 -88131 -4604 288652
7221 143088 -59618 -244670 -98383 -19447 122299 -56596 13170 -148028 160979 -195770 -192007
7210 -192007 -168885 -260080 -4602 316326 -158465 -114709 322026 -69319 81799 168089 -188673
7198 -240094 -117584 80375 -183285 21555 -136178 -176494 -27809 -78131 -144269 237903 -112998
7186 -147490 228902 144955 318529 -402422 -18136 -134942 -130703 113696 168844 39841 24069
7175 24069 -228139 -229366 -202101 -97762 -6339 -11611 -24353 154132 110308 88637 -125600 66456
7162 24047 135244 -148262 -122669 5232 101706 62649 177572 -200949 -171417 225939 213973
7151 213973 226635 11599 -18160 22789 -115634 66071 118198 -31313 -160403 -60681 206420
7139 181250 964 -21 59422 -12429 -11242 -144474 45730 -360416 24717 -61375 364867 -76771
7126 -300214 -152882 -19416 226904 -103604 66476 70257 55432 -195136 144021 178988 20332
7114 168299 -74810 -23026 8388 -63833 -372394 -81772 347295 -11657 153299 -369185 186105
7102 -20359 -8820 -133130 -25396 142551 133253 613 -264978 -86692 -22850 84547 11958 56877
7090 56877 -65788 68935 -55768 38067 -175182 -119618 174798 -189612 -104822 -217687 76071
7078 275572 -200209 -31986 -15359 -343945 -212203 -173351 247107 178476 -116573 -32889 236538
7066 109448 148786 -225892 -311762 38418 -216864 -80935 -109197 33502 187189 80867 -118830
7054 -39079 249323 44423 174694 156303 49296 -167295 297750 97422 158901 -63245 -133680
7043 -133680 113254 -285671 -248341 43024 126961 -149002 352850 83639 -144884 -83218 -127034
7032 -127034 222633 67291 -35237 -61974 109928 -363053 -243576 -282257 268823 -160604
7021 27182 -206509 -120589 94018 -381544 128445 -363861 -188406 124272 -379957 -33702
7010 -130097 -105464 124624 158026 -42577 -129484 -77795 -75198 -13373 -273614 -54613 139627
6998 -56191 -19169 -21226 -289455 -240164 -193785 147069 173210 -230080 147948 -250467 105586
6986 -169944 273453 -229904 -296111 -11645 -215919 36420 38245 -140502 -26254 -84824 -206393
6975 -206393 121291 11649 -57701 -79624 -168539 84687 4031 42073 -66924 46353 -108772
6963 -181090 -57033 335906 249594 277356 -24626 116518 90247 -60539 -103560 96716 100234
6952 100234 -81139 -205678 -148501 318160 233514 -243766 -111011 214677 34202 55498 -239063
6940 61970 55186 78115 -138441 96969 148888 61287 -422815 -162513 49679 -73009 -321620
6929 -321620 142810 -74913 112765 -178774 250473 -327923 -226697 171549 -100701 -102709
6919 -102709 10380 -51130 -60002 -81018 152847 -207920 96833 203937 -270778 97642 5181
6907 -10503 171974 -223061 106070 -219754 85474 59830 89869 -141774 -72053 -202433 -279615
6896 -279615 -416836 246200 -76883 109624 254277 145659 176156 -177324 -65005 236621
6885 -50521 328628 130839 225400 -186779 -223899 -313744 350580 7421 48870 -221285 -2508
6873 118091 -19252 -110187 94632 10830 -279659 262797 76042 -30252 17027 87699 -258199
6861 -143380 -222437 -96824 -62978 -81588 92496 -284338 -390284 -91101 -200854 -124105 12681
6849 52848 -17557 233224 -79384 210910 21776 -214351 -55203 157985 -25538 -76595 180998
6837 96155 -196754 -240207 -7878 116992 -110382 -315506 -327646 202653 -266190 -348934 -154539
6825 -90408 -115126 -81792 -222310 406310 -219703 -96747 -173472 93124 114961 -371249 35419
6813 230936 -16007 -186894 -234203 -41720 -165814 327504 -111606 291599 29692 -255024
6802 35039 155029 46699 -263364 -275962 5868 -8861 -193241 -54965 58155 61945 50809 -230758
6789 -87839 -168075 -150801 -454088 -25139 -42338 73734 71453 60294 -235113 136399 -266761
6777 140312 -30586 19226 -144398 -93625 -67704 96532 55350 -196538 -182062 -76337 203927
6765 -183371 -74910 -159692 340204 -19550 30401 -68450 20455 252914 -145527 62637 -204166
6753 -168415 -45904 -68370 -367289 7009 -45741 -328768 50290 79440 -162897 -77216 -91456
6742 -91456 110039 30315 -19686 14850 -258383 136898 -46993 29977 10098 90870 264837
6731 264837 -64855 -14161 -45787 3954 -72452 73817 -158546 214925 153066 -235121 74811
6719 -40969 -27200 90667 355169 -193905 117938 13963 243791 115690 -268196 16495 -29928
6707 -153172 38599 -70330 -197178 227227 -123427 -169651 60330 147383 206370 -46980 -89423
6696 -89423 75643 327667 66559 -231800 -177667 -219064 962 43650 -216763 -176074 -192243 -14590
6683 30080 -3832 367453 170590 179725 -223946 -10380 84315 -14143 -113188 -265662 -80285
6671 10033 81121 -84881 298353 79841 67486 44131 -108384 -187543 -71505 -209470 -130872
6660 -130872 -59689 -92772 -140008 15954 -133423 -75762 -164734 212336 438734 289772 -6945
6648 -80364 -114926 -195611 227972 126237 -103541 26010 29652 -70218 523016 68428 50247
6637 50247 -337624 -79175 -212823 85839 95473 -34130 114464 -207192 38676 -265466 -250197
6626 -250197 -156061 -32441 72130 -255324 302076 -343112 -71174 -277783 -101019 -267802
6616 -267802 -361604 -224974 -98163 27537 93425 -73327 265748 -135316 -237633 -81831 -26735
6604 36589 235461 -143445 -124953 263512 97938 -23353 -175713 88539 -128330 -182488 -5049
6592 -72395 -53897 160351 153218 -74185 -182973 200767 -252878 -118270 -21653 84850 -140565
6580 -239413 29676 -177832 -242289 104073 -173210 -235163 58605 21422 -38318 -4810 46640
6568 -10484 -61811 -145343 469990 30683 241284 -151071 -165617 -72951 183751 -194133 -139466
6557 -139466 289707 291194 15371 -10367 121726 -214860 72797 187732 323671 118110 280512
6546 280512 219773 368287 -467298 21515 92946 -74838 -15238 -439865 89352 76479 -43911
6534 -394398 -31029 167886 -409455 -106294 -147621 -275091 149833 218445 168017 113520 -48982
6522 47665 -24085 -111255 34312 -7672 -444883 -356595 -153363 -366653 74002 -444915 147608
6510 -271965 -149914 -211157 97907 -176136 81551 245265 47741 -72768 69518 -310374 23215
6498 -40322 -365038 -225084 138033 2189 128429 -184130 204414 -280565 55503 -87251 27221
6486 -88286 -246531 -65575 -148745 -275326 -195439 -107363 239138 -192627 30690 -210903 156630
6474 -49510 -125412 -286866 51289 363754 91905 4386 127903 124335 -170561 -186831 207592
6462 45548 -243435 -228885 80241 -397142 -41438 -344398 158385 212471 -216554 -128595 73387
6450 -183855 124661 -127272 -9120 217179 24022 -116400 141270 5048 -104123 147511 120585
6439 120585 -52709 -164682 -244676 -77712 -156790 -378660 56867 -194786 138449 138808 -35243
6427 -102638 288246 -112697 -42078 -128308 -24235 261513 -27210 23625 -285115 -211258 52859
6415 -136437 156145 73859 162002 -192721 41845 -29333 -212216 92685 120510 184392 -141567
6403 261097 -125582 45418 -182931 61423 -115505 102713 -43981 -92171 25162 46843 7422
6391 151994 26170 157982 216805 203952 70092 -98858 -24286 -100730 37135 -75082 89001
6379 -184452 141069 11613 -138127 56216 -245262 112752 111408 -180556 -259787 54978 -49253
6367 -64423 -127096 195686 217687 122809 233639 89977 -127345 189541 45155 251939 -41254
6355 -109989 203553 -57197 -229091 -174781 -225084 -110397 65785 -344438 -224516 280474
6344 -62110 -13458 228836 -442551 -174798 -65505 -66428 58743 162074 97323 -59206 219094
6332 69681 417849 26107 -32257 -53664 108448 -167212 19839 -266785 -4636 10544 -170470
6320 -335683 -38629 9645 102393 -115768 91037 72984 5158 280035 169702 -97502 62664
6308 69638 75192 183923 -222667 -39542 -169278 -54337 80606 -154909 -178226 -47766 -194577
6297 -194577 52150 -178128 44980 -166755 -15251 -20457 253439 -46157 308962 450219 -157453
6285 221083 -323967 21402 -63311 82965 -91302 -241192 443136 16010 29027 -169119 135931
6273 207279 352930 16745 -36539 409849 71934 -1552 -503715 -347615 -200944 111224 -53826
6261 -123901 -92768 15481 279545 -205537 127776 130817 145468 30960 148567 -5534 -35171
6250 -35171 58577 162683 -36384 -163616 137748 -238666 7902 6320 -259363 -23948 -62402
6239 -62402 74059 -185309 6380 -294145 202616 -22308 173533 -134444 -76182 -48980 -202814
6228 -202814 -94488 -109291 232876 -118402 47711 97400 176054 212270 194453 231606 -71261
6216 109623 443073 77855 -125084 -59201 175419 -17429 279469 -1871 -155262 61734 137623
6205 137623 113236 184230 182163 -8714 -112217 211074 -202114 -24489 -157163 89731 -70425
6193 -94687 -137418 -223127 -73681 -226902 146913 73530 -243702 -201793 -5058 -44346 -42689 55178
6180 808 53137 140162 -197594 5207 -19643 46260 -48546 -27510 91815 33142 230390 -101958
6167 -90593 -10953 38640 -249994 231078 305880 -132363 -87644 -99851 -133411 -55729 135271
6155 -30618 -41623 -55156 312371 -75055 -33111 348225 130327 -55159 -281592 -107814 -66981
6144 -66981 6768 192244 -62312 19869 70720 -84330 378575 -82306 180491 129355 -166408
6132 108201 102086 118217 14034 -44752 150541 -93961 43564 -40103 50246 88717 132914 187403
6120 187403 107091 216775 127552 306447 -45980 15988 -68234 32007 -213667 132313 350554
6109 350554 -14764 -308143 -77613 104570 -67929 -386036 52622 166286 -26296 -253542 277917
6097 -117614 -83179 -169704 -251032 67958 16214 -271453 92572 143655 111489 171086 66621
6085 -246582 267611 184299 -119766 -127194 39805 -42455 -33381 -23309 133169 133429 -196233 -129913
6073 -129913 -16280 219780 223738 -3867 479984 -69777 -281314 -46876 -271127 239435 15717
6061 237869 -27874 -233932 -298956 183883 -424046 -7376 170832 194601 -108444 44336 -10071
6049 130005 -36471 234215 -75231 182696 346379 90377 80813 -119271 -52208 33711 249364
6038 249364 167630 290947 -80198 25276 174081 -188320 35614 127256 -218634 -262185 145826
6026 117167 -27588 -155342 -223623 -237198 -11850 -22995 -168498 -11591 218604 153194 56833
6014 -169535 -167367 116099 -101780 -191025 130436 -156130 -47462 204208 141121 88469 241843
6003 241843 -439420 -198550 257368 165428 -145066 -26035 -48550 93519 106279 204780 98638
5991 26804 -246573 -341777 -182250 -322358 -38978 -171833 -8921 -47845 -260994 34053 78727
5980 78727 -302155 -17189 283359 -29817 -26080 -245513 333120 304649 -115058 118928 -153418
5968 -6917 -91874 -60049 338983 -102562 -88157 26674 405807 -221067 154523 311085 -130769
5956 397686 180759 71101 186449 -221706 -308033 43744 168422 -105059 29070 336789
5946 336789 29797 164987 4063 -182311 -103208 94816 -15312 -103362 -298805 -28812 184887
5934 162857 -14536 33395 73107 185511 304265 403637 -95654 -32951 -91412 -49865 82378
5922 156653 -27662 -142977 -131942 -27143 242450 61153 226490 -223710 -166971 -193476 174297
5910 -16645 56124 97141 234403 -143816 -80315 -27042 79425 -285229 149781 -21832 -136071
5899 -136071 -185380 -145201 197898 -298481 173051 81322 -162521 438177 -298674 -185498
5889 -185498 31437 63727 251094 298131 120740 114177 145122 -54399 77018 224007 -95444
5877 -36655 -293628 -88443 -243356 -354969 215194 -29029 -208202 54123 -84742 -238353 31532
5865 -35752 -90273 108001 137028 -171133 252223 238920 -381453 291259 -92793 -5164 -21608
5854 -21608 -97407 95017 -197802 252437 41402 6622 -86366 -99806 -47651 20754 125671
5843 125671 33892 127624 186898 239812 -188715 -158609 -73177 -339029 81859 -124098 -71698
5832 -71698 65332 176356 -145802 12647 52274 151012 -85430 -294378 -139613 117516 190092
5821 190092 -98108 -84498 2169 303787 -85356 70521 -151708 282688 -129454 -142477 -146072
5810 -146072 56689 226786 46730 36764 148648 -22465 69018 58975 -81043 -298658 -130122
5798 31699 -108673 -208879 70466 78856 48432 -237378 347604 139699 -164061 -72908 55796
5786 93026 -121136 177131 -119450 -177822 80776 24395 41103 -122141 -278073 -374565 127743
5774 52159 -19991 -150615 -136489 371028 115110 173571 -20489 142299 -221335 192183 114387
5763 114387 212593 -188513 55668 22467 -42274 321711 98972 -56991 35175 390700 306055
5752 306055 -228330 192792 -103502 -278182 246473 -103559 81552 85802 -187297 400791
5741 64245 -63118 113589 51071 78192 212601 -188550 111536 -79419 -103175 71139 -397999
5729 170500 -159861 -115837 -74264 134901 162158 231812 -233652 259282 103943 -415058
5718 -21635 -110008 84049 121628 67962 18765 10140 -157163 -120750 303860 276194 -72868 6939
5705 -9749 -187935 -12303 199847 302139 130325 -61417 21279 -115558 -51540 29151 14970
5694 14970 46384 262242 415104 -199940 -182200 -208901 -22576 191158 -167412 17463 -172934
5682 313064 352449 35382 -52696 -1117 209362 161176 277274 -100237 -19897 -129070 -80869
5671 -80869 -178137 264050 -32213 163677 -10523 -177419 25945 221338 84728 -64472 -169992
5660 -169992 -222902 82282 -82189 168821 -138531 187295 196708 117759 -250575 317228 -128936
5648 63197 -37923 -189722 61008 122535 8457 113938 164014 -53972 44508 133663 9755 -253173
5635 -238689 -56119 -52817 197460 -41866 138708 -134548 42991 -126140 94714 -67399 125431
5623 -207719 103941 -108413 56472 64457 -70005 -57947 33886 -285437 -116175 -487779 -142799
5611 25350 -41096 -170892 -139103 -342413 -247846 -108106 113526 -136781 85931 -159894 116495
5599 69851 28302 -54315 -38030 166118 203060 15002 181331 -13069 -215061 15465 132850
5588 132850 -210237 -31069 78077 -283171 316649 107011 338278 -347645 216318 189235
5578 189235 -1124 -270530 -76828 -37982 -13835 68532 5463 -118687 170903 361938 -104373
5566 69940 -125723 -17143 257966 -39590 -93500 31788 412079 197516 -34536 39782 -243158
5554 41512 -115853 365211 -339633 368012 213322 143100 359058 148097 -120192 166997
5543 -166698 123371 164178 277453 35333 -64059 242243 -175842 -284679 5610 -95674 126944
5531 171007 95707 -319991 -330808 14926 165572 -11302 -53470 107264 239001 -161450 -63573
5519 -85626 -99307 -119956 -73323 -166661 194683 -168588 37427 377249 -481888 259513 51388
5507 -169707 -15295 31402 -301299 -148065 -50609 -13889 412624 -108389 230126 -165045
5496 29834 181015 148881 167589 29525 -316527 -261712 152637 81654 -118775 130137 -310021
5484 -178161 63564 253615 147167 -189 -84429 219974 -38639 114915 -37952 -218459 -276444
5473 -276444 -201174 129665 100112 -195922 327142 -123201 126782 218616 178527 -60139 -20447
5461 -60812 111293 -382469 5873 -210607 110675 -129266 12516 135268 -176284 -23390 302233
5449 -8277 -37370 -71015 -60965 17068 13583 -132957 -131658 207813 -102074 28149 -102166 -38234
5436 -25135 116110 165622 220109 -64579 -16404 -19804 233991 -87029 102092 239796 -198473
5424 -3896 158756 -17766 -19187 -100602 -280137 -156547 -234356 -330799 55794 24064 -40847 168810
5411 115204 42467 3859 43792 412140 -195702 114819 92024 243855 127012 -21072 208832
5399 40594 78074 63830 254616 -160506 160398 224909 105131 -66980 282234 96955 204074
5388 204074 -127261 -142570 -353466 67781 -157681 87510 216687 270053 -375279 14503 -134766
5376 31164 171971 331462 95845 -29220 -181347 163974 136610 176330 73432 35694 -174833
5364 -63175 90670 -26862 112109 -159293 -117862 -186017 -154703 -32490 -135933 49105 -105107
5352 165957 59235 87110 -242214 -189249 -144979 164219 -65931 -91420 -372075 101278 260332
5341 260332 141603 -334638 156392 148762 -190961 47628 147956 231664 -110766 -215057
5331 -215057 -74335 162124 -181856 64339 155434 291955 76776 -259135 150356 51528 -254044
5319 -305223 151432 66217 -99927 -27607 86783 99414 95006 65489 285016 -42552 31261
5307 18502 184288 209391 23227 -38517 21671 58382 -31053 66959 -191648 -248305 11496
5295 -224614 -69411 -366135 114639 -25991 217252 -123860 -5076 23155 -31023 144588 -1966
5283 181626 271798 -40752 62320 213641 426178 -51928 183406 133603 15917 -349026 -85486
5271 -39386 155953 199377 87477 -84869 151798 166813 31120 170321 -471215 73344 147343
5260 147343 15139 237105 258754 183488 -171636 240266 -141279 -115157 14668 -185233 49333
5248 -149511 -117916 -45905 -351524 380752 -97814 -266907 98747 22471 235339 168947 4288
5236 149618 182230 -51711 -79655 488401 8421 96782 -4872 41520 -19872 -108839 -31186 224448
5223 -43888 -149210 -94654 -239039 33287 238149 131787 9864 344790 91810 346171 44110
5211 -67881 -330159 -157610 174430 -111408 -456672 -148188 -68600 43284 61968 -150132
5200 168899 155968 228385 124552 -14814 42107 -160649 111190 21958 151648 -444980 -277088
5189 -277088 -264960 172225 100948 -169150 -22873 -145102 154337 374998 273631 -157653
5178 44357 75223 203843 284004 -135480 -125510 -51143 -196580 -272850 -171054 149843 43296
5166 -98237 -199509 75261 364578 271666 -103445 188118 124054 -31345 -174961 -153333 -294396
5155 -294396 -1274 -29558 -180933 86705 -10763 -359014 126157 -162701 -158716 130342 131608
5144 131608 -78142 -70624 -196571 125342 -153836 16425 -238868 -3778 75754 -233803 120753
5132 28015 -5292 62753 -278944 -78183 13780 -129191 43919 -123135 203035 -124269 255695
5120 136127 356186 261568 298635 -355297 -107698 353854 -3564 -135062 -115129 -116674 99153
5108 3415 -257460 157108 69999 -135718 92973 -198001 -83853 257547 84017 -173829 -169107
5097 -169107 451 -293326 49941 -70452 96519 -47529 -270087 15395 404620 -215650 -26858
5085 -57002 20938 -158105 130772 -167403 333306 -94748 -69704 -314247 240734 -247498
5074 85055 30203 -9799 159942 70342 56215 -79075 -166162 -3628 -279414 -99932 374549 51636
5061 80845 -137425 175468 147277 -101455 -390495 111760 188712 -188966 154720 -91208
5050 59711 -2087 192420 129734 50531 255822 122904 -98328 -148450 161160 -174368 -140160
5039 -140160 58744 180205 -155202 -27748 99202 -86228 -8710 12748 -181190 -41202 189954
5027 150331 201215 -18486 17096 -100672 -44545 -177201 345869 190165 109655 28226 -65717
5015 -252585 -145215 120365 -129845 303509 99459 -41788 -24995 94153 -16203 47210 41488
5004 41488 222446 102731 63355 -24263 364850 -6572 -150203 -218487 -102612 210344 101215
4992 429205 50120 -90071 -25986 152767 41387 -86920 -47815 -58819 79775 98228 -206427
4980 -103561 -36905 -32471 -59908 -16820 -115516 -22472 61508 184986 198912 239548 -50585 -148611
4968 -148611 -164336 -35091 86264 134932 -280920 -248107 -37612 -25421 -96806 144326 131763
4957 131763 -59429 -190800 197459 199651 265965 220135 19779 168507 187802 -42969 -88442
4946 -88442 359211 15551 7408 341206 -301306 43104 302433 214732 134195 24627 -145480
4934 -11546 -50628 98241 295672 189403 183110 35549 428333 166786 -239001 -122127 -168578
4923 -168578 54649 89801 127235 112394 138536 21249 47444 44435 -1837 -50337 -37226 220749
4910 -29036 -72372 -165482 -225251 -11293 -325097 -249367 -141545 -100165 -106608 -209109 41440
4898 204367 310089 146549 73537 -159326 -327622 -66453 -54236 52393 59555 138181 -68268
4886 -211501 -159874 -87751 -39679 -34183 -273371 -37538 -41704 85707 67814 192 -156256 -66665
4873 116993 -175878 109372 120582 -120475 237886 152833 325794 -51025 -71656 -292583
4863 -292583 -69170 158157 -107902 -178643 41236 313767 -113392 171898 -110899 -102685 -119187
4852 -119187 325713 84683 293476 -62878 -41929 32157 118360 -14275 55417 181786 4342
4840 -122232 202510 5634 -23606 -7699 -36248 5372 -186915 374896 131656 36820 -233155
4828 -297019 -108875 -81778 -97078 -310128 238352 55650 -83394 51478 14034 -246154 -63246
4816 -404623 106331 -190198 191273 -11781 220846 -68222 -238413 -69522 -116897 157702
4805 -56357 43962 -48485 -172688 -17229 81349 3479 114126 -189785 165635 -62896 47787
4793 -32306 43151 389821 79417 49521 79697 17926 193115 309658 -28403 307096 9354
4781 -201865 -163472 71958 -293366 -9725 100301 58814 190988 223854 128243 -103533 152693
4769 22383 -96584 7837 -78610 37648 -101922 60999 140034 -236322 -5473 64149 -89382 51354
4756 138882 42111 120529 -86982 -149266 102123 -105800 273386 -120682 98973 351261 31692
4744 -23556 309153 -11422 299862 -230865 -37514 77072 114899 113232 -169885 -15777 218070
4732 80872 -370883 172982 -236469 -89718 -158191 -328032 236854 76138 -97840 49070 200556
4721 200556 -33387 -273777 -395696 -83615 -359151 -74078 107502 -22651 12665 -54713 -24714
4709 -164801 190673 -48691 -42605 -172699 -353048 201962 126563 -168282 -33746 108596 231251
4698 231251 212225 91040 145043 261573 378274 -46382 -2734 98525 167177 47653 30078
4687 30078 -58121 -357795 -161859 182571 178409 10223 226429 -332448 -175295 -246537 105615
4675 -165623 24833 -97011 -144112 27418 -28163 445739 352267 420114 -139329 -42319 241283
4663 92319 -55789 171600 40983 86643 -81020 100407 233909 -30069 49553 21301 186673
4652 186673 -71661 -48079 -155038 191179 -217118 -126618 140024 312070 271154 -90242 -103876
4641 -103876 224165 -151000 -64442 -31340 288595 -305390 72982 348785 179241 -55926
4630 133190 179193 259254 -138131 255645 -40064 -60789 -132037 -79214 -307090 -96039 119786
4618 280953 -141710 292048 -158347 34742 118760 -221442 32122 193142 -116011 223979
4607 -17812 31637 -34920 263244 41834 -109544 -76808 -157626 -84322 -25604 -139816 118957
4595 80801 30822 -417139 46157 -256264 127356 -109970 102444 75886 -29596 -293810 112967
4583 269836 -45806 -122015 -132985 160281 80953 -150290 -145765 -160089 10544 -130807 207695
4571 75093 -37375 54357 -176310 259341 -183447 29693 -65113 -88514 -62189 45442 56494
4560 56494 79893 83964 -81786 45666 179607 160455 205459 -36911 -71647 -119019 159621 -101202
4547 -142131 146350 252847 -11872 45905 127055 -138544 -323140 105077 97478 -405304 156809
4535 215688 -188746 4928 158116 97336 313165 130831 254987 -75030 26301 -197239 248062
4523 -24795 -24745 15143 -53867 43622 -1308 160605 -278695 -42555 -338801 159988 207834 -10263
4510 -10545 -186844 -81941 17892 -211176 295573 6305 19992 160430 342974 -1784 125727
4498 10997 -139950 -14543 -34771 -133631 246488 60249 -531656 147177 -62368 -418860 50479
4486 -113942 -284523 -191724 -3400 143384 32181 69523 68368 -43231 -105821 -62760 17022 110432
4474 110432 76401 -22905 -31816 -66825 -359189 698 -8316 -52368 -226881 221015 -38040 -93498
$$ [...]
##END NTUPLES=NMR SPECTRUM
##END=
