##TITLE=NES1047_924826_9270366_TrJqmCnVVd
##JCAMPDX= 6.0         $$ Bruker NMR JCAMP-DX V2.0
##DATA TYPE= NMR SPECTRUM
##DATA CLASS= NTUPLES
##ORIGIN= BRUKER
##OWNER= Administrator
$$ 1.72 TOPSPIN		Version 2.1
$$ 2015-07-11 17:26:43.769 -0700  Administrator@X
$$ Compression mode = diff/dup
##.OBSERVE FREQUENCY= 400.02188249412
##.OBSERVE NUCLEUS= ^1H
##.ACQUISITION MODE= SIMULTANEOUS (DQD)
##.ACQUISITION SCHEME= undefined
##.AVERAGES= 8
##.DIGITISER RES= 22
##SPECTROMETER/DATA SYSTEM= spect
##.PULSE SEQUENCE= zg30
##.SOLVENT NAME= COFFEE_meoh
##.SHIFT REFERENCE= INTERNAL, COFFEE_meoh, 1, 14.98509
##AUDIT TRAIL= $$ (NUMBER, WHEN, WHO, WHERE, PROCESS, VERSION, WHAT)
$$ ##TITLE= Audit trail, TOPSPIN		Version 2.1
$$ ##JCAMPDX= 5.01
$$ ##ORIGIN= Bruker BioSpin GmbH
$$ ##OWNER= Administrator
$$ $$ E:\/data/COFFEE/nmr/NES1047_924826_9270366_TrJqmCnVVd/10/pdata/1/auditp.txt
$$ ##AUDIT TRAIL=  $$ (NUMBER, WHEN, WHO, WHERE, PROCESS, VERSION, WHAT)
(   1,<2015-07-11 17:26:36.238 -0700>,<Administrator>,<X>,<go>,<TOPSPIN 2.1>,
      <created by zg
	started at 2015-07-11 17:25:30.425 -0700,
	POWCHK enabled, PULCHK disabled,
       configuration hash MD5:
       21 0F 79 D6 B3 7B B4 F6 88 20 88 DB 03 48 BD 9F
       data hash MD5: 64K
       6D CC 61 9E 3B 4F 76 4E 7C 81 30 C3 A5 D8 00 6D>)
(   2,<2015-07-11 17:26:39.581 -0700>,<Administrator>,<X>,<proc1d>,<TOPSPIN 2.1>,
      <Start of raw data processing
       efp LB = 0 FT_mod = 6 PKNL = 1 PHC0 = 0 PHC1 = 0 SI = 32K 
       data hash MD5: 32K
       4D 2D 88 7B 0C A2 7C 31 D8 E6 00 1C 6B E1 13 6B>)
(   3,<2015-07-11 17:26:39.878 -0700>,<Administrator>,<X>,<proc1d>,<TOPSPIN 2.1>,
      <pk PHC0 = 94.27368 PHC1 = 0 
       data hash MD5: 32K
       7D C6 3D 76 29 4F E6 26 0E DA C8 A0 2E 3F 08 2B>)
(   4,<2015-07-11 17:26:40.003 -0700>,<Administrator>,<X>,<proc1d>,<TOPSPIN 2.1>,
      <abs ABSG = 1 
       data hash MD5: 32K
       72 0E 25 2D 1C 16 A1 62 CB C2 60 5E 74 BD 0D E3>)
(   5,<2015-07-11 17:26:40.050 -0700>,<Administrator>,<X>,<proc1d>,<TOPSPIN 2.1>,
      <abs ABSG = 2 
       data hash MD5: 32K
       B7 F3 02 32 6E E4 A5 7B 81 0C F8 91 10 42 10 E4>)
(   6,<2015-07-11 17:26:40.128 -0700>,<Administrator>,<X>,<proc1d>,<TOPSPIN 2.1>,
      <abs ABSG = 3 
       data hash MD5: 32K
       2D A7 0B 84 F6 0C 65 BB AB 09 01 33 E0 0A A3 52>)
(   7,<2015-07-11 17:26:40.191 -0700>,<Administrator>,<X>,<proc1d>,<TOPSPIN 2.1>,
      <abs ABSG = 4 
       data hash MD5: 32K
       9F A8 B8 AF 29 DA 7D D2 C2 CB 19 5A FD 18 78 5C>)
(   8,<2015-07-11 17:26:40.253 -0700>,<Administrator>,<X>,<proc1d>,<TOPSPIN 2.1>,
      <abs ABSG = 5 
       data hash MD5: 32K
       8E DD D5 D2 08 29 35 C2 D1 9F A6 2C 4D 9A 56 27>)
$$ ##END=
$$ 
$$ $$ hash MD5
$$ $$ 71 16 03 49 63 69 7A 4D 0C C1 0C E0 71 A0 03 1A
##$RELAX= 
##$RELAX= 
##$RELAX= 
##$RELAX= 
##$RELAX= 
##$RELAX= 
##$RELAX= 
$$ Bruker specific parameters
$$ --------------------------
##$DU= <E:\>
##$EXPNO= 10
##$NAME= <NES1047_924826_9270366_TrJqmCnVVd>
##$PROCNO= 1
$$ [...]
150 150 150 150 150 150 150 150
##$TP07= 0
##$TPNAME0= <>
##$TPNAME1= <>
##$TPNAME2= <>
##$TPNAME3= <>
##$TPNAME4= <>
##$TPNAME5= <>
##$TPNAME6= <>
##$TPNAME7= <>
##$TPOAL= (0..7)
0.5 0.5 0.5 0.5 0.5 0.5 0.5 0.5
##$TPOFFS= (0..7)
0 0 0 0 0 0 0 0
##$TUNHIN= 0
##$TUNHOUT= 0
##$TUNXOUT= 0
##$USERA1= <user>
##$USERA2= <user>
##$USERA3= <user>
##$USERA4= <user>
##$USERA5= <user>
##$V9= 5
##$VALIST= <valist>
##$VCLIST= <CCCCCCCCCCCCCCC>
##$VD= 0
##$VDLIST= <DDDDDDDDDDDDDDD>
##$VPLIST= <PPPPPPPPPPPPPPP>
##$VTLIST= <TTTTTTTTTTTTTTT>
##$WBST= 2048
##$WBSW= 25
##$XGAIN= (0..3)
0 0 0 0
##$XL= 0
##$YL= 0
##$YMAX_a= 615249
##$YMIN_a= -515267
##$ZGOPTNS= <>
##$ZL1= 120
##$ZL2= 120
##$ZL3= 120
##$ZL4= 120
##$ABSF1= 14.98509
##$ABSF2= -5.573092
##$ABSG= 5
##$ABSL= 3
##$ALPHA= 0
##$AQORDER= 0
##$ASSFAC= 0
##$ASSFACI= 0
##$ASSFACX= 0
##$ASSWID= 0
##$AUNMP= <proc_prof1d_extract_pilot.lims>
##$AXLEFT= 0
##$AXNAME= <>
##$AXNUC= <1H>
##$AXRIGHT= 0
##$AXTYPE= 0
##$AXUNIT= <>
##$AZFE= 0.1
##$AZFW= 0.1
##$BCFW= 0
##$BC_mod= 0
##$BYTORDP= 0
##$COROFFS= 0
##$CY= 15
##$DATMOD= 1
##$DC= 0
##$DFILT= <>
##$DTYPP= 0
##$F1P= 0
##$F2P= 0
##$FCOR= 0.5
##$FTSIZE= 32768
##$FT_mod= 6
##$GAMMA= 0
##$GB= 0
##$INTBC= 1
##$INTSCL= 1
##$ISEN= 128
##$LB= 0
##$LEV0= 0
##$LPBIN= 0
##$MAXI= 10000
##$MC2= 0
##$MEAN= 0
##$ME_mod= 0
##$MI= 0
##$NCOEF= 0
##$NC_proc= -8
##$NLEV= 6
##$NOISF1= 0
##$NOISF2= 0
##$NSP= 0
##$NTH_PI= 0
##$NZP= 0
##$OFFSET= 14.98509
##$PC= 1
##$PHC0= 94.27368
##$PHC1= 0
##$PH_mod= 1
##$PKNL= yes
##$PPARMOD= 0
##$PPDIAG= 0
##$PPIPTYP= 0
##$PPMPNUM= 2147483647
##$PPRESOL= 1
##$PSCAL= 4
##$PSIGN= 0
##$PYNMP= <proc.py>
##$REVERSE= no
##$SF= 400.02
##$SI= 32768
##$SIGF1= 0
##$SIGF2= 0
##$SINO= 400
##$SIOLD= 32768
##$SPECTYP= <>
##$SREGLST= <1H.CDCl3>
##$SSB= 0
##$STSI= 32768
##$STSR= 0
##$SW_p= 8223.68421052631
##$SYMM= 0
##$S_DEV= 0
##$TDeff= 65536
##$TDoff= 0
##$TI= <>
##$TILT= no
##$TM1= 0
##$TM2= 0
##$TOPLEV= 0
##$USERP1= <user>
##$USERP2= <user>
##$USERP3= <user>
##$USERP4= <user>
##$USERP5= <user>
##$WDW= 1
##$XDIM= 32768
##$YMAX_p= 446809184
##$YMIN_p= -749512
##$CURPLOT= <Network HP LaserJet P1505>
##$CURPRIN= <$Network HP LaserJet P1505>
##$DFORMAT= <normdp>
##$LAYOUT= <+/1D_H.xwp>
##$LFORMAT= <normlp>
##$PFORMAT= <normpl>
##$SURQMSG= 1
$$ End of Bruker specific parameters
$$ ---------------------------------
##NTUPLES= NMR SPECTRUM
##VAR_NAME=  FREQUENCY,     SPECTRUM/REAL,   SPECTRUM/IMAG
##SYMBOL=    X,             R,               I
##VAR_TYPE=  INDEPENDENT,   DEPENDENT,       DEPENDENT
##VAR_FORM=  AFFN,          ASDF,            ASDF
##VAR_DIM=   32768,         32768,           32768
##UNITS=     HZ,            ARBITRARY UNITS, ARBITRARY UNITS
##FACTOR=    0.250966925370066, 1,           1
##FIRST=     8223.43324360094, -168120,      -117958
##LAST=      0,             -141667,         -98225
##MIN=       0,             -749512,         0
##MAX=       8223.43324360094, 446809184,    0
$$ Real data points
##PAGE= N=1
##DATA TABLE= (X++(R..R)), XYDATA
$$ [...]
19479C47965D3205L7614L2496a68571d9845D7082c68453I3102a4369k37885c9227
$$ 347965 43205 80819 113315 -168571 -49845 47082 -368453 93102 -14369 -252254 -39227
19467A66562L3203c10814J21772j95111h3510l03465C3870Q9588A7396c15943
$$ 166562 199765 -310814 -189042 -384153 -83510 -386975 33870 123458 17396 -315943
19456b83086d6137j62471g1593l2285k1065L40C1519c0760B04286f0679A61470
$$ -283086 -46137 -208608 -71593 -103878 -124943 -124603 31519 -30760 204286 -60679 161470
19444A14061f4930G1438J2405c92170d6711p2491L6351A30911a56890a9019H9132
$$ 114061 -64930 71438 83843 -392170 -46711 -119202 -82851 130911 -156890 -19019 89132
19432c33804L5424A93858b69294g4068B9214a77549L4194o8983B73463E9423a19107
$$ -333804 -298380 193858 -269294 -74068 29214 -177549 -143355 -212338 273463 59423 -119107
19420a46317A22212b62n7658m4818A57555a44031M5776G6824b25734a5285H2938
$$ -146317 122212 -262 -57920 -102738 157555 -144031 -98255 76824 -225734 -15285 82938
19408A6957K08877e5973A72844c32474G2701e20j66763D1248J18407d27962I1292
$$ 16957 225834 -55973 172844 -332474 72701 -520 -167283 41248 159655 -427962 91292
19396H6230a34651O157K9107n5868K5616p5043j0407F6436B7525a03412E9647
$$ 86230 -134651 -128494 -99387 -155255 -129639 -204682 -215089 66436 27525 -103412 59647
19384b03176i7343A8172a32219A54297o5977D0736a39974H0891c1280m0587k21380
$$ -203176 -97343 18172 -132219 154297 88320 40736 -139974 80891 -31280 -71867 -293247
19373b93247A24258a74503E6477c28268O7431i3660E2834K7047O9966h5591j3060
$$ -293247 124258 -174503 56477 -328268 -260837 -93660 52834 79881 149847 -85591 -98651
19362i8651G2008c14029J26020L1910p4718a03274M7908B39906G9342a30702j11536
$$ -98651 72008 -314029 -188009 -156099 -230817 -103274 -55366 239906 79342 -130702 -242238
19351b42238j05021A2968e7334b5118d113k28666J14808M0434D6262b57372E4748
$$ -242238 -347259 12968 -57334 -25118 -4113 -232779 -117971 -77537 46262 -257372 54748
19339B5940O2386b39133i7232B9255J3690L7804J52386f5324H1412b35009M7213
$$ 25940 88326 -239133 -97232 29255 42945 80749 233135 -65324 81412 -235009 -187796
19328a87796A7741J16145d0206k02524K0239a0122k85694J33214C79427A10820
$$ -187796 17741 133886 -40206 -242730 -222491 -10122 -295816 -162602 379427 110820
19317a72274B7141J11877b18481h1464o4025o4834b8615j65988O3475m3118O0377
$$ -172274 27141 139018 -218481 -81464 -145489 -210323 -28615 -194603 -131128 -174246 -113869
19306a13869F0064a94795B0404K172q391Q813N7958a57646r0379E5628b46416
$$ -113869 60064 -194795 20404 22576 14185 22998 80956 -157646 -248025 55628 -246416
19294e1183n7198o1325g8093j76451O4310N5627B55382a12817C9564i2095n8957
$$ -51183 -108381 -169706 -78093 -254544 -190234 -134607 255382 -112817 39564 -92095 -151052
19283a51052A1404K63457i002k77552i2446B1361a40829l7833C9863c7487H2871
$$ -151052 11404 274861 -9002 -286554 -92446 21361 -140829 -178662 39863 -37487 82871
19271A39026a87234d3542k40997B78250j28322b10335A2010i9683d5723A89903
$$ 139026 -187234 -43542 -284539 278250 149928 -210335 12010 -99683 -45723 189903
19260a53589O7228j9590j42409O0439G0754c4177j13438F120L0986b72065J2933
$$ -153589 -86361 -105951 -248360 -187921 70754 -34177 -147615 6120 37106 -272065 -259132
19249b59132m063B3229b29127K1693d1489q7593m8037d0940l5836n7750d3959
$$ -259132 -263195 23229 -229127 -207434 -41489 -129082 -177119 -40940 -76776 -134526 -43959
19237A199c6260p8581A9359f2000j49097g1606r8666b3055B32638j14944J69986
$$ 1199 -36260 -114841 19359 -62000 -211097 -71606 -170272 -23055 232638 117694 287680
19226B87680c7559A22013a02954k57749b5899l82203j7688G5315a86337q7488
$$ 287680 -37559 122013 -102954 -360703 -25899 -408102 -425790 75315 -186337 -273825
19216b73825B25880b36083E8250g3516L0129A95551e2691k56347g6749j78391
$$ -273825 225880 -236083 58250 -73516 -43387 195551 -52691 -309038 -76749 -255140
19206b55140j5363J7297j14280i6926a4503j3359N415a77B4171Q8770a58144C572
$$ -255140 -270503 -253206 -367486 -96926 -14503 -27862 -22447 -177 24171 112941 -158144 3572
19193A8211b06042M8904B43392g0414j64705g0343E8766O1230a08619B3212Q9375
$$ 18211 -206042 -157138 243392 -70414 -235119 -70343 58766 119996 -108619 23212 112587
19182A12587K4750A3827d9604k44719d7323f582B63917c9931l12101C4012h4326
$$ 112587 137337 13827 -49604 -294323 -47323 -6582 263917 -39931 -352032 34012 -84326
19170D53102a14561J7819B40721a99128R2452N1547j32157n9733a13555A3551
$$ 453102 -114561 -96742 240721 -199128 -106676 -55129 -187286 -247019 -113555 13551
19159a30256e8547A5545f1188k97233B76419b39138a00912A60348A3512b3713
$$ -130256 -58547 15545 -61188 -358421 276419 -239138 -100912 160348 13512 -23713
19148g7233l7500A34910e57A65453a60779L4920a5515j15153m2420j63370f8753
$$ -77233 -114733 134910 -557 165453 -160779 -125859 -15515 -130668 -173088 -336458 -68753
19136c08762b6183l8345b7540j94804M1454o9542B0390O0196a5996o8376k51749
$$ -308762 -26183 -64528 -27540 -222344 -180890 -250432 20390 80586 -15996 -84372 -336121
19125c36121C0784a33855j02122n2862d5352I9589d1445l27477d1330j80638N5580
$$ -336121 30784 -133855 -235977 -288839 -45352 99589 -41445 -368922 -41330 -221968 -166388
19114a66388A40484h052r9994E8925a33687l62492D5023J06332a05125F2980J85435
$$ -166388 140484 -8052 -108046 58925 -133687 -496179 45023 151355 -105125 62980 248415
19103B48415r5812a34168m7682M4167c9423J4171j43173g199l9901j89536j24264
$$ 248415 152603 -134168 -181850 -137683 -39423 -25252 -168425 -7199 -47100 -236636 -360900
19092c60900E9086a72126k78978A7532b34019m021b5918F3632M5332b46976h9719
$$ -360900 59086 -172126 -451104 17532 -234019 -238040 -25918 63632 108964 -246976 -89719
19080C07376b50693B03126F953e49858G9621d5016k17440K9211I3367a14397k9079
$$ 307376 -250693 203126 6953 -549858 79621 -45016 -262456 -233245 93367 -114397 -143476
19069a43476N7678J5718q5286C9376a6618m0740P082l6725A8678K5542c1079C4885
$$ -143476 -85798 -70080 -155366 39376 -16618 -57358 -50276 -87001 18678 44220 -31079 34885
19056a39671f7659A53659d4431r5536C12645B280c02065J42354B00344g8217j66536
$$ -139671 -67659 153659 -44431 -139967 312645 2280 -302065 -159711 200344 -78217 -244753
19045b44753C61742a77860A02917b15221d8258C4053a50586A21501b04268O6689
$$ -244753 361742 -177860 102917 -215221 -48258 34053 -150586 121501 -204268 -137579
19035a37579k96189E2672a17753m5977O3346B4987i5292o5927B13406g2715A22232
$$ -137579 -433768 52672 -117753 -163730 -100384 24987 -95292 -161219 213406 -72715 122232
19023a35851A15429J6760O9762b28018C58161o271A65427d0381A33226c03056
$$ -135851 115429 132189 201951 -228018 358161 351890 165427 -40381 133226 -303056
19012E3695E427g5672c7725p0742k18121g2466A70250l3385b392m8660A26121
$$ 53695 5427 -75672 -37725 -108467 -326588 -72466 170250 136865 -2392 -51052 126121
19000c73369a01563M6225j30042F2175J93945a10523G2617b96596g5887B88507
$$ -373369 -101563 -55338 -185380 62175 256120 -110523 72617 -296596 -75887 288507
18989H106a17285C8811J08028b71303d0209A47586A570J6677P3567b21375G2815
$$ 8106 -117285 38811 146839 -271303 -40209 147586 1570 18247 91814 -221375 72815
18977F857i0509I3209a24129B63635m7958O71669j58880l55549f7396l2431I5448
$$ 6857 -90509 93209 -124129 263635 215677 887346 728466 372917 -67396 -99827 95448
18965A17963a15537C9309O3555i7656B14408a01976o1853d8846J9742J2893k8750
$$ 117963 -115537 39309 102864 -97656 214408 -101976 -163829 -48846 -29104 -16211 -44961
18954d4961l5442K9579A45122a93316p11m0038A40181f387j45452b2870k83725
$$ -44961 -80403 -50824 145122 -193316 -194027 -234065 140181 -6387 -151839 -22870 -306595
18943c06595a45458B32048j5252F2753L9412D4078L42424A67363P9891F1647B0849
$$ -306595 -145458 232048 216796 62753 102165 44078 386502 167363 247254 61647 20849
18931b63851H9310K80890a36992f0699C62558b4894j7647k3649E2589a99060O5857
$$ -263851 89310 370200 -136992 -60699 362558 -24894 -42541 -66190 52589 -199060 -133203
18920a33203D21039A06350D2583c03234e7155E1692J58571n3912l5894M002D3625
$$ -133203 421039 106350 42583 -303234 -57155 51692 210263 156351 120457 124459 43625
18908G98191L5994C54623j41399A9306K12947E7849a40179K8388p2752n5159L0311
$$ 798191 834185 354623 213224 19306 232253 57849 -140179 -111791 -184543 -239702 -209391
18897b09391J399e3888j4883M367n20321a75595M7525a9160A34981a99388h7299
$$ -209391 -207992 -53888 -68771 -64404 -584725 -175595 -128070 -19160 134981 -199388 -87299
18885a15582p5137j17646B24847b44090R6887G3317d452n0852j65573B31094j12751
$$ -115582 -190719 -308365 224847 -244090 -147203 73317 -4452 -55304 -220877 231094 118343
18874A18343J42020g6429q0782N4998B87030d02469a45019a0900j51662A99041
$$ 118343 260363 -76429 -157211 -102213 287030 -402469 -145019 -10900 -162562 199041
18863E1675a98207l4447E4817Q2929b66911O0497M4453l25394A79179b0977B1326
$$ 51675 -198207 -232654 54817 137746 -266911 -206414 -161961 -487355 179179 -20977 21326
18851b12206e6293R166l70598J39520b3067D4467c42562g4937J4288d028H2076
$$ -212206 -56293 -47127 -417725 -278205 -23067 44467 -342562 -74937 -60649 -4028 82076
18839B94966E5910J12008c2877A2054c6413l44707J73209h1723j57882H1458c30161
$$ 294966 55910 167918 -32877 12054 -36413 -381120 -207911 -81723 -239605 81458 -330161
18827d9477M435n0141j68857A72515c04182L8213B00797E2716N3110a36963G7621
$$ -49477 -45042 -95183 -264040 172515 -304182 -265969 200797 52716 105826 -136963 77621
18815E37924F4485M4733b87871e6027j51489A76005a8526b294o9365E8993e2502
$$ 537924 64485 109218 -287871 -56027 -207516 176005 -18526 -2294 -71659 58993 -52502
18803A09272i5960A36607b47608c1262B5974d47629c0324E7681K2431h6374q0529
$$ 109272 -95960 136607 -247608 -31262 25974 -447629 -30324 57681 80112 -86374 -166903
18792a66903b6630B13290n8984F755a32559K4616A04602m0127A6436c7330a841
$$ -166903 -26630 213290 154306 6755 -132559 -107943 104602 64475 16436 -37330 -1841
18780g8380b779q6899b2295B3899a7160j86748a7709n02508b44755B07793m6451
$$ -78380 -2779 -89678 -22295 23899 -17160 -203908 -17709 -520217 -244755 207793 161342
18769A61342h7361E6746b5561A53800b35046e8492E1580J36380c36900H3855A145
$$ 161342 -87361 56746 -25561 153800 -235046 -58492 51580 187960 -336900 83855 1145
18757i728r8751A04625a88941j43423A81J41205e7444j05378B0379a25621j04698
$$ -9728 -108479 104625 -188941 -332364 181 141386 -57444 -162822 20379 -125621 -230319
18746b30319B02502g06499a43540b5311l8426K4028j58500D3953L8856j9027a67362
$$ -230319 202502 -706499 -143540 -25311 -63737 -39709 -198209 43953 82809 63782 -167362
18734c63881C6458d0457A44507a36275A64643F5436a42494C15808b98528J37270
$$ -363881 36458 -40457 144507 -136275 164643 65436 -142494 315808 -298528 -161258
18724a61258a0769l412p0891I5214b86131B899J14239E4549c38634M7084B14559
$$ -161258 -10769 -14181 -85072 95214 -286131 2899 117138 54549 -338634 -291550 214559
18712a80924j37886i8878k24457A0482a278B05115h948l39k23264i7491A84453
$$ -180924 -318810 -98878 -323335 10482 -1278 205115 -8948 -9287 -232551 -97491 184453
18700b5034l5243j19468B34690a17291a6483o7537e625m1555J564a9461C24129
$$ -25034 -60277 -179745 234690 -117291 -16483 -84020 -5625 -47180 -45616 -19461 324129
18688c26964b5119j81829d0165A8198b16819B47270e1057B5288J39565e48676
$$ -326964 -25119 -206948 -40165 18198 -216819 247270 -51057 25288 164853 -548676
18677c62223F2337e281l8482J0561n1731C5138a78785A73051Q0643e3028n4984
$$ -362223 62337 -5281 -43763 -33202 -84933 35138 -178785 173051 253694 -53028 -108012
18666a08012A97582c1903I6591a29136e8169A18149R1627m3111a07416A49731
$$ -108012 197582 -31903 96591 -129136 -58169 118149 209776 166665 -107416 149731
18655b77665M4509A3934a5878k01917L7464A22114b88571B0038a58254l5996a1655
$$ -277665 -233156 13934 -15878 -217795 -180331 122114 -288571 20038 -158254 -194250 -11655
18643A0407N2230G397a89246b190G3904a68996A59470g1259o1308m94901B06419
$$ 10407 62637 7397 -189246 -2190 73904 -168996 159470 -71259 -132567 -627468 206419
18631A39791a70062D192c03475J45243l6127A21097b29228Q4736B97677E6384
$$ 139791 -170062 4192 -303475 -158232 -194359 121097 -229228 -144492 297677 56384
18620a05799C10566h1506H9079A2044R6466J02156M6209b21028i8328p9012B55198
$$ -105799 310566 -81506 89079 12044 108510 210666 256875 -221028 -98328 -177340 255198
18608g0947J9983q1594B09507E4942J2855a62211A96823a45241A80354c76290
$$ -70947 -50964 -132558 209507 54942 67797 -162211 196823 -145241 180354 -376290
18597a15658A00399d4106A83279D6882a9079B15836b2779A49055a63204d7453
$$ -115658 100399 -44106 183279 46882 -19079 215836 -22779 149055 -163204 -47453
18586B08317b27229D3043K05768a19126d5339j95388B90509h5203j51950a9569
$$ 208317 -227229 43043 248811 -119126 -45339 -240727 290509 -85203 -237153 -19569
18575e17139J94462J04993m018A06526P5600b82099e1278o3682d5636C4386a88117
$$ -517139 -322677 -217684 -221702 106526 182126 -282099 -51278 -114960 -45636 34386 -188117
18563g3509o7886H4679d27290H2707C7988K65100a97693b3091k45295J11353b2351
$$ -73509 -141395 84679 -427290 82707 37988 303088 -197693 -23091 -268386 -157033 -22351
18551a72359d4261j0050B29421D7089J759J74507b3626A34089o6225J2213e4652
$$ -172359 -44261 -54311 229421 47089 48848 223355 -23626 134089 67864 80077 -54652
18539a75902j4815m5039A28420D471c79861e3521j50047C2688K67099h7401B35105
$$ -175902 -190717 -235756 128420 4471 -379861 -53521 -203568 32688 299787 -87401 235105
18527i9606A02927c36614J32471L6742A7151c02241D8000R8364K56551I5086J89708
$$ -99606 102927 -336614 -204143 -167401 17151 -302241 48000 146364 402915 95086 284794
18516B84794d53907c1805C50946e5942H0111Q016a53702A38955a27577G9565c42861
$$ 284794 -453907 -31805 350946 -55942 80111 88127 -153702 138955 -127577 79565 -342861
18504a20306L1133F4910K9306a88446j20724E7760d68033n6766C65704a52164
$$ -120306 -89173 64910 94216 -188446 -309170 57760 -468033 -524799 365704 -152164
18493c55904e1236k02549g7112E3274e4074p7673A21140A4128J67489A9549c26042
$$ -355904 -51236 -253785 -77112 53274 -54074 -131747 121140 14128 181617 19549 -326042
18481a28860k6555m0716d9931A44352b18862J7222B22624d6410k89220F649h2338
$$ -128860 -155415 -196131 -49931 144352 -218862 -201640 222624 -46410 -335630 6649 -82338
18469E7596J11093q1316A6496L08299d48949a426k46599B56777a7727k49469C23533
$$ 57596 168689 87373 16496 324795 -448949 -1426 -248025 256777 -17727 -267196 323533
18457F4115L1716e7533F8820b49032a1993o9876G0318b72301J07582h1838j03896
$$ 64115 95831 -57533 68820 -249032 -11993 -81869 70318 -272301 -164719 -81838 -185734
18446a85734N6568j27972H499J6513R0466J12222b49869B187g6950j27339c8751
$$ -185734 -129166 -257138 8499 25012 115478 227700 -249869 2187 -76950 -204289 -38751
18434c9467q7291F7467L7644i4736j9073N4566j92945D27960D7622L25329b4143
$$ -39467 -126758 67467 105111 -94736 -113809 -59243 -252188 427960 47622 372951 -24143
18422a76039H6966a15344a2280j0700k2421A63303a3954G9307J4376a38161A2247
$$ -176039 86966 -115344 -12280 -22980 -45401 163303 -13954 79307 93683 -138161 12247
18410A02652h6106B88787F7634J53953B5859N0471l8109g175j54144D481b85204
$$ 102652 -86106 288787 67634 221587 25859 76330 38221 -7175 -161319 4481 -285204
18398f7482A03822b6943D6438i4988J7344E8978D491a25667n5763j16490e9188
$$ -67482 103822 -26943 46438 -94988 -77644 58978 4491 -125667 -181430 -297920 -59188
18386A44961E7191b09841c8226j93416l8254a4941j73475k12570A70333d2788
$$ 144961 57191 -209841 -38226 -231642 -269896 -14941 -188416 -400986 170333 -42788
18375a6655q4903A14842l8985d7589A07218b22059A71341l78K7908a92695g3142
$$ -16655 -101558 114842 75857 -47589 107218 -222059 171341 170963 198871 -192695 -73142
18363a16514j00169A73766m9476b58395J07666A25191N276b01690j04255Q9004
$$ -116514 -216683 173766 124290 -258395 -150729 125191 130467 -201690 -305945 -216941
18353b16941C7290J58549n5549b23299A40757f5079B1918J94322a88509K4019
$$ -216941 37290 195839 140290 -223299 140757 -65079 21918 216240 -188509 -164490
18343a64490B50264E7531i4916o6801b1956D6216K8688J05536b6080m1122A22833
$$ -164490 250264 57531 -94916 -161717 -21956 46216 74904 180440 -26080 -67202 122833
18331a6343k29936a1117A87926a96218h9602n9724n0168h5498o0024D433g3308
$$ -16343 -246279 -11117 187926 -196218 -89602 -149326 -199494 -85498 -145522 4433 -73308
18319H2866b70289C28505F804b86026d8743R389j74248h943k3835q6920c4070
$$ 82866 -270289 328505 6804 -286026 -48743 -39354 -213602 -8943 -32778 -119698 -34070
18307a5729j65779F2839h2060c3765j32511q5417B01789A1131c86601k7609a18528
$$ -15729 -181508 62839 -82060 -33765 -166276 -251693 201789 11131 -386601 -414210 -118528
18295A59975I789Q1795a84210J1846A58152i685j05460C3891d8806C84374e2114
$$ 159975 9789 91584 -184210 -172364 158152 -9685 -115145 33891 -48806 384374 -52114
18283B15658a25505e3900k0764O889m8931j2431c4262j80961D0382J01978N8474
$$ 215658 -125505 -53900 -74664 -67775 -116706 -129137 -34262 -215223 40382 142360 200834
18272B00834A25b76997H3186C7682c91682C40122i6826H7630a64516A47676a01856
$$ 200834 125 -276997 83186 37682 -391682 340122 -96826 87630 -164516 147676 -101856
18260A31466M9651a06795N0408a353A6733a72827B89240b65335J6927g149j60749
$$ 131466 181117 -106795 -56387 -1353 16733 -172827 289240 -265335 -248408 -7149 -167898
18249a67898Q0814G3572d7642o446A52247d435G7244b20447M2006e0438j20767
$$ -167898 -87084 73572 -47642 -54088 152247 -4435 77244 -220447 -178441 -50438 -171205
18238a71205A80582a04379B96767C0428a31291j0466j5961A5097a0059p019A59753
$$ -171205 180582 -104379 296767 30428 -131291 -141757 -157718 15097 -10059 -17078 159753
18226B1854R1310J00372F6806a72838B52913h1529O10j47492c0882r6350A66631
$$ 21854 113164 213536 66806 -172838 252913 -81529 -80919 -228411 -30882 -127232 166631
18214a26284F5983k5631J63374c5901q7291A40711f3498C44816a94826P0424B93251
$$ -126284 65983 40352 203726 -35901 -123192 140711 -63498 344816 -194826 -124402 293251
18202B70549L203i6887A72838f0586E2267c4512A3296N0134k3372b86943B30778
$$ 270549 273752 -96887 172838 -60586 52267 -34512 13296 63430 40058 -286943 230778
18190b46077B87910P511b37403J9344g1592k64175B19683J743m20b3701C40151
$$ -246077 287910 295421 -237403 -218059 -71592 -335767 219683 221426 221006 -23701 340151
18178g9162C2947a16457p471B01709I5388f5750H9448e3993J8848B948K44238
$$ -79162 32947 -116457 -123928 201709 95388 -65750 89448 -53993 -35145 2948 247186
18167B47186G2721C272J39291f5981j92279O394K5741N8341p4698h3429j30479
$$ 247186 72721 3272 142563 -65981 -258260 -251866 -226125 -167784 -242482 -83429 -213908
18156b13908b3858k8566K131A57051a01463C1620f1913B9698f8825b1833j19083
$$ -213908 -23858 -52424 -50293 157051 -101463 31620 -61913 29698 -68825 -21833 -140916
18145a40916J5238B01048b36562m2163c4080N7l21569I2094k7321b08427M9347
$$ -140916 -125678 201048 -236562 -278725 -34080 -34023 -355592 92094 64773 -208427 -159080
18134a59080f9088c3850k05170e0248j02316d6678D5056a90646B23881f3544F6046
$$ -159080 -69088 -33850 -239020 -50248 -152564 -46678 45056 -190646 223881 -63544 66046
18122c06854K7680g1692B8922f3552q6293A42053b10373A81045l0975F9703c53297
$$ -306854 -279174 -71692 28922 -63552 -149845 142053 -210373 181045 150070 69703 -353297
18110h3117o2771l019B0730N1765K58255a66361A80556Q1750b981I956K22956
$$ -83117 -145888 -148907 20730 72495 330750 -166361 180556 262306 -2981 9956 232912
18099B32912g6053B7430N8364b19468p9083f7912F6556K28205b67509a6775j9198
$$ 232912 -76053 27430 85794 -219468 -298551 -67912 66556 294761 -267509 -16775 -35973
18088c5973a5972B965K534J64387C1610h633A62878A5501N2191a79013h7024n5542
$$ -35973 -15972 2965 5499 169886 31610 -8633 162878 15501 67692 -179013 -87024 -142566
18076a42566A34036e0498j13557O432C60475G2699A9153J06838Q5313J49249j50938
$$ -142566 134036 -50498 -164055 -157623 360475 72699 19153 125991 211304 360553 209615
18065B09615G8873b0363j05456l13575A39364l5708j0350N5018c70306I9593a66073
$$ 209615 78873 -20363 -125819 -439394 139364 103656 93306 148324 -370306 99593 -166073
18053d4859A38326A0664a8146C25618m4954F7712j8660L6321M0700i8766C6750
$$ -44859 138326 10664 -18146 325618 280664 67712 49052 85373 126073 -98766 36750
18041a0553B7761i0252l4415b4043B63645I3297L3075c840k9818m8783A01851
$$ -10553 27761 -90252 -124667 -24043 263645 93297 126372 -3840 -33658 -82441 101851
18029a42455B45085a57103E6594b02105g0167Q430A08086d3057B31700H7115a15197
$$ -142455 245085 -157103 56594 -202105 -70167 -61737 108086 -43057 231700 87115 -115197
18017A31122b14367K7165E5902Q5852f3104A73182b66693A01123J0639b10667
$$ 131122 -214367 -187202 55902 141754 -63104 173182 -266693 101123 111762 -210667
18006c1158A38008a13428A37979E0703J2957O6665d03966M8769a31155D57181
$$ -31158 138008 -113428 137979 50703 63660 130325 -403966 -355197 -131155 457181
17995E3041J54989l0373k5750b98681g6791G5807J08959n0306a49356P1973I9720
$$ 53041 208030 177657 151907 -298681 -76791 75807 184766 134460 -149356 -77383 99720
17983h6050p6502A94972a13532j0251G2924a52045G1967d41379A50942g9551A9455
$$ -86050 -162552 194972 -113532 -123783 72924 -152045 71967 -441379 150942 -79551 19455
17971C46942b01777H9136j2655J07373e3162B9349a31858B18358h143j52664m5945
$$ 346942 -201777 89136 76481 183854 -53162 29349 -131858 218358 -8143 -160807 -206752
17960b06752N1343A28402C8171c7996j32467B99750b0137j04131L8586A20122
$$ -206752 -155409 128402 38171 -37996 -170463 299750 -20137 -124268 -85682 120122
17949i1482l8396a6766C02929a80287h3767j55728J1546A71163d062k3680A31420
$$ -91482 -129878 -16766 302929 -180287 -83767 -239495 -227949 171163 -4062 -27742 131420
17937a12784c1633l9510E07888a0460I5982M2783B7945a09134n2044B0639R111
$$ -112784 -31633 -71143 507888 -10460 95982 138765 27945 -109134 -161178 20639 29750
17926B9750L55354A51248k2483a77873G258a01023A02609O2554P7827a86567j03034
$$ 29750 385104 151248 128765 -177873 7258 -101023 102609 165163 242990 -186567 -289601
17915b89601B1777L1653O3870d5789r2509j37666g4511r4687k59171A67169J13963
$$ -289601 21777 53430 117300 -45789 -138298 -275964 -74511 -169198 -428369 167169 281132
17904B81132p5671h8177B28869C6101j3715K95257H4971e0091E5535B2936F414
$$ 281132 205461 -88177 228869 36101 22386 317643 84971 -50091 55535 22936 6414
17892b28284B12940b62089J26913l9127B13466b22093C17292b12250e7665A8482
$$ -228284 212940 -262089 -135176 -174303 213466 -222093 317292 -212250 -57665 18482
17881A53382l7377f2540p870A73462a06071k2559D47929b26075C13949b09463
$$ 153382 116005 -62540 -70410 173462 -106071 -128630 447929 -226075 313949 -209463
17870b02686A85240a8071n1968I9798a9910B95021F8740B5702J32208J74415a05659
$$ -202686 185240 -18071 -70039 99798 -19910 295021 68740 25702 157910 332325 -105659
17858C24058g3133K3880A73367A1792K06592B3144O0683K86907e7121C27962D9388
$$ 324058 -73133 -49253 173367 11792 218384 23144 83827 370734 -57121 327962 49388
17846I0073B9952J94157D5502a90430A12538A1373J05333m7167b19999I8019J25187
$$ 90073 29952 224109 45502 -190430 112538 11373 116706 69539 -219999 98019 223206
17835B23206I1034i4223c7954H4974K44301m0162a68041F3348d4808A65385K4256
$$ 223206 91034 -94223 -37954 84974 329275 289113 -168041 63348 -44808 165385 189641
17824A89641g2163B84049c4015C10004j27768b73150J06103f1059j2547j28124
$$ 189641 -72163 284049 -34015 310004 182236 -273150 -167047 -61059 -73606 -201730
17814b01730A3089g6840F722R6410d45579b00311A28645K35439a32780a7150D8665
$$ -201730 13089 -76840 6722 103132 -445579 -200311 128645 364084 -132780 -17150 48665
17802A39599M735J05905F6740L68931f8205f196A66349a47648E4748b00614B68641
$$ 139599 144334 250239 66740 435671 -68205 -6196 166349 -147648 54748 -200614 268641
17790b46935E9844M6802D6524i923j42036F4802J14103a6708A49790O3129I9504
$$ -246935 59844 106646 46524 -9923 -151959 64802 178905 -16708 149790 212919 99504
17778a29951A37299D4500a40058A32230J97307A57480o1874l2076M0987e3819
$$ -129951 137299 44500 -140058 132230 329537 157480 95606 63530 104517 -53819
17767A80128J55099g8422E7204a26567k44325J53636A54792a29250j32193C00970
$$ 180128 335227 -78422 57204 -126567 -370892 -217256 154792 -129250 -261443 300970
17756A02856J18001C2104d8397A11042a45383C4104i3113b267I1879J47708a89546
$$ 102856 220857 32104 -48397 111042 -145383 34104 -93113 -2267 91879 239587 -189546
17744d5510J4521A80728N3811l6865E0399a06207n1451O2901G8196K4158C8391
$$ -45510 -30989 180728 234539 197674 50399 -106207 -157658 -94757 78196 102354 38391
17732C3595K01592I1399l9285a97153a5138B69189B836L20230H0794i3988G3347
$$ 33595 235187 91399 52114 -197153 -15138 269189 2836 323066 80794 -93988 73347
17720F8944O4388J07278j13886a21813B5310c86940I7247L84050I326J56758C0853
$$ 68944 133332 240610 126724 -121813 25310 -386940 97247 481297 9326 166084 30853
17708A30963k3979j6053P3411n4430J3268a25406E2969f6559J8479p2489j81227
$$ 130963 106984 90931 164342 109912 123180 -125406 52969 -66559 -48080 -120569 -301796
17697c01796b8763j01098G6716a95266g4941C08543b08857H2500J74863a14318
$$ -301796 -28763 -129861 76716 -195266 -74941 308543 -208857 82500 257363 -114318
17686a68377B31690i849k1142H513a4615B01256P4530h0923E2989O8988a39699
$$ -168377 231690 -9849 -30991 8513 -14615 201256 275786 -80923 52989 121977 -139699
17674D8091a3723E2791K18781p3283J69751a70534A57767k6643a38285M9350C6161
$$ 48091 -13723 52791 271572 198289 368040 -170534 157767 131124 -138285 -88935 36161
17662c8282B51274i3368K5851k9514A90404j2502L2224P3834A0027J33701J82001
$$ -38282 251274 -93368 -67517 -97031 190404 177902 210126 283960 10027 143728 325729
17651C25729A36689J80436A17324c0850B89789B2279L95905a39706A08686R824
$$ 325729 136689 317125 117324 -30850 289789 22279 418184 -139706 108686 118510
17641A18510J74828o9213J7960a68376C52429c4740B43084J5332A5886Q4066O3131
$$ 118510 293338 224125 242085 -168376 352429 -34740 243084 258416 15886 99952 163083
17630A63083B0020J39188o7282R1386G654Q4291a17221F3677a71452A48704a27144
$$ 163083 20020 159208 91926 183312 7654 91945 -117221 63677 -171452 148704 -127144
17618C72097A41426C3410M8376b3630G2819f1992B2236b6259j90592A63794n8323
$$ 372097 141426 33410 81786 -23630 72819 -61992 22236 -26259 -216851 163794 105471
17607A05471l4337K2207g1161C1003J69199K75374A1781Q0505K00421j42672p0242
$$ 105471 71134 93341 -71161 31003 200202 475576 11781 92286 292707 150035 79793
17596G9793L91941b45406A55830i797B02688J8211a52244B24861f1808B99839
$$ 79793 471734 -245406 155830 -9797 202688 220899 -152244 224861 -61808 299839
17585E12481j33991d14779J81442J10774G7000K85937m0796J18691A844a95395
$$ 512481 378490 -414779 -233337 -122563 77000 362937 322141 440832 1844 -195395
17574A59252L9063N1570r7945k1864J2472B5140J20641l8427K20504A10188K55821
$$ 159252 198315 249885 151940 130076 142548 25140 145781 107354 327858 110188 366009
17563C66009n0735m3307q5040J3840k0477J84132j79466M91567B06241J52899
$$ 366009 315274 271967 186927 200767 180290 364422 184956 676523 206241 359140
17553C59140j48459m6978K46401B02818R9946R8971Q8695l7206J16948A66732
$$ 359140 210681 163703 410104 202818 302764 401735 490430 453224 570172 166732
17542d0795D28433E035L73290F2402L9165c4589B71821A30739Q3163J53522L1213
$$ -40795 428433 5035 378325 62402 101567 -34589 271821 130739 213902 367424 398637
17531C98637m3415j15768K65052A35595L80896J65020M24048M1254P7973l55351
$$ 398637 355222 239454 504506 135595 516491 681511 1105559 1146813 1224786 869435
17521H69435k89421J52585C41091A51848K66995J2958j11043J47417j27714L46837
$$ 869435 580014 732599 341091 151848 418843 431801 320758 468175 340461 687298
17511F87298p4749L94034J39579R7307m77010B92749J04724n8473N7837A97948
$$ 687298 612549 1006583 1146162 1243469 766459 292749 397473 339000 396837 197948
17500B93636K06858B12129Q3137M1049I3379L31506q8903Q1707j77540J1102J02305
$$ 293636 500494 212129 295266 336315 93379 424885 335982 417689 240149 251251 353556
17489C53556A44956j8464n536J51742K3061q4718j00831K6483L12M44937E8731
$$ 353556 144956 126492 120956 272698 295759 211041 110210 136693 137005 581942 58731
17477C18903j05973J75490A32589R8471Q5963j55169e856D09354K42926k86584
$$ 318903 212930 388420 132589 231060 317023 161854 -5856 409354 652280 365696
17467C65696N7844j72519l1813J62285j58906r068o3324K20619A17614M07176
$$ 365696 423540 251021 219208 381493 222587 213519 150195 370814 117614 524790
17457E24790j67328A31597K21724J41762j64856J6792J4116k9371J23003B04238
$$ 524790 357462 131597 353321 495083 330227 347019 361135 331764 454767 204238
17446C30701L7490n5661K5678P7488r6409l9817L6852P0916j00460L1748P6927
$$ 330701 368191 312530 338208 415696 319287 279470 316322 387238 286778 318526 395453
17435C95453M6415J7296o5423J1540j85209R2887K1568j0415K35927k09900E499
$$ 395453 441868 459164 393741 405281 220072 312959 334527 324112 560039 350139 5499
17423C80281n0493K04559h4493D65948A42313J77603O6071o6492L46439j98973
$$ 380281 329788 534347 -84493 465948 142313 319916 385987 319495 665934 466961
17413D66961j09052L07680j34428k43315K1979J88999Q1711A64637R4217l824
$$ 466961 357909 665589 531161 287846 309825 498824 580535 164637 258854 255030
17403B55030K07553L2731G1041J3260L62613j11867R5774A24059K52004j09362
$$ 255030 462583 495314 71041 84301 446914 335047 430821 124059 376063 266701
17393B66701m8848Q5805J64170B20004N2501P6490p711l5090j11780J30967J8304
$$ 266701 217853 303658 467828 220004 272505 348995 341284 306194 194414 325381 343685
17382C43685N5344A31854I111J22838Q8427A4195K48614m0485n40F8500J47326
$$ 343685 399029 131854 9111 131949 220376 14195 262809 222324 221784 68500 215826
17371B15826L22340G5590K46243J67843B27280J17008K2145J18155B21052l2662
$$ 215826 538166 75590 321833 489676 227280 344288 366433 484588 221052 188390
17361A88390j9240l2154a61460B78827R6173F7579M68177G6036g1358B52782D8845
$$ 188390 169150 136996 -161460 278827 375000 67579 535756 76036 -71358 252782 48845
17349B09433J73375j39299R059N7448j31738K46860A27359J49452A23017m8722
$$ 209433 382808 243509 252568 310016 178278 425138 127359 276811 123017 74295
17339G4295M8805B3746M03548k6694A47867Q6517M3806B8213J65131N4008J49640
$$ 74295 123100 23746 427294 400600 147867 234384 278190 28213 193344 247352 396992
17328C96992j12724L7316A30212E4415M38627j42844q6259d1449B47918r0588
$$ 396992 284268 321584 130212 54415 493042 350198 263939 -41449 247918 157330
17318A57330b32282E06341j87732J38532B14234A04930P0788O5028L32056B52100
$$ 157330 -232282 506341 318609 457141 214234 104930 175718 240746 572802 252100
17307C4823K95894j60617J58904l280K99235B99993P0329j06102J37168j22201
$$ 34823 330717 170100 329004 325724 624959 299993 370322 264220 401388 279187
17297B79187E2427J74876j2249K19936r3150A66198M41112J16734B9896L13215
$$ 279187 52427 227303 215054 434990 341840 166198 607310 724044 29896 343111
17287C43111J23177K13732B00403K14192F2659L18024o7350j49923J15043M5720
$$ 343111 466288 680020 200403 414595 62659 380683 313333 163410 278453 324173
17277C24173j61629M30196K2333B81061J9533K72142j21288J14497k03620r2930
$$ 324173 162544 592740 615073 281061 300594 572736 451448 565945 362325 269395
17267B69395A14431R6370K88031A59184a6758C45704K08773p1496k8001A68368
$$ 269395 114431 210801 498832 159184 -16758 345704 554477 482981 454980 168368
17256D70759A91574K08702L9232O9922k49714L65923A49032K71251j99577L59248
$$ 470759 191574 400276 439508 509430 259716 625639 149032 420283 220706 579954
17246E79954j75252L6753K62128k03875p7854A26332Q4696J49943J4074n1796
$$ 579954 404702 441455 703583 499708 421854 126332 211028 360971 375045 323249
17236C23249M11757k21188j33216J38116k43685K9394J54299j83323m5573J28718
$$ 323249 735006 513818 380602 518718 275033 304427 458726 275403 229830 358548
17226C58548J69776j93911K10115A28935K80132q3403I0986K77849H0366L91428
$$ 358548 528324 334413 544528 128935 409067 325664 90986 368835 80366 471794
17216D71794r7561j78948Q9253O63431l72053j26658M6089j71581n9838O0711
$$ 471794 374233 195285 284538 947969 575916 449258 495347 323766 263928 324639
17206C24639K66552k03360p0359K79863J917k02952k7873J56564K38847l31650
$$ 324639 591191 387831 317472 597335 599252 396300 368427 524991 763838 432188
17196D32188J03672K92019B22174K72660J40709B57175L42365r6651o80J00253
$$ 432188 535860 827879 222174 494834 635543 257175 599540 502889 502209 602462
17186F02462k66913j52367M66418C01113R6959R3862j94984K04058M1762o8353
$$ 602462 335549 183182 649600 301113 398072 491934 296950 501008 542770 474417
17176D74417K33998B90440L67844j88187K46287r7410j05034r7278q1274K96314
$$ 474417 708415 290440 658284 470097 716384 618974 513940 416662 335388 631702
17166F31702j88938J10633k36433J42565L115R1503B21079L89811o7614o3976
$$ 631702 442764 553397 316964 459529 462644 554147 221079 610890 543276 479300
17156D79300p270J00939O2132J24976j01061j49883k1275J94008M2349l25918
$$ 479300 472030 572969 635101 760077 659016 509133 487858 681866 724215 398297
17146C98297J27228B48072J83086J86470J68492l42110L09894j00428J19275m1768
$$ 398297 525525 248072 431158 617628 786120 444010 753904 653476 772751 730983
17136G30983j73963n2016o8753j01452M04049C19582L40199l10823L37981p1621
$$ 730983 557020 505004 436251 334799 738848 319582 659781 348958 686939 615318
17126F15318J61554k28276j58914N31718C14162N9259K12667R8830K0759K8295
$$ 615318 776872 548596 389682 921400 314162 373421 586088 684918 705677 733972
17116G33972j96508K36175l1272j33410N38744m42315j44718L00850k64951l9843
$$ 733972 537464 773639 742367 608957 1147701 705386 560668 861518 596567 556724
17106E56724j08593L93248k77797L9088N2650J18390p6138R3163r0569m8286J94180
$$ 556724 448131 841379 563582 602670 655320 773710 697572 790735 700166 651880 846060
17095H46060k96334Q6374p6906J49551j74859L42022K8471k69885M5310J16433
$$ 846060 549726 636100 559194 708745 533886 875908 904379 634494 679804 796237
17085G96237M7006k47921J97826k60290L61665N9641l51181J41664N588K11033
$$ 796237 843243 595322 793148 532858 894523 954164 602983 744647 750235 961268
17075I61268J46091k93925J68688l39389N6637L62043k50080o661R736P6671J8393
$$ 961268 1107359 813434 982122 642733 699370 1061413 811333 804672 814408 891079 909472
17064I09472j29491L58596l60010l0902m4976K47240k12490J07860K40231p7821
$$ 909472 779981 1138577 778567 747665 702689 949929 737439 845299 1085530 1007709
17054A007709o8695L3753k67090K43849r2542K11044l86742K47869N2033k33781
$$ 1007709 939014 972767 705677 949526 856984 1068028 681286 929155 981188 747407
17044G47407J97581M0898l2839n373L15058o10483O12130o9336R5736j99738O4918
$$ 747407 944988 985886 953047 947674 1262732 652249 1264379 1195043 1290779 1091041 1155959
17033A155959M6073m29471J14871J57344J91460P3427j34952O5305p5195n9903
$$ 1155959 1202032 772561 887432 1044776 1236236 1309663 1174711 1240016 1164821 1104918
17023A104918j34865L08395j23505o8135K49606k2049n6024r3025k2661k98375
$$ 1104918 970053 1278448 1154943 1086808 1336414 1314365 1258341 1165316 1142655 844280
17013H44280L16104m9687J85719M4206k60562M20581k04437l1057K89728m96792
$$ 844280 1160384 1110697 1296416 1340622 1080060 1500641 1296204 1265147 1554875 1058083
17003A058083J94994J84252n4500m9830p181l9973j55369M23455k08553J40875
$$ 1058083 1253077 1437329 1382829 1332999 1325818 1285845 1130476 1553931 1345378 1486253
16993A486253l13917J69121j113M28998k93759P6668j50544J1551K50608r0267
$$ 1486253 1172336 1341457 1340344 1769342 1475583 1552251 1401707 1413258 1663866 1573599
16983A573599j66495K08185j87036K44091j00964R4905m0466q8906K3803j63221
$$ 1573599 1407104 1615289 1428253 1672344 1571380 1666285 1625819 1536913 1560716 1397495
16973A397495K85965M5883K32825k62825J2477K8714J8030J6311l35370K83396
$$ 1397495 1683460 1729343 1962168 1699343 1711820 1740534 1758564 1774875 1439505 1722901
16963A722901j4786J44222N2132k06549K01104j81830j55365L63868j18489M9059
$$ 1722901 1708115 1852337 1904469 1697920 1899024 1717194 1561829 1925697 1807208 1856267
16953A856267J80587j53398j01962J39595P2113J18120J79685j87231k82933M2217
$$ 1856267 2036854 1883456 1781494 1921089 1993202 2111322 2291007 2103776 1820843 1863060
16943A863060K04924L0414n0295K37024j01085r5465L89248k36252J37219K58388
$$ 1863060 2067984 2098398 2048103 2285127 2184042 2088577 2477825 2241573 2378792 2637180
16933B637180l63041j84507K13939J9974n5475Q2657P0054L1502k0715j43216
$$ 2637180 2274139 2089632 2303571 2323545 2268070 2350727 2420781 2452283 2431568 2288352
16923B288352M80225J53302m59884L26890j91766j10112J61581j2759K31706n3762
$$ 2288352 2768577 2921879 2461995 2788885 2597119 2487007 2648588 2635829 2867535 2813773
16913B813773Q976K14167q759j87509L89907k19571k18300Q6584L14922k24961
$$ 2813773 2822749 3036916 3028157 2840648 3230555 3010984 2792684 2879268 3194190 2969229
16903B969229j12945J55052K10622j90569J35470m862Q8316q1208L62693P4433
$$ 2969229 2856284 3011336 3221958 3031389 3166859 3161997 3250313 3169105 3531798 3606231
16893C606231J43079k25755J25181o3633m296N8796N9726j11267L43113P0416
$$ 3606231 3749310 3523555 3648736 3585103 3580807 3639603 3699329 3588062 3931175 4001591
16883D001591j60868M1135o4232K77501L79176l83449q8258K57281J99439l92848
$$ 4001591 3840723 3881858 3817626 4095127 4474303 4090854 4002596 4259877 4459316 4066468
16873D066468L81420l9518l8635P5138r899L31154n0111J60105k5313K56886J39514
$$ 4066468 4447888 4408370 4369735 4444873 4434974 4766128 4716017 4876122 4850809 5107695 5247209
16862E247209j44996K80253j74682O185K2810R1421J25695o0124L44837j18577
$$ 5247209 5102213 5382466 5207784 5213969 5236779 5328200 5453895 5393771 5738608 5620031
16852E620031M21442j64721J37336K21879l3955M986j56783M36920K41863J01846
$$ 5620031 6041473 5876752 6014088 6235967 6202012 6206998 6050215 6487135 6728998 6830844
16842F830844j9871r5293M81007m6508o810K39314P4604K51758j61774L40914
$$ 6830844 6810973 6715680 7196687 7150179 7143369 7382683 7457287 7709045 7547271 7888185
16832G888185j75228M4668K95279L58278K11535L03204O6388j02293K6116M3101
$$ 7888185 7712957 7757625 8052904 8411182 8622717 8925921 8992309 8890016 8916132 8959233
16822H959233O71829j620J61324L18489m5821M31645j26548J10260N43635L16569
$$ 8959233 9631062 9629442 9790766 10109255 10063434 10495079 10368531 10478791 11022426 11338995
16812A1338995K29782Q9668K4767O73936L29966k32892N46308K72222N7051L06829
$$ 11338995 11568777 11658445 11683212 12357148 12687114 12454222 13000530 13272752 13329803 13636632
16802A3636632M09971J41864N09168L01896L04808K64400L27725L19432N25379
$$ 13636632 14046603 14188467 14697635 14999531 15304339 15568739 15896464 16215896 16741275
16793A6741275L35830M44026M89647L73616M36896M83602L60209L77864M86351
$$ 16741275 17077105 17521131 18010778 18384394 18821290 19304892 19665101 20042965 20529316
16784B0529316O74593M54368O37960P53617K9402P08675R48681N67257R38557
$$ 20529316 21203909 21658277 22296237 23049854 23079256 23787931 24736612 25303869 26242426
16775B6242426N98916N96527P27888J030393P07713J001797O37830Q74547J096292
$$ 26242426 26841342 27437869 28165757 29196150 29903863 30905660 31543490 32418037 33514329
16766C3514329Q63821J505899K84349J464700R58587J400031J392807J150818
$$ 33514329 34378150 35884049 36168398 37633098 38591685 39991716 41384523 42535341
16758D2535341R76461J735136J382503J419937J367207J439988J542963J679203
$$ 42535341 43511802 45246938 46629441 48049378 49416585 50856573 52399536 54078739
16750E4078739J471587J694258J826272J972867J534625J780158K240118J668579
$$ 54078739 55550326 57244584 59070856 61043723 62578348 64358506 66598624 68267203
16742F8267203J986505K066907K140507J680304K048364K305991J701197J949059
$$ 68267203 70253708 72320615 74461122 76141426 78189790 80495781 82196978 84146037
16734H4146037J848349J703537J744381J896433J563637J055113J412568J225839
$$ 84146037 85994386 87697923 89442304 91338737 92902374 93957487 95370055 96595894
16726I6595894O52160J013479P03457M76537L97455j61893L7054l43549k19012
$$ 96595894 97248054 98261533 98964990 99441527 99838982 99677089 99714143 99370594 99151582
16717I9151582o79000j182210p67011j368784r41203j591150j703703j284424
$$ 99151582 98472582 97290372 96523361 95154577 94213374 92622224 90918521 89634097
16709H9634097k009142j934008j685306k035474k124242j844125j738774k351379
$$ 89634097 87624955 85690947 84005641 81970167 79845925 78001800 76263026 73911647
16701G3911647j846503k228388j666041k359527j957545j820805j739433j953010
$$ 73911647 72065144 69836756 68170715 65811188 63853643 62032838 60293405 58340395
16693E8340395j585996k017563j434895j894896j536637r95950j990635j424569
$$ 58340395 56754399 54736836 53301941 51407045 49870408 48874458 46883823 45459254
16685D5459254j546998j049649j495591j141618j005574j244120j694733p81409
$$ 45459254 43912256 42862607 41367016 40225398 39219824 37975704 36280971 35499562
16677C5499562j251915j003177p05004q35326j092878n29976j087825j092201
$$ 35499562 34247647 33244470 32539466 31704140 30611262 30081286 28993461 27901260
16669B7901260n56844p31961o61345p32596p45974r74696k06026n50744n65079
$$ 27901260 27344416 26612455 25951110 25218514 24472540 23497844 23291818 22741074 22175995
16660B2175995p54469p17542k93235o22849p75505k43811m63233k48347n23908
$$ 22175995 21421526 20703984 20410749 19787900 19012395 18768584 18305351 18057004 17533096
16651A7533096o16622m10756j60479k18479n19998l06840j88814l77781k46044
$$ 17533096 16916474 16505718 16345239 16126760 15606762 15299922 15111108 14733327 14487283
16642A4487283p15235J01428n04511O8927p60226n58473n3976j94949l46377l73326
$$ 14487283 13772048 13873476 13368965 13437892 12677666 12119193 12065217 11870268 11523891 11150565
16632A1150565n1569J94924m08259j86431j86791l31555N9888k91094j74566k44917
$$ 11150565 11098996 11293920 10885661 10699230 10512439 10180884 10240772 9949678 9775112 9530195
16622I530195k73001J52282n14234k08124L5062j95395p9940j82416l23177M6606
$$ 9530195 9257194 9409476 8895242 8687118 8722180 8526785 8446845 8264429 7941252 7987858
16612G987858M3964m60351K0982j78001J14084n20816K9882l96613J09413m0975
$$ 7987858 8031822 7571471 7592453 7414452 7528536 7007720 7037602 6640989 6750402 6709427
16602F709427l8400l84827P1353k6420k67148J58241m62683K18684m2655k71966
$$ 6709427 6671027 6286200 6357553 6331133 6063985 6222226 5759543 5978227 5935572 5663606
16592E663606k4078q06m2590j66820R174j31788J44687m41083O1070R7922m45473
$$ 5663606 5639528 5638722 5596132 5429312 5438486 5306698 5451385 5010302 5071372 5169294 4723821
16581D723821K14408j62852J4815p4731m12711J24963k43503j13487N36312j91804
$$ 4723821 4938229 4775377 4790192 4715461 4302750 4427713 4184210 4070723 4607035 4415231
16571D415231N5334k37834j10112J63730j12583m56281o4303n705L4705O0013
$$ 4415231 4470565 4232731 4122619 4286349 4173766 3717485 3653182 3647477 3682182 3742195
16561C742195k25009O3490K48046k35616m71177K42872J43385l08588M45389k24593
$$ 3742195 3517186 3580676 3828722 3593106 3121929 3364801 3508186 3199598 3644987 3420394
16551C420394m812R7817k83303k59699L12637l82538K93072j39425l82915K98797
$$ 3420394 3415582 3513399 3230096 2970397 3283034 2900496 3193568 3054143 2671228 2970025
16541B970025J45470k0409n03981L10683m21030R8761m1695K68532p2198j50767
$$ 2970025 3115495 3095086 2591105 2901788 2480758 2579519 2537824 2806356 2734158 2583391
16531B583391K92540j86034k00826K8551k65175M56149j64648J56638m0106q898
$$ 2583391 2875931 2689897 2489071 2517622 2252447 2708596 2543948 2700586 2660480 2651582
16521B651582k17888J24570l39787J73815k96071l6376K81834K78024m93005n8051
$$ 2651582 2433694 2558264 2218477 2392292 2096221 2059845 2341679 2619703 2126698 2068647
16511B068647K35123k51026N858j10154R821J66848J066K50760m44120J76943
$$ 2068647 2303770 2052744 2058602 1948448 1958269 2125117 2126183 2376943 1932823 2109766
16501B109766J89173n47017O55860n09940M6699O9139J07180j35541k61358J91373
$$ 2109766 2298939 1751922 2407782 1897842 1944541 2013680 2120860 1985319 1723961 1915334
16491A915334k73498K06163J69986n05089M19457J95381n67054P1782L04523k77909
$$ 1915334 1641836 1847999 2017985 1512896 1932353 2127734 1560680 1632462 1936985 1659076
16481A659076m29j5478K5367j74538J11359J49762m09793J77399K23142j50246
$$ 1659076 1658647 1643169 1668536 1493998 1605357 1755119 1345326 1522725 1745867 1595621
16471A595621K37891j80032p3184m07604L02960k82655K62244L0453M8167j97579
$$ 1595621 1833512 1653480 1580296 1172692 1475652 1192997 1455241 1485694 1533861 1336282
16461A336282n0692J87518l01133K03244K65786k52267J28176k54662m4362O2149
$$ 1336282 1285590 1473108 1171975 1375219 1641005 1388738 1516914 1262252 1217890 1280039
16451A280039Q7065k65216J36972r4240J98012m445j16713J46104L7337r5191
$$ 1280039 1367104 1101888 1238860 1144620 1342632 1338187 1221474 1367578 1404915 1309724
16441A309724k99050K25358J03195j16958J50894j82563k52006L19163j03414
$$ 1309724 1010674 1236032 1339227 1222269 1373163 1190600 938594 1257757 1154343
16432A154343M3468J41308j65480L8045j39381J86187j84955k27582J75076L70879
$$ 1154343 1197811 1339119 1173639 1211684 1072303 1258490 1073535 845953 1021029 1391908
16422A391908r2330r1950k51889J13996o3019J2127j17133P6412m9085k14830
$$ 1391908 1299578 1207628 955739 1069735 1006716 1018843 901710 978122 929037 714207
16412G14207M09557k05597k6935J71867n5659J81820j69759J65510l93408J8025
$$ 714207 1123764 918167 891232 1063099 1007440 1189260 1019501 1185011 791603 809628
16402H09628K44183l4151k32020J92687K0822k38332J21361j77542J43694M8548
$$ 809628 1053811 1019660 787640 980327 1001149 762817 884178 706636 850330 898878
16392H98878o6629r4292L78448l90876J16118o5463k4009K7443J94153l52902
$$ 898878 832249 737957 1116405 725529 841647 776184 752175 779618 973771 620869
16382F20869n3134L8161K58309q2396j01683C01280P94699l9958l92788L4451
$$ 620869 567735 605896 864205 781809 680126 301280 1095979 1056021 663233 697684
16372F97684J1508k682J58219J2944p0835r0024j24386j71195L27285L28514m63989
$$ 697684 709192 706510 864729 877673 806838 716814 592428 421233 748518 1077032 613043
16361F13043J92730k55068K30458l32350N4270J56194j39297N8502K48583j89458
$$ 613043 805773 550705 781163 448813 503083 659277 519980 578482 827065 637607
16351F37607j0729J085L8002L78429m04594K35950k56580n012R2841A89307N01084
$$ 637607 626878 627963 665965 1044394 639800 875750 619170 614158 706999 189307 690391
16340F90391k10586l6900L0828q7874K7375J74269Q1663L06588D51009K99220
$$ 690391 479805 442905 473733 385859 413234 587503 669166 975754 451009 750229
16330G50229J830l27036J2176j24036K51620B73201L92326j95842K30683j7112
$$ 750229 752059 425023 437199 313163 564783 273201 665527 469685 700368 683256
16320F83256l03651M5755J35283j39085Q5891j26581K06998k76750K61695B81599
$$ 683256 379605 425360 560643 421558 507449 380868 587866 311116 572811 281599
16309G19392j77654l1163n6930j13411M8727j801K92876j0966j1787B68003r9909
$$ 719392 541738 510575 453645 340234 388961 387160 680036 669070 657283 268003 168094
16298A68094N10620M0704k37357B35762j04929M28591B03185J65700L49506j46850
$$ 168094 678714 719418 482061 235762 130833 559424 203185 368885 718391 571541
16288E71541p5197B22705N19910k27541k8467J19457j93323P2887j90159J93947
$$ 571541 496344 222705 742615 515074 486607 606064 412741 485628 295469 489416
16278D89416j02012J42031n7995j22659A51023M19938A91382K62442m770j68734
$$ 489416 387404 529435 471440 348781 151023 570961 191382 453824 449054 280320
16268B80320A38044L94095j2941B59007M1333I3688N29352j70392A24345M21475
$$ 280320 138044 532139 519198 259007 300340 93688 623040 452648 124345 545820
16258E45820q6627j70979N1953j62694n3486K52004A26210L45511m3330j98225
$$ 545820 459193 288214 340167 177473 123987 375991 126210 471721 428391 230166
16248B30166L61997I0265N7023j660L63345j58080P9883j85102K24353M7019A5557
$$ 230166 592163 90265 147288 145628 508973 350893 430776 245674 470027 517046 15557
16236I9340L781K28598a3702B36443L83322A44231K13298e3891F85207C23306
$$ 99340 103121 331719 -13702 236443 619765 144231 357529 -53891 685207 323306
16225C41506J0736K61166l837f357G8597L61996A01303J44342I2147L39358A40181
$$ 341506 352242 613408 609571 -6357 78597 440593 101303 245645 92147 431505 140181
16213B82818Q3571F588J54730L20683A38526J4877b37076B65934p0917J30443
$$ 282818 366389 6588 161318 482001 138526 153403 -237076 265934 195017 325460
16203C25460A50594J64663D8888N07205G4879J98112J69259k02871J44731K1226
$$ 325460 150594 315257 48888 556093 74879 272991 442250 239379 384110 405336
16193D05336O7845o7248j57604K8906K21334A1404K54631o4549K42779n1060q38
$$ 405336 473181 405933 248329 277235 498569 11404 266035 201486 444265 393205 392367
16182C92367l0396j64391J41510b2306B46378J95479o7482j1999A79113l0960
$$ 392367 361971 197580 339090 -22306 246378 441857 374375 362376 179113 148153
16172A48153J23762l1710n4245Q3333K31494A62316J65429C3340K31183J72451
$$ 148153 271915 240205 185960 269293 500787 162316 327745 33340 264523 436974
16162D36974j28744A37232J31900I1907J90702A15288J22918I6894f4707D25308
$$ 436974 308230 137232 269132 91907 282609 115288 238206 96894 -64707 425308
16151D07388j16806A07509L3038Q5726l9408R6798j12842q0812J48820p6034a4226
$$ 407388 290582 107509 140547 226273 186865 283663 170821 90009 238829 162795 -14226
16139b8269l4563k1726B1834K06076O1814C535Q6817j5626J37269i5680A01380
$$ -28269 -62832 -84558 21834 227910 289724 3535 90352 74726 211995 -95680 101380
16127H8376K60571C4272o639L83250D1989K56455j0772p0134K352b26055A65629
$$ 88376 348947 34272 27633 410883 41989 298444 287672 217538 219890 -226055 165629
16115B26614J08368e0170j06286L090A43361M16174H9441L03749a19122B19973
$$ 226614 334982 -50170 -156456 -153366 143361 559535 89441 393190 -119122 219973
16104E2007K28679J33740r6872j34983d0716q467C15327Q7729j06778j04389a63729
$$ 52007 280686 414426 317554 182571 -40716 -49183 315327 403056 296278 191889 -163729
16092C52151A531K31483R5365l7575A34980J7444L9903K85885b69363g1035C26376
$$ 352151 1531 233014 328379 290804 134980 152424 192327 478212 -269363 -71035 326376
16080f9764C36930j13251j03706J15028R5620j15196m4253j2210b79032E34211
$$ -69764 336930 223679 119973 235001 330621 215425 171172 158962 -279032 534211
16069c81357F03787b9979C22602a80156B79911j39310E9409j287J16437a9960
$$ -381357 603787 -29979 322602 -180156 279911 140601 59409 58122 174559 -19960
16058B3618J21884N3369J04934B2225O5457a57535g6506k01499H9428L07166A37751
$$ 23618 145502 198871 303805 22225 87682 -157535 -76506 -278005 89428 396594 137751
16046C23608a89061A03480K74336a17716K915I6208J98649j18049b85974A81915
$$ 323608 -189061 103480 377816 -117716 -114801 96208 294857 176808 -285974 181915
16035A74763K08785j79248i0497O566i520A01767N815a4895C07391g6294k4888
$$ 174763 383548 204300 -90497 -83931 -9520 101767 107582 -14895 307391 -76294 -101182
16024a01182F6173c5684H0885e731D9496J77608D3677b5163B66255j12150K8130
$$ -101182 66173 -35684 80885 -5731 49496 227104 43677 -25163 266255 154105 182235
16013A82235G4456J43744m8232d2453l51239A70438a19316j0091A11865a20143
$$ 182235 74456 218200 169968 -42453 -393692 170438 -119316 -129407 111865 -120143
16002C91358a2683G7093c0141C57d4017k60901B12121E7881q064K66631j9684
$$ 391358 -12683 77093 -30141 357 -44017 -304918 212121 57881 49817 316448 296764
15991B96764r5572G9067J77916K74379L28779K38533J0690k9018j37796J2359
$$ 296764 201192 79067 256983 531362 860141 1098674 1109364 1080346 942550 954909
15981I54909m00155j90364f8139A52327M3192b194G4233c552A19697c8629p4139
$$ 954909 554754 364390 -68139 152327 195519 -2194 74233 -3552 119697 -38629 -112768
15970a12768C7351a18520C3911e7370A29276e1307a4192A06995K6755e4150C0834
$$ -112768 37351 -118520 33911 -57370 129276 -51307 -14192 106995 133750 -54150 30834
15958A89386E3829a34637e8989H2860K48478d3454n867I6994j9700c3833o7564
$$ 189386 53829 -134637 -58989 82860 331338 -43454 -49321 96994 77294 -33833 -101397
15947a01397o3112A42570E1648K91110h1107p3919e665j56158O9951d3628D2487
$$ -101397 -164509 142570 51648 342758 -81107 -155026 -5665 -161823 -91872 -43628 42487
15935B36930b930l68586G9273f0452A44503M8246a22028c728j72428N4204j56186
$$ 236930 -2930 -371516 79273 -60452 144503 192749 -122028 -3728 -176156 -121952 -278138
15924b78138k0482A52824o3843b05541B3341J58476E5835a39705C2100J3258k0146
$$ -278138 -298620 152824 88981 -205541 23341 181817 55835 -139705 32100 45358 25212
15913B5212a62500B0695b9753k70704a09427k03951B0300J26033d9215G4413a09750
$$ 25212 -162500 20695 -29753 -300457 -109427 -313378 20300 146333 -49215 74413 -109750
15901A04409a54322J6543A1720L1759P6056a57757C2832e2806D6563P2423a27189
$$ 104409 -154322 -137779 11720 43479 119535 -157757 32832 -52806 46563 118986 -127189
15889a67841o4850a14987k30154F7079N0470N7125f4289A07332c24695C0934M0453
$$ -167841 -232691 -114987 -345141 67079 117549 174674 -64289 107332 -324695 30934 71387
15878G1387O9897a33109A37831k542b24479G6379g028E704a17558e4628j56720
$$ 71387 141284 -133109 137831 135289 -224479 76379 -7028 5704 -117558 -54628 -211348
15867b11348e0081D9085L18883a3230E1080d3971B74270h7586p5061A00704J00435
$$ -211348 -50081 49085 367968 -13230 51080 -43971 274270 -87586 -162647 100704 201139
15856B01139j5487J37802a43678A02707A3198K03155A00674A3850i3974G2309
$$ 201139 185652 323454 -143678 102707 13198 216353 100674 13850 -93974 72309
15845a05966B94745a61858n6528j56405I3821K54078A34626b18160A17149b50293
$$ -105966 294745 -161858 -218386 -374791 93821 347899 134626 -218160 117149 -250293
15834B41914E7193m687a58537e901j13978r578j03110i7900A90163a80397B66091
$$ 241914 57193 52506 -158537 -5901 -119879 -129457 -232567 -97900 190163 -180397 266091
15822B0208a98106R0918j89715A19611a19523r8051a04762k45987b345D0577b53635
$$ 20208 -198106 -107188 -296903 119611 -119523 -217574 -104762 -350749 -2345 40577 -253635
15810A38783F909a13044j02149A84149a34596C7891J7281f8675F0263a26227F7298
$$ 138783 6909 -113044 -215193 184149 -134596 37891 55172 -68675 60263 -126227 67298
15798B28476a3915C9741f2079F2308b44155K3839A56961g2075l4690C5262b1830
$$ 228476 -13915 39741 -62079 62308 -244155 -220316 156961 -72075 -106765 35262 -21830
15786c36347D8581c23298A36262n9641a23735C40492I0119K43173b6954D3215
$$ -336347 48581 -323298 136262 76621 -123735 340492 90119 333292 -26954 43215
15775A2597c87646J64293a1631B0439g4778j44372A27528D4288c6730n70A04203
$$ 12597 -387646 -223353 -11631 20439 -74778 -219150 127528 44288 -36730 -37300 104203
15763b6889H9657J29292i9190I8555g3361E9081d7823C24539a01131A11445a37160
$$ -26889 89657 218949 -99190 98555 -73361 59081 -47823 324539 -101131 111445 -137160
15751A3452J28537f3836j89664F5250P9753P6633E7492b259B48161i9949B68608
$$ 13452 141989 -63836 -253500 65250 145003 221636 57492 -2259 248161 -99949 268608
15739B4134a97643F0198d52012B36067I3130a42791A05362d510A51000n6652a47790
$$ 24134 -197643 60198 -452012 236067 93130 -142791 105362 -4510 151000 94348 -147790
15727a37114F9373K3192a24424A03688B4478L7626a86519H2748a22045l3059p567
$$ -137114 69373 92565 -124424 103688 24478 62104 -186519 82748 -122045 -155104 -162671
15716a62671f9574r0023j35220A40311J13178h5477k14642c8479j65228e7053
$$ -162671 -69574 -159597 -294817 140311 253489 -85477 -300119 -38479 -203707 -57053
15705B972a18219j8855p0269A92557a31480M4416J1380m5065k2868A06837l661
$$ 2972 -118219 -137074 -207343 192557 -131480 -87064 -75684 -120749 -143617 106837 103176
15694A03176d9329A59856N4793D8809g7619D85388c1076B38471b6651D21238j92703
$$ 103176 -49329 159856 214649 48809 -77619 485388 -31076 238471 -26651 421238 228535
15683B28535G6325f1129K1266f340r315m8155d157D2313d2521l3969A40062m2613
$$ 228535 76325 -61129 -39863 -6340 -15655 -63810 -4157 42313 -42521 -76490 140062 97449
15671I7449J4689P6838d2178k14588b6480A71772b53812A77210l3802M28068a97344
$$ 97449 112138 188976 -42178 -256766 -26480 171772 -253812 177210 143408 571476 -197344
15659i4031M508C47982d8710B40434f9008k38776A58470J42619E0626J24356n2164
$$ -94031 -89523 347982 -48710 240434 -69008 -307784 158470 301089 50626 174982 122818
15648A22818h6640D5856a37329B0639i6302m8926m1308E8309a3568A93258C4106
$$ 122818 -86640 45856 -137329 20639 -96302 -145228 -186536 58309 -13568 193258 34106
15636E404e6102j5193A58558e0817I4381i0840j2954r0116D76184H6306j1308
$$ 5404 -56102 -71295 158558 -50817 94381 -90840 -103794 -193910 476184 86306 74998
15625G4998c1870R156A13479d10314J32956a37509B78574A27946b72233A41809
$$ 74998 -31870 -22714 113479 -410314 -277358 -137509 278574 127946 -272233 141809
15614E670b1680A893J13965d8442A29201b20344e3416A59028R9209A19859N8137
$$ 5670 -21680 1893 115858 -48442 129201 -220344 -53416 159028 258237 119859 177996
15603A77996E6189k5407K4990P9315m6544d7831B37501c5321j11497r6589f0917
$$ 177996 56189 30782 55772 135087 88543 -47831 237501 -35321 -146818 -243407 -60917
15591A87300B6049P2333a65965E0614J74806a26816A00536O9902c0791A52912
$$ 187300 26049 98382 -165965 50614 225420 -126816 100536 170438 -30791 152912
15580b32130i3022H9552h4591I1622a28995f876H5928b27296n5549A57499e5504
$$ -232130 -93022 89552 -84591 91622 -128995 -6876 85928 -227296 -282845 157499 -55504
15568G3950a3673A21188n8039a51209A20350M3663c2634D3199a16630I4090N6705
$$ 73950 -13673 121188 63149 -151209 120350 164013 -32634 43199 -116630 94090 150795
15557A50795d1725k3871B1686a92911f5758a8004G2491a33984o604j08128C4061
$$ 150795 -41725 -65596 21686 -192911 -65758 -18004 72491 -133984 -140588 -248716 34061
15545A58804J7951J29214K2971j19700g2713b6696I4829j1194b5228j9299H7950
$$ 158804 176755 305969 328940 209240 -72713 -26696 94829 83635 -25228 -44527 87950
15533e3392C55207a50186o6192A62738a80768C02741a94353C45873A012K07801
$$ -53392 355207 -150186 -216378 162738 -180768 302741 -194353 345873 1012 208813
15523B08813c6434H2191f8522K40q940A83412a60621A18247k856K20789j20542
$$ 208813 -36434 82191 -68522 -68282 -77222 183412 -160621 118247 115391 336180 215638
15512B15638J13786B6708J87418C353K09703J36886C944i2376B26766K068A07268
$$ 215638 329424 26708 214126 3353 213056 349942 3944 -92376 226766 228834 107268
15500C191N5725a2936B21397m6805K33396A40800J6785J30647j0176j13776F6151
$$ 3191 58916 -12936 221397 174592 407988 140800 157585 288232 278056 164280 66151
15488c03492A09639M54110F9341L2538K76042A84304c2871I3535K66886m7388
$$ -303492 109639 563749 69341 101879 377921 184304 -32871 93535 360421 313033
15478C13033j47292j8518K46258J86910J10409k13103B12168N0179J90105A87581
$$ 313033 165741 147223 393481 580391 690800 477697 212168 262347 452452 187581
15467A49499b34242b5219e172j84570M1966c0182j26607A95380c0092A31014g0697
$$ 149499 -234242 -25219 -5172 -189742 -147776 -30182 -156789 195380 -30092 131014 -70697
15455i3976A7293a23962G5866c50761C67420r0077G5600M4287d3065B90021J73338
$$ -93976 17293 -123962 75866 -350761 367420 277343 75600 119887 -43065 290021 463359
15444D63359K84504j92892L93199N50119n50920k77580B54296R6184A12577i7667
$$ 463359 747863 554971 948170 1498289 947369 669789 254296 350480 112577 -97667
15433h8349j191E7411J10084a02946B7542b13790B4740a99959C19274d67320B8727
$$ -88349 -89540 57411 167495 -102946 27542 -213790 24740 -199959 319274 -467320 28727
15421A04151a5103A67884H131b39505I80K66985a47001j1978k2071A90406F5649
$$ 104151 -15103 167884 8131 -239505 980 267965 -147001 -158979 -181050 190406 65649
15409B11987a59549N6159r9398i2218A5908i8516A14922J24981b40828N103B5358
$$ 211987 -159549 -103390 -202788 -92218 15908 -98516 114922 239903 -240828 -235725 25358
15397I5691K72463d8928B87554J0714a30275B38635A5165a21667I0912J11835
$$ 95691 368154 -48928 287554 298268 -130275 238635 15165 -121667 90912 202747
15387B02747O1477H0412a45743B32490d6964j49626C12875N4821H0685J22703
$$ 202747 264224 80412 -145743 232490 -46964 -196590 312875 367696 80685 203388
15377B03388F4735a25494k5842A09365J77346n5245Q7939j17623j2254d7799A55855
$$ 203388 64735 -125494 -151336 109365 286711 231466 319405 201782 189528 -47799 155855
15365C13944o9724m3411B9828b2590D2408J93325K03952A88550J77954j36598
$$ 313944 244220 200809 29828 -22590 42408 235733 439685 188550 366504 229906
15355B29906G8762a03250A34348a02927d1648j04351K0581A6497a3541F452J29402
$$ 229906 78762 -103250 134348 -102927 -41648 -145999 -125418 16497 -13541 6452 135854
15344A35854R5586N5633J37552k4027n2690a66497A47680L27527I9680e7297A56973
$$ 135854 231440 287073 424625 400598 347908 -166497 147680 475207 99680 -57297 156973
15332I0027Q8563a10265B68939L79935G0113d0229B25742F7420L67201j2936j87236
$$ 90027 178590 -110265 268939 648874 70113 -40229 225742 67420 434621 421685 234449
15321B34449I2220K43429A47000r941E26Q5189J85856g8926C84158L597d8725
$$ 234449 92220 335649 147000 137059 526 85715 271571 -78926 384158 387755 -48725
15309e5774H9220Q9266c4641B12536G5510K7820N3947a13219J128q8056A0090
$$ -55774 89220 178486 -34641 212536 75510 103330 157277 -113219 -112091 -200147 10090
15297A18131C5491d0787C9445N5293d7276C2234J01126L02187A97111K5242k8124
$$ 118131 35491 -40787 39445 94738 -47276 32234 133360 435547 197111 222353 194229
15286A94229D006J71304C6716J55209a43468N0501a6525k31941i0593D16002A15648
$$ 194229 4006 175310 36716 191925 -143468 -92967 -16525 -248466 -90593 416002 115648
15274d3559C07259j05786J43842e405A38490a16380A97753H2593A0477M51036
$$ -43559 307259 201473 345315 -5405 138490 -116380 197753 82593 10477 461513
15264D61513G8654J05196b90654C19011a61060q243B0207a25673B00360m1895
$$ 461513 78654 183850 -290654 319011 -161060 -169303 20207 -125673 200360 158465
15254A58465i858m9446C73572j83036c15l9830C47158b1586A31974a14223E38072
$$ 158465 -9858 -59304 373572 190536 -315 -40145 347158 -21586 131974 -114223 538072
15242D01553N95313Q08424q23579M43792q0735E93221A70628L1166r5119n297
$$ 401553 996866 1805290 981711 1425503 1344768 593221 170628 201794 106675 101378
15232A01378L66170A3625e0206D5616J00R7436a2693B09866n8357D4617c1507
$$ 101378 467548 13625 -50206 45616 45716 143152 -12693 209866 151509 44617 -31507
15220a33490C33351p7619j3465n6679a44855C42316a93494A48480e4466C8984
$$ -133490 333351 255732 242267 185588 -144855 342316 -193494 148480 -54466 38984
15209B04523c7925A58323b47953A51832o0717c2380q9423B07970G9459a59385
$$ 204523 -37925 158323 -247953 151832 91115 -32380 -121803 207970 79459 -159385
15198H6433J40653O9284J33792A78105C7268a3939r5676B21830K5697A11287B491
$$ 86433 227086 296370 430162 178105 37268 -13939 -109615 221830 247527 111287 2491
15186d05164H3687e8756a2401F130J58193d33465d475D9255i6526K6963A73622
$$ -405164 83687 -58756 -12401 6130 164323 -433465 -4475 49255 -96526 -69563 173622
15174D6975Q2178q392h3665G0286g0050q2251A28734L7839J2676P2462j25092
$$ 46975 129153 120761 -83665 70286 -70050 -152301 128734 166573 179249 251711 126619
15163A26619L03685k05698n3887a75539B39973j05884a59375D3085J45826c0698
$$ 126619 430304 224606 170719 -175539 239973 134089 -159375 43085 188911 -30698
15152A97533J4884J10998I3154J01052F5410R111Q4802p7237k9925f8632j13737
$$ 197533 212417 323415 93154 194206 65410 74521 159323 82086 52161 -68632 -182369
15141a82369L2085m4481D2207P7022b7207L271A0368K25767A10283K26779I4441
$$ -182369 -150284 -194765 42207 119229 -27207 -23936 10368 236135 110283 337062 94441
15129F7342J75519K61804k02348A47566K4408i1135C74405C7437L14345j28867
$$ 67342 242861 504665 302317 147566 171974 -91135 374405 37437 351782 222915
15119B22915J48317K32765F3132K18620A03001p190K35254m2227o5340r0963A5215
$$ 222915 371232 603997 63132 281752 103001 95811 331065 288838 223498 132535 15215
15107A5210J81399r862L7692k883R1056j55408J75801A34636K99259A21781K582
$$ 15210 196609 186747 224439 221556 312612 157204 333005 134636 433895 121781 124363
15096A24363J24832K27929a6216F6204d2731i140A03721J47475J58334a32041
$$ 124363 249195 477124 -16216 66204 -42731 -9140 103721 251196 409530 -132041
15085A30708j1214P3781K10743j70180C980J37613J70545A07080l2464J17554
$$ 130708 119494 193275 404018 233838 3980 141593 312138 107080 74616 192170
15075A92170J73391q3969A693J80006n4783C0709J3100K57664A2861a19873F62
$$ 192170 365561 281592 1693 181699 126916 30709 43809 301473 12861 -119873 662
15063I3106q687J7022J48142N14928F4088Q2269p0233M11259O9558B52340Q9453
$$ 93106 84419 101441 249583 764511 64088 146357 76124 487383 556941 252340 341793
15052C41793A58375A8648L93401K14460j55930H934L32396P713a20506B60187
$$ 341793 158375 18648 412049 626509 470579 8934 341330 349043 -120506 260187
15041B91875J57511B14574H8266J18383J85959j24912g4744A24316L6219K2720
$$ 291875 449386 214574 88266 206649 392608 267696 -74744 124316 160535 183255
15031A83255M71410j073R464J73028j67820j24160j67623k0783j65423K96857
$$ 183255 654665 653592 663056 836084 668264 544104 376481 355698 190275 487132
15021D87132N065j0326J80116k66335M612k8435p6300j18046m1577J03033A13569
$$ 487132 492197 481871 661987 395652 400264 371829 295529 177483 135906 238939 113569
15009E78700j96164A63000J78415p4564J2790J65658A39967J56001k8538J0423
$$ 578700 382536 163000 341415 266851 279641 445299 139967 295968 267430 277853
14999B77853K51551J32909j00069j84124L755J04205J7266A22531J37099L7111
$$ 277853 529404 662313 562244 378120 381875 486080 503346 122531 259630 296741
14989B96741J37260L41405j81544j26170A81623M18948m7348O7991L40197K4882
$$ 296741 434001 775406 593862 467692 181623 600571 553223 621214 961411 986293
14979I86293O6803m54637k73721K01883r2220K64375o2737B71168L37101j11404
$$ 986293 1053096 598459 324738 526621 434401 698776 636039 271168 608269 496865
14969D96865j17863o7562k108J83317k43673B1784L78512A32543B6798J59812
$$ 496865 379002 311440 309332 492649 248976 21784 400296 132543 26798 186610
14959A86610L40508k33354k4794K9442J12325R6334A72485J32852M8203J07612
$$ 186610 527118 293764 268970 298412 410737 507071 172485 305337 353540 461152
14949D61152K8443B04315K00648L74438k91431P2361M53580m90705J35034j87719
$$ 461152 489595 204315 404963 779401 487970 560331 1013911 523206 658240 470521
14939D70521k10212K12622o5287j7962M2298n4148K23330L89134j05112O01749
$$ 470521 260309 472931 407644 389682 431980 377832 601162 990296 885184 1486933
14929A486933o41734M31719l4947M46342r8967r9271l5684j86342Q1680M4225
$$ 1486933 845199 1276918 1241971 1688313 1589346 1490075 1454391 1268049 1349729 1393954
14919A393954N73221J89261K80446m39986l75000l20305J97477o66263j27675
$$ 1393954 1967175 2156436 2436882 1996896 1621896 1301591 1499068 832805 705130
14910G05130j19989j67729L62459A70596M60246o8376J35570A79493R7941Q6131
$$ 705130 585141 417412 779871 170596 630842 562466 698036 179493 277434 363565
14900C63565M03178B76951R2998N1140G705P38081C40995J87407N5147J4171k24594
$$ 363565 766743 276951 369949 421089 7705 745786 340995 528402 583549 597720 373126
14889C73126P413R7400K76403Q220P6360j50292J96600r657m7524M32455l23669
$$ 373126 380539 477939 754342 762562 838922 688630 885230 875573 828049 1260504 936835
14878I36835k00553N8940l27482o288B21100J99168P4953j64668M19378j70966
$$ 936835 736282 795222 467740 461452 221100 420268 495221 330553 749931 578965
14868E78965J48984R4155p7501M3858l2705J24927k20657l05980O0158K17102
$$ 578965 727949 822104 744603 788461 755756 880683 660026 354046 414204 631306
14858F31306k40644j23371q5098K73945J11558o8827K87908C91836L42933C03795
$$ 631306 390662 267291 182193 456138 567696 498869 786777 391836 734769 303795
14847E50620J26408K1478p1757J81456L49113k13055K70938J03400n63715j5530
$$ 550620 677028 698506 626749 808205 1157318 944263 1215201 1318601 754886 739356
14837G39356Q3345L3829k16241K09859l4360l24955P4984K7829k28036K89331
$$ 739356 822701 856530 640289 850148 815788 490833 565817 593646 365610 654941
14827F54941r7839J9699K93487D01620J93587o0651M3907o2489J89775N473j24888
$$ 654941 557102 576801 870288 401620 595207 534556 578463 515974 705749 711222 586334
14816E86334J20029l34609K74173k17158N43201j60734n0222j10621J1510J56337
$$ 586334 706363 371754 645927 428769 971970 811236 761014 650393 661903 818240
14806H18240K35177q6269k94713K49659k41065M49280C50955M61253B00851M41786
$$ 818240 1053417 967148 672435 922094 681029 1130309 350955 812208 200851 642637
14796F42637l9346B56462Q7301J64988B30860P2059J95856o422l2003Q9459K30978
$$ 642637 603291 256462 343763 508751 230860 302919 498775 492353 460350 549809 780787
14785G80787k93787K12379q5246k6998K15614m2676o3789Q9850l1213J48950M74224
$$ 780787 487000 699379 614133 587135 802749 760073 696284 786134 754921 903871 1378095
14774A378095m76167r3276O197k77065J17292p7869m4123K9607M8059O2705k04255
$$ 1378095 901928 808652 814849 537784 655076 577207 533084 562691 610750 673455 469200
14763D69200J17294J29079j75030k03502L03295k8330j8596K37028j12319J42133
$$ 469200 586494 715573 540543 337041 640336 612006 593410 830438 718119 860252
14753H60252k50946q7434M2688n1661p4130J45942j60850m152K93805J1823J10103
$$ 860252 609306 521872 564560 512899 438769 584711 423861 419709 713514 725337 835440
14742H35440k63646K98338k42678K3633Q0212j99344L00293j54987J16068J83967
$$ 835440 571794 870132 627454 651087 731299 531955 832248 677261 793329 977296
14732I77296O688J9073K14905J33403J14701K32894j23521j18324k64939l13081
$$ 977296 983984 1003057 1217962 1351365 1466066 1698960 1575439 1457115 1192176 879095
14722H79095O4667K10882m09821R0998P323q0622K96142o1643m22601L07698o7365
$$ 879095 943762 1154644 744823 835821 843144 762522 1058664 997021 574420 882118 814753
14711H14753K46036o4149k36022K62325k66986L08300J57017k3004L65415n4198
$$ 814753 1060789 996640 760618 1022943 755957 1064257 1221274 1198270 1563685 1509487
14701A509487M40942j12559n37727o022k46917l21936J18377Q0780r8063L46141
$$ 1509487 1950429 1837870 1300143 1294121 1047204 725268 843645 924425 826362 1172503
14691A172503j94466j78898j13557j46192Q6486K75209O3466k02213J86791K18720
$$ 1172503 978037 799139 685582 539390 625876 901085 964551 762338 949129 1167849
14681A167849l8306k98024L1295j57499K64289L3304k15426q0294J53473L9158
$$ 1167849 1129543 831519 862814 705315 969604 1002908 787482 707188 860661 899819
14671H99819j69071j2282K01938j71744M764M7759J79468N84218n20828j87695
$$ 899819 730748 718466 920404 748660 753424 801183 980651 1564869 1044041 856346
14661H56346M32908m56582J15510J975J15177n0834K02513n9582p5450K31947
$$ 856346 1289254 832672 948182 950157 1065334 1014500 1217013 1157431 1081981 1313928
14651A313928l26715K88932q6827j38552j07453J22919L41011k22904N2280J23509
$$ 1313928 987213 1276145 1189318 1050766 943313 1066232 1407243 1184339 1236619 1360128
14641A360128k90617K5509J26502j48508k9572L4276J15875N8745l01870K14397
$$ 1360128 1069511 1095020 1221522 1073014 1043442 1077718 1193593 1252338 950468 1164865
14631A164865K44628k47283K49076n9431k69602L26608k14801j41899l4232N3303
$$ 1164865 1409493 1162210 1411286 1351855 1082253 1408861 1194060 1052161 1017929 1071232
14621A071232q265J38957K6943l03190L16228L43877m94549K47982k9594p0333
$$ 1071232 1062967 1201924 1228867 925677 1241905 1585782 1091233 1339215 1309621 1239288
14611A239288j36501L51438k2108k42654M10732j41538m7707K547j17336Q0673
$$ 1239288 1102787 1454225 1432117 1189463 1600195 1458657 1410950 1413497 1296161 1376834
14601A376834M47215j96067k31366p8307N6824K08249J532j19234J24914k1496
$$ 1376834 1824049 1627982 1396616 1318309 1375133 1583382 1584914 1465680 1590594 1569098
14591A569098M12K114L63844m49079Q4419p1024J07426m6210K51471p3492p5796
$$ 1569098 1569510 1571624 1935468 1486389 1570808 1499784 1607210 1561000 1812471 1738979 1663183
14580A663183L4055M69700l08406n8010Q7380Q7806J03477l43009L04066p1200
$$ 1663183 1697238 2166938 1858532 1800522 1887902 1975708 2079185 1736176 2040242 1969042
14570A969042n2942M07277m04649J46411M31389l00196m0336P5550K03764j549
$$ 1969042 1916100 2323377 1918728 2065139 2496528 2196332 2155996 2231546 2435310 2433761
14560B433761K20118J4M59799j14405j04798r1315M86908r5909Q51661L96923
$$ 2433761 2653879 2653893 3113692 2999287 2894489 2803174 3290082 3194173 4045834 4442757
14550D442757J089206J164732L895689P007188J8156511J2640241A6525743F791608
$$ 4442757 5531963 6696695 10592384 17599572 35756083 48396324 16525743 6791608
14541C458075j152886r3378M02886P50337J966370B597114o72932J33454l26908
$$ 3458075 2305189 2211811 2614697 3365034 5331404 2597114 1924182 2057636 1730728
14532A730728J23576J18681K07654k17318j99099K44483N3967K35833j15710K79979
$$ 1730728 1854304 1972985 2180639 1963321 1764222 2008705 2062672 2298505 2182795 2462774
14522B462774K5116O9835m1649m5951l09111R9791J26676J88752R9129l97888
$$ 2462774 2487890 2557725 2516076 2470125 2161014 2260805 2387481 2576233 2675362 2277474
14512B277474J13614N39576l89690j06157N56109M3760j98499L2890O4142l53004
$$ 2277474 2391088 2930664 2540974 2434817 2990926 3034686 2836187 2869077 2933219 2580215
14502B580215M36783k29814J61188k83236O21216l86054K61185j71852Q9259P5411
$$ 2580215 3016998 2787184 2948372 2665136 3286352 2900298 3161483 2989631 3078890 3154301
14492C154301k58446K32825o5630K1999K38398j20628J99367o4744K21977k00153
$$ 3154301 2895855 3128680 3063050 3085049 3323447 3202819 3402186 3337442 3559419 3359266
14482C359266J50010q8941J43821j24148P0171K2476K46649J563L74093j87937
$$ 3359266 3509276 3420335 3564156 3440008 3510179 3532655 3779304 3780867 4154960 3967023
14472C967023r6373O4755J66147k66099l4029K51364J19227L51985l67617l1555
$$ 3967023 3870650 3935405 4101552 3835453 3801424 4052788 4172015 4524000 4156383 4124828
14462D124828J58987k00530M35817k7268P0246J90789J69613o40548K11769L04024
$$ 4124828 4283815 4083285 4519102 4491834 4562080 4752869 4922482 4281934 4493703 4797727
14452D797727j73138N2194L85431j18864j48912M19596M6238J47530j00949J45012
$$ 4797727 4624589 4676783 5062214 4943350 4794438 5214034 5260272 5407802 5306853 5451865
14442E451865J79605J33884K642J14721j52412J53781k29611K66320J90273q5925
$$ 5451865 5631470 5765354 5767996 5882717 5730305 5884086 5654475 5920795 6111068 6025143
14432F025143K74387Q9410N0027K70316P5365P2641j38784J81699K56525K11064
$$ 6025143 6299530 6388940 6438967 6709283 6784648 6857289 6718505 6900204 7156729 7367793
14422G367793J82103K29181N196m6582L10703k84440M23327j89939L15139k88348
$$ 7367793 7549896 7779077 7784273 7737691 8048394 7763954 8187281 7997342 8312481 8024133
14412H024133K85245J10436J79588O9458N85582k3145J99925J66751j48888K16498
$$ 8024133 8309378 8419814 8599402 8668860 9254442 9231297 9431222 9597973 9449085 9665583
14402I665583k41127M27445n4207R2700K85375n09538R11545O9117L41110o390
$$ 9665583 9424456 9851901 9797694 9890394 10175769 9666231 10577776 10646893 10988003 10981613
14392A0981613L14699Q0650J35934O5119L16884M84241J44740Q7961L69098K85098
$$ 10981613 11296312 11376962 11512896 11578015 11894899 12379140 12523880 12611841 12980939 13266037
14382A3266037L95910K41670O2601k26792L92703M07072L16674L5037M38320O98584
$$ 13266037 13661947 13903617 13966218 13739426 14132129 14539201 14855875 14890912 15329232 16027816
14372A6027816P5879K04431M60616L64454Q83820M01165r7529L07312M47041m3928
$$ 16027816 16103695 16308126 16768742 17133196 18017016 18418181 18320652 18627964 19075005 19031077
14362A9031077L79949M70692P24345l510R17353J18875P88064J98837N45161P70125
$$ 19031077 19411026 19881718 20606063 20602553 21519906 21638781 22426845 22625682 23170843 23940968
14352B3940968O42318N03343K69941J165150M34811J109684O71109L86974R36042
$$ 23940968 24583286 25086629 25356570 26521720 26956531 28066215 28737324 29124298 30060340
14343C0060340R91952O50657N32996J192404Q47258R62764R12223J169231J030521
$$ 30060340 31052292 31702949 32235945 33428349 34275607 35238371 36150594 37319825 38350346
14334C8350346J126628J235944J218231J221680J479824R52621J843677J555238
$$ 38350346 39476974 40712918 41931149 43152829 44632653 45585274 47428951 48984189
14326D8984189J503584J957067J662094J848839K004580J897143K158119J686924
$$ 48984189 50487773 52444840 54106934 55955773 57960353 59857496 62015615 63702539
14318F3702539K389799K283987K604095K658015K759564L072572K875717L473662
$$ 63702539 66092338 68376325 70980420 73638435 76397999 79470571 82346288 85819950
14310H5819950L921972L323187L838121M226054M498520M384966N081103M930278
$$ 85819950 89741922 93065109 96903230 101129284 105627804 110012770 115093873 120024151
14302A20024151N673470N947178N840948O682762P039942P203074P661455Q480315
$$ 120024151 125697621 131644799 137485747 144168509 151208451 158411525 166072980 174553295
14294A74553295Q524697R038317R794471R944050J0710038J1379950J1557778
$$ 174553295 183077992 192116309 201910780 211854830 222564868 233944818 245502596
14287B45502596J1862330J2683429J2931384J3585307J3850026J4036966J4073658
$$ 245502596 257364926 270048355 282979739 296565046 310415072 324452038 338525696
14280C38525696J4457280J4108964J3896760J3358888J2417293J1884944R807865
$$ 338525696 352982976 367091940 380988700 394347588 406764881 418649825 428457690
14273D28457690P405069K994190K154726L316214K481295l509182k715362m254273
$$ 428457690 435862759 438856949 441011675 444327889 446809184 443300002 440584640 436330367
14265D36330367q883535j1081342j2471210j4231152j4943304j5337686j5352808
$$ 436330367 427446832 416365490 403894280 389663128 374719824 359382138 344029330
14258C44029330j5636932j5557954j5083371j4624607j4466230j3573801j2932579
$$ 344029330 328392398 312834444 297751073 283126466 268660236 255086435 242153856
14251B42153856j2750501j2024149j1068448r472836r330995r963649q935565
$$ 242153856 229403355 217379206 206310758 196837922 187506927 177543278 168607713
14244A68607713p730008p891662p439553p048560o594968o341908n008832n257456
$$ 168607713 160877705 152986043 145546490 138497930 131902962 125561054 120552222 115294766
14236A15294766n485185m871970m340742m530403l637891l394732l851739l508183
$$ 115294766 109809581 104937611 100596869 96066466 92428575 89033843 85182104 81673921
14228H1673921l540043l080515k725829k814112k570616k311326k386855k526395
$$ 81673921 78133878 75053363 72327534 69513422 66942806 64631480 62244625 59718230
14220E9718230j367999k234216j774359j977712j559978j704096j313300j224068
$$ 59718230 58350231 56116015 54341656 52363944 50803966 49099870 47786570 46562502
14212D6562502j786734j281155j526556j145177r43249j093038o04181j664100
$$ 46562502 44775768 43494613 41968057 40822880 39879631 38786593 38182412 36518312
14204C6518312j077813p33335j028312q52404l30376j382482o58729r49846j283853
$$ 36518312 35440499 34707164 33678852 32826448 32496072 31113590 30454861 29505015 28221162
14195B8221162n46417J44377j142160o70961m35831j123635l25210m47994q37310
$$ 28221162 27674745 27819122 26676962 26006001 25570170 24446535 24121325 23673331 22836021
14186B2836021r5565n52527p25204k40308m41507o42341o73004J59027r45369
$$ 22836021 22740456 22187929 21462725 21222417 20780910 20138569 19465565 19624592 18679223
14177A8679223k91818k5514n46657n40189m75376k52021k29956l90331m13343
$$ 18679223 18387405 18361891 17815234 17275045 16799669 16547648 16317692 15927361 15514018
14168A5514018o4803k44123j50531k97764o95510M74312q19905l27610q1041J47288
$$ 15514018 15449215 15205092 15054561 14756797 14061287 14535599 13715694 13388084 13307043 13454331
14158A3454331k53581p28239k23620m8785j57588L6379m73825l42222K6135l49533
$$ 13454331 13200750 12472511 12248891 12200106 12042518 12078897 11605072 11262850 11288985 10939452
14148A0939452J57246j05806n53556l43143K59061o9772j36868n06989r7434l06617
$$ 10939452 11096698 10990892 10437336 10094193 10353254 10283482 10146614 9639625 9542191 9235574
14138I235574J814l1442p9867k77356o4372j64451l24030j68554J33531k91068
$$ 9235574 9237388 9205946 9126079 8848723 8784351 8619900 8295870 8127316 8260847 7969779
14128G969779K56875k56988j08778p3195n9433p5323l83038Q2014j75292N4472
$$ 7969779 8226654 7969666 7860888 7787693 7728260 7652937 7269899 7351913 7176621 7231093
14118G231093k39714j00603J82025l51081N9571m87571L21732r3937j26087l17169
$$ 7231093 6991379 6890776 7072801 6721720 6781291 6293720 6615452 6521515 6395428 6078259
14108F078259R9346N3142k02888l9646p4035K56353l01096R7601k09654j97948
$$ 6078259 6177605 6230747 6027859 5988213 5914178 6170531 5869435 5967036 5757382 5559434
14098E559434k73326L07833k55422n6310j97032N7635m2061P7194O3135l40804
$$ 5559434 5286108 5593941 5338519 5282209 5085177 5142812 5100751 5177945 5241080 4900276
14088D900276J72210J28225k11107m76231M10328K3026l07529J62020k48785j89394
$$ 4900276 5072486 5200711 4989604 4513373 4923701 4946727 4639198 4801218 4552433 4363039
14078D363039M36857l42896j70070m00k1530j81404J48375m19249K72087k24967
$$ 4363039 4799896 4457000 4286930 4286530 4265000 4083596 4231971 3812722 4084809 3859842
14068C859842P8145k60838K00697K01911j71114j9906K42308k71104k5647J65353
$$ 3859842 3937987 3677149 3877846 4079757 3908643 3888737 4131045 3859941 3834294 3999647
14058C999647j8162l39912J3402L5593l01376k13111j25337N59710j84070j98072
$$ 3999647 3981485 3641573 3654975 3690568 3389192 3176081 3050744 3610454 3426384 3228312
14048C228312J46013m36575M83276k57848l45931K86223k55172K01278L0015L7864
$$ 3228312 3374325 2937750 3421026 3163178 2817247 3103470 2848298 3049576 3079591 3117455
14038C117455l80931L51708l32808R3945Q5465k22348L30096j99321L57121o88106
$$ 3117455 2736524 3088232 2755424 2849369 2934834 2712486 3042582 2843261 3200382 2512276
14028B512276J45639K0076R5785r9819l60266L76375j58286l10353K34300K16717
$$ 2512276 2657915 2677991 2773776 2673957 2313691 2690066 2531780 2221427 2455727 2672444
14018B672444k67323J81030m16449K29731l9169N9931j10574J42740k89727M21799
$$ 2672444 2405121 2586151 2169702 2399433 2360264 2420195 2309621 2452361 2162634 2584433
14008B584433j82091k26856K14451j63970j76020J45028r7446k4509R3124j83323
$$ 2584433 2402342 2175486 2389937 2225967 2049947 2194975 2097529 2073020 2166144 1982821
13998A982821J18958p622k88867K57888k72230M76899n5195J10974l3945R66221
$$ 1982821 2101779 2094157 1805290 2063178 1790948 2267847 2212652 2323626 2289681 3255902
13988C255902K441417N321092J4034459K8206323B5780287A2396734n468385j829086
$$ 3255902 5697319 11018411 25052870 53259193 25780287 12396734 6928349 5099263
13980E099263q83273n76024l88925l48521j05410l44022q5707j26889O4784M92248
$$ 5099263 4215990 3639966 3251041 2902520 2797110 2453088 2367381 2240492 2305276 2797524
13970B797524n40947k69735L04076P3951j63501M1552l97141j2655L70979k33224
$$ 2797524 2256577 1986842 2290918 2364869 2201368 2242920 1845779 1833124 2204103 1970879
13960A970879K086j07078J03701l96669L10772J5856l15062M83937m33465k14381
$$ 1970879 1972965 1865887 1969588 1572919 1883691 1899547 1584485 2068422 1634957 1420576
13950A420576M67421m79535N37477j78172q0022o0369O7802o8984J2993k14156
$$ 1420576 1887997 1408462 1945939 1767767 1687745 1627376 1695178 1626194 1639187 1425031
13940A425031R5190k5786j7786J63701N116l7299k0630l4800q2625j83546J18052
$$ 1425031 1520221 1494435 1476649 1640350 1645466 1608167 1587537 1552737 1470112 1286566 1404618
13929A404618j40568P7594R0520k5889o7088M9882L94642m62684n1569R5780K27836
$$ 1404618 1264050 1341644 1432164 1406275 1339187 1389069 1783711 1321027 1269458 1365238 1593074
13918A593074k12766L9477J44446l94757L77405L1709k16086j72107L58611m99406
$$ 1593074 1380308 1419785 1564231 1169474 1546879 1578588 1362502 1190395 1549006 1049600
13908A049600K53198J20042l57874K18214J79384N0736l45355K23553l00700J77372
$$ 1049600 1302798 1422840 1064966 1283180 1462564 1513300 1167945 1391498 1090798 1268170
13898A268170L97J62651J72038n15562J73840l0381J1213n9868K15l0058j48582
$$ 1268170 1268567 1431218 1603256 1087694 1261534 1231153 1242366 1182498 1182713 1152655 1004073
13887A004073L61801k29098O1489J23400l13370l1550L79273j07965l1258k1724
$$ 1004073 1365874 1136776 1198265 1321665 1008295 976745 1356018 1248053 1216795 1195071
13877A195071j7158O5380l01584L36192l08901K46496m62241L20651K34342l82852
$$ 1195071 1177913 1243293 941709 1277901 969000 1215496 753255 1073906 1308248 925396
13867I25396M08011k91378L4178k87200J04609p4419R9465J23159o7695J48394
$$ 925396 1333407 1042029 1076207 789007 893616 819197 918662 1041821 974126 1122520
13857A122520q2358l19253J43779M5097K22557L9732l21630K32893j29368m6444
$$ 1122520 1040162 720909 864688 909785 1132342 1172074 850444 1083337 953969 907525
13847I07525J06098j54385J01426q5569K50787k74680m0278J44379O1907P8770
$$ 907525 1013623 859238 960664 875095 1125882 851202 810924 955303 1017210 1095980
13837A095980j78879j8131j43485L41280m13374K73724L55468E96230N24481E06154
$$ 1095980 917101 898970 755485 1096765 683391 957115 1312583 596230 1120711 506154
13826H60510M2636Q8708k85545K3877j77821M14592j96988o8258M0902j51618
$$ 860510 903146 991854 706309 730186 552365 966957 769969 701711 742613 590995
13816E90995M33453E03436J03720L76319j39172m07272M26885l72132J54958J36918
$$ 590995 1024448 503436 607156 983475 844303 437031 863916 491784 646742 783660
13806G83660L16258m85740Q3759K53131k32523K95381m75998P9211K41366M4368
$$ 783660 1099918 614178 697937 951068 718545 1013926 537928 617139 858505 902873
13796I02873l06673R9223j27529p9385J91453K46373j41585k50334J8735r6233
$$ 902873 596200 695423 567894 488509 679962 926335 784750 534416 553151 456918
13786D56918K0762J23108j18570L38209k49760K26395l33414J7992Q6311R3135
$$ 456918 477680 600788 482218 820427 570667 797062 463648 481640 567951 661086
13776F61086L2163j64624m481k8691J49089J28793r2352j56269k6092J59609P6113
$$ 661086 693249 528625 524144 495453 644542 773335 680983 524714 498622 658231 734344
13765G34344j01775j59546K30292Q286K300N629j08988K02516C56857K24660q653
$$ 734344 632569 473023 703315 711601 713901 719530 610542 813058 356857 581517 572864
13754E72864q6919A23421O28552l44065L9144j03568J13635J93637j85541K99914
$$ 572864 485945 123421 751973 407908 447052 343484 457119 650756 465215 765129
13744G65129k44106j25983M24396l61491M01838q7851j69023r1290J6503L56859
$$ 765129 521023 395040 819436 457945 859783 771932 602909 511619 528122 884981
13734H84981l19319k3840K12483k29290P0316J56552N8770B85009L76613k27203
$$ 884981 565662 541822 754305 525015 595331 751883 810653 285009 661622 434419
13724D34419R4447p7935j4697M92731m37332J08681j32114J61878j50630r5964
$$ 434419 528866 450931 436234 928965 491633 600314 468200 630078 479448 383484
13714C83484j44652K73770n6344q559M384j33470m7817L00717q9279j14931N4759
$$ 383484 238832 512602 456258 447699 452083 318613 270796 571513 482234 367303 422062
13703D22062B09241K67921j49696j5700R8296N594J75438J99299M7367l99599
$$ 422062 209241 477162 327466 311766 410062 415656 591094 790393 837760 438161
13693D38161J91109q263B65771J32984J26969J4939K97336l35172A83689e0816
$$ 438161 629270 621007 265771 398755 525724 540663 837999 502827 183689 -50816
13682D73997B20406J81376j50750M10936k37152A81484J94478N0114J33815n9598
$$ 473997 220406 401782 251032 661968 424816 181484 375962 426076 559891 500293
13672E00293j94233L57225B54424K24270k742K00774q4165J2594F8097K79716
$$ 500293 306060 663285 254424 478694 475952 676726 592561 605155 68097 347813
13662C47813K42819j03397B28484L4439q0392K13713N2456p8412A19427M43822
$$ 347813 590632 487235 228484 262923 182531 396244 448700 370288 119427 563249
13652E63249Q4369m873k63191K43432m9367B74323N4336K41947B28180I3900J25320
$$ 563249 647618 642745 379554 622986 573619 274323 328659 570606 228180 93900 219220
13641B19220L32461k20411o1930K06353k08413Q9526Q6615A80484N34055k95682
$$ 219220 551681 331270 269340 475693 267280 356806 443421 180484 714539 418857
13631D18857q3098A00514J55575f3462A11929M34393K12285B38874O0245E8380
$$ 418857 335759 100514 256089 -63462 111929 546322 758607 238874 299119 58380
13620g0957D52194j38128a12806C12752r5476H9957N31481k00166q320R0313j11211
$$ -70957 452194 314066 -112806 312752 217276 89957 621438 421272 412952 503265 392054
13609C92054j06600P0928o5071j1860D359K41856L25911k62631K3400P5564j11353
$$ 392054 285454 356382 291311 279451 4359 246215 572126 309495 332895 408459 297106
13598B97106N28770B91653P4812A68262K83274J19179A52070L17780m1734j44940
$$ 297106 825876 291653 366465 168262 451536 570715 152070 469850 428116 283176
13588B83176Q3231j30269D9655Q9965J11512m65J07882G3830L28864a8864D4582
$$ 283176 366407 236138 49655 139620 251132 250667 358549 73830 402694 -18864 44582
13576B38836J77182J3545J7211n9551b778B52184J07519C350L80575n9909I791
$$ 238836 416018 429563 446774 387223 -2778 252184 359703 3350 383925 324016 9791
13564B81883j13181J84983I2093J08252Q6055J60090k09339L86859B34396N9940
$$ 281883 168702 353685 92093 200345 286400 446490 237151 624010 234396 294336
13554B94336m5425o859m6375K3297r4263L55054A98938M03188r6440B11030N6730
$$ 294336 248911 242052 195677 218974 124711 479765 198938 602126 505686 211030 267760
13543B67760K3098j17744J3679n3818J14446i8560k2445D62086j3235B01802J74973
$$ 267760 290858 173114 186793 132975 247421 -98560 -121005 462086 448851 201802 376775
13532C76775o6497r3332J78173Q140j2623M0344A93073B1946J07717K18002g1837
$$ 376775 310278 216946 395119 403259 390636 430980 193073 21946 129663 347665 -71837
13520A46574K86077A53287K91153k16083j10507N5929B5079K25284C4554c9006
$$ 146574 432651 153287 444440 228357 117850 173779 25079 250363 34554 -39006
13509F21016I7031K65305r4662L148L511L36880i9063m3085n7843C38353a08518
$$ 621016 97031 362336 267674 270822 274333 611213 -99063 -142148 -199991 338353 -108518
13497D56658j18255r2726P3935A48482F770J56537A7297L04450F3199L05363A14507
$$ 456658 338403 245677 319612 148482 6770 163307 17297 321747 63199 368562 114507
13485A67050b35212B46587r2392P7581J01585A15146Q540J75406e3664A47557
$$ 167050 -235212 246587 154195 231776 333361 115146 123686 299092 -53664 147557
13474B06812a5660C61836J35461d6144A06914M44467d2214C51401k2455n3090
$$ 206812 -15660 361836 497297 -46144 106914 551381 -42214 351401 328946 275856
13464B75856H0501N8209J64916j10464N4353J86J91326a8545k12301B14850J00550
$$ 275856 80501 138710 303626 193162 247515 247701 439027 -18545 -230846 214850 315400
13453C15400J19861A17218R9167q6546m7747C0947i7691A60731c7917A94172R9915
$$ 315400 435261 117218 216385 129839 82092 30947 -97691 160731 -37917 194172 294087
13442B94087A46255L1822J41836l0504A38776n9131J91509Q020c68048A54864
$$ 294087 146255 178077 319913 289409 138776 79645 271154 279174 -368048 154864
13431A40062a1393C86072k346j7913b16724d2400C803Q4413i8547A47094C9189
$$ 140062 -11393 386072 383726 365813 -216724 -42400 3803 88216 -98547 147094 39189
13419A10946J61261o381J9389Q0816p4971I2442R8898G2687O9549D1783J09710
$$ 110946 272207 265826 285215 366031 291060 92442 191340 72687 142236 41783 151493
13408A51493N0090l2937i0811B74830a99566C03886p3675e4522E6589J21856F0462
$$ 151493 201583 168646 -90811 274830 -199566 303886 230211 -54522 56589 178445 60462
13396A74709K01054A08455K71206D5903K58047A16738L33874j10659j46118O6412
$$ 174709 375763 108455 379661 45903 303950 116738 450612 339953 193835 260247
13386B60247r0398J42171b4849A79144a53287A37983D0769L09180A63820b3564
$$ 260247 169849 312020 -24849 179144 -153287 137983 40769 349949 163820 -23564
13375E4634K2336B5884J22046Q6117p9172J92396N121N202P3669A57386a7090
$$ 54634 76970 25884 147930 234047 154875 347271 352392 357594 431263 157386 -17090
13363A50228J41463J35421A91118J07872I4390M36873G0728N8255K32988M9283
$$ 150228 291691 427112 191118 298990 94390 531263 70728 128983 361971 411254
13353D11254O5506F3704J5529J82837j12860K40074c43609D2846K34933P1920
$$ 411254 476760 63704 79233 262070 149210 389284 -343609 42846 277779 349699
13343C49699K59847C00106J12504A63604J44123G2535j1570J86240n8533J52261
$$ 349699 609546 300106 412610 163604 307727 72535 60965 247205 188672 340933
13333C40933H4194J49574b0457A34473k0467J17589n9019K18221j72127D4263
$$ 340933 84194 233768 -20457 134473 114006 231595 172576 390797 218670 44263
13322B23572Q7048r3093c5672I1387J91092q4919D90K53865H1326J23866E7526
$$ 223572 310620 217527 -35672 91387 282479 197560 490 254355 81326 205192 57526
13310B72366r5516a85894B36992O5166A30873a44791B83042n3589G6742L34102
$$ 272366 176850 -185894 236992 302158 130873 -144791 283042 229453 76742 410844
13300D10844A11411M0554J33440c24133B2840K47702I7175L0106j2353K96516
$$ 410844 111411 151965 285405 -324133 22840 270542 97175 127281 114928 411444
13290D11444D3312N3923Q4914n7159F0319J00921e2055A29505F793P7122C4089
$$ 411444 43312 97235 182149 124990 60319 161240 -52055 129505 6793 83915 34089
13278I3908K23192A33542B6830d1079B3423b7254B09433K9043a644A00587k2984
$$ 93908 317100 133542 26830 -41079 23423 -27254 209433 238476 -1644 100587 77603
13267G7603Q6076j987J39260A22082N3079b8186A74326a15005A51898n0554J40728
$$ 77603 163679 161692 300952 122082 175161 -28186 174326 -115005 151898 101344 242072
13256B42072j03144O6165k0648k1172p7495b56237A59184d6212o148A72887g3517
$$ 242072 138928 205093 184445 163273 85778 -256237 159184 -46212 -52360 172887 -73517
13244a25854d342A43515J26053m5080I4925a89171j50484B90978a85868D30500
$$ -125854 -4342 143515 269568 224488 94925 -189171 -339655 290978 -185868 430500
13233a6429H001K20850G2044j1082c9797E4024K36965j00049D7314J83843J30641
$$ -16429 8001 228851 72044 60962 -39797 54024 290989 190940 47314 231157 361798
13222C61798O1341j70081k8513a662j52382E1240Q4477d9181k6232J0998A39787
$$ 361798 423139 253058 224545 -1662 -154044 51240 135717 -49181 -75413 -64415 139787
13210D9736J34080i828A53662K71744a15549B4401P1346O6464m8878k9487J72421
$$ 49736 183816 -9828 153662 425406 -115549 24401 95747 162211 113333 83846 256267
13199B56267e4892F5214J6149f1177B72966C056i4016K0807A45870a97849R8598
$$ 256267 -54892 65214 81363 -61177 272966 3056 -94016 -73209 145870 -197849 -99251
13188i9251B62892a11617J9893F0073a23526n9372B34133a23972a0338A28790
$$ -99251 262892 -111617 -91724 60073 -123526 -182898 234133 -123972 -10338 128790
13177B55839k6732j7859G2164a4220q442l05358e5196A27435a72844k8964H506
$$ 255839 229107 211248 72164 -14220 -22662 -328020 -55196 127435 -172844 -201808 8506
13165D7214J05047b16176G5550A2377h0547l17298a19552l8654G0761M2659J79691
$$ 47214 152261 -216176 75550 12377 -80547 -397845 -119552 -158206 70761 113420 293111
13154B93111L8043n6031a06952A74046i8866A68338a65990l9430D5723K49667
$$ 293111 331154 275123 -106952 174046 -98866 168338 -165990 -205420 45723 295390
13144B95390j19059b80524A79962b2898A74036J92159B0285a08157G8087j0089
$$ 295390 176331 -280524 179962 -22898 174036 366195 20285 -108157 78087 67998
13134F7998M5497b13579o7045F1000D197a95724L4947A33931J85118j05907a07314
$$ 67998 113495 -213579 -280624 61000 4197 -195724 -160777 133931 319049 213142 -107314
13122f7014r826A43006b13355h1089d379k382k25698e6384a6019B0738a11603
$$ -67014 -76840 143006 -213355 -81089 -4379 -6761 -232459 -56384 -16019 20738 -111603
13110b26648C27691A3687J63536O6592b15477N5867f4549A87519R5920a5517k82054
$$ -226648 327691 13687 177223 243815 -215477 -159610 -64549 187519 283439 -15517 -297571
13099b97571c1883B23173o4095a92892F0491K53640D681d443A85852b75258F0147
$$ -297571 -31883 223173 159078 -192892 60491 314131 4681 -4443 185852 -275258 60147
13087b19370G9678d3603B86496r8658M6259N7023a38309C67908A73520g2561B6584
$$ -219370 79678 -43603 286496 187838 234097 291120 -138309 367908 173520 -72561 26584
13075B38527c01710A74665F0715c16337B8814K2088L2270d1399E7433R1663a16459
$$ 238527 -301710 174665 60715 -316337 28814 50902 83172 -41399 57433 149096 -116459
13063F8845O0419h2569A44265L7120a95566n5085O4168g6907A10818J34637j03825
$$ 68845 129264 -82569 144265 181385 -195566 -250651 -186483 -76907 110818 245455 141630
13052A41630c168C1595J09977A148J19931R0414C1521K59468q6981J38225A9893
$$ 141630 -3168 31595 141572 1148 121079 211493 31521 290989 204008 342233 19893
13040A97703a47028L4551C63991j70688d7166I8795l3220N176b73909J13086C04583
$$ 197703 -147028 -112477 363991 193303 -47166 98795 65575 70751 -273909 -160823 304583
13028a16285C19493G2996J19771a24290F9502R346a9767C12261A20580m8790J64966
$$ -116285 319493 72996 192767 -124290 69502 78848 -19767 312261 120580 71790 236756
13017B36756q9337b22206B9180a6259A94988q1113b4123B7720O7059K62591i8953
$$ 236756 147419 -222206 29180 -16259 194988 113875 -24123 27720 94779 357370 -98953
13005a02829B04257b37137d8564k4216n9927B68831o9668C4927O0525K22733A55452
$$ -102829 204257 -237137 -48564 -72780 -132707 268831 199163 34927 95452 318185 155452
12993B6485d458D7792E246M0112a77434b8599F5323R2822E3647L3341J15846K8148
$$ 26485 -4458 47792 5246 45358 -177434 -28599 65323 158145 53647 86988 202834 230982
12981B30982b14132Q5727a92j63000A25867O2155J45577j61472f711k34072B09434
$$ 230982 -214132 -128405 -192 -163192 125867 188022 333599 172127 -6711 -240783 209434
12969C0153K00144P7107j21520q7370d29565A7359f2581A42005f7945b708B3506
$$ 30153 230297 307404 185884 98514 -429565 17359 -62581 142005 -67945 -2708 23506
12957C11466j45130c2563k24369N6158Q1263D999a4887F0288b11881b5089F6688
$$ 311466 166336 -32563 -256932 -200774 -119511 4999 -14887 60288 -211881 -25089 66688
12945d8736j40765g1636A12426a33149N9163B30995a02620A47194m5074j4993
$$ -48736 -189501 -71636 112426 -133149 -73986 230995 -102620 147194 102120 87127
12935H7127p975N2931a7194B1313a14438b9814A20823C1418b6922I4972a16791
$$ 87127 79152 132083 -17194 21313 -114438 -29814 120823 31418 -26922 94972 -116791
12923a76904E4183M5102a01243k59611A68156p8209K01417n4625B589J83980e9575
$$ -176904 54183 99285 -101243 -360854 168156 89947 291364 236739 2589 186569 -59575
12911B57364i8236M5118j53963Q4160M8221A4016K188a46849F4118e2924J4048
$$ 257364 -98236 -53118 -207081 -122921 -74700 14016 16204 -146849 64118 -52924 -38876
12900c8876A14425q31L5385Q6496a48563d0097B75143A11597c4103k36745E0963
$$ -38876 114425 113594 148979 235475 -148563 -40097 275143 111597 -34103 -270848 50963
12888b31025A94777n4348a73515h2837a7725A88497I3752a47695A11343K35173
$$ -231025 194777 140429 -173515 -82837 -17725 188497 93752 -147695 111343 346516
12878C46516e1026C8692a0134B00939a84931A05701a80397j1307C2767c7418k9256
$$ 346516 -51026 38692 -10134 200939 -184931 105701 -180397 -191704 32767 -37418 -66674
12867f6674F6762J50706a1891A45429K77432A55220c84865A53908i270j83984
$$ -66674 66762 217468 -11891 145429 422861 155220 -384865 153908 -9270 -193254
12857a93254p3528B5711b22082B86117c19961h2353k4607A38785J83159j30056
$$ -193254 -266782 25711 -222082 286117 -319961 -82353 -106960 138785 321944 191888
12847A91888B0902K13936a10206M6599j37486Q169E727J12391d34505a00738o6292
$$ 191888 20902 234838 -110206 -63607 -201093 -192924 5727 118118 -434505 -100738 -167030
12836a67030C62160a45356I971N2497k3658K75507c18032C9972b19613K8808a7824
$$ -167030 362160 -145356 9971 62468 38810 314317 -318032 39972 -219613 -190805 -17824
12824a4335n6632j99154a22754E7326J71863A07094g0641A64825K1649b72909
$$ -14335 -70967 -270121 -122754 57326 229189 107094 -70641 164825 186474 -272909
12813E7582h8181d3138k36097f9565r3132E6758c4536A03267b97819b1848j49707
$$ 57582 -88181 -43138 -279235 -69565 -162697 56758 -34536 103267 -297819 -21848 -171555
12802a71555B5510g3674A42071f1983a7830q3278C847c8210m7125C05673i1724
$$ -171555 25510 -73674 142071 -61983 -17830 -101108 3847 -38210 -85335 305673 -91724
12790i0634E0208e83340e2943B24355b17023B10183p6054a01624G0405J93530
$$ -90634 50208 -583340 -52943 224355 -217023 210183 134129 -101624 70405 263935
12780B63935a9818k53331A62972i6411D2298j5609a6261A92224a6958A06984a89491
$$ 263935 -19818 -273149 162972 -96411 42298 26689 -16261 192224 -16958 106984 -189491
12768B037O2812e817E1596i5461K1959i617A19915a02350j85683O3045J08388
$$ 2037 64849 -5817 51596 -95461 -73502 -9617 119915 -102350 -288033 -224988 -116600
12757a16600A73044a86483n6488g6149c1958A98786o4016h4048n217l1216p9602
$$ -116600 173044 -186483 -242971 -76149 -31958 198786 134770 -84048 -89265 -120481 -200083
12746b00083C34401A3095a61217N7635a664A69595a88262A96781I580J28694n4245
$$ -200083 334401 13095 -161217 -103582 -1664 169595 -188262 196781 9580 138274 84029
12735H4029B2994b60658D5499i8818A63469k2967J10890b18032R602A06164R104
$$ 84029 22994 -260658 45499 -98818 163469 140502 251392 -218032 -208430 106164 115268
12724A15268c2278a4855C8055i2127A61257a21885p2204B03917p0373N7066H2467
$$ 115268 -32278 -14855 38055 -92127 161257 -121885 -194089 203917 133544 190610 82467
12712b12817e131m0011A43724J01273r5049N1588m9028m2360m2671A9271a24788
$$ -212817 -5131 -45142 143724 244997 149948 201536 152508 110148 67477 19271 -124788
12700b18513A13329a76945I7294K3080J03576I9174B152h1856D5487c3390r557
$$ -218513 113329 -176945 97294 120374 223950 99174 2152 -81856 45487 -33390 -42947
12689d2947A15891L42036F3683A6152Q927c03440C00759h8443A66001a93659I1173
$$ -42947 115891 457927 63683 16152 25079 -303440 300759 -88443 166001 -193659 91173
12677c2326c854B40402q437A5573J82153r8178C8961b18148h1623G4814C1915
$$ -32326 -3854 240402 231965 15573 197726 99548 38961 -218148 -81623 74814 31915
12665G2098c83591A93378J46733d0241A50580a42332b6328B89223d8962H0724
$$ 72098 -383591 193378 340111 -40241 150580 -142332 -26328 289223 -48962 80724
12654a00439H5363K37012j42727e3944B47822b257j19553p8783h4670k48458b5399
$$ -100439 85363 322375 179648 -53944 247822 -2257 -121810 -200593 -84670 -333128 -25399
12642a07436F4269a36056a4288C18281I0237H612a53111f2840G6997a16336D48209
$$ -107436 64269 -136056 -14288 318281 90237 8612 -153111 -62840 76997 -116336 448209
12630C01919F1990L2576k0251K04575c2589C54734A26512a4103F1698b2739E5247
$$ 301919 61990 94566 74315 278890 -32589 354734 126512 -14103 61698 -22739 55247
12618I6867J77116a64721N8855l3446G5657b37588c236j25082A136J42509l5927
$$ 96867 273983 -164721 -105866 -139312 75657 -237588 -3236 -128318 1136 143645 107718
12607A07718Q6309h4569p6340C44122c7823q4471B37100I2749J00254A1951e5513
$$ 107718 194027 -84569 -160909 344122 -37823 -122294 237100 92749 193003 11951 -55513
12595a3485B16757c3656a6278F7454c5120A42805a79556O0927A39912A5408f8264
$$ -13485 216757 -33656 -16278 67454 -35120 142805 -179556 -118629 139912 15408 -68264
12583a08594A65032M2789g7692B3795g9657e029j63978C71133g9380A27376e4427
$$ -108594 165032 207821 -77692 23795 -79657 -5029 -169007 371133 -79380 127376 -54427
12571D2872J22843i0701B46674F160h7399k09447A05401P5358a89793m6638C19116
$$ 42872 165715 -90701 246674 6160 -87399 -296846 105401 180759 -189793 -236431 319116
12559C69537a23537C6274a22095j07687j41284i4405l54995A37429M3316g7938
$$ 369537 -123537 36274 -122095 -229782 -371066 -94405 -449400 137429 180745 -77938
12548b61351c1313j09248C7801J25949O562P3467J30969H7241a22826A41887F424
$$ -261351 -31313 -140561 37801 163750 170312 243779 374748 87241 -122826 141887 6424
12536b0358D6046M05059d4004j23481A21583a16199p7984C02138h704l1043A28758
$$ -20358 46046 451105 -44004 -167485 121583 -116199 -194183 302138 -8704 -39747 128758
12524h7537j16121I4866B258J19140a7313j31985k23851a27290F0321a14713a3793
$$ -87537 -203658 94866 2258 121398 -17313 -149298 -373149 -127290 60321 -114713 -13793
12512c7975e984m0728p294o4286A07366i5091K0390C1725b28054O2138F9957J24086
$$ -37975 -5984 -46712 -54006 -118292 107366 -95091 -74701 31725 -228054 -165916 69957 194043
12500A94043b61856b2166A79396K5389D2485a38034C21496E7704a67881j13345
$$ 194043 -261856 -22166 179396 204785 42485 -138034 321496 57704 -167881 -281226
12490b81226A70451a07860q4338A39532K54b01856O6178B15431c9532i143B36211
$$ -281226 170451 -107860 -192198 139532 139786 -201856 -135678 215431 -39532 -9143 236211
12478B36369f0967D23027I9344F487e6973j1598G3918K0419b39712c7565j29450
$$ 236369 -60967 423027 99344 6487 -56973 -68571 73918 94337 -239712 -37565 -167015
12467a67015b5228k6632q1496j0458L1961F1506c2533r4065D5559G167J48939
$$ -167015 -25228 -51860 -133356 -143814 -111853 61506 -32533 -126598 45559 7167 156106
12456A56106a23490B86314M5977b42714B4099M0599P8868E290J13318J18743D317
$$ 156106 -123490 286314 332291 -242714 24099 64698 143566 5290 118608 237351 4317
12444B42071E711J35412a92179m1604A51545k7121C0559J04721a21983e0662A26053
$$ 242071 5711 141123 -192179 -233783 151545 124424 30559 135280 -121983 -50662 126053
12432D2674a77382J9608A94741a18377k403G5636J46820a12397a0171j51855d6846
$$ 42674 -177382 -157774 194741 -118377 -120780 75636 222456 -112397 -10171 -162026 -46846
12420a04313K3200A02776O0782Q883c48667f030B11685b18351C91222I3987J7950
$$ -104313 -81113 102776 163558 172441 -348667 -6030 211685 -218351 391222 93987 111937
12409A11937c5360D6437a48103d9105o552l58989A38372A8847g1690j64194A60450
$$ 111937 -35360 46437 -148103 -49105 -55657 -414646 138372 18847 -71690 -235884 160450
12397B10000d275I3773l5245J95707A16176i6835G3041q784j3281E877K23869
$$ 210000 -4275 93773 58528 254235 116176 -96835 73041 64257 50976 5877 229746
12386B29746I8106A1782a51569A67081i5687C1061J48528q7071J31532l0397N589
$$ 229746 98106 11782 -151569 167081 -95687 31061 179589 92518 224050 193653 199242
12375A99242J53336n5851j42765L2067b95960B30642h8982a083A08166c4198A086
$$ 199242 352578 296727 153962 186029 -295960 230642 -88982 -1083 108166 -34198 1086
12363b23947A21747d0984C29790a90502B91604c08799G0658b29477f9794F3605
$$ -223947 121747 -40984 329790 -190502 291604 -308799 70658 -229477 -69794 63605
12352h7460A57558b25774A6331J52234b2674H4861a14227n2491F6816f7632A42440
$$ -87460 157558 -225774 16331 168565 -22674 84861 -114227 -166718 66816 -67632 142440
12340a31689j33550A25283J01266r969c5585A82217R2314K82781A72999O6745
$$ -131689 -265239 125283 226549 216580 -35585 182217 274531 557312 172999 239744
12330B39744H3227K70618A56546M0025l3461k4174d0780j827B46027i121j8232
$$ 239744 83227 353845 156546 196571 163110 138936 -40780 -42607 246027 -9121 -27353
12319b7353E69941H3609K03570K62389l5939a55546A45313j2246c4223k222j05842
$$ -27353 569941 83609 287179 549568 513629 -155546 145313 133067 -34223 -36445 -142287
12308a42287j394A1759J43339l1751b4221p7440C27338c9661A16308m1982a6847
$$ -142287 -143681 11759 155098 123347 -24221 -101661 327338 -39661 116308 74326 -16847
12296C01198o0006a36531A65129P5879p8891a80354O6286A02132L6709a71448
$$ 301198 241192 -136531 165129 241008 162117 -180354 -114068 102132 138841 -171448
12285a2371m798A79073K90541b1902E3965J26399i7350A18399j9178a57200L5553
$$ -12371 -17169 179073 469614 -21902 53965 180364 -97350 118399 99221 -157200 -121647
12274a21647A77428J7323F0692R9064L2305A1547K03390R4590D1874M37366B26513
$$ -121647 177428 194751 60692 159756 192061 11547 214937 309527 41874 479240 226513
12262c24378B2314o845J82902K8900H9948h1384p0114A69504k67K53261A07454
$$ -324378 22314 15469 198371 227271 89948 -81384 -151498 169504 169237 422498 107454
12250A04166a55339G8304J55242N4093a37527l6274p2576A86690p2899d3572A82556
$$ 104166 -155339 78304 233546 287639 -137527 -173801 -246377 186690 113791 -43572 182556
12238H4353g5818q4611A88935a50432A5490a79656B20259A1314K11423b17251
$$ 84353 -75818 -160429 188935 -150432 15490 -179656 220259 11314 222737 -217251
12227e6058A61359D9201Q5474J88439A50947L43235A20572A9004a06707B47425
$$ -56058 161359 49201 134675 323114 150947 494182 120572 19004 -106707 247425
12216B43178o2995h8350E78548B10112n5288B0987M1881M12791b072H0457J4625
$$ 243178 180183 -88350 578548 210112 154824 20987 62868 475659 -2072 80457 95082
12205I5082L60860B15717Q0043p4422o9692C4636m530b5485B76772D4385L7077
$$ 95082 455942 215717 295760 221338 151646 34636 30106 -25485 276772 44385 81462
12194H1462J84354J64k8714j09597o159l0311a7876j90319A10621J52965d1973
$$ 81462 265816 265980 237266 127669 121510 91199 -17876 -208195 110621 263586 -41973
12182I5799Q1285D8109N5359n545R9056D8401O5063K35569g5687A69694a01347
$$ 95799 177084 48109 103468 97923 196979 48401 113464 349033 -75687 169694 -101347
12170C56873d9783B88151L6767J68098A19743k3670M52803B28013r1630K29595
$$ 356873 -49783 288151 324918 493016 119743 96073 548876 228013 136383 365978
12160C65978A69903Q8069H253L8274K89923k1397h8746K4204F9689b23914K3741
$$ 365978 169903 257972 8253 46527 336450 315053 -88746 -64542 69689 -223914 -200173
12149b00173e7238H3269L1399D3606A346g25A97351J0362C1039d6521B30344G2594
$$ -200173 -57238 83269 114668 43606 1346 -725 197351 207713 31039 -46521 230344 72594
12136C8559J86984b61643A57623D3751a728B90960F1734J4709J9885J66803J40880
$$ 38559 225543 -261643 157623 43751 -1728 290960 61734 76443 96328 263131 404011
12125D04011r9502f6373B50459O5726b75163C39475P6155C2659A5458J90878A8799
$$ 404011 304509 -66373 250459 316185 -275163 339475 415630 32659 15458 206336 18799
12113b96349C43611A33299K44348H9749R7962m6489R7391p6822b63505B8946K14464
$$ -296349 343611 133299 377647 89749 187711 141222 238613 161791 -263505 28946 243410
12102B43410j08933b31531A9960L8058K14338A17097J8970N0319a72382G2249
$$ 243410 134477 -231531 19960 58018 272356 117097 136067 186386 -172382 72249
12091c2988B96166B6059b0024P552k07125A8185d3082p7148A21085k9959Q8168
$$ -32988 296166 26059 -20024 -12472 -219597 18185 -43082 -120230 121085 91126 179294
12080A79294J04549j25921M08503A11936M2927a38005E6263a40728l4278B37265
$$ 179294 283843 157922 566425 111936 154863 -138005 56263 -140728 -175006 237265
12069D3883N37176k63549j12123A8748J07567K0154k2287f428m2806G3236B1350
$$ 43883 581059 317510 205387 18748 126315 146469 124182 -6428 -49234 73236 21350
12057D7960a68670A8753h26j8934j61747A7335a59954j34158A49761a08867J3986
$$ 47960 -168670 18753 -826 -19760 -181507 17335 -159954 -294112 149761 -108867 -94881
12046i4881J5300A39971b02318G9529b34429d0546n0131A57643b79482k78269
$$ -94881 -79581 139971 -202318 79529 -234429 -40546 -90677 157643 -279482 -557751
12036e57751b56589H8383a7280m483D09125A85071H9531b2079D4579a45423B16933
$$ -557751 -256589 88383 -17280 -21763 409125 185071 89531 -22079 44579 -145423 216933
12024B11468j2247A5093a19650A36634a2588j48089D9536d07855h4983B48675
$$ 211468 199221 15093 -119650 136634 -12588 -160677 49536 -407855 -84983 248675
12013C38356A18680K67929A73766i7080k6742E9153K46791J17602A13459a59578
$$ 338356 118680 386609 173766 -97080 -123822 59153 305944 423546 113459 -159578
12002A06582J31320E0958A3908a05752E6447k4399h5128a7493k55208G2926o651
$$ 106582 237902 50958 13908 -105752 56447 32048 -85128 -17493 -272701 72926 66275
11991F6275a76387A48462J01267O1566j55123b7601a738A42032b84157A46220
$$ 66275 -176387 148462 249729 311295 156172 -27601 -1738 142032 -284157 146220
11980H5714J68559b06283H9829h2436j71054A40596e2786C50950a87542d9026
$$ 85714 254273 -206283 89829 -82436 -253490 140596 -52786 350950 -187542 -49026
11969G7009l3689a45576g0766B73645G3807K58365a87105A0892a19392p0263F4968
$$ 77009 43320 -145576 -70766 273645 73807 332172 -187105 10892 -119392 -189655 64968
11957a73527D8284O9712j0411b08503C37439A42832b23662I0086a2554j46948
$$ -173527 48284 117996 107585 -208503 337439 142832 -223662 90086 -12554 -159502
11947a59502F5992b94820b5937o5319e487r7245b0357j83077C8592a02315f786
$$ -159502 65992 -294820 -25937 -91256 -5487 -102732 -20357 -203434 38592 -102315 -6786
11935D8877a57746F8790e3160A71164p5266C6036i0918j20048d159k54856L471
$$ 48877 -157746 68790 -53160 171164 95898 36036 -90918 -210966 -4159 -259015 -255544
11924b55544j08049g4798a163j83897A45597l0457B3537q085b4348A48638d88839
$$ -255544 -363593 -74798 -1163 -185060 145597 115140 23537 15452 -24348 148638 -488839
11912a21445A55219b09098o7621I3468h9680m167l8261d7780G3770g8213F3752
$$ -121445 155219 -209098 -276719 93468 -89680 -93847 -132108 -47780 73770 -78213 63752
11900D2754J22771e7957A84661G5856b99713i2176b4636m62213c885D167a96973
$$ 42754 165525 -57957 184661 75856 -299713 -92176 -24636 -486849 -3885 4167 -196973
11888B38586A08353c01218i9009A2063d3526k76861J60065d0978I7767i4216j132
$$ 238586 108353 -301218 -99009 12063 -43526 -320387 -160322 -40978 97767 -94216 -95348
11877i5348G983a25992B6421K11943I4819d0067A26441c49496a47064c3958r0982
$$ -95348 7983 -125992 26421 238364 94819 -40067 126441 -349496 -147064 -33958 -124940
11866a24940A99563d2910k8696j25022B14075G0707c7525G1294c143j2089k24557
$$ -124940 199563 -42910 -71606 -196628 214075 70707 -37525 71294 -3143 -15232 -239789
11855b39789l2393a619k42688f7595C38306k3772r1589b90314A52419A6663J8610
$$ -239789 -272182 -1619 -244307 -67595 338306 314534 222945 -290314 152419 16663 35273
11844C5273b76975b658l04532f1698C1620E210a96098R2764A7083a50206n9599
$$ 35273 -276975 -2658 -307190 -61698 31620 5210 -196098 -103334 17083 -150206 -209805
11833b09805B8362a26485j29971c639l06533k4219J18182N1456j1195F6937K14516
$$ -209805 28362 -126485 -256456 -3639 -310172 -334391 -216209 -164753 -175948 66937 281453
11822B81453A9897d7637j70459B94800l7505a93874k7420k6698B4083i8834k7476
$$ 281453 19897 -47637 -218096 294800 257295 -193874 -221294 -247992 24083 -98834 -126310
11811a26310j9882J0107H5685k4191m343a24398A57716j828K8283R4891c83603
$$ -126310 -146192 -136085 85685 61494 57151 -124398 157716 155888 184171 279062 -383603
11799a57437I7481H35K64944e22873a46386A28629d3136B18662c6537j31146k5428
$$ -157437 97481 835 265779 -522873 -146386 128629 -43136 218662 -36537 -167683 -193111
11788a93111A37004F7990M5736L3110a28440j59470P7472L7549A89223I0290a35444
$$ -193111 137004 67990 113726 146836 -128440 -287910 -210438 -172889 189223 90290 -135444
11776a86453H9712J29702a31807B6740i2469m3877j80482f5299B46314F6653a01217
$$ -186453 89712 219414 -131807 26740 -92469 -136346 -316828 -65299 246314 66653 -101217
11764D2083J32619M2676a40152M8209j35395e0888q9281A47544a40299D9461b19996
$$ 42083 174702 217378 -140152 -91943 -227338 -50888 -140169 147544 -140299 49461 -219996
11752a49113f2104r3995B45860a76688m6370B40695d3236k47352J19408M776k04509
$$ -149113 -62104 -156099 245860 -176688 -223058 240695 -43236 -290588 -171180 -166404 -370913
11741c70913J74881j38625A16107i6569j35687R9176k0171J0525D994J41886n1551
$$ -370913 -196032 -334657 116107 -96569 -232256 -133080 -153251 -142726 4994 146880 95329
11730I5329b0933d320j53896B3063K71638i4392A12036b66446b4671G3929d18087
$$ 95329 -20933 -4320 -158216 23063 294701 -94392 112036 -266446 -24671 73929 -418087
11718A96212a29760g784r3198b481j71698A11598a6955j27435A75096b025B14107
$$ 196212 -129760 -7784 -100982 -2481 -174179 111598 -16955 -144390 175096 -2025 214107
11706a16579B9533J77037M3047a30073H6718A9804M5479K69282j46614c03958
$$ -116579 29533 206570 249617 -130073 86718 19804 65283 334565 187951 -303958
11695a86844G5481a17172E6550c5427j15414H100b1852B33331e5265E5150i5022
$$ -186844 75481 -117172 56550 -35427 -150841 8100 -21852 233331 -55265 55150 -95022
11683H3841b55398F1295N4517M2083J39319F3838c6322j7069A92604G339a1661
$$ 83841 -255398 61295 115812 157895 297214 63838 -36322 -53391 192604 7339 -11661
11671a63264B73062j32610J03372b31766R5980H5495k6657c80104e5219a171j26409
$$ -163264 273062 140452 243824 -231766 -135786 85495 58838 -380104 -55219 -1171 -127580
11660a27580k1088j27470A59896a74247k9128n0371A2430a03008B1274f1369H4852
$$ -127580 -148668 -276138 159896 -174247 -203375 -253746 12430 -103008 21274 -61369 84852
11648A99877h5031A06731a0314o8844L8537h813B20378e4536A40347E6148a73392
$$ 199877 -85031 106731 -10314 -79158 -40621 -8813 220378 -54536 140347 56148 -173392
11636C17218g1888B44709a26636B04892a40959A02648k4788d510G588a61157K1651
$$ 317218 -71888 244709 -126636 204892 -140959 102648 77860 -4510 7588 -161157 -139506
11625a39506j06591c4142A47556a7036E166J21176a30976G6957C889a35107q8811
$$ -139506 -246097 -34142 147556 -17036 5166 126342 -130976 76957 3889 -135107 -223918
11614b23918A64948h8508m10754A0992b81278O0763A23022a38787a6061C2752
$$ -223918 164948 -88508 -499262 10992 -281278 -220515 123022 -138787 -16061 32752
11603E1894K9871O0437P8345m4346q4806K16543N1795b67562j69899a16648A2241
$$ 51894 81765 142202 220547 176201 91395 307938 359733 -267562 -437461 -116648 12241
11591a343A40005o6384a13693k3605M2723A69407P0637j04823A0949J4220J80260
$$ -1343 140005 73621 -113693 -137298 -94575 169407 240044 135221 10949 25169 205429
11580B05429a42672F5392K85768h1601K6952A30962N4718c10843B1336R2600K8233
$$ 205429 -142672 65392 351160 -81601 -54649 130962 185680 -310843 21336 113936 142169
11569A42169E8343b9854A69692b94967L7168A06657A455J60433o6750c53215C94464
$$ 142169 58343 -29854 169692 -294967 -257799 106657 1455 161888 95138 -353215 394464
11557G2969R441a65813B11503B5953b71904B65874d5997j27523C5694J88218D6160
$$ 72969 82410 -165813 211503 25953 -271904 265874 -45997 -173520 35694 223912 46160
11545A77597q0638R2679a55492A19388a0916k95124f4289B26352r6999q045k4599
$$ 177597 96959 189638 -155492 119388 -10916 -306040 -64289 226352 129353 121308 96709
11534I6709i4217I5011c4395A65412P0152k4888f8304C32958A32540h8330H2594
$$ 96709 -94217 95011 -34395 165412 235564 210676 -68304 332958 132540 -88330 82594
11522a9456A0482J34713k1039n903J09547F7769K07695b3105B28599n3702c8231
$$ -19456 10482 145195 124156 118253 227800 67769 275464 -23105 228599 174897 -38231
11510B36676p1607l4924B1995L72601a81514A65116O184b2825C23129a1294j33284
$$ 236676 165069 130145 21995 394596 -181514 165116 171300 -22825 323129 -11294 -144578
11499a44578N5195L0750B17155F2200K64140b17699C4315K88919D3654C760a9946
$$ -144578 -89383 -58633 217155 62200 326340 -217699 34315 323234 43654 3760 -19946
11487A73671N3659C3426J174J45519d4516c285C56a32693A42876J17942H3753
$$ 173671 227330 33426 34600 180119 -44516 -3285 356 -132693 142876 260818 83753
11475A59266l9552O4650K16735A41802J05363p5871H2485i5910B41874I4116N5319
$$ 159266 119714 184364 401099 141802 247165 171294 82485 -95910 241874 94116 149435
11464A49435K5636D9518R4842Q1742J03161k2586j22298b25102A58649D7434K20011
$$ 149435 175071 49518 144360 226102 329263 306677 184379 -225102 158649 47434 267445
11453B67445A11060a69171B46380b12172L5779A06459J36746c3703F2580J50168
$$ 267445 111060 -169171 246380 -212172 -176393 106459 243205 -33703 62580 212748
11443B12748a50116N468f8812A68928P6753I4251e3364C28559K36486C1299O4155
$$ 212748 -150116 -144648 -68812 168928 245681 94251 -53364 328559 565045 31299 95454
11432I5454P8976n724k6193F4189b262l4657j68827G5246C3027c1869A29568f6006
$$ 95454 174430 168706 142513 64189 -2262 -36919 -205746 75246 33027 -31869 129568 -66006
11419a84898I3246b58956A58488d4750q4322j00713g2768h098E9406b23533N1920
$$ -184898 93246 -258956 158488 -44750 -129072 -229785 -72768 -8098 59406 -223533 -171613
11408a71613M3025B34515F0505d14706g0066j12428A61035F9255J96377J91955
$$ -171613 -128588 234515 60505 -414706 -70066 -182494 161035 69255 265632 457587
11398D57587A1210J69894h7469b407o0840E0168J36357b69858C6455L8214B480
$$ 457587 11210 181104 -87469 -2407 -63247 50168 186525 -269858 36455 74669 2480
11386A10534a60964A8943J49688a52104A0495K02373m9265L7311J4118b4491j59223
$$ 110534 -160964 18943 168631 -152104 10495 212868 163603 200914 215032 -24491 -183714
11375a83714H2453q242a26528m9602f0520J8126B60990b55600A22679c47540G5544
$$ -183714 82453 74211 -126528 -176130 -60520 -42394 260990 -255600 122679 -347540 75544
11363B68018a17384A72413b04816n1053f296j77566l54607O2227Q8063A56028
$$ 268018 -117384 172413 -204816 -255869 -6296 -183862 -538469 -476242 -388179 156028
11352I7733e2305A3815Q0016m303a83025Q6400l2732e2333j2073O627j01319K8627
$$ 97733 -52305 13815 93831 89528 -183025 -96625 -129357 -52333 -64406 -57779 -159098 -130471
11340a30471B31594H6160K13B4878M8948g6101C3247b69012A6148a57596E1022
$$ -130471 231594 86160 86373 24878 73826 -76101 33247 -269012 16148 -157596 51022
11328g1811r5207a1995C05640a21551q4835c7871j93898Q6311L6572L7750C46658
$$ -71811 -167018 -11995 305640 -121551 -206386 -37871 -231769 -145458 -108886 -71136 346658
11316c6177j62624e5911j44544A72570F9219r457L0940e9138A99512C0593a29945
$$ -36177 -198801 -55911 -200455 172570 69219 59762 90702 -59138 199512 30593 -129945
11304A76730c27734j9707B17099b23298Q8968G5696K32376B398c25450P8869a9530
$$ 176730 -327734 -347441 217099 -223298 -134330 75696 308072 2398 -325450 -246581 -19530
11292H1269b88243a21808A6785i4260j58155c6744E4538a64391P9687D762L8485
$$ 81269 -288243 -121808 16785 -94260 -252415 -36744 54538 -164391 -84704 4762 43247
11281D3247c98997a02474F6891L15655a8085l1261A96263e9553F0871b62632H3413
$$ 43247 -398997 -102474 66891 382546 -18085 -49346 196263 -59553 60871 -262632 83413
11269a29311j5090M6473B34485a23599A62473f9317j65892h1613F1194a27955
$$ -129311 -144401 -97928 234485 -123599 162473 -69317 -235209 -81613 61194 -127955
11258B95083E3597b1245n486A83795a25051B35577h3631B8586N3244i304k31747
$$ 295083 53597 -21245 -26731 183795 -125051 235577 -83631 28586 81830 -9304 -241051
11247b41051Q3791a9038j74839g3045a7917C863J72523o2801k584a43788d45j08349
$$ -241051 -157260 -19038 -193877 -73045 -17917 3863 176386 113585 111001 -143788 -445 -108794
11235a08794I2395e9642j28157f3069m8538m2275a1958q5219N861c0496j60053
$$ -108794 92395 -59642 -187799 -63069 -111607 -153882 -11958 -97177 -91316 -30496 -190549
11224a90549A37663a77407a0116B14186a5822G1813c15854M8301H2152M1289k3537
$$ -190549 137663 -177407 -10116 214186 -15822 71813 -315854 -267553 82152 123441 99904
11213I9904A3199b57727J15224M9153A2370b92324j26542g8909j01076q155o3849
$$ 99904 13199 -257727 -142503 -93350 12370 -292324 -418866 -78909 -179985 -188140 -251989
11202b51989g6201A06515E2286M1400c86626C76054A72078A2176J51951b50496
$$ -251989 -76201 106515 52286 93686 -386626 376054 172078 12176 164127 -250496
11191E361Q4347a09995j94640J16400g419j51455A29839J9118b65245A26649h7067
$$ 5361 89708 -109995 -304635 -188235 -7419 -158874 129839 148957 -265245 126649 -87067
11179A25669J62711b5777j30536A39446D9777a15498b3185j90830O3498j14644
$$ 125669 288380 -25777 -156313 139446 49777 -115498 -23185 -214015 -150517 -265161
11169b65161J03335j69010A149J46719p2251a04422J4626H1939b6432A78258d5979
$$ -265161 -161826 -330836 1149 147868 75617 -104422 -89796 81939 -26432 178258 -45979
11157c22372i5562M5513A33489c8187j17702A47507a37036A48559d60860G7782
$$ -322372 -95562 -50049 133489 -38187 -155889 147507 -137036 148559 -460860 77782
11146d00101h7790A63360A6954K23267o4218q623c7139C0633K4236i8012n7831
$$ -400101 -87790 163360 16954 240221 176003 167380 -37139 30633 54869 -98012 -155843
11135a55843o2019a07972j0075q4241d0061A4745K22691L1027e9372A53983o7898
$$ -155843 -217862 -107972 -118047 -202288 -40061 14745 237436 268463 -59372 153983 86085
11124H6085J27472C3422a8330n3483b0305A76031m3262N6654b37378D8386a13892
$$ 86085 213557 33422 -18330 -71813 -20305 176031 132769 189423 -237378 48386 -113892
11112A68368J0203b88431E7370b4430B2761M4197a35835A76902Q1325j04229m6745
$$ 168368 178571 -288431 57370 -24430 22761 66958 -135835 176902 258227 153998 107253
11101A07253L1097h1200A3223K12427n2810J13771P808p9945a22525m1013B86195
$$ 107253 138350 -81200 13223 225650 172840 286611 294419 214474 -122525 -163538 286195
11089c8008G0915K47206j00971m9749K23777r4456G4752O08780b96821C70759
$$ -38008 70915 318121 217150 167401 391178 296722 74752 683532 -296821 370759
11078B12235r8908J02098J32430m680P8848J6874A76468L8402l4754h0465D5493
$$ 212235 113327 215425 347855 343175 422023 438897 176468 214870 180116 -80465 45493
11066A52579L30987o3797E3807K59419J40324D0015M88004j07295K4583l4977
$$ 152579 483566 419769 53807 313226 453550 40015 528019 420724 445307 410330
11056D10330j27292K72282p3142J3955j40983J55824K45249q8106j80305J12855
$$ 410330 283038 555320 482178 496133 355150 510974 756223 668117 487812 600667
11046F00667R7674J68961Q9937k30936J39319k8123K72343k68732J27727P4696
$$ 600667 698341 867302 957239 726303 865622 837499 1109842 841110 968837 1043533
11036A043533k69144L98403m48904M95871j00031j72195l71732L01231j76907
$$ 1043533 774389 1172792 723888 1219759 1119728 947533 575801 877032 700125
11027G00125J7872p7691j20886k30957N12679m8378N0638j04664M20295k45620
$$ 700125 717997 640306 519420 288463 801142 752764 803402 698738 1119033 873413
11017H73413k28559p5122j98312j16941N15829k75941l0348j02534M5293j22484
$$ 873413 644854 569732 371420 254479 770308 494367 464019 361485 406778 284294
11007B84294K79986M4065N4558j59232J12205M0788K89094m03999J42535j29830
$$ 284294 564280 608345 662903 503671 615876 656664 945758 541759 684294 554464
10997E54464p286J41361j55943Q1510j25140J19304J69610l16439M80130j51341
$$ 554464 547178 688539 532596 614106 488966 608270 777880 461441 941571 790230
10987G90230k01580J50518j56815J78204n3277K18266j82110K40786J53910k13215
$$ 790230 588650 739168 582353 760557 707280 925546 743436 984222 1138132 924917
10977I24917K67833k68206N20237k53175M13274j29726K78004K11494J97167J85965
$$ 924917 1192750 924544 1444781 1191606 1604880 1475154 1753158 1964652 2161819 2347784
10967B347784K72399K11769J60275k12380J67458J16974o66153j76750l01150
$$ 2347784 2620183 2831952 2992227 2779847 2947305 3064279 2398126 2221376 1920226
10958A920226j36163m17421L06062j49960k00880j83153L24342r3333J7238K6922
$$ 1920226 1784063 1366642 1672704 1522744 1321864 1138711 1463053 1369720 1386958 1413880
10948A413880j16195n76884q2690M4913k45597j31170J16487j78993a14804B62392
$$ 1413880 1297685 720801 638111 683024 437427 306257 422744 243751 -114804 262392
10937A30871K76786B9575L29707A00709M9104j4473P1562R8862j46072h430j79823
$$ 130871 407657 29575 359282 100709 149813 135340 206902 305764 159692 -8430 -188253
10926a88253a347j54752H1713c6525A05217D2626a75446J5618H9065e2451A48747
$$ -188253 -1347 -156099 81713 -36525 105217 42626 -175446 -159828 89065 -52451 148747
10914C76556a16388I3220b12244a4132j8618A20367L6724h6396A08299n352J39960
$$ 376556 -116388 93220 -212244 -14132 -32750 120367 157091 -86396 108299 102947 242907
10903B42907J2997h2345a4127n2629k63496A6435R539a91244A52208i1220j29767
$$ 242907 255904 -82345 -14127 -66756 -330252 16435 25974 -191244 152208 -91220 -220987
10892b20987P7297q7007c2233a5630I348a35229L28j9510P975A3067R6475i4217
$$ -220987 -143690 -230697 -32233 -15630 9348 -135229 -134901 -154411 -146436 13067 109542 -94217
10879F4502J9115c58274d7705A56469G7771b64102j48128E9244a24214A4825b14116
$$ 64502 83617 -358274 -47705 156469 77771 -264102 -412230 59244 -124214 14825 -214116
10867a06521K9942n0814p9850d6091r3655k6796j08483F0054c29519E6530c1224
$$ -106521 -76579 -127393 -207243 -46091 -139746 -166542 -275025 60054 -329519 56530 -31224
10855c6111j07k44730A04288d0577E8036A0359e9250B68773r3678d6075E1297
$$ -36111 -36218 -280948 104288 -40577 58036 10359 -59250 268773 175095 -46075 51297
10843a15615A73012J58027b29341n1530H7677J11146b25927e5608o1762j00686
$$ -115615 173012 331039 -229341 -280871 87677 198823 -225927 -55608 -117370 -218056
10833b18056Q5194b8033D3961b46738C7869a60379b6022j35457A12825e9748A98557
$$ -218056 -132862 -28033 43961 -246738 37869 -160379 -26022 -161479 112825 -59748 198557
10821b5852q6544b9842m9920C7110c30022J10549R8120F600J71237a06553D9979
$$ -25852 -112396 -29842 -79762 37110 -330022 -219473 -121353 6600 177837 -106553 49979
10809c06167B6374i3995A9385J48476E5951e1546D0191b74345H2428a05943A24237
$$ -306167 26374 -93995 19385 167861 55951 -51546 40191 -274345 82428 -105943 124237
10797g6304C82156b81629A23734e6999j29171A07285n1635c9452B3258N9243b68331
$$ -76304 382156 -281629 123734 -56999 -186170 107285 55650 -39452 23258 82501 -268331
10785b81067A57939a06210E1585c5118B46410a59318f5392j86895A10837a88290
$$ -281067 157939 -106210 51585 -35118 246410 -159318 -65392 -252287 110837 -188290
10774c59466F2612p730d8085D2973a30499C1276R1557J352J13110r0030A8375
$$ -359466 62612 54882 -48085 42973 -130499 31276 122833 124185 237295 147265 18375
10762c9812q4667G9748d0287j14153l17801a91843A16258a08142L970b5652A7773
$$ -39812 -124479 79748 -40287 -154440 -472241 -191843 116258 -108142 -104172 -25652 17773
10750A53476E4096J41739g3152A4118J4577J06948a33859K8554j57484e3177C1831
$$ 153476 54096 195835 -73152 14118 28695 135643 -133859 -105305 -262789 -53177 31831
10738B15366D7094J61138g3690j23445j90953h6968A83755B1190J86068c0994
$$ 215366 47094 208232 -73690 -197135 -388088 -86968 183755 21190 207258 -30994
10727A82471f8448k87036C03919a57643D7190b1788D8683f1949k42102B26876
$$ 182471 -68448 -355484 303919 -157643 47190 -21788 48683 -61949 -304051 226876
10716b68568e4379k94792k5090L5221a30403k05450B28738a5948A43533b62779
$$ -268568 -54379 -349171 -374261 -339040 -130403 -335853 228738 -15948 143533 -262779
10705D3342O7398d40201a11793B25247c39957A8597b08170g2566j6758B63731
$$ 43342 110740 -440201 -111793 225247 -339957 18597 -208170 -72566 -89324 263731
10694a78841d7240o7324A12686h4420r4809h9112a3329j05452G4846b42684J14916
$$ -178841 -47240 -114564 112686 -84420 -179229 -89112 -13329 -118781 74846 -242684 -127768
10683a27768D5495a8696j02799l36273c8956f454A0515c5540m13538a90168A0041
$$ -127768 45495 -18696 -121495 -457768 -38956 -6454 10515 -35540 -449078 -190168 10041
10671d5592n430L066E0296f1619B65704a67758c8950o8169i325k8201J4118D9772
$$ -45592 -51022 -47956 50296 -61619 265704 -167758 -38950 -107119 -9325 -37526 -23408 49772
10658b0829E2658J99409H6454c06451a6591j54664q1632D0385r257c22234P0010
$$ -20829 52658 252067 86454 -306451 -16591 -171255 -252887 40385 31128 -322234 -252224
10647b52224A9831K52742a61260q7899e6424j26225j16467r6605J76215j42165
$$ -252224 19831 272573 -161260 -249159 -56424 -182649 -299116 -395721 -219506 -361671
10637c61671A21486e0504J2958A10297m7640k9473a4264p2468H8612b50999M8624
$$ -361671 121486 -50504 -37546 110297 62657 33184 -14264 -86732 88612 -250999 -202375
10626b02375k12524H7908l036j2546e7712L771A03727a42477j90961a3075k71894
$$ -202375 -414899 87908 84872 72326 -57712 -53941 103727 -142477 -333438 -13075 -284969
10615b84969E8851g2738k5598Q712L7180l7071f233G7398d7888B9980c19933B1043
$$ -284969 58851 -72738 -98336 -89624 -52444 -89515 -6233 77398 -47888 29980 -319933 21043
10602I5485N5104c04194j50560b7555j7924k59038p4292J48428C30777A16263
$$ 95485 150589 -304194 -454754 -27555 -45479 -304517 -378809 -230381 330777 116263
10591f6701k6450J9489B44372b25509C15799b32191R6343D4761F082M9871a47558
$$ -66701 -93151 -73662 244372 -225509 315799 -232191 -135848 44761 6082 55953 -147558
10579d54168A11358k6430D2171K29534A31667B2096b59492k7225a16704k02324
$$ -454168 111358 84928 42171 271705 131667 22096 -259492 -286717 -116704 -319028
10569c19028d3533b275j71505e9411j9928k74526A41538a73046P6023A49598B8732
$$ -319028 -43533 -2275 -173780 -59411 -79339 -353865 141538 -173046 -97023 149598 28732
10557a28366L9215A22009C0739h70C7768J09920g8205C11203A48925a48468E0317
$$ -128366 -89151 122009 30739 -870 37768 147688 -78205 311203 148925 -148468 50317
10545i3705q6992d7807m3772R637B32741Q522A18203a25708d0949j2668B64929
$$ -93705 -180697 -47807 -91579 -81942 232741 241263 118203 -125708 -40949 -53617 264929
10533c92776a92506j25141C1713d17314n9923A08824i9985o2243c7754o4649K713
$$ -392776 -192506 -317647 31713 -417314 -477237 108824 -99985 -162228 -37754 -102403 -99690
10522i9690k5280A2853c3273A31540D2473d8115l67549F4372b07317j39384Q1809
$$ -99690 -124970 12853 -33273 131540 42473 -48115 -415664 64372 -207317 -346701 -264892
10511b64892A18103g7396k20219A77216B2026c26995c6832k67391A42324A5187
$$ -264892 118103 -77396 -297615 177216 22026 -326995 -36832 -304223 142324 15187
10500A35735d9743j49726B80983h1265b998l81210D4406b54137A22214d6263m2554
$$ 135735 -49743 -199469 280983 -81265 -2998 -384208 44406 -254137 122214 -46263 -88817
10489h8817A42192J32941B4775a81757B03607f6446b9814k024j37533A33284K25979
$$ -88817 142192 275133 24775 -181757 203607 -66446 -29814 -31838 -169371 133284 359263
10478C59263a59647g387B75691F8692J57769o1047G5478L45127p2625a97176A8378
$$ 359263 -159647 -7387 275691 68692 226461 165414 75478 420605 347980 -197176 18378
10466f1112A89195M471L29105A93469N0580F785O4844j5652b34738e3539B52599
$$ -61112 189195 193666 522771 193469 244049 6785 71629 55977 -234738 -53539 252599
10454a65656F9186j2733J70439c1364m9836o2571r3643O3210B56615b72866e5870
$$ -165656 69186 56453 226892 -31364 -81200 -143771 -237414 -174204 256615 -272866 -55870
10442i4033j62492c9299A73839b54851H8666a90581f7172k5455l76874a13653
$$ -94033 -256525 -39299 173839 -254851 88666 -190581 -67172 -92627 -469501 -113653
10431b938r3237n0339k38241A03766j01c3377A16377a8918q5079j16898a04116
$$ -2938 -96175 -146514 -384755 103766 103665 -33377 116377 -18918 -103997 -220895 -104116
10419b11073j8392E4527Q2427E5150a40945j5093N4672D8672b00919A24079d687
$$ -211073 -229465 54527 136954 55150 -140945 -156038 -101366 48672 -200919 124079 -4687
10407e253C06669a04187C34751A13937a34168j89455J17920o2114a10016H482
$$ -5253 306669 -104187 334751 113937 -134168 -323623 -205703 -267817 -110016 8482
10396h7795b8342A98395c19923a39116j24852H1082a00376c1835A48877D2555
$$ -87795 -28342 198395 -319923 -139116 -263968 81082 -100376 -31835 148877 42555
10385a12198B64014A17132J5145a50106b0629A5513L01630a14234j80381B84543
$$ -112198 264014 117132 132277 -150106 -20629 15513 317143 -114234 -294615 284543
10374A22020d3307C79260A15647a18244B47565j02193b2014A93738H4657K99988
$$ 122020 -43307 379260 115647 -118244 247565 145372 -22014 193738 84657 384645
10364C84645j27349Q4314q588p8745F0009L28528G6699J15165J78555n0068K389
$$ 384645 257296 341610 333022 254277 60009 388537 76699 191864 370419 320351 322740
10353C22740m9330o7227q016M3528J45201A74177L84942j439p5290J43901B31859
$$ 322740 273410 206183 198167 241695 386896 174177 559119 557680 482390 626291 231859
10341D5980K43721L541G2834K44326j45137m8224D8976Q9202M7141B7874h8671
$$ 45980 289701 293242 72834 317160 172023 123799 48976 138178 185319 27874 -88671
10329c1263o6975A31674C1045L38786j22253N597a52776o067A1680L07267b15684
$$ -31263 -98238 131674 31045 369831 247578 253175 -152776 -158843 11680 318947 -215684
10317A13320K82853c5224a6058D5914A9946Q9128f1864A84539C1241g5166B46084
$$ 113320 396173 -35224 -16058 45914 19946 109074 -61864 184539 31241 -75166 246084
10305a23930k41403C38020g1203k51996B19755I5311b74810B03862O842C9231
$$ -123930 -365333 338020 -71203 -323199 219755 95311 -274810 203862 210704 39231
10294H9346f9303j52060D5166L06898h6334A26555C0245a46466k1543M5217C57290
$$ 89346 -69303 -221363 45166 352064 -86334 126555 30245 -146466 -168009 -122792 357290
10282a2618A48978a45345b0514n6382A88880r3758a75529A46674J25543a01010
$$ -12618 148978 -145345 -20514 -76896 188880 95122 -175529 146674 272217 -101010
10271I927O444b23219e6380j75684A536M3562b26778o7533a13705E0710J94228
$$ 9927 16371 -223219 -56380 -232064 1536 45098 -226778 -294311 -113705 50710 244938
10260B44938E7690O7295b48234R2981B59936J241a00174a8418A97218D275L73753
$$ 244938 57690 124985 -248234 -155253 259936 261177 -100174 -18418 197218 4275 378028
10249C78028A45231L03759J43835B9691b6731o4561A18487l4370a84085G3014
$$ 378028 145231 448990 592825 29691 -26731 -91292 118487 84117 -184085 73014
10238a75760A04917H135d8381C39906d197n9372b5266H7354d44417d8801k3150
$$ -175760 104917 8135 -48381 339906 -4197 -63569 -25266 87354 -444417 -48801 -71951
10227g1951j05164B2501c04924A12437d62306b19574j89797J44338J03915c8565
$$ -71951 -177115 22501 -304924 112437 -462306 -219574 -409371 -265033 -161118 -38565
10216i1553B56240b898j76395a1722B15502b63997j4183B05725k7349a87526A85959
$$ -91553 256240 -2898 -179293 -11722 215502 -263997 -278180 205725 178376 -187526 185959
10204A23666M339b27174L7967A13112A2664i1888M0316j1074k74398A11031J74983
$$ 123666 128005 -227174 -189207 113112 12664 -91888 -51572 -62646 -337044 111031 286014
10193B86014c6236C03359a09203C3360Q1897b37425B8400N5788a04587D7231d3320
$$ 286014 -36236 303359 -109203 33360 115257 -237425 28400 84188 -104587 47231 -43320
10181g0505j60113m603a3481D6107a4014l51662C23456c5935k56237a09153B31117
$$ -70505 -230618 -235221 -13481 46107 -14014 -365676 323456 -35935 -292172 -109153 231117
10169a64066a6225F9137a20816F9516b24174P1846j00776e3434l88684A32267
$$ -164066 -16225 69137 -120816 69516 -224174 -152328 -253104 -53434 -442118 132267
10158c31009H8885d557m48503i4486I6792a89167p7266J10589A71787A000a4582
$$ -331009 88885 -4557 -453060 -94486 96792 -189167 -266433 -155844 171787 1000 -14582
10146h5059j17560j71442e8392A05178a14240c3318l8590L0755j01775e7198k5772
$$ -85059 -202619 -374061 -58392 105178 -114240 -33318 -71908 -41153 -142928 -57198 -82970
10135h2970n687o3349j804C9141a98875I0317J8138a02107o5944H368b51386J0136
$$ -82970 -88657 -152006 -153810 39141 -198875 90317 108455 -102107 -168051 8368 -251386 -241250
10123b41250j6335k20726A40150b73073b9159j24451d0857r1989c7521o2325A09609
$$ -241250 -257585 -478311 140150 -273073 -29159 -153610 -40857 -132846 -37521 -99846 109609
10111a20351A97819e1260n2720B16916d0338l6033c233p6697J4417A20763c93075
$$ -120351 197819 -51260 -103980 216916 -40338 -76371 -3233 -79930 -65513 120763 -393075
10099B4615a82984C17277G4979L13203a16122M6857A33108J10349e0908F09J03350
$$ 24615 -182984 317277 74979 388182 -116122 -69265 133108 243457 -50908 609 103959
10088A03959c8545B06387c09828N5228a18913b6180k5967C0256b22560m3884l5530
$$ 103959 -38545 206387 -309828 -254600 -118913 -26180 -52147 30256 -222560 -266444 -301974
10077c01974a29714j38213N4668j2M3176d7185b1343j91164f6210a2167j36715
$$ -301974 -129714 -267927 -213259 -213271 -170095 -47185 -21343 -212507 -66210 -12167 -148882
10066a48882N5760A41631c41955b9434k6491B24624F7990b55328P4181g0551I5712
$$ -148882 -93122 141631 -341955 -29434 -55925 224624 67990 -255328 -181147 -70551 95712
10054A95047B0884L560a90200J6843M6932e964l9420I5718D7005J14969a19695
$$ 195047 20884 24444 -190200 -173357 -126425 -5964 -45384 95718 47005 161974 -119695
10042a0072A72080e40954a70683F7829b16652A60842a75527J104q8526a24890
$$ -10072 172080 -540954 -170683 67829 -216652 160842 -175527 -174423 -262949 -124890
10031a13032F0514b49343F1284b72374a33419A34640l7625j2521C6005M5799G624
$$ -113032 60514 -249343 61284 -272374 -133419 134640 97015 84494 36005 81804 7624
10019f3828l25994a39973M9153F3909N2370J11990a48536P1113A81603a62021
$$ -63828 -389822 -139973 -90820 63909 116279 228269 -148536 -77423 181603 -162021
10008g1929A10686b78804P7333M0025N5936d8811b1178k98143B17331a16150n0199
$$ -71929 110686 -278804 -201471 -161446 -105510 -48811 -21178 -319321 217331 -116150 -166349
9997a66349p1100O149A8290h6647k4517d272l22991a6598p223j76001H4533J3328
$$ -166349 -237449 -231300 18290 -86647 -111164 -4272 -327263 -16598 -23821 -199822 84533 97861
9985I7861d75352C64751b50394j1750h1006J6289A05891b28673h0525D24787b00634
$$ 97861 -475352 364751 -250394 -262144 -81006 -64717 105891 -228673 -80525 424787 -200634
9973b80599D35656b5436A28410j3754j3430J15465c5663j54172H5330a38191A38276
$$ -280599 435656 -25436 128410 114656 101226 216691 -35663 -189835 85330 -138191 138276
9961G073a87496F249b93275C54218c3059j58838e8157k22328P9781A23751f4389
$$ 7073 -187496 6249 -293275 354218 -33059 -191897 -58157 -280485 -200704 123751 -64389
9949B65484i6644D319K87935e4751j70494M4299b4230j36689M1437a7282n2141
$$ 265484 -96644 4319 292254 -54751 -225245 -180946 -24230 -160919 -119482 -17282 -69423
9938f9423n8670L4814B9725b24273A7300J37476a09577j82221J736h4121A11230
$$ -69423 -128093 -93279 29725 -224273 17300 154776 -109577 -291798 -290062 -84121 111230
9926I5969a10476j17121f3487r9504j95029f4792A48477i6300j22760O6222B3900
$$ 95969 -110476 -227597 -63487 -162991 -358020 -64792 148477 -96300 -219060 -152838 23900
9914C3922b11633k72917C05891A11756L4593m6922K6909d69542K30360H4497f4856
$$ 33922 -211633 -484550 305891 111756 146349 99427 126336 -469542 -239182 84497 -64856
9902a02724j8495k18579J40174n2553q5681B23269b61517k1743H1472e1453o249
$$ -102724 -121219 -339798 -199624 -252177 -337858 223269 -261517 -283260 81472 -51453 -57702
9891e7702j74570h6256B825b24179A40365a26357m3591C68783A61442e1844A48692
$$ -57702 -232272 -86256 2825 -224179 140365 -126357 -169948 368783 161442 -51844 148692
9879f2777l43639E9012h1935M828H9689b64385a05450r9740R5217A7186a49619
$$ -62777 -406416 59012 -81935 -77107 89689 -264385 -105450 -205190 -109973 17186 -149619
9867a1614k3449E5911M230J18952b69865B7653a07885F6142M0495g7860l1582
$$ -11614 -35063 55911 60141 179093 -269865 27653 -107885 66142 106637 -77860 -109442
9856a09442b9078j1762A30998a51158O4407B58161N11a23596b8883j57026j79780
$$ -109442 -29078 -40840 130998 -151158 -86751 258161 258672 -123596 -28883 -185909 -365689
9845c65689J17832h9649J9743j60935F8604b14812g5096A9736e6263A18576a79821
$$ -365689 -247857 -89649 -69906 -230841 68604 -214812 -75096 19736 -56263 118576 -179821
9833a65373o3205A31197h2407j31277D12903b18735b4612G2779a50429H170K19953
$$ -165373 -228578 131197 -82407 -213684 412903 -218735 -24612 72779 -150429 8170 228123
9822B28123b85584g0595d972C49731a22401b7430k49228I5736a2836k01933C25438
$$ 228123 -285584 -70595 -4972 349731 -122401 -27430 -276658 95736 -12836 -214769 325438
9810b29869F5184a72055G0640a43290q3691A56960e8008k9866B0618P2085m2496
$$ -229869 65184 -172055 70640 -143290 -226981 156960 -58008 -87874 20618 92703 50207
9799E0207a02445r3835l2821e3023p9332I7262h6973A18696i7821A15725a80514
$$ 50207 -102445 -196280 -229101 -53023 -132355 97262 -86973 118696 -97821 115725 -180514
9787g8673j49555j7367R4246j18362a02815C04665f9463k37545Q3956j8467A39168
$$ -78673 -228228 -245595 -151349 -269711 -102815 304665 -69463 -307008 -223052 -241519 139168
9775c78570a00618C3101a98580A3742f6047A95777A3470K7431a49245A59526F8735
$$ -378570 -100618 33101 -198580 13742 -66047 195777 13470 40901 -149245 159526 68735
9763b29506j94936B47589h2902H6888H103d8883j65010j12805J36180B0017J05752
$$ -229506 -424442 247589 -82902 86888 8103 -48883 -213893 -326698 -190518 20017 125769
9752A25769a46705A4304a01234d4273j32541h368r7027F3274g5261a1994j9743
$$ 125769 -146705 14304 -101234 -44273 -176814 -8368 -105395 63274 -75261 -11994 -31737
9741c1737G7514a52140G8618K5704b32930i3616l3772l06091c8749j65268A27917
$$ -31737 77514 -152140 78618 104322 -232930 -93616 -127388 -433479 -38749 -204017 127917
9729A23909e20430f4044k16329f5539j6717o7500A05825l6332Q5441K05939h8304
$$ 123909 -520430 -64044 -280373 -65539 -82256 -149756 105825 69493 154934 360873 -88304
9717B58326d7660G0459e893A00247e80725A45445E8398f4874r6977j64206A92700
$$ 258326 -47660 70459 -5893 100247 -580725 145445 58398 -64874 -161851 -326057 192700
9705a0129j84761P6771H1931d5165D4162a15349M3641j51708R1827f0097j72304
$$ -10129 -194890 -118119 81931 -45165 44162 -115349 -71708 -223416 -131589 -60097 -232401
9694b32401A53387g510C01441a43938A9552J9738c7899J7578j59695j24455i5617
$$ -232401 153387 -7510 301441 -143938 19552 39290 -37899 -20321 -180016 -304471 -95617
9682a19218k76984B84369b02921r9110R0207l0367c6099k02699B19238c25721
$$ -119218 -396202 284369 -202921 -302031 -211824 -242191 -36099 -238798 219238 -325721
9671f2364D7357b52192c3164G5955j1694O4723l3436c38792d4365A36114A3874
$$ -62364 47357 -252192 -33164 75955 64261 128984 95548 -338792 -44365 136114 13874
9659B08724a12698c7786O332A10671c05458g3897q3830C0306b1246F3119d49534
$$ 208724 -112698 -37786 -31454 110671 -305458 -73897 -157727 30306 -21246 63119 -449534
9647A87663a29363j05956l108R3363O9374A0405b0317j76763a906E7337e3012
$$ 187663 -129363 -235319 -238427 -145064 -75690 10405 -20317 -197080 -1906 57337 -53012
9635g434j88420D1869J38253F7938R1465E356L80913j31302B2048b94244c1528
$$ -7434 -195854 41869 180122 67938 159403 5356 386269 254967 22048 -294244 -31528
9623d7053j14924k4902g6874j81901A01275a2532m9243A66138d6962n69520G5765
$$ -47053 -161977 -186879 -76874 -258775 101275 -12532 -61775 166138 -46962 -616482 75765
9611A15464e1886j07136o769A43847K6195K04842a26775n0338q657C20567F6210
$$ 115464 -51886 -159022 -165791 143847 170042 374884 -126775 -177113 -185770 320567 66210
9599F5082b0379j4067l43217a56786B83918A18499d2820A54582a03881p9068f8861
$$ 65082 -20379 -34446 -377663 -156786 283918 118499 -42820 154582 -103881 -182949 -68861
9587B3929Q935b2448A09273a2662j13673L166I5905C9024c25653b7110A63879
$$ 23929 32864 -22448 109273 -12662 -126335 -123169 95905 39024 -325653 -27110 163879
9575a11647l91833C1359a30994I4405a31676F7244c59082Q60A18910a79854J970
$$ -111647 -503480 31359 -130994 94405 -131676 67244 -359082 -358222 118910 -179854 -177884
9564a77884j05722C3590j4462a01897a0838j29859M6618A70921a84364a1977j0459
$$ -177884 -283606 33590 19128 -101897 -10838 -140697 -94079 170921 -184364 -11977 -22436
9553b2436l7221n1340q9109I1472J26188b61091H9433C6189a02700G4478A4358
$$ -22436 -59657 -110997 -200106 91472 217660 -261091 89433 36189 -102700 74478 14358
9541a44402j23745a05851E4127c78972B35066b63715G25a40342a6530k59774D1390
$$ -144402 -268147 -105851 54127 -378972 235066 -263715 725 -140342 -16530 -276304 41390
9529f0939D6674a97322J2836j15558a2682m03408f9045E4793a23663a5559l89610
$$ -60939 46674 -197322 -184486 -300044 -12682 -416090 -69045 54793 -123663 -15559 -405169
9518d05169a85799C0705K80341A16372a82961j06636K1820d6601K3191k54562
$$ -405169 -185799 30705 311046 116372 -182961 -289597 -267777 -46601 -23410 -277972
9508b77972b8898p8431d5035j34892A8460B859a76569r6753A95539a44537j10075
$$ -277972 -28898 -107329 -45035 -179927 18460 2859 -176569 -273322 195539 -144537 -254612
9497b54612L8926E0280a82874K0249o6743O7664P5010A24298i7989p314G6934
$$ -254612 -215686 50280 -182874 -162625 -229368 -161704 -86694 124298 -97989 -105303 76934
9485A2633a67255c2083o3419E34282e1235q5412j45702e6580l46424J31959a05081
$$ 12633 -167255 -32083 -95502 534282 -51235 -136647 -282349 -56580 -403004 -271045 -105081
9473B67403b43447B41444p9162c599j119B82004L209a0457j96346h2338l0468
$$ 267403 -243447 241444 162282 -3599 -4718 282004 285213 -10457 -206803 -82338 -112806
9462a12806N398j8882j00066j52444F6683c37372P6140N4918B9735a60814f9154
$$ -112806 -107408 -126290 -226356 -378800 66683 -337372 -261232 -206314 29735 -160814 -69154
9450B98613A15834a82536H3261C4995o02a4571A33281p511H352a84316j85438
$$ 298613 115834 -182536 83261 34995 34393 -14571 133281 125770 8352 -184316 -369754
9439c69754J69850K1723l1057F0229J76049R3926A2008g5905B35394E3582J19552
$$ -369754 -199904 -178181 -209238 60229 236278 330204 12008 -75905 235394 53582 173134
9428A73134a5403l98066a73197g9917j70840R5584B67839B8224i1132b2433j94591
$$ 173134 -15403 -413469 -173197 -79917 -250757 -155173 267839 28224 -91132 -22433 -217024
9417b17024G8478k71M2355c08088a43842G0890b87225p9168A69035O6638a6345
$$ -217024 78478 78207 120562 -308088 -143842 70890 -287225 -366393 169035 235673 -16345
9405G630J33790b06790O1565E064c66538E0825a46414O2668j52332j26251B82336
$$ 7630 141420 -206790 -145225 5064 -366538 50825 -146414 -83746 -236078 -362329 282336
9393a60479d6428m11809A67220a1422m8728C12695d7047G1729R0537b2408D7160
$$ -160479 -46428 -458237 167220 -11422 -60150 312695 -47047 71729 162266 -22408 47160
9381I7925C0560N3002a15217J1039n1934D4412a32466j3481N2344K7850l08539
$$ 97925 30560 83562 -115217 -104178 -156112 44412 -132466 -145947 -93603 -65753 -374292
9370c74292A43661A1964a40929k1634M9014C4931a41176C28K40698A04316a06549
$$ -374292 143661 11964 -140929 -162563 -113549 34931 -141176 328 241026 104316 -106549
9358B332a78280C4899K4747b0361o2086L8455j52821A14857R8439a77039A72053
$$ 2332 -178280 34899 59646 -20361 -82447 -43992 -196813 114857 213296 -177039 172053
9346b3468I7656a45544A84677c59637B46807D3183a9238B1809J19033M6616a93380
$$ -23468 97656 -145544 184677 -359637 246807 43183 -19238 21809 140842 187458 -193380
9334a90309A56812A5286c2123k48397A64150a83515j03487H8772a88149P7682
$$ -190309 156812 15286 -32123 -280520 164150 -183515 -287002 88772 -188149 -110467
9324a10467B36490e3664A00874C6508e3803p0741J1505b5436k76293J47504j15621
$$ -110467 236490 -53664 100874 36508 -53803 -124544 -113039 -25436 -301729 -154225 -269846
9313b69846o2484e5769j38610B7339K04989b29764O8346F4386c67333a41283A07668
$$ -269846 -332330 -55769 -194379 27339 232328 -229764 -161418 64386 -367333 -141283 107668
9301b78381A4923c61993A32804e0503A83611b58391H5027b80086A52923A1639
$$ -278381 14923 -361993 132804 -50503 183611 -258391 85027 -280086 152923 11639
9290A35090c54188b7540l2300M77o573q6194A63294f3707j0402C770d1633j11386
$$ 135090 -354188 -27540 -59840 -59363 -65936 -152130 163294 -63707 -74109 3770 -41633 -153019
9278a53019o3383b9395k61021a44703L5760j8548I4106a72321M293m6434J7363
$$ -153019 -216402 -29395 -290416 -144703 -108943 -127491 94106 -172321 -168028 -214462 -197099
9267a97099b7405k0325l2903j8377A23514K75036a76025A7097J22815a08614o5911
$$ -197099 -27405 -47730 -80633 -99010 123514 398550 -176025 17097 139912 -108614 -174525
9256a74525d6406F9662i6429k4452G2705d4436l8342K9699l5824k23798a55989
$$ -174525 -46406 69662 -96429 -120881 72705 -44436 -82778 -53079 -88903 -312701 -155989
9244a63615d5820j58311I9126l1014p487M7414b99792a41002A31351f1619r4821
$$ -163615 -45820 -204131 99126 68112 60625 108039 -299792 -141002 131351 -61619 -156440
9233a56440k77155b9618j51838c8933k70235C7901a05009j68731C54163c9063
$$ -156440 -433595 -29618 -181456 -38933 -309168 37901 -105009 -273740 354163 -39063
9222a28360k6262A59335K9241E6338j0488a20073j04985g7241c1541k29035i8534
$$ -128360 -154622 159335 188576 56338 45850 -120073 -225058 -77241 -31541 -260576 -98534
9210D1290b11850b1494p7376A78502b37853A72187G2583a93498G5829l495b48913
$$ 41290 -211850 -21494 -98870 178502 -237853 172187 72583 -193498 75829 72334 -248913
9198c07408A18030b21330b3788q6942k34853g6008n7497r997j73350B5695a60049
$$ -307408 118030 -221330 -23788 -110730 -345583 -76008 -133505 -143502 -316852 25695 -160049
9186f2372C4193b24626i0605o4608a2670A93964i1602c2743l5016G6665a04278
$$ -62372 34193 -224626 -90605 -155213 -12670 193964 -91602 -32743 -67759 76665 -104278
9174A8908B285a27948K0091k61833E8011M9454D4010I468K47383c9954A66825
$$ 18908 2285 -127948 -107857 -369690 58011 107465 44010 9468 256851 -39954 166825
9162h1706L1912p6879o4104e6291n6563j04720j06866h6026C4020i6651k8055
$$ -81706 -49794 -126673 -190777 -56291 -112854 -217574 -324440 -86026 34020 -96651 -124706
9151a24706C4745J64885h504q8030j19816A23956e5525E4004M1943C1076a19468
$$ -124706 34745 199630 -8504 -96534 -216350 123956 -55525 54004 95947 31076 -119468
9139a25886A51051b64096D7627f4298Q555A50556h4778j84025J11132j18236D72336
$$ -125886 151051 -264096 47627 -64298 -55743 150556 -84778 -268803 -157671 -275907 472336
9127A17523n1678d1410O273A75429F882a74680M8880j08770A37786f9196j19597
$$ 117523 65845 -41410 -35137 175429 6882 -174680 -125800 -234570 137786 -69196 -188793
9116a88793g8522I508f1179J2284C37960A45717c0359j11213B7833a91296A27555
$$ -188793 -78522 9508 -61179 -48895 337960 145717 -30359 -141572 27833 -191296 127555
9104i8265j54253Q7226l0612k37095I7280f2778A06292a86520j05737d010A01852
$$ -98265 -252518 -165292 -195904 -432999 97280 -62778 106292 -186520 -292257 -4010 101852
9092A12702M0957O690A2364b12055O5501j77071A7222M8187b21083A07329c6384
$$ 112702 153659 160349 12364 -212055 -146554 -323625 17222 65409 -221083 107329 -36384
9080b17159j19659C5575P7262B5873j1602J58772C226M05926a51043A05824b63850
$$ -217159 -336818 35575 112837 25873 14271 173043 3226 409152 -151043 105824 -263850
9068e0325q2482A77748c7173k92806P0464H6645l1494g2400G9306J4817D4511
$$ -50325 -132807 177748 -37173 -329979 -259515 86645 55151 -72400 79306 94123 44511
9056I4211B779L5146d2711p4590j24029g9646m6641M5514k86852A42566a84567
$$ 94211 2779 37925 -42711 -117301 -241330 -79646 -126287 -80773 -367625 142566 -184567
9044C0438a65548m759f5964k454j3185A03230b10621A2257d75197a2101k46329
$$ 30438 -165548 -170307 -65964 -68418 -81603 103230 -210621 12257 -475197 -12101 -258430
9033b58430I6496B2504b28347L3516F3850J89068A07203D2101h9041H7483L8829
$$ -258430 96496 22504 -228347 -194831 63850 252918 107203 42101 -89041 87483 126312
9022A26312C2965a2913A73558K5722a13253D258d6141l4453j50622a06383K432
$$ 126312 32965 -12913 173558 199280 -113253 4258 -46141 -80594 -231216 -106383 -103951
9011a03951j82605j48162E6358f4272B29677h0875j1961i102p0850k1789B54408
$$ -103951 -286556 -434718 56358 -64272 229677 -80875 -92836 -9102 -79952 -101741 254408
8999a0232k30862A81273C9569L03314b49339e7323O76J0439l4886D1831J11692
$$ -10232 -241094 181273 39569 342883 -249339 -57323 -56647 -46208 -81094 41831 153523
8988A53523J7492a11000k20179a36238A35946a79435A06235R9659a41467c648
$$ 153523 171015 -111000 -331179 -136238 135946 -179435 106235 205894 -141467 -3648
8977A89281J54111b57128M9006b0993j02173n6595l7362a02098j44425a02651
$$ 189281 343392 -257128 -208122 -20993 -123166 -179761 -217123 -102098 -246523 -102651
8966b7863k49489A39549c933B0255b5111D3345a17075e5314B5919h0348l7515
$$ -27863 -277352 139549 -3933 20255 -25111 43345 -117075 -55314 25919 -80348 -117863
8955a17863m839d9236C09584d43113h9192D1739N661b19693r9564A20234K60818
$$ -117863 -122702 -49236 309584 -443113 -89192 41739 47400 -219693 -319257 120234 381052
8944C81052d0271m9176p3327D2836c5159j15164E0815L82274a85623g7680o1780
$$ 381052 -40271 -89447 -162774 42836 -35159 -150323 50815 433089 -185623 -77680 -139460
8933a39460M1357l44520B37670b1712F2804b0540j57707p173B0716l198h4680
$$ -139460 -98103 -442623 237670 -21712 62804 -20540 -178247 -185420 20716 17518 -84680
8921A27697C2223J19943K62363M89391B15108a51416l00240B0155a50518b2344
$$ 127697 32223 152166 414529 903920 215108 -151416 -451656 20155 -150518 -22344
8910d4003l8148G606a35146k0759A38474b2947j71692A28174a35391j48917A5120
$$ -44003 -82151 7606 -135146 -155905 138474 -22947 -194639 128174 -135391 -284308 15120
8898A65631a13921b4357k14791c5084k6930A31022R483b11823K0795A7514O0721
$$ 165631 -113921 -24357 -239148 -35084 -62014 131022 140505 -211823 -191028 17514 78235
8887G8235C2642i3916r0790f7091m4526A47924l1746P0151e1239J4347I2606P1603
$$ 78235 32642 -93916 -184706 -67091 -111617 147924 116178 186329 -51239 -36892 92606 164209
8875A64209a27514B24383A9741a68649K8869f1148j03763d5026A10106a93225
$$ 164209 -127514 224383 19741 -168649 -139780 -61148 -164911 -45026 110106 -193225
8864c82160A4714b32246Q4424B04980a0488A58176O1907b48093A03703A8729L3359
$$ -382160 14714 -232246 -147822 204980 -10488 158176 220083 -248093 103703 18729 52088
8853E2088f4465A4157a7763o9490C60730A63643A60b77836J24027M9581o7997
$$ 52088 -64465 14157 -17763 -87253 360730 163643 160 -277836 -153809 -104228 -172225
8842a72225D1391c21803e0097j86900J12889k21317k5448J01906a24300B8312
$$ -172225 41391 -321803 -50097 -236997 -124108 -345425 -370873 -268967 -124300 28312
$$ [...]
##END NTUPLES=NMR SPECTRUM
##END=
