##TITLE=NES1047_924826_9270366_TrJqmCnVVd
##JCAMPDX= 6.0         $$ Bruker NMR JCAMP-DX V2.0
##DATA TYPE= NMR SPECTRUM
##DATA CLASS= NTUPLES
##ORIGIN= BRUKER
##OWNER= Administrator
$$ 1.72 TOPSPIN		Version 2.1
$$ 2015-07-11 17:39:47.956 -0700  Administrator@X
$$ Compression mode = diff/dup
##.OBSERVE FREQUENCY= 400.02188249412
##.OBSERVE NUCLEUS= ^1H
##.ACQUISITION MODE= SIMULTANEOUS (DQD)
##.ACQUISITION SCHEME= undefined
##.AVERAGES= 64
##.DIGITISER RES= 22
##SPECTROMETER/DATA SYSTEM= spect
##.PULSE SEQUENCE= noesygpps1d.comp
##.SOLVENT NAME= COFFEE_meoh
##.SHIFT REFERENCE= INTERNAL, COFFEE_meoh, 1, 14.96294
##AUDIT TRAIL= $$ (NUMBER, WHEN, WHO, WHERE, PROCESS, VERSION, WHAT)
$$ ##TITLE= Audit trail, TOPSPIN		Version 2.1
$$ ##JCAMPDX= 5.01
$$ ##ORIGIN= Bruker BioSpin GmbH
$$ ##OWNER= Administrator
$$ $$ E:\/data/COFFEE/nmr/NES1047_924826_9270366_TrJqmCnVVd/12/pdata/1/auditp.txt
$$ ##AUDIT TRAIL=  $$ (NUMBER, WHEN, WHO, WHERE, PROCESS, VERSION, WHAT)
(   1,<2015-07-11 17:39:42.456 -0700>,<Administrator>,<X>,<go>,<TOPSPIN 2.1>,
      <created by zg
	started at 2015-07-11 17:28:12.738 -0700,
	POWCHK enabled, PULCHK disabled,
       configuration hash MD5:
       21 0F 79 D6 B3 7B B4 F6 88 20 88 DB 03 48 BD 9F
       data hash MD5: 64K
       8C 42 37 CE 34 6B 96 6C 2D 43 D6 21 C7 F3 E9 93>)
(   2,<2015-07-11 17:39:45.816 -0700>,<Administrator>,<X>,<proc1d>,<TOPSPIN 2.1>,
      <Start of raw data processing
       efp LB = 0.3 FT_mod = 6 PKNL = 1 PHC0 = 0 PHC1 = 0 SI = 128K 
       data hash MD5: 128K
       EB D7 38 95 0E 7D BC 57 A3 CB 71 B1 34 7B B6 91>)
(   3,<2015-07-11 17:39:46.738 -0700>,<Administrator>,<X>,<proc1d>,<TOPSPIN 2.1>,
      <pk PHC0 = -83.6554 PHC1 = 0 
       data hash MD5: 128K
       9E F9 72 C6 EF E1 F6 5E 71 DA 41 A8 DE 59 33 1B>)
(   4,<2015-07-11 17:39:47.113 -0700>,<Administrator>,<X>,<proc1d>,<TOPSPIN 2.1>,
      <abs ABSG = 1 
       data hash MD5: 128K
       D3 E8 12 65 77 DD 76 E3 80 9C F3 AA 86 45 DE 1A>)
(   5,<2015-07-11 17:39:47.222 -0700>,<Administrator>,<X>,<proc1d>,<TOPSPIN 2.1>,
      <abs ABSG = 2 
       data hash MD5: 128K
       10 16 5D D9 A3 37 8A 33 38 FA BB 12 F8 4C 05 4B>)
(   6,<2015-07-11 17:39:47.300 -0700>,<Administrator>,<X>,<proc1d>,<TOPSPIN 2.1>,
      <abs ABSG = 3 
       data hash MD5: 128K
       FF DC 53 80 C1 78 D5 1A E4 97 3D 43 69 F0 A7 4A>)
(   7,<2015-07-11 17:39:47.394 -0700>,<Administrator>,<X>,<proc1d>,<TOPSPIN 2.1>,
      <abs ABSG = 4 
       data hash MD5: 128K
       DD BB FD 21 D2 89 C3 6C 03 01 72 6B E5 CD 05 12>)
(   8,<2015-07-11 17:39:47.488 -0700>,<Administrator>,<X>,<proc1d>,<TOPSPIN 2.1>,
      <abs ABSG = 5 
       data hash MD5: 128K
       CC 3D C9 77 AB 57 1D 05 00 7A 4F 00 88 AB F5 0D>)
$$ ##END=
$$ 
$$ $$ hash MD5
$$ $$ B9 D8 FB 30 A1 62 AE 3B 05 7F 06 93 3D 92 29 6C
##$RELAX= 
##$RELAX= 
##$RELAX= 
##$RELAX= 
##$RELAX= 
##$RELAX= 
##$RELAX= 
##$RELAX= 
$$ Bruker specific parameters
$$ --------------------------
##$DU= <E:\>
##$EXPNO= 12
$$ [...]
##$TP07= 0
##$TPNAME0= <>
##$TPNAME1= <>
##$TPNAME2= <>
##$TPNAME3= <>
##$TPNAME4= <>
##$TPNAME5= <>
##$TPNAME6= <>
##$TPNAME7= <>
##$TPOAL= (0..7)
0.5 0.5 0.5 0.5 0.5 0.5 0.5 0.5
##$TPOFFS= (0..7)
0 0 0 0 0 0 0 0
##$TUNHIN= 0
##$TUNHOUT= 0
##$TUNXOUT= 0
##$USERA1= <user>
##$USERA2= <user>
##$USERA3= <user>
##$USERA4= <user>
##$USERA5= <user>
##$V9= 5
##$VALIST= <valist>
##$VCLIST= <CCCCCCCCCCCCCCC>
##$VD= 0
##$VDLIST= <DDDDDDDDDDDDDDD>
##$VPLIST= <PPPPPPPPPPPPPPP>
##$VTLIST= <TTTTTTTTTTTTTTT>
##$WBST= 2048
##$WBSW= 25
##$XGAIN= (0..3)
0 0 0 0
##$XL= 0
##$YL= 0
##$YMAX_a= 8136013
##$YMIN_a= -17382880
##$ZGOPTNS= <>
##$ZL1= 120
##$ZL2= 120
##$ZL3= 120
##$ZL4= 120
##$ABSF1= 14.96294
##$ABSF2= -5.595242
##$ABSG= 5
##$ABSL= 3
##$ALPHA= 0
##$AQORDER= 0
##$ASSFAC= 0
##$ASSFACI= 0
##$ASSFACX= 0
##$ASSWID= 0
##$AUNMP= <proc_prof1d_extract.lims>
##$AXLEFT= 0
##$AXNAME= <>
##$AXNUC= <1H>
##$AXRIGHT= 0
##$AXTYPE= 0
##$AXUNIT= <>
##$AZFE= 0.1
##$AZFW= 0.1
##$BCFW= 0
##$BC_mod= 0
##$BYTORDP= 0
##$COROFFS= 0
##$CY= 15
##$DATMOD= 1
##$DC= 0
##$DFILT= <>
##$DTYPP= 0
##$F1P= 0
##$F2P= 0
##$FCOR= 0.5
##$FTSIZE= 131072
##$FT_mod= 6
##$GAMMA= 0
##$GB= 0
##$INTBC= 1
##$INTSCL= 1
##$ISEN= 128
##$LB= 0.3
##$LEV0= 0
##$LPBIN= 0
##$MAXI= 10000
##$MC2= 0
##$MEAN= 0
##$ME_mod= 0
##$MI= 0
##$NCOEF= 0
##$NC_proc= -2
##$NLEV= 6
##$NOISF1= 0
##$NOISF2= 0
##$NSP= 0
##$NTH_PI= 0
##$NZP= 0
##$OFFSET= 14.96294
##$PC= 1
##$PHC0= -83.6554
##$PHC1= 0
##$PH_mod= 1
##$PKNL= yes
##$PPARMOD= 0
##$PPDIAG= 0
##$PPIPTYP= 0
##$PPMPNUM= 2147483647
##$PPRESOL= 1
##$PSCAL= 4
##$PSIGN= 0
##$PYNMP= <proc.py>
##$REVERSE= no
##$SF= 400.020008858835
##$SI= 131072
##$SIGF1= 0
##$SIGF2= 0
##$SINO= 400
##$SIOLD= 131072
##$SPECTYP= <>
##$SREGLST= <1H.CDCl3>
##$SSB= 0
##$STSI= 131072
##$STSR= 0
##$SW_p= 8223.68421052631
##$SYMM= 0
##$S_DEV= 0
##$TDeff= 65536
##$TDoff= 0
##$TI= <>
##$TILT= no
##$TM1= 0
##$TM2= 0
##$TOPLEV= 0
##$USERP1= <user>
##$USERP2= <user>
##$USERP3= <user>
##$USERP4= <user>
##$USERP5= <user>
##$WDW= 1
##$XDIM= 131072
##$YMAX_p= 457068377
##$YMIN_p= -14530
##$CURPLOT= <Network HP LaserJet P1505>
##$CURPRIN= <$Network HP LaserJet P1505>
##$DFORMAT= <normdp>
##$LAYOUT= <+/1D_H.xwp>
##$LFORMAT= <normlp>
##$PFORMAT= <normpl>
##$SURQMSG= 1
$$ End of Bruker specific parameters
$$ ---------------------------------
##NTUPLES= NMR SPECTRUM
##VAR_NAME=  FREQUENCY,     SPECTRUM/REAL,   SPECTRUM/IMAG
##SYMBOL=    X,             R,               I
##VAR_TYPE=  INDEPENDENT,   DEPENDENT,       DEPENDENT
##VAR_FORM=  AFFN,          ASDF,            ASDF
##VAR_DIM=   131072,        131072,          131072
##UNITS=     HZ,            ARBITRARY UNITS, ARBITRARY UNITS
##FACTOR=    0.0627417313425164, 1,          1
##FIRST=     8223.62146879497, 2444,         -54831
##LAST=      0,             3337,            -54724
##MIN=       0,             -14530,          0
##MAX=       8223.62146879497, 457068377,    0
$$ Real data points
##PAGE= N=1
##DATA TABLE= (X++(R..R)), XYDATA
$$ [...]
63203I04248j0226j5541j9158k1704k4243k6478k7347k6668k5091k3019k0477
63192F64296j7666j4838j1987r255p050n279l079JL204N611P337R003J0665J2025
63178F42988J3221J4564J5938J7004J7686J7926J7491J6501J5621J5230J4989
63167H19159J4647J4563J4852J4780J3625J1566R044N953K116k084o210j0286
63155I01725j4153j7049j8633j9778k1438k3276k4270k4149k3374k2127k0295
63144F73183j8139j6111j4183j2178j0489r703r606r329q425p288o494o220o275
63131E38743o293n969n312m504l500k145p77j51m28q38o54O7R54J937K961L753
63115E17844M323N095O079O561O091N189M631M652N239O412P679P953O799N104
$$ plain form
63203 904248 894022 878481 859323 837619 813376 786898 759551 732883 707792 684773 664296
63192 664296 646630 631792 619805 610550 603500 598221 595142 595143 598347 603958 611295 620298 630963 642988
63178 642988 656209 670773 686711 703715 721401 739327 756818 773319 788940 804170 819159
63167 819159 833806 848369 863221 878001 891626 903192 912236 918189 920305 918221 912011 901725
63155 901725 887572 870523 851890 832112 810674 787398 763128 738979 715605 693478 673183
63144 673183 655044 638933 624750 612572 602083 592380 582774 573445 565020 557732 551238 545018 538743
63131 538743 532450 526481 521169 516665 513165 511020 510243 510092 509664 508826 508172 508239 509193 511130 514091 517844
63115 517844 522167 527262 533341 539902 545993 551182 555813 560465 565704 572116 579795 587748 594547 599651
63101E99651M015L725L861M300M920N280N215N139N105M386K741J322J297K231
63087F53188K797K536J936J361R41J062J853K504K152J195P72J176J742K073K370
63072F79658K654K726K886L729N089O032O114N980O506P863R613J1299J2785J4212
63058G77146J5772J7488J9370K1723K4759K7888L0121L1487L3222L5989L8819
63047A073784M0579M1699M3329M5447M6944M7321M7093M6618M5649M4188M2809
63036A565460M1876M1127M0270L9474L9036L8958L8939L8404L6592L2985K7650
63025A980771K0994J3292M714m489j4117k4085l3965m2795m9763n4806n8195n9889
63013A677667n9723n7915n4941n1105m6577m1583l6239l0447k4253j7929j1609
$$ plain form
63101 599651 603666 607391 611252 615552 620472 625752 630967 636106 641211 645597 648338 649660 650957 653188
63087 653188 655985 658521 660457 661818 662759 663821 665674 668178 670330 671525 672297 673473 675215 677288 679658
63072 679658 682312 685038 687924 691653 696742 702774 708888 714868 721374 729237 738850 750149 762934 777146
63058 777146 792918 810406 829776 851499 876258 904146 934267 965754 998976 1034965 1073784
63047 1073784 1114363 1156062 1199391 1244838 1291782 1339103 1386196 1432814 1478463 1522651 1565460
63036 1565460 1607336 1648463 1688733 1728207 1767243 1806201 1845140 1883544 1920136 1953121 1980771
63025 1980771 2001765 2015057 2019771 2015282 2001165 1977080 1943115 1900320 1850557 1795751 1737556 1677667
63013 1677667 1617944 1560029 1505088 1453983 1407406 1365823 1329584 1299137 1274884 1256955 1245346
63002A245346n282P04N786J0084J4368J8863K2959K6477L0117L3952L6543L6680
62990A476597L5240L4119L3903L3673L2681L1007K8799K6052K3110K0450J7884
62979A793515J4644J0195M427k701j0989j9665k7855l5264m1895m7489n1804n5025
62967A530094n7323n8426n8207n7146n5511n2756m8620m4224m0896l8393l5444
62956I83148l1777k8366k5772k3482k1056j8858j7250j5926j4425j2730j1130
62945G62376r820q840q142p708p648p949q050p271n932n272n739o207n596m453
62931F63749l940m027l866l443l543m288m937n080m962m659l940l041k720l302
62917F08001m330n100n146m432l597l590m458n010m386l269k640k054m96J606
$$ plain form
63002 1245346 1240064 1240768 1246554 1256638 1271006 1289869 1312828 1339305 1369422 1403374 1439917 1476597
62990 1476597 1511837 1545956 1579859 1613532 1646213 1677220 1706019 1732071 1755181 1775631 1793515
62979 1793515 1808159 1818354 1822781 1820080 1809091 1789426 1761571 1726307 1684412 1636923 1585119 1530094
62967 1530094 1472771 1414345 1356138 1298992 1243481 1190725 1142105 1097881 1056985 1018592 983148
62956 983148 951371 923005 897233 873751 852695 833837 816587 800661 786236 773506 762376
62945 762376 752556 743716 735574 727866 720218 712269 704219 696948 691016 685744 680005 673798 668202 663749
62931 663749 659809 655782 651916 648473 644930 640642 635705 630625 625663 621004 617064 614023 611303 608001
62917 608001 603671 598571 593425 588993 585396 581806 577348 572338 567952 564683 562043 559989 559493 561099
62903E61099K700K333J575J198P77j42j172j831k274k852l608m354m814m669m037
62888E39929l637l851l954l117j805j200j453j647j270p17k86K22Q28J262J532
62873E20836J891K254K439K720L286L460K580J356J117J850K259J708Q62L49J36
62858E49103L44J306K518K797J941J093J055J295J068M64j31p44j460k149k816
62843E55684l618m264m239l743l531l719l663l191k958l314l842m305m994n786
62829E00517n900n100m246m110m377m374m026l658l401l239l143k871k159j308
62815D48605r86j377k005k444k493j850m05J181K098K541L295M231M396L681L176
62800D61644L667M855O327Q012R427R734R119Q942R923J1241J2032J2684J3977
$$ plain form
62903 561099 563799 566132 567707 568905 569682 569540 568368 566537 564263 561411 557803 553449 548635 543966 539929
62888 539929 536292 532441 528487 525370 523565 522365 520912 519265 517995 517278 516992 517214 518042 519304 520836
62873 520836 522727 524981 527420 530140 533426 536886 539466 540822 541939 543789 546048 547756 548618 548967 549103
62858 549103 549447 550753 553271 556068 558009 559102 560157 561452 562520 562984 562853 562109 560649 558500 555684
62843 555684 552066 547802 543563 539820 536289 532570 528907 525716 522758 519444 515602 511297 506303 500517
62829 500517 494617 489517 485271 481161 476784 472410 468384 464726 461325 458086 454943 452072 449913 448605
62815 448605 447619 446242 444237 441793 439300 437450 437045 438226 440324 442865 446160 450391 454787 458468 461644
62800 461644 465311 470166 476493 484505 493932 503666 512785 521727 531650 542891 554923 567607 581584
62787E81584J5864J7879J9999K2346K4777K7321L0447L4325L8437M2332M6142
62776I01453M9972N3582N7064O0976O5281O8960P1209P2359P2986P2682P0290
62765A616814O4992N6864M6850L6273K5754J4577J795j1987k4907l5939m5604
62754A745482n4405o1795o7171p0671p2498p2483p0910o8731o6362o3296n9468
62743A017692n5815n2844m9705m5615m1162l7289l3926l0543k7276k4508k2043
62732E96966j9644j7689j6426j5222j3485j1670j0496r712q641p433o746o516
62720D53286n984m767l154j499k7J040J678K297L263M460N631O851Q286R856J1465
62705D92682J3167J4899J6552J8430K0999K4003K6609K8725L1319L5011L9275
$$ plain form
62787 581584 597448 615327 635326 657672 682449 709770 740217 774542 812979 855311 901453
62776 901453 951425 1005007 1062071 1123047 1188328 1257288 1328497 1400856 1473842 1546524 1616814
62765 1616814 1681806 1738670 1785520 1821793 1847547 1862124 1863919 1851932 1827025 1791086 1745482
62754 1745482 1691077 1629282 1562111 1491440 1418942 1346459 1275549 1206818 1140456 1077160 1017692
62743 1017692 961877 909033 859328 813713 772551 735262 701336 670793 643517 619009 596966
62732 596966 577322 559633 543207 527985 514500 502830 492334 482622 473981 466548 459802 453286
62720 453286 447302 442535 439381 437882 437855 438895 440573 442870 446133 450593 456224 463075 471361 481217 492682
62705 492682 505849 520748 537300 555730 576729 600732 627341 656066 687385 722396 761671
62694G61671M3439M7480N1343N4515N6940N9283O1485O2151O0327N6918N3130
62683A368682M8423M1347L1828K1212J0362q57j2359k3286l2854m0859m7227n1905
62671A312507n5211n7641n9138n9151n7579n5121n2577n0112m7298m3761l9724
62660G35194l5935l2907l0313k7550k4712k2428k0775j9075j6980j5028j3849
62649D75642j3393j3147j2532j1072q933p262p042p601p377o241n619o067o397
62636C62959n819n277n605n874m931l353k424k186j922j695j900k029j422o71
62622C17851p56j259r83k7L58j01j97Q61K306K976K688K145K071K683L579M086
62606C38281M094M259N091O225P137P980R174J0624J2066J3691J5663J7561J9058
$$ plain form
62694 761671 805110 852590 903933 958448 1015388 1074671 1136156 1198307 1258634 1315552 1368682
62683 1368682 1417105 1458452 1490280 1511492 1521854 1520997 1508638 1485352 1452498 1411639 1364412 1312507
62671 1312507 1257296 1199655 1140517 1081366 1023787 968666 916089 865977 818679 774918 735194
62660 735194 699259 666352 636039 608489 583777 561349 540574 521499 504519 489491 475642
62649 475642 462249 449102 436570 425498 416565 409303 402261 394660 387283 381042 375423 369356 362959
62636 362959 357140 351863 346258 340384 335453 332100 329676 327490 325568 323873 321973 319944 318522 317851
62622 317851 317095 315836 314853 314826 315184 315083 314886 315747 318053 321029 323717 325862 327933 330616 334195 338281
62606 338281 342375 346634 351725 357950 365087 373067 382241 392865 404931 418622 434285 451846 470904
62593D70904K0650K2888K5398K7583K9755L2567L5683L8016L9024L8919L7843
62582H19230L5728L2759K9116K4497J8599J1856M914k183r460j6147k1220k4639
62570I03050k7149k9177l0625l1447l1586l0781k9169k7673k6858k5974k4054
62559E88557k1442j9186j7435j5718j4336j4050j4531j4576j3853j3150j2842
62548D17438j2400j1641j1151j1094j0695r417p754o365n161l814k538j827j748
62535C21833j820j485n81N14J161J136Q99J080J939L413N202O598O922O520O657
62520C59988P853R182R826J0443J1990J4024J5419J6256J7700K0210K3060K5512
62508E41463K7462K9070L0610L2479L4515L5567L4663L2242K9393K6224K2013
$$ plain form
62593 470904 491554 514442 539840 567423 597178 629745 665428 703444 742468 781387 819230
62582 819230 854958 887717 916833 941330 959929 971785 976699 974516 965056 948909 927689 903050
62570 903050 875901 846724 816099 784652 753066 722285 693116 665443 638585 612611 588557
62559 588557 567115 547929 530494 514776 500440 486390 471859 457283 443430 430280 417438
62548 417438 405038 393397 382246 371152 360457 351040 343286 336921 331760 327946 325408 323581 321833
62535 321833 320013 318528 317947 318461 319622 320758 321657 322737 324676 328089 333291 339889 346811 353331 359988
62520 359988 367841 377023 386849 397292 409282 423306 438725 454981 472681 492891 515951 541463
62508 541463 568925 597995 628605 661084 695599 731166 765829 798071 827464 853688 875701
62497H75701J6534J0155L007m751j2052j7592k1355k4351k7017k8927k9966l0504
62485G08882l0457k9294k7097k4585k2080j9371j6599j4266j2445j0891r730r082
62473D82985q275o625m716l704l459k812j468k37O03J602K670K921K357K271L357
62458D67470M746N477N779O216O702P052P552Q309Q801Q634Q013P118N716L784
62444E61369J738l11k729n491p946r809j1480j3068j3971j3957j3747j3903j3834
62431D42861j2568j0075p302n257m358m272m129l194j504L44J971L359M466N277
62417D05619O105P219Q366R198R888J0639J1065J0901J0824J1457J1983J1105
62405E24369R029P112N727M004J673m52j979l399m771n476n594n990o667o608
$$ plain form
62497 875701 892235 902390 905397 900646 888594 871002 849647 825296 798279 769352 739386 708882
62485 708882 678425 649131 622034 597449 575369 555998 539399 525133 512688 501797 492067 482985
62473 482985 474710 468085 463369 459665 456206 453394 451926 451689 452292 453894 456564 459485 461842 464113 467470
62458 467470 472216 477693 483472 489688 496390 503442 510994 519303 528104 536738 544751 551869 557585 561369
62444 561369 563107 562796 560067 554576 546630 536821 525341 512273 498302 484345 470598 456695 442861
62431 442861 430293 420218 412916 407659 403301 399029 394900 391706 390202 390546 392517 395876 400342 405619
62417 405619 411724 418943 427309 436507 446395 457034 468099 479000 489824 501281 513264 524369
62405 524369 533398 540510 546237 550241 551914 551462 549483 546084 541313 535837 530243 524253 517586 510978
62391E10978n823n833p267q523p897n816l863k582j354L76K698N379P741R108
62377D87322R926J1668J4958J8803K2191K5433K9132L2865L5881L8312M0749M3239
62365H10479M5470M7339M8667M8957M8095M6527M4209M0178L3899K6141J7782
62354A257743Q754r40j0062j7132k2052k5674k8397l0195l1548l3169l4983l6264
62342I96081l6649l6251l5104l3206l0924k8656k6281k3470k0301j7185j4468
62331F93586j2494j1598j1549j1462j0663r269p614n769m015k968k661k233j194
62318F00097k75l22j075j818k586l790n241o515p782r268j0403j0480r895r668
62304E20979r866r602q472p009n672m349l036k149j779j272OJ824L394M264M669
$$ plain form
62391 510978 505155 499322 492055 483532 475635 469819 465956 463374 462020 462396 465094 470473 478214 487322
62377 487322 497248 508916 523874 542677 564868 590301 619433 652298 688179 726491 767240 810479
62365 810479 855949 903288 951955 1000912 1049007 1095534 1139743 1179921 1213820 1239961 1257743
62354 1257743 1266497 1265557 1255495 1238363 1216311 1190637 1162240 1132045 1100497 1067328 1032345 996081
62342 996081 959432 923181 888077 854871 823947 795291 769010 745540 725239 708054 693586
62331 693586 681092 669494 657945 646483 635820 626551 618937 613168 609153 606185 603524 601291 600097
62318 600097 599822 599500 598425 596607 594021 590231 584990 578475 570693 561425 551022 540542 530647 520979
62304 520979 511113 501511 493039 486030 480358 476009 472973 470824 469045 467773 467779 469603 472997 477261 481930
62289D81930N098N754O488P184P980Q902R596R774R777J0164J0769J0815J0103
62276E94334R450R629J0512J1495J2315J3059J3885J5007J6626J8646K0844K3386
62264G69188K6629L0339L3764L6642L9410M2168M4226M4931M4203M1874L7438
62253A190812L0888K3071J4644N585l814j2318j8925k3978k8296l1913l4449l6109
62241A075198l7387l8177l7970l6628l4264l0808k6437k2129j8896j6664j4549
62230G61289j2113r731p928o889o515o481o400o263o499p180p598p048n740m504
62216F60400l868l846m222m563m236k936j074P09K186L484M706N861O897P675
62202F67173Q230R143J1027J3608J5914J7599J9310K1535K3899K6021K8145L0386
$$ plain form
62289 481930 487028 492782 499270 506454 514434 523336 532932 542706 552483 562647 573416 584231 594334
62276 594334 603784 613413 623925 635420 647735 660794 674679 689686 706312 724958 745802 769188
62264 769188 795817 826156 859920 896562 935972 978140 1022366 1067297 1111500 1153374 1190812
62253 1190812 1221700 1244771 1259415 1265000 1261186 1248868 1229943 1205965 1177669 1145756 1111307 1075198
62241 1075198 1037811 999634 961664 925036 890772 859964 833527 811398 792502 775838 761289
62230 761289 749176 739445 731517 724628 718113 711632 705232 698969 692470 685290 677692 670644 664904 660400
62216 660400 656532 652686 648464 643901 639665 636729 635655 636364 638550 642034 646740 652601 659498 667173
62202 667173 675403 684546 695573 709181 725095 742694 762004 783539 807438 833459 861604 891990
62190H91990L2087L2522L1639K9557K6111K1483J6597J2235Q288M519J399n28
62178A107899j474j796j147R73M217P735J1191J4812J8666K2491K5877K8210K8797
62165A266451K7472K4679K0661J5298R095L515l62k876m887o589p973r674j2368
62152A322442j5723j8717k0608k1103k0159j8279j6444j5042j3468j1352r413
62141A142134q338p627o556n524n348n760n723m875l638k241o21J052K640M458
62127A094033O603Q375R284J0076J1637J3460J4502J5110J6630J9158K1256K2075
62115A262199K2411K3204K4200K4750K5029K5674K6743K7698K8289K8996L0514
62104A549707L2950L5508L7221L7998L8752M0327M2618M4921M6734M8035M9238
$$ plain form
62190 891990 924077 956599 988238 1017795 1043906 1065389 1081986 1094221 1102509 1107028 1108427 1107899
62178 1107899 1106425 1104629 1103482 1104455 1108672 1116407 1127598 1142410 1161076 1183567 1209444 1237654 1266451
62165 1266451 1293923 1318602 1339263 1354561 1363656 1367171 1366809 1363933 1359046 1352457 1344484 1334810 1322442
62152 1322442 1306719 1288002 1267394 1246291 1226132 1207853 1191409 1176367 1162899 1151547 1142134
62141 1142134 1133796 1126169 1119613 1114089 1108741 1102981 1097258 1092383 1088745 1086504 1085883 1086935 1089575 1094033
62127 1094033 1100636 1109011 1118295 1128371 1140008 1153468 1167970 1183080 1199710 1218868 1240124 1262199
62115 1262199 1284610 1307814 1332014 1356764 1381793 1407467 1434210 1461908 1490197 1519193 1549707
62104 1549707 1582657 1618165 1655386 1693384 1732136 1772463 1815081 1860002 1906736 1954771 2004009
62093B004009N1189N4584N8989O2853O4861O4847O3233O0424N7268N5198N5137
62082B652592N6605N8419N9630N9408N6879N1928M5622L9266L3627K9522K8079
62071C171577K9477L2189L4444L5828L6695L6834L5794L3835L1552K9073K6536
62060C533834K4666K3966K3992K4339K5510K7706K9692L0123K9372K8678K8271
62049C830149K7641K7119K7543K8769K9921L0787L1599L1853L0859K9169K7878
62038D153287K6742K4533K1221J8133J5844J3370R853N736J938j220l934o556
62026D278947r361j2115j4105j5293j6794j9254k1419k1660k0270j8756j7374
62015D092546j5160j2122r417p273m539o45L639P781J2272J7319K2205K6455L0366
$$ plain form
62093 2004009 2055198 2109782 2168771 2231624 2296485 2361332 2424565 2484989 2542257 2597455 2652592
62082 2652592 2709197 2767616 2827246 2886654 2943533 2995461 3041083 3080349 3113976 3143498 3171577
62071 3171577 3201054 3233243 3267687 3303515 3340210 3377044 3412838 3446673 3478225 3507298 3533834
62060 3533834 3558500 3582466 3606458 3630797 3656307 3684013 3713705 3743828 3773200 3801878 3830149
62049 3830149 3857790 3884909 3912452 3941221 3971142 4001929 4033528 4065381 4096240 4125409 4153287
62038 4153287 4180029 4204562 4225783 4243916 4259760 4273130 4282983 4288719 4290657 4289437 4285503 4278947
62026 4278947 4269586 4257471 4243366 4228073 4211279 4192025 4170606 4148946 4128676 4109920 4092546
62015 4092546 4077386 4065264 4055847 4048574 4044035 4043390 4047029 4054810 4067082 4084401 4106606 4133061 4163427
62002D163427L3889L6168L6721L6003L4322L1171K6126J9503J1863L747l846r718
61990D419376j3545j5933j7374j7991j8223j8719j9533k0421k1741k3932k6314
61979D205650k7817k8823l0742l3765l6661l8940m1359m4003m5709m6078m6334
61968C785419m7319m8216m8148m7629m7329m6738m5182m3107m1228l9260l6631
61957C294632l3690l1216k9233k7084k4268k0600j6193j1740q194n652l188j56
61945C083418L088O179R459J3183J6782J9594K1667K3396K5016K6800K8988L1204
61933C308774L2747L3785L5294L7493L9345M0160M0611M1628M3228M5267M8483
61922C746815N4043O2715P4931R0954J10336J32054J55818J82586K13319K47926
$$ plain form
62002 4163427 4197316 4233484 4270205 4306208 4340530 4371701 4397827 4417330 4429193 4432940 4429094 4419376
61990 4419376 4405831 4389898 4372524 4354533 4336310 4317591 4298058 4277637 4255896 4231964 4205650
61979 4205650 4177833 4149010 4118268 4084503 4047842 4008902 3967543 3923540 3877831 3831753 3785419
61968 3785419 3738100 3689884 3641736 3594107 3546778 3500040 3454858 3411751 3370523 3331263 3294632
61957 3294632 3260942 3229726 3200493 3173409 3149141 3128541 3112348 3100608 3092414 3086762 3083574 3083418
61945 3083418 3086506 3092685 3102144 3115327 3132109 3151703 3173370 3196766 3221782 3248582 3277570 3308774
61933 3308774 3341521 3375306 3410600 3448093 3487438 3527598 3568209 3609837 3653065 3698332 3746815
61922 3746815 3800858 3863573 3938504 4029458 4139794 4271848 4427666 4610252 4823571 5071497
61912E071497K85899L27145L71781M19976M72437N29958N91670O54420P14122
61903I438905P66116Q02872Q12165P79343O92608N47758L50846J18440j25380
61894A4183673l55063n49656o96113p90121q35524q41818q20017p79493p27553
61885G788315o70053o11085n52724m96178m42944l94322l50505l10934k75257
61876C684313k43361k14960j89777j67808j48854j32269j17493j04367r2634q1761
61866B191029p1618o2562n4488m6571l8430l0639k3653j7129j0905n577j356K717
61854A830818P409J1939J4991J6383J6817J6534J5289J3217J0663P528L679k50
61842A965017l317n288o449o662n447k914M6K631M800P042R648J2023J2858J1376
$$ plain form
61912 5071497 5357396 5684541 6056322 6476298 6948735 7478693 8070363 8724783 9438905
61903 9438905 10205021 11007893 11820058 12599401 13292009 13839767 14190613 14309053 14183673
61894 14183673 13828610 13278954 12582841 11792720 10957196 10115378 9295361 8515868 7788315
61885 7788315 7118262 6507177 5954453 5458275 5015331 4621009 4270504 3959570 3684313
61876 3684313 3440952 3225992 3036215 2868407 2719553 2587284 2469791 2365424 2272790 2191029
61866 2191029 2119411 2056849 2002361 1955790 1917360 1886721 1863068 1845939 1835034 1829457 1828101 1830818
61854 1830818 1838227 1850166 1865157 1881540 1898357 1914891 1930180 1943397 1954060 1961588 1965267 1965017
61842 1965017 1961700 1956412 1949963 1943301 1937854 1934940 1934986 1937617 1942417 1949459 1959107 1971130 1983988 1995364
61828A995364Q383N301K241j887p101j1468j3298j3125j2596j2136j0761p636
61816A921281k917K490P323J0545J2276J3698J5620J7769K0001K3201K8099L4072
61804B103458M0233M6935N4983O3899P2336P9988Q7886R6849J06758J17419J29235
61793B999979J42759J58247J75772J95381K17212K41870K70507L04035L42439
61784E048201L85439M33609M88380N51102O22526P02848P91718Q88320R91703
61775A0903846J100565J211923J319635J413575J478999J496065J441682J295348
61767B1661638J047246P04708K94152j42941n59850r16821j189747j371453j467556
61758A8059376j491285j459377j388727j294006j186813j075773r66700q62987
$$ plain form
61828 1995364 2003747 2009048 2011289 2009402 2002301 1990833 1977535 1964410 1951814 1939678 1928917 1921281
61816 1921281 1918364 1920854 1928177 1938722 1950998 1964696 1980316 1998085 2018086 2041287 2069386 2103458
61804 2103458 2143691 2190626 2245609 2309508 2381844 2461832 2549718 2646567 2753325 2870744 2999979
61793 2999979 3142738 3300985 3476757 3672138 3889350 4131220 4401727 4705762 5048201
61784 5048201 5433640 5867249 6355629 6906731 7529257 8232105 9023823 9912143 10903846
61775 10903846 12004411 13216334 14535969 15949544 17428543 18924608 20366290 21661638
61767 21661638 22708884 23413592 23707744 23564803 23004953 22088132 20898385 19526932 18059376
61758 18059376 16568091 15108714 13719987 12425981 11239168 10163395 9196695 8333708
61750H333708p66606o78909o00533n31140m69967m16379l69730l29069k93380
61741C877995k61925k34108k09334j87142j67110j48707j31754j16926j04867
61732B316122r4771q4888p4706o5530n8459n2975m8114m3962m1107l9490l8679
61721A673441l8527l8723l8358l6747l4243l1567k8931k6281k3695k0981j7752
61710A337636j4441j2349j1934j2004j1428j0703j0835j1576j1922j1761j1895
61699A206788j2825j4352j6024j7259j7585j7315j7341j7759j7638j6687j5953
61688A026050j6022j5790j4346j2799j2728j3663j3820j2704j1359j0411r445
61677H82963q152o753n325l843k751k474k529k108j231m14L81J497K611L098K970
$$ plain form
61750 8333708 7567102 6888193 6287660 5756520 5286553 4870174 4500444 4171375 3877995
61741 3877995 3616070 3381962 3172628 2985486 2818376 2669669 2537915 2420989 2316122
61732 2316122 2221351 2136463 2061757 1996227 1937768 1884793 1836679 1792717 1751610 1712120 1673441
61721 1673441 1634914 1596191 1557833 1521086 1486843 1455276 1426345 1400064 1376369 1355388 1337636
61710 1337636 1323195 1310846 1298912 1286908 1275480 1264777 1253942 1242366 1230444 1218683 1206788
61699 1206788 1193963 1179611 1163587 1146328 1128743 1111428 1094087 1076328 1058690 1042003 1026050
61688 1026050 1010028 994238 979892 967093 954365 940702 926882 914178 902819 892408 882963
61677 882963 874811 868058 862733 858890 856139 853665 851136 849028 847797 847383 847764 849261 851872 854970 857940
61662H57940K646K195J732J901K940L845L645K851K530K532K065J430J579K258
61648H92089K141O99j369l399n199o332o350n656n043m455l321j791m68Q63K903
61633H55312N439P578R190J0832J2444J3401J3657J3526J2483R747N923K601L22
61620I72455j679l651m839m982m763m493l729k554j926k302l119l906m803n645
61606I20064n820n377n284o103p340q326q785q494p469o612o983q213q766q035
61592H18457o963o349n810m873l872l183k492j389J20K025M406O837Q594R703
61578H15211J0911J2518J4110J5606J7446J9581K1421K2980K4919K7192K8879
61567A030774K9771L0821L2511L3978L4382L4062L3638L2990L1899L0772K9966
$$ plain form
61662 857940 860586 862781 864513 866414 869354 873199 876844 879695 882225 884757 886822 888252 889831 892089
61648 892089 894230 894929 893560 890161 884962 878630 872280 866624 861581 857126 853805 852014 851546 852409 855312
61633 855312 860751 868329 877519 888351 900795 914196 927853 941379 953862 963609 969532 972133 972455
61620 972455 970776 967125 962286 957304 952541 948048 944319 941765 939839 937537 934418 930512 925709 920064
61606 920064 914244 908867 903583 897480 890140 881814 873029 864535 857066 850454 843471 835258 826492 818457
61592 818457 811494 805145 799335 794462 790590 787407 784915 783526 783646 785671 790077 796914 805508 815211
61578 815211 826122 838640 852750 868356 885802 905383 926804 949784 974703 1001895 1030774
61567 1030774 1060545 1091366 1123877 1157855 1192237 1226299 1259937 1292927 1324826 1355598 1385564
61556A385564K9106K7799K6333K5121K4101K3160K2428K1625J9940J7105J3850
61545A636132J0689O997K037l731r094j3407j6820j9566k1610k2846k3190k2637
61533A502954k1388j9769j7927j5937j4048j2374j0401p510m004r06J376L526
61521A383592O410J0236J4773J9729K4902L0393L6653M3745N0905N7627O4874
61510A743839P4132Q5432R7490J09681J22623J36787J51915J68106J86106K05951
61500C082062K26450K46375K64894K80245K89137K88296K75863K50845K12573
61491E416740J61931J02558L9983k0414p4597j20199j56528j83857k02253k11591
61481D751773k12860k08400k00242j88893j74326j57423j39727j22347j05716
$$ plain form
61556 1385564 1414670 1442469 1468802 1493923 1518024 1541184 1563612 1585237 1605177 1622282 1636132
61545 1636132 1646821 1653818 1655855 1652124 1643030 1629623 1612803 1593237 1571627 1548781 1525591 1502954
61533 1502954 1481566 1461797 1443870 1427933 1413885 1401511 1391110 1383600 1379596 1378690 1380066 1383592
61521 1383592 1390002 1400238 1415011 1434740 1459642 1490035 1526688 1570433 1621338 1678965 1743839
61510 1743839 1817971 1903403 2000893 2110574 2233197 2369984 2521899 2690005 2876111 3082062
61500 3082062 3308512 3554887 3819781 4100026 4389163 4677459 4953322 5204167 5416740
61491 5416740 5578671 5681229 5721212 5700798 5626201 5506002 5349474 5165617 4963364 4751773
61481 4751773 4538913 4330513 4130271 3941378 3767052 3609629 3469902 3347555 3241839
61472C241839q9961p4906o0136m5581l1773j9159p584L291J3450K2707L0998L8251
61460C021436M4316M9206N3001N5444N6074N4860N2281M8864M5137M1818L9345
61449C561782L7351L5430L4264L5042L7772M1178M4338M7429N0821N4422N8068
61438D037897O1526O3913O4090O1827N7617N1362M2422L1128J8918O600o226j9626
61426D471448l2455m3636n3121o0949o6418o8967o8968o7025o3295n7996n1807
61415C836811m5198l8139l0722k3271j5681p715j74N523R292J2562J6022J8505
61403C737815J8777J7119J4335J0477N496N9n148r925j3628j4881j3075r032l379
61390C735010M588J5438K8315M2236N7627P5280R4808J15419J37313J60918J85452
$$ plain form
61472 3241839 3151878 3076972 3016836 2971255 2939482 2920323 2912739 2916030 2929480 2952187 2983185 3021436
61460 3021436 3065752 3114958 3167959 3223403 3279477 3334337 3386618 3435482 3480619 3522437 3561782
61449 3561782 3599133 3634563 3668827 3703869 3741641 3782819 3827157 3874586 3925407 3979829 4037897
61438 4037897 4099423 4163336 4227426 4289253 4346870 4398232 4440654 4471782 4490700 4497300 4491074 4471448
61426 4471448 4438993 4395357 4342236 4281287 4214869 4145902 4076934 4009909 3946614 3888618 3836811
61415 3836811 3791613 3753474 3722752 3699481 3683800 3676085 3675911 3681434 3690726 3703288 3719310 3737815
61403 3737815 3756592 3773711 3788046 3798523 3804019 3804078 3798930 3789005 3775377 3760496 3747421 3738389 3735010
61390 3735010 3739598 3755036 3783351 3825587 3883214 3958494 4053302 4168721 4306034 4466952 4652404
61379D652404K09575K32899K55538K76618K94384L07227L13404L10180K94637
61370G146866K65357K22820J68906J07268M3631j5978o7962j11886j48990j80644
61360G429388k07675k30146k47720k60675k70076k76464k79022k76880k70626
61351E110104k61577k50185k36257k20352k03719j86948j69698j51843j34085
61342C295440j17260j01583q6689p2111n7806m4336l2305k1535j1354j679O949
61331B755731J4582K2056K9502L5793M0236M3679M7039M9705N0551M9717M8171
61320C186762M6157M3392M0232L7461L5115L2716L0419K8877K8142K7572K6639
61309C563484K4957K1875J7096J1515O466K216k003o632j1439j6381k1822k7729
$$ plain form
61379 4652404 4861979 5094878 5350416 5627034 5921418 6228645 6542049 6852229 7146866
61370 7146866 7412223 7635043 7803949 7911217 7954848 7938870 7870908 7759022 7610032 7429388
61360 7429388 7221713 6991567 6743847 6483172 6213096 5936632 5657610 5380730 5110104
61351 5110104 4848527 4598342 4362085 4141733 3938014 3751066 3581368 3429525 3295440
61342 3295440 3178180 3076597 2989908 2917797 2859991 2815655 2783350 2761815 2750461 2748782 2755731
61331 2755731 2770313 2792369 2821871 2857664 2897900 2941579 2988618 3038323 3088874 3138591 3186762
61320 3186762 3232919 3276311 3316543 3354004 3389119 3421835 3452254 3481131 3509273 3536845 3563484
61309 3563484 3588441 3610316 3627412 3638927 3645393 3647609 3645606 3638974 3627535 3611154 3589332 3561603
61297C561603l3461l8589m3331m8025n2598n6675n9878o2005o3081o3117o1739
61286B979104n8411n3183m6801l9856l2423k4756j7645j1658o594k093J787M912
61274B692383P238Q328P558N339L131J589m04m089r126j4404j9512k4369k8147
61261B625515k9786k9126k6498k1676j4234m493O708J8851L1618M4534N7543P1304
61249B730260Q6066J00820J14404J26633J37384J45300J48595J46475J38604J23797
61239C998338J00666O9326L1501j0536n4028r5318j30831j58476j77393j87121
61229C386128j88277j83365j75222j64844j51921j37090j22065j07781r4083q1340
61219A980140p0845o3232n7642n2773m7856m2502l6659l0836k5567k0621j5482
$$ plain form
61297 3561603 3528142 3489553 3446222 3398197 3345599 3288924 3229046 3167041 3103960 3040843 2979104
61286 2979104 2920693 2867510 2820709 2780853 2748430 2723674 2706029 2694371 2687777 2685684 2687471 2692383
61274 2692383 2699621 2707949 2715507 2720846 2723977 2725566 2725162 2721073 2711947 2697543 2678031 2653662 2625515
61261 2625515 2595729 2566603 2540105 2518429 2504195 2499702 2506410 2525261 2556879 2601413 2658956 2730260
61249 2730260 2816326 2917146 3031550 3158183 3295567 3440867 3589462 3735937 3874541 3998338
61239 3998338 4099004 4168330 4199831 4189295 4135267 4039949 3909118 3750642 3573249 3386128
61229 3386128 3197851 3014486 2839264 2674420 2522499 2385409 2263344 2155563 2061480 1980140
61219 1980140 1909295 1846063 1788421 1735648 1687792 1645290 1608631 1577795 1552228 1531607 1516125
61208A516125j0397n911j679L089Q188J2733J6726K0853K4609K6133K4385K0299
61196A655153J5430J0611O344L247J387o1j869m033o327q869j1829j5204j9104
61183A624876k3555k7818l0720l1947l2380l2857l3309l3283l2624l1306k9256
61172A285821k6721k4261k2153k0242j8550j7452j7035j6846j6416j5668j4717
61161A075760j3808j3352j3448j3321j2044r949q641r389j2117j6125k0885k5653
61149I07028k9075l0011k8659k6240k3692k1011j7936j4756j2128j0196q320n976
61137F79028l599k000j133j84J153K335L153M270N981P410P727P480P738Q509
61123G27868R046R320R973J0989J1565J1385J1112J1405J2172J2886J3122J2689
$$ plain form
61208 1516125 1505728 1499817 1498138 1501227 1509415 1522148 1538874 1559727 1584336 1610469 1634854 1655153
61196 1655153 1670583 1681194 1687538 1690785 1692172 1692111 1690242 1686209 1679882 1671013 1659184 1643980 1624876
61183 1624876 1601321 1573503 1542783 1510836 1478456 1445599 1412290 1379007 1346383 1315077 1285821
61172 1285821 1259100 1234839 1212686 1192444 1173894 1156442 1139407 1122561 1106145 1090477 1075760
61161 1075760 1061952 1048600 1035152 1021831 1009787 999838 991197 981808 969691 953566 932681 907028
61149 907028 877953 847942 819283 793043 769351 748340 730404 715648 703520 693324 685004 679028
61137 679028 675429 673429 672296 672112 673265 675600 678753 683023 689004 696414 704141 711621 719359 727868
61123 727868 736914 746234 756207 767196 778761 790146 801258 812663 824835 837721 850843 863532
61111H63532J1719J0559R201P037L683k64l860o852r402j1245j1992j2090j2463
61098H37563j3215j3599j3334j3103j3486j4171j4519j4399j4142j3982j3833
61087F85780j3463j2780j1983j1279j0448r109p511o430n992n319l840k267j500
61074E83859j233n61N55J488K200L208M361M823M361L757L718M124M621N165N687
61059F30133N727M924L539K241J490J367J786K678L927N247O341P175P956Q687
61045F93218R130R425J0272J1927J3463J3817J3248J2842J2880J2781J2450J2341
61033H37794J2190J1078R061P336O445N648M559L952M264M627M185L307K740K648
61019I19834L122M481O400P862Q660R821J1930J4264J6247J8465K1436K4581K7233
$$ plain form
61111 863532 875251 885810 895011 902048 905731 905467 901607 894755 885353 874108 862116 850026 837563
61098 837563 824348 810749 797415 784312 770826 756655 742136 727737 713595 699613 685780
61087 685780 672317 659537 647554 636275 625827 616718 609207 602777 596785 591466 587626 585359 583859
61074 583859 582626 582065 582620 584108 586308 589516 593877 598700 603061 606818 610536 614660 619281 624446 630133
61059 630133 635860 640784 644323 646564 648054 649421 651207 653885 657812 663059 669400 676575 684531 693218
61045 693218 702348 711773 722045 733972 747435 761252 774500 787342 800222 813003 825453 837794
61033 837794 849984 861062 870123 877459 883904 889552 894111 898063 902327 906954 911139 914446 917186 919834
61019 919834 922956 927437 933837 941699 950359 960180 972110 986374 1002621 1021086 1042522 1067103 1094336
61006A094336K9642L2374L5761M0364M6648N3786O0082O4811O8269P0280P0791
60995A667144P1859P6412Q4605R4014J03624J14618J26784J37764J46881J56347
60985B780052J68008J82968K05232K40666K90654L51669M22482N05713O01216
60976E748660P07219Q31847R93506J205145J471531J806252K217171K631831K847651
60967B0460813K626351J899888Q83237n0555o21578p72235n87587j67710L73458
60958B4044082Q28008R17935M74772l99539j378641k132159k510946k556260k389476
60949A4897776k119712j821532j541391j298453j089983r08814p54122o25677
60941D738092n18176m26892l52547k95950k52975k18857j92633j73650j58160
$$ plain form
61006 1094336 1123978 1156352 1192113 1232477 1279125 1332911 1392993 1457804 1526073 1596353 1667144
60995 1667144 1739003 1815415 1900020 1994034 2097658 2212276 2339060 2476824 2623705 2780052
60985 2780052 2948060 3131028 3336260 3576926 3867580 4219249 4641731 5147444 5748660
60976 5748660 6455879 7287726 8281232 9486377 10957908 12764160 14981331 17613162 20460813
60967 20460813 23087164 24987052 25870289 25819734 25198156 24425921 23838334 23670624 24044082
60958 24044082 24872090 25790025 26264797 25865258 24486617 22354458 19843512 17287252 14897776
60949 14897776 12778064 10956532 9415141 8116688 7026705 6117891 5363769 4738092
60941 4738092 4219916 3793024 3440477 3144527 2891552 2672695 2480062 2306412 2148252
60932B148252j43267j30228j20242j10677r9034q7043p7149o8175n8370m9822
60922A204245m5760m5555m5951m5490m4472m2384l8630l4422l1162k8172k4444
60911G77803k0963j9001j7683j5651j3557j2563j1962j0485q554p188o155n094
60899F28947m745n196m813k813r04l85J91K253M391M823M595N597P249P911P890
60884F54991Q214Q065O258L859K491J424q62l536m710m718n271o381o928p364
60870F45532q851j0508j0409q827p826p966p939p080n859m257j956J66Q63O04
60856E65687Q55J829K732L599M914O085O372O682Q352J0838J2618J3787J5507
60843F59857J7590J8826J9312K0147K1120K0852J9052J6746J4424J1833R325P642
$$ plain form
60932 2148252 2004985 1874757 1754515 1643838 1544804 1457761 1380612 1312437 1254067 1204245
60922 1204245 1158485 1112930 1066979 1021489 977017 934633 896003 861581 830419 802247 777803
60911 777803 756840 737839 720156 704505 690948 678385 666423 655938 647384 640196 634041 628947
60899 628947 624202 619006 614193 611380 610476 610091 610282 612535 616926 621749 626344 631941 639190 647101 654991
60884 654991 663205 671270 677528 681387 683878 685302 684440 680904 676194 671476 666205 659824 652896 645532
60870 645532 636681 626173 615764 606937 599111 591145 583206 576126 570267 566010 564054 564220 565083 565687
60856 565687 566542 568371 571103 574702 579616 585701 592073 598755 607107 617945 630563 644350 659857
60843 659857 677447 696273 715585 735732 756852 777704 796756 813502 827926 839759 849084 856726
60831H56726O581N492M649M580M547L429J579K18m71j078j501j455j686k959m480
60816H74171n080n206o060p602r140j0929j3218j4703j4125j2533j1809j1733
60804G52033j0722q762p225o295m936l003j246M08K472M299M979N308O722Q705
60790G42737R481Q830Q014P335N992M034K297O84j291k778k584j528j457k349
60776G77417k611j813p60O44L024N412O202O003O922R093J0664J1080J1574J2226
60762H55077J1549R424P666P000O121M502L526L893M220L352K024J271J048J298
60748I21971K599M808O582P006O399N096K969N21j140j793k199k546k347j974
60734I45952k538m050n410o369p762r700j1321j2445j3640j4594j4352j3268j2703
$$ plain form
60831 856726 863307 868799 873448 878028 882575 886004 887583 887801 887330 886252 884751 883296 881610 878651 874171
60816 874171 869091 863885 857825 850223 841083 830154 816936 802233 788108 775575 763766 752033
60804 752033 741311 732549 725324 719029 714093 711090 709844 710252 712724 717023 722002 727310 734032 742737
60790 742737 752218 761048 769062 776397 782389 786423 788720 789404 788113 785335 782751 781223 779766 777417
60776 777417 774806 772993 772233 772877 775901 781313 787515 793518 800440 809533 820197 831277 842851 855077
60762 855077 866626 876050 883716 890716 896837 901339 904865 908758 912978 916330 918354 919625 920673 921971
60748 921971 924570 929378 935960 942966 949365 954461 957430 957951 956811 955018 952819 950273 947926 945952
60734 945952 943414 939364 933954 927585 919823 910123 898802 886357 872717 858123 843771 830503 817800
60721H17800j2687j1949j0454r648r843r611q315p071o589o102n135m380m080
60708G11936l430k147q80L42K281M657O113O540P368R042J0254J0267R865R302
60694G81510P517M269J068j098l062n588q003r688j1204j2872j3918j3956j3765
60681G01210j3717j3034j1429r827q667p099m751k595j183L00K287L773M098M206
60667F43572N061O202O849P145P378P235O691O361O261N547M098K957K566K126
60653G20049J377J389K755M541N822O847P859Q304P963P466P003O033M890M923
60639G97221O287P353P205P003P806Q793Q757P899O968O029N068M529M282L420
60625H88620J898R37J084J297P35k16j347l291n831p449p614p729q687r338q671
$$ plain form
60721 817800 805113 793164 782710 773062 763219 753608 745293 738222 731633 725531 720396 716016 711936
60708 711936 708506 706359 705479 705821 708102 712759 718872 725412 732780 741822 752076 762343 772208 781510
60694 781510 789027 793296 794364 793266 790204 784616 776613 766925 755721 742849 728931 714975 701210
60681 701210 687493 674459 663030 653203 644536 637437 632686 630091 628908 629208 631495 635268 639366 643572
60667 643572 648633 654835 661684 668829 676207 683442 690133 696494 702755 708302 712400 715357 717923 720049
60653 720049 721426 722815 725570 730111 735933 742780 750639 758943 766906 774372 781375 787408 792298 797221
60639 797221 803508 810861 818066 825069 832875 841668 850425 858324 865292 871321 876389 880918 885200 888620
60625 888620 890518 891455 892539 893836 894571 894355 893008 889717 883886 876437 868823 861094 852407 843069 834398
60610H34398p655p431p341o360m922l785k429k23K078L480M278N075N440M921
60596H19524M145L656K853J379L17N98J445J830K132K995L743L624L425M163N134
60581H60963M964L805K821K070N96j871m572o818q303q884q946r396j0430j1013
60567H04986j0445r602r669j0515j1209j1310j0739r285p256n703n100m566l271
60554F96316j634l58P39K014L179M048N108O525P631Q126Q701R702J0592J1471
60540G72160J3554J7214K1099K4316K7824L2284L6266L8100L7954L6349L2223
60529A089343K4550J4678M941m065j2789k0194k4207k4467k2597j9870j6287j1794
60517I77242o913k061K575O501R197J0771J1543J1476J0770J0340J0721J1224
$$ plain form
60610 834398 826743 819312 811971 805611 800689 796904 794475 794252 796330 799810 804088 809163 814603 819524
60596 819524 823669 827325 830178 831557 831874 832472 833917 835747 837879 840874 844617 848241 851666 855829 860963
60581 860963 865927 869732 872553 874623 875219 873348 868776 861958 853655 844771 835825 826429 815999 804986
60567 804986 794541 784939 775270 764755 753546 742236 731497 722212 714956 709253 704153 699587 696316
60554 696316 694682 694324 695063 697077 700256 704304 709412 715937 723568 731694 740395 750097 760689 772160
60540 772160 785714 802928 824027 848343 876167 908451 944717 982817 1020771 1057120 1089343
60529 1089343 1113893 1128571 1133512 1129447 1116658 1096464 1072257 1047790 1025193 1005323 989036 977242
60517 977242 970329 968268 970843 977344 986541 997312 1008855 1020331 1031101 1041441 1052162 1063386
60505A063386J1170J1284J2751J5589J9083K3245K8714L5579M3397N2046O1759
60494A378003P2659Q4955R9032J14761J31347J48488J66928J87442K10199K35785
60484B829599K65612L00125L36676L69117L88484L84532L49382K81750J87220
60475E692497P4355m7720j67790k72157l49115l94003m09268m01066l76809l43736
60465C005188l07094k69610k33408k01125j74091j51023j30187j11695r6308q3440
60455A247207p2078o2360n4593m7834m1195l5390l1313k8174k4811k1668j9729
60444H08062j8601j7410j6483j6281j5804j4065j2075j1290j1037r702p570o281
60432F51463o090n843n183m614l854k180j64Q31P07M89N31N51Q93K060L382L906
$$ plain form
60505 1063386 1074556 1085840 1098591 1114180 1133263 1156508 1185222 1220801 1264198 1316244 1378003
60494 1378003 1450662 1535617 1634649 1749410 1880757 2029245 2196173 2383615 2593814 2829599
60484 2829599 3095211 3395336 3732012 4101129 4489613 4874145 5223527 5505277 5692497
60475 5692497 5766852 5719132 5551342 5279185 4930070 4536067 4126799 3725733 3348924 3005188
60465 3005188 2698094 2428484 2195076 1993951 1819860 1668837 1538650 1426955 1330647 1247207
60455 1247207 1175129 1112769 1058176 1010342 969147 933757 902444 874270 849459 827791 808062
60444 808062 789461 772051 755568 739287 723483 709418 697343 686053 675016 665314 657744 651463
60432 651463 645373 639530 634347 629733 625879 623699 623535 624366 625073 625562 626093 626644 627537 629597 632979 636885
60416F36885M055M713N262M514L004K412K960L432L447L723M269M231L605L270
60402F89782L372L227K764K487K117R23o99j524j340j045j044r17m66J67J183
60387F98987K658L784L898L742M352N252N290M590M022L377J890J48m32K34R74
60372G42766J350J914K667L014L058L388L808L709L360L380L413K898K590L550
60358G84865N151N855N544N334N505N501N572O516Q054R289J0351J1835J3063
60345H82435J2996J2341J2656J3643J3584J2082J0135P807M306L10k359l596n070
60332I71270p062p783o420m525l564l082k208j103j21Q41J375N47j499l311m131
60317I29224m738n827o997p773q279q416p744o580n899n775n268m111l162k834
$$ plain form
60416 636885 640940 645653 650915 655429 658433 660845 663805 667237 670684 674407 678676 682907 686512 689782
60402 689782 693154 696381 699145 701632 703749 704672 703973 702449 701109 700064 699020 698103 697637 697804 698987
60387 698987 701645 705429 709327 713069 717421 722673 727963 732553 736575 739952 741842 741990 741558 741792 742766
60372 742766 744116 746030 748697 751711 754769 758157 761965 765674 769034 772414 775827 778725 781315 784865
60358 784865 790016 795871 801415 806749 812254 817755 823327 829843 837897 847186 857537 869372 882435
60345 882435 895431 907772 920428 934071 947655 959737 969872 977679 981985 982295 979936 976340 971270
60332 971270 964208 956425 950005 945480 941916 938834 936626 935523 935402 936243 937618 938165 936666 933355 929224
60317 929224 924486 918659 911662 903889 895610 887194 879450 872870 866971 861196 855928 851817 848655 845821
60303H45821k467j667r42o41l96Q7P24J618K873L914M160M228N119O433O828O071
60287H81763N088M114K557O72l98m68n69j134j490j292r61m77P67K672M346N474
60271I00664O506P449P946Q413R662J1429J2711J3537J4855J6811J8722K0633
60259A049338K3223K6282K8996L1633L5256L9717M3809M7366N1482N6544O1792
60248A495438O6875P2250P8029Q4028R0814R8965J07477J14649J20263J25075
60238B453863J28600J29542J28015J25053J20182J11962J00874Q9040P6944O3072
60228C527147M6974L0128J3349l947k1286l6464m8090n6654o2487o4944o4116
60217C259610o1101n5966m7805l7209k6207j5223k657J1809K6211L9434N2660
$$ plain form
60303 845821 843354 841687 840745 840104 839708 839795 840519 842137 845010 848924 853084 857312 862431 868864 875692 881763
60287 881763 886851 890965 893522 894194 893796 893328 892759 891625 890135 888843 887882 887405 888172 890844 895190 900664
60271 900664 907170 914619 922565 930978 940640 952069 964780 978317 993172 1009983 1028705 1049338
60259 1049338 1072561 1098843 1127839 1159472 1194728 1234445 1278254 1325620 1377102 1433646 1495438
60248 1495438 1562313 1634563 1712592 1796620 1887434 1986399 2093876 2208525 2328788 2453863
60238 2453863 2582463 2712005 2840020 2965073 3085255 3197217 3298091 3387131 3464075 3527147
60228 3527147 3574121 3604249 3617598 3613651 3592365 3555901 3507811 3451157 3388670 3323726 3259610
60217 3259610 3198509 3142543 3094738 3057529 3031322 3016099 3013442 3025251 3051462 3090896 3143556
60206C143556O6613Q0116R2537J05098J18248J30038J38542J43628J45139J41685
60196D305200J32861J20439J05797Q8209O7299M5023K3357J840k0728m3625o4962
60185D760710q3697r9421j11386j19162j23046j22823j17550j07529r4873q1064
60175C700159o5632m8278l0338j2839N031K4019M2946O0265P5937R0244J02054
60164C943568J09719J12495J10054J01978Q8908P2787N4970L5480J4980m400k1261
60153D619278l6162m9336n9086o3923o4606o2520n7497m8780l6706k2014m798
60142D113850J4573L4826N5363P7044J00298J24071J47748J72446J99050K26626
60132E265895K54143K82064L10674L38501L63867L86407M05423M18500M23535
$$ plain form
60206 3143556 3210169 3290285 3382822 3487920 3606168 3736206 3874748 4018376 4163515 4305200
60196 4305200 4438061 4558500 4664297 4752506 4819805 4864828 4888185 4890025 4869297 4825672 4760710
60185 4760710 4677013 4577592 4466206 4347044 4223998 4101175 3983625 3876096 3781223 3700159
60175 3700159 3634527 3586249 3555911 3543072 3548103 3572122 3615068 3675333 3751270 3841514 3943568
60164 3943568 4053287 4165782 4275836 4377814 4466722 4539509 4594479 4629959 4644939 4640539 4619278
60153 4619278 4583116 4533780 4474694 4410771 4346165 4283645 4226148 4177368 4140662 4118648 4113850
60142 4113850 4128423 4163249 4218612 4295656 4395954 4520025 4667773 4840219 5039269 5265895
60132 5265895 5520038 5802102 6112776 6451277 6815144 7201551 7606974 8025474 8449009
60123H449009M20791M11156L93794L67472L33037K92697K47717J98364J45247
60114A1259284Q9211L0730k9361q9355j47864k04348k57504l04454l42524l70544
60104I633271l87601l92438l85303l68690l44958l14821k79325k41165k02384
60095F716586j62605j21340q0287m1536n187K9345O1264Q9505J14340J35713J51392
60084F887190J58768J57396J48022J30566J05159P3977M0094N502k8258n9027
60074G619389q5589j09084j30909j50431j66520j79832j91501k00814k06305k07954
60064E990450k06267k00560j90305j77006j62466j46268j27291j06592q6365o6879
60054D520451m6789k5826m854J6067L7452N8659P8450R6826J14427J30570J43585
$$ plain form
60123 8449009 8869800 9280956 9674750 10042222 10375259 10667956 10915673 11114037 11259284
60114 11259284 11348495 11379225 11349864 11260509 11112645 10908297 10650793 10346339 10003815 9633271
60104 9633271 9245670 8853232 8467929 8099239 7754281 7439460 7160135 6918970 6716586
60095 6716586 6553981 6432641 6352354 6310818 6305631 6334976 6396240 6485745 6600085 6735798 6887190
60084 6887190 7045958 7203354 7351376 7481942 7587101 7661078 7701172 7706674 7678416 7619389
60074 7619389 7533800 7424716 7293807 7143376 6976856 6797024 6605523 6404709 6198404 5990450
60064 5990450 5784183 5583623 5393318 5216312 5053846 4907578 4780287 4673695 4587330 4520451
60054 4520451 4473662 4447836 4442982 4459049 4496501 4555160 4633610 4730436 4844863 4975433 5119018
60043E119018J52506J56720J54830J45818J30792J11794Q9536O3907L5860O912
60033F167693k2437n2026q0512j06227j28765j48047j62850j72018j76145j76197
60023D942469j71611j61756j48160j33023j16573r8020p8170n8679l9538j9728
60013C917211L87J9714L8814N9191Q0714J02004J22875J44052J64932J83935K00553
60002E034382K14597K23886K25273K17937K03485J83163J57326J27462R6009O3921
59992F747441L0555l883l7985p1240j04166j35919j63733j85310k00042k07659
59982E668059k07426j99320j84663j65235j42665j18574r4122o9466m4640k0485
59972D421463K180K3553M3889O2454P8820R3986J08647J21440J30732J36840J40452
$$ plain form
60043 5119018 5271524 5428244 5583074 5728892 5859684 5971478 6061014 6124921 6160781 6167693
60033 6167693 6145256 6093230 6012718 5906491 5777726 5629679 5466829 5294811 5118666 4942469
60023 4942469 4770858 4609102 4460942 4327919 4211346 4113326 4035156 3976477 3936939 3917211
60013 3917211 3917598 3937312 3976126 4035317 4116031 4218035 4340910 4484962 4649894 4833829 5034382
60002 5034382 5248979 5472865 5698138 5916075 6119560 6302723 6460049 6587511 6683520 6747441
59992 6747441 6777996 6774113 6736128 6664888 6560722 6424803 6261070 6075760 5875718 5668059
59982 5668059 5460633 5261313 5076650 4911415 4768750 4650176 4556054 4486588 4441948 4421463
59972 4421463 4423643 4447196 4491085 4553539 4632359 4726345 4834992 4956432 5087164 5224004 5364456
59961E364456J40210J34375J23861J10952R5952P7976N8466M0610K5326J0802
59951F182986l638j5996k4332k8514k8676k4129j4541l45J8513M2530P1147J03064
59939F278069J38109J76943K18859K61811L04792L48155L91300M31879M67571
59930I017488M96734N16872N24022N14178M84270M32113L57209K62048J51660
59921A2756594L2195q9074k03610l03820l85488m46865m86616n04848n05073m92275
59911I371120m69138m36450l96598l53727l10354k66505k22384j79288j37636
59902F599040r6678n6672j8924J6687N1863Q6999J20416J50976J79056K04218
59892G236981K24088K36400K40225K34411K16791J86017J42810Q8970K6741m0359
$$ plain form
59961 5364456 5504666 5639041 5762902 5873854 5969806 6047782 6106248 6146858 6172184 6182986
59951 6182986 6179348 6163352 6139020 6110506 6081830 6057701 6043160 6042815 6061328 6103858 6175005 6278069
59939 6278069 6416178 6593121 6811980 7073791 7378583 7726738 8118038 8549917 9017488
59930 9017488 9514222 10031094 10555116 11069294 11553564 11985677 12342886 12604934 12756594
59921 12756594 12788789 12699715 12496105 12192285 11806797 11359932 10873316 10368468 9863395 9371120
59911 9371120 8901982 8465532 8068934 7715207 7404853 7138348 6915964 6736676 6599040
59902 6599040 6502362 6445690 6426766 6443453 6495316 6582315 6702731 6853707 7032763 7236981
59892 7236981 7461069 7697469 7937694 8172105 8388896 8574913 8717723 8806693 8833434 8793075
59882H793075j07737j71361k28148k74963l09183l30480l40477l40494l31285
59873F358947l14705k93513k69358k42853k15722j90653j68836j49673j33180
59864D380454j20534j11986j06350j02869j01514j01186r9824r6639r2145q5861
59854C361546p6424o4426n2462m1677l0730j9108q907k118J637L176J612m266
59842C067853j3810k5081l6385m6281n3317n6819n7236n5181n1049m5700m0158
59831B586836l4300k7147j8653r970j796O163J4088K1882L0038L9212M8948N8282
59819B713583O7170P5591Q1767Q3604Q1722P8784P5841P1628O5425N7994M9415
59808C502524L8554K5304J1234k339j4734k4165k8211k6642k1537j4182m135Q338
$$ plain form
59882 8793075 8685338 8513977 8285829 8010866 7701683 7371203 7030726 6690232 6358947
59873 6358947 6044242 5750729 5481371 5238518 5022796 4832143 4663307 4513634 4380454
59864 4380454 4259920 4147934 4041584 3938715 3837201 3736015 3636191 3539552 3447407 3361546
59854 3361546 3285122 3220696 3168234 3126557 3095827 3076719 3067812 3065694 3067331 3070507 3072119 3067853
59842 3067853 3054043 3028962 2992577 2946296 2892979 2836160 2778924 2723743 2672694 2626994 2586836
59831 2586836 2552536 2525389 2506736 2496766 2494970 2501133 2515221 2537103 2567141 2606353 2655301 2713583
59819 2713583 2780753 2856344 2938111 3021715 3103437 3182221 3258062 3329690 3395115 3453109 3502524
59808 3502524 3541078 3566382 3577616 3575277 3560543 3536378 3508167 3481525 3459988 3445806 3441671 3450009
59796C450009K1596L5151N0370O7867Q6599J06405J29019J55637J85584K18269
59786D506506K54284K93737L35582L79061M23042M62477M87224M85346M46822
59777H074081L65734K43876R4557n9937j97627l04316l74072m07208m09750l91574
59767F633764l61699l25431k86025k46502k08679j72711j39053j09115q3123n9520
59757D641906l7499j8050j446J3996K9623M5088O0281P6255R3165J09636J25367
59746E138322J42090J60765J80190J99625K20425K43784K69116K95952L25104
59737G175373L56728L89657M23832M60898N01011N41642N80732O18089O51984
59728A1699946O77441O90009O88682O73211O41686N93843N34780M72724M14610
$$ plain form
59796 3450009 3471605 3506756 3557126 3624993 3711592 3817997 3947016 4102653 4288237 4506506
59786 4506506 4760790 5054527 5390109 5769170 6192212 6654689 7141913 7627259 8074081
59777 8074081 8439815 8683691 8778248 8718311 8520684 8216368 7842296 7435088 7025338 6633764
59767 6633764 6272065 5946634 5660609 5414107 5205428 5032717 4893664 4784549 4701426 4641906
59757 4641906 4604407 4586357 4584911 4598907 4628530 4673618 4733899 4810154 4903319 5012955 5138322
59746 5138322 5280412 5441177 5621367 5820992 6041417 6285201 6554317 6850269 7175373
59737 7175373 7532101 7921758 8345590 8806488 9307499 9849141 10429873 11047962 11699946
59728 11699946 12377387 13067396 13756078 14429289 15070975 15664818 16199598 16672322 17086932
59719A7086932L65760L31471L15826L19732L42010L81009M33622M94566N58635
59710B0629563O22136O80596P27062P54711P59460P38467O88544O08687N02787
59701B6712013L77806K40881R9948l5003j54264k51343l22367l64646l77916l65187
59691B5559922l30136k74886k01876j15670k0489Q2460J93032L09282M28787N51133
59681B6181559O76449Q02623R25884J042380J146527J228816J277371J280664
59673C4562273J227356J106396R11552O46752L26379k7897l89183p27924j018061
59664C6617643j242975j395745j476046j489169j446174j361284j248546j122230
59656B5835474r99174q97846q34036q16654q44575r04898r76013j036272j071844
$$ plain form
59719 17086932 17452692 17784163 18099989 18419721 18761731 19142740 19576362 20070928 20629563
59710 20629563 21251699 21932295 22659357 23414068 24173528 24911995 25600539 26209226 26712013
59701 26712013 27089819 27330700 27430648 27395645 27241381 26990038 26667671 26303025 25925109 25559922
59691 25559922 25229786 24954900 24753024 24637354 24616865 24699325 24892357 25201639 25630426 26181559
59681 26181559 26858008 27660631 28586515 29628895 30775422 32004238 33281609 34562273
59673 34562273 35789629 36896025 37807577 38454329 38780708 38752811 38363628 37635704 36617643
59664 36617643 35374668 33978923 32502877 31013708 29567534 28206250 26957704 25835474
59656 25835474 24836300 23938454 23104418 22287764 21443189 20538291 19562278 18526006 17454162
59647A7454162j077874j055653j010909r52216q87181q19734p51835o85969o24051
59638I588740n65710n10102m58289m11841l70431l32835k98882k68456k40083
59629F132111k12703j87331j64974j44446j24423j05894r0120p5945o1799m8852
59619D915624l9353l3204k9029k7361k9797l5937m3921n3189o4031p5251q4952
59608D399599r2888r9640j04365j05886j05022j03222r9846r3475q5007p6624
59598C433624o8425n8838m7874l7266k7837j9124j1106l974L163J0962J7984K2523
59586C213812K5444K8674L1748L2631L1234K9323K7424K4666K1392J9203J8592
59575C504143J8950K0654K4663L0387L6401M2967N1437O1534P1678Q1756R3116
$$ plain form
59647 17454162 16376288 15320635 14309726 13357510 12470329 11650595 10898760 10212791 9588740
59638 9588740 9023030 8512928 8054639 7642798 7272367 6939532 6640650 6372194 6132111
59629 6132111 5919408 5732077 5567103 5422657 5298234 5192340 5102220 5026275 4964476 4915624
59619 4915624 4876271 4843067 4814038 4786677 4756880 4720943 4677022 4623833 4559802 4484551 4399599
59608 4399599 4306711 4207071 4102706 3996820 3891798 3788576 3688730 3595255 3510248 3433624
59598 3433624 3365199 3306361 3258487 3221221 3193384 3174260 3163154 3159180 3162343 3173305 3191289 3213812
59586 3213812 3239256 3267930 3299678 3332309 3363543 3392866 3420290 3444956 3466348 3485551 3504143
59575 3504143 3523093 3543747 3568410 3598797 3635198 3678165 3729602 3791136 3862814 3944570 4037686
59564D037686J05987J19333J33115J48434J65461J83344K01913K21590K41878
59555E558741K61842K81503L00867L18206L31492L40692L46532L47845L42693
59546H430413L31426L16221K98167K77201K54342K31506K09643J89054J70448
59537A0708421J53207J34013J10590Q6308O8027N9793O1302P1458Q9486J12449
59527A1655054J35259J53791J65426J66568J52844J22433P6888J8560n0261j25701
59517A2470861k02737k77724l48256m10654m60351m95135n15674n22938n17696
59508H719696n02508m81182m55680m25842l92478l58141l24548k91571k59243
59499E228503k28525j99769j72532j47120j24335j03723q4087o5493m8612l2519
$$ plain form
59564 4037686 4143673 4263006 4396121 4544555 4710016 4893360 5095273 5316863 5558741
59555 5558741 5820583 6102086 6402953 6721159 7052651 7393343 7739875 8087720 8430413
59546 8430413 8761839 9078060 9376227 9653428 9907770 10139276 10348919 10537973 10708421
59537 10708421 10861628 10995641 11106231 11192539 11260566 11320359 11381661 11453119 11542605 11655054
59527 11655054 11790313 11944104 12109530 12276098 12428942 12551375 12628263 12646823 12596562 12470861
59517 12470861 12268124 11990400 11642144 11231490 10771139 10276004 9760330 9237392 8719696
59508 8719696 8217188 7736006 7280326 6854484 6462006 6103865 5779317 5487746 5228503
59499 5228503 4999978 4800209 4627677 4480557 4356222 4252499 4168412 4102919 4054307 4021788
59489D021788j5570J885J8270L3844N0217O7185Q3070R8169J14802J33600J52785
59478D760045J71507J90991K11766K32496K52204K71074K88379L01809L09431
59469F989702L10022L01340K80497K46773K01904J47537Q4642J5689n5033j23604
59459H399469j87059k42088k85794l17847l39632l51371l52547l44943l32270
59450E645918l16652k98091k77323k56251k35490k14415j93780j75345j58758
59441C519813j41972j24953j09835r7072q4761p2330o1549n3078m5199l6908k9290
59430B662866k2902j6643j0158m581j55M246Q538J1262J2535J4285J6906J8723
59418B694922J9459K1023K4196K7812L1984L8357M5808M9673M7374M1956L8279
$$ plain form
59489 4021788 4006218 4008103 4026373 4060217 4110434 4177619 4260689 4358858 4473660 4607260 4760045
59478 4760045 4931552 5122543 5334309 5566805 5819009 6090083 6378462 6680271 6989702
59469 6989702 7299724 7601064 7881561 8128334 8330238 8477775 8562417 8578106 8523073 8399469
59459 8399469 8212410 7970322 7684528 7366681 7027049 6675678 6323131 5978188 5645918
59450 5645918 5329266 5031175 4753852 4497601 4262111 4047696 3853916 3678571 3519813
59441 3519813 3377841 3252888 3143053 3045981 2961220 2888890 2827341 2774263 2729064 2692156 2662866
59430 2662866 2639964 2623321 2613163 2608582 2608427 2612673 2621211 2632473 2645008 2659293 2676199 2694922
59418 2694922 2714381 2735404 2759600 2787412 2819396 2857753 2903561 2953234 3000608 3042564 3080843
59407C080843L8492M2813N1519O3832P7380R1189J07245J26922J47551J64632
59397C992418J76424J85239J95568K11776K35989K67038L02504L41800L85730
59388F294486M33514M82828N32584N82481O29411O67445O92062P01577O94201
59379A1710589O67727O23595N67829N06229M41473L76069L14526K60278K13052
59370A5681367J71084J33457R8582O2988K3673k0351o9924j26475j89238k54004
59360A5511159l15987l71536m16182m44452m53974m47544m29714m04031l74985
59351A1852754l49255l32048l24152l24321l32151l46562l63847l79847l92485
59342H708086m00621m02439l96864l84849l67673l45759l20359k94049k68088
$$ plain form
59407 3080843 3119335 3162148 3213667 3277499 3354879 3446068 3553313 3680235 3827786 3992418
59397 3992418 4168842 4354081 4549649 4761425 4997414 5264452 5566956 5908756 6294486
59388 6294486 6728000 7210828 7743412 8325893 8955304 9622749 10314811 11016388 11710589
59379 11710589 12378316 13001911 13569740 14075969 14517442 14893511 15208037 15468315 15681367
59370 15681367 15852451 15985908 16084490 16147478 16171151 16150800 16080876 15954401 15765163 15511159
59360 15511159 15195172 14823636 14407454 13963002 13509028 13061484 12631770 12227739 11852754
59351 11852754 11503499 11171451 10847299 10522978 10190827 9844265 9480418 9100571 8708086
59342 8708086 8307465 7905026 7508162 7123313 6755640 6409881 6089522 5795473 5527385
59333E527385k41456k13988j87917j64822j43540j22866j03792q7220p1834n6314
59323D133636m1424k7991j4944j291J2110K4550L7145N0675O3907P5813Q7268
59312D399454R8862J09191J17034J22952J26976J27203J22553J14567J04483R1040
59302E534315P3280N3170L3157J3357o538k4780l9289m9901n6789n8701n5023
59291E416258m7579l8123k5995j0327P485K5788M5118O6330Q8067J08302J26659
59280E761983J43097J56082J64131J67454J66135J58678J44217J24361J01049
59271G087187P4745M6393J8589p413l3296n9612q2483r6956j01826r8835q9516
59260F656977p5664o0702m7347l5233k3429j3625q270p109q348j1682j7579k4892
$$ plain form
59333 5527385 5285929 5071941 4884024 4719202 4575662 4452796 4349004 4261784 4189950 4133636
59323 4133636 4092212 4064221 4049277 4047986 4060096 4084646 4121791 4172466 4236373 4312186 4399454
59312 4399454 4498316 4607507 4724541 4847493 4974469 5101672 5224225 5338792 5443275 5534315
59302 5534315 5607595 5660765 5693922 5707279 5700741 5675961 5636672 5586771 5529982 5471281 5416258
59291 5416258 5368679 5330556 5304561 5294234 5301719 5327507 5372625 5438955 5527022 5635324 5761983
59280 5761983 5905080 6061162 6225293 6392747 6558882 6717560 6861777 6986138 7087187
59271 7087187 7161932 7208325 7226914 7219501 7186205 7126593 7044110 6947154 6845328 6746493 6656977
59260 6656977 6581313 6520611 6473264 6438031 6414602 6400977 6392707 6385598 6377250 6365568 6347989 6323097
59248F323097l1794l7879m3126m6063m5163m0674l3052k1018l232J9664M6591
59237F087351P7898J13692J52216J92074K34262K79723L26435L70944M10758M43068
59227H688421M63062M66011M49711M13232L55547K77626J83870P9268l2798j48093
59217A1195857k59532l60169m46070n14148n60339n82975n85537n73008n47844
59208F766235n12271m71512m30717l90699l50298l10996k75590k44153k14991
59199C565008j88176j64708j43777j24203j07090r3733q2550p1436o1404n4419
59189B473512m9401m4010l8699l5114l2072k7198k1337j7204j4585j0923n914
59178B177055j540J876N909J0709J4971J8872K3723K9072L3378L7007M1494M6440
$$ plain form
59248 6323097 6291303 6253424 6210298 6164235 6119072 6078398 6045346 6024328 6021096 6040760 6087351
59237 6087351 6165249 6278941 6431157 6623231 6857493 7137216 7463651 7834595 8245353 8688421
59227 8688421 9151483 9617494 10067205 10480437 10835984 11113610 11297480 11376748 11343950 11195857
59217 11195857 10936325 10576156 10130086 9615938 9055599 8472624 7887087 7314079 6766235
59208 6766235 6253964 5782452 5351735 4961036 4610738 4299742 4024152 3779999 3565008
59199 3565008 3376832 3212124 3068347 2944144 2837054 2743321 2660771 2589335 2527931 2473512
59189 2473512 2424111 2380101 2341402 2306288 2274216 2247018 2225681 2208477 2193892 2182969 2177055
59178 2177055 2175515 2177391 2183300 2194009 2208980 2227852 2251575 2280647 2314025 2351032 2392526 2438966
59166B438966N0343N3854N8918O5293P1148P6598Q3351R1329R8823J05640J13012
59155C307275J20685J27056J31722J35084J35972J32647J25690J16924J06063
59146D439118R1314P2818N2543L1314Q907j3314l2793m8625o1531p1450p7600
59135D390701q0185p9774p5743o7811n7887m7882l6913k3285p815P774K4221M3192
59123C988593O3689Q3320J02124J21837J42370J62331J81893K01972K21693K39940
59113E509762K58011K77251K95288L08363L16011L19582L17342L05305K82089
59104H189004K48906K05737J52094R1221K9199l0117q5707j35624j77051k10103
59094H277559k37585k60824k79120k92959l03819l11103l13097l10803l06971
$$ plain form
59166 2438966 2489309 2543163 2602081 2667374 2738522 2815120 2898471 2989800 3088623 3194263 3307275
59155 3307275 3427960 3555016 3686738 3821822 3957794 4090441 4216131 4333055 4439118
59146 4439118 4530432 4603250 4655793 4687107 4696014 4682700 4649907 4601282 4539751 4468301 4390701
59135 4390701 4310516 4230742 4154999 4087188 4029301 3981419 3944506 3921221 3913406 3921180 3945401 3988593
59123 3988593 4052282 4135602 4237726 4359563 4501933 4664264 4846157 5048129 5269822 5509762
59113 5509762 5767773 6045024 6340312 6648675 6964686 7284268 7601610 7906915 8189004
59104 8189004 8437910 8643647 8795741 8886962 8916161 8886044 8800337 8664713 8487662 8277559
59094 8277559 8039974 7779150 7500030 7207071 6903252 6592149 6279052 5968249 5661278
59085E661278l01613k92442k79596k65835k52099k36899k20302k04563j90452
59076C417477j76691j63164j51079j39845j27596j14858j04044r5342q6755p8121
59066B179982p1113o5381n8840n1863m7031m4483m1653l7950l5455l4521l2952
59055A658740l0248k8627k8857k8898k7583k5991k4410k1523j7463j4236j2438
59044A398466j0750r000q364q355p167n167m320m045j618L072P220R958J3364
59031A373294J8091K2080K4263K5634K5946K3429J8479J3748R967N554Q00j814
59019A559471k043k313l016j740J928N258P007Q931J1599J3132J3240J4089J5780
59006A641323J5362J1801P709M600P41m639r214j1502j2949j4390j4319j2442
$$ plain form
59085 5661278 5359665 5067223 4787627 4521792 4269693 4032794 3812492 3607929 3417477
59076 3417477 3240786 3077622 2926543 2786698 2659102 2544244 2440200 2344858 2258103 2179982
59066 2179982 2108869 2043488 1984648 1932785 1885754 1841271 1799618 1761668 1726213 1691692 1658740
59055 1658740 1628492 1599865 1571008 1542110 1514527 1488536 1464126 1442603 1425140 1410904 1398466
59044 1398466 1387716 1378716 1370352 1361997 1354830 1349663 1345343 1341298 1339680 1342752 1349972 1359930 1373294
59031 1373294 1391385 1413465 1437728 1463362 1489308 1512737 1531216 1544964 1554931 1560485 1561285 1559471
59019 1559471 1557428 1555115 1552099 1550359 1552287 1557545 1564552 1573483 1585082 1598214 1611454 1625543 1641323
59006 1641323 1656685 1668486 1676195 1680795 1681536 1676897 1667683 1656181 1643232 1628842 1614523 1602081
58994A602081j1034j0899r812o736l872k619j272J362L687M529N247O844Q270
58981A585776R174J0929J3504J4865J4824J5814J8464K0286K0299K0944K3692
58970A768571K6741K8914L1849L6312M0181M2188M4030M6688M8307M7702M6444
58959B207927M5526M3673M0833L9490M0538M1547M1278M2077M5707N0529N5114
58948B694239O0836O8568P6462Q3361R0888R9893J08452J15664J23710J33833
58938C655906J44034J53227J63970J78331J94708K11420K29958K51809K75555
58929E458918L00023L27081L58465L92803M28604M67219N10174N56324O04158
58920I403769O54007P05626P56319Q03591Q46561Q82644R06018R11430Q96236
$$ plain form
58994 1602081 1591047 1580148 1570336 1563600 1559728 1557109 1555837 1557199 1560886 1565415 1570662 1577506 1585776
58981 1585776 1594950 1605879 1619383 1634248 1649072 1664886 1683350 1703636 1723935 1744879 1768571
58970 1768571 1795312 1824226 1856075 1892387 1932568 1974756 2018786 2065474 2113781 2161483 2207927
58959 2207927 2253453 2297126 2337959 2377449 2417987 2459534 2500812 2542889 2588596 2639125 2694239
58948 2694239 2755075 2823643 2900105 2983466 3074354 3174247 3282699 3398363 3522073 3655906
58938 3655906 3799940 3953167 4117137 4295468 4490176 4701596 4931554 5183363 5458918
58929 5458918 5758941 6086022 6444487 6837290 7265894 7733113 8243287 8799611 9403769
58920 9403769 10057776 10763402 11519721 12323312 13169873 14052517 14958535 15869965 16766201
58911A6766201Q56808P87024O83374N48663L88715K09218J8263j72059l50246
58902A9735961n09124o43438p47863q20548q65128q86189q85695q66120q33033
58893A2678823p91280p41869o85617o26380n67751n10284m55390m08421l73939
58884G517892l50474l33134l18592l04760k88945k70193k51045k33861k17638
58875D949250k00823j84337j69205j54356j39404j26430j16217j06154r4617q3999
58865C573708p6344o9665o1711n3884m7965m2442l5575k8863k3903j9037j2573
58854C101746o106j200L984J1189J8538K4096K9694L7461M5723N2214N8274O6054
58842C441667P4538Q2107R0107J00037J10177J18812J27938J39887J53218J65762
$$ plain form
58911 16766201 17623009 18410033 19093407 19642070 20030785 20240003 20258266 20086207 19735961
58902 19735961 19226837 18583399 17835536 17014988 16149860 15263671 14377976 13511856 12678823
58893 12678823 11887543 11145674 10460057 9833677 9265926 8755642 8300252 7891831 7517892
58884 7517892 7167418 6834284 6515692 6210932 5921987 5651794 5400749 5166888 4949250
58875 4949250 4748427 4564090 4394885 4240529 4101125 3974695 3858478 3752324 3657707 3573708
58865 3573708 3497364 3427699 3365988 3312104 3264139 3221697 3186122 3157259 3133356 3114319 3101746
58854 3101746 3095640 3094440 3098424 3109613 3128151 3152247 3181941 3219402 3265125 3317339 3375613 3441667
58842 3441667 3516205 3598312 3688419 3788456 3898633 4017445 4145383 4285270 4438488 4604250
58832D604250J78831J94550K11881K29222K48061K70243K94521L19707L48199
58823F899465L82385M20471M59927N02075N49040N99029O48883O98461P48067
58814A1907803P94082Q31243Q56714Q67888Q59091Q24687P62876O72819N51714
58805A8928917L99748K25211M0180j46253l26493m90256o27952p36417q16614
58796A6450071q68279q91652q91772q75502q45964q04449p55293p03824o51465
58787I161871n97672n44577m94915m47653m00680l55618l15056k77268k38865
58778E489567k00472j64619j30725r8564p5218p1791r2437j30283j73022k08542
58768D143894k27803k28565k16799k00513j82655j62729j42380j24544j09070
$$ plain form
58832 4604250 4783081 4977631 5189512 5418734 5666795 5937038 6231559 6551266 6899465
58823 6899465 7281850 7702321 8162248 8664323 9213363 9812392 10461275 11159736 11907803
58814 11907803 12701885 13533128 14389842 15257730 16116821 16941508 17704384 18377203 18928917
58805 18928917 19328665 19553876 19594056 19447803 19121310 18631054 18003102 17266685 16450071
58796 16450071 15581792 14690140 13798368 12922866 12076902 11272453 10517160 9813336 9161871
58787 9161871 8564199 8019622 7524707 7077054 6676374 6320756 6005700 5728432 5489567
58778 5489567 5289095 5124476 4993751 4895187 4819969 4748178 4655741 4525458 4352436 4143894
58768 4143894 3916091 3687526 3470727 3270214 3087559 2924830 2782450 2657906 2548836
58759B548836r4076q0212o9103n9457m9240l9896l3864k9748k4662j9376j6407
58748B032795j4933j2439r505q201p708o348n881q813j3438j6477j8490k1668
58736A888894k4746k5432k5523k7824l0328k9442k6940k7457l0761l2843l3212
58725A574386l4749l7401l8355l7732l8102l9021l7759l4753l2809l1767k9300
58714A182638k6102k4723k4355k2252j9190j8009j7893j5843j2588j1196j0940
58703I79547q571m647k643k647j847l82o92k015j546k78j605m952o779p021q413
58688I25509j0348r748p246o168o080l701M39K809L667O546J1428J5032J7397
58675I39536K1588K7096L0293L1261L3654L7961M1666M5807N4512O7938Q2452
$$ plain form
58759 2548836 2454760 2374548 2305445 2245988 2196748 2156852 2122988 2093240 2068578 2049202 2032795
58748 2032795 2017862 2005423 1995918 1987717 1980009 1973661 1967780 1958967 1945529 1929052 1910562 1888894
58736 1888894 1864148 1838716 1813193 1785369 1755041 1725599 1698659 1671202 1640441 1607598 1574386
58725 1574386 1539637 1502236 1463881 1426149 1388047 1349026 1311267 1276514 1243705 1211938 1182638
58714 1182638 1156536 1131813 1107458 1085206 1066016 1048007 1030114 1014271 1001683 990487 979547
58703 979547 970976 966329 963686 961039 959192 958810 958118 956103 954557 954279 952674 947722 940943 933922 925509
58688 925509 915161 905413 898167 891999 885919 882218 882657 885466 889133 895679 907107 922139 939536
58675 939536 961124 988220 1018513 1049774 1083428 1121389 1163055 1208862 1263374 1331312 1413764
58664A413764R7334J13509J24975J19474R0383M2995j1235o0916r6067j11384
58654A722832j10634j02539r1561p7378o1999m9908m1131l1477k0451j2072p189
58643A116493k061M559R812J3191J7805K4013K8521L0942L4837M1089M6716N1276
58631A417193N7954O7226P5924Q3627R3607J06480J19378J32219J48191J67211
58621B469010J85563K02832K22296K43551K61680K74645K84315K89031K82480
58612D715403K61449K27843J82179J22793N3093j7839q3881j44226j96146k33457
58602D887211k54468k64174k66233k59747k45760k29404k13063j94496j74042
58593B785824j56533j43645j31280j17084j03766r2657q0960o7843n6504m7796
$$ plain form
58664 1413764 1511098 1624607 1749582 1869056 1959439 2002434 1991199 1930283 1834216 1722832
58654 1722832 1612198 1509659 1418098 1340720 1278721 1228813 1187682 1156205 1135754 1123682 1116493
58643 1116493 1114432 1118991 1128803 1141994 1159799 1183812 1212333 1243275 1278112 1319201 1365917 1417193
58631 1417193 1475147 1542373 1618297 1701924 1795531 1902011 2021389 2153608 2301799 2469010
58621 2469010 2654573 2857405 3079701 3323252 3584932 3859577 4143892 4432923 4715403
58612 4715403 4976852 5204695 5386874 5509667 5562760 5544921 5461040 5316814 5120668 4887211
58602 4887211 4632743 4368569 4102336 3842589 3596829 3367425 3154362 2959866 2785824
58593 2785824 2629291 2485646 2354366 2237282 2133516 2040859 1959899 1892056 1835552 1787756
58583A787756l8498k8132k0752j7811j6018j4238j5425j9631k2366k2107k2296
58572A550482k3812k2768j7915j2840q756k868M062O642L807P81m18m013j1192
58559A461192j6478j6808j5952j6288j4342q397k436J371O064J1675J1695K358
58547A403654j1762k5464l8699n0749n6797n5254n1333m8771m4852l7760l1393
58536I50820k8386k5504k0515j6647j5897j4917j1820j0067j1381j1881r493q077
58524G66235j0008j1764j0888j0107j0665r137m815k512l924m125p25J740P75
58511F90080O84L727N299K960J658M550P233O634P091J1694J5969J6305J6506
58498G90390J9864K2747K2216K1903K4091K4135J9073J3684J1620Q642J362n604
$$ plain form
58583 1787756 1749258 1721126 1700374 1682563 1666545 1652307 1636882 1617251 1594885 1572778 1550482
58572 1550482 1526670 1503902 1485987 1473147 1464391 1461523 1465585 1472227 1476034 1476815 1476397 1472384 1461192
58559 1461192 1444714 1427906 1411954 1395666 1381324 1372927 1370491 1371862 1377926 1389601 1401296 1403654
58547 1403654 1391892 1366428 1327729 1276980 1220183 1164929 1113596 1064825 1019973 982213 950820
58536 950820 922434 896930 876415 859768 843871 828954 817134 807067 795686 783805 774312 766235
58524 766235 756227 744463 733575 723468 712803 703666 698851 696339 692415 688290 687565 689305 690080
58511 690080 690764 694491 699790 702750 704408 708958 716191 722825 729916 741610 757579 773884 790390
58498 790390 810254 833001 855217 877120 901211 925346 944419 958103 969723 978365 979727 974123
58486I74123q060r750j4423j8330j7786j6449j7878j8533j5299j2311j3020j3264
58474G99020r501o143p300q965p019n150p055q507n314j618k249m172l506l564
58460G18957p699j1438j0084p082o784o115j491L323M422N465J0055J3990J3313
58447G18832J2394J5488J8082J5452J2081J3480J6318J5878J5595J9583K3117
58436H96300K0408J4782J1600Q194M93p539j0905j2940j7984k1878j9648j5504
58424H45379j5177j5455j1390o652o384o897k952J798K078J528N390R860R522
58411H10648Q222J1537J5531J4091J0462J0257J0115M669k154m308n030r604j3887
58398H60549j1877p624p663q705n001o23j887m606j713L296L358J320L464O490
$$ plain form
58486 974123 966063 956313 941890 923560 905774 889325 871447 852914 837615 825304 812284 799020
58474 799020 789519 783376 776076 767111 760092 754942 747887 739380 734066 732448 730199 726027 722521 718957
58460 718957 711258 699820 689736 682654 675870 669755 668264 671587 676009 681474 691529 705519 718832
58447 718832 731226 746714 764796 780248 792329 805809 822127 838005 853600 873183 896300
58436 896300 916708 931490 943090 951284 951777 944238 933333 920393 902409 880531 860883 845379
58424 845379 830202 814747 803357 796705 790321 783424 780472 782270 784348 785876 791266 801126 810648
58411 810648 818870 830407 845938 860029 870491 880748 890863 895532 893378 889070 884040 874436 860549
58398 860549 848672 841048 833385 824680 819679 819056 817169 812563 810850 814146 817504 818824 822288 828778
58384H28778M212N13K135N281K915j248K85M421M000K032N254J0050R072N616
58370H83316P027J0196Q137M492O634J0694Q634L923M903Q837Q108N916R868J5997
58356I96682J5474J1403J2658J6652J4697Q930P374P617K149n418o225k894l801
58343A075298o309k612L617L696J135M802J0938J0129O135R116J5939J6302J2709
58330A160895J4932K0130J8400J2847J3940J8919J7272J1787J3362J9588J9553
58319A341625J5410J7803K4185K3317J7126J6415J9013J4390N734M849R107O457
58307A515431n74O22Q075Q915M289O463J4229J5563J1794J4585K1789K1158J5164
58294A657503J6941K4598K5122K0700K4667L4433L5506K9729L1916M0972M2525
$$ plain form
58384 828778 832990 833503 835638 840919 843834 842586 842871 847292 851292 853324 858578 868628 877700 883316
58370 883316 890343 900539 908676 913168 919802 930496 939130 943053 947956 956793 964901 970817 980685 996682
58356 996682 1012156 1023559 1036217 1052869 1067566 1076496 1083870 1091487 1093636 1088218 1081993 1079099 1075298
58343 1075298 1068989 1066377 1069994 1073690 1074825 1079627 1090565 1100694 1106829 1115945 1131884 1148186 1160895
58330 1160895 1175827 1195957 1214357 1227204 1241144 1260063 1277335 1289122 1302484 1322072 1341625
58319 1341625 1357035 1374838 1399023 1422340 1439466 1455881 1474894 1489284 1495018 1499867 1508974 1515431
58307 1515431 1514857 1515479 1523554 1532469 1536758 1543221 1557450 1573013 1584807 1599392 1621181 1642339 1657503
58294 1657503 1674444 1699042 1724164 1744864 1769531 1803964 1839470 1869199 1901115 1942087 1984612
58283A984612L7873M1407N1476N3179M8291N2272O3166O4127N5635N4018N9041
58272B565097N4737M1805L6871M0073L6057K6570K8401L9420M1094L4484L8415
58261B983024N2027N5679M9297N2499O5775O9824O4456O9088Q3193Q6361P9334
58250C710557Q3824R9672J04461R7905J02900J19987J25766J19607J25501J44058
58240D834238J50518J44398J51768J73844J84189J81645J93209K19306K31254
58231F464369K28683K42310K73363K89885K90153L07550L44640L67413L73760
58222I182126L99730M48151M81972M99066N39018O04247O53025O83369P40804
58213A4231508Q29348R03076R60902J055587J192600J320983J442413J620489
$$ plain form
58283 1984612 2022485 2063892 2115368 2168547 2216838 2269110 2332276 2396403 2452038 2506056 2565097
58272 2565097 2619834 2661639 2698510 2738583 2774640 2801210 2829611 2869031 2910125 2944609 2983024
58261 2983024 3035051 3090730 3140027 3192526 3258301 3328125 3392581 3461669 3544862 3631223 3710557
58250 3710557 3794381 3894053 3998514 4096419 4199319 4319306 4445072 4564679 4690180 4834238
58240 4834238 4984756 5129154 5280922 5454766 5638955 5820600 6013809 6233115 6464369
58231 6464369 6693052 6935362 7208725 7498610 7788763 8096313 8440953 8808366 9182126
58222 9182126 9581856 10030007 10511979 11011045 11550063 12154310 12807335 13490704 14231508
58213 14231508 15060856 15963932 16924834 17980421 19173021 20494004 21936417 23556906
58205B3556906J862433K110252K371573K730564L206209L744438M378529N233896
58197D9194800O336661P595098R009370J0698903J2692630J4954152J7672703
58190A28154317K1223725K5782854L1369678L8221150M6117428N2564229N2466373
58183C95899754M1361840J9806783n929797k8014347m1871725m7414349m6976118
58176B86862041m3092482l7726781l2213368k7189596k2743059j8836047j5515275
58169H9545433j2771812j0475452q531658o940217n663266m588040l650508k865358
58161C4059122k215912j630386j071991n45426j8352N71257J255346K056333K963016
58152C5423007L727576L789382K679960N72823j737897l468500m349128m537439
$$ plain form
58205 23556906 25419339 27529591 29901164 32631728 35837937 39582375 43960904 49194800
58197 49194800 55531461 63126559 72135929 82834832 95527462 110481614 128154317
58190 128154317 149378042 175160896 206530574 244751724 290869152 343433381 395899754
58183 395899754 437261594 457068377 451138580 423124233 381252508 333838159 286862041
58176 286862041 243769559 206042778 173829410 146639814 123896755 105060708 89545433
58169 89545433 76773621 66298169 57766511 50826294 45163028 40574988 36924480 34059122
58161 34059122 31843210 30212824 29140833 28595407 28577055 29148312 30403658 32459991 35423007
58152 35423007 39150583 42939965 45619925 46192748 44454851 40986351 36637223 32099784
58144C2099784m282039l788785l240019k750562k324280j932414j594716j335568
58136A0851401j126394r33856p73340o62647n73525m77985l95266l47854l15721
58127E244813k75732k42995k33740k28439k08975j92647j94325j93394j72057
58118C302509j48976j42478j36634j15359r4818r0768q7587p0401n5777o0612
58108B299099p0919o9968o7960p6257q1019o9742n6739n6116n5792m3324l1426
58097A619837l3187l7329l2096k8914l8475m7616m3480l7335m1369m4804l5931
58086A199301k5660k6399k8829k1908j5286j9834k5823k1903j6534j9750k2713
58075I54662j6031r664j4042j9535j4981q897j2151j6873j2665p133j0261j4485
$$ plain form
58144 32099784 27817745 24028960 20788941 18038379 15714099 13781685 12186969 10851401
58136 10851401 9725007 8791151 8017811 7355164 6781639 6303654 5908388 5560534 5244813
58127 5244813 4969081 4726086 4492346 4263907 4054932 3862285 3667960 3474566 3302509
58118 3302509 3153533 3011055 2874421 2759062 2664244 2573476 2485889 2415488 2359711 2299099
58108 2299099 2228180 2158212 2090252 2013995 1932976 1863234 1806495 1750379 1694587 1651263 1619837
58097 1619837 1586650 1549321 1517225 1488311 1449836 1402220 1358740 1321405 1280036 1235232 1199301
58086 1199301 1173641 1147242 1118413 1096505 1081219 1061385 1035562 1013659 997125 977375 954662
58075 954662 938631 928967 914925 895390 880409 871512 859361 842488 829823 822690 812429 797944
58063G97944r987m353p617j2593r222m021o643j1101q648n527r883j4530j0654
58050F83165n430q327j2876r557m170n852r137n347m8j892n479k273K472L28l533
58035F12044o21M371L411J088M780R041N742K1M60K958j90m598k605J396l17l692
58019F33289j515J778j160n657l788L72j018m314k034K244J186j843l8K793k04
58004F20091m782l297N60j036n172m581k068m488q815q110n163o569r360p163
57990E50047l582n866j0996j1376q724r035r582m457K375L037j36M99L830L678
57976D99712J591L016N407K975j192m79K402N48l639l078J77j238n988o815m035
57961D89364l697n262l455K73J14k720k451J00o7j437J141N682O318M511N962
$$ plain form
58063 797944 787957 783604 775987 763394 754172 750151 743508 732407 723759 718232 708349 693819 683165
58050 683165 677735 669408 656532 646975 642805 636953 627816 622469 622421 620529 615050 612777 615249 615577 612044
58035 612044 611423 615794 619205 620293 625073 634114 639856 639877 640337 643295 643105 638507 635902 637298 636981 633289
58019 633289 631774 633552 632392 626735 622947 623319 622301 617987 615953 618197 619383 617540 617502 620295 620091
58004 620091 615309 612012 612572 611536 606364 601783 599715 595227 586412 578302 573139 566570 557210 550047
57990 550047 546465 540599 529603 518227 509503 500468 490886 486429 488804 491841 491705 492204 496034 499712
57976 499712 501303 504319 509726 512701 511509 511030 513432 513980 510341 507263 507440 506202 500214 493399 489364
57961 489364 485667 480405 476950 477223 477337 474617 472166 472266 472199 470762 471903 477585 483903 488414 494376
57946D94376R227Q453M783L928M999K735j642k766j936m630r499j0635q690r072
57932D79631j1092r649n912n682q763j0075r745j1984j5643j5806j3087j1697
57920C50496j0297m652K735N698N178O974J0712J1243R047R025J0618R290O248
57907D22315O490Q740P675M668N898J0900J3404J2569J3029J4606J2492P199M113
57894E44098L344K7n569q180p622q832j1873j1747q321o774p832p077m225l660
57880D55757n303m373p38O80o42m2L153M712M246N822R269R876P523P173R437
57865E06550R617O905N639O449N045J092n85R72J145j512l179k744l591o055o372
57850E19376m492m783p570q182n770m770o160n656k333o71j996k139K47J116q87
$$ plain form
57946 494376 503603 512056 516839 520767 525766 528501 526859 524093 522157 517527 508028 497393 488703 479631
57932 479631 468539 458890 452978 447296 438533 428458 418713 406729 391086 375280 362193 350496
57920 350496 340199 335547 338282 343980 349158 356132 366844 378087 387134 396159 406777 416067 422315
57907 422315 428805 437545 445220 449888 455786 466686 480090 492659 505688 520294 532786 539985 544098
57894 544098 547442 547469 541900 533720 526098 517266 505393 493646 485325 478551 470719 463642 459417 455757
57880 455757 450454 446081 445343 446023 445381 445339 448492 453204 457450 463272 472541 482417 489940 497113 506550
57865 506550 516167 523072 528711 535160 540205 541297 540712 541684 542829 541317 538138 535394 531803 525748 519376
57850 519376 514884 510101 502531 494349 488579 483809 477649 471993 469660 468989 466993 464854 465101 466217 465330
57835D65330j744Q8P97j346k974k616l427o499q428q013q474j0714j1260r184
57821C91536q225r692j0027p769o175o569n852l075j774l203l667j329O44K28
57807C25051j42J141K194K376L788O162O336M600N299R228J1992J1878J2572J5722
57793D18197J7514J5501J2420J0468P927M191K163K778K885J021l73n99k502o364
57779D85227q271p091o772r161j0824r737q799r676r432o474l887l517k643K80
57765C89223K326J784J441K952L672K344K185M837O854N810M414M942N135L332
57751D41251K261L778M929L392J874L083M978M984M531N493O357N718N450O916
57737E04995P994P263O998Q816J0475J0160R726J0682J1217J0284J0221J2260
$$ plain form
57835 465330 463586 463674 464471 463125 460151 457535 454108 447609 439181 431168 422694 411980 400720 391536
57821 391536 383311 373619 363592 355823 349648 343079 337227 334152 332378 329175 325508 324179 324823 325051
57807 325051 324909 326050 328244 330620 334408 340570 346906 351506 356805 366033 378025 389903 402475 418197
57793 418197 435711 451212 463632 474100 482027 486218 488381 491159 494044 495065 494692 494093 491591 485227
57779 485227 476956 469865 463093 453932 443108 433371 424572 414896 405464 398990 395103 391586 388943 389223
57765 389223 391549 393333 394774 397726 401398 403742 405927 410764 417618 423428 427842 432784 437919 441251
57751 441251 443512 447290 452219 455611 457485 460568 465546 470530 475061 480554 486911 492629 498079 504995
57737 504995 512989 520252 527250 536066 546541 556701 566427 577109 588326 598610 608831 621091
57725F21091J3841J3494J3819J6506J8996J9405K0035K2635K4893K5168K6046
57714H35929K9410L2574L3296L4173L7946M2702M5896M9162N4878O1735O7932
57703A325633P5204Q5675R7927J09991J22976J38203J54108J69416J86028K05367
57693B670528K25331K43913K61959K78997K90229K91025K80607K58077K19512
57684E020178J63403R5391K3697m6524j10907j62710j97040k15161k20572k14077
57674D135678j96414j71710j43611j11214p2831l0216J4653O1768J05649J29386
57664C721138J14119N5542l1586j23132j96883k39343k49475k37051k13905j86383
57654B413041j56790j28040j02788q0608o0103m2075k7455j4474j246J1230K1839
$$ plain form
57725 621091 634932 648426 662245 678751 697747 717152 737187 759822 784715 809883 835929
57714 835929 865339 897913 931209 965382 1003328 1046030 1091926 1141088 1195966 1257701 1325633
57703 1325633 1400837 1486512 1584439 1694430 1817406 1955609 2109717 2279133 2465161 2670528
57693 2670528 2895859 3139772 3401731 3680728 3970957 4261982 4542589 4800666 5020178
57684 5020178 5183581 5278972 5302669 5256145 5145238 4982528 4785488 4570327 4349755 4135678
57674 4135678 3939264 3767554 3623943 3512729 3439898 3409682 3424335 3486103 3591752 3721138
57664 3721138 3835257 3890799 3859213 3736081 3539198 3299855 3050380 2813329 2599424 2413041
57654 2413041 2256251 2128211 2025423 1944815 1884712 1842637 1815182 1800708 1799462 1810692 1832531
57643A832531L2504M5267N8830P1357Q4008R8368J13263J27608J43446J62448
57633B769630J82282K00145K16834K33324K46269K51095K46694K32875K06207
57624D785355J63401J06888M2815k4216r0399j49586j96090k29224k51103k61935
57614C895906k61540k53311k41869k28259k11490j93016j75563j59169j42496
57605B029193j26542j13142j01511r0037p9716p2106o5777n8642n1699m6642m2055
57594A181324l6120l0786k8697k8151k5756k2148k0257j9611j7350j3616j1113
57583I27719j0248r251q090p937p801n933l520k867l146k045k93j22n54J155M432
57568H71499O387O946Q466J0969J2324J2609J3880J6078J7366J8004J9774K2193
$$ plain form
57643 1832531 1865035 1910302 1969132 2040489 2124497 2222865 2336128 2463736 2607182 2769630
57633 2769630 2951912 3152057 3368891 3602215 3848484 4099579 4346273 4579148 4785355
57624 4785355 4948756 5055644 5098459 5074243 4983844 4834258 4638168 4408944 4157841 3895906
57614 3895906 3634366 3381055 3139186 2910927 2699437 2506421 2330858 2171689 2029193
57605 2029193 1902651 1789509 1687998 1597961 1518245 1446139 1380362 1321720 1270021 1223379 1181324
57594 1181324 1145204 1114418 1085721 1057570 1031814 1009666 989409 969798 952448 938832 927719
57583 927719 917471 908220 900130 892193 884392 878459 874939 872072 868926 866881 866588 866466 865912 867067 871499
57568 871499 877886 884832 893298 904267 916591 929200 943080 959158 976524 994528 1014302 1036495
57556A036495K3388K4153K6913L1290L4948L8223M3593N0940N7680O3406P0280
57545A501309P8898Q7831R7131J08338J21083J33438J45567J59244J73971J87041
57535B793851J97159K04338K06587K00419J84319J58427J21788P4060J9472l4996
57525D125424q5072j29286j64856j88256j99869k03552k01483j93328j80350j65888
57515B413484j51392j35961j20055j05785r3308q0813o8369n8074n0183m2760
57505A506784l5294k9031k3799j8129j2492q626n767j491L883P749R976J3011
57493A406774J7289K0803K3539K7845L4064M0097M5754N3249O2723P1691P9733
57482A883561Q9416J01565J13920J25600J38642J53665J68007J79622J89085J96071
$$ plain form
57556 1036495 1059883 1084036 1110949 1142239 1177187 1215410 1259003 1309943 1367623 1431029 1501309
57545 1501309 1580207 1668038 1765169 1873507 1994590 2128028 2273595 2432839 2606810 2793851
57535 2793851 2991010 3195348 3401935 3602354 3786673 3945100 4066888 4140948 4160420 4125424
57525 4125424 4040352 3911066 3746210 3557954 3358085 3154533 2953050 2759722 2579372 2413484
57515 2413484 2262092 2126131 2006076 1900291 1806983 1726170 1657801 1599727 1549544 1506784
57505 1506784 1471490 1442459 1418660 1400531 1388039 1379413 1373646 1372155 1376038 1383787 1393763 1406774
57493 1406774 1424063 1444866 1468405 1496250 1530314 1570411 1616165 1669414 1732137 1803828 1883561
57482 1883561 1972977 2074542 2188462 2314062 2452704 2606369 2774376 2953998 3143083 3339154
57472C339154J97324J89712J72275J44228J04488N4722J0n4714j06168j50430
57462C890601j83022k02704k12167k13914k08492j97392j83907j69755j54124
57453B165124j37198j21466j08255r6151q4184p3550o4974n7369n0265m4691m0521
57442A286500l5916l0471k6039k3438k1186j8421j6146j4695j2935j0776r530
57431A066947r039p585n350m579n504n591l827k282k209k122j084m75r74j021
57417A015305K25J329J426J713K840L720M016M848O067N952M663M567O132O948
57403A069751O044N589O843Q061Q060Q325R756J0680J0045R422R967J0488J0184
57390A183215J0238J1034J0980R751R409J0634J1229J0176R635J0897J1975J1457
$$ plain form
57472 3339154 3536478 3726190 3898465 4042693 4147181 4201903 4201913 4147199 4041031 3890601
57462 3890601 3707579 3504875 3292708 3078794 2870302 2672910 2489003 2319248 2165124
57453 2165124 2027926 1906460 1798205 1702054 1617870 1544320 1479346 1421977 1371712 1327021 1286500
57442 1286500 1250584 1220113 1194074 1170636 1149450 1131029 1114883 1100188 1087253 1076477 1066947
57431 1066947 1057908 1050323 1044973 1040394 1034890 1029299 1025472 1023190 1020981 1018859 1017775 1017300 1016326 1015305
57417 1015305 1015530 1016859 1018285 1019998 1022838 1026558 1030574 1035422 1041489 1047441 1052104 1056671 1062803 1069751
57403 1069751 1075795 1081384 1088227 1096288 1104348 1112673 1122429 1133109 1143154 1152576 1162543 1173031 1183215
57390 1183215 1193453 1204487 1215467 1225218 1234627 1245261 1256490 1266666 1276301 1287198 1299173 1310630
57378A310630J1209J2695J3987J3180J1746J1733J2450J2556J2698J3501J3589
57367A449974J2159J0930J1047J0748Q647O569O436O942O157M994N260O540P746
57354A554149R465J2102J3893J3618J3194J4841J7658J9673K1280K3772K6396
57343A740041K7717K8321K9531L0852L1202L1081L1279L0977K9401K7747K7304
57332B065453K7287K6654K6210K6837K7418K6787K5949K6236K6970K7118K7391
57321B360310K8598K9749K9944L0276L1753L3244L3621L3869L4964L5721L5162
57310B717211L4811L6229L8266L9276M0020M1759M3488M3803M3760M5099M7245
57299C170967M8709M9854N1777N3960N5504N7072N9306O1034O1460O2176O4532
$$ plain form
57378 1310630 1321839 1334534 1348521 1361701 1373447 1385180 1397630 1410186 1422884 1436385 1449974
57367 1449974 1462133 1473063 1484110 1494858 1503505 1510074 1516510 1523452 1529609 1534603 1539863 1546403 1554149
57354 1554149 1563614 1575716 1589609 1603227 1616421 1631262 1648920 1668593 1689873 1713645 1740041
57343 1740041 1767758 1796079 1825610 1856462 1887664 1918745 1950024 1981001 2010402 2038149 2065453
57332 2065453 2092740 2119394 2145604 2172441 2199859 2226646 2252595 2278831 2305801 2332919 2360310
57321 2360310 2388908 2418657 2448601 2478877 2510630 2543874 2577495 2611364 2646328 2682049 2717211
57310 2717211 2752022 2788251 2826517 2865793 2905813 2947572 2991060 3034863 3078623 3123722 3170967
57299 3170967 3219676 3269530 3321307 3375267 3430771 3487843 3547149 3608183 3669643 3731819 3796351
57288C796351O6896O7181O6117O5205O3431N9106N3189M7600M1805L4229K5792
57277D386902J8796J3532Q879N137L301K601J691J322L025O191R100J1801J5343
57264D487621J9192K2196K4963K8659L2456L4805L6229L8203M0423M1713M2552
57253D849012M4017M5355M5274M4546M4694M5196M4700M3808M3908M4363M3741
57242E338614M2751M3094M4351M4883M4925M5924M7611M8553M8864M9751N1257
57231E850578N2821N5086N8513O1348O1712O0560N9935N9533N7926N5787N4688
57220F488487N3809N1212M7442M4634M2809M0306L7203L5066L3914L2646L1881
57209F939409L3117L5540L6829L6816L7347L8927M0575M2501M5767M9629N2167
$$ plain form
57288 3796351 3863247 3930428 3996545 4061750 4125181 4184287 4237476 4285076 4326881 4361110 4386902
57277 4386902 4405698 4419230 4428109 4433246 4436547 4439148 4440839 4442161 4445186 4451377 4460477 4472278 4487621
57264 4487621 4506813 4529009 4553972 4582631 4615087 4649892 4686121 4724324 4764747 4806460 4849012
57253 4849012 4893029 4938384 4983658 5028204 5072898 5118094 5162794 5206602 5250510 5294873 5338614
57242 5338614 5381365 5424459 5468810 5513693 5558618 5604542 5652153 5700706 5749570 5799321 5850578
57231 5850578 5903399 5958485 6016998 6078346 6140058 6200618 6260553 6320086 6378012 6433799 6488487
57220 6488487 6542296 6593508 6640950 6685584 6728393 6768699 6805902 6840968 6874882 6907528 6939409
57209 6939409 6972526 7008066 7044895 7081711 7119058 7157985 7198560 7241061 7286828 7336457 7388624
57198G388624N3394N4917N6883N8039N8379N8911N9357N8868N8294N8781N8867
57187H023314N6272N1848M8481M6532M3935M0350L7541L5684L2903K8708K4642
57176H470210K1217J7284J2711Q705N321J557k039l746l600k905q53N065J4799
57163H543726K4898L2313L6563L7901L6301L2744K8997K5588K2038J8905J7356
57152H857330J6861J5720J3612J1359Q713M796J16m390r482j6167k3060k8126
57140H847282l1938l6082l9470l9707l7250l4509l1557k6625k0280j5174j1971
57129H522719r342p641q623j1770j4796j7705k2387k8299l2511l3983l3918l2117
57117H269627k7088j9817j3225p656q10P874J6787K6096L8107N3549P1405R2338
$$ plain form
57198 7388624 7442018 7496935 7553818 7611857 7670236 7729147 7788504 7847372 7905666 7964447 8023314
57187 8023314 8079586 8131434 8179915 8226447 8270382 8310732 8348273 8383957 8416860 8445568 8470210
57176 8470210 8491427 8508711 8521422 8530127 8535448 8537005 8534966 8531220 8527620 8524715 8523862 8528927 8543726
57163 8543726 8568624 8600937 8637500 8675401 8711702 8744446 8773443 8799031 8821069 8839974 8857330
57152 8857330 8874191 8889911 8903523 8914882 8923595 8928391 8928507 8924117 8914635 8898468 8875408 8847282
57140 8847282 8815344 8779262 8739792 8700085 8662835 8628326 8596769 8570144 8549864 8534690 8522719
57129 8522719 8513377 8505736 8497113 8485343 8470547 8452842 8430455 8402156 8369645 8335662 8301744 8269627
57117 8269627 8242539 8222722 8209497 8201841 8201031 8208905 8225692 8251788 8289895 8343444 8414849 8507187
57105H507187J18531J50616J88768K36345K98545L78441M78246O02180P52463
57096A1711322R24743J114506J327031J573817J859358K178126K523477K891495
57088B6103875L275995L667070M053120M415476M722740M940422N041863M992484
57080F1213045M725297M161337L276146K138662Q73720m03819j610443k675781
57072G1698164l541209m185116m629825m911586n050142n049473m915896m667007
57064C4747910m329220l933842l512595l091336k687412k312645j975491j679562
57056A1225807j423699j205299j021592q68055p39023o30735n41252m67354m04565
57047C924233l50420l04846k67031k34558k05909j81360j61098j44419j30692
$$ plain form
57105 8507187 8625718 8776334 8965102 9201447 9499992 9878433 10356679 10958859 11711322
57096 11711322 12636065 13750571 15077602 16651419 18510777 20688903 23212380 26103875
57088 26103875 29379870 33046940 37100060 41515536 46238276 51178698 56220561 61213045
57080 61213045 65938342 70099679 73375825 75514487 76388207 75984388 74373945 71698164
57072 71698164 68156955 63971839 59342014 54430428 49380286 44330813 39414917 34747910
57064 34747910 30418690 26484848 22972253 19880917 17193505 14880860 12905369 11225807
57056 11225807 9802108 8596809 7575217 6707162 5968139 5337404 4796152 4328798 3924233
57047 3924233 3573813 3268967 3001936 2767378 2561469 2380109 2219011 2074592 1943900
57038A943900j19232j08644r8182q9104q2691p7717p2009o5584n9951n5379n1129
57027A064278m7490m5101m3041l9924l6211l3267l0887k7868k4226k0911j8213
57016F97139j6090j4970j4578j3435j1027q788p327m898m12M511Q644J3674K1170
57003F53613K9852L8548M9135O3984Q3663J09111J40135J66274J65026J19279
56993A618620L7230n1171j18020j53730j62993j54334j36102j15456r5616p5830
56983E92598n5811l7987k4860j7150j5088j8307k3651k6445k5103k1897j8759
56972C07540j5233j1115p786n826l975j499P44K316L986N958P577R134J1801J5590
56958C19212J9603K4130K9692L3912L2306K3051Q759o617k0180k9542l3072l1760
$$ plain form
57038 1943900 1824668 1716024 1617842 1528738 1446047 1368330 1296321 1230737 1170786 1115407 1064278
57027 1064278 1016788 971687 928646 888722 852511 819244 788357 760489 736263 715352 697139
57016 697139 681049 666079 651501 638066 627039 618251 610924 606026 605614 610125 618769 632443 653613
57003 653613 683465 722013 771148 835132 918795 1027906 1168041 1334315 1499341 1618620
56993 1618620 1655850 1604679 1486659 1332929 1169936 1015602 879500 764044 668428 592598
56983 592598 536787 498800 473940 456790 441702 423395 399744 373299 348196 326299 307540
56972 307540 292307 281192 273406 267580 263605 262106 262850 265166 269152 275110 282687 291821 303622 319212
56958 319212 338815 362945 392637 426549 458855 481906 490665 484048 463868 434326 401254 369494
56946C69494k8555k5118k1044j6255j1787p915l923o9K463L911O099R914J4635
56933B91850J9876K6222L3752M1552M7944M9471M1113K1078m878k7056m0052m5072
56921D55800m5176m1979l7051l2436k8461k3817j8607j4685j2570j0772q717p425
56909A74104o806n241k561o20p4N54J864K444J745J283J973K745K833L037L808
56894A81088M462N136P110J0223J2439J3004J3808J6666K1264K6411L0885L2266
56882C74762K7649J6945L758p980j6569k1533k2635k0842j8106j5215j1553p377
56870B81304m052j557J833O622J1133J4359J7542K2086K8019L5361M4903N6202
56858E13755O5990O9236O1280M0224R783k0695m2054n1936n3986n1602m5578l7072
$$ plain form
56946 369494 340939 315821 294777 278522 266735 258820 254897 254828 257291 261202 267301 277215 291850
56933 291850 311726 337948 371700 413252 461196 510667 551780 572858 567980 540924 500872 455800
56921 455800 410624 368645 331594 299158 270697 246880 228273 213588 201018 190246 181529 174104
56909 174104 167298 162057 159496 158876 158802 159356 161220 163664 165409 166692 168665 171410 174243 177280 181088
56894 181088 185550 190686 197796 208019 220458 233462 247270 263936 285200 311611 342496 374762
56882 374762 402411 419356 423114 415134 398565 377032 354397 333555 315449 300234 288681 281304
56870 281304 277252 275695 277528 284150 295283 309642 327184 349270 377289 412650 457553 513755
56858 513755 579745 648981 710261 750485 760268 739573 697519 645583 591597 539995 494417 457345
56846D57345k8601k1119j3427n283J939Q215J5196K2945K9849L6455M5719N8616
56834F07849P3202Q8517J04233J14394J07069P5146K5438k6000o5834q9120r7040
56823I17854r3813q4830p4173o3181n2123m1948l3255k5186j6944q969j465O574
56811D28541J5630K4714L3452M3484N6123O9497P8499P6602N8578K4933j5349
56800H94704m9331o9296p6277p4881o8100n7971m7311l8082l0133k3161j7784
56789C42377j3523q490k506K271N324R303J5920K3467L0358L7560M4599M6267
56777E32927L7141J8040m729k4958l9210m6159m6594m3383l9112l4214k8591k3332
56765B57826j9350j5972j2548r855q449p335n786m611m252l632k366j914k913
$$ plain form
56846 457345 428744 407625 394198 388915 390854 399069 414265 437210 467059 503514 549233 607849
56834 607849 681051 769568 873801 988195 1095264 1170410 1195848 1169848 1104014 1014894 917854
56823 917854 824041 739211 665038 601857 549734 507786 474531 449345 432401 423432 421967 428541
56811 428541 444171 468885 502337 545821 601944 671441 749940 826542 885120 910053 894704
56800 894704 845373 776077 699800 624919 556819 498848 451537 413455 383322 360161 342377
56789 342377 328854 320364 317858 320129 325453 334756 350676 374143 404501 442061 486660 532927
56777 532927 570068 588108 583379 558421 519211 473052 426458 383075 343963 309749 281158 257826
56765 257826 238476 222504 209956 200101 191652 184317 178531 173920 169668 166036 163670 161756 158843
56752A58843l641k823j691j498j267o0Q98L77o44r63j228k048k271j160j58m83
56736A40183j069q77q83j681j657J32J615Q15r79j609j436j733j898r73J6j36
56720A27830m98K4L46o64j708j235j51J21J99R48J256K84l36P03J626N35j133
56703A28147j161l87o30j020J13J551J132k00LJ381J613M64m45q37j489j782p84
56686A25669K72k97j397q43P61J075K6m32J77O49O91Q50N95p73k145k138j574
56669A21166j870k184j069M31L89n53m77K21j47j053p14L29Q4j161j317k48K88
56652A12115o0r1K04k59j094r28l6J50k77j55K81J0m43N4P54J74j064j307p66
56633A07262p20q44j19O44J19p95m61M27K63k91K75J058L47p71o3J755K229J550
$$ plain form
56752 158843 155202 152379 150688 149190 147923 147863 148761 149138 148494 147531 146303 144255 141984 140824 140666 140183
56736 140183 139114 138237 137354 135673 134016 134148 135763 136578 135599 133990 132554 130821 128923 127950 127966 127830
56720 127830 127332 127356 127702 127038 125330 124095 123944 124065 124264 125212 126468 126752 126416 127119 128745 129280 128147
56703 128147 126986 126599 125969 124949 125062 126613 127745 127545 127548 128929 130542 131006 130561 129724 128235 126453 125669
56686 125669 125941 125644 124247 123404 124165 125240 125266 124834 125011 125660 126351 127201 127796 127023 124878 122740 121166
56669 121166 119296 117112 116043 116474 116863 116310 115833 116054 115907 114854 114140 114469 114553 113392 112075 111827 112115
56652 112115 112055 111964 112168 111909 110815 109887 109851 110001 109724 109569 109850 109860 109417 109471 110225 110399 109335 108028 107262
56633 107262 106542 105698 105579 106223 106342 105547 105086 105513 105776 105485 105760 106818 107165 106394 106331 108086 110315 111865
56615A11865J825K840K476Q66K35Q82J032M04M12J027Q95K63M44Q49r1j611j699
56598A22914q47j128k173j831l43O5o28l51J017J571J173J562K789L228K905L215
56582A33138L675K722J291J574K723K009p5l50J467K342J328P92J672J994J052
56567A57354Q65K293L531L511L365L650L510L186M067N751O291N624N404N489
56553B13891M274K369K068L036K664Q50J50R43Q16p72j619j196j567l142l795
56538B18970l062k995l991m049k971k969m206m156k427j757l057l893l162k866
56524A73409l809l885k303j246j729j913j064j075k449k874j493n58j187j504
56510A46320o95p88k534l537k459j274j379j222K04J160M79l25o7K40M7M32J288
$$ plain form
56615 111865 113690 116530 119006 119872 120107 120989 122021 122425 122837 123864 124759 125022 125466 126315 126224 124613 122914
56598 122914 122067 120939 118766 116935 116592 116657 116029 115678 116695 118266 119439 121001 123790 127018 129923 133138
56582 133138 136813 139535 140826 142400 145123 147132 147057 146707 148174 150516 151844 152636 154308 156302 157354
56567 157354 158219 160512 164043 167554 170919 174569 178079 181265 185332 191083 197374 202998 208402 213891
56553 213891 218165 220534 222602 225638 228302 229152 229302 230245 231061 230289 228670 227474 225907 222765 218970
56538 218970 215908 212913 208922 204873 201902 198933 194727 190571 188144 186387 183330 179437 176275 173409
56524 173409 169600 165715 163412 162166 160437 158524 157460 156385 153936 151062 149569 149011 147824 146320
56510 146320 145625 144837 142303 138766 136307 135033 133654 132432 132636 133796 134275 133950 133883 134123 134170 134602 135890
56493A35890R00m33j65J938K960J890J273K364K965J837J012J708K080J023L62
56478A57604J267K268K562L424M739M291K132J364K854L633K314J433K374K760
56464A95019J313N49K013L295K537J573J919J948P09L00J661K294Q65j01J121
56449B17015K376J922J476K180K046L16j32K106L895K798R85O60J87j815l024
56434B32991j855j034k877n053m934m126m795n443m272k985l320l432j617J2n94
56419A86666j607j079p70k299l319j594P08Q40J00O63J365O83K99J679K579J044
56403A85958o08J27J426Q31j64N79J490N49n42K78J337P11K81J996L575K489P43
56386B01056J208K487K036J037J576K227J070r6Q64K030J034k74O38K097J598
$$ plain form
56493 135890 136790 136357 136192 138130 141090 142980 144253 146617 149582 151419 152431 154139 156219 157242 157604
56478 157604 158871 161139 163701 167125 171864 176155 178287 179651 182505 186138 188452 189885 192259 195019
56464 195019 196332 196881 198894 202189 204726 206299 208218 210166 210875 211175 212836 215130 215995 215894 217015
56449 217015 219391 221313 222789 224969 227015 227331 227199 229305 233200 235998 236983 237643 237830 236015 232991
56434 232991 231136 230102 227225 222172 217238 213112 208317 202874 198602 195617 192297 188865 187248 187260 186666
56419 186666 185059 183980 183210 180911 177592 175998 176706 177546 177646 178309 179674 180357 180656 182335 184914 185958
56403 185958 185350 185477 186903 187734 187570 188149 189639 190188 189646 189924 191261 191972 192253 194249 197824 200313 201056
56386 201056 202264 204751 206787 207824 209400 211627 212697 212601 213465 215495 216529 216255 216893 218990 220588
56371B20588P58K015L587K722Q85Q22J429M30q73l34N65k76j156N4J365L47r91
56354B31937R1J861J621R99K498M274L741K883M382N946M339J762K198M488N084
56339B78104M694O030P904P664O853Q259J0059Q974O630O640P991P545O394P404
56325C81145Q977P759N132M641N295L823J267Q39J469K0k296k204r20j870m034
56310D09043m028k721l210m386l088n10N9l35J248L217K367P08K194M962M313
56295D09833J442J424M336N920N690O723Q727Q841Q130R968J3142J3753J2688
56282E10617J3904J6766J7574J7225J9626K3781K5317K4803K6655L0756L3099
56271G60123L4021L7794M4489N0000N3893N9635O7507P4620Q1434R0967J02172
$$ plain form
56371 220588 221346 223361 226948 229670 230555 231377 232806 233236 232363 232029 232594 232318 231162 231216 232581 232928 231937
56354 231937 232028 233889 235510 236509 239007 243281 247022 249905 254287 260233 264572 266334 268532 273020 278104
56339 278104 282798 288828 296732 304396 311249 319508 329567 338541 345171 351811 359802 367347 373741 381145
56325 381145 390122 397881 403013 407654 412949 416772 418039 418878 420347 420367 418071 415867 414947 413077 409043
56310 409043 405015 402294 399084 394698 391610 391100 391159 390824 392072 395289 397656 398364 400558 405520 409833
56295 409833 411275 412699 417035 422955 428645 435368 444095 452936 461066 471034 484176 497929 510617
56282 510617 524521 541287 558861 576086 595712 619493 644810 669613 696268 727024 760123
56271 760123 794144 831938 876427 926427 980320 1039955 1107462 1182082 1263516 1354483 1456655
56260A456655J11428J19639J30468J42612J51507J57499J64320J70639J71363
56251B776130J66384J59704J50829J35656J15131R4344P3626M9397K3245J143
56241C745589j6124l2728m8378n8383o3096o7932p3712p6169p5430p6663q0681
56230C076293q3104q3504q6188r1204r3882r4157r7107j03221j07350j08397j10637
56219B017542j14228j13825j08135j01821r6478q8725p8601p0739o5754n9356
56209A119880n1269m6061m3968m0241l4656l2248l3326l2343k8046k5118k4371
56198G28233k1180j5175j1492j0791p986k628l23j960j836J597L437K712M418
56185F67026Q975J0423P691O988J0191J1550Q872P248Q652Q367M932L119L927
$$ plain form
56260 1456655 1568083 1687722 1818190 1960802 2112309 2269808 2434128 2604767 2776130
56251 2776130 2942514 3102218 3253047 3388703 3503834 3598178 3671804 3721201 3744446 3745589
56241 3745589 3729465 3696737 3648359 3589976 3526880 3458948 3385236 3309067 3233637 3156974 3076293
56230 3076293 2993189 2909685 2823497 2732293 2638411 2544254 2447147 2343926 2236576 2128179 2017542
56219 2017542 1903314 1789489 1681354 1579533 1483055 1394330 1315729 1244990 1179236 1119880
56209 1119880 1068611 1022550 978582 938341 903685 871437 838111 805768 777722 752604 728233
56198 728233 707053 691878 680386 669595 661609 658981 658658 656698 654862 656459 659896 662608 667026
56185 667026 676001 686424 694115 701103 711294 722844 731716 738964 747616 755983 760915 764034 767961
56172G67961K267k373l823q78k6l266m437j256L73k032k888L39K556J686K777
56157G56980P212R096O800O873J1940J5842J5430J5983K0255K3393K3554K6297
56145I39655L3598L9746M2895M9264O1186P2806Q2410R6958J19078J41590J60108
56134A839294J78630J96920K05022J96917J78197J54896J27081R8924Q1539P8463
56124C335883Q0030P7935P3028O3822M2359R333k0567l6822m4342m9979n2134
56113C478546n1843n9688q1487j08948j33142j54994j74715j84371j80286j70385
56103B178687j60592j46448j26179j08391r7891q7324p1859n8488n1878m5011
56093A224626l3433k4565k3117k1446j4317q921j0123j0430m852r53l464m130
$$ plain form
56172 767961 770228 767855 764032 763154 763128 759862 755425 754169 754542 752510 749622 749961 752517 754203 756980
56157 756980 764192 773288 780088 786961 798901 814743 830173 846156 866411 889804 913358 939655
56145 939655 973253 1012999 1055894 1105158 1166344 1239150 1321560 1418518 1537596 1679186 1839294
56134 1839294 2017924 2214844 2419866 2616783 2794980 2949876 3076957 3175881 3257420 3335883
56124 3335883 3415913 3493848 3566876 3630698 3673057 3682390 3661823 3625001 3580659 3530680 3478546
56113 3478546 3426703 3367015 3285528 3176580 3043438 2888444 2713729 2529358 2349072 2178687
56103 2178687 2018095 1871647 1745468 1637077 1539186 1451862 1380003 1321515 1269637 1224626
56093 1224626 1191193 1166628 1143511 1122065 1107748 1098827 1088704 1078274 1073422 1072469 1069005 1064875
56081A064875K145O525L016L68N314R674O649M076Q622J2460R036O368J1084J4909
56067A165121J0986P744J2350J6355J2370Q941J3829J8593J5129J1413J5255J8772
56055A326858J4845J2338J8696K4295K0803J7876K4471L1056K8197K5145L1354
56044A575934L7376L3393K8970L4541M0957L7687L3648L9266M5583M2289L8534
56033A988178M4406M9994M4810L9478M5563N2730M8982M4296N0312N6300N0077
56022B515126M2973M8585N6623N3824N0352N8758O7721O4299O0831P1316Q3065
56011C173473Q1099P7988Q8904J00610R7332R3358J06337J22305J22311J19197
56001D182914J31648J46809J46484J44886J60942J79132J78844J75867J92113
$$ plain form
56081 1064875 1067020 1073545 1076561 1076929 1082243 1091917 1098566 1102642 1111264 1123724 1132760 1139128 1150212 1165121
56067 1165121 1176107 1183851 1196201 1212556 1224926 1233867 1247696 1266289 1281418 1292831 1308086 1326858
56055 1326858 1341703 1354041 1372737 1397032 1417835 1435711 1460182 1491238 1519435 1544580 1575934
56044 1575934 1613310 1646703 1675673 1710214 1751171 1788858 1822506 1861772 1907355 1949644 1988178
56033 1988178 2032584 2082578 2127388 2166866 2212429 2265159 2314141 2358437 2408749 2465049 2515126
56022 2515126 2558099 2606684 2663307 2717131 2767483 2826241 2893962 2958261 3019092 3090408 3173473
56011 3173473 3254572 3332560 3421464 3522074 3619406 3712764 3819101 3941406 4063717 4182914
56001 4182914 4314562 4461371 4607855 4752741 4913683 5092815 5271659 5447526 5639639
55992E639639K11735K11975K09268K27733K51041K54766K56667K83069L16079
55983G861972L28474L39273L77426M23268M46474M67949N20099N81363O18139
55974A1964437O54373P27104Q12310Q72455R36378J048758J184020J300334J432298
55965B0932467J632419J871112K102282K374634K760666L235777L760972M419818
55957D3090147N320399O428280P664960R094354J0822755J2822391J5104308J7956588
55949A28304182K1715219K6450608L2245746L9372442M7078833N1916615M8585882
55942C95669527L4013445J0866696j3611423l2505631m2986529m6092882m4314077
55935B61039126l9917333l4598027k9434652k4821624k0737300j7168810j4180213
$$ plain form
55992 5639639 5851374 6063349 6272617 6500350 6751391 7006157 7262824 7545893 7861972
55983 7861972 8190446 8529719 8907145 9330413 9776887 10244836 10764935 11346298 11964437
55974 11964437 12618810 13345914 14158224 15030679 15967057 17015815 18199835 19500169 20932467
55965 20932467 22564886 24435998 26538280 28912914 31673580 34909357 38670329 43090147
55957 43090147 48410546 54838826 62503786 71598140 82420895 95243286 110347594 128304182
55949 128304182 150019401 176470009 208715755 248088197 295167030 347083645 395669527
55942 395669527 429682972 440549668 426938245 394432614 351446085 305353203 261039126
55935 261039126 221121793 186523766 157089114 132267490 111530190 94361380 80181167
55928H0181167j1724584r660691p934355o565296n492755m596098l838619l250628
55920B7118141k799530k404348k052374j783782j582775j390628j205249j068045
55912A2831410r70294q64735p53024o74934o25811n65768m96923m54720m34861
55903F990340m01202l55015l28138l17747k92950k56538k38081k34551k17061
55894D349057j88186j75718j77241j65764j43171j35128j39451j30843j11066
55885B982489j04914j11304j06245q9909q4583q9838q4462o9468o5851p2637o9120
55874B034158n5916n2989n9394n5072m0721l6894m4750m5363l7040l6503m3761
55863A525755m1667l0254k6676l1100k6592j3014p656j1551p857N104J0752N518
$$ plain form
55928 80181167 68456583 58795892 50861537 44296241 38803486 34207388 30368769 27118141
55920 27118141 24318611 21914263 19861889 18078107 16495332 15104704 13899455 12831410
55912 12831410 11861116 10996381 10243357 9568423 8942612 8376844 7879921 7425201 6990340
55903 6990340 6589138 6234123 5905985 5588238 5295288 5038750 4800669 4566118 4349057
55894 4349057 4160871 3985153 3807912 3642148 3498977 3363849 3224398 3093555 2982489
55885 2982489 2877575 2766271 2660026 2570117 2485534 2395696 2311234 2241766 2175915 2103278 2034158
55874 2034158 1978242 1925253 1865859 1810787 1770066 1733172 1688422 1643059 1606019 1569516 1525755
55863 1525755 1484088 1453834 1427158 1396058 1369466 1356452 1348796 1337245 1329388 1334492 1345244 1350762
55851A350762K688L813l793j9332k7309k5839k8493l6656l7710l1713l2414m0030
55839A073974m0143l1436k8048l2383l1765k4292k2256k7191k6717j8982j5828
55828G74933j8971j7060r069o772j1231j0367k808r17o952r107m530l609q013
55815F65527o933R21L692j247k820J739J840n156q604n349n451j2101j5582j2375
55801E98101j1109j4477j4060q091n939j0062j1502p930q112j3844j5491j0423
55789D67061q062j1639j2504p630n326q290q162k307Q82j288o06N009O016j293
55775D11861q014r205j1310j7060j8878j3877j0178j1807j1896p184m648p356
55763B80448q057l343k73k483l452J29J771j715l732q17Q27k113l775j353j123
$$ plain form
55851 1350762 1353450 1357263 1353470 1334138 1306829 1280990 1252497 1215841 1178131 1146418 1114004 1073974
55839 1073974 1033831 1002395 974347 941964 910199 885907 863651 836460 809743 790761 774933
55828 774933 755962 738902 729833 723061 711830 701463 698655 697738 690786 681679 677149 673540 665527
55815 665527 658594 659515 663207 661960 659140 660879 662719 657563 648959 643610 638159 626058 610476 598101
55801 598101 586992 572515 558455 550364 544425 534363 522861 514931 506819 492975 477484 467061
55789 467061 458999 447360 434856 427226 421900 413610 405448 403141 404023 402735 402129 407138 413154 411861
55775 411861 403847 394642 383332 366272 347394 333517 323339 311532 299636 292452 287804 280448
55763 280448 272391 269048 268775 266292 262840 262969 264740 263025 259293 258476 259303 257190 253415 252062 250939
55748B50939o043r745q743q471j1474j1836p185m034n439n432j322P26j939k917
55734A67085N77J950j775l655M6K659j32k406N0J701j538m207k020J03j958l734
55718A52746j622o2k237l369k27K296P94n9K972N188L490K819O442R379Q100P269
55702A93919J0155J1761Q349M550M083K682k790p233o536n165p346r217o986m614
55688A85612o094p953o623n605q314j1100j0087p799o787m100J795O190O292O512
55674A31939R717J1200P586L580L377L270l87l811l309k450m626n822k122K619
55660A50761L684L365N008N957L335M53O19Q44j832m116k916j570l269m829l319
55645A52175k230m617o725n056l086m369n617l512j679l808o262m771k243k708
$$ plain form
55748 250939 244896 235151 226408 217937 206463 194627 187442 183408 177969 172537 171215 171941 170002 167085
55734 167085 167662 169612 167837 164182 164228 166887 166755 164349 164399 166100 164562 160355 158335 158438 156480 152746
55718 152746 151124 151062 148825 145456 145229 147525 148319 148260 151232 156420 159910 162729 169171 178550 186650 193919
55702 193919 204074 215835 224184 228734 232817 235499 232709 225476 218940 213775 206429 197212 190226 185612
55688 185612 179518 171565 164942 159337 151023 139923 129836 122037 115250 111150 112945 119135 125427 131939
55674 131939 141656 152856 160442 164022 167399 170669 170282 166471 163162 160712 156086 150264 148142 150761
55660 150761 154445 157810 162818 168775 172110 172563 173182 174026 172194 168078 165162 163592 160323 155494 152175
55645 152175 149945 145328 138603 133547 130461 126092 120475 116963 115284 111476 105214 100443 98200 95492
55631I5492l568j317R97m88k851j917k8j055k835j805j52j231k693j123J176P54
55615G7356m00O26J515m64k382j033O51r60l266k485o58j010j424P74K575O92
55599G0107j732o78J335L34j491l45J689R35o42L88J873M60j355K47K899K283
55583G6307j0lJ166K92j146k42J038k83j801p3K460J810j9J081L643L831K917
55566I0968M380O870O948N652N622N156J849j468j314m18k935o553o690m967n733
55551I7367p607o335l214k615l676k314O87J277j16R5J452Q04r07l13J647J500
55535G7732J2N38K289J978K90K59J039k52k416k341j180j954l324k346r12k548
55519F6864n209m504j823j834l871l509j011m64j821j434M44K44j678j655Q2j3
$$ plain form
55631 95492 91924 90607 91604 91116 88265 86348 86320 85265 82430 80625 80473 79242 76549 75426 76602 77356
55615 77356 76956 77582 79097 78633 76251 75218 75869 74909 71643 69158 68500 67490 66066 66840 69415 70107
55599 70107 68375 67697 69032 69366 67875 67530 69219 70154 69512 69900 71773 72233 70878 71125 74024 76307
55583 76307 76297 76294 77460 77752 76606 76364 77402 77119 75318 75245 77705 79515 79496 80577 84220 88051 90968
55566 90968 95348 102218 109166 114818 120440 125596 127445 125977 124663 124245 121310 114757 108067 103100 97367
55551 97367 89760 83425 80211 77596 73920 71606 72293 73570 73454 73549 75001 75805 74898 74585 76232 77732
55535 77732 77744 78282 80571 82549 82839 83098 84137 83885 81469 79128 77948 75994 72670 70324 69412 66864
55519 66864 61655 57151 55328 53494 49623 46114 45103 44639 42818 41384 41828 42072 40394 38739 38821 38808
55503C8808j721j578P3l30k390k187L51J388K93J36J209P01j203j386L1j49j850
55486C0196j788J51P99q4L15J825J332r95j646j53L69p20q47L38M58m36R9J670
55468C0883J453k41l98P59J09k184k649q95r6r06o48J023J404J58kJ308J522K80
55450C0880qQ63N41r67j139P3J68q50n30R34R06m32l42R70N45j579k242r34k32
55431B6625m44O21K460K119r4p79L75L35j165j099P51J178k74m00J481K240Q82
55414C4812P9P06M41r75p03J679L036K361K305L679L797J819M56Q10O08r17j396
55397E2597j94K8j681k757j962j392k158k519j819j765k477j720N71J513K86n26
55381C4025J81M16m93n12P24Q01q30j641p38l14j081q55Q72J567L49m24L16O20
$$ plain form
55503 38808 37087 35509 35582 35252 32862 30675 31026 32414 32707 32843 34052 34753 33550 32164 32195 32046 30196
55486 30196 28408 28559 29358 29274 29589 31414 32746 31751 30105 29952 30321 29601 28754 29092 29550 29114 29213 30883
55468 30883 32336 32095 31697 32456 32565 30381 27732 26837 26741 25835 25187 26210 27614 27772 27770 29078 30600 30880
55450 30880 30872 31735 32276 31309 30170 30243 30411 29561 29031 29965 30871 30439 30097 31067 31612 30033 27791 26857 26625
55431 26625 26181 26802 29262 31381 31287 30508 30883 31218 30053 28954 29705 30883 30609 30209 31690 33930 34812
55414 34812 34891 35597 36038 35063 34360 36039 39075 41436 43741 47420 51217 53036 53492 54302 54910 53993 52597
55397 52597 52403 52431 50750 47993 46031 44639 42481 39962 38143 36378 33901 32181 32752 34265 34551 34025
55381 34025 34206 34622 34129 33617 34341 35142 34312 32671 31933 31619 30538 29683 30555 32122 32471 32047 32363 32983
55363C2983k99n96J76j2j355j344M61J258Q3n56M67R13l18j209p00m43r93o50
55345B7866N77K69j693k302o65M86n5n6J339J805N25j2J161J644M61m2R08O27
55327C2843j816l237j694L11M51R2O52P16o62j650j087n50q81n11Q00P19j219
55310B3277j997j08J909K030J621J778J072p97j342L43J620R84M64J220J092r63
55294C2203k369j426k30m76n71N70J007k94j149m19l22j811k150KJ544J92j480
55277B2821p45P06N18O1J261K530J797L78K68N17l26j094n64j76j082j448J77
55260B5599J809J395K78L03M70n00j273n83J07m83q53J76Q65mm24J040K083N59
55242C0564j559j601n43n24q67p0Q48M47j81L27P84n3p48J28J143P21J04O71J094
$$ plain form
55363 32983 32684 32088 32264 32252 30897 29553 30014 31272 31355 30799 31266 32179 31861 30652 29952 29509 28516 27866
55345 27866 28443 28712 27019 24717 24052 24538 24483 24427 25766 27571 28096 28084 29245 30889 31350 31308 32216 32843
55327 32843 31027 27790 26096 26407 26858 26950 27602 28318 27656 26006 24919 24369 23488 22977 23777 24496 23277
55310 23277 21280 21172 23081 25111 26732 28510 29582 28785 27443 27786 29406 30390 30854 32074 33166 32203
55294 32203 29834 28408 28178 27702 27131 27701 28708 28414 27265 26846 26524 24713 22563 22565 24109 24301 22821
55277 22821 22076 22782 23300 23361 24622 27152 28949 29327 29595 30112 29786 28692 28128 27952 26870 25422 25599
55260 25599 27408 28803 29081 29384 29854 29354 28081 27498 27605 27122 26269 26445 27310 27306 26882 27922 30005 30564
55242 30564 29005 27404 26861 26337 25470 25400 26248 26695 26514 26841 27625 27572 26824 26952 28095 28816 28920 29591 30685
55223C0685Q9q11j35O84K25j04Q38J197m01j775r32K93k48r94J05J461Q66k78
55205C0765K62J207L37j092o75O95P37PK07M03r56k309j314P87J194K43K03R01
55187C1602N27n69o15J46K49L3O47J309P50o3L30R53K84o31j21P61J39j139j134
55168C3458m01o16j192n99M06J89n74k84M27R7n21J2Q12L12n57k9J111R59j01
55149C2909m69l23n96n53O45J561O99n91l82M83L43L8R84J922J058l86k43P27
55131C7826N09k80J32J064Q96N55J763L317K879J100K29P4r45k129j686m02l62
55114D4540j228j336j144j912k392p43J581J844O46N48J367R96j76P1J482J883
55098D6027J270J390J890J022m78l43R49R36k98l88Q18J162L20J11P70P25N8M18
$$ plain form
55223 30685 30774 29963 29828 30512 30737 30633 31471 32668 32267 30492 29560 29853 29605 28611 28716 30177 31043 30765
55205 30765 31027 32234 32571 31479 30804 31499 32236 32243 32450 32853 31897 29588 28274 29061 30255 30498 30701 31602
55187 31602 32129 31560 30945 31091 31340 31373 32020 33329 34079 34016 34346 35299 35583 34952 34831 35592 35731 34592 33458
55168 33458 33057 32441 31249 30650 31056 31245 30671 30387 30814 30911 30390 30402 31214 31526 30969 30940 32051 33010 32909
55149 32909 32440 32117 31521 30968 31613 33174 33873 33282 32900 33383 33726 33764 34748 36670 37728 37342 37099 37826
55131 37826 38335 38055 38187 39251 40147 40702 42465 45782 48661 49761 49990 50064 49119 46990 45304 44902 44540
55114 44540 43312 41976 40832 38920 36528 35785 37366 39210 39856 40404 41771 42767 42591 42662 44144 46027
55098 46027 47297 48687 50577 51599 51121 50778 51727 52663 52365 51977 52795 53957 54277 54388 55158 55883 55941 56359
55080E6359J523J447L10J06Q99P93k87m51M95P40l4k73K25N3p37n95M29P27K86
55061F2015O00J441R89p00j554j015o37j105j435j295j253r06N59K146K118Q71
55045F0839O7l35j292j897o45J287J499L57R4O45J85r42p34M65N02m26j46J158
55027F0681J102m15j050l92m27j387j290nL39m69k37J326J789L61q51q47j143
55010E7085k193k183o15M49K9k81L72N54m80j324j163j020j171l40J506K458J855
54993E3538J354J837K017J153L56K29j47r72j039j20N07O02J392K845L221K056
54977F8829J011J100J574J986K861L845L857L349L757M687M512L758M659P147
54963A16932Q778Q965R766J1933J3807J4890J6773J9449K0383J8579J6189J4569
$$ plain form
55080 56359 57882 59329 59639 59745 60644 61437 61150 60699 61194 61934 61900 61627 61852 61905 61168 60573 61002 61729 62015
55061 62015 62615 64056 65045 64345 62791 61776 61139 60034 58599 57304 56051 55145 55704 57850 59968 60839
55045 60839 60906 60571 59279 57382 56737 58024 59523 59880 59974 60619 60804 59862 59128 59593 60095 59669 59523 60681
55027 60681 61783 61368 60318 59926 59499 58112 56822 56817 57156 56687 56450 57776 59565 59926 59075 58228 57085
55010 57085 54892 52709 52094 52543 52572 52291 52663 53217 52737 51413 50250 49230 48059 47719 49225 51683 53538
54993 53538 54892 56729 58746 59899 60255 60484 60337 59365 58326 58206 58713 59315 60707 63552 66773 68829
54977 68829 69840 70940 72514 74500 77361 81206 85063 88412 92169 96856 101368 105126 109785 116932
54963 116932 125710 134675 144441 156374 170181 185071 201844 221293 241676 260255 276444 291013
54951B91013J1948O649k27o824j2622j7225j9634j9958j9621j8967j7005j4082
54939A63445j2052j1211r907p751o249n678m433k237q44q23p84m46j083k252j617
54924I6078R82K895L131L775N775P148O951P280R463J1795J3001J4524J7263J9229
54910B19290J8588J6196J3079Q381J778m743r616j3569j7074j8731j8038j6928
54898A78613j6635j5721j3118j0394r001p972o336n177n283n293m140k924k469
54885G4150j704k29J88j217k324j504k78l90q50k73L18m59j644j722j197j184
54869E9681j269q47p20j372j587n31O08P22N02N37Pj165j327J7Q37n5q56lJ101
54850E4280Q16J10L24N63j93p03K34J246O54o22q83m66l97j89O86J079K22l96
$$ plain form
54951 291013 302961 309610 309383 302559 289937 272712 253078 233120 213499 194532 177527 163445
54939 163445 151393 140182 130275 122524 116275 110597 106164 103927 103083 102260 101476 101030 99947 97695 96078
54924 96078 97060 99955 103086 106861 112636 119784 126735 134015 143478 155273 168274 182798 200061 219290
54910 219290 237878 254074 267153 275534 277312 272569 262953 249384 232310 213579 195541 178613
54898 178613 161978 146257 133139 122745 113744 105772 99436 94259 88976 83683 79543 76619 74150
54885 74150 72446 72217 72405 71188 68864 67360 67082 66692 65842 65569 65887 65428 63784 62062 60865 59681
54869 59681 58412 57565 56845 55473 53886 53355 53963 54685 55187 55724 55731 54566 53239 53256 54093 54038 53182 53179 54280
54850 54280 55096 55206 55530 56093 55900 55197 55431 56677 57331 56709 55826 55360 54963 54774 55460 56539 56761 56365
54832E6365M33J320P53q3M72J479J232L57M35J081J067Q26J337J883J394P36J288
54815G2375K552L327L916N006N871N865O175P877R774J0379J0583J2043J4373
54802A70116J6240J7733J9345J9950J8205J4750J0849O162J15n931j0198j2999
54790B64337j5540j7425j7557j6330j4782j2798j0099p844p133p144o573n638
54778A25474m900l711j732l73n52o90Q55L009L877L792M118M623M529M702O263
54763A49284Q391R883J1537J4474J7513J8854J9051J9713K0312J8976J5441J0795
54751C34224N271j225p446j2028j5465j8616k0532k0079j8468j7593j6996j5158
54739A75889j2659j1289j0874r785p910o511n755m775l733l415l391k702j794
$$ plain form
54832 56365 56798 58118 58871 58788 59260 60739 61971 62328 62763 63844 64911 65737 67074 68957 70351 71087 72375
54815 72375 74927 78254 82170 87176 93047 98912 105087 112964 122738 133117 143700 155743 170116
54802 170116 186356 204089 223434 243384 261589 276339 287188 293350 293465 287534 277336 264337
54790 264337 248797 231372 213815 197485 182703 169905 159806 151962 144829 137685 131112 125474
54778 125474 120574 116863 115131 114758 114206 113516 114371 117380 121257 125049 129167 133790 138319 143021 149284
54763 149284 157675 167558 179095 193569 211082 229936 248987 268700 289012 307988 323429 334224
54751 334224 339495 338270 330824 318796 303331 284715 264183 244104 225636 208043 191047 175889
54739 175889 163230 151941 141067 131282 123372 116861 111106 106331 102598 99183 95792 93090 91296
54726I1296j694j973j604r54r33j105o05nj82m69M3N58Q9n04j10L65k67r47j83
54707H0816J038R02j4K2O80N60J84R26J956J461K8l39K16Kp69m81M50O3j450j786
54687H4465l30J171J690J847J718O21p40p42L91Q29K02p6M09N66K52O71K073L277
54669I8294L753M096M352M011L517L778M373M295L979M342M513L024Q33L01J479
54654A48940K209J770J616K381K977K961L147L623L582L397M364O190P120O776
54640B01053O377O044M442J470j286l259n578q478j0407j0455r625r029q635q273
54626A44361q043p416n730l776l085l512l411k224r18N6J174K136J947R17N54
54611A13030J266K065K584L359M147M006L097K423J865O01q06j048o10j204k686
$$ plain form
54726 91296 89602 87629 86025 85071 84138 83033 82428 82423 82241 81772 81815 82373 82462 81958 81848 82213 81946 80999 80816
54707 80816 81854 82756 82742 82764 83444 84004 84188 85114 87070 88531 88559 88220 88436 88438 87669 87188 87638 87701 86251 84465
54687 84465 84135 85306 86996 88843 90561 91182 90442 89700 90091 90920 91122 91046 91455 92021 92273 92944 95017 98294
54669 98294 102047 106143 110495 114506 118023 121801 126174 130469 134448 138790 143303 146327 147160 147461 148940
54654 148940 151149 152919 154535 156916 159893 162854 166001 169624 173206 176603 180967 187157 194277 201053
54640 201053 207430 213474 217916 219386 218100 214841 209263 200785 190378 179923 170298 161269 152634 144361
54626 144361 136318 128902 123172 119396 116311 112799 109388 107164 106246 106302 107476 109612 111559 112476 113030
54611 113030 114296 116361 118945 122304 126451 130457 133554 135977 137842 138443 137637 136589 135979 134775 132089
54596A32089l189k410k122k991l632l314l119l625l878l427l235l677l655k538
54582H7277j220n53l68n37j291k100j874o73L14O02O49L97n98j658j560o24k34
54565G5949m63k21M11K58n86q01k68j27m19n2P92P30k40o95m26n94j077m48J108
54546G2831J613N79j69M56J493K193L006L718L221J889J579K555L031K478K593
54531A03066M095N206M598L257K198P55j517l483m323m788n387n301m185l082
54517I1109k522j684l74J79n01j222j265j431k032j992r52j89l62m48J85O48M85
54500G7632N86J216J274N21L26J090J297K62m49K48J159J147J042J639J925J039
54484I1954J03L20R70R50O65Q55J055Q07Q67J705K239J598O96O76J053Q50K71
$$ plain form
54596 132089 128900 126490 124368 121377 117745 114431 111312 107687 103809 100382 97147 93470 89815 87277
54582 87277 86057 85504 85136 84599 83308 81208 79334 78661 78975 79577 80226 80623 80025 78367 76807 76183 75949
54565 75949 75486 75265 75676 75934 75348 74547 74279 74152 73733 73681 74473 75203 74963 74268 73842 73248 72171 71723 72831
54546 72831 74444 75023 74854 75310 76803 78996 82002 85720 88941 90830 92409 94964 97995 100473 103066
54531 103066 107161 112367 116965 120222 122420 123175 121658 118175 113852 109064 103677 98376 94191 91109
54517 91109 88587 86903 86529 86708 86207 84985 83720 82289 80257 78265 77313 77124 76762 76314 76499 77147 77632
54500 77632 78218 79434 80708 81229 81555 82645 83942 84204 83755 84003 85162 86309 87351 88990 90915 91954
54484 91954 92057 92377 93347 94297 94962 95817 96872 97679 98546 100251 102490 104088 104784 105460 106513 107363 107634
54467A07634k4j10j20L84J283J439M03o93r05p96r92r76k82L73K48m13j204k083
54449A03166k486j565L3L72r52k033j515l91L1L0J74m4r41j586j244n13p4K88
54431I0750O05K28p22j054l86L07N84J080J612R41p40j365o5J484J853J771K126
54414I9009K325J928J768K135J953J022Q66K048K952K618K342L045L518K957K708
54399A33194L639M243L377K495K968L556K865K051K507K955J587p39k148k909
54385A59641m248n446n036l731l414m081m297l828l502l239k466j797k172k968
54371A09416k943k351k305k751k799k331j719p63N10R97L0j269j613j346j177
54356H7586n97P84J730J143K6j46L27N91J249L017M754N004M302L942L660K777
$$ plain form
54467 107634 107610 107500 107380 107764 109047 110486 110889 110196 109291 108495 107503 106527 106245 106618 106866 106453 105249 103166
54449 103166 100680 99115 99148 99520 98568 96535 95020 94629 94660 94690 94864 94820 93879 92293 91049 90536 90462 90750
54431 90750 91355 91583 90861 89807 89421 89728 90312 91392 93004 93945 93205 91840 91775 93259 95112 96883 99009
54414 99009 101334 103262 105030 107165 109118 110140 111006 113054 116006 118624 120966 124011 127529 130486 133194
54399 133194 136833 141076 144453 146948 149916 153472 156337 158388 160895 163850 165437 164698 162550 159641
54385 159641 155393 149947 144911 141180 137766 133685 129388 125560 122058 118819 116353 114556 112384 109416
54371 109416 106473 104122 101817 99066 96267 93936 92217 91454 91964 92961 92991 91722 90109 88763 87586
54356 87586 86989 87773 89503 90646 90672 90526 90853 91444 92693 95710 100464 105468 109770 113712 117372 120149
54340A20149K251L185M410M075K668J979J955J151l86j282j436j970k910l223
54326A30616k944l121l839m268m467n124n806n384m039l053k783k533k150k032
54312G9073j911j229m72n15r83q91m65p28j613k058j765j388j198q95m90j97J74
54295F2449O61N88l71j261j085j91N59J038J230N78q16j574r53r7q0j71M79J064
54277F2047P47M88J275K046J552P83J196J981J559N61O51J437J300M82N50J408
54261H0063J548Q69O47R68O94j91n42k18j70m95m78k54n25r21o41k18o47j265
54243G8224p03N60P60l58j472j932k014j421J59J495J104k55o74k01n01j661j982
54226F9128q34N96J513K160K328J461K47J4N67O56L15N20Q73J18j200j172L20
$$ plain form
54340 120149 122400 125585 129995 134070 136738 138717 140672 141823 141437 140155 138719 136749 133839 130616
54326 130616 127672 124551 120712 116444 111977 106853 101047 95663 91624 88571 85788 83255 81105 79073
54312 79073 77162 75933 75461 74946 73963 73072 72607 71879 70266 68208 66443 65055 63857 62962 62472 62275 62449
54295 62449 63110 63698 63327 62066 60981 60790 61349 62387 63617 64195 63379 61805 60852 60755 60675 60504 60983 62047
54277 62047 62794 63282 64557 66603 68155 68938 70134 72115 73674 74235 74886 76323 77623 78105 78655 80063
54261 80063 81611 82480 83127 84095 84789 84598 84056 83838 83668 83173 82695 82441 81916 80995 80354 80136 79489 78224
54243 78224 77521 78081 78841 78483 77011 75079 73065 71644 71803 73298 74402 74147 73473 73272 72771 71110 69128
54226 69128 68294 68890 70403 72563 74891 76352 76599 76613 77180 77836 78151 78671 79544 79662 78462 77290 77610
54209G7610J392J225Q86Q71L12q76j417q90m42p26j016q20o24o66o41p27j308
54192G2143j660p81O82J210Q82J010J543J184m8p78q29j296j986j375M65J470
54176G1836O86n13r55j153j604j762j405j115q43P2J140J000j95q47o49r14j729
54159F1050j350P54K640K762J956J431R03j11q69o24J52P29J006Q24j60j352j464
54142F8277m77J74j76n92l82n7K2L12Q24Q16K99J51M11J07q17j213q03o89j250
54123F4937j383n10M07N62L34J59j23l29nL11l74j525j533l70L24L6l9M59L52
54104F1690n59q21ML83m68j209q89n14q71r35Q2J092R55K20k58p29j333j238k29
54085E4373M36L1l87O0O04N15N38J275J768J179L52K93M75J18k07K67R23P26j28
$$ plain form
54209 77610 79002 80227 81113 81984 82296 81420 80003 79113 78671 77945 76929 76109 75485 74819 74178 73451 72143
54192 72143 70483 69702 70384 71594 72476 73486 75029 76213 76165 75387 74558 73262 71276 69901 70366 71836
54176 71836 72522 72009 71054 69901 68297 66535 65130 64015 63172 63244 64384 65384 65189 64342 63693 62779 61050
54159 61050 59700 60454 63094 65856 67812 69243 70146 70035 69166 68542 68694 69423 70429 71253 71093 69741 68277
54142 68277 67800 67974 67798 67206 66824 66767 66789 67101 67925 68741 69040 69191 69602 69709 68892 67679 66876 66187 64937
54123 64937 63554 63044 63451 64013 64347 64506 64383 64054 64049 64360 63986 62461 60928 60558 60882 60918 60879 61338 61690
54104 61690 61131 60310 60314 60697 60229 59020 58131 57617 56746 55811 55893 56985 57940 58160 57902 57173 55840 54602 54373
54085 54373 54809 54840 54453 54513 55117 55632 56170 57445 59213 60392 60744 61037 61512 61630 61423 61690 62613 63339 63211
54066F3211p69r20o15L21J542J987J315N13L44L37L7m6M42R12R87J219J910K436
54048G5163K415K207J784O55n82l80J283K449K024J284J550K289K725L411M723
54033A03000N468M663L363L193M167N245N939O217N871N134M837N086M898L907
54019A70988L091L055L075K686K564K891K542J030l87p13p45j392k126k348k720
54004A81491l777m739m929m932n167m863l749l053l454l713k781j652j482j610
53990A31590j091o40j189j891j526o64o01j182j394j162r71o18J42O84N58M04
53974A20449O41N00l55p91j18M80M1l44M33J285Q47P2O19J883K021J040M02L36
53956A29441j72j104j372p69j53K17Q08J525J859J993K386K684K341J918K379
$$ plain form
54066 63211 62442 61522 60907 61228 62770 64757 66072 66585 66929 67266 67303 67257 67699 68611 69598 70817 72727 75163
54048 75163 77578 79785 81569 82224 81642 81262 82545 84994 87018 88302 89852 92141 94866 98277 103000
54033 103000 108468 113131 116494 119687 123854 129099 135038 141255 147126 152260 157097 162183 167081 170988
54019 170988 174079 177134 180209 182895 185459 188350 190892 191922 191535 190822 190077 188685 186559 184211 181491
54004 181491 177714 172975 168046 163114 157947 153084 149335 146282 142828 139115 136334 134682 133200 131590
53990 131590 130499 129859 128670 126779 125253 124589 123988 122806 121412 120250 119279 118661 118803 119487 120045 120449
53974 120449 121090 121590 121235 120444 120326 120806 120847 120503 120936 122221 123068 123140 123759 125642 127663 128703 129105 129441
53956 129441 129269 128165 126793 126024 125871 126088 126896 128421 130280 132273 134659 137343 139684 141602 143981
53941A43981L550M574N300O060O638O704O608O617O090M534K648J121n22k663
53927B01240m268m304l494l073k794j713j65P31Q52Q67R62J093J707K885L628
53912A94154L397L290M296N553N842N690O213O939O643N460M345L324K010R83
53898B58139P98O04m99j657j700j333j873k822k928k721l649n366o274o254o462
53883B16003o911o619n852n799o222n779m636m392n282n703m791l480k705k402
53869A45430k469l035l560l313k794l090l917m022l360l042l193k817j816j240
53855A03762j346j263q24q90j533j685r55k03K0R9J10m51j401j767j269n53Q3
53838H9934Q32J227N16p25j013j87M40L41M07R37Q66k61j254j126o02p39j245
$$ plain form
53941 143981 147531 152105 157405 163465 170103 176807 183415 190032 196122 200656 203304 204425 203903 201240
53927 201240 196972 192668 189174 186101 183307 181594 181429 182160 183012 183879 184841 185934 187641 190526 194154
53912 194154 197551 200841 205137 210690 216532 222222 228435 235374 242017 247477 251822 255146 257156 258139
53898 258139 258937 259541 259042 257385 255685 254352 252479 249657 246729 244008 240359 234993 228719 222465 216003
53883 216003 209092 202473 196621 190822 184600 178821 174185 169793 164511 158808 154017 150537 147832 145430
53869 145430 142961 139926 136366 133053 130259 127169 123252 119230 115870 112828 109635 106818 105002 103762
53855 103762 102416 101153 100329 99439 97906 96221 95266 95063 95083 95182 95292 94841 93440 91673 90404 89851 89934
53838 89934 90766 91993 92509 91784 90771 90584 91024 91365 91772 92709 93575 93314 92060 90934 90332 89593 88348
53821H8348j115k02P81J264J270J208J557K353K931K670J892J453J624K017K377
53806A10428K661K628K165J815K082K568K654K655L295M390N080N093M792M355
53792A56661L879L883M629N375N280M557L765K664J019k29q9P45P81q9q14j072
53776A90945j404j791j735j471j670k202k554l039m107m942m416l110k560k961
53762A52983l198k933k815k856k406j656j377j364q53k40n42j309j110O2Q06Q26
53746A32018J247K303K737J966R08K30m40j082q79J63P82K06r89k092l017l538
53730A30523l253k512k125k010j446o04l34n50m54k50p82j602j310P5J050J091
53714A15507J143J510J319N31K66O95O12j45j00J290K472K218J352J022R79P80
$$ plain form
53821 88348 87233 87031 87812 89076 90346 91554 93111 95464 98395 101065 102957 104410 106034 108051 110428
53806 110428 113089 115717 117882 119697 121779 124347 127001 129656 132951 137341 142421 147514 152306 156661
53792 156661 160540 164423 169052 174427 179707 184264 188029 190693 191712 191483 191394 192139 192920 192831 192017 190945
53776 190945 189541 187750 186015 184544 182874 180672 178118 175079 170972 166030 161614 158504 155944 152983
53762 152983 149785 146852 144037 141181 138775 137119 135742 134378 133525 133285 132743 131434 130324 130386 131192 132018
53746 132018 133265 135568 138305 140271 141179 141409 140969 139887 139008 139171 139953 140159 139170 137078 134061 130523
53730 130523 127270 124758 122633 120623 119177 118573 118239 117689 117235 116985 116203 114601 113291 113366 114416 115507
53714 115507 116650 118160 119479 120010 120276 120971 121583 121438 121338 122628 125100 127318 128670 129692 130671 131451
53698A31451J061K390M029M912M914M402L590K929L018L576L674L322L533M441
53684A81242M901M405L843L786L590K897K444K608K550J679O82L47O01J226K224
53669B19025K934K273M41r36j026o97p15o33k25m01j656k997l340k841k084j151
53653B05971k52m0n23q26o34o97j323j727j491j278j429j230l62L50L28J27K22
53636A95186J96j04L2Q43J434J187O45K95j55p35p95k86n6k33J38J238J823J277
53618B01930O68Q63J240J243J626K883L963L841L084K691K538K205K186L043M304
53603B38308N195N550N333M372L355L663N315O425N685M149L523L985M722N393
53589C04973N918N999N849O360P573Q184P433O239N607N203M509L956L956M078
$$ plain form
53698 131451 132512 134902 138931 143843 148757 153159 156749 159678 162696 166272 169946 173268 176801 181242
53684 181242 186143 190548 194391 198177 201767 204664 207108 209716 212266 213945 214627 214974 215575 216801 219025
53669 219025 221959 224232 224673 223737 222711 222014 221299 220666 220441 220040 218384 215387 212047 209206 207122 205971
53653 205971 205719 205679 205156 204330 203696 202999 201676 199949 198458 197180 195751 194521 194159 194509 194837 194964 195186
53636 195186 195382 195278 195310 196153 197587 198774 199419 199714 199559 198824 198029 197743 197687 197454 197592 198830 200653 201930
53618 201930 202598 203461 204701 205944 207570 210453 214416 218257 221341 224032 226570 228775 230961 234004 238308
53603 238308 243503 249053 254386 258758 262113 265776 271091 277516 283201 287350 290873 294858 299580 304973
53589 304973 310891 316890 322739 329099 336672 344856 352289 358528 364135 369338 373847 377803 381759 385837
53575C85837M204M992O215O275M581K863K686L190K842J951J748K097J998J412
53561D32891R97P20J90l28m68o35j241j834j953j939k016j696j021j054k082k718
53545D15813k025j092j210j874k060k043k337k272j315n43j018j858j750j181
53531C93235j303j674j207l25o3J01J423L419M456M299M158M557N015N596O825
53516D28512Q280R008R160R660J0481J0857J0943J1690J3156J4466J5277J5949
53504E67439J6501J6769J7295J8601J9990K0471K0539K1430K2964K3910K4266
53493G90175K5332K7384K9060K9410K9125K9224K9832L0684L1698L2525L2518
53482A116967L1571L0380K9585K9207K8979K8716K8354K8056K8148K8605K8898
$$ plain form
53575 385837 390041 395033 401248 407523 412104 414967 417653 420843 423685 425636 427384 429481 431479 432891
53561 432891 433888 434608 434798 434470 434002 433367 432126 430292 428339 426400 424384 422688 421667 420613 418531 415813
53545 415813 413788 412696 411486 409612 407552 405509 403172 400900 399585 399042 398024 396166 394416 393235
53531 393235 391932 390258 389051 388726 388663 388764 390187 393606 398062 402361 406519 411076 416091 421687 428512
53516 428512 436792 445800 454960 464620 475101 485958 496901 508591 521747 536213 551490 567439
53504 567439 583940 600709 618004 636605 656595 677066 697605 719035 741999 765909 790175
53493 790175 815507 842891 871951 901361 930486 959710 989542 1020226 1051924 1084449 1116967
53482 1116967 1148538 1178918 1208503 1237710 1266689 1295405 1323759 1351815 1379963 1408568 1437466
53471A437466K8746K8495K8285K7535K5847K3698K1632J9472J7132J5263J4226
53460A687797J3224J1504R611Q396P645O809O285O622P042O140L680N49k615n661
53446A767028q287j0359j2376j4682j6674j7825j8743k0255k2077k3526k4784
53435A577440k6270k7489k7840k7893k8533k9424k9641k9295k9140k9078k8431
53424A264406k7272k6214k5250k3934k2296k0537j8443j6139j4617j4287j3885
53413A041532j2184r884q320p135n049k147M04K500M968P724R848J1338J3107
53400A046702J5329J7335J9019K0844K2631K3799K4692K6200K8290L0258L2126
53389A307225L4344L6379L7253L7408L8443M1052M4410M7579N0235N2216N3600
$$ plain form
53471 1437466 1466212 1494707 1522992 1550527 1576374 1600072 1621704 1641176 1658308 1673571 1687797
53460 1687797 1701021 1712525 1722136 1730532 1738177 1744986 1751271 1757893 1764935 1771075 1774755 1775304 1772689 1767028
53446 1767028 1758741 1748382 1736006 1721324 1704650 1686825 1668082 1647827 1625750 1602224 1577440
53435 1577440 1551170 1523681 1495841 1467948 1439415 1409991 1380350 1351055 1321915 1292837 1264406
53424 1264406 1237134 1210920 1185670 1161736 1139440 1118903 1100460 1084321 1069704 1055417 1041532
53413 1041532 1029348 1019464 1011144 1004009 998960 996813 997217 999717 1004685 1012409 1022257 1033595 1046702
53400 1046702 1062031 1079366 1098385 1119229 1141860 1165659 1190351 1216551 1244841 1275099 1307225
53389 1307225 1341569 1377948 1415201 1452609 1491052 1532104 1576514 1624093 1674328 1726544 1780144
53378A780144N5074N7046N8886O0050O1320O3485O5611O6279O5895O5928O6388
53367B466106O6000O4531O2954O1495N9465N6847N4119N0680M5482L9272L4177
53356C061128L0920K8270K5340K2433J9503J5725J1080O503K081l072q843j3846
53344C197222j7603k1397k6483l2975m0837n0060n9321o6187o9558p0543p0463
53333B671795o9419o7439o5475o4317o3685o2951o1887o0337n8334n6741n6487
53322A984723n6879n6113n3822n1579n0376m9100m6344m2409l8519l5139l1885
53311A472558k8481k5087k2136k0170j9268j8644j7458j5935j4789j3820j2110
53300A264660r538o963n003l698l129l174k917j601J6O72O37J190K411L240L635
$$ plain form
53378 1780144 1835218 1892264 1951150 2011200 2072520 2136005 2201616 2267895 2333790 2399718 2466106
53367 2466106 2532106 2596637 2659591 2721086 2780551 2837398 2891517 2942197 2987679 3026951 3061128
53356 3061128 3092048 3120318 3145658 3168091 3187594 3203319 3214399 3220902 3222983 3219911 3211068 3197222
53344 3197222 3179619 3158222 3131739 3098764 3057927 3007867 2948546 2882359 2812801 2742258 2671795
53333 2671795 2602376 2534937 2469462 2405145 2341460 2278509 2216622 2156285 2097951 2041210 1984723
53322 1984723 1927844 1871731 1817909 1766330 1715954 1666854 1620510 1578101 1539582 1504443 1472558
53311 1472558 1444077 1418990 1396854 1376684 1357416 1338772 1321314 1305379 1290590 1276770 1264660
53300 1264660 1255122 1248159 1243156 1239458 1236329 1233155 1230238 1228637 1228653 1229325 1229962 1231152 1233563 1236803 1240438
53285A240438M661O360P555Q070R230J1719J4657J7351K0166K3106K5227K6160
53273A414700K6700K7355K7768K8036K8916L0201L0463K9245K7824K7198K6738
53262A725144K5611K4002K2223J9983J7390J5345J4180J3136J1770J0534R371
53251A908689P210L659k08l462o446r603j2582j5289j8427k2082k5107k6811k8099
53238A751442k9985l2101l3559l4254l4550l4547l4400l4404l4219l3014l0895
53227A385514k9046k8039k7173k6010k5226k5314k5702k5827k5892k5996k5725
53216A095564k5161k5069k5485k5400k4418k3297k2349k0780j8414j6453j5726
53205H53012j5540j5171j5033j5477j5812j5623j5735j6790j8034j8494j8277
$$ plain form
53285 1240438 1245099 1251459 1259014 1267084 1276314 1288033 1302690 1320041 1340207 1363313 1388540 1414700
53273 1414700 1441400 1468755 1496523 1524559 1553475 1583676 1614139 1643384 1671208 1698406 1725144
53262 1725144 1750755 1774757 1796980 1816963 1834353 1849698 1863878 1877014 1888784 1899318 1908689
53251 1908689 1915899 1919558 1919350 1915888 1909442 1899839 1887257 1871968 1853541 1831459 1806352 1779541 1751442
53238 1751442 1721457 1689356 1655797 1621543 1586993 1552446 1518046 1483642 1449423 1416409 1385514
53227 1385514 1356468 1328429 1301256 1275246 1250020 1224706 1199004 1173177 1147285 1121289 1095564
53216 1095564 1070403 1045334 1019849 994449 970031 946734 924385 903605 885191 868738 853012
53205 853012 837472 822301 807268 791791 775979 760356 744621 727831 709797 691303 673026
53194F73026j7844j7096j6089j5431j5133j4307j2834j1992j2524j3381j3421
53183E12974j3048j3024j2996j2429j1897j2148j2770j2940j2604j2047j1213
53172C75858j0323j0124j0584j0477r172p740p305p447p272o908o827o718o157
53159B68804n465m964m342l645l729m752n428m764l442k447j657q36o71j493k195
53144B18974j839j193j354j917j869j317q73l48N17J053P92O51J524K645K837
53129B18283K477K679L232L017J857M86q08k103k935k918k675k966l395l222k818
53114B08191l015l646l967l950l920l564k565j659j744k489k971l054l020k596
53100A66031j613r23j296k029j966j277r47j123j363j764k476k776k101j289j363
$$ plain form
53194 673026 655182 638086 621997 606566 591433 577126 564292 552300 539776 526395 512974
53183 512974 499926 486902 473906 461477 449580 437432 424662 411722 399118 387071 375858
53172 375858 365535 355411 344827 334350 325178 317438 310133 302686 295414 288506 281679 274961 268804
53159 268804 263339 258375 254033 250388 246659 241907 236479 231715 228273 225826 224169 223333 222662 221169 218974
53144 218974 217135 215942 214588 212671 210802 209485 208612 208264 208781 209834 210626 211277 212801 215446 218283
53129 218283 220760 223439 226671 229688 231545 232031 231223 229120 226185 223267 220592 217626 214231 211009 208191
53114 208191 205176 201530 197563 193613 189693 186129 183564 181905 180161 177672 174701 171647 168627 166031
53100 166031 164418 163495 162199 160170 158204 156927 155980 154857 153494 151730 149254 146478 144377 143088 141725
53085A41725j773j462r44j484k679k838j630m91l52o83r01j228j730j969j855
53070A19706j846k017j907j359o49J23R46J392J090N17L58L72p0o53n27J11J31
53053A15718p95j638j460n63M0k32r97j242l60R24J211K44o60m96J26L03K73N27
53035A10923N47k75j198j091k49J00l54q92j087j074q22k37L00M78O60J107J291
53018A08127R18P83J481K156J810J038R47J244R32K05q7j41n57n65R97L243L883
53001A26414K417P11K15L66K44L6K11N65Q05J102J597K129K635L142L332K921
52985A48842K362K360K774K923K734K667K715K431J807J101J73j082k025k030
52971A67752j601j674k202k563k842l425l778l048j634p75p52q57q92j258j807
$$ plain form
53085 141725 139952 138490 137546 136062 133383 130545 128915 128424 128072 127389 126488 125260 123530 121561 119706
53070 119706 117860 115843 113936 112577 111928 112051 112997 114389 115479 115996 116354 116726 116656 116003 115476 115587 115718
53053 115718 114923 113285 111825 111262 111302 111070 110073 108831 108471 109395 110606 110850 110190 109694 109820 110123 110396 110923
53035 110923 111470 111195 109997 108906 108657 108757 108403 107511 106424 105350 104528 104291 104591 105069 105729 106836 108127
53018 108127 109045 109828 111309 113465 115275 116313 117260 118504 119436 119641 119554 119413 118856 118291 119288 122531 126414
53001 126414 128831 129542 129757 130123 130367 130403 130614 131179 131984 133086 134683 136812 139447 142589 145921 148842
52985 148842 151204 153564 156338 159261 161995 164662 167377 169808 171615 172716 172889 171807 169782 167752
52971 167752 166151 164477 162275 159712 156870 153445 149667 146619 144985 144210 143458 142601 141709 140451 138644
52956A38644j906j634j531j359m78O55Q44J2o64m95O8N34Q49P95J77m42l25J55
52938A33899J9o46q35k32N97J432K451L097K480R29j05J26J056J926K321J810
52922A50325M08p69n56N56J126Q60O28O90M39j18l26k99p65j465j256LJ168J536
52904A52185J433J068K52o15p89n01n60p42j81P84Q90J68k9N96P96O1n16k08L36
52885A54428O34J226K223K639J945R02K44j99m90j01R08J612J671J723J957J682
52869A73004Q70N79J270K077K390K734L408L719L247K681K601K695K719L010L436
52854B10440L157K003R37N59M53L64O54J124Q52j58o87k14L19K72K88P55R00K10
52836B22228o75j341k276l342l219j495J90L09o00j298j795k593l245l094k578
$$ plain form
52956 138644 136738 135104 133573 132214 131736 132391 133235 133247 132583 132088 132156 132690 133539 134334 134511 134069 133744 133899
52938 133899 133918 133272 132437 132205 132802 134234 136685 139782 142262 143191 143086 143212 144268 146194 148515 150325
52922 150325 150733 149964 149408 149964 151090 151950 152578 153268 153707 153589 153263 152964 152199 150734 149478 149481 150649 152185
52904 152185 153618 154686 154938 154323 153534 153033 152473 151731 151550 152334 153224 153392 153363 153959 154755 154816 154300 154092 154428
52885 154428 155062 156288 158511 161150 163095 163997 164241 164042 163552 163451 164359 165971 167642 169365 171322 173004
52869 173004 173874 174453 175723 177800 180190 182924 186332 190051 193298 195979 198580 201275 203994 207004 210440
52854 210440 213597 215600 216537 217096 217549 217913 218567 219691 220543 220385 219698 219484 219803 220075 220363 221118 222018 222228
52836 222228 221553 220212 217936 214594 211375 209880 210070 210379 209779 208481 206686 204093 200848 197754 195176
52821A95176k484k688k749k932l514l870l338k362j792j714j750j887k157k156
52807A59783j666j111q33n83k18m5r1jL5o04j581j647o55k9n68j297j333j335
52789A46221k010k653k385j584q93r2Q33Q78l88j566j279j65L47K18K41K95j70
52772A35848p00n20k3j27n93n63j84k82p77q61n14m98r78j278j040o13m36o83
52754A25178j292j798j566p73m56j030j599j494j459k251l081k793j730j095j018
52739A01743p50k34o8j49J74P65Q11K46j53m2J61K38M67Q74J102J128J305J585
52721A09203J453P54J0k63p7K31M83Q06J425K222K608K195J430R54N20n94k084
52704A21276k756k301j804j996k272k008j683j895k334k506k525k425j763p09
$$ plain form
52821 195176 192692 190004 187255 184323 180809 176939 173601 171239 169447 167733 165983 164096 161939 159783
52807 159783 158117 157006 156173 155590 155372 155327 155236 155235 155270 154666 153085 151438 150783 150754 150186 148889 147556 146221
52789 146221 144211 141558 139173 137589 136696 136604 137437 138315 137927 136361 135082 134917 135264 135482 135723 136018 135848
52772 135848 135148 134628 134605 134478 133885 133322 133138 132856 132079 131218 130704 130206 129228 127950 126910 126297 125861 125178
52754 125178 123886 122088 120522 119749 119293 118263 116664 115170 113711 111460 108379 105586 103856 102761 101743
52739 101743 100993 100759 100691 100542 100716 101481 102292 102538 102385 102343 102504 102742 103209 104083 105185 106313 107618 109203
52721 109203 110656 111410 111420 111157 111080 111311 111794 112600 114025 116247 118855 121050 122480 123434 123954 123360 121276
52704 121276 118520 116219 114415 112419 110147 108139 106456 104561 102227 99721 97196 94771 93008 92299
52690I2299l60j129j878j658j151j330j802j738j358j242j067m18ko17j614j769
52674G3166j096n60m83m67l82k58K15J013J218L03p49q21l68m62q58n29M55J093
52656G0430J129J102J050O03O2O0L49K13k39l48k18m40q76q97n42k20K65J200
52638G2683J922J727J333J953L146L270J906K93o41j154j561j711j779k219k707
52623G6461k341j114o6K31K06K77L43L95N21K61q42j999j752j11J229J124L77
52606G3200L37J105J736J557P47k5j60L26P30M95m6j78K10O38P70N83J37k45Q
52587H1925Q46J256O11k30j30N82P63K95N8L48O43Q56J391K069K170J638J119
52570I6210Q19L87kK89J173J751J597J171Q43M55M5J2L73O38N40K60j9j08L85
$$ plain form
52690 92299 91939 90810 88932 87274 86123 84793 82991 81253 79895 78653 77586 77168 77166 76549 74935 73166
52674 73166 72070 71510 71027 70560 70178 69920 70135 71148 72366 72669 71920 71099 70731 70269 69411 68882 69337 70430
52656 70430 71559 72661 73711 74314 74376 74436 74785 74998 74759 74411 74193 73753 72877 71980 71438 71218 71483 72683
52638 72683 74605 76332 77665 79618 82764 86034 87940 88233 87592 86438 84877 83166 81387 79168 76461
52623 76461 74120 73006 72940 73171 73377 73654 73997 74392 74913 75174 74332 72333 70581 70470 71699 72823 73200
52606 73200 73537 74642 76378 77935 78682 78657 78497 78823 79553 80048 80002 79824 80034 80672 81442 82025 82162 81917 81925
52587 81925 82771 84027 84638 84408 84278 84860 85623 85918 85976 86324 86967 87823 89214 91283 93453 95091 96210
52570 96210 97029 97416 97414 97703 98876 100627 102224 103395 104238 104693 104738 104750 105123 105761 106301 106561 106542 106434 106819
52551A06819J457K164J672N42JJ57J41j93q0O38J059O18j44n04l58N9M65M79M0
52532A15032k01L31J108J195O68L29K18k89j071j245o84l09o09j073j204j139
52516A11057r66n44r0m4j78J25P02P56J79k92l21k69j63L76J079J134N90L95P92
52497A14318R55M87P0J67K45j25n37n90n20m78j31N11P25J44n76o30k0P06J029
52478A15750O34k70p42q2R82J056R7n02MQ31J214J476J917J942J172M23O50J575
52460A28127K253K393K386K431K320J843R88ln67k33P36J555J818J672J107j15
52444A48711j706k823l089k947k774k357j567q32o35r71j570k156k383k096j692
52429A19113j726k033j856q91L55J178J243O08k27n58k80q2l00k53M23O97l19
$$ plain form
52551 106819 108276 110440 112112 112654 112655 112812 112953 112760 112680 113318 114377 114995 114851 114347 113989 114048 114513 114992 115032
52532 115032 114831 115162 116270 117465 118133 118462 118680 118391 117320 116075 115391 115082 114473 113400 112196 111057
52516 111057 110091 109547 109457 109413 109235 109360 110062 110818 110997 110705 110384 110115 109952 110328 111407 112541 113131 113526 114318
52497 114318 115273 115760 115830 115997 116242 116117 115580 114990 114470 113992 113861 114372 115097 115241 114665 114035 114015 114721 115750
52478 115750 116384 116114 115372 115290 116272 117328 117425 116923 116927 117758 118972 120448 122365 124307 125479 125902 126552 128127
52460 128127 130380 132773 135159 137590 139910 141753 142741 142738 142171 141938 142674 144229 146047 147719 148826 148711
52444 148711 147005 144182 141093 138146 135372 133015 131448 130616 129981 129010 127440 125284 122901 120805 119113
52429 119113 117387 115354 113498 112607 112962 114140 115383 115991 115764 115206 114926 114844 114544 114291 114714 115411 115092
52412A15092j500j065O35J520Q92J12J43L66L21O07J335J400K90q05p19J26P53
52395A19503J072J306J121L01m83n27nO49J450K318K620K006J029K96k95r39j302
52378A30120j052m43J65O70R05O96N24J141K241K594J903J351J760K344K084J235
52362A48238O58M92L96L75O08R61J294J692J990J761J133Q57J202J621J840K286
52346A67404K984L107K276J374J336J903K177J743P58l06o69J68J577K348K333
52331A90513K421K820K728K074J900K435K427J296L73P90J648J645J220J541K371
52316B18202K595K174K041K466K875K988L028L076L208L920N498P264Q227Q255
52302B75817P927P754Q060R118J0675J1878J2253J2224J2168J1799J1048J0672
$$ plain form
52412 115092 113592 112527 113162 114682 115574 115686 115829 116195 116516 117123 118458 119858 120148 119343 118624 118750 119503
52395 119503 120575 121881 123002 123303 122820 122293 122288 122937 124387 126705 129325 131331 132360 132656 132361 131422 130120
52378 130120 129068 128625 128790 129460 130365 131061 131585 132726 134967 137561 139464 140815 142575 144919 147003 148238
52362 148238 148896 149388 149784 150159 150767 151728 153022 154714 156704 158465 159598 160455 161657 163278 165118 167404
52346 167404 170388 173495 175771 177145 178481 180384 182561 184304 185062 184756 184087 184255 185832 188180 190513
52331 190513 192934 195754 198482 200556 202456 204891 207318 208614 208987 209777 211425 213070 214290 215831 218202
52316 218202 220797 222971 225012 227478 230353 233341 236369 239445 242653 246573 252071 259335 267562 275817
52302 275817 283744 291498 299558 308676 319351 331229 343482 355706 367874 379673 390721 401393
52290D01393J1139J1750J1703J1310J1250J1404J1275J0969J0855J0891J0980
52279E24919J1353J1904J1939J1312J0995J1634J2512J2711J2381J1950J1077
52268F54687R556Q223P788P552O543N213M619M680M500L946L502L080K251J307
52254G27447Q53P07L29q5j9K83K94K53O28J023R12Q91J811L082L385K879L110
52237G47783M673O476P491P989Q631R427J0076J0558J1027J1583J2314J3070J3320
52224H74418J2744J1809J1160J0711R900Q638P346O345N778N786O083N761M266
52211I80745K242O85k72j108j927k652l613n010o215o582o620p292q460r073q742
52196I16106q089p626p223o695o127n582n072m707m411l819k946k453k673k930
$$ plain form
52290 401393 412532 424282 435985 447295 458545 469949 481224 492193 503048 513939 524919
52279 524919 536272 548176 560115 571427 582422 594056 606568 619279 631660 643610 654687
52268 654687 664243 672466 680254 687806 694349 699562 704181 708861 713361 717307 720809 723889 726140 727447
52254 727447 728300 729007 729336 729251 729232 729515 729809 730062 730690 731713 732625 733516 735327 738409 741794 744673 747783
52237 747783 752456 758932 766423 774412 783043 792470 802546 813104 824131 835714 848028 861098 874418
52224 874418 887162 898971 910131 920842 930742 939380 946726 953071 958849 964635 970718 976479 980745
52211 980745 982987 983672 983400 982292 980365 977713 974100 969090 962875 956293 949673 942381 933921 924848 916106
52196 916106 908017 900391 893168 886473 880346 874764 869692 864985 860574 856755 853809 851356 848683 845753
52182H45753k503j633q85k59K03j76j586k792k649j894k033k966l355k969k907
52167H17349l481l659k930k246k527l358l822l663l148k478j871j681k081k903
52153G77501l805m349m061k969j850j408j506j667j930k472k893k712k280k304
52139G41295k734k994l086l516m248m651m501m186l991l810l506l046k390j729
52125F92907j534j895k296k440k691l162l212k574k046k190k193j201J58Q02Q81
52110F67314J071J022J31p95l92J125K378L001L676M330M254L928M763O756Q170
52095G10732Q056P512P914R247J0761J2025J2874J3309J3882J5200J6806J7614
$$ plain form
52182 845753 843250 841617 840732 840473 840676 840500 838914 836122 833473 831579 829546 826580 823225 820256 817349
52167 817349 813868 810209 807279 805033 802506 799148 795326 791663 788515 786037 784166 782485 780404 777501
52153 777501 773696 769347 765286 762317 760467 759059 757553 755886 753956 751484 748591 745879 743599 741295
52139 741295 738561 735567 732481 728965 724717 720066 715565 711379 707388 703578 700072 697026 694636 692907
52125 692907 691373 689478 687182 684742 682051 678889 675677 673103 671057 668867 666674 665473 665631 666433 667314
52110 667314 668385 669407 669538 668743 668351 669476 671854 674855 678531 682861 687115 691043 695806 702562 710732
52095 710732 718788 726300 734214 743461 754222 766247 779121 792430 806312 821512 838318 855932
$$ [...]
##END NTUPLES=NMR SPECTRUM
##END=
