##TITLE=NES1048_10961_9270454_ZMJJLuvnOD
##JCAMPDX= 6.0         $$ Bruker NMR JCAMP-DX V2.0
##DATA TYPE= NMR SPECTRUM
##DATA CLASS= NTUPLES
##ORIGIN= BRUKER
##OWNER= Administrator
$$ 1.72 TOPSPIN		Version 2.1
$$ 2015-07-11 18:02:58.441 -0700  Administrator@X
$$ Compression mode = diff/dup
##.OBSERVE FREQUENCY= 400.02188249412
##.OBSERVE NUCLEUS= ^1H
##.ACQUISITION MODE= SIMULTANEOUS (DQD)
##.ACQUISITION SCHEME= undefined
##.AVERAGES= 8
##.DIGITISER RES= 22
##SPECTROMETER/DATA SYSTEM= spect
##.PULSE SEQUENCE= zg30
##.SOLVENT NAME= COFFEE_meoh
##.SHIFT REFERENCE= INTERNAL, COFFEE_meoh, 1, 14.98509
##AUDIT TRAIL= $$ (NUMBER, WHEN, WHO, WHERE, PROCESS, VERSION, WHAT)
$$ ##TITLE= Audit trail, TOPSPIN		Version 2.1
$$ ##JCAMPDX= 5.01
$$ ##ORIGIN= Bruker BioSpin GmbH
$$ ##OWNER= Administrator
$$ $$ E:\/data/COFFEE/nmr/NES1048_10961_9270454_ZMJJLuvnOD/10/pdata/1/auditp.txt
$$ ##AUDIT TRAIL=  $$ (NUMBER, WHEN, WHO, WHERE, PROCESS, VERSION, WHAT)
(   1,<2015-07-11 18:02:50.956 -0700>,<Administrator>,<X>,<go>,<TOPSPIN 2.1>,
      <created by zg
	started at 2015-07-11 18:01:44.691 -0700,
	POWCHK enabled, PULCHK disabled,
       configuration hash MD5:
       21 0F 79 D6 B3 7B B4 F6 88 20 88 DB 03 48 BD 9F
       data hash MD5: 64K
       AD 12 05 CE D4 F3 F2 E2 83 E2 D0 53 3D F0 DC A5>)
(   2,<2015-07-11 18:02:54.331 -0700>,<Administrator>,<X>,<proc1d>,<TOPSPIN 2.1>,
      <Start of raw data processing
       efp LB = 0 FT_mod = 6 PKNL = 1 PHC0 = 0 PHC1 = 0 SI = 32K 
       data hash MD5: 32K
       95 4E 59 AF 3B 9B F5 E4 7A D1 AE 82 7E 26 33 DA>)
(   3,<2015-07-11 18:02:54.613 -0700>,<Administrator>,<X>,<proc1d>,<TOPSPIN 2.1>,
      <pk PHC0 = 92.94434 PHC1 = 0 
       data hash MD5: 32K
       99 2F 25 05 3E 20 07 95 4A 43 E9 6E 8B AF FE AC>)
(   4,<2015-07-11 18:02:54.722 -0700>,<Administrator>,<X>,<proc1d>,<TOPSPIN 2.1>,
      <abs ABSG = 1 
       data hash MD5: 32K
       27 7D 90 B5 73 9E 35 68 81 84 2D 39 63 32 BB 8C>)
(   5,<2015-07-11 18:02:54.800 -0700>,<Administrator>,<X>,<proc1d>,<TOPSPIN 2.1>,
      <abs ABSG = 2 
       data hash MD5: 32K
       61 D0 DE 0E 6B 9E 67 80 8C BF 69 4E A1 29 19 DB>)
(   6,<2015-07-11 18:02:54.847 -0700>,<Administrator>,<X>,<proc1d>,<TOPSPIN 2.1>,
      <abs ABSG = 3 
       data hash MD5: 32K
       91 B8 6A E0 24 23 0D 76 50 C3 43 88 B2 C1 FC 1A>)
(   7,<2015-07-11 18:02:54.910 -0700>,<Administrator>,<X>,<proc1d>,<TOPSPIN 2.1>,
      <abs ABSG = 4 
       data hash MD5: 32K
       07 82 05 E4 8F 28 82 32 4C 80 F7 3B 2F 9D 38 CF>)
(   8,<2015-07-11 18:02:54.972 -0700>,<Administrator>,<X>,<proc1d>,<TOPSPIN 2.1>,
      <abs ABSG = 5 
       data hash MD5: 32K
       44 EB 4A CF 26 30 25 55 FF 00 EB 85 5C F4 FE 6D>)
$$ ##END=
$$ 
$$ $$ hash MD5
$$ $$ 27 44 2D 8F 94 05 F5 19 CA CA BC 10 E7 E5 B2 F9
##$RELAX= 
##$RELAX= 
##$RELAX= 
##$RELAX= 
##$RELAX= 
##$RELAX= 
##$RELAX= 
$$ Bruker specific parameters
$$ --------------------------
##$DU= <E:\>
##$EXPNO= 10
##$NAME= <NES1048_10961_9270454_ZMJJLuvnOD>
##$PROCNO= 1
$$ [...]
150 150 150 150 150 150 150 150
##$TP07= 0
##$TPNAME0= <>
##$TPNAME1= <>
##$TPNAME2= <>
##$TPNAME3= <>
##$TPNAME4= <>
##$TPNAME5= <>
##$TPNAME6= <>
##$TPNAME7= <>
##$TPOAL= (0..7)
0.5 0.5 0.5 0.5 0.5 0.5 0.5 0.5
##$TPOFFS= (0..7)
0 0 0 0 0 0 0 0
##$TUNHIN= 0
##$TUNHOUT= 0
##$TUNXOUT= 0
##$USERA1= <user>
##$USERA2= <user>
##$USERA3= <user>
##$USERA4= <user>
##$USERA5= <user>
##$V9= 5
##$VALIST= <valist>
##$VCLIST= <CCCCCCCCCCCCCCC>
##$VD= 0
##$VDLIST= <DDDDDDDDDDDDDDD>
##$VPLIST= <PPPPPPPPPPPPPPP>
##$VTLIST= <TTTTTTTTTTTTTTT>
##$WBST= 2048
##$WBSW= 25
##$XGAIN= (0..3)
0 0 0 0
##$XL= 0
##$YL= 0
##$YMAX_a= 629248
##$YMIN_a= -523462
##$ZGOPTNS= <>
##$ZL1= 120
##$ZL2= 120
##$ZL3= 120
##$ZL4= 120
##$ABSF1= 14.98509
##$ABSF2= -5.573092
##$ABSG= 5
##$ABSL= 3
##$ALPHA= 0
##$AQORDER= 0
##$ASSFAC= 0
##$ASSFACI= 0
##$ASSFACX= 0
##$ASSWID= 0
##$AUNMP= <proc_prof1d_extract_pilot.lims>
##$AXLEFT= 0
##$AXNAME= <>
##$AXNUC= <1H>
##$AXRIGHT= 0
##$AXTYPE= 0
##$AXUNIT= <>
##$AZFE= 0.1
##$AZFW= 0.1
##$BCFW= 0
##$BC_mod= 0
##$BYTORDP= 0
##$COROFFS= 0
##$CY= 15
##$DATMOD= 1
##$DC= 0
##$DFILT= <>
##$DTYPP= 0
##$F1P= 0
##$F2P= 0
##$FCOR= 0.5
##$FTSIZE= 32768
##$FT_mod= 6
##$GAMMA= 0
##$GB= 0
##$INTBC= 1
##$INTSCL= 1
##$ISEN= 128
##$LB= 0
##$LEV0= 0
##$LPBIN= 0
##$MAXI= 10000
##$MC2= 0
##$MEAN= 0
##$ME_mod= 0
##$MI= 0
##$NCOEF= 0
##$NC_proc= -8
##$NLEV= 6
##$NOISF1= 0
##$NOISF2= 0
##$NSP= 0
##$NTH_PI= 0
##$NZP= 0
##$OFFSET= 14.98509
##$PC= 1
##$PHC0= 92.94434
##$PHC1= 0
##$PH_mod= 1
##$PKNL= yes
##$PPARMOD= 0
##$PPDIAG= 0
##$PPIPTYP= 0
##$PPMPNUM= 2147483647
##$PPRESOL= 1
##$PSCAL= 4
##$PSIGN= 0
##$PYNMP= <proc.py>
##$REVERSE= no
##$SF= 400.02
##$SI= 32768
##$SIGF1= 0
##$SIGF2= 0
##$SINO= 400
##$SIOLD= 32768
##$SPECTYP= <>
##$SREGLST= <1H.CDCl3>
##$SSB= 0
##$STSI= 32768
##$STSR= 0
##$SW_p= 8223.68421052631
##$SYMM= 0
##$S_DEV= 0
##$TDeff= 65536
##$TDoff= 0
##$TI= <>
##$TILT= no
##$TM1= 0
##$TM2= 0
##$TOPLEV= 0
##$USERP1= <user>
##$USERP2= <user>
##$USERP3= <user>
##$USERP4= <user>
##$USERP5= <user>
##$WDW= 1
##$XDIM= 32768
##$YMAX_p= 444939213
##$YMIN_p= -698204
##$CURPLOT= <Network HP LaserJet P1505>
##$CURPRIN= <$Network HP LaserJet P1505>
##$DFORMAT= <normdp>
##$LAYOUT= <+/1D_H.xwp>
##$LFORMAT= <normlp>
##$PFORMAT= <normpl>
##$SURQMSG= 1
$$ End of Bruker specific parameters
$$ ---------------------------------
##NTUPLES= NMR SPECTRUM
##VAR_NAME=  FREQUENCY,     SPECTRUM/REAL,   SPECTRUM/IMAG
##SYMBOL=    X,             R,               I
##VAR_TYPE=  INDEPENDENT,   DEPENDENT,       DEPENDENT
##VAR_FORM=  AFFN,          ASDF,            ASDF
##VAR_DIM=   32768,         32768,           32768
##UNITS=     HZ,            ARBITRARY UNITS, ARBITRARY UNITS
##FACTOR=    0.250966925370066, 1,           1
##FIRST=     8223.43324360094, 53507,        -169656
##LAST=      0,             -56278,          -133006
##MIN=       0,             -698204,         0
##MAX=       8223.43324360094, 444939213,    0
$$ Real data points
##PAGE= N=1
##DATA TABLE= (X++(R..R)), XYDATA
$$ [...]
19454b45001d8020k48268A39553b37253b907A33397f3371l31800a47233D1845
$$ -245001 -48020 -296288 139553 -237253 -2907 133397 -63371 -395171 -147233 41845
19443b41595N1287A0738K6237M7832J58167r883a68430o6111C3623b64945f3100
$$ -241595 -190308 10738 36975 84807 242974 233091 -168430 -234541 33623 -264945 -63100
19431A85466b78175i4460j14651j21721K9270A03687l3406a89936f3387A57813
$$ 185466 -278175 -94460 -209111 -330832 -301562 103687 70281 -189936 -63387 157813
19420a63635M4098b3539j27928c9116c286j38030G8648b35362d8820A17302h2000
$$ -163635 -119537 -23539 -151467 -39116 -3286 -141316 78648 -235362 -48820 117302 -82000
19408A57364a27350j7683j98561a69469k2264j6565b4372G8642M9833n6842J40567
$$ 157364 -127350 -145033 -343594 -169469 -191733 -208298 -24372 78642 128475 71633 212200
19397B12200A1113a20077K6590j79169F8411d005n55832b04080B9434a1915B32001
$$ 212200 11113 -120077 -93487 -272656 68411 -4005 -559837 -204080 29434 -11915 232001
19385A24574a75068o039P889A7179d2775E3829a86975A04626C1663c67859a57164
$$ 124574 -175068 -181107 -173218 17179 -42775 53829 -186975 104626 31663 -367859 -157164
19373e3303o555G8399r334J34834b03952h3205B03444d7609m629j60748A20201
$$ -53303 -59858 78399 69065 203899 -203952 -83205 203444 -47609 -52238 -212986 120201
19361A5917G201K8460K93126a05770L2898R35I221c1599k3101A06551a34209D0271
$$ 15917 7201 35661 328787 -105770 -72872 -71937 9221 -31599 -54700 106551 -134209 40271
19348a21008k5044d6188G0029b3245j90176N8835K8516K370d4660k3642B0145
$$ -121008 -146052 -46188 70029 -23245 -213421 -154586 -126070 -123700 -44660 -68302 20145
19336I3024b50250G3417C4360f9789A11716i9753A57168b39038k24624A47986
$$ 93024 -250250 73417 34360 -69789 111716 -99753 157168 -239038 -463662 147986
19325g8646L4576a4349k91750C3656a30619A24189h789D517b59125C6622K54628
$$ -78646 -44070 -14349 -306099 33656 -130619 124189 -8789 4517 -259125 36622 291250
19314B91250i593j35168D837P9523k9601o576a25088k26885J74136n0828A63249
$$ 291250 -9593 -144761 4837 84360 54759 48183 -125088 -351973 -177837 -228665 163249
19302e6168k2156l7069N3327A09218n3797a71402I5165a52813K297j6141A844
$$ -56168 -78324 -115393 -62066 109218 55421 -171402 95165 -152813 -150516 -166657 1844
19290f9283j26125A24707b11633A59277M8994J42014D1162c92088E9803P0744
$$ -69283 -195408 124707 -211633 159277 208271 350285 41162 -392088 59803 130547
19280A30547l6717b07313m0803A99106F0779O8421d18329a91469H7209C4503O2239
$$ 130547 93830 -207313 -248116 199106 60779 129200 -418329 -191469 87209 34503 96742
19269I6742b60656m5029a35841A40856c97069i8104B22198b43265A67766a37559
$$ 96742 -260656 -305685 -135841 140856 -397069 -98104 222198 -243265 167766 -137559
19258A53112p0725J24417b13653A43723b73237c8867k0173G5885a00733j5899
$$ 153112 82387 206804 -213653 143723 -273237 -38867 -59040 75885 -100733 -116632
19248a16632o9991g5914r5415n7692A22298a16220N1221E4429b09836l18720C3940
$$ -116632 -186623 -75914 -171329 -229021 122298 -116220 -64999 54429 -209836 -528556 33940
19236e55463c7338j74553A27791l9226a48074f9754A8131b20830D4107a61465
$$ -555463 -37338 -211891 127791 88565 -148074 -69754 18131 -220830 44107 -161465
19225d08766a35848I6174a6415k58960B3671c05901g7653a254j47138m9572j21513
$$ -408766 -135848 96174 -16415 -275375 23671 -305901 -77653 -1254 -148392 -197964 -319477
19214c19477J48723l38752G5977J2591a84892A63671a59827A48849d77000D9823
$$ -319477 -170754 -509506 75977 88568 -184892 163671 -159827 148849 -477000 49823
19203A82259b83436i8250m1788E0650b75957l5770b2828C3292b2038A36678a1846
$$ 182259 -283436 -98250 -140038 50650 -275957 -311727 -22828 33292 -22038 136678 -11846
19191b48394K8113B2030b06300n6945B31531h8069L6715A40313a00131c2139A7666
$$ -248394 -220281 22030 -206300 -263245 231531 -88069 -51354 140313 -100131 -32139 17666
19179b36172O9676D8608d49581a12003G9226b17807D0955j8264R030J75283f1705
$$ -236172 -166496 48608 -449581 -112003 79226 -217807 40955 22691 31721 207004 -61705
19167b90835a03900k0958H8512J33631d9568I4155b60156h9087C39782b36464
$$ -290835 -103900 -124858 88512 222143 -49568 94155 -260156 -89087 339782 -236464
19156a47010A98635a66457F5608f2646J5554B2688e937o4525b3261p9434L1068
$$ -147010 198635 -166457 65608 -62646 -47092 22688 -5937 -70462 -23261 -102695 -71627
19145g1627j68766E2498b42953H1305a65763A72157a69336l6496P1218L0037j26812
$$ -71627 -240393 52498 -242953 81305 -165763 172157 -169336 -205832 -134614 -104577 -231389
19134b31389l869G489b90027d8775F9168b54462Q4041A423e5081B77060G7688
$$ -231389 -235258 7489 -290027 -48775 69168 -254462 -170421 1423 -55081 277060 77688
19122c09732B84948o739m8803A2062a57711c3404I7313K9226n8502f7003m2114
$$ -309732 284948 278209 229406 12062 -157711 -33404 97313 126539 68037 -67003 -109117
19111a09117B8516a8220j04386e5219a4009o0707G7527h9230A52662a8905A37522
$$ -109117 28516 -18220 -122606 -55219 -14009 -74716 77527 -89230 152662 -18905 137522
19099C033b31703I1123f4606j09036M4954o7340I038e2887k27563Q9380j72473
$$ 3033 -231703 91123 -64606 -173642 -128688 -196028 9038 -52887 -280450 -191070 -363543
19088c63543H6503C5147b26284A79950K13175G022a14324A20199b27902D0187
$$ -363543 86503 35147 -226284 179950 393125 7022 -114324 120199 -227902 40187
19077f4221F0443J38654H8730l6823b18288B00529r4626m6257b78715A25409j1394
$$ -64221 60443 199097 88730 51907 -218288 200529 105903 59646 -278715 125409 114015
19066A14015c31658d2347k01666N1239f6484f98A07418b16907A16038b8924j04554
$$ 114015 -331658 -42347 -244013 -192774 -66484 -698 107418 -216907 116038 -28924 -133478
19055a33478k49321a70328A20408D6131J14063m6502J1961o0069K25403b1404
$$ -133478 -382799 -170328 120408 46131 160194 113692 125653 65584 290987 -21404
19044A59958b47187j06203C77546c65791A52622b6706q4910A55353a9957H7713
$$ 159958 -247187 -353390 377546 -365791 152622 -26706 -111616 155353 -19957 87713
19033C1719D82K70598j34825m5352M3151g9744B00949k3277a85645f3487a3848
$$ 31719 482 271080 136255 90903 134054 -79744 200949 177672 -185645 -63487 -13848
19021b1221A10641b7032j3512B53242E9054c55193a44832A6486K33819K541d213
$$ -21221 110641 -27032 -40544 253242 59054 -355193 -144832 16486 250305 252846 -4213
19009c93822A88477I0597e0207I7357e0034B92086d81131G8915a12257j32851
$$ -393822 188477 90597 -50207 97357 -50034 292086 -481131 78915 -112257 -245108
18999b45108j25289A81166a4264q1215P29j96976f3394B16362b11452b1479q8608
$$ -245108 -370397 181166 -14264 -95479 -94750 -291726 -63394 216362 -211452 -21479 -110087
18988a10087i92j44495r3724P7855f9027F3302b07546n2794L6866D6021h0213
$$ -110087 -992 -145487 -239211 -161356 -69027 63302 -207546 -260340 -223474 46021 -80213
18976c34572R2792B19614b62444B95226A16493d1360j78677E03425J71038B60374
$$ -334572 -241780 219614 -262444 295226 116493 -41360 -220037 503425 674463 260374
18965F1977O0184M3210F1103b5674k2852A25503c17110a48133l97981a22243I4273
$$ 61977 122161 165371 61103 -25674 -48526 125503 -317110 -148133 -546114 -122243 94273
18953a92340D00840A78736a98540C06612a15613k0052a9804C268e1816r7888b6520
$$ -192340 400840 178736 -198540 306612 -115613 -135665 -19804 3268 -51816 -149704 -26520
18941a81082j1994D570c58980B04176M6876a74418k40424a9518j01864M1613L3638
$$ -181082 -193076 4570 -358980 204176 251052 -174418 -414842 -19518 -121382 -79769 -46131
18930d6131D11733c58524A0340a34983f5459K9144j77928O3504i855k78003A10152
$$ -46131 411733 -358524 10340 -134983 -65459 -36315 -214243 -150739 -9855 -287858 110152
18918a6049k9544A99553L3627b63400P0809b8984F0546c8219j74904a04646B76477
$$ -16049 -45593 199553 233180 -263400 -192591 -28984 60546 -38219 -213123 -104646 276477
18906a11521C51858P5101L05305B21559H3362C5357J36761o2909b12502L1786
$$ -111521 351858 426959 732264 221559 83362 35357 172118 109209 -212502 -180716
18896a80716A3747f7024q2032C6729J13408f5798F6193g6498j64528Q6173n4411
$$ -180716 13747 -67024 -149056 36729 150137 -65798 66193 -76498 -241026 -154853 -209264
18885b09264C5776L15361j29696k4607A1378N3199a59500j29506A52703C8913
$$ -209264 35776 351137 221441 196834 11378 64577 -159500 -289006 152703 38913
18874A47585a06462o0812B49458j13956A1418e14722b51588A12674e1396A71145
$$ 147585 -106462 -167274 249458 135502 11418 -514722 -251588 112674 -51396 171145
18863B8489N00870E6731c78494A21324b00470O1871M7194k25045B685a49247J0893
$$ 28489 529359 56731 -378494 121324 -200470 -138599 -91405 -316450 2685 -149247 -138354
18852a38354d963k51867A80418f6534p3290M8933K0613A2558h4140K7644e780
$$ -138354 -4963 -256830 180418 -66534 -139824 -90891 -70278 12558 -84140 -56496 -5780
18840a89419j79843R5305a33488A8317K6051b15447i6868D30633b03650b9359
$$ -189419 -369262 -273957 -133488 18317 44368 -215447 -96868 430633 -203650 -29359
18829A54559a1208l9135k03947h8592r7155d1614J872m4843A42927a33205J5649
$$ 154559 -11208 -50343 -254290 -88592 -185747 -41614 -39742 -84585 142927 -133205 -117556
18818a17556A67684a8353C9705c03262Q8105j02494a5915l56483I1475j891i6193
$$ -117556 167684 -18353 39705 -303262 -215157 -317651 -15915 -372398 91475 89584 -96193
18806F3084n978g0026J9895H974b38628C16015J37812H6477B5686Q658a15062
$$ 63084 57106 -70026 -50131 8974 -238628 316015 453827 86477 25686 34344 -115062
18794A02326B2683b29492D83659d87128c6217r8255l8551D9923J01713e9860K8923
$$ 102326 22683 -229492 483659 -487128 -36217 -134472 -173023 49923 151636 -59860 -30937
18783c0937j39885D4980h3121j25833H2362N2826a00859L3773j01729B2956f5990
$$ -30937 -170822 44980 -83121 -208954 82362 135188 -100859 -67086 -168815 22956 -65990
18771A46746l7084c11364P2223h3517I7145N828b503A22963d18448c5648o3284
$$ 146746 109662 -311364 -239141 -83517 97145 102973 -2503 122963 -418448 -35648 -98932
18760i8932C28317b70126D0091b36274F5623M087a93738c0240j34631A2987J35815
$$ -98932 328317 -270126 40091 -236274 65623 69710 -193738 -30240 -164871 12987 148802
18749A48802a27584j58854Q8558p9998a10060L8330K2095j08350e3720j54393
$$ 148802 -127584 -286438 -197880 -277878 -110060 -71730 -49635 -157985 -53720 -208113
18739b08113a5656j92641h8958j1939J389D0532b36385e533C9906b38805e8821
$$ -208113 -15656 -208297 -88958 -100897 -99508 40532 -236385 -5533 39906 -238805 -58821
18727a02051C1023a40588A85228J8197a18981d9588D2429f3682k542j7458o7502
$$ -102051 31023 -140588 185228 203425 -118981 -49588 42429 -63682 -66224 -83682 -151184
18716a51184K1698O3409k47604h8640M3151m7443K7637j64032a05423k27996g0310
$$ -151184 -129486 -66077 -313681 -88640 -45489 -92932 -65295 -229327 -105423 -333419 -70310
18704A1375K198a17844G1649a19308D77180b6362A7560a21765L7071k95540R4121
$$ 11375 13573 -117844 71649 -119308 477180 -26362 17560 -121765 -84694 -380234 -286113
18693b86113H6736f5802A85112a92887B86510a03490D1769c7808p0256A85705
$$ -286113 86736 -65802 185112 -192887 286510 -103490 41769 -37808 -108064 185705
18682i3138r6384n2281a773j40329A7643J83323a37863c5432A96716c2435B52968
$$ -93138 -189522 -241803 -1773 -142102 17643 200966 -137863 -35432 196716 -32435 252968
18670B02744J67348B3161d720j38567f2915j05643j39528k44015o1427L04303
$$ 202744 370092 23161 -4720 -143287 -62915 -168558 -308086 -552101 -613528 -309225
18660c09225B3981b66102B03815I2570h1213G5416c48802f8404m0056g380j1936
$$ -309225 23981 -266102 203815 92570 -81213 75416 -348802 -68404 -108460 -7380 -19316
18649a9316B57782b60321J29693j38879Gb24575A32471c48206i2442j61014B40153
$$ -19316 257782 -260321 -130628 -269507 7 -224575 132471 -348206 -92442 -253456 240153
18637A42177J24790a09542p3888n4059j05471a22148q7721A66531A9940P368a3773
$$ 142177 266967 -109542 -183430 -237489 -342960 -122148 -209869 166531 19940 27308 -13773
18625C29931B7221a206j56861a036H5453a88707Q1514G4952b04264P0547l0216
$$ 329931 27221 -1206 -158067 -1036 85453 -188707 -107193 74952 -204264 -133717 -163933
18614a63933N2268e4775m6389e054A83034q1484b10635i8903M1383A71509a73867
$$ -163933 -111665 -54775 -101164 -5054 183034 101550 -210635 -98903 -57520 171509 -173867
18602D19336d85549B60063a43332b3739q3641e1141B20081B083d258A08120K23839
$$ 419336 -485549 260063 -143332 -23739 -107380 -51141 220081 2083 -4258 108120 331959
18591C31959j30918a33057j00722l5452c3631B0355O9057c6611A43154a36632
$$ 331959 201041 -133057 -233779 -269231 -33631 20355 89412 -36611 143154 -136632
18580B27000d793A45863c080l42122Q7348a15862A59575G2097j931j9501e8749
$$ 227000 -4793 145863 -3080 -345202 -257854 -115862 159575 72097 70166 50665 -58749
18568C0940a21380D2444f0351N444l97108d3457j77440A36636a37735f6711l2711
$$ 30940 -121380 42444 -60351 -54907 -452015 -43457 -220897 136636 -137735 -66711 -99422
18557i9422B2889a32116J5545D783b09493B3160k836J72485R9521j31712b40279
$$ -99422 22889 -132116 -116571 4783 -209493 23160 20324 192809 292330 160618 -240279
18545b41259n2805L73G5360a13227l21905d3900l41831A33818a99886I3180C0099
$$ -241259 -294064 -293691 75360 -113227 -435132 -43900 -385731 133818 -199886 93180 30099
18533A8605f4736j74371c4912A41381Q006m8449K59132a4672m2789B03041a16406
$$ 18605 -64736 -239107 -34912 141381 149387 100938 360070 -14672 -57461 203041 -116406
18521F1737g303A51083a19643C76697c2748j97895e8510l19291a88219i1718j80823
$$ 61737 -7303 151083 -119643 376697 -32748 -230643 -58510 -377801 -188219 -91718 -272541
18510b72541I6411f7414G5106b66342B2841J81403b45789b15A0969K47049c15008
$$ -272541 96411 -67414 75106 -266342 22841 204244 -245789 -215 10969 258018 -315008
18498A27370e2135J5571j27158b6601B68360A13369b03478F9197b64375n8499
$$ 127370 -52135 -36564 -163722 -26601 268360 113369 -203478 69197 -264375 -322874
18488c22874c5066A43720b63609i6679H7936a62016P1371l37253J97431l5644
$$ -322874 -35066 143720 -263609 -96679 87936 -162016 -90645 -427898 -230467 -266111
18478b66111A18543h7645j4353c0502A05635B1620a91615A8603b81199A9690L96042
$$ -266111 118543 -87645 -101998 -30502 105635 21620 -191615 18603 -281199 19690 415732
18467D15732b78249C08263A38705l186C5372J65743a32556e7584Q139j34305j59340
$$ 415732 -278249 308263 138705 135519 35372 201115 -132556 -57584 -49445 -183750 -343090
18456c43090Q4727j11511A09237b56872a20919L4093A46038c10837i6625b091
$$ -343090 -258363 -369874 109237 -256872 -120919 -86826 146038 -310837 -96625 -2091
18445B74653e2348l3770g200l7246k21441P498g7712j18628C38912a32714p4304
$$ 274653 -52348 -86118 -7200 -44446 -265887 -258389 -77712 -196340 338912 -132714 -207018
18434b07018c5983m13145E6067c02934i0054N043k78126A17536J247a36066F395
$$ -207018 -35983 -449128 56067 -302934 -90054 -85011 -363137 117536 118783 -136066 6395
18422e1350B31094a93761Q9181j10282B756b88447d5871j09996l2476O4773A0649
$$ -51350 231094 -193761 -104580 -214862 2756 -288447 -45871 -155867 -188343 -123570 10649
18410c14512A3889b53364A2017K26724f5339l8786E6059B1563J11526j4368O3116
$$ -314512 13889 -253364 12017 238741 -65339 -104125 56059 21563 133089 118721 181837
18399A81837O3504C9567b29989m9319m6277C38260a78947B04387F0997a3129k12043
$$ 181837 245341 39567 -229989 -279308 -325585 338260 -178947 204387 60997 -13129 -225172
18388b25172I7381a39680L2392o2772Q4159b0320G9844b81263C75488i5350c1380
$$ -225172 97381 -139680 -107288 -170060 -85901 -20320 79844 -281263 375488 -95350 -31380
18376A49435J94526i7501A7647J57317a77006B42789a1454B07388a745j5106B21962
$$ 149435 343961 -97501 17647 174964 -177006 242789 -11454 207388 -1745 -16851 221962
18364B8558l443R8369j1357e1179A69450G945b4909B28544J74614h4381m3505
$$ 28558 25115 123484 112127 -51179 169450 7945 -24909 228544 403158 -84381 -127886
18353a27886B5431b47455d1256m9700j52301J21135A50208a85800e6266A33580
$$ -127886 25431 -247455 -41256 -90956 -243257 -122122 150208 -185800 -56266 133580
18342h9115C0201O2904c15620a37198q8883m20C75847G0639a27316e3996O846
$$ -89115 30201 93105 -315620 -137198 -226081 -226501 375847 70639 -127316 -53996 -47150
18331d7150a5748k60053B20131A06998e300C4145j985K76457A01246i3623H4754
$$ -47150 -15748 -275801 220131 106998 -5300 34145 32160 308617 101246 -93623 84754
18319A18418a24953L2363l9668B58447D0117d67604E8532b46216B16741c6091
$$ 118418 -124953 -92590 -132258 258447 40117 -467604 58532 -246216 216741 -36091
18308G5681d16423f9245C26011a87958A23037D0296b38564J11171m7315O3261
$$ 75681 -416423 -69245 326011 -187958 123037 40296 -238564 -127393 -174708 -111447
18298a11447c5718k92814a27723L6402A8106K99704j43066o74A8656J55048p3310
$$ -111447 -35718 -328532 -127723 -91321 18106 317810 174744 174070 18656 173704 100394
18287A00394a96036q6286D6161b59972I7356b4061j45079B15551b21210j5481
$$ 100394 -196036 -282322 46161 -259972 97356 -24061 -169140 215551 -221210 -236691
18277b36691E5153a46393r3224N1151D9645k4446K19544j16048b41936g0321n5314
$$ -236691 55153 -146393 -239617 -188466 49645 25199 244743 128695 -241936 -70321 -125635
18266a25635j21515a6825B80016a28485B0545d20580i8993l72328B07283f3125
$$ -125635 -247150 -16825 280016 -128485 20545 -420580 -98993 -471321 207283 -63125
18255A75176N595B8815a18084C49634D6574b5016J332j60566M6306H74P1691b78866
$$ 175176 180771 28815 -118084 349634 46574 -25016 -23684 -184250 -137944 874 72565 -278866
18242C98429c7069m3794F9703j1778a92584O8777j6755O5299B18964b0963A41380
$$ 398429 -37069 -80863 69703 57925 -192584 -123807 -140562 -75263 218964 -20963 141380
18230A07174M1861L8123a45224f3658A89070o2799a35811F493J23377c4172C2439
$$ 107174 149035 187158 -145224 -63658 189070 126271 -135811 6493 129870 -34172 32439
18218A36677E3911J25636e8488J9144C18136H9364g6554j31354h4731D82489a05692
$$ 136677 53911 179547 -58488 -39344 318136 89364 -76554 -207908 -84731 482489 -105692
18206a03681L3369I6551N9397c627j2726j79867b0804C00428l6393m4688G2178
$$ -103681 -70312 96551 155948 -3627 -16353 -196220 -20804 300428 264035 219347 72178
18194B3482C272J30940M7688p0458c8763d086A15203d6814j6251j19644N2707
$$ 23482 3272 134212 181900 111442 -38763 -4086 115203 -46814 -63065 -182709 -130002
18183a30002Q047J5483q7523C9582K0616J07150A233a72624n442A96497L815b51940
$$ -130002 -121955 -106472 -193995 39582 60198 167348 1233 -172624 -178066 196497 200312 -251940
18170a11548B45854b10817A21037M3525e152k49679n5341b4786k1760a4869I3602
$$ -111548 245854 -210817 121037 164562 -5152 -254831 -310172 -24786 -46546 -14869 93602
18158c01420B41896b49662C70114a06124j32240l5297J03650j20947H9502R1627
$$ -301420 241896 -249662 370114 -106124 -238364 -273661 -170011 -290958 89502 181129
18148A81129o318b83922C43691a03600F6849b89902B93411b07961L6629j61451
$$ 181129 174811 -283922 343691 -103600 66849 -289902 293411 -207961 -171332 -332783
18138c32783a10C2991a80930F2964f6546m265l7311D900K04104k1068b50003A76935
$$ -332783 -110 32991 -180930 62964 -66546 -70811 -108122 4900 209004 187936 -250003 176935
18125D38802d42787B38606a17972G6674A9060J0181R1468d0679C1108c46397A97922
$$ 438802 -442787 238606 -117972 76674 19060 29241 120709 -40679 31108 -346397 197922
18113F8430C1533K65716F987K8379K8209P7751n8775J71951a70119C4546O8284
$$ 68430 31533 297249 6987 35366 63575 141326 82551 254502 -170119 34546 102830
18102A02830i8260C7102d99865A62886b06106f5271N36k39010d9337G2912J21028
$$ 102830 -98260 37102 -499865 162886 -206106 -65271 -64735 -303745 -49337 72912 193940
18091A93940f8596E1534b48402A59335f9978E9940b22194K6655j5014i075m2768
$$ 193940 -68596 51534 -248402 159335 -69978 59940 -222194 -195539 -210553 -9075 -51843
18080e1843k1401J4697J6449E3641b4376A57158g9960A13608K1263l3858J50203
$$ -51843 -73244 -58547 -42098 53641 -24376 157158 -79960 113608 134871 101013 251216
18069B51216d4433I8324e9513j7170M526J8744l4200J5447p4077B79090I7729
$$ 251216 -44433 98324 -59513 -76683 -72157 -53413 -87613 -72166 -146243 279090 97729
18057A52429a79024e5259D5963a27600A1001O6809a300j54923A24244a96876O8568
$$ 152429 -179024 -55259 45963 -127600 11001 77810 -1300 -156223 124244 -196876 -128308
18046a28308A381K02893J71609I2732h8232L0065j35350f8075D57741h3422j7460
$$ -128308 1381 204274 375883 92732 -88232 -58167 -193517 -68075 457741 -83422 -100882
18035a00882D2888a13775A88103a18310A86062C0992K78949j53353K16814a94323
$$ -100882 42888 -113775 188103 -118310 186062 30992 309941 156588 373402 -194323
18024b68126C00648E5550I120O9714J55284E3859h7346M0541p8115j60849D1922
$$ -268126 300648 55550 9120 78834 234118 53859 -87346 -46805 -124920 -285769 41922
18012F3678b05469k3112R3183f0169F6348e463F2583R3442a34393A73608d8236
$$ 63678 -205469 -228581 -135398 -60169 66348 -5463 62583 156025 -134393 173608 -48236
18000E1647O05J30911k8823J5005c7203B22582A4311J44564c51138e2884j82628
$$ 51647 52252 183163 154340 169345 -37203 222582 14311 158875 -351138 -52884 -235512
17989b35512d6012B40557F4306J14005b3312E3914c333C2464J36279E4713a02683
$$ -235512 -46012 240557 64306 178311 -23312 53914 -3333 32464 168743 54713 -102683
17977a30818F0640k6921a70509d3064A71021E5516J93250a33695A68922b21394
$$ -130818 60640 33719 -170509 -43064 171021 55516 248766 -133695 168922 -221394
17966i0070B04202B7693Q3989k561f0338j78269M6873H7955c221A03389f650q788
$$ -90070 204202 27693 111682 109121 -60338 -238607 -191734 87955 -3221 103389 -6650 -15438
17954a5438A8903K05288q2038C6546J712Q1242a86503E8724A2652J72636a51144
$$ -15438 18903 224191 142153 36546 38258 119500 -186503 58724 12652 185288 -151144
17942a9504B8607J22725A1479b80267I0162e0672I1964m159a22078A35017R262
$$ -19504 28607 151332 11479 -280267 90162 -50672 91964 87805 -122078 135017 144279
17931A44279N7233J4197a92089H3776L3029k0483L71388c7980q1445q560c1275
$$ 144279 201512 215709 -192089 83776 116805 96322 467710 -37980 -119425 -127985 -31275
17919a23479A40156a04634A74085l8713o3594R0732l1652f2449o5426A39013F2063
$$ -123479 140156 -104634 174085 135372 71778 162510 130858 -62449 -127875 139013 62063
17907a63821D0304I658L08388a89073C48884d1459b0701k88217c9673n0341a0903
$$ -163821 40304 9658 318046 -189073 348884 -41459 -20701 -308918 -39673 -90014 -10903
17895a47652B9141O4398c63724B21379a09932A27320q390b28903B52966c9190
$$ -147652 29141 93539 -363724 221379 -109932 127320 118930 -228903 252966 -39190
17884B09391a13483n0120N8509H5743g2186r4412H7132P8666d1743k30692J15597
$$ 209391 -113483 -163603 -105094 85743 -72186 -166598 87132 165798 -41743 -272435 -156838
17873a56838j0280c8541B59059a07677C51938j59899a82527r8463D10662A13416
$$ -156838 -167118 -38541 259059 -107677 351938 192039 -182527 -280990 410662 113416
17862A14111b40035M2792A7278a06163B26800a25B5617h4176A9272c7430C4991
$$ 114111 -240035 -197243 17278 -106163 226800 -125 25617 -84176 19272 -37430 34991
17850a07751A94666M2149B3173a36320G0102a77381B22158a48603d6213B29629
$$ -107751 194666 236815 23173 -136320 70102 -177381 222158 -148603 -46213 229629
17839a34344n050A01207M6324B6327j1391M9329H408M3663j501B2584C395J0766
$$ -134344 -139394 101207 147531 26327 14936 64265 8408 52071 50570 22584 3395 14161
17827A4161K15946j13842A1451M7656K15623J78183E1961e8492A02499i737E2827
$$ 14161 230107 116265 11451 59107 274730 452913 51961 -58492 102499 -9737 52827
17815g5657B74682j7369A00582a66946k55508E7621O2317a5030q3660B30037I4275
$$ -75657 274682 257313 100582 -166946 -422454 57621 119938 -15030 -98690 230037 94275
17803B98045G8530H65O0383K62334r9628J30179A56039i7282j08504A85858e3108
$$ 298045 78530 865 61248 323582 223954 354133 156039 -97282 -205786 185858 -53108
17791a99288j89773H1269O430a28194h810A13723e3137p814C03303m9336p2566
$$ -199288 -389061 81269 87699 -128194 -8810 113723 -53137 -60951 303303 253967 181401
17780A81401l3793J52917a07401I5667b22212G8918k5858J27104K9851a2730I6904
$$ 181401 147608 300525 -107401 95667 -222212 78918 53060 180164 210015 -12730 96904
17768B85246L8406H2766b39084I3801Q4511c678B53298b40147A71279B1343b17894
$$ 285246 323652 82766 -239084 93801 178312 -3678 253298 -240147 171279 21343 -217894
17756B30408e791B7301R345J9645L3711L54106K4840g6656E6920B5127J55414
$$ 230408 -5791 27301 36646 56291 90002 444108 468948 -76656 56920 25127 180541
17745A80541b16970d7082k9783k8822G9315O1804o0488h643A60630J019a45306
$$ 180541 -216970 -47082 -76865 -105687 79315 141119 80631 -8643 160630 161649 -145306
17733b8104j06170q908C1214K47746I9533E00a53903r0636F0632N1491m2126g6476
$$ -28104 -134274 -143182 31214 278960 99533 500 -153903 -244539 60632 112123 69997 -76476
17720a20692I7233J62189h3801A66433J86011c94033B47223j4775e9224G9138
$$ -120692 97233 259422 -83801 166433 352444 -394033 247223 232448 -59224 79138
17709C13262a79430g305E93819A73676i3878C33501H1732c6063j009K596j43213
$$ 313262 -179430 -7305 593819 173676 -93878 333501 81732 -36063 -37072 -34476 -177689
17698a77689E2441J17594R1941C7359a05196B51109A19821J87141A08956E2653
$$ -177689 52441 170035 261976 37359 -105196 251109 119821 306962 108956 52653
17687F1258k280J89543A7136K3679R0057A334L524M5073G695K49867d5916A20310
$$ 61258 58978 248521 17136 40815 130872 1334 4858 49931 7695 257562 -45916 120310
17674A02571Q1032l6345b16768C61551g3140o2066D9817M18948b3479A10783N0544
$$ 102571 183603 147258 -216768 361551 -73140 -135206 49817 468765 -23479 110783 161327
17663A61327K39008A72620n5096j783a30141E5398K93782L6066F2893e6759B01601
$$ 161327 400335 172620 117524 115741 -130141 55398 349180 385246 62893 -56759 201601
17651B76766h8856C44327A21481k8881K44577m7123j10261K4232a28843B89103
$$ 276766 -88856 344327 121481 92600 337177 290054 179793 204025 -128843 289103
17640C21621o6191j14871k3569m0902J18213L1657K2033p8779M7319m4290b59725
$$ 321621 255430 140559 116990 76088 194301 225958 247991 169212 216531 172241 -259725
17628A35907J20454L05455B0532f6819C48499A25477c19826A40614O5027o1004
$$ 135907 256361 561816 20532 -66819 348499 125477 -319826 140614 205641 144637
17618A44637n3049J4655J32689j8401a6088j696n1164C62726A46098D151L1538
$$ 144637 91588 106243 238932 220531 -16088 -17784 -68948 362726 146098 4151 35689
17607C5689b12017B10799j02046J23405C5414a34031A54635B7205F483J84964
$$ 35689 -212017 210799 108753 232158 35414 -134031 154635 27205 6483 191447
17597A91447b0813A11945b44641F6398L61716b656A21997L1447J35768o0009J52462
$$ 191447 -20813 111945 -244641 66398 428114 -2656 121997 153444 289212 229203 381665
17586C81665n3037l8406a4851I9478K50538K5780A09915Q1109J14377a9483C92964
$$ 381665 328628 290222 -14851 99478 350016 375796 109915 191024 305401 -19483 392964
17574A82355b5775A74083R2118j03462L4525b8711A29867o2027J91745C8898M8112
$$ 182355 -25775 174083 266201 162739 197264 -28711 129867 67840 259585 38898 87010
17563H7010J70845L22350A187N3959a15920j02628B02241F772K12526p1714J07992
$$ 87010 257855 580205 1187 55146 -115920 -218548 202241 6772 219298 147584 255576
17552B55576g2659l1670D20109B03671L9810P2236n9814L0941a92642b9120B90039
$$ 255576 -72659 -104329 420109 203671 243481 315717 255903 286844 -192642 -29120 290039
17540B2555J01540i571A73023n7476R9471l6287K18129K90348A77077C3934J09550
$$ 22555 124095 -9571 173023 115547 215018 178731 396860 687208 177077 33934 143484
17529A43484J12772m4530a20710G42677k11966l9693K35692M55765l24204k17911
$$ 143484 256256 211726 -120710 742677 530711 491018 726710 1182475 858271 640360
17519F40360J44366C46539A11696O6017J27761M561K29462o4635j19943N66775
$$ 640360 784726 346539 111696 177713 305474 310035 539497 474862 354919 921694
17509I21694l8503l4530J40415j73199k73900p4718r4873B5841M05196j12681
$$ 921694 883191 848661 989076 815877 541977 467259 372386 25841 431037 318356
17499C18356Q2218K27158B97585J42513K42584k73502J57566I8255O1604J88538
$$ 318356 400574 627732 297585 440098 682682 409180 566746 98255 159859 348397
17489C48397l301J3218j59300a9382C37375J6845j8263j41907J38735e1634C39647
$$ 348397 345096 358314 199014 -19382 337375 354220 335957 194050 332785 -51634 339647
17477F4872M03244N0859p2444B4233E803N89651B51733K8492K33618k46002J23555
$$ 64872 468116 518975 446531 24233 5803 595454 251733 280225 513843 267841 391396
17466C91396M2368q4821k7496A16752d3345I9025K9474C9123L42042q523A63250
$$ 391396 433764 348943 321447 116752 -43345 99025 128499 39123 381165 372642 163250
17454B68235J61396A57918K60790F0982L93729o4485J36371k16417K77860k62597
$$ 268235 429631 157918 418708 60982 454711 390226 526597 310180 588040 325443
17444C25443o400j1852K23660q5294q272k01415q6313L25739a0117D83713J02821
$$ 325443 319043 307191 530851 445557 437285 235870 149557 475296 -10117 483713 586534
17433E86534A86445l0036J73402j1505N5789l2148J62759q0141A05681N64030
$$ 586534 186445 156409 329811 318306 374095 341947 504706 424565 105681 669711
17423F69711k56454k3936K9512A63376R1401I3362Q1058M22666B94478k2051C3776
$$ 669711 413257 389321 418833 163376 254777 93362 174420 597086 294478 272427 33776
17411C43289J53041B02585R4313L29394j95481o3320j59102L45975k58582n1334
$$ 343289 496330 202585 296898 626292 430811 367491 208389 554364 295782 244448
17401B44448Q0354a7751C16709R8513A84388L0641G7649N6373J65543J10209k7714
$$ 244448 324802 -17751 316709 415222 184388 215029 77649 134022 299565 409774 382060
17390C82060A27434L59919A92613r072D4358J38306L1241K17609A31679M1111
$$ 382060 127434 487353 192613 183541 44358 182664 213905 431514 131679 172790
17380A72790j6784J85221O5941A01177J67432J09635j18640P8774H0264J84542
$$ 172790 156006 341227 407168 101177 268609 378244 259604 338378 80264 264806
17370B64806d2279A49915J33117J70451j7664n0628p9545J18359A50147d622C65565
$$ 264806 -42279 149915 283032 453483 435819 385191 305646 424005 150147 -4622 365565
17358B51652J2160J55161O0510E3323b46929A90088Q686a56957D18594D9543J39387
$$ 251652 263812 418973 479483 53323 -246929 190088 198774 -156957 418594 49543 188930
17347A88930J28574J97772B49934q6730L23159o6914N0250I3889N04505j46742
$$ 188930 317504 515276 249934 163204 486363 419449 469699 93889 598394 451652
17337D51652j02304j6185R074p4770j4082O9897I6068K20905P3449H4433K7406
$$ 451652 349348 333163 342237 267467 253385 323282 96068 316973 390422 84433 111839
17326A11839J27260M58611B48114K15797L6957A69938L25192G6624K34143K92398
$$ 111839 239099 697710 248114 463911 500868 169938 495130 76624 310767 603165
17316F03165J3532A56642o6995L79752p2821j92472L150Q4227K29890l4146O051
$$ 603165 616697 156642 89647 469399 396578 204106 207256 291483 521373 487227 493278
17305D93278p1407c3679B56149L16999B79694d425C56236p3681P053J08899e119
$$ 493278 421871 -33679 256149 573148 279694 -4425 356236 282555 289608 398507 -5119
17293C51706f9644C53491A72697L07043P323j67453j18171F5143K38937A29803
$$ 351706 -69644 353491 172697 479740 487063 319610 201439 65143 304080 129803
17282C49154O9213A20655J44348o545J32785K7579p4165r1561K29962M4199A93616
$$ 349154 418367 120655 265003 258458 391243 418822 344657 253096 483058 527257 193616
17270E19218I9121P5512J51847O5255J1160J10275A28838l1463Q4289J54499R965
$$ 519218 99121 174633 326480 391735 402895 513170 128838 97375 181664 336163 346128
17259C46128J21646j27539J77844F772O88190l35095j3565N9971J46810A36451
$$ 346128 467774 340235 518079 6772 694962 359867 346302 406273 553083 136451
17248D16550L4262o3940q6862G5323j8279l775L04780M1796Q4064D9716M84018
$$ 416550 450812 386872 300010 75323 57044 53269 358049 399845 483909 49716 533734
17237E33734A52639N80794k92539l1670l3931A61858M62906j94886J08145b6217
$$ 533734 152639 733433 440894 409224 375293 161858 624764 429878 538023 -26217
17226D25415J65137A89087J53808C005J98564J99647H3843K1173J95568p7235
$$ 425415 590552 189087 342895 3005 201569 401216 83843 105016 300584 223349
17216B23349K43309O3665A70584L31684n2441j50779F2001L70214j55746P3846
$$ 223349 466658 530323 170584 502268 449827 299048 62001 432215 276469 350315
17206C50315O7838G0079L77334m7363J38267k38447N5182n5012K23387o1091P9335
$$ 350315 418153 70079 447413 400050 538317 299870 355052 300040 523427 462336 541671
17195E41671k6860G7947K66966N190K87510R1049j47017O4532j53225J2334J12616
$$ 541671 514811 77947 344913 350103 637613 728662 581645 646177 492952 505286 617902
17184F17902q4097B33780q1085K21524A70496K12103R6901l0256q1507M0568j79964
$$ 617902 533805 233780 152695 374219 170496 382599 479500 449244 367737 408305 228341
17173B28341Q8915K71105l3256m6195j15932j96204L66590J61477C60145K88167
$$ 228341 317256 588361 555105 508910 392978 196774 563364 724841 360145 648312
17163F48312l18878M1536A57740J27725J98789A81630N57384k88613p1570J37023
$$ 648312 329434 370970 157740 285465 484254 181630 739014 450401 378831 515854
17153E15854J12827k65866n6639L50415L24321l50953A59902P3839L11714j28514
$$ 515854 628681 362815 306176 656591 980912 629959 159902 233741 545455 416941
17143D16941R8665J54015k35971K17766q9722L13481j08101j52234M786j30533
$$ 416941 515606 669621 433650 651416 561694 875175 767074 614840 619626 489093
17133D89093j62614J99275j4740K92482C98732J43420J40891L43458m19422l2567
$$ 489093 326479 525754 511014 803496 398732 542152 683043 1026501 607079 574512
17123E74512J58990o4354M2302L07613k80367n3163L26P3657j18127J8395j97845
$$ 574512 733502 669148 711450 1019063 738696 685533 685859 759516 641389 659784 461939
17112D61939N5370L22725k7062l14990L37451C34392K89011j54702J74462J15308
$$ 461939 517309 840034 812972 497982 835433 334392 623403 468701 643163 758471
17102G58471p2669K9336B32051M16725K16274j83228j58486K06492k20626p673
$$ 758471 685802 715138 232051 648776 865050 681822 523336 729828 509202 501529
17092E01529J79806K78078k64983J85741j08785j29209K6986j9439L27040m31859
$$ 501529 681335 959413 694430 880171 771386 642177 669163 649724 976764 544905
17082E44905J97695J49865K9365j12892j06431j03206K66213l31364J15658J11875
$$ 544905 742600 892465 921830 808938 702507 599301 865514 534150 649808 761683
17072G61683L54289k53306p0351L305n2749N36914l12792J95126k05949j05688
$$ 761683 1115972 862666 792315 795620 742871 1279785 966993 1162119 956170 850482
17062H50482l51424O51351l3274M7639m51844J70453L2463L4764j00750N4061
$$ 850482 499058 1150409 1117135 1164774 712930 883383 915846 950610 849860 903921
17052I03921o5207P7286J01988k65920K86564k01322P1085J41833O7541k89251
$$ 903921 838714 916000 1017988 752068 1038632 837310 908395 1050228 1117769 828518
17042H28518K152P1466j01003R5752P2517J43739k89103j4292J033103H07215
$$ 828518 830670 902136 801133 896885 969402 1113141 824038 809746 1842849 807215
17031A295952j98184j62721M92729K3143n23910K28430K13971l22920m5860J69299
$$ 1295952 1097768 935047 1427776 1450919 927009 1155439 1369410 1046490 1000630 1169929
17021A169929M2283J54188l47313L23349J2378N3511J87795n24764J06372q1004
$$ 1169929 1212212 1366400 1019087 1342436 1354814 1408325 1596120 1071356 1177728 1096724
17011A096724L66950k34757k51053K86207j6175o592J41213l03354K19222j09626
$$ 1096724 1463674 1228917 977864 1264071 1247896 1241304 1382517 1079163 1298385 1188759
17001A188759n7609M91155k93378J78476j37949j25830M82062k09152j93328O7403
$$ 1188759 1131150 1622305 1328927 1507403 1369454 1243624 1725686 1516534 1323206 1390609
16991A390609J58913j39852K10P0894j91586K37600J83587M1313k36882J24438
$$ 1390609 1549522 1409670 1409880 1480774 1289188 1526788 1710375 1751688 1514806 1639244
16981A639244j01990Q9096j89666o490j27447L60249l09565K65192k61238M52851
$$ 1639244 1537254 1626350 1436684 1430194 1302747 1662996 1353431 1618623 1357385 1810236
16971A810236l8079M8650K934J86583l72891J43338J19586P6571p6230J94371
$$ 1810236 1772157 1820807 1823741 2010324 1637433 1780771 1900357 1976928 1900698 2095069
16961B095069l13326L93816k99354J68507R1649k42112o303j07705P4332J70819
$$ 2095069 1781743 2175559 1876205 2044712 2136361 1894249 1887946 1780241 1854573 2025392
16951B025392K9854m5222j4426J43705k45209M38083l64610J90287j50095L15180
$$ 2025392 2055246 2010024 1995598 2139303 1894094 2332177 1967567 2157854 2007759 2322939
16941B322939K14314l94903q4836P1932K97486k00909J64082j7524j94044M38129
$$ 2322939 2537253 2142350 2057514 2129446 2426932 2226023 2390105 2372581 2178537 2616666
16931B616666k66791M018J86461j10645J61572k16040K77426M45333m19628O6904
$$ 2616666 2349875 2353893 2540354 2429709 2591281 2375241 2652667 3098000 2678372 2745276
16921B745276j53735M4241N45580l19502K60077j0510J46294k70675j36306L07241
$$ 2745276 2591541 2635782 3181362 2861860 3121937 3111427 3257721 2987046 2850740 3157981
16911C157981l6785Q9528k03523L657J66711J01992j40661J13002J996K83536
$$ 3157981 3121196 3210724 3007201 3010858 3177569 3279561 3138900 3251902 3253898 3537434
16901C537434n8174p188k76399L78145j8996O8297L24795q8810J96933k51502
$$ 3537434 3479260 3472072 3195673 3573818 3554822 3623119 3947914 3859104 4056037 3804535
16891C804535K94562m78102L01925J14801J32397k64048J25462J29017K00003
$$ 3804535 4099097 3620995 3922920 4037721 4170118 3906070 4031532 4160549 4360552
16882D360552k19448N19493j96646J43025J49289k56408N16443n5776l17063K08025
$$ 4360552 4141104 4660597 4463951 4606976 4756265 4499857 5016300 4960524 4643461 4851486
16872D851486j24632P56473j98464Q2216M7366k74231K82739K41742j61794O5381
$$ 4851486 4726854 5483327 5284863 5367079 5414445 5140214 5422953 5664695 5502901 5568282
16862E568282K68236J70904k2902J41170j85763n7552L29368M47565M4205M5978
$$ 5568282 5836518 6007422 5984520 6125690 5939927 5882375 6211743 6659308 6703513 6749491
16852F749491K24975k8354l56234O95117L7873L94985m62703L82498L1249J68705
$$ 6749491 6974466 6946112 6589878 7284995 7322868 7717853 7255150 7637648 7668897 7837602
16842G837602J871M5961N18445J78624j65730L49106J141L73150k286L64114J67524
$$ 7837602 7839473 7885434 8403879 8582503 8416773 8765879 8767020 9140170 9137884 9501998 9669522
16831I669522K5324J94194J90260j12026M94384K21373r0032K01371K43384N06741
$$ 9669522 9694846 9889040 10079300 9967274 10461658 10683031 10592999 10794370 11037754 11544495
16821A1544495L48229J09322J19830J91267L27444L16643M28944j55921M43073
$$ 11544495 11892724 12002046 12121876 12313143 12640587 12957230 13386174 13230253 13673326
16812A3673326M65230j84344M77269M47269N5322O81486O08547J72130M84739
$$ 13673326 14138556 13954212 14431481 14878750 14934072 15615558 16224105 16396235 16880974
16803A6880974J31868O38839J48184M13034P84845j8941N74953Q11061M33208
$$ 16880974 17012842 17651681 17799865 18212899 18997744 18978803 19553756 20364817 20798025
16794B0798025L983J065192O51535L93406M21517N54368J254065N0071Q52972
$$ 20798025 20802008 21867200 22518735 22912141 23333658 23888026 25142091 25192162 26045134
16785B6045134J060826J58660J256058K60947J212557M73535R42540J071448J017458
$$ 26045134 27105960 27264620 28520678 28781625 29994182 30467717 31410257 32481705 33499163
16776C3499163J084898M53096J490763O44793J287324J291307P56114J422584
$$ 33499163 34584061 35037157 36527920 37172713 38460037 39751344 40507458 41930042
16768D1930042R65356J508674J237798J343379J460298J334754J272846J687184
$$ 41930042 42895398 44404072 45641870 46985249 48445547 49780301 51053147 52740331
16760E2740331J799571R27364J653212J745076J468538J615694J573146J620319
$$ 52740331 54539902 55467266 57120478 58865554 60334092 61949786 63522932 65143251
16752F5143251J920637J452705J940306J918093J459607J579343J803931J337606
$$ 65143251 67063888 68516593 70456899 72374992 73834599 75413942 77217873 78555479
16744G8555479J493171J970196J308533J515865J044628J277554P38180J455604
$$ 78555479 80048650 82018846 83327379 84843244 85887872 87165426 87903606 89359210
16736H9359210P32786Q95768O76561K21964L35399M30476m4290M0858j82732m57137
$$ 89359210 90091996 90987764 91664325 91886289 92221688 92652164 92607874 92648732 92466000 92008863
16726I2008863p37757l98205n89824o79740j343708r12373j324613j085303j175812
$$ 92008863 91271106 90872901 90283077 89603337 88259629 87347256 86022643 84937340 83761528
16717H3761528j497028j782788j271676j481594j554443j752795k007574j321182
$$ 83761528 82264500 80481712 79210036 77728442 76173999 74421204 72413630 71092448
16709G1092448j804683j470522j609305j404619j886540j646804j284753j408605
$$ 71092448 69287765 67817243 66207938 64803319 62916779 61269975 59985222 58576617
16701E8576617j761448j349385j704537j499879j141775j542786j224872j261352
$$ 58576617 56815169 55465784 53761247 52261368 51119593 49576807 48351935 47090583
16693D7090583q60880j325177j362548q09315j543375r75086j008706j145569
$$ 47090583 46229703 44904526 43541978 42732663 41189288 40214202 39205496 38059927
16685C8059927q52015r25399o84171j316126q08447j247755j44838j273594n57689
$$ 38059927 37207912 36282513 35598342 34282216 33473769 32226014 32081176 30807582 30249893
16676C0249893o47547q50748l99057q85514p29618n19210m03015p61502n08633
$$ 30249893 29602346 28751598 28352541 27467027 26737409 26218199 25815184 25053682 24545049
16667B4545049p92767o24635k87213k67991p27421l96177m88879l09916o92712
$$ 24545049 23752282 23127647 22840434 22572443 21845022 21448845 20959966 20650050 19957338
16658A9957338l35924n73315k78245m32424m76338l19883k20030m66318j7272
$$ 19957338 19621414 19048099 18769854 18337430 17861092 17541209 17321179 16854861 16837589
16649A6837589p46700k19086l71323m4226k51204m86110L23916o32708o14634
$$ 16837589 16090889 15871803 15500480 15456254 15205050 14718940 15042856 14410148 13795514
16640A3795514L5087k48995l87458q8880o7475j70826q35912K16596l55194m2200
$$ 13795514 13830601 13581606 13194148 13105268 13037793 12866967 12031055 12247651 11892457 11850257
16630A1850257j96922j88723J51493m94445j8870j75804o89634L32178l11318
$$ 11850257 11653335 11464612 11616105 11121660 11102790 10926986 10237352 10569530 10258212
16621A0258212j23326n8010l27317j45688j60928l14972J99406l13902J75816
$$ 10258212 10134886 10076876 9749559 9603871 9442943 9127971 9327377 9013475 9189291
16612I189291k10932m77753J52659j96043K78001n05442q1009r9605R8376m42525
$$ 9189291 8978359 8500606 8653265 8457222 8735223 8229781 8148772 8049167 8147543 7705018
16602G705018N9972o255p2651l08272Q5992j8791k67612o5363J27038l30763J64157
$$ 7705018 7764990 7758735 7686084 7377812 7463804 7445013 7177401 7112038 7239076 6908313 7072470
16591G072470j80650k00173k0974k56264J81611m18260j71247n2227P3386k03262
$$ 7072470 6891820 6691647 6670673 6414409 6596020 6177760 6006513 5954286 6027672 5824410
16581E824410K76963k59565J72784k30911j27791K15782l60925J93300k77679
$$ 5824410 6101373 5841808 6014592 5783681 5655890 5871672 5510747 5704047 5426368
16572E426368J231j40759j92736K12533k26572N75L6149k79708K15435j57779
$$ 5426368 5427599 5286840 5094104 5306637 5080065 5080640 5116789 4837081 5052516 4894737
16562D894737O662j21217k46378R6232m5455J60488k27763J98666L15714k49757
$$ 4894737 4901399 4780182 4533804 4630036 4584581 4745069 4517306 4715972 5031686 4781929
16552D781929m61904N4137J09812q6522o0052q9318q627j66472j8772K71180j41275
$$ 4781929 4320025 4374162 4483974 4397452 4337400 4248082 4239455 4072983 4054211 4325391 4184116
16541D184116J15827j36796k68206K90697k12617k32925J44784K19466k98806
$$ 4184116 4299943 4163147 3894941 4185638 3973021 3740096 3884880 4104346 3805540
16532C805540n38632J19440K34784J35707M0007l16242J49365j99851P4843k83568
$$ 3805540 3266908 3386348 3621132 3756839 3796846 3480604 3629969 3430118 3504961 3221393
16522C221393J62854L43706m86022K31615p1413j6879j53202N922r7373J06104
$$ 3221393 3384247 3727953 3241931 3473546 3402133 3385254 3232052 3237974 3140601 3246705
16512C246705q0306j06533L19353m13544j63991N50530j91538N9422l32949J82170
$$ 3246705 3166399 3059866 3379219 2965675 2801684 3352214 3160676 3220098 2887149 3069319
16502C069319j75761K09345L603q7776P5238J8328j91774K26685l09604l52775
$$ 3069319 2893558 3102903 3106506 3018730 3093968 3112296 2920522 3147207 2837603 2484828
16492B484828N3669K97942n9049J22940l85405J84201J13055j01842M5106k03893
$$ 2484828 2538497 2836439 2777390 2900330 2514925 2699126 2812181 2710339 2755445 2551552
16482B551552j07111J74162k6558k04397K93224k22410P9441M21788m69827J72584
$$ 2551552 2444441 2618603 2592045 2387648 2680872 2458462 2537903 2959691 2489864 2662448
16472B662448j49818o5480j14748j78821N3714L06428p4393k00416J68872K751
$$ 2662448 2512630 2447150 2332402 2153581 2207295 2513723 2439330 2238914 2407786 2410537
16462B410537m2752k73726K08578J5901J66460l09855J03268P7416q4317q1553
$$ 2410537 2367785 2094059 2302637 2318538 2484998 2175143 2278411 2355827 2271510 2189957
16452B189957j14397L12739m82379N05653l21873R9825j10435P3903l2859K46618
$$ 2189957 2075560 2388299 1905920 2411573 2089700 2189525 2079090 2152993 2120134 2366752
16442B366752m63208J40689N7785j48540N0411J25950k35945J32734K48830j48165
$$ 2366752 1903544 2044233 2102018 1953478 2003889 2129839 1893894 2026628 2275458 2127293
16432B127293k00791L54558o1450l23736k6446m018L00356l16739j9215J27593
$$ 2127293 1926502 2281060 2219610 1895874 1869428 1865410 2165766 1849027 1829812 1957405
16422A957405j47911K14229k20007J52947J09359k02581L6641r9425M7674L02180
$$ 1957405 1809494 2023723 1803716 1956663 2066022 1863441 1900082 1800657 1848331 2150511
16412B150511n0553m42418N8589r932J11467Q0230k58287K43287P5638k49515
$$ 2150511 2099958 1657540 1716129 1706197 1817664 1897894 1639607 1882894 1958532 1709017
16402A709017J94672J29085m72221J8331J30373q1418R0058M0993l51802K56803
$$ 1709017 1903689 2032774 1560553 1578884 1709257 1627839 1717897 1758890 1407088 1663891
16392A663891l85275K20283J2273j80753M62330k33321m3843O1630k3486j39382
$$ 1663891 1278616 1498899 1511172 1330419 1792749 1559428 1515585 1577215 1553729 1414347
16382A414347N95105l65180l99739M50372j90703o8718J39412k41722N74407l91585
$$ 1414347 2009452 1644272 1244533 1694905 1504202 1435484 1574896 1333174 1907581 1515996
16372A515996L1668k03897L12552j28965J85881r166R371m86804J72904J12239
$$ 1515996 1547664 1343767 1656319 1527354 1713235 1704069 1713440 1226636 1399540 1511779
16362A511779k52244N43043l40892q3107k61410J51575K06923L51393p42129M09670
$$ 1511779 1259535 1802578 1461686 1378579 1117169 1268744 1475667 1827060 1084931 1494601
16352A494601k68011q1762L69915n3464k8468L5215k9980J1631k77575N88537
$$ 1494601 1226590 1144828 1514743 1461279 1432811 1468026 1438046 1449677 1172102 1760639
16342A760639o96200L64309L16407n61017M09153j17182k03823J88791j0282m4093
$$ 1760639 1064439 1428748 1745155 1184138 1593291 1476109 1272286 1461077 1450795 1406702
16332A406702k2074j88734j70308L92031j80861K50604j17116j48102j58841J46843
$$ 1406702 1384628 1195894 1025586 1417617 1236756 1487360 1370244 1222142 1063301 1210144
16322A210144J37264j22485k726P7880K34565k08725L4204l19571O4524K14820
$$ 1210144 1347408 1224923 1222197 1300077 1534642 1325917 1360121 1040550 1105074 1319894
16312A319894l07094R7599K17903k13635J22994j47772m6621M59761o56753L20255
$$ 1319894 1012800 1110399 1328302 1114667 1237661 1089889 1043268 1503029 846276 1166531
16302A166531J88813k26909J4928R1015J7270l4781p8606J10595l94505K68410
$$ 1166531 1355344 1128435 1143363 1234378 1251648 1216867 1138261 1248856 854351 1122761
16292A122761J4988j75545K12807k58155R8808J56361J83424n52628L66851O1713
$$ 1122761 1137749 962204 1175011 916856 1015664 1172025 1355449 802821 1169672 1231385
16282A231385m97166J46714j11935L50637k55967L79642k90223J5690K65893m51878
$$ 1231385 734219 880933 768998 1119635 863668 1243310 953087 968777 1234670 782792
16272G82792J32785J46891j20713J28781j13627k86645L43713j28404r6854L50330
$$ 782792 915577 1062468 941755 1070536 956909 670264 1013977 885573 788719 1139049
16262A139049k63810P7502R0117J88018L8382m75026J92832J2512L4635k2721
$$ 1139049 875239 952741 1042858 1230876 1269258 794232 987064 999576 1034211 1011490
16252A011490j65884J73570k87546N03093n24133N61414l22217l8455n7285L19959
$$ 1011490 845606 1019176 731630 1234723 710590 1272004 949787 911332 854047 1174006
16242A174006m37083J13227K95339j00613j70503J80631q7458j65644J11290k49256
$$ 1174006 736923 850150 1145489 1044876 874373 1055004 967546 801902 913192 663936
16232F63936l0564M00541m19823K67127O2148k6928k7962k38633B89772M63280
$$ 663936 633372 1033913 614090 881217 943365 916437 888475 649842 289772 753052
16222G53052K3040P9624j25922j29338K38858Q0613l06144q9575K51900k7623
$$ 753052 776092 855716 729794 600456 839314 919927 613783 524208 776108 748485
16212G48485Q0658j5486j53535m5260L69448k38614J42357j53991p3014J82129
$$ 748485 829143 813657 660122 614862 984310 745696 888053 734062 661048 843177
16202H43177o1796j09024K6993k79587M93742j77101k5699N7788k82547n5105
$$ 843177 781381 672357 699350 419763 913505 736404 710705 768493 485946 430841
16192D30841N35872j15762L6814k24837j23534K90611Q201j50410j36282k72616
$$ 430841 966713 850951 887765 662928 539394 830005 838206 687796 551514 278898
16182B78898J44324j19749M28776m5716p5857j27462l1908J59336J09071B70607
$$ 278898 423222 303473 732249 686533 610676 483214 451306 610642 719713 270607
16171E01886O9646K67989C91850L35644l46123L46192j86513M840j91589M11842
$$ 501886 571532 839521 391850 727494 381371 727563 541050 545890 354301 766143
16161G66143C02472L02349L41845D53687M0034J2609M9719O1830B98461m3397
$$ 766143 302472 604821 946666 453687 493721 506330 556049 617879 298461 255064
16151B55064J77451M1449m1802K60493C28590k0821J04506J6550m546J16815K63509
$$ 255064 432515 473964 432162 692655 328590 307769 412275 428825 424279 541094 804603
16140H04603l47131L24829k61389p1459n0978q5992J46982j4243m2409A3686M07925
$$ 804603 457472 782301 520912 449453 398475 312483 459465 445222 402813 13686 421611
16129D21611p4163j42443M12182k0281k12500n1381J10346J72189A69340K49936
$$ 421611 347448 205005 617187 596906 384406 333025 443371 615560 169340 419276
16119D19276L170R5706k20618K21933A46565K58243J37220q3774B16690J70166
$$ 419276 422446 518152 297534 519467 146565 404808 542028 458254 216690 386856
16109C86856J9704n6185J55087B01133K34960L2127B15123J38740m7457l1929
$$ 386856 406560 350375 505462 201133 436093 468220 215123 353863 306406 274477
16099B74477D9031j2138K68939B7212L54783J55102J85740k75270B02671J48133
$$ 274477 49031 36893 305832 27212 381995 537097 722837 447567 202671 350804
16089C50804q6909j05349K45554m9550P8602A05438J04753r3057C0097M71802
$$ 350804 263895 158546 404100 354550 433152 105438 210191 117134 30097 501899
16079E01899j18178A70133C7499J28678R0683O8915j40151L58189O348J6000k43361
$$ 501899 383721 170133 37499 166177 256860 325775 185624 543813 550161 566161 322800
16068C22800j22312R0102J32985H5214J53140K17788I9345L40303i9966D77697
$$ 322800 200488 290590 423575 85214 238354 456142 99345 439648 -99966 477697
16057A27617M81862A21770L47915A76873K05480j08638k7317J93384j57054M4135
$$ 127617 609479 121770 469685 176873 382353 273715 246398 439782 282728 326863
16047C26863R9021j21212d3466A54033J85551k2294M9033J21205A22276K1592
$$ 326863 425884 304672 -43466 154033 339584 317290 366323 487528 122276 143868
16037A43868J04002M560L93697B45068a24563A78708k7864M52728k74834F2565
$$ 143868 247870 252430 646127 245068 -124563 178708 150844 603572 328738 62565
16026C43178a6990C46216j20817j2636J78091k6055A50100J23141M4250K43285
$$ 343178 -16990 346216 225399 212763 390854 364799 150100 273241 317491 560776
16016E60776r4689o4644A59988l5120J15769a24498B066J15092K91453B02407
$$ 560776 466087 401443 159988 124868 240637 -124498 2066 117158 408611 202407
16005b0048A95093a24837A76403D9365a79303I2373O6794J87083I7579K91377
$$ -20048 195093 -124837 176403 49365 -179303 92373 159167 346250 97579 388956
15995C88956J13992F4215e443A64520E0737M29177k25553K26982L48008J34374
$$ 388956 502948 64215 -5443 164520 50737 479914 254361 481343 829351 963725
15985I63725k23457j72306J99974j09501A74380J22276J91734A47327K36231C9100
$$ 963725 740268 567962 767936 658435 174380 296656 488390 147327 383558 39100
15974I0987L51383B1196a75290A04985M8259b7635n8640n2142I1575K48579j54272
$$ 90987 442370 21196 -175290 104985 153244 -27635 -86275 -138417 91575 340154 185882
15963A85882c10136d46D13121g671K531A87107i3128B82366E4000J83748m9115
$$ 185882 -310136 -446 413121 -7671 -5140 187107 -93128 282366 54000 237748 188633
15952A88633b10942E7231j8584a18802B83215A0087J9160O6392D4899L7420b4449
$$ 188633 -210942 57231 38647 -118802 283215 10087 29247 95639 44899 82319 -24449
15940a69918A1010b16059g6518j28096B24874H7459J45121M9676R0928a02743
$$ -169918 11010 -216059 -76518 -204614 224874 87459 232580 282256 373184 -102743
15929b55670a4584C02673J25448A84929a02310p7704B51941g9548C64154I1699
$$ -255670 -14584 302673 428121 184929 -102310 -180014 251941 -79548 364154 91699
15918B95419j42597J19458a70108N3243B75810j36694J7768n3691K03884c031
$$ 295419 152822 272280 -170108 -116865 275810 139116 156884 103193 307077 -3031
15907b3609E7873O5517a39733C41151c4865A52524b05344A52800n7823J65738
$$ -23609 57873 123390 -139733 341151 -34865 152524 -205344 152800 94977 260715
15897B60715O8820e1970k42345g6707B83750j33867D6954a08234C82640E2194
$$ 260715 329535 -51970 -294315 -76707 283750 149883 46954 -108234 382640 52194
15886b48863A99686A8845a3455E7783A745M6239J42288a92596B12584P1573g0553
$$ -248863 199686 18845 -13455 57783 1745 47984 190272 -192596 212584 284157 -70553
15874d65627B84382l9034c1814P623j34692L5796M8716j30486E7449b4189A19278
$$ -465627 284382 245348 -31814 -24191 -158883 -123087 -74371 -204857 57449 -24189 119278
15862a77150c3758B38901c70897B02718c03207A48936b17910A8834D424a66158
$$ -177150 -33758 238901 -370897 202718 -303207 148936 -217910 18834 4424 -166158
15851a33317C914a24797D8256A9919i8045H7479b68699I9356C4672i7983a4558
$$ -133317 3914 -124797 48256 19919 -98045 87479 -268699 99356 34672 -97983 -14558
15839A64996A3647N7079J24210f4288B98168L21659h6158j32187K5281B37093
$$ 164996 13647 70726 194936 -64288 298168 619827 -86158 -218345 -193064 237093
15828B49918h6059B0772g974q3346l04135A64847a49959H5336J45121p8837M2554
$$ 249918 -86059 20772 -7974 -91320 -395455 164847 -149959 85336 230457 151620 194174
15817A94174J48815a44145j3521B24937C3554a92274C01993A26697a92902A7912
$$ 194174 342989 -144145 -157666 224937 33554 -192274 301993 126697 -192902 17912
15806h0665F8593a43769F5821j4365B2886a55576A83635e952C67156a26362A257
$$ -80665 68593 -143769 65821 51456 22886 -155576 183635 -5952 367156 -126362 1257
15794B75308B8662e57240a98511E8586J14818p6841h6419B221a12848K052B65457
$$ 275308 28662 -557240 -198511 58586 173404 96563 -86419 2221 -112848 -110796 265457
15782e3340B08302k5946d6578f252I0776J1980h5703k17896F7631f4051I843J41426
$$ -53340 208302 182356 -46578 -6252 90776 102756 -85703 -303599 67631 -64051 9843 151269
15770A51269a4021A76500e2526B08739I1465L4244B1903N3253J1669O0421j0933
$$ 151269 -14021 176500 -52526 208739 91465 125709 21903 75156 86825 147246 136313
15759A36313a7441A42308i7321C58841j49443O2730a01602j08103B96378a72900
$$ 136313 -17441 142308 -97321 358841 209398 272128 -101602 -209705 296378 -172900
15748B17471b64757A28369a66465A37572e3261A7837a20372K5694o9511o6733
$$ 217471 -264757 128369 -166465 137572 -53261 17837 -120372 -94678 -164189 -230922
15738b30922F6985J60961D4418c10912r7663G211b799A12874i9957G1360a31293
$$ -230922 66985 227946 44418 -310912 -408575 7211 -2799 112874 -99957 71360 -131293
15726A29590A013K64239E4034G321d2576o1924c9071j55292D6825a58764r0625
$$ 129590 1013 265252 54034 7321 -42576 -104500 -39071 -194363 46825 -158764 -249389
15715b49389o3799b299F0045a0345p5144o5583M1603A04046B5707a77013j00179
$$ -249389 -313188 -2299 60045 -10345 -85489 -151072 -109469 104046 25707 -177013 -277192
15704b77192A93905b41876G7161C216J44103C5560a54176A38923A4874J16491
$$ -277192 193905 -241876 77161 3216 147319 35560 -154176 138923 14874 131365
15694A31365R3242n5105f153l5786B77670A19619D0613J97566a03418c3643C1374
$$ 131365 224607 169502 -6153 -41939 277670 119619 40613 238179 -103418 -33643 31374
15682A59507J78079e3425N797l4583k7740j4869B24334J53685H2436L3734l7910
$$ 159507 337586 -53425 -47628 -82211 -109951 -124820 224334 378019 82436 116170 78260
15671G8260J31247M9598j24475o4036b9894r4860n3058D0003a56645O4670L9362
$$ 78260 209507 259105 134630 70594 -29894 -124754 -177812 40003 -156645 -91975 -52613
15660e2613k26404A57763p7293J06701q1904a87820m4833N3023h7112C75476g6518
$$ -52613 -279017 157763 80470 187171 105267 -187820 -232653 -179630 -87112 375476 -76518
15648G7288a78420B97836B5318J77489H3920d35444G9595J20721f285A09469f6588
$$ 77288 -178420 297836 25318 202807 83920 -435444 79595 200316 -6285 109469 -66588
15636H7277e3520A45867o6212l2619f8291j0611C2510O1853h0921j07252e4369
$$ 87277 -53520 145867 79655 47036 -68291 -78902 32510 94363 -80921 -188173 -54369
15624D5882i8446A27872n4557c888B01335h6813A69136a38271a8255B90182b85932
$$ 45882 -98446 127872 73315 -3888 201335 -86813 169136 -138271 -18255 290182 -285932
15612G7189K2047D0463K44394b24288M2672k14972F2013b27485B17443a50096
$$ 77189 99236 40463 284857 -224288 -181616 -396588 62013 -227485 217443 -150096
15601b96926N5579a10538p5742j54525a14624E2403N4961d8088j15479B61378
$$ -296926 -241347 -110538 -186280 -340805 -114624 52403 107364 -48088 -163567 261378
15590b36780a00395n5866j99042n1572B22283c7619j84817B63049c16476J52491
$$ -236780 -100395 -156261 -355303 -406875 222283 -37619 -222436 263049 -316476 -163985
15580a63985E0686M337K85770d05256A55855l0019h3903I0708a13672j88275b0878
$$ -163985 50686 55023 340793 -405256 155855 125836 -83903 90708 -113672 -301947 -20878
15568D2437N2844a75229B50162D2931J0492K23490B8366f1842j3967A84604Q5249
$$ 42437 95281 -175229 250162 42931 53423 276913 28366 -61842 -75809 184604 269853
15557B69853d996A20402K44306F2078J01246g6490l26200g9338A93306d3122j34301
$$ 269853 -4996 120402 364708 62078 163324 -76490 -402690 -79338 193306 -43122 -177423
15546a77423o6386g4919A79460J68748k6756p3040m040r291n7937m5469L90J08349
$$ -177423 -243809 -74919 179460 348208 321452 248412 244372 235081 177144 131675 132065 240414
15534B40414j0917m0934C0556Q9859R8939I9171J43141a08271G1071Q3531O544
$$ 240414 229497 188563 30556 120415 219354 99171 242312 -108271 71071 154602 161146
15523A61146J32697j3993a41913A5435K82600b11221k60005d0495C0961J06294
$$ 161146 293843 279850 -141913 15435 298035 -211221 -471226 -40495 30961 137255
15513A37255r417J0174e1992B47068N0522F3516J53509n3626C6566K44851g3716
$$ 137255 127838 138012 -51992 247068 297590 63516 217025 163399 36566 281417 -73716
15501a18254K9828E5107K32484b7512K258j82911f0453A93780a78282D18821F0841
$$ -118254 -88426 55107 287591 -27512 -25254 -208165 -60453 193780 -178282 418821 60841
15489a06798C0297a16539J3517A315O4573b2744E15792B52799H5285K30238q2521
$$ -106798 30297 -116539 -103022 1315 65888 -22744 515792 252799 85285 315523 233002
15478B33002K78849j64990K38017j2369C8843M38764G5231e8210b2980D4895a79240
$$ 233002 511851 346861 584878 572509 38843 477607 75231 -58210 -22980 44895 -179240
15466A16318j7233c73524A9131a17166C3014r627J96239a83707B14240r3837h7698
$$ 116318 99085 -373524 19131 -117166 33014 23387 219626 -183707 214240 120403 -87698
15454A79550D5670a05035K431A30925B9290K16144b0884G02960p51j05532K15029
$$ 179550 45670 -105035 -102604 130925 29290 245434 -20884 702960 702209 596677 811706
15443H11706m3889O2254C77138J73716A99752J53380p4017a64973I3208a32915
$$ 811706 767817 830071 377138 550854 199752 353132 279115 -164973 93208 -132915
15432B05706p8889m9930a1560A75664n1524j7874B2486c64948b1886E8340c02173
$$ 205706 126817 76887 -11560 175664 124140 106266 22486 -364948 -21886 58340 -302173
15420b83261n8589J59223B4977h4352J2219B3048e3086F0867e38804B226J3076
$$ -283261 -341850 -182627 24977 -84352 -72133 23048 -53086 60867 -538804 2226 15302
15409A5302a19267e9447A88628a44720p5557A31315L90683F4819i1803c9613A14623
$$ 15302 -119267 -59447 188628 -144720 -220277 131315 521998 64819 -91803 -39613 114623
15397b94435J06075A15474H475a12080M6475G3504c8752A24333a84771k6714C13647
$$ -294435 -188360 115474 8475 -112080 -65605 73504 -38752 124333 -184771 -211485 313647
15385i2214J1951B39619a69349c9200A76463c5879B05576a5221C20537F5407k4522
$$ -92214 -80263 239619 -169349 -39200 176463 -35879 205576 -15221 320537 65407 40885
15374D0885J80531J25980j38833a1455C70272F4715a13949H8442f723p1884A45009
$$ 40885 221416 347396 208563 -11455 370272 64715 -113949 88442 -6723 -78607 145009
15362h4681H8426a81616A97643k3279o1405C9309L3178J45751l5520n3886A4869
$$ -84681 88426 -181616 197643 174364 112959 39309 72487 218238 182718 128832 14869
15350A17740E1917k2472P8101K47813q7344l1264k3495a4288C81679J80810a17431
$$ 117740 51917 29445 107546 355359 268015 236751 213256 -14288 381679 562489 -117431
15338A70437q4963O0736J05782i9030H2807J76112j12918b7063A86827Q6537j03532
$$ 170437 85474 146210 251992 -99030 82807 258919 146001 -27063 186827 273364 169832
15327A69832L4725J83965H0200J13396J42266A66450j2520J19738i1196B57353
$$ 169832 204557 388522 80200 193596 335862 166450 153930 273668 -91196 257353
15316a19647C49374J52501a15351n0449p3950B5544J64941f9912E8994J83885
$$ -119647 349374 501875 -115351 -165800 -239750 25544 190485 -69912 58994 242879
15306B42879C9915J90964c7222B5551h5901B06289C9327a5142A91267C0082L14992
$$ 242879 39915 230879 -37222 25551 -85901 206289 39327 -15142 191267 30082 345074
15295C45074a66852D17090A48112b7064k526D5479f9038L2716A56944b00662H3896
$$ 345074 -166852 417090 148112 -27064 -29590 45479 -69038 -36322 156944 -200662 83896
15283C8327J63080c14494A30115E4995J49497J49994F7520F500a72589p0635C3458
$$ 38327 201407 -314494 130115 54995 204492 354486 67520 6500 -172589 -243224 33458
15271a85624I7362hG7427J3526K17693I8766J52677A25315a50577c3184C0319
$$ -185624 97362 -8 77427 90953 308646 98766 251443 125315 -150577 -33184 30319
15259A60915p0991L54970j14297i2674A84838b72506N0680A21578a59052B6458
$$ 160915 89924 444894 330597 -92674 184838 -272506 -221826 121578 -159052 26458
15248e1993B71014a84144C74262L04254L12454O81478K03391l22218P37172I15848
$$ -51993 271014 -184144 374262 678516 990970 1672448 1875839 1553621 2290793 915848
15237C82144a60216A42002J81157a25251A5332J67851m8281J20022d9728C2190
$$ 382144 -160216 142002 323159 -125251 15332 183183 134902 254924 -49728 32190
15226A99379o5344D5958a33146A97026j9348C7962A8670K42423a46477l3867A59811
$$ 199379 134035 45958 -133146 197026 177678 37962 18670 261093 -146477 -180344 159811
15214d0805a5728B05950f7508D5365b26313A35322b2734j38116p5475A51388R7347
$$ -40805 -15728 205950 -67508 45365 -226313 135322 -22734 -160850 -236325 151388 248735
15203B48735I2389R128m7191a64757B31371b8080A16002o766O0842Q9733H675
$$ 248735 92389 101517 54326 -164757 231371 -28080 116002 109236 170078 259811 8675
15191B9446g4716C09606a71108A77053g4561l6106J6143B05426Q8038a3609N330
$$ 29446 -74716 309606 -171108 177053 -74561 -110667 -94524 205426 293464 -13609 -8279
15180h279A94218A5288J39152a50574B67381B113M39589C8772J02306b3092k20419
$$ -8279 194218 15288 154440 -150574 267381 2113 441702 38772 141078 -23092 -243511
15169b43511A2507J43382c3971A93152J7314K23443A94490h9870A35249L52434
$$ -243511 12507 155889 -33971 193152 210466 433909 194490 -89870 135249 487683
15159D87683k36000j22711A5526K5883J43827k5269G1585g5595B24216I9324a51418
$$ 487683 251683 128972 15526 41409 185236 159967 71585 -75595 224216 99324 -151418
15147C21261a23534N3563C92184A25365L4361a40072B37485I4960M20420B31215
$$ 321261 -123534 -69971 392184 125365 159726 -140072 237485 94960 515380 231215
15136A29761P7911q144j9552P7036d0264j3798B1847N07703B00697c4072B16037
$$ 129761 207672 199528 179976 257012 -40264 -54062 21847 529550 200697 -34072 216037
15124C29045I1478a11691c5705D2654N2751P0379D5975K37920c9766q1479C32461
$$ 329045 91478 -111691 -35705 42654 95405 165784 45975 283895 -39766 -121245 332461
15112B72747r2968O5933J18616e2374A88689L0980J94943A25406M1590a43682
$$ 272747 179779 245712 364328 -52374 188689 219669 414612 125406 166996 -143682
15101a00662I3692B3192R9821b3584A22823J40829g0557n5966C8586J01726k9196
$$ -100662 93692 23192 123013 -23584 122823 263652 -70557 -126523 38586 140312 111116
15090A11116k3646J30346o746Q1262i185G9777L1088m1166R611K9832k6677J519
$$ 111116 87470 217816 211070 292332 -9185 79777 110865 69699 79310 109142 82465 83984
15078H3984R0609f1879j5422A18000m3169K72270A39031J3138b14767C77731a57226
$$ 83984 174593 -61879 -77301 118000 74831 347101 139031 152169 -214767 377731 -157226
15066B76804d9130J4685m0916o5286D21887A53235A3712a06710c6198E32683B13210
$$ 276804 -49130 -34445 -75361 -140647 421887 153235 13712 -106710 -36198 532683 213210
15054C87415j03141j08767K23235j14086H8178K18819k5781j11604Q5799o1361
$$ 387415 284274 175507 398742 284656 88178 306997 281216 169612 255411 194050
15044A94050M32399j1304B12310O6064j15619O67680l76435A74926J9018K82590
$$ 194050 626449 615145 212310 278374 162755 830435 454000 174926 193944 476534
15034D76534o6648n4610A40481J55513M48930k01372q1273M19187k10991k99239
$$ 476534 409886 355276 140481 295994 744924 543552 462279 881466 670475 371236
15024C71236L27948C0265J36261o099M92935k67204J37802Q0651A30476M12495
$$ 371236 699184 30265 166526 160427 653362 386158 523960 604611 130476 542971
15014E42971j01877j75308G9071Q4726M28805A98376L57142B75833q8591L89249
$$ 542971 441094 265786 79071 163797 592602 198376 555518 275833 187242 576491
15004E76491k57190l0363j0412j312R1447A23380K43778K41681K5218B31166K16878
$$ 576491 319301 288938 278526 277214 368661 123380 367158 608839 634057 231166 448044
14993D48044L41803C88751A61160K49673J13303B56110M7073J53413P5489n2917
$$ 448044 789847 388751 161160 410833 524136 256110 303183 456596 532085 479168
14983D79168J04354j41558J88449K45245O3093j90564j45433L243J6180o4277
$$ 479168 583522 441964 630413 875658 938751 748187 602754 605997 622177 557900
14973E57900j33641q8665R1434K11973J62790j56025k36604K19735j97937j79637
$$ 557900 424259 335594 427028 639001 801791 645766 409162 628897 430960 251323
14963B51323P2908J3043N8263H1609K77508N1787J10755B41373n5885L05782N6513
$$ 251323 324231 337274 395537 81609 359117 410904 521659 241373 185488 491270 547783
14952E47783B62998r0550J05062J10525K87633k96668F1125R14435k10136B99260
$$ 547783 262998 172448 277510 388035 675668 379000 61125 975560 765424 299260
14941F24224k66819K77320j79850A30425N01111k5763j53005P5764K61052j54063
$$ 624224 357405 634725 454875 130425 631536 605773 452768 528532 789584 635521
14931F35521M96439j63501N5211J12511K03455K1092p289m9067m46999M49776
$$ 635521 1131960 968459 1023670 1136181 1339636 1360728 1353439 1304372 857373 1307149
14921A307149k27633M86498K81617J39709k33002k2941n50947j71910J69611m58131
$$ 1307149 1079516 1566014 1847631 1987340 1754338 1731397 1180450 1008540 1178151 720020
14911G20020L8352j00677j88309L8152O4828A22536L54061j99235r2320n1428
$$ 720020 758372 657695 469386 507538 572366 122536 476597 277362 185042 133614
14901A33614M1891L38095q4111L7214q7308J22773r0444l7147J85623k17927K48154
$$ 133614 175505 513600 429489 466703 379395 502168 411724 374577 560200 342273 590427
14890E90427j81979R4940L42972j97427p1073M9474K0513j63539J72574A95447
$$ 590427 408448 503388 846360 648933 577860 627334 647847 484308 656882 195447
14879E56809K55155M31797E72904k8258H0820M72857o5744j14376J42872J04967
$$ 556809 811964 1243761 572904 544646 80820 553677 487933 373557 516429 621396
14869F21396J86949k86379K1370Q8079k78956k8358L27813k50556J00442j01910
$$ 621396 808345 521966 543336 631415 352459 324101 651914 401358 501800 399890
14859C99890J08883K17968k04829n5695j61519J67263B32025k0170J18619K01718
$$ 399890 508773 726741 521912 466217 304698 471961 232025 211855 330474 532192
14849E32192j60966R3016M61945l56134K27232r8790K45073J56198K04134k32261
$$ 532192 371226 464242 926187 570053 797285 698495 943568 1099766 1303900 1071639
14839A071639K04199r8868j61154D25253J23969j30913M0633B11379L83515J70880
$$ 1071639 1275838 1176970 1015816 425253 549222 418309 458942 211379 594894 765774
14829G65774k80489K77770C46482R9357J19460R2143j58262O9747k41107N50835
$$ 765774 485285 763055 346482 445839 565299 657442 499180 568927 327820 878655
14819H78655l30353L09223C94837M019k9045L18519L3295n7679A83501M38997
$$ 878655 548302 857525 394837 398856 369811 688330 721625 663946 183501 622498
14809F22498l0395n8720J82510j22876K00418K81060j33648k6133R3638k55934
$$ 622498 592103 533383 715893 593017 793435 1074495 940847 914714 1008352 752418
14799G52418l23061M9877J16905k47070M84730C78775K50811q5754J66716J47609
$$ 752418 429357 479234 596139 349069 833799 378775 629586 543832 710548 858157
14789H58157j20451C24080K10911J24405q8722l4255J38029k883p3654K28387
$$ 858157 737706 324080 534991 659396 570674 536419 674448 671565 597911 826298
14779H26298Q389C98361J86506Q4770j2242N3021K88694m65679K76368L3213J0040
$$ 826298 834687 398361 584867 669637 657395 710416 999110 533431 809799 843012 853052
14768H53052l57339N1032j06733j00816K47157P0917j76913j97501Q4409L37006
$$ 853052 495713 546745 440012 339196 586353 657270 480357 282856 367265 704271
14758G04271k25175K88168l48703K81034N8632Q024K38761m00418k41980K89473
$$ 704271 479096 767264 418561 699595 758227 766251 1005012 604594 362614 652087
14748F52087j74025J85094K12756k81202k05166L35984m5032n372C12678M50650
$$ 652087 478062 663156 875912 594710 389544 725528 680496 675124 312678 763328
14738G63328J14082k07245N7227o2557k1135J53383k39939J00070M06752l02046
$$ 763328 877410 670165 727392 664835 643700 797083 557144 657214 1063966 761920
14728G61920K96942J28886j00452J89457N11627k09010j56083k00119l11304K9017
$$ 761920 1058862 1187748 1087296 1276753 1788380 1579370 1423287 1223168 911864 940881
14718I40881m1753p2302p8792K34585K8101R1595l84405M9354L9407j40647J96228
$$ 940881 899128 826826 748034 982619 1010720 1102315 717910 767264 806671 666024 862252
14707H62252j68699P9072J55294J65539j97727N87316q0305M22449l75047K43231
$$ 862252 693553 772625 927919 1093458 895731 1483047 1402742 1825191 1450144 1693375
14697A693375l74099k76598k7052J62885j10296o8163J1981k09258J60168j97301
$$ 1693375 1319276 1042678 1015626 1178511 1068215 1000052 1012033 802775 962943 765642
14687G65642j65346J40272J70368J2534k60936L14639m0085K74468k21348D07876
$$ 765642 600296 740568 910936 923470 662534 977173 937088 1211556 990208 407876
14676A031728l18195K65092o072k83866K632K82643m8616k5775M49784m16049
$$ 1031728 713533 978625 972553 688687 691319 973962 925346 899571 1349355 933306
14666I33306j12194K8378J81733Q1230l8643j62181J3873L15715j26962m48421
$$ 933306 821112 849490 1031223 1112453 1073810 911629 925502 1241217 1114255 665834
14656F65834L24448K03386k79324k14551L66174m902j29021K37442J27413k35363
$$ 665834 990282 1193668 914344 699793 1065967 1061065 932044 1169486 1296899 1061536
14646A061536J74751j84330r7618J29439P1713j04151N3486P1831k06941J82481
$$ 1061536 1236287 1051957 954339 1083778 1155491 1051340 1104826 1176657 969716 1152197
14636A152197K33157o0704j79728O119J05101J2587K35726m0518k50563R4104
$$ 1152197 1385354 1324650 1144922 1151041 1256142 1268729 1504455 1463937 1213374 1307478
14626A307478M2406j60379j29499K31423P7819k35085J0375L50619k07699J53787
$$ 1307478 1349884 1189505 1060006 1291429 1369248 1134163 1144538 1495157 1287458 1441245
14616A441245j58671K54301m31346r7355M07926k22384K82001R3284j10243n7522
$$ 1441245 1282574 1536875 1105529 1008174 1416100 1193716 1475717 1569001 1458758 1401236
14606A401236J63662k08620J05956J12344R8087m4597J45453n52513K51620L01566
$$ 1401236 1564898 1356278 1462234 1574578 1672665 1628068 1773521 1221008 1472628 1774194
14596A774194j56925J07673J63140M646K30690m10430j82509o1528O52135k93467
$$ 1774194 1617269 1724942 1888082 1892728 2123418 1712988 1530479 1468951 2121086 1827619
14586A827619j91251J89585k15018l3926K44859j15222K77503k3366k32381J45807
$$ 1827619 1636368 1825953 1610935 1577009 1821868 1706646 1984149 1960783 1728402 1874209
14576A874209j97117J04074K55180l33058M84634n79173N48194Q5656l68344N06747
$$ 1874209 1677092 1781166 2036346 1703288 2187922 1608749 2156943 2242599 1874255 2381002
14566B381002n17695N11970l24480L81368p3467k84853L98264L2975J24667j08899
$$ 2381002 1863307 2375277 2050797 2432165 2358698 2073845 2472109 2505084 2629751 2520852
14556B520852M11480K25382J34653K14532N09088L58329J372079J579041M499949
$$ 2520852 2932332 3157714 3292367 3506899 4015987 4374316 5746395 7325436 11825385
14547A1825385Q539204J6233518K367610A7951762H696486l740103r25968r5814
$$ 11825385 20364589 36598107 38965717 17951762 8696486 4956383 4030415 3934601
14539C934601J359933O02161k819022o75059p19721j0398L44723k55940N68251
$$ 3934601 5294534 5896695 3077673 2402614 1682893 1672495 2017218 1761278 2329529
14530B329529l00805L9675N1898J27082k30988J58948n4860o6439M27328m15591
$$ 2329529 2028724 2068399 2120297 2247379 2016391 2175339 2120479 2054040 2481368 2065777
14520B065777L7877L85381J46368j75902J76546j62534J0122j84763M15134k0481
$$ 2065777 2103654 2489035 2635403 2459501 2636047 2473513 2483635 2298872 2714006 2693525
14510B693525N47154l44275l886l47973j26180J78946L96262j25253m15537M17749
$$ 2693525 3240679 2896404 2892518 2544545 2418365 2597311 2993573 2868320 2452783 2870532
14500B870532N0176K25049o3667k7868l73705L29105K38528J64863j55186O78
$$ 2870532 2920708 3145757 3082090 3054222 2680517 3009622 3248150 3413013 3257827 3258505
14490C258505m9326l6023M24599k77845K10034J0278K90741m50606K97646J04297
$$ 3258505 3209179 3173156 3597755 3319910 3529944 3540222 3830963 3380357 3678003 3782300
14480C782300l03026J43913j66780N50094j41942k72144K35398J06297R0336K3543
$$ 3782300 3479274 3623187 3456407 4006501 3864559 3592415 3827813 3934110 4024446 4047989
14470D047989k52875Q3513j83651O96429j62013k32703K07441M02817j4822k56659
$$ 4047989 3795114 3878627 3694976 4391405 4229392 3996689 4204130 4606947 4592125 4335466
14460D335466J83174M4652J66707j25474L87684l69903L26385j21062M23113j96434
$$ 4335466 4518640 4563292 4729999 4604525 4992209 4622306 4948691 4827629 5250742 5054308
14450E054308q4080K36843j7393j58124K2024N77439m71473N71627n8535P7468
$$ 5054308 4970228 5207071 5189678 5031554 5053578 5631017 5159544 5731171 5672636 5750104
14440E750104o9269k2329J22733K93208l41424O27977m3906K35502j96778J88110
$$ 5750104 5680835 5658506 5781239 6074447 5733023 6361000 6317094 6552596 6355818 6543928
14430F543928J74853l94964N31142J9739q2833K00717K49484j10264L54399J28628
$$ 6543928 6718781 6323817 6854959 6874698 6791865 6992582 7242066 7131802 7486201 7614829
14420G614829J38925q544J26870j48267L15757K24544k49338M27415l0522R5687
$$ 7614829 7753754 7745210 7872080 7723813 8039570 8264114 8014776 8442191 8411669 8507356
14410H507356p7965M27888J52667L70299j00016K15307K45399l20250K49503L55895
$$ 8507356 8429391 8857279 9009946 9380245 9280229 9495536 9740935 9420685 9670188 10026083
14400A0026083K0616P4434M5876j44768O23679L51789l6655J0759M99756P7228
$$ 10026083 10046699 10121133 10167009 10022241 10645920 10997709 10961054 10971813 11471569 11548797
14390A1548797L05008o0386L29182k31755O84656k915N45937L71013J15790L65341
$$ 11548797 11853805 11793419 12122601 11890846 12575502 12572587 13118524 13489537 13605327 13970668
14380A3970668l86696N68875m9827P17988r406J94662M73311j58262J100916P7548
$$ 13970668 13583972 14152847 14103020 14821008 14811602 15006264 15479575 15321313 16422229 16499777
14370A6499777K61923L33831K79003J06519N88030Q49165o3657M02712M959M13390
$$ 16499777 16761700 17095531 17374534 17481053 18069083 18918248 18854591 19257303 19262262 19675652
14360A9675652O92087O88136K70787M59997M08990N69398N57511N88225N49055
$$ 19675652 20367739 21055875 21326662 21786659 22195649 22765047 23322558 23910783 24459838
14351B4459838O23420N35399O89874O11085O22843P69437N81650O00074P78025
$$ 24459838 25083258 25618657 26308531 26919616 27542459 28311896 28893546 29493620 30271645
14342C0271645J015051R88874P56047J349339O55273J087539J184158Q54877J188722
$$ 30271645 31286696 32275570 33031617 34380956 35036229 36123768 37307926 38162803 39351525
14333C9351525J004725J307490J466800J138107J602085J430966J370749J613357
$$ 39351525 40356250 41663740 43130540 44268647 45870732 47301698 48672447 50285804
14325E0285804J796737J643029J951174J966190J727805J836112K152285K709153
$$ 50285804 52082541 53725570 55676744 57642934 59370739 61206851 63359136 66068289
14317F6068289K272889K741528K526229L108085K777429L175896L130519L663267
$$ 66068289 68341178 71082706 73608935 76717020 79494449 82670345 85800864 89464131
14309H9464131L756594M017323M209297M555165M908540M923139N038107N886109
$$ 89464131 93220725 97238048 101447345 106002510 110911050 115834189 120872296 126758405
14301A26758405O098692O145619O410240P530021P368671Q133693Q142380Q988352
$$ 126758405 132857097 139002716 145412956 152942977 160311648 168445341 176587721 185576073
14293A85576073R907839R751917J0543117J0790613J1221604J1943069J2697809
$$ 185576073 195483912 205235829 215778946 226569559 237791163 249734232 262432041
14286B62432041J2965627J3839886J3755025J4421811J4508619J4548620J4444227
$$ 262432041 275397668 289237554 302992579 317414390 331923009 346471629 360915856
14279C60915856J4359818J3998125J3017894J2268782J0757186R144816N919600
$$ 360915856 375275674 389273799 402291693 414560475 425317661 434462477 440382077
14272D40382077K109281J236234J198671J2950l797971n113655m822321n957124
$$ 440382077 442491358 443727592 444926263 444939213 441141242 436027587 431205266 425248142
14264D25248142r179650j1071856j2386986j3365603j4140703j4708204j5130580
$$ 425248142 416068492 404996636 392609650 379244047 365103344 350395140 335264560
14257C35264560j5186144j4694311j4712729j4406922j3682194j2837428j3066295
$$ 335264560 320078416 305384105 290671376 276264454 262582260 249744832 236678537
14250B36678537j1810185r594412j0280697j0375928r777090q796582q361276
$$ 236678537 224868352 215273940 204993243 194617315 184840225 176043643 167682367
14243A67682367q114073p487682p143904o655141o342029n528633n480332n510138
$$ 167682367 159568294 152080612 144936708 138281567 131939538 126410905 120930573 115420435
14235A15420435m631933n071099m597423l782484l753872l507004l865903l255304
$$ 115420435 110788502 105717403 101119980 97337496 93583624 90076620 86210717 82955413
14227H2955413l233080l126600k693268k637686l047393k069251k485249j590375
$$ 82955413 79722333 76595733 73902465 71264779 68217386 66148135 63662886 62072511
14219F2072511k326853k274284j740004k039581j549209j551175j230760j538403
$$ 62072511 59745658 57471374 55731370 53691789 52142580 50591405 49360645 47822242
14211D7822242j845761j324908j388994o65061r01995j387604j235355j364352
$$ 47822242 45976481 44651573 43262579 42597518 41695523 40307919 39072564 37708212
14203C7708212j085309r22441o58055p53307r81158j233249r69449p43846m69101
$$ 37708212 36622903 35700462 35042407 34289100 33307942 32074693 31105244 30361398 29892297
14194B9892297q38984o14659q70050n47926m50288p20034o92289p78418m86214
$$ 29892297 29053313 28438654 27568604 27020678 26570390 25850356 25158067 24379649 23893435
14185B3893435l45196m68360p56220j09444r47455j78454m75257j42409q84971
$$ 23893435 23548239 23079879 22323659 22214215 21266760 21088306 20613049 20470640 19585669
14176A9585669l65571k19896k14856m59311n45970r5867l5918q70320k75506L5273
$$ 19585669 19220098 19000202 18785346 18326035 17780065 17684198 17648280 16777960 16502454 16537727
14166A6537727q37467J449j41141m54122k13952j71963m05592o78451k09261L78509
$$ 16537727 15700260 15701709 15560568 15106446 14892494 14720531 14314939 13636488 13427227 13805736
14156A3805736m12859k97218q8646l87652K2250o45263L01843k89650j44883o13347
$$ 13805736 13392877 13095659 13007013 12619361 12641611 11996348 12298191 12008541 11863658 11250311
14146A1250311j46621l90242J45961j8139o25342l89060O05555j09818m47909
$$ 11250311 11103690 10713448 10859409 10841270 10215928 9826868 10432423 10322605 9874696
14137I874696O4153m41503K92409o54446J09865k56453j1690j28861l44052l84989
$$ 9874696 9938849 9497346 9789755 9135309 9245174 8988721 8977031 8848170 8504118 8119129
14127H119129K11289k0506l25671j6345j00764l11617N52781l22715j28481j56042
$$ 8119129 8330418 8309912 7984241 7967896 7867132 7555515 8108296 7785581 7657100 7501058
14117G501058j40503J60267l67336o9462P6477l25489j18263K93735k17398k40323
$$ 7501058 7360555 7520822 7153486 7084024 7160501 6835012 6716749 7010484 6793086 6552763
14107F552763k03524M3583j25669J71012j03777k72374j79172M28271p31163K41599
$$ 6552763 6349239 6392822 6267153 6438165 6334388 6062014 5882842 6311113 5579950 5821549
14097E821549k81146k45485N46739k57768k85201L69145l99285Q2736k33093m8538
$$ 5821549 5540403 5294918 5841657 5583889 5298688 5667833 5268548 5351284 5118191 5069653
14087E069653J96525k06109j38177O8830j42368r7442j23310L79446j02837l33370
$$ 5069653 5266178 5060069 4921892 4990722 4848354 4750912 4627602 5007048 4904211 4570841
14077D570841L4939j03391J4241k73733j10719K75331j39133J58903q6719k95228
$$ 4570841 4605780 4502389 4516630 4242897 4132178 4407509 4268376 4427279 4340560 4045332
14067D045332J74109j44390k56091L42980j89155j3071j34709Q7998K23907k54463
$$ 4045332 4219441 4075051 3818960 4161940 3972785 3959714 3825005 3913003 4136910 3882447
14057C882447k9612r7385m3219J46188k07449J35024j58501l8971k24283K67781
$$ 3882447 3852835 3755450 3712231 3858419 3650970 3785994 3627493 3588522 3364239 3632020
14047C632020l51263N8161l7256R8267j73656L6828K84896m26653k25087J98019
$$ 3632020 3280757 3338918 3301662 3399929 3226273 3263101 3547997 3121344 2896257 3094276
14037C094276l71990L25929L8463j94498N62133l75856K21079q14576R42517o21155
$$ 3094276 2722286 3048215 3086678 2892180 3454313 3078457 3299536 2484960 3427477 2806322
14027B806322K23700l14135q2836N6573J5446j83594q6409K70399k93500J2840
$$ 2806322 3030022 2715887 2633051 2689624 2705070 2521476 2435067 2705466 2411966 2424806
14017B424806L53509k59927l41714M57075n34671N55876m14583J88484k53455
$$ 2424806 2778315 2518388 2176674 2633749 2099078 2654954 2240371 2428855 2175400
14008B175400J98779m6581K18875j28512p1387j79235O5552l46536L37128J95610
$$ 2175400 2374179 2327598 2546473 2417961 2346574 2167339 2232891 1886355 2223483 2419093
13998B419093P8601j93912l28186r4987J20264l90K31994K99070m5322P91412
$$ 2419093 2497694 2303782 1975596 1880609 2000873 2000483 2232477 2531547 2486225 3277637
13988C277637K945194O006740J4549050J6985285j7115589j1786069n887938k326174
$$ 3277637 6222831 12229571 26778621 43763906 26648317 14862248 8974310 6648136
13980F648136j461741q36271o03911l69429l91082L52084n10756j93426k8854
$$ 6648136 5186395 4350124 3746213 3376784 2985702 3337786 2827030 2633604 2604750
13971B604750j89030J61953j14907N4933m4200l74899K75850P9729L6321o22436
$$ 2604750 2415720 2577673 2462766 2517699 2473499 2098600 2374450 2454179 2490500 1868064
13961A868064L44618l1503j67206K29424k57761m6025p8727n6730K5972N0853
$$ 1868064 2212682 2181179 2013973 2243397 1985636 1939611 1860884 1804154 1830126 1880979
13951A880979L7804k21697O4860O0878l5476j42137J0213K38950k89931J61892
$$ 1880979 1918783 1697086 1761946 1822824 1787348 1645211 1655424 1894374 1604443 1766335
13941A766335J62761j39854q8729l2881M5833j87491K71650k50517J40113P6102
$$ 1766335 1929096 1789242 1700513 1667632 1713465 1525974 1797624 1547107 1687220 1763322
13931A763322J48369k53741m69872P3016L43262j32785J18591l55013M66003k69739
$$ 1763322 1911691 1657950 1188078 1261094 1604356 1471571 1590162 1235149 1701152 1431413
13921A431413Q5460K95306r0281q3391j33508q981k15525J61361j14140n0315
$$ 1431413 1516873 1812179 1721898 1638507 1504999 1496018 1280493 1441854 1327714 1277399
13911A277399K15812L5546K8494j31653n2018K16942m35700J34609K3555m7905
$$ 1277399 1493211 1528757 1557251 1425598 1373580 1590522 1154822 1289431 1312986 1265081
13901A265081K07313k51056m0689Q0308N7846K47067k77711q6020J90013j51365
$$ 1265081 1472394 1221338 1180649 1260957 1318803 1565870 1288159 1202139 1392152 1240787
13891A240787m1886J28108j74631j97898k2005J98684J48174j32302L47584Q7407
$$ 1240787 1198901 1327009 1152378 954480 932475 1131159 1279333 1147031 1494615 1582022
13881A582022m29417k43647J87357K6117N7816J16531p5268j82683L24978j52000
$$ 1582022 1152605 908958 1096315 1122432 1180248 1296779 1221511 1038828 1363806 1211806
13871A211806j73280n4013N8390K93304j98432L0821j57604K09332j2438j74028
$$ 1211806 1038526 984513 1042903 1336207 1137775 1168596 1010992 1220324 1207886 1033858
13861A033858M9843n8613J45467J41768m00797J16237K36329j33442p8568k1780
$$ 1033858 1083701 1025088 1170555 1312323 911526 1027763 1264092 1130650 1052082 1030302
13851A030302R2657Q6270k65514k1042K47297j75697o0205L8771P4082o4825J35760
$$ 1030302 1122959 1209229 943715 922673 1169970 994273 934068 972839 1046921 982096 1117856
13840A117856J80631k65061j11600l39906N8939K43181K86119m90524M71730j69498
$$ 1117856 1298487 1033426 921826 581920 640859 884040 1170159 679635 1151365 981867
13830I81867l88085P0863J64705K67369p5212K01100l42282j23926q8654K43010
$$ 981867 593782 664645 829350 1096719 1021507 1222607 880325 756399 667745 910755
13820I10755l8832L97079j90531l40375K08841j79645n1985K0308J42477R8447
$$ 910755 871923 1269002 1078471 738096 946937 767292 715307 735615 878092 976539
13810I76539j24027j91401J05038K2953p3202J10176L11415l40844o3878r5973
$$ 976539 852512 661111 766149 789102 715900 826076 1137491 796647 732769 636796
13800F36796M75311k78416J23390n6389l05153K97879k76000J7513J14079J623
$$ 636796 1112107 833691 957081 900692 595539 893418 617418 634931 749010 750633
13790G50633j22293K78760k54859K74607l27979L72584k50290k69937K06810j6782
$$ 750633 628340 907100 652241 926848 598869 971453 721163 451226 658036 641254
13780F41254J5802K31539l51761O6074k55384L16273J07589q9705J00577l54687
$$ 641254 657056 888595 536834 602908 347524 663797 771386 681681 782258 427571
13770D27571k7875l2303K98555K3939J24636j50054P301K17935j77331j04440
$$ 427571 399696 367393 665948 689887 814523 664469 671770 889705 712374 607934
13760F07934K22883k60212J3063j09521J89088p3051K50498j91893l5652k06218
$$ 607934 830817 570605 583668 474147 663235 590184 840682 648789 613137 406919
13750D06919K69503M32680m23290r6491J88009l36121k8717P02430D16748K43230
$$ 406919 676422 1109102 685812 589321 777330 441209 412492 1114922 416748 659978
13740F59978k6960Q3068J14251j01933P6750j20147j12026J93340j97118j96199
$$ 659978 633018 716086 830337 728404 805154 685007 572981 766321 569203 373004
13730C73004K68293j31410m5086N1990k33702L62465J32220k64385j84484J73171
$$ 373004 641297 509887 464801 516791 283089 645554 777774 513389 328905 502076
13720E02076B01207K17401j21627J77482J64700j37455j10666O8284o3682K53096
$$ 502076 201207 418608 296981 474463 639163 501708 391042 459326 395644 648740
13710F48740o1203n284B17836K20087L49984l19324K21905B89642P8910j6323
$$ 648740 587537 582253 217836 437923 787907 468583 690488 289642 368552 352229
13700C52229Q5804M50778C24132m9529l2669J01105O5282R7099O1870o8971J31548
$$ 352229 438033 888811 324132 274603 241934 343039 408321 505420 567290 498319 629867
13689F29867j34110j20721M2109O1447P0525j81329Q4271P325K08820k91321J93503
$$ 629867 495757 375036 417145 478592 549117 367788 452059 459384 668204 376883 570386
13678E70386q7925A82494L11023j28016K29766B27536M2722K4163J31276J84954
$$ 570386 482461 182494 493517 365501 595267 227536 270258 294421 425697 610651
13668F10651k76950J64360k0976j24757J36239j48144m7774J60992K12672l31813
$$ 610651 333701 498061 477085 352328 488567 340423 292649 453641 666313 334500
13658C34500j08822L12872o665n3632j48316J70841j37117n4954P2123J23065
$$ 334500 225678 538550 531885 478253 329937 500778 363661 308707 380830 503895
13648E03895K25770k88599l8924o9299L04041k39588A85613L01349P1582A81407
$$ 503895 729665 441066 402142 332843 636884 397296 185613 486962 558544 181407
13637A56160P5092K19036n7423A75771L93996j81970J40147J74307k5337n722
$$ 156160 231252 450288 392865 175771 569767 387797 527944 702251 676914 671192
13627F71192j50637B30117J64347J66157J46518k99434L36976l66463m8496j49902
$$ 671192 520555 230117 394464 560621 707139 407705 744681 378218 329722 179820
13617A79820L60907B25223L5659K37749J39933j21037j78493J05192l671A95328
$$ 179820 540727 225223 260882 498631 638564 517527 339034 444226 440555 195328
13606A77128L19927A06006J39419K21019k18781N9103J14764J67808j68001m0832
$$ 177128 497055 106006 245425 466444 247663 306766 421530 589338 421337 380505
13596C80505m5635j52463K77537k26047M4136O87132C74619j36768n8459K46946
$$ 380505 334870 182407 459944 233897 278033 965165 374619 237851 179392 426338
13586D26338k273K09248B65126p7513J09009R3870I5803L64601A42169K69382
$$ 426338 424065 633313 265126 187613 296622 390492 95803 460404 142169 411551
13576D11551j62217L7381n7991K02932j97593J14493m4488K634Q0722K8255A87665
$$ 411551 249334 286715 228724 431656 234063 348556 304068 306702 387424 415679 187665
13564E2451K23607J68670j90234J35583j28391K95957A4411L69980O6511K1297
$$ 52451 276058 444728 254494 390077 261686 557643 14411 384391 450902 472199
13554D72199b2058F58648k29580F1655L31688A20408K36524J50710B53021J89294
$$ 472199 -22058 658648 429068 61655 393343 120408 356932 507642 253021 442315
13544D42315F1411L13311D3763L39935a78408E35948j25525g2631H3171K13666
$$ 442315 61411 374722 43763 383698 -178408 535948 410423 -72631 83171 296837
13534B96837o7455r8196L32055a47190A855J55041L59822A84421R7766J7129L04626
$$ 296837 229382 131186 463241 -147190 1855 156896 516718 184421 282187 299316 603942
13523F03942A99279I9603J38991N5825A31529L59337A04675L14624a59043A63049
$$ 603942 199279 99603 238594 294419 131529 490866 104675 419299 -159043 163049
13512C04025J45286j36209A45445e7710C68740j58549L4708K20335q7389j72807
$$ 304025 449311 313102 145445 -57710 368740 210191 244899 465234 377845 205038
13502B05038J30084l8059A26764K98919I3941K09297j0441o7131m0966J59643
$$ 205038 335122 297063 126764 425683 93941 303238 292797 225666 184700 344343
13492C44343a10788C5830J67429m6923O5311M8941j13535l897K10994h007A21843
$$ 344343 -110788 35830 203259 156336 221647 270588 157053 153156 364150 -8007 121843
13480F4608K43004p7061Q3694j33400p94K4626E4443J57824J58891k5391R7660
$$ 64608 307612 230551 314245 180845 180051 204677 54443 212267 371158 345767 443427
13469D43427j53890n4433m3264R1226l1772j0764K45945e6702A42831O4504J27720
$$ 443427 289537 235104 191840 283066 251294 240530 486475 -56702 142831 207335 335055
13458C35055K17604B37638k9018L3016q5829O8595J0133J6222M844H4527J54027
$$ 335055 552659 237638 208620 241636 155807 224402 234535 250757 255601 84527 238554
13447B38554e380A39691N16636B45374F0408K09766P0583m1777A23133D0144K25894
$$ 238554 -5380 139691 656327 245374 60408 270174 340757 298980 123133 40144 266038
13436B66038B2227L55596A87934q7625J10187r7747a03795H7561J68178D3009
$$ 266038 22227 377823 187934 100309 210496 112749 -103795 87561 255739 43009
13425G67660A12282J2378d7637r6493D11238A69872c4987F0764a07611B18927
$$ 767660 112282 124660 -47637 -144130 411238 169872 -34987 60764 -107611 218927
13414B31076r9552L93402A8941L43488A26283O0184r1907J41516P321D6143L94178
$$ 231076 131524 524926 18941 362429 126283 186467 94560 236076 243397 46143 440321
13403D40321A50452J68734d6549B8139J47794k7409R2397d9042B7873B052K84076
$$ 440321 150452 319186 -46549 28139 175933 148524 240921 -49042 27873 2052 286128
13392B86128q0048J84865p4334k0323j3717J5663o1637A16118K3279R254Q3a54013
$$ 286128 206080 390945 316611 296288 282571 298234 236597 116118 139397 148651 148734 -154013
13379B26835E0830L22442O9637j44046r3485a05610A11034D7171K47148E1735
$$ 226835 50830 373272 442909 298863 205378 -105610 111034 47171 294319 51735
13368B45919b5822C89999A29954a13066D59056A74116J72866L3902J56777A92509
$$ 245919 -25822 389999 129954 -113066 459056 174116 346982 380884 537661 192509
13357H0596Q6869p2924j3635c5935D49380j56400b8709A38564j5130l1103a10106
$$ 80596 167465 94541 80906 -35935 449380 292980 -28709 138564 123434 92331 -110106
13345C72254F4842J8272J24597L71006j27885K7138B10056f5990E33485B24275
$$ 372254 64842 83114 207711 578717 450832 477970 210056 -65990 533485 224275
13334a82285B65712J45940k03288J81253A16047B6500J87299G5425K74215A02134
$$ -182285 265712 411652 208364 389617 116047 26500 213799 75425 349640 102134
13323C74450a43007A78993J30277A33023f450A07704J43905p3221J85021I3901
$$ 374450 -143007 178993 309270 133023 -6450 107704 251609 178388 363409 93901
13312F40199l19521J6586H9325l7000K91123P6029r3411M1936q3486E2687J88008
$$ 640199 320678 337264 89325 52325 343448 419477 326066 368002 284516 52687 240695
13301B40695b51933A21771i9576E7805O2016l7101J82319J10364A00624K47004
$$ 240695 -251933 121771 -99576 57805 119821 82720 265039 375403 100624 347628
13291C47628l0383j48165L5225l131J56079b0941j28733k267B23974I720O6163
$$ 347628 317245 169080 204305 201174 357253 -20941 -149674 -151941 223974 9720 75883
13280G5883a59322C4702A3798L38133A18261J27357m255a53372B3216a59017H5610
$$ 75883 -159322 34702 13798 351931 118261 245618 241363 -153372 23216 -159017 85610
13268E0461J36226b225l3974k31883C37408A26723n2238c78024B800a04182d1197
$$ 50461 186687 -2225 -36199 -268082 337408 126723 74485 -378024 2800 -104182 -41197
13256b12774b2784D4077K83224K8960a04768B40826F9339J11741m0735K8994G1673
$$ -212774 -22784 44077 327301 356261 -104768 240826 69339 181080 140345 169339 71673
13244A94235n4485a1902D3786J16693a12430c4479C8791K48094l1299R2214G9096
$$ 194235 139750 -11902 43786 160479 -112430 -34479 38791 286885 255586 347800 79096
13232b3711l9371b3116E20401a48235B48547J30836d1206C4164K08190H5142N3429
$$ -23711 -63082 -23116 520401 -148235 248547 379383 -41206 34164 242354 85142 138571
13221A38571b21108B7145J52931J19954a56071A07059j2837a63124E3808j078
$$ 138571 -221108 27145 180076 300030 -156071 107059 94222 -163124 53808 52730
13211E2730J00214N7547f8378D6327J5642R7763l7739k4641j51f3748b4927p514
$$ 52730 152944 210491 -68378 46327 61969 159732 121993 97352 97201 -63748 -24927 -32441
13199c2441A95742d2907n4335B67359b5653A09647K5353l2164D2989J41927G45
$$ -32441 195742 -42907 -97242 267359 -25653 109647 135000 102836 42989 184916 745
13187I8058a3549C05861A22211K9615n9363M8331P7602r2928L9544K53535a46913
$$ 98058 -13549 305861 122211 151826 92463 140794 218396 125468 165012 418547 -146913
13175D42668e4325A62367b4876H0955h7031k9552D21O19963a56020B68805j18074
$$ 442668 -54325 162367 -24876 80955 -87031 -116583 421 620384 -156020 268805 150731
13164A50731l308c1784F8245Q8762D0190A6784b504B03390h7234A84986K43G9484
$$ 150731 147423 -31784 68245 157007 40190 16784 -2504 203390 -87234 184986 185229 79484
13151A60428a38818B50544A14528j9224b4074k28652E6783K08956f401o0546p2724
$$ 160428 -138818 250544 114528 95304 -24074 -252726 56783 265739 -6401 -66947 -139671
13140a39671A91435G1662L729B5849J1943e726A0016c8065A47518L5850a85986
$$ -139671 191435 71662 75391 25849 37792 -5726 10016 -38065 147518 183368 -185986
13128b27582J5861d5668A83923J1645E9711Q4601O141b10985C97788c1449o9312
$$ -227582 -211721 -45668 183923 195568 59711 144312 150453 -210985 397788 -31449 -100761
13117a00761B11287b51288e2630p3896b8984B31986c37523G5302O4507j7897c8144
$$ -100761 211287 -251288 -52630 -126526 -28984 231986 -337523 75302 139809 121912 -38144
13105f5424A29112B728J02629m5291K12425p089f3937A84696q4132m2317e1699
$$ -65424 129112 2728 105357 60066 272491 265402 -63937 184696 100564 58247 -51699
13093C63625c08101A89109j081k2710g4326A04247a99609M7414A8251K91136b93284
$$ 363625 -308101 189109 188028 165318 -74326 104247 -199609 -152195 18251 309387 -293284
13081A78821p2264g8960A62991B1315M57505b47179D16325a66496d0718a3110
$$ 178821 106557 -78960 162991 21315 478820 -247179 416325 -166496 -40718 -13110
13070a39081A31722n0750f8842A93131l2213j1597Q9704a19498A11186d8606A09643
$$ -139081 131722 80972 -68842 193131 160918 149321 239025 -119498 111186 -48606 109643
13058G6150M2561a90239C18762a64136A18072E8714J49440b6077A22658R424a22167
$$ 76150 118711 -190239 318762 -164136 118072 58714 208154 -26077 122658 132082 -122167
13046A09159i0044a3917p9027M3841A36956J05174A3216K39590E1406a48882j80608
$$ 109159 -90044 -13917 -92944 -49103 136956 242130 13216 252806 51406 -148882 -329490
13035c29490a6338A31726n2908J29883o7604A5063R103J24047N7638D2225j1205
$$ -329490 -16338 131726 78818 208701 141097 15063 24166 148213 205851 42225 31020
13024C1020K2657J37856o6222C0729J07824h5842K0811B05284d1302A99449r9023
$$ 31020 53677 191533 125311 30729 138553 -85842 -65031 205284 -41302 199449 100426
13013A00426m8605J63793L2181G8995J19528A0593c9605j82665A22654J91874
$$ 100426 51821 215614 247795 78995 198523 10593 -39605 -222270 122654 314528
13003C14528h5196A67286M5671f4962j50395A69984m4322B4896M570e3845A405
$$ 314528 -85196 167286 212957 -64962 -215357 169984 125662 24896 29466 -53845 1405
12991I2541J83370b650n3497B9873b29451A38607K94668a49635f8036c3876b028
$$ 92541 275911 -2650 -56147 29873 -229451 138607 433275 -149635 -68036 -33876 -2028
12979D2333f8199g760j78338P8295H187J27772a86870D0393a4776A16137a48127
$$ 42333 -68199 -7760 -186098 -107803 8187 135959 -186870 40393 -14776 116137 -148127
12967A31168K07599j23797a42563H8926J82N0475g2124F6764N0994J53431H172
$$ 131168 338767 214970 -142563 88926 89108 139583 -72124 66764 117758 271189 8172
12955a1451o1188j52195g1521C13929g2213B5574m078J39358J86428j42066C5524
$$ -11451 -72639 -224834 -71521 313929 -72213 25574 21496 160854 347282 205216 35524
12943a67085B4794d4990A73482p7405l8174J06893q594A2459c43506F0097a27831
$$ -167085 24794 -44990 173482 96077 57903 164796 156202 12459 -343506 60097 -127831
12931a9321q7392q2169b2275C60112H5422J46516B9177J0063K59297b49127I3753
$$ -19321 -106713 -188882 -22275 360112 85422 231938 29177 39240 298537 -249127 93753
12919A03749n136C3117a7190q6043F6574j6023M0141l6198c2429k18328G2309
$$ 103749 98613 33117 -17190 -103233 66574 50551 90692 54494 -32429 -250757 72309
12907a83130D4307f7603K3131a6704a272E1122B3163g2507l7284B2079a41227
$$ -183130 44307 -67603 -44472 -16704 -1272 51122 23163 -72507 -109791 22079 -141227
12895A23763l5913K9211D8597O1096b60597D09349b42076a441j84059E3523K75479
$$ 123763 87850 117061 48597 109693 -260597 409349 -242076 -1441 -185500 53523 329002
12884C29002A60721K41625E2801J21923f2627G657a7073B15797q9410g3279G4342
$$ 329002 160721 402346 52801 174724 -62627 7657 -17073 215797 126387 -73279 74342
12872h4689L9710F4957R636O0496C6298a20403E2635a238D6778J12196a33916
$$ -84689 -44979 64957 74593 135089 36298 -120403 52635 -1238 46778 158974 -133916
12860b6394J0964C48603c6955D49942A39984B3890p040K00623d335j15719e2722
$$ -26394 -15430 348603 -36955 449942 139984 23890 16850 217473 -4335 -120054 -52722
12848A27246c1412j09382d1020B26681K5521D3934d4135j74331A83729b23464
$$ 127246 -31412 -140794 -41020 226681 252202 43934 -44135 -218466 183729 -223464
12837A37406a53334a0302j28308E0549c7246A316K6444d1389j03991q5378i001
$$ 137406 -153334 -10302 -138610 50549 -37246 1316 27760 -41389 -145380 -230758 -9001
12825a04129I2585r017N9052n5766J21406h2443n1008A22262b97145d6901A20367
$$ -104129 92585 83568 142620 86854 208260 -82443 -133451 122262 -297145 -46901 120367
12813A69725E1192J16202f6874j194K1349E32383A04756N8245p9637d9924k2483
$$ 169725 51192 167394 -66874 -68068 -46719 532383 104756 163001 83364 -49924 -72407
12802g2407j0521k77399F1058a08434D58945A41000a27635N9044l7946A9123J87911
$$ -72407 -82928 -360327 61058 -108434 458945 141000 -127635 -68591 -106537 19123 207034
12791B07034d4689j75439N1870A28175l5241k625J28429g3924L21J0472j05644
$$ 207034 -44689 -220128 -168258 128175 92934 90309 218738 -73924 -73603 -63131 -168775
12780a68775k4443C04059d30666A03523a58516r2681A24258c32455a49065k54910
$$ -168775 -193218 304059 -430666 103523 -158516 -251197 124258 -332455 -149065 -403975
12770d03975A20943a29320A7592J40602a43873n2364B37246a24239L7891A72938
$$ -403975 120943 -129320 17592 158194 -143873 -196237 237246 -124239 -86348 172938
12759a11233H342c323C88811f0245r8751P6997A17740b29057k06220B03530a88807
$$ -111233 8342 -3323 388811 -60245 -158996 -81999 117740 -229057 -435277 203530 -188807
12747A18975K6289a85266l4279A72206K5709B9241b9010o21j49894F5493L42082
$$ 118975 145264 -185266 -219545 172206 197915 29241 -29010 -29631 -179525 65493 407575
12736D07575a00523I3688a137j52641p1006A12342g661j5445A64436e1947E6019
$$ 407575 -100523 93688 -1137 -153778 -224784 112342 -7661 -23106 164436 -51947 56019
12724c27647e5198C77946a00031J5043P211j01370E3491g31k528A57361G8524
$$ -327647 -55198 377946 -100031 -84988 -77777 -179147 53491 -731 -3259 157361 78524
12712F6084A9315J90561B8243K93109D3838J2074A0244K38638H8686a00075H4779
$$ 66084 19315 209876 28243 321352 43838 55912 10244 248882 88686 -100075 84779
12700F8839b0105B63164g428F267K46851n9709O8583H1587b16491B52176O6811
$$ 68839 -20105 263164 -7428 6267 253118 193409 261992 81587 -216491 252176 318987
12689C18987f0791k3657D62027F9647N4949a55295K3516A56644e8369B04793m3681
$$ 318987 -60791 -84448 462027 69647 124596 -155295 -131779 156644 -58369 204793 161112
12678A61112b14799A11015g2028l0816K4227r9495B06109r4362J65882j10851
$$ 161112 -214799 111015 -72028 -102844 -78617 -178112 206109 111747 277629 166778
12668A66778a16175A59719a66269e4972A16852M3283F8416g0003l94864F3857
$$ 166778 -116175 159719 -166269 -54972 116852 160135 68416 -70003 -464867 63857
12657H1601J90233E3198M6367d0356f928G4159a33729E69769A7381K6645a68255
$$ 81601 271834 53198 99565 -40356 -6928 74159 -133729 569769 17381 44026 -168255
12645B16073b0767C01248c67492B18522I3126m3532J1510i4597k0969C03090b04320
$$ 216073 -20767 301248 -367492 218522 93126 49594 61104 -94597 -115566 303090 -204320
12633B18395n1577J6667J17402b4658A15198k3470a77101A2683J87402d7947j7835
$$ 218395 166818 183485 300887 -24658 115198 91728 -177101 12683 200085 -47947 -65782
12622f5782B959J69329D2960K1999J48384e0546m0442J223A3207J70434K44143
$$ -65782 2959 172288 42960 64959 213343 -50546 -90988 -89765 13207 183641 427784
12611D27784o6042A14498c61308A55345a70444A06151a01268j78818A05571i0146
$$ 427784 361742 114498 -361308 155345 -170444 106151 -101268 -280086 105571 -90146
12600A08973E857L55473C21c803l20466N8634A48675a46714A29227N802c25066
$$ 108973 5857 361330 321 -3803 -324269 -265635 148675 -146714 129227 135029 -325066
12588A0167b09628J04415j28503C3019f7192B99641a85458j2041A21320b24468
$$ 10167 -209628 -105213 -233716 33019 -67192 299641 -185458 -197499 121320 -224468
12577A81939a41394A10716N16588G5735A8122K75034a54319O1265A94078C4226
$$ 181939 -141394 110716 627304 75735 18122 293156 -154319 -93054 194078 34226
12566f0760B00844K47471j66159a6210l9080B65003j29866d8776j25388A43304
$$ -60760 200844 448315 282156 -16210 -55290 265003 135137 -48776 -174164 143304
12555b56867E1751a52680j94056A01114J28106p7044c7722k924a5863k73732B1808
$$ -256867 51751 -152680 -346736 101114 229220 152176 -37722 -40646 -15863 -289595 21808
12543a20891C590a91623j37117d1639O302C29625A59527a57219G8211a90394d6196
$$ -120891 3590 -191623 -328740 -41639 -35337 329625 159527 -157219 78211 -190394 -46196
12531b9960I5512B2524K70514A32419N3596H0366c4037A75624N3610j0768i5881
$$ -29960 95512 22524 293038 132419 186015 80366 -34037 175624 229234 218466 -95881
12519D5040i7282D4035k0440a46203c3691C5182J25155A150a67002A71819a16112
$$ 45040 -97282 44035 23595 -146203 -33691 35182 160337 1150 -167002 171819 -116112
12507D1917d9623J7813k356j84449L5801M5587J9744A72551j9903J13898A04763
$$ 41917 -49623 -31810 -34166 -218615 -182814 -137227 -117483 172551 152648 266546 104763
12495H821K2406a7347A14540K15500j6631j7967B8493M3970J01854d8984C2669
$$ 8821 31227 -17347 114540 330040 313409 295442 28493 72463 174317 -48984 32669
12483a8050k23515h4114A82972a11066B29368G140b64580c3484A7781q387P5473
$$ -18050 -241565 -84114 182972 -111066 229368 7140 -264580 -33484 17781 9394 84867
12472H4867a07456D7501D634K15522K3824c1354C89395e3828G1779a8089r1023
$$ 84867 -107456 47501 4634 220156 243980 -31354 389395 -53828 71779 -18089 -109112
12461a09112A46688L5537a33916m15321B6604g3913L4536A35529a00890b1828
$$ -109112 146688 182225 -133916 -549237 26604 -73913 -39377 135529 -100890 -21828
12450i2877G4690b19031h2665B00058J85040J9844A07312C5516c9502J3983j49622
$$ -92877 74690 -219031 -82665 200058 385098 404942 107312 35516 -39502 -25519 -175141
12439a75141l9659B85206b77452Q4712I8940a72731A15014m1121P6557a9052k6346
$$ -175141 -214800 285206 -277452 -192740 98940 -172731 115014 73893 150450 -19052 -45398
12428d5398B61731E7401a49349f5209A79919a89911A7321M0517A4715Ia29610
$$ -45398 261731 57401 -149349 -65209 179919 -189911 17321 57838 14715 9 -129610
12416b33159O9352B64398n951a64808I1359K64357i6983B8481Q7170b3320l5220
$$ -233159 -163807 264398 258447 -164808 91359 355716 -96983 28481 115651 -23320 -58540
12405e8540D21345B01660J27212A18678D0248c73513f4194j43916I063L21746
$$ -58540 421345 201660 328872 118678 40248 -373513 -64194 -208110 9063 330809
12395C30809j17341M2418a685A0972g9594A97138n143l5772h3614G4328M27980
$$ 330809 213468 255886 -1685 10972 -79594 197138 191995 156223 -83614 74328 502308
12384E02308A79515P8200J34783L3842D6856P764j499j7019J24203E1518J69617
$$ 502308 179515 257715 392498 426340 46856 54620 53121 36102 160305 51518 221135
12373B21135j08154N6103p8272a10748A75011a93454A35789f1826b0919E3694
$$ 221135 112981 169084 90812 -110748 175011 -193454 135789 -61826 -20919 53694
12362C15941c1262P305A96465C9899c8483J1289D0192J85141a42826j9794B47735
$$ 315941 -31262 -23957 196465 39899 -38483 -27194 40192 225333 -142826 -162620 247735
12350b9720l4872j07270A2820R2803c659A69839n4743a28031j93953a56834D5933
$$ -29720 -64592 -171862 12820 105623 -3659 169839 115096 -128031 -321984 -156834 45933
12338C91720p3959A7671L80660a18396B80077L6011b24316E0724N8093k8446K04464
$$ 391720 317761 17671 398331 -118396 280077 316088 -224316 50724 108817 80371 284835
12327B84835k7681p1923G698K62987b79350A15711n5943L00235A36549k3337K080
$$ 284835 257154 185231 7698 270685 -279350 115711 59768 360003 136549 113212 115292
12316A15292N1038k5410K3630L7755n3540a28020A48290b63284B09663c2058j82082
$$ 115292 166330 140920 164550 202305 148765 -128020 148290 -263284 209663 -32058 -214140
12305b14140a3014I1075L4839a64908A79572e9609D5250J15440M8214g2496C19660
$$ -214140 -13014 91075 125914 -164908 179572 -59609 45250 160690 208904 -72496 319660
12293A11370a24939B10820N8305R6243A11309b55888A29575J1859k3240a75024
$$ 111370 -124939 210820 269125 365368 111309 -255888 129575 141434 118194 -175024
12282A96154J1480b99058b0061o7919B22299J7897a60660b5804A12865l7009i5617
$$ 196154 207634 -299058 -20061 -87980 222299 240196 -160660 -25804 112865 75856 -95617
12270c5186C03607F5908c22265A7908J83347b6960D53852m9062h8807A18094m0592
$$ -35186 303607 65908 -322265 17908 201255 -26960 453852 404790 -88807 118094 77502
12259G7502k1693a94823j7579A55145H200J75613J28817I077M6575K03471f8802
$$ 77502 55809 -194823 -212402 155145 8200 183813 312630 9077 55652 259123 -68802
12247H5199J00302G0570C2857d9888A01258a1314j33853B85274a6663j66286e5180
$$ 85199 185501 70570 32857 -49888 101258 -11314 -145167 285274 -16663 -182949 -55180
12235b4234l08878A38492J02712i0227h751C35062b00985H9724p64J13804J00228
$$ -24234 -333112 138492 241204 -90227 -8751 335062 -200985 89724 88960 202764 302992
12224C02992P855j40076E0296L47327A2030K66978D9200K64539H3588L97146B39241
$$ 302992 310847 170771 50296 397623 12030 279008 49200 313739 83588 480734 239241
12212A74463E9752K05445M3360K0880l0913m0463a3932e387j62841D4173n624
$$ 174463 59752 265197 308557 329437 298524 258061 -13932 -5387 -168228 44173 38549
12201C8549J50631g2207J4207B31107J91395E0943c0722B81779j33374K08919
$$ 38549 189180 -72207 -58000 231107 422502 50943 -30722 281779 148405 357324
12191C57324A35098N1442J51353a29741D2659L04106q8724J00133A49399k7049
$$ 357324 135098 186540 337893 -129741 42659 346765 258041 358174 149399 122350
12181A22350Q8029R3960H2220J51734D0067K58639d1953B51550j20847L72591
$$ 122350 210379 304339 82220 233954 40067 298706 -41953 251550 130703 503294
12171E03294j26469n9753d7998C96706j44123M6527F7570k1123e2434j6260B19092
$$ 503294 376825 317072 -47998 396706 252583 299110 67570 46447 -52434 -68694 219092
12159H5466K65123j72096J47650h0899B94127a44753C33845p5326e112l6375B15425
$$ 85466 350589 178493 326143 -80899 294127 -144753 333845 258519 -5112 -41487 215425
12147a16174B96284j09804J7835p9345c618B83582e0518D00384A21132J52431
$$ -116174 296284 186480 204315 124970 -3618 283582 -50518 400384 121132 273563
12137B73563J77855H6962J28651o1480b34365A39964Q7003b6592B2604J75845
$$ 273563 451418 86962 215613 154133 -234365 139964 226967 -26592 22604 198449
12127A98449J59059r4728a7816A25825C0692J66644I3444a0749o4915K511A80040
$$ 198449 357508 262780 -17816 125825 30692 197336 93444 -10749 -75664 -73153 180040
12115A61589J74980j38417c2452l0929C2513O0536J40024E4132k6362J5106K13180
$$ 161589 336569 198152 -32452 -63381 32513 93049 233073 54132 27770 42876 256056
12104B56056a627j25564n6682K9792c2685B7645J62459k0160b86305k64939C0070
$$ 256056 -1627 -127191 -183873 -154081 -32685 27645 190104 169944 -286305 -551244 30070
12092G3847a3142A70460a34993K0014J5653L5344E9749R949J23962a15148A40644
$$ 73847 -13142 170460 -134993 -114979 -99326 -63982 59749 69698 193660 -115148 140644
12080F9942i8374p9364G5390a81834A71014E4720b18252A06891O4415i5251C75615
$$ 69942 -98374 -177738 75390 -181834 171014 54720 -218252 106891 171306 -95251 375615
12068a36086h407c377B15109K00926A63419K03175f3474m1072K186C8019R4505
$$ -136086 -8407 -3377 215109 416035 163419 366594 -63474 -104546 -102360 38019 132524
12057A32524J18562c32740A39583o0269j6023A9851a0001B98922q7640G6032R9788
$$ 132524 251086 -332740 139583 79314 63291 19851 -10001 298922 211282 76032 175820
12046A75820g883C96622b1796F9768b06497h9034B05309a53909C75515b9049B79267
$$ 175820 -7883 396622 -21796 69768 -206497 -89034 205309 -153909 375515 -29049 279267
12034a2121A08561a12949d687o9206j23707A90185g6453j11096C17612j36433
$$ -12121 108561 -112949 -4687 -73893 -197600 190185 -76453 -187549 317612 181179
12024A81179a06791l1133b969B14312e9489K0657p7170k74840A28286m1121a44159
$$ 181179 -106791 -137924 -2969 214312 -59489 -38832 -116002 -390842 128286 87165 -144159
12012e5340d105m0958l7761D01710G7944a33985J6025H0902b94434Q120M2470
$$ -55340 -4105 -45063 -82824 401710 77944 -133985 -117960 80902 -294434 -286314 -243844
12001b43844I9561J9274J11814c0009H5232L6588d4870m83042c3751C0924K01568
$$ -243844 99561 118835 230649 -30009 85232 121820 -44870 -527912 -33751 30924 232492
11990B32492o9090a11307E2155j1098H582J97794N3931D7696a43256B4749b8473
$$ 232492 163402 -111307 52155 41057 8582 206376 260307 47696 -143256 24749 -28473
11978A07792J39477o3982o1411B0591M8954a87974c8489j64150O5638A54332g0654
$$ 107792 247269 183287 121876 20591 69545 -187974 -38489 -202639 -137001 154332 -70654
11966a63973C08983a12484l61809K27710d5458k2671Q742F9012a34826m2312B41985
$$ -163973 308983 -112484 -474293 -246583 -45458 -68129 -59387 69012 -134826 -177138 241985
11954A34506a09162m916b4304q9511F6309b54389J08526C01821c80439a08276
$$ 134506 -109162 -114078 -24304 -113815 66309 -254389 -145863 301821 -380439 -108276
11943h8788j7017E8868M5503c31966a60039B38454j41g8581B86912a48859j56596
$$ -88788 -105805 58868 104371 -331966 -160039 238454 238313 -78581 286912 -148859 -305455
11932c05455i9687F491a92789l9361P3804p4328J5742O8876F4757d6814o025C10633
$$ -305455 -99687 6491 -192789 -232150 -158346 -232674 -216932 -148056 64757 -46814 -52839 310633
11919C36403a11794I485Q187a84564Q1628m7416D6925O9960e7695C90395a38457
$$ 336403 -111794 9485 17672 -184564 -102936 -150352 46925 116885 -57695 390395 -138457
11907A01982P1136n2158d2860r5311A53552F6717b68754e7299p2202J6175D43724
$$ 101982 173118 120960 -42860 -138171 153552 66717 -268754 -57299 -129501 -113326 443724
11895b32888A56020J3985A2305h2675I1745b26020A44534o5212b87742B02933
$$ -232888 156020 170005 12305 -82675 91745 -226020 144534 79322 -287742 202933
11884C88993g5216M826A48820q317L1418c25332F8446h6227A1559J56514B9043
$$ 388993 -75216 -70390 148820 140503 171921 -325332 68446 -86227 11559 168073 29043
11872e6250A8703c38009B47681L1142d2062k376a328m23859E5461a46369l0060
$$ -56250 18703 -338009 247681 278823 -42062 -44438 -1328 -425187 55461 -146369 -176429
11861a76429N4412k8645H5100J02027b38964J17370A24116a17314J4981k01125
$$ -176429 -122017 -150662 85100 187127 -238964 -121594 124116 -117314 -102333 -303458
11851c03458a19981L2495E9738M081b65824f9959C8162g5834j01470b1900p09
$$ -303458 -119981 -87486 59738 63819 -265824 -69959 38162 -75834 -177304 -21900 -22609
11840b2609F282a56889k03597H1172M0843g3102r8800C6661A2R7962Q1984e32540
$$ -22609 6282 -156889 -360486 81172 122015 -73102 -171902 36661 12 97974 179958 -532540
11827A53334N5848j00573i2497R643m09626e7082A02255J00231h7660j7996o6392
$$ 153334 209182 108609 -92497 -82854 -492480 -57082 102255 202486 -87660 -105656 -172048
11816a72048g8435B6056c29872d5957A36562o4993A333a02562k36068a12001j98572
$$ -172048 -78435 26056 -329872 -45957 136562 71569 1333 -102562 -338630 -112001 -310573
11805c10573a21682d6218q0860C93337j96526a34127o8719P8080b9810j12350
$$ -310573 -121682 -46218 -127078 393337 196811 -134127 -202846 -124766 -29810 -142160
11795a42160M3467A48653l7589e9434A3137g0235j7123E05111I2475k2693a33841
$$ -142160 -98693 148653 111064 -59434 13137 -70235 -87358 505111 92475 69782 -133841
11783a34553D1775d2938r1715I1322H783J01236i9709G3390a97584A25286L8335
$$ -134553 41775 -42938 -134653 91322 8783 110019 -99709 73390 -197584 125286 163621
11772A63621Q4732c7454A44058a60985A68212a53727H3581b33480P6315e855C34422
$$ 163621 248353 -37454 144058 -160985 168212 -153727 83581 -233480 -157165 -5855 334422
11760a4210o4418K6384J8536I4961c902B51215C0440n784L5995o293c02080J17877
$$ -14210 -78628 -52244 -33708 94961 -3902 251215 30440 24656 60651 54358 -302080 -184203
11748a84203F3162a88378p9019n9552F9719K11883j28574a38681n7074f075B2552
$$ -184203 63162 -188378 -267397 -326949 69719 281602 153028 -138681 -195755 -6075 22552
11736b9485A23224a28851A60918h1036c3345B32425d4645C7800b13336A68195
$$ -29485 123224 -128851 160918 -81036 -33345 232425 -44645 37800 -213336 168195
11725d367j20833c5625j4262B7112e3299B75742P4357A22201P1792g850K999k20314
$$ -4367 -125200 -35625 -49887 27112 -53299 275742 350099 122201 193993 -7850 -4851 -225165
11713b25165I3414B4733e5451I2850a8149j59002A11350K02430F8422e3858j38336
$$ -225165 93414 24733 -55451 92850 -18149 -177151 111350 313780 68422 -53858 -192194
11702a92194J1142B41146a77063B05957a41037J4663B49862I9361J82963a2284
$$ -192194 -181052 241146 -177063 205957 -141037 -126374 249862 99361 282324 -12284
11691d3089l69465C18713a09362C33796c77072J78732L9689H2691a23813k92827
$$ -43089 -412554 318713 -109362 333796 -377072 -198340 -158651 82691 -123813 -416640
11681d16640C2254q918a84612B9662J84997c3263A87767J8510i3729j16695o4518
$$ -416640 32254 23336 -184612 29662 214659 -33263 187767 206277 -93729 -210424 -274942
11670b74942c6120j24598c3168j30446K7722C4816L16267a43269e6747A71286
$$ -274942 -36120 -160718 -33168 -163614 -135892 34816 351083 -143269 -56747 171286
11659b36705l5839a36115B68060c4691A25937a37008A66526g082D2421a05676
$$ -236705 -272544 -136115 268060 -34691 125937 -137008 166526 -7082 42421 -105676
11648B29868h3761l02072a63397H5613J84394e0973A20591K1375m1981h0320l8128
$$ 229868 -83761 -385833 -163397 85613 270007 -50973 120591 141966 99985 -80320 -118448
11637a18448H0253k9497J10935c9003C9407d7681B21999i416I6104a33048k03764
$$ -118448 80253 50756 161691 -39003 39407 -47681 221999 -9416 96104 -133048 -336812
11626c36812A08082O951c5043A51459b9281A14473a28379c6750k41284J26566
$$ -336812 108082 115033 -35043 151459 -29281 114473 -128379 -36750 -278034 -151468
11616a51468c3199q2542E8776a29101H2485l2784a66903B41725i8882m24556a37732
$$ -151468 -33199 -115741 58776 -129101 82485 49701 -166903 241725 -98882 -523438 -137732
11604B32728f5440e404B2374b22714C4305J14018A4978K13077j10589C9302J05857
$$ 232728 -65440 -5404 22374 -222714 34305 148323 14978 228055 117466 39302 145159
11593A45159J69782k5214k0970O5494c854H5038a51392B07299r948k1420J20877
$$ 145159 314941 289727 268757 334251 -3854 85038 -151392 207299 197351 175931 296808
11582B96808b0772A20224E7219j0906L1086b3355A13750g579l5564n6790B3916
$$ 296808 -20772 120224 57219 46313 77399 -23355 113750 -7579 -43143 -99933 23916
11570a81005A50473a72533A63998R0398i1051A16593N7123B7631J2999a46017
$$ -181005 150473 -172533 163998 254396 -91051 116593 173716 27631 40630 -146017
11559E2247R9459B2912a52246J5811B10809G8849l8018O3746f9314j16079B45004
$$ 52247 151706 22912 -152246 -136435 210809 78849 40831 104577 -69314 -185393 245004
11547B08950i0232A65910b2227d292A96398C4101c91404B1100N7146R465B5622
$$ 208950 -90232 165910 -22227 -4292 196398 34101 -391404 21100 78246 87711 25622
11535A19009c00703d7993G5942a09524m3194a8969A68819J26093C9080a6816j38504
$$ 119009 -300703 -47993 75942 -109524 -152718 -18969 168819 294912 39080 -16816 -155320
11524a55320B70043d2083A24355P7349a17684n421a7592B37263b18362g9194a6826
$$ -155320 270043 -42083 124355 201704 -117684 -123105 -17592 237263 -218362 -79194 -16826
11512C9423d74217i793m8167A06466J72055e1634C65135c4771D42089A58879C5286
$$ 39423 -474217 -9793 -57960 106466 278521 -51634 365135 -34771 442089 158879 35286
11500b4532A52066b48933C2241i8121a7322B03957J06952k5938C9819b911p9942
$$ -24532 152066 -248933 32241 -98121 -17322 203957 310909 284971 39819 -2911 -82853
11489h2853B07549O3016B5056Q2238J09014A05920P2516l2122n4599K05764a26614
$$ -82853 207549 270565 25056 107294 216308 105920 178436 146314 91715 297479 -126614
11477A13568a00156B60420A18396a22582A83973F2947R5391k1053J45096a30365
$$ 113568 -100156 260420 118396 -122582 183973 62947 158338 137285 282381 -130365
11466A69013K5321g7782B11788k1445I0861J00635L24407B27828A05737l8850
$$ 169013 194334 -77782 211788 190343 90861 191496 515903 227828 105737 66887
11456F6887J04879q069b58573A68509Q5040L65279I9267b58299a25208M2357L8314
$$ 66887 171766 163697 -258573 168509 253549 618828 99267 -258299 -125208 -82851 -44537
11445d4537B27805A07254K9456l841G261a43186A61412B5270a39990M1784B62548
$$ -44537 227805 107254 136710 132869 7261 -143186 161412 25270 -139990 -98206 262548
11433A72104f3920B1741K18019R0223f6445j39720J9175d1989o2589e050C94722
$$ 172104 -63920 21741 239760 329983 -66445 -206165 -186990 -41989 -104578 -5050 394722
11421a22975H672K17721j12121f5143q4074p8353A0613Q6366l7277M9565k9684
$$ -122975 8672 226393 114272 -65143 -149217 -227570 10613 96979 59702 109267 79583
11410G9583k8218c28103G0796b0293A28566m6197i6175a7569B94739e4335B791
$$ 79583 51365 -328103 70796 -20293 128566 82369 -96175 -17569 294739 -54335 2791
11398h4359G6240k2714M9026k5593j2416a45892D23b64867f9446K9942j1060j11218
$$ -84359 76240 53526 102552 76959 64543 -145892 423 -264867 -69446 -39504 -50564 -161782
11386a61782A87801J94075c01735G349a17559b7934B2551a69849h0708l11302
$$ -161782 187801 381876 -301735 7349 -117559 -27934 22551 -169849 -80708 -392010
11376c92010a33978p121A26538J46552b19684R398D19842c4183A11076c91303
$$ -392010 -133978 -141099 126538 273090 -219684 -210286 419842 -34183 111076 -391303
11365e430m9721D8811b57470F6034b53027I9535a26590l9951M0837B3105a09403
$$ -5430 -55151 48811 -257470 66034 -253027 99535 -126590 -166541 -125704 23105 -109403
11353b09935B29582A11986N0950j2698b15735D8240j0574a69106C61599a50407
$$ -209935 229582 111986 162936 150238 -215735 48240 37666 -169106 361599 -150407
11342A10615a39328a1916B58002b2k5545q8676B3312a70241m0229R1360E2262
$$ 110615 -139328 -11916 258002 -22 -25567 -114243 23312 -170241 -210470 -119110 52262
11330b39541p7414c1525C16596f0823k95286a197k08573R7866A93892b22063A13868
$$ -239541 -316955 -31525 316596 -60823 -356109 -1197 -209770 -111904 193892 -222063 113868
11318a55327D7784f1397o590n9139L2723B01008b85002Q6736A59604b39742a01204
$$ -155327 47784 -61397 -67987 -127126 -94403 201008 -285002 -198266 159604 -239742 -101204
11306E46643i2663k14158B8042J9174J0949a65632B64012D2333c9738C94438h1268
$$ 546643 -92663 -306821 28042 47216 58165 -165632 264012 42333 -39738 394438 -81268
11294A51083i1230o2180f303B94335a82053P7503j98236a44930L7003k13225A38694
$$ 151083 -91230 -153410 -6303 294335 -182053 -104550 -302786 -144930 -107927 -321152 138694
11282A76245b35570c8418j07244j29814B07965b00188N7024k5333P6861R238A41862
$$ 176245 -235570 -38418 -145662 -275476 207965 -200188 -143164 -168497 -91636 -82398 141862
11270a76677G3899a69928A84861p9259i6324j00267G8666d0923B7343j857b53751
$$ -176677 73899 -169928 184861 105602 -96324 -196591 78666 -40923 27343 25486 -253751
11258f4752C447i7866G257K31413a20210B3868K81787B7541a64201j82067A45211
$$ -64752 3447 -97866 7257 238670 -120210 23868 305655 27541 -164201 -346268 145211
11246a59533f9658j36825e0700F141g3896A25653e879p0849B32037L4479a96281
$$ -159533 -69658 -206483 -50700 6141 -73896 125653 -5879 -76728 232037 266516 -196281
11234A67925b2092D7161N2507E842a21593H5903a02577j2969C00943P658D7837
$$ 167925 -22092 47161 99668 5842 -121593 85903 -102577 -115546 300943 308601 47837
11222h4726B8240J01749f7199C6903L6359I092a26492A36141a98367G7775a86565
$$ -84726 28240 129989 -67199 36903 73262 9092 -126492 136141 -198367 77775 -186565
11210A86343J28262d17831b8669n897l51516J43633A62240B1963J55985i8263
$$ 186343 314605 -417831 -28669 -34566 -386082 -242449 162240 21963 177948 -98263
11199e7126q5480d1159k2907b2634m2478E6129a99701g7949D69117a70539N3638
$$ -57126 -142606 -41159 -64066 -22634 -65112 56129 -199701 -77949 469117 -170539 -116901
11188a16901j48153h8395A87092H154M1823b43727G4792b27704c5378q9209j86657
$$ -116901 -265054 -88395 187092 8154 49977 -243727 74792 -227704 -35378 -124587 -311244
11177c11244a29590a2219j6927C3897i5915I1128i6635k30889e6076o8023r6631
$$ -311244 -129590 -12219 -29146 33897 -95915 91128 -96635 -327524 -56076 -124099 -220730
11166b20730I9733D9626a99771B24022c05223A10973a99683O3098j18083D39754
$$ -220730 99733 49626 -199771 224022 -305223 110973 -199683 -136585 -254668 439754
11155a36922j12862j17289D1041g287j8595j29295k50808f1985o9345D82963c2073
$$ -136922 -249784 -367073 41041 -7287 -25882 -155177 -405985 -61985 -131330 482963 -32073
11143c60213Q3147J19339f077C5231j4202i0497L7039C48744I2720l974J10639
$$ -360213 -277066 -157727 -6077 35231 21029 -90497 -53458 348744 92720 88746 199385
11132A99385b6567B46705B8157m074c29924A20333C0443d9552j91901J0777I4855
$$ 199385 -26567 246705 28157 24083 -329924 120333 30443 -49552 -241453 -230676 94855
11120A54662n4167K18461h650A76347a34578m0140C36852c34756G1074j2369J92404
$$ 154662 100495 318956 -8650 176347 -134578 -174718 336852 -334756 71074 58705 251109
11109B51109g6953A31671E8505J5240N9693N6498C7173M4522b92724R8526B57941
$$ 251109 -76953 131671 58505 73745 133438 189936 37173 81695 -292724 -194198 257941
11097A59015F8273k206j6521J25037k3807b4896I2211K07540c07046H8233a65412
$$ 159015 68273 66067 49546 174583 150776 -24896 92211 299751 -307046 88233 -165412
11085A28259l8348b06008H1735L85447A65065K4722P2268A28915d2500B31257
$$ 128259 89911 -206008 81735 467182 165065 189787 262055 128915 -42500 231257
11074H3550K10640e1086A26013O3715J61276A03236L93132A58409M0193J19085
$$ 83550 294190 -51086 126013 189728 351004 103236 496368 158409 198602 317687
11064C17687C2219K37935L34039A79891H1955K45666J44684J01054B08030K68078
$$ 317687 32219 270154 604193 179891 81955 327621 472305 573359 208030 476108
11054D76108K9449j23000M29589C15484J05063J80697J92365j00241k08922J16047
$$ 476108 505557 382557 812146 315484 420547 601244 793609 693368 484446 600493
11044F00493J617o7497J48127m4394J14396R3202r7581k59429Q4799J560B38215
$$ 600493 602110 534613 682740 638346 752742 845944 748363 488934 573733 575293 238215
11032F47439J41091k73216P0004R1475l32498M02422j82765J21766j8771j8046
$$ 647439 788530 515314 585318 676793 344295 746717 563952 685718 666947 648901
11022F48901p2414O992k14788K91897l1653K65218k07211B18811c2457F75589
$$ 648901 576487 583479 368691 660588 628935 894153 686942 218811 -32457 675589
11011B32946J58296J59325j45615J83154J8577A48954L80324k36651J34794m5907
$$ 232946 391242 550567 404952 588106 606683 148954 529278 292627 427421 381514
11001C81514K46998K12629k04877j13754j7778J68747j73952k02408L87933j25371
$$ 381514 628512 841141 636264 522510 504732 673479 499527 297119 685052 559681
10991E59681q8304j36362q9551J61688j10519k1784J30580R9858k29973J28861
$$ 559681 471377 335015 245464 407152 296633 274849 405429 505287 275314 404175
10981D04175J26131J53218L82048l22180N4160k6992J11784j52812N43243j94616
$$ 404175 530306 683524 1065572 743392 797552 770560 882344 729532 1272775 1078159
10971A078159J79645l3173L19273J29917R3569P33939n13413L58209l48567N97329
$$ 1078159 1257804 1224631 1543904 1673821 1767390 2501329 1987916 2346125 1997558 2594887
10961B594887k50817l49152P1102p20262J78702k28557j30480k14291J10110N0230
$$ 2594887 2344070 1994918 2066020 1345758 1524460 1295903 1165423 951132 1061242 1111472
10951A111472K75496l50936L06147n63525M18255l18931l04786Q6876o9744O3634
$$ 1111472 1386968 1036032 1342179 778654 1196909 877978 573192 660068 590324 653958
10941F53958j61883o2782b5138A70950J01607a34297c1598r0317C99727j90489
$$ 653958 492075 429293 -25138 170950 272557 -134297 -31598 -121915 399727 209238
10931B09238j01172c0205b944G602k174L25715f6538D9820J31002F9449A3382
$$ 209238 108066 -30205 -2944 7602 5428 331143 -66538 49820 180822 69449 13382
10919F4258a23193j11233A37699A9232i9823I4183b16135L1433A7259M141R975
$$ 64258 -123193 -234426 137699 19232 -99823 94183 -216135 -184702 17259 21400 31375
10908C1375a38715k4339A16118a59289O1923j18397C29708a07395F3937l1223
$$ 31375 -138715 -163054 116118 -159289 -97366 -215763 329708 -107395 63937 32714
10898C2714b1680k11123a01244j6672N3576j41917A87046a88023B49598q6994
$$ 32714 -21680 -232803 -101244 -117916 -64340 -206257 187046 -188023 249598 162604
10888A62604a76723g9068N484A54939b46762A686a48502M8329A20093b00788O3204
$$ 162604 -176723 -79068 -73584 154939 -246762 1686 -148502 -100173 120093 -200788 -137584
10877a37584d6460C2760g2271A1218a76962A38877d1506A12136m8649K08188b3883
$$ -137584 -46460 32760 -72271 11218 -176962 138877 -41506 112136 63487 271675 -23883
10865b7752A18017a56604E27183c26332J30871f1537D2174M10213E3344O717J07506
$$ -27752 118017 -156604 527183 -326332 -195461 -61537 42174 452387 53344 60061 167567
10854A67567e3374q5153k8222A31987c0640A11744i9779G7694a54308j6415L3122
$$ 167567 -53374 -138527 -166749 131987 -30640 111744 -99779 77694 -154308 -170723 -137601
10843a37601N9414A96722d4749A73266L5348g8515j38859G1036a65838A7390J3896
$$ -137601 -78187 196722 -44749 173266 208614 -78515 -217374 71036 -165838 17390 31286
10832C1286J03953e426k12387D17783b7881B84781A25464E0535b49119J02670
$$ 31286 135239 -5426 -217813 417783 -27881 284781 125464 50535 -249119 -146449
10822a46449b6740k7813B01308e9305A10902J73733d34286a4670G0532c3135m44543
$$ -146449 -26740 -54553 201308 -59305 110902 284635 -434286 -14670 70532 -33135 -477678
10811d77678c8238j47756e3380G5608b53821j15017d4023o0844j52683B58503
$$ -477678 -38238 -185994 -53380 75608 -253821 -368838 -44023 -104867 -257550 258503
10800I3959f4843j29274A91529i6441F7140K6935g4143C72772A41717i3888D0628
$$ 93959 -64843 -194117 191529 -96441 67140 94075 -74143 372772 141717 -93888 40628
10788d5461j24993k2205I4327i6924k71231d2346I828h6115n7632j64223A1570
$$ -45461 -170454 -192659 94327 -96924 -368155 -42346 9828 -86115 -143747 -307970 11570
10776a49012f8826H2535a21943E547f6337p4863j50805E9311A275a68147m8750
$$ -149012 -68826 82535 -121943 5547 -66337 -141200 -292005 59311 1275 -168147 -216897
10765b16897A23372a20315m6309A38711a0862k6952l2371B31192a51820a1861
$$ -216897 123372 -120315 -166624 138711 -10862 -37814 -70185 231192 -151820 -11861
10754i233j3103q6277L1315k86334c5360E6286a13666M1674B84877J6422A34593
$$ -9233 -22336 -108613 -77298 -363632 -35360 56286 -113666 -71992 284877 301299 134593
10742c49743i2158L4421D3955a56216F2252c96421B6664a60562f4802A1460f0343
$$ -349743 -92158 -57737 43955 -156216 62252 -396421 26664 -160562 -64802 11460 -60343
10730c26904b7062B7327c64441C066c9329k9756C8461a02177B09586j02580a38193
$$ -326904 -27062 27327 -364441 3066 -39329 -69085 38461 -102177 209586 107006 -138193
10718a44775b9903C1200A2201i1129F024Q1522h9067J2551M814D33854A27135
$$ -144775 -29903 31200 12201 -91129 6024 87546 -89067 -76516 -71702 433854 127135
10706C75271d6211k7475C9125j8872a84707q681F4030a50074C7433a22623j0299
$$ 375271 -46211 -73686 39125 20253 -184707 -193388 64030 -150074 37433 -122623 -132922
10695a32922a9501m08526A23452h1838A69895f456I260c45042A23881a61152L3115
$$ -132922 -19501 -428027 123452 -81838 169895 -6456 9260 -345042 123881 -161152 -128037
10684a28037L5294j31804A27760a68305b9363o3414k2897B65467b17861F931a96405
$$ -128037 -92743 -224547 127760 -168305 -29363 -92777 -115674 265467 -217861 6931 -196405
10672i768o5423A1546b05201k662L3548B78782D785a08986A88721a13650k15324
$$ -9768 -75191 11546 -205201 -207863 -174315 278782 4785 -108986 188721 -113650 -328974
10661c28974a48468C3639h8644k2245k19911a31010p5829h8821a1891I5256J17346
$$ -328974 -148468 33639 -88644 -110889 -330800 -131010 -206839 -88821 -11891 95256 212602
10650B12602K3338P5013F557a03817k8970F8645C3364N1867h9185F8127b41346
$$ 212602 235940 310953 6557 -103817 -132787 68645 33364 85231 -89185 68127 -241346
10638h933p8817B10347M9184h2433A4628a86068m7413a2755A2774K19659b15260
$$ -8933 -87750 210347 259531 -82433 14628 -186068 -233481 -12755 12774 232433 -215260
10626b47418l8279O4012f7117F0841k2806J40069b68995g8010I745g6831r7079
$$ -247418 -285697 -221685 -67117 60841 38035 178104 -268995 -78010 9745 -76831 -173910
10615a73910A38270b32386A16462D8101L2024R2530a4576k5685o0484j31046c5617
$$ -173910 138270 -232386 116462 48101 80125 172655 -14576 -40261 -100745 -231791 -35617
10603b99256a31274j43020A28873h5877c9566B07242a01509A43072b52383f0561
$$ -299256 -131274 -274294 128873 -85877 -39566 207242 -101509 143072 -252383 -60561
10592F8547a55774H2828d5370m40811b07345H4328h2000m0522k04158f1657G2646
$$ 68547 -155774 82828 -45370 -486181 -207345 84328 -82000 -122522 -326680 -61657 72646
10580B36373a49075b9388A33683a57711D3747b18942A39983c80898a47428A05367
$$ 236373 -149075 -29388 133683 -157711 43747 -218942 139983 -380898 -147428 105367
10569B36691h4737C1653h6255A5639L0871d7289A99485a15805j20814B81505a27361
$$ 236691 -84737 31653 -86255 15639 46510 -47289 199485 -115805 -236619 281505 -127361
10557c79458A35029a34137K06j95878J45995a4050I0710B1695a64113Q0092G4742
$$ -379458 135029 -134137 -133931 -329809 -183814 -14050 90710 21695 -164113 -84021 74742
10545b84172A40547R1924a27429e9269q0398C6969a81152A90501i4334i026A86055
$$ -284172 140547 232471 -127429 -59269 -139667 36969 -181152 190501 -94334 -9026 186055
10533h0289J9587l00507J14001g1227j89259D47530c84343d9820B4955b19578
$$ -80289 -60702 -361209 -247208 -71227 -260486 447530 -384343 -49820 24955 -219578
10522b62788b2936j09002k93186I2172a1651k75511g9993E6111i983k15188r5059
$$ -262788 -22936 -131938 -425124 92172 -11651 -287162 -79993 56111 -9983 -225171 -320230
10511c20230g8855j24606b8976k67584b9125C49c18157J50777k1434B96104a30413
$$ -320230 -78855 -203461 -28976 -296560 -29125 349 -318157 -167380 -188814 296104 -130413
10499a57972A51300a29801e9079B3722a16000F996d09017A88283i7527K6847A04150
$$ -157972 151300 -129801 -59079 23722 -116000 6996 -409017 188283 -97527 -70680 104150
10487a10559G0025Q12c72692d9462k5616A65136a68163E2675a53077B13792a80831
$$ -110559 70025 70837 -372692 -49462 -75078 165136 -168163 52675 -153077 213792 -180831
10475f6045B42521C3776J82183J75618N5166R250J05170G1408j1179k9284J16731
$$ -66045 242521 33776 215959 391577 446743 455993 561163 71408 60229 30945 147676
10464A47676Q2328a03246I930L48832G4886K20311a94919B6360a5068k39002a04259
$$ 147676 230004 -103246 9930 358762 74886 295197 -194919 26360 -15068 -254070 -104259
10452a75740a4084l2778k76996B18254a67379j4109M2350M2618j17819A24132
$$ -175740 -14084 -46862 -323858 218254 -167379 -181488 -139138 -96520 -214339 124132
10441C3291a62024I1801J30575G2604a76352F6846a87644B63817j21727a1285
$$ 33291 -162024 91801 222376 72604 -176352 66846 -187644 263817 142090 -11285
10430c19113A84369e9468A03440J75370D1446a48022K9878C8489c2359j48574
$$ -319113 184369 -59468 103440 278810 41446 -148022 -118144 38489 -32359 -180933
10420a80933F0356b51564B03150b69875J11399j23038B42238o7969b80170G0601
$$ -180933 60356 -251564 203150 -269875 -158476 -281514 242238 174269 -280170 70601
10409a53762O9763n435j9809R386j04759J1683j7357O2217C27c36403A01508a55494
$$ -153762 -83999 -89434 -109243 -99857 -204616 -192933 -210290 -148073 327 -336403 101508 -155494
10396b69206d1546d797j97833A14020B3443N5840a75833D6956J82631K84824B11605
$$ -269206 -41546 -4797 -202630 114020 23443 79283 -175833 46956 229587 514411 211605
10384C10005F5948g8715A21233j1353C088O3248J21978F4073J77600a22766K1752
$$ 310005 65948 -78715 121233 109880 3088 66336 188314 64073 241673 -122766 -101014
10373a01014D0859O4387b4322D24673B5650p795a6397C95224m1825A45294J70918
$$ -101014 40859 105246 -24322 424673 25650 17855 -16397 395224 353399 145294 316212
10362C16212r678j15941J38930K0896j0138E367M24504A17292p928h1349B04437
$$ 316212 306534 190593 329523 350419 340281 5367 429871 117292 109364 -81349 204437
10350H3556K36261m8962a17086E23277j4452k14820J44572j71632a65518B72039
$$ 83556 319817 270855 -117086 523277 508825 294005 438577 266945 -165518 272039
10339H843O6474J90513N5723j20579r6593L28811c6261B60542l6786Q9233C0095
$$ 8843 75317 265830 321553 200974 104381 433192 -36261 260542 223756 312989 30095
10327e6836A55259k7876J83067C9244L5090J97673g6279b8732B22943H2767h7355
$$ -56836 155259 127383 310450 39244 74334 272007 -76279 -28732 222943 82767 -87355
10315C33223j04627G5978J53668d6604j3423k2231A58129J65734j9559c17562
$$ 333223 228596 75978 229646 -46604 -60027 -82258 158129 323863 304304 -317562
10304b3390j475c773j45273B90173a596B1082d00029h650A32736A2908e9058f14
$$ -23390 -24865 -3773 -149046 290173 -1596 21082 -400029 -8650 132736 12908 -59058 -614
10291I1103e9166p0554c5652m64733a71880e0127j36061j32775A49844J32227
$$ 91103 -59166 -129720 -35652 -500385 -171880 -50127 -186188 -318963 149844 282071
10281B82071C2426J69083N9252b28850o186I0602J5272b29505L250j637H4662
$$ 282071 32426 201509 260761 -228850 -235036 90602 105874 -229505 -226255 -227892 84662
10269b37655H287a38809j45235F2556a44728j08083M8614l7022R8907D715K68630
$$ -237655 8287 -138809 -284044 62556 -144728 -252811 -204197 -241219 -142312 4715 273345
10258B73345J52485H7688l4267a31405N8808K0377F4183M34640k36344j19624
$$ 273345 425830 87688 53421 -131405 -72597 -52220 64183 498823 262479 142855
10248A42855b611A61902K9988n1271b60572I7984K53824b08359M5345p2938e2356
$$ 142855 -2611 161902 191890 140619 -260572 97984 351808 -208359 -163014 -235952 -52356
10236C4155O0090c11150O3251c1654A53485m1184H020P6532h9117B85373c26538
$$ 34155 94245 -311150 -247899 -31654 153485 112301 8020 84552 -89117 285373 -326538
10224e4074b5092j08688m35340a28226l9621b7471j94905A07664L7616A3036g3816
$$ -54074 -25092 -133780 -569120 -128226 -167847 -27471 -222376 107664 145280 13036 -73816
10212H7078b24969h5001B48654B4518K10792b13280O6241d7910E2068b43717d4647
$$ 87078 -224969 -85001 248654 24518 235310 -213280 -147039 -47910 52068 -243717 -44647
10200e4387j00370a4291B2713c3861q1574I3394b31452A67596a18465M6173l40689
$$ -54387 -154757 -14291 22713 -33861 -115435 93394 -231452 167596 -118465 -72292 -412981
10189d12981a6469m8559j56903A23990J27476b8334l9268A42317d6318D550M3172
$$ -412981 -16469 -65028 -221931 123990 251466 -28334 -67602 142317 -46318 4550 47722
10178D7722I733a57479j05081J29427A72141a91036A7201a73804C9985b02765
$$ 47722 9733 -157479 -262560 -133133 172141 -191036 17201 -173804 39985 -202765
10167E2545j3374a72287A81191a35904G2180c26988R1186e4055o8386B38925c69861
$$ 52545 39171 -172287 181191 -135904 72180 -326988 -235802 -54055 -122441 238925 -369861
10155B01435b1997n2171j47961g9303p0601E520J84531B9925c90k95372r113C7106
$$ 201435 -21997 -74168 -222129 -79303 -149904 5520 190051 29925 -390 -295762 -304875 37106
10142C6840a53978D14721d9193j26784A37483f1920p349r6785A02779i3059B40219
$$ 36840 -153978 414721 -49193 -175977 137483 -61920 -69269 -166054 102779 -93059 240219
10130F5913a19207A90855f1375K9154k00851A21705b64126g7570k279A22263a56868
$$ 65913 -119207 190855 -61375 -32221 -233072 121705 -264126 -77570 -79849 122263 -156868
10118a17559I1974a34710d8644i445n33162a01297b5478j14497A31309E6813J46774
$$ -117559 91974 -134710 -48644 -9445 -542607 -101297 -25478 -139975 131309 56813 203587
10107B03587e8686j17278o5952c3410j49946K9506a9308k78601a16483q8649Q0058
$$ 203587 -58686 -175964 -241916 -33410 -183356 -153850 -19308 -297909 -116483 -205132 -125074
10096a25074A29591b95660J03033n1428e4701m45092E5622b40848d6558b0763
$$ -125074 129591 -295660 -192627 -244055 -54701 -499793 55622 -240848 -46558 -20763
10085H301J03043b81785G388P210b02889q2345f3968A39370c6164A4914J2411
$$ 8301 111344 -281785 7388 14598 -202889 -285234 -63968 139370 -36164 14914 27325
10074B7325L3466e26381F486J96572G5776N0602c38614a09805P825j46499H059
$$ 27325 60791 -526381 6486 203058 75776 126378 -338614 -109805 -101980 -248479 8059
10062A92280b7665l0477A25b29097H986g6422l2094B2106K24494b58931J26506
$$ 192280 -27665 -58142 125 -229097 8986 -76422 -108516 22106 246600 -258931 -132425
10051a32425B03576b0943F0733P9559a66630a4700j3907j98854o2742p0735g6467
$$ -132425 203576 -20943 60733 140292 -166630 -14700 -28607 -227461 -290203 -360938 -76467
10039h3124k30912J26767g6389j62322C02706F9585b5566l00042o9175A36017
$$ -83124 -314036 -187269 -76389 -238711 302706 69585 -25566 -325608 -394783 136017
10028A5220J7517L0710f9325J7660m9571H5988a18151b7470j19853m3810A30366
$$ 15220 32737 63447 -69325 -51665 -101236 85988 -118151 -27470 -147323 -191133 130366
10016b13386C8238c9408k20894F5062N9535n0978d0065r8957A36585c7278j44368
$$ -213386 38238 -39408 -260302 65062 124597 73619 -40065 -139022 136585 -37278 -181646
10005a81646a9126o1457k19844B4547c68896A49132i4982l60921A12803c21920
$$ -181646 -19126 -80583 -300427 24547 -368896 149132 -94982 -455903 112803 -321920
9994e7655k52962C6653J08002b05111O5279j69415A84931H2017J15070d8045o1932
$$ -57655 -310617 36653 144655 -205111 -139832 -309247 184931 82017 197087 -48045 -109977
9983a09977e2857A96988I09J43090m6933a2639B75705c21437n8690J36103A18858
$$ -109977 -52857 196988 909 143999 97066 -12639 275705 -321437 -380127 -244024 118858
9971D8199b13576E421P9888a11665A81213b9761C19948A3816b86260a08918H9370
$$ 48199 -213576 5421 85309 -111665 181213 -29761 319948 13816 -286260 -108918 89370
9959B3851M4593a13990k5827O583j62467a7743n0738p3534A37228J33399h4837
$$ 23851 68444 -113990 -139817 -133234 -295701 -17743 -68481 -142015 137228 270627 -84837
9947A07324c711r221k96342Q0829N2030A346L47787a47916e8940j78751k66005
$$ 107324 -3711 -12932 -309274 -228445 -176415 1346 349133 -147916 -58940 -237691 -503696
9936e03696B3918K36385a67569C1327j1058O66M0347d66402a74737j02931A7701
$$ -503696 23918 260303 -167569 31327 20269 20935 61282 -466402 -174737 -277668 17701
9924A26091b27554r5176i3162i16m2387j62856l826k939b6722q5029A20041l6188
$$ 126091 -227554 -322730 -93162 -916 -43303 -206159 -209985 -212924 -26722 -111751 120041 83853
9912H3853P3117K5564F3853b3494o8599n1991j37102b8391j6199A84704L1527
$$ 83853 156970 182534 63853 -23494 -92093 -144084 -281186 -28391 -44590 184704 216231
9901B16231k2175F3623a99172l9434A99397d28097I8096b1041n1665q1383E4922
$$ 216231 194056 63623 -199172 -238606 199397 -428097 98096 -21041 -72706 -154089 54922
9889d87749D4647e4696n6268C0398d60481K08181G4077e6639P363c421l30675
$$ -487749 44647 -54696 -110964 30398 -460481 -252300 74077 -56639 -49276 -3421 -334096
9878c34096R6630F8630e1978l30098J03920N847n2388o6359c6058m6140k362A55090
$$ -334096 -237466 68630 -51978 -382076 -278156 -272309 -324697 -391056 -36058 -82198 -84560 155090
9865a04515n61j10125A5005O81265b32184a15428m4364j81923A42615h5485k83083
$$ -104515 -105076 -215201 15005 696270 -232184 -115428 -159792 -341715 142615 -85485 -368568
9854c68568Q0898p0126J32143k213I4998h2059k55710a3173j2985l4182o7509
$$ -368568 -287670 -357796 -225653 -227866 94998 -82059 -337769 -13173 -26158 -60340 -127849
9843a27849j22252b0491C7170J41456M2071A00338e9236r7036k2355Q4510K2338
$$ -127849 -250101 -20491 37170 178626 220697 100338 -59236 -156272 -178627 -94117 -71779
9832g1779A4005a29667C2013i5240A42971C3631c34202A07936a87660r9192M9034
$$ -71779 14005 -129667 32013 -95240 142971 33631 -334202 107936 -187660 -286852 -237818
9821b37818B69395a91302A9786J080a10241a7172m46665f3455k40789Q7501B0102
$$ -237818 269395 -191302 19786 20866 -110241 -17172 -463837 -63455 -304244 -216743 20102
9809A48125J8771H0449d5615j95744m6811A00736A4453b53115d3707l81351B06716
$$ 148125 166896 80449 -45615 -241359 -288170 100736 14453 -253115 -43707 -425058 206716
9797c61126B88419g8392j93022N8499A90857a63645l8116I0479A9207J2387c02625
$$ -361126 288419 -78392 -271414 -212915 190857 -163645 -201761 90479 19207 31594 -302625
9785b3816q8947J6068A60118c25951C58258d10188C19547F9071P3210a63739j42463
$$ -23816 -112763 -96695 160118 -325951 358258 -410188 319547 69071 142281 -163739 -306202
9774c06202A0781a40921A30856a84790B7507a00134o185b5535m5048j78454a8547
$$ -306202 10781 -140921 130856 -184790 27507 -100134 -106319 -25535 -70583 -249037 -18547
9762b36286j01603J02862c7783C24290j60541D1501a18542e4118l06380B42952
$$ -236286 -337889 -235027 -37783 324290 163749 41501 -118542 -54118 -360498 242952
9751f9202b580E0448i8431o7844I0476b9053r8020A16096b623D6875A9810Q5376
$$ -69202 -2580 50448 -98431 -166275 90476 -29053 -127073 116096 -2623 46875 19810 105186
9739A05186a12953k48125A10389a9257A498J82530g8581A09836f9667K7718j77847
$$ 105186 -112953 -361078 110389 -19257 1498 184028 -78581 109836 -69667 -41949 -219796
9728b19796b7374E7604A3279a36272o6039B3293P8841K7118k2535B0197c44257
$$ -219796 -27374 57604 13279 -136272 -202311 23293 102134 129252 106717 20197 -344257
9716E0322b33355A21338i0668j75131e3089j12420o2914a04110D7741J8259a28094
$$ 50322 -233355 121338 -90668 -265799 -53089 -165509 -228423 -104110 47741 66000 -128094
9704c11364J40778A16875A7124b33283C6759J55225c2093g256k07929M0785F3778
$$ -311364 -170586 116875 17124 -233283 36759 191984 -32093 -7256 -215185 -174400 63778
9692a43185O1967k9471o1731A2859K06306a12335B28924a6228A3R471i0938l0510
$$ -143185 -81218 -110689 -172420 12859 219165 -112335 228924 -16228 13 9484 -90938 -121448
9680a21448q0126l7677A19193c67481a50635A93287i3478k93995J56995j42895
$$ -121448 -201574 -239251 119193 -367481 -150635 193287 -93478 -387473 -230478 -373373
9670c73373j57309f7776j70686a11254L5008A74101J15708A4016M39000H8755
$$ -373373 -530682 -67776 -238462 -111254 -76246 174101 289809 14016 453016 88755
9659c29812H1484i6694p0155C9575b19753A93516D1110g71k30656P3541j39588
$$ -329812 81484 -96694 -166849 39575 -219753 193516 41110 -771 -231427 -157886 -297474
9648b97474a8668B02881c69053J29921N7446M3885l98010d1415j8960k24150A48596
$$ -297474 -18668 202881 -369053 -239132 -181686 -137801 -535811 -41415 -60375 -284525 148596
9636a46716b3811o6840b2703r3183e4426k71817L0974A65057b13269i0558a833
$$ -146716 -23811 -90651 -22703 -115886 -54426 -326243 -295269 165057 -213269 -90558 -1833
9624c21861A4209a02004A27369J22109b15062f4846k40108A58578b74742a06339
$$ -321861 14209 -102004 127369 249478 -215062 -64846 -304954 158578 -274742 -106339
9613H2896B7988N7145J54635A8756a24237J0063A76919c53918B06121B5167b13448
$$ 82896 27988 85133 239768 18756 -124237 -114174 176919 -353918 206121 25167 -213448
9601i3417q1727c972B35473e818k5250A65647a58999P0863b0246j26449d3482
$$ -93417 -175144 -3972 235473 -5818 -31068 165647 -158999 -88136 -20246 -146695 -43482
9589A4178a56415A38265d0051B0350c5132A46022k7752c55812C27830A01064d4421
$$ 14178 -156415 138265 -40051 20350 -35132 146022 118270 -355812 327830 101064 -44421
9577A5284J01487i9183A16625j4069a37043A3685b83029a31552l6457j60704A41366
$$ 15284 116771 -99183 116625 102556 -137043 13685 -283029 -131552 -168009 -328713 141366
9565b89161a31960B48622a63075A38465C7880e800p0178q5422B92567e6723O906
$$ -289161 -131960 248622 -163075 138465 37880 -5800 -75978 -161400 292567 -56723 -49817
9554d9817A51971o4605a11402d2704C1378a38034k03236e0932A0654D655Q6737
$$ -49817 151971 87366 -111402 -42704 31378 -138034 -341270 -50932 10654 4655 91392
9543I1392j2102C0888M5550P7986i5805A44804b50969B54426I6438K8433a66228
$$ 91392 79290 30888 76438 154424 -95805 144804 -250969 254426 96438 124871 -166228
9531A83527h8968K3155A86376J43816c1810E83286b58468a16860A72667c34577
$$ 183527 -88968 -65813 186376 330192 -31810 583286 -258468 -116860 172667 -334577
9520b98204g7207D2508c10631A02443j1758l1936b16982P4667F2590b19292O201
$$ -298204 -77207 42508 -310631 102443 90685 58749 -216982 -142315 62590 -219292 -213091
9509b13091a6743A22858c7516q4771o0332l3227J05861l22960A34176a09114l2108
$$ -213091 -16743 122858 -37516 -122287 -182619 -215846 -109985 -432945 134176 -109114 -141222
9498a41222P0173K5898k62817I5563J17321N3588e3093F6898P189Q4559A0996
$$ -141222 -71049 -45151 -307968 95563 212884 266472 -53093 66898 74087 158646 10996
9486C09030a58838B0264a79246A64566L3682c01837H8254b50572J4166N275c5983
$$ 309030 -158838 20264 -179246 164566 198248 -301837 88254 -250572 -236406 -231131 -35983
9474b73973a34865D7486P0016k3920b73831K9235Q4822q2295B9117a15849M8942
$$ -273973 -134865 47486 117502 93582 -273831 -244596 -159774 -242069 29117 -115849 -66907
9463f6907A07137a13905H007b18159g5019K6127p2961j76498J03844k6232C7950
$$ -66907 107137 -113905 8007 -218159 -75019 -48892 -121853 -298351 -194507 -220739 37950
9451E4768a01052m0342E8001b62846p1385J02572P3379L6931j21380a02090K293
$$ 54768 -101052 -141394 58001 -262846 -334231 -231659 -158280 -121349 -242729 -102090 -99797
9440i9797F6113M980a53542B9008c23189C0426a33923A28382a8936F9228A2737
$$ -99797 66113 71093 -153542 29008 -323189 30426 -133923 128382 -18936 69228 12737
9428A04906h0185r543j5211c4227j69616f7042k52605B3313f0148j30483I3028
$$ 104906 -80185 -89728 -104939 -34227 -203843 -67042 -319647 23313 -60148 -190631 93028
9416A61998a14226C2268d6733A74029I912a79495A16781a0564B33939k7150h5003
$$ 161998 -114226 32268 -46733 174029 9912 -179495 116781 -10564 233939 206789 -85003
9404c05855G7745c43411d531E9455a05165k32512o2697h0610c3941B51698g6383
$$ -305855 77745 -343411 -4531 59455 -105165 -337677 -400374 -80610 -33941 251698 -76383
9392c9560A21928g1615A12350J98075i9332l8879k5637O9534P282l5733b9746
$$ -39560 121928 -71615 112350 310425 -99332 -138211 -163848 -94314 -87032 -122765 -29746
9380I2796a5081K636A46711b21174k6368A6674a57404j44213A89763K53364n2743
$$ 92796 -15081 -12445 146711 -221174 -247542 16674 -157404 -301617 189763 443127 390384
9369C90384f6900J2512l2132o2457q8846A36687b37313k415A726b70192k1846
$$ 390384 -66900 -54388 -86520 -148977 -237823 136687 -237313 -239728 1726 -270192 -292038
9358b92038I20a63432e8899j43932e9811j04892j94954A52757a25058r2358Q9927
$$ -292038 920 -163432 -58899 -202831 -59811 -164703 -359657 152757 -125058 -217416 -127489
9347a27489C61343c84580C8730J7607i9461A27271c33887J43072P9751o9449g036
$$ -127489 361343 -384580 38730 56337 -99461 127271 -333887 -190815 -111064 -180513 -7036
9335c21330J01446e2956A00463D868J44755b21621E2982O6400a27883j10283d0678
$$ -321330 -219884 -52956 100463 4868 149623 -221621 52982 119382 -127883 -238166 -40678
9323e02659a23760k96392D0156R5256J18201a49921A3639e938r9644K9602J9379
$$ -502659 -123760 -420152 40156 135412 253613 -149921 13639 -5938 -105582 -75980 -56601
9312e6601I7770J85261C7978b30859A11825a81725C45678a32058K8133j95131
$$ -56601 97770 283031 37978 -230859 111825 -181725 345678 -132058 -103925 -299056
9302b99056B23636d8374k10806c5360j19585C46886a12682A1929a52954c5152
$$ -299056 223636 -48374 -259180 -35360 -154945 346886 -112682 11929 -152954 -35152
9291e74152a03005c5734c806j12968e6785g524j31161c6736A83700b26126A97031
$$ -574152 -103005 -35734 -3806 -116774 -56785 -7524 -138685 -36736 183700 -226126 197031
9279B04360l7554b20735i8566A60985a30860k13988P9897f9246D7690b00049o3974
$$ 204360 166806 -220735 -98566 160985 -130860 -344848 -264951 -69246 47690 -200049 -264023
9268b64023c1359B9795b00494K2620G7789a96643A909a36026j96786B257J62163
$$ -264023 -31359 29795 -200494 -177874 77789 -196643 1909 -136026 -332812 2257 164420
9257A64420F1947a80931e3320j45110k5285j66462J92103g5608A0598a34648M7569
$$ 164420 61947 -180931 -53320 -198430 -223715 -390177 -198074 -75608 10598 -134648 -87079
9246h7079A32694b24107B00873c34421B5855a78391E9418k4174c16539N7377O7306
$$ -87079 132694 -224107 200873 -334421 25855 -178391 59418 35244 -316539 -259162 -191856
9235a91856R994k17799J98414O6415j5544A36322b1936j29515N3003l8248d0211
$$ -191856 -181862 -399661 -201247 -134832 -150376 136322 -21936 -151451 -98448 -136696 -40211
9223a13948A61260F3989A7783J3667h7926F8624K62395a17204D9905a25611D9013
$$ -113948 161260 63989 17783 31450 -87926 68624 331019 -117204 49905 -125611 49013
9211e8468A64371P495R1914a2061m7216l26653i079l46214m7741J47827C51663
$$ -58468 164371 171866 263780 -12061 -59277 -385930 -9079 -355293 -403034 -255207 351663
9199d9175j74451d3778m8745l22472J5037B67486a47199j0607M1082I6839c6446
$$ -49175 -223626 -43778 -92523 -414995 -399958 267486 -147199 -157806 -116724 96839 -36446
9187B7161D833c1669B34116a8185j21079j0085H6863b18409m6957L9205A73946
$$ 27161 4833 -31669 234116 -18185 -139264 -149349 86863 -218409 -265366 -226161 173946
9175b347k36147f0556I5820a56350j7064k8037G8680q392a49403f4017k85754
$$ -2347 -238494 -60556 95820 -156350 -173414 -201451 78680 70288 -149403 -64017 -349771
9164c49771a05100C47782b07019L6061j75178a57934K3888K0216n84374B77162
$$ -349771 -105100 347782 -207019 -170958 -346136 -157934 -134046 -113830 -698204 277162
9153F2892K23539A10466J3376a12027G4654b65844a825j76916f6057j77480A8387
$$ 62892 286431 110466 123842 -112027 74654 -265844 -1825 -178741 -66057 -243537 18387
9141e7286l3974K9960E48739c70084H9533h0343C21783a16298j18258B64083a17313
$$ -57286 -91260 -61300 548739 -370084 89533 -80343 321783 -116298 -234556 264083 -117313
9129d0267p4141n0874A58255c8928I1414b55965a2466k22490a01477B03378d5338
$$ -40267 -114408 -165282 158255 -38928 91414 -255965 -12466 -234956 -101477 203378 -45338
9117d2959I0337N5426b70916e8751l6060M0866k24263D4213a02681b7741j55196
$$ -42959 90337 145763 -270916 -58751 -94811 -53945 -278208 44213 -102681 -27741 -182937
9106a82937A20983b04565g1256l4886j6301K5929j43731F3345B6591f5014j08884
$$ -182937 120983 -204565 -71256 -106142 -122443 -96514 -240245 63345 26591 -65014 -173898
9095a73898A07471g0253n11041C5575b785j0788r246j80063C62180f7817k7213
$$ -173898 107471 -70253 -581294 35575 -2785 -13573 -22819 -202882 362180 -67817 -95030
9084i5030j7931J0333o071I545J10435b48525C5597a78147k02279A69954a61327
$$ -95030 -112961 -102628 -108699 9545 119980 -248525 35597 -178147 -380426 169954 -161327
9072b06655R7705l9686l4487B59011a8893A15531j1172b70247L7965A47690n7354
$$ -206655 -108950 -148636 -183123 259011 -18893 115531 104359 -270247 -232282 147690 90336
9061I0336b83999J31451O831j0994C3212K20435F8803a9316m205B96878b86398
$$ 90336 -283999 -152548 -145717 -156711 33212 253647 68803 -19316 -23521 296878 -286398
9049b60797g6541k54666A30894b90936a04504j52361J06194e3957F1060O1528
$$ -260797 -76541 -331207 130894 -290936 -104504 -256865 -150671 -53957 61060 122588
9039A22588b23403A23770D3485a82653q8548g2531A19832M133c2792j15427k07318
$$ 122588 -223403 123770 43485 -182653 -271201 -72531 119832 123965 -32792 -148219 -355537
9028c55537a15859C1941c6471A9288b9744l99933G4808d8842M449k7980j03239
$$ -355537 -115859 31941 -36471 19288 -29744 -429677 74808 -48842 -44393 -72373 -175612
9017a75612J1414B53414r543b4597A7306c3438C3774a707o8936e197A22796A4436
$$ -175612 -164198 253414 243871 -24597 17306 -33438 33774 -1707 -70643 -5197 122796 14436
9004a86859C27951D2992i014j06370D4656a49891D23J02902a84010K1385A24343
$$ -186859 327951 42992 -9014 -115384 44656 -149891 423 103325 -184010 -162625 124343
8992D8779f1170I529b54600R1074k875N1983r7128d9330r4431d3750o3900j4221
$$ 48779 -61170 9529 -254600 -163526 -166401 -114418 -211546 -49330 -143761 -43750 -107650 -121871
8980a21871n9252J0007n846e9893j54790h5936K8163m8075a443l03814D9969Q3121
$$ -121871 -181123 -171116 -176962 -59893 -214683 -85936 -57773 -105848 -1443 -305257 49969 133090
8968A33090Q4689G6930h5456k01555a00745M7597l18206a69162B09657a48044
$$ 133090 217779 76930 -85456 -287011 -100745 -53148 -371354 -169162 209657 -148044
8957f4999k36000c8326p9077B12910b89184C31393j40072r1901A0851M4643d2766
$$ -64999 -300999 -38326 -117403 212910 -289184 331393 191321 99420 10851 55494 -42766
8945b20849E5954j9808a03714d1331C6003J6949b6384k19925C8684L5018N673
$$ -220849 55954 36146 -103714 -41331 36003 52952 -26384 -246309 38684 73702 79375
8934G9375J56979k1721j06689c47222j7139g0456a0115E5723A8458b43376B3425
$$ 79375 236354 214633 107944 -347222 -364361 -70456 -10115 55723 18458 -243376 23425
8922E3600Q4997P4748N5889G4144J8090O86709a691A41398C4170P1313h6330J5715
$$ 53600 138597 213345 269234 74144 92234 778943 -1691 141398 34170 105483 -86330 -70615
8910g0615r905A55230F8940i7758C9258b21115c3239l23361g9557H0266K6596
$$ -70615 -80520 155230 68940 -97758 39258 -221115 -33239 -356600 -79557 80266 106862
8899A06862a6472E3367a84364P7608B96284d23864J87965B7205N4272C9790c30795
$$ 106862 -16472 53367 -184364 -106756 296284 -423864 -235899 27205 81477 39790 -330795
8887F9981N3217f1181j13463g5996r6830P5615p1968H0819c41555J64473g5701
$$ 69981 123198 -61181 -174644 -75996 -172826 -97211 -169179 80819 -341555 -177082 -75701
8875B0994b69355g3564J3952k2381A14114O4745A1671g2203A05725a56626A8523
$$ 20994 -269355 -73564 -59612 -81993 114114 178859 11671 -72203 105725 -156626 18523
8863b48423A02811b71992a09848j58819g2713k19316h3107G2769P7747n1553a24346
$$ -248423 102811 -271992 -109848 -268667 -72713 -292029 -83107 72769 150516 98963 -124346
$$ [...]
##END NTUPLES=NMR SPECTRUM
##END=
