##TITLE=NES1049_872015078_9268765_7xj5IxsP2y
##JCAMPDX= 6.0         $$ Bruker NMR JCAMP-DX V2.0
##DATA TYPE= NMR SPECTRUM
##DATA CLASS= NTUPLES
##ORIGIN= BRUKER
##OWNER= Administrator
$$ 1.72 TOPSPIN		Version 2.1
$$ 2015-07-10 17:08:53.316 -0700  Administrator@X
$$ Compression mode = diff/dup
##.OBSERVE FREQUENCY= 400.02188249412
##.OBSERVE NUCLEUS= ^1H
##.ACQUISITION MODE= SIMULTANEOUS (DQD)
##.ACQUISITION SCHEME= undefined
##.AVERAGES= 8
##.DIGITISER RES= 22
##SPECTROMETER/DATA SYSTEM= spect
##.PULSE SEQUENCE= zg30
##.SOLVENT NAME= COFFEE_meoh
##.SHIFT REFERENCE= INTERNAL, COFFEE_meoh, 1, 14.98509
##AUDIT TRAIL= $$ (NUMBER, WHEN, WHO, WHERE, PROCESS, VERSION, WHAT)
$$ ##TITLE= Audit trail, TOPSPIN		Version 2.1
$$ ##JCAMPDX= 5.01
$$ ##ORIGIN= Bruker BioSpin GmbH
$$ ##OWNER= Administrator
$$ $$ E:\/data/COFFEE/nmr/NES1049_872015078_9268765_7xj5IxsP2y/10/pdata/1/auditp.txt
$$ ##AUDIT TRAIL=  $$ (NUMBER, WHEN, WHO, WHERE, PROCESS, VERSION, WHAT)
(   1,<2015-07-10 17:08:46.050 -0700>,<Administrator>,<X>,<go>,<TOPSPIN 2.1>,
      <created by zg
	started at 2015-07-10 17:07:39.800 -0700,
	POWCHK enabled, PULCHK disabled,
       configuration hash MD5:
       21 0F 79 D6 B3 7B B4 F6 88 20 88 DB 03 48 BD 9F
       data hash MD5: 64K
       F0 EF 5C 6A D8 72 F6 CC 8D 48 1C DB 6C E5 A8 29>)
(   2,<2015-07-10 17:08:49.222 -0700>,<Administrator>,<X>,<proc1d>,<TOPSPIN 2.1>,
      <Start of raw data processing
       efp LB = 0 FT_mod = 6 PKNL = 1 PHC0 = 0 PHC1 = 0 SI = 32K 
       data hash MD5: 32K
       45 D1 6B 79 49 FC 49 98 A7 0E E5 B0 A9 7E 8E 0E>)
(   3,<2015-07-10 17:08:49.503 -0700>,<Administrator>,<X>,<proc1d>,<TOPSPIN 2.1>,
      <pk PHC0 = 90.10986 PHC1 = 0 
       data hash MD5: 32K
       11 38 FB 63 98 A3 C5 8B 93 48 E1 7B DF A7 72 93>)
(   4,<2015-07-10 17:08:49.613 -0700>,<Administrator>,<X>,<proc1d>,<TOPSPIN 2.1>,
      <abs ABSG = 1 
       data hash MD5: 32K
       DF E9 2D 3E 09 31 26 9F 2A 05 DC BA CB 9C 23 4B>)
(   5,<2015-07-10 17:08:49.675 -0700>,<Administrator>,<X>,<proc1d>,<TOPSPIN 2.1>,
      <abs ABSG = 2 
       data hash MD5: 32K
       0E DE 61 D1 C6 47 1A 6A 74 EE 0A 5A 06 23 8A 97>)
(   6,<2015-07-10 17:08:49.738 -0700>,<Administrator>,<X>,<proc1d>,<TOPSPIN 2.1>,
      <abs ABSG = 3 
       data hash MD5: 32K
       64 E7 3B 60 BC 1A 40 8A C5 7E C8 67 2E A1 15 E0>)
(   7,<2015-07-10 17:08:49.785 -0700>,<Administrator>,<X>,<proc1d>,<TOPSPIN 2.1>,
      <abs ABSG = 4 
       data hash MD5: 32K
       2C 1C 37 8E 67 AB 80 E1 DB 8C 1A 52 FC 08 1B FD>)
(   8,<2015-07-10 17:08:49.847 -0700>,<Administrator>,<X>,<proc1d>,<TOPSPIN 2.1>,
      <abs ABSG = 5 
       data hash MD5: 32K
       F7 BD C7 B6 71 23 8E C2 6A 19 D7 13 EC E1 1E DE>)
$$ ##END=
$$ 
$$ $$ hash MD5
$$ $$ E1 88 EF 59 D1 91 C6 39 61 42 9E 8F 96 F8 A4 81
##$RELAX= 
##$RELAX= 
##$RELAX= 
##$RELAX= 
##$RELAX= 
##$RELAX= 
##$RELAX= 
$$ Bruker specific parameters
$$ --------------------------
##$DU= <E:\>
##$EXPNO= 10
##$NAME= <NES1049_872015078_9268765_7xj5IxsP2y>
$$ [...]
150 150 150 150 150 150 150 150
##$TP07= 0
##$TPNAME0= <>
##$TPNAME1= <>
##$TPNAME2= <>
##$TPNAME3= <>
##$TPNAME4= <>
##$TPNAME5= <>
##$TPNAME6= <>
##$TPNAME7= <>
##$TPOAL= (0..7)
0.5 0.5 0.5 0.5 0.5 0.5 0.5 0.5
##$TPOFFS= (0..7)
0 0 0 0 0 0 0 0
##$TUNHIN= 0
##$TUNHOUT= 0
##$TUNXOUT= 0
##$USERA1= <user>
##$USERA2= <user>
##$USERA3= <user>
##$USERA4= <user>
##$USERA5= <user>
##$V9= 5
##$VALIST= <valist>
##$VCLIST= <CCCCCCCCCCCCCCC>
##$VD= 0
##$VDLIST= <DDDDDDDDDDDDDDD>
##$VPLIST= <PPPPPPPPPPPPPPP>
##$VTLIST= <TTTTTTTTTTTTTTT>
##$WBST= 2048
##$WBSW= 25
##$XGAIN= (0..3)
0 0 0 0
##$XL= 0
##$YL= 0
##$YMAX_a= 597188
##$YMIN_a= -506474
##$ZGOPTNS= <>
##$ZL1= 120
##$ZL2= 120
##$ZL3= 120
##$ZL4= 120
##$ABSF1= 14.98509
##$ABSF2= -5.573092
##$ABSG= 5
##$ABSL= 3
##$ALPHA= 0
##$AQORDER= 0
##$ASSFAC= 0
##$ASSFACI= 0
##$ASSFACX= 0
##$ASSWID= 0
##$AUNMP= <proc_prof1d_extract_pilot.lims>
##$AXLEFT= 0
##$AXNAME= <>
##$AXNUC= <1H>
##$AXRIGHT= 0
##$AXTYPE= 0
##$AXUNIT= <>
##$AZFE= 0.1
##$AZFW= 0.1
##$BCFW= 0
##$BC_mod= 0
##$BYTORDP= 0
##$COROFFS= 0
##$CY= 15
##$DATMOD= 1
##$DC= 0
##$DFILT= <>
##$DTYPP= 0
##$F1P= 0
##$F2P= 0
##$FCOR= 0.5
##$FTSIZE= 32768
##$FT_mod= 6
##$GAMMA= 0
##$GB= 0
##$INTBC= 1
##$INTSCL= 1
##$ISEN= 128
##$LB= 0
##$LEV0= 0
##$LPBIN= 0
##$MAXI= 10000
##$MC2= 0
##$MEAN= 0
##$ME_mod= 0
##$MI= 0
##$NCOEF= 0
##$NC_proc= -8
##$NLEV= 6
##$NOISF1= 0
##$NOISF2= 0
##$NSP= 0
##$NTH_PI= 0
##$NZP= 0
##$OFFSET= 14.98509
##$PC= 1
##$PHC0= 90.10986
##$PHC1= 0
##$PH_mod= 1
##$PKNL= yes
##$PPARMOD= 0
##$PPDIAG= 0
##$PPIPTYP= 0
##$PPMPNUM= 2147483647
##$PPRESOL= 1
##$PSCAL= 4
##$PSIGN= 0
##$PYNMP= <proc.py>
##$REVERSE= no
##$SF= 400.02
##$SI= 32768
##$SIGF1= 0
##$SIGF2= 0
##$SINO= 400
##$SIOLD= 32768
##$SPECTYP= <>
##$SREGLST= <1H.CDCl3>
##$SSB= 0
##$STSI= 32768
##$STSR= 0
##$SW_p= 8223.68421052631
##$SYMM= 0
##$S_DEV= 0
##$TDeff= 65536
##$TDoff= 0
##$TI= <>
##$TILT= no
##$TM1= 0
##$TM2= 0
##$TOPLEV= 0
##$USERP1= <user>
##$USERP2= <user>
##$USERP3= <user>
##$USERP4= <user>
##$USERP5= <user>
##$WDW= 1
##$XDIM= 32768
##$YMAX_p= 440353788
##$YMIN_p= -678735
##$CURPLOT= <Network HP LaserJet P1505>
##$CURPRIN= <$Network HP LaserJet P1505>
##$DFORMAT= <normdp>
##$LAYOUT= <+/1D_H.xwp>
##$LFORMAT= <normlp>
##$PFORMAT= <normpl>
##$SURQMSG= 1
$$ End of Bruker specific parameters
$$ ---------------------------------
##NTUPLES= NMR SPECTRUM
##VAR_NAME=  FREQUENCY,     SPECTRUM/REAL,   SPECTRUM/IMAG
##SYMBOL=    X,             R,               I
##VAR_TYPE=  INDEPENDENT,   DEPENDENT,       DEPENDENT
##VAR_FORM=  AFFN,          ASDF,            ASDF
##VAR_DIM=   32768,         32768,           32768
##UNITS=     HZ,            ARBITRARY UNITS, ARBITRARY UNITS
##FACTOR=    0.250966925370066, 1,           1
##FIRST=     8223.43324360094, 5983,         -184176
##LAST=      0,             -27580,          -208463
##MIN=       0,             -678735,         0
##MAX=       8223.43324360094, 440353788,    0
$$ Real data points
##PAGE= N=1
##DATA TABLE= (X++(R..R)), XYDATA
$$ [...]
19502G3980a02629q2730A79476a51546A50102K1888J43681A20744B28b23050O0403
$$ 73980 -102629 -185359 179476 -151546 150102 171990 315671 120744 228 -223050 -162647
19491a62647B09196a04116d4638A14756J40128h1946k07391O2629o1959A19799
$$ -162647 209196 -104116 -44638 114756 254884 -81946 -289337 -226708 -288667 119799
19480C0147K04965a85035k96391I1187m3741R5082b6095j35253f7698A1649a89756
$$ 30147 235112 -185035 -481426 91187 47446 142528 -26095 -161348 -67698 11649 -189756
19468g4743j18152C6027a24939j33132a01098j83725h3401A11947a04298j24280
$$ -74743 -192895 36027 -124939 -258071 -101098 -284823 -83401 111947 -104298 -228578
19458b28578j96345G6517k6684g1557A9109a28613k0331J5345l6043e0558n8341
$$ -228578 -424923 76517 49833 -71557 19109 -128613 -148944 -133599 -169642 -50558 -108899
19447a08899K4324k90336C41829A33139a79981A332a17558c5390B57099f2775
$$ -108899 -84575 -374911 341829 133139 -179981 1332 -117558 -35390 257099 -62775
19436a51399A93595c19203C58016b57774L4002Q2602B04864B124M5436d34149
$$ -151399 193595 -319203 358016 -257774 -223772 -141170 204864 2124 47560 -434149
19425c9524A66047g1885q6165K8122J9851A7952b10176K6682A20607b57973N3668
$$ -39524 166047 -71885 -158050 -129928 -110077 17952 -210176 -183494 120607 -257973 -204305
19414b04305D7343e2576A93296E177J3884c37116B61952a53975D723h7444A76219
$$ -204305 47343 -52576 193296 5177 19061 -337116 261952 -153975 4723 -87444 176219
19402B8621b49940A60213d9926j5003j95438a7994j56637D10551I1680f7098C4122
$$ 28621 -249940 160213 -49926 -64929 -260367 -17994 -174631 410551 91680 -67098 34122
19390B33401C7929R3117h3953k85846c8963j9999m9178F2844K2543l9103D798
$$ 233401 37929 131046 -83953 -369799 -38963 -58962 -108140 62844 85387 46284 4798
19378e0307o0810j9932k2741D5984L5294a68993G0872b06135e7286B07333b60609
$$ -50307 -111117 -131049 -153790 45984 81278 -168993 70872 -206135 -57286 207333 -260609
19366a26354o4636O2480j61622C27608a27737j39693H852c212B08621e1786k9982
$$ -126354 -190990 -128510 -290132 327608 -127737 -267430 8852 -3212 208621 -51786 -81768
19355h1768j42006m6925a5953q1339F8411b63322D5704a28431j05541D0448A0528
$$ -81768 -223774 -270699 -15953 -97292 68411 -263322 45704 -128431 -233972 40448 10528
19343a33182N5496I4784k2921a88852B97823A33160L6435c2307j4608j12745m1692
$$ -133182 -77686 94784 71863 -188852 297823 133160 169595 -32307 -46915 -159660 -201352
19332b01352D08087d6365j57649j5875C4915a19018B29081b04618I6018e8188
$$ -201352 408087 -46365 -204014 -219889 34915 -119018 229081 -204618 96018 -58188
19321b10111c3620k53034b0884G3332a83584P9894B63078b26324h8260r5201N3955
$$ -210111 -33620 -286654 -20884 73332 -183584 -103690 263078 -226324 -88260 -183461 -129506
19310a29506q2346J04285N172d9831k1996A8982b74985m2155N3105O6536j3734
$$ -129506 -211852 -107567 -102395 -49831 -71827 18982 -274985 -317140 -264035 -197499 -211233
19299b11233q6898B6173J7707f6962K5506B1726d4858j58767g4023n652j88370
$$ -211233 -298131 26173 43880 -66962 -41456 21726 -44858 -203625 -74023 -79675 -268045
19288b68045a13979j80599j0158E983d0320l58442D6637a62218B73336D643b74283
$$ -268045 -113979 -294578 -304736 5983 -40320 -398762 46637 -162218 273336 4643 -274283
19276B70410D636a59687f370C15641I7335f9563A26596b4500k74667A61591B104
$$ 270410 4636 -159687 -6370 315641 97335 -69563 126596 -24500 -299167 161591 2104
19264A11854a295C11768b27062a8897C3222e6075n8933e6441D6854a32287H5784
$$ 111854 -1295 311768 -227062 -18897 33222 -56075 -115008 -56441 46854 -132287 85784
19252A63181a02002E5678O9582b2840j80050o5616B78383b43333h4879A81739
$$ 163181 -102002 55678 125260 -22840 -202890 -268506 278383 -243333 -84879 181739
19241b57926N9205j25595E1925a37728b4A65490a14399a7188j60356n7943h6752
$$ -257926 -198721 -324316 51925 -137728 -24 165490 -114399 -17188 -177544 -235487 -86752
19229D0733b22297A43442E0176b13915b9471A7476a64134A24339l6494c67306
$$ 40733 -222297 143442 50176 -213915 -29471 17476 -164134 124339 87845 -367306
19218b67109A85877C8345b58088a4384j95627q1714A73519h2941k63130a37180
$$ -267109 185877 38345 -258088 -14384 -210011 -291725 173519 -82941 -346071 -137180
19207C1028a54174M4627j60044c6442j82630N9186H380b38871g8738E9881Q313
$$ 31028 -154174 -109547 -269591 -36442 -219072 -159886 8380 -238871 -78738 59881 68194
19196F8194J37442m1885G1076a8468A56451b6145C7525b14769C1420a65990J9625
$$ 68194 205636 163751 71076 -18468 156451 -26145 37525 -214769 31420 -165990 -146365
19185a46365E8917a99886K6977A263a546A89987o7901f5469k63738q3855K01191
$$ -146365 58917 -199886 -172909 1263 -1546 189987 122086 -65469 -329207 -413062 -211871
19174b11871h2096o0341A35848l7394A8664b63976C3503n241N9713N4632g7780
$$ -211871 -82096 -142437 135848 98454 18664 -263976 33503 28262 87975 142607 -77780
19162g1519L1341j47606g9900m7503c0630o6780F0631g003j82720B134N5557L0490
$$ -71519 -40178 -187784 -79900 -127403 -30630 -97410 60631 -7003 -189723 2134 57691 88181
19150H8181h2483j89295Q2414K8694A21046P6982b16885f5264A79845a36997f6102
$$ 88181 -82483 -271778 -189364 -160670 121046 198028 -216885 -65264 179845 -136997 -66102
19138b68723B121a30084C4625a0885l3293a5571H7915E894J26937a22170c3045
$$ -268723 2121 -130084 34625 -10885 -44178 -15571 87915 5894 132831 -122170 -33045
19126C34944a2479j88681j26353J55387O3348B75024F3702B0028e3170p9963A48845
$$ 334944 -12479 -201160 -327513 -172126 -108778 275024 63702 20028 -53170 -133133 148845
19114I3124d27604A82848q0428K57184a77934h0111m407d451H1050J9744a96092
$$ 93124 -427604 182848 102420 359604 -177934 -80111 -84518 -4451 81050 100794 -196092
19102d21273a04310c1630C5597e1776b3981D6344a59894d8352L0k35708i7363
$$ -421273 -104310 -31630 35597 -51776 -23981 46344 -159894 -48352 -48322 -284030 -97363
19090B25645a38636G9065M471a21007A56222a27051A52548g3025I2747l3885c5343
$$ 225645 -138636 79065 83536 -121007 156222 -127051 152548 -73025 92747 58862 -35343
19078A07535b62972a24072j3038j33750a5308A96335c02323J19066A14247J800
$$ 107535 -262972 -124072 -137110 -270860 -15308 196335 -302323 -183257 114247 116047
19068A16047a90775j58517a40783O1821p9896M6719p5101l04174A01248c24781
$$ 116047 -190775 -349292 -140783 -78962 -158858 -112139 -187240 -491414 101248 -324781
19057A49191M1212d6709j83637e1945F0898c54102B18575I9329e2730D3744K6768
$$ 149191 190403 -46709 -230346 -51945 60898 -354102 218575 99329 -52730 43744 70512
19046G0512a33316a8382q4770B9222b03457B43129a68580A43269c66278J79188
$$ 70512 -133316 -18382 -103152 29222 -203457 243129 -168580 143269 -366278 -187090
19036a87090A45322b20529E6849d3498D5083a71293A94070a49861A02720A7910
$$ -187090 145322 -220529 56849 -43498 45083 -171293 194070 -149861 102720 17910
19025C3206L22684d6297I7180a07399I7318i2297A19689a66145A53232E5165g9969
$$ 33206 355890 -46297 97180 -107399 97318 -92297 119689 -166145 153232 55165 -79969
19013E726N3571J22007a55135O6913k14533a23276j7405C35526a33413H0824k6525
$$ 5726 59297 181304 -155135 -88222 -302755 -123276 -140681 335526 -133413 80824 54299
19002E4299k1824a35917M2308G5525J3831a04638A82783a94B76060F6546d68481
$$ 54299 32475 -135917 -93609 75525 89356 -104638 182783 -194 276060 66546 -468481
18990b056j42380A35799A3402c16169F4437a75388l7810E5026J85145a61476C0798
$$ -2056 -144436 135799 13402 -316169 64437 -175388 -213198 55026 240171 -161476 30798
18978E7594a88646P0887K4525j75830A93887b35972J5305A31563J56134c3988
$$ 57594 -188646 -117759 -93234 -269064 193887 -235972 -220667 131563 287697 -33988
18967d9489I6240c09029H1872f2396A05218N0685J57978a07785b2723B95349c48403
$$ -49489 96240 -309029 81872 -62396 105218 155903 313881 -107785 -22723 295349 -348403
18955B0655g1711k08415A15448b50968o4763F4757B327g7421j43219A11078D0154
$$ 20655 -71711 -280126 115448 -250968 -315731 64757 2327 -77421 -220640 111078 40154
18943B02739A260L63786c42501a9954j01415q0321C5109J50870a83039q7012B83425
$$ 202739 1260 365046 -342501 -19954 -121369 -201690 35109 185979 -183039 -270051 283425
18931i5644j43073b1107j2753B0196J07805M5559a24268n7915E634a59121A66394
$$ -95644 -238717 -21107 -33860 20196 128001 173560 -124268 -182183 5634 -159121 166394
18919d5301j69311H8431a94085L4697f5245j19023F8439Q6618b81791J39247P0885
$$ -45301 -214612 88431 -194085 -159388 -65245 -184268 68439 155057 -281791 -142544 -71659
18908g1659c5148j35122j5494k6509Q9177C44343a39537f9083A61123b19954f6511
$$ -71659 -35148 -170270 -185764 -212273 -123096 344343 -139537 -69083 161123 -219954 -66511
18896c11100J45533A19240i8774j26365B56204b58013B1103b25095b3695l9434
$$ -311100 -165567 119240 -98774 -225139 256204 -258013 21103 -225095 -23695 -63129
18886f3129L1435A30808a99829i6047R564A02621h0897B95605o4958d8820B0483
$$ -63129 -31694 130808 -199829 -96047 -86483 102621 -80897 295605 230647 -48820 20483
18874g3626j04018L0960Q934a3662n4725a8407j4626q667p9219G1523J11686d36821
$$ -73626 -177644 -146684 -137750 -13662 -68387 -18407 -33033 -41700 -120919 71523 183209 -436821
18861a95888e4762j69640C24190a16037A32831K54198a14416A23088e101F4174
$$ -195888 -54762 -224402 324190 -116037 132831 387029 -114416 123088 -5101 64174
18850i9974E6394a68414l8324f3761b9139H6402N4412b15006h970I5254K60198
$$ -99974 56394 -168414 -206738 -63761 -29139 86402 140814 -215006 -8970 95254 355452
18839C55452b73388b0876j29461A87417e8270K899B51673i5888d2209I8414d0295
$$ 355452 -273388 -20876 -150337 187417 -58270 -55371 251673 -95888 -42209 98414 -40295
18827e8183K5423D0437A5540a86099A86928h1822A03971b39112C2874h3781n4004
$$ -58183 -32760 40437 15540 -186099 186928 -81822 103971 -239112 32874 -83781 -137785
18816a37785A20156C1238R6365b76193G0091K62264F9397a44098K1105B36612
$$ -137785 120156 31238 127603 -276193 70091 332355 69397 -144098 -122993 236612
18805C60206a54078A9608K4913h601n603C41581B7399J7340e7913j7587B88765
$$ 360206 -154078 19608 44521 -8601 -14204 341581 27399 44739 -57913 -75500 288765
18793f6076I0204M7357c48322B73918c09478a13450K6152j39568c5002j9995J4058
$$ -66076 90204 137561 -348322 273918 -309478 -113450 -87298 -226866 -35002 -54997 -40939
18782d0939A36138f8232A53266a49157A87592c8772k87194j79920a64428A01668
$$ -40939 136138 -68232 153266 -149157 187592 -38772 -325966 -505886 -164428 101668
18771c23207O2977d0693k749o677k6452l5858b8038r0744m8179j41201C02461
$$ -323207 -260230 -40693 -43442 -50119 -76571 -112429 -28038 -118782 -166961 -308162 302461
18759G2130a33538B21721b09484g5538n3653J3535M7338A28619L7613m9327D6721
$$ 72130 -133538 221721 -209484 -75538 -129191 -115656 -68318 128619 166232 116905 46721
18747B6384A3140D715a40073j83539A30627L4288B6340a21971o2362o8915B55682
$$ 26384 13140 4715 -140073 -323612 130627 164915 26340 -121971 -184333 -253248 255682
18735a39304q1312A99640a11358c1829D3804K3349J54470c9j17561j08911a5660
$$ -139304 -220616 199640 -111358 -31829 43804 67153 221623 -39 -117600 -226511 -15660
18723h1875C2885c727C23911i5515C08617a54724A7084J29314G2379J22508c02762
$$ -81875 32885 -3727 323911 -95515 308617 -154724 17084 146398 72379 194887 -302762
18711a39325l2744P4460j70232A55033o9225d6558N086O761h61j33063j54188
$$ -139325 -172069 -97609 -267841 155033 85808 -46558 -41472 -34711 -861 -133924 -288112
18700b88112B4465a49584k18851d8179A37425a74450j16866O4021C9955a46789
$$ -288112 24465 -149584 -368435 -48179 137425 -174450 -291316 -227295 39955 -146789
18689a7245k14027j10516A59036a21333j5716j24679D3126k055K8577d9184n2587
$$ -17245 -231272 -341788 159036 -121333 -137049 -261728 43126 41071 69648 -49184 -101771
18678a01771C461J37439c54469J46813Q5996A00214e0150A07111a99888a1841
$$ -101771 3461 140900 -354469 -207656 -121660 100214 -50150 107111 -199888 -11841
18667H3632a1914j78543G3598d5822k30345j46541a51864A49497a58364J6870
$$ 83632 -11914 -190457 73598 -45822 -276167 -422708 -151864 149497 -158364 -141494
18657a41494m4365n6153r1579A88995a84153I5621a22861B00082a65798G0626
$$ -141494 -185859 -242012 -333591 188995 -184153 95621 -122861 200082 -165798 70626
18646d7455o8897f472B21538f6994j75363j902B85367a0214A0593a9214o9545
$$ -47455 -116352 -6472 221538 -66994 -242357 -244259 285367 -10214 10593 -19214 -88759
18635h8759E5113M2653c19857A2985a62621K5270a6672G2582d2104k64022a9050
$$ -88759 55113 97766 -319857 12985 -162621 -137351 -16672 72582 -42104 -306126 -19050
18623b16946G9274e37828h7813K6030C45619h6833L3254B60047d42900J82229
$$ -216946 79274 -537828 -87813 -61783 345619 -86833 -53579 260047 -442900 -260671
18613b60671P0544j9541j0070J5483d8665l61784J37118n069a9358j90590P2148
$$ -260671 -190127 -209668 -219738 -204255 -48665 -410449 -273331 -278400 -19358 -209948 -137800
18602a37800a9543j52808B72697e0612j92671A08913O1322a86296E7854c0617
$$ -137800 -19543 -172351 272697 -50612 -243283 108913 170235 -186296 57854 -30617
18591b7794A33393b23152b1044l11744j0096A29626d6107j51969E1897a61220
$$ -27794 133393 -223152 -21044 -332788 -342884 129626 -46107 -198076 51897 -161220
18580b25300R5963q7076B35962a13819C79939d39545H5623c4989m3990G4766b7298
$$ -225300 -129337 -216413 235962 -113819 379939 -439545 85623 -34989 -78979 74766 -27298
18568a99184q5542a06604b5931m5677B03370q0488c04885B3602a06130b2165A67657
$$ -199184 -284726 -106604 -25931 -71608 203370 122882 -304885 23602 -106130 -22165 167657
18556a20605A67719G0227h0276j03092r0168a5853B01180a44250B29812f5691
$$ -120605 167719 70227 -80276 -183368 -273536 -15853 201180 -144250 229812 -65691
18545A35904o402d8773k3750K9833j0690n5719j6946A18521I863J90817l1937
$$ 135904 129502 -48773 -72523 -42690 -53380 -109099 -126045 118521 9863 200680 168743
18534A68743b14617K3215P2229B21193E0710g9165k32623R2280B84491a0889p2297
$$ 168743 -214617 -191402 -119173 221193 50710 -79165 -311788 -219508 284491 -10889 -83186
18523h3186o5186A38315j0308a14289b4247k09614A07402a07747j04369F2941
$$ -83186 -148372 138315 128007 -114289 -24247 -233861 107402 -107747 -212116 62941
18512f343l1029q9064C87619A9850K8262J4525a29389R108M7017o235A4396K5317
$$ -6343 -37372 -126436 387619 19850 48112 62637 -129389 -120281 -73264 -79499 14396 39713
18500C9713K85857i5702M6226D0430d46048J67411N5013b7170j76293A48753b47
$$ 39713 325570 -95702 -49476 40430 -446048 -278637 -223624 -27170 -203463 148753 -247
18488a55320M8864k3507N6072o0117G8366a91878A22280b46070a10264J5372d4568
$$ -155320 -106456 -129963 -73891 -134008 78366 -191878 122280 -246070 -110264 -94892 -44568
18476h6864k01362f4925l35244a9823G8403C3615g1742K3633n1024A66664a4924
$$ -86864 -288226 -64925 -400169 -19823 78403 33615 -71742 -48109 -99133 166664 -14924
18464A66918a69042A89882d0398m72896b03666g726G4909b09040O3310C5954b0719
$$ 166918 -169042 189882 -40398 -513294 -203666 -7726 74909 -209040 -145730 35954 -20719
18452a31495B5686b25835h7812G3657a7152j05254l7832A90189h9102J6865A23110
$$ -131495 25686 -225835 -87812 73657 -17152 -122406 -160238 190189 -89102 -72237 123110
18440B81455B7806e769A48380n8498k5019a26610e9229l705A07437a58028B46736
$$ 281455 27806 -5769 148380 89882 64863 -126610 -59229 -62934 107437 -158028 246736
18428B40034q5004A3524L497M9264j4157n973b27411D4756e7531C1247c40016
$$ 240034 155030 13524 17021 66285 52128 46155 -227411 44756 -57531 31247 -340016
18416a3009l8499C8561b9244B9548Q4377M9720b207p8195o5448A48736F5691Q6594
$$ -13009 -51508 38561 -29244 29548 113925 163645 -2207 -80402 -145850 148736 65691 152285
18404A52285C5827d0514o4978B35791a35131A49440e7229I2057a16662j9948e0847
$$ 152285 35827 -40514 -105492 235791 -135131 149440 -57229 92057 -116662 -136610 -50847
18392C1571a56906c1840j21685A02114c6334r9953q607L9542P602J719C6924c6424
$$ 31571 -156906 -31840 -153525 102114 -36334 -136287 -144894 -105352 -97750 -96031 36924 -36424
18379B16401C6407P170b9900B4246K6930b4379k60693B51517D0974A6510B071
$$ 216401 36407 43577 -29900 24246 51176 -24379 -285072 251517 40974 16510 2071
18367C8653b02059g4390k33335A47821C1319b95299N4458j5252A65727a27723
$$ 38653 -202059 -74390 -307725 147821 31319 -295299 -240841 -256093 165727 -127723
18356b44691A14696a82921f4823b5357p2035o7501d3420j715a4471j77033C13849
$$ -244691 114696 -182921 -64823 -25357 -97392 -164893 -43420 -45135 -14471 -191504 313849
18344B89734b40502G7039b7184E6406b462G9810p716a12589B47196b49706Q7963
$$ 289734 -240502 77039 -27184 56406 -2462 79810 72094 -112589 247196 -249706 -161743
18333a61743k417r5722f8888r0002r3945i0089j15202A04975c7836q2515A02599
$$ -161743 -164160 -259882 -68888 -158890 -252835 -90089 -205291 104975 -37836 -120351 102599
18321a3535q8960E9683J06392J1440g653A20950J8771d41674A24317j8003E1854
$$ -13535 -102495 59683 166075 177515 -7653 120950 139721 -441674 124317 106314 51854
18309A24061D0875R175a65117b2467E911a71076A24688R103b65451B4211L00392
$$ 124061 40875 50050 -165117 -22467 5911 -171076 124688 133791 -265451 24211 324603
18298C24603c2188A45797b93465A05438A3148a80525g9708a8585F2140a69663
$$ 324603 -32188 145797 -293465 105438 13148 -180525 -79708 -18585 62140 -169663
18287F3446k9945b04857i1437j21779c429G9561d8975l33129f6763l4581k24198
$$ 63446 33501 -204857 -91437 -213216 -3429 79561 -48975 -382104 -66763 -101344 -325542
18276c25542C1977i9109A33984b37044B5285i2923B09087M1086a89713O1180l9457
$$ -325542 31977 -99109 133984 -237044 25285 -92923 209087 250173 -189713 -128533 -167990
18265a67990D3701j7907K24105A07029f8985q5530A1727a40368P0144F4562Q2651
$$ -167990 43701 25794 249899 107029 -68985 -154515 11727 -140368 -70224 64562 147213
18254A47213a50438j29202d27A31568d313m6001F596J80350B6832a20500j01710
$$ 147213 -150438 -279640 -427 131568 -4313 -50314 6596 186946 26832 -120500 -222210
18243b22210G4938c05325A66355C8348K03524b61395d5993D6978a16858N394A06169
$$ -222210 74938 -305325 166355 38348 241872 -261395 -45993 46978 -116858 -111464 106169
18231h6389O775B62694m9792O4723b96507B45011h2998C6721b0350A16680b53977
$$ -86389 -79614 262694 212902 277625 -296507 245011 -82998 36721 -20350 116680 -253977
18219E2052a16216j4955q6439j1756H4318J26069n8104J22021K02332b89739A31121
$$ 52052 -116216 -131171 -217610 -229366 84318 210387 152283 274304 476636 -289739 131121
18207C0900a67909A4453b9735B49121A08640c05880q8461a04680K7933F7088B9649
$$ 30900 -167909 14453 -29735 249121 108640 -305880 -394341 -104680 -76747 67088 29649
18195A27920L813I826M8200b38622j68526a03714F3796i6846j85336F2708O5041
$$ 127920 131733 9826 58026 -238622 -407148 -103714 63796 -96846 -282182 62708 127749
18184A27749F913a47874P621B42490g4653B6827P923a59403A09629f465H18a9463
$$ 127749 6913 -147874 -140253 242490 -74653 26827 34750 -159403 109629 -6465 818 -19463
18171a61441A20679a8427A06782R7756c4482C4915Q644d6906m51509J02714a80480
$$ -161441 120679 -18427 106782 204538 -34482 34915 43559 -46906 -498415 -395701 -180480
18159B9837O9004A2489b34230A15756d6101D7540c3573n6418c3976j53368o7817
$$ 29837 98841 12489 -234230 115756 -46101 47540 -33573 -89991 -33976 -187344 -255161
18148b55161m934F5051c50496A80199b25312E5262A4434a44812e0716B15982p4803
$$ -255161 -260095 65051 -350496 180199 -225312 55262 14434 -144812 -50716 215982 141179
18137A41179d21009b9762A07997a542I6788J2544b36844i5466k38084h5432B35180
$$ 141179 -421009 -29762 107997 -1542 96788 109332 -236844 -95466 -333550 -85432 235180
18125I3576O2152m9662i2150K5190J4396q5622M9786I2560e7225k90509G2740
$$ 93576 155728 106066 -92150 -66960 -52564 -138186 -88400 92560 -57225 -347734 72740
18113I7034i2222j58952C94407A31287h9891B34399c0596G2924a93488P1143N6641
$$ 97034 -92222 -251174 394407 131287 -89891 234399 -30596 72924 -193488 -122345 -65704
18102f5704B18159d37045a97103A70330K1278A8025P6598a43183A26593J93389
$$ -65704 218159 -437045 -197103 170330 191608 18025 94623 -143183 126593 319982
18092C19982d1455e897q1419B81023h1279D8441c50665A79619b61165g4695A11804
$$ 319982 -41455 -5897 -87316 281023 -81279 48441 -350665 179619 -261165 -74695 111804
18080D0382c02401C58107f2323A21779a91795Q5525d7386B65115a29200k10051
$$ 40382 -302401 358107 -62323 121779 -191795 -106270 -47386 265115 -129200 -339251
18070c39251d1364r4685A00577l1907a86189j02229A09111b1340C2783h5864A28255
$$ -339251 -41364 -136049 100577 68670 -186189 -288418 109111 -21340 32783 -85864 128255
18058a71251j40725J25270b7577j42855A0011i895p4718c532G8285J9842A1452
$$ -171251 -311976 -186706 -27577 -170432 10011 -9895 -84613 -3532 78285 98127 11452
18046D8460j2832a20099A00959f4611q6962A27303d8313D7409b8336K875D0310
$$ 48460 35628 -120099 100959 -64611 -151573 127303 -48313 47409 -28336 -25461 40310
18034C84849a45580e4810B3927K9253K23979b66481D3337d7898r8153A1857b18065
$$ 384849 -145580 -54810 23927 53180 277159 -266481 43337 -47898 -146051 11857 -218065
18022c73241B9867i0635G7126b00877O5631F705c70764H3420b12107E7177K297
$$ -373241 29867 -90635 77126 -200877 -135246 6705 -370764 83420 -212107 57177 59474
18011E9474j4137a2820n6958C1140a03310M3882I1488g3233I388J40573f8315
$$ 59474 45337 -12820 -69778 31140 -103310 -59428 91488 -73233 9388 149961 -68315
17999A25622D0624e5502n1287B50866E496R7714g9153D7692d0633A58256C417
$$ 125622 40624 -55502 -106789 250866 5496 103210 -79153 47692 -40633 158256 3417
17987A57945C0927J35389P9066A19742a04135F8740c9898j38851e5157r9010F3707
$$ 157945 30927 166316 245382 119742 -104135 68740 -39898 -178749 -55157 -154167 63707
17975a25350B6373a94053M6265j20953a02090Q773k01173B42696d9916m9608G8312
$$ -125350 26373 -194053 -147788 -268741 -102090 -93317 -294490 242696 -49916 -99524 78312
17963i6611k64190B52596e226m82686a68932C1935O9241Q1461q6063b58237A13779
$$ -96611 -360801 252596 -5226 -487912 -168932 31935 101176 182637 96574 -258237 113779
17951I5190a14900D3363i4888J6994I603J60815b06954D1895a02470k6038I1452
$$ 95190 -114900 43363 -94888 -77894 9603 170418 -206954 41895 -102470 -128508 91452
17939f0773B14617a7376C3874J96949q6817b62981G6366f2742I4783e6436G8916
$$ -60773 214617 -17376 33874 230823 144006 -262981 76366 -62742 94783 -56436 78916
17927d62234D05168d2761j28272P4430A55461D5850g9409j08172e8261A65359
$$ -462234 405168 -42761 -171033 -96603 155461 45850 -79409 -187581 -58261 165359
17916f3242j72499A36034n7000K19118a58496n6015c7436a4137E8335F069K72800
$$ -63242 -235741 136034 79034 298152 -158496 -214511 -37436 -14137 58335 6069 278869
17905B78869a36961A29917b90736C0295J05J26735d1744l25310g206A95065G3609
$$ 278869 -136961 129917 -290736 30295 30400 157135 -41744 -367054 -7206 195065 73609
17893D8772b44617d3979o0109E3386j8329b03672A71591a18273b2126A10366B6227
$$ 48772 -244617 -43979 -104088 53386 35057 -203672 171591 -118273 -22126 110366 26227
17881E4535J32248J63047c33933a53430L7871B27693D5726a02464A1262a79537
$$ 54535 186783 349830 -333933 -153430 -115559 227693 45726 -102464 11262 -179537
17870b26775A25842J1880j6344C284a26843F4028J8958k5415a33772e5553a2867
$$ -226775 125842 137722 121378 3284 -126843 64028 82986 57571 -133772 -55553 -12867
17858e13554J59180G484g5897B25242b7368E3124Q6686K65927G4939c9752r5965
$$ -513554 -354374 7484 -75897 225242 -27368 53124 139810 405737 74939 -39752 -135717
17847a35717A39499P5417f5442F8769L8437h1876H8817a80979D1653R6591C8020
$$ -135717 139499 214916 -65442 68769 107206 -81876 88817 -180979 41653 138244 38020
17835G4041J16542J11792E7047a51562B69812d5502B39246C3764J71660B1387
$$ 74041 190583 302375 57047 -151562 269812 -45502 239246 33764 205424 21387
17824a7366A46914j1774K66816F2145a46490B73279c6146j67098J453C255J47390
$$ -17366 146914 135140 401956 62145 -146490 273279 -36146 -203244 -201791 3255 150645
17813A50645A7778b34312g0096E5772J20181d12176H5980a20607B5727b00126
$$ 150645 17778 -234312 -70096 55772 175953 -412176 85980 -120607 25727 -200126
17802c7816G2180c2440A32604a78241J3057I4092j405Q2100a11118F5826j4218
$$ -37816 72180 -32440 132604 -178241 -165184 94092 92687 174787 -111118 65826 51608
17791E1608a84538j17405J27120J5853C70397I3617G97a07159L4253j01649O1120
$$ 51608 -184538 -301943 -174823 -158970 370397 93617 797 -107159 -72906 -174555 -113435
17780a13435f375j13333A98361N9559a36516A08728J22695a72285M3908A69763
$$ -113435 -6375 -119708 198361 257920 -136516 108728 231423 -172285 -128377 169763
17769B39434L2104j33227h0766A53735a45210M0368q8769A54564a30585I148K41032
$$ 239434 271538 138311 -80766 153735 -145210 -104842 -193611 154564 -130585 9148 250180
17758B50180j14196J14663b26923g1562m1445c8455C55703a46429b5240G4581
$$ 250180 135984 250647 -226923 -71562 -113007 -38455 355703 -146429 -25240 74581
17747a84702q6293A74575L7185f77G0490a46063L1097k4382H9656a22191K6293
$$ -184702 -270995 174575 211760 -677 70490 -146063 -114966 -139348 89656 -122191 -95898
17736i5898D3685J65427a41923D0461a06676M8351l3112B249d19644A78476d982
$$ -95898 43685 209112 -141923 40461 -106676 -58325 -91437 2249 -419644 178476 -4982
17724b27174E3134J8136g1390A10058J350J08386O7528j23512A4550P3579R116
$$ -227174 53134 71270 -71390 110058 111408 219794 287322 163810 14550 88129 97245
17713I7245Q4288k4456r540J31116C1861P3098D7469a12297A83356p5703J65769
$$ 97245 181533 157077 147537 278653 31861 104959 47469 -112297 183356 107653 273422
17702B73422a09434B26726C1617d2128k06156E6706b44845C73353c5968j75064
$$ 273422 -109434 226726 31617 -42128 -248284 56706 -244845 373353 -35968 -211032
17692b11032H8195a63570q6709A87772a75308a0484B71868a49472b1688A68003
$$ -211032 88195 -163570 -250279 187772 -175308 -10484 271868 -149472 -21688 168003
17681a70588C32751F3780L19708A73588J14796H3328R7141a43301h191A66489
$$ -170588 332751 63780 383488 173588 288384 83328 180469 -143301 -8191 166489
17670A41561b30172a6841B31496L4441b23882I9227C536a13690b9286A73602K79732
$$ 141561 -230172 -16841 231496 265937 -223882 99227 3536 -113690 -29286 173602 453334
17659D53334B10783J37179G6365b33072H1801a1182A87845p9422b27206B73920
$$ 453334 210783 347962 76365 -233072 81801 -11182 187845 108423 -227206 273920
17648A75199P9901o8966I0118m1191K67720F4714a24677D84544a52915A15707
$$ 175199 255100 186134 90118 48927 316647 64714 -124677 484544 -152915 115707
17637B66762G4862L161a82564j32100B83376p9149k2761F1504Q7093d6626A98128
$$ 266762 74862 78023 -182564 -314664 283376 204227 181466 61504 148597 -46626 198128
17625f763A15834h881G4305h0154A75338B1175K63683F3718k0956L5022J44463
$$ -6763 115834 -8881 74305 -80154 175338 21175 284858 63718 42762 77784 222247
17614B22247j245k4721b65890A63954K3325a20648A01339L29548B10633J06895
$$ 222247 221002 196281 -265890 163954 187279 -120648 101339 430887 210633 317528
17604C17528d4584D4699J25946i0781A64040K10915d6674A94900o7122L97952
$$ 317528 -44584 44699 170645 -90781 164040 374955 -46674 194900 127778 525730
17594E25730D05M8117J9882K30784L7099k2424F3531c41319f4860C62816a0402
$$ 525730 405 48522 68404 299188 336287 313863 63531 -341319 -64860 362816 -10402
17582A28059N2552p877Q9409h1901k7696A57538b29882A6432K70075j13905A7790
$$ 128059 180611 172734 262143 -81901 -109597 157538 -229882 16432 286507 172602 17790
17570A39036A9703a68772B87680D0881K90618G732J36758M19462d0291L462A6493
$$ 139036 19703 -168772 287680 40881 331499 7732 144490 563952 -40291 -36829 16493
17558B37268r2246j1211e6144m2212k14086A42016J10929A7078a38422B85378
$$ 237268 145022 133811 -56144 -98356 -312442 142016 252945 17078 -138422 285378
17547F8939b12706i250I8525J54321K20134D0659a72326B19921a3526A7291J38611
$$ 68939 -212706 -9250 98525 252846 472980 40659 -172326 219921 -13526 17291 155902
17536A55902C9782P1593k9604J85665j06888K7507I1194J80771A21469P617L51994
$$ 155902 39782 111375 81771 267436 160548 188055 91194 271965 121469 129086 481080
17525D81080g8691B18358p9423l3108L76727A1691M42599A46724j7051K08616
$$ 481080 -78691 218358 138935 105827 482554 11691 454290 146724 129673 338289
17515C38289l0654a96610B68444C0633b55202A14999k7558a69126F4183J97477
$$ 338289 307635 -196610 268444 30633 -255202 114999 87441 -169126 64183 261660
17505B61660a14823F59578C00896n3174I858Q5750N4386P5333a43239F0389a03319
$$ 261660 -114823 659578 300896 247722 9858 95608 149994 225327 -143239 60389 -103319
17493i3377D2235K21479A31694a68550C35966G6605J52760a05092B68179G7295
$$ -93377 42235 263714 131694 -168550 335966 76605 229365 -105092 268179 77295
17482A60172p3352g0156C771a25608b9933B23729j7283Q6056F9831J13708M9538
$$ 160172 86820 -70156 3771 -125608 -29933 223729 206446 292502 69831 183539 233077
17471B33077K9567A04328d7527A46393J33676f5162B27911o7225K2210P1792j6762
$$ 233077 262644 104328 -47527 146393 280069 -65162 227911 160686 182896 254688 237926
17460B37926o0878k0814b9819A24533K97267A24596J81245o7280p1399J12540
$$ 237926 177048 156234 -29819 124533 421800 124596 305841 238561 167162 279702
17450B79702j1457J03356a6969A95155l8489K77063O8016B42947l8431o5224K955
$$ 279702 268245 371601 -16969 195155 156666 433729 501745 242947 204516 139292 142247
17439A42247C3806L09574G7646J02451Q30F2912A3242c686B29297L03678k17546
$$ 142247 33806 343380 77646 180097 180927 62912 13242 -3686 229297 532975 315429
17428C15429D3853J337b9215G8831K6244J232O06251A24286K54555A31904L0066
$$ 315429 43853 45190 -29215 78831 105075 106307 712558 124286 378841 131904 161970
17417A61970M5895p9707J6679K63784A08875K20121A52050L22192A87763a77813
$$ 161970 207865 128158 144837 408621 108875 328996 152050 474242 187763 -177813
17406C9067K01489n6127Q576J52192A58953a03397B61949g6087k9933A77927J99707
$$ 39067 240556 184429 193005 345197 158953 -103397 261949 -76087 -106020 177927 377634
17395C77634G1933N6705N5397l6833l96n9002J0628K10048j12131J64580A32828
$$ 377634 71933 128638 184035 147202 146806 87804 98432 308480 196349 360929 132828
17383G6662M0896J37586N6958q5891a14098k64209A60532a00897C60264G8493
$$ 76662 117558 255144 312102 226211 -114098 -378307 160532 -100897 360264 78493
17372B28434b8781C59836A27228J18052E5191h8705j47117B54294l6470g0113
$$ 228434 -28781 359836 127228 245280 55191 -88705 -235822 254294 217824 -70113
17361A31992M01826e6192K513A25046f203F3998K31516r3957i4313I398Q7910
$$ 131992 533818 -56192 -53679 125046 -6203 63998 295514 201557 -94313 9398 97308
17350I7308f715m4288A40476P6420A00282Q7236d9816C20368K35348k73108D1532
$$ 97308 -6715 -51003 140476 216896 100282 187518 -49816 320368 555716 282608 41532
17338F0865Q5496d9955A19718K25895N3425A95950K02126A86888N906D9827P0598
$$ 60865 146361 -49955 119718 345613 399038 195950 398076 186888 192794 49827 120425
17327A20425i0490B27738q8555e2595j15376C10674r9184C2210K17724q5086K9462
$$ 120425 -90490 227738 139183 -52595 -167971 310674 211490 32210 249934 164848 194310
17316A94310H8892K28668A7480J28444I740a57697A59125q147a7381C18999p9828
$$ 194310 88892 317560 17480 145924 9740 -157697 159125 150978 -17381 318999 239171
17305B39171j2064Q180J4619D3098E091b25853B24429n9840E3720L00534A69080
$$ 239171 227107 235287 249906 43098 5091 -225853 224429 164589 53720 354254 169080
17293E17778D0540J16743J75368f4813Q202A62591J37409o3799J9675r4126B9128
$$ 517778 40540 157283 332651 -64813 -56611 162591 300000 236201 255876 161750 29128
17281C91396G8598J89537j1546l4904B9345P2619a17597C69269G9850K81086r1584
$$ 391396 78598 268135 256589 221685 29345 101964 -117597 369269 79850 360936 269352
17270B69352d4860n6582B37377p8195M11301A64907K01632p3889j07586O2056
$$ 269352 -44860 -101442 237377 159182 570483 164907 366539 292650 185064 247120
17260B47120L22144a97041C6770J48873K0412a28857B07680B037a10269C50699
$$ 247120 569264 -197041 36770 185643 206055 -128857 207680 2037 -110269 350699
17249I0481O7863L1915K37737A29838L31974B28083k3226k2547k9785K3223J15555
$$ 90481 158344 190259 427996 129838 461812 228083 204857 182310 152525 175748 291303
17238B91303p4191J95265j41240Q1340j54027D7173K51359A9142K31356j3250
$$ 291303 217112 412377 271137 352477 198450 47173 298532 19142 250498 237248
17228B37248O2322j06064K74M217N2718A02091J81361J39160A18127E2523L48225
$$ 237248 299570 193506 193780 197997 250715 102091 283452 422612 118127 52523 400748
17217D00748A89966J11609J24712A21239K37702J3494A70029R1192Q296l3677
$$ 400748 189966 301575 426287 121239 358941 372435 170029 261221 269517 235840
17207B35840J59739p5745n4886j5683k9663K41358r1417A79700F5409P1033J25173
$$ 235840 395579 319834 264948 249265 219602 460960 369543 179700 65409 136442 261615
17196B61615i2211A30085J0771K40698m5175L233K523p04o8310o3211p1559M58587
$$ 261615 -92211 130085 140856 381554 336379 339612 342135 341431 273121 209910 138351 596938
17184E96938j46906A46503F2949L86892P7093A25209L59433A05644L17278B09526
$$ 596938 450032 146503 62949 449841 526934 125209 484642 105644 422922 209526
17173A90964M22950k62716p9718K61423j51276O4629K90717C43048j24380L56748
$$ 190964 613914 351198 271480 532903 381627 446256 736973 343048 218668 575416
17163E75416B67414J95873B5592N35772B77400N3515C0206L75853J63864P4427
$$ 575416 267414 463287 25592 561364 277400 330915 30206 406059 569923 644350
17153F44350j97858r4466K0896F6126K31387n2434j3931N1737K33862n2062J17690
$$ 644350 446492 352026 372922 66126 297513 245079 231148 282885 516747 464685 582375
17142E82375a6985F08731A36832K92906A41596M25141B20719J38319K87300k90877
$$ 582375 -16985 608731 136832 429738 141596 566737 220719 359038 646338 355461
17132C55461l9849K00452j72472K13968j66994j54018J57447j69127J32749j39484
$$ 355461 315612 516064 343592 557560 390566 236548 393995 224868 357617 218133
17122B18133L17970B62937P8487j63968J23503j38244L78088O6519k06391j50178
$$ 218133 536103 262937 341424 177456 300959 162715 540803 607322 400931 250753
17112B50753K58504B51418J87025K81148k30465j31803K36044r4180o0454l4377
$$ 250753 509257 251418 438443 719591 489126 357323 593367 499187 438733 404356
17102D04356M6665K23995B35521N45963k67718B16857K52352P1256j14776K28075
$$ 404356 451021 675016 235521 781484 513766 216857 469209 540465 425689 653764
17092F53764B39507J6668L15752k17123L56519C29420R5307l5953r1934L31721
$$ 653764 239507 256175 571927 354804 711323 329420 424727 388774 296840 628561
17082F28561N0900K6526q1135m4541k1030k29455M693L14737J14653A48548J29340
$$ 628561 679461 705987 624852 580311 559281 329826 334519 649256 763909 148548 277888
17071B77888L69996n6286M8447j23292H3694O41887k41770l0931j4137N7642J28451
$$ 277888 647884 591598 640045 516753 83694 725581 483811 452880 438743 496385 624836
17060F24836j4405j07990K25080k27228K66946A72424L99661B54192P490K88486
$$ 624836 610431 502441 727521 500293 767239 172424 572085 254192 261682 550168
17050E50168N1814L32541m53605J05148L31875k30260J96470k61128L3426K4651
$$ 550168 601982 934523 480918 586066 917941 687681 884151 623023 656449 681100
17040F81100k86763K57411k92230K16536P9818R2660k60221L94560N160k54875
$$ 681100 394337 651748 359518 576054 655872 748532 488311 882871 888031 633156
17030F33156n880K71012k4835J2356k1956l03226M04178M5944l0246l6319o1939
$$ 633156 627276 898288 873453 885809 863853 560627 964805 1010749 980503 944184 882245
17019H82245l25807M04408k91981r3444J27348N09370m23595o2594Q3104M1543
$$ 882245 556438 960846 668865 575421 702769 1212139 788544 725950 809054 850597
17009H50597O5130r0138P1353k0661K60652N0074j85184Q4886n8003k60850J17617
$$ 850597 915727 825589 896942 876281 1136933 1187007 1001823 1086709 1028706 767856 885473
16998H85473L33523q8070l39032L15528k97055O1364K83119l36541K53245j62089
$$ 885473 1218996 1130926 791894 1107422 810367 871731 1154850 818309 1071554 909465
16988I09465j52409K08490Q2629j57633K63118j37144L4642J49516J84607k50464
$$ 909465 757056 965546 1048175 890542 1153660 1016516 1051158 1200674 1385281 1134817
16978A134817L3910k7104k28432M25726l67681L00533m3391k18759L74760k50629
$$ 1134817 1168727 1141623 913191 1338917 971236 1271769 1228378 1009619 1384379 1133750
16968A133750K41675j68175j75080K85292j61822q4637M59767l09104j09825L07320
$$ 1133750 1375425 1207250 1032170 1317462 1155640 1071003 1530770 1221666 1111841 1419161
16958A419161p1508P3384J44633l11583K86008l2845j1951J09783q0537J79992
$$ 1419161 1347653 1421037 1565670 1254087 1540095 1507250 1495299 1605082 1524545 1704537
16948A704537L0916l50249L57548j84697j72385K39195l227L3732j24414K87093
$$ 1704537 1735453 1385204 1742752 1558055 1385670 1624865 1621638 1655370 1530956 1818049
16938A818049m98444J82286J66322M6983R477j63443K26516l6029j49363R3949
$$ 1818049 1319605 1501891 1668213 1715196 1724673 1561230 1787746 1751717 1602354 1696303
16928A696303N0809j16141K38753o3792R0305N6443j92634L1184O5576K79832
$$ 1696303 1747112 1630971 1869724 1805932 1896237 1952680 1760046 1791230 1856806 2136638
16918B136638m419n893j56945J49361j52838K34188M9533k36400L79774k87443
$$ 2136638 2132219 2126326 1969381 2118742 1965904 2200092 2249625 2013225 2392999 2105556
16908B105556Q5851p8984K62308j64378J43460j65783l902J5041K11849p3886
$$ 2105556 2191407 2112423 2374731 2210353 2353813 2188030 2184128 2199169 2411018 2337132
16898B337132K12052L9077p7901J86295j57150K98952k70637K040K60299j55428
$$ 2337132 2549184 2588261 2510360 2696655 2539505 2838457 2567820 2569860 2830159 2674731
16888B674731m5827L98799L39852j07680k50576q457m0750k28703O50105l7679
$$ 2674731 2628904 3027703 3367555 3259875 3009299 3000842 2960092 2731389 3381494 3343815
16878C343815K46119L8908k71486J35075J32770n8429j35337M36934j65287L3600
$$ 3343815 3589934 3628842 3357356 3492431 3625201 3566772 3431435 3868369 3703082 3736682
16868C736682M91036m24298K56011n249j01901L19827j10755n5713N7488k28361
$$ 3736682 4227718 3803420 4059431 4054182 3952281 4272108 4161353 4105640 4163128 3934767
16858C934767P90951l17950L94488k18927M74873j20376n1360K59454J77305m4506
$$ 3934767 4725718 4407768 4802256 4583329 5058202 4937826 4886466 5145920 5323225 5278719
16848E278719q0498R6631M5332l5711M73199J70363J77744j21448L7467N7872
$$ 5278719 5198221 5294852 5340184 5304473 5777672 5948035 6125779 6004331 6041798 6099670
16838F099670K2719M45244j76622M68354q4893J88938n5495M48706K954N02876
$$ 6099670 6122389 6567633 6391011 6859365 6774472 6963410 6907915 7356621 7359575 7862451
16828G862451n11868O89099M6181J68652n3895J77521L69457K14679K01159K66003
$$ 7862451 7350583 8039682 8085863 8254515 8200620 8378141 8747598 8962277 9163436 9429439
16818I429439Q4152J88084N25349k04714K81734M93764K59616L27780J51958N52268
$$ 9429439 9513591 9701675 10227024 10022310 10304044 10797808 11057424 11385204 11537162 12089430
16808A2089430M11836R0630L52737J13373L13254N76269K79007M76707L72485
$$ 12089430 12501266 12591896 12944633 13058006 13371260 13947529 14226536 14703243 15075728
16799A5075728M86417N48747K5343N45124O61036M58933K21657O50184P11416
$$ 15075728 15562145 16110892 16136235 16681359 17342395 17801328 18022985 18673169 19384585
16790A9384585Q30102N32325M99994L64009N77432R54532P03383Q64835J042903
$$ 19384585 20214687 20747012 21247006 21611015 22188447 23142979 23846362 24711197 25754100
16781B5754100M47126R50871J233585Q45823Q34584R57651Q92387J090127J211076
$$ 25754100 26201226 27152097 28385682 29231505 30066089 31023740 31916127 33006254 34217330
16772C4217330J397958J608778J135537J452736J100770J590516J704734J649497
$$ 34217330 35615288 37224066 38359603 39812339 40913109 42503625 44208359 45857856
16764D5857856J757246J638255J710183J801930K184108K258349K198073K078939
$$ 45857856 47615102 49253357 50963540 52765470 54949578 57207927 59406000 61484939
16756F1484939K132218K444579K705487K214241K886277K143192K662075K811369
$$ 61484939 63617157 66061736 68767223 70981464 73867741 76010933 78673008 81484377
16748H1484377K449827K856116K474618K823132K786093K630954J829420K587542
$$ 81484377 83934204 86790320 89264938 92088070 94874163 97505117 99334537 101922079
16740A01922079K078843K219990J614369J704219J670820J230188O61668M00878
$$ 101922079 104000922 106220912 107835281 109539500 111210320 112440508 113102176 113503054
16732A13503054M23245J18799j16142q45043o44983q79387j336729j572957j783351
$$ 113503054 113926299 114045098 113928956 113083913 112438930 111559543 110222814 108649857 106866506
16723A06866506k280161j814208k054385k482930k538763k429817k709036k461553
$$ 106866506 104586345 102772137 100717752 98234822 95696059 93266242 90557206 88095653
16715H8095653k411158k929928k541998k709644k503403k363742k223960k630890
$$ 88095653 85684495 82754567 80212569 77502925 74999522 72635780 70411820 67780930
16707F7780930k574326j785229k451224j636028k588388j778580k141744j782712
$$ 67780930 65206604 63421375 60970151 59334123 56745735 54967155 52825411 51042699
16699E1042699j284430j763023j701120j606829j422096j454813j633679j336436
$$ 51042699 49758269 47995246 46294126 44687297 43265201 41810388 40176709 38840273
16691C8840273j035223j355472j017767r03817j408468j049319j007385j061568
$$ 38840273 37805050 36449578 35431811 34527994 33119526 32070207 31062822 30001254
16683C0001254o73069q24982n27199j204908q02507n84643n96577o91681j125095
$$ 30001254 29328185 28503203 27976004 26771096 25968589 25383946 24787369 24095688 22970593
16674B2970593m02084l44666n84676p30383n44931n02029n52857m66850m97449
$$ 22970593 22568509 22223843 21639167 20908784 20363853 19861824 19308967 18842117 18344668
16665A8344668n52158m21879m70318l02198r1418m02846o82346l09811n31384
$$ 18344668 17792510 17370631 16900313 16598115 16506697 16103851 15421505 15111694 14580310
16656A4580310o7001r1912j86577l04868p19288j68656j66531m71448n0584n49465
$$ 14580310 14513309 14421397 14234820 13929952 13210664 13042008 12875477 12404029 12353445 11803980
16646A1803980P677k36010l59289M5352k99693m64888K70959p67025L8006l78008
$$ 11803980 11811657 11575647 11216358 11261710 10962017 10497129 10768088 10001063 10039069 9661061
16636I661061J75294m46456k7535J37402m95058j26382n67122K51582j83976K15166
$$ 9661061 9836355 9389899 9362364 9499766 9004708 8878326 8311204 8562786 8378810 8593976
16626H593976l66850l67218K9096j24982j75019J67902l98461j04868m52681K74232
$$ 8593976 8227126 7859908 7889004 7764022 7589003 7756905 7358444 7253576 6800895 7075127
16616G075127l20242J93628m44636M28276l86196n32211K82791P8514k44443P7969
$$ 7075127 6754885 6948513 6503877 6932153 6545957 6013746 6296537 6375051 6130608 6208577
16606F208577L180n87140L73498l83969R7768m48870N36276l61757j02039k1864
$$ 6208577 6211757 5624617 5998115 5614146 5711914 5263044 5799320 5437563 5335524 5313660
16596E313660N2090l43761Q9246O6553k39360j88432J85442J25279l95545l83406
$$ 5313660 5365750 5021989 5111235 5177788 4938428 4749996 4935438 5060717 4665172 4281766
16586D281766L23934k47190J11660j89373J11733j65685j32081k52414L74985
$$ 4281766 4605700 4358510 4470170 4280797 4392530 4226845 4094764 3842350 4217335
16577D217335l11722q1703L71928k01950R2779j69032k46750J05500J64223l39161
$$ 4217335 3905613 3823910 4195838 3993888 4086667 3917635 3670885 3776385 3940608 3601447
16567C601447q9462O8626k2130j27766J65361j07712m6805l691k55275J60021
$$ 3601447 3511985 3580611 3558481 3430715 3596076 3488364 3441559 3437868 3182593 3342614
16557C342614J11511l65296K48533l44778j82604M94920r7945R2600j15188J74742
$$ 3342614 3454125 3088829 3337362 2992584 2809980 3304900 3206955 3299555 3184367 3359109
16547C359109l90053j1725k52711J84497k0432N6193K38403k82703l5719j51694
$$ 3359109 2969056 2957331 2704620 2889117 2868685 2924878 3163281 2880578 2844859 2693165
16537B693165L59756J5609l64608P4370k88807M23706K55123p41355j05801L36617
$$ 2693165 3052921 3068530 2703922 2778292 2489485 2913191 3168314 2426959 2321158 2657775
16527B657775J53798k54549k19052K13539j86933L19467O1977n62110j14379N16959
$$ 2657775 2811573 2557024 2337972 2551511 2364578 2684045 2746022 2183912 2069533 2586492
16517B586492j52019k63709r2079L92277j11228l7448R681J57854j34231l56257
$$ 2586492 2434473 2170764 2078685 2470962 2359734 2322286 2331967 2489821 2355590 1999333
16507A999333j8455L88100L0740j80077l4687k9596J19462l42068K12298q0612
$$ 1999333 1980878 2368978 2399718 2219641 2184954 2155358 2274820 1932752 2145050 2064438
16497B064438r884j61496R5004K11371k97077J25078R769m20146J32262K41086
$$ 2064438 2054554 1893058 1988062 2199433 1902356 2027434 2037203 1617057 1749319 1990405
16487A990405j95862K2000j81853L37890j37097M18491l72542j92783J56911j41235
$$ 1990405 1794543 1816543 1634690 1972580 1835483 2253974 1881432 1688649 1845560 1704325
16477A704325L39017j37213J7774n2210m7371j56797J97544j14383m4083j89764
$$ 1704325 2043342 1906129 1923903 1871693 1824322 1667525 1865069 1750686 1706603 1516839
16467A516839L89138k40385J2184K64625O6173l02723o0347p7441L25650Q2553
$$ 1516839 1905977 1665592 1677776 1942401 2008574 1705851 1645504 1568063 1893713 1976266
16457A976266l00965j25280J22156K5921J86312j19252k24009N3168J62591n82
$$ 1976266 1675301 1550021 1672177 1698098 1884410 1765158 1541149 1594317 1756908 1756326
16447A756326J05368l83618n711Q9890K64014k46328k00048k6288P8522J26990
$$ 1756326 1861694 1478076 1472365 1562255 1826269 1579941 1379893 1353605 1432127 1559117
16437A559117N7906k11673N8231j37883K48796L5647j53018J2155R4106L8559
$$ 1559117 1617023 1405350 1463581 1325698 1574494 1610141 1457123 1469278 1563384 1601943
16427A601943O190n81306L91723K78849m810j40440k89723J38047R7118r248o1307
$$ 1601943 1608133 1026827 1418550 1697399 1692589 1552149 1262426 1400473 1497591 1488343 1427036
16416A427036J21909j96079J33564m6513N7011j93413j57708J57673j95195N7961
$$ 1427036 1548945 1352866 1486430 1439917 1496928 1303515 1145807 1303480 1108285 1166246
16406A166246J67997K86012m49029O9640L62011j30620l84413L50916j15589O9085
$$ 1166246 1334243 1620255 1171226 1240866 1602877 1472257 1087844 1438760 1323171 1392256
16396A392256l90548L14994l89731L62286L5629k57032K3999P3038K5776J47412
$$ 1392256 1001708 1316702 926971 1289257 1324886 1067854 1091853 1164891 1190667 1338079
16386A338079K04763k28846N3386l84051L25668j63691K19067j66203K30495l55012
$$ 1338079 1542842 1313996 1367382 983331 1308999 1145308 1364375 1198172 1428667 1073655
16376A073655j12576L23188M8660r8378k8396j12394J93329K78532k58112J36568
$$ 1073655 961079 1284267 1332927 1234549 1206153 1093759 1287088 1565620 1307508 1444076
16366A444076k55656j99729L93855l06129L6996M9166K98330q9104j43302o2523
$$ 1444076 1188420 988691 1382546 1076417 1113413 1162579 1460909 1371805 1228503 1165980
16356A165980k38507K24555P6289L26309l65086O5130k28166K9161L29079n71473
$$ 1165980 927473 1152028 1228317 1554626 1189540 1254670 1026504 1055665 1384744 813271
16346H13271K04002P0983J8558J24080k83297K16454j51740k89514J41962L04850
$$ 813271 1017273 1088256 1106814 1230894 947597 1164051 1012311 722797 864759 1169609
16336A169609q4348R07N6016l61859N43725o5299l76250j35650J76838K91775
$$ 1169609 1085261 1086168 1142184 780325 1324050 1258751 882501 746851 923689 1215464
16326A215464j39491k879j44480O8381N5584J71899l51442M5871J62011p1933
$$ 1215464 1075973 1073094 928614 996995 1052579 1224478 873036 918907 1080918 1008985
16316A008985o5719k8878j74181K56793j47222N7078J10429j21261p4090L38834
$$ 1008985 943266 914388 740207 997000 849778 906856 1017285 896024 821934 1160768
16306A160768m07750J56920q3438J94473j10944J81654l14151j1964L72475j43985
$$ 1160768 753018 909938 826500 1020973 910029 1091683 777532 765568 1138043 994058
16296I94058O3554k06461K89993j45093j2175q382j44975J68915L8443K99704
$$ 994058 1057612 851151 1141144 996051 983876 975494 830519 999434 1037877 1337581
16286A337581m04072j1459K72862l77407k73879K19676K43639j7395J13767m8145
$$ 1337581 933509 922050 1194912 817505 543626 763302 1006941 989546 1103313 1055168
16276A055168k16360M56411n55295K82056k6756r6482R7233n2289k92273L51681
$$ 1055168 838808 1295219 739924 1021980 995224 898742 995975 943686 651413 1003094
16266A003094l53738j25101L53481k47791J23188q4755r2730K87689k5464k29858
$$ 1003094 649356 524255 877736 629945 753133 668378 575648 863337 837873 608015
16256F08015K06518K18763M6180r7720j60322k28173L96637m55858L29507l76409
$$ 608015 814533 1033296 1079476 981756 821434 593261 989898 534040 863547 487138
16246D87138K73913j83979N09881k77020j67677N3903L53518k03172r3417k80704
$$ 487138 761051 577072 1086953 809933 642256 696159 1049677 846505 753088 472384
16236D72384L06460M7591j14561n7664j60940J93945M25533l98820L72065C58353
$$ 472384 778844 826435 711874 654210 493270 687215 1112748 713928 1085993 358353
16225G07026J27093j16612k95946K79767j70022J4499J68495k05361K17557C49432
$$ 707026 834119 717507 421561 701328 531306 545805 714300 508939 726496 349432
16214H06933j49944Q9766k09845M23757M8102m61815J44258J52512B48201L10560
$$ 806933 656989 746755 536910 960667 1008769 546954 691212 843724 248201 558761
16204E58761o9455M92060k46617l04228r9211K83568P3722j70440J59202j1515
$$ 558761 489306 981366 734749 430521 331310 614878 688600 518160 677362 665847
16194F65847j68837L1021N3111j77277M41776k91729q8515J58111N8198J54307
$$ 665847 497010 528031 581142 403865 845641 553912 465397 623508 681706 836013
16184H36013l34159O4583l6901j11599K71050C39441L02664J88597j10283p9113
$$ 836013 501854 566437 529536 417937 688987 339441 642105 830702 720419 641306
16174F41306j31763K90721q3747C32995L36139j12444P1480P2304k58113p527
$$ 641306 509543 800264 716517 332995 669134 556690 628170 700474 442361 434834
16164D34834A45989O32603j20390n1727k0646k47261K32639k5411j38669N3196
$$ 434834 145989 778592 658202 606475 585829 338568 571207 545796 407127 460323
16154D60323L69364D13919M84722m32498J75855a42425A35911O9131P0592q813
$$ 460323 829687 413919 898641 466143 641998 -142425 135911 205042 275634 266821
16144B66821J87054J68231l05256K3826N5601m0345r9754K5764J48619O9448B14434
$$ 266821 453875 622106 316850 340676 396277 355932 256178 281942 430561 500009 214434
16132B71979k2028I5746K91683A49522J85963J25331J97564M3957l14985q2358
$$ 271979 249951 95746 387429 149522 335485 460816 658380 702337 387352 304994
16122C04994J15115I2047J76258D4722L90210k08865J75374n7523J47837A86047
$$ 304994 420109 92047 268305 44722 434932 226067 401441 343918 491755 186047
16111C87698B1733L57555o9191N1608J69884A60953J95959p6721q6399J72145
$$ 387698 21733 379288 310097 361705 531589 160953 356912 280191 193792 365937
16101C65937Q4408A42764K26286A65591J68381J69178A23786L64272j12772j05077
$$ 365937 450345 142764 369050 165591 333972 503150 123786 488058 375286 270209
16091B70209J5911a39209A72709L48629A23987i217D84491o0033L8348j85661
$$ 270209 286120 -139209 172709 521338 123987 -9217 484491 424458 462806 277145
16081B77145H9119j002C3503J18264N2303J28093j43866k2798J37986F4408J18572
$$ 277145 89119 88117 33503 151767 204070 332163 188297 165499 303485 64408 182980
16070A82980c133F0131K73845j30589g9388G4567K72961J60693a4053A50345j4321
$$ 182980 -3133 60131 333976 203387 -79388 74567 347528 508221 -14053 150345 136024
16059A36024J27542J2291j04310O1270p1969a02076A90813J52951n1474J55951
$$ 136024 263566 275857 171547 232817 160848 -102076 190813 343764 292290 448241
16049D48241a4387A03696B4123K54329J29062j41728N566J11522j14594p605b2954
$$ 448241 -14387 103696 24123 278452 407514 265786 271352 382874 268280 260675 -22954
16037C23842k0732A7061c4661E22730B19449A1828L56913a34297j78678P8243
$$ 323842 303110 17061 -34661 522730 219449 11828 368741 -134297 -312975 -234732
16027b34732E7749a82808D2261h0107B38812K2759J58105D8948a78690B42553
$$ -234732 57749 -182808 42261 -80107 238812 261571 419676 48948 -178690 242553
16016A60181J14778K36420A08797R371K04973l7332m1221B7166b1399A24888f5866
$$ 160181 274959 511379 108797 118168 323141 285809 244588 27166 -21399 124888 -65866
16004D44227j37064q4839H4835f2445C8868J56490M4211M7351c00844A16395a88544
$$ 444227 307163 222324 84835 -62445 38868 195358 239569 286920 -300844 116395 -188544
15992D9996a07169C22652m2227A31996m2400J22275J03364K51197n0206M7609
$$ 49996 -107169 322652 280425 131996 89596 211871 315235 566432 516226 563835
15982E63835j2206k01790A17857K52328a01032D82424e5281B93142K10795G9186
$$ 563835 551629 349839 117857 370185 -101032 482424 -55281 293142 503937 79186
15971C01686l5620A07338J44459c35136A64319a00245A36019J1254F2992a67439
$$ 301686 266066 107338 251797 -335136 164319 -100245 136019 147273 62992 -167439
15960d2795A02736k0732A6155J22839J59304J79672b2968A35660k2712C4397J76956
$$ -42795 102736 82004 16155 138994 298298 477970 -22968 135660 112948 34397 211353
15949B11353B8318Q4165M36401A16297b48316h8932E2156b72977D17511a30554
$$ 211353 28318 112483 548884 116297 -248316 -88932 52156 -272977 417511 -130554
15938F8969K59253q9464H0603J7352A9126O5876b35972C62773A35672m6952j5319
$$ 68969 328222 238758 80603 97955 19126 85002 -235972 362773 135672 88720 73401
15927G3401L0012l2161e8548H3291C2156K27679a43786C4800A4842M3510a1735
$$ 73401 103413 71252 -58548 83291 32156 259835 -143786 34800 14842 58352 -11735
15915f3955A56991l3413O1776I926P5357f9334D32136C4604K23843L0923A01619
$$ -63955 156991 123578 185354 9926 85283 -69334 432136 34604 258447 289370 101619
15903A62601l6199G704a65854A49078e8357B47487F4545j6697e6235A627J83991
$$ 162601 126402 7704 -165854 149078 -58357 247487 64545 47848 -56235 1627 185618
15892A85618G4897K04546b48454G2105L9327c42951G1775l5475J74558f0765F5387
$$ 185618 74897 279443 -248454 72105 111432 -342951 71775 36300 210858 -60765 65387
15880b6837G6468L4021c4862F566J27584M1877a16580j61382R2416A35333K04801
$$ -26837 76468 110489 -34862 6566 134150 176027 -116580 -277962 -185546 135333 340134
15869C40134j57745B823d7613N600k2295A70177k6437A0018a301F9880e9299A48657
$$ 340134 182389 2823 -47613 -42013 -64308 170177 143740 10018 -1301 69880 -59299 148657
15856B49969e601B04980o4391J83967j50694d07627a34777N2030a4753j41033
$$ 249969 -5601 204980 140589 324556 173862 -407627 -134777 -82747 -14753 -155786
15846a55786A3404a69513P5177B88162g0750d329A32523k2350g6121j39019n9311
$$ -155786 13404 -169513 -94336 288162 -70750 -4329 132523 110173 -76121 -215140 -274451
15835b74451a36189A88497a78977p2538A66379m2626n1629l5074J09149a40647
$$ -274451 -136189 188497 -178977 -251515 166379 123753 72124 37050 146199 -140647
15824a40901K686D9093a86728A30094d6992H5662K43298b88272B1240c34904a66989
$$ -140901 -138215 49093 -186728 130094 -46992 85662 328960 -288272 21240 -334904 -166989
15812A70536a22599G6292b4313m01560i7470j22492g0705q4222B81320D2139c10392
$$ 170536 -122599 76292 -24313 -425873 -97470 -219962 -70705 -154927 281320 42139 -310392
15800a26246A54496A2969E504J16724a65107e8141B18087c40872A55223A9834
$$ -126246 154496 12969 5504 122228 -165107 -58141 218087 -340872 155223 19834
15789A279K90601F8725b96601P9326A58203a55542A25030J51906b25400A44951
$$ 1279 291880 68725 -296601 -217275 158203 -155542 125030 276936 -225400 144951
15778i6281M7343j14826B07358L4380o8855d2353l5007A70026d0728j0337A95666
$$ -96281 -48938 -163764 207358 241738 172883 -42353 -77360 170026 -40728 -51065 195666
15766A62433a53364j36437c6058B08193b23608J1042A40942b6588j08257K12C63720
$$ 162433 -153364 -289801 -36058 208193 -223608 -212566 140942 -26588 -134845 -134633 363720
15754A22474B1650K25123b64256O034P9110O0478M4855j03770A98159L8418H6729
$$ 122474 21650 246773 -264256 -258222 -179112 -118634 -73779 -177549 198159 236577 86729
15742A77458a82067c8873A8558J03077b35250p6724d8685o6064G0724a42288e6777
$$ 177458 -182067 -38873 18558 121635 -235250 -311974 -48685 -114749 70724 -142288 -56777
15730a41305r6060H7972d339C5097J30732m3056P7418b28355N9434A46337a10688
$$ -141305 -237365 87972 -4339 35097 165829 122773 200191 -228355 -168921 146337 -110688
15718i3997r3263e6960k37777c5119p6917o3168Q6760C991b23158n9084a12417
$$ -93997 -187260 -56960 -294737 -35119 -112036 -175204 -88444 3991 -223158 -282242 -112417
15706E7729M1247P1479a24310O0389j58336a9504A06369f4232A21058J99011d3408
$$ 57729 98976 170455 -124310 -63921 -222257 -19504 106369 -64232 121058 320069 -43408
15694D1857a16154d1278A61524L1885m487q2065M1664L7289d024j70895B02979
$$ 41857 -116154 -41278 161524 193409 188922 106857 148521 185810 -4024 -174919 202979
15682d0984A16513M2017i2730n6199n6015C0897a06740C14494d0944j20196C59351
$$ -40984 116513 158530 -92730 -148929 -204944 30897 -106740 314494 -40944 -161140 359351
15670H3296e5238o9269A8354c99445J38097G2903M6583b47650k00836A31712h7962
$$ 83296 -55238 -124507 18354 -399445 -261348 72903 119486 -247650 -448486 131712 -87962
15658A52387d7539E9772K13533e5614P326a7090j03080j03771q4118b1060I7731
$$ 152387 -47539 59772 273305 -55614 -48288 -17090 -120170 -223941 -308059 -21060 97731
15646b2361o5497a7775B21956a5833B23427a46j17129N4339j44538A11556J36285
$$ -22361 -87858 -17775 221956 -15833 223427 -146 -117275 -62936 -207474 111556 247841
15635B47841d0527J8917j9433j17246A73271a26621A78110g5793k79854J15114
$$ 247841 -40527 -21610 -41043 -158289 173271 -126621 178110 -75793 -355647 -240533
15625b40533B2349a72234j54795A04608a579l0344A19339J6728R3260o5246g2771
$$ -240533 22349 -172234 -327029 104608 -1579 -31923 119339 136067 229327 164081 -72771
15613A52777M557R0901b56404A23855d9764j4411A96367i7534A68009a01474j24152
$$ 152777 157334 248235 -256404 123855 -49764 -64175 196367 -97534 168009 -101474 -225626
15602b25626P8012j47533c742B4550d5724j10431D3072J24567N4651a27746o9020
$$ -225626 -147614 -295147 -3742 24550 -45724 -156155 43072 167639 222290 -127746 -196766
15591a96766E932a53538g0487A7237a11640b6992m117p1973d781q0317p225j7807
$$ -196766 5932 -153538 -70487 17237 -111640 -26992 -31109 -103082 -4781 -85098 -92323 -110130
15579a10130A72354a83047C7727M14468A96811b2727h113o6200B5515J14151c35005
$$ -110130 172354 -183047 37727 452195 196811 -22727 -8113 -74313 25515 139666 -335005
15567A00994a43064F3843a55536J1347j77719a21017M3123a5512I973J75468f243
$$ 100994 -143064 63843 -155536 -144189 -321908 -121017 -77894 -15512 9973 185441 -6243
15555a84834E250a52380D2963J25407q2150j8870d6262j17311e1384j1909n0071
$$ -184834 5250 -152380 42963 168370 86220 67350 -46262 -163573 -51384 -63293 -113364
15544a13364B60754D0215J36566a31331K6805c3219k7599A38235E7096b17300
$$ -113364 260754 40215 176781 -131331 -104526 -33219 -60818 138235 57096 -217300
15533b81613J12531B1685K0378f5572p3577a4371C4673O8576J9691d9070l3259
$$ -281613 -169082 21685 42063 -65572 -139149 -14371 34673 103249 122940 -49070 -82329
15522h2329L1298A05921a889I9182B0726b15701d1646A00907a34991A07442m1272
$$ -82329 -51031 105921 -1889 99182 20726 -215701 -41646 100907 -134991 107442 66170
15511F6170k0223h1988j63829d8439A92543a35301m7290l9255L6962N3649A2889
$$ 66170 45947 -81988 -245817 -48439 192543 -135301 -182591 -221846 -184884 -131235 12889
15499B11406c84093c1409l6100l8979M3418A28545j9437D6213a1989j17746k5195
$$ 211406 -384093 -31409 -67509 -106488 -63070 128545 109108 46213 -11989 -129735 -154930
15488a54930G8090J50819b4392B61809A24395b41387A59653e1113m463m8068j28382
$$ -154930 78090 228909 -24392 261809 124395 -241387 159653 -51113 -55576 -103644 -232026
15477b32026a03056o6367C2892a30132F1252b09428B18696j6014c694A66683P852
$$ -232026 -103056 -169423 32892 -130132 61252 -209428 218696 202682 -3694 166683 174535
15466A74535b13830D62242d3534A28157Q4252b08999g4246B17346M5720H9544
$$ 174535 -213830 462242 -43534 128157 212409 -208999 -74246 217346 263066 89544
15455A58031a00933k36485A31213a29215B14329f4204C2164d13250A67782b37056
$$ 158031 -100933 -337418 131213 -129215 214329 -64204 32164 -413250 167782 -237056
15444H7261A4148J36433a4812A19150J46246F8433A3871J28165K78980b11190
$$ 87261 14148 150581 -14812 119150 265396 68433 13871 142036 421016 -211190
15433A7981a03864F0846J22925B7490M6020K4604K30745A14246b92412a17783
$$ 17981 -103864 60846 183771 27490 73510 98114 328859 114246 -292412 -117783
15422A62284N2323h0141j24309B204a74184I4292J45601c30544c9453B59569c65875
$$ 162284 214607 -80141 -204450 2204 -174184 94292 239893 -330544 -39453 259569 -365875
15410a53884A15230L4512e9330K6443A56586j5335a2387A67575J60856c15902
$$ -153884 115230 149742 -59330 -32887 156586 141251 -12387 167575 328431 -315902
15399a33190N487F0735J26020P3092B0977J82051l3657q1261R0397a34932F0919
$$ -133190 -127703 60735 186755 259847 20977 203028 169371 88110 178507 -134932 60919
15387A5383N0280J48997a57937A24841n2444N1477b367k54753b0676o33237g7829
$$ 15383 65663 214660 -157937 124841 72397 123874 -2367 -257120 -20676 -653913 -77829
15375g9015m24190a54509A80296F4146L9384K4425K19558H6302l9197R0429k8870
$$ -79015 -503205 -154509 180296 64146 103530 127955 347513 86302 47105 137534 108664
15364A08664g8445G0215M4895E5959f3449B68963p7328d9480I0752c1589A80748
$$ 108664 -78445 70215 115110 55959 -63449 268963 191635 -49480 90752 -31589 180748
15352A76335c2859l14310d3000B63126L8821d7577C23891j24623G603c4097C32880
$$ 176335 -32859 -347169 -43000 263126 301947 -47577 323891 199268 7603 -34097 332880
15340c7794A79390n1810B5200d563A27916C4795b40447B2418b35348C03706c2738
$$ -37794 179390 127580 25200 -4563 127916 34795 -240447 22418 -235348 303706 -32738
15328G1219c0920H7614J56632p4976J14834A02057h8235q3534M9149E7953J44589
$$ 71219 -30920 87614 244246 169270 284104 102057 -88235 -171769 -122620 57953 202542
15317B02542J70844C4283J0495M6448D3549a98967c9955C24766A34827A5639i2827
$$ 202542 373386 34283 44778 91226 43549 -198967 -39955 324766 134827 15639 -92827
15305B01726B8900L7303b0562k4132a8819D48157A46725B1829K81005K02134g8313
$$ 201726 28900 66203 -20562 -44694 -18819 448157 146725 21829 302834 504968 -78313
15293b05827e6171q1026j92019I1809a817k90603E1166c2498c98m4648F5995J08877
$$ -205827 -56171 -137197 -329216 91809 -1817 -292420 51166 -32498 -398 -45046 65995 174872
15281A74872b1749j00032A6302M3160b51648c6670A2408M249P5491C7943l480
$$ 174872 -21749 -121781 16302 59462 -251648 -36670 12408 16657 92148 37943 34463
15270C4463f4691F6522i3897B51347a18846d2041a0878A00783a38357N8057B88077
$$ 34463 -64691 66522 -93897 251347 -118846 -42041 -10878 100783 -138357 -80300 288077
15258b74755A74992C8084K62415a19727A58619E0462J85198C5736Q98380L23228
$$ -274755 174992 38084 300499 -119727 158619 50462 235660 35736 934116 1257344
15248A257344p2054j89622L7073C14837j5853b44011B33543F4656L1423a84415
$$ 1257344 1185290 995668 1032741 314837 298984 -244011 233543 64656 96079 -184415
15237A19911e1387G4133J9337m2707Q3948K3464L8694f8672B04604o4588i6443
$$ 119911 -51387 74133 93470 50763 134711 158175 196869 -68672 204604 140016 -96443
15225f9661B93764a06731A61020G907a38818C54359b885j38160C2687f8932l2655
$$ -69661 293764 -106731 161020 7907 -138818 354359 -2885 -141045 32687 -68932 -101587
15214a01587j08575c2419B81852a81204B34470C9709J14127k1795l7218l7920
$$ -101587 -210162 -32419 281852 -181204 234470 39709 153836 132041 94823 56903
15204E6903K13632c7322j83614D00550d7696j09628b0689B84479p2286K0969d6829
$$ 56903 270535 -37322 -220936 400550 -47696 -157324 -20689 284479 212193 233162 -46829
15192c5785j31419I1986M30966a4859p6764B61294A20857D7346J8972J98955H7883
$$ -35785 -167204 91986 522952 -14859 -91623 261294 120857 47346 66318 265273 87883
15180B11173k7079D8075e0746J0695B01719a47643D0784K10262p7756B842a31387
$$ 211173 184094 48075 -50746 -40051 201719 -147643 40784 251046 173290 2842 -131387
15168B43440H7690M0870b0269A32299m0243J0675i2131L5177K3420J5235j54228
$$ 243440 87690 128560 -20269 132299 92056 102731 -92131 -56954 -33534 -18299 -172527
15157a72527F921f3244A97581c18692c4226n0613A05936J71928E6128Q7451m8599
$$ -172527 6921 -63244 197581 -318692 -34226 -84839 105936 277864 56128 143579 94980
15146I4980a38065D3016M61592b8750P317A48210J946a06838m3331C3909j3058
$$ 94980 -138065 43016 504608 -28750 -21433 148210 150156 -106838 -150169 33909 20851
15135B0851b07907I6492O3925L19284j16567A07589J36406P6836m3669E0689f9080
$$ 20851 -207907 96492 160417 479701 363134 107589 243995 320831 277162 50689 -69080
15123a05588C48137j45611a4500A23642K19591M3054N3818B00644E3787b7891
$$ -105588 348137 202526 -14500 123642 343233 386287 440105 200644 53787 -27891
15112A95878b08450D42379b6977D85617j79127i373j30079C71666H4079i150A42759
$$ 195878 -208450 442379 -26977 485617 306490 -9373 -139452 371666 84079 -9150 142759
15100A36688k918n7043J3936a30569A09153J06067F0145P5666J72003J7505A45043
$$ 136688 133770 76727 90663 -130569 109153 215220 60145 135811 307814 325319 145043
15088d961p2881B40857C9620a80662g1594J9693B40061a71360B60069I2454A3189
$$ -4961 -77842 240857 39620 -180662 -71594 -51901 240061 -171360 260069 92454 13189
15076B84390j11056n3288n2699J9145K83882J65301o8299H9554J29282j4403C6772
$$ 284390 173334 120046 67347 86492 370374 535675 467376 89554 218836 204433 36772
15064B8145b85635a37455B49063J95023q586j13338J01449A88392K9521R3694
$$ 28145 -285635 -137455 249063 444086 435500 322162 423611 188392 217913 311607
15054C11607B9560N61835B49188j8567R6056A1346K32924H5318L04564n4207A16003
$$ 311607 29560 591395 249188 230621 326677 11346 244270 85318 389882 335675 116003
15042B67856a2658H4958J35525E3136K12416A04838N5859o568J01715K6059R8041
$$ 267856 -12658 84958 220483 53136 265552 104838 160697 154129 255844 281903 379944
15031C79944j11795K87788C3736J39076O25K8520b68444D19425j38590J37323
$$ 379944 268149 555937 33736 172812 173437 201957 -268444 419425 280835 418158
15021D18158A40694e2626B4829K5501g2865D66842A74565C4831K51878L19411
$$ 418158 140694 -52626 24829 50330 -72865 466842 174565 34831 286709 606120
15011F06120I0974K13966j28945A9431L30224I6288K52782A22823o0344j203N3111
$$ 606120 90974 304940 175995 19431 349655 96288 349070 122823 62479 61276 114387
15000A14387n567O2574o2300L07396I3985C3154J54267l1992J43203L3790m9314
$$ 114387 108820 171394 109094 416490 93985 33154 187421 155429 298632 332422 283108
14989B83108j17484K59176A49631G208L85617H9295b02395B15589A2214K16758
$$ 283108 165624 424800 149631 7208 392825 89295 -202395 215589 12214 228972
14979B28972J16412o8754o6389J12997A35197J01980K80718A04069M04692F7797
$$ 228972 345384 276630 210241 323238 135197 237177 517895 104069 508761 67797
14968D50806j87705r1719J05347J64276j38793L6441r5624P2148a98685D20611
$$ 450806 263101 171382 276729 441005 302212 338653 243029 315177 -198685 420611
14957B0958D873N04495k35958R807K29635j62943A56631M36361k64994j50471
$$ 20958 4873 509368 273410 283217 512852 349909 156631 592992 327998 177527
14947A77527K34237j04785A34986a34055C92181A16237c9225C31990l3758j09739
$$ 177527 411764 306979 134986 -134055 392181 116237 -39225 331990 298232 188493
14937A88493M70463A87296Q0461O0138d7061B67681q7676J04626K25712K6421
$$ 188493 658956 187296 267757 327895 -47061 267681 180005 284631 510343 536764
14927E36764N6414j13718J03876J75102k13428j70205K1811K68567k80818L99484
$$ 536764 593178 479460 583336 758438 545010 374805 396616 665183 384365 783849
14917G83849k89132L59469k63487m1960M5128n5352Q6140k18908L726j90041M96604
$$ 783849 494717 854186 590699 548739 593867 538515 624655 405747 409473 219432 716036
14906G16036C05269P2218J81836k30006H2811r460J8641L06098E6368L53879p8976
$$ 716036 305269 377487 559323 329317 82811 73351 91992 398090 56368 410247 331271
14895C31271Q9145J7928j71161B0602K85751j53004C6506Q0011K52606q8305J92318
$$ 331271 420416 438344 267183 20602 306353 153349 36506 116517 369123 280818 473136
14884D73136j35886L15069B29116R7396k1580r534E4117J19219L02400n353A16361
$$ 473136 337250 652319 229116 326512 304932 295398 54117 173336 475736 470383 116361
14872B13421f6320C62906o6190C9704L33078q7007q0522K21836l7252m8321J57384
$$ 213421 -66320 362906 296716 39704 372782 285775 205253 427089 389837 341516 498900
14861D98900B35814K14156r8607A22224J00095l1485J23241A15617K50240m946
$$ 498900 235814 449970 351363 122224 222319 190834 314075 115617 365857 360911
14851C60911q6061A7637O4894M88286k15428m1226h938C39270n345L13187O9355
$$ 360911 274850 17637 82531 570817 355389 314163 -8938 339270 333925 647112 716467
14840G16467j11522k83310K84215L01953n5379k50652K02067k2587A73053L27492
$$ 716467 604945 321635 605850 907803 852424 601772 803839 781252 173053 500545
14830E00545A43300M39020n0315j94032r8842N12968C46940L8254J13972o139
$$ 500545 143300 582320 532005 337973 239131 752099 346940 385194 499166 493027
14820D93027J28382k29834N1783j96708j4207J23069J7858J67332j25661L2956
$$ 493027 621409 391575 443358 246650 232443 355512 373370 540702 415041 447997
14810D47997J10175j31383Q8268A14923M65731j90781L13954B63381J48832K14511
$$ 447997 558172 426789 515057 114923 580654 389873 703827 263381 412213 626724
14800F26724j24294P3801k29545M06117l54009M08547l66269E9219L83288M4221
$$ 626724 502430 576231 346686 752803 398794 807341 441072 59219 442507 486728
14790D86728n9538K4898J59444k47647j24015K92167J25845j2344k59403K07274
$$ 486728 427190 452088 611532 363885 239870 532037 657882 645538 386135 593409
14780E93409k23343L00984B90958N39780m03856M7127K95567r4873l30332L41260
$$ 593409 370066 671050 290958 830738 426882 474009 769576 674703 344371 685631
14770F85631J0651O2735j40539L01739l46222K37457r9689k26704N45724j20996
$$ 685631 696282 759017 618478 920217 573995 811452 711763 485059 1030783 909787
14760I09787k29652J3484l25043M41318M9937j89031J06716J58257k47347R7862
$$ 909787 680135 693619 368576 809894 859831 670800 777516 935773 688426 786288
14750G86288k53288J79746j29539J22994r0853J78420l7053j51727j41350K97955
$$ 786288 533000 712746 583207 706201 615348 793768 756715 604988 463638 761593
14740G61593n2510j31071J30531j62380o0313J68423L47886D07907L11895K2503
$$ 761593 709083 578012 708543 546163 485850 654273 1002159 407907 719802 742305
14730G42305J21731k45808K63043l42650J18521K14235l3352J00188K5847l36538
$$ 742305 864036 618228 881271 538621 657142 871377 838025 938213 964060 627522
14720F27522L4858K79195l23507K03309J09838P9988L634C39326M32346J60671
$$ 627522 662380 941575 618068 821377 931215 1011203 1014837 339326 771672 932343
14710I32343l17154Q1201J8037J41997O7952r7015n677m0979p2006Q9639j41773
$$ 932343 615189 696390 714427 856424 924376 827361 821684 780705 708699 798338 656565
14699F56565K39985n7718J6585p0216K03723Q1439j33582C77082N53322L48602
$$ 656565 896550 838832 855417 785201 988924 1070363 936781 377082 930404 1279006
14689A279006l19081k22329L84033k91346m2709O94J57448k55362K52647k5693
$$ 1279006 959925 737596 1121629 830283 787574 788268 945716 690354 943001 917308
14679I17308k07947J15967J93018D26922N32207j54531K02503j96438q7421K18420
$$ 917308 709361 825328 1018346 426922 959129 804598 1007101 810663 723242 941662
14669I41662k4776Q9067L62304k32764r2381N7913n14568M09120k25496q0872
$$ 941662 916886 1005953 1368257 1135493 1043112 1101025 586457 995577 770081 689209
14659F89209M78833k70195k7254J25389k4815m4430N1031J31911k05643K01233
$$ 689209 1168042 897847 870593 995982 971167 926737 977768 1109679 904036 1105269
14649A105269l71071K95754j5490k8109n6366J65604N5741J77891j27267j74213
$$ 1105269 734198 1029952 1014462 986353 929987 1095591 1151332 1329223 1201956 1027743
14639A027743r6930k1216Q7140J94115q6138J84412P7634q25j24878J69406r8204
$$ 1027743 930813 909597 996737 1190852 1104714 1289126 1366760 1365935 1241057 1410463 1312259
14628A312259P1997j57635P5512k10303K47387k46837J72755k46820J75779n7790
$$ 1312259 1384256 1226621 1302133 1091830 1339217 1092380 1265135 1018315 1194094 1136304
14618A136304R2882L847j81705K76361l351q1036M58241p7856k61802L15804k86577
$$ 1136304 1229186 1233033 1051328 1327689 1324338 1243302 1701543 1623687 1361885 1677689 1391112
14607A391112j08243M4466m7779L38785l91861L99387m14795K14924j80062K79337
$$ 1391112 1282869 1327335 1279556 1618341 1226480 1625867 1211072 1425996 1245934 1525271
14597A525271l25417K31248J42578L08465n7791l95538J3455L66346l13177j08164
$$ 1525271 1199854 1431102 1573680 1882145 1824354 1428816 1442271 1808617 1495440 1387276
14587A387276K14626J46587K3293o3385m7991L74013r5578j25104j91439Q3144
$$ 1387276 1601902 1748489 1771782 1708397 1660406 2034419 1938841 1813737 1622298 1705442
14577A705442O2455L77051l05098k37887M01119q646n7518L03887o5151j42132
$$ 1705442 1767897 2144948 1839850 1601963 2003082 1994436 1936918 2240805 2175654 2033522
14567B033522o2476K30867k34666K34562l0471M41618l19997N24395R0802k13464
$$ 2033522 1971046 2201913 1967247 2201809 2171338 2612956 2292959 2817354 2908156 2694692
14557B694692M82767l47936L98906L97265J35881N29320P56565Q40858K200530
$$ 2694692 3177459 2829523 3228429 3625694 3761575 4290895 5047460 5888318 8088848
14548H088848N116289R524773R646652k509343j1988679p856156l922802j934599
$$ 8088848 13205137 22729910 32376562 29867219 17878540 10022384 6099582 4164983
14540D164983r97788m90382k96382m36499P8920k51300J98775K77102l68164j30801
$$ 4164983 3167195 2676813 2380431 1943932 2022852 1771552 1970327 2247429 1879265 1748464
14530A748464J01862J30508j03317o2711K86721j29173J0783J81777p9551K72934
$$ 1748464 1850326 1980834 1877517 1814806 2101527 1972354 1983137 2164914 2085363 2358297
14520B358297j48217k17300L48558l14759J41483L11512l53225J71091n6930K74134
$$ 2358297 2210080 1992780 2341338 2026579 2168062 2479574 2126349 2297440 2240510 2514644
14510B514644Q3876j90384L94389k49157q3584K81781J10604J02040k14514Q5650
$$ 2514644 2598520 2408136 2802525 2553368 2469784 2751565 2862169 2964209 2749695 2835345
14500B835345P2012o3616J43729j40340J85957O7440k43506k4807K42636k12041
$$ 2835345 2907357 2843741 2987470 2847130 3033087 3100527 2857021 2832214 3074850 2862809
14490B862809M16242l09785J74149J88256J22344k10371J651M33851m00438L18771
$$ 2862809 3279051 2969266 3143415 3331671 3454015 3243644 3245295 3679146 3278708 3597479
14480C597479M1049Q5750k3331Q2161k0591l23396M28273j81563M5940J59621
$$ 3597479 3638528 3724278 3700947 3783108 3762517 3439121 3867394 3685831 3731771 3891392
14470C891392m9977N1395P5808J00349K15j36461J6848Q0528K96963j55378K78528
$$ 3891392 3841415 3892810 3968618 4068967 4069182 3932721 3949569 4030097 4327060 4171682 4450210
14459D450210j34733m0036K76189l35507O39264n73714P05029k64724L33737j41897
$$ 4450210 4315477 4275441 4551630 4216123 4855387 4281673 4986702 4721978 5055715 4913818
14449D913818L3469J476J9790Q3723M37333l08679P349M9773P5864Q1889J71262
$$ 4913818 4947287 4948763 4968553 5052276 5489609 5180930 5188279 5238052 5313916 5395805 5567067
14438E567067J85229l212K30252O1107j32680J28145L2418L03987q4264J84388
$$ 5567067 5752296 5749084 5979336 6040443 5907763 6035908 6068326 6372313 6288049 6472437
14428F472437K3663j14508p817M20034L20264M4434K92625p63732L95387L36623
$$ 6472437 6496100 6381592 6373775 6793809 7114073 7158507 7451132 6687400 7082787 7419410
14418G419410K42230n72J78490J49856l89108N17463K0531K74290k12674L23564
$$ 7419410 7661640 7661068 7839558 7989414 7600306 8117769 8138300 8412590 8199916 8523480
14408H523480k00151K09072K59340L27380p1256J93940m4576O02885M6466j71739
$$ 8523480 8323329 8532401 8791741 9119121 9047865 9241805 9197229 9800114 9846580 9674841
14398I674841L65565n2755J24125M72325j91230O2150N76875K73389k86279L19887
$$ 9674841 10040406 9987651 10111776 10584101 10392871 10455021 11031896 11305285 11019006 11338893
14388A1338893L23462q7156M38067M4719L31276o3354K13917N85057K84660J29131
$$ 11338893 11662355 11575199 12013266 12057985 12389261 12325907 12539824 13124881 13409541 13538672
14378A3538672J62317M15085M58632k64125P20146J39445K20854N46267j00380
$$ 13538672 13700989 14116074 14574706 14310581 15030727 15170172 15391026 15937293 15836913
14369A5836913N39087L87947L23298M95244K49324L21819M31626M71187R71798
$$ 15836913 16376000 16763947 17087245 17582489 17831813 18153632 18585258 19056445 20028243
14360B0028243j11063P12176L69847M86017P29678P8851J092264K29358O55720
$$ 20028243 19917180 20629356 20999203 21485220 22214898 22293749 23386013 23615371 24271091
14351B4271091O27707M52042N86694O75915R22269L91273J061392O71837N37305
$$ 24271091 24898798 25350840 25937534 26613449 27535718 27926991 28988383 29660220 30197525
14342C0197525J147827Q12358N55283J220133R43333Q04306J140391J125867J246528
$$ 30197525 31345352 32157710 32712993 33933126 34876459 35680765 36821156 37947023 39193551
14333C9193551R49497J319908J267968J462774J336738J423023J629168J462350
$$ 39193551 40143048 41462956 42730924 44193698 45530436 46953459 48582627 50044977
14325E0044977J716988K030962J751875K160761K242196J863389K302959K240294
$$ 50044977 51761965 53792927 55544802 57705563 59947759 61811148 64114107 66354401
14317F6354401K956372K446878K872615K437034L247126L295152L249503L972919
$$ 66354401 69310773 71757651 74630266 77067300 80314426 83609578 86859081 90832000
14309I0832000L868154M253103M340941M931105M659413N357927N562698N681730
$$ 90832000 94700154 98953257 103294198 108225303 112884716 118242643 123805341 129487071
14301A29487071O414230O513604O351280P173008P454774Q223082Q578372R127078
$$ 129487071 135901301 142414905 148766185 155939193 163393967 171617049 180195421 189322499
14293A89322499R511813R955707J0543835J1033249J2065452J2248870J2786663
$$ 189322499 198834312 208790019 219333854 230367103 242432555 254681425 267468088
14286B67468088J3355719J3899578J3636815J3649584J4079548J4347924J4451785
$$ 267468088 280823807 294723385 308360200 322009784 336089332 350437256 364889041
14279C64889041J3673573J3256314J2243056J1288702R915337P800316N467110
$$ 364889041 378562614 391818928 404061984 415350686 425266023 433066339 438533449
14272D38533449J820339k599387k956746l251592l981805n352520p525938p460719
$$ 438533449 440353788 437754401 434797655 431546063 427564258 422211738 414685800 407225081
14264D07225081q519835j1084652j2439887j4136839j4636451j5196467j5396656
$$ 407225081 398705246 387620594 375180707 361043868 346407417 331210950 315814294
14257C15814294j4703934j4066732j3672020j3721688j3213945j2375433j2171531
$$ 315814294 301110360 287043628 273371608 259649920 246435975 234060542 221889011
14250B21889011j0867328j0792854j0037468r365832q905790q312427p976895
$$ 221889011 211021683 200228829 190191361 180825529 171919739 163607312 155630417
14243A55630417p342564p035739p013482n736765n998990n228993n083782n024241
$$ 155630417 148287853 141252114 134238632 128501867 122502877 117273884 112190102 107165861
14235A07165861m607591m238035l783564m229118l225531l543497l295236l090991
$$ 107165861 102558270 98320235 94536671 90307553 87082022 83538525 80243289 77152298
14227G7152298l227343k676701k429009k765564k487746k284199j822558k278327
$$ 77152298 73924955 71248254 68819245 66053681 63565935 61281736 59459178 57180851
14219E7180851j642360k034026j925689j306392j889660j351424j375559j793103
$$ 57180851 55538491 53504465 51578776 50272384 48382724 47031300 45655741 43862638
14211D3862638q77443j325927r48911j266920p31680j579734q33617q62169r42222
$$ 43862638 42985195 41659268 40710357 39443437 38711757 37132023 36298406 35436237 34494015
14202C4494015j037772p54855j021066q42088j071102m71048r42418m83073o51897
$$ 34494015 33456243 32701388 31680322 30838234 29767132 29296084 28353666 27870593 27218696
14193B7218696n61984r79614l91146o86976o36266p00928m36756j43582m16705
$$ 27218696 26656712 25677098 25285952 24598976 23962710 23261782 22825026 22681444 22264739
14184B2264739n59978r37853r7384l26060o74831m68523l45395r9656m33977n26806
$$ 22264739 21704761 20766908 20669524 20343464 19668633 19200110 18854715 18755059 18321082 17794276
14174A7794276j15891l26417k62462m64502o49318J92365p62331Q7653j30225
$$ 17794276 17678385 17351968 17089506 16625004 15975686 16168051 15405720 15493373 15363148
14165A5363148q53892N9844m1126n49656l92409j49441j16761l40894k67585J13055
$$ 15363148 14509256 14569100 14527974 13978318 13585909 13436468 13319707 12978813 12711228 12824283
14155A2824283l17961l02027j03410m72003j74180l11150J92429l21870m28381
$$ 12824283 12506322 12204295 12100885 11628882 11454702 11143552 11335981 11014111 10585730
14146A0585730J9863j10880m4038m46348n3320k38765O1179m49613O571k05989
$$ 10585730 10605593 10494713 10450675 10004327 9951007 9712242 9773421 9323808 9330379 9124390
14136I124390J59967n22687p8003L13244n13165m9223k45235j93889R1953j11049
$$ 9124390 9284357 8761670 8683667 8996911 8483746 8434523 8189288 7995399 8087352 7976303
14126G976303k22063k4807k50073J21556m19142O9164K7228k99225M7081k74405
$$ 7976303 7754240 7729433 7479360 7600916 7181774 7250938 7278166 6978941 7026022 6751617
14116F751617m0900n9729n7138r5780K42014m19285j48312o1426j02950J06983
$$ 6751617 6710717 6650988 6593850 6498070 6740084 6320799 6172487 6111061 6008111 6115094
14106F115094M9367J7795o40506L70125o42969L76281j13841k35707K91386m20839
$$ 6115094 6164461 6182256 5541750 5911875 5268906 5645187 5531346 5295639 5587025 5166186
14096E166186n8470N43494j58815p19389J82508L73907m02767J86292q0453k11957
$$ 5166186 5107716 5651210 5492395 4773006 4955514 5329421 4926654 5112946 5032493 4820536
14086D820536Q6893j84648j02970j60478J50259p0513K0794k84620o0742L36369
$$ 4820536 4907429 4722781 4619811 4459333 4609592 4539079 4559873 4275253 4214511 4550880
14076D550880m01011J54846J38964l40080n2273L4646r5028l795l9849O4832l75252
$$ 4550880 4149869 4304715 4443679 4103599 4051326 4085972 3990944 3987149 3947300 4012132 3636880
14065C636880L40165j70656o6262K66144l81546L94466n00033M00055r4009k11845
$$ 3636880 3977045 3806389 3740127 4006271 3624725 4019191 3519158 3919213 3825204 3613359
14055C613359l85914M74480m40333J71420k35787J3135p7554P6603k39390L32927
$$ 3613359 3227445 3701925 3261592 3433012 3197225 3210360 3132806 3209409 2970019 3302946
14045C302946Q1447l96684j12572L08603j43608K42467m51155K80241j36687k02971
$$ 3302946 3384393 2987709 2875137 3183740 3040132 3282599 2831444 3111685 2974998 2772027
14035B772027J22805J28934m0782O8272n22634M14556j9238J0229l24085K3998
$$ 2772027 2894832 3023766 2982984 3051256 2528622 2943178 2923940 2934169 2610084 2634082
14025B634082K17641j85849N7715l04154M26467m40674n7050K19567l67323p3407
$$ 2634082 2851723 2665874 2723589 2419435 2845902 2405228 2348178 2567745 2200422 2127015
14015B127015L6920J59607K55768r4028j14764q3227n2478j09165j41510M40698
$$ 2127015 2163935 2323542 2579310 2485282 2370518 2287291 2234813 2125648 1984138 2424836
14005B424836l65771L14760k24377q0357J56017l69012K59956n0797J10471k02840
$$ 2424836 2059065 2373825 2149448 2069091 2225108 1856096 2116052 2065255 2175726 1972886
13995A972886K43133k50779M87242k49977K74484J044821R49363K884076Q210985
$$ 1972886 2216019 1965240 2452482 2202505 2476989 3521810 4471173 7355249 15566234
13986A5566234J0938916M131777p773793q694487m629682k613261j704865o59555
$$ 15566234 26505150 30636927 22863134 14168647 9538965 6925704 5220839 4561284
13978D561284j117451P9143n37012j06995J7956n68882M11667l46522K00481l36037
$$ 4561284 3443833 3522976 2985964 2878969 2896925 2328043 2739710 2393188 2593669 2257632
13968B257632j25330K5123O0585j18359r8154l6897J78278k44524L66053l83073
$$ 2257632 2132302 2157425 2218010 2099651 2001497 1964600 2142878 1898354 2264407 1881334
13958A881334M5247J74754J15819l88926J85938K1355j47736k40269K28588p1912
$$ 1881334 1926581 2101335 2217154 1828228 2014166 2035521 1887785 1647516 1876104 1804192
13948A804192j77548J01648N5288p9995J00768j40967J50809k05063q8351n319
$$ 1804192 1626644 1728292 1783580 1703585 1804353 1663386 1814195 1609132 1520781 1515462
13938A515462J25623j98521o1110K06527j62912j01313J73537J57981j6013k28286
$$ 1515462 1641085 1442564 1381454 1587981 1425069 1323756 1497293 1655274 1639261 1410975
13928A410975o949J76271k46595J47863J85658j77495k07821L15361k58376J58528
$$ 1410975 1404026 1580297 1333702 1481565 1667223 1489728 1281907 1597268 1338892 1497420
13918A497420j04058K22668m37132L55344j873j05348l29675L57936L28996k14001
$$ 1497420 1393362 1616030 1178898 1534242 1532369 1427021 1097346 1455282 1784278 1570277
13908A570277j42627J55103k84979l75397L08820P7300l57839K18737r9319L66926
$$ 1570277 1427650 1582753 1297774 922377 1231197 1308497 950658 1169395 1070076 1437002
13898A437002k54125K68694j33471P1151j80892K58545J32755l75727j32613k6335
$$ 1437002 1182877 1451571 1318100 1389251 1208359 1466904 1599659 1223932 1091319 1064984
13888A064984K19876j3147j79389J27362l42835L46055m4598r72o9222m1202K72665
$$ 1064984 1284860 1271713 1092324 1219686 876851 1222906 1178308 1177336 1108114 1066912 1339577
13877A339577l86409k36201L62501J82614k61509j96730K29264q4470p904J37053
$$ 1339577 953168 716967 1079468 1262082 1000573 803843 1033107 948637 940733 1077786
13867A077786k75431N44288l80661p1927o3579J54375M447j85465K35528j90857
$$ 1077786 802355 1346643 965982 894055 830476 984851 989298 803833 1039361 848504
13857H48504J84764n4250k14339P2954J18077K38655J125L3273k95869j80640
$$ 848504 1033268 979018 764679 837633 955710 1194365 1195490 1228763 932894 752254
13847G52254K20123m04978J46382K78505P32M2464Q3130m70626J86241j5126K05319
$$ 752254 972377 567399 713781 992286 993018 1035482 1118612 647986 834227 819101 1024420
13836A024420p4368j17826J77426k01268O7622K25361j62357j42788l7728J04681
$$ 1024420 950052 832226 1009652 808384 876006 1101367 939010 796222 758494 863175
13826H63175R400l92427M07566L4092D30236N22970o7067Q4915j19508j4625K84033
$$ 863175 872575 480148 887714 921806 430236 953206 886139 971054 851546 836921 1120954
13815A120954m2821j78129j68677O7651L596J11390j02572k26389J13452j94755
$$ 1120954 1078133 900004 731327 798978 802574 913964 811392 585003 698455 503700
13805E03700N8628J05296j36077J09318L89228m74477K95327j08065j03674K9728
$$ 503700 562328 667624 531547 640865 1030093 555616 850943 742878 639204 668932
13795F68932K02190j46436O5787r6683J52360l03193M1953K51695k21514n0236
$$ 668932 871122 724686 790473 693790 846150 542957 584910 836605 615091 564855
13785E64855J23703k13941K97505R5703C90796K07917j09018M02082C47990L08696
$$ 564855 688558 474617 772122 867825 390796 598713 489695 891777 347990 656686
13775F56686k64702M66481B34389N73276J04949j84933J39258l4708j23358B78659
$$ 656686 391984 858465 234389 807665 912614 727681 866939 832231 708873 278659
13764G09847C42976J84496n9996K35839l8951J68690J10838q3080q583k60894
$$ 709847 342976 527472 467476 703315 664364 833054 943892 860812 852229 591335
13754E91335J9608m6448j43794J29106Q7205O9867B37985M73688m2853r4778N0897
$$ 591335 610943 564495 420701 549807 637012 706879 237985 711673 668820 574042 624939
13743F24939q8044K81299n3348l73457K65174j28204L89248j81946p7531j33920
$$ 624939 536895 818194 764846 391389 656563 528359 917607 735661 658130 524210
13733E24210L55567k88963J61184k28415K4027j87996M31867l23449J36900J38989
$$ 524210 879777 590814 751998 523583 547610 359614 791481 468032 604932 743921
13723G43921j36038R1831J11968B37657L81028k56838K22932B68093M10037k14731
$$ 743921 607883 699714 811682 237657 618685 361847 584779 268093 678130 463399
13713D63399O6863j9487p3884J93187j83289j18500K38190k73343K01513O5299
$$ 463399 530262 510775 436891 630078 446789 328289 566479 293136 494649 559948
13703E59948o0115j57717K09015o4314r4959n9301K71845L372B90019J09345A55678
$$ 559948 499833 342116 551131 486817 391858 332557 604402 607774 290019 399364 155678
13691a4694B41071K99337O2621k18200J58948k44800K23304J18472j16203Q2831
$$ -14694 241071 540408 603029 384829 543777 298977 522281 640753 524550 607381
13681F07381k08860K51812C19289J55226J91272k72365L82959l8485k11051K03866
$$ 607381 398521 650333 319289 474515 665787 393422 776381 737896 526845 730711
13671G30711C25875M88265r6808C49834E4O95185j33608k06623K37027m5957J98266
$$ 730711 325875 814140 717332 349834 54 695239 561631 355008 592035 546078 744344
13660G44344k58235k7108k04503J37560K98392k45274J96980q3838k03615K90004
$$ 744344 486109 459001 254498 392058 690450 445176 642156 558318 354703 644707
13650F44707J17851C47631L52048j62574l724k64189J95470j89797K00288M5016
$$ 644707 762558 347631 699679 537105 533381 269192 464662 274865 475153 520169
13640E20169k28256K66575n8141A34388K67842J63905A06215K21414K71169j57344
$$ 520169 291913 558488 500347 134388 402230 566135 106215 327629 598798 441454
13630D41454p7540K51752O3459k18321J14029A20268M03107n7917l8280J74273
$$ 441454 363914 615666 679125 460804 574833 120268 523375 465458 427178 601451
13620F01451k85761J62347P6641j30670J85815q7927A42513J51389l5322Q5414
$$ 601451 315690 478037 554678 424008 609823 521896 142513 293902 258580 343994
13610C43994P5589J73904k87791j0514K15278k29519R706M21328B52322J96333
$$ 343994 419583 593487 305696 295182 510460 280941 290647 711975 252322 448655
13600D48655L55709C87436P7839A68662L53837I375L72724j46600J00343J04541
$$ 448655 804364 387436 465275 168662 522499 9375 382099 235499 335842 440383
13590D40383P187K79782D430K81066K34764a0697A17914N04294B78041k4001K75109
$$ 440383 447570 727352 4430 285496 520260 -10697 117914 622208 278041 254040 529149
13579E29149R1908k34615A24558R6490j03270J64300n8045J67147m3147A60359
$$ 529149 621057 386442 124558 221048 117778 282078 224033 391180 348033 160359
13568B60273m8586A00252N80233n2915k27798j81386K6504K01262E9684K20445
$$ 260273 211687 100252 680485 627570 399772 218386 244890 446152 59684 280129
13558B80129J67862A22428M11132r0237D7897J17670L42566E0342h1562L4433
$$ 280129 447991 122428 533560 443323 47897 165567 508133 50342 -81562 -47129
13548d7129A58159K64555E1743J87347K01232B18085d5605C62054o3881J97002
$$ -47129 158159 422714 51743 239090 440322 218085 -45605 362054 298173 495175
13538D95175B01282P2422m068J71710A64133a8929C31529j9844o3671Q0289K32689
$$ 495175 201282 273704 269636 441346 164133 -18929 331529 311685 248014 328303 560992
13527E60992A66709b6181l597B84155o4632B1030M25882j26717j11536J56988
$$ 560992 166709 -26181 -29778 284155 219523 21030 446912 320195 208659 365647
13517C65647J29353r8097A68424J51426L22371j56951l5326H9957K03583E9344
$$ 365647 495000 396903 168424 319850 642221 485270 449944 89957 293540 59344
13506H8269M38373k11287j01547h2891C33537J14558A13622J39882A0680L81915
$$ 88269 526642 315355 213808 -82891 333537 448095 113622 253504 10680 392595
13496C92595A59072N1978L19169j85319K34722A99065B3256Q164L62138j72486
$$ 392595 159072 211050 530219 344900 579622 199065 23256 31420 393558 221072
13486B21072G3488J88993M1432A25242K85233A34603J78476j56004J04751J28425
$$ 221072 73488 262481 303913 125242 410475 134603 313079 157075 261826 390251
13476C90251a09049B85011K02220A68903a24883A83272m9378P715n2405J72884
$$ 390251 -109049 285011 487231 168903 -124883 183272 133894 141609 89204 262088
13466B62088r8623L8317L18430k18474j24045a93372B90620K5829O983A35599
$$ 262088 163465 201782 520212 301738 177693 -193372 290620 316449 323432 135599
13455A17987K58530L3442b5033D55310E6493K64139J66433b9749B93671j27921
$$ 117987 376517 409959 -25033 455310 56493 320632 487065 -29749 293671 165750
13445A65750e5373C30474K0465a5604A84665J08124a02303B43031Q0120Q0450
$$ 165750 -55373 330474 350939 -15604 184665 292789 -102303 243031 323151 403601
13435D03601d0906C9961K64316A4583J35219r619K06818I606Q7814J57697a45712
$$ 403601 -40906 39961 304277 14583 149802 140183 347001 9606 97420 255117 -145712
13423A6207Q1213J71143n4055L7225J3609k4804Q7377J1018I0647J25164H5608
$$ 16207 97420 268563 214508 251733 265342 240538 327915 338933 90647 215811 85608
13411C4437J6943L19779H341P4065Q1525J57416A43983a63243c1772B25366Q3978
$$ 34437 51380 371159 8341 82406 163931 321347 143983 -163243 -31772 225366 309344
13400C09344e6255B83769J73538I6936a44267c4819C3921m074M1619L7030D0531
$$ 309344 -56255 283769 457307 96936 -144267 -34819 33921 29847 71466 108496 40531
13388A87584a1275A51424Q5847H4458L09982A96460e589B83763d2559l8190D0130
$$ 187584 -11275 151424 237271 84458 394440 196460 -5589 283763 -42559 -80749 40130
13376i9294I389g173E8422Q6664J013J40201F111K21922b5012A20223l6514c8695
$$ -99294 9389 -7173 58422 145086 146099 286300 6111 228033 -25012 120223 83709 -38695
13363C17866F8816Q893K1050m195a33154D63827A77134n7035O9355M5196i1543
$$ 317866 68816 77709 98759 94564 -133154 463827 177134 120099 189454 234650 -91543
13351B02419p9056l2536j1374I875K74089E9160P2916k5746J01892A6540h4643
$$ 202419 123363 90827 79453 9875 283964 59160 132076 106330 208222 16540 -84643
13339C93821N5421B7323N26823k16748n5976H3743K92538p5850A14090L06150
$$ 393821 449242 27323 554146 337398 281422 83743 376281 300431 114090 420240
13329D20240j45454a96379C22505e5881j34804E4283J16684G6901J66049a34711
$$ 420240 274786 -196379 322505 -55881 -190685 54283 170967 76901 242950 -134711
13318A67223J92255e6236G3200J15726a29595j6585D47609k18941e1584J6615
$$ 167223 359478 -56236 73200 188926 -129595 -146180 447609 228668 -51584 -34969
13308c4969C38208J09730A27249n4731O8478p912f5300j5848B66353A444J32589
$$ -34969 338208 447938 127249 72518 140996 133084 -65300 -81148 266353 1444 134033
13297A34033a21295A35804a75261c6724B79598L47218A56978K02901D9988R4547
$$ 134033 -121295 135804 -175261 -36724 279598 626816 156978 359879 49988 144535
13287A44535B4249M33235a4129m0981A14010J14213D9076N5007J21289o8172J23296
$$ 144535 24249 457484 -14129 -55110 114010 228223 49076 104083 225372 157200 280496
13276B80496A18954C8639J90023J7787J7692A31982K24379G9921a2122j26365
$$ 280496 118954 38639 228662 246449 264141 131982 356361 79921 -12122 -138487
13266a38487C26789A20656K05138H4102J63485B8360Q1887l4642g6868A57737
$$ -138487 326789 120656 325794 84102 247587 28360 110247 75605 -76868 157737
13255F6234J57926R7778e1349B01820J34985j06101j11440m9413R4768c04013
$$ 66234 224160 321938 -51349 201820 336805 230704 119264 69851 164619 -304013
13244F9022K40747a63171C06880d321j91118F8333j2436K76829A57151c3669l314
$$ 69022 309769 -163171 306880 -4321 -195439 68333 55897 332726 157151 -33669 -36983
13233c6983J3536B56330B1761K15213j00545K77189n2023c1703C59322a98321
$$ -36983 -23447 256330 21761 236974 136429 413618 361595 -31703 359322 -198321
13222i9541F1020K05112A25801K47436F8863b4578n1961G7167a43976A33973L39789
$$ -99541 61020 266132 125801 373237 68863 -24578 -76539 77167 -143976 133973 473762
13211D73762b8818B73963A17627J56105P9075b20160e4515C45952F9640k9870
$$ 473762 -28818 273963 117627 273732 352807 -220160 -54515 345952 69640 39770
13201C9770J09851A7774K83652b30779A02462J3673J45344n5214K08304b02232
$$ 39770 149621 17774 301426 -230779 102462 116135 261479 206265 414569 -202232
13190a67805B44835J11786j30395o7568i3156A79497h7611B18131p5819a52657
$$ -167805 244835 356621 226226 158658 -93156 179497 -87611 218131 142312 -152657
13179A09311N1585o6086d696k12040B13383J78817D4604K80062a04833C28920
$$ 109311 160896 94810 -4696 -216736 213383 392200 44604 324666 -104833 328920
13168g6774A96690E478d07761b01594A38577l9692K7758B218N48726D134R6586
$$ -76774 196690 5478 -407761 -201594 138577 98885 126643 2218 550944 4134 100720
13157A00720m6006J51749O4820A18964a14918I8299f1563A58179F2911a93492
$$ 100720 54714 206463 271283 118964 -114918 98299 -61563 158179 62911 -193492
13146A54505p0045f3831a855B93110c12160A82216m5983J84907m1837c3A19432
$$ 154505 84460 -63831 -1855 293110 -312160 182216 136233 321140 279303 -33 119432
13134D8515c782q1551A76387n9909a83737B8523J08104J26789A13903a52933O5649
$$ 48515 -3782 -85333 176387 116478 -183737 28523 136627 263416 113903 -152933 -87284
13123h7284B38678a8994k00640B43588g6005B1531i0556C95943A847M01916c8021
$$ -87284 238678 -18994 -219634 243588 -76005 21531 -90556 395943 1847 403763 -38021
13111A70523b74546A01050j4464k6742L9953d5841l844n0307B25259g3018f153
$$ 170523 -274546 101050 86586 59844 99797 -45841 -49685 -99992 225259 -73018 -6153
13099A01311K7226c30379P4025Q6871I6386L2452C3671J19032a03891C05687A17693
$$ 101311 128537 -330379 -256354 -169483 96386 128838 33671 152703 -103891 305687 117693
13087B3144Q6840H635P2574h3448A16996J67359a65440O5161B09943G830J53286
$$ 23144 109984 8635 81209 -83448 116996 284355 -165440 -100279 209943 7830 161116
13076A61116J52009a63794A80156a4120D2233h528k0814B42563G0122J6393b6005
$$ 161116 313125 -163794 180156 -14120 42233 -8528 -29342 242563 70122 86515 -26005
13064A39661a28232M8219B45535c43996a58771A35778F1726J5751a3555A08565
$$ 139661 -128232 -80013 245535 -343996 -158771 135778 61726 77477 -13555 108565
13053c43025A07672K4483N2600a83484E9902k2539a47482A80627F0950a68584
$$ -343025 107672 132155 184755 -183484 59902 37363 -147482 180627 60950 -168584
13042a8031C13028F7002B3648J89409A5064g0358H8167b63313A4056J20752J7164
$$ -18031 313028 67002 23648 213057 15064 -70358 88167 -263313 14056 134808 151972
13031A51972a29570B37023q058A04147K92995G0535L58331b73836A8477f455F8963
$$ 151972 -129570 237023 228965 104147 397142 70535 428866 -273836 18477 -6455 68963
13019D40343A73775o8283J40284a26982b2631B40816o7971B7458N6093a37428
$$ 440343 173775 105492 245776 -126982 -22631 240816 172845 27458 83551 -137428
13008A47076N6631p1168P0298a47154A04905P3190d4763D5006P4547B4276a05662
$$ 147076 203707 132539 202837 -147154 104905 178095 -44763 45006 119553 24276 -105662
12996a9143B27956N4903a39362H7602a50496A60413a57790D10039a58528D5106
$$ -19143 227956 282859 -139362 87602 -150496 160413 -157790 410039 -158528 45106
12985a09542A62227K43190b04750F8370b96436d6082j93691F5394a2022A14575
$$ -109542 162227 405417 -204750 68370 -296436 -46082 -239773 65394 -12022 114575
12974G4879P6444h7282o3519a2511B18119N4870A6327a12632j6550M547M9472
$$ 74879 151323 -87282 -150801 -12511 218119 272989 16327 -112632 -129182 -124635 -75163
12963g5163D09185e2765H5643R8863r2120J8613K4902R8729F6153b84028B84992
$$ -75163 409185 -52765 85643 184506 92386 110999 135901 234630 66153 -284028 284992
12951d2175H6714N6184a06654A67524h6730A72242H4910f3739j85210h4651A38170
$$ -42175 86714 142898 -106654 167524 -86730 172242 84910 -63739 -248949 -84651 138170
12939a62642B84229b05727g3699J3149B02837A574b52837A88050a83851M6122
$$ -162642 284229 -205727 -73699 -60550 202837 1574 -252837 188050 -183851 -137729
12929a37729A3133a5065A28628f4134B25869j06074A7919L40932G8876j7873a15561
$$ -137729 13133 -15065 128628 -64134 225869 119795 17919 358851 78876 61003 -115561
12917a21855r1372g2423K8972A53307d9310F6838i2937A8591d09350f8923A22914
$$ -121855 -213227 -72423 -43451 153307 -49310 66838 -92937 18591 -409350 -68923 122914
12905C692a74871d8219l53678B18406a64955B15478k1110a28338B659Q7555A3643
$$ 3692 -174871 -48219 -401897 218406 -164955 215478 194368 -128338 2659 90214 13643
12893A02837J03369c6924A19787d06619B27715f3651A7146R5578c33032E8173
$$ 102837 206206 -36924 119787 -406619 227715 -63651 17146 112724 -333032 58173
12882A87187q9210L05351o6486H3038M6735Q6600A4215a50025K3809j65578C4469
$$ 187187 97977 403328 336842 83038 129773 216373 14215 -150025 -126216 -291794 34469
12870A4018O1962C6782b46377C44743d1027j04050e6237C18448A0050K68742c0364
$$ 14018 75980 36782 -246377 344743 -41027 -145077 -56237 318448 10050 278792 -30364
12858A26799f5915r2922L2821I7380L7339J8059L271J72793a32853B09811a07283
$$ 126799 -65915 -158837 -126016 97380 134719 152778 156049 328842 -132853 209811 -107283
12846g668K104C03475q8231L7294B1320M6574J59619b6144o5324G8153J44883
$$ -7668 -5564 303475 215244 252538 21320 67894 227513 -26144 -91468 78153 223036
12835B23036H3770B9492Q6193a51718F6275f8248G6479G526R1119a8916j53457
$$ 223036 83770 29492 115685 -151718 66275 -68248 76479 7526 98645 -18916 -172373
12824a72373g626l22306R0392k582B12716h4445c5744k1340k26829a0068E356
$$ -172373 -7626 -329932 -239540 -242122 212716 -84445 -35744 -57084 -283913 -10068 5356
12812b46671A53308a26852I1049a96562A31653e8750H1148C6564h6003G6027C7644
$$ -246671 153308 -126852 91049 -196562 131653 -58750 81148 36564 -86003 76027 37644
12800e2994A3713b10574J02651I7154O2326D1873b20424B51581a02673C16023
$$ -52994 13713 -210574 -107923 97154 159480 41873 -220424 251581 -102673 316023
12789a10119I5284P6116h0200A32326h3123j3488A87826L4450A8536e3006B8398
$$ -110119 95284 171400 -80200 132326 -83123 -96611 187826 222276 18536 -53006 28398
12777b75265A13161J52960j23096j0845b32830A93020a96731A09751H04a52292
$$ -275265 113161 266121 143025 132180 -232830 193020 -196731 109751 804 -152292
12766A21552a0952G9021M4920J5940d67380a76230G1724c44023b8437D9339a58745
$$ 121552 -10952 79021 123941 139881 -467380 -176230 71724 -344023 -28437 49339 -158745
12754b2246A31529F1483j2827G918a38030e150A52021c45659a66528B18997b68515
$$ -22246 131529 61483 48656 7918 -138030 -5150 152021 -345659 -166528 218997 -268515
12742a46469A35068n1396a67729j963M358C29903j8800F6531Q671b52197A16328
$$ -146469 135068 83672 -167729 -169692 -165334 329903 311103 66531 75202 -252197 116328
12730A4937K65026C6645M2018d09851G2056a8201B28050c5204g84A11660a37740
$$ 14937 279963 36645 78663 -409851 72056 -18201 228050 -35204 -784 111660 -137740
12718a01760L8508K8420A28034b95678A47270a23629I9819a9752E9000g3469B58503
$$ -101760 -63252 -34832 128034 -295678 147270 -123629 99819 -19752 59000 -73469 258503
12706a80720I6951K66044p9794m1796H7866R585l8977a22A24286Q4112H9288m0307
$$ -180720 96951 362995 283201 241405 87866 97451 58474 -122 124286 208398 89288 48981
12694D8981d3914D18946b48043D2511L97547f146q5750J3440C09085p4352a631
$$ 48981 -43914 418946 -248043 42511 440058 -6146 -91896 -78456 309085 234733 -1631
12682E9278b38425F9580A4287O14439A91612G7403M7823L2648P1479a18026j33126
$$ 59278 -238425 69580 14287 628726 191612 77403 125226 157874 229353 -118026 -251152
12671b51152A19967f1112A81509a11503A169g3779l7225a4943j43987i156H1256
$$ -251152 119967 -61112 181509 -111503 1169 -73779 -111004 -14943 -158930 -9156 81256
12659F7672a01613k15303i2012C32589G2815J20489r4100D4341b99574g7088a9234
$$ 67672 -101613 -316916 -92012 332589 72815 193304 99204 44341 -299574 -77088 -19234
12647I7127o653b5612I7752p03b1072A97941b90269I2971h2036H3107B105b84779
$$ 97127 90474 -25612 97752 97049 -21072 197941 -290269 92971 -82036 83107 2105 -284779
12634b11239A47860h3648C1325M6720M02353A14787L10552k01751b82206n4323
$$ -211239 147860 -83648 31325 78045 480398 114787 425339 223588 -282206 -336529
12624c36529G704Q8069N9721b0718D8150J0855J13720a41093F1144O8038D0602
$$ -336529 7704 95773 155494 -20718 48150 59005 172725 -141093 61144 129182 40602
12612B51009e1126I6483b19019J01078o578I2697a98874K4967C85143j29820b70684
$$ 251009 -51126 96483 -219019 -117941 -124519 92697 -198874 -173907 385143 255323 -270684
12600a7269A6901h665I2930a0294E7680i7282A90847I0249J72324A25661n0205
$$ -17269 16901 -8665 92930 -10294 57680 -97282 190847 90249 262573 125661 75456
12589G5456K2135J56007c0932J2434F2417M0174a60605C88035C3701a99974i568
$$ 75456 97591 253598 -30932 -18498 62417 102591 -160605 388035 33701 -199974 -9568
12577a14913C3879J3231a15862J3419b8931j23163K2565E3875b78538B9702J29865
$$ -114913 33879 47110 -115862 -102443 -28931 -152094 -129529 53875 -278538 29702 159567
12566A59567a9373j24399J009E1514J46710G7428c51990a34002A653K9497i6238
$$ 159567 -19373 -143772 -142763 51514 198224 77428 -351990 -134002 1653 31150 -96238
12554H4939J21147a81319c9526A85194J0299P3070j19685G2257a31028p3387E6092
$$ 84939 206086 -181319 -39526 185194 195493 268563 148878 72257 -131028 -204415 56092
12542A50876J02992b4786B12227A05368a04205I6451M7511o7642R3524o0282D5701
$$ 150876 253868 -24786 212227 105368 -104205 96451 143962 76320 169844 109562 45701
12530b070n3032K6052m8540C28444F4226a2539k73521d2995j01676N6211C73810
$$ -2070 -55102 -29050 -77590 328444 64226 -12539 -286060 -42995 -144671 -88460 373810
12518a23360A37109i6411D1976P1608a84598f754C00583j32516d5778q7403A27115
$$ -123360 137109 -96411 41976 113584 -184598 -6754 300583 168067 -45778 -133181 127115
12506a62517B67521i955j24262B79099A20051i7800d8544o6472j21593k608A47809
$$ -162517 267521 -9955 -134217 279099 120051 -97800 -48544 -115016 -236609 -239217 147809
12494G5561C1994R6006a00916j71786f8236B8510a80503I8739c4373I200K5300
$$ 75561 31994 128000 -100916 -272702 -68236 28510 -180503 98739 -34373 9200 34500
12483C4500a09272a719r8033A90391a57162H7570q819K6093R5334a39322e5633
$$ 34500 -109272 -1719 -99752 190391 -157162 87570 78751 104844 200178 -139322 -55633
12471b86014A98746a54420c1960k90886A1558j256a99924L367R0918r346r6712
$$ -286014 198746 -154420 -31960 -322846 11558 10302 -199924 -196557 -105639 -114985 -211697
12460b11697e216A44120d3438A97099a53188c3770q3562A70520a26903r8449e842
$$ -211697 -5216 144120 -43438 197099 -153188 -33770 -117332 170520 -126903 -225352 -5842
12448h4105m0358j20181L3136A18329N9668a58954N55A7755K48256a53721F8664
$$ -84105 -124463 -244644 -211508 118329 177997 -158954 -158399 17755 266011 -153721 68664
12436A1078a2205B38892C9615e9855A83909m6640f0495b4859I4707b17290j69908
$$ 11078 -12205 238892 39615 -59855 183909 137269 -60495 -24859 94707 -217290 -387198
12425c87198d6307k09961a13188A94428F0343J09837a5062A46547a68587C64636
$$ -387198 -46307 -256268 -113188 194428 60343 170180 -15062 146547 -168587 364636
12414F6322a6382p3538b6329l27420J38238A98813o8649K37093a39607B10813
$$ 66322 -16382 -89920 -26329 -353749 -215511 198813 130164 367257 -139607 210813
12403a72863a0380j04751A03634K576a78473A21473j5894K58455A3106J26660
$$ -172863 -10380 -115131 103634 106210 -178473 121473 105579 364034 13106 139766
12393A39766a92071D5025k393L09386I7355k5606j6087B1273c3118A14864E2337
$$ 139766 -192071 45025 42632 352018 97355 71749 55662 21273 -33118 114864 52337
12381a45659B9419a87873B64964p4260B5752J6807b44912H8192P1282a19917k5199
$$ -145659 29419 -187873 264964 190704 25752 42559 -244912 88192 159474 -119917 -145116
12370a45116B68134h4405P419E5214A8138J2238b13949F1244a50646A62296a33346
$$ -145116 268134 -84405 -76986 55214 18138 30376 -213949 61244 -150646 162296 -133346
12358a96188A22440J76255o0425b68093L0595M9805l05294a27604G1792f3530
$$ -196188 122440 298695 238270 -268093 -237498 -187693 -492987 -127604 71792 -63530
12347A04919b9130B92382i4108j68351m8464f9361H4898j7684a7074j05908E8548
$$ 104919 -29130 292382 -94108 -262459 -310923 -69361 84898 67214 -17074 -122982 58548
12335b11212F2953b28680l4937l8101A92625i5615B39391g0608D4609K85585G4630
$$ -211212 62953 -228680 -263617 -301718 192625 -95615 239391 -70608 44609 330194 74630
12323D6141c13775c9294A74933D2030M05710E2237a44890A75142D9914K0465i0012
$$ 46141 -313775 -39294 174933 42030 447740 52237 -144890 175142 49914 70379 -90012
12311a95266Q4902M9457j04586G0620b82098c1534F2400a43609m2001O3234i082
$$ -195266 -110364 -60907 -165493 70620 -282098 -31534 62400 -143609 -185610 -122376 -9082
12299G8513J46157q0204a23796C4291b77501g2680m1631G3370b24609C65337b38247
$$ 78513 224670 144466 -123796 34291 -277501 -72680 -114311 73370 -224609 365337 -238247
12287d0538j55351j57091B87941g8441B43319p1555a83614A59168a90967A95532
$$ -40538 -195889 -352980 287941 -78441 243319 171764 -183614 159168 -190967 195532
12276I4397J15853a0051j73125D6738J91134J06685b27118I7051A2918f3000o8418
$$ 94397 210250 -10051 -183176 46738 237872 344557 -227118 97051 12918 -63000 -131418
12265a31418e6378B83795A1669f2403A04447K41927P9389a01971E1988Q5883b25129
$$ -131418 -56378 283795 11669 -62403 104447 346374 425763 -101971 51988 137871 -225129
12253A92821I3366l2693K29762Q4402c3938E1245c8853B39892h3035D18b60744
$$ 192821 93366 60673 290435 374837 -33938 51245 -38853 239892 -83035 418 -260744
12241C0806J7268K3471L2751J04884K1198C7710N7873a7697C79876a67235A04047
$$ 30806 48074 71545 104296 209180 230378 37710 95583 -17697 379876 -167235 104047
12229I4047F558N7812f3648A81011K54736G4298N08543A54199a02362j38900D03849
$$ 94047 6558 64370 -63648 181011 435747 74298 582841 154199 -102362 -241262 403849
12217F0731a14494C35225a94967B15509e9904b6220B70399J07646I5324K5986
$$ 60731 -114494 335225 -194967 215509 -59904 -26220 270399 378045 95324 121310
12207A21310F0578J6148M1776J18166A09806J16782b8442m301H4281J24198E4257
$$ 121310 60578 76726 118502 236668 109806 226588 -28442 -32743 84281 208479 54257
12195A95276g7301B26391B8176J32976o9225K4530J87394A09570J10946l8593
$$ 195276 -77301 226391 28176 161152 91927 116457 303851 109570 220516 181923
12185A81923a20572C11396h9898A87438a45735a6613j83989B16366b75384i5176
$$ 181923 -120572 311396 -89898 187438 -145735 -16613 -200602 216366 -275384 -95176
12174B01965a34446H3702l0596n224K34979G2278L8583E0443J23984a01080A45595
$$ 201965 -134446 83702 53106 47882 282861 72278 110861 50443 174427 -101080 145595
12162C82978A67048J35723I3267F747K09415h0262r0486J1253B02294o0574n2232
$$ 382978 167048 302771 93267 6747 216162 -80262 -170748 -159495 202294 141720 89488
12151H9488J68885N8835C7813J12007G0313J20511a36356E9495d19226a57711
$$ 89488 258373 317208 37813 149820 70313 190824 -136356 59495 -419226 -157711
12140B37632a51553m0621N2734O1382D6628J83323E0546J71022B3743L03713A30434
$$ 237632 -151553 -192174 -139440 -78058 46628 229951 50546 221568 23743 327456 130434
12128E7221O0292a42253b3092B58860j1723h8318b807j4621C8441c69569a75621
$$ 57221 117513 -142253 -23092 258860 247137 -88318 -2807 -17428 38441 -369569 -175621
12116A56877l6960I801d45109A6246J76435b64198a16239F7549I880b49061C08591
$$ 156877 119917 9801 -445109 16246 192681 -264198 -116239 67549 9880 -249061 308591
12104B79769l9134j06165a6199D7750R2290m1669J75230n1678e9898j8427a3384
$$ 279769 240635 134470 -16199 47750 140040 98371 273601 221923 -59898 -78325 -13384
12092b41852A1715O4003a61704B29084B8146J81434b9405I6091b8325r3109A68117
$$ -241852 11715 75718 -161704 229084 28146 209580 -29405 96091 -28325 -121434 168117
12080D71971F7082i2141j74949H3838c22356b7856j89258G5181a10917l5102B44026
$$ 471971 67082 -92141 -267090 83838 -322356 -27856 -217114 75181 -110917 -146019 244026
12068B1360c298A39833J36130b17874A22927J75795p2607J86396j64201q0202
$$ 21360 -3298 139833 275963 -217874 122927 298722 226115 412511 248310 168108
12058A68108b09429g034j65458B77132b13376N9578B28403a19960p4740A2359
$$ 168108 -209429 -7034 -172492 277132 -213376 -153798 228403 -119960 -194700 12359
12047E2332a2049A16774E1628b39930H0238d0037j07918J1159I7375b01680A26965
$$ 52332 -12049 116774 51628 -239930 80238 -40037 -147955 -136796 97375 -201680 126965
12035a09438L4353A95810q7150O5157e2408j03957K1833A27112a25030B03951
$$ -109438 -75085 195810 108660 173817 -52408 -156365 -134532 127112 -125030 203951
12024A26016K093D5551J42876a92545A70687H1499Q3263c3166q7612H5301b00020
$$ 126016 128109 45551 188427 -192545 170687 81499 164762 -33166 -120778 85301 -200020
12012D8466m953j5019K14962F5158a29954A14770O1000f1014A70716c22088C7392
$$ 48466 43513 28494 243456 65158 -129954 114770 175770 -61014 170716 -322088 37392
12000B07502I0187a3520E0853b92776d4428b0700D4406R2616g8376B27455h2227
$$ 207502 90187 -13520 50853 -292776 -44428 -20700 44406 137022 -78376 227455 -82227
11988a84309E7927a42824A491L6241a41880A0878J17859b71606c6791D6871c90072
$$ -184309 57927 -142824 1491 37732 -141880 10878 128737 -271606 -36791 46871 -390072
11976a69873j25675e3032A20560M9221b2616A62531P3579g4821A86550a94357
$$ -169873 -295548 -53032 120560 169781 -22616 162531 236110 -74821 186550 -194357
11965b4860j177I7151b18034n7172a24854N4110l389o8241H4735g2578k63571
$$ -24860 -26037 97151 -218034 -275206 -124854 -70744 -74133 -142374 84735 -72578 -336149
11954c36149I4676a99638B5956g6760C214g6028j90616B76407F8731g5306o1238
$$ -336149 94676 -199638 25956 -76760 3214 -76028 -266644 276407 68731 -75306 -136544
11943a36544c6660k07447H2647a17648B65580i5224j6775J7145r7229E9931a9601
$$ -136544 -36660 -244107 82647 -117648 265580 -95224 -111999 -94854 -192083 59931 -19601
11931A49644e8401C57738b16270B20681A2241b9929l31898a53347M1084i909j39860
$$ 149644 -58401 357738 -216270 220681 12241 -29929 -361827 -153347 -112263 -9909 -149769
11920a49769d2636D6594c81744J85653Q1954j49303J31074M7448j48227n7177
$$ -149769 -42636 46594 -381744 -196091 -114137 -263440 -132366 -84918 -233145 -290322
11910b90322j5716G5914g9031K5401A78008j6677J4994a54654k8375b0020A1165
$$ -290322 -306038 75914 -79031 -53630 178008 161331 176325 -154654 -183029 -20020 11165
11898a62823B40184d00675B1428a93189d4597j48733d6880D6317J20973a29409
$$ -162823 240184 -400675 21428 -193189 -44597 -193330 -46880 46317 167290 -129409
11887b05169O6890M9404A53126l0674N3995o7932b36308c5548j39302D53923D5829
$$ -205169 -138279 -88875 153126 122452 176447 108515 -236308 -35548 -174850 453923 45829
11875F290d4166m0140B39813c75917J76910B05659b14911N2532g6502k03985A39390
$$ 6290 -44166 -84306 239813 -375917 -199007 205659 -214911 -162379 -76502 -280487 139390
11863b9634j68700A39800a66484e0328o8308C5674a08465A2205O2979J68006b16048
$$ -29634 -198334 139800 -166484 -50328 -118636 35674 -108465 12205 75184 243190 -216048
11851a45258A26945h008D4944b73128a33895D241d2846m2968L3103j40875I9110
$$ -145258 126945 -8008 44944 -273128 -133895 4241 -42846 -85814 -52711 -193586 99110
11839G1719j3304J51141d98645d5659r1223B0579d26386A68596g3871j75329i0577
$$ 71719 58415 209556 -498645 -45659 -136882 20579 -426386 168596 -73871 -249200 -90577
11827B1378a61064h0082B88679G0395e2783r3308l2077A64252n1606a08206j92531
$$ 21378 -161064 -80082 288679 70395 -52783 -146091 -178168 164252 112646 -108206 -300737
11816c00737g6143I0942g8280C8128R2365Q8359a35701A08927d32485a97501P3321
$$ -300737 -76143 90942 -78280 38128 130493 218852 -135701 108927 -432485 -197501 -124180
11805a24180q3395P3897A73801d5641I08M699a78683E5784N2374i6366j91731
$$ -124180 -207575 -133678 173801 -45641 908 5607 -178683 55784 108158 -96366 -288097
11794b88097B9169J31035h929B23480a3050A34159e1939A28623n3222J42819g4528
$$ -288097 29169 160204 -8929 223480 -13050 134159 -51939 128623 75401 218220 -74528
11782B9991e1021C95138b314F6412b9217J2687I9744h3255K9939B47753b10123
$$ 29991 -51021 395138 -2314 66412 -29217 -16530 99744 -83255 -53316 247753 -210123
11770a82589A3779c23439d6387j76739G3962A8878L6162d30753D4949J07096J45493
$$ -182589 13779 -323439 -46387 -223126 73962 18878 55040 -430753 44949 152045 297538
11759B97538b28435A31661d7756e085n9807H3170c5086B60358b94987A30209a0656
$$ 297538 -228435 131661 -47756 -5085 -64892 83170 -35086 260358 -294987 130209 -10656
11747c0939j45752I3431J71026O1579f6547b8145o0484A29221j0669b12404O9642
$$ -30939 -176691 93431 264457 326036 -66547 -28145 -88629 129221 118552 -212404 -142762
11736a42762d1102A7226i2886A79671d1693A23571B696i1895j55389d492j60720
$$ -142762 -41102 17226 -92886 179671 -41693 123571 2696 -91895 -247284 -4492 -165212
11725a65212d2902A96148F6104b70767I6915c4945H8150L1816L413L6241m5670
$$ -165212 -42902 196148 66104 -270767 96915 -34945 88150 119966 123379 159620 113950
11714A13950L2008p1824a78992g5171B1446c5919r0099C5495b43247J09492N8895
$$ 113950 145958 74134 -178992 -75171 21446 -35919 -126018 35495 -243247 -133755 -74860
11703g4860C17462E2173L37876A8981a32913A23362J7232l061K88961F0249A7945
$$ -74860 317462 52173 390049 18981 -132913 123362 140594 137533 426494 60249 17945
11691B20874R7251D6356J54878e2271J4516I7344a19355C28182A10429g5903C9406
$$ 220874 318125 46356 201234 -52271 -37755 97344 -119355 328182 110429 -75903 39406
11679a22338p8318B43813e9260A80414a22353b2416A95580f4253A22276k6992
$$ -122338 -200656 243813 -59260 180414 -122353 -22416 195580 -64253 122276 95284
11669I5284a17212j53038A47615j4583b3753k81278E025a04993B94752A09408
$$ 95284 -117212 -270250 147615 133032 -23753 -305031 5025 -104993 294752 109408
11658a15055A8448K31034G5133J2461J00290o1805J43115a48703K0833j0689e2357
$$ -115055 18448 249482 75133 87594 187884 126079 269194 -148703 -127870 -138559 -52357
11646a18100A4730b21922B72761D0781f7390A0561e2322q9043B15199m4193a02018
$$ -118100 14730 -221922 272761 40781 -67390 10561 -52322 -141365 215199 171006 -102018
11634B38460j00179M80593B78734a56908G7171N8272m7388h6549k73061A48763
$$ 238460 138281 618874 278734 -156908 77171 135443 88055 -86549 -359610 148763
11623a24276C54J4596b17754a5547e298D9924a01676C41934e7519B53118a19751
$$ -124276 354 14950 -217754 -15547 -5298 49924 -101676 341934 -57519 253118 -119751
11611f1432j19516C00268j25815j6499a26359r7319j05450B1465A6c1802P872
$$ -61432 -180948 300268 174453 157954 -126359 -223678 -329128 21465 16 -31802 -23930
11600b3930B4345K01656f1545b4755p3144L8153j41979A37420h4828A8847b82397
$$ -23930 24345 226001 -61545 -24755 -97899 -59746 -201725 137420 -84828 18847 -282397
11588B05827b65425Q1668B97171D6005J93456b54542A84414g8414q7878L3228
$$ 205827 -265425 -183757 297171 46005 239461 -254542 184414 -78414 -166292 -133064
11578a33064j23449D4258b71492A9096a43874B55794N4483M9453a94206B49058
$$ -133064 -256513 44258 -271492 19096 -143874 255794 310277 359730 -194206 249058
11567F3851K8278J77991A21177b60058c5911D1993b9916A07107i6347Q185H7766
$$ 63851 92129 270120 121177 -260058 -35911 41993 -29916 107107 -96347 -88162 87766
11555F1106J54912a97439G0993J53617a66258b0018m6015q2258B5272J96104E5973
$$ 61106 216018 -197439 70993 224610 -166258 -20018 -66033 -148291 25272 221376 55973
11543a09447m6843g7430m6559A15858A0909b6925F7280N442l0515b057o9280A35167
$$ -109447 -156290 -77430 -123989 115858 10909 -26925 67280 72722 42207 -2057 -71337 135167
11530B1508q605b53915A92739G0336b6559l0173g41B21893a53147k4040b8606
$$ 21508 12903 -253915 192739 70336 -26559 -56732 -741 221893 -153147 -177187 -28606
11518F6113A1859a97704d1350H974J03457R2902A4116N0715J81761b30383N663
$$ 66113 11859 -197704 -41350 8974 112431 205333 14116 64831 246592 -230383 -224720
11507b24720A91104F9944g645l07552f929j09885G9131d1119n7393F2244K13634
$$ -224720 191104 69944 -7645 -315197 -6929 -116814 79131 -41119 -98512 62244 275878
11496B75878A8633n300a55844D059M51g9264B56897A7457c326j63316B53311f0397
$$ 275878 18633 13333 -155844 4059 4510 -79264 256897 17457 -3326 -166642 253311 -60397
11483A16741M9761Q4104a85530A67442N6846G5748j9492a04383A18863E5794L02754
$$ 116741 166502 250606 -185530 167442 224288 75748 56256 -104383 118863 55794 358548
11472C58548j61905E7840M912J26445D9490i8530C59313a4919k93789H9228B1874
$$ 358548 196643 57840 62752 189197 49490 -98530 359313 -14919 -308708 89228 21874
11460b908C8395O281J72449B8285c30786F4265f6228A89562c2539L752A54297
$$ -2908 38395 44676 217125 28285 -330786 64265 -66228 189562 -32539 -28787 154297
11448A92135b02667b3003j14027O1509C83839a2431j8297k02477A48803b26307
$$ 192135 -202667 -23003 -137030 -75521 383839 -12431 -30728 -233205 148803 -226307
11437C66415e7560J4829A21262b39581A44378a35951C44840d0030A32133d4872
$$ 366415 -57560 -42731 121262 -239581 144378 -135951 344840 -40030 132133 -44872
11426a03050A33517b18552i7734K0569q5388f1930g389C4540a60422e2541E24
$$ -103050 133517 -218552 -97734 -77165 -162553 -61930 -7389 34540 -160422 -52541 524
11414d8796k29988i2163o686l8394c712j25976m1002D1411a48706A54131l837
$$ -48796 -278784 -92163 -98849 -137243 -3712 -129688 -170690 41411 -148706 154131 150294
11403A50294n8864K27598j57379b01843Q0573H5052h6516j07054C1978f4044B3741
$$ 150294 91430 319028 161649 -201843 -121270 85052 -86516 -193570 31978 -64044 23741
11391i7383k2425k9638A0739h3013G5603H748d8057A69473a63456P7597q2918
$$ -97383 -119808 -149446 10739 -83013 75603 8748 -48057 169473 -163456 -85859 -168777
11380a68777A99383l168G3418C4117J28272A7639J18135h8846p4461j2989O9029
$$ -168777 199383 196215 73418 34117 162389 17639 135774 -88846 -163307 -176296 -107267
11369a07267c4022j71198i6590A66124C2957P566b41863J3630c4197k81713F1200
$$ -107267 -34022 -205220 -96590 166124 32957 40523 -241863 -228233 -34197 -315910 61200
11357A22614O2728c31043K1786A94679a29770C75694i994j64573C19238d37793
$$ 122614 185342 -331043 -309257 194679 -129770 375694 -9994 -174567 319238 -437793
11346a28799A0440d98223D1155J29421a58692k30234A50500c4421E3599J30863
$$ -128799 10440 -498223 41155 170576 -158692 -388926 150500 -34421 53599 184462
11336A84462F1574g6981B9925M9294a28789K8299E2749R4149b53453C1236a686
$$ 184462 61574 -76981 29925 79219 -128789 -100490 52749 146898 -253453 31236 -1686
11324A09410m3223a12374J820F7860O1910b436q7671n0031k05994h6273k31882
$$ 109410 66187 -112374 -110554 67860 129770 -2436 -90107 -140138 -346132 -86273 -318155
11313c18155C9581a50756a1097j07679k56566i4912K3968K4461j8433A08333c1895
$$ -318155 39581 -150756 -11097 -118776 -375342 -94912 -70944 -46483 -64916 108333 -31895
11301b04776R1513d265n3390m3955d8880b392r7027c6310m03153a36902j62629
$$ -204776 -113263 -4265 -57655 -101610 -48880 -2392 -99419 -36310 -439463 -136902 -299531
11290b99531c4983l54147J84699B57158E4658E964J2804Q6093m1915J27272f6886
$$ -299531 -34983 -389130 -204431 257158 54658 5964 18768 104861 62946 190218 -66886
11278a23671o1080h7688B6623R3870a47760g0144B63436g9430k03316f2639j04569
$$ -123671 -184751 -87688 26623 120493 -147760 -70144 263436 -79430 -282746 -62639 -167208
11267a67208B69465g5837A93490D1490b68016A07572b606A90770p5079g7965A47015
$$ -167208 269465 -75837 193490 41490 -268016 107572 -2606 190770 115691 -77965 147015
11255a19783j30149h5284j9962c5101D75b40776O3287C1421J31699B1322c73827
$$ -119783 -249932 -85284 -105246 -35101 475 -240776 -177489 31421 163120 21322 -373827
11243C5239K28238h2375J0502R238j06421d3768B19425a21993J4800B95169q5530
$$ 35239 263477 -82375 -71873 -62635 -169056 -43768 219425 -121993 -107193 295169 209639
11232B09639c07993q7103c9859J2097O013I1359P024b66838J9308E3427a23870
$$ 209639 -307993 -395096 -39859 -27762 -21749 91359 98383 -266838 -247530 53427 -123870
11220B14903b25317Q2431O2465L3642B60346B508a76274F9201a8673A071K37930
$$ 214903 -225317 -142886 -80421 -46779 260346 2508 -176274 69201 -18673 1071 239001
11209B39001j05839g9931b0146k148B88702I7372N2935I708a37058C0188f352
$$ 239001 133162 -79931 -20146 -22294 288702 97372 150307 9708 -137058 30188 -6352
11197b0798A06797a2030H2845d77340h2526B7817f4874A28748a43786e566k3274
$$ -20798 106797 -12030 82845 -477340 -82526 27817 -64874 128748 -143786 -5566 -28840
11186b8840A3346d3557j24092K0393K3164A79664e8192C4882b14898B0244K1415
$$ -28840 13346 -43557 -167649 -147256 -124092 179664 -58192 34882 -214898 20244 41659
11175D1659J94895f78735a6975A53537J29554f4j23921N830l07750A77463h6786
$$ 41659 236554 -678735 -16975 153537 283091 -64 -123985 -118155 -425905 177463 -86786
11163c66444A86210K76111H9585N0494A9908b33599D5691J88a07174L1806j58273
$$ -366444 186210 462321 89585 140079 19908 -233599 45691 45879 -107174 -75368 -233641
11152b33641A5023b14020I0257a75495A04653C1139J40824a80572A96602c216
$$ -233641 15023 -214020 90257 -175495 104653 31139 171963 -180572 196602 -3216
11141a85514R0492J0428A06321a59910J7423A88838b41989I6691m2122h4337A7677
$$ -185514 -95022 -84594 106321 -159910 -142487 188838 -241989 96691 54569 -84337 17677
11129A26937b72044D41855b2267A74554a43385c8824n5568G6794b01312Q6628
$$ 126937 -272044 441855 -22267 174554 -143385 -38824 -94392 76794 -201312 -114684
11119a14684L8870B53816a89053d8011A2676B214c024H5919j411j5931b4680j13840
$$ -114684 -75814 253816 -189053 -48011 12676 2214 -3024 85919 84508 68577 -24680 -138520
11107a38520b8298j58048P1601M0436k1602B69809q9320N2582B5840K53035G2338
$$ -138520 -28298 -186346 -114745 -74309 -95911 269809 180489 233071 25840 278875 72338
11095b87319A31242c97078a65622C39834a10998a4134B84528j10782p9029L85150
$$ -287319 131242 -397078 -165622 339834 -110998 -14134 284528 173746 94717 479867
11085D79867a45530A2556M38963a29277p405I1169J4692L52656j66160A20076
$$ 479867 -145530 12556 451519 -129277 -136682 91169 105861 458517 292357 120076
11074A80119J05037J15106A03013M5480Q2240B5369g3469D02292B00031r1405
$$ 180119 285156 400262 103013 148493 230733 25369 -73469 402292 200031 108626
11064A08626K51037P1204j27108K5764N8495A47309o097K81991M5332k8750q6210
$$ 108626 359663 430867 303759 329523 388018 147309 141212 423203 468535 439785 353575
11053C53575I8979P9446Q3344E1030J66675L31566A70612K61620J21384M7950
$$ 353575 98979 178425 261769 51030 217705 549271 170612 432232 553616 601566
11043F01566j85051Q328k0293K03330E4915O21723B32122O0090L85580M8307K3246
$$ 601566 416515 424843 404550 607880 54915 676638 232122 292212 677792 726099 749345
11032G49345l50395o6909O9080L58340l56448K2223r9275L27932K6251p8536B46715
$$ 749345 398950 332041 401121 759461 403013 425236 325961 653893 680144 601608 246715
11020E80416K24037C51903b3445C35721K55414B66520M92860A90994K66104J0679
$$ 580416 804453 351903 -23445 335721 591135 266520 759380 190994 457098 467777
11010D67777q7730j70864M24202p8998p9651k1269l8221K44641B48856J25194
$$ 467777 380047 209183 633385 554387 474736 453467 415246 659887 248856 374050
11000C74050m2870o9028K40236B16271K29162j12259J96182J3415K67053B78047
$$ 374050 331180 262152 502388 216271 445433 333174 529356 542771 809824 278047
10989F34093B45890K29365J20014J98846J0136k84381k12043K25255J60203l1769
$$ 634093 245890 475255 595269 794115 804251 519870 307827 533082 693285 661516
10979F61516J74588k82627M38168k71689J26975J85877K70741l21428L96131J92421
$$ 661516 836104 553477 991645 719956 846931 1032808 1303549 982121 1378252 1570673
10969A570673r4008K73472j36085Q8313k01954K6029k46888j90243Q1992r943
$$ 1570673 1476665 1750137 1614052 1702365 1500411 1526440 1279552 1089309 1171301 1161358
10959A161358l05402O97126k50997l4979k35551L08529m20852J74726j74247K6798
$$ 1161358 855956 1553082 1302085 1267106 1031555 1340084 919232 1093958 919711 946509
10949I46509n8493k25484L6537j87709p7386j72020A5852J86733k2691K234B2446
$$ 946509 888016 662532 699069 511360 433974 261954 15852 202585 179894 182128 22446
10937I3220a09304B06523o5475J3551J57994A15901J02663b35786e2967G2461
$$ 93220 -109304 206523 141048 154599 312593 115901 218564 -235786 -52967 72461
10926H5931J00187n264a32917B12285J1141K28591A20855K1595b7424C7311K33054
$$ 85931 186118 180854 -132917 212285 223426 452017 120855 142450 -27424 37311 270365
10915B70365B1540a75250B79714a8074j73531C2866K467a02732B43657F9280i925
$$ 270365 21540 -175250 279714 -18074 -191605 32866 35333 -102732 243657 69280 -9925
10903h6326j76365A25408a19218K4055l9934O072B691b1259B1044a08249D445
$$ -86326 -262691 125408 -119218 -95163 -135097 -129025 2691 -21259 21044 -108249 4445
10891A0236e4733I956c5476B10528q1180b05739d4566j72208d9717A39888a79984
$$ 10236 -54733 9956 -35476 210528 129348 -205739 -44566 -216774 -49717 139888 -179984
10879c20636a60081H1812C1886e8401k04738a4010b998A31489f358H6020J24943
$$ -320636 -160081 81812 31886 -58401 -263139 -14010 -2998 131489 -6358 86020 210963
10868B10963G6719J12368d6680H7541g9187o4473L1575n5089D1802a22395B6376
$$ 210963 76719 189087 -46680 87541 -79187 -143660 -112085 -167174 41802 -122395 26376
10856A08199D9639b42436j3803h6741j42788o0460J43133A82026o5552H511a78554
$$ 108199 49639 -242436 -256239 -86741 -229529 -289989 -146856 182026 116474 8511 -178554
10844c21245A17184a2694l9317I8145h6073j62085A53448b90867B03830G2331
$$ -321245 117184 -12694 -52011 98145 -86073 -248158 153448 -290867 203830 72331
10833E1154a12168C7211d7322M657H0264J23564c29014A75605b14426j22182J09572
$$ 51154 -112168 37211 -47322 -42665 80264 203828 -329014 175605 -214426 -336608 -227036
10822b27036d4024l10990h4034k18508h952D0886Q0911a29715B84796A2881b00282
$$ -227036 -44024 -355014 -84034 -302542 -8952 40886 121797 -129715 284796 12881 -200282
10810B44038d44071I4021h7646p956k72836a00967K9357j7728e326A498e2498
$$ 244038 -444071 94021 -87646 -95602 -368438 -100967 -71610 -89338 -5326 1498 -52498
10798I9008e3985p9034O43F7128b31925M7206G5224J7469b25016O2514A26937
$$ 99008 -53985 -133019 -132376 67128 -231925 -184719 75224 92693 -225016 -162502 126937
10786A02841b04351J5626M6486M4293M846j10862d4014j35902p558Q8202A77275
$$ 102841 -204351 -188725 -142239 -97946 -93100 -203962 -44014 -179916 -187474 -99272 177275
10774b12634P1380N1417L1664A33700k0849a1607B31912F3743Q2209f6081k6973
$$ -212634 -141254 -89837 -58173 133700 112851 -11607 231912 63743 145952 -66081 -93054
10763i3054J0636r9545f3468k62554J44008a1773k4653j55597A00026a18178J6911
$$ -93054 -82418 -181963 -63468 -326022 -182014 -11773 -36426 -192023 100026 -118178 -101267
10752a01267G977a03278j72303A01863D3854b86439A42731k9635l7716J2739a93778
$$ -101267 7977 -103278 -275581 101863 43854 -286439 142731 113096 75380 88119 -193778
10740B2138h2969a3840q8880A98377a56837G4242a30201A0023b4000r9660o4962
$$ 22138 -82969 -13840 -102720 198377 -156837 74242 -130201 10023 -24000 -123660 -188622
10729a88622A52796C9018h2662D94107c84988h3905k70039a74074A22301C6107
$$ -188622 152796 39018 -82662 494107 -384988 -83905 -353944 -174074 122301 36107
10718i8493G2610q598h3401r1050e0131A96022a71775C1920K0334c88960A34980
$$ -98493 72610 64012 -83401 -174451 -50131 196022 -171775 31920 52254 -388960 134980
10706C22203f3070J678K5257A37973d806A16859R584b06789A54947a8378l20661
$$ 322203 -63070 -61392 -36135 137973 -4806 116859 126443 -206789 154947 -18378 -339039
10695c39039c423k56737A12580a50363e451E5308r182C897a15169o6340l7561
$$ -339039 -3423 -260160 112580 -150363 -5451 55308 46126 3897 -115169 -181509 -219070
10684b19070j40180b9442j35382L9332I5654d3614j19684k7855A02071J9168c9057
$$ -219070 -359250 -29442 -164824 -125492 95654 -43614 -163298 -191153 102071 121239 -39057
10672A3277J40014E7363J1251j3021P2235d9380A09536b63195G4148P9737h1077
$$ 13277 153291 57363 68614 55593 127828 -49380 109536 -263195 74148 153885 -81077
10660a15049H3996c28254a07646n6626B22038a92711H788R9000m7729i9923B70093
$$ -115049 83996 -328254 -107646 -164272 222038 -192711 8788 107788 60059 -99923 270093
10648b3792m61327K09774C301O7974a42591M4855l52546b02190h5930m1774a985
$$ -23792 -485119 -275345 3301 71275 -142591 -97736 -450282 -202190 -85930 -127704 -1985
10636a5100j6421j49186c4983j49147A14859M5794b18413B14970I2791c6119B3536
$$ -15100 -31521 -180707 -34983 -184130 114859 160653 -218413 214970 92791 -36119 23536
10624A06775C6037h7757i421j68155d8577C6137c51112J52354R5293l3122D1056
$$ 106775 36037 -87757 -9421 -177576 -48577 36137 -351112 -198758 -103465 -136587 41056
10612A69905F8810a2982j73448E7385a92209I1071c7077q9240B05340b17255A2059
$$ 169905 68810 -12982 -186430 57385 -192209 91071 -37077 -126317 205340 -217255 12059
10600B72075d7791r177A16499a11305C01060c67637J44492H1155b06335k3727
$$ 272075 -47791 -56968 116499 -111305 301060 -367637 -223145 81155 -206335 -230062
10590b30062A83936b06926H5320J6763j9841J13634m1302m4125c68869H3056c17018
$$ -230062 183936 -206926 85320 102083 82242 195876 154574 110449 -368869 83056 -317018
10578a30293p0484d8843J9693H3700a76486M9699E8404j1015a88601p5504L1967
$$ -130293 -200777 -48843 -29150 83700 -176486 -126787 58404 47389 -188601 -264105 -232138
10567b32138j30596A37503h0951G3409c069A37570l7198a23086k4816c6820b115
$$ -232138 -362734 137503 -80951 73409 -3069 137570 100372 -123086 -147902 -36820 -2115
10555C7339j1187N7599N9068O8582A02358a6712I0357d1562k23133p1099A6456
$$ 37339 26152 83751 142819 211401 102358 -16712 90357 -41562 -264695 -335794 16456
10543c277E5104a34829G2814M0843a22257G4308b1764D6342h0494m9092r55B8895
$$ -3277 55104 -134829 72814 113657 -122257 74308 -21764 46342 -80494 -129586 -130541 28895
10530a18765E1961e6521E776L15583j55563a25116E204K01340a48674A3378f0837
$$ -118765 51961 -56521 5776 321359 165796 -125116 5204 206544 -148674 13378 -60837
10518e09470a1648k21758E8039f2897A9935b21109a07225m0341L1771j3182p9315
$$ -509470 -11648 -233406 58039 -62897 19935 -221109 -107225 -147566 -115795 -128977 -208292
10507b08292D4150a16576A9868R9571l8972a46830N300C494J63531q997l8632
$$ -208292 44150 -116576 19868 119439 80467 -146830 -141530 3494 167025 158028 119396
10496A19396K2986b23811j4328g3997G0779B7132b8340f632J031j56358K4660
$$ 119396 142382 -223811 -238139 -73997 70779 27132 -28340 -6632 -5601 -161959 -137299
10485a37299D3159J22122p0097D0944O9373J53534A14651L04389o5186J64289
$$ -137299 43159 165281 95184 40944 110317 263851 114651 419040 353854 518143
10475E18143B39569B7676L16179d637j05872A02591I344i9148a0252C8942d25450
$$ 518143 239569 27676 343855 -4637 -110509 102591 9344 -99148 -10252 38942 -425450
10463c14679E7453d6029A98120a21614j40799H7704h5881B50564C7798L5361c0496
$$ -314679 57453 -46029 198120 -121614 -262413 87704 -85881 250564 37798 73159 -30496
10451d8235k81377a25997k11402M2035I8901C3925a28595J4692A3358K10106b21555
$$ -48235 -329612 -125997 -337399 -295364 98901 33925 -128595 -113903 13358 223464 -221555
10439i058K625A95618b44181A6356a16358B46916F0915h7986c3369B6190a00587
$$ -9058 -6433 195618 -244181 16356 -116358 246916 60915 -87986 -33369 26190 -100587
10427g8476C68814g1716A59025J34501b86836L0017c6420l33433c1944J4154C0520
$$ -78476 368814 -71716 159025 293526 -286836 -256819 -36420 -369853 -31944 -17790 30520
10415B15196e0417G2967b8155I2449b130m85900g2953H5473a83739B910K30288
$$ 215196 -50417 72967 -28155 92449 -2130 -488030 -72953 85473 -183739 2910 233198
10404B33198d497C64315A54030m4481b00720h1966k7724q8108e4545n5851j14494
$$ 233198 -4497 364315 154030 109549 -200720 -81966 -109690 -197798 -54545 -110396 -224890
10393b24890a03051j3421A5033d30634A52834f5900k41437Q9212B87832a50530
$$ -224890 -103051 -116472 15033 -430634 152834 -65900 -307337 -218125 287832 -150530
10382H741f9125m8252D66029b6603H1152i7484A25219J4768F7850L44532j10491
$$ 8741 -69125 -117377 466029 -26603 81152 -97484 125219 139987 67850 412382 301891
10371C01891j2272M0498f49C04922r7236j4253J64621L0716A90223O7798J27524
$$ 301891 289619 330117 -649 304922 207686 193433 358054 388770 190223 258021 385545
10360C85545j04146j38713o9864b21597A24230f1952j43731B71641j04095o7737
$$ 385545 281399 142686 72822 -221597 124230 -61952 -205683 271641 167546 99809
10350I9809a26360B89507J17106p2662L1694I565J79113c2036C86349A80563L3617
$$ 99809 -126360 289507 406613 333951 365645 9565 188678 -32036 386349 180563 214180
10339B14180o1418b9602B15932J3775F1298a07890h636l488C4091b84096J08740
$$ 214180 152762 -29602 215932 229707 61298 -107890 -8636 -12124 34091 -284096 -175356
10328a75356B41428a17035c2985B1437J6116a39402j5553B36147c6912H488J20579
$$ -175356 241428 -117035 -32985 21437 37553 -139402 -154955 236147 -36912 8488 129067
10317A29067c8571A74758B8897M29009A22855R6947H6462j0145O2553l9140b55548
$$ 129067 -38571 174758 28897 457906 122855 219802 86462 76317 138870 99730 -255548
10305e3439A60098A6048a52176k76874a95939c3592E3956a36116B9875b03197
$$ -53439 160098 16048 -152176 -429050 -195939 -33592 53956 -136116 29875 -203197
10294G5148a47636C5885L7199l4549J58280D9023b44381e5414j21543O9536B76412
$$ 75148 -147636 35885 73084 38535 196815 49023 -244381 -55414 -176957 -107421 276412
10282a07753o147H8479j8792J9279b3360P559A74485G4130K13642b67086H8898
$$ -107753 -113900 88479 69687 88966 -23360 -15801 174485 74130 287772 -267086 88898
10270a89608G000b34576A2418b29633i7745a625j11003B54454f514j33069b8354
$$ -189608 7000 -234576 12418 -229633 -97745 -1625 -112628 254454 -6514 -139583 -28354
10258C108i1357A49726j0054F8702J09845J70926A23288J9909h2605H5683a27147
$$ 3108 -91357 149726 139672 68702 178547 349473 123288 143197 -82605 85683 -127147
10246A11400B0104i2030a7096j04325q4804h7913j97398e2753o4687e5749D132
$$ 111400 20104 -92030 -17096 -121421 -206225 -87913 -285311 -52753 -117440 -55749 4132
10234C55064A19262i0133F7557b33899H0259p665R9971a14886k85861d3721m1328
$$ 355064 119262 -90133 67557 -233899 80259 72594 172565 -114886 -400747 -43721 -85049
10223h5049e297C01011j21090o4502D4189g0829l27212a58982j32947G3112h9281
$$ -85049 -5297 301011 179921 115419 44189 -70829 -398041 -158982 -291929 73112 -89281
10211a01123A01795D6335a08647K3324b4070m00817A94414F8606c1774k53665
$$ -101123 101795 46335 -108647 -85323 -24070 -424887 194414 68606 -31774 -285439
10201b85439A51857B7964L25112a82868A48894b23725d2794f647C2751f8880l07908
$$ -285439 151857 27964 353076 -182868 148894 -223725 -42794 -6647 32751 -68880 -376788
10190c76788A51140f2692C55890A55193a69453c9145k05867A63841b79648B62493
$$ -376788 151140 -62692 355890 155193 -169453 -39145 -245012 163841 -279648 262493
10179a09867m8931j33797J19760A79678J8501M7382e0376n5631j10082R7810j73472
$$ -109867 -158798 -292595 -172835 179678 198179 245561 -50376 -106007 -216089 -118279 -291751
10168b91751a23349p329j32435e8047A42692J9293D2652c40423a10876n4859A02283
$$ -291751 -123349 -130678 -263113 -58047 142692 161985 42652 -340423 -110876 -165735 102283
10156B87403H633b3484k30203b8083l88225A06895a0617m5991A2668c87933a23549
$$ 287403 8633 -23484 -253687 -28083 -416308 106895 -10617 -56608 12668 -387933 -123549
10144g6430A10682J30340A08874J10196r2223b06147c5809a0119q6663k2512q5170
$$ -76430 110682 241022 108874 219070 126847 -206147 -35809 -10119 -96782 -119294 -204464
10133b04464j36010J22429J0454e8668J8491l23809M9359a2368A66311O0626a26675
$$ -204464 -340474 -218045 -207591 -58668 -40177 -363986 -314627 -12368 166311 226937 -126675
10121B15082B9409J10281b44124a05754k49614A4635f0012k36146E9621a34194
$$ 215082 29409 139690 -244124 -105754 -355368 14635 -60012 -296158 59621 -134194
10110c3030A14701h8681m8964m2549j55175B37553a53263D5826J7069a38905j31932
$$ -33030 114701 -88681 -137645 -180194 -335369 237553 -153263 45826 62895 -138905 -270837
10099b70837d685k27496f9924l6491I9873m5377R39a0553I0341k6567c9363B01741
$$ -270837 -4685 -232181 -69924 -106415 99873 54496 55435 -10553 90341 63774 -39363 201741
10086F6231e813n2157k4045m6558e7912A32191C6570a10504A01726J11189b8486
$$ 66231 -5813 -57970 -82015 -128573 -57912 132191 36570 -110504 101726 212915 -28486
10074A3785K79939b02932A64109J8490a96102B24444B4638J18979m0961a00125
$$ 13785 293724 -202932 164109 182599 -196102 224444 24638 143617 102656 -100125
10063a69383o9833i0986n395G6764A0301J1573R9492M6355E5697J08056o8864
$$ -169383 -239216 -90986 -96381 76764 10301 21874 121366 167721 55697 163753 94889
10052I4889B3541b4277j41931c8837l18134A02338b7056B2509k937a28507D058
$$ 94889 23541 -24277 -166208 -38837 -356971 102338 -27056 22509 19572 -128507 4058
10040A98971b32159i4710L9539a0383G9033b42704i8996j16547P0045f2297E934
$$ 198971 -232159 -94710 -55171 -10383 79033 -242704 -98996 -215543 -145498 -62297 5934
10028a55001d4305j58283E3670b49563M088A32889b34384o7909A43913b15277
$$ -155001 -44305 -202588 53670 -249563 -245475 132889 -234384 -302293 143913 -215277
10017D4367b25677G572L05469c32391d5956j24599g1950a8954j39122a6381j26188
$$ 44367 -225677 7572 313041 -332391 -45956 -170555 -71950 -18954 -158076 -16381 -142569
10006a42569d3210B23807g5821A92054h5305j07103q5744J1298D6928P7093b8901
$$ -142569 -43210 223807 -75821 192054 -85305 -192408 -278152 -266854 46928 124021 -28901
9994f2660j4010B4921D666h8350j59469A53790a65586k65013D4351a18400B30294
$$ -62660 -76670 24921 4666 -88350 -247819 153790 -165586 -430599 44351 -118400 230294
9982D5722c19442J19749K3414d5665k25486O6685d5317J1087l03341A03759R2480
$$ 45722 -319442 -199693 -176279 -45665 -271151 -204466 -45317 -34230 -337571 103759 196239
9971A96239D3933L3992Q4338d45746b15083P4505m0850c2847A6788K0990b84288
$$ 196239 43933 77925 162263 -445746 -215083 -140578 -181428 -32847 16788 37778 -284288
9959D8429e7398i257G3198c51366G0867C4451b04849B21528b75363j56193a54183
$$ 48429 -57398 -9257 73198 -351366 70867 34451 -204849 221528 -275363 -431556 -154183
9947E7385A3970O6228b5621H2947a39110H0898b17688e7573A74373b7109p8196
$$ 57385 13970 80198 -25621 82947 -139110 80898 -217688 -57573 174373 -27109 -105305
9936a05305k02921k20889J24941C7892a10346d7212A86357b25336g9695j77055
$$ -105305 -308226 -529115 -404174 37892 -110346 -47212 186357 -225336 -79695 -256750
9926b56750a09871c6595A90836c05103A48596E7677J03326b18384o5354a13762
$$ -256750 -109871 -36595 190836 -305103 148596 57677 161003 -218384 -283738 -113762
9915A53728A6049N9534C3150c45288b3197C16661e4400D1557i9410L0556H9772
$$ 153728 16049 75583 33150 -345288 -23197 316661 -54400 41557 -99410 -68854 89772
9903c384j54046E9049d8581J0588J4029p0985J4223C8891b94417A90659b78934
$$ -3384 -157430 59049 -48581 -37993 -23964 -94949 -80726 38891 -294417 190659 -278934
9891a38372J3922A32641b04920h836D332M1293K8842K60571C6841b16562E814
$$ -138372 -124450 132641 -204920 -8836 4332 45625 74467 335038 36841 -216562 5814
9879h9200D129J85556a91591h9200M2679m2495B44954h0284K4971a456j5721A4839
$$ -89200 4129 189685 -191591 -89200 -46521 -89016 244954 -80284 -55313 -1456 -17177 14839
9866b23137D488R8272a84701O4533A80470h7912k28618j25400P7680A14131a32653
$$ -223137 4488 102760 -184701 -120168 180470 -87912 -316530 -441930 -364250 114131 -132653
9854c71174J01474h7887q1356C43228j47729g3975j29405g9495n7552p1545C1400
$$ -371174 -269700 -87887 -169243 343228 195499 -73975 -203380 -79495 -137047 -208592 31400
9842d3679A09026b06577g8657I8228N4554J81808i7957M6310E4916b47300J6516
$$ -43679 109026 -206577 -78657 98228 152782 334590 -97957 -51647 54916 -247300 -230784
9831b30784I3813i9013l9223A23480b52049F8886J04876a81591g3637k66447A58588
$$ -230784 93813 -99013 -138236 123480 -252049 68886 173762 -181591 -73637 -340084 158588
9819A7506J0298i956o9054m6169A01778a51142R603j32268C86586f6120j0521
$$ 17506 27804 -9956 -79010 -125179 101778 -151142 -141539 -273807 386586 -66120 -76641
9808g6641n7449P238M9018D7523P6000a38892A78749b05849H8086J19960a75439
$$ -76641 -134090 -126852 -77834 47523 123523 -138892 178749 -205849 88086 208046 -175439
9796a03345A77374b35130I1275O4260c60361k53749D4566N7705J58439b41934
$$ -103345 177374 -235130 91275 155535 -360361 -614110 44566 102271 260710 -241934
9785a74857I6768a65173h034l5111C4383g980A25426M355D6276h0146E4846a42124
$$ -174857 96768 -165173 -8034 -43145 34383 -7980 125426 129781 46276 -80146 54846 -142124
9772f3946l26940A1396b4867q4828q4926d8738j30776j64346e6370j74664A02459
$$ -63946 -390886 11396 -24867 -109695 -194621 -48738 -179514 -343860 -56370 -231034 102459
9760a10451H244J63687d4079B20180a4060C7610J11675K9442b35652k1191h2725
$$ -110451 8244 171931 -44079 220180 -14060 37610 149285 178727 -235652 -256843 -82725
9748b954k89657G0141k9755a4618k63205c8841j03754J597E1880m105a08147j18711
$$ -2954 -292611 70141 40386 -14618 -277823 -38841 -142595 -140998 51880 47775 -108147 -226858
9736b26858J04497j46424A61598E1323b72717c645q0156m5689A0740J05641c13264
$$ -226858 -122361 -268785 161598 51323 -272717 -3645 -83801 -129490 10740 116381 -313264
9724e8110l7243m52632F5467J81408C5439h3784a1232j85208B7335a9904A28991
$$ -58110 -95353 -547985 65467 246875 35439 -83784 -11232 -196440 27335 -19904 128991
9712d3373a557A82537J6851C997d9929l21467a29415b2723L385k2653A97260r3907
$$ -43373 -1557 182537 199388 3997 -49929 -371396 -129415 -22723 -19338 -41991 197260 103353
9700A03353b005A24723a66152E5755i8784d8049j62042P2029A857f9052A44601
$$ 103353 -2005 124723 -166152 55755 -98784 -48049 -210091 -138062 1857 -69052 144601
9688G8604J15534g6446j06068k40430g008l34566a37773L6094m4248O7122A3585
$$ 78604 194138 -76446 -182514 -422944 -7008 -341574 -137773 -101679 -145927 -78805 13585
9676B34355b39169Q2017M5464h249j86148k3430A45204c63198a47913j53484J6642
$$ 234355 -239169 -157152 -111688 -8249 -194397 -217827 145204 -363198 -147913 -301397 -284755
9665b84755A48336J02406h7698k90624H9511g2965A2087c8182k16896h388n9143
$$ -284755 148336 250742 -87698 -378322 89511 -72965 12087 -38182 -255078 -8388 -67531
9654f7531j6002c8665k0214q1087A18126C1233i237A01196J58178G4654a04847
$$ -67531 -83533 -38665 -58879 -139966 118126 31233 -9237 101196 259374 74654 -104847
9642c29400P416a7424o289B43815H1704a92421c1493m9845a6394k6110G437J27009
$$ -329400 -321984 -17424 -23713 243815 81704 -192421 -31493 -81338 -16394 -42504 7437 134446
9630A34446J18441H0633K2505a22879l16975K01115k6202C29825F5251c97219
$$ 134446 252887 80633 103138 -122879 -439854 -238739 -264941 329825 65251 -397219
9619d01642e4373B00974g4922j15129n156B21662a95719N0239B27896c7193k35511
$$ -401642 -54373 200974 -74922 -190051 -195207 221662 -195719 -145480 227896 -37193 -272704
9608b72704b7911j08631J644k5017A13478c79757g3865D1101M380c69590h5214
$$ -272704 -27911 -136542 -134898 -159915 113478 -379757 -73865 41101 45481 -369590 -85214
9596I1837E424c00480I1854C7846I632c78487A72815j7414a70795j7642N9973
$$ 91837 5424 -300480 91854 37846 9632 -378487 172815 155401 -170795 -188437 -128464
9585a28464j30181A63127h9799m7979i714A6551k502J34578c45061A44252a55228
$$ -128464 -258645 163127 -89799 -137778 -9714 16551 14049 148627 -345061 144252 -155228
9573d6266F2186B6991d71549K7305Q235a13305j6687b4143l06723g3875o607j49157
$$ -46266 62186 26991 -471549 -444244 -436009 -113305 -129992 -24143 -330866 -73875 -80482 -229639
9561b29639B47163c36541B51623B5001f29838a25431k68747a43723G344i3141
$$ -229639 247163 -336541 251623 25001 -629838 -125431 -394178 -143723 7344 -93141
9550B04510i8117L2832m0451H8178b34952H8902a05632I530h491A1503P2835a11672
$$ 204510 -98117 -65285 -105736 88178 -234952 88902 -105632 9530 -8491 11503 84338 -111672
9537c40996H7051b48478k82611D2122K18310a11908C36373b8884I780d3056k8532
$$ -340996 87051 -248478 -531089 42122 260432 -111908 336373 -28884 9780 -43056 -71588
9526g1588k8448F1109E697d5783D046c03091J03792e1291k6366B88912j36744
$$ -71588 -100036 61109 5697 -45783 4046 -303091 -199299 -51291 -77657 288912 152168
9515A52168a50283h949C02940d6469j91922J18807K1818L2723b7504k21740C0778
$$ 152168 -150283 -8949 302940 -46469 -238391 -119584 -97766 -65043 -27504 -249244 30778
9503c6136r1885M9615D3327e2684J1973k80096J15828g5375n6551e1279D0728
$$ -36136 -128021 -78406 43327 -52684 -40711 -320807 -204979 -75375 -131926 -51279 40728
9491e1678I7315q16h2928A4218J48167F1698Q73a19513A17636R054Q2601a14377
$$ -51678 97315 96499 -82928 14218 162385 61698 62571 -119513 117636 126690 209291 -114377
9478a61988H9046a03523c6621I9676b26549c2804J5191j2257j8479k6870A16526
$$ -161988 89046 -103523 -36621 99676 -226549 -32804 -17613 -29870 -48349 -75219 116526
9466c07907D26957a70078n8339P2181k88240b17876A56533B1448l446R3811a10653
$$ -307907 426957 -170078 -228417 -156236 -444476 -217876 156533 21448 18002 111813 -110653
9454c3400j56912B93272a6695C5203I834O7228M9629o1618b16802P7055p7514
$$ -33400 -190312 293272 -16695 35203 9834 77062 126691 65073 -216802 -139747 -217261
9443b17261f0614b8854I333a98756j6024i7494C18342j9624a58654c6295A09678
$$ -217261 -60614 -28854 9333 -198756 -214780 -97494 318342 298718 -158654 -36295 109678
9431c25899E9369c0867j91467K1768A86768f0077A25615J275A4642K88512e3487
$$ -325899 59369 -30867 -222334 -200566 186768 -60077 125615 126890 14642 303154 -53487
9419C8335g0948C01935A01493i3076m3362A46748j3825g2112A37880B4169a40215
$$ 38335 -70948 301935 101493 -93076 -136438 146748 132923 -72112 137880 24169 -140215
9407C0767K14312a41212C6289K95643j14563b64870A41050a67603c1874B47680
$$ 30767 245079 -141212 36289 331932 217369 -264870 141050 -167603 -31874 247680
9396c66090J56728K022O6783k20890B09038b35081K5458d6370D7112b69731B57113
$$ -366090 -209362 -207340 -140557 -361447 209038 -235081 -209623 -46370 47112 -269731 257113
9384G4811c9572B30294b05662B2745L89517a48445e5467o8519e6256H4709a30862
$$ 74811 -39572 230294 -205662 22745 412262 -148445 -55467 -123986 -56256 84709 -130862
9372d0868B77179k2312I2506a11692a5048j72848G0116l1415a1996B0152a46363
$$ -40868 277179 254867 92506 -111692 -15048 -187896 70116 38701 -11996 20152 -146363
9360b15226E0225a43265j36566E8278c39733D0502a24133J9606K0234R823I2114
$$ -215226 50225 -143265 -279831 58278 -339733 40502 -124133 -104527 -84293 -74470 92114
9348f9192B92281a66462A6024a70582J2128e3516C0156K53728a52389O4422B93239
$$ -69192 292281 -166462 16024 -170582 -158454 -53516 30156 283884 -152389 -87967 293239
9336A63971a06628n5088f3791j2721A25953F0819b28612c3479k82951f3157j0794
$$ 163971 -106628 -161716 -63791 -76512 125953 60819 -228612 -33479 -316430 -63157 -73951
9325g3951b6560l07838e4271n5047k19311E6710e668q3313l0991e3744j43961
$$ -73951 -26560 -334398 -54271 -109318 -328629 56710 -5668 -88981 -119972 -53744 -197705
9314a97705J42M9638P0711p6434O989O7930q6927k22329f937l797j62446H0617
$$ -197705 -197563 -147925 -77214 -153648 -146659 -78729 -165656 -387985 -6937 -10734 -173180 80617
9301g5766A57688l9935E7689i7629l834B57684b81426B8913J63376a03118D3993
$$ -75766 157688 117753 57689 -97629 -101463 257684 -281426 28913 192289 -103118 43993
9289c36379K7792D2876a9747P553C4533d7885k43124d4410h180p6460k84846a34422
$$ -336379 -308587 42876 -19747 -12194 34533 -47885 -291009 -44410 -8180 -84640 -369486 -134422
9276c08766J38245k636A85566B8377b51845B2869a86608d742p5733n6042A7821
$$ -308766 -170521 -173157 185566 28377 -251845 22869 -186608 -4742 -80475 -136517 17821
9264f3362A03488D3797J64753B7182L05000b09862G1424L6571h6488a5889D68307
$$ -63362 103488 43797 208550 27182 332182 -209862 71424 107995 -86488 -15889 468307
9252D16384c02500j55B0474c48549A20547G569a68593N8358b4690j0127A18230
$$ 416384 -302500 -302655 20474 -348549 120547 7569 -168593 -110235 -24690 -34817 118230
9240g1938A48512a35147d5931k06723A83953d5996B91046C3344b01955I6188O791
$$ -71938 148512 -135147 -45931 -252654 183953 -45996 291046 33344 -201955 96188 102979
9229A02979J13889b61872J05621A66557d46361J00639A40556h9121D4306a96627
$$ 102979 216868 -261872 -156251 166557 -446361 -345722 140556 -89121 44306 -196627
9218a71665b3595B06040n9892E3340h2022l02711c0809A32244d7414n7961A1572
$$ -171665 -23595 206040 146148 53340 -82022 -384733 -30809 132244 -47414 -105375 11572
9206b2796m6573E7974b03790k17653c6801A47328L094b87559B3758b67773c8311
$$ -22796 -69369 57974 -203790 -421443 -36801 147328 150422 -287559 23758 -267773 -38311
9194A62479h0175K3759A93442a15152e7125j84717A15913J4520c80449j36803
$$ 162479 -80175 -56416 193442 -115152 -57125 -241842 115913 130433 -380449 -517252
9184e17252a48949H3573C0184d79708I3665j9556C2706r32c5300F3917a58724
$$ -517252 -148949 83573 30184 -479708 93665 74109 32706 31774 -35300 63917 -158724
9172e6383n3471D69390j48403A41678f1424j79521P9203H9918a17364P046m085
$$ -56383 -109854 469390 320987 141678 -61424 -240945 -161742 89918 -117364 -110318 -114403
9161a14403j65801j16074f1858J5293E7798b39891H6686d9460B35419A2827b14615
$$ -114403 -280204 -396278 -61858 -46565 57798 -239891 86686 -49460 235419 12827 -214615
9149a38638A6384a70214g2409j0315l9407e6481A8044g783j38023K5532j01584
$$ -138638 16384 -170214 -72409 -82724 -122131 -56481 18044 -7783 -145806 -120274 -221858
9138b21858M74e8324A3763C125J7208c1019A0718b14721e0262B53392D4347a17763
$$ -221858 -221384 -58324 13763 3125 20333 -31019 10718 -214721 -50262 253392 44347 -117763
9125B8481c9523D00101b35083o9735Q8152A6292J74837a02655C1075a45896G7086
$$ 28481 -39523 400101 -235083 -304818 -216666 16292 191129 -102655 31075 -145896 77086
9113h7248B9717K6899a9610e612G4889A7458J09700f7385e47j43121j09472Q1863
$$ -87248 29717 56616 -19610 -5612 74889 17458 127158 -67385 -547 -143668 -253140 -171277
9101a71277a7266o3574I1471a46648a8007n571A9865K20180a68846H6131a51199
$$ -171277 -17266 -80840 91471 -146648 -18007 -23578 19865 240045 -168846 86131 -151199
9089A8623a8766G9111c26819a46233A56519c42559b5439H4275N1965d17565J46530
$$ 18623 -18766 79111 -326819 -146233 156519 -342559 -25439 84275 136240 -417565 -271035
9078b71035Q0091B59243I591M9657d1503A05855a9514j6760A42637J2619a80631
$$ -271035 -190944 259243 9591 59248 -41503 105855 -19514 -36274 142637 155256 -180631
9066a39856C55053a32069A61204a27806A99871J8613b47302e5497l9965G5183
$$ -139856 355053 -132069 161204 -127806 199871 218484 -247302 -55497 -95462 75183
9055b36946M9956j7010n4126A9441J23090F4020P2713O582O4386a76764D8046
$$ -236946 -186990 -204000 -258126 19441 142531 64020 136733 143315 207701 -176764 48046
9043a19578o3222A4091b4328l77626a14179A40686a5055k59121a23370A31577
$$ -119578 -182800 14091 -24328 -401954 -114179 140686 -15055 -274176 -123370 131577
9032B50146h0363c1162E1527a1709A02633h8405o8647B30352j09925l718a48384
$$ 250146 -80363 -31162 51527 -11709 102633 -88405 -157052 230352 120427 116709 -148384
9020a85252j57418A10237a09782j74040a21990D54677a11865k16860h6758p6089
$$ -185252 -342670 110237 -109782 -283822 -121990 454677 -111865 -328725 -86758 -162847
9010a62847f5204K610C4591b07040d7562A91036B7635b9665Q256R12k8785j1361
$$ -162847 -65204 -62594 34591 -207040 -47562 191036 27635 -29665 -21409 -20497 -49282 -60643
8998f0643o3946F0387B5308b18987g7983n17980K30008m786g6693B08513b92884
$$ -60643 -124589 60387 25308 -218987 -77983 -595963 -365955 -370741 -76693 208513 -292884
8986e03757I1419f8394D9206P6041b56627o3556B47122a20986b9727r7857e3053
$$ -503757 91419 -68394 49206 125247 -256627 -320183 247122 -120986 -29727 -127584 -53053
8974e2513A52777h2656C17050c62B06479A4771K5221b70744I752i9384b1843k33392
$$ -52513 152777 -82656 317050 -362 206479 14771 39992 -270744 9752 -99384 -21843 -255235
8962b55235G9684e7397r3330C3061i9943F2968a08944N1787l42700C1337a41182
$$ -255235 79684 -57397 -150727 33061 -99943 62968 -108944 -57157 -399857 31337 -141182
8950h5317j68010B80889a55329C25072b18559R5627G5702A7464J46065f8937D0331
$$ -85317 -253327 280889 -155329 325072 -218559 -122932 75702 17464 163529 -68937 40331
8938B73777b20652o6981O3747M2626C35708b437q2875r610k36520f4939p4037
$$ 273777 -220652 -287633 -223886 -181260 335708 -2437 -85312 -94922 -331442 -64939 -138976
8927a38976E9736i7047j5938I33M14328g9153J7302D84738p3983A06787C3033
$$ -138976 59736 -97047 -112985 933 415261 -79153 -61851 484738 410755 106787 33033
8915D04647A28075e1680A88713p3921f4667H9463c61617A65773n6161b8131P292
$$ 404647 128075 -51680 188713 114792 -64667 89463 -361617 165773 109612 -28131 -20839
8904b0839j32312a9856n4562N207L4291j38226a0334n0415f277j48199C0088J31178
$$ -20839 -153151 -19856 -74418 -69211 -34920 -173146 -10334 -60749 -6277 -154476 30088 161266
8892A61266B4745N8755a53475E228i3496N376j68953A20931k8199a85368L1927
$$ 161266 24745 83500 -153475 5228 -93496 -88120 -257073 120931 92732 -185368 -153441
8881a53441D2275d4313C069g150r3311K0249H4628k8779J97927b60020f8468A2737
$$ -153441 42275 -44313 3069 -7150 -100461 -80212 84628 55849 253776 -260020 -68468 12737
8868a31325F1647b04947d8350j6094B6444J29168e4412m62930K19328A04076g3902
$$ -131325 61647 -204947 -48350 -64444 26444 155612 -54412 -517342 -298014 104076 -73902
8856d05464e7254a0393j51036a7437q5335l64031C62576B8794a81670L9644n7914
$$ -405464 -57254 -10393 -161429 -17437 -102772 -466803 362576 28794 -181670 -142026 -199940
8845a99940C4616C358c6860I9004I515b10871B31472i1084k98907J72740P1694
$$ -199940 34616 3358 -36860 99004 9515 -210871 231472 -91084 -389991 -217251 -145557
8834a45557e8932A02481c67233A58289a74238M8545F1486b58561A14837N7304
$$ -145557 -58932 102481 -367233 158289 -174238 -125693 61486 -258561 114837 172141
8824A72141p4835b25471I5524K41053b7397C3819c1229B71922c4037G2465L9283
$$ 172141 97306 -225471 95524 336577 -27397 33819 -31229 271922 -34037 72465 111748
$$ [...]
##END NTUPLES=NMR SPECTRUM
##END=
