##TITLE=NES1049_872015078_9268765_7xj5IxsP2y
##JCAMPDX= 6.0         $$ Bruker NMR JCAMP-DX V2.0
##DATA TYPE= NMR SPECTRUM
##DATA CLASS= NTUPLES
##ORIGIN= BRUKER
##OWNER= Administrator
$$ 1.72 TOPSPIN		Version 2.1
$$ 2015-07-11 14:38:29.581 -0700  Administrator@X
$$ Compression mode = diff/dup
##.OBSERVE FREQUENCY= 400.02188249412
##.OBSERVE NUCLEUS= ^1H
##.ACQUISITION MODE= SIMULTANEOUS (DQD)
##.ACQUISITION SCHEME= undefined
##.AVERAGES= 64
##.DIGITISER RES= 22
##SPECTROMETER/DATA SYSTEM= spect
##.PULSE SEQUENCE= noesygpps1d.comp
##.SOLVENT NAME= COFFEE_meoh
##.SHIFT REFERENCE= INTERNAL, COFFEE_meoh, 1, 14.96233
##AUDIT TRAIL= $$ (NUMBER, WHEN, WHO, WHERE, PROCESS, VERSION, WHAT)
$$ ##TITLE= Audit trail, TOPSPIN		Version 2.1
$$ ##JCAMPDX= 5.01
$$ ##ORIGIN= Bruker BioSpin GmbH
$$ ##OWNER= Administrator
$$ $$ E:\/data/COFFEE/nmr/NES1049_872015078_9268765_7xj5IxsP2y/12/pdata/1/auditp.txt
$$ ##AUDIT TRAIL=  $$ (NUMBER, WHEN, WHO, WHERE, PROCESS, VERSION, WHAT)
(   1,<2015-07-10 18:08:39.691 -0700>,<Administrator>,<X>,<go>,<TOPSPIN 2.1>,
      <created by zg
	started at 2015-07-10 17:57:09.691 -0700,
	POWCHK enabled, PULCHK disabled,
       configuration hash MD5:
       21 0F 79 D6 B3 7B B4 F6 88 20 88 DB 03 48 BD 9F
       data hash MD5: 64K
       FC 59 F6 DC F5 A6 11 11 62 BB 8C 08 D9 78 EE 23>)
(   2,<2015-07-10 18:08:43.410 -0700>,<Administrator>,<X>,<proc1d>,<TOPSPIN 2.1>,
      <Start of raw data processing
       efp LB = 0.3 FT_mod = 6 PKNL = 1 PHC0 = 0 PHC1 = 0 SI = 128K 
       data hash MD5: 128K
       98 00 27 0F C7 37 8E 6F 4B 25 64 9A 16 07 37 F8>)
(   3,<2015-07-10 18:08:44.331 -0700>,<Administrator>,<X>,<proc1d>,<TOPSPIN 2.1>,
      <pk PHC0 = -87.05017 PHC1 = 0 
       data hash MD5: 128K
       FE 4B ED 15 39 49 F8 49 AC 26 E5 60 F5 1B A2 45>)
(   4,<2015-07-10 18:08:44.769 -0700>,<Administrator>,<X>,<proc1d>,<TOPSPIN 2.1>,
      <abs ABSG = 1 
       data hash MD5: 128K
       B0 0C 96 46 D1 BA BE 9A F7 4A 63 E5 A1 33 8E C9>)
(   5,<2015-07-10 18:08:44.863 -0700>,<Administrator>,<X>,<proc1d>,<TOPSPIN 2.1>,
      <abs ABSG = 2 
       data hash MD5: 128K
       EF 45 08 D4 B6 E7 A3 3D 4D E2 27 2A 67 05 29 15>)
(   6,<2015-07-10 18:08:44.941 -0700>,<Administrator>,<X>,<proc1d>,<TOPSPIN 2.1>,
      <abs ABSG = 3 
       data hash MD5: 128K
       61 32 DE FB 0C 1A 16 89 23 3E 4D 8E 4D E3 19 D6>)
(   7,<2015-07-10 18:08:45.035 -0700>,<Administrator>,<X>,<proc1d>,<TOPSPIN 2.1>,
      <abs ABSG = 4 
       data hash MD5: 128K
       82 E4 ED C5 8F A9 CA 4E 2F 4E 3F EE B5 EB E0 C9>)
(   8,<2015-07-10 18:08:45.128 -0700>,<Administrator>,<X>,<proc1d>,<TOPSPIN 2.1>,
      <abs ABSG = 5 
       data hash MD5: 128K
       F6 33 09 44 F3 EF B2 D4 56 D1 E4 70 E2 47 DD 5D>)
(   9,<2015-07-10 18:08:47.035 -0700>,<Administrator>,<X>,<audit>,<TOPSPIN 2.1>,
      <user comment:
       ICON-NMR User ID: COFFEE
       data hash MD5: 128K
       F6 33 09 44 F3 EF B2 D4 56 D1 E4 70 E2 47 DD 5D>)
$$ ##END=
$$ 
$$ $$ hash MD5
$$ [...]
150 150 150 150 150 150 150 150
##$TP07= 0
##$TPNAME0= <>
##$TPNAME1= <>
##$TPNAME2= <>
##$TPNAME3= <>
##$TPNAME4= <>
##$TPNAME5= <>
##$TPNAME6= <>
##$TPNAME7= <>
##$TPOAL= (0..7)
0.5 0.5 0.5 0.5 0.5 0.5 0.5 0.5
##$TPOFFS= (0..7)
0 0 0 0 0 0 0 0
##$TUNHIN= 0
##$TUNHOUT= 0
##$TUNXOUT= 0
##$USERA1= <user>
##$USERA2= <user>
##$USERA3= <user>
##$USERA4= <user>
##$USERA5= <user>
##$V9= 5
##$VALIST= <valist>
##$VCLIST= <CCCCCCCCCCCCCCC>
##$VD= 0
##$VDLIST= <DDDDDDDDDDDDDDD>
##$VPLIST= <PPPPPPPPPPPPPPP>
##$VTLIST= <TTTTTTTTTTTTTTT>
##$WBST= 2048
##$WBSW= 25
##$XGAIN= (0..3)
0 0 0 0
##$XL= 0
##$YL= 0
##$YMAX_a= 5765750
##$YMIN_a= -10496694
##$ZGOPTNS= <>
##$ZL1= 120
##$ZL2= 120
##$ZL3= 120
##$ZL4= 120
##$ABSF1= 14.96233
##$ABSF2= -5.595852
##$ABSG= 5
##$ABSL= 3
##$ALPHA= 0
##$AQORDER= 0
##$ASSFAC= 0
##$ASSFACI= 0
##$ASSFACX= 0
##$ASSWID= 0
##$AUNMP= <proc_prof1d_extract.lims>
##$AXLEFT= 0
##$AXNAME= <>
##$AXNUC= <1H>
##$AXRIGHT= 0
##$AXTYPE= 0
##$AXUNIT= <>
##$AZFE= 0.1
##$AZFW= 0.1
##$BCFW= 0
##$BC_mod= 0
##$BYTORDP= 0
##$COROFFS= 0
##$CY= 15
##$DATMOD= 1
##$DC= 0
##$DFILT= <>
##$DTYPP= 0
##$F1P= 0
##$F2P= 0
##$FCOR= 0.5
##$FTSIZE= 131072
##$FT_mod= 6
##$GAMMA= 0
##$GB= 0
##$INTBC= 1
##$INTSCL= 1
##$ISEN= 128
##$LB= 0.3
##$LEV0= 0
##$LPBIN= 0
##$MAXI= 10000
##$MC2= 0
##$MEAN= 0
##$ME_mod= 0
##$MI= 0
##$NCOEF= 0
##$NC_proc= -2
##$NLEV= 6
##$NOISF1= 0
##$NOISF2= 0
##$NSP= 0
##$NTH_PI= 0
##$NZP= 0
##$OFFSET= 14.96233
##$PC= 1
##$PHC0= -87.05017
##$PHC1= 0
##$PH_mod= 1
##$PKNL= yes
##$PPARMOD= 0
##$PPDIAG= 0
##$PPIPTYP= 0
##$PPMPNUM= 2147483647
##$PPRESOL= 1
##$PSCAL= 4
##$PSIGN= 0
##$PYNMP= <proc.py>
##$REVERSE= no
##$SF= 400.0200091049
##$SI= 131072
##$SIGF1= 0
##$SIGF2= 0
##$SINO= 400
##$SIOLD= 131072
##$SPECTYP= <>
##$SREGLST= <1H.CDCl3>
##$SSB= 0
##$STSI= 131072
##$STSR= 0
##$SW_p= 8223.68421052631
##$SYMM= 0
##$S_DEV= 0
##$TDeff= 65536
##$TDoff= 0
##$TI= <>
##$TILT= no
##$TM1= 0
##$TM2= 0
##$TOPLEV= 0
##$USERP1= <user>
##$USERP2= <user>
##$USERP3= <user>
##$USERP4= <user>
##$USERP5= <user>
##$WDW= 1
##$XDIM= 131072
##$YMAX_p= 358874699
##$YMIN_p= -10231
##$CURPLOT= <Network HP LaserJet P1505>
##$CURPRIN= <$Network HP LaserJet P1505>
##$DFORMAT= <normdp>
##$LAYOUT= <+/1D_H.xwp>
##$LFORMAT= <normlp>
##$PFORMAT= <normpl>
##$SURQMSG= 1
$$ End of Bruker specific parameters
$$ ---------------------------------
##NTUPLES= NMR SPECTRUM
##VAR_NAME=  FREQUENCY,     SPECTRUM/REAL,   SPECTRUM/IMAG
##SYMBOL=    X,             R,               I
##VAR_TYPE=  INDEPENDENT,   DEPENDENT,       DEPENDENT
##VAR_FORM=  AFFN,          ASDF,            ASDF
##VAR_DIM=   131072,        131072,          131072
##UNITS=     HZ,            ARBITRARY UNITS, ARBITRARY UNITS
##FACTOR=    0.0627417313425164, 1,          1
##FIRST=     8223.62146879497, -1200,        -39344
##LAST=      0,             -391,            -40379
##MIN=       0,             -10231,          0
##MAX=       8223.62146879497, 358874699,    0
$$ Real data points
##PAGE= N=1
##DATA TABLE= (X++(R..R)), XYDATA
$$ [...]
63593C19726j2964j2751j1785j0487r390q586p988p595p162o082m119j844M2J503
$$ 319726 306762 294011 282226 271739 262349 253763 245775 238180 231018 224936 220817 218973 219015 220518
63579B20518K823L908M512M801N128N367N173M725M614M961N275N307N509O337
$$ 220518 223341 227249 231761 236562 241690 247057 252230 256955 261569 266530 271805 277112 282621 288958
63565B88958P533Q508R191J0141J1839J4059J6003J6968J6811J5734J3749J0574
$$ 288958 296491 304999 314190 324331 336170 350229 366232 383200 400011 415745 429494 440068
63553D40068O245J600k175m432n360n455n110m596m057l333k124n85M44Q1j762
$$ 440068 446313 447913 445738 441306 435946 430491 425381 420785 416728 413395 411271 410686 411130 411211 409449
63538D09449m313o606q045q603q770r296j0618j2374j3667j3906j3275j2322j1368
$$ 409449 405136 398530 390485 381882 373112 363816 353198 340824 327157 313251 299976 287654 276286
63525B76286j0476r779r406r163q661p860p165o796o406n623m709m201m106l894
$$ 276286 265810 256031 246625 237462 228801 220941 213776 206980 200574 194951 190242 186041 181935 178041
63511A78041l368k996l156l492l403k852k271j845j390r06p07r01j071p70r9M69
$$ 178041 174673 171677 168521 165029 161626 158774 156503 154658 153268 152362 151655 150754 149683 148913 148814 149283
63495A49283O80O99Q12J108J463J701J759J758J853J998K001J887K037K676L394
$$ 149283 149963 150662 151474 152582 154045 155746 157505 159263 161116 163114 165115 167002 169039 171715 175109
63480A75109L429K509J156J16l83o78j203j976k530k315j412p00j010k047k577
$$ 175109 178538 181047 182203 182319 181936 181258 180055 178079 175549 173234 171822 171122 170112 168065 165488
63465A65488j860n08L70M94M62P85J423K131K754L156L318L527M008M431M272
$$ 165488 163628 163120 163490 163984 164446 165231 166654 168785 171539 174695 178013 181540 185548 189979 194251
63450A94251L687L459L912M511M752M885N326N977O643P596R035J0403J0994J1146
$$ 194251 197938 201397 205309 209820 214572 219457 224783 230760 237403 244999 254034 264437 275431 286577
63436B86577J1964J3861J6109J8062K0046K2611K5379K7238K7482K6333K4397
$$ 286577 298541 312402 328511 346573 366619 389230 414609 441847 469329 495662 520059
63425E20059K1932J8684J4318Q956L397j244m238n587n726n023l701k106q32m50
$$ 520059 541991 560675 574993 583949 587346 586102 581864 576277 570551 565528 561827 559721 558889 558439
63411E58439j205k951n327p964j0539j2836j4816j6586j8129j9118j9142j8148
$$ 558439 557234 554283 548956 540992 530453 517617 502801 486215 468086 448968 429826 411678
63399D11678j6547j4869j3408j2206j1175j0140q918p410n647l802k237j318r56
$$ 411678 395131 380262 366854 354648 343473 333333 324415 317005 311358 307556 305319 304001 303045
63386C03045n06N35J909L179M624O848R496J1362J2022J2418J3329J4165J4096
$$ 303045 302539 303074 304983 308162 312786 319634 329130 340492 352514 364932 378261 392426 406522
63373D06522J3523J3468J4030J4602J5221J6465J8054J8778J7971J6066J3444
$$ 406522 420045 433513 447543 462145 477366 493831 511885 530663 548634 564700 578144
63362E78144R789N053K81l190m910n374n307n207n141m734l705k577k395l641
$$ 578144 587933 592986 593267 590077 585167 579793 574486 569279 564138 559404 555699 553122 550727 547086
63348E47086n925q723j1732j4398j6012j6663j7284j8215j8510j7265j5024j3122
$$ 547086 541161 532438 520706 506308 490296 473633 456349 438134 419624 402359 387335 374213
63336C74213j2109j1565j0981j0100q716o991n798n920o919p437o743n394m381
$$ 374213 362104 350539 339558 329458 320742 313751 307953 302033 295114 287677 280934 275540 271159
63323B71159m052m040l799l086k164j628j822k415k662k100q35O86J975K730K951
$$ 271159 267107 263067 259268 256182 254018 252390 250568 248153 245491 243391 242556 243242 245217 247947 250898
63308B50898K866K662K464K478K811L043K491J098m14j485k356l384m338m844
$$ 250898 253764 256426 258890 261368 264179 267222 269713 270811 270397 268912 266556 263172 258834 253990
63294B53990m996m999m598l567k403j830j855j942j951k139k456k535k369k275
$$ 253990 248994 243995 239397 235830 233427 231597 229742 227800 225849 223710 221254 218719 216350 214075
63280B14075k227j904j371j052r57o75j88j7l84q49r77q37n63oQ75J730K168K089
$$ 214075 211848 209944 208573 207521 206564 205889 205701 205684 205300 204451 203474 202637 202074 202068 202943 204673 206841 208930
63262B08930J558Q07L95Q46J917K748K888K690K551K439K418K906L964M864N023
$$ 208930 210488 211295 211690 212536 214453 217201 220089 222779 225330 227769 230187 233093 237057 241921 246944
63247B46944M780M778M980N030N201O110P571Q613Q825R001J0118J2136J4182
$$ 246944 251724 256502 261482 266512 271713 277823 285394 294007 302832 311833 321951 334087 348269
63234C48269J5593J6405J6958J7419J7740J7891J7942J7957J7916J7774J7581
$$ 348269 363862 380267 397225 414644 432384 450275 468217 486174 504090 521864 539445
63223E39445J7400J7142J6676J6153J6058J6699J7753J8575J8911J9035J9091
$$ 539445 556845 573987 590663 606816 622874 639573 657326 675901 694812 713847 732938
63212G32938J8649J7130J4530J1362P952M240L01l428o673r721j2874j5801j8026
$$ 732938 751587 768717 783247 794609 802561 806801 807102 803674 797001 787280 774406 758605 740579
63199G40579j9751k1496k2974k3197k1916k0119j8627j6933j4141j0493p140m599
$$ 740579 720828 699332 676358 653161 631245 611126 592499 575566 561425 550932 543792 539193
63187E39193k302M64L746P137J0173J2500J4136J5537J7025J8241J8663J8530
$$ 539193 536891 537355 541101 548238 558411 570911 585047 600584 617609 635850 654513 673043
63175F73043J8634J9213J9721J9697J9339J8956J8491J7776J6901J5997J4991
$$ 673043 691677 710890 730611 750308 769647 788603 807094 824870 841771 857768 872759
63164H72759J3606J1465Q233M072k93m360q555j3425j8363k1985k3897k5143k6620
$$ 872759 886365 897830 906063 910135 909842 905482 896927 883502 865139 843154 819257 794114 767494
63151G67494k7943k8282k7517k6047k4143k2040k0154j8547j6660j4132j1449
$$ 767494 739551 711269 683752 657705 633562 611522 591368 572821 556161 542029 530580
63140E30580r252p465n676l986k775j921r25L21J503K427L058L169K478J150l49
$$ 530580 521328 513863 508187 504201 501426 499505 498580 498901 500404 502831 505889 509058 511536 512686 512337
63125E12337j744k985l919m425m739n174n550n394m685l991l727l667l289k421
$$ 512337 510593 507608 503689 499264 494525 489351 483801 478407 473722 469731 466004 462337 459048 456627
63111D56627j460j053j419j933j649l66J120J986K203K117J756J087O68J262K770
$$ 456627 455167 454114 452695 450762 449113 448747 449867 451853 454056 456173 457929 459016 459684 460946 463716
63096D63716M134M386L562K503K025K318K899L181L041K735K341J748J216J291
$$ 463716 467850 472236 475798 478301 480326 482644 485543 488724 491765 494500 496841 498589 499805 501096
63082E01096J889K144J587Q67P01Q77J017J578L026M564M963M434M409N469O675
$$ 501096 502985 505129 506716 507583 508284 509161 510178 511756 514782 519346 524309 528743 533152 538621 545296
63067E45296P154P205P515Q280R522J1365J3480J5032J5693J6165J7266J9059
$$ 545296 552450 559655 567170 575450 584972 596337 609817 624849 640542 656707 673973 693032
63055F93032K1147K3204K4934K6187K7488K9641L2515L4891L5957L6169L6207
$$ 693032 714179 737383 762317 788504 815992 845633 878148 913039 948996 985165 1021372
63044A021372L5988L5349L4818L4821L4770L3993L2994L2802L3418L3948L4061
$$ 1021372 1057360 1092709 1127527 1162348 1197118 1231111 1264105 1296907 1330325 1364273 1398334
63033A398334L4247L4675L4686L3615L1358K7926K3103J6704Q871N1r020j7502
$$ 1398334 1432581 1467256 1501942 1535557 1566915 1594841 1617944 1634648 1643519 1643570 1634550 1617048
63021A617048k5101l2316l9483m5831n0113n1997n2106n0893m8377m4956m1398
$$ 1617048 1591947 1559631 1520148 1474317 1424204 1372207 1320101 1269208 1220831 1175875 1134477
63010A134477l7778l3305k7575k1341j5559j0379n463p10L878Q588J3652J8728
$$ 1134477 1096699 1063394 1035819 1014478 998919 988540 983077 982367 986245 994833 1008485 1027213
62998A027213K3110K6325K8305K9291K9835L0536L1516L2410L3048L3660L4239
$$ 1027213 1050323 1076648 1104953 1134244 1164079 1194615 1226131 1258541 1291589 1325249 1359488
62987A359488L4239L3323L1881L0339K8373K5402K1439J6854J1531M881l365j2785
$$ 1359488 1393727 1427050 1458931 1489270 1517643 1543045 1564484 1581338 1592869 1597750 1594385 1581600
62975A581600k2627l2067m0378m7298n3079n7777o0803o1763o1368o0718n9894
$$ 1581600 1558973 1526906 1486528 1439230 1386151 1328374 1267571 1205808 1144440 1083722 1023828
62964A023828n8069n5042n1670m8575m5356m1515l7498l4175l1751k9701k7451
$$ 1023828 965759 910717 859047 810472 765116 723601 686103 651928 620177 590476 563025
62953E63025k4701k1444j8122j5552j4165j3497j2776j1819j1015j0525j0040
$$ 563025 538324 516880 498758 483206 469041 455544 442768 430949 419934 409409 399369
62942C99369r265q283p376o671o045n285m381l664l476l687l794l620l520l735
$$ 399369 390104 381821 374445 367774 361729 356444 352063 348399 344923 341236 337442 333822 330302 326567
62928C26567l954l831l553l459l429l129k662k400k373k310k214k346k660k788
$$ 326567 322613 318782 315229 311770 308341 305212 302550 300150 297777 295467 293253 290907 288247 285459
62914B85459k626k442k316k042j649j580k052k653k870k638k204j711j199p58
$$ 285459 282833 280391 278075 276033 274384 272804 270752 268099 265229 262591 260387 258676 257477 256719
62900B56719m27r9K50M02J68l00o13m99n8L11K27k52n94l94J48N51P05P58O12
$$ 256719 256292 256193 256443 256845 257013 256713 256100 255601 255543 255854 256081 255829 255235 254841 254989 255540 256245 257003 257615
62881B57615Q1n10n94k33j06l92m97q7L48M24N42J022J298P62j52n40l15L3N07
$$ 257615 257696 257186 256592 256359 256253 255861 255364 255277 255625 256049 256591 257613 258911 259673 259521 258981 258666 258699 259206
62862B59206J396K188J884M88q49j392j564j820j824j311r09j280k038k324k057
$$ 259206 260602 262790 264674 265162 264313 262921 261357 259537 257713 256402 255493 254213 252175 249851 247794
62847B47794j824j803j681j450j504j860j975j618j274j395j670j499q62k68L5
$$ 247794 245970 244167 242486 241036 239532 237672 235697 234079 232805 231410 229740 228241 227379 227111 227146
62832B27146L40Q96J407J330N95j88k91M43J476K105K099J838J854K339L030L536
$$ 227146 227486 228382 229789 231119 231714 231526 231235 231678 233154 235259 237358 239196 241050 243389 246419 249955
62816B49955L657L427K956K316J645J161J079J448K145L007L934M871N711O247
$$ 249955 253612 257039 259995 262311 263956 265117 266196 267644 269789 272796 276730 281601 287312 293559
62802B93559O386O352O567P198P970Q610R298J0400J1867J3304J4664J6408J8794
$$ 293559 299945 306297 312864 320062 328032 336642 345940 356340 368207 381511 396175 412583 431377
62789D31377K1449K3901K6233K8767L1495L4259L7337M1286M6167N1386N6340
$$ 431377 452826 476727 502960 531727 563222 597481 634818 676104 722271 773657 829997
62778H29997O0777O4531O7283O8797O9080O8059O5416O0824N4196M5648L5488
$$ 829997 890774 955305 1022588 1091385 1160465 1228524 1293940 1354764 1408960 1454608 1490096
62767A490096K4326J2887J499r938k1315l1969m1228m8936n5149n9606o2044o2871
$$ 1490096 1514422 1527309 1528808 1518870 1497555 1465586 1424358 1375422 1320273 1260667 1198623 1135752
62755A135752o2923o2492o1082n8346n4817n1373m8299m5249m1930l8365l4645
$$ 1135752 1072829 1010337 949255 890909 836092 784719 736420 691171 649241 610876 576231
62744E76231l0967k7907k6074k5121k3658k0696j6915j3943j2488j1768j0750
$$ 576231 545264 517357 491283 466162 442504 421808 404893 390950 378462 366694 355944
62733C55944r300p911o894o235n804n256m120k400p66K23Q81J840L016L750L865
$$ 355944 346644 338733 331839 325604 319800 314544 310424 308024 307258 307481 308362 310202 313218 316968 320833
62718C20833L937M479N421O573Q079J0093J2337J4333J5984J7697J9993K2991
$$ 320833 324770 329249 334670 341243 349322 359415 371752 386085 402069 419766 439759 462750
62706D62750K6259K9271L2070L5274L9246M3622M7940N2343N7088O1731O5463
$$ 462750 489009 518280 550350 585624 624870 668492 716432 768775 825863 887594 953057
62695I53057O8139P0106P1023O9827O5986O0053N2654M3739L3255K1738R739k640
$$ 953057 1021196 1091302 1162325 1232152 1298138 1358191 1410845 1454584 1487839 1509577 1519316 1516676
62683A516676j5150k6955l7433m6746n4953o1223o4817o6291o6710o6143o4006
$$ 1516676 1501526 1474571 1437138 1390392 1335439 1274216 1209399 1143108 1076398 1010255 946249
62672I46249o0682n7456n4748n1614m7417m2951l9290l6350l3309k9912k6654
$$ 946249 885567 828111 773363 721749 674332 631381 592091 555741 522432 492520 465866
62661D65866k3934k1661j9595j7620j5713j3914j2312j0955r815q919q313p901
$$ 465866 441932 420271 400676 383056 367343 353429 341117 330162 320347 311428 303115 295214
62649B95214p571p456p648p710o978n542m344l908l640k820j813j515j959k287
$$ 295214 287643 280187 272539 264829 257851 252309 247965 244057 240417 237597 235784 234269 232310 230023
62635B30023k018j582j481j620j766k047k564k895k503j472m60M6J36J77L64O62
$$ 230023 228005 226423 224942 223322 221556 219509 216945 214050 211547 210075 209615 209661 209797 209974 210338 211000
62619B11000J028J540K175K621K462J794J408K027L430M660N152N256N570O270
$$ 211000 212028 213568 215743 218364 220826 222620 224028 226055 229485 234145 239297 244553 250123 256393
62605B56393P306Q755J0526J2124J3304J4673J6989K0000K2687K4677K6623K9071
$$ 256393 263699 272454 282980 295104 308408 323081 340070 360070 382757 407434 434057 463128
62593D63128L1613L3588L4877L5521L5144L3384L0550K7136K2978J7563J1041
$$ 463128 494741 528329 563206 598727 633871 667255 697805 724941 747919 765482 776523
62582G76523M228k285q366j3782j8148k1568k4550k7108k8636k9019k9132k9649
$$ 776523 780751 778466 770100 756318 738170 716602 692052 664944 636308 607289 578157 548508
62570E48508k9957k8974k6660k4070k2002k0296j8443j6323j4173j2152j0238
$$ 548508 518551 489577 462917 438847 416845 396549 378106 361783 347610 335458 325220
62559C25220q454p061o503o859p350o812m978k993k209k665l308l465l425l545
$$ 325220 316766 309705 303202 296343 288993 282181 277203 274210 272001 269336 266028 262563 259138 255593
62545B55593l585l260k854k770k851k592j907j157n32J59R85J641J917K126K772
$$ 255593 252008 248748 245894 243124 240273 237681 235774 234617 234085 234244 235229 236870 238787 240913 243685
62530B43685L865M892N516O027O951Q413J0102J1745J3326J4885J6412J8088K0262
$$ 243685 247550 252442 257958 263985 270936 279349 289451 301196 314522 329407 345819 363907 384169
62517C84169K3055K6146K9090L1747L4190L6338L7894L8571L8237L6950L4884
$$ 384169 407224 433370 462460 494207 528397 564735 602629 641200 679437 716387 751271
62506G51271L2166K8653K4068J8354J1738M484l070j0157j5851j9968k3219k6186
$$ 751271 783437 812090 836158 854512 866250 870734 867664 857507 841656 821688 798469 772283
62494G72283k8536k9742l0058l0122k9989k9237k7873k6317k4658k2713k0727
$$ 772283 743747 714005 683947 653825 623836 594599 566726 540409 515751 493038 472311
62483D72311j9202j8018j6590j4969j3852j3324j2552j1150r815r093q409p108
$$ 472311 453109 435091 418501 403532 389680 376356 363804 352654 342839 333746 325337 318229
62471C18229n679m967m822m458l796l379l277k989k397j844j305m06O65J167R98
$$ 318229 312550 307583 302761 298303 294507 291128 287851 284862 282465 280621 279316 278910 279575 280742 281740
62456B81740J017J825K949L651M002M563N435O183O521O546O435O233N922N510
$$ 281740 282757 284582 287531 291182 295184 299747 305182 311365 317886 324432 330867 337100 343022 348532
62442C48532N013M462L840L022J870L76j371l277n100o392o990p356p977q495
$$ 348532 353545 358007 361847 364869 366739 367115 365744 362467 357367 350975 343985 336629 328652 320157
62428C20157q065o694n505n381n974o366o231n816n229m332l139j812m27Q53J585
$$ 320157 312092 305398 299893 294512 288538 282172 275941 270125 264896 260564 257425 255613 255186 256039 257624
62413B57624J479R24O97J147J977K723L055K838K205J614J451J663J958K276K752
$$ 257624 259103 260027 260724 261871 263848 266571 269626 272464 274669 276283 277734 279397 281355 283631 286383
62398B86383L387M062M805N614O202O212N654M840M025L417L309L747M221M178
$$ 286383 289770 293832 298637 304251 310453 316665 322319 327159 331184 334601 337910 341657 345878 350056
62384C50056L685L182K785K392K269K808L793M614N275O364P998R607J0965J2579
$$ 350056 353741 356923 359708 362100 364369 367177 370970 375584 380859 387223 395221 404828 415793 428372
62370D28372J4716J6903J8871K1190K4323K7749L0683L3092L5328L7275L8545
$$ 428372 443088 459991 478862 500052 524375 552124 582807 615899 651227 688502 727047
62359G27047L9007L8385L5896L1214K5375J9817J4797R817N248K156M04j723n513
$$ 727047 766054 804439 840335 871549 896924 916741 931538 941355 946603 948759 949163 947440 941927
62346I41927j0387j4971j8730k1924k4637k6639k7861k8381k8192k7352k6118
$$ 941927 931540 916569 897839 875915 851278 824639 796778 768397 740205 712853 686735
62335F86735k4614k2728k0638j8929j7846j6832j5394j3993j3446j3670j3753
$$ 686735 662121 639393 618755 599826 581980 565148 549754 535761 522315 508645 494892
62324D94892j3160j2223j1394j0609r618q512p602p019o633o205n537m641l739
$$ 494892 481732 469509 458115 447506 437888 429376 421774 414755 408122 401917 396380 391739 388000
62311C88000k967k110q79M69J242J192J036J654K973L989M008L480L317L679L853
$$ 388000 385033 382923 382044 382513 383755 384947 385983 387637 390610 394599 398607 402087 405404 409083 412936
62296D12936L335K536K225K555L067L455L883M527N162N391N145M776M762N300
$$ 412936 416271 418807 421032 423587 426654 430109 433992 438519 443681 449072 454217 458993 463755 469055
62282D69055O097O593O472N921N309M757M253M002M304N121O176P494R380J1805
$$ 469055 475152 481745 488217 494138 499447 504204 508457 512459 516763 521884 528060 535554 544934 556739
62268E56739J4287J6568J9002K1954K5140K8006L0516L3193L6308L9283M0962
$$ 556739 571026 587594 606596 628550 653690 681696 712212 745405 781713 820996 861958
62257H61958M0470L7911L4156K9917K5140J9580J3718Q528M300L52l899q212j2276
$$ 861958 902428 940339 974495 1004412 1029552 1049132 1062850 1071378 1075678 1076030 1072131 1063919 1051643
62244A051643j6489k1271k5999k9365l0847l1198l1361l1388l0586k8494k5439
$$ 1051643 1035154 1013883 987884 958519 927672 896474 865113 833725 803139 774645 749206
62233G49206k2264j9588j7411j5462j3758j2541j1685j0647r150p547o288n388
$$ 749206 726942 707354 689943 674481 660723 648182 636497 625850 616700 609153 602865 597477
62221E97477m707m295m126l843l213k459j784r37K21J198J511J510J802K122J659
$$ 597477 592770 588475 584349 580506 577293 574834 573050 572113 572334 573532 575043 576553 578355 580477 582136
62206E82136M23m87k27Q94J958K396K218J839J843K493L429M171M850N910P148
$$ 582136 582559 582072 581845 582739 584697 587093 589311 591150 592993 595486 598915 603086 607936 613846 620994
62191F20994P798P661P400P524P757P797P959Q568R255R479R348R322R436R460
$$ 620994 628792 636453 643853 651377 659134 666931 674890 683458 692713 702192 711540 720862 730298 739758
62177G39758R647J0713J2986J6051J9282K2365K5196K7609K9401L0502L0926L0528
$$ 739758 749405 760118 773104 789155 808437 830802 855998 883607 913008 943510 974436 1004964
62165A004964K8924K5807K1494J6928J2964R711O782M007J469j088m271q232j2206
$$ 1004964 1033888 1059695 1081189 1098117 1111081 1120792 1127574 1131581 1133050 1131962 1127691 1119459 1107253
62152A107253j5234j7115j8366j9402k0071j9967j8987j7460j5738j3800j1495
$$ 1107253 1092019 1074904 1056538 1037136 1017065 997098 978111 960651 944913 931113 919618
62141I19618r151p541o962o743o162n439n203n306n048m406m061m062l571k248
$$ 919618 910467 902926 895964 889221 883059 877620 872417 867111 862063 857657 853596 849534 845963 843715
62127H43715r53m27j63P58K406M307O176P563P389M972J263j853l337l360k315
$$ 843715 842762 842335 842172 842930 845336 849643 855819 863382 870771 875743 877006 875153 871816 868456 866141
62112H66141n17J194J635L49k138n097p995j0163j0994j0716j0182r733q941p649
$$ 866141 865624 866818 868453 868802 866664 861567 853572 843409 832415 821699 811517 801784 792843 785194
62098G85194o435n671m891l639k298j486j133p24j22M74J040J696K335K808L331
$$ 785194 778759 773088 768197 764558 762260 760774 759641 758917 758795 759269 760309 762005 764340 767148 770479
62083G70479M264N596P043Q509R979J1091J1365J0922J0561J0957J2036J3237
$$ 770479 774743 780339 787382 795891 805870 816961 828326 839248 849809 860766 872802 886039
62071H86039J4189J5018J6115J7601J8909J9067J7526J4657J1227P585L691k47
$$ 886039 900228 915246 931361 948962 967871 986938 1004464 1019121 1030348 1037933 1041624 1041377
62059A041377l648o149p958r557j1375j3756j6740j9750k1938k3101k3862k4646
$$ 1041377 1037729 1031580 1023622 1014065 1002690 988934 972194 952444 930506 907405 883543 858897
62047H58897k5005k4389k3118k1957k0943j9483j7512j5740j4550j3434j1911
$$ 858897 833892 809503 786385 764428 743485 724002 706490 690750 676200 662766 650855
62036F50855j0361r383q876q391p937p733p475o702n803n680o349o772o437o169
$$ 650855 640494 631111 622235 613844 605907 598174 590699 583997 578194 572514 566165 559393 552956 546787
62022E46787o802p740p713o580n478n271n619n721n327m763m399m365m475m331
$$ 546787 539985 532245 524532 517952 512474 507203 501584 495863 490536 485773 481374 477009 472534 468203
62008D68203l672k768k169j981j787j353r89r70j054r94j149j982l194l933l902
$$ 468203 464531 461763 459594 457613 455826 454473 453484 452514 451460 450466 449317 447335 444141 440208 436306
61993D36306l626l528l436l289l569m546n501n461m481l501l057k861k680k778
$$ 436306 432680 429152 425716 422427 418858 414312 408811 403350 398869 395368 392311 389450 386770 383992
61979C83992l172l203k380j106p0O51J250J465R74K62J73O62Q61N07L83J055J954
$$ 383992 380820 377617 375237 374131 374061 374712 375962 377427 378401 378663 378836 379498 380359 380866 381249 382304 384258
61962C84258K326K423L024M129M912M848M259L642L142K846L163M517O722R003
$$ 384258 386584 389007 392031 396160 401072 405920 410179 413821 416963 419809 422972 427489 434211 443214
61948D43214J0636J1489J1931J2356J2918J3627J4490J5440J6257J6711J6736
$$ 443214 453850 465339 477270 489626 502544 516171 530661 546101 562358 579069 595805
61937E95805J6463J6182J6305J7049J8007J8410J8065J7698J7879J8125J7682
$$ 595805 612268 628450 644755 661804 679811 698221 716286 733984 751863 769988 787670
61926G87670J6845J6644J7333J8183J8861J9979K2032K4692K7611L1068L5244
$$ 787670 804515 821159 838492 856675 875536 895515 917547 942239 969850 1000918 1036162
61915A036162L9703M4238M9396N5426O1376O6214P0260P4561P9314Q3967Q8463
$$ 1036162 1075865 1120103 1169499 1224925 1286301 1352515 1422775 1497336 1576650 1660617 1749080
61904A749080R3157R7655J00868J02402J02783J02089R9355R3654Q4974P3685
$$ 1749080 1842237 1939892 2040760 2143162 2245945 2348034 2447389 2541043 2626017 2699702
61894B699702N9936M3990K6468P840j1660l1197m9104o4034p5951q5588r3370
$$ 2699702 2759638 2803628 2830096 2837936 2826276 2795079 2745975 2681941 2605990 2520402 2427032
61883B427032r9293j03338j05406j05229j02828r8909r4270q9071q3115p6587
$$ 2427032 2327739 2224401 2118995 2013766 1910938 1812029 1717759 1628688 1545573 1468986
61873A468986p0159o4475n9841n6137n2689m8566m3519l8457l4446l1401k8337
$$ 1468986 1398827 1334352 1274511 1218374 1165685 1117119 1073600 1035143 1000697 969296 940959
61862I40959k4757k1231j8414j6140j3686j0600o971l179L61L336N610P199Q102
$$ 940959 916202 894971 876557 860417 846731 836131 829160 825981 826342 829678 835288 842487 850589
61849H50589Q321Q049P593P054O207M905L341J795K62j344k750l440l266k582
$$ 850589 858910 866959 874552 881606 887813 892718 896059 897854 898116 896772 894022 890582 887316 884734
61835H84734j661k91J768M256O728R179J1805J4210J5465J5123J3586J1245P833
$$ 884734 883073 882782 884550 888806 895534 904713 916518 930728 946193 961316 974902 986147 993980
61822I93980L163j993o461r832j2499j4649j5942j6150j5471j4088j1954r292
$$ 993980 997143 995150 988689 978857 966358 951709 935767 919617 904146 890058 878104 868812
61810H68812o673m381k050P38L831O682Q947J0665J2142J3811J5991J8578K1205
$$ 868812 862139 857758 855708 856446 860277 866959 875906 886571 898713 912524 928515 947093 968298
61797I68298K3709K6183K8536L0506L2337L4829L8416M2511M6289M9798N3779
$$ 968298 992007 1018190 1046726 1077232 1109569 1144398 1182814 1225325 1271614 1321412 1375191
61786A375191N8608O3929O9321P4855Q0896Q7669R5238J03710J13206J23567J34137
$$ 1375191 1433799 1497728 1567049 1641904 1722800 1810469 1905707 2009417 2122623 2246190 2380327
61775B380327J44085J53097J61613J69995J77621J83164J85790J85434J81763
$$ 2380327 2524412 2677509 2839122 3009117 3186738 3369902 3555692 3741126 3922889
61766C922889J73607J59866J40530J16272Q7655N5402K1108j3246m6422p7854
$$ 3922889 4096496 4256362 4396892 4513164 4600819 4656221 4677329 4664083 4617661 4539807
61756D539807j06559j31065j50576j65431j76042j82094j83362j80765j75966
$$ 4539807 4433248 4302183 4151607 3986176 3810134 3628040 3444678 3263913 3087947
61747C087947j70094j63359j55679j47111j37815j28122j18716j10293j02893
$$ 3087947 2917853 2754494 2598815 2451704 2313889 2185767 2067051 1956758 1853865
61738A853865r5938q9035q2380p6212p0255o4141n8169n3173m9563m6870m4320
$$ 1853865 1757927 1668892 1586512 1510300 1440045 1375904 1317735 1264562 1214999 1168129 1123809
61727A123809m1560l8625l5544l2292k9092k6325k4127k2255k0392j8472j6656
$$ 1123809 1082249 1043624 1008080 975788 946696 920371 896244 873989 853597 835125 818469
61716H18469j5205j4372j4214j4425j4469j3980j2981j1844j1098j1157j1847
$$ 818469 803264 788892 774678 760253 745784 731804 718823 706979 695881 684724 672877
61705F72877j2280j1629j0157r043q986r377r229q495p930p886p885p454o773
$$ 672877 660597 648968 638811 629768 620782 611405 602176 593681 585751 577865 569980 562526 555753
61692E55753o211n748n213m806m861n234n371n039m566m210l676k674j629j302
$$ 555753 549542 543794 538581 533775 528914 523680 518309 513270 508704 504494 500818 498144 496515 495213
61678D95213j652j726r41ro7j219k589l665m865o490p945q466q209p995q142q129
$$ 495213 493561 491835 490894 490885 490818 489599 487010 483345 478480 471990 464045 455579 447370 439375 431233 423104
61662D23104p425o180m964m156l690l192k258p95Q51K184L051L705M400N038N223
$$ 423104 415679 409499 404535 400379 396689 393497 391239 390444 391295 393479 396530 400235 404635 409673 414896
61647D14896M564K978Q34j174k545l368m097m937n653n992o002n789n208m113
$$ 414896 419460 422438 423272 422098 419553 416185 412088 407151 401498 395506 389504 383715 378507 374394
61633C74394k801j975k082k792l272k957k074j360j261j483j405q38k08Q0J60
$$ 374394 371593 369618 367536 364744 361472 358515 356441 355081 353820 352337 350932 350094 349886 349966 350126
61618C50126L77O22M13l17r39r27o64r94k025k928l002k552k360k616k837k712
$$ 350126 350503 351125 351538 351221 350282 349355 348691 347697 345672 342744 339742 337190 334830 332214 329377 326665
61602C26665k499k484k457k015j235p02q88j588k080j811q82K04J133J930K582
$$ 326665 324166 321682 319225 317210 315975 315273 314385 312797 310717 308906 308024 308228 309361 311291 313873
61587C13873K801K435J910J934K767L936M676M531L703K999L245M522O078P226
$$ 313873 316674 319109 321019 322953 325720 329656 334332 338863 342566 345565 348810 353332 359410 366636
61573C66636Q069Q990R778R933R697R999J1147J2351J2919J3257J4102J5255J5815
$$ 366636 374705 383695 393473 403406 413103 423102 434249 446600 459519 472776 486878 502133 517948
61560E17948J5489J4948J4757J4462J3070J0265O983M701M129M501M377L147J523
$$ 517948 533437 548385 563142 577604 590674 600939 607922 612623 616752 621253 625630 628777 630300
61547F30300M90J58Mj83j48J15P1o75j780k475k345j693j156j090j271j238r42
$$ 630300 630790 630948 630952 630769 630621 630736 630807 630132 628352 625877 623532 621839 620683 619593 618322 617084 616142
61530F16142q66j397k224k633k339j732j282j005o37p7N75J324K372L876N733
$$ 616142 615276 613879 611655 609022 606683 604951 603669 602664 602027 601950 602525 603849 606221 610097 615830
61515F15830P764R930J2295J4705J6786J8393J9967K2188K5242K8636L1870L5047
$$ 615830 623594 633524 645819 660524 677310 695703 715670 737858 763100 791736 823606 858653
61503H58653L8698M3037M7616N1708N4988N7732O0380O2934O4919O5818O5420
$$ 858653 897351 940388 988004 1039712 1094700 1152432 1212812 1275746 1340665 1406483 1471903
61492A471903O3618O0214N5157M8853M1881L4466K6477J7951R369J402n374j0686
$$ 1471903 1535521 1595735 1650892 1699745 1741626 1776092 1802569 1820520 1829889 1831291 1825917 1815231
61480A815231j4704j7863k0261k1322k0534j8418j6225j4628j3317j1936j0835
$$ 1815231 1800527 1782664 1762403 1741081 1720547 1702129 1685904 1671276 1657959 1646023 1635188
61469A635188j0596j1321j2750j4682j6962j9362k1749k4075k5983k6863k6533
$$ 1635188 1624592 1613271 1600521 1585839 1568877 1549515 1527766 1503691 1477708 1450845 1424312
61458A424312k5473k4059k2067j9322j6362j3815j1478q616n062j458J595M219
$$ 1424312 1398839 1374780 1352713 1333391 1317029 1303214 1291736 1283120 1278058 1276600 1278195 1282414
61446A282414P009J0427J4378J8276K1579K4404K7370L0662L3581L5105L4607
$$ 1282414 1289423 1299850 1314228 1332504 1354083 1378487 1405857 1436519 1470100 1505205 1539812
61435A539812L1749K6295J8499R479P33o504j1358j3384j3045j1613j0018q074
$$ 1539812 1571561 1597856 1616355 1625834 1626567 1620063 1608705 1595321 1582276 1570663 1560645 1552571
61423A552571n412k516j39J952M602P938J1272J4171J6476J7213J4688Q233q50
$$ 1552571 1547159 1544643 1544504 1546456 1551058 1558996 1570268 1584439 1600915 1618128 1632816 1641049 1640199
61410A640199j0442j9102k6097l0833l3013l3046l1795k9948k7919k5936k3958
$$ 1640199 1629757 1610655 1584558 1553725 1520712 1487666 1455871 1425923 1398004 1372068 1348110
61399A348110k1705j9149j6799j5167j4140j3100j1602r709p693n588l106l6L366
$$ 1348110 1326405 1307256 1290457 1275290 1261150 1248050 1236448 1226739 1219046 1213458 1210352 1210316 1213682
61386A213682O529R289J2159J5652J9562K3327K6882L0671L4815L8858M2452M5780
$$ 1213682 1220211 1229500 1241659 1257311 1276873 1300200 1327082 1357753 1392568 1431426 1473878 1519658
61374A519658M9083N2201N4776N6609N7600N7530N6207N3599M9726M4582L8246
$$ 1519658 1568741 1620942 1675718 1732327 1789927 1847457 1903664 1957263 2006989 2051571 2089817
61363B089817L0907K2718J3838M637m364j2904k1142k9263l7043m3803m8847n1982
$$ 2089817 2120724 2143442 2157280 2161917 2157553 2144649 2123507 2094244 2057201 2013398 1964551 1912569
61351A912569n3752n5002n6121n6779n6482n5179n3167n0717m8064m5515m3188
$$ 1912569 1858817 1803815 1747694 1690915 1634433 1579254 1526087 1475370 1427306 1381791 1338603
61340A338603m0796l7998l4778l1317k7806k4617k2205k0413j8306j5213j1631
$$ 1338603 1297807 1259809 1225031 1193714 1165908 1141291 1119086 1098673 1080367 1065154 1053523
61329A053523q554o301m503k822r57J550M691P518R258J0538J2472J4883J6538
$$ 1053523 1044969 1038668 1034165 1031343 1030386 1031936 1036627 1044145 1053403 1063941 1076413 1091296 1107834
61316A107834J7019J6929J6363J4720J2262J0302R242P936N740L856L555M271
$$ 1107834 1124853 1141782 1158145 1172865 1185127 1195429 1204671 1212607 1218347 1222203 1225758 1230029
61304A230029M647M585M893N525N562M713L658K904K238J323J81r94j909k290
$$ 1230029 1234676 1239261 1244154 1249679 1255241 1259954 1263612 1266516 1268754 1270077 1270258 1269264 1267355 1265065
61290A265065k323k759l911m987m987m093l346l275l566l948m473m969m970m353
$$ 1265065 1262742 1259983 1256072 1251085 1246098 1242005 1238659 1235384 1231818 1227870 1223397 1218428 1213458 1209105
61276A209105l384k110l61J549K833L133K863K393J487k02k504m894o911q167
$$ 1209105 1205721 1203611 1203250 1204799 1207632 1210765 1213628 1216021 1217508 1217306 1214802 1209908 1202997 1194830
61262A194830q357p615o541n623m715l426j758l4J732M027P246J1168J5077J8413
$$ 1194830 1186473 1178858 1172317 1166694 1161979 1158553 1156795 1156761 1158493 1162520 1169766 1180934 1196011 1214424
61248A214424K1121K3486K5865K8750L2807L8405M4900N0684N4015N3739M9190
$$ 1214424 1235545 1259031 1284896 1313646 1346453 1384858 1429758 1480442 1534457 1588196 1637386
61237A637386M0051K6918J1850k362j3881k2615k9285l4080l6648l7115l6395
$$ 1637386 1677437 1704355 1716205 1713843 1699962 1677347 1648062 1613982 1577334 1540219 1503824
61226A503824l5208l3262k9890k5228k0152j5230j0413n870k383n92o01k695p625
$$ 1503824 1468616 1435354 1405464 1380236 1360084 1344854 1334441 1328571 1326188 1325596 1324995 1322300 1314675
61213A314675j5261k3537k9720l2617l2736l0771k7056k2468j8500j5887j4059
$$ 1314675 1299414 1275877 1246157 1213540 1180804 1150033 1122977 1100509 1082009 1066122 1052063
61202A052063j2379j1105j0643j0588j0191r198p708n631l026p00K39n16k045
$$ 1052063 1039684 1028579 1017936 1007348 997157 987959 980251 974620 971594 970894 971133 970617 968572
61189I68572l043k974k534k851m217n789o834p774r410j1445j2703j2784j2495
$$ 968572 965529 962555 960021 957170 952953 947164 940330 932556 923146 911701 898998 886214 873719
61176H73719j2555j2763j2688j2332j1753j0798r548q414p480o450n408m807m511
$$ 873719 861164 848401 835713 823381 811628 800830 791282 782868 775388 768938 763530 758723 754212
61163G54212l783k536j663j773k567l896o243r593j2890j5368j7380j9110j9656
$$ 754212 750429 747893 746230 744457 741890 737994 731751 722158 709268 693900 676520 657410 637754
61150F37754j8458j6662j5821j5930j5849j5057j3761j1936r528p338o390o608
$$ 637754 619296 602634 586813 570883 555034 539977 526216 514280 504752 497414 491024 484416
61138D84416p081p375p592p430o357m647l262k615k284j855j310n79N11J822K970
$$ 484416 477335 469960 462368 454938 448581 443934 440672 438057 435773 433918 432608 432029 432540 434362 437332
61123D37332L802M438M995N610O414P196P605P894Q688R586R115O841M422L501
$$ 437332 441134 445572 450567 456177 462591 469787 477392 485286 493974 503560 512675 519516 523938 527439
61109E27439L456K582O45j116j951k063j612p33k10o52j215n97Q23J315K35j271
$$ 527439 530895 533477 534122 533006 531055 528992 527380 526647 526437 525785 524570 523973 524796 526111 526346 525075
61093E25075k106k367k469k410k225k189k278k226k182k475k865k892k789l053
$$ 525075 522969 520602 518133 515723 513498 511309 509031 506805 504623 502148 499283 496391 493602 490549
61079D90549l397l113k332j778j513j072o13o69r71p49n1M20O25J057J604J811
$$ 490549 487152 484039 481707 479929 478416 477344 476731 476062 475091 474342 474291 474711 475336 476393 477997 479808
61063D79808K010K736L395L079K431K910M354N169M891M636M947N154N169N832
$$ 479808 481818 484554 487949 491028 493459 496369 500723 505892 510783 515419 520366 525520 530689 536521
61049E36521P047P488O812O387P238Q815J0331J1718J2847J3442J4119J5852J8165
$$ 536521 543568 551056 557868 564255 571493 580308 590639 602357 615204 628646 642765 658617 676782
61036F76782J9722K0888K3522K7876L1931L4282L5437L5861L5325L4959L7067
$$ 676782 696504 717392 740914 768790 800721 835003 870440 906301 941626 976585 1013652
61025A013652M1933M7387N2578N9308O8412P7798Q5722R3231J02015J13138J29489
$$ 1013652 1055585 1102972 1155550 1214858 1283270 1361068 1446790 1540021 1642036 1755174 1884663
61014A884663J55633J92774K37319K86780L43147M08391M82743N71835O89502
$$ 1884663 2040296 2233070 2470389 2757169 3100316 3508707 3991450 4563285 5252787
61005E252787Q48430J055705J322701J658044K017014K256692K187730J722679
$$ 5252787 6101217 7156922 8479623 10137667 12154681 14411373 16599103 18321782
60997A8321782R84358K45045k57605m46380l69918r9789K91192O65839Q13107
$$ 18321782 19306140 19551185 19293580 18847200 18477282 18377493 18668685 19334524 20147631
60988B0147631N69199l8063p86619j414420j779382j890829j831781j681224j492808
$$ 20147631 20716830 20678767 19892148 18477728 16698346 14807517 12975736 11294512 9801704
60979I801704j302423j129542r76562q38525p13712o03078n05407m18799l44257
$$ 9801704 8499281 7369739 6393177 5554652 4840940 4237862 3732455 3313656 2969399
60970B969399k83701k36171j98863j69949j47923j30210j14887j02105r1878q2370
$$ 2969399 2685698 2449527 2250664 2080715 1932792 1802582 1687695 1585590 1493712 1411342
60960A411342p2313o3049n6031n0219m4118l8632l5486l4348l3788l3661l4267
$$ 1411342 1339029 1275980 1219949 1169730 1125612 1086980 1051494 1017146 983358 949697 915430
60949I15430l4443l2965l0759k9467k8709k7036k4683k3026k2000k0467j8634
$$ 915430 880987 848022 817263 787796 759087 732051 707368 684342 662342 641875 623241
60938F23241j7749j7581j6487j4041j1541r708p776n248k887j525j107j255j687
$$ 623241 605492 587911 571424 557383 545842 536134 528358 523110 520223 518698 517591 516336 514649
60925E14649j973j856j845k502l376l629l406l376l289k404j117o98j356k037
$$ 514649 512676 510820 508975 506473 503097 499468 496062 492686 489397 486993 485876 485178 483822 481785
60911D81785k222k564l494m513n157n479n347m406l066k396k661k967k674k196
$$ 481785 479563 476999 473505 468992 463835 458356 453009 448603 445537 443141 440480 437513 434839 432643
60897D32643k066k207k442k809k965k279r52q1k17o70p12o37j015j751k405k832
$$ 432643 430577 428370 425928 423119 420154 417875 416923 416842 416625 415955 415243 414606 413591 411840 409435 406603
60881D06603k933k434j464o73l13J35Q86J201N90n4N08K083L309L442L022K772
$$ 406603 403670 401236 399772 399099 398786 398921 399807 401008 401598 401544 402052 404135 407444 410886 413908 416680
60865D16680K787K910L093L086K411J043k98r15q44m73J94J334K486K618J262
$$ 416680 419467 422377 425470 428556 430967 432010 431712 430797 429953 429480 429674 431008 433494 436112 437374
60850D37374q09k390l089l440l902m314m408m371m615n192n747n917n588m900
$$ 437374 436565 434175 431086 427646 423744 419430 415022 410651 406036 400844 395097 389180 383592 378692
60836C78692m197l805l666l376k724k058j828k014k217k174j973j824j886k149
$$ 378692 374495 370690 367024 363648 360924 358866 357038 355024 352807 350633 348660 346836 344950 342801
60822C42801k302j947j131m53l64n92o33n29o76j023r99l17O39J337J637J686
$$ 342801 340499 338552 337421 336968 336604 336012 335379 334850 334174 333151 332152 331835 332474 333811 335448 337134
60806C37134J612J429J116O60J42j56R2Q90J810K268K002J289P17O51R23J184
$$ 337134 338746 340175 341291 341951 342093 341937 342029 342919 344729 346997 348999 350288 351005 351656 352579 353763
60790C53763J361J490J329O57q7j50L63M56l31j188j318j198j702k580k773k006
$$ 353763 355124 356614 357943 358600 358513 358363 358726 359182 358851 357663 356345 355147 353445 350865 348092 346086
60774C46086j084o93q40j415k358l182l174k405j782j834k101k014j663j329r24
$$ 346086 345002 344309 343469 342054 339696 336514 333340 330935 329153 327319 325218 323204 321541 320212 319288
60759C19288l70j9j20k77O4Q07J398J613J698J831J870J629J085L45m02r34j166
$$ 319288 318918 318899 318779 318502 318566 319373 320771 322384 324082 325913 327783 329412 330497 330842 330440 329506 328340
60742C28340j268j455j737j993k147k154j912j401q63o70r15j256j264r28o94
$$ 328340 327072 325617 323880 321887 319740 317586 315674 314273 313410 312740 311825 310569 309305 308377 307683
60727C07683r54j564k076k263k166j710p35M07R22N27j24l67m70j008j789k167
$$ 307683 306729 305165 303089 300826 298660 296950 296215 296622 297544 298071 297947 297580 297110 296102 294313 292146
60711B92146k171k401k853k868k372k195k750l205k642j350l13Q1J26o0o20j291
$$ 292146 289975 287574 284721 281853 279481 277286 274536 271331 268689 267339 267026 267107 267233 267173 266553 265262
60695B65262j404o96L31J048J262J111P60M38M61R36J575J993K162K351K673K902
$$ 265262 263858 263162 263493 264541 265803 266914 267674 268112 268573 269509 271084 273077 275239 277590 280263 283165
60679B83165K853K756K968L381L476L053K520K244K017J573J268J575K099J967
$$ 283165 286018 288774 291742 295123 298599 301652 304172 306416 308433 310006 311274 312849 314948 316915
60665C16915J184P44J123J478R82J91L17J491K660L033K879K775K853K967L000
$$ 316915 318099 318843 319966 321444 322426 322617 322934 324425 327085 330118 332997 335772 338625 341592 344592
60650C44592K689J627j01j637k175j871j588j802k210k363k300k302k367k204
$$ 344592 347281 348908 348807 347170 344995 343124 341536 339734 337524 335161 332861 330559 328192 325988
60636C25988j713j216j101j398j720j643j127o06o16j240j940k019j340n23l56
$$ 325988 324275 323059 321958 320560 318840 317197 316070 315464 314848 313608 311668 309649 308309 307786 307430
60621C07430j027j891k079j341l85j67q07j428j294q29r98j825k217j468k31M10
$$ 307430 306403 304512 302433 301092 300707 300540 299733 298305 297011 296182 295184 293359 291142 289674 289443 289853
60605B89853L61L38P40J228J381J077L22p59j742k186k146j967j694j161o10n33
$$ 289853 290214 290552 291292 292520 293901 294978 295300 294541 292799 290613 288467 286500 284806 283645 283035 282502
60589B82502q53r63p53q45j445j740r79L09R26N35p1j37K71O78R21J190J641K132
$$ 282502 281649 280686 279933 279088 277643 275903 274924 275233 276159 276694 276623 276486 276757 277435 278356 279546 281187 283319
60571B83319K322K034J566J482J944K436K364J771J257J283J841K621L259L501
$$ 283319 285641 287675 289241 290723 292667 295103 297467 299238 300495 301778 303619 306240 309499 313000
60557C13000L445L562M167M907N106M644M163M290M962N718O447P505R229J1557
$$ 313000 316445 320007 324174 329081 334187 338831 342994 347284 352246 357964 364411 371916 381145 392702
60543C92702J4222J7152K0484K4282K8411L2757L7288M1714M5216M6758M5676
$$ 392702 406924 424076 444560 468842 497253 530010 567298 609012 654228 700986 746662
60532G46662M1722L4720K4691J2444l80j2292k2657l1169l7058l9460l8611l6014
$$ 746662 788384 823104 847795 860239 859859 847567 824910 793741 756683 717223 678612 642598
60520F42598l3182l0500k7472k3735j9507j5272j1381q033n326l222j459M01K790
$$ 642598 609416 578916 551444 527709 508202 492930 481549 473516 468190 464968 463509 463910 466700
60507D66700N812R122J2240J5184J8582K2997K8180L3283L7669M1121M3073M2252
$$ 466700 472512 481634 493874 509058 527640 550637 578817 612100 649769 690890 733963 776215
60495G76215L7637K9680K0056J0208O65q115j4978j8651j8815j6133j1379n003
$$ 776215 813852 843532 863588 873796 874461 866346 851368 832717 813902 797769 786390 781387
60483G81387K601J0944J9688K8672L7668M6247N3863N9612O1961N9214N0626L6885
$$ 781387 783988 794932 814620 843292 880960 927207 981070 1040682 1102643 1161857 1212483 1249368
60471A249368J9488Pj9943l8441n3587o4174p0031p1795p0375o6502o0748n3983
$$ 1249368 1268856 1268863 1248920 1210479 1156892 1092718 1022687 950892 880517 814015 753267 699284
60459F99284m7535m2400l8336l4272k9778k5586k2435j9995j7513j5014j3156
$$ 699284 651749 609349 571013 536741 506963 481377 458942 438947 421434 406420 393264
60448C93264j2036j0950r402p672o190m908l680k847k813l253l247k338j023o9
$$ 393264 381228 370278 360876 353204 347014 342106 338426 335579 332766 329513 326266 323928 322905 322836
60434C22836L69O49R78J198J191J155J285J480J460J034J90q65j718k026j935
$$ 322836 323205 323854 324832 326030 327221 328376 329661 331141 332601 333635 333825 332960 331242 329216 327281
60419C27281j829j689j030J66J114J208Q98R89J467J780J910K247K624K538K297
$$ 327281 325452 323763 322733 322899 324013 325221 326119 327108 328575 330355 332265 334512 337136 339674 341971
60404C41971K833M158N188N456N851P007Q125Q345Q242Q826R784J0033R528R136
$$ 341971 344804 348962 354150 359606 365457 372464 380589 388934 397176 406002 415786 425819 435347 444483
60390D44483R033Q578P764P335P245O337M224K280J955K873L539L342K947K902
$$ 444483 453516 462094 469858 477193 484438 490775 494999 497279 499234 502107 505646 508988 511935 514837
60376E14837K832K101P35o22j303j133m51J60K91o8n76p91n31j61l39j255k170
$$ 514837 517669 519770 520505 519883 518580 517447 516996 517156 517447 517379 516803 516012 515481 515320 514981 513726 511556
60359E11556k112j031J15M40L0l24oR08J774J928J308N22P2l43j398l108m681
$$ 511556 509444 508413 508528 508968 508998 508674 508668 509576 511350 513278 514586 515108 515180 514837 513439 510331 505650
60342E05650n454n493n230m942m759m640m239l269k125j640j986k439k527k662
$$ 505650 500196 494703 489473 484531 479772 475132 470893 467624 465499 463859 461873 459434 456907 454245
60328D54245l251l855m013m203n081o159o315n483m767m733m671l972l204l147
$$ 454245 450994 447139 443126 438923 433842 427683 421368 415885 411118 406385 401714 397742 394538 391391
60314C91391l411k950j600k44N18J061J881K752L136L091L249M102N634P538R323
$$ 391391 387980 385030 383430 383186 383704 384765 386646 389398 392534 395625 398874 402976 408610 416148 425471
60299D25471J0229R552P415M877K849J096j366m841q385j0723j1445j1071j0331
$$ 425471 435700 445252 452667 457544 460393 461489 460123 455282 446897 436174 424729 413658 403327
60286D03327r596q913q117o974n420l815k728k362k239j653l90J061K022K229
$$ 403327 393731 384818 376701 369727 364307 360492 357764 355402 353163 351510 351120 352181 354203 356432
60272C56432J928J520J387J876L096M571N439N298M676M439M830N412N696N511
$$ 356432 358360 359880 361267 363143 366239 370810 376249 381547 386223 390662 395492 400904 406600 412111
60258D12111M851L854K972K701L026L415L486L303L061K826K708K882L281L681
$$ 412111 416962 420816 423788 426489 429515 432930 436416 439719 442780 445606 448314 451196 454477 458158
60244D58158M179N131O465P545Q057Q495R406J0560J1404J1984J2829J4111J5484
$$ 458158 462337 467468 473933 481478 489535 498030 507436 517996 529400 541384 554213 568324 583808
60231E83808J6586J7285J7597J7858J8802K0945K3898K6832K9528L2446L5817
$$ 583808 600394 617679 635276 653134 671936 692881 716779 743611 773139 805585 841402
60220H41402L9220M2176M4599M6544M7933M8690M8792M8031M6119M3110L9430
$$ 841402 880622 922798 967397 1013941 1061874 1110564 1159356 1207387 1253506 1296616 1336046
60209A336046L5397L1086K6644K2212J7507J2086O228R61l054o122q691j0543
$$ 1336046 1371443 1402529 1429173 1451385 1468892 1480978 1487206 1488167 1485113 1478991 1470300 1459757
60197A459757j1343j1486j1592j1363r745o272j690K871O905J0646J4570J9000
$$ 1459757 1448414 1436928 1425336 1413973 1404228 1397956 1396266 1399137 1406042 1416688 1431258 1450258
60185A450258K3849K8586L2642L5965L8966M1899M4431M5964M6117M4769M1872
$$ 1450258 1474107 1502693 1535335 1571300 1610266 1652165 1696596 1742560 1788677 1833446 1875318
60174A875318L7508L2087K6219K0291J4243P744N68p265j5498k3720l1424l8078
$$ 1875318 1912826 1944913 1971132 1991423 2005666 2013410 2013978 2006713 1991215 1967495 1936071 1897993
60162A897993m3275m6768m8467m8451m7026m4615m1519l7791l3411k8472k3149
$$ 1897993 1854718 1807950 1759483 1711032 1664006 1619391 1577872 1540081 1506670 1478198 1455049
60151A455049j7548j1772o045o47M260Q631J2500J5948J8949K1072K1595K0238
$$ 1455049 1437501 1425729 1419684 1419037 1423297 1431928 1444428 1460376 1479325 1500397 1521992 1542230
60139A542230J7616J4535J1052O669J363m147r229j3730j7440j9755k0394j9906
$$ 1542230 1559846 1574381 1585433 1592102 1593465 1589318 1580089 1566359 1548919 1529164 1508770 1488864
60127A488864j8920j7237j4173r605m190J398P016J2953J9545K6874L4576M2161
$$ 1488864 1469944 1452707 1438534 1428929 1424739 1426137 1433153 1446106 1465651 1492525 1527101 1569262
60115A569262M9698N7886O7044P6340Q4643R1860R8738J05406J10873J14233J15627
$$ 1569262 1618960 1676846 1743890 1820230 1904873 1996733 2095471 2200877 2311750 2425983 2541610
60104B541610J15545J13691J09124J01380R0950P8639O4845M9562L2917J5389
$$ 2541610 2657155 2770846 2879970 2981350 3072300 3150939 3215784 3265346 3298263 3313652
60094C313652k429k0164l7516n3871o8315q0161q9328r6018j00255j01974j01328
$$ 3313652 3311223 3291059 3253543 3199672 3131357 3051196 2961868 2865850 2765595 2663621 2562293
60083B562293r8590r3946q7715q0596p3226o5472n6703m6846l6812k7686j9797
$$ 2562293 2463703 2369757 2282042 2201446 2128220 2062748 2006045 1959199 1922387 1894701 1874904
60072A874904j2732o000M55O177J0576J3453J5163J6008J5674J3729J0586P406
$$ 1874904 1862172 1856172 1856627 1862804 1873380 1886833 1901996 1918004 1933678 1947407 1957993 1965399
60060A965399M835K387o90m424q334j2206j6150k0134k3933k7445l0721l3777
$$ 1965399 1970234 1972621 1971931 1967507 1959173 1946967 1930817 1910683 1886750 1859305 1828584 1794807
60048A794807l6601l9243m1630m3372m4015m3462m1990l9878l7160l3642k9156
$$ 1794807 1758206 1718963 1677333 1633961 1589946 1546484 1504494 1464616 1427456 1393814 1364658
60037A364658k3845j8284j3067q232l284K149P982J3974K0003K5914L1499L6921
$$ 1364658 1340813 1322529 1309462 1301230 1297946 1300095 1308077 1322051 1342054 1367968 1399467 1436388
60025A436388M2633M8612N3952N7561N8964N8118N4882M9220M1667L3047K3897
$$ 1436388 1479021 1527633 1581585 1639146 1698110 1756228 1811110 1860330 1901997 1935044 1958941
60014A958941J4463N039m214j3493k2882l1763l9204m4825m8737n0875n1040m9541
$$ 1958941 1973404 1978443 1974229 1960736 1937854 1906091 1866887 1822062 1773325 1722450 1671410 1621869
60002A621869m7052m3770l9439l4310k9317k4945k0590j5483r773m177J107O599
$$ 1621869 1574817 1531047 1491608 1457298 1427981 1403036 1382446 1366963 1357190 1353013 1354120 1360719
59990A360719J2846J9863K7188L4220M0724M7157N4209O1680O8147P2136P3427
$$ 1360719 1373565 1393428 1420616 1454836 1495560 1542717 1596926 1658606 1726753 1798889 1872316
59979A872316P2776P0472O5894N8549M9100L8963K9093J9444R496j005j1818k2427
$$ 1872316 1945092 2015564 2081458 2140007 2189107 2228070 2257163 2276607 2286103 2285098 2273280 2250853
59967B250853l2318m1053m8242n3526n6618n7444n6284n3615m9763m4736l8568
$$ 2250853 2218535 2177482 2129240 2075714 2019096 1961652 1905368 1851753 1801990 1757254 1718686
59956A718686l1693k4737j7968j1202m287K676R640J6744K3931L0738L6761M1943
$$ 1718686 1686993 1662256 1644288 1633086 1628799 1631475 1641115 1657859 1681790 1712528 1749289 1791232
59944A791232M6216M9257N0987N1838N1989N0771M7506M2803L8108L4090L0156
$$ 1791232 1837448 1886705 1937692 1989530 2041519 2092290 2139796 2182599 2220707 2254797 2284953
59933B284953K5641K0672J5656J0790O487L613K743L610N723R127J4114K0567
$$ 2284953 2310594 2331266 2346922 2357712 2364199 2367812 2370555 2374165 2379888 2389015 2403129 2423696
59921B423696K8073L6365M5252N4316O3142P1637P9766Q7070R2674R5602R5000
$$ 2423696 2451769 2488134 2533386 2587702 2650844 2722481 2802247 2889317 2981991 3077593 3172593
59910C172593R0449Q2378P1680N8677M2882K4313M443j4833l2747m9349o4040
$$ 3172593 3263042 3345420 3417100 3475777 3518659 3542972 3547415 3532582 3499835 3450486 3386446
59899C386446p5462q2948q7097q8733q8080q5285q0949p5588o9176o1709n3765
$$ 3386446 3310984 3228036 3140939 3052206 2964126 2878841 2797892 2722304 2653128 2591419 2537654
59888B537654m5899l7892k9202j9963j0881k322N973J4202K2161K9658L6802M3594
$$ 2537654 2491755 2453863 2424661 2404698 2393817 2391495 2397468 2411670 2433831 2463489 2500291 2543885
59876B543885M9586N4242N7421N9266N9702N8365N4923M9342M1852L2817K2549
$$ 2543885 2593471 2647713 2705134 2764400 2824102 2882467 2937390 2986732 3028584 3061401 3083950
59865C083950J1116j602j5502k9890m3697n6046o6419p4308p9041q0162p7912
$$ 3083950 3095066 3093464 3077962 3048072 3004375 2948329 2881910 2807602 2728561 2648399 2570487
59854B570487p3208o7181o0752n4432m8408m2915l8549l5905l4705l3554l0941
$$ 2570487 2497279 2430098 2369346 2314914 2266506 2223591 2185042 2149137 2114432 2080878 2049937
59843B049937k6473k1016j5763j1452q261o024m475l404k583j403J049N117R981
$$ 2049937 2023464 2002448 1986685 1975233 1966972 1960948 1956473 1953069 1950486 1949083 1950132 1955249 1965230
59830A965230J4469J8370K2307K6370K9567L0900L0348K8370K4979J9826J2939
$$ 1965230 1979699 1998069 2020376 2046746 2076313 2107213 2137561 2165931 2190910 2210736 2223675
59819B223675M951l141j0226j5403j8560k0447k1835k2842k3319k3508k3860k4465
$$ 2223675 2228626 2225485 2215259 2199856 2181296 2160849 2139014 2116172 2092853 2069345 2045485 2021020
59807B021020k5138k5839k6466k6494k5464k3809k2594k2305k2376k2036k1202
$$ 2021020 1995882 1970043 1943577 1917083 1891619 1867810 1845216 1822911 1800535 1778499 1757297
59796A757297k0447k0358k1079k2105k2544k1894k0578j9429j8607j7480j5539
$$ 1757297 1736850 1716492 1695413 1673308 1650764 1628870 1608292 1588863 1570256 1552776 1537237
59785A537237j2928r922o400k208K401P157J2304J8339K5284L2629L9995M7560
$$ 1537237 1524309 1514387 1507987 1505779 1508180 1515337 1527641 1545980 1571264 1603893 1643888 1691448
59773A691448N5787O4970P5034Q5685R6626J07609J18025J26243J29364J24110
$$ 1691448 1747235 1812205 1887239 1972924 2069550 2177159 2295184 2421427 2550791 2674901
59763B674901J08347Q2202M8133J0274k6514n7812q0755r4633j00508j00250r5708
$$ 2674901 2783248 2865450 2913583 2923857 2897343 2839531 2758776 2664143 2563635 2463385 2367677
59752B367677q8380p9360o9408n9192m9494m0974l3667k6939k0244j3710p803
$$ 2367677 2279297 2199937 2130529 2071337 2021843 1980869 1947202 1920263 1900019 1886309 1878506
59741A878506k650J986O233J0166J4190J8814K3998K9247L4414L9802M5347N0440
$$ 1878506 1875856 1877842 1884075 1894241 1908431 1927245 1951243 1980490 2014904 2054706 2100053 2150493
59729B150493N4994N9983O6294P3631Q1260Q9359R8711J09334J20411J31574J43298
$$ 2150493 2205487 2265470 2331764 2405395 2486655 2576014 2674725 2784059 2904470 3036044 3179342
59718C179342J55833J68575J80883J92669K03585K12272K17147K17632K14089
$$ 3179342 3335175 3503750 3684633 3877302 4080887 4293159 4510306 4727938 4942027
59709D942027K06751J95470J80552J63283J45504J28909J14699J03329R4299Q6495
$$ 4942027 5148778 5344248 5524800 5688083 5833587 5962496 6077195 6180524 6274823 6361318
59699F361318P9105P2106O5713N9623N3249M6522L9867L3247K5776J6847P268
$$ 6361318 6440423 6512529 6578242 6637865 6691114 6737636 6777503 6810750 6836526 6853373 6860641
59688F860641j280p844j2670j6191j8240j8440j6706j3002p072J073J0872K1935
$$ 6860641 6859361 6851517 6838847 6822656 6804416 6785976 6769270 6756268 6749196 6750269 6761141 6783076
59676F783076L4652M9531O6201Q3598J00944J17964J34331J49538J63331J75496
$$ 6783076 6817728 6867259 6933460 7017058 7118002 7235966 7370297 7519835 7683166 7858662
59666G858662J85106J90551J90551J84712J72899J54571J29102R6555N7871J4504
$$ 7858662 8043768 8234319 8424870 8609582 8782481 8937052 9066154 9162709 9220580 9235084
59656I235084l1797p8887j24182j65043j99463k26545k46164k58149k62049k57967
$$ 9235084 9203287 9124400 9000218 8835175 8635712 8409167 8163003 7904854 7642805 7384838
59646G384838k47216k31764k13265j93141j73548j57750j49320j50909j63116
$$ 7384838 7137622 6905858 6692593 6499452 6325904 6168154 6018834 5867925 5704809
59637E704809j83708k07884k30099k46220k54410k54610k47988k36511k22183
$$ 5704809 5521101 5313217 5083118 4836898 4582488 4327878 4079890 3843379 3621196
59628C621196k06182j89108j71788j55208j39686j24912j10971r8587q8105p8859
$$ 3621196 3415014 3225906 3054118 2898910 2759224 2634312 2523341 2424754 2336649 2257790
59618B257790o9956o1180n2923m5706l9998l6026l3359l1121k8888k6919k5371
$$ 2257790 2187834 2126654 2073731 2028025 1988027 1952001 1918642 1887521 1858633 1831714 1806343
59607A806343k3867k2151k0598j9614j9058j8640j8487j8738j9058j8991j8636
$$ 1806343 1782476 1760325 1739727 1720113 1701055 1682415 1663928 1645190 1626132 1607141 1588505
59596A588505j8497j8756j9031j8713j7461j5545j3794j2831j2404j1905j1487
$$ 1588505 1570008 1551252 1532221 1513508 1496047 1480502 1466708 1453877 1441473 1429568 1418081
59585A418081j1927j3241j4335j4365j3590j2459j0748q257n514k973k50K911
$$ 1418081 1406154 1392913 1378578 1364213 1350623 1338164 1327416 1319159 1313645 1310672 1310422 1313333
59573A313333N561O614O554O932Q371J0161J1696J3203J4924J6628J8185J9839
$$ 1313333 1318894 1325508 1332062 1338994 1347365 1357526 1369222 1382425 1397349 1413977 1432162 1452001
59561A452001K1670K3452K5228K7375K9905L2368L4592L6933L9632M2436M5005
$$ 1452001 1473671 1497123 1522351 1549726 1579631 1611999 1646591 1683524 1723156 1765592 1810597
59550A810597M7252M9227N1195N3749N7243O1223O5137O9348P4147P7631P6056
$$ 1810597 1857849 1907076 1958271 2012020 2069263 2130486 2195623 2264971 2339118 2416749 2492805
59539B492805O7437N4045M0495K9838K2177J6243J0958N582m09p028j3808k0383
$$ 2492805 2560242 2614287 2654782 2684620 2706797 2723040 2733998 2739580 2739171 2732143 2718335 2697952
59527B697952k6719l2755l8213m2877m6735m9811n2096n3612n4227n3511n1182
$$ 2697952 2671233 2638478 2600265 2557388 2510653 2460842 2408746 2355134 2300907 2247396 2196214
59516B196214m7691m3881l9950l5245k9227k2204j4764o942J514J0338J8921K7293
$$ 2196214 2148523 2104642 2064692 2029447 2000220 1978016 1963252 1956310 1957824 1968162 1987083 2014376
59504B014376L6279M6392N6967O6787P5227Q2419Q8520R3261R6159R6595R3787
$$ 2014376 2050655 2097047 2154014 2220801 2296028 2378447 2466967 2560228 2656387 2752982 2846769
59493B846769Q7051P6337O2275M5689K7372Q273j0580k8539m5299o0306p2543
$$ 2846769 2933820 3010157 3072432 3118121 3145493 3153766 3143186 3114647 3069348 3009042 2936499
59482B936499q1244q6341q8055q6415q1635p4661o6751n8580m9969m0572l0590
$$ 2936499 2855255 2768914 2680859 2594444 2512809 2438148 2371397 2312817 2262848 2222276 2191686
59471B191686k0883j2348n085J667Q457J4605J8890K1126K2257K2694K1596J8267
$$ 2191686 2170803 2158455 2153370 2155037 2163494 2178099 2196989 2218115 2240372 2263066 2284662 2302929
59459B302929J3280P423M89p830j6639k4711l2165l9893m7606n3888n8136o1068
$$ 2302929 2316209 2323632 2324121 2316291 2299652 2274941 2242776 2202883 2155277 2101389 2043253 1982185
59447A982185o3209o4273o4344o4193o3935o2625n9917n6905n4488n1999m8441
$$ 1982185 1918976 1854703 1790359 1726166 1662231 1599606 1539689 1482784 1428296 1376297 1327856
59436A327856m4239m0624l7958l5617l3116l0386k7372k4220k1528j9516j7360
$$ 1327856 1283617 1242993 1205035 1169418 1136302 1105916 1078544 1054324 1032796 1013280 995920
59425I95920j4210j0508p352m908k456M08L751Q195J4062J9371K0312J4926N565
$$ 995920 981710 971202 963850 958942 956486 956894 960645 968840 982902 1002273 1022585 1037511 1043076
59412A043076l045p763q552p018m573j725J831O574J1924J5616J4981R330Q78
$$ 1043076 1040031 1032268 1023716 1016698 1012125 1010400 1012231 1018805 1030729 1046345 1061326 1070656 1071534
59399A071534o811j1198j1795r596o047k384O78L043N131P507J0556J4239J8077
$$ 1071534 1064723 1053525 1041730 1032134 1026087 1023703 1024381 1027424 1032555 1040062 1050618 1064857 1082934
59386A082934K1376K3779K5687K7998L1184L4737L7721L9910M2055M4940M8410
$$ 1082934 1104310 1128089 1153776 1181774 1212958 1247695 1285416 1325326 1367381 1412321 1460731
59375A460731N1439N3140N3589N3667N4183N5163N6190N7422N9865O4319P0336
$$ 1460731 1512170 1565310 1618899 1672566 1726749 1781912 1838102 1895524 1955389 2019708 2090044
59364B090044P6894Q3968R2650J03538J15837J28404J40971J53709J66234J77782
$$ 2090044 2166938 2250906 2343556 2447094 2562931 2691335 2832306 2986015 3152249 3330031
59354C330031J87921J96206K01433K02218J98343J90693J79886J65862J48934
$$ 3330031 3517952 3714158 3915591 4117809 4316152 4506845 4686731 4852593 5001527
59345E001527J30245J10790R0739P0263N0195L1208J2806o102k5888m6011o5897
$$ 5001527 5131772 5242562 5333301 5403564 5453759 5484967 5497773 5491671 5465783 5419772 5353875
59334E353875q5443j04742j23775j42214j59164j73318j83828j90852j94788j95303
$$ 5353875 5268432 5163690 5039915 4897701 4738537 4565219 4381391 4190539 3995751 3800448
59324C800448j91825j84942j76457j67812j59030j49466j39001j28131j17308
$$ 3800448 3608623 3423681 3247224 3079412 2920382 2770916 2631915 2503784 2386476
59315B386476j06769r6796q7659p9269p1158o2920n4631m6801l9827l3392k6663
$$ 2386476 2279707 2182911 2095252 2015983 1944825 1881905 1827274 1780473 1740646 1707254 1680591
59304A680591j9539j3621j1346j3798j9552k5816l0288l1907l0668k7440k3660
$$ 1680591 1661052 1647431 1636085 1622287 1602735 1576919 1546631 1514724 1484056 1456616 1432956
59293A432956k0337j7323j3989j0465p672o088n172m046k316N2L066O526R784
$$ 1432956 1412619 1395296 1381307 1370842 1363170 1357082 1351910 1347864 1345548 1345600 1348666 1355192 1364976
59280A364976J2208J3896J5633J8106K1138K3788K5229K5514K5334K4937K3662
$$ 1364976 1377184 1391080 1406713 1424819 1445957 1469745 1494974 1520488 1545822 1570759 1594421
59269A594421K0813J6718J2374Q188L647j733p700j3686j9313k4287k8286l1335
$$ 1594421 1615234 1631952 1644326 1652514 1656161 1654428 1646728 1633042 1613729 1589442 1561156 1529821
59257A529821l3933l6425l8550l9886m0342l9949l8530l6104l3296l0912k9238
$$ 1529821 1495888 1459463 1420913 1381027 1340685 1300736 1262206 1226102 1192806 1161894 1132656
59246A132656k8013k6818k5169k2630j9381j6415j4535j3295j1488q681n686l476
$$ 1132656 1104643 1077825 1052656 1030026 1010645 994230 979695 966400 954912 946231 940545 937069
59234I37069k120j001L60J955L493M752N790O896Q331J0104J2045J3956J5638
$$ 937069 934949 933948 934308 936263 939756 944508 950298 957194 965525 975629 987674 1001630 1017268
59221A017268J7008J8289J9857K1795K3902K6254K9308L3135L7092M0795M4901
$$ 1017268 1034276 1052565 1072422 1094217 1118119 1144373 1173681 1206816 1243908 1284703 1329604
59210A329604N0255N6609O3004O9212P6018Q3993R2735J01392J09351J16285J22138
$$ 1329604 1379859 1436468 1499472 1568684 1644702 1728695 1821430 1922822 2032173 2148458 2270596
59199B270596J27037J30697J31820J28817J21163J09482R4276P5385N2960K8152
$$ 2270596 2397633 2528330 2660150 2788967 2910130 3019612 3113888 3189273 3242233 3270385
59189C270385K446k3094m7567o9853q9047j04799j16837j24616j27876j27186
$$ 3270385 3272831 3249737 3202170 3132317 3043270 2938471 2821634 2697018 2569142 2441956
59179B441956j23576j17893j10797j02887r4453q5484p6178o7120n8611n0384
$$ 2441956 2318380 2200487 2089690 1986803 1892350 1806866 1730688 1663568 1604957 1554573
59169A554573m2306l4891k8611k3200j8176j3593r750o505l561j181N1K4p68j822
$$ 1554573 1512267 1477376 1448765 1425565 1407389 1393796 1384046 1377541 1373980 1372799 1372850 1372874 1372106 1370284
59155A370284k975m413o677j0272j4737j8543k0549k1279k2066k3230k3949k3753
$$ 1370284 1367309 1362896 1356219 1345947 1331210 1312667 1292118 1270839 1248773 1225543 1201594 1177841
59143A177841k3125k2507k1603k0087j8322j6884j5713j4243j2146r702p488n814
$$ 1177841 1154716 1132209 1110606 1090519 1072197 1055313 1039600 1025357 1013211 1003509 996021 990207
59131I90207m471l033j496l94q0j36J32Q24J536K103K680L211L415L393L587M017
$$ 990207 985736 982703 981207 980813 980733 980597 980729 981553 983089 985192 987872 991083 994498 997891 1001478 1005495
59115A005495M166L768L261L182L587M183M570M247K981J445Q17J369K042J847
$$ 1005495 1009661 1013429 1016690 1019872 1023459 1027642 1032212 1036459 1039440 1040885 1041702 1043071 1045113 1046960
59101A046960J184J083J639K026J820J459J401J635K248L700O132Q812J0793J1926
$$ 1046960 1048144 1049227 1050866 1052892 1054712 1056171 1057572 1059207 1061455 1065155 1071287 1080099 1090892 1102818
59087A102818J2740J3600J4393J5127J6217J7846J9323J9572J8328J6524J5278
$$ 1102818 1115558 1129158 1143551 1158678 1174895 1192741 1212064 1231636 1249964 1266488 1281766
59076A281766J4764J4319J3393J1925R807O654K388k269o390r783j2973j6363
$$ 1281766 1296530 1310849 1324242 1336167 1345974 1352628 1355016 1352747 1346357 1336574 1323601 1307238
59064A307238j9697k2459k4414k5631k6182k6034k5229k4038k2923k2220k1843
$$ 1307238 1287541 1265082 1240668 1215037 1188855 1162821 1137592 1113554 1090631 1068411 1046568
59053A046568k1364k0536j9619j8944j8306j7244j5857j4877j4681j4678j4099
$$ 1046568 1025204 1004668 985049 966105 947799 930555 914698 899821 885140 870462 856363
59042H56363j3061j2301j2029j1636j0577r036p551o459n833n537n119m098k637
$$ 856363 843302 831001 818972 807336 796759 787723 780172 773713 767880 762343 757224 753126 750489
59029G50489j591j484j834j824j350r07p39o63n71n71n86l49J89P73J207J428
$$ 750489 748898 747414 745580 743756 742406 741499 740760 740097 739526 738955 738369 738020 738209 738982 740189 741617
59013G41617J326R26O74J061J878K404K346K127K191K546L144M045N043N670N870
$$ 741617 742943 743869 744543 745604 747482 749886 752232 754359 756550 759096 762240 766285 771328 776998 782868
58998G82868O171O951Q056R354J0962J2647J3757J4262J5155J7140J9551K1429
$$ 782868 789039 795990 804046 813400 824362 837009 850766 865028 880183 897323 916874 938303
58986I38303K3050K5306K7925K9511K9381K8281K7027K5410K2908J9573J5738
$$ 938303 961353 986659 1014584 1044095 1073476 1101757 1128784 1154194 1177102 1196675 1212413
58975A212413J1375O472J620k412n572q523j1739j4954j7460j8749j8838j8199
$$ 1212413 1223788 1230260 1231880 1229468 1223896 1215373 1203634 1188680 1171220 1152471 1133633 1115434
58963A115434j7424j6823j6234j5255j3719j1932j0375r112p657n681l770k952
$$ 1115434 1098010 1081187 1064953 1049698 1035979 1024047 1013672 1004560 996903 991222 987452 984500
58951I84500l378l944l645k772k187j827p65J272L389M751N559O460P528Q422
$$ 984500 981122 977178 973533 970761 968574 966747 965982 967254 970643 975394 980953 987413 994941 1003363
58937A003363R105R935J1102J2438J3707J4822J5905J7285J9272K1726K4056K5923
$$ 1003363 1012468 1022403 1033505 1045943 1059650 1074472 1090377 1107662 1126934 1148660 1172716 1198639
58925A198639K7742L0169L3308L6789M0527M4838M9756N4564N8249O0093N9748
$$ 1198639 1226381 1256550 1289858 1326647 1367174 1412012 1461768 1516332 1574581 1634674 1694422
58914A694422N7047N2179M5951L9575L4044K9846K7208K6420K7733L1021L5612
$$ 1694422 1751469 1803648 1849599 1889174 1923218 1953064 1980272 2006692 2034425 2065446 2101058
58903B101058M0560M5140M9307N3652N8764O4596P0589P6427Q2374Q8687R5082
$$ 2101058 2141618 2186758 2236065 2289717 2348481 2413077 2483666 2560093 2642467 2731154 2826236
58892B826236J01201J07350J14082J20973J26446J29156J29039J26639J21783
$$ 2826236 2927437 3034787 3148869 3269842 3396288 3525444 3654483 3781122 3902905
58883C902905J13681J02244Q8661P4501O0664M7394L4853K3156J1937M10j1862
$$ 3902905 4016586 4118830 4207491 4281992 4342656 4390050 4424903 4448059 4459996 4460406 4448544
58872D448544k4467l6628m8032n8941o9500p9314q7912r5241j01415j06205j09283
$$ 4448544 4424077 4387449 4339417 4280476 4210976 4131662 4043750 3948509 3847094 3740889 3631606
58861C631606j10829j11456j11458j10620j08819j06393j03724j00887r7822r4484
$$ 3631606 3520777 3409321 3297863 3187243 3078424 2972031 2868307 2767420 2669598 2575114
58851B575114r0668q6144q1228p6727p2996o9443o5357o0771n6147n1617m7110
$$ 2575114 2484446 2398302 2317074 2240347 2167351 2097908 2032551 1971780 1915633 1864016 1816906
58840A816906m2849l9077l5533l1822k8138k5009k2360j9530j6277j3131j0608
$$ 1816906 1774057 1734980 1699447 1667625 1639487 1614478 1592118 1572588 1556311 1543180 1532572
58829A532572q510o264l568m95K634N390P495R171J0986J3209J5585J7732J9541
$$ 1532572 1524062 1517798 1514230 1513735 1516369 1521759 1529254 1538425 1549411 1562620 1578205 1595937 1615478
58816A615478K1034K2203K3091K3771K4143K4056K3809K4177K5665K7939L0360
$$ 1615478 1636512 1658715 1681806 1705577 1729720 1753776 1777585 1801762 1827427 1855366 1885726
58805A885726L2892L6102M0259M4855M9279N3638N8545O4174O9980P5501Q0956
$$ 1885726 1918618 1954720 1994979 2039834 2089113 2142751 2201296 2265470 2335450 2410951 2491907
58794B491907Q6754R2692R8175J03029J07487J11422J14216J15547J15692J14762
$$ 2491907 2578661 2671353 2769528 2872557 2980044 3091466 3205682 3321229 3436921 3551683
58784C551683J12261J07789J01618R4102Q4897P3484O0076M5283K9013J0475j0480
$$ 3551683 3663944 3771733 3873351 3967453 4052350 4125834 4185910 4231193 4260206 4270681 4260201
58773D260201l2400n3002p0673q5287r7627j08152j16423j21846j24720j26019
$$ 4260201 4227801 4174799 4104126 4018839 3921212 3813060 3696637 3574791 3450071 3324052
58763C324052j26166j24740j21641j17780j14064j10352j06049j01232r6346r1283
$$ 3324052 3197886 3073146 2951505 2833725 2719661 2609309 2503260 2402028 2305682 2214399
58753B214399q5659p9793p4494o9925o5487o0788n6045n1521m7279m3470m0181
$$ 2214399 2128740 2048947 1974453 1904528 1839041 1778253 1722208 1670687 1623408 1579938 1539757
58742A539757l6999l3418k9728k6735k4588k2678k0749j9237j8279j7214j5526
$$ 1539757 1502758 1469340 1439612 1412877 1388289 1365611 1344862 1325625 1307346 1290132 1274606
58731A274606j3563j1864j0327q537o374l821n72L592Q262J2597J5964J8040J8516
$$ 1274606 1261043 1249179 1238852 1230315 1223941 1220120 1219548 1223140 1231402 1243999 1259963 1278003 1296519
58718A296519J6932J2838O060k954j2936k2206k9502l4457l7459l9214m0319m0875
$$ 1296519 1313451 1326289 1332349 1329395 1316459 1294253 1264751 1230294 1192835 1153621 1113302 1072427
58706A072427m0494l8950l6679l4260l1634k8372k4574k0853j7427j3895j0092
$$ 1072427 1031933 992983 956304 922044 890410 862038 837464 816611 799184 785289 775197
58695G75197o524l570q20K436O255R875J2293J2823J1330Q105L474k321q769j4786
$$ 775197 768673 765103 764283 766719 772974 782849 795142 807965 819295 827400 830874 828553 819784 804998
58681H04998j9222k1623k2251k1497j9649j7089j4246j1325q384n466k421J062
$$ 804998 785776 764153 741902 720405 700756 683667 669421 658096 649712 644246 641825 642887
58669F42887M779P798R523J0507J1445J1709R952N971J028l641p608j0581j2215
$$ 642887 647666 655464 664987 675494 686939 698648 708600 714571 715599 711958 704350 693769 681554
58656F81554j2842j3357j3866j3337j1110q046n714m922n432o495p367p742p931
$$ 681554 668712 655355 641489 628152 617042 608996 603282 598360 592928 586433 579066 571324 563393
58643E63393q230q236p380o002m987m407l501k088r30m55j81K87P78J356K434
$$ 563393 555163 546927 539547 533545 528558 524151 520650 518562 517632 517177 516996 517283 518061 519417 521851
58628E21851L617L677K376J163J310K339L110L426L636L654L492L914N415P094
$$ 521851 525468 529145 531521 532684 533994 536333 539443 542869 546505 550159 553651 557565 562980 570074
58614E70074P763P661P962Q952R824J0105J0227J0676J1468J2534J3874J5309
$$ 570074 577837 585498 593460 602412 612236 622341 632568 643244 654712 667246 681120 696429
58602F96429J6625J7978J9664K1568K3235K4459K5508K6857K8823L1272L3516
$$ 696429 713054 731032 750696 772264 795499 819958 845466 872323 901146 932418 965934
58591I65934L4868L5311L5269L4674L2989L0243K7180K4146K0584J6091J1068
$$ 965934 1000802 1036113 1071382 1106056 1139045 1169288 1196468 1220614 1241198 1257289 1268357
58580A268357N932N29n080j0107j3936j6786j8906k0004k0119k0167k0757k1267
$$ 1268357 1274289 1274818 1269738 1259631 1245695 1228909 1210003 1189999 1169880 1149713 1128956 1107689
58568A107689k0926j9969j8974j7855j6509j5578j5490j5497j4776j3792j3422
$$ 1107689 1086763 1066794 1047820 1029965 1013456 997878 982388 966891 952115 938323 924901
58557I24901j3383j2794j1777j1140j0968j0823j0954j2002j3658j4886j5354
$$ 924901 911518 898724 886947 875807 864839 854016 843062 831060 817402 802516 787162
58546G87162j5529j5519j5046j4351j3910j3264j1445q599o095m777m224l941
$$ 787162 771633 756114 741068 726717 712807 699543 688098 679499 673404 668627 664403 660462
58534F60462m207n425p388r543j1395j2506j2642j2083j1361j0757j0394j0408
$$ 660462 656255 650830 643442 633899 622504 609998 597356 585273 573912 563155 552761 542353
58522E42353j0514r836p965n782m437l925l542l281l582m061l714k387r20J45
$$ 542353 531839 522003 514038 508256 503819 499894 496352 493071 489489 485428 481714 479327 478407 478552
58508D78552R43J457J405J030J049J676K559L639N101O506P061O806O543O533
$$ 478552 479495 480952 482357 483387 484436 486112 488671 492310 497411 503917 510978 517784 524327 530860
58494E30860O298N826N788O272O315N125L057J080o9j54M25O83Nj013j440j511
$$ 530860 537158 542984 548772 555044 561359 566484 569541 570621 570552 570398 570823 571506 571511 570498 569058 567547
58478E67547k190l356l773l055k304k440k983l163l104l213l254k883k444k497
$$ 567547 565357 562001 558228 555173 552869 550429 547446 544283 541179 537966 534712 531829 529385 526888
58464E26888k871k936k487j964j839k227k944l697m267m523m291l424k208j302
$$ 526888 524017 521081 518594 516630 514791 512564 509620 505923 501656 497133 492842 489418 487210 485908
58450D85908r22m92M91J637K252K285K059J556P72L15P28J519J806J663J850K436
$$ 485908 484986 484494 484985 486622 488874 491159 493218 494774 495546 495861 496589 498108 499914 501577 503427 505863
58434E05863K736K504K129J790J329J010J409K486L602M368M799M793M309L796
$$ 505863 508599 511103 513232 515022 516351 517361 518770 521256 524858 529226 534025 538818 543127 546923
58420E46923L602L331K630K125K401K695J982R45J126K382K957K247J659K333
$$ 546923 550525 553856 556486 558611 561012 563707 565689 566634 567760 570142 573099 575346 577005 579338
58406E79338L571M138L823L120K492K397L100M000M136L545L154L252L168K601
$$ 579338 582909 587047 590870 593990 596482 598879 601979 605979 610115 613660 616814 620066 623234 625835
58392F25835K029J645J106N48O13J299K020K956M913P615R586J0138J0070J0055
$$ 625835 627864 629509 630615 631163 631776 633075 635095 638051 642964 650579 660165 670303 680373 690428
58378F90428R730Q888Q101P579O779N703N258N682N922N263M382M091M198M292
$$ 690428 700158 709046 717147 724726 731505 737208 742466 748148 754070 759333 763715 767806 772004 776296
58364G76296M547N063N417N514N854O488O704O227N748N734N873O006O570P627
$$ 776296 780843 785906 791323 796837 802691 809179 815883 822110 827858 833592 839465 845471 852041 859668
58350H59668Q567R143R725J0312J0457J0334J0567J0825J0079Q498P497P603P948
$$ 859668 868235 877378 887103 897415 907872 918206 928773 939598 949677 958175 965672 973275 981223
58337I81223Q151Q863R932J0095R223Q909R949J1042J1090J0882J1402J2131J2383
$$ 981223 989374 998237 1008169 1018264 1027487 1036396 1046345 1057387 1068477 1079359 1090761 1102892 1115275
58324A115275J2667J3436J4000J3959J4301J5734J7303J7972J8243J8926J9573
$$ 1115275 1127942 1141378 1155378 1169337 1183638 1199372 1216675 1234647 1252890 1271816 1291389
58313A291389J9580J9565K0242K0986K0889K0341K0268K0644K0923K1049K1053
$$ 1291389 1310969 1330534 1350776 1371762 1392651 1412992 1433260 1453904 1474827 1495876 1516929
58302A516929K0531J9451J8637J8555J8618J8374J8319J8810J9316J9552K0096
$$ 1516929 1537460 1556911 1575548 1594103 1612721 1631095 1649414 1668224 1687540 1707092 1727188
58291A727188K1207K2215K2780K3454K4437K5151K5634K6749K8510K9922L1048
$$ 1727188 1748395 1770610 1793390 1816844 1841281 1866432 1892066 1918815 1947325 1977247 2008295
58280B008295L3217L6405L8582L8708L8352L9237M1145M3410M6277M9510N1719
$$ 2008295 2041512 2077917 2116499 2155207 2193559 2232796 2273941 2317351 2363628 2413138 2464857
58269B464857N2536N3559N5764N7927N8941N9650O0915O1936O2074O2442O4106
$$ 2464857 2517393 2570952 2626716 2684643 2743584 2803234 2864149 2926085 2988159 3050601 3114707
58258C114707O6543O9206P2669P6941Q0658Q3304Q6239R0270R4474R8432J03241
$$ 3114707 3181250 3250456 3323125 3400066 3480724 3564028 3650267 3740537 3835011 3933443 4036684
58247D036684J09087J14507J19250J25021J32238J39154J45419J53157J62997
$$ 4036684 4145771 4260278 4379528 4504549 4636787 4775941 4921360 5074517 5237514
58238E237514J72665J81257J91093K03490K16589K29377K43748K60310K76642
$$ 5237514 5410179 5591436 5782529 5986019 6202608 6431985 6675733 6936043 7212685
58229G212685K92119L09922L31508L53978L75955M00960M31530M65125M99734
$$ 7212685 7504804 7814726 8146234 8500212 8876167 9277127 9708657 10173782 10673516
58220A0673516N38201N82960O31896O83912P43143Q13027Q91872R79023J079219
$$ 10673516 11211717 11794677 12426573 13110485 13853628 14666655 15558527 16537550 17616769
58211A7616769J195632J325085J465916J624103J806703K017480K265577K569679
$$ 17616769 18812401 20137486 21603402 23227505 25034208 27051688 29317265 31886944
58203C1886944K946579L405257L959431M633328N444272O392172P478810Q726078
$$ 31886944 34833523 38238780 42198211 46831539 52275811 58667983 66146793 74872871
58195G4872871J0165887J1832762J3783146J6096676J8827409K1959942K5395437
$$ 74872871 85038758 96871520 110654666 126751342 145578751 167538693 192934130
58188A92934130K8856206L1654872L2586556L0311230K4155471J4709906L666328
$$ 192934130 221790336 253445208 286031764 316342994 340498465 355208371 358874699
58181C58874699o979377j5720265k1861057k5406393k6787281k6599315k5404425
$$ 358874699 351895322 336175057 314314000 288907607 262120326 235521011 210116586
58174B10116586k3629322k1564770j9406122j7277664j5247043j3352021j1622482
$$ 210116586 186487264 164922494 145516372 128238708 112991665 99639644 88017162
58167H8017162j0077410q716496p529440o508056n641291m907195m281022l746927
$$ 88017162 77939752 69223256 61693816 55185760 49544469 44637274 40356252 36609325
58159C6609325l294504k909947k578844k292991k047004j832230j640468j469793
$$ 36609325 33314821 30404874 27826030 25533039 23486035 21653805 20013337 18543544
58151A8543544j320573j189196j071054r65886q74588p94009p20148o53719n97627
$$ 18543544 17222971 16033775 14962721 13996835 13122247 12328238 11608090 10954371 10356744
58142A0356744n51344n11923m77861m48037m19540l90522l62840l38496l16107
$$ 10356744 9805400 9293477 8815616 8367579 7948039 7557517 7194677 6856181 6540074
58133F540074k93997k73653k56632k41072k24907k09690j97545j87078j76027
$$ 6540074 6246077 5972424 5715792 5474720 5249813 5040123 4842578 4655500 4479473
58124D479473j65418j57242j50385j42650j34732j28422j22802j15972j08808
$$ 4479473 4314055 4156813 4006428 3863778 3729046 3600624 3477822 3361850 3253042
58115C253042j03407r9302r4729r0142q7046q4650q1086p6889p3956p2021o9303
$$ 3253042 3149635 3050333 2955604 2865462 2778416 2693766 2612680 2535791 2461835 2389814 2320511
58104B320511o5868o3204o1179n8201n4055m9874m5858m1468l7338l4733l3480
$$ 2320511 2254643 2191439 2130260 2072059 2018004 1968130 1922272 1880804 1843466 1808733 1775253
58093A775253l2515l1842l1934l1954l0779k9159k8773k9590l0139k9893k9560
$$ 1775253 1742738 1710896 1678962 1647008 1616229 1587070 1558297 1528707 1498568 1468675 1439115
58082A439115k9469k9363k9313k9372k8886k7548k6266k5751k5216k3989k3069
$$ 1439115 1409646 1380283 1350970 1321598 1292712 1265164 1238898 1213147 1187931 1163942 1140873
58071A140873k3402k3818k2647k0429j8895j8201j7258j6033j5379j5105j4274
$$ 1140873 1117471 1093653 1071006 1050577 1031682 1013481 996223 980190 964811 949706 935432
58060I35432j3151j2919j3679j4355j4403j4124j3686j3150j3001j3385j3427
$$ 935432 922281 909362 895683 881328 866925 852801 839115 825965 812964 799579 786152
58049G86152j2566j1767j2003j2438j1750j0335r430q892p848o829p076q130q229
$$ 786152 773586 761819 749816 737378 725628 715293 705863 696971 689123 682294 675218 667088 658859
58036F58859p038o010n987o246o182o240o810p521p936p994p684p158o990p406
$$ 658859 651821 645811 639824 633578 627396 621156 614346 606825 598889 590895 583211 576053 569063 561657
58022E61657p610o875n821n491n648n267m306l646l540l391k911k333j711j045
$$ 561657 554047 547172 541351 535860 530212 524945 520639 516993 513453 510062 507151 504818 503107 502062
58008E02062p87j090j076M7J587K309K255K419L073L822M892O817R200J1174J2847
$$ 502062 501275 500185 499109 499156 500743 503052 505307 507726 510799 514621 519513 526330 535530 546704 559551
57993E59551J4914J7191J8938K0338K2078K3707K4038K3143K2396K2476K2832
$$ 559551 574465 591656 610594 630932 653010 676717 700755 723898 746294 768770 791602
57982G91602K3208K4073K5346K6159K6295K6571K7353K7806K7024K4884K1520
$$ 791602 814810 838883 864229 890388 916683 943254 970607 998413 1025437 1050321 1071841
57971A071841J6871J1047M409k889j0699j8337k4981l0490l4966l7881l8719l8169
$$ 1071841 1088712 1099759 1104168 1101279 1090580 1072243 1047262 1016772 981806 943925 905206 867037
57959H67037l7411l6396l4178l0912k7987k6034k4218k1786j9063j6432j3640
$$ 867037 829626 793230 759052 728140 700153 674119 649901 628115 609052 592620 578980
57948E78980j0624p977n968m036j817J48J207J464J456J564J939K420K344J194
$$ 578980 568356 560379 554411 550375 548558 548706 549913 551377 552833 554397 556336 558756 561100 562294
57934E62294m71j490j642j896k933m249m978m818l807j972M12K793M935P051R134
$$ 562294 561823 560333 558691 556795 553862 549613 544635 539817 536010 534038 534450 537243 542178 549229 558363
57919E58363J0790J1895J2845J3854J4394J3639J1147P110K239k645p217j1683
$$ 558363 569153 581048 593893 607747 622141 635780 646927 654037 656276 653631 646414 634731
57907F34731j5870j8833j9979k0080k0281k0432j9439j7133j4665j2967j1877
$$ 634731 618861 600028 580049 559969 539688 519256 499817 482684 468019 455052 443175
57896D43175j0983j0397j0312j0466j0389r844q937q153q110q721q943q000o540
$$ 443175 432192 421795 411483 401017 390628 380784 371847 363694 355584 346863 337920 329920 323380
57883C23380n771n749n517m698l889l501l284l067k935k637j711l57P55J562K565
$$ 323380 317609 311860 306343 301645 297756 294255 290971 287904 284969 282332 280621 280264 281019 282581 285146
57868B85146L652M091L889M003M899N809N871N182M305L448K519J441J49j262
$$ 285146 288798 292889 296778 300781 305680 311489 317360 322542 326847 330295 332814 334255 334404 333142
57854C33142k302k633k693l124l685l690l260l104l132k573j575j359k363l411
$$ 333142 330840 328207 325514 322390 318705 315015 311755 308651 305519 302946 301371 300012 297649 294238
57840B94238l250j950l65Q73J399J140P75J269K505L290L021K419K182J989J438
$$ 294238 290988 289038 288673 289546 290945 292085 292860 294129 296634 299924 302945 305364 307546 309535 310973
57825C10973R30R04J058J064J262J967K774L121K898K015K01k137l704l659k549
$$ 310973 311903 312807 313865 314929 316191 318158 320932 324053 326951 328966 329167 327030 323326 319667 317118
57810C17118j293k6J445K849L991N329P275R441J1350J3221J5319J7114J8107
$$ 317118 315825 315799 317244 320093 324084 329413 336688 346129 357479 370700 386019 403133 421240
57797D21240J8811J9946K1006K0663J8413J4942J1052O972K704j681o054j0021
$$ 421240 440051 459997 481003 501666 520079 535021 546073 553045 555749 554068 548014 537993
57785E37993j2868j4280j4882j5563j6406j6868j6776j6538j6440j6349j6133
$$ 537993 525125 510845 495963 480400 463994 447126 430350 413812 397372 381023 364890
57774C64890j5896j5730j5521j5118j4446j3553j2600j1659j0524q969p308o151
$$ 364890 348994 333264 317743 302625 288179 274626 262026 250367 239843 230874 223566 217415
57762B17415n507m653l236j926j497j728j781j293n67Q9O01R22J013J056J337
$$ 217415 211908 207255 204019 202093 200596 198868 197087 195794 195227 195316 195917 196839 197852 198908 200245
57747B00245J904K510K804K521J766J159J291J979K440K298J936J709J481J216
$$ 200245 202149 204659 207463 209984 211750 212909 214200 216179 218619 220917 222853 224562 226043 227259
57733B27259J341K112L100L719L864L652L126K547K363K474K114R61k38p16p46
$$ 227259 228600 230712 233812 237531 241395 245047 248173 250720 253083 255557 257671 258632 258394 257678 256932
57718B56932r85j360j406j202j174j273j185j085j343j680j413n79P0J99L53J078
$$ 256932 255947 254587 253181 251979 250805 249532 248347 247262 245919 244239 242826 242247 242317 242516 242869 243947
57702B43947K138K892L079K998L103L459L665L380K900K924L616M406M919N551
$$ 243947 246085 248977 252056 255054 258157 261616 265281 268661 271561 274485 278101 282507 287426 292977
57688B92977O790Q398R764J0695J1363J1921J2630J3991J6159J8589K0840K3320
$$ 292977 299767 308165 317929 328624 339987 351908 364538 378529 394688 413277 434117 457437
57676D57437K6620L0483L4272L8280M3738N1392O0782P1164Q2666R5989J10605
$$ 457437 484057 514540 548812 587092 630830 682222 743004 814168 896834 992823 1103428
57665A103428J22852J26087J14112Q5917M7435Q278k3603m4721n5562n8933n8395
$$ 1103428 1226280 1352367 1466479 1552396 1599831 1608109 1584506 1539785 1484223 1425290 1366895
57654A366895n6676n4739n2505n0223m8515m7358m6000m4005m1692l9472l7447
$$ 1366895 1310219 1255480 1202975 1152752 1104237 1056879 1010879 966874 925182 885710 848263
57643H48263l5681l4214l2665l0496k7787k5188k3001k0896j8664j6535j4530
$$ 848263 812582 778368 745703 715207 687420 662232 639231 618335 599671 583136 568606
57632E68606j2296r864p944o956o329n302m009l168k925k590j525K10K143L949
$$ 568606 556310 546446 538502 531546 525217 519915 515906 512738 509813 507223 505698 505908 508051 512000
57618E12000N587P075Q415R666J0927J2230J3553J5067J7070J9562K1892K3310
$$ 512000 517587 524662 533077 542743 553670 565900 579453 594520 611590 631152 653044 676354
57606F76354K3788K3984K4361K4738K4804K4504K3711K2048J9378J6072J2395
$$ 676354 700142 724126 748487 773225 798029 822533 846244 868292 887670 903742 916137
57595I16137Q106L117j952o420j0418j4460j8480k1921k4587k6678k8149k8717
$$ 916137 924243 927360 925408 918988 908570 894110 875630 853709 829122 802444 774295 745578
57583G45578k8489k8034k7771k7712k7627k7099k5683k3535k1609k0587j9875
$$ 745578 717089 689055 661284 633572 605945 578846 553163 529628 508019 487432 467557
57572D67557j8460j6452j4881j4123j3513j2634j1879j1439j0707r202p429o319
$$ 467557 449097 432645 417764 403641 390128 377494 365615 354176 343469 334267 326838 320519
57560C20519o231o840p486p396o139m258k928k670k785k351j290j82M69M37k23
$$ 320519 314288 307448 299962 292566 286427 282169 279241 276571 273786 271435 270145 269963 270432 270869 270646
57545B70646j026j269p40R6P46J137J257J031P73J102K013K703K793L040M175
$$ 270646 269620 268351 267611 267707 268453 269590 270847 271878 272651 273753 275766 278469 281262 284302 288477
57530B88477N639O342O249O348P221Q517R799J1067J2321J3276J3751J3959J4188
$$ 288477 294116 300458 306707 313055 320276 328793 338592 349659 361980 375256 389007 402966 417154
57517D17154J4578J5220J6150J7185J8050J8773J9649K0747K1689K2023K1610
$$ 417154 431732 446952 463102 480287 498337 517110 536759 557506 579195 601218 622828
57506F22828K0639J9387J7938J5949J2899Q775M345M15l020o527j0191j3389j5667
$$ 622828 643467 662854 680792 696741 709640 718415 722760 723175 720155 713628 703437 690048 674381
57493F74381j7318j8867k0343k1381k1795k1675k1066j9858j8165j6550j5690
$$ 674381 657063 638196 617853 596472 574677 553002 531936 512078 493913 477363 461673
57482D61673j5688j5797j5002j2993j0479q415p137o331n675n083m476l687k716
$$ 461673 445985 430188 415186 402193 391714 383299 376162 369831 364156 359073 354597 350910 348194
57469C48194j764q78J18J263K288L012L627M465N669P228R096J1086J2803J3943
$$ 348194 346430 345552 345670 346933 349221 352233 355860 360325 365994 373222 382318 393404 406207 420150
57455D20150J4519J4733J4791J4999J5749J7049J8331J8999J9029J8687J7883
$$ 420150 434669 449402 464193 479192 494941 511990 530321 549320 568349 587036 604919
57444F04919J6311J4071J1607R020O001K532r23m129p410j0936j4218j6720j8528
$$ 604919 621230 635301 646908 655928 661929 664461 663538 659409 651999 641063 626845 610125 591597
57431E91597k0032k1290k2195k2888k3450k3489k2623k1125j9546j7981j6378
$$ 591597 571565 550275 528080 505192 481742 458253 435630 414505 394959 376978 360600
57420C60600j5244j5123j5488j5112j3670j2048j0902r887q739q049q252q633
$$ 360600 345356 330233 314745 299633 285963 273915 263013 253126 244387 236338 228086 219453
57408B19453q231p210o436o130n799n294m965m838m394l365k157j377j377k179
$$ 219453 211222 204012 197576 191446 185647 180353 175388 170550 166156 162791 160634 159257 157880 155701
57394A55701l320l854l158j849j186j473j774j376q29r64j558j686j103n14n04
$$ 155701 152381 148527 145369 143520 142334 140861 139087 137711 136882 135918 134360 132674 131571 131057 130553
57379A30553p66o46K2Q10J269J290R77M72j02n71q60j127j641k397k959k791j773
$$ 130553 129787 129141 129163 129973 131242 132532 133509 133981 133879 133308 132448 131321 129680 127283 124324 121533 119760
57362A19760m09M59K71p22j559j441n32K79M34K20J75M29Q48J388J923K069J666
$$ 119760 119351 119810 120081 119359 117800 116359 115827 116106 116540 116760 116935 117364 118212 119600 121523 123592 125258
57345A25258J179J133J307J075L82k20m75p13j134j391j168o71k44Q3L04J68l84
$$ 125258 126437 127570 128877 129952 130334 130114 129639 128926 127792 126401 125233 124562 124318 124401 124705 124873 124489
57328A24489p86l92O08J346J323Q90O09N25M16L96Q57J738K344K108J350Q88J045
$$ 124489 123703 123311 123919 125265 126588 127478 128087 128612 129028 129424 130281 132019 134363 136471 137821 138709 139754
57311A39754J349J327J150J351K053K830L213L092K712K415K440K784L301L907
$$ 139754 141103 142430 143580 144931 146984 149814 153027 156119 158831 161246 163686 166470 169771 173678
57297A73678M585N226N660N889O064O159N996N697N732O252O674O337N318M271
$$ 173678 178263 183489 189149 195038 201102 207261 213257 218954 224686 230938 237612 243949 249267 253538
57283B53538L637L334L066K557J580Q3j692l400m774n553n561n102m925n431o170
$$ 253538 257175 260509 263575 266132 267712 267795 266103 262703 257929 252376 246815 241713 236788 231357 225187
57268B25187o509o437o321o196n863n394m898m131k970k059k163k978l404k992
$$ 225187 218678 212241 205920 199724 193861 188467 183569 179438 176468 174409 172246 169268 165864 162872
57254A62872k333j934j579r77l32J40O03J139J416J221Q61P37Q56J063J326J566
$$ 162872 160539 158605 157026 156049 155717 155857 156460 157599 159015 160236 161097 161834 162690 163753 165079 166645
57238A66645J567J340J243J477J735J632J216R06J112J953L067L693L363K440
$$ 166645 168212 169552 170795 172272 174007 175639 176855 177761 178873 180826 183893 187586 190949 193389
57224A93389J651J138N55k9o4N63J323J912K529L076K979K191J580J770K325K583
$$ 193389 195040 196178 196733 196704 196640 197203 198526 200438 202967 206043 209022 211213 212793 214563 216888 219471
57208B19471K577K538K192J398Q55J308K477L554M367N184N769N592M887M580
$$ 219471 222048 224586 226778 228176 229031 230339 232816 236370 240737 245921 251690 257282 262169 266749
57194B66749N108N993O703P220P653P896P907P873P930P939P697P214O747O696
$$ 266749 271857 277850 284553 291773 299426 307322 315229 323102 331032 338971 346668 353882 360629 367325
57180C67325P240P973Q210P807P332P190P106O753O312N937N327M487M244N177
$$ 367325 374565 382538 390748 398555 405887 413077 420183 426936 433248 439185 444512 448999 453243 458420
57166D58420O569P373P838Q972J0768J2154J2743J3278J4209J5023J5447J6185
$$ 458420 464989 472362 480200 489172 499940 512094 524837 538115 552324 567347 582794 598979
57154E98979J7837J9886K1436K2273K2690K2888K3072K3614K4533K5297K5573
$$ 598979 616816 636702 658138 680411 703101 725989 749061 772675 797208 822505 848078
57143H48078K5712K6074K6439K6590K6920K7840K9060L0080L1079L2644L4829
$$ 848078 873790 899864 926303 952893 979813 1007653 1036713 1066793 1097872 1130516 1165345
57132A165345L7134L9257M1332M3540M5968M8739N1874N5094N8217O1557O5495
$$ 1165345 1202479 1241736 1283068 1326608 1372576 1421315 1473189 1528283 1586500 1648057 1713552
57121A713552O9814P3857P7301Q0402Q3636Q7505R2563R9098J06835J15430J25170
$$ 1713552 1783366 1857223 1934524 2014926 2098562 2186067 2278630 2377728 2484563 2599993 2725163
57110B725163J36778J50495J65851J82539K01162K22964K49034K79934L16057
$$ 2725163 2861941 3012436 3178287 3360826 3561988 3784952 4033986 4313920 4629977
57101D629977L58391M08884M69865N42866O28361P26729Q38809R64729J102366
$$ 4629977 4988368 5397252 5867117 6409983 7038344 7765073 8603882 9568611 10670977
57092A0670977J247715J396624J545374J689263J821336J932681K013595K054416
$$ 10670977 11918692 13315316 14860690 16549953 18371289 20303970 22317565 24371981
57084B4371981K046387J983052J861627J683513J454112J182056Q77965N53250
$$ 24371981 26418368 28401420 30263047 31946560 33400672 34582728 35460693 36013943
57076C6013943K19849j09637m22954p10237r65196j184635j367790j516297j633320
$$ 36013943 36233792 36124155 35701201 34990964 34025768 32841133 31473343 29957046 28323726
57067B8323726j721121j779209j805518j799176j761866j697144j609674j505192
$$ 28323726 26602605 24823396 23017878 21218702 19456836 17759692 16150018 14644826
57059A4644826j390070j270225j150491j034880r26593q27421p37608o56760n84696
$$ 14644826 13254756 11984531 10834040 9799160 8872567 8045146 7307538 6650778 6066082
57050F066082n21263m65720m16706l72919l33649k98725k67942k40654k15951
$$ 6066082 5544819 5079099 4662393 4289474 3955825 3657100 3389158 3148504 2932553
57041B932553j93256j72448j53358j35540j18756j03200q8791p4618n9519m2625
$$ 2932553 2739297 2566849 2413491 2277951 2159195 2055995 1967204 1892586 1833067 1790442
57031A790442k3138j110J9727L0786K3547k508l7729o9259q9654r8868j00151
$$ 1790442 1767304 1766194 1785921 1816707 1840254 1837746 1800017 1730758 1641104 1542236 1442085
57020A442085r6457r0057q2889p5970o9215o2358n5586m9256m3650l9074l5526
$$ 1442085 1345628 1255571 1172682 1096712 1027497 965139 909553 860297 816647 777573 742047
57009G42047l2244k8359k4159k1025j9839j9997k0215j9739j8539j6936j5378
$$ 742047 709803 681444 657285 636260 616421 596424 576209 556470 537931 520995 505617
56998E05617j4174j3126j1724r929q405p737p766p894p703p085o071m762l199
$$ 505617 491443 478317 466593 456664 448259 440522 432756 424862 417159 410074 404003 399241 396042
56985C96042j334O66K100K273J346R4j227l108n636p883q949r055q988q909q350
$$ 396042 394708 395374 397474 399747 401093 401187 399960 396852 391216 383333 374384 365329 356341 347432 339082
56970C39082p137n657m278l043j936r47J29J566L306N009O536Q119R916J1608
$$ 339082 331945 326288 322010 318967 317031 316084 316213 317779 321085 326094 332630 340749 350665 362273
56956C62273J2545J2168J0251O913K569k125o367r450j1118j1663j1572j1068
$$ 362273 374818 386986 397237 404150 406719 404594 398227 388777 377659 365996 354424 343356
56944C43356j0109q792p448o308n232l879j964N70L429O077Q237J0291J2804J5557
$$ 343356 333247 324455 317007 310699 305467 301588 299624 300194 303623 309700 317937 328228 341032 356589
56930C56589J7378J7072J4249R265K847l957r914j4196j6734j7822j7667j6571
$$ 356589 373967 391039 405288 414553 417400 413443 403529 389333 372599 354777 337110 320539
56918C20539j5158j3930j2787j1354r760q642q293q201p616o441n279m535l821
$$ 320539 305381 291451 278664 267310 257550 248908 240615 232414 224798 218357 213078 208543 204722
56905B04722k578j190q07j710k525j813l0J043P75M01J081K367L272L890M972
$$ 204722 202144 200954 200147 198437 195912 194099 194069 195112 195887 196288 197369 199736 203008 206898 211870
56890B11870O467P508P755P796Q199Q770Q886Q082O236L538M55k458m779o270
$$ 211870 218337 225845 233600 241396 249595 258365 267251 275333 281569 285107 285562 283104 278325 272055
56876B72055o926p071p045o627n202k733r0J885L247M485N814P408R765J3004
$$ 272055 265129 258058 251013 244386 239184 236451 236361 238246 241493 245978 251792 259200 268965 281969
56862B81969J6252J8530J9937K1024K1308J9440J4996R067K977k744p778j1480
$$ 281969 298221 316751 336688 357712 379020 398460 413456 422523 425500 422756 414978 403498
56850D03498j3433j3969j3570j2257r980p127m186j225J810M698P335J0275J4314
$$ 403498 390065 376096 362526 350269 340289 333162 328976 327751 329561 334259 341594 351869 366183
56837C66183J9568K5356L0867L5549L8775L9520L6620K9411J8309M978q130j8810
$$ 366183 385751 411107 441974 477523 516298 555818 592438 621849 640158 645136 637006 618196
56825F18196k6059l0150l1854l1650k9682k6330k2433j8757j5372j1833p915l817
$$ 618196 592137 561987 530133 498483 468801 442471 420038 401281 385909 374076 366161 362344
56813C62344L59M903R997J5281K0176K4342K7417K8603K6995K2296J4988N952
$$ 362344 362703 367606 377603 392884 413060 437402 464819 493422 520417 542713 557701 563653
56801E63653l635j2345j8970k3101k5031k5233k4172k2403k0326j7950j5263j2652
$$ 563653 560018 547673 528703 505602 480571 455338 431166 408763 388437 370487 355224 342572
56789C42572j0456q329n679k626J68K602N243Q241J0866J2390J2642J1425Q145
$$ 342572 332116 323787 318108 315482 315650 318252 323495 331736 342602 354992 367634 379059 387204
56776C87204K780l415q833j2857j5742j7541j7929j7001j5469j3929j2458j1060
$$ 387204 389984 386569 377736 364879 349137 331596 313667 296666 281197 267268 254810 243750
56764B43750r973r263q491p223n711m703m547m757m590l962l521l825m594m955
$$ 243750 233777 224514 216023 208800 203089 198386 193839 189082 184492 180530 177009 173184 168590 163635
56750A63635m379l209k255j977k092j965j364p50p15j199j507j194o10k91j48
$$ 163635 159256 156047 153792 151815 149723 147758 146394 145644 144929 143730 142223 141029 140419 140128 139980
56735A39980L03J030J355Q94J55m5M50J032J109P55N30P49J135J268J202J372
$$ 139980 140283 141313 142668 143562 143717 143672 144122 145154 146263 147018 147548 148297 149432 150700 151902 153274
56719A53274J848K094J611N66m49j055j167q38l27j05l81p95r42r52j113j230
$$ 153274 155122 157216 158827 159393 158944 157889 156722 155884 155557 155452 155071 154276 153334 152382 151269 150039
56703A50039r24m12k24k54J43J025J614J468J203J604K528L161L020K309J517
$$ 150039 149115 148703 148479 148225 148368 149393 151007 152475 153678 155282 157810 160971 163991 166300 167817
56688A67817J115J428K447L694M477M316L211J755R12J235K202K649J994Q22Q7
$$ 167817 168932 170360 172807 176501 180978 185294 188505 190260 191172 192407 194609 197258 199252 200074 200161
56673B00161J32O12J042J089O36r5n88m62J89R48J483J740J837J866J743J294
$$ 200161 200293 200905 201947 203036 203672 203577 202989 202527 202716 203664 205147 206887 208724 210590 212333 213627
56657B13627O07J17R1K12j2o00j224j836k573l122k890j906r20m13j37J16m0q97
$$ 213627 214234 214351 214442 214654 214642 214042 212818 210982 208409 205287 202397 200491 199571 199158 199021 199137 199097 198200
56639A98200j954k421k114j465r23p67j192k060k763k699j865p24K35O76M84p
$$ 198200 196246 193825 191711 190246 189323 188556 187364 185304 182541 179842 177977 177253 177488 178164 178648 178641
56623A78641j21M50J220J461J031L41j79l42j29K51L88N4n75j262j964k555k660
$$ 178641 178520 178970 180190 181651 182682 183023 182844 182502 182373 182624 183012 183066 182491 181229 179265 176710 174050
56606A74050k119j366r60r53j022r97q85o63m24m56p56p29P4J120J387O90q1o6
$$ 174050 171931 170565 169605 168652 167630 166633 165748 165085 164661 164205 163449 162720 162794 163914 165301 165991 165910 165844
56588A65844O76J515J974J950J548R98N46K92K36M27Q37J163J036N75L93Q83J740
$$ 165844 166520 168035 170009 171959 173507 174505 175051 175343 175579 176006 176843 178006 179042 179617 180010 180893 182633
56571A82633K368K572K580K511K153J403O22L40O45J154J553J898K222K267J869
$$ 182633 185001 187573 190153 192664 194817 196220 196842 197182 197827 198981 200534 202432 204654 206921 208790
56556B08790J354J196J391J611J795K068K177J637N33l86o48n60n75o95q10j059
$$ 208790 210144 211340 212731 214342 216137 218205 220382 222019 222552 222166 221518 220958 220383 219688 218878 217819
56540B17819j480j702j529j392j786k483k914l006l197l687m190m360m098l523
$$ 217819 216339 214637 213108 211716 209930 207447 204533 201527 198330 194643 190453 186093 181995 178472
56526A78472k892k487k316k081j679j429j506j438p09L84R56N30n62j655k180
$$ 178472 175580 173093 170777 168696 167017 165588 164082 162644 161935 162319 163275 163805 163243 161588 159408
56511A59408j809p71P7M1n03n35K30R79R36K93k98n71n92k79M04R72P59j16o75
$$ 159408 157599 156828 156905 156946 156443 155908 156138 157117 158053 158346 158048 157477 156885 156606 157010 157982 158741 158625 157950
56492A57950j88Q96J570J588J602J971K030J047m95j274p35L17Q52P21L74L9l18
$$ 157950 157762 158658 160228 161816 163418 165389 167419 168466 167971 166697 165962 166279 167131 167852 168226 168265 167947
56475A67947n20k38M85J166J392J262J262J773K605L048K539J315J91k64r4M06
$$ 167947 167427 167189 167674 168840 170232 171494 172756 174529 177134 180182 182721 184036 184227 183963 183869 184275
56459A84275R70J319J264R58O49J77o93j497j391m16L33J77l05l40j01j35l71
$$ 184275 185245 186564 187828 188786 189435 189612 188919 187422 186031 185615 185948 186125 185820 185480 185379 185244 184873
56442A84873l96k23n4K44P07Q03J71o15p83m52j80M0M71P03J18r56j555j401j001
$$ 184873 184477 184254 184200 184444 185151 185954 186125 185510 184727 184275 184095 184135 184606 185309 185427 184471 182916 181515 180514
56423A80514o00r4J83k63j017j104n29l09q23j257j040o33m55j14N64Q79M16k0
$$ 180514 179914 179820 180003 179740 178723 177619 177090 176781 175958 174701 173661 173028 172573 172459 173023 173902 174318 174298
56405A74298M64J397J654J071M74L65M94N79O18M87J2m50j30J169K588L079K551
$$ 174298 174762 176159 177813 178884 179358 179723 180217 180796 181414 181901 181913 181463 181333 182502 185090 188169 190720
56388A90720J904J908K300K229J504R29J176J811J990J719J635J740J355M23j64
$$ 190720 192624 194532 196832 199061 200565 201494 202670 204481 206471 208190 209825 211565 212920 213343 213179
56373B13179J4J20o69j843k231j539m18N19J052R91L28l64l73K67Q43R11O81N22
$$ 213179 213193 213313 212644 210801 208570 207031 206613 207132 208184 209175 209503 209139 208766 209033 209876 210787 211468 211990
56355B11990N51P59J097J362J317J003O60M24L73P16J527K358K546J977J183P20
$$ 211990 212541 213300 214397 215759 217076 218079 218739 219163 219536 220252 221779 224137 226683 228660 229843 230563
56339B30563P90J370K290L040L094K578K260K553K931K686J937J457J638K106
$$ 230563 231353 232723 235013 238053 241147 243725 245985 248538 251469 254155 256092 257549 259187 261293
56325B61293K349K291K174K184K366K644K774K558K248K415L153L738L515K860
$$ 261293 263642 265933 268107 270291 272657 275301 278075 280633 282881 285296 288449 292187 295702 298562
56311B98562K674L103L449L433L683M565N315N052M167L847M368M797M433L763
$$ 298562 301236 304339 307788 311221 314904 319469 324784 329836 334003 337850 342218 347015 351448 355211
56297C55211L646M094M340L902L200L088L870M824M878L902K955K985L658L967
$$ 355211 358857 362951 367291 371193 374393 377481 381351 386175 391053 394955 397910 400895 404553 408520
56283D08520L735L659M020M282M237M648O111P998R161R389R493J0251J1785J3886
$$ 408520 412255 415914 419934 424216 428453 433101 439212 447210 456371 465760 475253 485504 497289 511175
56269E11175J6321J8757K0828K2514K4276K6783L0445L5089M0037M4712M9272
$$ 511175 527496 546253 567081 589595 613871 640654 671099 706188 746225 790937 840209
56258H40209N4398O0319O6441P2220P7934Q4116R0443R5840R9598J01848J02847
$$ 840209 894607 954926 1021367 1093587 1171521 1255637 1346080 1441920 1541518 1643366 1746213
56247A746213J02293R9578R4360Q6601P6373O3953N0013L5432K0853O561p233
$$ 1746213 1848506 1948084 2042444 2129045 2205418 2269371 2319384 2354816 2375669 2382230 2374997
56236B374997k0141l1773m2008n0996n8806o5156o9590p2040p3117p3812p4820
$$ 2374997 2354856 2323083 2281075 2230079 2171273 2106117 2036527 1964487 1891370 1817558 1742738
56225A742738p6073p6924p6711p5196p2626o9482o6305o3461o0882n8002n4288
$$ 1742738 1666665 1589741 1513030 1437834 1365208 1295726 1229421 1165960 1105078 1047076 992788
56214I92788m9872m5490m1662l8164l4436l0321k6202k2594j9770j7639j5769
$$ 992788 942916 897426 855764 817600 783164 752843 726641 704047 684277 666638 650869
56203F50869j3733j1643j0094r372q915q016o792n987n930o179o235o036n595
$$ 650869 637136 625493 615399 606027 597112 589096 582304 576317 570387 564208 557973 551937 546342
56190E46342m718l387k091j352j134r82o40j93K39O85J187J748K385L119L787
$$ 546342 541624 538237 536146 534794 533660 532678 532038 531845 532084 532769 533956 535704 538089 541208 544995
56175E44995M061L860L685M297N872P631Q530Q291P564P164P422Q234R306J0221
$$ 544995 549056 552916 556601 560898 566770 574401 582931 591222 598786 605950 613372 621606 630912 641133
56161F41133J0677J0868J1429J2789J4821J7226J9826K2405K4764K7233L0656
$$ 641133 651810 662678 674107 686896 701717 718943 738769 761174 785938 813171 843827
56150H43827L5505M1536M8680N7663O9013Q1945R4938J06924J16981J23174J23000
$$ 843827 879332 920868 969548 1027211 1096224 1178169 1273107 1380031 1497012 1620186 1743186
56139A743186J15367J01686Q5049O8930N6456M9527M7712M8118M6782M0590K8699
$$ 1743186 1858553 1960239 2045288 2114218 2170674 2220201 2267913 2316031 2362813 2403403 2432102
56128B432102J3080k257j3516j9206k0353j9336j9265k3697l5057n2511p2147
$$ 2432102 2445182 2442925 2429409 2410203 2389850 2370514 2351249 2327552 2292495 2239984 2167837
56117B167837q9767j03000j10777j12320j07775r9051q8683p7928o6759n5555
$$ 2167837 2078070 1975070 1864293 1751973 1644198 1545147 1456464 1378536 1311777 1256222
56107A256222m5681l8127l2303k6805k1078j5846j1953r264o949m532k281n59
$$ 1256222 1210541 1172414 1140111 1113306 1092228 1076382 1064429 1055165 1048216 1043684 1041403 1040844
56095A040844P00J827L056M512O165P655Q542R020R871J1359J2774J3460J3760
$$ 1040844 1041544 1043371 1046427 1050939 1057104 1064759 1073301 1082321 1092192 1103551 1116325 1129785 1143545
56082A143545J4274J4739J4493J3613J2726J1912J0825R680R183R420R708R694
$$ 1143545 1157819 1172558 1187051 1200664 1213390 1225302 1236127 1245807 1254990 1264410 1274118 1283812
56070A283812R760J0201J0736J1104J1535J2409J3769J5314J6568J7202J7552
$$ 1283812 1293572 1303773 1314509 1325613 1337148 1349557 1363326 1378640 1395208 1412410 1429962
56059A429962J8432J9999K1310K1591K1422K1807K2675K3332K3861K4817K5890
$$ 1429962 1448394 1468393 1489703 1511294 1532716 1554523 1577198 1600530 1624391 1649208 1675098
56048A675098K6289K6253K6780K7928K8810K9284L0207L1801L3186L3861L4303
$$ 1675098 1701387 1727640 1754420 1782348 1811158 1840442 1870649 1902450 1935636 1969497 2003800
56037B003800L4877L5468L6490L8864M2448M5807M8047M9715N1472N3121N4479
$$ 2003800 2038677 2074145 2110635 2149499 2191947 2237754 2285801 2335516 2386988 2440109 2494588
56026B494588N5951N7644N8980N9758O0641O2139O4153O6774P0310P4230P7342
$$ 2494588 2550539 2608183 2667163 2726921 2787562 2849701 2913854 2980628 3050938 3125168 3202510
56015C202510P9492Q1801Q4930Q8356R1779R5727J00234J04499J08487J13419
$$ 3202510 3282002 3363803 3448733 3537089 3628868 3724595 3824829 3929328 4037815 4151234
56005D151234J19873J26739J32862J38536J44690J51743J59772J68689J77848
$$ 4151234 4271107 4397846 4530708 4669244 4813934 4965677 5125449 5294138 5471986
55996E471986J86712J96120K07442K20371K33299K46011K60013K75952K92948
$$ 5471986 5658698 5854818 6062260 6282631 6515930 6761941 7021954 7297906 7590854
55987G590854L10949L31373L54586L79240M05001M33627M66326N02351N41405
$$ 7590854 7901803 8233176 8587762 8967002 9372003 9805630 10271956 10774307 11315712
55978A1315712N84992O34225O88669P48638Q16369Q93749R81166J079701J192000
$$ 11315712 11900704 12534929 13223598 13972236 14788605 15682354 16663520 17743221 18935221
55969A8935221J320247J466189J634155J831133K063367K336690K661279L052285
$$ 18935221 20255468 21721657 23355812 25186945 27250312 29587002 32248281 35300566
55961C5300566L524936M093166M773124N581612O529338P622624Q875716J0318037
$$ 35300566 38825502 42918668 47691792 53273404 59802742 67425366 76301082 86619119
55953H6619119J1990168J3939822J6217563J8854185K1816524K4952421K7911776
$$ 86619119 98609287 112549109 128766672 147620857 169437381 194389802 222301578
55946B22301578L0040771L0362087K7834964K1908767J3026181K623303p457530
$$ 222301578 252342349 282704436 310539400 332448167 345474348 348097651 340640121
55939C40640121j5728529k1483097k4742425k5948866k5677357k4462372k2717905
$$ 340640121 324911592 303428495 278686070 252737204 227059847 202597475 179879570
55932A79879570k0722596j8649621j6606504j4659329j2846365j1191474r711188
$$ 179879570 159156974 140507353 123900849 109241520 96395155 85203681 75492493
55925G5492493q410985p282373o309387n475970m765920m161061l644143l201742
$$ 75492493 67081508 59799135 53489748 48013778 43247858 39086797 35442654 32240912
55917C2240912k822638k496122k213702j969757j758923j575001j413359j271668
$$ 32240912 29418274 26922152 24708450 22738693 20979770 19404769 17991410 16719742
55909A6719742j147296j036594r37607q50558p74671p07167o46343n92707n45910
$$ 16719742 15572446 14535852 13598245 12747687 11973016 11265849 10619506 10026799 9480889
55900I480889n03384m63422m27037l95216l66713l40032l15407k93309k72901
$$ 9480889 8977505 8514083 8087046 7691830 7325117 6985085 6669678 6376369 6103468
55891F103468k53524k35831k20044k04765j89051j74286j62667j54999j50874
$$ 6103468 5849944 5614113 5394069 5189304 5000253 4825967 4663300 4508301 4357427
55882D357427j49415j48718j46139j40646j33928j28069j23207j18419j13555
$$ 4357427 4208012 4059294 3913155 3772509 3638581 3510512 3387305 3268886 3155331
55873C155331j08909j04077r8545r2758q7562q3063p8892p5017p1585o8456o5446
$$ 3155331 3046422 2942345 2843800 2751042 2663480 2580417 2501525 2426508 2354923 2286467 2221021
55862B221021o2608n9859n6871n3602n0391m7318m4166m1140l8925l7803l7438
$$ 2221021 2158413 2098554 2041683 1988081 1937690 1890372 1846206 1805066 1766141 1728338 1690900
55851A690900l7460l7587l7328l6521l5969l6455l7241l6840l5240l3879l3399
$$ 1690900 1653440 1615853 1578525 1542004 1506035 1469580 1432339 1395499 1360259 1326380 1292981
55840A292981l2863l1536k9912k8522k7052k5236k3440k1765j9758j7482j5752
$$ 1292981 1260118 1228582 1198670 1170148 1143096 1117860 1094420 1072655 1052897 1035415 1019663
55829A019663j4779j3712j1999j0171q718p372o011n170n026m866m283l876m231
$$ 1019663 1004884 991172 979173 969002 960284 952912 946901 941731 936705 931839 927556 923680 919449
55816I19449n042n917p136q976j0990j2501j3199j3068j2447j2247j3109j4260
$$ 919449 914407 908490 901354 892378 881388 868887 855688 842620 830173 817926 804817 790557
55804G90557j4302j3295j2646j2784j2491j1140r860r645r803r340q587q202p633
$$ 790557 776255 762960 750314 737530 725039 713899 704039 694394 684591 675251 666664 658462 650829
55791F50829n898l096j80K006K525K46m707j0091j3402j4247j3997j3666j3242
$$ 650829 644931 641835 641655 643661 646186 646432 641725 631634 618232 603985 589988 576322 563080
55778E63080j2621j2036j1544j0956j0211r396q556p850p474p092n988m190k685
$$ 563080 550459 538423 526879 515923 505712 496316 487760 479910 472436 465344 459356 455166 452481
55765D52481k021j483l23J043J835K198K708L140K672J066j112l083m142l902
$$ 452481 450460 448977 448654 449697 451532 453730 456438 459578 462250 463316 462204 459121 454979 451077
55751D51077k860k226k534l058l179l576n100p214q666r269r866j0787j1381j1106
$$ 451077 448217 445991 443457 440399 437220 433644 428544 421330 412664 403395 393529 382742 371361 360255
55737C60255j0215r285q681q436q187p364n939m659m161m235m422m766n326n587
$$ 360255 350040 340755 332074 323638 315451 308087 302148 297489 293328 289093 284671 279905 274579 268992
55723B68992n177m671m821n312n210m363l406k612j772j069j098j848k483k346
$$ 268992 263815 259144 254323 249011 243801 239438 236032 233420 231648 230579 229481 227633 225150 222804
55709B22804j557o25K4J13k14k37N79J659J886J103L67M95J065J228R53R05J342
$$ 222804 221247 220622 220646 220759 220545 220308 220887 222546 224432 225535 225902 226397 227462 228690 229643 230548 231890
55692B31890J680J264K83l77j96L51M67J11m6M13J268K292L515M619M765L630
$$ 231890 233570 234834 235117 234740 234544 234895 235362 235473 235427 235840 237108 239400 242915 247534 252299 255929
55676B55929K097J368J615K003J818J143O03O71J186J352N01j109k631l649m324
$$ 255929 258026 259394 261009 263012 264830 265973 266576 267247 268433 269785 270286 269177 266546 262897 258573
55661B58573m616m275l722l898m801n252m722m256m795n577n339m214l221k464
$$ 258573 253957 249682 245960 242062 237261 232009 227287 223031 218236 212659 207320 203106 199885 197421
55647A97421j241M25J706K357K912L583M013M261M990O361P586P804O878N197
$$ 197421 196180 196605 198311 200668 203580 207163 211176 215437 220427 226788 234374 242178 249056 254253
55633B54253L319J820R61L91l57j259k049k787l531l811l184k112j485j438j428
$$ 254253 257572 259392 260353 260744 260387 259128 257079 254292 250761 246950 243766 241654 240169 238731 237303
55618B37303j292j343j532j489j435k114l657n328o512p181p336o941o519o904
$$ 237303 236011 234668 233136 231647 230212 228098 224441 219113 212601 205420 198084 191143 184624 177720
55604A77720q043q836q586p813p307p035o525n648m615l581k784k579k941l280
$$ 177720 169677 160841 152255 144442 137135 130100 123575 117927 113312 109731 106947 104368 101427 98147
55590I8147l065k450j981j983k377k820k872k312j444p95m81k35oo6m00n23j32
$$ 98147 95082 92632 90651 88668 86291 83471 80599 78287 76843 76048 75567 75332 75326 75260 74860 74337 74205
55573G4205M36O59L98p7l77k29K74O69N88K43Q2J49J76J41K04K45O3l0M23J148
$$ 74205 74641 75300 75698 75621 75244 75015 75289 75958 76546 76789 76871 77020 77196 77337 77541 77786 77849 77819 78242 79390
55553G9390J353R77Q74J570K538L023K899K410J716J098J006J446J857J843J541
$$ 79390 80743 81720 82594 84164 86702 89725 92624 95034 96750 97848 98854 100300 102157 104000 105541
55538A05541R52k67j948l105l117k657k694l119l094k419j642j096o53l79o74
$$ 105541 106493 106226 104278 101173 98056 95399 92705 89586 86492 84073 82431 81335 80682 80303 79629
55523G9629j547k453k938l014k739j977q20J42K91l52j157j393o76Q28K388L076
$$ 79629 78082 75629 72691 69677 66938 64961 64141 64283 64574 64222 63065 61672 60996 61824 64212 67288
55507F7288K514J372R12J829L580M981N486N564N802O054N794N095M613M683M883
$$ 67288 69802 71174 72086 73915 77495 82476 87962 93526 99328 105382 111176 116271 120884 125567 130450
55492A30450M613L671K156K63j553k753l370m162n575o929p175o356n658n871
$$ 130450 135063 138734 140890 141153 139600 136847 133477 129315 123740 116811 109636 103280 97622 91751
55478I1751o410o216n187m175l764l661l387l082l144l455l509l197k899k734
$$ 91751 85341 79125 73938 69763 65999 62338 58951 55869 52725 49270 45761 42564 39665 36931
55464C6931k276j317l89j23l88n91n55o26r85j353j412j128o48j83J6j02k08J9
$$ 36931 34655 33338 32949 32826 32438 31847 31292 30666 29681 28328 26916 25788 25140 24957 24973 24871 24663 24682
55446B4682L69L05k88q76r08l62L26O44L76j78m19j75j2m31r88q18P0O98M46k21
$$ 24682 25051 25356 25068 24192 23284 22922 23248 23892 24268 24090 23671 23496 23484 23053 22065 21247 21317 22015 22461 22240
55426B2240o10p27q98r85n70K54Q23O25j58q64r42l78L56P30N73Q8m64q66r39
$$ 22240 21630 20903 20005 19020 18450 18704 19527 20152 19994 19130 18188 17810 18166 18896 19469 19557 19093 18227 17288
55407A7288o78l54k86m38n55n54n01l31L8L57K23l01o95o26k81N2K69L19J67J6
$$ 17288 16610 16256 15970 15532 14977 14423 13922 13591 13629 13986 14209 13908 13213 12587 12306 12358 12627 12946 13113 13129
55387A3129J81N79P85O28M14L54K34j80p88j337j664j594r90n7P29J170J441J555
$$ 13129 13310 13889 14674 15302 15716 16070 16304 16124 15336 13999 12335 10741 9751 9694 10423 11593 13034 14589
55369A4589J226N03k1M0L04K42m4o3K46M62L23L5j01n5q1m43j112j650j565q74
$$ 14589 15815 16318 16297 16337 16641 16883 16839 16776 17022 17484 17807 17842 17741 17686 17605 17162 16050 14400 12835 11961
55349A1961j53O1j93m60l84J1M17N80N71O05N81J30o87j129p54k16l51q02n10
$$ 11961 11808 11869 11676 11216 10832 10843 11260 11840 12411 13016 13597 13727 13040 11911 11157 10941 10590 9788 9278
55330I278N15J045M49m10n68k87k97n55n33j52L44R86J786K243J837Q28r1o54
$$ 9278 9793 10838 11287 10877 10309 10022 9725 9170 8637 8485 8829 9815 11601 13844 15681 16509 16418 15764
55312A5764j005j134r65p35o61m94KM32K67k40l88o7K42L87O18Q95R21Q71J199
$$ 15764 14759 13625 12660 11925 11264 10770 10772 11204 11471 11231 10843 10776 11018 11405 12023 12918 13839 14710 15909
55293A5909J574R65q36k548k782j588j07Q18J146J103Q20M94L43L50K87J02J8
$$ 15909 17483 18448 17612 15064 12282 10694 10587 11405 12551 13654 14474 14968 15311 15661 15948 16050 16068
55276A6068J79L24M1o43j109p94P1O62N18J7k49k04r0N4K28O3p25j583j542n59
$$ 16068 16247 16571 16612 15969 14860 14066 14137 14799 15317 15334 15085 14881 14791 14845 15073 15136 14411 12828 11286 10727
55256A0727K55J00m76m93K3K25j63m83k02L48N81M71L41K94K83N22J138J638J311
$$ 10727 10982 11082 10606 10113 10136 10361 10198 9715 9513 9861 10442 10913 11254 11548 11831 12353 13491 15129 16440
55237A6440L09l75k71p7n47j268j278m97K68N40O11O93N49J35r2O8J54k29p47
$$ 16440 16749 16374 16103 16026 15479 14211 12933 12436 12704 13244 13855 14548 15097 15232 15140 15208 15362 15133 14386
55218A4386q41m55R0N69P57L61m63r21m54M50Q89P06M36L10L7m37o56l21J97L09
$$ 14386 13545 13090 13180 13749 14506 14867 14404 13483 13029 13479 14368 15074 15510 15820 15857 15420 14764 14443 14640 14949
55198A4949j02o08o79j90L99M01l71j302j600j111l18L41P93J055J013N99j2m99
$$ 14949 14847 14239 13560 13370 13769 14170 13799 12497 10897 9786 9468 9809 10602 11657 12670 13269 13257 12758
55180A2758o10l03J96N53O15N02L79K52Lm56j079j534j249lJ490K081J500O28
$$ 12758 12148 11845 12041 12594 13209 13711 14090 14342 14345 13889 12810 11276 10027 10024 11514 13595 15095 15723
55162A5723K97L29J92o2p5Ok24o48p87o30n94p14n45P3P06R58Q92P37N65L81K74
$$ 15723 16020 16349 16541 16479 16404 16410 16186 15538 14751 14121 13527 12813 12268 12341 13047 14005 14897 15634 16199 16580 16854
55141A6854K94L84M55L34j09o80r00o47l85m73n93l82j23j62o7O90J546J383K42
$$ 16854 17148 17532 17987 18321 18212 17532 16632 15985 15600 15127 14534 14152 14029 13867 13800 14490 16036 17419 17661
55122A7661o26m99O5M70R30J577J720Q52l80r75q39n30k04L83J103J518J568J567
$$ 17661 17035 16536 16601 17071 18001 19578 21298 22150 21770 20795 19956 19426 19222 19605 20708 22226 23794 25361
55104B5361J591J411R63M11j87q07j110p23J08O17L77k76p64q37n97k70q1j46
$$ 25361 26952 28363 29326 29737 29550 28743 27633 26910 27018 27635 28012 27736 26972 26135 25538 25268 25187 25041
55086B5041l34m08l06j53k8M0o3m16p71p24k23L35O94J025J482J778J574J070
$$ 25041 24707 24299 23993 23840 23812 23852 23789 23373 22602 21878 21655 21990 22684 23709 25191 26969 28543 29613
55068B9613P68P14M51k36r26j193j179j228j190o20L92J113R67J34p70j214r55
$$ 29613 30381 31095 31546 31310 30384 29191 28012 26784 25594 24974 25366 26479 27446 27580 26810 25596 24641
55051B4641r6P93R52J96q16j286j052n18k9L25N35N70L88r8q56j462j350n91O5
$$ 24641 24545 25338 26290 26486 25670 24384 23332 22814 22785 23110 23645 24215 24603 24505 23649 22187 20837 20246 20311
55032B0311J65J88O86J291J255O57K89M78Q49J156J492J648J159K34j26N66J488
$$ 20311 20476 20664 21350 22641 23896 24553 24842 25320 26169 27325 28817 30465 31624 31858 31732 32298 33786
55015C3786J542O60l59r59j178j163q66k79L60O96N59J77J9K46M36J67k83l08
$$ 33786 35328 35988 35629 34670 33492 32329 31463 31184 31544 32240 32799 32976 32995 33241 33677 33844 33561 33253
54997C3253O9K39M8L0L89N21M5m24k03L42L78k2M0Q97J816J992J409N31l21j029
$$ 33253 33322 33561 33609 33639 34028 34549 34594 34170 33967 34309 34687 34665 34705 35602 37418 39410 40819 41350 41029 40000
54977D0000j448j511j370j164p98j95L11J79n93j174p44M08J084O58n0J35J100
$$ 40000 38552 37041 35671 34507 33709 33514 33825 34004 33411 32237 31493 31901 32985 33643 33593 33728 34828
54960C4828J603R86k8m38j50K79M98N17M27M48Q54J485J716J375J236K001L160
$$ 34828 36431 37417 37389 36951 36801 37080 37578 38095 38522 38970 39824 41309 43025 44400 45636 47637 50797
54943E0797L669L494L706M959O699Q077Q978R715J0174R746Q023N205J936j142
$$ 50797 54466 57960 61666 66625 73324 81401 90379 100094 110268 120014 128037 133242 135178 134036
54929A34036l705n802p590q976r643r391q341o828n266m077l526l493l552l339
$$ 134036 130331 124529 116939 107963 98320 88929 80588 73760 68494 64417 60891 57398 53846 50507
54915E0507k817k150j511r82o06l99l06j84J59P96J542K080K278K301K407K736
$$ 50507 47690 45540 44029 43047 42441 42042 41736 41552 41711 42507 44049 46129 48407 50708 53115 55851
54899E5851L320M162N172O179P038P602P626O967N905M901L943K494K75k238m374
$$ 55851 59171 63333 68505 74684 81722 89324 96950 103917 109822 114723 118666 121160 121435 119197 114823
54884A14823n902o818o941o284n518n366n659n603m964m342m154m075l693l174
$$ 114823 108921 102103 95162 88878 83360 77994 72335 66732 61768 57426 53272 49197 45504 42330
54870D2330k852k578j999j126k54N17J247J739J647J023M04J78J37j77p43r84
$$ 42330 39478 36900 34901 33775 33521 34038 35285 37024 38671 39694 40098 40276 40413 40236 39493 38509
54854C8509m61M63Q41J31j158k000j926j361q63m71J1L89K28l91p38l10M76P47
$$ 38509 38048 38511 39352 39483 38325 36325 34399 33038 32175 31704 31715 32104 32332 31941 31203 30893 31369 32116
54836C2116K04o02j016r56p73p23q22j039j330j518j395r91n46j31M17J112J556
$$ 32116 32320 31718 30702 29746 28973 28250 27428 26389 25059 23541 22146 21155 20609 20478 20895 22007 23563
54819B3563J394Q76O54R41J162P06k21p96o79m61q05j437j394k89J167J993J951
$$ 23563 24957 25833 26487 27428 28590 29296 29075 28279 27600 27139 26334 24897 23503 23214 24381 26374 28325
54802B8325J562J424J731K226K354J733P28K76P77J552J816J809K266L066L400
$$ 28325 29887 31311 33042 35268 37622 39355 40083 40359 41136 42688 44504 46313 48579 51645 55045
54787E5045L304L959N987Q288R300Q831P922P247O548N453M072K533N94j937m624
$$ 55045 58349 62308 68295 76583 85883 94714 102636 109883 116431 121884 125956 128489 129083 127146 122522
54772A22522o577p215o753n978n484n122m303k868j368l94N9L42N38M77K58K54
$$ 122522 115945 108730 101977 95999 90515 85393 81090 78222 76854 76460 76519 76861 77399 77876 78134 78388
54756G8388O62J287J839K156K143J751J089L54k95p45p92k82O26J549K294L042
$$ 78388 79050 80337 82176 84332 86475 88226 89315 89669 89374 88629 87837 87555 88181 89730 92024 95066
54740I5066M018N114N859N845N079L922K581Q42j497m029n916o784p012p026o748
$$ 95066 99084 104198 110057 115902 120981 124903 127484 128326 126829 122800 116884 110100 103088 96062 89314
54725H9314o063n425n375n699n627m869l947l379l039k471j567o99l01m62q51
$$ 89314 83251 77826 72451 66752 61125 56256 52309 48930 45891 43420 41853 41154 40853 40391 39540
54710C9540r82o74k62j71l71m53k17jk43q40j110m78Q55J980K133J408N24Mj52
$$ 39540 38558 37884 37622 37451 37080 36627 36410 36409 36166 35326 34216 33738 34593 36573 38706 40114 40638 40642 40490
54691D0490j14J5P4q7k09J95J024J401P58l15p74l41M67J173J562J364N08l66
$$ 40490 40376 40391 40465 40378 40169 40364 41388 42789 43547 43232 42458 42117 42584 43757 45319 46683 47191 46825
54673D6825m38K00O24L31k22n46p95j188j313o60N11J386J544J260R89R04R79
$$ 46825 46387 46587 47211 47542 47320 46774 45979 44791 43478 42818 43329 44715 46259 47519 48508 49412 50391
54656E0391J164J414J648J806J891J998K286K864L689M614N490O149O355N969
$$ 50391 51555 52969 54617 56423 58314 60312 62598 65462 69151 73765 79255 85404 91759 97728
54642I7728N213M556M191L715K447J52k513m393m937m781m984n670n898n028l612
$$ 97728 102941 107497 111688 115403 117850 118002 115489 111096 106159 101378 96394 90724 84826 79798 76186
54627G6186k552j936j297o28l21k83NN73P97L17n50j406k082k271j598m37J24
$$ 76186 73634 71698 70401 69773 69452 69169 69174 69747 70544 70861 70311 68905 66823 64552 62954 62517 62641
54610F2641m48j440j918j899j933k061j905j494j272j312j202p54l49l37n31m73
$$ 62641 62193 60753 58835 56936 55003 52942 51037 49543 48271 46959 45757 45003 44654 44317 43786 43313
54594D3313r7J75n3o51j105j112q25m42J42R74J601J489P55j2o54j440k156k024
$$ 43313 43216 43391 43338 42687 41582 40470 39645 39203 39345 40319 41920 43409 44164 44152 43498 42058 39902 37878
54576C7878q56M06Q56P19P45J035J110Q01L83N9p2J64O72Q10J40q02j193j175
$$ 37878 37022 37428 38284 39003 39748 40783 41893 42694 43077 43136 43064 43228 43900 44710 44850 44048 42855 41680
54558D1680j522k174k147j048K40Q40R93J293J571J340Q31P53J139J292Q96M46
$$ 41680 40158 37984 35837 34789 35029 35869 36862 38155 39726 41066 41897 42650 43789 45081 45977 46423
54542D6423L97M43J37k01K41J621L058L625L385L134L257L280K674J630P18J3
$$ 46423 46820 47263 47400 47199 47440 49061 52119 55744 59129 62263 65520 68800 71474 73104 73822 73835
54526G3835r41k299l505l901l457k715k179j887j538r02j96K6m72j163j312r75
$$ 73835 72894 70595 67090 63189 59732 57017 54838 52951 51413 50511 50315 50341 49869 48706 47394 46419
54510D6419r79j691k354k050r86j89j54m14m26k06M6L30N48L90j00k32M43J362
$$ 46419 45440 43749 41395 39345 38359 38170 38016 37602 37176 36970 37016 37346 37894 38284 38184 37952 38395 39757
54492C9757J619J223J039J459J881J681J060N46J53m32j092j272p09K19R20J098
$$ 39757 41376 42599 43638 45097 46978 48659 49719 50265 50418 49986 48894 47622 46913 47132 48052 49150
54476D9150Q00K23l67o81n80k27J6m8j67J08P82J249R81K45k74l67l78m57l63
$$ 49150 49950 50173 49806 49125 48545 48318 48334 48286 48119 48227 49009 50258 51239 51484 51210 50843 50465 50008 49645
54457D9645j04j20m39m01L41J095J060M93J82J94l3n52p88n49l02l28l38j63j11
$$ 49645 49541 49421 48982 48581 48922 50017 51077 51570 51752 51946 51913 51361 50573 50024 49722 49394 49056 48893 48782
54438D8782l67o10n37k61Q0N89J193J463J129M37k61q31j118q76k54J80J82J88
$$ 48782 48415 47805 47268 47007 47087 47676 48869 50332 51461 51898 51637 50806 49688 48812 48558 48738 48920 49108
54420D9108N67J024J098Q50N83L45J34K77J041K087K733K623J868Q41J19K01Q67
$$ 49108 49675 50699 51797 52647 53230 53575 53709 53986 55027 57114 59847 62470 64338 65179 65298 65499 66366
54403F6366J176N77l25o59m96n24q14p36RR29J406J186K34j254k584k933k211
$$ 66366 67542 68119 67794 67135 66639 66115 65301 64565 64574 65503 66909 68095 68329 67075 64491 61558 59347
54386E9347j185n29k16L7K02J25o8j11K8J89K71K70J36k39q12j295j331q01LO45
$$ 59347 58162 57633 57417 57454 57656 57781 57713 57602 57630 57819 58090 58360 58496 58257 57445 56150 54819 54018 54021 54666
54366E4666R33R30O64J08m93o94m22j30j36j39K71R12J253J095P09M38M81Q33
$$ 54666 55599 56529 57193 57301 56808 56114 55692 55562 55426 55287 55558 56470 57723 58818 59527 59965 60446 61279
54348F1279J146R19J95l52l90m67j046j543j172l44j58p27j089q32o16q56r93
$$ 61279 62425 63344 63539 63187 62797 62330 61284 59741 58569 58225 58067 57340 56251 55419 54803 53947 52954
54331E2954o13k92n68r23n81J39K81k66o09k04L87L04n61j530j931j686j176o91
$$ 52954 52341 52049 51481 50558 49977 50116 50397 50131 49522 49318 49705 50009 49448 47918 45987 44301 43125 42434
54313D2434j51N46J080R60K21n21q58j032j401j816j843j392p93l75k08j77j16
$$ 42434 42283 42829 43909 44869 45090 44569 43711 42679 41278 39462 37619 36227 35434 35059 34851 34674 34558
54296C4558Q0L57N66O40N65K88j42l28J31J012J556J339P04J93m0p0J13M55O58
$$ 34558 34638 34995 35561 36201 36766 37054 36912 36584 36715 37727 39283 40622 41326 41519 41479 41409 41522 41977 42635
54277D2635N42L17L17N49P71P52M02j75n87n02j72j95o08p45k47M04O56O26N77
$$ 42635 43177 43494 43811 44360 45131 45883 46285 46110 45523 45021 44849 44654 44046 43301 43054 43458 44114 44740 45317
54258D5317L26k13m24K07J117J297O95J01j15k34k47K34R86J124L95k92j50L53
$$ 45317 45643 45430 45006 45213 46330 47627 48322 48423 48308 48074 47827 48061 49047 50171 50566 50274 50124 50477
54240E0477K67m56j042r62m02J63L94J96j97l49j19Q4j54o62r50q57o19l92j58
$$ 50477 50744 50288 49246 48284 47882 48045 48439 48635 48438 48089 47970 48054 47900 47238 46288 45431 44812 44420 44262
54221D4262j8k12p42j235j320r71m41L9M17P27Q81O37p8q67j131p72l01j05P0
$$ 44262 44244 44032 43290 42055 40735 39764 39323 39362 39779 40506 41387 42024 41946 41079 39948 39176 38875 38770 38840
54202C8840N45R76P35l6l61L28J369J586O49o80j400j172m07K59M82L87K07p1
$$ 38840 39385 40361 41096 41060 40699 41027 42396 43982 44631 43951 42551 41379 40972 41231 41713 42100 42307 42236
54184D2236n78j055q76J37J173J189K02o65n68J21M33K9o51j169j488j648j563
$$ 42236 41658 40603 39727 39864 41037 42226 42428 41763 41195 41316 41749 41778 41127 39958 38470 36822 35259
54167C5259j267r79p26k02O92J491J659J307J050J170J232P15k61j048j224r97
$$ 35259 33992 33013 32287 32085 32777 34268 35927 37234 38284 39454 40686 41401 41140 40092 38868 37871
54151C7871q34q55p62l96p7k20o88q33k36P40J331J115K76o78j232j072k83O18
$$ 37871 37037 36182 35420 35024 34947 34727 34039 33206 32970 33710 35041 36156 36432 35754 34522 33450 33167 33785
54133C3785J065R48N92K94M9k14m26n21n71o11m89j42J34ll48j99P10J599J369
$$ 33785 34850 35798 36390 36684 36733 36519 36093 35572 35001 34390 33901 33759 33893 33890 33542 33343 34053 35652 37021
54114C7021j9j299j281j88P18P00K07k0J09K56L22L88L34O0p1L39R60J000L93
$$ 37021 37002 35703 34422 34234 34952 35652 35859 35839 35948 36204 36526 36914 37248 37308 37237 37576 38536 39536 39929
54095C9929K1M65J147J156N34J24L78Q70R50M16m05r30o69K78J116J108M74Q5
$$ 39929 39950 40415 41562 42718 43252 43376 43754 44624 45574 45990 45585 44655 43986 44264 45380 46488 46962 47047
54077D7047L20O80O25K70o9m35r33j226q73j7P66J179J394J502J230L50q66j766
$$ 47047 47367 48047 48672 48942 48873 48438 47505 46279 45406 45389 46155 47334 48728 50230 51460 51810 50944 49178
54059D9178j797q86M72J544J913J771J562J450J316J119R65Q83Q26Q73J119J428
$$ 49178 47381 46495 46967 48511 50424 52195 53757 55207 56523 57642 58607 59490 60316 61189 62308 63736
54043F3736J623J919K692L742M312L994L298L022L431M262N150N692N449M436
$$ 63736 65359 67278 69970 73712 78024 82018 85316 88338 91769 96031 101181 106873 112322 116758
54029A16758L329K771K653K442K055J832J821J654J202P44M20n2q43j733k499
$$ 116758 120087 122858 125511 127953 130008 131840 133661 135315 136517 137261 137681 137629 136786 135053 132554
54014A32554l248m015m400l991k936j865j341j551k311l143l502l231k658k114
$$ 132554 129306 125291 120891 116900 113964 112099 110758 109207 106896 103753 100251 97020 94362 92248
54000I2248j575r91p08j123k022k659k540j855j132p34p37j020j297j271q98m71
$$ 92248 90673 89682 88974 87851 85829 83170 80630 78775 77643 76909 76172 75152 73855 72584 71686 71215
53984G1215l15n04q17r48p85n39n89r68j159o03N22J367J354P83L05P3k68q70
$$ 71215 70900 70396 69579 68631 67846 67307 66718 65750 64591 63988 64510 65877 67231 68014 68319 68392 68124 67254
53966F7254j387j417r34j91N93J225J427J052L73m5J58Q11J435J700J660J575
$$ 67254 65867 64450 63516 63325 63918 65143 66570 67622 67995 67950 68108 68919 70354 72054 73714 75289
53950G5289J578J521J225P96O08Q88J471K030K444K765K948K916K810K899L191
$$ 75289 76867 78388 79613 80409 81017 81905 83376 85406 87850 90615 93563 96479 99289 102188 105379
53935A05379L431L565L942M786N694N931N204L964K983K683K833K774K105J192
$$ 105379 108810 112375 116317 121103 126797 132728 137932 141896 144879 147562 150395 153169 155274 156466
53921A56466Q56J464K587L612M378M969N223M952M427M151M175M080L591K835
$$ 156466 157322 158786 161373 164985 169363 174332 179555 184507 188934 193085 197260 201340 204931 207766
53907B07766J996J124L75l2k18n82j235j894k431k994l457l340k689k430l262
$$ 207766 209762 210886 211261 211229 211011 210429 209194 207300 204869 201875 198418 195078 192389 189959 186697
53892A86697m568n216n137n347o270o994o501n080l904l515l364k814k021j568
$$ 186697 182129 176913 171776 166429 160159 153165 146664 141584 137680 134165 130801 127987 125966 124398
53878A24398j576j522j022m32m84j409k596l264l240k988k917k943k771k404k128
$$ 124398 122822 121300 120278 119846 119362 117953 115357 112093 108853 105865 102948 100005 97234 94830 92702
53863I2702k065j994j705j370j305j471j428r44l96l60r23j575j787j518j119
$$ 92702 90637 88643 86938 85568 84263 82792 81364 80420 80024 79664 78741 77166 75379 73861 72742
53848G2742q86q31p99o82n23m10l40k76k71m24o47p04m97j22L72J035J669J774
$$ 72742 71856 71025 70226 69544 69021 68611 68271 67995 67724 67300 66653 65949 65452 65330 65702 66737 68406 70180
53830G0180J162L81J02K84L51P0k08j28K85Q69J485J887J823J333O81j0o61r10
$$ 70180 71342 71723 71825 72109 72460 72530 72322 72194 72479 73348 74833 76720 78543 79876 80557 80547 79886 78976
53812G8976l86O83J648K290K904L500L629L216K829K824K909K924L307M173M654
$$ 78976 78590 79273 80921 83211 86115 89615 93244 96460 99289 102113 105022 107946 111253 115426 120080
53797A20080L975K661J892J979K259K190J761J015P8n02k40M03M03m24j226j386
$$ 120080 124055 126716 128608 130587 132846 135036 136797 137812 137890 137388 137148 137551 137954 137530 136304 134918
53781A34918j298j615k381l205l730l670k903j917j588k158k864k902k398j937
$$ 134918 133620 132005 129624 126419 122689 119019 116116 114199 112611 110453 107589 104687 102289 100352
53767A00352j696j449j282j561k266k824k738k086j328p91n09l90l78m92p13r67
$$ 100352 98656 97207 95925 94364 92098 89274 86536 84450 83122 82331 81822 81432 81054 80562 79849 78882
53751G8882j188j360j415j216q24o04q94j497j797j368l75O36J141R08J54n71
$$ 78882 77694 76334 74919 73703 72879 72275 71381 69884 68087 66719 66344 66980 68121 69029 69183 68612
53735F8612q33o88n00m58n23o44p26m62L17J165J396R81O26P73J052R58N89L08
$$ 68612 67779 67091 66591 66133 65610 64966 64240 63778 64095 65260 66656 67637 68263 69036 70088 71046 71635 71943
53717G1943J14j53k50K92J384K223K115J236M83N83J403K099J990J216M11j17
$$ 71943 72057 71904 71654 71946 73330 75553 77668 78904 79387 79970 81373 83472 85462 86678 87089 86972
53701H6972n51r16p86J34J382K116K007J460J063J078J468K052K529K547J943
$$ 86972 86421 85505 84719 84853 86235 88351 90358 91818 92881 93959 95427 97479 100008 102555 104498
53686A04498R89K80K11N30N81O6n23m68L03J218J819K142K286K028J147p2r16
$$ 104498 105487 105767 105978 106508 107089 107155 106632 106164 106467 107685 109504 111646 113932 115960 117107 117035 116119
53669A16119q74j25N65M91k86j027j191j032j029j010m47N73J326J471J341J138
$$ 116119 115245 115120 115685 116176 115890 114863 113672 112640 111611 110601 110154 110727 112053 113524 114865 116003
53653A16003O10r8k05N29J048L36j034j544p17M01P12K16m15o90m86N5N36N62
$$ 116003 116613 116515 116310 116839 117887 118223 117189 115645 114928 115329 116041 116257 115842 115152 114666 114721 115257 115819
53635A15819K15jK39P60J231J447J259N93k21n15N0J031J619J414P71L93O46J147
$$ 115819 116034 116033 116272 117032 118263 119710 120969 121562 121341 120826 120876 121907 123526 124940 125711 126104 126750 127897
53617A27897J166N20r7N6Q28J446J613J774K254K712K702K307J906J662J639K025
$$ 127897 129063 129583 129486 129542 130370 131816 133429 135203 137457 140169 142871 145178 147084 148746 150385 152410
53601A52410K775L227K703J449N71P81J656K307K444K449K624K782K608K091J472
$$ 152410 155185 158412 161115 162564 163135 163916 165572 167879 170323 172772 175396 178178 180786 182877 184349
53586A84349J009Q94J186J600J620J033K80j0K19M65L29j46p51j312j550j215
$$ 184349 185358 186252 187438 189038 190658 191691 191971 191961 192180 192645 192974 192828 192077 190765 189215 188000
53570A88000n53k69o65j185j130n79k04l82q42j156j221j266j564k111k437j980
$$ 188000 187447 187178 186513 185328 184198 183619 183415 183033 182191 181035 179814 178548 176984 174873 172436 170456
53554A70456q01L40Q53R13Q92O06k68j291j504n53Q97J898J920R95k94r84m91
$$ 170456 169655 169995 170848 171761 172653 173259 172991 171700 170196 169643 170540 172438 174358 175353 175059 174075 173584
53537A73584O65J439J547J608J943K074J693J331J621K403L117L591L902L850
$$ 173584 174249 175688 177235 178843 180786 182860 184553 185884 187505 189908 193025 196616 200518 204368
53523B04368L230K457K308L048M242N251N673N433M937M949N935P508Q867R672
$$ 204368 207598 210055 212363 215411 219653 224904 230577 236010 240947 245896 251831 259339 268206 277878
53509B77878J0182J0615J0850J0686J0149R538R427J0405J2412J4472J5552J5681
$$ 277878 288060 298675 309525 320211 330360 339898 349325 359730 372142 386614 402166 417847
53497D17847J5733J6172J6608J6654J6574J6707J6834J6620J6249J6099J6045
$$ 417847 433580 449752 466360 483014 499588 516295 533129 549749 565998 582097 598142
53486E98142J5675J5110J4986J5542J6264J6651J6852J7208J7481J7033J5790
$$ 598142 613817 628927 643913 659455 675719 692370 709222 726430 743911 760944 776734
53475G76734J4475J3783J3564J3132J2218J1391J1444J2508J3797J4303J3663
$$ 776734 791209 804992 818556 831688 843906 855297 866741 879249 893046 907349 921012
53464I21012J2323J0901R547Q149O833N849M947L466J259r74k700m419o777r211
$$ 921012 933335 944236 953783 961932 968765 974614 979561 983027 984286 983312 980612 976193 969416 960205
53450I60205j0369r951r216r348j0100j0560j0583j0739j1308j2057j2797j3491
$$ 960205 949836 939885 930669 921321 911221 900661 890078 879339 868031 855974 843177 829686
53438H29686j3905j3772j3321j3109j3268j3495j3722j4200j4734j4468j2833
$$ 829686 815781 802009 788688 775579 762311 748816 735094 720894 706160 691692 678859
53427F78859j0323p969o299n181m426m034l827l294k081n57M64O40O15J328K835
$$ 678859 668536 660567 654268 649087 644661 640627 636800 633506 631425 630868 631332 631972 632587 633915 636750
53412F36750M203M676M616M967O116P710R342J0858J2140J3095J3916J4805J5514
$$ 636750 640953 645629 650245 655212 661328 669038 678380 689238 701378 714473 728389 743194 758708
53399G58708J5653J5502J5889J7148J8892K0913K3445K6237K8224K8846K8985
$$ 758708 774361 789863 805752 822900 841792 862705 886150 912387 940611 969457 998442
53388I98442K9867L1458L2856L3777L4778L6135L7464L8487L9302L9797L9624
$$ 998442 1028309 1059767 1092623 1126400 1161178 1197313 1234777 1273264 1312566 1352363 1391987
53377A391987L8931L8398L8224L7808L6767L5572L4719L3802L2071K9582K7206
$$ 1391987 1430918 1469316 1507540 1545348 1582115 1617687 1652406 1686208 1718279 1747861 1775067
53366A775067K5583K4482K3185K1124J8178J4666J1103P956N430L331Q69l024
$$ 1775067 1800650 1825132 1848317 1869441 1887619 1902285 1913388 1921344 1926774 1930105 1930974 1927950
53354A927950q710j5158k0821k5260k9238l3085l5868l6756l6406l6168l6439
$$ 1927950 1919240 1904082 1883261 1858001 1828763 1795678 1759810 1723054 1686648 1650480 1614041
53343A614041l6649l6499l6217l5720l4567l2817l1128k9829k8712k7889k7955
$$ 1614041 1577392 1540893 1504676 1468956 1434389 1401572 1370444 1340615 1311903 1284014 1256059
53332A256059k8883k9627k9382k8572k7994k7599k6854k5774k4721k3476k1568
$$ 1256059 1227176 1197549 1168167 1139595 1111601 1084002 1057148 1031374 1006653 983177 961609
53321I61609j9349j7731j6703j5072j2174r100p521p820q993j0098j1004j1810
$$ 961609 942260 924529 907826 892754 880580 871480 863959 856139 847146 837048 826044 814234
53309H14234j2286j2177j1614j0903j0075q964p602o303n411n006m816m381l391
$$ 814234 801948 789771 778157 767254 757179 748215 740613 734310 728899 723893 719077 714696 711305
53296G11305j981n79N82J677K950M367N784P159Q430R334R797J0250J1176J2423
$$ 711305 709324 708745 709327 711004 713954 718321 724105 731264 739694 749028 758825 769075 780251 792674
53282G92674J3493J4409J5708J7321J8277J7958J7114J6935J7455J7609J6731
$$ 792674 806167 820576 836284 853605 871882 889840 906954 923889 941344 958953 975684
53271I75684J5262J3949J2999J2252J1502J0428Q639O215L821J926K06j817l859
$$ 975684 990946 1004895 1017894 1030146 1041648 1052076 1060715 1066930 1070751 1072677 1072883 1071066 1067207
53258A067207n147n647o394q341j1139j3469j4585j5080j6022j7552j8879j9492
$$ 1067207 1062060 1056413 1050019 1041678 1030539 1017070 1002485 987405 971383 953831 934952 915460
53246I15460j9850k0547k1333k1499k0974k0342j9824j8894j7184j5239j4088
$$ 915460 895610 875063 853730 832231 811257 790915 771091 752197 735013 719774 705686
53235G05686j4239j5289j6288j6441j5761j5108j5311j6205j6851j6679j5986
$$ 705686 691447 676158 659870 643429 627668 612560 597249 581044 564193 547514 531528
53224E31528j5214j4424j3638j3112j2830j2177j0581q178n589l435k366k937
$$ 531528 516314 501890 488252 475140 462310 450133 439552 431374 425785 422350 419984 417047
53212D17047m872o904p913p955p697p390p044p125q101r510j0362j0437j0351
$$ 417047 412175 405271 397358 389403 381706 374316 367272 360147 352046 342536 332174 321737 311386
53199C11386j0376j0066r189q113p132o208n593n794o577o843n985m727m064m101
$$ 311386 301010 290944 281755 273642 266510 260302 254709 248915 242338 235495 229510 224783 220719 216618
53185B16618m495n293o498p306o835n394m202l817l665l145k483k245k551l073
$$ 216618 212123 206830 200332 193026 186191 180797 176595 172778 169113 165968 163485 161240 158689 155616
53171A55616l401l234k510j569j027j214j890k510k649k224j529j076j111j310
$$ 155616 152215 148981 146471 144902 143875 142661 140771 138261 135612 133388 131859 130783 129672 128362
53157A28362j263j124j391k016k302j890j328j297j620j607j074n16l25l86m72
$$ 128362 127099 125975 124584 122568 120266 118376 117048 115751 114131 112524 111450 110934 110609 110223 109751
53142A09751m81k71K67Q20Q17K92L5N26J167J132N52J55J3n00j447k014j708j070
$$ 109751 109270 108999 109266 110086 110903 111195 111230 111756 112923 114055 114607 114762 114775 114275 112828 110814 109106 108036
53124A08036p41n14K3M29n2j172j778j222q4O54N68r7q18j095q21m82o01r78r21
$$ 108036 107295 106781 106804 107233 107181 106009 104231 103009 102925 103579 104147 104050 103232 102137 101316 100834 100233 99255 98334
53105I8334l04J42j55q37j202j137j019j010r55q41q48r67q95m20K60O63M55k08
$$ 98334 98030 98172 98017 97180 95978 94841 93822 92812 91857 91016 90168 89201 88306 87886 88146 88809 89264 89056
53087H9056p31o29m9L70K42j64l92l69l44l97l29M3N84Q53M60m82j250j079J8
$$ 89056 88325 87696 87647 88017 88259 88095 87703 87334 86990 86593 86264 86307 86891 87744 88204 87722 86472 85393 85411
53068H5411J218J697J337N46k32p12p10k69K49M30J51m03r22j109q57l99r2MJ54
$$ 85411 86629 88326 89663 90209 89977 89265 88555 88286 88535 88965 89116 88713 87791 86682 85825 85426 85334 85338 85492
53049H5492M07M57J95O1M55J111J428J250R03N84K27p8J9N97J207J326R32M40
$$ 85492 85899 86356 86551 86612 87067 88178 89606 90856 91759 92343 92570 92492 92511 93108 94315 95641 96573 97013
53031I7013K19L02N13P38R47J012P07Q0l43l2Q74J689K015K118K384K775L026
$$ 97013 97232 97534 98047 98785 99732 100744 101451 101531 101188 101156 102030 103719 105734 107852 110236 113011 116037
53014A16037K958K417J299l4p71n64m0J5l03l55n7K6l65p83p57l63M7K92M16N72
$$ 116037 118995 121412 122711 122677 121906 121342 121302 121317 121014 120659 120602 120628 120263 119480 118723 118360 118407 118699 119115 119687
52994A19687R07J299J278N72l49p24n08m24q81j400j351q40m76m61l79R5O42O60
$$ 119687 120594 121893 123171 123743 123394 122670 122162 121738 120857 119457 118106 117266 116790 116329 115950 116045 116687 117347
52976A17347J42j58L40J097R97j15j039p42L33J077J288J525J779J404M16k56
$$ 117347 117489 117331 117671 118768 119765 119650 118611 117869 118202 119279 120567 122092 123871 125275 125691 125435
52960A25435j11K32J04k72m63o21r21q10K53J724K455K106J367R18P74O80N47
$$ 125435 125324 125556 125660 125388 124925 124304 123383 122573 122826 124550 127005 129111 130478 131396 132170 132850 133397
52943A33397L23r3o12r62r99q53p32p37q00p22l46J44L30Q9k18l14m08o63p36
$$ 133397 133720 133627 133015 132053 131054 130201 129469 128732 127932 127210 126864 127008 127338 127427 127209 126895 126487 125824 125088
52924A25088l14J55m8p79j080m32O03J142R34L12k81n80n74n62q12j115r60k84
$$ 125088 124774 124929 124881 124102 123022 122590 123193 124335 125269 125581 125300 124720 124146 123584 122772 121657 120697 120413
52906A20413L37M46K32P0q7m83r90j227j086p43k66L68Q83Q12J43m74m50J9K14
$$ 120413 120750 121196 121428 121498 121411 120928 119938 118711 117625 116882 116616 116984 117867 118679 118822 118348 117898 117917 118131
52887A18131j48n52l70K77O63M16L6K37R79J457J074J74l68r1O49J148J099Q54
$$ 118131 117983 117431 117061 117338 118001 118417 118453 118690 119669 121126 122200 122374 122006 121915 122564 123712 124811 125665
52869A25665R70J565K097J892Q70l93j234j442j276j105j170j476j847k060j999
$$ 125665 126635 128200 130297 132189 133059 132666 131432 129990 128714 127609 126439 124963 123116 121056 119057
52854A19057j688j217p54n59p96j295j706j895k040k256k414k361k155j927j680
$$ 119057 117369 116152 115398 114839 114043 112748 111042 109147 107107 104851 102437 100076 97921 95994 94314
52839I4314j409j167q91l82K97O52K72n46j062r04l63L1k5m99j086j345j067n51
$$ 94314 92905 91738 90847 90465 90762 91414 91686 91140 90078 89174 88811 88842 88817 88318 87232 85887 84820 84269
52821H4269k42j46R7N35P35M30m7k13o2P0k0k93o40q27n23L24J193J453J064N64
$$ 84269 84027 83881 83978 84513 85248 85678 85631 85418 85356 85426 85406 85113 84473 83646 83123 83447 84640 86093 87157 87721
52801H7721M15N47O47N45L14J38J13J35l3m50q57r70p62l73Q9M23K50n17j269
$$ 87721 88136 88683 89330 89875 90189 90327 90440 90575 90542 90092 89235 88265 87503 87130 87219 87642 87892 87375 86106
52782H6106j209k86P72J390J636J743J613J121M96J20J18L92P99J124J087O21
$$ 86106 84897 84611 85383 86773 88409 90152 91765 92886 93382 93502 93620 94012 94811 95935 97022 97643
52766I7643Pm85p92q58n34K5K50j42o11l90M91J207J114L36n44j051j013n29J28
$$ 97643 97650 97165 96373 95515 94981 95006 95256 95114 94503 94113 94604 95811 96925 97261 96717 95666 94653 94124 94252
52747I4252P13J155J420J374R96O15O42J087J597J833J708J301Q90Q62J286J649
$$ 94252 94965 96120 97540 98914 99910 100525 101167 102254 103851 105684 107392 108693 109583 110445 111731 113380
52731A13380J371N45j68l01J07Q43J628J968J484N35O3M94J217J376Q17No49j005
$$ 113380 114751 115296 115128 114827 114934 115777 117405 119373 120857 121392 121455 121949 123166 124542 125359 125364 124715 123710
52713A23710j021p31k53L25R73J446J322N44l22o46l65J63O55R13O53j90j042
$$ 123710 122689 121958 121705 122030 123003 124449 125771 126315 125993 125347 124982 125145 125800 126713 127366 127176 126134
52696A26134j139m61J90J83k16l84j76P5K90Q22J777K599K622J942J273R84O50
$$ 126134 124995 124534 124724 124907 124691 124307 124131 124206 124496 125318 127095 129694 132316 134258 135531 136515 137165
52679A37165j83j239j852j909j888k111k388k476k443k407k325k209k194k219
$$ 137165 136982 135743 133891 131982 130094 127983 125595 123119 120676 118269 115944 113735 111541 109322
52665A09322k006j517j128j066j032p22l32k17l18l61l93o29r23q95n43k33n9
$$ 109322 107316 105799 104671 103605 102573 101851 101519 101302 100984 100623 100230 99601 98678 97783 97240 97007 96948
52648I6948K40O43O69J07m34j89Q04J759K100J966J775J632J390R89M92r6p39
$$ 96948 97188 97831 98500 98607 98173 97984 98788 100547 102647 104613 106388 108020 109410 110399 110891 110795 110056
52631A10056j144j013n36k60l25k64J72M26n8q92j245j046q78p69j04J060J640
$$ 110056 108912 107899 107363 107103 106778 106514 106686 107112 107054 106162 104917 103871 102993 102224 102120 103180 104820
52614A04820J025O2j81J39K32R1L19Q73J076P51L81J79n7q7P13K126K891K259
$$ 104820 105845 105907 105726 105865 106097 106188 106507 107380 108456 109207 109588 109767 109710 109623 110336 112462 115353 117612
52596A17612R80K15Q9J9r6J25O64R87Q13L97l8n94j309j885k035j849j620j463
$$ 117612 118592 118807 118896 118915 118819 118944 119608 120595 121408 121805 121767 121173 119864 117979 115944 114095 112475 111012
52578A11012j256q78l58J51M51L69j49r71j773k167j964j338o79k87j61q1J57
$$ 111012 109756 108878 108520 108671 109122 109491 109342 108371 106598 104431 102467 101129 100450 100163 100002 99921 100078
52561A00078N07O14J45p58j475j571j318j240j300r42j1Q61J003N00k8j63P4M41
$$ 100078 100585 101199 101344 100586 99111 97540 96222 94982 93682 92740 92729 93590 94593 95093 95065 94902 94976 95417
52543I5417O28K68p08j728j947j143l4M84K98O0L43R97J395J139L43n79j260j519
$$ 95417 96045 96313 95605 93877 91930 90787 90753 91237 91535 91595 91938 92935 94330 95469 95812 95233 93973 92454
52525I2454j370r88n99l28k39l61n42l98K49Q75O66m19j393j326l99M71O57J31
$$ 92454 91084 90096 89497 89169 88930 88569 88027 87629 87878 88753 89419 89000 87607 86281 85882 86353 87010 87141
52507H7141r06k075k746k501j645p88q8N74R59P38L51O64J685K415K216J488P56
$$ 87141 86235 84160 81414 78913 77268 76480 76392 76966 77925 78663 79014 79678 81363 83778 85994 87482 88238
52490H8238l7q04q55P1J026R27J8o66q18r32j143j095q36q14q48r8J545K883K811
$$ 88238 88201 87397 86542 86613 87639 88566 88584 87918 87100 86168 85025 83930 83094 82280 81432 81334 82879 85762 88573
52471H8573J653N73R1k17p83j397j563j090l30J65J20k22m34m31m64o81r53j169
$$ 88573 90226 90799 90890 90673 89890 88493 86930 85840 85510 85675 85795 85573 85139 84708 84244 83563 82610 81441
52453H1441j352j391j010k64K85K14j23J3P68J509J592J076M70J16k8n2Q5L65
$$ 81441 80089 78698 77688 77424 77709 77923 77800 77813 78581 80090 81682 82758 83228 83344 83316 83264 83349 83714
52435H3714N14K66k33n13l27Q6L93N87Q25J001Q36L44p4o5L25P62R54Q25N51L88
$$ 83714 84228 84494 84261 83748 83421 83507 83900 84487 85312 86313 87149 87493 87419 87354 87679 88441 89395 90220 90771 91159
52415I1159L92L25k0m89p38o49l38J28O59R22O17J9k37j4J71Kr9L10R26J190J151
$$ 91159 91551 91876 91856 91367 90629 89980 89642 89770 90429 91351 91968 91987 91750 91736 91907 91909 91810 92120 93046 94236 95387
52394I5387J253J420J035m9j086j256n85K46O83O81N04M16N02O30O53O43P72Q99
$$ 95387 96640 98060 99095 99046 97960 96704 96119 96365 97048 97729 98233 98649 99151 99781 100434 101077 101849 102748
52376A02748O22r5n80j10J180K416K922K756K288J663R23L69M02J041J841K305
$$ 102748 103370 103275 102695 102585 103765 106181 109103 111859 114147 115810 116733 117102 117504 118545 120386 122691
52360A22691K228J723J067N29J86n9j49L17J533K801K930J624L0n12K0O06O79
$$ 122691 124919 126642 127709 128238 128424 128365 128216 128533 130066 132867 135797 137421 137451 136939 136959 137565 138244
52343A38244O79J094J703K073K218K350K363K050J579J292J246J373J830K729
$$ 138244 138923 140017 141720 143793 146011 148361 150724 152774 154353 155645 156891 158264 160094 162823
52329A62823L674M199M563N444O762P552P272O555O228O183N881N496N731O692
$$ 162823 166497 170696 175259 180703 187465 195017 202289 208844 215072 221255 227136 232632 238363 245055
52315B45055P750Q586R625J1124J2540J3173J3038J2703J2542J2589J2831J3219
$$ 245055 252805 261391 271016 282140 294680 307853 320891 333594 346136 358725 371556 384775
52303C84775J3572J3794J4063J4489J4727J4403J3770J3441J3494J3349J2647
$$ 384775 398347 412141 426204 440693 455420 469823 483593 497034 510528 523877 536524
52292E36524J1712J0963J0269R197P629N867M392L620L556L466K299j18k650m013
$$ 536524 548236 559199 569468 578665 586294 592161 596553 600173 603729 607195 609494 609376 606726 602713
52278F02713m127l910l938l944l567k930k349j948j791j939k147j918j051Q8J096
$$ 602713 598586 594676 590738 586794 583227 580297 577948 576000 574209 572270 570123 568205 567154 567242 568338
52263E68338J965K807L529M145N056O585Q397R820J0641J1217J1849J2427J2724
$$ 568338 570303 573110 576639 580784 585840 592425 600822 610642 621283 632500 644349 656776 669500
52250F69500J2644J2146J1270J0365R943J0150J0542J0579J0059R077P775O373
$$ 669500 682144 694290 705560 715925 725868 736018 746560 757139 767198 776275 784050 790423
52238G90423N140M070K763R40j063k586l413l925m392m563m176l657l836m953
$$ 790423 795563 799633 802396 803336 802273 799687 796274 792349 787957 783394 779218 775561 771725 766772
52224G66772o269o855o532n840n314n091n176n570o081o322o168n893n625m959
$$ 766772 760503 753648 747116 741276 735962 730871 725695 720125 714044 707722 701554 695661 690036 685077
52210F85077l568j963j041r62j005o73l41m76p37l87O50J710K199K091J591R00
$$ 685077 681509 679546 678505 677543 676538 675865 675524 675048 674311 673924 674574 676284 678483 680574 682165 683065
52194F83065L37K80P35J205J221Q48N25N02O52O56L02l52r66j189j056j040j538
$$ 683065 683402 683682 684417 685622 686843 687691 688216 688718 689370 690026 690328 689976 689010 687821 686765 685725 684187
52177F84187k397l053l156k921k824l022l233l183l061l312l941m356m070l394
$$ 684187 681790 678737 675581 672660 669836 666814 663581 660398 657337 654025 650084 645728 641658 638264
52163F38264l023l136l248l013k667k529k550k547k554k558k251j512q95j102
$$ 638264 635241 632105 628857 625844 623177 620648 618098 615551 612997 610439 608188 606676 605781 604679
52149F04679k078l042l401l179k602j841j265j344k024k592k496k022j797j935
$$ 604679 602601 599559 596158 592979 590377 588536 587271 585927 583903 581311 578815 576793 574996 573061
52135E73061j999j659j033m41j54k39m54l38L33J237J913K331K773L291L703M118
$$ 573061 571062 569403 568370 567929 567775 567536 567082 566744 567077 568314 570227 572558 575331 578622 582325 586443
52119E86443M982O413P854Q688Q982R308R993J0861J1645J2381J3312J4503J5694
$$ 586443 591425 597838 605692 614380 623362 632670 642663 653524 665169 677550 690862 705365 721059
52106G21059J6516J6807J6757J6749J7056J7655J8215J8219J7274J5476J3419
$$ 721059 737575 754382 771139 787888 804944 822599 840814 859033 876307 891783 905202
52095I05202J1679J0309R044P882P018O242M914K887R59n8m78j375l224n439p248
$$ 905202 916881 927190 936234 944116 951134 957376 962290 965177 966136 966078 965600 964225 961001 955562 948314
52080I48314q432r055r042q467p812p523p479p354p161p061o756n730m105k639
$$ 948314 939882 930827 921785 913318 905506 897983 890504 883150 875989 868928 862172 856442 852337 849698
52066H49698j670n86J236L352M697M985N094N909P263Q308Q621Q493Q307Q127
$$ 849698 848028 847442 848678 852030 856727 861712 866806 872715 879978 888286 896907 905400 913707 921834
52052I21834P930P816P706P219O181N037M336L911L156K073J381J303Q76r69l883
$$ 921834 929764 937580 945286 952505 958686 963723 968059 971970 975126 977199 978580 979883 980759 979790 975907
52037I75907o360p471p821q578j0040j1451j1991j1713j1444j1881j2807j3348
$$ 975907 969547 962076 954255 945677 935637 924186 912195 900482 889038 877157 864350 851002
52025H51002j3055j2525j2675j3585j4486j4782j4576j4150j3491j2589j1823
$$ 851002 837947 825422 812747 799162 784676 769894 755318 741168 727677 715088 703265
52014G03265j1638j2066j2789j3433j3713j3506j3020j2678j2635j2734j2970
$$ 703265 691627 679561 666772 653339 639626 626120 613100 600422 587787 575053 562083
52003E62083j3565j4343j4637j4195j3772j4168j5083j5537j5177j4440j3629
$$ 562083 548518 534175 519538 505343 491571 477403 462320 446783 431606 417166 403537
51992D03537j2664j1747j1409j1710j2045j2042j1953j1830j0984q939o432m820
$$ 403537 390873 379126 367717 356007 343962 331920 319967 308137 297153 288214 281782 276962
51980B76962m647n335o130o786p304p571p435o922o273n859o017o690p272p058
$$ 276962 272315 266980 260850 254064 246760 239189 231754 224832 218559 212700 206683 199993 192721 185663
51966A85663n978m629l588k942k629k819l595m382m266l032j573r48j253j738
$$ 185663 179685 175056 171468 168526 165897 163078 159483 155101 150835 147803 146230 145282 144029 142291
51952A42291j867j785j712j473r02k57R8J76J57o2n92j087j083p54q09j452j978
$$ 142291 140424 138639 136927 135454 134552 134295 134393 134569 134726 134664 134072 132985 131902 131148 130339 128887 126909
51935A26909j645o28J80J63m30q64o66k0N78Q68R01O93K42j46J7N28M48o87k036
$$ 126909 125264 124636 124816 124979 124549 123685 123019 122999 123577 124445 125346 126039 126281 126135 126152 126680 127128 126441 124405
51916A24405k517k246k032j886j143N8O12M6p99j103j086j190j202q43n25o84
$$ 124405 121888 119642 117610 115724 114581 114639 115251 115297 114498 113395 112309 111119 109917 109074 108549 107865
$$ [...]
##END NTUPLES=NMR SPECTRUM
##END=
