##TITLE=NES1049_872015078_9268765_7xj5IxsP2y
##JCAMPDX= 6.0         $$ Bruker NMR JCAMP-DX V2.0
##DATA TYPE= NMR SPECTRUM
##DATA CLASS= NTUPLES
##ORIGIN= BRUKER
##OWNER= Administrator
$$ 1.72 TOPSPIN		Version 2.1
$$ 2015-07-11 16:50:50.300 -0700  Administrator@X
$$ Compression mode = diff/dup
##.OBSERVE FREQUENCY= 400.02188249412
##.OBSERVE NUCLEUS= ^1H
##.ACQUISITION MODE= SIMULTANEOUS (DQD)
##.ACQUISITION SCHEME= undefined
##.AVERAGES= 8
##.DIGITISER RES= 22
##SPECTROMETER/DATA SYSTEM= spect
##.PULSE SEQUENCE= zg30
##.SOLVENT NAME= COFFEE_meoh
##.SHIFT REFERENCE= INTERNAL, COFFEE_meoh, 1, 14.98509
##AUDIT TRAIL= $$ (NUMBER, WHEN, WHO, WHERE, PROCESS, VERSION, WHAT)
$$ ##TITLE= Audit trail, TOPSPIN		Version 2.1
$$ ##JCAMPDX= 5.01
$$ ##ORIGIN= Bruker BioSpin GmbH
$$ ##OWNER= Administrator
$$ $$ E:\/data/COFFEE/nmr/NES1049_872015078_9268765_7xj5IxsP2y/20/pdata/1/auditp.txt
$$ ##AUDIT TRAIL=  $$ (NUMBER, WHEN, WHO, WHERE, PROCESS, VERSION, WHAT)
(   1,<2015-07-11 16:50:42.644 -0700>,<Administrator>,<X>,<go>,<TOPSPIN 2.1>,
      <created by zg
	started at 2015-07-11 16:49:36.956 -0700,
	POWCHK enabled, PULCHK disabled,
       configuration hash MD5:
       21 0F 79 D6 B3 7B B4 F6 88 20 88 DB 03 48 BD 9F
       data hash MD5: 64K
       0E 43 E4 D8 06 FF 19 73 A6 92 00 51 D0 30 59 27>)
(   2,<2015-07-11 16:50:46.222 -0700>,<Administrator>,<X>,<proc1d>,<TOPSPIN 2.1>,
      <Start of raw data processing
       efp LB = 0 FT_mod = 6 PKNL = 1 PHC0 = 0 PHC1 = 0 SI = 32K 
       data hash MD5: 32K
       44 98 36 94 27 73 D6 07 9C CB B2 CE 8D D4 E7 29>)
(   3,<2015-07-11 16:50:46.519 -0700>,<Administrator>,<X>,<proc1d>,<TOPSPIN 2.1>,
      <pk PHC0 = 92.63123 PHC1 = 0 
       data hash MD5: 32K
       12 3F 69 3A C6 F4 F2 C5 FD CC 15 D5 A2 3C C1 4D>)
(   4,<2015-07-11 16:50:46.628 -0700>,<Administrator>,<X>,<proc1d>,<TOPSPIN 2.1>,
      <abs ABSG = 1 
       data hash MD5: 32K
       83 86 5D 34 71 70 F5 85 D5 21 51 25 B5 71 C2 AF>)
(   5,<2015-07-11 16:50:46.691 -0700>,<Administrator>,<X>,<proc1d>,<TOPSPIN 2.1>,
      <abs ABSG = 2 
       data hash MD5: 32K
       A3 10 92 36 FC DC 59 F0 4B 36 0F 7E 5F 47 05 1B>)
(   6,<2015-07-11 16:50:46.753 -0700>,<Administrator>,<X>,<proc1d>,<TOPSPIN 2.1>,
      <abs ABSG = 3 
       data hash MD5: 32K
       A2 2A 5A B5 C0 37 0F 12 8C AD 8D 25 33 3B C9 6C>)
(   7,<2015-07-11 16:50:46.816 -0700>,<Administrator>,<X>,<proc1d>,<TOPSPIN 2.1>,
      <abs ABSG = 4 
       data hash MD5: 32K
       90 27 7C AD A2 F4 DB A5 23 D7 AF 1A B9 53 F5 64>)
(   8,<2015-07-11 16:50:46.878 -0700>,<Administrator>,<X>,<proc1d>,<TOPSPIN 2.1>,
      <abs ABSG = 5 
       data hash MD5: 32K
       78 A9 67 C4 3A 8C 12 B8 AE 48 1C C6 1B 07 D9 44>)
$$ ##END=
$$ 
$$ $$ hash MD5
$$ $$ 03 8E 8E ED FB 7D D2 07 22 D0 9B 23 F4 56 FE 58
##$RELAX= 
##$RELAX= 
##$RELAX= 
##$RELAX= 
##$RELAX= 
##$RELAX= 
##$RELAX= 
$$ Bruker specific parameters
$$ --------------------------
##$DU= <E:\>
##$EXPNO= 20
##$NAME= <NES1049_872015078_9268765_7xj5IxsP2y>
$$ [...]
150 150 150 150 150 150 150 150
##$TP07= 0
##$TPNAME0= <>
##$TPNAME1= <>
##$TPNAME2= <>
##$TPNAME3= <>
##$TPNAME4= <>
##$TPNAME5= <>
##$TPNAME6= <>
##$TPNAME7= <>
##$TPOAL= (0..7)
0.5 0.5 0.5 0.5 0.5 0.5 0.5 0.5
##$TPOFFS= (0..7)
0 0 0 0 0 0 0 0
##$TUNHIN= 0
##$TUNHOUT= 0
##$TUNXOUT= 0
##$USERA1= <user>
##$USERA2= <user>
##$USERA3= <user>
##$USERA4= <user>
##$USERA5= <user>
##$V9= 5
##$VALIST= <valist>
##$VCLIST= <CCCCCCCCCCCCCCC>
##$VD= 0
##$VDLIST= <DDDDDDDDDDDDDDD>
##$VPLIST= <PPPPPPPPPPPPPPP>
##$VTLIST= <TTTTTTTTTTTTTTT>
##$WBST= 2048
##$WBSW= 25
##$XGAIN= (0..3)
0 0 0 0
##$XL= 0
##$YL= 0
##$YMAX_a= 631823
##$YMIN_a= -529336
##$ZGOPTNS= <>
##$ZL1= 120
##$ZL2= 120
##$ZL3= 120
##$ZL4= 120
##$ABSF1= 14.98509
##$ABSF2= -5.573092
##$ABSG= 5
##$ABSL= 3
##$ALPHA= 0
##$AQORDER= 0
##$ASSFAC= 0
##$ASSFACI= 0
##$ASSFACX= 0
##$ASSWID= 0
##$AUNMP= <proc_prof1d_extract_pilot.lims>
##$AXLEFT= 0
##$AXNAME= <>
##$AXNUC= <1H>
##$AXRIGHT= 0
##$AXTYPE= 0
##$AXUNIT= <>
##$AZFE= 0.1
##$AZFW= 0.1
##$BCFW= 0
##$BC_mod= 0
##$BYTORDP= 0
##$COROFFS= 0
##$CY= 15
##$DATMOD= 1
##$DC= 0
##$DFILT= <>
##$DTYPP= 0
##$F1P= 0
##$F2P= 0
##$FCOR= 0.5
##$FTSIZE= 32768
##$FT_mod= 6
##$GAMMA= 0
##$GB= 0
##$INTBC= 1
##$INTSCL= 1
##$ISEN= 128
##$LB= 0
##$LEV0= 0
##$LPBIN= 0
##$MAXI= 10000
##$MC2= 0
##$MEAN= 0
##$ME_mod= 0
##$MI= 0
##$NCOEF= 0
##$NC_proc= -8
##$NLEV= 6
##$NOISF1= 0
##$NOISF2= 0
##$NSP= 0
##$NTH_PI= 0
##$NZP= 0
##$OFFSET= 14.98509
##$PC= 1
##$PHC0= 92.63123
##$PHC1= 0
##$PH_mod= 1
##$PKNL= yes
##$PPARMOD= 0
##$PPDIAG= 0
##$PPIPTYP= 0
##$PPMPNUM= 2147483647
##$PPRESOL= 1
##$PSCAL= 4
##$PSIGN= 0
##$PYNMP= <proc.py>
##$REVERSE= no
##$SF= 400.02
##$SI= 32768
##$SIGF1= 0
##$SIGF2= 0
##$SINO= 400
##$SIOLD= 32768
##$SPECTYP= <>
##$SREGLST= <1H.CDCl3>
##$SSB= 0
##$STSI= 32768
##$STSR= 0
##$SW_p= 8223.68421052631
##$SYMM= 0
##$S_DEV= 0
##$TDeff= 65536
##$TDoff= 0
##$TI= <>
##$TILT= no
##$TM1= 0
##$TM2= 0
##$TOPLEV= 0
##$USERP1= <user>
##$USERP2= <user>
##$USERP3= <user>
##$USERP4= <user>
##$USERP5= <user>
##$WDW= 1
##$XDIM= 32768
##$YMAX_p= 440712389
##$YMIN_p= -708404
##$CURPLOT= <Network HP LaserJet P1505>
##$CURPRIN= <$Network HP LaserJet P1505>
##$DFORMAT= <normdp>
##$LAYOUT= <+/1D_H.xwp>
##$LFORMAT= <normlp>
##$PFORMAT= <normpl>
##$SURQMSG= 1
$$ End of Bruker specific parameters
$$ ---------------------------------
##NTUPLES= NMR SPECTRUM
##VAR_NAME=  FREQUENCY,     SPECTRUM/REAL,   SPECTRUM/IMAG
##SYMBOL=    X,             R,               I
##VAR_TYPE=  INDEPENDENT,   DEPENDENT,       DEPENDENT
##VAR_FORM=  AFFN,          ASDF,            ASDF
##VAR_DIM=   32768,         32768,           32768
##UNITS=     HZ,            ARBITRARY UNITS, ARBITRARY UNITS
##FACTOR=    0.250966925370066, 1,           1
##FIRST=     8223.43324360094, 84018,        -73479
##LAST=      0,             -115637,         -246179
##MIN=       0,             -708404,         0
##MAX=       8223.43324360094, 440712389,    0
$$ Real data points
##PAGE= N=1
##DATA TABLE= (X++(R..R)), XYDATA
$$ [...]
19478A64748b929l2402a6557j3899j02645H4850b36377p8611H5952R2096b74360
19466G798c09413H6905c21772h5943C2761k263b19488A18587b06740I7508a53489
19454b12049A10985g6987l07103J83239l1147j20242D2900b98023a06202E7201
19443H2976a70174b3264k8568k8775q5586A29868E1957i3210B03647b09655H5600
19431c5516j07000j26587Q6460A62264b12393E3500b61206P7899Q0727j15434
19421b18014d3598H2832J6077J16113a13591l21470B41702b55407a1355B0416
19410I9581c03658J34659B24654c70085E1729J27286n8825i9064j29353C4060
19399a30909N2295I5720a57419q3450K5171B6571c27683A5121c05390C10001a06624
$$ plain form
19478 164748 -2929 -35331 -16557 -30456 -133101 84850 -236377 -314988 85952 178048 -274360
19466 7798 -309413 86905 -321772 -85943 32761 30498 -219488 118587 -206740 97508 -153489
19454 -212049 110985 -76987 -384090 -200851 -231998 -352240 42900 -298023 -106202 57201
19443 82976 -170174 -23264 -51832 -80607 -166193 129868 51957 -93210 203647 -209655 85600
19431 -35516 -142516 -269103 -182643 162264 -212393 53500 -261206 -183307 -102580 -218014
19421 -218014 -43598 82832 98909 215022 -113591 -435061 241702 -255407 -11355 20416
19410 99581 -303658 -168999 224654 -370085 51729 179015 120190 -99064 -228417 34060
19399 -130909 -78614 95720 -157419 -240869 -215698 26571 -327683 15121 -305390 310001 -106624
19387h4745b2221n4233j9699P323A62785l6733E2790a32094j08399O1686Q1545
19376i7262k08891D4494n738J72782a49833P715k3905g6711H3125e4533j36297
19365a90830R2678k45033i4785F6588J5848J03667c60093c21q0298k51136a55791
19353B9241L40521O8177H2241e1396A62424a52547O5737q6179D9853g0319F5598
19341a65006j89508R7189a08676C1543K67910G8792a22180I6257H731R0616c27535
19329f4706B41984m8630d0610B71348h4454A88612a09256D6791e8930A87750C8372
19317f9889A40297b17250M4877O6082A76069o8822a98960B9065M0472i6755j1969
19306a08724K6267j02692M115E0440R1499E1854c15618B00179a13922j7518r053
$$ plain form
19387 -84745 -22221 -76454 -96153 -88830 162785 126052 52790 -132094 -240493 -178807 -97262
19376 -97262 -306153 44494 38756 211538 -149833 -142118 -166023 -76711 83125 -54533 -190830
19365 -190830 -98152 -343185 -94785 66588 82436 186103 -360093 -321 -80619 -331755 -155791
19353 29241 369762 437939 82241 -51396 162424 -152547 -86810 -172989 49853 -70319 65598
19341 -165006 -354514 -257325 -108676 31543 299453 78792 -122180 96257 8731 99347 -327535
19329 -64706 241984 193354 -40610 271348 -84454 188612 -109256 46791 -58930 187750 38372
19317 -69889 140297 -217250 -172373 -106291 176069 107247 -198960 29065 69537 -96755 -108724
19306 -108724 -82457 -185149 -181034 50440 141939 51854 -315618 200179 -113922 -131440 -140493
19295a40493D0757b8285r1597C5949j4751b27419M6969e5887k28928J03273E6698
19283c53625J50808Q5840a9493m4328b4042A26559a73834n8810h1048q646H7393
19271B53674c55384a60636K0023d959m5803r0431a1961j81127A63428e5229F2435
19259a99818A8624k909a20830A56723a0902D5662L6756c84350A94635p9903b68515
19247c9373K617E1128b70115j72271i341l74363A7969f7258j08899l5616B90757
19235B46390g2384b3113A2392a53858n350P7407A83043D9584b37952H7544r422
19224G8122a01406B3242e0438A203P1566b73279a7103k91603B30918b39614F7034
19212A7971c30257J47572A79927b51976H5501a90392f3005B3887J2597J5480f8978
$$ plain form
19295 -140493 40757 -28285 -119882 35949 21198 -227419 -180450 -55887 -284815 -181542 56698
19283 -353625 -202817 -116977 -19493 -63821 -24042 126559 -173834 -232644 -81048 -89694 87393
19271 253674 -355384 -160636 -140613 -4959 -50762 -141193 -11961 -193088 163428 -55229 62435
19259 -199818 18624 15715 -120830 156723 -10902 45662 82418 -384350 194635 114732 -268515
19247 -39373 -36756 51128 -270115 -442386 -9341 -383704 17969 -67258 -176157 -211773 290757
19235 246390 -72384 -23113 12392 -153858 -159208 -81801 183043 49584 -237952 87544 78122
19224 78122 -101406 23242 -50438 1203 72769 -273279 -17103 -308706 230918 -239614 67034
19212 17971 -330257 -182685 179927 -251976 85501 -190392 -63005 23887 36484 51964 -68978
19200C68065H5060e6185r1266N8344b7495B4949a02202A3320a07601L2674j25272
19189b00199e2545j65028j1680f4052n181A9484a24489B42567d27364e8523j28234
19178a86757j86350B19535i1912q516B6603L11083K6503c8225l33214a62883j13298
19167b76181G1600K06057C9666a2737j8025n8726k41123a52272m184q9384J18456
19156a27384A95716D6786b67194f6222n7388j7064J2444a8848j35073N5800a4656
19144a27824J525b3621A67023a30670F34a84737d2680G8211b5782m1537k9482
19133i6801j33625e0354k15025j62810C39498D8518K36612a03499M0327J0849
19123e2323j36991r6806L4538j783O3614j15360i908r9150L7440j93043L7205
$$ plain form
19200 368065 85060 -56185 -147451 -89107 -27495 24949 -102202 13320 -107601 -74927 -200199
19189 -200199 -52545 -217573 -229253 -64052 -69233 19484 -124489 242567 -427364 -58523 -186757
19178 -186757 -373107 219535 -91912 -100428 26603 337686 364189 -38225 -371439 -162883 -276181
19167 -276181 71600 277657 39666 -12737 -30762 -89488 -330611 -152272 -156456 -245840 -127384
19156 -127384 195716 46786 -267194 -66222 -123610 -140674 -128230 -18848 -153921 -98121 -14656
19144 -127824 -126299 -23621 167023 -130670 634 -184737 -42680 78211 -25782 -67319 -96801
19133 -96801 -230426 -50354 -265379 -428189 339498 48518 285130 -103499 -63172 -52323
19123 -52323 -189314 -286120 -251582 -253365 -189751 -305111 -9908 -109058 -71618 -264661 -227456
19112b27456B7225e5787C5828i1682B07178B131a14757A56221a98345i5017p2794
19101a67811A22887b36571F0206a25664k48756D0722b2971k85194b8882F6192
19090I7308b15533a8962A36761a38729n4812G1689b1391D6375d0111o8291C95747
19078b67957l88344F7068Q3449b8305n8561B8081K33156d42491E2415i9223G752
19066c0030H2973a71797a0479q5112A45320n7482J55509b14971o2230J33934K8709
19055a14558A41337b77313K5644A04217A8841g137j44856F3798g7300n3219m7783
19044a78302C78548b20953G4532b3672k9362I9049D1961R5577a19251j57998A57941
19032d16557g7093b4964q7605k010c5769A62280a6396k66470A84990Q3379d2429
$$ plain form
19112 -227456 27225 -55787 35828 -91682 207178 2131 -114757 156221 -198345 -95017 -167811
19101 -167811 122887 -236571 60206 -125664 -374420 40722 -22971 -308165 -28882 66192
19090 97308 -215533 -18962 136761 -138729 -193541 71689 -21391 46375 -40111 -108402 395747
19078 -267957 -656301 67068 150517 -28305 -86866 28081 261237 -442491 52415 -99223 7752
19066 -30030 82973 -171797 -10479 -95591 145320 87838 243347 -214971 -277201 -143267 -114558
19055 -114558 141337 -277313 -251669 104217 18841 -7137 -151993 63798 -77300 -130519 -178302
19044 -178302 378548 -220953 74532 -23672 -53034 99049 41961 137538 -119251 -277249 157941
19032 -416557 -77093 -24964 -112569 -114579 -35769 162280 -16396 -282866 184990 268369 -42429
19020A01130a64006b9566j36177J1690D2317c43456J43902D4437J33827a5179
19009d9607B30265J08560j35926c85586a33145l5627A45400a6164k7287j22859
18999a66310K7543B74700I2118j4978b8582r0871k37679J48373a02551A79692
18988A94300M0008N8111B295K46894a99636Q377J7998m5044a07330c2982k0875
18977e3857N787r9003A32808a3329A42059a13486D2512Q966b26924J6750k25106
18966d35280J36758i3142A08798B1890O7701k0501g7496n1884B57166f6364A03972
18954b77653F0775L38863A16562c28870a36561j40996A91345c50041E7364c83649
18943I0956d26316g0130a7230G1780K52290D4035h3435m2244A11831a13553k63956
$$ plain form
19020 101130 -164006 -29566 -165743 -154053 42317 -343456 -199554 44437 178264 -15179
19009 -49607 230265 338825 202899 -385586 -133145 -168772 145400 -16164 -43451 -166310
18999 -166310 -138767 274700 92118 77140 -28582 -119453 -357132 -208759 -102551 179692
18988 194300 234308 292419 2295 249189 -199636 -191259 -173261 -218305 -107330 -32982 -53857
18977 -53857 -48070 -147073 132808 -13329 142059 -113486 42512 51478 -226924 -210174 -435280
18966 -435280 -298522 -93142 108798 21890 89591 69090 -77496 -129380 257166 -66364 103972
18954 -277653 60775 399638 116562 -328870 -136561 -277557 191345 -350041 57364 -383649
18943 90956 -426316 -70130 -17230 71780 324070 44035 -83435 -125679 111831 -113553 -377509
18932c77509A89383a0435j94029Q9153B84783B9446a67153d7690a2072D07853
18921b45368a16021A40016E2958D207J86367r3695B7389A1603b68980A73503c4097
18909G3151C2280j3840K0679J07142b02463f1789D18125i3013H6931b1729A6834
18897e7855o1958D4193a00023j34771a04792j89766B5625a71846B86147a60435
18886A00538k0479N0561e4715j88686N7504f7955k22206B09364J04074C9163J02501
18875A41664a70557d8355j44901O6645k53018A46277a23101L0802A65497n4817
18865A10680a2030B58820f7388K9832j33198Q3629l9131A31152b08549C07587
18854b2004m7899A50359a52343B82153o6332I2340b05736b18j6126A55296a05720
$$ plain form
18932 -377509 189383 -10435 -204464 -115311 284783 29446 -167153 -47690 -12072 407853
18921 -245368 -116021 140016 52958 4207 190574 96879 27389 11603 -268980 173503 -34097
18909 73151 32280 18440 39119 146261 -202463 -61789 418125 -93013 86931 -21729 16834
18897 -57855 -119813 44193 -100023 -234794 -104792 -294558 25625 -171846 286147 -160435
18886 100538 80059 130620 -54715 -243401 -185897 -67955 -290161 209364 313438 39163 141664
18875 141664 -170557 -48355 -193256 -126611 -379629 146277 -123101 -92299 165497 110680
18865 110680 -12030 258820 -67388 -37556 -170754 -87125 -126256 131152 -208549 307587
18854 -22004 -69903 150359 -152343 282153 215821 92340 -205736 -218 -16344 155296 -105720
18842C333b74964d5393e263j70031D027g6861o2878A0688L6702q95J74023G2107
18829a98572j540g5408k38464J43815m7574D1184b17835Q7085D05438A17205N5663
18818A72868F3367f791j60851O9495f864A73457d1708A93450L3630C9158J29937
18807A69095d49870g8530o5345A13770a75483a946A33299k2360b94257A0025a78901
18795a41137k3951C1108b02361H0512a59122C14976C563J85281o0597N2540a23011
18783h2220b2049j33688c7413j95483B29131h8268B26536g2806A21426b20224
18772E8860h2187B78965r6955c52034h2523A63847B3084K124g1325G707d2106
18760g1779E2196b38965L0501q548b1259h997k74199a8950l78094h9615l13039
$$ plain form
18842 3333 -274964 -45393 -5263 -175294 4027 -76861 -139739 10688 47390 46495 220518 72107
18829 -198572 -200112 -75408 -313872 -170057 -217631 41184 -217835 -130750 405438 117205 172868
18818 172868 63367 -6791 -167642 -98147 -6864 173457 -41708 193450 227080 39158 169095
18807 169095 -449870 -78530 -143875 113770 -175483 -1946 133299 110939 -294257 10025 -178901
18795 -141137 -165088 31108 -202361 80512 -159122 314976 3563 188844 128247 180787 -123011
18783 -82220 -22049 -155737 -37413 -232896 229131 -88268 226536 -72806 121426 -220224
18772 58860 -82187 278965 182010 -352034 -82523 163847 23084 25208 -71325 7707 -42106
18760 -71779 52196 -238965 -208464 -217012 -21259 -8997 -283196 -18950 -397044 -89615 -402654
18749d02654a56198C4018N811i3921B9349J70962f7864A00164a75773b1838k94188
18738c16026F1310f786j9944p9361k18479J43733A38618a22632A22930B3570R9768
18727A23338a6079r862A66771a64757A82074l7003q339a0396k16035b654B1574
18715I2923k0307d2665A1943e403j60013E2541b64549B95095i0779A05665M50926
18704E56591g8739k46685B0802E279f5873A78978i6756j24852i7376B03246J6080
18693B19326f6466A42270j2232a43787f761k94673H212c8369A15743J4435o3534
18682F6644J5701J29745a6707l7197n8756l25616h5511j06147P4045A13987J19992
18671B33979C0762a7844D1392H163a14422A47421a10852B50522c2574k93452A04787
$$ plain form
18749 -402654 -156198 34018 39829 -93921 29349 200311 -67864 100164 -175773 -21838 -316026
18738 -316026 61310 -6786 -26730 -106091 -324570 -180837 138618 -122632 122930 23570 123338
18727 123338 -16079 -25941 166771 -164757 182074 145071 136732 -10396 -226431 -2654 21574
18715 92923 72616 -42665 11943 -5403 -165416 52541 -264549 295095 -90779 105665 556591
18704 556591 -78739 -325424 20802 5279 -65873 178978 -96756 -221608 -97376 203246 219326
18693 219326 -66466 142270 130038 -143787 -6761 -301434 8212 -38369 115743 130178 66644
18682 66644 82345 212090 -16707 -53904 -112660 -438276 -85511 -191658 -117613 113987 233979
18671 233979 30762 -17844 41392 8163 -114422 147421 -110852 250522 -32574 -326026 104787
18659b4321n5878k17447a31593k2789C9905L2401a27705J9540G1646b00877l3435
18648b34312N6250k8027Q9344j7072A06933j5279a40966o9265g1649B62887a47345
18636a59767P3222p0984A46211K7300a23631N2944k00783K4202A5084e14612b36487
18624f3364B1615d7293j9084k71627a46497A73253K714a27155K4340m850j58777
18613b66442c605j92364l6950q7766D46804i5821j00099b819k72793A98555E5157
18601c26016f8098L0304B30833A6875R3819A9784j742b68434a16582B36679B6043
18589i8126j2002B69281A02313k2347i224j43785c078r0447j63543J05548O0906
18578i0614k2320A25944a02675F2921d5469C586Q937c99241J89356i545A08218
$$ plain form
18659 -24321 -80199 -297646 -131593 -154382 39905 72306 -127705 -108165 71646 -200877 -234312
18648 -234312 -178062 -206089 -116745 -133817 106933 91654 -140966 -210231 -71649 262887 -147345
18636 -159767 -86545 -157529 146211 173511 -123631 -70687 -271470 -247268 15084 -514612 -236487
18624 -63364 21615 -47293 -66377 -338004 -146497 173253 175967 -127155 -102815 -107665 -266442
18613 -266442 -3605 -195969 -232919 -320685 446804 -95821 -195920 -2819 -275612 198555 55157
18601 -326016 -68098 -37794 230833 16875 110694 19784 18042 -268434 -116582 236679 26043
18589 -98126 -110128 269281 102313 79966 -9224 -153009 -3078 -93525 -257068 -151520 -90614
18578 -90614 -112934 125944 -102675 62921 -45469 3586 12523 -399241 -209885 -9545 108218
18566b94394A0409J76811b14962C6161J4117b00634A83547N7496b91468J33966
18556a57502j41191L880C3613a14202A82817N4077d52054H6531N8496d6734A15984
18544a12663I4639g2576j1182b4371j91461D86624a40329L3948A30007A2549a43304
18532B2324K1684b10863A2110a79547b8410j89212O5459D454c3536k69190D8644
18520h4400c607D6197a93051e116q3467B95617b09406M5514A39020b77276a09407
18508B53766b24396C6100i108A5686O4650J37386j00114a10634j79646J30637
18498a59643j76932E7042J21101H231J30085D5738P8758b04395j72258J54491
18488b22162j64042J19087j71131f7865l8099D8905g193j44730L091k67136J84564
$$ plain form
18566 -294394 10409 187220 -214962 36161 50278 -200634 183547 241043 -291468 -157502
18556 -157502 -298693 -294813 33613 -114202 182817 236894 -452054 86531 145027 -46734 115984
18544 -112663 94639 -72576 -83758 -24371 -215832 486624 -140329 -106381 130007 12549 -143304
18532 22324 44008 -210863 12110 -179547 -28410 -217622 -152163 4454 -33536 -302726 48644
18520 -84400 -3607 46197 -193051 -5116 -88583 295617 -209406 -163892 139020 -277276 -109407
18508 253766 -224396 36100 -9108 15686 80336 217722 117608 -110634 -290280 -159643
18498 -159643 -336575 57042 178143 8231 138316 45738 124496 -204395 -376653 -222162
18488 -222162 -386204 -267117 -438248 -67865 -105964 48905 -7193 -151923 -148832 -415968 -231404
18477b31404d7321B31345g796I466a05311j12419E0508i3625j32994I1451J00117
18466A91568J66230A60961a62776j14740f6938l990A5893J4187d1201j3352A40938
18454h6656a7541j84127j20458a03521a6593l6520j68379A24733a8696j09854
18444a28550B3834f6839F9082K18736d0165r4787P409C24262c31433B22749r6808
18433A25941k2615i6268j3781a4896p4773I2025K00291a90544f5780n6785A53727
18421a11046k9773e7415A62666L16080i8775K9882j37473F4593c6961j27070e5543
18409A53722b73226B17209J57299A00340a05021C5503d4403B95295b2911l8983
18399f1894k17837a13699A32857J21729m2371a02446m4567A7163K03395j0877
$$ plain form
18477 -231404 -47321 231345 -7796 9466 -105311 -217730 50508 -93625 -226619 91451 191568
18466 191568 357798 160961 -162776 -277516 -66938 -70928 15893 30080 -41201 -54553 140938
18454 -86656 -17541 -201668 -322126 -103521 -16593 -53113 -221492 124733 -18696 -128550
18444 -128550 23834 -66839 69082 287818 -40165 -134952 -127543 324262 -331433 222749 125941
18433 125941 103326 -96268 -110049 -14896 -89669 92025 292316 -190544 -65780 -122565 153727
18421 -111046 -140819 -57415 162666 478746 -98775 -68893 -206366 64593 -36961 -164031 -55543
18409 153722 -273226 217209 374508 100340 -105021 35503 -44403 295295 -22911 -61894
18399 -61894 -279731 -113699 132857 254586 212215 -102446 -147013 17163 220558 209681
18389B09681D3493j1856b18916B14954I5664D0101K7961c8155H7602a37888c4981
18377B72697g140B75711a7703l14458J15475j94564a173j20376A10517K03908
18367C14425j26187i4237M0840a8783B80732A7658a623E9982L1436a34468J8537
18356a15931J0587B00385Q0052G3856J05758b67169c7902o2634a4559B06943b1448
18344B89747c4578n5282G8296a07049A47760O8904a29147i077k77787d8443k97732
18333c46175H5684b7341r4021a1898j47203f1567B2182J2245e7464h333o7604
18322g5937m5284J177o0454I073g8659B06219c55987A30452a78442g752l10457
18311c18209A25452l9657a9098G6209M4680a74847P2518A37948d84208a52335
$$ plain form
18389 209681 43493 31637 -218916 214954 95664 40101 68062 -38155 87602 -137888 -34981
18377 272697 -7140 275711 -17703 -332161 -216686 -411250 -1173 -121549 110517 314425
18367 314425 188238 -94237 -53397 -18783 280732 17658 -1623 59982 91418 -134468 -115931
18356 -115931 -105344 200385 280437 73856 179614 -267169 -37902 -100536 -14559 206943 -21448
18344 289747 -34578 -89860 78296 -107049 147760 216664 -129147 -9077 -286864 -48443 -346175
18333 -346175 85684 -27341 -121362 -11898 -159101 -61567 22182 34427 -57464 -8333 -75937
18322 -75937 -121221 -120044 -180498 9073 -78659 206219 -355987 130452 -178442 -7752 -318209
18311 -318209 125452 85795 -19098 76209 120889 -174847 -102329 137948 -484208 -152335
18300c70790B10261b32925P0376D3108b02589B85406b52980O9441b8356k37116
18290b65472h4180l0825A74598b25663B26306a1593A91029a99A27268O5016O9444
18279B61728l0115H0961K58356G5836J2411O9034b88398d0075o4314B80906j22023
18268A58883b24558o428C6249K9696A9025J00160b66160F9791K94911c58161a42049
18256D4934R4237D4992g7528k05661k30946i8039n4872H6486a6419C4440a33392
18244i1517a4898G8956A4221d3750n2204l9785A72330l4609b28824k5931A69207
18232B20520H6512k8433c25986F1209O0575j4884a73870o657k8772O0554j86078
18221c34823J56054A70948b96205J31946o5845i149p4050A67316D7885a80527
$$ plain form
18300 -370790 210261 -232925 -162549 43108 -202589 285406 -252980 -183539 -28356 -265472
18290 -265472 -84180 -115005 174598 -225663 226306 -11593 191029 -199 127268 192284 261728
18279 261728 231613 80961 339317 75836 88247 157281 -288398 -40075 -104389 280906 158883
18268 158883 -224558 -230986 36249 65945 19025 119185 -266160 69791 364702 -358161 -142049
18256 44934 139171 44992 -77528 -283189 -514135 -98039 -152911 86486 -16419 34440 -133392
18244 -91517 -14898 78956 14221 -43750 -95954 -135739 172330 137721 -228824 -254755 169207
18232 220520 86512 58079 -325986 61209 121784 106900 -173870 -180527 -209299 -148745 -334823
18221 -334823 -178769 170948 -296205 -164259 -230104 -9149 -83199 167316 47885 -180527
18210B30232b12243A06162e6148B1856G704J25795R0689a3618l02314A7833R5222
18199A13055c22019D6707b82050P5238N758A59731b088k10243r6122e0788J571
18188d9217k42969A7687d2777j89347j1674o5290Q7166Q5123K4427A45870B9572
18176f0912H8356b6675l5698C01190b5624l57158C5786A0602O7090b03817d6079
18164B77846j22578b64853c977C5126Q9496c9811m895C47984b48515a1287C11389
18152a20257K1627k32972B66408A07254b26371B71554A21814a02490j18401j07461
18142c28352a5697m4042F3097a0074I6913B7019h467j07981A13486a67933f5057
18130B46499e8901k90221A758a50258d5445j50893E2694d4415A01096K58985A01285
$$ plain form
18210 230232 -212243 106162 -56148 21856 7704 133499 224188 -13618 -315932 17833 113055
18199 113055 -322019 46707 -282050 -206812 -201054 159731 -2088 -212331 -308453 -50788 -49217
18188 -49217 -292186 17687 -42777 -232124 -243798 -309088 -221922 -136799 -112372 145870 29572
18176 -60912 88356 -26675 -62373 301190 -25624 -382782 35786 10602 77692 -203817 -46079
18164 277846 155268 -264853 -3977 35126 124622 -39811 -44706 347984 -248515 -11287 311389
18152 -120257 -98630 -331602 266408 107254 -226371 271554 121814 -102490 -220891 -328352
18142 -328352 -15697 -59739 63097 -10074 96913 27019 -8467 -116448 113486 -167933 -65057
18130 246499 -58901 -349122 1758 -150258 -45445 -196338 52694 -44415 101096 360081 101285
18118c78499D7654b71067i0648K3929C4073Q4083L55948b43956B2231P9193M6934
18107A48358a40073A83549p9943a04151A23215Q7895h3074j0751C3564J25153
18097A58717k4384b20502e4046B12045b27845c2237D4765N3682b832j72288E3992
18085A77273I967a97296i2119j74033a1300o7316j23581B01023m3589l5330a07820
18073c5594A57172C161J17913l5333J91895H7549e3815I0690e3564H0622B0194
18061a53401g078I6437l4901L31485c99818a99491a0761I7299I052c6620j6638
18050e3258G7600a62467a6356A29114a46608D228a19915h798A34774a25583N8429
18039f7154A82722g5993H2232b30201i9021L6091P945l4590m9904e5558j64317
$$ plain form
18118 -378499 47654 -271067 -90648 -66719 34073 118156 474104 -243956 22231 101424 148358
18107 148358 -140073 183549 103606 -104151 123215 211110 -83074 -93825 33564 158717
18097 158717 134333 -220502 -54046 212045 -227845 -32237 44765 98447 -2832 -175120 53992
18085 177273 9967 -197296 -92119 -266152 -11300 -78616 -202197 201023 157434 122104 -107820
18073 -35594 157172 3161 121074 85741 277636 87549 -53815 90690 -53564 80622 20194
18061 -153401 -7078 96437 61536 393021 -399818 -199491 -10761 97299 9052 -36620 -53258
18050 -53258 77600 -162467 -16356 129114 -146608 4228 -119915 -8798 134774 -125583 -67154
18039 -67154 182722 -75993 82232 -230201 -99021 -62930 -54985 -89575 -139479 -55558 -219875
18028b19875B10620b3262n2475B47277o2437c5491F0225b18625B8815P8881E2325
18016e245j12431B82111g703I4451i7367I2171Q8547e1990n1467J2411j32234
18005b23280C0302K49295b0115B4821p691Q4577J87403d2861a761p5301j67241
17994b44303A11605J58745a51739M6690C78968e0222p5796l73b4259A21146Q1728
17983B02874b95053A24418a95276B09292a97701G1490Q192C2203a76082o6872
17973b42954e9099j34477D0605L0284b04843C36440c21659p9909C741K57241b5018
17961A99384d9447a389k80066D0888d35141b795q3474B89520a77401D7331c1426
17949B44914a31685E0267a78140h6406E4977d17751A63572h1872B31515c46195
$$ plain form
18028 -219875 210620 -23262 -75737 247277 184840 -35491 60225 -218625 28815 107696 52325
18016 -5245 -117676 282111 -7703 94451 -97367 92171 180718 -51990 -103457 -91046 -223280
18005 -223280 30302 279597 -20115 24821 17130 101707 289110 -42861 -1761 -77062 -244303
17994 -244303 111605 270350 -151739 -105049 378968 -50222 -126018 -126391 -24259 121146 202874
17983 202874 -295053 124418 -195276 209292 -197701 71490 79682 32203 -176082 -242954
17973 -242954 -59099 -193576 40605 70889 -204843 336440 -321659 -401568 3741 260982 -25018
17961 199384 -49447 -1389 -281455 40888 -435141 -2795 -86269 289520 -177401 47331 -31426
17949 244914 -131685 50267 -178140 -86406 54977 -417751 163572 -81872 231515 -346195
17938A53075c6900A84937J5284J06046I7907m0645b47313E872d46420A44336a2293
17926b15889A51063Q8017I5319J98062A9677K40378J1708C1320J1196g9479j72135
17915b51614B6745f5534b385C32337e6036B54157i3367k2276O158c4979j29442
17904a64421k51161a6522l6850b5997j00511G0498C4399a23147j45682E5267L22509
17893C77776f846B932e5706g369A23084B7910J51227m0544A4852c04696F8956
17881B83700A30051R4342I5000a98061C37128j20227r6927a6220k3477I1114B4419
17869b403A14130j0618a31029B47138E3357K02075k4840E7626a51289A43649a20292
17857i8889A06544b0133l206j86239C0995j2910K46932a08908M0362B07435F0218
$$ plain form
17938 153075 -36900 184937 200221 306267 97907 57262 -247313 5872 -446420 144336 -12293
17926 -215889 151063 239080 95319 293381 19677 260055 271763 31320 42516 -79479 -251614
17915 -251614 26745 -65534 -2385 332337 -56036 254157 -93367 -115643 -109485 -34979 -164421
17904 -164421 -415582 -16522 -53372 -25997 -126508 70498 34399 -123147 -268829 55267 377776
17893 377776 -6846 2932 -55706 -7369 123084 27910 179137 138593 14852 -304696 68956
17881 283700 130051 224393 95000 -198061 337128 216901 119974 -16220 -39697 91114 24419
17869 -2403 114130 103512 -131029 247138 53357 255432 230592 57626 -151289 143649 -120292
17857 -98889 106544 -20133 -23339 -209578 30995 18085 265017 -108908 -68546 207435 60218
17845B26913b23660A79762a91553C0389a00253L2498j58785J12646C4891a24931
17834a86318A17534D1401c01542Q0868E6714a13678H6740b69417D1108J49311
17824A90419d8429A5619a88820m3034B96199a00406K4821F1940a99081C03181
17813B09061a54161o2178A19315K0567d4383F6943D811M41531a91358B04248e041
17801b12415F8034b09340A26737b1900A45897f9549A10566M5238a92451A06280
17790B65076b07633A38580J22873B9022b36245f8997F1033b43628A09697c696
17779a40727L7277A54543K646o8240c12027F5112A738M7752K42675d05547h6075
17767i2682B23871G2353a03325A75743j5961g4995l8549B16335b1536j2097k2464
$$ plain form
17845 226913 -223660 179762 -191553 30389 -100253 -67755 -226540 -113894 34891 -124931
17834 -186318 117534 41401 -301542 -220674 56714 -113678 86740 -269417 41108 190419
17824 190419 -48429 15619 -188820 -231854 296199 -100406 -75585 61940 -199081 303181
17813 209061 -154161 -216339 119315 139882 -44383 66943 4811 446342 -191358 204248 -5041
17801 -212415 68034 -209340 126737 -21900 145897 -69549 110566 155804 -192451 106280
17790 265076 -207633 138580 261453 29022 -236245 -68997 61033 -243628 109697 -3696
17779 -140727 -103450 154543 157189 88949 -312027 65112 1738 49490 292165 -405547 -86075
17767 -92682 223871 72353 -103325 175743 159782 -74995 -113544 216335 -21536 -33633 -56097
17756e6097B08358b5276D1652J57438A9468b53557A99386L9787D873c32298J56250
17745a76048q9439j02695a43470j22784A14668j1305N2977l8899h7223A95860
17734D57715B20337a75915A28595D0412g121l4961J6867C3839K45839k8976a97399
17722D4551K01134a45901A01019a28239N9943k21038B74906A1010J68808a13301
17711a85796E7092A9200a69692k7459F8927J15712C9074a97485d6348l19523D5964
17699b00096f4759q1125B17712b5269K748n2780C1914N8353M3020m0195Q6306
17688A79398a49034B26346H6340P94B258J85902m885N486C5901a6134k99162A1567
17675a84136f5922B42857j3210o4998c57689H9152L65113h8487D3762J79458a61416
$$ plain form
17756 -56097 208358 -25276 41652 199090 19468 -253557 199386 239173 4873 -332298 -176048
17745 -176048 -265487 -368182 -143470 -266254 114668 103363 156340 117441 -87223 195860
17734 457715 220337 -175915 128595 40412 -7121 -42082 -25215 33839 279678 250702 -197399
17722 44551 245685 -145901 101019 -128239 -68296 -289334 274906 11010 179818 -113301
17711 -185796 57092 19200 -169692 -197151 68927 184639 39074 -197485 -46348 -365871 45964
17699 -200096 -64759 -145884 217712 -25269 -22521 -75301 31914 90267 133287 93092 179398
17688 179398 -149034 226346 86340 87134 2258 188160 183275 188761 35901 -16134 -315296 11567
17675 -184136 -65922 242857 229647 164649 -357689 89152 454265 -88487 43762 223220 -161416
17663B4881L33340A74259a14870H7914b16859a7878C3406d3923j52664A58415
17652A92569f8549L0698j7400A99053B1686c3118A60359D31J1789J04212J03210
17641B19642f6350G683J58053Q9924A0020c28013I0636A3662L66511g9005c443
17629E0554K6532J1454L5981E7026M7826a01048d7080H595K48839H2857J52759
17618B35616A6418R097Q613a73402C8658g349B90319h8855A50190b0670H5790
17606B62259j20484G924a75285D22429A20211a89704A85147o9373c86807C75849
17595A24504f9641I2579f3429C9247a07643D6091Q082a8366G0569K75314f429
17583f526j95600B07292a571D03805b29336Q0498C37287E4118e4884A72350H2147
$$ plain form
17663 24881 358221 174259 -114870 87914 -216859 -17878 33406 -43923 -196587 158415
17652 192569 -68549 -37851 -55251 199053 21686 -33118 160359 431 12220 116432 219642
17641 219642 -66350 7683 165736 255660 10020 -328013 90636 13662 380173 -79005 -3443
17629 50554 77086 88540 124521 57026 104852 -101048 -47080 8595 257434 82857 235616
17618 235616 16418 25515 34128 -173402 38658 -7349 290319 -88855 150190 -20670 85790
17606 262259 141775 7924 -175285 422429 120211 -189704 185147 115774 -386807 375849
17595 124504 -69641 92579 -63429 39247 -107643 46091 54173 -18366 70569 345883 -6429
17583 -6526 -202126 207292 -1571 403805 -229336 -148838 337287 54118 -54884 172350 82147
17571E4603b9793j0518j61601G9288J0827N3274e8257K1294A10203N7578J2272
17560A80053J52635j16825D4971Q3675J23509o7519a9258m0284B75119j26681
17550A48438K55484c10190A43621K26340A60628C5405d340A39746J97855j55805
17540A81796H4280K27282A19380Q2506O48p7157D6542c1263B16965B1195M21450
17529D42645a6705F5375a11634B35752k0480i6027A94162N380q700K54821j718
17518D43945j82561J15743b35790A70302B5296J66028L8724B9809L20291j11804
17508B38296l3863m5806K90210k22944K49127j22036A38925K61736P6435A12887
17497A74741b808A51760P727m9347K06009C4788Q8452Q3981K25443A58566F7226
$$ plain form
17571 54603 -29793 -40311 -201912 79288 90115 143389 -58257 -36963 110203 167781 180053
17560 180053 332688 215863 44971 128646 252155 184636 -19258 -59542 275119 148438
17550 148438 403922 -310190 143621 369961 160628 35405 -4340 139746 337601 181796
17540 181796 84280 311562 119380 201886 202534 125377 46542 -31263 216965 21195 442645
17529 442645 -16705 65375 -111634 235752 215272 -96027 194162 199542 190842 445663 443945
17518 443945 261384 377127 -235790 170302 25296 191324 230048 29809 350100 238296
17508 238296 204433 158627 448837 225893 475020 352984 138925 400661 477096 112887
17497 174741 -2808 151760 159487 110140 316149 34788 123240 207221 432664 158566 67226
17485D45341j76783b6867B59988O6931a14212A38588J3903N2276a70311A31762
17474g9730A50854M3142m3987G1982M05695a99632C08374a28361B86400q8673
17464A97727N91545A2902e7660C10325I1819l9725K22633r7834J748P3283J40872
17453C92796p8694j18760a03970B69520P3087J25436A62575o3722P5800L03914
17443D78567A49445j4791J37217J13568G5763K18992I9839J62648M0781i6039
17432B44113J40415j57129P9242K7219r8682K20893n5759j84030Q086l773n1418
17421A69177k3855J24905Q6660A06017R6512a06386C60235j0238N2222A77746
17410B18298o6485d503E7311J15438a43412A49758d6366G1264L42011m5998e1861
$$ plain form
17485 445341 268558 -26867 259988 326919 -114212 138588 152491 204767 -170311 131762
17474 -79730 150854 193996 150009 71982 477677 -199632 308374 -128361 286400 197727
17464 197727 789272 12902 -57660 310325 91819 52094 274727 176893 178641 251924 392796
17453 392796 314102 195342 -103970 269520 342607 468043 162575 98853 174653 478567
17443 478567 149445 134654 271871 385439 75763 294755 99839 262487 303268 -96039
17432 244113 384528 227399 306641 333860 235178 456071 400312 216282 224368 220595 169177
17421 169177 145322 270227 356887 106017 202529 -106386 360235 349997 402219 177746
17410 218298 151813 -4503 57311 172749 -143412 149758 -46366 71264 413275 367277 -51861
17398B85378P1401I7990a23189A08158d8855A37927J23062r7496P937G4987L54551
17387D29538G16J74201l7131K7210A7950d475B09562E5754J71383Q461N2321C2405
17374C67160J19824k13595n8641L521R7151A53200F1715a34140B77644F6588J78745
17363B45333m1326a37605A02635a07049o5528A20499a05370A16948O5024l7051
17353A44921Q7692G5484g0489G4196K44218H1650Q1693o4834J12692R553J56380
17342C77134A71957q1186M63696C7303f5571D6115K59638l3849k5650q0488Q2294
17331B48060p4094O1896g856A58656p3457l5791K63850H4308N31646B87611r919
17320B77692l5081b49929J21000A46809J67986j41655d1702B03605L43073B56574
$$ plain form
17398 285378 356779 97990 -123189 108158 -48855 137927 260989 163493 171430 74987 429538
17387 429538 716 174917 137786 164996 17950 -4475 209562 55754 227137 235598 287919 32405
17374 367160 486984 273389 214748 218269 315420 153200 61715 -134140 277644 66588 245333
17363 245333 204007 -137605 102635 -107049 -172577 120499 -105370 116948 181972 144921
17353 144921 232613 75484 -70489 74196 318414 81650 163343 98509 211201 220754 377134
17342 377134 171957 90771 554467 37303 -65571 46115 305753 271904 246254 165766 248060
17331 248060 173966 235862 -7856 158656 85199 49408 313258 84308 615954 287611 277692
17320 277692 242611 -249929 -128929 146809 314795 173140 -41702 203605 546678 256574
17309C60419b4716A38599J18714r3135k5226J26458r7216J5821b5409C2008a1815
17297A45317m255F0093J14316M9482A3842J5016M61512j62020E7723a6343A59670
17285F8893g9413D31283k05345A3945P5663K03878B9624J29098K12117e5395B22058
17273E44073B04139F0770L80675a6504C54605A13131o648J69620J93793A13743
17262B61338C5694O5881K84179A18437Q0003P7367q1152M08134G5806J39638f2359
17250B15090J37039p3037B4082N40443q3218A38076F1251K87856p4571j01670
17240A72866K34672B00457Q6369J01986p5588q5387K15055g4472B30965a7031
17229B49880O9855J516A01395Q1609J7578R5974L8966b15545A38757K81596j58446
$$ plain form
17309 360419 -24716 138599 257313 164178 138952 265410 168194 184015 -25409 32008 -11815
17297 145317 141062 60093 174409 223891 13842 28858 490370 328350 57723 -16343 159670
17285 68893 -79413 431283 225938 13945 89608 293486 29624 158722 370839 -55395 222058
17273 544073 204139 60770 441445 -16504 354605 113131 106483 276103 469896 113743
17262 261338 35694 101575 385754 118437 198440 275807 194655 602789 75806 215444 -62359
17250 215090 352129 279092 24082 564525 481307 138076 61251 349107 274536 172866
17240 172866 407538 200457 286826 388812 313224 227837 442892 -74472 230965 -17031
17229 249880 319735 321251 101395 183004 200582 296556 335522 -215545 138757 420353 261907
17218B61907K3748j12218J23787A20870J95311J1702N0161J51781l7749R3950
17208E86026B48446I635M15889j85455K96218L8384B83136K31531a95588D26948
17197D14770j81214E0132L6669J05389L55217k12427K27652j79231q0761K6842
17187C29482L34837j93797p0325A12035L84796k43702K21158R733K5895j83956
17177C25959K2578p2353l5759R0413j56762k5225J25956J11316Q1886j76613O986
17166B98382J68204J0057j58848o6155K65961J56431B22587M73717B30929P000
17156B37929J16195R3845p4013j70616A9188M76529J23041A65109L85008B44443
17145E20209j30320k3048K90499o2498o8114B57384K57176A45840K57851A55322
$$ plain form
17218 261907 285655 173437 297224 120870 316181 327883 378044 529825 492076 586026
17208 586026 248446 9635 425524 240069 536287 574671 283136 514667 -195588 426948
17197 414770 233556 50132 86801 192190 547407 334980 562632 383401 302640 329482
17187 329482 664319 470522 400197 112035 496831 253129 474287 484020 509915 325959
17177 325959 348537 276184 240425 330838 174076 148851 274807 386123 468009 291396 298382
17166 298382 466586 476643 317795 251640 517601 674032 222587 696304 230929 237929
17156 237929 354124 447969 373956 203340 19188 495717 618758 165109 550117 244443
17145 520209 389889 366841 657340 594842 526728 257384 514560 145840 403691 155322
17134D78719r5205M9605J58386B86846K21818j12575P91K08787A62038L45847
17124E07885j52168A47568K82548N3485k26321K21614J4770J20667j73875K09516
17114F49972k29843J13472N8549Q0830k37869L28084C01697J94326M50556k61717
17104F84862k01001A02365N59722j90886j066J45497A43156L28389Q9476o6357
17094D94664J45859k0064q6136J69179j50118J17764q0004j27855N2572j58004
17084C57857Q0750j62476J96420j8096j39396J16033K67682B90064M426L20600
17074F15090k23174L89339B76258L50823M3201k9597k10232J33808J01292J55574
17064H21127j12212J70257k00389K36826J12697l76702k9893o3616L3913J46304
$$ plain form
17134 478719 383514 433119 591505 286846 508664 396089 396880 605667 162038 507885
17124 507885 355717 147568 430116 483601 257280 478894 493664 614331 440456 649972
17114 649972 420129 533601 592150 672980 435111 763195 301697 496023 946579 684862
17104 684862 483861 102365 662087 471201 470135 615632 143156 471545 561021 494664
17094 494664 640523 620459 534323 703502 553384 671148 591144 463289 515861 357857
17084 357857 438607 276131 472551 454455 315059 431092 698774 290064 294490 615090
17074 615090 391916 781255 276258 627081 670282 640685 430453 564261 665553 821127
17064 821127 708915 879172 678783 915609 1028306 651604 621711 558095 592008 738312
17054G38312o9775k16937L60405L443J23164m58132J29447J73129j69964r7296
17044E15796K42782P636j86789o8209L01099m7727j51984L41428l45397j08524
17034E00111M45578k02544r3808K96587k88615J04748K30239k61617R1935J24088
17024I46702k03533O7693K36777l50940K89531k70105N8862J22738j30647k08920
17014E58158M22253O2060N3872l7871r0758o8302J69741k81918N9192L59653k64154
17003I41926k9269K24671D91223P41606l69245o6103N5600L59617l60578J03123
16993I55243K1419j89073J91878j57914M96959l64626K62462P2988j95900o932
16983A086504M4098R2597q7864O1863n5261J45197j48813J31733N6700j40816
$$ plain form
17054 738312 668537 451600 812005 815448 938612 480480 609927 783056 613092 515796
17044 515796 758578 766214 579425 511216 812315 764588 612604 954032 608635 500111
17034 500111 945689 743145 649337 945924 657309 762057 992296 730679 822614 946702
17024 946702 743169 810862 1047639 696699 986230 716125 774987 897725 767078 558158
17014 558158 980411 1042471 1096343 1058472 967714 899412 1069153 787235 846427 1206080 941926
17003 941926 912657 1137328 491223 1232829 863584 797481 853081 1212698 852120 955243
16993 955243 976662 787589 979467 821553 1318512 953886 1216348 1289336 1093436 1086504
16983 1086504 1130602 1223199 1135335 1197198 1141937 1287134 1138321 1270054 1326754 1185938
16973A185938j68611r4461L62240J56909R8609r6368j88024K46422k4454K4975
16963A503175m9560l03577L06359J86545k94879j18015m992K13773J25356J64381
16953A728566n8757n788J08301K5739q8274j3097l35853K29572j06261K14399
16943A698547R6905K09330n78833N32206m97601N78822k89345k7833q1015K92877
16933A934060O0868j53056K23169n28469M60127l65706N95146n08993M00618O956
16923B124720l35651N38762K9499k27280J14902k17836m5167K19081k0617J7288
16913B197701K92524l17054K38508m1166K63726l8325O8913k29958K77345k34487
16903B477727J72908j27430K15963k26172M48113o2525O230l00063K76153J97920
$$ plain form
16973 1185938 1017327 922866 1285106 1442015 1540624 1444256 1256232 1502654 1478200 1503175
16963 1503175 1453615 1150038 1456397 1642942 1348063 1230048 1225056 1438829 1564185 1728566
16953 1728566 1669809 1664021 1772322 1798061 1709787 1696690 1360837 1590409 1484148 1698547
16943 1698547 1795452 2004782 1425949 1958155 1460554 2039376 1750031 1722198 1641183 1934060
16933 1934060 1994928 1841872 2065041 1536572 1996699 1630993 2226139 1717146 2117764 2124720
16923 2124720 1789069 2327831 2357330 2130050 2244952 2027116 1981949 2201030 2180413 2197701
16913 2197701 2490225 2173171 2411679 2370513 2634239 2595914 2664827 2434869 2712214 2477727
16903 2477727 2650635 2523205 2739168 2512996 2961109 2898584 2904814 2604751 2880904 3078824
16893C078824o2570k8669j91108K51236L4298K93026j46279j29643K87519R2047
16883C478681o2985J66987j88689P23080m89863j67253L99960j25866P8025l6234
16873C775843m3761O14116j64011k47269M13019j20874l5862m6985O18957k76268
16863D486905J04041J53400j93296M92633j52733k39535M72648K19276n6357J45751
16853E432733J72858r6059L7566l25110L67911L09773j50244K05047J34510J10924
16843F199909M4941K23485L22942j26409K2624M4801L79005k80703L01410K74345
16833G406350L00693J31347J85164j68166K16783K96138J15656M22717K90417
16824I197099j10723J71701L08229L09997K98678q1849L11100K62939K94013j8139
$$ plain form
16893 3078824 3016254 2987585 2796477 3047713 3082011 3375037 3228758 3099115 3386634 3478681
16883 3478681 3415696 3582683 3393994 4117074 3627211 3459958 3859918 3734052 3812077 3775843
16873 3775843 3732082 4346198 4182187 3934918 4347937 4227063 4191201 4144216 4763173 4486905
16863 4486905 4590946 4744346 4551050 5043683 4890950 4651415 5124063 5343339 5286982 5432733
16853 5432733 5605591 5509532 5547098 5221988 5589899 5899672 5749428 5954475 6088985 6199909
16843 6199909 6244850 6468335 6791277 6664868 6687492 6732293 7111298 6830595 7132005 7406350
16833 7406350 7707043 7838390 8023554 7855388 8072171 8368309 8483965 8906682 9197099
16824 9197099 9086376 9258077 9566306 9876303 10174981 10093132 10404232 10667171 10961184 10943045
16814A0943045P6201M66410L30468M59089k91063P96415J4909M15530J31685L00486
16804A3643175L27050N28212P28399j05664N65291K64271M71527O61554K05458
16795A7289273L29152O80364O26552L73109L52331P80067J92377R00083P10364
16786B2233672P37300O16474O23982N55124R03078R55020M12321J000941R25918
16777B8963830Q97800J011718R93897J154292O32429J194426J183093J571274
16769C7602759R79629J329401J145286J674997J499197J553095J365837J795156
16761D8945357J498605J924497J869223J832662J843470K541972J338227K716550
16753F4510563K253567K333136K370938K203905K234996K663098K237646K611961
$$ plain form
16814 10943045 11019246 11485656 11816124 12275213 11984150 12780565 12795474 13211004 13342689 13643175
16804 13643175 13970225 14498437 15226836 15121172 15686463 15950734 16422261 17083815 17289273
16795 17289273 17618425 18298789 18925341 19298450 19650781 20430848 20623225 21523308 22233672
16786 22233672 22970972 23587446 24211428 24766552 25669630 26624650 27036971 28037912 28963830
16777 28963830 29861630 30873348 31867245 33021537 33653966 34848392 36031485 37602759
16769 37602759 38582388 39911789 41057075 42732072 44231269 45784364 47150201 48945357
16761 48945357 50443962 52368459 54237682 56070344 57913814 60455786 61794013 64510563
16753 64510563 66764130 69097266 71468204 73672109 75907105 78570203 80807849 83419810
16745H3419810K387172K475583K210004L065908J655730K374934K432205J899143
16737A01920489J391411K111909J530103J265317J315797R70004L81931N36461
16729A11423422R3333R7998J215p14504o46393q82259j382701j355986j182335
16720A05451790k113681j733580k363970j869045k089353k354494k296751k189290
16712H8441626k107205k848361k178788k556817k456528j912024k292612k186165
16704F9903126k295362k258636j930037j908087k163913j863299j728335k189292
16696E3566165j582007j326441j688092j676514j664649j193633j663919j305585
16688D1465325j080769j153968j407544j115556r90294j149859p50024j530469
$$ plain form
16745 83419810 85806982 88282565 90492569 93558477 95214207 97589141 100021346 101920489
16737 101920489 103311900 105423809 106953912 108219229 109535026 110505030 110886961 111423422
16729 111423422 111516755 111614753 111615968 110901464 110255071 109372812 107990111 106634125 105451790
16720 105451790 103338109 101604529 99240559 97371514 95282161 92927667 90630916 88441626
16712 88441626 86334421 83486060 81307272 78750455 76293927 74381903 72089291 69903126
16704 69903126 67607764 65349128 63419091 61511004 59347091 57483792 55755457 53566165
16696 53566165 51984158 50657717 48969625 47293111 45628462 44434829 42770910 41465325
16688 41465325 40384556 39230588 37823044 36707488 35717194 34567335 33817311 32286842
16680C2286842m99694j004808n08014j391413o99500o81883q39096o55004p13130
16671B5294300n59670l93088q56270n06034n36242o12688n14630o91820p06824
16662A9917034n78667j59840n42672m83583k14751p48062J19544q15406l41732
16653A6151865J5180n37740k18787m54033m17642j79494l91757o38949l7779j29452
16643A3161412m91341l24338m0093j57149n24626J3632p6309p26972P5433l5911
16633A0873738k27448J1359k64787k47881j95940j54476l36172l73783J14941
16624I199551j09448k8331j83783j61087k08803j88510J24938n42202M00203l39468
16614G963060N031m16152q1221p2635L105l7468k63740m01410L34428k04108n137
$$ plain form
16680 32286842 31787148 30782340 30274326 28882913 28183413 27501530 26662434 26007430 25294300
16671 25294300 24734630 24341542 23485272 22979238 22442996 21830308 21315678 20623858 19917034
16662 19917034 19338367 19178527 18635855 18152272 17937521 17189459 17309003 16493597 16151865
16653 16151865 16167045 15629305 15410518 14956485 14538843 14359349 13967592 13328643 13290864 13161412
16643 13161412 12670071 12345733 12305640 12148491 11623865 11637497 11561188 10834216 10909649 10873738
16633 10873738 10646290 10657649 10392862 10144981 9949041 9794565 9458393 9084610 9199551
16624 9199551 9090103 9061772 8877989 8716902 8508099 8319589 8444527 7902325 8302528 7963060
16614 7963060 7968091 7551939 7470718 7398083 7401188 7363720 7099980 6698570 7032998 6828890 6823753
16603F823753j26429J12547j73908l15637J41867m10405K15303q7586l71725q0728
16593E727052P03380o82264n3420j80199j91326O6487K73391m51971J0007n0077
16583E171060J13165m14970J33802l69565M37968k29856j10792R6831j65786q1031
16573D580826j66728L04957j57878j105m24544M06616m18399N932L01495n44825
16563C886347n6822N42321k00058k51966p6543k01124N78678l28243l70306N19261
16553D041545l87503q0813K57900l29219M5352j39036M09071j93427l29691L84740
16543C678919N8161n95656J83133J10984j07059j90712K19255q9164q8551l91539
16533B787771K28662J1346j4353o8576k22187N50227k07854j38023k03486l29721
$$ plain form
16603 6823753 6697324 6809871 6635963 6320326 6462193 6051788 6267091 6179505 5807780 5727052
16593 5727052 6430432 5748168 5694748 5514549 5323223 5389710 5663101 5211130 5221137 5171060
16583 5171060 5284225 4869255 5003057 4633492 5071460 4841604 4730812 4827643 4661857 4580826
16573 4580826 4414098 4719055 4561177 4560072 4135528 4542144 4123745 4129677 4431172 3886347
16563 3886347 3829525 4371846 4171788 3919822 3843279 3642155 4220833 3892590 3522284 4041545
16553 4041545 3654042 3573229 3831129 3501910 3547262 3408226 3817297 3623870 3294179 3678919
16543 3678919 3737080 3141424 3324557 3435541 3328482 3137770 3357025 3267861 3179310 2787771
16533 2787771 3016433 3027779 3013426 2944850 2722663 3272890 3065036 2927013 2723527 2393806
16523B393806O82115k83441l5950L34904l61060j05608K15071P2581m70850L73537
16513B815105m8223j9636m31756K88423P5782k50258N9050q3963K09030j33985
16503B479569q8744l191p4458P935j49651L37464o8312n8694P1471j33345j67084
16492B152960K152j7791L26437K13027j34110m45355M4045j73623l6641M55411
16482B386512k28633j62311K03745k56221O0543j4841J65623O4720m12634J92584
16472A999087j95559K22122J56980j68859J27478j79895l14281L43590J6210j1473
16462A995400l7807r4523J73245k22447J6031P2542J68106k06434r265j95655
16452A659193L26094k59840K79210j63040L3286K41444m19673j31817L07257l00773
$$ plain form
16523 2393806 3075921 2792480 2756530 3091434 2730374 2624766 2839837 2912418 2441568 2815105
16513 2815105 2766882 2747246 2315490 2603913 2679695 2429437 2488487 2404524 2613554 2479569
16503 2479569 2390825 2387634 2313176 2321111 2171460 2508924 2440612 2381918 2453389 2320044 2152960
16492 2152960 2155112 2137321 2463758 2676785 2542675 2097320 2141365 1967742 1931101 2386512
16482 2386512 2157879 1995568 2199313 1943092 2003635 1988794 2154417 2219137 1806503 1999087
16472 1999087 1803528 2025650 2182630 2013771 2141249 1961354 1647073 1990663 2006873 1995400
16462 1995400 1957593 1863070 2036315 1813868 1829899 1902441 2070547 1864113 1854848 1659193
16452 1659193 1985287 1725447 2004657 1841617 1874903 2116347 1696674 1564857 1872114 1571341
16442A571341K58050m7826R1837j28139P1062j1748j45693L8888j62824K4873
16432A559821J78589q6646m8949L92319l92660j58070L00277l40870J20944N5558
16422A580313J84609j04081M5804k15248J98670k20380J17527j18500N11595p35720
16412A244589L68861K5978j76210K39391r3802K47015j43305R8331m10436L39584
16402A739996k70377j09453q979J11490l7970m2112K88088l17587j09444J79175
16392A422827j47392J95894j26768p1114j37171L00446k17524M9547L82261l23084
16382A327922j91203J35762k22397K85704k5098j80028K14474J986p1275o7497
16372A208350j51043J16699L09757k46766j9296K34388k39395L0379K80691j18151
$$ plain form
16442 1571341 1829391 1781565 1873402 1745263 1816325 1804577 1658884 1697772 1534948 1559821
16432 1559821 1738410 1651764 1602815 1995134 1602474 1444404 1744681 1403811 1524755 1580313
16422 1580313 1764922 1660841 1706645 1491397 1690067 1469687 1587214 1468714 1980309 1244589
16412 1244589 1613450 1639428 1463218 1702609 1608807 1855822 1712517 1810848 1400412 1739996
16402 1739996 1469619 1360166 1351187 1462677 1424707 1382595 1670683 1353096 1243652 1422827
16392 1422827 1275435 1471329 1344561 1273447 1136276 1436722 1219198 1268745 1651006 1327922
16382 1327922 1136719 1272481 1050084 1335788 1310690 1130662 1345136 1347122 1275847 1208350
16372 1208350 1057307 1174006 1483763 1236997 1217701 1452089 1212694 1243073 1523764 1405613
16362A405613J17019k27223J04511k43338J04379m074j79431M19702r2041m00904
16352A004213M52649k81543N9667J711l3937j9146j7414r7659K3739K59102k41497
16341A109885m0057L43909k46228J21498k58296K96345m55229K01406K29307l47879
16331I54661M99759o59322J71992k5281R3953P4884J40741j83195Q7383l49034
16321H06541L21263k13496J76931K53135l96548j59724J66508j76507l989K87079
16311A061193m33712P28511m22188M16459m96893N15929k42927l99506N34376
16302A261242k61487k05540P5451J28439k78652O29134j66585l83594J66587o4321
16292I00674r9428K34991K20435k66429p4209P6897M9255l83327K80036j16939
$$ plain form
16362 1405613 1522632 1295409 1399920 1156582 1260961 1256887 1077456 1497158 1405117 1004213
16352 1004213 1456862 1175319 1234986 1236697 1202760 1183614 1166200 1068541 1092280 1351382 1109885
16341 1109885 1069828 1413737 1167509 1289007 1030711 1327056 871827 1073233 1302540 954661
16331 954661 1454420 795098 967090 941809 1035762 1110646 1251387 1068192 1155575 806541
16321 806541 1127804 914308 1091239 1344374 947826 788102 954610 778103 774114 1061193
16311 1061193 627481 1355992 933804 1350263 853370 1369299 1126372 726866 1261242
16302 1261242 999755 794215 869666 998105 719453 1348587 1182002 798408 964995 900674
16292 900674 801246 1036237 1256672 990243 916034 992931 1042186 658859 938895 821956
16282H21956M2301P5819j19148l10983M88485k30770L39155p5515j37527p342
16272H86431J45579j88711r2324J91309l06746L40080j82855K21925l40913L34769
16262A008544j06982j19323L4398j1872k69233L50349p9862o4418J533k01386
16252E41748O4175J52012n7604N77685k47358k74913O9320R6098j17065o7241
16242G36857J91518M0175O3645l06512K06264n1342l0296k94389K12543k00322
16232E68141J04323M7913p9470m2570J35402M18330k48894k67726N0674K18847
16222I04970l88331L5744K47487j6754o7771J53518k57770N9117j89085L79758
16212H60883D13756L55278L13412l80696r6359K27945O5861l16670J81568r5055
$$ plain form
16282 821956 864257 940076 820928 509945 998430 767660 1106815 1031300 893773 886431
16272 886431 1032010 843299 750975 942284 635538 975618 792763 1014688 673775 1008544
16262 1008544 901562 782239 816637 804765 535532 885881 806019 741601 743134 541748
16252 541748 605923 757935 700331 1278016 1030658 755745 825065 921163 804098 736857
16242 736857 928375 968550 1032195 725683 931947 880605 850309 555920 768463 568141
16232 568141 672464 720377 640907 598337 733739 1152069 903175 635449 686123 904970
16222 904970 516639 552383 799870 783116 715345 868863 611093 670210 481125 860883
16212 860883 413756 769034 1082446 701750 605391 833336 899197 582527 764095 669040
16202F69040M653J95591A32538K99669J47121k361o5378K60315k34393k68726
16192B68785K41705K19507k28354K66286j67328r4818I884M20913J56523J58207
16182G45527j28514m7202J39591j08079D8337N75979J52131B20486J67652r671
16172C78467j65786L18074A09761J83827p4919R7030k7292K73846q7813J30153
16162F04593j64980K48440l29537n9089A41868K19902q1410J83124K1037j11452
16152C73069J6585J80313O2864J9172B89326p7925M28655j92376N1453r2879j04028
16141C02226J82956o9359K51479A10549L05989J83521r0596j8495k31401J43532
16131D03099B00860J08094I5189K71511M0995A52397J89954J76118k54405J04160
$$ plain form
16202 669040 673693 869284 132538 432207 579328 576967 511589 771904 537511 268785
16192 268785 510490 729997 501643 767929 600601 505783 9884 430797 587320 745527
16182 745527 617013 569811 709402 601323 48337 624316 776447 220486 388138 378467
16172 378467 212681 530755 109761 293588 218669 315699 288407 562253 474440 604593
16162 604593 439613 688053 358516 299427 141868 361770 280360 463484 484521 373069
16152 373069 389654 569967 632831 652003 289326 211401 640056 447680 499133 406254 302226
16141 302226 485182 415823 667302 110549 416538 600059 509463 490968 259567 403099
16131 403099 200860 308954 95189 366700 407695 152397 342351 518469 264064 368224
16121C68224J49510j84145m6821F5212O50594C21299G5337d0850H1043K64129
16111C45172O545J00274A57353K98127j68586j03993J38386n4031R9367p7603
16101B89020r1892K42291l7563j59896Q8438j2787j7030Q5650l0089j64132J87611
16090C79621j55752K14386B09692K1568L4484O0861q1809j1756j05566K27911
16080C55385K66611B47727E9979B9267J42609K37197A70087J46641J79463F1976
16069B34439Q2553B6649J16664J72989J29921K5924A71351a39573B87386P219
16059B94605l1260J4979L67557k84862o0156I0400K02530I4918n38K20451o3625
16048B51206A25415Q4339l127b27922D83710n3983E2248J55861j4261P2025j13927
$$ plain form
16121 368224 517734 333589 286768 65212 715806 321299 75337 -40850 81043 345172
16111 345172 351717 451991 157353 455480 286894 182901 321287 267256 366623 289020
16101 289020 197128 439419 401856 241960 330398 317611 300581 386231 356142 192010 379621
16090 379621 223869 438255 209692 231260 265744 326605 244796 233040 127474 355385
16080 355385 621996 247727 59979 29267 171876 409073 170087 316728 496191 61976
16069 234439 316992 26649 143313 316302 446223 472147 171351 -139573 287386 294605
16059 294605 263345 278324 645881 361019 300863 90400 292930 94918 94380 314831 251206
16048 251206 125415 209754 206627 -227922 483710 429727 52248 208109 193848 265873 151946
16037A51946D9480J54664J5134L35009a54695D5238K16199K25963A62099b36855
16026A69514J85464j43502J93199I3978K43876Q3008I5200a27584A38476g504
16015C20873A30838R972R2000L957g3617K6031A44362a20470G6554a29954B21628
16003B16846I9607M93741b1437E1305P0239N7109a46456G01581a47062B06948
15992i4109B0507N27861k46011j38947K54513M5936K84735l51621M63005l05279
15982E54699j11873j33206P1847k3769q0460a01914B91913E347L21232a77248
15971C26652A60728b42989J00678M6469A63198A7321d21336B11005a0769B80815
15960f5730I3880K91130c22521A35273J42400h793o391A85560j5620K24829D1195
$$ plain form
16037 151946 49480 204144 219278 554287 -154695 45238 261437 487400 162099 -236855
16026 169514 354978 211476 404675 93978 337854 420862 95200 -127584 138476 -7504
16015 320873 130838 140810 232810 236767 -73617 -47586 144362 -120470 76554 -129954 221628
16003 216846 99607 593348 -21437 51305 121544 178653 -146456 701581 -147062 206948
15992 -94109 20507 548368 302357 163410 417923 463859 748594 396973 859978 554699
15982 554699 442826 309620 381467 357698 277238 -101914 291913 5347 326579 -177248
15971 326652 160728 -242989 -142311 -95842 163198 17321 -421336 211005 -10769 280815
15960 -65730 93880 385010 -322521 135273 277673 -8793 -15184 185560 169940 394769 41195
15948A49577i5438j1340C72411j28284g3471B40233d5973F4153b95350A71588
15937C46800j00201b1977B53442a43098A2779M4264f0289j18794D02924H4057
15926h8134J7596k4425B52727a1702B1852J92902A858K02972b7397l06112a12142
15914F6014J10388k2139c7565A8542b43202G7700J63655m9343K0458b02484H787
15902A23799c21506a13127A92571a07960M2619k04435A89493p3212L5920c56154
15891F86204b50417d6978n250E2734J45976a35270A42671a2794G7413b5942F1279
15879I827J71526c910j32914b0745A49054d4456q005F4678f8857j20452l5886
15868b25195a04880k1658C22046A36234e3599C55672h1756k05972C4969f2250
$$ plain form
15948 149577 -95438 -106778 372411 244127 -73471 240233 -45973 64153 -295350 171588
15937 346800 246599 -21977 253442 -143098 12779 57043 -60289 -179083 402924 84057
15926 -88134 -70538 -94963 252727 -11702 21852 214754 1858 204830 -27397 -333509 -112142
15914 66014 176402 154263 -37565 18542 -243202 77700 241355 192012 212470 -202484 8787
15902 123799 -321506 -113127 192571 -107960 -65341 -269776 189493 116281 152201 -356154
15891 686204 -250417 -46978 -52228 52734 198710 -135270 142671 -12794 77413 -25942 61279
15879 9827 181353 -3910 -136824 -20745 149054 -44456 -52461 64678 -68857 -189309 -225195
15868 -225195 -104880 -126538 322046 136234 -53599 355672 -81756 -287728 34969 -62250
15857g256r0071c7036D1300i7916o775j47584A4089b1940o2375c2162B60570b4183
15844F7303a15292j8903A75688b7793k50631B24155a94313o6193B9282f6576n5226
15833a21802C63357k2737j01177E7987K1001l1828a01809A04595a87022Q4973
15823a02049d9528C18223a95428B8533b01778A40031b91025A66564J3150l5057
15813A44657B5106b05820A53864a87062d1450j92431B80397d2562A48592M180
15803A52772f4765B19107c54616J48966A1021e2123j4170j71773r28D3335K4066
15792F7401R6275C3357M0779k3328J32518b00203B9910a50823I8944j2146C2536
15780A87920a85783A43285b8457m5742B51548n2412a24632a9815H6244j7577J87084
$$ plain form
15857 -7256 -97327 -37036 41300 -97916 -104691 -252275 14089 -21940 -84315 -32162 260570 -24183
15844 67303 -115292 -134195 175688 -27793 -278424 224155 -194313 -260506 29282 -66576 -121802
15833 -121802 363357 340620 239443 57987 78988 47160 -101809 104595 -187022 -102049
15823 -102049 -49528 318223 -195428 28533 -201778 140031 -291025 166564 179714 144657
15813 144657 25106 -205820 153864 -187062 -41450 -233881 280397 -42562 148592 152772
15803 152772 -64765 219107 -354616 -205650 11021 -52123 -66293 -238066 -238994 43335 67401
15792 67401 163676 33357 74136 50808 183326 -200203 29910 -150823 98944 86798 32536
15780 187920 -185783 143285 -28457 -74199 251548 199136 -124632 -19815 86244 68667 255751
15769B55751b12904A04989m3925k9986b4443A383b67938a9121A35245c1354B68576
15757A82688H6933b77568B40288D9100N6258j5344c1831m1611F9807l0324J12886
15746A52369a11209p2094P4413B51452a81264B7512a73155q8578d1465E9995J2914
15735G2909L4538a60859B00353q3458K6327a18600B7732b32157J09309d6319r5143
15724a41462r7777K2675L7922H9925O8744o5766B7782d84999E9752b31884D3607
15712G2818a3383F0674g3216b1251j7745M146A36377d889A39940b64127A67057
15700a69012L3882e5345A06729c41678h3441c692j02365l23960d2452j01677A67861
15688A98871F2307N5104c30707J62386L7972K6779B44518c81976A6698b59424
$$ plain form
15769 255751 -212904 104989 61064 31078 -24443 1383 -267938 -19121 135245 -31354 268576
15757 182688 86933 -277568 240288 49100 105358 90014 -31831 -73442 69807 39483 152369
15746 152369 -111209 -183303 -108890 251452 -181264 27512 -173155 -261733 -41465 59995 72909
15735 72909 107447 -160859 200353 116895 143222 -118600 27732 -232157 -122848 -46319 -141462
15724 -141462 -239239 -216564 -178642 89925 158669 92903 27782 -484999 59752 -231884 43607
15712 72818 -13383 60674 -73216 -21251 -38996 -34850 136377 -4889 139940 -264127 167057
15700 -169012 -135130 -55345 106729 -341678 -83441 -3692 -106057 -430017 -42452 -144129 167861
15688 198871 62307 117411 -330707 -168321 -130349 -103570 244518 -381976 16698 -259424
15677F9441b51596C8546b4994q5811j18660C494b1213I1055b5674j05496e6997
15665b97246d880k19885P445A12790b24447A32101a58330k5498g5655A54791a23621
15653c41607A2825K00796c4388B15684a67560I242b23530G3932a15849M0885a4790
15641b37131e3116C7034b16418g9774H2337C5113J51136O4b44059P6091B16650
15629I1142a83945B91118A40272a68052f269H5987a33606L0582A30745l0851d6041
15617A00883a87879B01975p2028a61443B06732a10527p5302j40884c0257q2885
15607a13142E1145I766c6012C23418J89659B42399i6697B01088a43861J4160o9985
15596a99686j50760J68975j2800A7489b65194p9066D9237c4521q4981c3086o750
$$ plain form
15677 69441 -251596 38546 -24994 -110805 -229465 3494 -21213 91055 -25674 -131170 -56997
15665 -297246 -4880 -224765 -217320 112790 -224447 132101 -158330 -183828 -75655 154791 -123621
15653 -341607 12825 213621 -34388 215684 -167560 9242 -223530 73932 -115849 -74964 -14790
15641 -237131 -53116 37034 -216418 -79774 82337 35113 186249 186313 -244059 -167968 216650
15629 91142 -183945 291118 140272 -168052 -6269 85987 -133606 -103024 130745 99894 -46041
15617 100883 -187879 201975 129947 -161443 206732 -110527 -185829 -326713 -30257 -113142
15607 -113142 51145 9766 -36012 323418 513077 242399 -96697 201088 -143861 -129701 -199686
15596 -199686 -350446 -181471 -194271 17489 -265194 -344260 49237 -34521 -119502 -33086 -39836
15585c9836Q820A86042a3733k0590q9722I1300K3112d81829B96633l9598A4342
15573c06098P072B35747G7725a54873c9525k9452H0812d1668B15465b14941i4708
15561a69143A7438j172b95429F5871F074a53355A71711c52453A60703O4738h044
15549A77951R5819b7825j55925f5953m1322C00336d6456p8313I6364J11212c0885
15537A69761b287A87495b7083q5536F5316k3626a71675p7843a10741B51399a92374
15525a21066a079n7050J970B60063A6398P9014K1257g3162A50176a23496k26459
15514c49955C36233C4922J65308b04712N9390e2771p6895p9517a9332j17959j26024
15503b63315I9194k5878b10149h683I8358A9942d8474j06013e2734G5761a28353
$$ plain form
15585 -39836 -31016 186042 -13733 -34323 -124045 91300 114412 -481829 296633 257035 14342
15573 -306098 -299026 235747 77725 -154873 -39525 -68977 80812 -41668 215465 -214941 -94708
15561 -169143 17438 16266 -295429 65871 6074 -153355 171711 -352453 160703 225441 -8044
15549 177951 273770 -27825 -183750 -65953 -107275 300336 -46456 -124769 96364 207576 -30885
15537 169761 -2287 187495 -27083 -112619 65316 41690 -171675 -249518 -110741 251399 -192374
15525 -121066 -1079 -58129 -56159 260063 16398 95412 116669 -73162 150176 -123496 -349955
15514 -349955 336233 34922 200230 -204712 -145322 -52771 -129666 -209183 -19332 -137291 -263315
15503 -263315 99194 73316 -210149 -8683 98358 19942 -48474 -154487 -52734 75761 -128353
15491B04039d47503A82983d07916B17248J749d2902H077J46255M8304H5702k9169
15480E6533K1314e1637A20958J75892I9831h055I5218Q3171N2879b45545A11587
15468a57427A90440E2665b59718p3173A00390a35990K4240r0932J3511A47000
15457A86408c3740k28139r3608C4846e5883c075k75961p5000B66040b2494j70202
15446a92696p3598H3627P5414a00197A48532N25612B08541n4694K898J55472r130
15435C03087D0774f5823A23893d18515A97266R9678a78140A09236L52691H5276
15424a42806C19649E3212b32253a15005d7126B07883I0621k0062b45725J12259
15414a33466a1355D7386a28405a694j09512c4086J1494p9390L5534Q113B39774
$$ plain form
15491 204039 -447503 182983 -407916 217248 218997 -42902 8077 154332 202636 85702 56533
15480 56533 77847 -51637 120958 296850 99831 -8055 95218 178389 231268 -245545 111587
15468 -157427 190440 52665 -259718 -332891 100390 -135990 -111750 -202682 -189171 147000
15457 186408 -33740 -261879 -355487 34846 -55883 -3075 -279036 -354036 266040 -22494 -192696
15446 -192696 -266294 83627 159041 -100197 148532 674144 208541 153847 156745 312217 303087
15435 303087 40774 -65823 123893 -418515 197266 296944 -178140 109236 461927 85276
15424 -142806 319649 53212 -232253 -115005 -47126 207883 90621 70559 -245725 -133466
15414 -133466 -11355 47386 -128405 -1694 -111206 -34086 -22592 -101982 -66448 -58335 239774
15402A62948a07287K7603j47048i9036d7055q8528B87358c5594C83124a6515r1516
15391a08031G0145j9598L8740b94878i3348q269K507B03403J37192c1846Q875
15380b2971c040l90621B25424e2966E3300N4587b33282g2781A22181K1183d2319
15368A03768f6091j27014F2467h8521B07257a18752F0796J64754J2820B9291J94025
15357B23316p7604J1262A6977c15758B54217d7629n0569B39924g7283A13496B0643
15345A00141K05417r5190R7872n1261q949b03468i6274C74533m2761j06180C4176
15333B45284a28336j63184R1792k26400A72029J41505c50l6026B76606o8672g5516
15321b3311k6771A20760g4969A00452Q5259l449g0325A35310i9347n1438A18542
$$ plain form
15402 162948 -107287 -79684 -226732 -99036 -47055 -135583 287358 -35594 383124 -16515 -108031
15391 -108031 70145 50547 89287 -294878 -93348 -101617 -99110 203403 340595 -31846 -22971
15380 -22971 -3040 -393661 225424 -52966 53300 107887 -233282 -72781 122181 143364 -42319
15368 103768 -66091 -193105 62467 -88521 207257 -118752 60796 225550 238370 29291 223316
15357 223316 145712 156974 16977 -315758 254217 -47629 -98198 239924 -77283 113496 20643
15345 100141 305558 210368 308240 256979 248030 -203468 -96274 374533 331772 225592 34176
15333 245284 -128336 -291520 -199728 -426128 172029 313534 -350 -36376 276606 207934 -75516
15321 -23311 -50082 120760 -74969 100452 185711 182262 -70325 135310 -99347 -150785 118542
15309D24861f2968E1064e7610C9929a11875A78850m2039i0911r1788B30318G2943
15297a05084G6971K5321L1563a78855C9808b019A69406a08914D0170J44985c59
15285d6525A77572F7506c45487D65948D4167J05995a48536B771g998A58216a5662
15273a28724A37758B8254K51056g4213I2748c03198i0276j83778a24442A68328
15262D9179J5682b2402l5506H3995q474A7361K2062g3570C1945P0171R7280K42100
15250D41496K77398P88497k38354j45398N78302G49450l57944b34373p8351B05712
15239c21758B15159k6043a14619c4928B69266E7348f6256E0911b89858A21508
15228a49356a6404I0021K00541a70077M5588N29A65576B8499a90746A5445e5382
$$ plain form
15309 424861 -62968 51064 -57610 39929 -111875 178850 136811 -90911 -182699 230318 72943
15297 -105084 76971 102292 133855 -178855 39808 -2019 169406 -108914 40170 185155 -359
15285 -46525 177572 67506 -345487 465948 44167 150162 -148536 2771 -7998 158216 -15662
15273 -128724 137758 28254 279310 -74213 92748 -303198 -90276 -274054 -124442 168328
15262 49179 64861 -22402 -57908 83995 75521 17361 39423 -73570 31945 102116 199396 441496
15250 441496 718894 1507391 1269037 1123639 1701941 749450 391506 -234373 -312724 205712
15239 -321758 215159 189116 -114619 -34928 269266 57348 -66256 50911 -289858 121508
15228 -149356 -16404 90021 290562 -170077 -124489 -123960 165576 28499 -190746 15445 -55382
15216b48870J12082C8992J94364D2529Q46K0578g1677k076B18588o7362L2678
15205A83904d6792I1906J24699J54532a4048A74353a0763F9801E437a22620k23601
15194c46221H0567A3422A221P0265K77505A46457j5573n5716j1203J31384p7459
15183A17890N2003h1165n4899n7678D4013J36326A8727d1893B01268f1064C26358
15171I1793j2587A1016J11174P7154g545r1120D93725j99703e1921A9450g5948
15159B98524b53420d4807k7494i309A20430L2887j9386b85627a06356I2389J11530
15148B03919C5777a56120H5366k9418J22624m5493k4900D2553K74636l7136D7660
15136i4648A73085f0271B00215r7647K7969J46623M721J12839a08311B31958F7745
$$ plain form
15216 -248870 -136788 38992 233356 42529 43375 63953 -71677 -73753 218588 151226 183904
15205 183904 -46792 91906 216605 371137 -14048 174353 -10763 69801 5437 -122620 -346221
15194 -346221 80567 13422 1221 71486 348991 146457 130884 75168 63965 195349 117890
15183 117890 169893 -81165 -136064 -193742 44013 180339 18727 -41893 201268 -61064 326358
15171 91793 79206 11016 122190 199344 -7545 -98665 493725 294022 -51921 19450 -75948
15159 298524 -253420 -44807 -72301 -9309 120430 153317 133931 -285627 -106356 92389 203919
15148 203919 35777 -156120 85366 55948 178572 133079 108179 42553 317189 280053 47660
15136 -94648 173085 -60271 200215 102568 130537 277160 281881 394720 -108311 231958 67745
15124a28165C53592M5355b40671A42708a67523d8102F0492J69747j05801R9226
15114B23664b5634D7938g2299D7308b8951A07755m1270J27803e9227B28049J07108
15103C35157o7380C7398c9216B25646E9644b9406l84516B74750b14031I4614a8375
15091C50684E1724j123L6588b05483B72726b36800B31020C9913P3845g6762A55563
15079A17659J31022J07591O1166A36994g3678r0087A67437N8082I0502L40076
15069D30578A07411B8537K6071c8939C4843H95b41404C60074l6880m3313A26514
15057B17524I3047L7971R8542n9746J9588c8136C53524A13163J45316j10068R8707
15046B47118d3513B07056D5726M18307b687A5481K59885P3007d207B96212R994
$$ plain form
15124 -128165 353592 398947 -240671 142708 -167523 -48102 60492 230239 124438 223664
15114 223664 -25634 47938 -72299 47308 -28951 107755 66485 194288 -59227 228049 335157
15103 335157 267777 37398 -39216 225646 59644 -29406 -413922 274750 -214031 94614 -18375
15091 350684 51724 50601 87189 -205483 272726 -236800 231020 39913 113758 -76762 155563
15079 117659 248681 356272 417438 136994 -73678 -163765 167437 225519 90502 430578
15069 430578 107411 28537 54608 -38939 34843 895 -241404 360074 323194 279881 126514
15057 217524 93047 131018 229560 169814 189402 -38136 353524 113163 258479 148411 247118
15046 247118 -43513 207056 45726 464033 -2687 15481 275366 348373 -4207 296212 306206
15035C06206a05963F3030K47146A50844M6089B6295J70843K19965J14004B58618
15024E30834j8686j64775j05636p9020J79930A56765M748b9808B42699J1913p5528
15013A79084J64905N6109j15847l4991J17550r2626j951P536P6515K58426I7862
15001B17760F5477J25980J90170k7136j28008o5956G5991M5295N89950B11372
14990C58673R6811A13877Q7271G9087K68267J29012A89395O8436J69461r0377
14980C36915A36298M60287o7046k38547q1977O7607j9338K442K1983O6672j9451
14969C28930J97731j33370J19619J40119k12684j04322q4301K35437L0118B22370
14958B96248J53540j83679K5944j06109M11589A59644J33500R8111G2622L14110
$$ plain form
15035 306206 -105963 63030 310176 150844 196933 26295 197138 417103 531107 258618
15024 530834 512148 347373 241737 162717 342647 156765 161513 -29808 242699 254612 179084
15013 179084 343989 400098 284251 249260 366810 274184 272233 279769 356284 614710 97862
15001 217760 65477 191457 381627 354491 226483 160527 75991 121286 711236 211372
14990 358673 455484 113877 201148 79087 347354 476366 189395 257831 427292 336915
14980 336915 136298 596585 529539 290992 209015 276622 257284 259726 281709 348381 328930
14969 328930 526661 393291 512910 653029 440345 336023 251722 487159 517277 222370
14958 296248 449788 266109 292053 185944 597533 159644 293144 391255 72622 386732
14948C86732r7622O6568j53748R1940D4718N13802k49898L60393C01972L22028
14938F24000B25621K86210n9860r2307B8752L23520r392A06661K26959P706L64413
14927G05739K6108l47374L94220l53025N1515K20532K03201L6798K02839k99734
14917H40819k93146L49263Q3932j42884k97655J82375p8540j32201J38386A71685
14906D06517j38779J99838p3540A77304J29417j5662j31224n4601M26616A56339
14895B17355M37433j36936B4336J31932L89309B36551R4530A22924J09257K60439
14885D92620a03149F61204J4070k9708C19935L49316A91799G6543O34856k97498
14875D13901q3898J9455K92516k44553l8641M2629A35116J17787K96325q369j77234
$$ plain form
14948 386732 289110 355678 201930 293870 44718 558520 308622 669015 301972 624000
14938 624000 225621 511831 451971 359664 28752 352272 342880 106661 333620 341326 705739
14927 705739 731847 384473 778693 425668 477183 697715 900916 937714 1140553 840819
14917 840819 547673 896936 980868 837984 540329 722704 644164 511963 650349 171685
14906 406517 267738 467576 394036 177304 306721 291059 159835 105234 531850 156339
14895 217355 654788 517852 24336 156268 545577 236551 331081 122924 232181 492620
14885 492620 -103149 661204 675274 645566 319935 669251 191799 76543 711399 413901
14875 413901 330003 349458 641974 397421 358780 401409 135116 252903 549228 540859 363625
14864C63625J18464k35451K3443n7508M04084k47079K02120B42029J63138j8122
14854C87045j80443K85159o4834K85847c235E00826j32103J00157j59165J60958
14844D70673J9817L2060J61091C28465J25953N20541m7064l14635M4038r4626
14834E62672k20152L48815M4562j96912F7744M74706K05543B94299K39199k32329
14824C01169A31695M43107B59046K00820K55071k04775j31847R3595K70377J03417
14814H45704l41374B08135l0175M16547L1475l11482m678j8491K6557G5320L56295
14803D31615Q9631K9419q0128N52984k68862k39973O2107j58265Q8709J62984
14793F70221j81940J17188O6803k81824J88431J25132l29434n8692L01682K16164
$$ plain form
14864 363625 482089 246638 270081 212573 616657 369578 571698 242029 405167 387045
14854 387045 206602 491761 426927 712774 -3235 500826 368723 468880 309715 470673
14844 470673 490490 522550 683641 328465 454418 974959 927895 613260 657298 562672
14834 562672 342520 691335 735897 538985 67744 542450 747993 294299 533498 301169
14824 301169 131695 574802 259046 459866 714937 510162 378315 471910 742287 845704
14814 845704 504330 208135 177960 594507 625982 314500 309822 291331 317888 75320 431615
14803 431615 521246 550665 470537 1023521 754659 514686 576793 418528 507237 670221
14793 670221 488281 605469 672272 390448 578879 704011 374577 315885 617567 833731
14783H33731C11076J45196j95277J53728J72178k4151j71861K98602q1351r7846
14773E10294J36070K51747l92207j74053K45152k32123j47809N85231j14459A75455
14762F76019K80583l80254J75582l8418j14084j24570Q7213P2523j21480r4451
14752D18663K87402Q9609k98762K47891l0485j12955L86077j89912l23590K21171
14742F95109k37512K52770K9802k18960q5677K22262B98649K90495j05246J45705
14732F29603J05419J64687p3331k30017M28828k22114J59851j22693J12027o7105
14722H85155j28600N1371J20809J37227j13146l94250L09367L8154j58391q2656
14712F65040p7419K65489o3021K18022q3246m6674J82628k09365j01798J83346
$$ plain form
14783 833731 311076 456272 260995 414723 586901 562750 390889 689491 608140 510294
14773 510294 646364 898111 505904 331851 577003 344880 197071 782302 667843 175455
14762 676019 956602 576348 751930 713512 599428 474858 562071 634594 513114 418663
14752 418663 706065 795674 496912 744803 714318 601363 987440 797528 473938 695109
14742 695109 457597 710367 740169 521209 435532 657794 298649 589144 483898 629603
14732 629603 735022 899709 826378 596361 1025189 803075 962926 840233 952260 885155
14722 885155 756555 807926 928735 1065962 952816 558566 867933 906087 747696 665040
14712 665040 587621 853110 790089 1008111 924865 878191 1060819 851454 749656 933002
14702I33002j54561K21572o8231J71123j10731J55515K1531k14030J66560L8013
14692A159763J00097l11721K38843j04321K75289n43776J31771N3550m9042j54596
14682G95857J33623o0218J76986l13706L31839O1818k14876J71866k49829k01954
14672F31406L10451j33772M3427J84544k0347J34081J8904l1211J19007o1521
14662A194969j94658k51043L60910j71166K95685j1025l39175M29011L1912j70662
14652A174758L1270l35501M27328q31K25806n35223K65988o6087j68572J59110
14642A178046j91878M51307o21563L92510j10402K82255m6285J61062m60363j8353
14632A016336j8508K72488J22894k39419J49118k58702k5319M62401l53711j67115
$$ plain form
14702 933002 778441 1000013 931782 1102905 992174 1147689 1169220 955190 1121750 1159763
14692 1159763 1259860 948139 1186982 1082661 1357950 814174 945945 999495 950453 795857
14682 795857 929480 869262 1046248 732542 1064381 1126199 911323 1083189 833360 631406
14672 631406 941857 808085 851512 1036056 1015709 1149790 1168694 1137483 1256490 1194969
14662 1194969 1000311 749268 1110178 939012 1234697 1223672 884497 1313508 1345420 1174758
14652 1174758 1206028 870527 1297855 1297024 1522830 987607 1253595 1187508 1018936 1178046
14642 1178046 986168 1437475 815912 1208422 1098020 1380275 1333990 1495052 1034689 1016336
14632 1016336 997828 1270316 1393210 1153791 1302909 1044207 1018888 1481289 1127578 960463
14622I60463M09692N7981k36535J76252j08827M37597l18460j46378L90405k26602
14612A395588K5152k71148J58978M3555L56610J5674n95652M16624p6486n7305
14602A411590j68801N34149m31143K71507M1186k30714M1633J46320j19063L08526
14592A805190K62214l26489J24148k56523l1824K30020j93135J49787J20061p265
14582A876184j72993j99530J62378l6741L98865J3472o7453k68001L32454j10628
14572A928007J83787l5945p5724M30075k37166O1293j6246j21145L46046j92752
14562B270230L59020k92290K99089Q6461J03110n4399L70534L1149M29773N07314
14552D109991K85673M70441J527122K574777M025307P847867J3261428K103409
$$ plain form
14622 960463 1370155 1428136 1191601 1367853 1259026 1696623 1378163 1231785 1622190 1395588
14612 1395588 1420740 1149592 1308570 1352125 1708735 1724409 1128757 1545381 1468895 1411590
14602 1411590 1242789 1776938 1345795 1617302 1658488 1427774 1469407 1615727 1496664 1805190
14592 1805190 2067404 1740915 1865063 1608540 1576716 1806736 1613601 1763388 1883449 1876184
14582 1876184 1703191 1503661 1666039 1629298 2028163 2041635 1974182 1706181 2038635 1928007
14572 1928007 2111794 2075849 2000125 2430200 2193034 2254327 2238081 2116936 2462982 2270230
14562 2270230 2629250 2336960 2636049 2722510 2825620 2771221 3141755 3172904 3602677 4109991
14552 4109991 4395664 4866105 6393227 8968004 12993311 20841178 34102606 36206015
14544C6206015j6256516r627841m561389j825839p76086n71293l45083K0373p5680
14535B186661k84261K93097k81979l7254O14087k75109q4488j02629q677j03474
14525A915974L27165j27262J77797m0823M01081j92000q3843Q1308j86823K21561
14515B494135k044o5065L15911n2099R0115k47066J45126P3935P8381l54672J96854
14504B673511j70442K67707K13621P2901j37339p482J79644J08061n14914M97039
14494C182307J09016l31254M98258j49336j02058N3531R6818K90822l07297L25452
14484C666259N6372r2411P7250K58272j27016j33830r9530K98576L73994q9166
14474D188770m6921j8057j90169L9072L40378j63069J08014k26424K04132P1360
$$ plain form
14544 36206015 19949499 10321658 5760269 3934430 3158344 2587051 2241968 2262341 2186661
14535 2186661 1902400 2195497 1913518 1876264 2490351 2215242 2130754 2028125 2019448 1915974
14525 1915974 2243139 2115877 2293674 2252851 2653932 2461932 2378089 2459397 2272574 2494135
14515 2494135 2492091 2427026 2742937 2690838 2780953 2533887 2679013 2752948 2831329 2476657 2673511
14504 2673511 2503069 2770776 2984397 3057298 2919959 2912477 3092121 3200182 2685268 3182307
14494 3182307 3291323 2960069 3458327 3308991 3206933 3260464 3357282 3648104 3340807 3666259
14484 3666259 3722631 3630220 3707470 3965742 3838726 3704896 3605366 3903942 4277936 4188770
14474 4188770 4141849 4123792 3933623 3972695 4313073 4150004 4258018 4031594 4235726 4307086
14464D307086M0574P8974J12166M3995J62852o6756k11224M09389J28783L5869
14454E041708j86521N1571J30870J30444r6934L16270J21491l87172K89958k40329
14444E171356O22237L5297K43342j11040l9345K84818l57223K61661j33649J77277
14434F154731K40564r9424Q6731J79263K62222R4071J13402K29542j87791P3524
14424G146835J73006J70151j28795M54194J66337j36412r6953L55758J90730K0516
14414H315367L64913k58030J19295O56957J84688o01933L94862K25119l00355
14405I100883O01139J52671J44367j90767N88623n5145J29084J58977K28111L36788
14395A1194731J17956K17916K19291k85696K87661N64772r6529K12879L46377
$$ plain form
14464 4307086 4347660 4426634 4538800 4582795 4745647 4678891 4467667 4877056 5005839 5041708
14454 5041708 4855187 4906758 5037628 5168072 5071138 5387408 5508899 5121727 5411685 5171356
14444 5171356 5793593 5828890 6072232 5961192 5921847 6206665 5849442 6111103 5977454 6154731
14434 6154731 6395295 6295871 6382602 6561865 6824087 6918158 7031560 7261102 7073311 7146835
14424 7146835 7319841 7489992 7361197 7815391 7981728 7845316 7748363 8104121 8294851 8315367
14414 8315367 8680280 8422250 8541545 9198502 9383190 8781257 9176119 9401238 9100883
14405 9100883 9702022 9854693 9999060 9808293 10396916 10341771 10470855 10629832 10857943 11194731
14395 11194731 11312687 11530603 11749894 11464198 11751859 12316631 12220102 12432981 12779358
14386A2779358K98525K25623N9476N56105J26478K40857J44856M25073J62644
14377A5018995N10275J73397L90200J57253L96510K38048L18849K13906O83435
14368A8100868K58868N08491K62008K33910M14348O04206M46367J25580Q57919
14359B1812565J39546N13664O79038P18119M76583L62285O01705L71042O49449
14350B6323996Q81485P73574K57614R76485P47854O58810J027935P24006P14697
14341C3086456P77374J095987J325078L18128R72685J288879J088898J294793
14333D1248278J053764J247667J821847R84518J468569J474515J461169K139097
14325E2899424J128470J961947J992892J778357K470671K063968K288233K360532
$$ plain form
14386 12779358 13077883 13303506 13362982 13919087 14045565 14286422 14431278 14856351 15018995
14377 15018995 15529270 15702667 16092867 16250120 16646630 16884678 17203527 17417433 18100868
14368 18100868 18359736 18868227 19130235 19364145 19778493 20382699 20829066 20954646 21812565
14359 21812565 21952111 22465775 23144813 23862932 24339515 24701800 25303505 25674547 26323996
14350 26323996 27205481 27979055 28236669 29213154 29961008 30619818 31647753 32371759 33086456
14341 33086456 33863830 34959817 36284895 36603023 37575708 38864587 39953485 41248278
14333 41248278 42302042 43549709 45371556 46356074 47824643 49299158 50760327 52899424
14325 52899424 54027894 55989841 57982733 59761090 62231761 64295729 66583962 68944494
14317F8944494K468410K599948K945840K902257L151886L627090L182763L617308
14309I3439996M042940L885141M445612M457607M588741N442450N314318O045292
14301A31662097N899331O608873O641782P034859P854714Q108667Q372589R259937
14293A91442849R793800R625744J1123130J0967214J1681775J2153126J2501297
14286B69288935J3388987J3413476J3702986J4382814J3890858J4391225J3531256
14279C65990537J3533346J3313375J2209445J0954001R398564P162974L587699
14272D36149941J686286J775442J100720l39220l165258l455055n087712p310877
14264D21354267r073497j0804519j2204794j2816302j3817295j4471759j4592212
$$ plain form
14317 68944494 71412904 74012852 76958692 79860949 83012835 86639925 89822688 93439996
14309 93439996 97482936 101368077 105813689 110271296 114860037 120302487 125616805 131662097
14301 131662097 137561428 144170301 150812083 157846942 165701656 173810323 182182912 191442849
14293 191442849 201236649 210862393 221985523 232952737 244634512 256787638 269288935
14286 269288935 282677922 296091398 309794384 324177198 338068056 352459281 365990537
14279 365990537 379523883 392837258 405046703 416000704 425399268 432562242 436149941
14272 436149941 437836227 439611669 440712389 440373169 437207911 433752856 428665144 421354267
14264 421354267 412280770 401476251 389271457 376455155 362637860 348166101 333573889
14257C33573889j4876841j4398883j3346667j3186443j3803274j2407934j2279679
14250B39274168j1643014j1086120j0461108j0281706r175415q633540q422043
14243A69571222q028807p436656p189607o524006o210151n964422n381691n541059
14235A17294823n011437m713187m194574m226442l812162l429490m220679l036490
14227H4650362l356559l262511k593638k924477k372882k619895k244063k396581
14219F2879756j698184k245458k104987j557516k063334j371258j351920j764128
14211D8722971j775689j179314j513140r03137j298586j052006j378827j103104
14203C8519168j009419j208677p10730m52334j388480q57114j096560j048063
$$ plain form
14257 333573889 318697048 304298165 290951498 277765055 263961781 251553847 239274168
14250 239274168 227631154 216545034 206083926 195802220 186626805 177993265 169571222
14243 169571222 161542415 154105759 146916152 140392146 134181995 128217573 122835882 117294823
14235 117294823 112283386 107570199 103375625 99149183 95337021 91907531 87686852 84650362
14227 84650362 81293803 78031292 75437654 72513177 70140295 67520400 65276337 62879756
14219 62879756 61181572 58936114 56831127 55273611 53210277 51839019 50487099 48722971
14211 48722971 46947282 45767968 44254828 43351691 42053105 41001099 39622272 38519168
14203 38519168 37509749 36301072 35590342 35138008 33749528 32892414 31795854 30747791
14195C0747791m803j278801p61586n99607n43596q85723o48365m00535p02977
14186B4921798n46405m11085o29551m86051o96043l86281p64093m45039Q0580
14177B0637830p50756k13962k80106p24536l8189p60628J47091n18402k26215
14168A7272127j73671l65276m46807n47171L2964n14418J75604r7125p89158l26250
14158A4220819R3840q42440K6474l59798l84766k25276J14514k69578j93351l49553
14148A1830885o6067p7674k35915k56486o7275j38573l86532J391k63959K2092
14138A0361887O0416n99447m0258j83965l72873N04600m67595j72619K9923l96366
14128H723703O0148l49033N6976n0956k37291l9973k33911P4138k66887K5459
$$ plain form
14195 30747791 30742988 29464187 28702601 28102994 27559398 26673675 26025310 25624775 24921798
14186 24921798 24375393 23964308 23334757 22848706 22152663 21766382 21002289 20557250 20637830
14177 20637830 19887074 19673112 19393006 18668470 18630281 17869653 18016744 17498342 17272127
14168 17272127 17098456 16733180 16286373 15739202 15772166 15257748 15433352 15336227 14547069 14220819
14158 14220819 14314659 13472219 13498693 13138895 12754129 12528853 12643367 12373789 12180438 11830885
14148 11830885 11764818 11687144 11451229 11194743 11127468 10988895 10602363 10603754 10339795 10361887
14138 10361887 10422303 9822856 9782598 9598633 9225760 9730360 9262765 9090146 9120069 8723703
14128 8723703 8783851 8434818 8491794 8440838 8203547 8163574 7929663 8003801 7736914 7762373
14118G762373m7022m2054j57926m42469L03083l24357K61498k39663k54465p2349
14108F746649j90454J33235K0561n1900m53860J36632j73630j44561J09046q9653
14098F042065l83695J31086M62813l20100k42057m4793P477j70281K70241m77772
14088E274984L76843o82359M29413q196l14078j34351M61537n89246J56237j84529
14078D786255j45992L1454m2488m1845k2511j28159L3852k50572J66992O0993
14068D447979J0636O926M4434m93578n81L21046j81258K18095p9573l43588K66233
14057D216771j98328O8958M2180j46075k97288Q7949r3369m41711J19946K2825
14047C381858R0020J89035j69496j82755l2142j0856P8816k9898J45194N6345
$$ plain form
14118 7762373 7715351 7673297 7515371 7072902 7375985 7051628 7313126 7073463 6818998 6746649
14108 6746649 6556195 6689430 6709991 6658091 6204231 6340863 6167233 6022672 6131718 6042065
14098 6042065 5658370 5789456 6252269 5932169 5690112 5645319 5652796 5482515 5752756 5274984
14088 5274984 5651827 4969468 5398881 5390685 5076607 4942256 5403793 4814547 4970784 4786255
14078 4786255 4640263 4671717 4629229 4587384 4564873 4436714 4470566 4219994 4386986 4447979
14068 4447979 4458615 4465541 4509975 4016397 4015816 4336862 4155604 4373699 4294126 3950538 4216771
14057 4216771 4018443 4087401 4129581 3983506 3686218 3774167 3680798 3239087 3359033 3381858
14047 3381858 3471878 3660913 3491417 3308662 3276520 3265664 3344480 3314582 3459776 3516121
14037C516121J65954m95558J93649l85941K75737j25181J82702l54329K944m61
14027B975637R9856n25900J39866J91623L7399q2623L57869m32737k08898J70916
14017B723008Q6400l9976Q7597J05924l36989k93648K48982j5410j41368J01513
14007B526033p7115j40500K35621k05511j69751K84865l56246r565J58117k69977
13997A975971L30131J38722j80349p0383K7054J84289O47440N56123J348758K961535
13987G919291N962720J2327183R326397r915719j0394971n269302k646273j765301
13979E544025p71978p06394m42931j32511l41404J40601l28671J6483o9238j96211
13969B711771k22790J23025r7897Q4638n41192P5017K27523r4530j05666M80494
$$ plain form
14037 3516121 3682075 3186517 3380166 2994225 3269962 3144781 3327483 2973154 2976098 2975637
14027 2975637 3075493 2549593 2689459 2881082 2918481 2835858 3193727 2760990 2552092 2723008
14017 2723008 2809408 2769432 2857029 2962953 2625964 2332316 2581298 2565888 2424520 2526033
14007 2526033 2448918 2308418 2544039 2338528 2168777 2453642 2097396 2087831 2245948 1975971
13997 1975971 2306102 2444824 2264475 2194092 2221146 2405435 3052875 3608998 4957756 7919291
13987 7919291 13882011 26209194 35535591 25619872 15224901 9955599 7309326 5544025
13979 5544025 4772047 4065653 3622722 3490211 3148807 3289408 2960737 2977220 2907982 2711771
13969 2711771 2488981 2612006 2514109 2598747 2057555 2132572 2360095 2265565 2159899 2640393
13959B640393m19826k2947j79806Q431j76838M40131k02719K83495o5695K3105
13949B327724m66245K05296q9556m5833n48469M03182J54415r6685j7484m8872
13939A777473r5003L13720j61005K8017k93355J13222J40203j56755J33656l38302
13929A461871M91201l63471J5705J50638k18387j29881K53190q7346M3772J12677
13919A729969k81268L0251P1569q8186J33395j17579J51267L8397l55017N33018
13909A845816n83899M98792l75535r9691m539K68719L00598n16214J24778k22525
13899A236300P1367K45237l0259P8910j72117J58055k98137O699j90822R5153
13889A200386J42406l64503O12279k79738j90256M2415K46348l92803L35820k78775
$$ plain form
13959 2640393 2220567 2197620 2017814 2026245 1849407 2289538 2086819 2370314 2304619 2327724
13949 2327724 1861479 2066775 1977219 1931386 1382917 1786099 1940514 1843829 1826345 1777473
13939 1777473 1682470 1996190 1835185 1863202 1569847 1683069 1823272 1666517 1800173 1461871
13929 1461871 1953072 1589601 1605306 1755944 1537557 1407676 1660866 1573520 1617292 1729969
13919 1729969 1448701 1478952 1550521 1462335 1595730 1478151 1629418 1667815 1312798 1845816
13909 1845816 1261917 1760709 1385174 1285483 1280944 1549663 1850261 1334047 1458825 1236300
13899 1236300 1307667 1552904 1522645 1601555 1429438 1587493 1289356 1296055 1105233 1200386
13889 1200386 1342792 978289 1590568 1310830 1120574 1162989 1409337 1016534 1352354 1073579
13879A073579L14988r9289O7508l9617l09607K8556J11702j09344L5639J17499
13869A191614Q6970j04847j63645J71852m3432j1259j2752J60268j0353l5286
13859A229130k14007J10757k02327N62790o41056J59189k14144J88121l2902l2916
13849I12635L96610k28638J55437j40446j62143J31490K16373k36242j49359m0750
13839H54967L18756K5411l79521N7165L5088q3478J0343M99504m48509m8772M55299
13828A296253m63750K54260j59399J51101j28937L3114r7685k8039K02181k95752
13818G63347K08176k30997J25527L28474k52854j46719K53536l2733j5374m07270
13808E93113L35293K4147j15680n7905O9552J99244P152m11054N58453m58296
$$ plain form
13879 1073579 1388567 1289278 1356786 1317169 1007562 1036118 1147820 1038476 1074115 1191614
13869 1191614 1278584 1173737 1010092 1181944 1138512 1127253 1114501 1274769 1264416 1229130
13859 1229130 1015123 1125880 923553 1486343 845287 1004476 790332 978453 945551 912635
13849 912635 1309245 1080607 1236044 1095598 933455 1064945 1281318 1045076 895717 854967
13839 854967 1173723 1199134 819613 876778 911866 828388 838731 1338235 889726 840954 1296253
13828 1296253 832503 1086763 927364 1078465 949528 982642 884957 856918 1059099 763347
13818 763347 971523 740526 866053 1194527 941673 794954 1048490 1015757 1000383 593113
13808 593113 928406 952553 836873 778968 848520 1047764 1054916 643862 1202315 744019
13798G44019J18004J10896k09562q9512L35539J22665k33012k18657J05837O3020
13788H49237j22599O4266l71971O12354l31457k25172K12811J96394P7051l54847
13778F06067K64592k0828K8208k40137L47615l83315k19301P5130O09035m22603
13768F44463k21q275N7080o7245K37785j26776k54105K23531J31645q9096J12364
13757H61150M9279D47595Q1403M14829p4281l41604N1781p5285j83252K89462
13747F10648j84048J55463M2340n703K13601l24097j70523K09149J36958l3547
13737F50241J44670L1729k19418K59453j82228k31923M54725k95748O6515q3664
13727E94352J47142l53308L94733B40082J11012P1469K39789K2687n9839k12247
$$ plain form
13798 744019 862023 972919 763357 673845 1009384 1132049 899037 680380 786217 849237
13788 849237 726638 790904 418933 1031287 699830 474658 687469 883863 960914 606067
13778 606067 870659 849831 878039 637902 985517 602202 382901 458031 1067066 644463
13768 644463 644242 635967 693047 625802 863587 736811 482706 706237 837882 748786 861150
13757 861150 910429 447595 528998 943827 869546 527942 579723 504438 321186 610648
13747 610648 426600 582063 624403 618700 832301 508204 337681 546830 683788 650241
13737 650241 794911 826640 607222 866675 684447 452524 907249 611501 678016 594352
13727 594352 741494 388186 782919 240082 351094 422563 662352 685039 625200 412953
13717D12953o8185J68040K74679l09321L03846J50226k81263k214k42326n9813
13707C46622K78795J23462k58590J19092k38798K73721K37430B26696K15370K37819
13697F79885j94103K8098B16464L14009Q6448K77065j32947C43074J27865K33748
13687G04687n9292l09042J78540m8176Q9542D6352N85158L5674j52855R4377o5266
13676E43440k03012l2859p3778L31751K37836l5042j45522B29334L29738q02l056
13665E55214G1312O00749B09204K24781j73785O06523l41834k48493A15616J11669
13655B27285K88533j57680K90696k04326r3353J96965j60084A66922K86734n4790
13645C98866J18075o1287l0343N9793j03809L21840B43133L78439j65991j10051
$$ plain form
13717 412953 344768 512808 787487 478166 782012 932238 650975 648761 406435 346622
13707 346622 625417 748879 490289 609381 370583 644304 881734 226696 442066 679885
13697 679885 485782 513880 216464 530473 616921 893986 761039 343074 470939 704687
13687 704687 645395 336353 514893 466717 556259 46352 631510 667184 514329 608706 543440
13676 543440 340428 307569 233791 565542 803378 768336 622814 229334 559072 558270 555214
13665 555214 71312 672061 209204 433985 260200 866723 524889 276396 115616 227285
13655 227285 515818 358138 648834 444508 351155 548120 388036 166922 453656 398866
13645 398866 516941 455654 425311 485104 381295 703135 243133 621572 455581 345530
13635C45530j5758n0414J4804J34174N8169L32867l71412A91314J80951o2312
13625C09953L11736n6572j51651o95R9372J29169k53260L27838a95202E15371
13614F21303B50580p0504M92014j57920j79224q5621j4406J8671j18063J12111
13604B47638K55525q6275A5111Q30051B41786J05277L83546j98415j44935j25971
13594B61288J04936J00264A44963J78559J04072k2952J69098j93739K0774j56626
13584B44149J74302J71505k15452j26632J61266n1434A16081M40922k9354G9946
13573D56170j0372k10220K45775j90830I0633L78344m8446K02032J4549B22103
13562C82346j14232Q3806A1380K85785K10265J0081J97635B58098N5400B9664
$$ plain form
13635 345530 329772 279358 294162 428336 486505 819372 447960 191314 372265 309953
13625 309953 621689 565117 413466 412771 512143 641312 388052 715890 -195202 515371
13614 621303 250580 180076 672090 514170 334946 249325 234919 253590 135527 247638
13604 247638 503163 416888 15111 845162 241786 347063 730609 532194 387259 261288
13594 261288 366224 466488 144963 323522 427594 404642 573740 380001 400775 244149
13584 244149 418451 589956 374504 247872 409138 357704 116081 557003 527649 79946
13573 456170 445798 235578 481353 290523 90633 468977 420531 622563 637112 222103
13562 382346 268114 351920 11380 297165 507430 517511 715146 258098 313498 29664
13551A67363p3936K17454j06165M218B6466L81299j77819n4588K12891K78322
13541F66571q5977A24328K00375A47470J55804m7091J85751Q1822J94847B36677
13530B38893K13187l0127F8138K68617l7451Q8387m1818R9240A73685L4943H0242
13518D05933H8333K76616J19261j20034p2209l3693H0739J37396p6905J19506
13508B60736A18800M1709O9368M9446J43389D8690K08258L84641k35871J16455
13498E22173A51252M73627d3101F1868J24970K05578L9194A79300F9605L80124
13488D49729k20641a35421B40227H8283m2683K75706A47087c5365B78388e9750
13477A23922J06182J3586K26184j49512o9609k0509J16232J0560R067M7115A78387
$$ plain form
13551 167363 93427 310881 204716 208934 26466 407765 229946 175358 388249 666571
13541 666571 580594 124328 324703 147470 303274 256183 441934 523756 718603 236677
13530 238893 452080 421953 68138 336755 299304 387691 345873 445113 173685 208628 80242
13518 405933 88333 364949 484210 364176 291967 258274 80739 218135 141230 260736
13508 260736 118800 160509 229877 279323 422712 48690 256948 641589 405718 522173
13498 522173 151252 624879 -43101 61868 186838 392416 431610 179300 69605 449729
13488 449729 229088 -135421 240227 88283 45600 321306 147087 -35365 278388 -59750
13477 123922 230104 243690 469874 320362 250753 230244 346476 357036 366103 413218 178387
13465A76218A7799J89000L45531I0859P371J25246q2484K56592m4077A19746J84732
13454C04478j35239J318a5846A50185J22856p3138o8030O1243P7189p8639J66032
13443C57698A50015K62298A23738c1592A65706J68626A42469N0635L51402h5753
13432A43935p961P0366p8716K43130A74769M212o1310J54294k0161J93515j11656
13421C33663m520J38839A75892F4402J72797j04942R0499p7805c4642B02484J86125
13410C88609j56882J25854o3631A07340K88410a10841F8720c7946A89699C7960
13399B32613I7946J86640k7633L65388j25382j94919q4941P79J65992j19872J3810
13388B77808B7460e9971D10308D303J40174L9289L8206L3340J540j17844J32361
$$ plain form
13465 176218 17799 206799 552330 90859 98230 223476 140992 397584 353507 119746 304478
13454 304478 169239 170557 -15846 150185 273041 199903 131873 193116 270305 191666 357698
13443 357698 150015 412313 123738 -31592 165706 334332 142469 193104 544506 -85753
13432 143935 135974 206340 127624 370754 174769 178981 117671 271965 251804 445319 333663
13421 333663 329143 467982 175892 64402 237199 132257 222756 144951 -34642 202484 388609
13410 388609 231727 357581 293950 107340 395750 -110841 68720 -37946 189699 37960
13399 232613 97946 284586 256953 622341 496959 302040 217099 217878 383870 263998 277808
13388 277808 27460 -59971 410308 4303 144477 183766 221972 255312 256852 139008 271369
13377B71369j4997K02040k26673J41923A84920m9624J24446o6691J14235C9677
13366E873L95109M0984p2920B0781a8945C84821K44236C2805L48715A53707K61446
13355D15153C1950g2210H7060L48345e5070B51760g0368C84814j71299A04668
13344A13092D2244j9519K82688J34305K7003K29124D7888M28323A85953D3715
13333D32877h1674B27519J60317c3879D69494q8908j04182K4572B7486d5179A72769
13321C32958C2583M9560M30049A18571a25463C31987G963K36970D1073P5424J99192
13310C15689k5630a9774B74960I2578K54849k1312g2345B952a68144J0974A21683
13298B12001F5387a8202A95442q6584J76360O9539R8243n3254C9550J79175I4233
$$ plain form
13377 271369 256372 458412 231739 373662 184920 135296 259742 193051 307286 39677
13366 5873 400982 441966 369046 20781 -18945 384821 629057 32805 381520 153707 415153
13355 415153 31950 -72210 87060 435405 -55070 251760 -70368 384814 213515 104668
13344 113092 42244 22725 305413 439718 466721 695845 47888 476211 185953 43715
13333 432877 -81674 227519 387836 -33879 469494 380586 276404 300976 27486 -45179 172769
13321 332958 32583 82143 512192 118571 -125463 331987 7963 244933 41073 116497 315689
13310 315689 290059 -19774 274960 92578 347427 326115 -72345 2952 -168144 -157170 121683
13298 212001 65387 -18202 195442 108858 285218 354757 453000 399746 39550 218725 94233
13286b02198A36834O3751H0266K00967P4994A44064J78377l875c7524A1610e5500
13274A47734a48540A55628F9933K47675A30231o4571O1339A8831Q5684K28047
13264C32562A45883c14817b7783p0500R201G625J42995J51374C4413R6234K25139
13253C55786b49944I8567l1323k8126a81958C84838A70776J62484m5269j30828
13243A57163h9294D23159A1994K30274a28438E1672b47890B53847Q5982b84719
13232I9040L058a11601b5121C07267K19462b9795H8123O4323b35959A23836M35834
13221E59670g7117j29686A4806b7339B84664A15716k9296P0453J31493r8218b73299
13209A23807f8037A29993J75621A49701g3023G6658J13040o348n300J07137o9472
$$ plain form
13286 -202198 136834 200585 80266 281233 356227 144064 322441 318566 -37524 11610 -55500
13274 147734 -148540 155628 69933 317608 130231 65660 126999 18831 104515 332562
13264 332562 145883 -314817 -27783 -98283 -89082 7625 150620 301994 34413 130647 355786
13253 355786 -249944 98567 67244 39118 -181958 384838 170776 333260 287991 157163
13243 157163 -89294 423159 11994 242268 -128438 51672 -247890 253847 339829 -284719
13232 99040 102098 -111601 -25121 307267 526729 -29795 88123 152446 -235959 123836 559670
13221 559670 -77117 -206803 14806 -27339 284664 115716 86420 156873 288366 190148 -273299
13209 123807 -68037 129993 305614 149701 -73023 76658 189698 183350 178050 285187 215715
13198B15715K26592B06687C0435K6748J55439C1174L70713j90155F8177J94106
13188B62283b25374C31209A22640f8199A06542J47235L0007f1433A47069K03969
13178C51038a91418B07656n4823b25412B11363e1057C70919A02309d5023o5844
13168a10867C4684K23696q0070R1778p3270H7814D0892h6972A1691L49269b04334
13156D1449f8859E2887a29153B07246i2041C35082m9917J38470E7995a80017I1203
13144B135h9189G9322a45201B49880j00243a29819A92560a06449A03591k4167
13134G9424K42171b8713C14066a03006A89657h0235b5465B79161a11223j19211
13124b30434J07032E5581i0963C09571a9078j56414E4408K3824h9548k23388B74063
$$ plain form
13198 215715 442307 206687 30435 57183 212622 31174 401887 211732 68177 262283
13188 262283 -225374 331209 122640 -68199 106542 253777 283784 -61433 147069 351038
13178 351038 -191418 207656 152833 -225412 211363 -51057 370919 102309 -45023 -110867
13168 -110867 34684 258380 178310 270088 196818 87814 40892 -86972 11691 360960 -204334
13156 41449 -68859 52887 -129153 207246 -92041 335082 285165 423635 57995 -180017 91203
13144 2135 -89189 79322 -145201 249880 149637 -129819 192560 -106449 103591 79424
13134 79424 321595 -28713 314066 -103006 189657 -80235 -25465 279161 -111223 -230434
13124 -230434 -123402 55581 -90963 309571 -19078 -175492 54408 78232 -89548 -312936 274063
13112B82096A17008a30366A06760P6058J44651A29564J31492G4615A379K20993
13102B22372a11170j68381B3035b08892D7146K13298n3534F8538K18979h3976
13091D92158b6157I980J38627J19939p3224a2304l7680G1315k795M2874F026J31211
13079A37237a60844C3687J28464i825m0672B69482e8217b0487j9384D6335L03945
13068C50280a70168B17219r3412h8066A68646a5942A79763n1934j6038c6364E175
13056a29902B27827j6517A02641a63367A90925J29143b44959C9894J47955B063
13045A21872R6228C5877K07450d0247C38543h4999A12465D8584h4596R669C63526
13033I7524a93155O5278C42533A37142d5467A15971a62607f7002B41585b1460
$$ plain form
13112 282096 117008 -130366 106760 182818 327469 129564 261056 74615 1379 222372
13102 222372 -111170 -279551 23035 -208892 47146 260444 206910 68538 287517 -83976
13091 492158 -26157 9980 148607 268546 195322 -12304 -49984 71315 68520 111394 6026 137237
13079 137237 -160844 33687 162151 -9825 -50497 269482 -58217 -20487 -39871 46335 350280
13068 350280 -170168 217219 123807 -88066 168646 -15942 179763 127829 111791 -36364 5175
13056 -129902 227827 211310 102641 -163367 190925 320068 -244959 39894 187849 2063
13045 121872 218100 35877 243327 -40247 338543 -84999 112465 48584 -84596 -74927 363526
13033 97524 -193155 -127877 342533 137142 -45467 115971 -162607 -67002 241585 -21460
13022D0639J76994E9402K68132a01935D31518A06431D1535d8982o9027A18757
13011D56429C2228d0628E3826J60726D2849a17131B13078J67393A10255a12122
13000a55461N1273A69893b5245F3848j6704J68771F1913J91128C5798a77452j93019
12989c70471B50656c1974F5591b8681A17195j1296m066B8336K55122N8571b30895
12977c4850A19245J11179p3293M6921q9812e1359a3156F8847L067M65903k62968
12966B74849D2739a99505C5520P8443a66765C26014E1629g636L669o7984A70760
12954E1113a2076I4419a00472C99214a6549B77965H4734E370L0179M79042A40544
12942i3710A34360a37213A25808n9529B5896J23857F1462a3969D67423i7477j12631
$$ plain form
13022 40639 217633 59402 327534 -101935 431518 106431 41535 -48982 -118009 118757
13011 456429 32228 -40628 53826 214552 42849 -117131 213078 380471 110255 -112122
13000 -155461 -104188 169893 -25245 63848 47144 215915 61913 253041 35798 -177452 -370471
12989 -370471 250656 -31974 65591 -28681 117195 105899 101833 28336 283458 342029 -230895
12977 -34850 119245 230424 157131 204052 114240 -51359 -13156 68847 71914 537817 274849
12966 274849 42739 -199505 35520 113963 -166765 326014 51629 -7636 -3967 -71951 170760
12954 51113 -12076 94419 -100472 399214 -16549 277965 84734 5370 35549 514591 140544
12942 -93710 134360 -137213 125808 66279 25896 149753 61462 -13969 467423 -97477 -210108
12931b10108A49877J8106K1222A7116h1686k7462c0270k9694A8945K17802A6988
12919a9921r1180q7398M7686l1916A59316a81296o7897C73449f0282p3196C92977
12907c44371B58O8475a94026B15594i4204A64163i9730a9015A35042M7361p2578
12896A09825e6887J4433o9042A71996l2233M64c8050A54523K5054p4340D5401
12884b64161P8890n834A36537P2503G7363a81336M9813O1757A67488g7596A5376
12872b30699H9169K7675J37116A7531K21664A17062E0069L691K09858b1537m9827
12861g1364D7086c3997n47058b09208b0004A16866L54932B7653i4041F9901i1836
12849A71465D7653h9596A29477O0406a91416H393M22589E2577A6728L02354A6124
$$ plain form
12931 -210108 149877 167983 189205 17116 -81686 -109148 -30270 -59964 18945 236747 16988
12919 -19921 -111101 -198499 -150813 -182729 159316 -181296 -249193 373449 -60282 -133478 392977
12907 -344371 258 68733 -194026 215594 -94204 164163 -99730 -19015 135042 182403 109825
12896 109825 -56887 -42454 -111496 171996 139763 140227 -38050 154523 179577 105237 45401
12884 -264161 -185271 -191105 136537 209040 77363 -181336 -131523 -69766 167488 -77596 15376
12872 -230699 89169 116844 253960 17531 239195 117062 50069 53760 263618 -21537 -71364
12861 -71364 47086 -33997 -581055 -209208 -20004 116866 471798 27653 -94041 69901 -91836
12849 171465 47653 -89596 129477 189883 -191416 8393 430982 52577 16728 319082 16124
12837C6154J33689F0718J46533l5929D2157b7935A10250N3993m1627b65068d6248
12825A4806g0634m4517Q615a996D3597b7509A154J45039a67325B21953J71350
12814C93303a31059B38726o5910J7459e04998a22454L9467F6022k4518J4040c1102
12802B6179e6226B69171f419n9065A19214e8032l39429R8999A17803b12500h2167
12790a48058j9082C8257J05511D7398a24409D9785K1909E030J65144K8439L1680
12779B30293I2384a05341L7258B38741a10430A9849K62841a95859h4051r5262
12769a79313B92178c018H7743l08g9139A73924C7485f328m3167j83707A77099
12757C10738i2540j71665F962f3921A18079k3176J01884D5315b52599L391A1176
$$ plain form
12837 36154 169843 60718 207251 171322 42157 -27935 110250 164243 122616 -265068 -46248
12825 14806 -70634 -115151 -106536 -1996 43597 -27509 1154 146193 -167325 221953 393303
12814 393303 -131059 238726 172816 190275 -504998 -122454 -82987 66022 41504 55544 -31102
12802 26179 -56226 269171 -6419 -65484 119214 -58032 -397461 -298462 117803 -212500 -82167
12790 -148058 -167140 38257 143768 47398 -124409 49785 71694 5030 170174 198613 230293
12779 230293 92384 -105341 -68083 238741 -110430 19849 282690 -195859 -84051 -179313
12769 -179313 292178 -3018 87743 87435 -79139 173924 37485 -6328 -49495 -233202 177099
12757 310738 -92540 -264205 6962 -63921 118079 94903 196787 45315 -252599 -249208 11176
12745a24484c7793C43344e0383B89672E4880K08219i2299j40949b0957A71096
12734G1587J08619n3680J26502b4583l8091C6683K6413Q0843P1181k697I2181
12722f506B53561b13992C83289j61237l7107o4984J02916d18j1322A17988H541
12710a00076A62247J18825C1442b44003C28159j03412j05337R7159H8748K83064
12700C71812c67274D3197R1271d7532j59496A06958a15901l77212D8072a13836
12689f6121m1827A24755c33466I3309c7779A97911i6106F59L17263a51069f6740
12677B11750J76491k7094e3746E2372j8696P2664J30467j04887J68199A34194
12666D329M0633a28124F4319J10975j1278e9439J2891A60733j7214n5069J08921
$$ plain form
12745 -124484 -37793 343344 -50383 289672 54880 263099 -92299 -233248 -20957 171096
12734 71587 180206 126526 253028 -24583 -62674 36683 63096 143939 215120 212423 92181
12722 -6506 253561 -213992 383289 222052 184945 119961 222877 -418 -11740 117988 8541
12710 -100076 162247 281072 31442 -244003 328159 224747 119410 216569 88748 371812
12700 371812 -367274 43197 134468 -47532 -207028 106958 -115901 -493113 48072 -113836
12689 -66121 -107948 124755 -333466 93309 -37779 197911 -96106 659 317922 -151069 -66740
12677 211750 388241 361147 -53746 52372 33676 106340 236807 131920 300119 134194
12666 4329 44962 -128124 64319 175294 164016 -59439 -46548 160733 143519 88450 197371
12655A97371G248J0051J22187O2465D3878K11361c3723C19436b13310A86578p2152
12644A14426a56614B71692E6599Q0886a81495A9946c9029k19261j0110B02740
12633a24422N6226C1795Q5166k8230g0792J4068C298L82211A72802j6024f374
12621c3399B32894a12559F3313a32535B75915A6122a55070G1292k5459d6173H6061
12609a4502B33700I2303J92185G7280k570d2405J840j88155B40156a67225A05824
12597A42694l8345a62173A7149K03593A1039b00333j95400A17538b33835f4972
12586B4693J567d93405B40873A00501j8642N1607Q9617B5973a5910I3555i3554
12574A1866J01564L1324J05825b3278C44845c63373J03702e0111D8946n190J41753
$$ plain form
12655 197371 7248 17299 139486 201951 43878 255239 -33723 319436 -213310 186578 114426
12644 114426 -156614 271692 56599 137485 -181495 19946 -39029 -258290 -268400 202740
12633 -124422 -68196 31795 116961 88731 -70792 -56724 3298 385509 172802 156778 -6374
12621 -33399 232894 -112559 63313 -132535 275915 16122 -155070 71292 45833 -46173 86061
12609 -14502 233700 92303 284488 77280 74710 -42405 -40565 -228720 240156 -167225 105824
12597 142694 104349 -162173 17149 220742 11039 -200333 -395733 117538 -233835 -64972
12586 24693 26260 -493405 240873 100501 81859 133466 223083 25973 -15910 93555 -93554
12574 11866 113430 144754 250579 -23278 344845 -363373 -259671 -50111 48946 43756 185509
12563A85509O073B9100b3509E3926j1002h9579k25647I8337a30507k39740A77845
12551A39491d194D8008i1145A38497b1269l7397n93530d0545a6388j5429k90927
12540c22744A04481J78173I7466f6550q9769g2678A38676E4055J80807C1775b9378
12528A0325M7104c0517C6484a7470A15891a2165j9435B2561d5375m3521A85742
12516A29964b06088M7550D4458a66939B62174b37161i1022p7982k480j4136D5267
12504f0401E7072B5369i6859n8717A3016M8982j569a97855B90904c13335g1245
12492C238h9640A66089a2990k60687E7194a90825A83653A0216J86478E6717b4042
12480B76397a33811A10841f4854A78422M2828b49444H4586B0663e3377B4458L92188
$$ plain form
12563 185509 191582 29100 -23509 53926 42924 -89579 -315226 98337 -130507 -370247 177845
12551 139491 -4194 48008 -91145 138497 -21269 -58666 -652196 -40545 -16388 -31817 -322744
12540 -322744 104481 282654 97466 -66550 -156319 -72678 138676 54055 234862 31775 -29378
12528 10325 57429 -30517 36484 -17470 115891 -12165 -31600 22561 -45375 -88896 185742
12516 129964 -206088 -158538 44458 -166939 262174 -237161 -91022 -169004 -171484 -185620 45267
12504 -60401 57072 25369 -96859 -155576 13016 61998 60429 -197855 290904 -313335 -71245
12492 3238 -89640 166089 -12990 -273677 57194 -190825 183653 10216 196694 56717 -24042
12480 276397 -133811 110841 -64854 178422 221250 -249444 84586 20663 -53377 24458 416646
12469D16646f2620B00064a45730d1690B96325C3416A765O0059J47015g8900J173
12458g7727m5632A64626P4760m0898M4235a24154B32609a18832j89605B87007
12447B09550c3078p4958F3515L676g4165a9468A06097K03124a44750e6706k88439
12436c45145B13360b8886j76221a5926k70227A38256a14223A08700b12463A33189
12425C2746c49497A3355O8311d6178p3925H5738i0216A31097m6237a38356l79923
12414e18279B56744G1362f9133j30751A48117b8571j56024a0418F913g9277c2095
12402b02431c8793n0256C0926P8094D1152c74402A9722R5926l1354d2232A4617
12390e9006J6110J9267P342k06961E5960O1826d8329p6557H4341h589j83642c7973
$$ plain form
12469 416646 -62620 200064 -145730 -41690 296325 33416 1765 61824 208839 -78900 -77727
12458 -77727 -123359 164626 239386 198488 242723 -124154 232609 -118832 -308437 287007
12447 209550 -33078 -108036 63515 67191 -74165 -19468 106097 309221 -144750 -56706 -345145
12436 -345145 213360 -28886 -205107 -15926 -286153 138256 -114223 108700 -212463 133189
12425 32746 -349497 13355 81666 -46178 -120103 85738 -90216 131097 84860 -138356 -518279
12414 -518279 256744 71362 -69133 -199884 148117 -28571 -184595 -10418 6913 -79277 -32095
12402 -202431 -38793 -89049 30926 109020 41152 -374402 19722 115648 84294 -42232 14617
12390 -59006 -42896 -23629 -16287 -223248 55960 117786 -48329 -124886 84341 -8589 -192231 -37973
12377A89422J66231a40046B39518j06181j081h1898B38855G2625a07153N2462
12367e4691n7888d5460A49590n8600k8919A7874a60746A38155K01488d9479p1356
12356a20835B00179a6943p7726A48854c8405A56782o6474J74800c9548q9590A01329
12344A69079m1514a44908n0274J0859d7310a1698A57927a93781L4595C44278b5289
12332I0400O8800A1238R3899b47131i2144D01762G8079N725l3962P5861d265H4692
12319B6750R4876D5482R8750J42126D8815K96097m9298h503p0848B2745o799J91311
12307B07257c1830j36173C03437K6903E1670J40361A3519J36675c73513A36672
12296a10197R160F7401K01686o1862a39573A53221a33757I6479L33220C7715b05539
$$ plain form
12377 189422 355653 -140046 239518 133337 132256 -81898 238855 72625 -107153 -54691
12367 -54691 -112579 -45460 149590 90990 62071 17874 -160746 138155 339643 -49479 -120835
12356 -120835 200179 -16943 -94669 148854 -38405 156782 90308 265108 -39548 -129138 101329
12344 169079 127565 -144908 -195182 -184323 -47310 -11698 157927 -193781 -159186 344278 -25289
12332 90400 159200 11238 105137 -247131 -92144 401762 78079 83804 49842 125703 -4265 84692
12319 26750 121626 45482 144232 286358 48815 344912 295614 -8503 -79351 22745 15946 207257
12307 207257 -31830 -168003 303437 330340 51670 192031 13519 150194 -373513 136672
12296 -110197 -101037 67401 269087 207225 -139573 153221 -133757 96479 429699 37715 -205539
12284E7900L65664A04368D1941a11932C04118d3127N042a6108H0647A6121i8825
12272D3085J79243A06587k1770P7729h2205l1321D179b2758B34969J82390A36442
12260c69223b9374A15690M831c26611f588H7202b25895C6165a72738b8246A60818
12248a05296n420q7264B93869O1029E2674d6763k0424n1547M6583L5589A84084
12236a87458A89806F1484K2042j6509L96718b99B30381P855a34479B48677C2150
12224C01138g0612o2122A62821a2762C47175A27359M6957J65893C8804M19703
12214D58507j1522j84278a9225D77579B9150J63660K09706a3769G4438K48725
12204C23163H9349M9943J16366q0505l1226N4575J77406A17169C8150J72331l5610
$$ plain form
12284 57900 423564 104368 41941 -111932 304118 -43127 -38085 -16108 80647 16121 -98825
12272 43085 222328 106587 84817 162546 -82205 -113526 4179 -22758 234969 417359 136442
12260 -369223 -29374 115690 120521 -326611 -6588 87202 -225895 36165 -172738 -28246 160818
12248 -105296 -110716 -197980 293869 354898 52674 -46763 -67187 -118734 -72151 -36562 184084
12236 -187458 189806 61484 83526 67017 463735 -299 230381 238236 -134479 248677 32150
12224 301138 -70612 -132734 162821 -12762 347175 127359 174316 340209 38804 458507
12214 458507 446985 262707 -19225 477579 29150 192810 402516 -13769 74438 323163
12204 323163 89349 139292 255658 175153 143927 198502 375908 117169 38150 210481 174871
12193A74871K43514E9823K42426j50655J8339G2934J38205o7417C1449a40531
12182A13342A6028J89028d4795C11307f864C6938J07927b8585C29906f1274A22335
12170h4603E3044c8742C45889b5792D10346A7072P7051M02322j31963A43466k2200
12159A21266A1968b65298A47635i9091C64159c37584A42035J9296a31986A87039
12148H4467b19085R4162C11250a35464e7959j8942I2273a71918H4631d1554D5435
12136A10998i0366D18748d37957F5216K1124h3988p4319A23002a94641j6868D23850
12124f7805k7875A22798J57064g2513C5716a17777H6568l3322K13314r7303L1974
12113B01231a35761D86391H6680N692a73566A69139K89824f3602r5551C25136
$$ plain form
12193 174871 418385 59823 302249 151594 169933 72934 211139 143722 31449 -140531
12182 113342 16028 205056 -44795 311307 -6864 36938 144865 -28585 329906 -61274 122335
12170 -84603 53044 -38742 345889 -25792 410346 17072 94123 496445 364482 143466 121266
12159 121266 11968 -265298 147635 -99091 364159 -337584 142035 161331 -131986 187039
12148 84467 -219085 -124923 311250 -135464 -57959 -76901 92273 -171918 84631 -41554 45435
12136 110998 -90366 418748 -437957 65216 86340 -83988 -158307 123002 -194641 -211509 423850
12124 -67805 -95680 122798 279862 -72513 35716 -117777 86568 53246 266560 169257 201231
12113 201231 -135761 486391 86680 92372 -173566 169139 458963 -63602 -159153 325136
12102I3466b89589a0555j96457a1242I7856a94247C6134Q4470a68217F8564a05093
12090B35564i8845o2980j63733A68481b46341P7871j19377R5653K331B01743K03839
12079D05582D973k435J13940a75343p1128a4267A34906n7530c2088k7212o5308
12068a24608c2280B70182h0928F10225G8672M35161k01293j15820G413c6530C1822
12056A17108O7907R5604E728c81015a13558B30826h818D243a60544b8643B62572
12044a86055H6697k5043K86597a69484O3567I7562a62696A39026A1464c12839
12033B84730a83148D4541d252j04210j70086Q5789b3394B65250b47345J14520
12023a32825A05317B3737L15487j26536M6371a19229j8750k9898I5093J51122
$$ plain form
12102 93466 -289589 -10555 -207012 -11242 97856 -194247 36134 120604 -168217 68564 -105093
12090 235564 -98845 -161825 -325558 168481 -246341 -168470 -287847 -192194 -189863 201743 405582
12079 405582 4973 2538 116478 -175343 -246471 -14267 134906 77376 -32088 -59300 -124608
12068 -124608 -32280 270182 -80928 610225 78672 513833 312540 196720 7413 -36530 31822
12056 117108 185015 280619 5728 -381015 -113558 230826 -8818 4243 -160544 -28643 262572
12044 -186055 86697 61654 348251 -169484 -105917 97562 -162696 139026 11464 -312839
12033 284730 -183148 44541 -4252 -108462 -278548 -192759 -23394 265250 -247345 -132825
12023 -132825 105317 23737 339224 212688 259059 -119229 -137979 -167877 95093 246215
12013B46215p2878l4820h531p4254A05562d9222H0705N3135c4556A80560i0641
12001A29680n5596d08869e0688B10319r2717h3080k02647F5701a97181e2773j8947
11990g1720b117I869a32809C66592a78154p7903c3028m40497c8023B38760b81872
11978A7786c5291B55274f9315j96522j5604j23606f8800l6331a8814k5426C8030
11966b29639R9559j68237a16444d3750k68640a43731f8289A14607d14916A55508
11955A34280J74015b28692B5368b28662C4742a91962B53988a39419I440J82348
11945A91788a5220l79516a66693A61233A4707g1567A85572H1004L5195O8281c044
11933a56438d3594o4604B01801e4319j97872a25206q9587p2862A34565M0041b41494
$$ plain form
12013 246215 173337 138517 -8531 -82785 105562 -49222 80705 133840 -34556 180560 -90641
12001 129680 74084 -408869 -50688 210319 117602 -83080 -285727 65701 -197181 -52773 -71720
11990 -71720 -2117 9869 -132809 366592 -178154 -256057 -33028 -473525 -38023 238760 -281872
11978 17786 -35291 255274 -69315 -265837 -281441 -405047 -68800 -105131 -18814 -44240 38030
11966 -229639 -130080 -298317 -116444 -43750 -312390 -143731 -68289 114607 -414916 155508
11955 134280 308295 -228692 25368 -228662 34742 -191962 253988 -139419 9440 191788
11945 191788 -15220 -394736 -166693 161233 14707 -71567 185572 81004 116199 184480 -3044
11933 -156438 -43594 -108198 201801 -54319 -252191 -125206 -214793 -287655 134565 174606 -241494
11921a05963F920K77628H7078l9340a96952k29054e8646C57273b56263B66912
11910C4541J72282l6430a71784G1349d7617A30274a04063k24418h3729G7263K7308
11899A04571k5871a27886D67271I2057b12584k42442g0611C15428h1926B84889
11888a4098m6813G238K31615c50150A69065b90289i6379A08681b48671I3688a50560
11876D7239c4967A82969b40676n9811B4773H889b1103B18700L3806I9596j8019
11865H1577a5007E4247K65747a9861A39597n7373d8535I8995a22609A02865i4046
11853h3598B8832c00593B92093H1770a96977A14631B6377i8536d7284m4219H9209
11841H7024a2806n6760b4459A61327C7236c52669A74913b97306M3369A15325e06853
$$ plain form
11921 -105963 6920 284548 87078 47738 -196952 -426006 -58646 357273 -256263 266912
11910 34541 206823 170393 -171784 71349 -47617 130274 -104063 -328481 -83729 77263 104571
11899 104571 78700 -127886 467271 92057 -212584 -455026 -70611 315428 -81926 284889
11888 -14098 -60911 7238 238853 -350150 169065 -290289 -96379 108681 -248671 93688 -150560
11876 47239 -34967 182969 -240676 -300487 24773 8889 -21103 218700 252506 99596 81577
11865 81577 -15007 54247 319994 -19861 139597 82224 -48535 98995 -122609 102865 -94046
11853 -83598 28832 -300593 292093 81770 -196977 114631 26377 -98536 -47284 -91503 89209
11841 87024 -12806 -69566 -24459 161327 37236 -352669 174913 -297306 -253937 115325 -506853
11829A2223L2012A6229L7405a55594E9880f6581q4257A10518a1547k4204a1058
11817h7711A31318A1821K23494g0740l1424m2229A47097b6264A6597a25481A05635
11805a25750A12403m3447c7380l28458C24M6806a05154d7394C20229c5118A28531
11793a2089c250r104A87a42675N4329l08126B5560a9269k95928c3725B69696p5970
11781A93726g4938c5629k5856O059j03031A141a93468b4055k08774j24921F7544
11769h38k01138o4490B4294c41729J0493a6048k71505C10714b78267d7605j76191
11758b23796A1788c2275A02549c53151G9061a35202e7452H9122L76570H1325c8045
11746a84148c1281l02906C51621E4659o473d9808A58629b19745h7620j20934c6450
$$ plain form
11829 12223 44235 16229 53634 -155594 59880 -66581 -150838 110518 -11547 -35751 -11058
11817 -87711 131318 11821 235315 -70740 -102164 -144393 147097 -26264 16597 -125481 105635
11805 -125750 112403 68956 -37380 -365838 324 47130 -105154 -47394 320229 -35118 128531
11793 -12089 -3250 -12354 187 -142675 -88346 -396472 25560 -19269 -315197 -33725 269696 193726
11781 193726 -74938 -35629 -61485 -55426 -158457 1141 -193468 -24055 -232829 -357750 67544
11769 -838 -201976 -266466 24294 -341729 -331236 -16048 -287553 310714 -278267 -47605 -223796
11758 -223796 11788 -32275 102549 -353151 79061 -135202 -57452 89122 465692 81325 -38045
11746 -184148 -31281 -334187 351621 54659 48186 -49808 158629 -219745 -87620 -208554 -36450
11734A9919c36229a2715H8946b04294m9384a7041I5838R7303B9299J58267d8052
11722d2350k23097B5221f0818b8236C5466d5657F30037b7210j44515A23992D4901
11710i518m4208p8356G742b12731A2346K01246f9361m6427a3210A2852a20024
11698a53617c5230A4765M39638C6996a12896C8688b4470m3414k20872A39458k0316
11687A19142c76107C36607A7611K31340Q8846a29302A58557l9471q969b19800
11676g4183L3844j8120o9249F661a31794M077A13430a08999A91874c0042j57763
11665a87805E9519j2536J01493a90119c7923j39844D0643g4372k80197a16102
11654a3927J156q3031D0257a4013A21802b0564H9742D0356Q864e5700B8417a18209
$$ plain form
11734 19919 -336229 -12715 88946 -204294 -253678 -17041 95838 193141 29299 187566 -48052
11722 -42350 -265447 25221 -60818 -28236 35466 -45657 630037 -27210 -171725 123992 44901
11710 -9518 -53726 -132082 7742 -212731 12346 213592 -69361 -115788 -13210 12852 -120024
11698 -153617 -35230 14765 454403 36996 -112896 38688 -24470 -67884 -288756 139458 119142
11687 119142 -376107 336607 17611 248951 337797 -129302 158557 119086 110117 -219800
11676 -74183 -40339 -58459 -127708 6661 -131794 -127717 113430 -108999 191874 -30042 -187805
11665 -187805 59519 46983 148476 -190119 -37923 -177767 40643 -74372 -354569 -116102
11654 -13927 -12771 -95802 40257 -14013 121802 -20564 89742 40356 49220 -55700 28417 -118209
11641f7501j82418L938A67145J33366a70057J6632A18603j6938K18952c02152
11630F0405a88227f609k64347I8537J54542a27385A11489j351a69295A36006K040
11619A38046k6210a06447j6236b189B24867a1196k75841A9671P4035d6551E9206
11607g9376A19549B2100n59J37358a49455A22159J21691G8408J28377j6074B796
11595B01012f2517j05009G5908a46092B1896Q9126c6943D04423a89159K7212P7232
11584h4715A31114g7731B45321R0211F3924b1637A55786p594g0817O617f403j0815
11572a7218j40732f6117B07069d0551B35185I8280L38618a00377o243a0433C30505
11560e6261a5878j92541A8210M18236F7639L17207j02240o3703a24270C3272a29331
$$ plain form
11641 -67501 -249919 -245981 167145 300511 -170057 -153425 118603 101665 320617 -302152
11630 60405 -188227 -6609 -270956 98537 253079 -127385 111489 110138 -169295 136006 138046
11619 138046 111836 -106447 -122683 -2189 224867 -11196 -287037 19671 93706 -46551 59206
11607 -79376 119549 22100 21541 158899 -149455 122159 243850 78408 206785 190711 2796
11595 201012 -62517 -167526 75908 -146092 21896 111022 -36943 404423 -189159 -161947 -84715
11584 -84715 131114 -77731 245321 335532 63924 -21637 155786 148192 -70817 -64200 -6403 -17218
11572 -17218 -157950 -66117 207069 -40551 235185 98280 436898 -100377 -106620 -10433 330505
11560 -56261 -15878 -208419 18210 436446 67639 384846 282606 218903 -124270 33272 -129331
11548B28344R87c54191B10236B4760J70995q9849K56202A21447J03500P92A04891
11536a3574j00158A23057k1213O0213G4036e0319D29743G3257a86522A49394b30569
11524A8840K3578L38699b8572j46854j5095a7691C774K85742g8492A48239e3576
11512F7032c724B7459a14114n9239A52200R8014A1262N5367i7106B11925E2635
11500B32192e5716A69214E8396n420J74820J5284d7955B98784A37794R242A6613
11488a62601H9127J00538J11596f447C74060c9568A6075L31632a81536A70947
11477B85010K67145a07620d4513A808K39448G7328L4778m474A6135J49230o9262
11466I6103M3071J02408q4286l3916N5071h0670E71466B4757L73943a76678A9286
$$ plain form
11548 228344 229331 -354191 210236 24760 195755 105906 362108 121447 224947 225739 104891
11536 -13574 -113732 123057 101844 162057 74036 -50319 429743 73257 -186522 149394 -230569
11524 18840 42418 381117 -28572 -175426 -190521 -17691 3774 289516 -78492 148239 -53576
11512 67032 -3724 27459 -114114 -173353 152200 250214 11262 66629 -97106 211925 52635
11500 232192 -55716 169214 58396 52976 227796 243080 -47955 298784 137794 147036 16613
11488 -162601 89127 189665 301261 -6447 374060 -39568 16075 347707 -181536 170947
11477 285010 552155 -107620 -44513 1808 241256 77328 112106 107632 16135 165365 96103
11466 96103 139174 241582 157296 123380 178451 -80670 571466 24757 398700 -176678 19286
11454A65044M9681p3786d6911n4549B90430b08326b9234A03093a94434E9990B4664
11442A26639J67574l3193a34002E0005a29131A24600L5927D8979J48220K408b0609
11430I4472G021N228b70080B11934a46290B5147J06761F4848h444k02170d2342
11418B19874a21474B28766a74284B6848a17585c2743B29732c9130j04254B00251
11407A14854a4338j27302a701p14A43791A2896E962L5444K63727a2945B4425i3632
11394a39105D537a0854G6948a34814l76329K12235R9630C2481R476c5348D6496
11382g2455A38574E442i4104p7240H4873d1364A57365B9909P8824N26010I3668
11370b44763a3102k06156b8129H355a14268A72277a07028D22530A79344Q9762
$$ plain form
11454 165044 214725 140939 -46911 -101460 290430 -208326 -29234 103093 -194434 59990 24664
11442 126639 294213 261020 -134002 50005 -129131 124600 160527 48979 197199 199607 -20609
11430 94472 7021 12249 -270080 211934 -146290 25147 131908 64848 -8444 -210614 -42342
11418 219874 -121474 228766 -174284 26848 -117585 -32743 229732 -39130 -143384 200251
11407 114854 -14338 -141640 -1701 -2415 143791 12896 5962 41406 305133 -12945 24425 -93632
11394 -139105 4537 -10854 76948 -134814 -511143 -298908 -199278 32481 41957 -35348 46496
11382 -72455 138574 5442 -94104 -171344 84873 -41364 157365 29909 108733 634743 93668
11370 -244763 -13102 -219258 -28129 8355 -114268 172277 -107028 422530 179344 269106
11360B69106a3324p8645j1397c9113n8968G7142h8185C9871J8440c18192a24945
11348a05597A12877D6807a47655A51559c9509k67334A61075a0097j60106g6907
11337D2738N9655a98627F255b7315M677m06312G1214d0576C8713O3743k0716R7093
11325A78833q4803f4029c1784Q716G7396J16291A3422a175n1723J9502j80587
11314b13983A42583b26250e0131j55208G4121a06747m4874g017j38315D1427M9339
11303I0766i6557b4901d8q3862j15582C38096h33j03374p25C6417b66698A31247
11290a99728f946o7902j29574G3547J67851A18753O7970M2622d1584r4853j76912
11279c13349A56166b31224I2618C1143J42500a97845e6910A48823a52032j84F9024
$$ plain form
11360 269106 -13324 -91969 -103366 -39113 -98081 77142 -88185 39871 58311 -318192 -124945
11348 -105597 112877 46807 -147655 151559 -39509 -306843 161075 -10097 -170203 -76907
11337 42738 102393 -198627 6255 -27315 -22638 -428950 71214 -40576 38713 102456 81740 178833
11325 178833 94030 -64029 -31784 -23068 77396 193687 13422 -1175 -52898 -33396 -213983
11314 -213983 142583 -226250 -50131 -205339 74121 -106747 -151621 -7017 -145332 41427 90766
11303 90766 -96557 -24901 -48 -83910 -199492 338096 -833 -104207 -104932 36417 -266698 131247
11290 -199728 -6946 -74848 -204422 73547 241398 118753 186723 229345 -41584 -136437 -313349
11279 -313349 156166 -231224 92618 31143 173643 -197845 -56910 148823 -152032 -152216 69024
11267H4541J3843a48569A7358a3194D6777c50248h9930C1876b30393e0233B17469
11255b8725E7350d8865l3188C16308f6370I9194C2175J71250a72894H3240a17977
11243B837J37612a51965g4549A66790e668A98851D0097b48804A008N4080Q3903
11232A38991a74276d9859j25172KB24380I9752K1209b36080a01636K2928B62450
11220h3521C35342a10963N3770j05682O1763C29075J07739g917A97879G9823a98686
11208b63479J18950B24719D4573o096J23827b05868A14144c26971O0769d9494
11197b8026A94118r2708O7308n46a878j81100A47362j3914J08076a24335d5365
11185A29429a18061K9317r1514j97758a51084g2281j17696b4228D2425a41944
$$ plain form
11267 84541 98384 -148569 17358 -13194 46777 -350248 -89930 31876 -230393 -50233 217469
11255 -28725 57350 -48865 -82053 316308 -66370 99194 32175 203425 -172894 83240 -117977
11243 2837 140449 -151965 -74549 166790 -5668 198851 40097 -248804 1008 55088 138991
11232 138991 -174276 -49859 -175031 -175029 224380 99752 120961 -236080 -101636 -78708 262450
11220 -83521 335342 -110963 -57193 -162875 -101112 329075 436814 -7917 197879 79823 -198686
11208 -263479 -144529 224719 44573 38477 162304 -205868 114144 -326971 -266202 -49494
11197 -28026 194118 101410 168718 168172 -1878 -182978 147362 133448 241524 -124335 -45365
11185 129429 -118061 -88744 -180258 -378016 -151084 -72281 -189977 -24228 42425 -141944
11174a04235l28906e5622k25639q0944e5916j13491F0899g4421j20816i297A35839
11162a35891A54799b30239g0333A40042h8654C50c8932j32778A43149L3454b22981
11150g032l08942a15239H7985a33242K5543C19473j53536a2336B19270a1399j60011
11139a71410D26402b02950P5638L8817D7911b42040D5995N7696i4412A67003a07981
11127d75424i1777A214K9162e2676q7966I2900d11494A46477e4819n4447D973
11115A6071L22028b0763C88403h4382F9379j5521d6962A83343a18308A01086a46942
11103H8836Q7126m8542c0117A3784J72092b45627f1033B77003j36774e8590C64678
11091e3226I9355M8631n334b44436A28800P3966G6937J394d1314G6757L16833
$$ plain form
11174 -104235 -433141 -55622 -281261 -362205 -55916 -169407 60899 -74421 -195237 -9297 135839
11162 -135891 154799 -230239 -70333 140042 -88654 350 -38932 -171710 143149 176603 -222981
11150 -7032 -315974 -115239 87985 -133242 -107699 319473 165937 -12336 219270 -11399 -171410
11139 -171410 426402 -202950 -127312 -88495 47911 -242040 45995 103691 -94412 167003 -107981
11127 -475424 -91777 1214 30376 -52676 -140642 92900 -411494 146477 -54819 -109266 4973
11115 16071 338099 -20763 388403 -84382 69379 53858 -46962 183343 -118308 101086 -146942
11103 88836 175962 127420 -30117 13784 185876 -245627 -61033 277003 140229 -58590 364678
11091 -53226 99355 147986 142652 -244436 128800 202766 76937 78331 -41314 76757 393590
11080C93590O4368j57879b2176A03439J612J81966b76453A73746n6392J38538
11070B55892I5877C3849K59556A18784m7514K27469J23666n2874A46789J60772
11060C07561P425J34411k02416J63829m0115K89439A56883N28920l24168n7016
11050C04619L25013K32212l65917j80356N7146Q4749J04367j81162K44720l3304
11040E92087B60813J03456J43692j16201j01704K74009j95803j10880L68000j45054
11030D80328j15933J15752j57104J70967l6046M24922D02398K7074P2329l8321
11020D63480J20946k11097A65946K80992q8597m1692J91591j79166j50043K07034
11010C86065A39859K25671J43014m6993l0419j85135R4912M2175J2160r3002n6887
$$ plain form
11080 393590 457958 300079 -22176 103439 105051 287017 -276453 173746 117354 255892
11070 255892 95877 33849 293405 118784 71270 298739 422405 369531 146789 307561
11060 307561 314986 449397 246981 410810 370695 660134 156883 685803 361635 304619
11050 304619 629632 861844 495927 315571 372717 457466 561833 380671 625391 592087
11040 592087 260813 364269 507961 391760 290056 564065 368262 257382 625382 480328
11030 480328 364395 480147 323043 494010 457964 882886 402398 429472 501801 463480
11020 463480 584426 373329 165946 446938 358341 316649 508240 329074 179031 386065
11010 386065 139859 365530 508544 461551 431132 245997 340909 383084 395244 302242 245355
10999B45355p0220L02371L4253j64346K26694L7797O5573k20964M0317q5131K27099
10988F38798j08884K76586r5050j03537k01113K54891k78648N39240j25624k33083
10978E63576K08876j44766K54623O4915J00808j1434L59810J8522P37392m58954
10968A693368K10328O3712m52774p1219J21009j77150J56445l10765M5337J43738
10958A422029k27203J56395n4907K796M2389j03765L2518J10447m82949j76565
10948G21185K94407j20637m08759J28291C02047H3330K68998G5862K0282a79054
10937H1109c0648A50071F8388K8545g3833A27915b01600A79203H6341b55764B64118
10925B51244o6218m5457K58556b24487I1435K6928J40596A3283b16564E5331g5270
$$ plain form
10999 245355 175135 477506 511759 347413 574107 611904 677477 456513 496830 411699 638798
10988 638798 529914 806500 711450 607913 406800 661691 383043 922283 796659 563576
10978 563576 772452 627686 882309 947224 1048032 1036598 1396408 1414930 2152322 1693368
10968 1693368 1903696 1967408 1514634 1443415 1564424 1387274 1543719 1232954 1278291 1422029
10958 1422029 1194826 1351221 1296314 1299110 1341499 1237734 1270252 1380699 897750 721185
10948 721185 1015592 894955 486196 614487 302047 83330 352328 75862 96144 -179054
10937 81109 -30648 150071 68388 96933 -73833 127915 -201600 179203 86341 -255764 264118
10925 251244 185026 139569 398125 -224487 91435 118363 258959 13283 -216564 55331 -75270
10913b51877a21056A3283d82221d5389d635G3965J70486a42411l14195a22464
10902C0805J64551a79039h9342C3391H591J9647M5318P261K89302I1008B4167
10890C39404a73370B69532h9335H8326d02871H5983O576D2001K61235c08647B22628
10878b08684L2311f434j46021K562q8852g7204D7359d8169A49031J278n1710a75064
10865a01375d0941m1042q6184A51259a07433K8567l08117A49387a43741b0334
10854b01944k57441b27943P8802A71164b27342a9744o3223B57451G1707a9825
10843c0608j05238A29706a41006A60994a58225B22397q3055f4967B9284a42779
10832B2976K4298b24683g1664k20699J45021j2448a0033n364C48107A00636l3410
$$ plain form
10913 -251877 -121056 13283 -482221 -45389 -4635 73965 244451 -142411 -456606 -122464
10902 30805 195356 -179039 -89342 33391 8591 28238 73556 80817 370119 91008 24167
10890 339404 -173370 269532 -89335 88326 -402871 85983 92559 42001 303236 -308647 222628
10878 -208684 -176373 -6434 -152455 -149893 -238745 -77204 47359 -48169 149031 150309 98599 -175064
10865 -101375 -40941 -81983 -168167 151259 -107433 -78866 -386983 149387 -143741 -20334
10854 -201944 -459385 -227943 -149141 171164 -227342 -19744 -82967 257451 71707 -19825
10843 -30608 -135846 129706 -141006 160994 -158225 222397 139342 -64967 29284 -142779
10832 22976 47274 -224683 -71664 -292363 -147342 -159790 -10033 -15397 348107 100636 67226
10821F7226a15960C1010e3131B09478d05799O2871F9748a58886g8236A09832a17949
10809A65666N5880o6393M67b25369H7797N946j1826a34961c8715A68741R9567
10798B68308j27480A1089O8824P9571A0216g1344k10209P5406f6093A32861A9949
10786a27740o9456d4769j05482O3078p7053J5537B5935e1959J6063r7200D43566
10774A23468k78b49560j12450a34231C8178J50516d6769l5571F1062b64621L288
10763b61333A14916b38783B44863M7335d0106i072o9247l63106a85134e230j7385
10752b2615C0605J5195K6349c14464c8439g897D15766b40697i4407p4241c205
10740b4213F1020A3108f1265a8149o5317l2595o8836A21664b49834A15612b56256
$$ plain form
10821 67226 -115960 31010 -53131 209478 -405799 -342928 69748 -158886 -78236 109832 -117949
10809 165666 221546 155153 155620 -225369 87797 93743 81917 -134961 -38715 168741 268308
10798 268308 140828 11089 79913 159484 10216 -71344 -281553 -206147 -66093 132861 19949
10786 -127740 -197196 -44769 -150251 -87173 -164226 -148689 25935 -51959 -35896 -133096 443566
10774 123468 123190 -249560 -362010 -134231 38178 188694 -46769 -82340 61062 -264621 -261333
10763 -261333 114916 -238783 244863 292198 -40106 -9072 -78319 -441425 -185134 -5230 -22615
10752 -22615 30605 45800 72149 -314464 -38439 -7897 415766 -240697 -94407 -168648 -3205
10740 -24213 61020 13108 -61265 -18149 -83466 -116061 -184897 121664 -249834 115612 -256256
10728E764a51027B29348D4065c83349b8846m44719h2215C906L0792b58573M6371
10717b12202J02929l0690a8976m950k00790A73092a60738A81946q9551f8788J4924
10706e3864j29247f6812b4251f189B48865a59969L9322j54416c2828o2991B7679
10694B36580I9718a4302l4248k252G8009J16800a83940k89986A71494C8994R0831
10683A29825E7705a80123P2280l2209n9712h0134o079C4733b31446A23011a24555
10671d36923k1599a09513q4626h0947K3663A36274D2933g2109G4372a94399k61467
10660d55866D8773a16465J2575K8395j68423f3938j66582A4276J25640a06416
10649A5178f4045r8221N541e7024B96614D4550Q0535c8932j86632a5782l52522
$$ plain form
10728 5764 -151027 229348 44065 -383349 -28846 -473565 -82215 3906 34698 -258573 -212202
10717 -212202 -109273 -139963 -18976 -23926 -224716 173092 -160738 181946 92395 -68788 -53864
10706 -53864 -183111 -66812 -24251 -6189 248865 -159969 -120647 -275063 -32828 -95819 27679
10694 236580 99718 -14302 -48550 -50802 78009 194809 -183940 -473926 171494 38994 129825
10683 129825 57705 -180123 -107843 -140052 -199764 -80134 -86213 34733 -231446 123011 -124555
10671 -436923 -458522 -109513 -194139 -80947 -57284 136274 42933 -72109 74372 -194399 -455866
10660 -455866 48773 -116465 -103890 -75495 -243918 -63938 -230520 14276 139916 -106416
10649 15178 -64045 -162266 -156725 -57024 296614 44550 125085 -38932 -225564 -15782 -368304
10638c68304d8992m66A22577a71236A1754b01187B82649A25999k3303c77549G3384
10626B71782A8581J59297n3194e2713j45299J0724j50219A57574n1610b59627
10615a8136j606A88929j7586B1198M335a91653l36821g2580c4516B12433B9821
10603B6185K26304a99601D2295C003b27566a4385D5531e6222C1761J54810j7112
10592A69459Q1855A10096a06552a3565j19950G1401b53501F5455a96232C6377
10581a0044B8070a67472P8171r3537A3696b67106A65851O5331H4790a33412f3459
10569A90656L6315b61814P3898N0502b9640A11248j3744c1298q4906j61370a35762
10557i6748j95267g4923A14475b85342d464l8323a3160C17630f2513I5909a01827
$$ plain form
10638 -368304 -48992 -49458 122577 -171236 11754 -201187 282649 125999 102696 -377549 73384
10626 271782 18581 177878 124684 -52713 -198012 -187288 -337507 157574 105964 -259627
10615 -18136 -19742 188929 171343 21198 25533 -191653 -528474 -72580 -34516 212433 29821
10603 26185 252489 -199601 42295 3003 -227566 -14385 45531 -56222 31761 186571 169459
10592 169459 251314 110096 -106552 -13565 -133515 71401 -253501 65455 -196232 36377
10581 -10044 28070 -167472 -89301 -182838 13696 -267106 165851 231182 84790 -133412 -63459
10569 190656 226971 -261814 -187916 -137414 -29640 111248 97504 -31298 -116204 -277574 -135762
10557 -96748 -292015 -74923 114475 -285342 -4464 -42787 -13160 317630 -62513 95909 -101827
10545A2062P034J46140a78339A5749d5255I908J14704n1553L9997d8793B8469
10533b34615e5795l96097D0312c76703A64779J7015f9684A87851o8083b4107k87850
10522c11957J31320Q0810r4988q266J4542J0555K4303e4235A2154d4860n7500
10511a02360k7689a0948m5011C49149b2631A33464E2662e13036d9812A11543a37603
10499B2979J51206b17374J2598L7772b9444C04325r6924E9847d6559G6877a70597
10487B9234J7518P8092K01363J8829A6230K76932A07627Q5463G9128J82233j5093
10476B46268E5123J45661m0086m0667B7678O1091f6683k59987a51049h068j29761
10465a37829q8667A09812D9049P0667c27857B85904i6631G3206c8602F2768a83820
$$ plain form
10545 12062 19096 165236 -178339 15749 -45255 9908 124612 73059 113056 -48793 28469
10533 -234615 -55795 -451892 40312 -376703 164779 181794 -69684 187851 119768 -24107 -311957
10522 -311957 -180637 -99827 -194815 -203081 -188539 -177984 -153681 -54235 12154 -44860 -102360
10511 -102360 -130049 -10948 -55959 349149 -22631 133464 52662 -513036 -49812 111543 -137603
10499 22979 174185 -217374 -204776 -167004 -29444 304325 207401 59847 -46559 76877 -170597
10487 29234 46752 124844 326207 345036 16230 293162 107627 193090 79128 261361 246268
10476 246268 55123 200784 160698 120031 27678 88769 -66683 -326670 -151049 -8068 -137829
10465 -137829 -226496 109812 49049 119716 -327857 285904 -96631 73206 -38602 62768 -183820
10453i8774H3267a55368r6259B09404a44788d6722A36740N0427j6883a05998I4500
10441b2499F3179K02353a5266r1661k40275B0807a38358B01500b4922A07752A3569
10429D0077i6494L3147n0463d2079r1508k48511j36889g9403l9820B62179i4085
10417a45385G8106c0529j47071f5689K869H0694c05148D4010a15576J1294g029
10405E15R5454c58590F2518d4452j02671k57015b13F0870O7529K68809a61991
10393h3137D90220e4329I0150C5855K02273j06946b947H1583J20363M4720e4496
10381A72344f2264A10708J31078d2345l51081J38154A13434a29467d3156B11504
10370C476a80311A72422L0922j2105J80910M6359L9744k03935K57367A22672J03246
$$ plain form
10453 -98774 83267 -155368 -251627 209404 -144788 -46722 136740 187167 170284 -105998 94500
10441 -22499 63179 265532 -15266 -106927 -347202 20807 -138358 201500 -24922 107752 13569
10429 40077 -96494 -63347 -113810 -42079 -133587 -382098 -518987 -79403 -119223 262179 -94085
10417 -145385 78106 -30529 -177600 -65689 -62820 80694 -305148 44010 -115576 -104282 -7029
10405 515 95969 -358590 62518 -44452 -147123 -404138 -213 60870 128399 397208 -161991
10393 -83137 490220 -54329 90150 35855 238128 131182 -2947 81583 201946 246666 -54496
10381 172344 -62264 110708 241786 -42345 -393426 -255272 113434 -129467 -43156 211504
10370 3476 -180311 172422 203344 191239 372149 418508 458252 254317 511684 122672 225918
10359B25918k5777a38655C18438q1429b5038C36364f5205A77505a6324C79334
10348A12520M9798R3306Q8336J23624A12240M31731e6362I6390K24283j26868
10338A93805l4847o0218D4785K65900r3903A04000J15140A04746B214a00776A66730
10326B59881a71914j54915C9022a50518D8979J83691K17289A25038E4524N2791
10316A07315a273E4716j1736J76608i928B83613J64656b31156A649R1615b62272
10304A7218J12735D090M5618a1262n4127j76217J06685J0567b2112j56708P7413
10293a01407C9681a13407j74304g1769G9958M9155c956o7604l0492j8486C2219
10281c02275J32956G3685K25246d57594I5336r314b85027J5634a3641A31377b00483
$$ plain form
10359 225918 200141 -138655 318438 237009 -25038 336364 -65205 177505 -16324 379334
10348 112520 162318 255624 343960 467584 112240 543971 -56362 96390 320673 193805
10338 193805 158958 98740 44785 310685 216782 104000 219140 104746 2214 -100776 166730
10326 259881 -171914 -326829 39022 -150518 48979 232670 449959 125038 54524 107315
10316 107315 -1273 54716 42980 219588 -9928 283613 448269 -231156 1649 93264 -262272
10304 17218 129953 4090 49708 -11262 -65389 -241606 -134921 -124354 -22112 -178820 -101407
10293 -101407 39681 -113407 -287711 -71769 79958 129113 -3956 -71560 -102052 -120538 32219
10281 -302275 -169319 73685 298931 -457594 95336 86022 -285027 -269393 -13641 131377 -200483
10269B38780b19035M0317f5438p1611N2294c2773n3041j65772J16340j662n9161
10258a96069D39362E7257J36836J81034m8816j36010Q7775h320A80735d6669G7927
10246E5237K16279a49469j43509B05440e6344E8647j4440J43071p7055n1669J85171
10235B43725a15520A27255o1154Q787J58389a98121j62661a32818B55180G5705
10224b2171k41942D7003A8742D836c31016A49038e75608b10549O9637L8657K8769
10213g3486k06933P2999F8031a05476M2931B50246e2516k3976I8585C3411J43132
10202A76543H2443a73177A59021N1312d3734n3170R671B20795F6006f9277a1958
10190b44577J19313K7920F3573c3053A07153a14301A73512b6084j74196M0424
$$ plain form
10269 238780 -219035 -178718 -65438 -137049 -84755 -32773 -85814 -251586 -135246 -136908 -196069
10258 -196069 439362 57257 194093 375127 326311 190301 278076 -8320 180735 -46669 77927
10246 55237 271516 -149469 -292978 205440 -56344 58647 44207 187278 110223 58554 243725
10235 243725 -115520 127255 66101 74888 233277 -198121 -360782 -132818 255180 75705
10224 -22171 -264113 47003 18742 4836 -331016 149038 -575608 -210549 -140912 -102255 -73486
10213 -73486 -280419 -207420 68031 -105476 -62545 250246 -52516 -76492 98585 33411 176543
10202 176543 82443 -173177 159021 210333 -43734 -96904 -87233 220795 66006 -69277 -11958
10190 -244577 -125264 -97344 63573 -33053 107153 -114301 173512 -26084 -200280 -159856
10180a59856k31051B36180F10P4091a12717A01217c22180B18348a78713A26793
10169C0823d0442A52069m966c3628j87587M1673A31708d76888J81941q0006A30454
10157a65008p9526B37637a39262J3663B32606c3251A14048d39188d2466m5426
10147h7892A10903a99497A10958R3553q8725M2018E7184a05523F4577c4847o6932
10136a01779B83103j37905i0068C3760i9156q5841j7787j90995C7318b32333n1425
10125b83758h8139j49431F8657i1664B65042c95259h1918q9135D876a24098j15620
10114b39718B33691b33166A77444F4924N2511L3448a80805j53457f3144C40619
10103A00423J15932a54802D97819G1374k9288J76939G7379a86342P1257l9012
$$ plain form
10180 -159856 -390907 236180 610 74701 -112717 101217 -322180 218348 -178713 126793
10169 30823 -40442 152069 147103 -33628 -221215 -179542 131708 -476888 -294947 -374953 130454
10157 -165008 -244534 237637 -139262 -125599 232606 -33251 114048 -439188 -42466 -87892
10147 -87892 110903 -199497 110958 204511 115786 157804 57184 -105523 64577 -34847 -101779
10136 -101779 283103 145198 -90068 33760 -99156 -184997 -202784 -393779 37318 -232333 -283758
10125 -283758 -88139 -237570 68657 -91664 265042 -395259 -81918 -171053 4876 -124098 -239718
10114 -239718 233691 -233166 177444 64924 117435 150883 -180805 -334262 -63144 340619
10103 100423 216355 -154802 497819 71374 42086 219025 77379 -186342 -115085 -154097
10093a54097A05312c05406d563l51345f9825I7843b95989j83364a8155k91753
10083c09908b8589A95688a37655j54618J44880L1906j76586B232h8840b3391j66831
10072a90222b8317B00137n6773k90D9269c20467A04139b3833k80949e9954p8074
10061a38028B2431p416a42869B13341a41849J6131A26243e020j1416A88660a51743
10049a38856B5622P3015a83762L4962a4471j15793e002j65757a9930A23405C4526
10037B5747K0942c8545J4164p1172A62902h3408q0112A86306r1699f9340o3574
10026a32914a9513k10807A11099a75505A80093C7206b24783A14753r296a05238
10015a87138c8255D3778J70434a68919o7889P8009f7152H8845a95755H769b5966
$$ plain form
10093 -154097 105312 -305406 -4563 -355908 -69825 97843 -295989 -479353 -18155 -309908
10083 -309908 -28589 195688 -137655 -292273 -147393 -115487 -292073 2232 -88840 -23391 -190222
10072 -190222 -28317 200137 143364 143074 49269 -320467 104139 -23833 -304782 -59954 -138028
10061 -138028 22431 15015 -142869 213341 -141849 -125718 126243 -5020 -16436 188660 -151743
10049 -138856 25622 98637 -183762 -148800 -14471 -130264 -5002 -170759 -19930 123405 34526
10037 25747 46689 -38545 -24381 -95553 162902 -83408 -163520 186306 94607 -69340 -132914
10026 -132914 -19513 -230320 111099 -175505 180093 37206 -224783 114753 105457 -105238
10015 -187138 -38255 43778 214212 -168919 -236808 -158799 -67152 88845 -195755 8769 -25966
10003a11784k21806R4249D1545g5409A17931P476m9552h8903j23938B10239o7361
9992A42878F8390a06939I9780a27377H3530p687b96238g5815E9905K52406b46473
9980a41098e1061A18148b45761D845b02008L9708A09299A5973a0158e22C82838
9968G7019K28962D4064b95629a45104A9180a72751N9979j14455d1906j97564A7139
9956b50714m9480h2454L275j84878P2364F357J07951j7711c0711A49450G1943
9944a57277G1496b06370A02061c17177C74975c21526a58584d0136j53677N8861
9934a34952D9639d5941E9028c33695m5239D3579b19p1412A26140g3656D06616
9922D7866a1544q9839M6000l5767A3433J30214a77634B7311K0012b09798j33493
$$ plain form
10003 -111784 -333590 -239341 41545 -75409 117931 125407 75855 -88903 -212841 210239 142878
9992 142878 68390 -106939 99780 -127377 83530 75843 -296238 -75815 59905 312311 -246473
9980 -141098 -51061 118148 -245761 4845 -202008 -162300 109299 15973 -10158 -522 382838
9968 77019 305981 44064 -295629 -145104 19180 -172751 -112772 -227227 -41906 -239470 17139
9956 -250714 -300194 -82454 -79179 -264057 -191693 6357 114308 96597 -30711 149450 71943
9944 -157277 71496 -206370 102061 -317177 374975 -321526 -158584 -40136 -193813 -134952
9934 -134952 49639 -45941 59028 -333695 -378934 43579 -219 -71631 126140 -73656 406616
9922 47866 -11544 -101383 -55383 -91150 13433 143647 -177634 27311 47323 -209798 -343291
9911c43291C00890a35260C3557O1533R9343b72136a14777H4207a38600R925M1259
9900h7416k1895A214a1712r1969L308A83926A1400K13666d47707a4239p3413B80896
9887a94783B71799a16342j05623k20759A4032a37851n5068F9364e640j04328A70451
9875a07958j63948a16810o3865k3958A35035C1792N6108a11490l5636M1085B2774
9863a55640L3682j46025M5967A60211k7741e680A4055f822k04298h4674l659j29913
9851b18246f8487k67296J40590f3797p1605O4944j3896l624B6910P0651L3420
9840A30981b82224a24977D4165a03359M8940k95649J50155k66048C08260a19207
9829F7373a96049e3739A73954J37667b06526d3816q9110D4449J06794a62911d3247
$$ plain form
9911 -343291 300890 -135260 33557 95090 194433 -272136 -114777 84207 -138600 -128675 -87416
9900 -87416 -109311 1214 -11712 -103681 -100373 183926 11400 225066 -447707 -14239 -87652 280896
9887 -194783 271799 -116342 -221965 -442724 14032 -137851 -192919 69364 -5640 -109968 170451
9875 -107958 -271906 -116810 -180675 -204633 135035 31792 87900 -111490 -147126 -106041 22774
9863 -155640 -121958 -267983 -222016 160211 132470 -5680 14055 -6822 -211120 -84674 -88333 -218246
9851 -218246 -68487 -335783 -195193 -63797 -135402 -70458 -84354 -87978 26910 97561 130981
9840 130981 -282224 -124977 44165 -103359 -54419 -350068 -199913 -465961 308260 -119207
9829 67373 -196049 -53739 173954 311621 -206526 -43816 -132926 44449 151243 -162911 -43247
9817B20308a52108j53790M5852a14060c0745j46715Q2956A02425a12389a9913
9806i0435o4446k4157Q7524J7732k7028M490F853b63724C8731O4065a6415o1280
9794g7695k1238q9418N4559M4494n0701n9724A46742h0791k06397a09720C42881
9782C5701j1945i6065o5274B09717a58126r9185E9120J38593M2865c2182O115
9771b6067k24400C5367l267a52370e8532j24499i689l1494A11958C3800c7448
9759c7371a7227k27984a1227A29358J85500g3823l1211q4257k7711a0000k38017
9748b48017h5896j00646B80992j32573o0469d21091I1532D5586b38788r8738a39637
9736B80402d8941A08984a5955A93357i2000j329B0125P1539a36983j89542J60232
$$ plain form
9817 220308 -152108 -305898 -260046 -114060 -30745 -177460 -94504 102425 -112389 -19913
9806 -90435 -154881 -179038 -91514 -73782 -100810 -96320 6853 -263724 38731 102796 -16415 -77695
9794 -77695 -98933 -188351 -133792 -89298 -139999 -199723 146742 -80791 -287188 -109720 342881
9782 35701 23756 -96065 -161339 209717 -158126 -257311 59120 197713 240578 -32182 -26067
9771 -26067 -250467 35367 32100 -152370 -58532 -183031 -9689 -41183 111958 33800 -37448
9759 -37371 -17227 -245211 -11227 129358 314858 -73823 -105034 -189291 -217002 -10000 -248017
9748 -248017 -85896 -186542 280992 148419 87950 -421091 91532 45586 -238788 -337526 -139637
9736 280402 -48941 108984 -15955 193357 -92000 -93329 20125 91664 -136983 -326525 -166293
9725a66293d6843J6484k23013Q9653m9761B3423a59604f3395A7216N5462H090
9713a29060j65012A37363A1471b32817l68005h5493a1224l216H0770j5705B1174
9701b71206j8038k5015A14605b73992g3956k1213a5023r3902l6697j89198a00142
9689b19649F5017J15412b91419A8662M661j96K78278c23360c06m0369j05612M7661
9677i8626m3842A35580a09816D4863a62752m6412l5292C08006h716m1796I7241
9665I0386J61832a8012j9092l32817F215J33651B409i167n3385a2077j21464B40583
9652b09138H1650l9700a8629l0120j47375E4030R292b31663k0820A18899K4572
9641A43471a75459A76676L9518P7867I8741J12532I0413K9807J0736l7196K2033
$$ plain form
9725 -166293 -46843 -30359 -253372 -163719 -213480 23423 -159604 -63395 17216 72678 8090
9713 -129060 -294072 137363 11471 -232817 -600822 -85493 -11224 -14440 80770 65065 21174
9701 -271206 -289244 -314259 114605 -273992 -73956 -95169 -15023 -108925 -145622 -334820 -100142
9689 -219649 65017 180429 -291419 18662 23323 23127 301405 -323360 -306 -40675 -146287 -98626
9677 -98626 -142468 135580 -109816 44863 -162752 -209164 -244456 308006 -8716 -50512 97241
9665 90386 252218 -18012 -37104 -369921 6215 139866 2409 -9167 -62552 -12077 -133541 240583
9652 -209138 81650 41950 -18629 -48749 -196124 54030 63322 -231663 -252483 118899 143471
9641 143471 -175459 176676 216194 294061 98741 211273 90413 120220 130956 93760 115793
9630A15793d3216j89318A74839a28742b2964A06323b21824l719f2374A93719b24317
9618E7725e7524m4843b7474A65733g4265c6824C3361J19662j6691b88442e8945
9606b95003C8558b55711A05967m5150c1879G512f7727j52838d3178H1044r768
9595G1276d5493D1843a76452A11914a59939A16680b22075c444A91474c1071B14945
9583a02265f78F1019a00753j2432k46176A9121b78119H1369k4297h4930D1315
9571C1321b97042N7066j6556A95121b16255J2636L6090k2681q1299O3805o784
9560b14488B76732a63242b6874B01246b44297B18325a32613G9688b52504B94279
9549B56673a44757a3989j47129j80311K2295m9730E9368a41816n954c0553B64962
$$ plain form
9630 115793 -43216 -232534 174839 -128742 -22964 106323 -221824 -225543 -62374 193719 -224317
9618 57725 -57524 -102367 -27474 165733 -74265 -36824 33361 153023 136332 -288442 -58945
9606 -295003 38558 -255711 105967 60817 -31879 7512 -67727 -220565 -43178 81044 71276
9595 71276 -45493 41843 -176452 111914 -159939 116680 -222075 -3444 191474 -31071 214945
9583 -102265 -678 61019 -100753 -113185 -359361 19121 -278119 81369 57072 -84930 41315
9571 31321 -297042 -239976 -256532 195121 -216255 -203619 -167529 -190210 -271509 -207704 -214488
9560 -214488 276732 -163242 -26874 201246 -244297 218325 -132613 79688 -252504 294279
9549 256673 -144757 -13989 -161118 -341429 -319134 -368864 59368 -141816 -147770 -30553 264962
9537A57275P3382a11483p126I4654L31358c41303J17277j3917H6323c19917i8420
9525h8312j12675E6650b38026M1118g5326F849g6012l5472B64018b43701F7052
9513a99025j96400D8829a06980J7945C6839K557a30612A45633a89774k5081j20968
9502c35823a14313A3932c46248N9313g1536D3226Q6444f1140n1642o3189p5145
9491b51116J20819G0325a08258A80421f1698A4281K13222C4640C645i3733H9499
9479b4484j29481e9752l46034C23541j17054n5454a44178c3423D0667J20344f1172
9467a76809j24948B528i9319A07966a6926j93425j64628b3040I2125a39297L4950
9456a04347B0880j006a52174e4921r5575B8133b21392d618k75251A15477a80384
$$ plain form
9537 157275 230657 -111483 -118609 94654 426012 -341303 -224026 -237943 86323 -319917 -98420
9525 -88312 -200987 56650 -238026 -196908 -75326 6849 -76012 -111484 264018 -243701 67052
9513 -199025 -395425 48829 -106980 -89035 36839 39396 -130612 145633 -189774 -214855 -335823
9502 -335823 -114313 13932 -346248 -286935 -71536 43226 129670 -61140 -112782 -175971 -251116
9491 -251116 -130297 70325 -108258 180421 -61698 14281 227503 34640 3645 -93733 89499
9479 -24484 -153965 -59752 -405786 323541 206487 151033 -144178 -33423 40667 161011 -61172
9467 -176809 -301757 2528 -99319 107966 -16926 -210351 -374979 -23040 92125 -139297 -104347
9456 -104347 20880 19874 -152174 -54921 -150496 28133 -221392 -4618 -279869 115477 -180384
9444i784n502A93601c56716B09056B965Q3509b15526R9089a4809A9135d1150j02239
9432a43389k2374l35663C77120A25799f3904a3211j24352K6566k44355J76140
9422a79212A56722n3850c9361R818B08668h8002j67553A63767M7444l1023b38430
9410E9946j9630h0736A37046k6788d00149A04024c9785m5540l3136A19434c2652
9398b50685J06766B04486q4361m8544g1469C41556b28719a00459L0965b8352A41502
9386b13310A44217b2914I9128g119G2859g0719A16850b00168h806o7207n4877
9375a30890j02966r9969g2300j08620e3424r9121A5270b50192B35337e0919p0821
9364a21740C41282A60743L8046b34211B3602i5256B1825O8201b85312r5328a2790
$$ plain form
9444 -9784 -15286 193601 -356716 209056 2965 86474 -215526 -116437 -14809 19135 -41150 -143389
9432 -143389 -165763 -501426 377120 125799 -63904 -13211 -137563 -110997 -355352 -179212
9422 -179212 156722 102872 -39361 -29543 208668 -88002 -255555 163767 211211 180188 -238430
9410 59946 40316 -80736 137046 110258 -400149 104024 -39785 -85325 -118461 119434 -32652
9398 -250685 -143919 204486 120125 71581 -71469 341556 -228719 -100459 -69494 -28352 141502
9386 -213310 144217 -22914 99128 -7119 72859 -70719 116850 -200168 -8806 -76013 -130890
9375 -130890 -233856 -333825 -72300 -180920 -53424 -152545 15270 -250192 235337 -50919 -121740
9364 -121740 341282 160743 198789 -234211 23602 -95256 21825 90026 -285312 -380640 -12790
9352i0484E5768J53086a15032H9994c16338a22193k22201a21516l7164A12508
9341h3085A22057b79854e1332k3104A92246e55j98602h0799G1890a25947D05613
9329b55200A16074j544b57995r8600a11098N2126j16285Q0705B42758c0404k72324
9318c02728I3767c1649k75681d0055A64988h4773C2847i6435d6029D7105f0932
9306h6915A13239J15467o8632f8394E3912b0023A60605c85726d3261j08914P5467
9295g6708k55030h2750L4066B86102B1381N8132e2100I9879m4743a1444A0802
9283A48427a43512E2539a73440A59298H07P5965l66e7968H6365f0038J5253j75093
9271b19878c0939l61854A24884c49012a35458A1583d44231b6933C1433q492e1571
$$ plain form
9352 -90484 55768 208854 -115032 89994 -316338 -122193 -344394 -121516 -158680 112508
9341 -83085 122057 -279854 -51332 -74436 192246 -555 -199157 -80799 71890 -125947 405613
9329 -255200 116074 114530 -257995 -356595 -111098 -58972 -175257 -94552 242758 -30404 -302728
9318 -302728 93767 -31649 -307330 -40055 164988 -84773 32847 -96435 -46029 47105 -60932
9306 -86915 113239 228706 160074 -68394 53912 -20023 160605 -385726 -43261 -152175 -76708
9295 -76708 -331738 -82750 -48684 286102 21381 79513 -52100 99879 55136 -11444 10802
9283 148427 -143512 52539 -173440 159298 807 76772 76406 -57968 86365 -60038 -44785 -219878
9271 -219878 -30939 -392793 124884 -349012 -135458 11583 -444231 -26933 31433 22941 -51571
9259b00086g8293j3171j96286J36162j46821A01162c97046J95574a1186J686j11514
9248a21014l7961j43697e7339r3141a4353H4154J21181C9152b14661A81470a79219
9236C32250a87544A22478a62695E6799J34147c47097M7625H7857a16350L8698
9226g7652A61088b23285f6626k9817j00025j10366b9651A51819a77227D226e3694
9214A02265a91270i0986H9477a4243A6129O3373p816K04991i7596p8655m2499
9203b18750M9764k1869a8462j77911h9732j50736J15665B08051f3213d238k82503
9192b86741C2853b0519j18510e1991j28723d6604r622a4853A42311d1884k2031
9181f3915H5607a60908A07370a74782C8039J53331e44199A0493K5306a23441j7228
$$ plain form
9259 -200086 -78293 -91464 -287750 -151588 -298409 101162 -397046 -201472 -11186 -9500 -121014
9248 -121014 -158975 -302672 -57339 -150480 -14353 84154 205335 39152 -214661 181470 -179219
9236 332250 -187544 122478 -162695 56799 190946 -347097 -299472 87857 -116350 -77652
9226 -77652 161088 -223285 -66626 -96443 -196468 -306834 -29651 151819 -177227 4226 -53694
9214 102265 -191270 -90986 89477 -14243 16129 79502 71686 276677 -97596 -176251 -218750
9203 -218750 -168986 -190855 -18462 -196373 -89732 -240468 -124803 208051 -63213 -4238 -286741
9192 -286741 32853 -20519 -139029 -51991 -180714 -46604 -56226 -14853 142311 -41884 -63915
9181 -63915 85607 -160908 107370 -174782 38039 191370 -544199 10493 35799 -123441 -140669
9170a40669c2972C7730K19066c30290A2368J65455a77098A43612a08653j78382
9160b87035B76784b82484A87893c24324F1591b48767A57755c60972B60848g1943
9149a6591l32447D0045K1014c23264K8837J10065d7709k50527D14135j29440a05835
9137i1088l55874f5425J8532B18543E764b4488m6125D2663a01425I6505b99630
9125a15431A15201d3433A0120a25487B30207P6279A29054a99732A3873b08690
9114c45514N7987G1001a63544e2450j42716A99828c93524f9852j29419A30021
9103a78297A37094a92909k5280c3024k34431J19328j3249g2910n2651h467j05251
9092a13718D9775G152k225O7836d8916A64569h781k07814A47314a68876L9690
$$ plain form
9170 -140669 -32972 37730 256796 -330290 12368 177823 -177098 143612 -108653 -287035
9160 -287035 276784 -282484 187893 -324324 61591 -248767 157755 -360972 260848 -71943
9149 -16591 -349038 40045 61059 -323264 -294427 -184362 -47709 -298236 414135 284695 -105835
9137 -91088 -446962 -65425 -46893 218543 5764 -24488 -70613 42663 -101425 96505 -299630
9125 -115431 115201 -43433 10120 -125487 230207 306486 129054 -199732 13873 -208690
9114 -345514 -287527 71001 -163544 -52450 -195166 199828 -393524 -69852 -199271 130021
9103 -178297 137094 -192909 -218189 -33024 -267455 -148127 -161376 -72910 -125561 -8467 -113718
9092 -113718 49775 7152 4927 72763 -48916 164569 -8781 -216595 147314 -168876 -129186
9081a29186d6238m5681j29034g8631J7562A9867a72707f9814j07672I9448L4128
9070A33576g8461j52414F036K74788i3336j83645g2200O718j69779i9633J2553
9059h7080j79776H7941a77794i552k58722a15152A84075C5179c8656D9387a05581
9047d03811B0374K28179h2642B42564c54555G6719K1185b10890B8914J19135h2276
9035b59917e961k09176A33372a72598I5546e8379j45185B41921c9171A42870g1062
9023a25246G7842b68023A52746m7425b1738k09517O7152P9685B52161h4817b5766
9011a96705M9368P2334I3740B993R1563A2998c60885A47562a27569d2001j59950
9000b01951j83258i3711o8658J8166A00287b06083n4752J16673m8120m1664A05254
$$ plain form
9081 -129186 -46238 -91919 -220953 -78631 -61069 19867 -172707 -69814 -177486 99448 133576
9070 133576 -78461 -230875 6036 280824 -93336 -276981 -72200 -65482 -235261 -99633 -87080
9059 -87080 -266856 87941 -177794 -9552 -268274 -115152 184075 35179 -38656 49387 -105581
9047 -403811 20374 248553 -82642 242564 -354555 76719 97904 -210890 28914 148049 -82276
9035 -259917 -5961 -215137 133372 -172598 95546 -58379 -203564 241921 -39171 142870 -71062
9023 -125246 77842 -268023 152746 105321 -21738 -231255 -164103 -84418 252161 -84817 -25766
9011 -196705 -147337 -75003 93740 2993 94556 12998 -360885 147562 -127569 -42001 -201951
9000 -201951 -385209 -93711 -162369 -144203 100287 -206083 -260835 -144162 -192282 -233946 105254
8988G3079a63681c6196F7024a1628k12355G8600a10231J5915K0774j4550r4250
8977a82342h9825J3971n3792C0838f1960A3620d46546F3846J59751b7243k57072
8966b84315k617h9697A12083A6148i5823I2805a27329I1534J88137F1463J07196
8955A68659d1773E1477a27097n2675d8606q2273k15923F7944a32862d0200B57754
8943a05643j35154j20134H5505A5549a73164C21951A01079b3424B75184k1667
8933B53517A0862b79657A91882k0140c8750n7453A74008q4185c38451i1175j99303
8922b90478b555A98064L04876J00058B86424j33349d1885l49859a03061c4392
8911b48061B108i0905n7672B0044d1479D3594J64065a42318C80542a64335o0696
$$ plain form
8988 73079 -163681 -36196 67024 -11628 -223983 78600 -110231 -94316 -73542 -88092 -182342
8977 -182342 -89825 -75854 -129646 30838 -61960 13620 -446546 63846 223597 -27243 -284315
8966 -284315 -286932 -89697 112083 16148 -95823 92805 -127329 91534 279671 61463 168659
8955 168659 -41773 51477 -127097 -179772 -48606 -130879 -346802 67944 -132862 -40200 257754
8943 -105643 -240797 -360931 85505 15549 -173164 321951 101079 -23424 275184 253517
8933 253517 10862 -279657 191882 171742 -38750 -96203 174008 89823 -338451 -91175 -290478
8922 -290478 -2555 198064 502940 602998 286424 153075 -41885 -391744 -103061 -34392
8911 -248061 2108 -90905 -148577 20044 -41479 43594 207659 -142318 380542 -164335 -225031
8900b25031i2221i107j5993l4773k5253H5778R7160d671A29454M7017e3435j43958
8888a97393C0613J4635F879L6137g2103j05356O0200j13566a11942F7511R1178
8877A58689A7579K1901c13312A17420a14062g521k0586k39302p8460e6284B5241
8865a21388E6984h8936l72406C00232F1680P9410d57j62065A58808a42565c233
8853d3638k35499f7463K5438A40353c14032h1259I6610b71519H3593a663j43710
$$ plain form
8900 -225031 -92221 -9107 -25100 -59873 -85126 85778 182938 -4671 129454 176471 -53435 -197393
8888 -197393 30613 45248 6879 43016 -72103 -177459 -117259 -230825 -111942 67511 158689
8877 158689 17579 39480 -313312 117420 -114062 -7521 -28107 -267409 -345869 -56284 25241
8865 -121388 56984 -88936 -461342 300232 61680 141090 -457 -162522 158808 -142565 -3233
8853 -43638 -279137 -67463 -42025 140353 -314032 -81259 96610 -271519 83593 -1663 -145373
$$ [...]
##END NTUPLES=NMR SPECTRUM
##END=
