##TITLE=NES1050_10427_9270609_61D8CKfaId
##JCAMPDX= 6.0         $$ Bruker NMR JCAMP-DX V2.0
##DATA TYPE= NMR SPECTRUM
##DATA CLASS= NTUPLES
##ORIGIN= BRUKER
##OWNER= Administrator
$$ 1.72 TOPSPIN		Version 2.1
$$ 2015-07-11 20:30:10.816 -0700  Administrator@X
$$ Compression mode = diff/dup
##.OBSERVE FREQUENCY= 400.02188249412
##.OBSERVE NUCLEUS= ^1H
##.ACQUISITION MODE= SIMULTANEOUS (DQD)
##.ACQUISITION SCHEME= undefined
##.AVERAGES= 8
##.DIGITISER RES= 22
##SPECTROMETER/DATA SYSTEM= spect
##.PULSE SEQUENCE= zg30
##.SOLVENT NAME= COFFEE_meoh
##.SHIFT REFERENCE= INTERNAL, COFFEE_meoh, 1, 14.98509
##AUDIT TRAIL= $$ (NUMBER, WHEN, WHO, WHERE, PROCESS, VERSION, WHAT)
$$ ##TITLE= Audit trail, TOPSPIN		Version 2.1
$$ ##JCAMPDX= 5.01
$$ ##ORIGIN= Bruker BioSpin GmbH
$$ ##OWNER= Administrator
$$ $$ E:\/data/COFFEE/nmr/NES1050_10427_9270609_61D8CKfaId/10/pdata/1/auditp.txt
$$ ##AUDIT TRAIL=  $$ (NUMBER, WHEN, WHO, WHERE, PROCESS, VERSION, WHAT)
(   1,<2015-07-11 20:30:03.269 -0700>,<Administrator>,<X>,<go>,<TOPSPIN 2.1>,
      <created by zg
	started at 2015-07-11 20:28:57.316 -0700,
	POWCHK enabled, PULCHK disabled,
       configuration hash MD5:
       21 0F 79 D6 B3 7B B4 F6 88 20 88 DB 03 48 BD 9F
       data hash MD5: 64K
       78 8D A9 43 8B 05 3D 3C 4C 95 03 20 F4 C1 D2 0D>)
(   2,<2015-07-11 20:30:06.675 -0700>,<Administrator>,<X>,<proc1d>,<TOPSPIN 2.1>,
      <Start of raw data processing
       efp LB = 0 FT_mod = 6 PKNL = 1 PHC0 = 0 PHC1 = 0 SI = 32K 
       data hash MD5: 32K
       9E 06 33 00 D6 04 5F BF 6E 74 09 EC A7 B7 F7 23>)
(   3,<2015-07-11 20:30:06.972 -0700>,<Administrator>,<X>,<proc1d>,<TOPSPIN 2.1>,
      <pk PHC0 = 94.49341 PHC1 = 0 
       data hash MD5: 32K
       3D F4 29 79 79 C5 38 0F 99 37 67 CD D4 D2 68 13>)
(   4,<2015-07-11 20:30:07.097 -0700>,<Administrator>,<X>,<proc1d>,<TOPSPIN 2.1>,
      <abs ABSG = 1 
       data hash MD5: 32K
       CC 4B 83 2F 99 B8 16 56 41 9B 4D 46 0A DB 89 9F>)
(   5,<2015-07-11 20:30:07.144 -0700>,<Administrator>,<X>,<proc1d>,<TOPSPIN 2.1>,
      <abs ABSG = 2 
       data hash MD5: 32K
       F5 EF D8 CC 19 B3 FC EC B6 D0 83 6A D2 13 C8 3C>)
(   6,<2015-07-11 20:30:07.222 -0700>,<Administrator>,<X>,<proc1d>,<TOPSPIN 2.1>,
      <abs ABSG = 3 
       data hash MD5: 32K
       11 5E 88 42 53 A5 DD 4E 9D 41 1A 7D 5B D5 5F A6>)
(   7,<2015-07-11 20:30:07.285 -0700>,<Administrator>,<X>,<proc1d>,<TOPSPIN 2.1>,
      <abs ABSG = 4 
       data hash MD5: 32K
       0B C5 DA 1E B5 76 F6 8F A5 98 9A 9D 6A 06 C1 60>)
(   8,<2015-07-11 20:30:07.347 -0700>,<Administrator>,<X>,<proc1d>,<TOPSPIN 2.1>,
      <abs ABSG = 5 
       data hash MD5: 32K
       26 05 61 C0 F1 FA 44 94 DB 99 0A ED 68 75 E2 56>)
$$ ##END=
$$ 
$$ $$ hash MD5
$$ $$ 67 9E 48 F1 11 C8 E0 D5 1F 28 59 F0 BC A0 1B 98
##$RELAX= 
##$RELAX= 
##$RELAX= 
##$RELAX= 
##$RELAX= 
##$RELAX= 
##$RELAX= 
$$ Bruker specific parameters
$$ --------------------------
##$DU= <E:\>
##$EXPNO= 10
##$NAME= <NES1050_10427_9270609_61D8CKfaId>
##$PROCNO= 1
$$ [...]
##$TP= (0..7)
150 150 150 150 150 150 150 150
##$TP07= 0
##$TPNAME0= <>
##$TPNAME1= <>
##$TPNAME2= <>
##$TPNAME3= <>
##$TPNAME4= <>
##$TPNAME5= <>
##$TPNAME6= <>
##$TPNAME7= <>
##$TPOAL= (0..7)
0.5 0.5 0.5 0.5 0.5 0.5 0.5 0.5
##$TPOFFS= (0..7)
0 0 0 0 0 0 0 0
##$TUNHIN= 0
##$TUNHOUT= 0
##$TUNXOUT= 0
##$USERA1= <user>
##$USERA2= <user>
##$USERA3= <user>
##$USERA4= <user>
##$USERA5= <user>
##$V9= 5
##$VALIST= <valist>
##$VCLIST= <CCCCCCCCCCCCCCC>
##$VD= 0
##$VDLIST= <DDDDDDDDDDDDDDD>
##$VPLIST= <PPPPPPPPPPPPPPP>
##$VTLIST= <TTTTTTTTTTTTTTT>
##$WBST= 2048
##$WBSW= 25
##$XGAIN= (0..3)
0 0 0 0
##$XL= 0
##$YL= 0
##$YMAX_a= 632338
##$YMIN_a= -529984
##$ZGOPTNS= <>
##$ZL1= 120
##$ZL2= 120
##$ZL3= 120
##$ZL4= 120
##$ABSF1= 14.98509
##$ABSF2= -5.573092
##$ABSG= 5
##$ABSL= 3
##$ALPHA= 0
##$AQORDER= 0
##$ASSFAC= 0
##$ASSFACI= 0
##$ASSFACX= 0
##$ASSWID= 0
##$AUNMP= <proc_prof1d_extract_pilot.lims>
##$AXLEFT= 0
##$AXNAME= <>
##$AXNUC= <1H>
##$AXRIGHT= 0
##$AXTYPE= 0
##$AXUNIT= <>
##$AZFE= 0.1
##$AZFW= 0.1
##$BCFW= 0
##$BC_mod= 0
##$BYTORDP= 0
##$COROFFS= 0
##$CY= 15
##$DATMOD= 1
##$DC= 0
##$DFILT= <>
##$DTYPP= 0
##$F1P= 0
##$F2P= 0
##$FCOR= 0.5
##$FTSIZE= 32768
##$FT_mod= 6
##$GAMMA= 0
##$GB= 0
##$INTBC= 1
##$INTSCL= 1
##$ISEN= 128
##$LB= 0
##$LEV0= 0
##$LPBIN= 0
##$MAXI= 10000
##$MC2= 0
##$MEAN= 0
##$ME_mod= 0
##$MI= 0
##$NCOEF= 0
##$NC_proc= -8
##$NLEV= 6
##$NOISF1= 0
##$NOISF2= 0
##$NSP= 0
##$NTH_PI= 0
##$NZP= 0
##$OFFSET= 14.98509
##$PC= 1
##$PHC0= 94.49341
##$PHC1= 0
##$PH_mod= 1
##$PKNL= yes
##$PPARMOD= 0
##$PPDIAG= 0
##$PPIPTYP= 0
##$PPMPNUM= 2147483647
##$PPRESOL= 1
##$PSCAL= 4
##$PSIGN= 0
##$PYNMP= <proc.py>
##$REVERSE= no
##$SF= 400.02
##$SI= 32768
##$SIGF1= 0
##$SIGF2= 0
##$SINO= 400
##$SIOLD= 32768
##$SPECTYP= <>
##$SREGLST= <1H.CDCl3>
##$SSB= 0
##$STSI= 32768
##$STSR= 0
##$SW_p= 8223.68421052631
##$SYMM= 0
##$S_DEV= 0
##$TDeff= 65536
##$TDoff= 0
##$TI= <>
##$TILT= no
##$TM1= 0
##$TM2= 0
##$TOPLEV= 0
##$USERP1= <user>
##$USERP2= <user>
##$USERP3= <user>
##$USERP4= <user>
##$USERP5= <user>
##$WDW= 1
##$XDIM= 32768
##$YMAX_p= 408304828
##$YMIN_p= -656931
##$CURPLOT= <Network HP LaserJet P1505>
##$CURPRIN= <$Network HP LaserJet P1505>
##$DFORMAT= <normdp>
##$LAYOUT= <+/1D_H.xwp>
##$LFORMAT= <normlp>
##$PFORMAT= <normpl>
##$SURQMSG= 1
$$ End of Bruker specific parameters
$$ ---------------------------------
##NTUPLES= NMR SPECTRUM
##VAR_NAME=  FREQUENCY,     SPECTRUM/REAL,   SPECTRUM/IMAG
##SYMBOL=    X,             R,               I
##VAR_TYPE=  INDEPENDENT,   DEPENDENT,       DEPENDENT
##VAR_FORM=  AFFN,          ASDF,            ASDF
##VAR_DIM=   32768,         32768,           32768
##UNITS=     HZ,            ARBITRARY UNITS, ARBITRARY UNITS
##FACTOR=    0.250966925370066, 1,           1
##FIRST=     8223.43324360094, -143790,      35830
##LAST=      0,             -8935,           -46914
##MIN=       0,             -656931,         0
##MAX=       8223.43324360094, 408304828,    0
$$ Real data points
##PAGE= N=1
##DATA TABLE= (X++(R..R)), XYDATA
$$ [...]
19477c56451f2256n034A32951c4036k08581J07420O5740m9702l6611A97564c12970
19465a85890I9748K92660g1773F6738b23404J6927K3034B02201q9576h4420D5802
19453A5410a43911o76m56836K98460M9157P1226D7682f5942e144p5963c0787l558
19441c4345k78183J30389A94636a04460o1471p9495B1773b62328r678L7587D296
19429b39316C7870c3759J6732b551k80924a04101g73k780j33089l8678B6070d5530
19416A69442M7048h279l7562k1045o1206D2279a41824M1201J9493B53453c17008
19404A18707a74232H7762a81807L6342b6731A21190a17086B5442a87947B0977
19393B01306B6437i8551j11874b9024A83880i156j12786k64959i431H8366A8880
$$ plain form
19477 -356451 -62256 -67290 132951 -34036 -242617 -135197 -69457 -119159 -155770 197564 -312970
19465 -185890 99748 392408 -71773 66738 -223404 -206477 -183443 202201 112625 -84420 45802
19453 15410 -143911 -144587 -601423 -302963 -253806 -182580 47682 -65942 -5144 -81107 -30787 -34345
19441 -34345 -312528 -182139 194636 -104460 -165931 -245426 21773 -262328 -272006 -234419 4296
19429 -239316 37870 -33759 -17027 -2551 -283475 -104101 -773 -3553 -136642 -175320 26070 -45530
19416 169442 216490 -8279 -45841 -66886 -128092 42279 -141824 -100623 -81130 253453 -317008
19404 118707 -174232 87762 -181807 -145465 -26731 121190 -117086 25442 -187947 20977
19393 201306 26437 -98551 -210425 -29024 183880 -9156 -121942 -386901 -9431 88366 18880
19381b34619A7274J86450i4486L0582G0754i4366G0402d25550J44820p798Q3106
19370b05422N5687D9887b34892A11472a25603A0017h8711n0546f0195j73169n1751
19359b85115h6358A8901a84829e2192j57227h2663A26445B7542e9790C05461b87982
19347a8218l5858n0586m3744J5158J9517k30100B1840L2542J7422N22J6994d04149
19334e1372B1762L4125A1880f4736A12068a14664p7494e323j25798C9958a70802
19322d842A11809h1689E9531b87422D4108J52806a43791E9890a91167C7161f9289
19310b42393a14090c1976p3634d7293l02452a60876N9336j25997k80101a07488
19299f2625m17183C6957j2831c14622j1043J25493c8596o192j67633e3499j14375
$$ plain form
19381 -234619 17274 203724 -94486 -63904 70754 -94366 70402 -425550 -280730 -288528 -205422
19370 -205422 -149735 49887 -234892 111472 -125603 10017 -88711 -139257 -60195 -233364 -285115
19359 -285115 -86358 18901 -184829 -52192 -209419 -82663 126445 27542 -59790 305461 -287982
19347 -18218 -54076 -104662 -148406 -133248 -113731 -343831 21840 54382 71804 72326 89320 -404149
19334 -51372 21762 55887 11880 -64736 112068 -114664 -192158 -5323 -131121 39958 -170802
19322 -4842 111809 -81689 59531 -287422 44108 196914 -143791 59890 -191167 37161 -69289
19310 -242393 -114090 -31976 -105610 -47293 -349745 -160876 -101540 -227537 -507638 -107488
19299 -62625 -479808 36957 24126 -314622 -325665 -200172 -38596 -44788 -212421 -53499 -167874
19288a67874G6640e002m9647K1159j9621j21325E5102B4891R2542c6312k58203
19277b94515h5597k07753B17921a29481l0236A2957P9743i4438b1793D9884a35929
19265f434j89034H8721h627o5155q6502J1435M8458A554b37027g7015j11958n6898
19253b45871E3263a54706A96147b80645b0196a953B07327a48375f5325r4326b860
19241a03387k12705a41957L8743B4281K04731a92585h9311j69263J02486j06073
19231b62161B00936F1721b32978j29218P9866o2956A67511E6874b56887a15647
19220G2481L7562i6689A57135H499a10833C0319K6054J34223A0259c2301F1673
19208c54938d1458j71218g6525j68024J5886O1062e6899j91564k77383I2287a29446
$$ plain form
19288 -167874 76640 -5002 -54649 -33490 -53111 -174436 55102 24891 117433 -36312 -294515
19277 -294515 -85597 -293350 217921 -129481 -159717 12957 92700 -94438 -21793 49884 -135929
19265 -6434 -195468 88721 -8627 -73782 -160284 -148849 -100391 1554 -237027 -77015 -188973 -245871
19253 -245871 53263 -154706 196147 -280645 -20196 -1953 207327 -148375 -65325 -159651 -2860
19241 -103387 -316092 -141957 -103214 24281 229012 -192585 -89311 -258574 -156088 -262161
19231 -262161 200936 61721 -232978 -362196 -282330 -345286 167511 56874 -256887 -115647
19220 72481 110043 -96689 157135 8499 -110833 30319 56373 190596 10259 -32301 61673
19208 -354938 -41458 -212676 -76525 -244549 -228663 -167601 -56899 -248463 -525846 92287 -129446
19196A36628b10854D8086k2526K05617E4549b4059H5030d25080C80581a38293
19185G445b2739A13980K5417D3011b71303n4660b6708A73516d4759q1239C12710
19173C0054K54328h3935k04832m6737e7134k35066P6634e3808A86694a81316I7946
19161b71142O3667A77329D4223j9600q058b44595k2343P7440b6494o985j55174
19150a88653g9866j97765i9164q8490m40783A23314P284a32056r9442J2856f9104
19138a83614L9407C6647i3556o0342B3254J42298G0560A9077c09300c7135l1418
19127f8553K3830A19090d54227J90686A01887m0088i9432A76061a26818k81871
19117d08689D5088b25126b4220A9000p2K24665m320G8685d36036K09174F8795
$$ plain form
19196 136628 -210854 48086 25560 231177 54549 -24059 85030 -425080 380581 -138293
19185 7445 -22739 113980 139397 43011 -271303 -325963 -26708 173516 -44759 -125998 312710
19173 30054 284382 -83935 -288767 -335504 -57134 -292200 -215566 -53808 186694 -181316 97946
19161 -271142 -207475 177329 44223 24623 16565 -244595 -266938 -189498 -26494 -33479 -188653
19150 -188653 -79866 -277631 -99164 -187654 -628437 123314 130598 -132056 -231498 -218642 -69104
19138 -183614 -144207 36647 -93556 -153898 23254 165552 70560 19077 -309300 -37135 -68553
19127 -68553 -44723 119090 -454227 -263541 101887 61799 -99432 176061 -126818 -408689
19117 -408689 45088 -225126 -24220 19000 18928 243593 239273 78685 -436036 -226862 68795
19105b9282l26514b9399D1165c38451a02345H5664l8953i0440j00333H1863D0450
19093b60597m1969E8933b66776j00239C5258b54242B87343g4131a1845q9793A82544
19081B6707c06689C36444a38556f8357C405J75965a14394m9257j41815e957j27912
19070a33869A03997a52622c8495l09859a27213C00690o99g2174k5440j07480A38302
19058b20834k051j5291i9424A55718a90860M6773e2064A61379E1482J86915B4151
19046G7523g5552L2119j14090k70388E1197a23772A64559a42555A05853A9157
19035a08371A8490c2186m1505A13450m7951K3312b33899H5261K7922A3630h7960
19023a61337r4183I6623h2408N001F9934g647j60679C3874k148a46167A31660
$$ plain form
19105 -29282 -355796 -29399 41165 -338451 -102345 85664 46711 -90440 -190773 81863 40450
19093 -260597 -302566 58933 -266776 -367015 35258 -254242 287343 -74131 -11845 -101638 182544
19081 26707 -306689 336444 -138556 -68357 3405 179370 -114394 -163651 -305466 -5957 -133869
19070 -133869 103997 -152622 -38495 -348354 -127213 300690 299991 -72174 -97614 -205094 138302
19058 -220834 -222885 -238176 -99424 155718 -190860 -144087 -52064 161379 51482 238397 24151
19046 77523 -75552 -43433 -157523 -427911 51197 -123772 164559 -142555 105853 19157
19035 -108371 18490 -32186 -73691 113450 65499 88811 -233899 85261 113183 13630 -87960
19023 -161337 -255520 96623 -82408 -77407 69934 -7647 -168326 33874 31726 -146167 131660
19011d8438A02008b14210J4285Q0928r8882A64957b75103A2392B681J05830b10278
18999a26043A1067g2931B69900h1248A95968O9062c8193H5992g2248G0060b29102
18987D6968b16838R1266f0753I2021b5705A2016g8124B39710A04582e7379A52400
18975g0144b8246O015k1090I6435N7792k4772N502K99014j85059a00407B13850
18963A56104K5804a8755A5329B266a72954H9717b73693J27849A01829a44731O8873
18952g5858p9502j07490A00033b57141N4564A13943g8804j79393a06021E9209
18941a28492L1861b7151o3702q7147C2488J08344J982f4884l62554e9652G391
18929a07944D8340A075d89400A52936F730J46220b48252G0028l1728b39888h2968
$$ plain form
19011 -48438 102008 -214210 -199925 -118997 -217879 164957 -275103 12392 2681 108511 -210278
18999 -126043 11067 -72931 269900 -81248 195968 265030 -38193 85992 -72248 70060 -229102
18987 46968 -216838 -125572 -60753 92021 -25705 12016 -78124 239710 104582 -57379 152400
18975 -70144 -28246 -22231 -43321 96435 154227 129455 134957 433971 248912 -100407 213850
18963 156104 181908 -18755 15329 2266 -172954 89717 -273693 -145844 101829 -144731 -75858
18952 -75858 -155360 -262850 100033 -257141 -202577 113943 -78804 -258197 -106021 59209
18941 -128492 -96631 -27151 -90853 -178000 32488 140832 142814 -64884 -427438 -59652 7391
18929 -107944 48340 1075 -489400 152936 6730 152950 -248252 70028 38300 -239888 -82968
18917g787k74073B67758b07589a0847A06746c8569J1057A67470E5368k737i0131
18905b5572j49154f7495r451j52235h4489l51671A89167f6407H4226b3598r1747
18894a15345D1622e04844H883b5920A72122k3513a85579j11303m2334P6823I1970
18882c30385F776c36643B46516A6408b25182O1481g6778B89226f4063j13059L3144
18871a43978D0030c99626E0802J00355b02781H2204N2516m9592L06580b25406
18860A21913c5145m34945H9783a15380C07978D6277a25450n2305B6106e2492F7319
18848a4467j73520g8760A4318K48412b38330o1940C17754d80505B71696D3283
18837g6066j04692i411k12428i2220A30738O4505a54209k8434A75164c2336G6446
$$ plain form
18917 -7787 -281860 267758 -207589 -10847 106746 -38569 -27512 167470 55368 52631 -90131
18905 -25572 -174726 -67495 -76946 -229181 -84489 -436160 189167 -66407 84226 -23598 -115345
18894 -115345 41622 -504844 8883 -25920 172122 148609 -185579 -296882 -339216 -262393 91970
18882 -330385 6776 -336643 246516 16408 -225182 -163701 -76778 289226 -64063 -177122 -143978
18871 -143978 40030 -399626 50802 151157 -202781 82204 134720 85128 391708 -225406
18860 121913 -35145 -470090 89783 -115380 307978 46277 -125450 -177755 26106 -52492 67319
18848 -14467 -187987 -78760 14318 262730 -238330 -300270 317754 -480505 271696 43283
18837 -76066 -180758 -9411 -221839 -92220 130738 195243 -154209 -182643 175164 -32336 76446
18825a9680A6347N6902g8783j14116L1898p3055l79508A67652a85685K4549L6978
18814a24158j24778B4908B279e0712I9141a30790k3778A84996b39184C18732a45283
18802A98011F3626b24801a02745q9931D6538I736J61550a61279B20131A4395b40483
18790b71605a9890A35645E7017a05879J2084k08229L8831d1922k98105a32325
18779i4031l9411O1659A64469g7837j01547I046K60615a34204K2595B44675b31662
18767c03038f0242C38153D7752A1248a41383m0995E2480a10804m8978C4085a94190
18755a33402B2623g1367m9286H2905b35448A36210K3145A8664a97907A8794N5850
18744G4644a91881a3474B43941a19198H9883f5062r260G6435d0656j72283j05830
$$ plain form
18825 -19680 16347 73249 -78783 -192899 -161001 -234056 -613564 167652 -185685 -161136 -124158
18814 -124158 -248936 24908 2279 -50712 99141 -130790 -154568 184996 -239184 318732 -145283
18802 198011 63626 -224801 -102745 -192676 46538 9736 171286 -161279 220131 14395 -240483
18790 -271605 -19890 135645 57017 -105879 -93795 -302024 -263193 -41922 -340027 -132325
18779 -94031 -133442 -71783 164469 -77837 -179384 9046 269661 -134204 -111609 244675 -231662
18767 -303038 -60242 338153 47752 11248 -141383 -182378 52480 -110804 -159782 34085 -194190
18755 -133402 22623 -71367 -120653 82905 -235448 136210 159355 18664 -197907 18794 74644
18744 74644 -191881 -13474 243941 -119198 89883 -65062 -74322 76435 -40656 -212939 -318769
18733c18769f7574F5992a04722L8284k65158J27611D5592c8422J753j21187C1333
18721A39392D8269i6144i799r9071Q501M4915j36568A99579I3762b83318K5620
18710b57698B57340a82795L9816C06030a40219k29039A14837J84942A38932a91208
18699a28469A67573m5960E3673K83965g4216j53799P2897P3630j09755A65875
18688c48866J53202A1349c6514A19331N4033A2078a96129N6588c0016l23846n4436
18677d08298A8149a04232d144l46312L293a17277I8167a98270N1749A05467B3336
18665E4624k6046i5859k42503J47272D1250M7157f2087r3694A7532d4647B38204
18653h7694b5014l1186k44469a40026k0975j05469K2419D79852A83756o5740a34630
$$ plain form
18733 -318769 -67574 65992 -104722 -66438 -331596 -203985 45592 -38422 -36669 -157856 31333
18721 139392 48269 -96144 -9799 -108870 -100369 -55454 -192022 199579 93762 -283318 -257698
18710 -257698 257340 -182795 -142979 306030 -140219 -369258 114837 299779 138932 -191208
18699 -128469 167573 121613 53673 337638 -74216 -228015 -155118 -81488 -191243 165875
18688 -348866 -195664 11349 -36514 119331 173364 12078 -196129 -139541 -30016 -353862 -408298
18677 -408298 18149 -104232 -4144 -350456 -347163 -117277 98167 -198270 -146521 105467 23336
18665 54624 28578 -95859 -338362 -191090 41250 88407 -62087 -155781 17532 -44647 238204
18653 -87694 -25014 -56200 -300669 -140026 -161001 -266470 -244051 479852 183756 118016 -134630
18641F2576L8608b36440O5050A98303b57582a16411e6118k35065a18755K1889
18631i6866r5110O2226C5721g7622j0160A4196e557j15459D4229b52911Q1367
18620a71544b8711j3880j41139G8848b54576C2974a65504P0642j82501j33800
18610d11163I980N6536J57972b94090h4025B78914A34855b29447H2617a23777
18599e1989D5668a21679j17484d2803g764j20960M3166l4667J564l6366k14680
18588c69707f6600j15125k28991B969R7596a65708n0777A66579l6654c97412A99563
18576c67104d2049C1642N1726a51110A6443b69776g6404j17333B62028I728c8009
18564a72380f7688A0882b55932i8222B3076J34239b03788f9001F518a34962p5445
$$ plain form
18641 62576 101184 -236440 -171390 198303 -257582 -116411 -56118 -291183 -118755 -96866
18631 -96866 -191976 -129750 35721 -77622 -87782 14196 -5557 -121016 44229 -252911 -171544
18620 -171544 -28711 -42591 -183730 78848 -254576 32974 -165504 -94862 -277363 -411163
18610 -411163 9980 66516 224488 -294090 -84025 278914 134855 -229447 82617 -123777
18599 -51989 45668 -121679 -239163 -42803 -7764 -128724 -85558 -120225 -118661 -155027 -369707
18588 -369707 -66600 -181725 -410716 2969 100565 -165708 -216485 166579 129925 -397412 199563
18576 -367104 -42049 31642 83368 -151110 16443 -269776 -76404 -193737 262028 9728 -38009
18564 -172380 -67688 10882 -255932 -98222 23076 157315 -203788 -69001 6518 -134962 -210407
18553b10407q568B55284R1482e7318A04081a70057I0703Q1690C6373c1142D4305
18541C72113i9845I9751l132g1038K1948B23632p9378c36212J64523B37672b08093
18529a25638j09466m5677A30760D6674b19768O5241o4910J02779A21776N3589
18519A75365b0367j32930M5880A09079a17461n9659o7259a3378B00092a45602
18508A25636J93768c99906J95369L5727j52188e9623m34071i6090E771Q8881J11168
18497B05820o8951e8826a8496m3197A34260a5433c711j7660A94012b46926j47748
18486c94674A39258J38853b27539a8696l2353m8814A12677b63416A16566c09514
18475g2556C09388b45990p0048G2651a03424n0571A56528b16697f1405j0803J6906
$$ plain form
18553 -210407 -218975 255284 346766 -57318 104081 -170057 90703 172393 36373 -31142 44305
18541 372113 -99845 99751 96619 -71038 -49090 223632 144254 -336212 -171689 237672 -208093
18529 -125638 -235104 -280781 130760 46674 -219768 -154527 -219437 -116658 121776 175365
18519 175365 -20367 -153297 -107417 109079 -117461 -177120 -244379 -13378 200092 -145602
18508 125636 319404 -399906 -204537 -168810 -320998 -59623 -493694 -96090 5771 94652 205820
18497 205820 136869 -58826 -18496 -61693 134260 -15433 -3711 -21371 194012 -246926 -394674
18486 -394674 139258 278111 -227539 -18696 -51049 -99863 112677 -263416 116566 -309514
18475 -72556 309388 -245990 -316038 72651 -103424 -153995 156528 -216697 -61405 -72208 -55302
18464e5302D49319a59706k78031C83942E7701a27516j26718j88222J69867o5844
18454c38433I0760b85195a02737k9947B9797a29763E0150R2208b01390K8846B31314
18442A61891N1629G7195K6809h2186F8912J9801j3730a45371E5944g9937B57445
18430e3899A39788g3694E9450a67344j26327C47695C5995d2433g408C323L09717
18419C13040a33969b2737A32957a82422K577J4299A0240c37564E671d830n4660
18408e9490m07450B04231f5096B78974C201c3393q0938j0270G972f3064k6247
18397h9311k70675j22788B13382c1669n5336r7286K5726n1128E4275f4614j35688
18386b00302p7389A61947a76863B11124D4440J1247P6899F3032a35678G6921b5708
$$ plain form
18464 -55302 449319 -159706 -437737 383942 57701 -127516 -254234 -442456 -272589 -338433
18454 -338433 90760 -285195 -102737 -132684 29797 -129763 50150 142358 -201390 -172544 231314
18442 161891 213520 77195 104004 -82186 68912 88713 74983 -145371 55944 -79937 257445
18430 -53899 139788 -73694 59450 -167344 -293671 347695 35995 -42433 -7408 3323 313040
18419 313040 -133969 -22737 132957 -182422 -179845 -165546 10240 -337564 5671 -4830 -59490
18408 -59490 -466940 204231 -65096 278974 3201 -33393 -114331 -124601 7972 -63064 -89311
18397 -89311 -359986 -482774 213382 -31669 -87005 -184291 -158565 -209693 54275 -64614 -200302
18386 -200302 -277691 161947 -176863 211124 44440 55687 132586 63032 -135678 76921 -25708
18374b90130e5331A72665C0604N9860b08720A02013L42712a03514p9331A05558
18363C1066f1896A57784l8471g1905A43467A6606J80734g8605B555f5476r5559
18352a61035g1631H4678b45269b1553l44443J51235e7529a0739k16737Q2443l3013
18341a78046A90213l6690E7702a55176A24566a0643I6195k5099b31432f3047L527
18330e9520B0432N9942a94773J9192A06463d07002B63259g4964D6802J13427b38064
18318d6301A9817a93286f0029B8357c6506j3103m5654a0166D756K29961b4409
18306h2964l4133l46404a05348j10254e0396l31850J17754E6570c45716a60249
18295b84185A97152a39030M4450C9481d07769C8752c38685i9058j418j0810e0589
$$ plain form
18374 -290130 -55331 172665 30604 90464 -208720 102013 444725 -103514 -182845 105558
18363 31066 -61896 157784 119313 -71905 143467 16606 197340 -78605 2555 -65476 -161035
18352 -161035 -71631 84678 -245269 -21553 -365996 -214761 -57529 -10739 -227476 -145033 -178046
18341 -178046 190213 153523 57702 -155176 124566 -10643 96195 71096 -231432 -63047 -59520
18330 -59520 20432 80374 -194773 -175581 106463 -407002 263259 -74964 46802 160229 -238064
18318 -46301 19817 -193286 -60029 28357 -36506 -49609 -95263 -10166 4756 234717 -24409
18306 -82964 -117097 -463501 -105348 -215602 -50396 -382246 -264492 56570 -345716 -160249
18295 -284185 197152 -139030 -94580 39481 -407769 38752 -338685 -99058 -100476 -111286 -50589
18283a07470m2982h42k26528J04085A04031b04299j36914f5264G8530e0228j48578
18272a98806n1470R2133o3925a06208j30437B86991p4570a11277A66226p8725
18262H7501j6219l3343J00671b28892H4798a03370m4673l3949P1237C6653K25280
18251B61933b97641a20875B42900G7345M3506K54015l8016A38536q49e46411c732
18239B9855J24064F3990a42060k21704A04401A3660L17763j48273J71060f2643
18228a84304O4723m4140B00072a47628L9159A41311a49861H1539d9726I5581i9321
18216e8204B8932K18354q8433c89304F2432a33138o3952M4903r3827j82353C06992
18204a528m6406Q989l95443A24459h2238A75520c2783A45441E5160K17559l9165
$$ plain form
18283 -107470 -150452 -842 -227370 -123285 104031 -204299 -341213 -65264 78530 -50228 -198806
18272 -198806 -250276 -158143 -222068 -106208 -236645 286991 212421 -111277 166226 87501
18262 87501 71282 37939 138610 -228892 84798 -103370 -148043 -181992 -110755 36653 261933
18251 261933 -297641 -120875 242900 77345 120851 374866 336850 138536 137687 -546411 -3732
18239 29855 153919 63990 -142060 -363764 104401 13660 331423 183150 354210 -62643
18228 -184304 -119581 -163721 200072 -147628 -108469 141311 -149861 81539 -49726 95581 -99321
18216 -58204 28932 247286 158853 -389304 62432 -133138 -197090 -152187 -246014 -428367 306992
18204 -1528 -47934 -38945 -434388 124459 -82238 175520 -32783 145441 55160 272719 233554
18193B33554B8457b85147q8101C6311c925C1584a96391d5226A3426J8621c8004
18181a78338D2675h280k58604A74386i988A72233i9366F0294b87128i8619J2606
18170h6013j13821F838b8295j57106j31386O8508B49932b7126j21845N1376h748
18158A66255a57604C8299j1678Q2008a42684r3070a2873A81017K68797A8939a52177
18146f2288D1107b09526I8075a31401k369B3468K24892b98574B29482b2029P387
18135a4642A0000k591b32325k21066a02547B3542b38232j1133H1098c8307B58838
18123a56067F6843M7882J05144O0374A27025K6532a3822C51063E3180d4321G2677
18111c68020b1538j04182A9236K13235I9431k4424m92d9158j85217H4267b17219
$$ plain form
18193 233554 28457 -285147 -373248 36311 -3925 31584 -196391 -45226 13426 32047 -38004
18181 -178338 42675 -8280 -266884 174386 -9988 172233 -99366 60294 -287128 -98619 -86013
18170 -86013 -199834 6838 -28295 -185401 -316787 -248279 249932 -27126 -148971 -97595 -8748
18158 166255 -157604 38299 26621 108629 -142684 -235754 -12873 181017 449814 18939 -152177
18146 -62288 41107 -209526 98075 -131401 -133770 23468 248360 -298574 229482 -22029 -14642
18135 -14642 10000 7409 -232325 -453391 -102547 23542 -238232 -249365 81098 -38307 258838
18123 -156067 66843 114725 219869 280243 127025 153557 -13822 351063 53180 -44321 72677
18111 -368020 -21538 -125720 19236 232471 99431 75007 74515 -49158 -234375 84267 -217219
18099g5725F9022a97573M5493a9916j83079e3919o9065C41109i8924D716b3484
18087C63577h155j32818n7133A40084A3849b16211A57058a41587C5115P4255M2103
18076A51473m7424K6863n1107e5355H5442A7694Q6982Q8425a2692A56718l3160
18065A23558a7140A69529K52557A52196J81181a24817A72820a39484e526p2900
18055g8426G4984h8875a6518m1327b5713A6178K60047r2665c3847j40277h0960
18043A81743G6591a69949C7383d3753l2329f503k7849j18726e3933A02744g5319
18031a29596B95786j47839c3494B98460n2677I6827J27665k3787p2173a95124
18020a16982a4069q2726A88679a48336a0143H7280b7807A29974b4301A37434J47376
$$ plain form
18099 -75725 69022 -197573 -152080 -19916 -202995 -53919 -122984 341109 -98924 4716 -23484
18087 363577 -8155 -140973 -198106 140084 13849 -216211 157058 -141587 35115 109370 151473
18076 151473 104049 130912 79805 -55355 85442 17694 104676 193101 -12692 156718 123558
18065 123558 -17140 169529 422086 152196 333377 -124817 172820 -139484 -5526 -78426
18055 -78426 74984 -88875 -16518 -57845 -25713 16178 276225 183560 -33847 -174124 -80960
18043 181743 76591 -169949 37383 -43753 -76082 -6503 -34352 -153078 -53933 102744 -75319
18031 -129596 295786 147947 -33494 298460 245783 96827 224492 200705 128532 -195124
18020 -116982 -14069 -96795 188679 -148336 -10143 87280 -27807 129974 -24301 137434 284810
18009B84810c1962F7846a95366j10577b3968j12028e1818m6128A72405a13815
17998d8093j60039B9169f9568l0913A49938b53510A02355i6625k3827j7638f3012
17986a01449A10147K03495g6312j4496B23600r5691N6538O9758e5830n5473c2088
17974A12124b87950L6626B189L84132c77087A87513J82949F2469R6440d0933E9423
17962a39246k7942A93812H2701N4083K0433b74554K0543d2796j85783D7728i6767
17950A29837R1625a56949L7816N2048A31146P390b46998d5302A63403F530J079
17939G609e8728B34737I9136r808J35827h8970K2403A92223K18177j20845a49462
17927D1214e4440k24849B53304j18662a20961k53397A04212j9339a44596e2683
$$ plain form
18009 284810 -31962 67846 -195366 -305943 -23968 -135996 -51818 -97946 172405 -113815
17998 -48093 -208132 29169 -69568 -100481 149938 -253510 102355 -96625 -120452 -138090 -63012
17986 -101449 110147 313642 -76312 -90808 223600 127909 184447 254205 -55830 -111303 -32088
17974 112124 -287950 -251324 2189 386321 -377087 187513 370462 62469 158909 -40933 59423
17962 -139246 -167188 193812 82701 136784 157217 -274554 -254011 -42796 -228579 47728 -96767
17950 129837 221462 -156949 -119133 -67085 131146 138536 -246998 -45302 163403 6530 7609
17939 7609 -58728 234737 99136 89328 225155 -88970 -66567 192223 410400 289555 -149462
17927 41214 -54440 -279289 253304 134642 -120961 -374358 104212 84873 -144596 -52683
17916c69925g6985B23375a25864j06116C40718b02059A75375c20021C58037C8704
17905f0115I2306b89479C1237b63940c8008D0156b01108A24575a49691G4735b6333
17893a17887E1755h6721C86391A29691C7746L36434A36088a7763j64471g973D45182
17881A22701Q1961E8651J08702B4580J94342a13471A01640C9373B485b36297j1914
17870b48211B95938c6618j92196F6173b32642C14802b61421f140l6737C0306c1403
17858a38510f0071k20815d4613E8201K59383c5444C17309b10367h7538M0277D65399
17846A3804J17711O2123m2575K7915J00719B5319a20264G9079J31046B5268K83418
17835C08686b70676M4135L1279g7618k7565M1420H7967a13422C8954J09981b23994
$$ plain form
17916 -369925 -76985 223375 -125864 -231980 340718 -202059 175375 -320021 358037 38704
17905 -60115 92306 -289479 31237 -263940 -38008 40156 -201108 124575 -149691 74735 -26333
17893 -117887 51755 -86721 386391 129691 37746 374180 136088 -17763 -182234 -7973 445182
17881 122701 204662 58651 167353 24580 218922 -113471 101640 39373 2485 -236297 -248211
17870 -248211 295938 -36618 -228814 66173 -232642 314802 -261421 -6140 -42877 30306 -31403
17858 -138510 -60071 -280886 -44613 58201 317584 -35444 317309 -210367 -87538 -47261 465399
17846 13804 131515 193638 151063 178978 279697 25319 -120264 79079 210125 25268 308686
17835 308686 -270676 -226541 -195262 -77618 -105183 -63763 87967 -113422 38954 148935 -223994
17823a11611A95864F2382k3483c38392C62701A65001c7996A7295a49347b5667
17812b1377C91345A85624a43522G5170f8378B11367f4115I6597a08236h726B51899
17800A14582O2264m0631a65133q606B39621k2720a37323B3502b18419B26314b6890
17788h4486C22182a70053B31191h6888B74132A26193a58849H559P2012k0579K11180
17777B71172e5977A40297d4972B20371P4862j21077a07734f1B64342H9589A1087
17765A34300K06373O2939G5672A4731b40045K2134L7154K469C8518b3682r126
17754c2808B9567K35226a5436A28040g5681r4363A42302K72950a1199j557k1826
17743c4582I5981D6319K02677G2962K59235l1082A1357J49848b9682H1368A8736
$$ plain form
17823 -111611 195864 62382 38899 -338392 362701 165001 -37996 17295 -149347 -25667
17812 -21377 391345 185624 -143522 75170 -68378 211367 -64115 96597 -108236 -8726 251899
17800 114582 176846 136215 -165133 -173739 239621 216901 -137323 23502 -218419 226314 -26890
17788 -84486 322182 -170053 231191 -86888 274132 126193 -158849 8559 80571 59992 271172
17777 271172 -55977 140297 -44972 220371 295233 174156 -107734 -61 264342 89589 11087
17765 134300 340673 403612 75672 14731 -240045 -217911 -180757 -178288 38518 -23682 -32808
17754 -32808 29567 264793 -15436 128040 -75681 -170044 142302 415252 -11199 -12756 -34582
17743 -34582 95981 46319 248996 72962 332197 301115 11357 161205 -29682 81368 18736
17731G8734j0115a41513A34707o5003N2156K61960a60663A36409E1867K07881
17721B59748E1816L5654O4714f6634A93028j4685J51673r4592o190q0259a70708
17709B17484a12857G872J83081f9842B05863F9750J03154K46990b29057N0764
17699a78293a9855A00883P4780L6177a11802c0137j16833K393p9291k51651B46826
17687A94877m2726N6876J9825b93369G3744K42057a28186A15686A350h0267j28444
17676b08711A73634l3588o0245a05135D4337a49D7556L39891B2346J59442L62890
17665E44678B3077P1181d443A52295N480J38204G3957L45149a15217B88783a35913
17653B1530O5549d1485j53675B35564J77713A19278k6473K74349a24013A22460
$$ plain form
17731 78734 68619 -141513 134707 69704 121860 383820 -160663 136409 51867 259748
17721 259748 51816 87470 152184 -66634 193028 178343 330016 235424 229234 148975 -170708
17709 217484 -112857 7872 190953 -69842 205863 69750 172904 419894 -229057 -178293
17699 -178293 -19855 100883 175663 211840 -111802 -30137 -146970 -144577 -223868 -475519 246826
17687 194877 152151 209027 228852 -293369 73744 315801 -128186 115686 1350 -80267 -208711
17676 -208711 173634 140046 79801 -105135 44337 -149 47556 387447 22346 181788 544678
17665 544678 23077 94258 -4443 152295 157775 295979 73957 419106 -115217 288783 -135913
17653 21530 87079 -41485 -195160 235564 413277 119278 92805 367154 -124013 122460
17642B56723c30841G3438B0343L6491J46095b62209I5938b43730A27337J06783
17632B34120A11270a10255G5351p555R6806b59880i5211C97090j08969g6757A7304
17620G3456M7400J5233J68568b22713A5147f0835B7405a47675G3815J30001i7861
17608a32526I530K74589J52994f913A66748a68478k3186R1335C01603a23807C72312
17596A02202e5488A53612K95072A96185K07893A67045B7434K05134m9098J831
17586A85301F8995J05761K05178r4051K6828Q0267j91621m8687d6963F8765P9198
17575A47963K36857D3396J02373o054b27419A38491C448M0314K88989a4759B03798
17563A01356E543L13854K74454B4884M5588L020J15705J66850h1532C03460r6022
$$ plain form
17642 256723 -330841 73438 20343 56834 202929 -262209 95938 -243730 127337 234120
17632 234120 111270 -110255 75351 67796 164602 -259880 -95211 397090 288121 -76757 17304
17620 73456 120856 136089 304657 -222713 15147 -60835 27405 -147675 73815 203816 -97861
17608 -132526 9530 284119 437113 -6913 166748 -168478 -191664 -100329 301603 -123807 372312
17596 102202 -55488 153612 448684 196185 404078 167045 27434 232568 183470 185301
17586 185301 68995 174756 379934 285883 312711 392978 201357 152670 -46963 68765 147963
17575 147963 384820 43396 145769 139715 -227419 138491 3448 43762 332751 -14759 203798
17563 101356 5543 319397 593851 24884 70472 73492 189197 356047 -81532 303460 207438
17552B07438K37873j46314o0912p9952k6281J08626n4419j7536N5068J15038J81055
17541E19684B25554P283j6099J65243j13402B8192J74198M45429k55542R6836
17531D89113p6120O9988O2826K14466o3102q5552k8656N698K5041M44044D52652
17519D02255j50028M21445k16993j39856L03339j02136A68753N88273J26648l17713
17509E65961J17463r3477B50828K6034J9200L7243p925A49905L33955A18876P9470
17498A98346K08443M2720A57835K59995j8533F5258Q1566m5733K51001J8343L8240
17487D08675k03361L1965J66693m1783j26914a69923G72166B50661n9630L0096
17477B21127M0793J23804n3078j58418J64235L47227C00573J20046k3002j10364
$$ plain form
17552 207438 445311 298997 238085 158133 131852 240478 186059 168523 223591 338629 519684
17541 519684 225554 232837 216738 381981 268579 28192 202390 647819 392277 489113
17531 489113 412993 482981 545807 760273 697171 611619 582963 588661 613702 1057746 452652
17519 402255 252227 673672 456679 316823 620162 518026 168753 757026 883674 565961
17509 565961 683424 589947 250828 276862 296062 333305 325380 149905 483860 118876 198346
17498 198346 406789 449509 157835 417830 399297 65258 146824 101091 352092 370435 408675
17487 408675 205314 237279 403972 362189 235275 -169923 772166 250661 191031 221127
17477 221127 261920 385724 332646 174228 338463 685690 300573 420619 397617 287253
17467B87253L4480j4369o4606P8940K28724B52107P6415o4779K01580B29599N3035
17456B82634k6405k0315b5053E66325B38447f7398E53922A09065N91809B72522
17445E56003k56654J59072J25544k19620A42524K84014B03483J27491J30204r3457
17435C67721A07684J86724k4853A33007P9736J64689j40263K57348N863A94609
17424E22602l4491k19345l4318K16351M630D5354N61288A64916J14367J9321n1553
17413B47051J86355j50782J14568j58536A19311L42246O341j54641B2927K71837
17403B94764J6271b4054C88225p8166M5365r3450j17453E1069N30765A63203l0183
17392A33020J98869j50998K16651N7508M5764G8705K61086J08929D6744J44554
$$ plain form
17467 287253 321733 307364 242758 321698 550422 252107 328522 263743 465323 229599 282634
17456 282634 256229 235914 -25053 566325 238447 -67398 553922 109065 700874 272522
17445 556003 299349 458421 583965 364345 142524 426538 203483 330974 461178 367721
17435 367721 107684 294408 269555 133007 212743 377432 237169 494517 500380 194609
17424 522602 488111 268766 234448 450799 455429 45354 606642 164916 279283 298604 247051
17413 247051 433406 282624 397192 238656 119311 461557 467898 313257 22927 294764
17403 294764 311035 -24054 388225 310059 355424 261974 144521 51069 581834 163203 133020
17392 133020 331889 180891 397542 455050 500814 78705 339791 448720 46744 191298
17382A91298J44426A35290E6865K89511q2942A29904J41686L7375n9595a54132
17371B29712N9840J5846L16759B70861K24315k29173J03813j59427K7688K1642
17361B59719F9041K36672R0058k25M5042k16793A4994K07082L22727L0714j09355
17350D66162Jp9579j1921j35097K64245Q6618k61724a91308D64419B11545l701
17339B07844K08668j01203a71276B69103j29079L8191h647B73782J08758A11269
17328E01696l7927f9625B66667k0921R237P68n7423J92065K34051I6972C0687
17316B92725B4989M28436F5520K17356k1064O4287B9379J07591L08966r6328j24954
17305B24654r3548J07842K05418k6622J2837K73371k0047k18627A94900K49778
$$ plain form
17382 191298 335724 135290 56865 346376 263434 129904 271590 308965 249370 -154132
17371 229712 289552 305398 622157 270861 495176 266003 369816 210389 238077 259719
17361 259719 69041 305713 395771 395546 440588 223795 14994 222076 544803 575517 466162
17350 466162 466163 386584 374663 239566 503811 590429 328705 -191308 464419 211545 207844
17339 207844 416512 315309 -171276 269103 140024 178215 -8647 273782 382540 111269
17328 501696 463769 -69625 266667 245746 254983 255751 198328 390393 624444 96972 30687
17316 292725 24989 453425 65520 282876 261812 326099 29379 136970 445936 349608 224654
17305 224654 131106 238948 444366 417744 430581 703952 683905 465278 194900 444678
17295D44678j40428J09983A70449L57094B30451O8082A37697M42698k22207F1871
17284D63821H6901M15890E1226K94219j35248K72889k29545l76k5569K14754J70563
17273F12913B94038j07813P0289K74217P836k45601K3861K12597j39610p6487
17263C13327K4794J62000p8520k7082j56293P5166H0008A9087L57618J44748A95157
17251A88198L6204K60674j65877J12690p5848k2135K12348j68342J85046k72863
17241B90095J42213J03688R3268A20027L47826O0233B50899F9232N64483B87737
17230B74561K33344m0446N9355j12767J29158B63716K79882k51496P7277l7361
17220C32018L4250K88321k4388l00043A38899L90224k26672A28880K71228J70050
$$ plain form
17295 444678 304250 414233 170449 527543 230451 298533 137697 580395 358188 61871
17284 463821 86901 502791 51226 345445 210197 483086 253541 253165 227596 442350 612913
17273 612913 294038 186225 256514 530731 538567 292966 316827 529424 389814 313327
17263 313327 338121 500121 421601 394519 238226 313392 80008 19087 376705 521453 195157
17251 188198 224402 485076 319199 431889 356041 333906 546254 377912 562958 290095
17241 290095 432308 535996 629264 120027 467853 528086 250899 69232 633715 287737
17230 274561 507905 467459 526814 414047 543205 263716 543598 292102 369379 332018
17220 332018 366268 654589 630201 330158 138899 529123 302451 128880 400108 570158
17210E70158R9651B86741J01850O1306J8680L7130n847m233j14743M63815k86707
17199E57992j7499J9757k19119R7699J356J41979j48707L97605A86666K58323
17189D44989J76373J57923k22098j9506n4706k4503M19588m10070K96607k94389
17179D70208j25053K72675N3527k21930q0815K52416k83154K97831j46419J23971
17169F13257K6280k39396o8921Q5697K19092k4562k15950J94063N7088J28852
17159G75500k5870j66660O0587j82290K6801J78014k8778n7610j45349K94065
17149G28410l63101M92146m00110K3996j37166J58109J14512o9544M11329j03036
17139H55545l22445J32879j90991K42105o1420K7133l7861k3444N3106k74967
$$ plain form
17210 570158 669809 286741 388591 449897 468577 505707 499860 495627 380884 844699 557992
17199 557992 540493 560250 341131 438830 440186 582165 433458 831063 186666 444989
17189 444989 621362 779285 557187 537681 482975 458472 878060 467990 764597 470208
17179 470208 345155 617830 671357 449427 368612 621028 337874 635705 489286 613257
17169 613257 639537 400141 331220 416917 636009 611447 395497 589560 646648 775500
17159 775500 749630 582970 643557 461267 488068 666082 637304 579694 434345 728410
17149 728410 365309 857455 457345 481341 344175 502284 616796 547252 958581 855545
17139 855545 533100 665979 474988 717093 655673 682806 644945 621501 674607 399640
17129C99640L92604k94519L00348m9971J97745r6538l23558L12162k96356J65321
17119G06878k22219K06123k65261J67960j89336L48293J3045j92556o9181K88636
17109G92382M5805K26966l87536K48640j05304j39299J98802Q1689r8474r4405
17099G69266k40646M01131k45749N44562n72922L45074k53296N1885J05193j12115
17089G92383L63153m58323M3875K42770L4297j33467j15378k87118N58634l59995
17079F80831K51265J02450m7058p9607l58935L66188L19950k86382j84367J04874
17069H69209K25629j01410j69848K05263K75597j42843j6498n29061M16204r9845
17059I32397k28672L74804J16856k59631O4055M11535o01033Q0263N1631J68452
$$ plain form
17129 399640 792244 497725 798073 748102 945847 849309 525751 837913 541557 706878
17119 706878 484659 690782 425521 593481 404145 752438 765483 572927 503746 792382
17109 792382 838187 1065153 677617 926257 820953 681654 880456 962145 863671 769266
17099 769266 528620 929751 684002 1228564 655642 1000716 747420 799305 904498 792383
17089 792383 1155536 697213 741088 983858 1018155 884688 769310 482192 1040826 680831
17079 680831 932096 1034546 987488 907881 548946 915134 1235084 948702 764335 869209
17069 869209 1094838 993428 823580 1028843 1304440 1161597 1145099 616038 1032242 932397
17059 932397 703725 1078529 1195385 935754 999809 1411344 810311 890574 942205 1110657
17049A110657M6389J4729k68092L93991j79205R2676j81479M2122j09574r8440
17039H63774K22660J74185K0096k66969K83999o2336K62696R383k26362r5933
17029A185193J6058J44785k11247L50287k31490o7871L26072j45633k57902L16939
17019A425191l0963K32539k44336R4909k47873J78651K85742k57237J27026j05710
17009A457939J21734k42978J79150J4987J649J86343m41385L3040N45178j74225
16999A681432r1459j99815K63534K13572k54635N8001J30562m3468k58700L35101
16989A834125j79320o224K98165J27759j23683r4071p5086K12095l66405M10453
16979B037808m33352L12281m2830K53793l67064Q078n608K77648j97859M43130
$$ plain form
17049 1110657 1157046 1171775 903683 1297674 1118469 1211145 1029666 1071788 962214 863774
17039 863774 1086434 1260619 1280715 1013746 1297745 1235409 1498105 1507488 1281126 1185193
17029 1185193 1201251 1346036 1134789 1485076 1253586 1185715 1511787 1366154 1108252 1425191
17019 1425191 1394228 1626767 1382431 1477340 1229467 1408118 1693860 1436623 1563649 1457939
17009 1457939 1579673 1336695 1515845 1530832 1532481 1718824 1277439 1310479 1855657 1681432
16999 1681432 1589973 1390158 1653692 1867264 1612629 1670630 1801192 1757724 1499024 1834125
16989 1834125 1654805 1648581 1946746 2074505 1950822 1856751 1781665 1993760 1627355 2037808
16979 2037808 1604456 1916737 1873907 2127700 1760636 1768714 1763106 2040754 1842895 2286025
16969B286025k80759N53511k74874k55960J48158k27184M68077k1279j46289R5355
16959B344781j32445L91418l53940q7628J58504J47066J85051k24096L58693j95797
16949B591607P7001j68124N5749j9436P1900J72528l37249N26532k36987k71475
16939B462046L28109J80055J06787k33408J93964K62607O6101n36464L28174l48760
16929B809211L27733J2124L9833J65961k73204K12565J80139k45580K9538J99263
16919C457583n8990j65100M21934q5915k09762L18326j07934K14427J35703j00334
16909C819938J04702j02756J24477K5490M805J37935P2405J53541j20729J87743
16899D407551L87033m50875K74548m24374O90861l81002L72454l889j50882J84208
$$ plain form
16969 2286025 2005266 2558777 2283903 2027943 2176101 1948917 2416994 2395715 2249426 2344781
16959 2344781 2212336 2603754 2249814 2162186 2320690 2467756 2652807 2428711 2787404 2591607
16949 2591607 2668608 2500484 2556233 2536797 2608697 2781225 2443976 2970508 2733521 2462046
16939 2462046 2790155 2970210 3076997 2843589 3037553 3300160 3366261 2829797 3157971 2809211
16929 2809211 3136944 3149068 3188901 3354862 3081658 3294223 3474362 3228782 3258320 3457583
16919 3457583 3398593 3233493 3655427 3569512 3359750 3678076 3570142 3784569 3920272 3819938
16909 3819938 3924640 3821884 3946361 3971851 3976656 4114591 4186996 4340537 4219808 4407551
16899 4407551 4794584 4343709 4618257 4193883 4884744 4503742 4876196 4872307 4721425 4905633
16889D905633n4558R5620K58015l3084N3754l6363L15360k30559K34787M89884
16879E998489k48763L34339n20869O76698m61142L83516r0118L56661M6840k15622
16869F260029N12989j01737J76949J44523o0740L12508P2112m0167O61941r5588
16859G842819o83K03278j21476P2659J59245J93882L25285k0131k40099M69570
16849H884349J87636L86169k36327O43289j56877K09420J54788R5458l67870O81663
16839A0481698J62912N65942l8440K25475K56219L27427O4232K70227K65882O6555
16829A2648129K70012N03979K44191q2108L50094j38597Q56107K49718K32320
16820A5133845J89534L44910J02534N51904M33572M00306M6178L38205P97524
$$ plain form
16889 4905633 4851075 4946695 5204710 5171626 5225380 5189017 5504377 5273818 5508605 5998489
16879 5998489 5749726 6084065 5563196 6239894 5778752 6162268 6072150 6428811 6475651 6260029
16869 6260029 6773018 6671281 6848230 6992753 6932013 7244521 7316633 7276466 7938407 7842819
16859 7842819 7842136 8045414 7923938 7996597 8155842 8349724 8675009 8654878 8414779 8884349
16849 8884349 9071985 9458154 9221827 9865116 9708239 9917659 10072447 10167905 9800035 10481698
16839 10481698 10644610 11210552 11172112 11397587 11653806 11981233 12045465 12315692 12581574 12648129
16829 12648129 12918141 13422120 13666311 13584203 13934297 13795700 14651807 14901525 15133845
16820 15133845 15323379 15668289 15770823 16322727 16756299 17156605 17202783 17540988 18338512
16811A8338512p9830N48337L34154O25244K90771M04295N54239O38164J16890
16802B1770776M93013M44898L68530Q13374Q79336K67669j7929R65180R53566
16793B6938413K10451L57251Q52070P24331L76338M89069O55277J135015N34535
16784C2272750Q13111N26144R98518R12849P96467P14013Q11655Q29216O94815
16775C9369538J275676Q90146P32264R35105Q88432P50585J261663J230152Q36795
16766D8170356J109477J190191R30896J085363J048302J110323J016779J200498
16758E6862185J507475P48170R83208J539791P66913J152791J091877J378005
16750F6030415J192789J311655O16906J764111O00531J154805J036442J293642
$$ plain form
16811 18338512 18258682 18807019 19141173 19766417 20057188 20461483 21015722 21653886 21770776
16802 21770776 22263789 22708687 23077217 23890591 24769927 25037596 25019667 25984847 26938413
16793 26938413 27148864 27506115 28358185 29082516 29458854 29947923 30603200 31738215 32272750
16784 32272750 33085861 33612005 34610523 35523372 36319839 37033852 37845507 38674723 39369538
16775 39369538 40645214 41535360 42267624 43202729 44091161 44841746 46103409 47333561 48170356
16766 48170356 49279833 50470024 51400920 52486283 53534585 54644908 55661687 56862185
16758 56862185 58369660 59117830 60101038 61640829 62407742 63560533 64652410 66030415
16750 66030415 67223204 68534859 69151765 70915876 71516407 72671212 73707654 75001296
16742G5001296J025570L72070J041915R09213O95609O43788O15749O87785L10515
16733H1303510N33505P99695j20986K42984l89810K45483K43802l18251l89753
16724H2150179l35695o55175j61937j032252n22150j054941r62360r34465j222140
16715G5269064p30177j617802j000624j186600j548795r00847j819973j284220
16707F5180026j295838j876487j109751j655448r99103j943512j015441j368521
16699E3915925j420200j055754j888597j007082j277023j442842p12891j481289
16691D3630247j121451q76724j449851r59934q23622j165359r98692j039489o87136
16682C4507989j034951p16157r58888o82531p69740p76598o72492p71737q39916
$$ plain form
16742 75001296 76026866 76398936 77440851 78350064 79045673 79689461 80305210 80992995 81303510
16733 81303510 81837015 82636710 82515724 82758708 82368898 82614381 82858183 82539932 82150179
16724 82150179 81814484 81159309 80997372 79965120 79442970 78388029 77425669 76491204 75269064
16715 75269064 74538887 72921085 71920461 70733861 69185066 68284219 66464246 65180026
16707 65180026 63884188 62007701 60897950 59242502 58243399 56299887 55284446 53915925
16699 53915925 52495725 51439971 49551374 48544292 47267269 45824427 45111536 43630247
16691 43630247 42508796 41632072 40182221 39222287 38398665 37233306 36234614 35195125 34507989
16682 34507989 33473038 32756881 31797993 31115462 30345722 29569124 28896632 28124895 27284979
16673B7284979l96197q47469r15726j75102m58919o58678q36087n97421m16761
16664B1982619n85697l32375o83225j88443n27717m06052n02503k17092m70283
16655A8069232k56763m30213o28693l17664Q5757n25287m05205m21254p6559m32513
16645A4660838j90376l06934J9416p36673p9870l47899j44062k15241j50882j96222
16635A2312095m91792M7875k64880K6323o17255J56979l64813M5220l43950m15595
16625A0090207K80298q7247n95794k14098j11674l54707K35581n3798j77799k23490
16615H787479J29233p27970R6069k60843L94490m78354j20176m1009K79277n36213
16605G521983J33852q8441l82824q2043J47984n36012K46215k85507j78601Q7960
$$ plain form
16673 27284979 26888782 26041313 25125587 24950485 24491566 23832888 22996801 22399380 21982619
16664 21982619 21396922 21064547 20381322 20192879 19665162 19259110 18756607 18539515 18069232
16655 18069232 17812469 17382256 16753563 16435899 16521656 15996369 15591164 15169910 15093351 14660838
16645 14660838 14470462 14163528 14182944 13446271 13366401 13018502 12874440 12659199 12508317 12312095
16635 12312095 11820303 11868178 11603298 11629621 11012366 11169345 10804532 10849752 10505802 10090207
16625 10090207 10370505 10283258 9687464 9473366 9361692 9006985 9242566 9188768 9010969 8787479
16615 8787479 8916712 8188742 8284811 8023968 8418458 7940104 7819928 7778919 8058196 7521983
16605 7521983 7655835 7567394 7184570 7102527 7250511 6714499 6960714 6675207 6496606 6584566
16595F584566j95804l2001J78748l01441k78764k7787K82311o79691N46643o9292
16585F007488k37503k38918j04329j09190j99759J32741J59706j07576j91099
16576E111561K46159l11857N768j04574k04112R4798m99611N58389k79193k13210
16566D404118P5155J30627k55918k12410K09616k01521Q6848m3825j37801l06272
16556C748617N30580j99471m7422J2932n6930n9045k65414j32133M56451l01875
16546C686290j9443j39755Q6943k9875j39549O1177r4524l37988L30129j81782
16536C221623j94193R6847J98099j99487O6862p4161K01989n00490N67255l87228
16526B997116j29180J18163P3253j00755J80823k35360q7251k17469j20689K40228
$$ plain form
16595 6584566 6388762 6356761 6535509 6234068 5955304 5927517 6209828 5530137 6076780 6007488
16585 6007488 5769985 5531067 5426738 5317548 5117789 5250530 5410236 5302660 5111561
16576 5111561 5357720 5045863 5051631 4947057 4742945 4837743 4338132 4896521 4617328 4404118
16566 4404118 4479273 4609900 4353982 4141572 4351188 4149667 4236515 4192690 4054889 3748617
16556 3748617 4279197 4079726 4032304 4045236 3988306 3929261 3663847 3531714 3988165 3686290
16546 3686290 3666847 3527092 3614035 3584160 3444611 3505788 3411264 3073276 3403405 3221623
16536 3221623 3027430 3124277 3322376 3122889 3189751 3115590 3317579 2817089 3384344 2997116
16526 2997116 2867936 2986099 3059352 2958597 3139420 2904060 2816809 2599340 2478651 2718879
16516B718879j93031L39127k78941L08367k53971m4048O4221L13725j46657N065
16506B832736j48612j65555m0835j19285K2941r8079J70681p3473O8290l5566
16496B413243J80133k98769R5957J20320n58574J4776M90435j55985M8960l32041
16486B018455K88705j21096j48401K03398k17168M39211j73487k19798k36905
16477A832914M25752j41669J31479k95408j51209K44680r9732k54755J23000j26253
16467A688799J90405j06177k89060M15347j2128j32842R4172k6351n5013P8436
16457A845588K02816o14012J61767P2932J55295j44379J73815k91839P1721K31045
16447A864749n7550k31184O1897N5773k06603J38568K44593o01389J73301N1788
$$ plain form
16516 2718879 2525848 2864975 2586034 2894401 2640430 2596382 2660603 2974328 2827671 2832736
16506 2832736 2684124 2518569 2477734 2358449 2381390 2283311 2453992 2380519 2448809 2413243
16496 2413243 2593376 2294607 2390564 2510884 1952310 1967086 2457521 2301536 2350496 2018455
16486 2018455 2307160 2186064 2037663 2241061 2023893 2463104 2289617 2069819 1832914
16477 1832914 2258666 2116997 2248476 1953068 1801859 2046539 1946807 1692052 1815052 1688799
16467 1688799 1879204 1773027 1483967 1899314 1887186 1754344 1848516 1822165 1767152 1845588
16457 1845588 2048404 1434392 1596159 1669091 1824386 1680007 1853822 1561983 1633704 1864749
16447 1864749 1807199 1576015 1637912 1693685 1487082 1625650 1870243 1268854 1442155 1493943
16437A493943N7301k11657J72891l40616M09025R1260j96667J25405m41306J10373
16427A269952R2485J42555j0265j03068r1425J46019l91621N32514P8645m04432
16417A261359K81660o99004K90026M78619l16770o286K4674K13444l50829J08457
16407A285350K42426j01109j00652j95307o8944L83892K9705j3661m55212N36459
16397A542947k53736o2685K45981k62616K36765m31611k1268Q4625K73288k99538
16387A052152j74544J19227M7061l2066M2683k11881L43348l95974J68845J81618
16377A140469k30824K3635j19541J50222j38144K52911n0460Q2005l2089j00485
16367I77699j13553J49401j69119N8667j77230J94158M03044R3325m66496o1669
$$ plain form
16437 1493943 1551244 1339587 1512478 1171862 1580887 1672147 1475480 1600885 1159579 1269952
16427 1269952 1362437 1504992 1494727 1391659 1300234 1446253 1054632 1587146 1665791 1261359
16417 1261359 1543019 844015 1134041 1612660 1295890 1289604 1314278 1527722 1176893 1285350
16407 1285350 1527776 1426667 1326015 1130708 1061764 1445656 1475361 1461700 1006488 1542947
16397 1542947 1289211 1226526 1472507 1209891 1446656 1015045 993777 1078402 1351690 1052152
16387 1052152 877608 996835 1043896 1011830 1054513 842632 1185980 790006 958851 1140469
16377 1140469 909645 933280 813739 963961 825817 1078728 1028268 1110273 1078184 977699
16367 977699 864146 1013547 844428 903095 725865 920023 1323067 1416392 949896 888227
16357H88227j45632R7890P7858J03967M2222o1931l2951R045M5173P5154l81090
16346G17932k6959J62780J87661q1756j17992j07760j10026K5616N2199O8925
16336G70620J85631j08996O8775p8663l5487k73356M86428k94399N8674M11260
16326A190487k14033K20522l08371j97245J79049q7942K35143l35543N67J97913
16316H80547j6956j47406l4598J91908j17890k4885J16373j41122P542l1365n47
16305F81601q3807L2188L71230k59878n4021j18803L0562K54240k35159l4120
16295E84033K64362l37443M57061k62670j06093L6117j4869K12618l01028J67762
16285F99850j05264K12733p5520k5244j74116J08998j29004J53171r177p2902
$$ plain form
16357 888227 742595 840485 918343 1022310 1064532 1002601 969650 978695 1023868 1099022 717932
16346 717932 690973 853753 1041414 959658 841666 733906 623880 649496 701695 770620
16336 770620 956251 847255 916030 837367 801880 528524 1014952 720553 779227 1190487
16326 1190487 976454 1196976 888605 691360 870409 782467 1017610 682067 682634 880547
16316 880547 863591 716185 681587 873495 755605 730720 847093 705971 713513 682148 681601
16305 681601 597794 629982 1001212 741334 687313 568510 599072 853312 618153 584033
16295 584033 848395 510952 968013 705343 599250 635367 620498 833116 532088 699850
16285 699850 594586 807319 731799 706555 532439 641437 512433 665604 656427 583525
16275E83525B64120N38953k07698L24843l53986j26933J12184K00095k33133j7520
16265E00925J82505M4948j32440l8358Q5848M1632L4674k19280J2887J80636O0001
16254G53978n6397l791k8931L9293j37029Q1587j9687N2343p9354J22337k00104
16243E24245j12237m386n7368J40212A40164K80220K28428j20051K50601k88582
16233D90780k8175j40917M16968A85988J74544M7340P8096J36679k58159R1591
16223D56079j01644j6339p1374L12526j36060K63756j32659k22338L02502B26711
16212E73507k76113j14634L37491J6813k43769J94951Q117A62517L16767j78231
16202C01053j23115L07149K01285B80710O25j18097K58963Q3885L2509A93890
$$ plain form
16275 583525 264120 803073 595375 920218 566232 439299 551483 751578 518445 500925
16265 500925 683430 728378 595938 557580 643428 685060 719734 500454 513341 693977 753978
16254 753978 697581 693790 664859 704152 567123 648710 629023 681366 602012 724349 524245
16243 524245 412008 407622 350254 490466 140164 420384 648812 528761 779362 490780
16233 490780 462605 321688 738656 185988 360532 407872 485968 622647 364488 456079
16223 456079 354435 338096 266722 579248 443188 706944 574285 351947 654449 226711
16212 573507 297394 182760 520251 537064 293295 488246 496363 162517 479284 301053
16202 301053 177938 485087 686372 280710 281335 163238 422201 506086 538595 193890
16191C61550N7787J9396r9973P6371K5445K7972J88368l09418A56221M47193F8717
16179B38713K17681R2714I2352L0801M8249O0780J30511j11849j17437A1946K11346
16168B23292J48181Q1373E9868K25265a01230D99407o2214P0052Q3519B23349
16157A89256J59444J94522A11475J2027M1470R3707G3276K94870K00577j38193
16147D30530j74860M02624j47130B25376J16157o1837J3528l9352g25C91212J05152
16136D96364k16253e2104D66025A16087J78745f4871H3928O7920O9335A8411K76874
16125B95285F1829K01180l4826Q2549p2611A5342L23890J17928j78027j20559
16115A58574o7458Q507j0637k266D2269J84409K345E3327P58462C50790J460I9026
$$ plain form
16191 361550 419337 438733 338760 415131 440576 468548 656916 347498 156221 603414 68717
16179 238713 456394 549108 92352 123153 171402 232182 362693 250844 133407 11946 223292
16168 223292 371473 452846 59868 285133 -101230 499407 437193 507245 590764 223349
16157 189256 348700 543222 111475 123502 164972 258679 73276 368146 568723 430530
16147 430530 255670 658294 511164 225376 341533 279696 293224 253872 -725 391212 496364
16136 496364 280111 -52104 466025 116087 294832 -64871 83928 151848 221183 18411 295285
16125 295285 61829 263009 228183 310732 238121 15342 339232 457160 279133 158574
16115 158574 91116 99623 88986 86720 42269 226678 229023 53327 811789 350790 352250 99026
16102C73543j31048r9710P6624k906I9011P31004B39521b209q505B01328a818
16090A61650J94489A45156J02105Q4379n862l7728J8807j01979J69611F9332L9393
16079A08725h841D16718b5680F5269I96L01716M4964j04775R73o5416P7480j7053
16067B38885l5848H7922D0247J61104P6914l3530L19385i3441l4240G523K88428
16056B95951a27910G5422C2366J49601D799M1463J04438K22262r6376H0296J50553
16045B30849K0871P0801b3973B31713D8552N5336L1328Q2159q5189J2025K32563
16034C76774A63557j965a31205K120I1031K07575O4969a1296A21797l6869J09669
16023A94597f7380E67096A33608n9710l0611a73105d1269A00514N314L0400J20
$$ plain form
16102 373543 242495 142785 219409 216503 99011 830015 239521 -2209 -10714 201328 -1818
16090 161650 356139 145156 247261 331640 325778 288050 306857 204878 374489 69332 108725
16079 108725 -8841 416718 -25680 65269 996 302712 347676 242901 243874 178458 255938 238885
16067 238885 203037 87922 40247 201351 278265 244735 564120 -93441 -127681 7523 295951
16056 295951 -127910 75422 32366 181967 4799 46262 150700 372962 276586 80296 230849
16045 230849 251720 322521 -23973 231713 48552 103888 135216 217375 132186 144211 376774
16034 376774 163557 161592 -131205 -129085 91031 298606 363575 -11296 121797 84928 194597
16023 194597 -67380 567096 133608 73898 43287 -173105 -41269 100514 105828 136228 136348
16012A36348K84726H1743Q2687K74695j84225k7824N9029J28045B00044Q5603
16002B85647a43447F02942j58199G7318M24593G6712K32216H3056L69424I2039
15991A46528L3292J07605J39041j26702L18717J65891k70904q0644G3082M71295
15981E44377A72864K9400O3482q6744M17376H6357J38238m7681g8462B58902L5869
15970B94771j38938Q9076C2401K34160D0119A7869K10223f2457K7155A62867h9966
15958B14647A02585a49634A10834F136K6144L1449e2160B04699A9421f9429H033
15946G640R6272D2403a6634C9598e59B24106F831K51825G4031J2982P9644M244
15934A70901l6967K1144a7542B61903c15449D56504b18403C59099j64689a3652
$$ plain form
16012 136348 421074 81743 164430 439125 254900 227076 286105 414150 200044 285647
16002 285647 -143447 602942 444743 77318 501911 76712 308928 83056 452480 92039
15991 146528 179820 287425 426466 299764 618481 784372 513468 432824 73082 544377
15981 544377 172864 202264 265746 179002 596378 86357 224595 176914 -78462 258902 294771
15970 294771 155833 244909 32401 266561 40119 17869 228092 -62457 -35302 162867 -89966
15958 214647 102585 -149634 110834 6136 32280 63729 -52160 204699 19421 -69429 8033
15946 7640 103912 42403 -16634 39598 -559 224106 6831 258656 74031 87013 166657 170901
15934 170901 133934 155078 -17542 261903 -315449 456504 -218403 359099 194410 -13652
15923A69587K7255H1253J77867F3793O0996J64607I7375J23708b17850a0701H2638
15911a40581A99769a81867A44552J10509B9269J1223J20612E721a30784L4261
15901i6523d2653C0171b8378j87952f4785C10289j44690C0618J15031a3186J803
15890a1383k13619K5891f8662C11411m0884o3132b75310B7690O9267b17633A7336
15878a2194A33110J22498A0139L17092i8529A48700a59008I8569d4322k9802C70327
15866C3231J3667a30586B32971g8352H9939g5294l08944G8249f8679A75722C1425
15854A00599e97688C3980N8550g7707E8207c0286A27192A2410a27995B31595a69791
15842A62101q611c059G9040a92541C2425f8985F3529f5488A91950g0277B59325
$$ plain form
15923 169587 196842 81253 259120 63793 124789 289396 97375 221083 -217850 -10701 82638
15911 -140581 199769 -181867 144552 255061 29269 40492 161104 5721 -130784 -96523
15901 -96523 -42653 30171 -28378 -216330 -64785 310289 165599 30618 145649 -13186 -11383
15890 -11383 -225002 -199111 -68662 311411 270527 207395 -275310 27690 96957 -217633 17336
15878 -12194 133110 255608 10139 327231 -98529 148700 -159008 98569 -44322 -74124 370327
15866 33231 46898 -130586 232971 -78352 89939 -75294 -384238 78249 -68679 175722 31425
15854 100599 -597688 33980 92530 -77707 58207 -30286 127192 12410 -127995 231595 -169791
15842 162101 153490 -3059 79040 -192541 32425 -68985 63529 -65488 191950 -70277 259325
15830D1213c01933A09394B5997K07367a29161E5148a74381n1161I2175K3217b21147
15818d67996F1211e0265A4492a01219d2029j44397M1146B4M70295A04949P918
15807A12867L61888b60049h2943B4351J30306n1683b34594r3397J1978C08734
15796b09221e3180o2154A2872a55156D4115c8326b923k8654i821D7975b64015
15784G4112J63101m4911B7864N8199e6371A15953b65793g9962G9143J46188j11247
15773A14084R8395a12730L7046E7620L3405C1898j4755L25410D2248i6245B6451
15761D9971J67215b40358h1216E7818c86124a32752p4325A17603C351M9241a55835
15749A13878a34662b0460A88957J04643c2091A00559b9497A14392g6280A78507
$$ plain form
15830 41213 -301933 109394 25997 233364 -129161 55148 -174381 -225542 92175 115392 -221147
15818 -467996 61211 -50265 14492 -101219 -42029 -186426 -145280 24 470319 104949 112867
15807 112867 474755 -260049 -82943 24351 154657 102974 -234594 -327991 -316013 308734
15796 -209221 -53180 -115334 12872 -155156 44115 -38326 -2923 -31577 -9821 47975 -264015
15784 74112 237213 192302 27864 86063 -56371 115953 -265793 -79962 79143 225331 114084
15773 114084 212479 -112730 -75684 57620 91025 31898 17143 342553 42248 -96245 26451
15761 49971 217186 -240358 -81216 57818 -386124 -132752 -207077 117603 3351 52592 -155835
15749 113878 -134662 -20460 188957 293600 -32091 100559 -29497 114392 -76280 178507
15738A61489k4036e31774d4837A31416J20050c7540C01645a18864o3287k09999
15728c92150B5799a09355c179j29699j71767N6831B03087K70428b94872a09454
15717D14181a46418J5022j63949a1540l47300b4710B36989B7061a00785G2050
15706A29572a96822Q1991B73437b14790D773K37695l5537p7840a05991B03573
15695e8603n4136C07364m7093d5576J6618h690k83350B54308e7307R346j02953
15684a50914A42369h9668j12466O6264d2592j52634p5774A97695a64199l50544
15674e14743b8214p4099k9526A70572e6290q1183c4757l51530B29869d56113i4227
15662i3885D32313b41329N9886A14684a80990m5909Q3182c8148C7249e9695j76113
$$ plain form
15738 161489 137453 -531774 -44837 131416 251466 -37540 301645 -118864 -182151 -392150
15728 -392150 25799 -109355 -3179 -132878 -304645 -247814 203087 473515 -294872 -109454
15717 414181 -146418 -131396 -295345 -11540 -358840 -24710 236989 27061 -100785 72050
15706 129572 -196822 -114831 273437 -214790 4773 242468 206931 129091 -105991 203573
15695 -58603 -112739 307364 260271 -45576 -28958 -8690 -292040 254308 -57307 -47961 -150914
15684 -150914 142369 -89668 -202134 -135870 -42592 -195226 -271000 197695 -164199 -514743
15674 -514743 -28214 -102313 -131839 170572 -56290 -137473 -34757 -386287 229869 -456113 -94227
15662 -93885 432313 -241329 -181443 114684 -180990 -226899 -143717 -38148 37249 -59695 -235808
15651b35808e3097D3191A1168a39985q5680K7226d9835A16797J7638b09942p1384
15640b81326i4411A28273m0115g4128a7983P478C10752I7801B8497f5852I0282
15628a00028K5198B7349L723J17563c11278A90443p5431a07876N691C22824F7314
15616A16381h2076k4955q0635C7727d2738A98178a4845j23980A29161a2187H5393
15604b64337I3680J46983G9273K3722m4036a71263I0849J8939b315F0385i816
15592a63939N9301k96A28294c0519k32328e9668A16892g1783j30237g2968J1584
15581f1384l10272J80436j126A48861E6948a57647B34001c1748k14384a11749
15570B18982a23735B34746l6138a97769A2480K3708J6180a4656m5807A31345c58871
$$ plain form
15651 -235808 -53097 43191 11168 -139985 -225665 -198439 -49835 116797 134435 -209942 -281326
15640 -281326 -94411 128273 88158 -74128 -17983 -10505 310752 97801 28497 -65852 90282
15628 -100028 -74830 27349 31072 148635 -311278 190443 115012 -107876 -102185 322824 67314
15616 116381 -82076 -107031 -187666 37727 -42738 198178 -14845 -138825 129161 -12187 85393
15604 -264337 93680 240663 79273 102995 58959 -171263 90849 109788 -2315 60385 -9816
15592 -163939 -104638 -104934 128294 -30519 -262847 -59668 116892 -71783 -202020 -72968 -61384
15581 -61384 -371656 -191220 -192346 148861 56948 -157647 234001 -31748 -246132 -111749
15570 218982 -123735 234746 198608 -197769 12480 36188 52368 -14656 -60463 131345 -358871
15558a12037A14975c46986a27897A86843K2823E5496b66706b0535A98407F5073
15547c40673d3458j75644b8539C13294b4123j4900D34438A38428L25771B7813
15536H8854R8218m5477o8323q727a90927A99554L4064A8509R5725f3882B23357
15524D41002d7619I7374L3889a24654A00864h9392k0811A91405J1655Q1268j31822
15513A52506i5993C17809N9490a79420M5838L0746d8543A28720J64228j21193
15503A71755R6004A26320f8083I8492J19902n2543p4940a57237C38170j17978
15493B20192p8321a751B2039K48580b17924B68495F5370l1492P407J51822a9192
15481G0035J17358b60143A22679J67109F9764J05177L65688F9286J47786e3844
$$ plain form
15558 -112037 114975 -346986 -127897 186843 209666 55496 -266706 -20535 198407 65073
15547 -340673 -43458 -219102 -28539 313294 -24123 -39023 434438 138428 464199 27813
15536 88854 187072 141595 73272 64545 -190927 199554 233618 18509 114234 -63882 223357
15524 441002 -47619 97374 131263 -124654 100864 -89392 -110203 191405 203060 284328 152506
15513 152506 -95993 317809 377299 -179420 -133582 -102836 -48543 128720 292948 171755
15503 171755 267759 126320 -68083 98492 218394 165851 90911 -157237 338170 220192
15493 220192 141871 -1751 22039 270619 -217924 268495 65370 33878 41285 193107 -19192
15481 70035 187393 -260143 122679 289788 69764 174941 540629 69286 217072 -53844
15470a97741n5066A10506j8928J3103c8161j57677A52919m5852L9642K507o1224
15459H7992c11748A51117K99609E5579d1298B30220J33158j57625H1936J55520
15449B37456J4326M4494A01226J58644L35226k30718J30834j34118g9330J6933
15439f2397B23539K58866d89498g0638k19870I0852c9769j14720d6705k50012
15429b96717g4571n9481D01835b6942D3196h4760B5768b24977A24788C519a84450
15417a0871k03958O3637A02399g0940H3882C0026e7085A19351R1461c5186D3459
15405a28286P784b7092q6187B32034H217M7253b07546P5137d8422o9449M5147
15394g2724A83505b14071g2071B28133j06739c1214D3090J96099c24854A78495
$$ plain form
15470 -197741 -252807 110506 91578 104681 -38161 -195838 152919 107067 146709 149216 87992
15459 87992 -311748 151117 450726 55579 -41298 230220 363378 205753 81936 237456
15449 237456 251782 296276 101226 259870 595096 364378 495212 361094 -79330 -62397
15439 -62397 223539 482405 -489498 -70638 -290508 90852 -39769 -154489 -46705 -296717
15429 -296717 -74571 -134052 401835 -26942 43196 -84760 25768 -224977 124788 3519 -184450
15417 -10871 -214829 -151192 102399 -70940 83882 30026 -57085 119351 210812 -35186 43459
15405 -128286 -120502 -27092 -113279 232034 8217 55470 -207546 -132409 -48422 -117871 -72724
15394 -72724 183505 -214071 -72071 228133 121394 -31214 43090 239189 -324854 178495
15383A975K52229j00544F007R1227J49356n4053p7003o918K20102q7270M6026
15372B87474j30232d3209J4690H0152a7643F8250F310f9241H2363M39122B39173
15360E42927i4092B85779A21011n4938L25887A66613r511c8163j60482A91150
15349d1521j6822A43842a5426j61464D91839k26411h5788A79294R6249b66637
15338D79889B05606L10454C3179J65444F7975K16148B0671L90260A59617L2939
15328A92556H0729b0790p8594D51339k25182r3241f8858a8645l6408e075B00309
15316d8648G1370J355R255a9952o6445A47043K88446a35828E30244A56407J19455
15305B75862a06399G5379j3723l057a87120h0760A48551f3177k56548g6600J1047
$$ plain form
15383 1975 254204 153660 6007 97234 246590 192537 115534 108616 328718 241448 287474
15372 287474 157242 -43209 -28519 80152 -17643 68250 6310 -69241 82363 521485 239173
15360 542927 -94092 285779 121011 66073 391960 166613 157102 -38163 -198645 191150
15349 -41521 -58343 143842 -15426 -176890 491839 265428 -85788 179294 275543 -266637
15338 479889 205606 516060 33179 198623 67975 284123 20671 410931 159617 192556
15328 192556 80729 -20790 -99384 451339 226157 132916 -68858 -18645 -55053 -5075 200309
15316 -48648 71370 72725 81980 -19952 -86397 147043 435489 -135828 530244 156407 275862
15305 275862 -106399 75379 61656 58599 -187120 -80760 148551 -63177 -319725 -76600 -65553
15294f5553A8402b0698l41971a47466I5757c65612F1463K6711b26896m0697b6746
15282b8845F2339k6479K0579a43530A49040F254J1107J11042g6941r3476b0266
15270E78009g1745K6436A50107r738K83772j62271J40803j63137q2619a80495
15259G5514L38577a24956d0396C68233j47720K21961J3170F6534K06010k9427
15249B43117N8672K78667j38362L973m671r1404O74176j08010j44858J89610j27292
15238H33618C67043O5699A92676l961h0935A92151b59625A38364J0826a64742
15227a16237B01322a81762A17870j5104d8301G5975K23987a05788A29145N9519
15217A88664c9238C05267A32366l8683J28294a50099f6231J5948K876A34960J15201
$$ plain form
15294 -65553 18402 -20698 -362669 -147466 95757 -365612 61463 88174 -226896 -267593 -26746
15282 -28845 62339 35860 56439 -143530 149040 6254 17361 128403 -76941 -170417 -20266
15270 578009 -71745 -45309 150107 140369 424141 261870 402673 239536 156917 -180495
15259 75514 414091 -124956 -40396 368233 220513 442474 455644 66534 272544 243117
15249 243117 301789 580456 442094 446067 441396 349992 1024168 916158 771300 960910 833618
15238 833618 367043 432742 192676 188715 -80935 192151 -259625 138364 149190 -164742
15227 -116237 201322 -181762 117870 102766 -48301 75975 299962 -105788 129145 188664
15217 188664 -39238 305267 132366 93683 221977 -150099 -66231 -50283 -47407 134960 250161
15206B50161q5843A4131b3042F5888J78847p9517l1541a59036h258j44926A51072
15194c00267B30724j04637O5980r4377d891A08732A756c6585k70120D0081c3545
15182g317A083a71040j4962C47085B9852K05881b51236A48834A9249a30671A50368
15170A56208c8612B13164J12054a7442C60815f0787A83681h5750B65736j00698
15160A65038m4455i3687B7087a30390A11397k8305K43903A30505J90060e3588
15149C28079g6691A67234J2271m7278l9195a96144B23624L8528N8490J53996C3918
15137a49872q7145h0208B7488K31715p9937M5122m0250n6857i5173A25568J98124
15126C23692A28761K25330r9441R2604j60820f8088A2997J64011L1640H6682d55
$$ plain form
15206 250161 164318 14131 -23042 65888 244735 165218 133677 -159036 -8258 -153184 151072
15194 -300267 230724 126087 192067 97690 -4891 108732 1756 -36585 -306705 40081 -33545
15182 -7317 1083 -171040 -186002 347085 29852 235733 -251236 148834 19249 -130671 150368
15170 156208 -38612 213164 325218 -17442 360815 -60787 183681 -85750 265736 165038
15160 165038 120583 -93687 27087 -130390 111397 83092 326995 130505 320565 -53588
15149 328079 -76691 167234 179505 132227 93032 -196144 223624 262152 320642 474638 33918
15137 -149872 -237017 -80208 27488 259203 179266 224388 184138 127281 -95173 125568 323692
15126 323692 128761 354091 254650 347254 186434 -68088 12997 177008 208648 86682 -455
15114B7523A3270M02730A93023g680A38936J15949b94600a25667F61i3473B13685
15102B01799B7786J2019c45313a33215C7978N09295I8892M0891c6324F22048A86714
15090B34193E8092N3942J44874j04789Q1125A15579a16419H5541C3015J47510
15080A80525J20593o2824k5351d2550A61587P036r384h2478F828K00587a23386
15068C28977j06135J35563j61068J32675J93266k13589a06912I6541J00923Q8008
15058B85472q8465K45904k20386L23760k41760N6498E1568M41363J5703n7127
15048D51507B08659K77407A79476K77344b5483A70938l7348Q2353P5442K33571
15038E24956p4242o4812j63531R9371n1501M78936k69859j26945n8898J95936
$$ plain form
15114 27523 13270 416000 193023 -7680 138936 254885 -294600 -125667 661 -93473 213685
15102 201799 27786 39805 -345313 -133215 37978 547273 98892 139783 -36324 622048 186714
15090 234193 58092 112034 256908 152119 233244 115579 -116419 85541 33015 180525
15080 180525 301118 238294 212943 -42550 161587 168623 159239 -82478 6828 207415 -123386
15068 328977 222842 358405 197337 330012 523278 309689 -106912 96541 197464 285472
15058 285472 197007 442911 222525 546285 304525 361023 51568 492931 508634 451507
15048 451507 208659 486066 179476 456820 -25483 170938 133590 215943 291385 524956
15038 524956 450714 385902 222371 321742 270241 749177 479318 352373 293475 489411
15028D89411J09440N5237K05816C58389J64936j34129K1953I8058L19225A81941
15017I2118J2415M30063k48428K89797k53163K03326k14568J48562j25396k4131
15007C10595J75688G3848J31639M45100k76355I80K89032K11095k30963L60020
14997F30164j84292k04533K51560E4390N09574B23252M38614k12164J58294k23128
14987C84868L15727B61970K85959r5062K0831J67143r7141o6025M1044O2390j67828
14976D13281J93048B85483J41942m8205Q3627k07135L35677R428j04499m6908
14966D49410A84311J66802M2295k7226L66642C20597L937J30434J95082k66160
14956C83890K92810j06420L9203J84389p9181k74313M44427D32672K10623k75005
$$ plain form
15028 489411 598851 654088 859904 358389 523325 389196 411149 98058 417283 181941
15017 92118 104533 534596 286168 575965 322802 526128 311560 460122 334726 310595
15007 310595 486283 73848 205487 650587 374232 980 290012 501107 270144 630164
14997 630164 445872 241339 492899 54390 563964 223252 661866 449702 607996 384868
14987 384868 700595 261970 547929 452867 473698 640841 543700 477675 518719 581109 413281
14976 413281 606329 285483 427425 379220 462847 255712 591389 600817 496318 449410
14966 449410 184311 351113 393408 366182 732824 320597 324534 454968 650050 383890
14956 383890 676700 570280 609483 793872 714691 440378 884805 432672 643295 368290
14946C68290k5950J72041k10219O22026L5237m5460C74792K04048K12147J35155
14936I26142n6838M3813j25570M665J27684L18306l91671P06970j70240j0578
14926A372683K56474n10931J11731J14198l22825K1027K17868j01694K89577m4398
14916A403710m06465O6137k20497j35246j86928r0710k09144M13000j24806A28787
14905B66227J7429M08604l11295K31289N7757j64336o4781J79653r1439n4635
14895D74473J72593k10899L55630j10473C03347l3743L11101L9538K25663l50382
14885D95524R6942K13173l04552K14399k52635j35376M2118L88044r2504J5427
14875F80560k98116P5048J19657r4912K38612B98882K26640P9498J89059A55138
$$ plain form
14946 368290 342340 514381 304162 926188 961425 915965 374792 578840 790987 926142
14936 926142 869304 913117 787547 792212 919896 1238202 846531 1553501 1383261 1372683
14926 1372683 1629157 1118226 1229957 1344155 1021330 1042357 1260225 1158531 1448108 1403710
14916 1403710 997245 1063382 842885 707639 520711 430001 220857 633857 509051 128787
14905 266227 283656 692260 380965 612254 670011 505675 440894 620547 529108 474473
14895 474473 647066 436167 791797 681324 303347 269604 580705 620243 845906 495524
14885 495524 592466 805639 501087 715486 462851 327475 369593 757637 665133 680560
14875 680560 382444 457492 577149 482237 720849 298882 525522 605020 794079 155138
14864F25353q3012j20155J99777j68976K133l6509K8162B17944K04179j59127
14854B62996L91072k19795O9143R0582r5945J07463J72783j17656n1724J37192
14844G46111P4888J18554j10391J11792k45120o1977J00332K0461k7495l46455
14834C80700L61553J71066j21569k77455K11572k50186B33360M46178k26856K20134
14824F72816j76706J93408m1208B69123J58964J40075j35642N7331K85276j93590
14814E81537J10281j09496J53125j69228m1595K46114j58742M7184K21633C93100
14803H79027m02205K48963j27408J06521C47772K09112J22229q8478J79139j68371
14793F01403n2032j26932L63615l63306J00671J22844K06610l75253j66655M88935
$$ plain form
14864 625353 542341 422186 621963 452987 455120 418611 446773 217944 422123 262996
14854 262996 654068 434273 503416 593998 498053 605516 778299 660643 608919 746111
14844 746111 820999 939553 829162 940954 695834 633857 734189 754650 727155 380700
14834 380700 742253 913319 791750 514295 725867 475681 233360 679538 452682 672816
14824 672816 496110 689518 648310 269123 428087 568162 432520 489851 775127 581537
14814 581537 691818 582322 735447 566219 524624 770738 611996 659180 880813 393100
14803 879027 476822 725785 598377 704898 347772 556884 679113 590635 769774 601403
14793 601403 549371 422439 786054 422748 523419 646263 852873 477620 310965 799900
14783G99900m4954k59097M45380k24190k36340K15115L5090B64534M13717L2409
14773G10660R5917O3679j52314r0040J9313J38999j69397N6512J9064j58072K96008
14762H30329k23553K34944k30473J31960N2496m089L8329l12432L12726N2122
14752H82359R9076j44270j29745J09564k07783R3050M178j56907L77012Q0380
14742A006914j10699j71348j46210M43366j96399O6511j99116M28874k44954M56642
14732A333581m76103K78912K36820q8312k6160j30239j35089J90530m63926M46736
14722A166750l13264J7915K15081l69937q3206J51736O3764K92651k78288K72440
14712A135642L18871k28141k45964L58742k45744K32578j28510k82770L18134
$$ plain form
14783 799900 754946 495849 941229 717039 480699 695814 730904 264534 678251 710660
14773 710660 806577 870256 717942 627902 647215 786214 616817 673329 692393 534321 830329
14762 830329 606776 841720 611247 743207 795703 791614 829943 517511 830237 882359
14752 882359 981435 837165 707420 816984 609201 702251 706429 549522 926534 1006914
14742 1006914 896215 724867 578657 1022023 825624 892135 693019 1121893 876939 1333581
14732 1333581 857478 1136390 1373210 1284898 1258738 1128499 993410 1183940 720014 1166750
14722 1166750 853486 871401 1086482 716545 633339 785075 848839 1141490 863202 1135642
14712 1135642 1454513 1226372 980408 1339150 1093406 1325984 1197474 914704 1232838
14703A232838J03518j48237j86100K1392K2044E00026N91609l71787K23761j68853
14693G74756J02215J248l8255k69652L83954j82704J95874Q0146l88414J15181
14683G74349j31579L63717Q103K45656j79807L4460J9117o013r3818J83007m74725
14672G42467M70019l35394N86160l37355j4286L02641m24916O1833K06054k05004
14662A052219j58706L68128k58299j99239l426L87683j178k5114M09424n61650
14652A009842J31469p1822j19173J53513J28988l14097M5469M01893j58654O9174
14642A276602R9958r9869l7650Q445P8008j88533J5507o7194j27227J44215J13741
14631A216003J25377n9579K9114J58020Q0195j6280K40848l46521l8738J89934
$$ plain form
14703 1232838 1336356 1188119 1002019 1023411 1045455 500026 1091635 719848 943609 774756
14693 774756 876971 878219 839964 570312 954266 771562 967436 1047582 659168 774349
14683 774349 642770 1006487 1014590 1260246 1080439 1114899 1134016 1128003 1034185 1217192 742467
14672 742467 1212486 877092 1463252 1125897 1111611 1414252 989336 1051169 1257223 1052219
14662 1052219 893513 1261641 1003342 804103 800677 1188360 1187182 1162068 1571492 1009842
14652 1009842 1141311 1069489 950316 1103829 1232817 918720 964189 1366082 1207428 1276602
14642 1276602 1376560 1276691 1239041 1247486 1325494 1136961 1152468 1085274 958047 1102262 1216003
14631 1216003 1341380 1281801 1310915 1468935 1549130 1532850 1773698 1427177 1388439 1578373
14621A578373J72763k58723k84353K95812j95692j60257M80863j21181J15136
14612A622741K1938q1759J35472j14294R3651K56773P0530r3548k95252J960J31739
14601A749951J90432K23266n74812L60643L17585k32474p7251K41917l66819O19556
14591B451994l32624l72309K70419N00213P6960j33210N5974l2706m0331K46898
14581B691278j97650J28543L80859j68915M0752m80374Q10528j32351j49980K40578
14571C163268L9513j28961O45744m34675L48394p2584K97981K09051N7809J9116
14561D144656M03202J28836o0548P77800L61598M7729L61922N64330O91403J53381
14551G574309O61882O52086J529751J512629J693649J702702j563200n049038
$$ plain form
14621 1578373 1751136 1492413 1208060 1503872 1308180 1147923 1628786 1507605 1622741
14612 1622741 1644679 1562920 1698392 1584098 1677749 1934522 2005052 1911504 1616252 1618212 1749951
14601 1749951 1940383 2163649 1588837 1949480 2267065 2034591 1957340 2199257 1832438 2451994
14591 2451994 2119370 1747061 2017480 2517693 2594653 2461443 2517417 2484711 2444380 2691278
14581 2691278 2493628 2622171 3003030 2834115 2874867 2394493 3205021 3072670 2922690 3163268
14571 3163268 3202781 3073820 3719564 3284889 3633283 3560699 3858680 4067731 4125540 4144656
14561 4144656 4547858 4676694 4616146 5393946 5755544 5803273 6165195 6729525 7420928 7574309
14551 7574309 8236191 8888277 10418028 11930657 13624306 15327008 13763808 8714770
14543H714770l638670j826387o36826J64594k7368J77445J63903k44409j86433
14534B660619k10759j1830j23368k08831K78085j23623J06595l073J62866n9604
14524B467077J95533j55953M9546J37646k92919O15586Q0066n91807L97708J5897
14514B918380j06442L0122K83286j97295j30709J18259M43373R2931k62489j35980
14504C053436K45578J42127L4752j09267J60747j04203J49243j64691M1241J47864
14494C596827p270J63474R6556j74938K54535J9033j88081M55267j38694Q3112
14484D159821J8860J28125k01318N21730l12722J39508J4148L04044r3399J77565
14474D856362P5704l9327j36368J98951j45967K75820j02485J73664j25929L91068
$$ plain form
14543 8714770 5076100 3249713 2612887 2777481 2750113 2927558 3091461 2847052 2660619
14534 2660619 2449860 2438030 2314662 2105831 2383916 2260293 2366888 2363815 2526681 2467077
14524 2467077 2662610 2506657 2556203 2693849 2400930 3016516 3096582 2504775 2902483 2918380
14514 2918380 2811938 2842060 3125346 2928051 2797342 2915601 3358974 3451905 3189416 3053436
14504 3053436 3299014 3441141 3475893 3366626 3527373 3423170 3572413 3407722 3448963 3596827
14494 3596827 3589557 3753031 3849587 3674649 3929184 3948217 3760136 4215403 4076709 4159821
14484 4159821 4178681 4306806 4105488 4627218 4314496 4454004 4468152 4772196 4678797 4856362
14474 4856362 4932066 4892739 4756371 4955322 4809355 5085175 4982690 5156354 5030425 5421493
14464E421493l65943M44955k7448J04002L80125l80269K70239K53391K04348n77432
14454E727461M22140K82835k34959K83424m3154M46305l57017K30571Q3964N6132
14444F897702P6013K22314K05281J35219L13167k26117L42528M6707r3076J62540
14434H082278M11523l45827K51886J17943L88143j38285M96853m5187M53509K9121
14424I701957k1965J38798M47134j40122K13694L51386J83791L1590J55789L54844
14414A1416896k266J84433p6643L92957n5000Q10382r4671L90088j02925L98922
14404A3262173Q9893N06939K14500J04891M15129K91605K18338L34305N54110
14395A5991883L43874L52357J56574L63373J73930N26649J01146Q26038J53247
$$ plain form
14464 5421493 5055550 5500505 5473057 5577059 5957184 5576915 5847154 6100545 6304893 5727461
14454 5727461 6149601 6432436 6197477 6480901 6437747 6884052 6527035 6757606 6841570 6897702
14444 6897702 6973715 7196029 7401310 7536529 7849696 7623579 7966107 8012814 7919738 8082278
14434 8082278 8493801 8147974 8399860 8517803 8905946 8767661 9264514 9219327 9672836 9701957
14424 9701957 9679992 9818790 10265924 10125802 10339496 10690882 10874673 10906263 11062052 11416896
14414 11416896 11414630 11599063 11522420 11915377 11860377 12670759 12576088 12966176 12863251 13262173
14404 13262173 13352066 13859005 14073505 14178396 14593525 14885130 15103468 15437773 15991883
14395 15991883 16335757 16688114 16844688 17208061 17381991 17908640 18009786 18835824 18989071
14386A8989071L20539Q87496N7837M97012O74322M75472K91706K20526M95566
14377B2909547M87535P68697N92791L18153Q03478N90621L53958O00148J024300
14368B8449228N81100N73353P17102P57585Q64303N45667J425129O18202P97370
14359C5329039O98740J147811Q43218Q87814Q59047J074909J361900Q93373J316282
14350D4412133J381383J217388J285099R40885J546411J288974J891517J476756
14342E5440546J964635J421789J997693J620524J927869K291622J836528K067357
14334G0568563K434389J991078L065233J974999K603096K535965L226498K995424
14326I1395245L296801L419467K918002L183535L016851L252910L819113L638053
$$ plain form
14386 18989071 19309610 20197106 20254943 20751955 21426277 21901749 22193455 22413981 22909547
14377 22909547 23397082 24165779 24758570 25076723 25880201 26470822 26824780 27424928 28449228
14368 28449228 29030328 29603681 30320783 31078368 31942671 32488338 33913467 34531669 35329039
14359 35329039 36027779 37175590 38018808 38906622 39765669 40840578 42202478 43095851 44412133
14350 44412133 45793516 47010904 48296003 49236888 50783299 52072273 53963790 55440546
14342 55440546 57405181 58826970 60824663 62445187 64373056 66664678 68501206 70568563
14334 70568563 73002952 74994030 78059263 80034262 82637358 85173323 88399821 91395245
14326 91395245 94692046 98111513 101029515 104213050 107229901 110482811 114301924 117939977
14318A17939977L182566M147274L610220L723197M114817L906685M298136M703216
14310A49626088N094094L056660L904520M502675L903671M158642M930916K963929
14302A82141195K949072M873224M711717L304000N173940N479786M925172N409510
14294B18967616M774990N201391M894415O376460N734396L738523M486552O811801
14286B60986144O229886Q891626R714790J0183790R083932P133470K860785N422170
14278C20506593P576630P607553K827338M726717R781172J2184589J4728544R581832
14270C89520968Q412013O245859M125988l219419k028176j2294737j8728707j9857065
14262C52176724j9772999j9074472j8135844j7134006j6246053j5095981j4356737
$$ plain form
14318 117939977 121122543 125269817 128880037 132603234 136718051 140624736 144922872 149626088
14310 149626088 154720182 157776842 161681362 166184037 170087708 174246350 179177266 182141195
14302 182141195 185090267 189963491 194675208 197979208 203153148 208632934 213558106 218967616
14294 218967616 223742606 228943997 233838412 240214872 245949268 249687791 254174343 260986144
14286 260986144 267216030 276107656 285822446 296006236 305090168 312223638 315084423 320506593
14278 320506593 328083223 335690776 338518114 343244831 353026003 365210592 379939136 389520968
14270 389520968 397932981 404178840 408304828 405085409 403057233 390762496 372033789 352176724
14262 352176724 332403725 313329253 295193409 278059403 261813350 246717369 232360632
14255B32360632j3215513j2301735j1891383j0416625r999295r175986q751668
14248A56608427p596388p533501p022879o663903n932108o016042n432899m934496
14240A05476211m759045m282352m122086m110072l307295l507299l604857k887567
14232G4895638k767689k546587k823782k264739k568139k148268j920862k055293
14224E5800279k109328j760716j518962j855545j420365j404113j402744j588138
14216D2740368r26522j294877r56427j483345q63177j216082n08771j444824p44580
14207C3301763p91162o84536j032410j121738l42895q65776p34250o84898p01864
14198B6342234k82167p34458r23722k47641o65162o19828l59832n03915o70899
$$ plain form
14255 232360632 219145119 206843384 194952001 184535376 174536081 165360095 156608427
14248 156608427 149012039 141478538 134455659 127791756 121859648 115843606 110410707 105476211
14240 105476211 100717166 96434814 92312728 88202656 84895361 81388062 77783205 74895638
14232 74895638 72127949 69581362 66757580 64492841 61924702 59776434 57855572 55800279
14224 55800279 53690951 51930235 50411273 48555728 47135363 45731250 44328506 42740368
14216 42740368 41813846 40518969 39562542 38079197 37216020 35999938 35491167 34046343 33301763
14207 33301763 32510601 31826065 30793655 29671917 29329022 28463246 27728996 27044098 26342234
14198 26342234 26060067 25325609 24401887 24154246 23489084 22869256 22509424 22005509 21334610
14189B1334610m40199n52773n83555q3571o36212l75797k62417j71570p89930
14180A7438586k18299l34956l25824l51811l08474l08683l68452q9812m07551
14171A4724724l22143L7656k17348l87114k89364p2811n40991n7160r0365k38496
14161A2546588o22836J21264m82375k21748K63251k82943j47056n13611K30858
14152A0891392k08744l21650m99237L16284j12737l63579J03482l29460m5250
14143I430501k02889R3917j50008l04266j33016m0604n8888l52994l08907J03717
14133H076563p31390O41504J26721j57066n29040R3590j00994l51605Q2639p8531
14123G072391J65557n83465M20412m34369l4037o1586P5227O7338l89643N26977
$$ plain form
14189 21334610 20894411 20341638 19758083 19674512 19038300 18662503 18400086 18228516 17438586
14180 17438586 17220287 16885331 16559507 16207696 15899222 15590539 15222087 15132275 14724724
14171 14724724 14402581 14440237 14222889 13835775 13546411 13473600 12932609 12875449 12785084 12546588
14161 12546588 11923752 12045016 11562641 11340893 11604144 11321201 11174145 10660534 10891392
14152 10891392 10682648 10360998 9861761 10178045 10065308 9701729 9805211 9475751 9430501
14143 9430501 9227612 9321529 9171521 8867255 8734239 8693635 8634747 8281753 7972846 8076563
14133 8076563 7345173 7986677 8113398 7956332 7427292 7520882 7419888 7068283 7150922 7072391
14123 7072391 7237948 6654483 7074895 6640526 6606489 6544903 6620130 6687468 6297825 6824802
14113F824802n29985r6028K61174n20855k08746L8988r8643K98756m13979j50570
14103E404914L81244l60492j40537J56151j99398r3416j74842K68625k01507m1338
14093D999404m6840j66337K01112j0147l35110J07928k44836j61138J61380j84466
14083D320950l3272M03768l65623q1728M4047j85184k01193K21138p8398L92795
14073D437300p78389N93607l27018o4263l3397L29576l11220J37970j73453K92756
14063D103469m98208J0879Q0234L957j95155O8631j21330J57978k45936J21355
14053C485874K01889j44279k50895K8013J61178k86530K32618k65365M3785p2878
14043C133410j07229r683J79882q0132O5540M3828r6391r1966R0941k44951K31534
$$ plain form
14113 6824802 6294817 6198789 6459963 5939108 5730362 5769350 5670707 5969463 5555484 5404914
14103 5404914 5786158 5425666 5285129 5441280 5241882 5148466 4973624 5242249 5040742 4999404
14093 4999404 4952564 4786227 4987339 4977192 4642082 4750010 4505174 4344036 4505416 4320950
14083 4320950 4287678 4691446 4325823 4244095 4288142 4102958 3901765 4122903 4044505 4437300
14073 4437300 3658911 4252518 3925500 3861237 3827840 4157416 3846196 3984166 3810713 4103469
14063 4103469 3605261 3616140 3696374 3700331 3505176 3573807 3452477 3610455 3364519 3485874
14053 3485874 3687763 3543484 3292589 3320602 3481780 3195250 3427868 3162503 3206288 3133410
14043 3133410 3026181 3016498 3196380 3116248 3181788 3225616 3129225 3037259 3128200 2883249 3114783
14032C114783K95229l42634K25651m5766j50827Q9478m8305R3082l5512k72335
14022B922844K95753l90816M37382p6940l26242P2377K57281J86113p1583j84720
14012C121449N9563r563K76516j68775J80720k62373K29256K5026O2246Q2113
14002C596178j40152K23355j72869O69759M51635K27476k3759M23077N6570R29448
13992F240718K32809N90570M54460J098929J817808J797507K366731Q13847m169043
13983A1244336l749956k647442j075507n92232l65505l7452j39374j20607l52818
13974B163443K0613L36691l98127J21387J0372q6361j29310k72748L28685k38499
13964A856146m6575L6637J92712J53043m66996K22160J1798l75211K65615j73880
$$ plain form
14032 3114783 3410012 3067378 3293029 3247263 3096436 3185914 3137609 3230691 3195179 2922844
14022 2922844 3218597 2827781 3265163 3188223 2861981 2934358 3191639 3377752 3306169 3121449
14012 3121449 3181012 3171449 3447965 3279190 3459910 3197537 3426793 3451819 3514065 3596178
14002 3596178 3456026 3679381 3506512 4176271 4627906 4855382 4831623 5254700 5311270 6240718
13992 6240718 6473527 7064097 7518557 8617486 10435294 12232801 14599532 15413379 11244336
13983 11244336 7494380 4846938 3771431 3179199 2813694 2776242 2636868 2516261 2163443
13974 2163443 2184056 2520747 2122620 2244007 2254379 2168018 2038708 1765960 2094645 1856146
13964 1856146 1809571 1846208 2038920 2191963 1724967 1947127 1958925 1583714 1849329 1675449
13954A675449L77656j72636L02691k96157j59535J83589j41574j25393k46467
13945A397623M05724L0520k70420J37522M4167k38316M71550j55062l4525k54954
13935A533829k90423K11709m935J12239k05515K44516j11654K89368k71180o809
13925A501145J14081j52294K3859o0314K59381l10825M8603Q6221o7369n4890
13915A387598l2825M5574o7994J09354j59863p0008j5776K10230m3278K8600k29604
13904A162008K47797k85720J20911J36901j6586k41593J86408q2949J25164n2733
13894A299608O3620J99025k87653q4009P4233j74716J99840l3711K9715l65636
13884I20316K10646Q5216k50271J06731l08196L21292J91187j9494m05200P1814
$$ plain form
13954 1675449 2053105 1880469 2183160 1887003 1727468 1911057 1769483 1644090 1397623
13945 1397623 1803347 1833867 1563447 1700969 1745136 1506820 1978370 1823308 1788783 1533829
13935 1533829 1243406 1455115 1450180 1562419 1356904 1601420 1489766 1779134 1507954 1501145
13925 1501145 1615226 1462932 1486791 1426477 1685858 1375033 1423636 1509857 1442488 1387598
13915 1387598 1354773 1400347 1332353 1441707 1281844 1211836 1196060 1406290 1363012 1391612 1162008
13904 1162008 1409805 1124085 1244996 1381897 1365311 1123718 1310126 1227177 1352341 1299608
13894 1299608 1363228 1562253 1274600 1190591 1264824 1090108 1289948 1256237 1285952 920316
13884 920316 1130962 1216178 965907 1072638 764442 1085734 1276921 1257427 852227 924041
13874I24041l6200k24554L75791O6337Q3519n22559Q12279l69015k12125J64734
13864A062248J03806J94677m92240Q4115j29038J77176K30079j76790k95585O43419
13854A401867n51241L88257l54803J64955l15762L74254K11306E92030M66274
13845A058304j06907j87473K74490j60669K23942k26593L72030P9464n15844j66176
13835F44568k2484K45209j3254j33692K79239l1175l66856J01712L6694r019R0210
13824H21152k4727J28865j41001L63344l30116J00501r7682J74614p6072j47449
13814G71429k14278K15784K47145j16794k19116K01471P6581p5421P5128l38677
13804F23252M6515K06386n1322j66159n9441j31441L43697k58396K90372C92506
$$ plain form
13874 924041 887841 663287 1039078 1105415 1188934 666375 1478654 1109639 897514 1062248
13864 1062248 1166054 1360731 868491 952606 823568 1000744 1230823 1054033 758448 1401867
13854 1401867 850626 1238883 884080 1049035 733273 1107527 1318833 592030 1058304
13845 1058304 951397 763924 1038414 877745 1101687 875094 1247124 1326588 810744 644568
13835 644568 622084 867293 854039 720347 999586 968411 601555 703267 739961 730942 821152
13824 821152 796425 925290 784289 1147633 817517 918018 820336 994950 918878 771429
13814 771429 557151 772935 1020080 903286 684170 885641 962222 886801 961929 623252
13804 623252 669767 876153 824831 658672 599231 467790 811487 553091 843463 392506
13793I64262l82084K8353r9549j48810M33744J56269k77218L5449J37416j45251
13783G02581J99277j97399K41750k57186q3938q6788L20941j05069l4501j78209
13773E21459j23756J58407O8143j8964N8822N1020j58965J57506o1580K67066
13763I19158j38566R7362m24754L60693l76933J32451M31388l31462q8944q7734
13753D92659j30270N41450j22012j46356r0529n5049J18572K01720l5196n8797
13743G16192j16574J58330B89530M99020k80485J46863o8013k60945J05316o9725
13733C61561J05609B19942K40640J11705j29660j25780M64642l32499J16185K1008
13723E86183k989j5379J20983k20661P7313j85322L40616K22508l96791K29621
$$ plain form
13793 964262 582178 610531 510982 362172 795916 952185 674967 710416 847832 702581
13783 702581 901858 704459 946209 689023 605085 518297 839238 734169 699668 521459
13773 521459 397703 556110 624253 605289 664111 715131 556166 713672 652092 919158
13763 919158 780592 877954 453200 813893 436960 569411 1000799 669337 580393 492659
13753 492659 362389 903839 781827 635471 544942 489893 608465 810185 774989 716192
13743 716192 599618 757948 289530 788550 508065 654928 586915 325970 431286 361561
13733 361561 467170 219942 460582 572287 442627 316847 781489 448990 565175 586183
13723 586183 583194 567815 688798 468137 545450 360128 700744 923252 526461 756082
13713G56082k00906J16679j7126j37361k35100K20804J08300k60178M25526r7681
13703F79039l21946r6015L15457j68518J7431J1425L09815B02409K35832P639
13693D45880J8535j60138K63910J22153k6959j19252M94649m45092A95471Q2977
13683B78448J2981K78049k33555K00025J90106j17416B33255L66442j28255J24283
13673E95725J72020C19806J0136J53626j48441k3751L46848J06283M9436C60976
13662C93705J56857J0278j05448l090j1346J19106k17681m0792P0196J4724j39497
13651B47012K1829D5639N08845B56441K77241k08431p0855P6624M7813K93626
13641F72459C23933l0168O386H2627L08595m6594J49441N2255j02849l7840R0405
$$ plain form
13713 756082 555176 671855 654729 517368 282268 503072 611372 351194 776720 679039
13703 679039 357093 261078 576535 408017 425448 436873 746688 202409 438241 445880
13693 445880 464415 304277 568187 690340 663381 544129 1038778 593686 195471 278448
13683 278448 291429 569478 335923 535948 726054 608638 233255 599697 471442 595725
13673 595725 767745 319806 329942 483568 335127 311376 658224 764507 813943 360976
13662 393705 550562 560840 455392 452302 440956 560062 342381 301589 371785 386509 247012
13651 247012 268841 45639 554484 256441 533682 325251 254396 331020 378833 672459
13641 672459 323933 293765 300151 82627 391222 344628 494069 546324 443475 405635 496040
13630D96040A02629L23225O2094J02494M179K305k05964A24607L30366A8422N33311
13619E51733A85521K21535R5766j22924A56134K85594N1859k13734K72516A87468
13608C93202L6771n2640P0478N9064J33127j35614A98717M9036k2322J95807R9961
13597E21199B28378J76789B0646M02356K58273k40908q8531j35514J40504j20156
13587B36670N729n274J53340J82750k02135j77255M15431j80423p9018J9522A76474
13575I0747L66481q2370j72497J36549j54783L37324B29776J02661F5428P5424
13565A40852J54736L5218j498o1667J74371r2612j71837L50409q1236A34477K88609
13554D23086A470L12766k030K03618j96701J27852j53181P1036n9210L3375p5429
$$ plain form
13630 496040 102629 425854 487948 590442 594621 596926 390962 124607 454973 18422 551733
13619 551733 185521 407056 502822 379898 156134 441728 493587 279853 552369 187468
13608 393202 429973 377333 447811 506875 640002 504388 198717 247753 225431 421238 521199
13597 521199 228378 405167 20646 423002 681275 440367 351836 216322 356826 236670
13587 236670 242399 237125 390465 573215 371080 193825 609256 428833 349815 369337 176474
13575 90747 457228 374858 202361 338910 184127 521451 229776 332437 65428 140852
13565 140852 295588 330806 329308 267641 442012 349400 177563 527972 446736 134477 423086
13554 423086 1470 314236 312206 515824 319123 446975 293794 364830 305620 338995 263566
13543B63566P5064K14775k34504P5076J28856F176K24055K55346j37942M2228
13533C89863B9867L32774j13721P5149q5242q2952F5610M46205j11224N0175A73021
13521B79148A23752c5601B18449O3239k7268J25239a14670C39696j09548J83905
13511D14053A74729J57645K32659A86121O4473L1897B3624L23261Q4478A00514
13500B11809J29744J18185A21814K4053L83589k40962n7969J11570A53386p1548
13490H1838J50531q5932K07613P7466A29444N5666H5501K17510r162m8739R9002
13479C44112k9298j3465A42264C7256J15472J25617N5890K4518F208c5835A08388
13467C67378j15933O6315j12949K28127A63961Q0197R0266A53438l8953K54659
$$ plain form
13543 263566 338630 553405 318901 393977 522833 6176 230231 485577 347635 389863
13533 389863 29867 362641 248920 324069 238827 155875 65610 511815 400591 450766 173021
13521 279148 123752 -35601 218449 281688 254420 379659 -114670 339696 230148 414053
13511 414053 174729 332374 565033 186121 250594 282491 23624 346885 431363 100514
13500 211809 341553 459738 121814 145867 529456 288494 230525 342095 153386 81838
13490 81838 232369 146437 354050 431516 129444 185110 85501 303011 293849 245110 344112
13479 344112 314814 301349 142264 37256 152728 278345 334235 358753 6208 -35835 108388
13467 367378 251445 317760 204811 432938 163961 244158 334424 153438 114485 369144
13457C69144A54359G3968K58207d1459A23878J49631A10831k1342K30008r7059
13447B22438J47135a56762b1054A2198a30612i845B70345I8389G419L40955P2156
13436D20530j29967A42889J31348A6490J73881a10414A95188M00I6656M20017
13426E16673j47194j70753P6172A16915N8452m6105J87121j58144K22267j29309
13416B51197o8056J9533J62648A27849i6623A66534l6829Q116K14905F3099J59547
13405B22646d0351j79855O8635C566K49138j13758o1197K37606P424q1531J57393
13394C98641j33517J10808A08006J46412l2446c07444a31633C32539J4238p537
13384C39240j50436J6483a73232H6185h0081D14809j10383A06580P5865K21806
$$ plain form
13457 369144 154359 73968 332175 -41459 123878 273509 110831 89489 319497 222438
13447 222438 369573 -156762 -21054 12198 -130612 -9845 270345 98389 7419 348374 420530
13436 420530 290563 142889 274237 16490 190371 -110414 195188 195588 96656 516673
13426 516673 369479 198726 274898 116915 175367 129262 316383 158239 380506 251197
13416 251197 183141 202674 365322 127849 -96623 166534 129705 137821 352726 63099 222646
13405 222646 -40351 -220206 -151571 3566 252704 138946 77749 315355 322779 241248 398641
13394 398641 265124 375932 108006 254418 221972 -307444 -131633 332539 346777 339240
13384 339240 188804 205287 -173232 86185 -80081 414809 304426 106580 182445 404251
13374D04251J17840j34394m7903j67062G6037O6193L48049A70967i4870C77803
13363G9382k8777J96972m9450J56744A27562K4452j3682L0444d154C26237I5903
13351D36149F980M5939J25039J8229R0141j39731O9260a7118D4740M85995j7749
13340E12986j79539N1457j00130p4857K73117J02588B76327r6369C2666K44498
13330B77164m476D0944b8856C09997J87650A25612L00310j97627J4893j07961
13320A35227m3863K12235j26376J48557o4450M1444A40594o7984J35503o6345
13310A41768K00106j17080R4984j57750K58208j02384o0164j10070F0973K45220
13300C06193q7897o3683J69479i1708b6227B99213j17935D0086K33424G5360Q1589
$$ plain form
13374 404251 522091 387697 339794 172732 76037 142230 490279 170967 -94870 377803
13363 79382 50605 247577 198127 354871 127562 152014 138332 168776 -4154 326237 95903
13351 436149 6980 52919 177958 196187 286328 146597 215857 -17118 44740 530735 512986
13340 512986 333447 384904 284774 209917 483034 585622 276327 179958 32666 277164
13330 277164 272688 40944 -28856 309997 497647 125612 425922 228295 243188 135227
13320 135227 91364 303599 177223 325780 261330 302774 140594 72610 208113 141768
13310 141768 341874 224794 319778 162028 420236 317852 257688 147618 60973 306193
13300 306193 218296 154613 324092 -91708 -26227 299213 181278 40086 273510 75360 156949
13289A56949c2116J1236j8771C14399C2446P8746M1860L3930q1487C3921L50958
13278C84879A10702c0294E37037j35783A52167g4180A06983J49743j13142e2356
13267A92250M9773c7397p3196b8383A35240K23014C3607a1302B77407b1523B71336
13255A15842J96157F2491B5903i3447D24032I0779a30723A83197m6451N6455A3285
13243C36606i7539c3493H9597c0418p882B02614r6028L96947A75272J44152j10578
13232B08846M4620O4393p9703o8016J61584J33284F9134L8079J02616g096B13256
13220a13223A05333P7276g8648o703B86355a10238A88663P5227D1688J83998a36136
13208A84777r1132J71184H6634C7868R6909J01477a24489A24223J98040N673J789
$$ plain form
13289 156949 -32116 -20880 -39651 314399 32446 111192 153052 186982 105495 33921 384879
13278 384879 110702 -30294 537037 401254 152167 -74180 106983 256726 143584 -52356
13267 192250 242023 -37397 -110593 -28383 135240 358254 33607 -11302 277407 -21523 271336
13255 115842 311999 62491 25903 -93447 424032 90779 -130723 183197 136746 193201 13285
13243 336606 -97539 -33493 89597 -30418 -38300 202614 106586 503533 175272 319424 208846
13232 208846 253466 317859 238156 170140 331724 465008 69134 107213 209829 -7096 213256
13220 -113223 105333 182609 -78648 -85351 286355 -110238 188663 263890 41688 225686 -136136
13208 184777 93645 264829 86634 37868 134777 236254 -124489 124223 322263 327936 329725
13197C29725E8260a82660f6263j88925C14825f3718G9001h3769B2325O3652R4958
13186A80935B077i1994j122B81299A1925b5746A70234K4085b42729B3365J58235
13175A81600b66208D70098E4756J4060P7571c2686C96802l4470I7845a6001A49776
13163B91196F7758g7233A32376L5123c59381h4066A39769c4417B70530B0765J89538
13152B10303a1214A17381R5686a47812G2950L61340A17100R4689p3601J27739
13142B65927a6286l6666B52158c7412A14512J57313j04168c54634e8292C10994
13131a15606a6007A46914C5729a31986b0241o4796A14481d426l5929D6378k0059
13120B6319i129o5664q7120A88674F2414j2222Q2897F1707M3548a60973I5667
$$ plain form
13197 329725 58260 -182660 -66263 -255188 314825 -63718 79001 -83769 22325 85977 180935
13186 180935 2077 -91994 -93116 281299 11925 -25746 170234 194319 -242729 23365 181600
13175 181600 -266208 470098 54756 68816 146387 -32686 396802 362332 97845 -16001 149776
13163 291196 67758 -77233 132376 167499 -359381 -84066 139769 -34417 270530 20765 210303
13152 210303 -11214 117381 213067 -147812 72950 434290 117100 211789 138188 265927
13142 265927 -16286 -52952 252158 -37412 114512 271825 167657 -354634 -58292 310994
13131 -115606 -16007 146914 35729 -131986 -20241 -85037 114481 -4426 -40355 46378 26319
13120 26319 -9129 -74793 -161913 188674 62414 50192 133089 61707 105255 -160973 95667
13108A29328j8409K5913b0798A02507J5822A3438a45973j0720p354D4554E164
13096d0957j68072A06204J94670B8818A0907K68824j39529a45863K7397C40955
13085a24098p7766f7014j04300p9995d3012B8304R226J10508l2327j8986J1619
13074A08344m7802a0527k04702L8665H9544j7119a6869l0540B14561d611C01825
13062A27920C3100a8800m0889B08719j4164Q0194a09226A01517a08457B14249
13051A37052I906J42137K50752m1749D7391K03420A01613R4098a04510l4953F5009
13039B90796B4162J69841f0461B59052c6863A83706f6268B43675l3230a45480
13028C32030g8474A64712J8771P6185q0223o5476J5734l8627j1763K08343E2719
$$ plain form
13108 129328 110919 136832 -20798 102507 118329 13438 -145973 -156693 -164047 44554 5164
13096 -40957 -209029 106204 300874 28818 10907 279731 140202 -145863 -118466 340955
13085 -124098 -201864 -67014 -171314 -251309 -43012 28304 37530 148038 115711 96725 108344
13074 108344 60542 -10527 -215229 -176564 89544 72425 -16869 -47409 214561 -4611 301825
13062 127920 33100 -18800 -59689 208719 194555 274749 -109226 101517 -108457 214249
13051 137052 9906 152043 402795 361046 47391 250811 101613 195711 -104510 -139463 65009
13039 290796 24162 194003 -60461 259052 -36863 183706 -66268 243675 210445 -145480
13028 332030 -78474 164712 183483 259668 179445 113969 129703 91076 79313 287656 52719
13016a95809A68877E4212i434D85527E033J34014a84266P4820b2225B07440o0217
13005A47223h0391c302B77881J00300j76241j2555a08163M9837F8491J7359c1820
12993e0258j29888a5601B21772a9581B61572D4068J95690M2195p8525e2211A60390
12981B4212Q9928f4751B09924l4679J94053A43743R1731q9165Q2550o483g4089
12969G8891J57632a53725q2940H8292a16596j21843D9490L3918J01936b3916H5343
12957e06696b447B21446o4881j002a55544p1917A75022a34158G5734c33505A0303
12945f7407o4857A5390e2298a3875A29357b07962i4442I8716b4282p2585A35198
12933c6084B44669a281r3194L8614F4260L32705F983J92903J33005b14212F8603
$$ plain form
13016 -195809 168877 54212 -9434 485527 5033 139047 -184266 -109446 -22225 207440 147223
13005 147223 -80391 -3302 277881 378181 201940 189385 -108163 -58326 68491 85850 -31820
12993 -50258 -180146 -15601 221772 -19581 261572 44068 239758 281953 203428 -52211 160390
12981 24212 114140 -64751 209924 175245 369298 143743 235474 146309 228859 222376 -74089
12969 78891 236523 -153725 -236665 88292 -116596 -238439 49490 83408 185344 -23916 85343
12957 -506696 -2447 221446 156565 155563 -155544 -227461 175022 -134158 75734 -333505 10303
12945 -67407 -132264 15390 -52298 -13875 129357 -207962 -94442 98716 -24282 -96867 135198
12933 -36084 244669 -1281 -94475 -55861 64260 396965 6983 199886 332891 -214212 68603
12921f3435D1820a92726B71308A09244n398a49219A87229J53117a54575o0838
12911b15413D2706b16909a9931A50476K8191c2756C2939K59737h3539q6169A26980
12899C9986R0527J74578a80761D5026j9665K19856b55923G7378c12476A30514
12888D9227c36l5953j7448D7595H17f330A45245f9018l5518J3509j14107F9433
12875A56246o1852a46898A85179K2067e0212B42034J77044D153J48951a23227
12864i851E0348e1969D8877c4624l348n3995I675g555k36821C85076H2391f4358
12851i425k25887A54071n0210J40375c03896g8199J6835k39462g8822A06052K3261
12840A29313D390R462g7263a6556A62476a41720H4357f4479j88550R7371M3666
$$ plain form
12921 -63435 41820 -192726 271308 109244 103846 -149219 187229 340346 -154575 -215413
12911 -215413 42706 -216909 -19931 150476 178667 -32756 32939 292676 -83539 -169708 126980
12899 39986 130513 305091 -180761 45026 25361 245217 -255923 77378 -312476 130514
12888 49227 -336 -36289 -53737 47595 817 -6330 145245 -69018 -104536 -91027 -205134 69433
12875 156246 94394 -146898 185179 207246 -50212 242034 419078 4153 153104 -123227
12864 -9851 50348 -51969 48877 -34624 -37972 -91967 9675 -7555 -244376 385076 82391 -64358
12851 -9425 -235312 154071 103861 244236 -303896 -78199 -61364 -300826 -78822 106052 129313
12840 129313 4390 13852 -77263 -16556 162476 -141720 84357 -64479 -253029 -155658 -111992
12829a11992j51721b791n9583E7189i4383A72415a12107B39156a99882A64432
12818G3139a69859O0668G6950a31926M7894h742B45416G8297K7751l397a79051
12806b94115A50014d3923o2150I8573K10558d3420A73243b3232A74355O7882a14122
12794a43258B6316O3777J94985g245l7791n9886C04549F2621J86106I9707C3014
12782b15535J4504a2781A2028a17902c7677K517G3650a49341r0312g1041A27619
12770C35400D6014e8090j4113k97940I5919J39966a45576F3168k6616Q3246c45702
12758B2747f1226o06I6479a46517h569A69002a53708a643j12613j02101c812F8067
12745b46756i7084D956a35904a8529n3501j43048A58825b2064A7484J17626D819
$$ plain form
12829 -111992 -263713 -2791 -62374 57189 -94383 172415 -112107 239156 -199882 164432
12818 73139 -169859 -109191 76950 -131926 -84032 -8742 245416 78297 106048 102651 -179051
12806 -294115 150014 -43923 -106073 98573 309131 -43420 173243 -23232 174355 242237 -114122
12794 -143258 26316 90093 285078 -7245 -45036 -104922 304549 62621 248727 99707 33014
12782 -215535 -201031 -12781 12028 -117902 -37677 -35160 73650 -149341 -239653 -71041 127619
12770 335400 46014 -58090 -72203 -370143 95919 235885 -145576 63168 36552 119798 -345702
12758 22747 -61226 -61832 96479 -146517 -8569 169002 -153708 -1643 -114256 -216357 -3812 68067
12745 -246756 -97084 4956 -135904 -18529 -72030 -215078 158825 -22064 17484 135110 4819
12733b3172l483j22626D93342D6793J34859c1454A94381a06452b5731B74718o3547
12722B11171a33541k5176c4439A8959P4511d7899A09067N2241J08221J00471h9061
12710i734A41725i6815G514c0183B32457e4294B23114O4390F5125b3945A59847
12698h6787I8965J67228a13299b2657p9546q8131F2644a28638I9868O4802d289
12686B59161g8292j01240f0102A71794D3441O3967J06667a7319o3450a5172G2038
12674b7638k1473A05480L2177K45384E1775N9507c3522B6443J26130Q2310p1509
12663A63374D5772J29685a05439B55738c8057A2724R9641J42342A14399n1498
12653F2901J4907K09453b05224J8500A92960a54838f2113D10914a95143k4265
$$ plain form
12733 -23172 -26655 -149281 493342 46793 181652 -31454 194381 -106452 -25731 274718 211171
12722 211171 -133541 -158717 -34439 18959 93470 -47899 109067 161308 269529 370000 -89061
12710 -9734 141725 -96815 7514 -30183 232457 -54294 223114 287504 65125 -23945 159847
12698 -86787 98965 266193 -113299 -22657 -102203 -190334 62644 -128638 99868 164670 -4289
12686 259161 -78292 -179532 -60102 171794 43441 107408 214075 -17319 -80769 -15172 72038
12674 -27638 -49111 105480 137657 383041 51775 111282 -33522 26443 152573 234883 163374
12663 163374 45772 175457 -105439 255738 -38057 12724 112365 254707 114399 62901
12653 62901 77808 287261 -205224 -186724 192960 -154838 -62113 410914 -195143 -219408
12643b19408N1495j82761D38695A89294E2655J54014i8389A46737r984b02981
12632B66090M2788f5510C86504E4513b07793e5193B80257I2735c12516G4948c00398
12620B9840A0611N8303a41609K8854B03264I5390N789K24279A1851K36613B6386
12608a77421C8180d5166A210h1937C03595c27259Q3651E7212J38362a5292A61391
12596A23777d83890B7605j639b4913F8623L49220c1697p1975j5895A15852b17889
12584b24765A14230a56213K0301A4995h0652A44943J52197i018j25419C41515
12573d6043A08406J057Q1796c3080l0765A91553d9209j00996B28802l9130A1508
12561i8658A18683C8320J27668j4376a94605A30050c43184a26732B83176a52974
$$ plain form
12643 -219408 -167913 -350674 438695 189294 52655 206669 -98389 146737 136753 -202981
12632 266090 308878 -65510 386504 54513 -207793 -55193 280257 92735 -312516 74948 -300398
12620 29840 10611 68914 -141609 -112755 203264 95390 101179 325458 11851 248464 26386
12608 -177421 38180 -45166 1210 -81937 303595 -327259 -243608 57212 195574 -15292 161391
12596 123777 -483890 27605 25966 -24913 68623 417843 -31697 -103672 -119567 115852 -217889
12584 -224765 114230 -156213 -135912 14995 -80652 144943 297140 -9018 -134437 341515
12573 -46043 108406 109463 191259 -33080 -63845 191553 -49209 -150205 228802 189672 11508
12561 -98658 118683 38320 165988 151612 -194605 130050 -343184 -126732 283176 -152974
12550H0778A1707c9640k06787h8367a5641H0519a32513A15032N9172R1253A24715
12538B60225b28316D5692L0730L92595a52633G628K56088A27177L1497a25725
12527B66932a63474L9932B96659a070A43395e9206C32374n3293B7397b96853b2949
12515A95948a10293A27650K5900C4634d6364G9275a23790a8269q1316A46013i9883
12503i590k853j66939D34919A38304F5042M2944D9996J54322n8798J58943I8527
12491A3546K01321H7133c19230H0771B2316e6242C7235A8020J07419A4559b9700
12479H4697Q5952b35152L4370B1191d2785I5743C1948J12387a491A02838c39182
12467G9883c6495k23491B5682a68018D5464e5557e518k42836I0478M1893K0005
$$ plain form
12550 80778 11707 -39640 -246427 -88367 -15641 80519 -132513 115032 174204 265457 124715
12538 260225 -228316 45692 76422 469017 -152633 7628 263716 127177 158674 -125725
12527 266932 -163474 -123542 296659 -1070 143395 -59206 332374 279081 27397 -296853 -22949
12515 195948 -110293 127650 153550 34634 -46364 79275 -123790 -18269 -99585 146013 -99883
12503 -9590 -12443 -179382 434919 138304 65042 107986 49996 204318 145520 304463 98527
12491 13546 214867 87133 -319230 80771 22316 -56242 37235 18020 125439 14559 -29700
12479 84697 170649 -235152 -200782 21191 -42785 95743 31948 144335 -1491 102838 -339182
12467 79883 -36495 -259986 25682 -168018 45464 -55557 -5518 -248354 90478 132371 152376
12456A52376a70771f1190C2069J26744d959C0335a93306B06575c69946F0040b27216
12444A85493a711j67545B11127n0541c6379F9245c10470A86826a67024m0332b0788
12432H7147e7728q7751A3698J59149A3193i9968B5883a79317k9786k5359P4416
12421a60046l3498D6686n41j9200K6116d4124n8974A36163E2367b36896a01845
12409b50436A12801n5814b4362p6441k59955A07804l1644K6899L2921A9651K12972
12398B32623A8341a3803C83719j0742q6668E750g8839B41414i9234H081K27102
12387B35183A317K71735e6383G4325C6110K63558a40226A72470b08590A6200c0827
12375B04394c98252c4045k5066q2232C0205J15949a9879H2288J37718a54132B21474
$$ plain form
12456 152376 -170771 -61190 32069 158813 -4959 30335 -193306 206575 -369946 60040 -227216
12444 185493 -1711 -169256 211127 160586 -36379 69245 -310470 186826 -167024 -207356 -20788
12432 87147 -57728 -145479 13698 172847 13193 -99968 25883 -179317 -209103 -234462 -160046
12421 -160046 -193544 46686 46145 26945 53061 -44124 -103098 136163 52367 -236896 -101845
12409 -250436 112801 56987 -24362 -100803 -360758 107804 76160 103059 135980 19651 232623
12398 232623 18341 -13803 383719 372977 286309 5750 -78839 241414 -99234 8081 235183
12387 235183 1317 273052 -56383 74325 36110 299668 -140226 172470 -208590 16200 -30827
12375 204394 -398252 -34045 -59111 -141343 30205 146154 -19879 82288 220006 -154132 221474
12363a05213C86257G7006k6914B4410c44130D2613a6462j21840j14774d8810b3065
12351A42909a9936m0715G6862D938i5196B45289m5502G5233d12486a88088E1411
12339D2673J07689J03227A10160f6117A42098A389g389j05409C08324b11175A6100
12327D6139K66739C6596M247A3715K8413L29730c5692A68360G2386J38432h814
12315A67707R5168a64303P850H8465K17994e8050D70300A2330N8882J51501A01168
12303E7985a73372B546K23760B5231K78297D4034L61341a48620b0345B3780N7195
12292H0975b01249B03042b58345D6250N0420M8770p0014M67830a10160L1521a0293
12280h2523C70165q3400I2917b92916A67883a0053A54646J31414E5318J18101
$$ plain form
12363 -105213 386257 77006 50092 24410 -344130 42613 -16462 -138302 -253076 -48810 -23065
12351 142909 -19936 -60651 76862 4938 -95196 245289 199787 75233 -412486 -188088 51411
12339 42673 150362 253589 110160 -66117 142098 1389 -7389 -112798 308324 -211175 16100
12327 46139 312878 36596 40843 13715 42128 371858 -35692 168360 72386 210818 -8814
12315 167707 262875 -164303 -156453 88465 306459 -58050 470300 12330 71212 222713 101168
12303 57985 -173372 2546 226306 25231 303528 44034 405375 -148620 -20345 23780 80975
12292 80975 -201249 203042 -258345 46250 96670 145440 75426 543256 -110160 -78639 -10293
12280 -82523 370165 286765 92917 -292916 167883 -10053 154646 286060 55318 173419
12270A73419o1090a04029M512A1100K08077M71632C43992C876K53180r3714E621
12258e9237j20193D13318A20176J87264j16682J6347b0526R586B17348j8719O6358
12247B64987a58972A94083A0758d5650B77203j13405B7002d3110G5081M200L84457
12236D63738I355J83813m0018a70568B53147b4052j4494C38752a99127B98645
12225D41042F519K02106g5262K7543C45937J19302B05466J41464j61051L65619
12215E51498j95281n8890j40112J1838k3447i4511F5319l018J12613b9281B67975
12203G9901K7152j6861f106A03081L0056i5854b7413B59820A6563P3595P2343
12192A62501F2121N198b22597A75837e4135C88256r1318J00553j72140I1373J94509
$$ plain form
12270 173419 112329 -104029 -99517 11100 219177 690809 343992 3876 257056 163342 5621
12258 -59237 -179430 413318 120176 307440 190758 207105 -20526 -10940 217348 198629 264987
12247 264987 -158972 194083 10758 -45650 277203 163798 27002 -43110 75081 79281 463738
12236 463738 9355 193168 153150 -170568 253147 -24052 -38546 338752 -199127 298645
12225 441042 6519 208625 -75262 -47719 345937 465239 205466 346930 185879 551498
12215 551498 356217 297327 157215 169053 145606 -94511 65319 62301 174914 -29281 267975
12203 79901 107053 90192 -6106 103081 133137 -95854 -27413 259820 16563 90158 162501
12192 162501 62121 67319 -222597 175837 -54135 388256 296938 397491 225351 91373 285882
12181B85882N7409A19874K8419J93475r7191a5572B8574M13637k14401j05031
12171A22779K0671F9182K89693r8474j04185R6230j11286K17991J1835A81388
12160B19870F7896K50613a3319J514o3455m1300B28656N3095j17638d8050B28180
12148B26592G6531a27027f89n8668C39263J00603D3459K4064K95794a90523B09734
12136A26545b3719l7302H9419B3865a36493g58A86225M79348B65747E1710J91006
12125B42716b6128C00750a64621c6232A33456D1564K70766j20459l7709m2280
12115A11882a90130B46378F1919M2728a85075B99677A10382J09723j0143L5529
12105B45491j04843j9194J43633b8011n9432C9952M48275a15393D746e0738q592
$$ plain form
12181 285882 343291 119874 148293 341768 244577 -15572 28574 442211 227810 122779
12171 122779 143450 69182 358875 260401 156216 252446 141160 359151 370986 181388
12160 219870 67896 318509 -13319 -11805 -75260 -116560 228656 281751 164113 -48050 228180
12148 226592 76531 -127027 -689 -59357 339263 439866 43459 67523 363317 -190523 209734
12136 126545 -23719 -61021 89419 23865 -136493 -758 186225 665573 265747 51710 242716
12125 242716 -26128 300750 -164621 -36232 133456 41564 312330 191871 154162 111882
12115 111882 -190130 246378 61919 104647 -185075 299677 110382 220105 209962 245491
12105 245491 140648 121454 265087 -28011 -87443 39952 488227 -115393 4746 -50738 -59330
12094e9330B05210g4741B21801J23305B8704a06126e0699A58589D6552J49299
12084A95851p9039i9275p8031B37023G7099A3606d4419F3033d5877B52257B7286
12072a68743A10973a86943B2146c3102a0623A67891L5736b9347k91841c037a199
12060a63031B40923F0309P4390Q4040F9610K72789H5330b16753J06399l43895
12050d54249b16026B95552C7651J36155h1318l358q3620I9155b67149h3344b7661
12038b92946B06549j00388J68829D450K4929P5571E1991N0138k4930k1251i3148
12026G3952J23010a09637j30376O6090N4034F8610i2147I5427a86296L5291d140
12014A19039J9065b80822a8286E5063O7239A1412c1460A972d216o2692A22249
$$ plain form
12094 -59330 205210 -74741 221801 345106 28704 -106126 -50699 158589 46552 195851
12084 195851 116812 -99275 -177306 237023 77099 13606 -44419 63033 -45877 252257 27286
12072 -168743 110973 -186943 22146 -33102 -10623 167891 203627 -29347 -321188 -3037 -1199
12060 -163031 240923 60309 134699 218739 69610 342399 85330 -216753 -110354 -454249
12050 -454249 -216026 295552 37651 173806 -81318 -84676 -168296 99155 -267149 -83344 -27661
12038 -292946 206549 106161 274990 4450 29379 104950 51991 102129 77199 55948 -93148
12026 73952 196962 -109637 -240013 -173923 -119889 68610 -92147 95427 -186296 -151005 -4140
12014 119039 138104 -280822 -18286 55063 122302 11412 -31460 1972 -4216 -66908 122249
12002a85034f6397A54208F0733b0302I0686O5071c29711g1034j95645d829j4309
11991a9138A6689a70715k3285j0384r4103g2295l9266L2381A26640m8018a53503
11979d9136n1442k9731A29133e6940E3861i5333k3047F883L10592D8055M7037
11968I5092a00500c8168k63783B56750c15606G493J06984j9113b0858G4469a75275
11956h3445C3120c8352r3796L3429A73404a86621N5901b6584o8662A0345a01034
11944a08807C26766a98834H6426b04942B12303m9616c45626L9386a39016A26752
11933f343j01843D3468E107i1667C01252a6034j20512J1279n3095A85880H0117
11921c1117I5109j3135b4174j49681B60840b91907Q6297B05504f6378j62909L438
$$ plain form
12002 -185034 -66397 154208 60733 -20302 90686 155757 -329711 -71034 -266679 -4829 -19138
11991 -19138 16689 -170715 -194000 -204384 -298487 -72295 -111561 -79180 126640 78622 -153503
11979 -49136 -100578 -130309 129133 -56940 53861 -95333 -118380 6883 317475 48055 95092
11968 95092 -100500 -38168 -301951 256750 -315606 7493 114477 95364 -20858 74469 -175275
11956 -83445 33120 -38352 -132148 -98719 173404 -186621 -130720 -26584 -95246 10345 -101034
11944 -108807 326766 -198834 86426 -204942 212303 162687 -345626 -306240 -139016 126752
11933 -6343 -108186 43468 5107 -91667 301252 -16034 -136546 -125267 -178362 185880 80117
11921 -31117 95109 81974 -24174 -173855 260840 -291907 -205610 205504 -66378 -229287 -225849
11910b25849P4463P3157D7428h3890j74470D3036a45383j8701A3094J27286a84756
11898c7493j79494K3459F3483M8448l1065a63288J3021f6445J7572A40563a35670
11886A68809g1651c0193I0445a33487J7624H0983a37232f0789q8642D9101e1109
11874f8670C05254j43408l8268n1356c203I6112a60910P4271a0706k7910r1291
11863a29907G7784O025b35413J01082l46896g2815B43874k3592g3290o3959I5526
11851a26941M0087n3730I4822P6296b3671B49827i2556N344C9789p705J52218
11840A84302d49312J77486F5702a14955c5962H4248a13323B01753j5769f2882
11829a81969h4706n2597G0112c38260A43327N2293c5450B56138b39501c6505B5555
$$ plain form
11910 -225849 -151386 -78229 47428 -83890 -258360 43036 -145383 -164084 13094 140380 -184756
11898 -37493 -216987 -193528 63483 111931 80866 -163288 -150267 -66445 -48873 140563 -135670
11886 168809 -71651 -30193 90445 -133487 -115863 80983 -137232 -60789 -149431 49101 -51109
11874 -68670 305254 161846 123578 72222 -3203 96112 -160910 -86639 -10706 -38616 -129907
11863 -129907 77784 83809 -235413 -134331 -481227 -72815 243874 220282 -73290 -137249 95526
11851 -126941 -86854 -140584 94822 171118 -23671 249827 -92556 -87212 39789 32084 184302
11840 184302 -449312 -271826 65702 -114955 -35962 84248 -113323 201753 185984 -62882
11829 -181969 -84706 -137303 70112 -338260 143327 195620 -35450 256138 -239501 -36505 25555
11817c41570J21395G9448b4926k59065C30820a05739A12823m357j9658D71b3672
11805A69286f482p6204C5335a62905B74442a31414F8030J02236a87617N8528D5060
11793b01300P3276B41580b0681l2277H4433a75050B20925n4473h1468G0175a62449
11781B99547I6052a07608A77474a355o4244j44246P8455H4845J08269r3664a11866
11769b22330A66275a03790A4889J08746m8361M682F893O2298a20426j6743l2859
11758a70028M2322H8712J796L4677J4821b35107A82449g0379J1022r8953d3123
11746A13078b4381j6942J2683C70256A28051a1931C26057Q2474b02485K4225B4347
11734a42403c8858A55527K8820b63209C22361D1251e2613l7453B27519b09272
$$ plain form
11817 -341570 -220175 79448 -24926 -283991 330820 -105739 112823 108466 88808 471 -23672
11805 169286 -6482 -82686 35335 -162905 274442 -131414 68030 170266 -187617 -129089 45060
11793 -201300 -128024 241580 -20681 -52958 84433 -175050 220925 166452 -81468 70175 -162449
11781 299547 96052 -107608 177474 -1355 -65599 -209845 -131390 84845 193114 99450 -111866
11769 -222330 166275 -103790 14889 123635 75274 79956 6893 69191 -120426 -137169 -170028
11758 -170028 -127706 88712 90508 125185 140006 -235107 182449 -70379 -59357 -158310 -43123
11746 113078 -24381 -41323 -28640 370256 128051 -11931 326057 408531 -202485 -178260 24347
11734 -142403 -38858 155527 184347 -263209 322361 41251 -52613 -90066 227519 -209272
11723I0670K7487B1898a68844A12627j9357a7026H400R4506a54572j4751B1116
11711C4491K84149A11343J41913B3156J28869b3816m5368l0003c4449k88330B49677
11699a97593H9254J72257a51957B38441q2359A4434K46204j24485C4905J75086
11689B09991d1462E4757f1392k43091O2982C34309b28138B5102a28723e2698l69282
11678d21980C47027E645J29337i079n1027p989j3808J2247C09101a77049C8219
11666d27020A50910F8709b33273d9160k82560a6988E8777c90464B7003K10214
11656B37217c58549B9277i0751A49897b82771C7099d3284A04317h1193K5155A1083
11644a07741G3383b0316I329c9441B55608k5508a19388j38121D6200J3521i2653
$$ plain form
11723 90670 118157 21898 -168844 112627 93270 -17026 8400 102906 -154572 -169323 21116
11711 34491 318640 111343 253256 23156 152025 -23816 -69184 -99187 -34449 -322779 249677
11699 -197593 89254 261511 -151957 238441 156082 14434 260638 136153 34905 209991
11689 209991 -41462 54757 -61392 -304483 -241501 334309 -228138 25102 -128723 -52698 -421980
11678 -421980 347027 5645 134982 -9079 -60106 -68095 -81903 -69656 309101 -177049 38219
11666 -427020 150910 68709 -233273 -49160 -331720 -16988 58777 -390464 27003 237217
11656 237217 -358549 29277 -90751 149897 -282771 37099 -43284 104317 -81193 -56038 11083
11644 -107741 73383 -20316 9329 -39441 255608 230100 -119388 -257509 46200 59721 -92653
11632c38610B07988a18311H770J64511b9143o5103j65305l95493B92424A0731
11621D7185c58432D3314c40216C80461j73853n7676a90654A59806n359h023C6903
11609a66557f4300F7978b22422B527K96237i4651K3762p5739r6554B4131c37336
11597D2785Q8246R515R598a45387C2369g724E0264c3237A10545D1095J69475E5112
11584a76083f4910D156J03878E3138K93924a00942A66190o0002J59573K34392
11574E00153A29156J66409b25037P3559F9086c7257A04607m8344J22351B0222
11563A83452e0873B90654e7180G877a29713m6420j59756D92106a42163B85418
11552F0080R791O6827B746a61270B31437p0672J2841C3735J42760K1950G4785
$$ plain form
11632 -338610 207988 -118311 8770 173281 -29143 -94246 -259551 -655044 292424 10731
11621 47185 -358432 43314 -340216 380461 206608 148932 -190654 159806 154447 -8023 36903
11609 -166557 -64300 67978 -222422 2527 298764 -94651 -70889 -146628 -243182 24131 -337336
11597 42785 131031 140546 150144 -145387 32369 -7724 50264 -33237 110545 41095 210570 55112
11584 -176083 -64910 4156 108034 53138 347062 -100942 166190 106188 265761 500153
11574 500153 129156 295565 -225037 -151478 69086 -37257 104607 56263 178614 20222
11563 183452 -50873 290654 -57180 7877 -129713 -176133 -335889 492106 -142163 285418
11552 60080 69871 136698 2746 -161270 231437 160765 173606 33735 176495 198445 74785
11540a38045G1825K06880g8442A47976C7743J13237b35418B28964J9727E227K3375
11529B8602d5086j9964E2330L68233A79700a0905j6057o5186C54076A38521k6096
11518A12425R2998J49491C9046J01692K0073L2968n9217N4200f7987F7577j6217
11507E1360J11024A0567R8226n3755K46520a04632B45088g6286D46378j11546
11497C34832j57183J2696l1242O5116j07487J17042c1542A8436R8009J66943k3484
11486B59904g8141B44871a7813B44361A19614Q1277R7978D6974O03830k85652
11476C65152B6582a3983D9650O236L42204c5969j00029m370B88315A00390f935
11464g0298B9379f5536B48803m3120E6326e1904l0042A49317i1690A35317K3656
$$ plain form
11540 -138045 71825 278705 -78442 147976 37743 150980 -235418 228964 248691 5227 28602
11529 28602 -45086 -65050 52330 420563 179700 -10905 -26962 -92148 354076 138521 112425
11518 112425 205423 354914 39046 140738 160811 193779 134562 188762 -67987 67577 51360
11507 51360 162384 10567 108793 55038 301558 -104632 245088 -76286 446378 334832
11497 334832 177649 190345 159103 224219 116732 233774 -31542 18436 116445 283388 259904
11486 259904 -78141 244871 -17813 244361 119614 200891 298869 46974 650804 365152
11476 365152 26582 -13983 49650 55886 398090 -35969 -135998 -140368 288315 100390 -6935
11464 -70298 29379 -65536 248803 205683 56326 -51904 -81946 149317 -91690 135317 158973
11453A58973b6500A11521e2876B24709a12728A89411o4272n9201K55017i7341
11442D4824J93514q5712b40213A84177c1153j03221i560B10678A03967R7660c3717
11430A04956C1577P0392j0596a57316C3730A6491O4586a5486q4791B5494e9583
11418b339j0284j26062A78213k9526a18789q4003f7554m6967A4837a28702A23281
11406b47133O6070G6763J23547i0845A25203a43433b1626C67726a91589B04042
11395B68773A12948c36o7107k02655d0603l05714i7656B20510b63612a06084B05237
11383g2205N042L2829q6996b965G4139c16719M5026a09289B08041c665j58320
11372a61985j7650A3667J42253N3078a72798A55384N4288f0464A14677a01421
$$ plain form
11453 158973 -26500 111521 -52876 224709 -112728 189411 125139 65938 320955 -97341
11442 44824 238338 152626 -240213 184177 -31153 -134374 -9560 210678 103967 201627 -33717
11430 104956 31577 101969 91373 -157316 33730 16491 81077 -15486 -100277 25494 -59583
11418 -2339 -12623 -138685 178213 148687 -118789 -202792 -67554 -114521 14837 -128702 123281
11406 -247133 -181063 76763 200310 -90845 125203 -143433 -21626 367726 -191589 204042
11395 268773 112948 -336 -67443 -270098 -40603 -346317 -97656 220510 -263612 -106084 205237
11383 -72205 -67163 -34334 -121330 -2965 74139 -316719 -271693 -109289 208041 -3665 -161985
11372 -161985 -179635 13667 155920 208998 -172798 155384 209672 -60464 114677 -101421
11361c47027G7163a26674A53278j979N0895I9526P5918b75794e4698F4495J11010
11350A75505K4984c9213C25754A24558a22481l9147B85421Q6393C407L62346j14031
11339B51722a13766B23980f490j01794B31080c84426J18335A78914D7497a10942
11328A57248a90717C902N6253c0828F2007b7701j4126k05904d0250B39182c30930
11316a83501E677J23715a83500D3788L833b24562Q9314d601A61813e5288k29934
11305b85222D19292A89623a26514j166i155j15776c6844A10560g2911A17443a6686
11293a15962m6536g4666P068b265A49923a14721K2576k70491a73780j03653a9063
11281a98873E257O4049b3236B1953b09720j777d0015A66099E755N0273J13551
$$ plain form
11361 -347027 77163 -126674 153278 151299 202194 99526 175444 -275794 -54698 64495 175505
11350 175505 200489 -39213 325754 124558 -122481 -161628 285421 371814 3407 365753 251722
11339 251722 -113766 223980 -6490 -108284 231080 -384426 -266091 178914 47497 -110942
11328 157248 -190717 3902 60155 -30828 62007 -27701 -41827 -247731 -40250 239182 -330930
11316 -183501 5677 129392 -183500 43788 47621 -224562 -135248 -4601 161813 -55288 -285222
11305 -285222 419292 189623 -126514 -127680 -9155 -124931 -36844 110560 -72911 117443 -16686
11293 -115962 -162498 -74666 -67598 -2265 149923 -114721 -92145 -362636 -173780 -277433 -19063
11281 -198873 5257 69306 -23236 21953 -209720 -211497 -40015 166099 5755 56028 169579
11270A69579G3238A0106c07531a52372E30207A97470i0311k5142A63379J81940
11260C45319d76929b02976L1635K4607A50626b87306e2488j67988A31899J11159
11250B43058b14626Q7022A78655a55222k9319g4389K0501o2742m924A83411c6357
11238D3786L31863e10823a60372q8896h2853B3640R5232L9744a27363n2077A07172
11226a03251A62532E531i5855j31393L0631N1907c3989B4213a8536A18810l6334
11215H2476b15794A1197a34951a9806D48841a85827A82030a26510j12949d2527
11204c23465f8479A02770M9820E6687a64214M7060C1663a75685A01306a18850
11193A52651b19925I6650d84739a49009k16518A6184K0939a83954J837b4638A95006
$$ plain form
11270 169579 73238 10106 -307531 -152372 530207 197470 -90311 -115453 163379 345319
11260 345319 -476929 -202976 -171341 -146734 150626 -287306 -52488 -220476 131899 243058
11250 243058 -214626 -127604 178655 -155222 -184541 -74389 -53888 -116630 -121554 183411 -36357
11238 43786 375649 -510823 -160372 -249268 -82853 23640 118872 158616 -127363 -179440 107172
11226 -103251 162532 5531 -95855 -227248 -196617 -144710 -33989 24213 -18536 118810 82476
11215 82476 -215794 11197 -134951 -19806 448841 -185827 182030 -126510 -239459 -42527
11204 -323465 -68479 102770 152590 56687 -164214 -117154 31663 -175685 101306 -118850
11193 152651 -219925 96650 -484739 -149009 -365527 16184 37123 -183954 -182117 -24638 195006
11181c04051a42839o7451e1345C55121a82249K2523A79296a11230A09456J49508
11171B58964j11496J21279e0780k4503D6176a52417d6902B28183c45543H5227
11160a33263o8335o819A25840L5196a70689C17558g2273E3318M2516b06992B47219
11148A20025b3390j4791a1234B78428l5532F5212J57956a1606j1987O67j60125
11137a83051c7181A50379i0558j27847B6255h5354L1228A40668d6688D19626a3864
11125A04593J8853n8236a02875j63107A35902k0327O834L72723B43856B7024J64100
11114A91124D2636B0131J02153Q7766l0642m3725n8771L2165j1692J15577J31291
11103C44253n0696E6634N4645B8017M33829j16256d4315A94569K30305A37736
$$ plain form
11181 -304051 -142839 -210290 -51345 355121 -182249 -159726 179296 -111230 109456 258964
11171 258964 147468 268747 -50780 -75283 46176 -152417 -46902 228183 -345543 85227
11160 -133263 -201598 -208417 125840 161036 -170689 317558 -72273 53318 95834 -206992 247219
11148 120025 -23390 -38181 -11234 278428 242896 65212 223168 -11606 -23593 -22926 -183051
11137 -183051 -37181 150379 -90558 -218405 26255 -85354 -54126 140668 -46688 419626 -13864
11125 104593 123446 65210 -102875 -265982 135902 115575 122409 495132 243856 27024 191124
11114 191124 42636 20131 122284 210050 179408 135683 76912 109077 97385 212962 344253
11103 344253 293557 56634 111279 28017 461846 345590 -44315 194569 424874 137736
11092G61925B15768l1894J88988j43443J24255A50196L67880A61518M05506j87729
11082C79295j85180l4142K76710j6871O294m4429L23722C07995K37792J5810k58049
11071C03548L47015j39070B32590K81970B16544p790K23497n9890J22744L60711
11061H55816p7864k20495q9095M0792J52354r4273j4868J66898M9003j75907l2233
11050E60128J60786Q5507o9157L59763l30927P4771o2057J42947j01334k03832
11040F16595M42926l41569L34818r3855j6596j37904K5028K01166l07601J90205
11030I13213k71311J81731j26127K43262n3386l76765J32072r9349K86845m7637
11020G82548j35246N2147j69718R0980L75511D26644L89754K5992L97172l46230
$$ plain form
11092 761925 215768 183874 372862 229419 353674 150196 518076 161518 567024 379295
11082 379295 194115 159973 436683 419812 426106 381677 705399 307995 545787 561597 303548
11071 303548 650563 511493 232590 514560 216544 208754 432251 372361 495105 855816
11061 855816 777952 557457 468362 509154 661508 567235 552367 719265 768268 592361 560128
11050 560128 720914 806421 737264 1097027 766100 840871 778814 921761 820427 616595
11040 616595 1059521 717952 1052770 958915 942319 804415 829443 1030609 723008 913213
11030 913213 641902 823633 697506 940768 887382 510617 642689 543340 830185 782548
11020 782548 647302 699449 529731 620711 996222 426644 816398 842390 1239562 893332
11010H93332j91810l4045J6675L68704l32482L4453R7884m9536J8160N4303Q0765
10999I56403l7191j90003K05535j95303J82687K3401j52636R9581k00944N3668
10989G45198L24172O6466m11827L74837j74171j8276M15233p5845q070j42430
10979A095287N01058n998l12576J52533K53707k80926L99090P227K86000J01238
10969B196640l00302K55278k45175M85801l65817L55587k64817r5412J11649j89537
10959A943895n84804m20763J54406j81944j29884J44510J57277J28720m08637
10950H02776K3278J0927J01885l07271M6970k37840j94797K54460k38927F5479
10939C61380l9928A38797f3848b2335C42574e4920j29119A77559F9025N1561R3696
$$ plain form
11010 893332 701522 667477 684152 1052856 720374 754827 852711 803175 821335 875638 956403
10999 956403 919212 729209 934744 739441 922128 945529 792893 892474 691530 745198
10989 745198 1069370 1135836 724009 1098846 924675 906399 1321632 1245787 1237717 1095287
10979 1095287 1596345 1590347 1277771 1430304 1684011 1403085 1802175 1809402 2095402 2196640
10969 2196640 1896338 2151616 1906441 2392242 2026425 2382012 2117195 2021783 2133432 1943895
10959 1943895 1359091 938328 1092734 910790 780906 925416 1082693 1211413 802776
10950 802776 826054 836981 938866 631595 678565 440725 245928 500388 261461 65479
10939 361380 321452 138797 -63848 -22335 342574 -54920 -184039 177559 69025 120586 214282
10928B14282A02096d3594H5557l9342K59359j7793o9010d53703G4650Q6326A1644
10916B68477j21824b09415J9961A04981Q2646b36755A33570D0559a14790j61235
10906b76025J36093B74389j02504m9306J5256J33284g2887j36104e3606D03213
10895h5022L2703j57887K0628c932l9820j70114B86691a31327E570a2400C72032
10883b83133B744L1610d0828C9658O953L8335e020A30599E2213b10496E0238Q6583
10871A36821a72574B07934E1487i5462A09300K2551b06776B79388I8537k6324
10861G2213h9441B51222a79845e8230C7590b82732b8161j999A48447a25348c0319
10849a14611M4969r7177Q0138K6482k83658A02550j8274c84794r3721a62993M7901
$$ plain form
10928 214282 102096 -43594 85557 46215 305574 287781 218771 -453703 74650 160976 11644
10916 268477 146653 -209415 -189454 104981 187627 -236755 133570 40559 -114790 -276025
10906 -276025 -139932 274389 171885 122579 137835 271119 -72887 -208991 -53606 403213
10895 -85022 -52319 -210206 -189578 -3932 -43752 -213866 286691 -131327 5570 -12400 372032
10883 -283133 2744 34354 -40828 39658 46611 84946 -5020 130599 52213 -210496 50238 136821
10871 136821 -172574 207934 51487 -95462 109300 131851 -206776 279388 98537 72213
10861 72213 -89441 251222 -179845 -58230 37590 -282732 -28161 -30160 148447 -125348 -30319
10849 -114611 -69642 -166819 -86681 -60199 -343857 102550 84276 -384794 -478515 -162993 -115092
10838a15092j51187A25824i5045B39598h7313A11448a78694c7370o8410a0061
10827A1271a32476j80042e9929m3374B06026n0489a79438M0392j21982A01570
10816A8778a94241E4447a54862O4947j63941A82909H1773C2102J87111a86722
10805C98661a21082A49313k2372k9783i7141B24689a14679A26398a30687F658
10794a54519k59971h6970A4535e6947a5783j3840j14453i971A60533a28585a0953
10782D9001J97050D6584K16675b38122N4631E7099a01593A2435a26371l6298L8915
10771a23754J3044A05220N1853C9117J25660E6367h9183j55121A45562J08664
10761B54226e4654p0476d0144q392k5611J7422l73130P6351a26591B2291b51616
$$ plain form
10838 -115092 -266279 125824 -95045 239598 -87313 111448 -178694 -37370 -105780 -10061
10827 11271 -132476 -312518 -59929 -103303 206026 155537 -179438 -139046 -261028 101570
10816 18778 -194241 54447 -154862 -89915 -253856 182909 81773 32102 219213 -186722
10805 398661 -121082 149313 126941 97158 -97141 224689 -114679 126398 -130687 6658
10794 -154519 -414490 -86970 14535 -56947 -15783 -29623 -144076 -9971 160533 -128585 -10953
10782 49001 246051 46584 263259 -238122 -183491 57099 -101593 12435 -126371 -162669 -123754
10771 -123754 -110710 105220 157073 39117 164777 56367 -89183 -244304 145562 254226
10761 254226 -54654 -125130 -40144 -48536 -74147 -56725 -429855 -353504 -126591 22291 -251616
10749a818r4831r2037l55937c0975J34p1935j26725B00856C8357f709m7996B2661
10736B17620a3763I6140a48020l7981Q2581q3023A9749d3936E0298J87985g8486
10724a48638d706A25466m9587J81218a69036b5580j42871m61247B9214a59092
10713A14323i5132d0970j38320m5031h7310j34046G4701c28611a01586j88640
10703b90226j30095a42371o88B48486a70292H4364a59044m3740b8491m56649A33694
10691a08449B89836a41855I7477a22974E3201b95660A6644b09485E743J44278
10681A50021n5765P8623c83740f4886j88558F2285J70137b90509j62335K00403
10671b52441i4575a5393j84541m1562A14627a00661E5430L07207A13314B869Q1838
$$ plain form
10749 -1818 -96649 -188686 -544623 -30975 -30841 -102776 -229501 200856 38357 -6709 -54705 22661
10736 217620 -13763 96140 -148020 -186001 -103420 -186443 19749 -43936 50298 238283 -78486
10724 -148638 -4706 125466 75879 257097 -169036 -25580 -168451 -629698 29214 -159092
10713 114323 -95132 -40970 -179290 -224321 -87310 -221356 74701 -328611 -101586 -290226
10703 -290226 -420321 -142371 -143059 248486 -170292 84364 -159044 -202784 -28491 -485140 133694
10691 -108449 289836 -141855 97477 -122974 53201 -295660 16644 -209485 5743 150021
10681 150021 94256 172879 -383740 -64886 -253444 62285 232422 -290509 -452844 -252441
10671 -252441 -94575 -15393 -199934 -241496 114627 -100661 55430 362637 113314 2869 84707
10660H4707D517f7487k9656j98975j03975C95030a93477O7448j5055A41983m2039
10649I9944e873K728o0552k0080J4375p2110A08540C5450K3415b67477a17072
10637A5261a89474I4072g1179B46786h5301A99900f0257n1208H1509a00047q8175
10626a88222E4526a51224K9947j72191j57287a41791j6693B80038h5973d1901
10615a01378K2065n6823j02518a6251n1144A3434a529j41502l1881A03336e6401
10603a43414B03336a96048M9853O3764A06665R7623h6012q1116G5310a2535j3354
10592b5889B47325B8676j2734a0649j46828B1829K9180b9147H6851b78102O9569
10581b08533B166a06855c2703j8845G8216a84508j28603h1923B8451c29695B37898
$$ plain form
10660 84707 4517 -67487 -97143 -296118 -400093 395030 -193477 -126029 -141084 141983 99944
10649 99944 -5873 -3145 -63697 -83777 -69402 -141512 108540 35450 58865 -267477 -117072
10637 15261 -189474 94072 -71179 246786 -85301 199900 -60257 -111465 81509 -100047 -188222
10626 -188222 54526 -151224 -121277 -293468 -450755 -141791 -158484 280038 -85973 -41901
10615 -101378 -79313 -136136 -238654 -16251 -67395 13434 -1529 -143031 -174912 103336 -56401
10603 -143414 203336 -196048 -146195 -82431 106665 204288 -86012 -167128 75310 -12535 -25889
10592 -25889 247325 28676 15942 -10649 -157477 21829 51009 -29147 86851 -278102 -208533
10581 -208533 2166 -106855 -32703 -51548 78216 -184508 -313111 -81923 28451 -329695 237898
10569F8993a66789L5053N2334B929K99858A31143d9851j07286j08191C10722A6512
10557B81114I7075D8285J3632a41920a4507p3422B03366C1198P0186m5705J34404
10546A90083b7514k12935e6815M366l3781j51747c9970J8048B41848b32799H2895
10534A48401b01800O7877j67044g7360k02022A41520a51342c1406k84567h2587
10523E6029Q8088C6041D902K75177A1714a43740A02839c32281A5544e6020r5944
10512a51964A83531a88883M3112o325A6894a21910A72701c12672B2401a38656
10501I3947C6200I23b95139a7446D2688c5810o9056D7198O2534e6172A25059e5282
10488F8205b4836D4116J631J354i9617A07284c4894p2283A62732B5848O4125a34548
$$ plain form
10569 68993 -166789 -131736 -79402 2929 302787 131143 -49851 -157137 -265328 310722 16512
10557 281114 97075 48285 61917 -141920 -14507 -87929 203366 31198 101384 55679 190083
10546 190083 -27514 -240449 -56815 -52449 -86230 -237977 -39970 -21922 241848 -232799 82895
10534 148401 -201800 -133923 -300967 -77360 -279382 141520 -151342 -31406 -315973 -82587
10523 56029 144117 36041 4902 280079 11714 -143740 102839 -332281 15544 -56020 -151964
10512 -151964 183531 -188883 -145771 -152096 16894 -121910 172701 -312672 22401 -138656
10501 93947 36200 923 -295139 -17446 42688 -35810 -104866 47198 109732 -56172 125059 -55282
10488 68205 -24836 44116 45747 47101 -99617 107284 -34894 -107177 162732 25848 89973 -134548
10475A14488a44745C13613q2461r0401J94599b61197j82682D36441j07328a57056
10464a46571a6051l13817B98798a59590O5718A27084K6192o9667K7371h0120m5215
10453a25335j25695A45425b42740j06986A10009a24514q9077B70686a76854n9865
10443b36719p4748A80402g8539j15940i1521a1898l16448B58d81641c0338A5581
10431b51617A6892J57124b36101N2438b9536o395A73659f7828k09367A79537D6591
10419C83152b26078C1876h4689l68816B34474F7620c5949A4281a61676P2987C20472
10407A75528h2780E7332J5725b01495A49781a70122I9200c1586h112j98730d6521
10395F3627c5000D25917i429j26774B45591p3787B9230J30953b24280A53518E4066
$$ plain form
10475 114488 -144745 313613 231152 140751 335350 -261197 -443879 436441 329113 -157056
10464 -146571 -16051 -329868 298798 -159590 -93872 127084 153276 83609 110980 -80120 -125335
10453 -125335 -251030 145425 -242740 -349726 110009 -124514 -213591 270686 -176854 -236719
10443 -236719 -311467 180402 -78539 -194479 -91521 -11898 -328346 258 -481641 -30338 15581
10431 -251617 16892 174016 -236101 -183663 -29536 -35931 173659 -67828 -277195 179537 46591
10419 383152 -226078 31876 -84689 -453505 234474 67620 -35949 14281 -161676 -88689 320472
10407 175528 -82780 57332 73057 -201495 149781 -170122 99200 -31586 -8112 -206842 -46521
10395 63627 -35000 425917 -9429 -136203 245591 171804 29230 160183 -224280 153518 54066
10383A49889J2268J25399H7270J59207f8776D27140D1006K76206o5032A02728
10372E33918k03406O3908j80545J56700b472D65750j67183J69545j42241P0381
10362C96252j44411N9842F3093M0671L15114J32085A60050O3908J90392C6470
10351D14791A78414J59119o4324J75584j78200L7434J5900M4874J00241B10652
10340C5352h9186b3694B60894J25610J35894B09841H1940R5459J3217a520j80097
10329a81617B85729j23979n9099j986a48338B51213A20384B9451J58050q5670
10319A01831i4703A72137K87430e675B09035e7379A1887e5861j16999G3628b7726
10307c23759G6510K38024d7611a4176A5302c00174B9364K37793p6370B6174d0341
$$ plain form
10383 149889 162157 287556 87270 246477 -68776 427140 41006 317212 252180 102728
10372 533918 330512 394420 213875 370575 -2472 465750 298567 468112 325871 396252
10362 396252 251841 311683 63093 103764 418878 550963 160050 223958 414350 36470
10351 414791 178414 337533 273209 448793 270593 308027 323927 368801 469042 210652
10340 35352 -89186 -23694 260894 386504 522398 209841 81940 177399 190616 -1520 -181617
10329 -181617 285729 161750 102651 100665 -148338 251213 120384 29451 187501 101831
10319 101831 -94703 172137 459567 -5675 209035 -57379 11887 -55861 -172860 73628 -27726
10307 -323759 76510 314534 -47611 -14176 15302 -300174 29364 267157 190787 26174 -40341
10295C604K9677a88207o9122A37032J18275f7772o1943j98967A72889p8466N3796
10284A48219c40029a1286A248a8782C0802g9530p9747K9704j62407e5528D7860
10272E9014a17696A70963E0643J12208a37453B39330B7085a3107B45685F6515
10261g4054E2916M0040a39972D1558h0622b204j32941B14217b0234A83389A9783
10249G1832C5589c0019k5796b3120b617A65575h6695l03177a72957m220I4584
10237B00658a01546k25352h8822l218k6527e3164j64436k466j1250J09388M4223
10226g7705h042j46737P5043E4947k3718J25696a11531k88808I4536a56263e9824
10214b0272k86886F8641e0431l8045H9001a40880q3566D0559h0490A34878c0065
$$ plain form
10295 3604 33281 -188207 -257329 137032 255307 -67772 -129715 -328682 172889 94423 148219
10284 148219 -340029 -11286 1248 -18782 30802 -79530 -159277 -129573 -291980 -55528 47860
10272 59014 -117696 170963 50643 162851 -137453 239330 27085 -13107 245685 66515
10261 -74054 52916 92956 -139972 41558 -80622 -2204 -135145 214217 -20234 183389 19783
10249 71832 35589 -30019 -55815 -23120 -2617 165575 -86695 -389872 -172957 -177177 94584
10237 200658 -101546 -326898 -88822 -92040 -118567 -53164 -217600 -220066 -231316 -121928 -77705
10226 -77705 -8042 -154779 -79736 54947 31229 156925 -111531 -400339 94536 -156263 -59824
10214 -20272 -307158 68641 -50431 -88476 89001 -140880 -224446 40559 -80490 134878 -30065
10202B3976h7342F0426c29412F9167J1330a88893Q1127j14087D5417A485e9857
10190a18705j74995h239k0667o2177j71066f1887a7420E1057a4097j96795f3566
10178B55409A5505c31451H7966g628k7373l10391B833g868A20771a65906Q2441
10167h3465a9057j69263N5182a6460k7923k05796h0578K3467r7768B64337p1221
10156A93116K4922g2847r2464q3853M6554K2111j14812A39221L1455B0192J04432
10145A24624f3701A13839a35510A6749J54417a71051A0460J00026a01444a5315
10134b28197D5815b46524L3200p9531j28693A44544C1821J59002M9640C6332a40517
10122b23099A40275e4414A420J81244b60489i6365a8577j04714L6578j3564q754
$$ plain form
10202 23976 -87342 60426 -329412 69167 80497 -188893 -107766 -221853 45417 1485 -59857
10190 -118705 -293700 -8239 -28906 -91083 -262149 -61887 -17420 51057 -14097 -210892 -63566
10178 255409 15505 -331451 87966 -7628 -35001 -345392 2833 -7868 120771 -165906 -83465
10167 -83465 -19057 -188320 -133138 -16460 -44383 -250179 -80578 -57111 -154879 264337 193116
10156 193116 218038 -72847 -165311 -249164 -202610 -180499 -295311 139221 170676 20192 124624
10145 124624 -63701 113839 -135510 16749 171166 -171051 10460 110486 -101444 -15315
10134 -228197 45815 -246524 -213324 -292855 -421548 144544 31821 190823 240463 36332 -140517
10122 -223099 140275 -54414 1420 182664 -260489 -96365 -18577 -123291 -86713 -100277 -109031
10111a09031D53b41202A8102a79299i50A794J37698K04618g695o9640b6027l42686
10099c68713D5302c98894a11098A28411J4545a27012j05088G9206a79578n9194
10089b38772I2739J24936b31831i0255B19343a71121A34592a09613f54q3894r5403
10078a79951j09492D5809K851e3551k33462a1106l90901a49068A1821a66097d375
10066g8831I4360K9924a81041A86638n8390D7036b88871C9345a69113n1770f8171
10054e9338j62276h2663F5441k8909N78g7987j54533J5677c3075k0666C7264a07862
10041a63438B20884c12944F6326f2291E5070k6519e35677b07646q6477l4682a57384
10029h819j97359k4696e1898E8317b03969j731N3321L5587K4989A20130a91279
$$ plain form
10111 -109031 453 -241202 18102 -179299 -950 1794 139492 344110 -7695 -77335 -26027 -368713
10099 -368713 45302 -398894 -111098 128411 142956 -127012 -232100 79206 -179578 -238772
10089 -238772 92739 217675 -231831 -90255 219343 -171121 134592 -109613 -654 -84548 -179951
10078 -179951 -289443 45809 48660 -53551 -287013 -11106 -402007 -149068 11821 -166097 -4375
10066 -78831 94360 124284 -181041 186638 128248 47036 -288871 39345 -169113 -220883 -68171
10054 -59338 -221614 -82663 65441 36532 37110 -77987 -232520 -216843 -33075 -53741 37264 -107862
10041 -163438 220884 -312944 66326 -62291 55070 28551 -535677 -207646 -294123 -328805 -157384
10029 -8819 -206178 -230874 -51898 58317 -203969 -205700 -152379 -116792 -91803 120130 -191279
10017a80557j43984b5391m8435m3428D079b57060e4978b0756B76965A06123O139
10006A12262j8700O9928f7351B00471D7235R010a61260L7368A75421E0979h0626
9994b94325B64555a63142A29165b49561J00851A51688p1753O8613b94770J44347
9984a50423I3820a07950P331j22852j68327h8514J6780K9946o961A17717c53664
9972A17887m1593i5110j62040b2018m3489A66762a39428A81190c66072e5884k06755
9961b62639P1037f8745m02702b02555G2625a13032C3942f659m1748k17124A50787
9949b40092k59389C7796c12232A34126a39175j48793a04322A13633b54182J15788
9939a38394j56568G9428C5482c6571A35968b01233h4282F7448b84284J03830B50464
$$ plain form
10017 -180557 -324541 -25391 -73826 -117254 4079 -257060 -54978 -20756 276965 106123 112262
10006 112262 93562 163490 -67351 200471 47235 56245 -161260 -123892 175421 50979 -80626
9994 -294325 264555 -163142 129165 -249561 -148710 151688 79935 148548 -294770 -150423
9984 -150423 93820 -107950 -100619 -223471 -391798 -88514 -71734 -41788 -48749 117717 -353664
9972 117887 76294 -95110 -257150 -22018 -65507 166762 -139428 181190 -366072 -55884 -262639
9961 -262639 -191602 -68745 -471447 -202555 72625 -113032 33942 -6659 -48407 -265531 150787
9949 -240092 -499481 37796 -312232 134126 -139175 -287968 -104322 113633 -254182 -138394
9939 -138394 -294962 79428 35482 -36571 135968 -201233 -84282 67448 -284284 -180454 250464
9927b84017E38933B7439Q8411A7133i8029J9493A82724d3140B0286a10842H4183
9915d5714J4915A53802b15467A41688a51803E8170a24981r2091d6806b0041j46354
9904a66395P0832A54969f5768l8292B1130J3933a26719j69037J47789N1088n1366
9893a48245d3078J144p5953a0186A50203b54698M4505o8065D7919a87413C7263
9881c16408c8189A76608d61806i6429k86556k4875A1847K56254a88670B87303
9870a36599A30409E039J8034b27474A40621a81172L8344j19082i5614B3866J0181
9859C4047D552J26901F4366k1658J20179c7988j23051D9912J46242j4331g8728
9847b71548j5224A23921J62592a1547A63506a57319A50428d35198b973A15774
$$ plain form
9927 -284017 538933 27439 115850 17133 -98029 -78536 182724 -43140 20286 -110842 84183
9915 -45714 -30799 153802 -215467 141688 -151803 58170 -124981 -217072 -46806 -20041 -166395
9904 -166395 -95563 154969 -65768 -104060 21130 35063 -126719 -295756 -147967 -96879 -148245
9893 -148245 -43078 -41934 -117887 -10186 150203 -254698 -210193 -278258 47919 -187413 37263
9881 -316408 -38189 176608 -461806 -96429 -382985 -407860 11847 268101 -188670 287303
9870 -136599 130409 5039 23073 -227474 140621 -181172 -142828 -261910 -95614 23866 34047
9859 34047 4552 131453 64366 42708 162887 -37988 -161039 49912 196154 181823 -78728
9847 -271548 -286772 123921 286513 -11547 163506 -157319 150428 -435198 -2973 115774
9836b04485N8163b1328n0671k17240C0078a52031I724b88319l2113B46472b51225
9824g0834o7693A49892a60660k30715i1421j04101E5524b118l8690k5840j00848
9813a67496A78804b04548A05916a72882j05900B73812c3509E32129a50831r5570
9803b46401A4030c6468k7503j11409A61942G2511d19383Q9056H3764b02809l06016
9792e08825N8326B4159b34381L7809E7745a57126B16543a60085j44371J06083
9782a98373k20800B19153b82232A19692a59066E7342b47679l3331c1999p8526
9772a10525A24297M7465a35328B47839a04643M4583j06059f1302p9928j36298
9762b77528b5211k25464J16955q2268N8794B9728a53620k22O2712J4088q7025
$$ plain form
9836 -204485 -146322 -21328 -71999 -289239 30078 -152031 9724 -288319 -320432 246472 -251225
9824 -70834 -138527 149892 -160660 -391375 -91421 -195522 55524 -2118 -40808 -66648 -167496
9813 -167496 178804 -204548 105916 -172882 -278782 273812 -33509 532129 -150831 -246401
9803 -246401 14030 -36468 -63971 -175380 161942 72511 -419383 -330327 83764 -202809 -508825
9792 -508825 -450499 24159 -234381 -196572 57745 -157126 216543 -160085 -304456 -198373
9782 -198373 -419173 219153 -282232 119692 -159066 57342 -247679 -281010 -31999 -110525
9772 -110525 124297 171762 -135328 247839 -104643 -60060 -166119 -61302 -141230 -277528
9762 -277528 -25211 -250675 -133720 -215988 -157194 29728 -153620 -153842 -91130 -77042 -164067
9751a64067M3264o1599j32099a51771j23996C22162e1639B7739h6958l096j34993
9740b25047c4337j08231j16974B02792b58791H9245O946J28339q8258c88349A02448
9728H3428M3516a34425m7927A79370a94865O7757e3701H961M2562a36389B28069
9716c84532h6235E1697J05624f9307k24802A03318b23208O721N3757j614A44802
9704h5653j35008M473a4982j47222H6204b17339d159j67458a1422j18570A37117
9692a79187R288h4614d0864A11440a8905o7276r4063n8020g09j17286A41158h7738
9679A10095b43441j3077a11125L9634C5224g2961H6051g1536j71063e8834j13515
9668a72349j34550J36507J7319A8715d3799A42483I800L62926c52163J15139a00419
$$ plain form
9751 -164067 -120803 -182402 -314501 -151771 -275767 322162 -51639 27739 -86958 -90054 -225047
9740 -225047 -34337 -142568 -259542 202792 -258791 89245 96191 224530 136272 -388349 102448
9728 83428 126944 -134425 -182352 179370 -194865 -127108 -53701 8961 51523 -136389 228069
9716 -384532 -86235 51697 157321 -69307 -294109 103318 -223208 -216487 -162730 -164344 144802
9704 -85653 -220661 -216188 -14982 -162204 86204 -217339 -4159 -171617 -11422 -129992 137117
9692 -179187 -169899 -84614 -40864 111440 -18905 -86181 -180244 -238264 -709 -117995 141158 -87738
9679 110095 -243441 -256518 -111125 -71491 35224 -72961 86051 -71536 -242599 -58834 -172349
9668 -172349 -306899 -170392 -153073 18715 -43799 142483 9800 372726 -352163 -237024 -100419
9656c73697Q1724Q2843j00116d8938b743G4859e15650h4500c1340A08694g511
9644f1490k32038A04813L11336a77416o6725N0907H6703l6440J30015B0741h6328
9632b61697A58602c394A10206K95320c75448A7496b40162g1830P176k26419j9056
9621c10129J1124A9113b09251C4331a17708j70158B91609a19328B38703d76030
9610g8624E2675L97391D4527l560g5815A2265d3798l22536a29304p851D5158J9161
9598F4319f6674j7153J292E0551h8825j62707H809c5834l68173J22015a02990
9586A02416P3921b1360i394B12961h5777a1407B61680a00706B7352h3300J554
9575h1746A83448b96957a44321L4734D8599K1939M8696m9773J66881J11706C2732
$$ plain form
9656 -373697 -291973 -209130 -309246 -48938 -2743 74859 -515650 -84500 -31340 108694 -7511
9644 -61490 -293528 104813 416149 -177416 -244141 -193234 86703 50263 180278 20741 -86328
9632 -261697 158602 -3394 110206 405526 -375448 17496 -240162 -71830 -64654 -291073 -310129
9621 -310129 -299005 19113 -209251 34331 -117708 -287866 291609 -119328 238703 -476030
9610 -78624 52675 450066 44527 40967 -75815 12265 -43798 -366334 -129304 -137155 45158 64319
9598 64319 -66674 -83827 -82535 50551 -88825 -251532 8809 -35834 -404007 -281992 -102990
9586 102416 176337 -21360 -9394 212961 -85777 -11407 261680 -100706 27352 -83300 -81746
9575 -81746 183448 -296957 -144321 -109587 48599 70538 119234 69461 236342 348048 32732
9563a81464A55761l4375b82669B06781J87400a57942c0748j20913E8896J46574
9553B05470e7358A08009g7376B43854b03151O8376a001r6600A41979e25225B2219
9541d265C2702c60401O6152h3380j12623B9125d61052a35869L8220C3398c0965
9529d7068l47726H0651a31292C01853b57108f5640C5951e274k31088R8224j67998
9518c06136c2798B6910J4308a17694p7389n1408a09645K2950a1359A7551a66121
9506a89249a4408r830l28041L641a49396E4819c25979A8803b06753E6524b93168
9494a93812j89867a23941B443b30136A36322P6440a9681d284A6225J21737h5493
9482g1098c0612j71347O4613b3411j15597O2669j794K8847r7094j9624F3077b64407
$$ plain form
9563 -181464 155761 121386 -282669 206781 394181 -157942 -30748 -151661 58896 205470
9553 205470 -57358 108009 -77376 243854 -203151 -134775 -1001 -97601 141979 -525225 22219
9541 -4265 32702 -360401 -294249 -83380 -196003 29125 -461052 -135869 -97649 33398 -30965
9529 -47068 -394794 80651 -131292 301853 -257108 -65640 35951 -5274 -236362 -138138 -306136
9518 -306136 -32798 26910 41218 -117694 -195083 -246491 -109645 -86695 -11359 17551 -166121
9506 -189249 -14408 -24238 -352279 -348638 -149396 54819 -325979 18803 -206753 56524 -293168
9494 -193812 -383679 -123941 2443 -230136 136322 212762 -19681 -4284 16225 137962 -85493
9482 -71098 -30612 -201959 -137346 -23411 -139008 -76339 -78133 -49286 -146380 -166004 63077 -264407
9469B04246J04776a43049G7076a61380m8260B09836E7709a7169o3411H6967k5026
9458F1941Q9545c02915a35115N9612o652B16676D9172K20608E4545d66643m1308
9447e07951C19061a85418L6699k97198K0948I4062c09770e7455j80043I9311a45523
9435f8324A72962L2532a77374H124i821A12073b36902I1313a89080F9782K02618
9424B72400a67358f1781l47907A0950a52456B9302R4275c3238q1680A82625o45
9413A81980j5908c6811j56483p6376A21299g3390j91561A09744N7022g9905G1641
9401b18242P2128I998a13128n1762J5475A01764i0775r9818B6315a49239A03722
9389a53130A6591K3942L38358d767C5824a11354B9698a50013H7293C2645b49182
$$ plain form
9469 204246 309022 -143049 77076 -161380 -209640 209836 57709 -17169 -80580 86967 61941
9458 61941 151486 -302915 -135115 -75503 -82155 216676 49172 269780 54545 -466643 -507951
9447 -507951 319061 -185418 -148719 -445917 -424969 94062 -309770 -57455 -237498 99311 -145523
9435 -68324 172962 205494 -177374 8124 -9821 112073 -236902 91313 -189080 69782 272400
9424 272400 -167358 -61781 -409688 10950 -152456 29302 123577 -33238 -114918 182625 181980
9413 181980 166072 -36811 -193294 -269670 121299 -73390 -264951 109744 166766 -79905 71641
9401 -218242 -146114 9998 -113128 -164890 -149415 101764 -90775 -190593 26315 -149239 103722
9389 -153130 16591 40533 378891 -4767 35824 -111354 29698 -150013 87293 32645 -249182
9377E1647j5363J2629d06114J80925A87323a03736j34846e8437b4803k18272l0822
9366b73897F6535b44438i3692B22619c5817m1099k09274C42816a07410j14097
9356b21507C16453a82048f601m0378j72512c520q8537B10118c7992D6191B2745
9344a39703j5323G4790b17564f7198A90127k0989a48759D2943b04646D7206a8426
9332B47556b32573c3355n644m3929j5832B7857a0888k51194B14105a75837R569
9321a66268I745c6161k42571b9731D8731J70206a35240l99j5594j5111B3771J54225
9309A77996b36832E3387c14814a55653A6815B396f9322A35761c5042k18949P0710
9298a83281J0655f2854k11710Q2043F3280K9116a05761q0744E9479O5347a44734
$$ plain form
9377 51647 36284 48913 -406114 -225189 187323 -103736 -238582 -58437 -24803 -243075 -273897
9366 -273897 66535 -244438 -93692 222619 -35817 -76916 -286190 342816 -107410 -221507
9356 -221507 316453 -182048 -6601 -46979 -219491 -3520 -92057 210118 -37992 46191 22745
9344 -139703 -155026 74790 -217564 -67198 190127 169138 -148759 42943 -204646 47206 -18426
9332 247556 -232573 -33355 -38999 -82928 -98760 27857 -10888 -262082 214105 -175837 -166268
9321 -166268 9745 -36161 -278732 -29731 48731 218937 -135240 -135639 -151233 -166344 23771 177996
9309 177996 -236832 53387 -314814 -155653 16815 2396 -69322 135761 -35042 -253991 -183281
9298 -183281 -172626 -62854 -274564 -192521 63280 92396 -105761 -186505 59479 124826 -144734
9286F946a39354q7039c3213k57902h8175j1741B4827d29668e2414j73174J2344
9275b13244A00643C4611b89355j11248A09628a72599f897C9744c7051F2038C186
9263f9784j23000j76963a70832E082J43606b45757f5730a3586G7597B1627b90088
9251a2052k95327C3286i524A58436p7808d0594C5080J73169A4036g082D9667J8210
9239F7877K02266c6167j03704J7711M8510J4882m15882d0617m19197I2311a82404
9227c0910B60839b07309A93364f0457j95959e2358B2766c38173A64593A0120k669
9216G451g3573k01233b9327j37683c7025j51750A3706J63910b45092d3860p9812
9205a23672l7795O9109I6608d1823B70039a75851B5058b22795h15A21470f8764
$$ plain form
9286 6946 -139354 -226393 -33213 -291115 -88175 -99916 24827 -429668 -52414 -225588 -213244
9275 -213244 100643 34611 -289355 -400603 109628 -172599 -6897 39744 -37051 62038 3186
9263 -69784 -192784 -369747 -170832 5082 148688 -245757 -65730 -13586 77597 21627 -290088
9251 -12052 -307379 33286 -9524 158436 80628 -40594 35080 208249 14036 -7082 49667 67877
9239 67877 270143 -36167 -139871 -122160 -73650 -58768 -474650 -40617 -459814 92311 -182404
9227 -30910 260839 -207309 193364 -60457 -256416 -52358 22766 -338173 164593 10120 7451
9216 7451 -73573 -274806 -29327 -167010 -37025 -188775 13706 177616 -245092 -43860 -123672
9205 -123672 -161467 -92358 96608 -41823 270039 -175851 25058 -222795 -815 121470 -68764
9193b860j67121I180a65015b3718j18414G9473i5487c2158O85j38121P9564L7671
9181e2359l4093b1327o4444A15065d9086q890m9297F4117e6726B2822J4663J08761
9169A46246a53063k79827e1327I5891m2140b58498Q885M6299C77050a90483A2244
9157B39976R3146a63966A38379b4111j91808K6212g7017j01285A43973J0201c1254
9145b10624N3554b9589A28264m1964a96567b2439k19368j4084D5794A0996B784
9133a41026K6441d7387J6704j32774a3822C92265a17931g457q0443l7785e7647
9121g4940n5529f990a573l68578h7667A6378J47435F4823a53605D3753k1273d6620
9108B92582c3307B9509a87474e5759E4216d0197l55709g8807l1475k61882C6819
$$ plain form
9193 -2860 -169981 9180 -165015 -23718 -142132 79473 -95487 -32158 -31473 -169594 -90030 -52359
9181 -52359 -86452 -21327 -85771 115065 -49086 -57976 -107273 64117 -56726 22822 37485 146246
9169 146246 -153063 -432890 -51327 95891 53751 -258498 -249613 -203314 377050 -190483 12244
9157 239976 333122 -163966 138379 -24111 -215919 -189707 -77017 -178302 143973 154174 -31254
9145 -210624 -157070 -29589 128264 86300 -196567 -22439 -241807 -255891 45794 10996 2784
9133 -141026 -114585 -47387 -30683 -163457 -13822 392265 -117931 -7457 -87900 -125685 -57647
9121 -74940 -130469 -6990 -1573 -370151 -87667 16378 163813 64823 -153605 43753 22480 -46620
9108 292582 -33307 29509 -187474 -55759 54216 -40197 -395906 -78807 -110282 -372164 36819
9096a14445j2117q8080O4881f5541A30507b1420B08901A0645i5327k8346l43658
9085d67331I0932d538l40864r6856c3945l3269B3364J10000A9909J15672n4426
9074H1155e3520I2284d41476e952j91031j03695E7941c9607j6149l96001a25344
9062a19564r5322a0051j55504p1274B4044b27184A6580b6248A01812B6726O886
9051C3612a04422A43180f3502a2064j03153p1453A49678i2776B80903a53694B03401
9039b88939B08904G7883j8426K65930b975n3940A12047a18254C8887J58978b54464
9027i5553A83524d9850j04636P5776o0199H780a04626E7742b50957I8642L0528
9016A29170a78167A38819a72549C1270b4336m9066K9088j06698k2157g4604B65902
$$ plain form
9096 -114445 -126562 -214642 -149761 -65541 130507 -21420 208901 10645 -95327 -123673 -467331
9085 -467331 90932 -4538 -345402 -442258 -33945 -67214 23364 133364 19909 135581 81155
9074 81155 -53520 92284 -441476 -5952 -196983 -300678 57941 -39607 -55756 -451757 -125344
9062 -119564 -214886 -10051 -165555 -236829 24044 -227184 16580 -26248 101812 26726 33612
9051 33612 -104422 143180 -63502 -12064 -115217 -186670 149678 -92776 280903 -153694 203401
9039 -288939 208904 77883 59457 325387 -2975 -56915 112047 -118254 38887 197865 -254464
9027 -95553 183524 -49850 -154486 -78710 -138909 8780 -104626 57742 -250957 98642 129170
9016 129170 -178167 138819 -172549 31270 -24336 -73402 -44314 -151012 -173169 -74604 265902
9004c0519o8561F6808c9356E975h5382l03470A28075a19096B9263d6176A31909
8992b54904A33641h767n9687m34039I1622m3901i1903I8944F118J59498b17878
8980a3758r6196j21687J11514k40732A20082a18667G0743g0185j90073N2322Q1027
8969a26909B5645a82072H2565b01993C6662J04420B275J73725a60249q8216c8905
8957a76928r7106f3771I6399J71661b18132C54940f1877j02362A05096m5749A4229
8945b4536l7909E8494a23196l2629a4246k65013k94563g3578F1401a40988k53047
8934c94035C207a41952K3046A85628p9637e4658B82854A21211a49539I2021a73753
8922h5694B31739B3694L41298h948B43198L1320b11742i9083L7481n7415j37564
$$ plain form
9004 -30519 -99080 66808 -39356 5975 -85382 -388852 128075 -119096 29263 -46176 131909
8992 -254904 133641 -8767 -68454 -502493 91622 47721 -91903 98944 6118 165616 -217878
8980 -13758 -109954 -231641 -120127 -360859 120082 -118667 70743 -70185 -260258 -207936 -126909
8969 -126909 25645 -182072 82565 -201993 36662 141082 2275 176000 -160249 -248465 -38905
8957 -176928 -274034 -63771 96399 268060 -218132 354940 -61877 -164239 105096 59347 14229
8945 -24536 -62445 58494 -123196 -155825 -14246 -279259 -573822 -73578 61401 -140988 -394035
8934 -394035 3207 -141952 -118906 185628 105991 -54658 282854 121211 -149539 92021 -173753
8922 -85694 231739 23694 364992 -8948 243198 274518 -211742 -99083 -61602 -119017 -256581
8911b56581Q6583A3026h672j11131A30375A927N6122h9547L0528r7320N4051j72695
8899b74983a22517m4874e458k46908d4515l03493a73202K3721B1847a39143E1625
8887b8841A8961a59359l6074n4911B659b94232a35145r9657i9931A1996g9895
8875A1945M3149c56705Q8945a25361A86902F3559c2147n8426d0946A2691N716
8864A8407b85961G6968I168J81700i4927A32938c05052B44145a47056f1361l55295
$$ plain form
8911 -256581 -169998 13026 -8672 -119803 130375 1927 58049 -89547 -59019 -156339 -102288 -274983
8899 -274983 -122517 -167391 -5458 -252366 -44515 -348008 -173202 -149481 21847 -139143 51625
8887 -28841 18961 -159359 -195433 -250344 2659 -294232 -135145 -234802 -99931 11996 -79895
8875 11945 55094 -356705 -267760 -125361 186902 63559 -32147 -90573 -40946 12691 18407
8864 18407 -285961 76968 9168 190868 -94927 132938 -305052 244145 -147056 -61361 -416656
$$ [...]
##END NTUPLES=NMR SPECTRUM
##END=
