##TITLE=NES1050_10427_9270609_61D8CKfaId
##JCAMPDX= 6.0         $$ Bruker NMR JCAMP-DX V2.0
##DATA TYPE= NMR SPECTRUM
##DATA CLASS= NTUPLES
##ORIGIN= BRUKER
##OWNER= Administrator
$$ 1.72 TOPSPIN		Version 2.1
$$ 2015-07-18 19:35:44.947 -0700  Administrator@X
$$ Compression mode = diff/dup
##.OBSERVE FREQUENCY= 400.02188249412
##.OBSERVE NUCLEUS= ^1H
##.ACQUISITION MODE= SIMULTANEOUS (DQD)
##.ACQUISITION SCHEME= undefined
##.AVERAGES= 8
##.DIGITISER RES= 22
##SPECTROMETER/DATA SYSTEM= spect
##.PULSE SEQUENCE= zg30
##.SOLVENT NAME= COFFEE_meoh
##.SHIFT REFERENCE= INTERNAL, COFFEE_meoh, 1, 14.98509
##AUDIT TRAIL= $$ (NUMBER, WHEN, WHO, WHERE, PROCESS, VERSION, WHAT)
$$ ##TITLE= Audit trail, TOPSPIN		Version 2.1
$$ ##JCAMPDX= 5.01
$$ ##ORIGIN= Bruker BioSpin GmbH
$$ ##OWNER= Administrator
$$ $$ E:\/data/COFFEE/nmr/NES1050_10427_9270609_61D8CKfaId/30/pdata/1/auditp.txt
$$ ##AUDIT TRAIL=  $$ (NUMBER, WHEN, WHO, WHERE, PROCESS, VERSION, WHAT)
(   1,<2015-07-18 19:35:37.432 -0700>,<Administrator>,<X>,<go>,<TOPSPIN 2.1>,
      <created by zg
	started at 2015-07-18 19:34:31.635 -0700,
	POWCHK enabled, PULCHK disabled,
       configuration hash MD5:
       21 0F 79 D6 B3 7B B4 F6 88 20 88 DB 03 48 BD 9F
       data hash MD5: 64K
       04 BF A3 0D 49 9C C5 60 47 B4 08 49 BE AB 67 CA>)
(   2,<2015-07-18 19:35:40.760 -0700>,<Administrator>,<X>,<proc1d>,<TOPSPIN 2.1>,
      <Start of raw data processing
       efp LB = 0 FT_mod = 6 PKNL = 1 PHC0 = 0 PHC1 = 0 SI = 32K 
       data hash MD5: 32K
       01 28 AE 67 0C E7 3C 50 9C 5A ED BB B9 4B 74 2A>)
(   3,<2015-07-18 19:35:41.072 -0700>,<Administrator>,<X>,<proc1d>,<TOPSPIN 2.1>,
      <pk PHC0 = 87.29736 PHC1 = 0 
       data hash MD5: 32K
       EC 8B C2 03 14 AE C2 E7 67 AA CA B6 05 F0 F6 19>)
(   4,<2015-07-18 19:35:41.182 -0700>,<Administrator>,<X>,<proc1d>,<TOPSPIN 2.1>,
      <abs ABSG = 1 
       data hash MD5: 32K
       CC CB 83 92 6E 43 24 F2 1D 0C CB 19 30 36 BA E8>)
(   5,<2015-07-18 19:35:41.244 -0700>,<Administrator>,<X>,<proc1d>,<TOPSPIN 2.1>,
      <abs ABSG = 2 
       data hash MD5: 32K
       AA 8C DE 17 92 89 AA CB 91 7D 1E C9 18 28 AA 4F>)
(   6,<2015-07-18 19:35:41.307 -0700>,<Administrator>,<X>,<proc1d>,<TOPSPIN 2.1>,
      <abs ABSG = 3 
       data hash MD5: 32K
       B0 4A 9F 96 40 C0 33 1C DB F3 26 51 AA 49 55 04>)
(   7,<2015-07-18 19:35:41.369 -0700>,<Administrator>,<X>,<proc1d>,<TOPSPIN 2.1>,
      <abs ABSG = 4 
       data hash MD5: 32K
       03 64 D9 B6 EC FD DE 51 D0 60 2D 71 3A 8D BE 12>)
(   8,<2015-07-18 19:35:41.432 -0700>,<Administrator>,<X>,<proc1d>,<TOPSPIN 2.1>,
      <abs ABSG = 5 
       data hash MD5: 32K
       DE 24 64 44 12 7C 79 59 7F EB CA C8 DC 51 7F 0A>)
$$ ##END=
$$ 
$$ $$ hash MD5
$$ $$ EF DD EB 3C C1 32 D8 3F 35 5F 39 C1 6F 06 93 4B
##$RELAX= 
##$RELAX= 
##$RELAX= 
##$RELAX= 
##$RELAX= 
##$RELAX= 
##$RELAX= 
$$ Bruker specific parameters
$$ --------------------------
##$DU= <E:\>
##$EXPNO= 30
##$NAME= <NES1050_10427_9270609_61D8CKfaId>
##$PROCNO= 1
$$ [...]
150 150 150 150 150 150 150 150
##$TP07= 0
##$TPNAME0= <>
##$TPNAME1= <>
##$TPNAME2= <>
##$TPNAME3= <>
##$TPNAME4= <>
##$TPNAME5= <>
##$TPNAME6= <>
##$TPNAME7= <>
##$TPOAL= (0..7)
0.5 0.5 0.5 0.5 0.5 0.5 0.5 0.5
##$TPOFFS= (0..7)
0 0 0 0 0 0 0 0
##$TUNHIN= 0
##$TUNHOUT= 0
##$TUNXOUT= 0
##$USERA1= <user>
##$USERA2= <user>
##$USERA3= <user>
##$USERA4= <user>
##$USERA5= <user>
##$V9= 5
##$VALIST= <valist>
##$VCLIST= <CCCCCCCCCCCCCCC>
##$VD= 0
##$VDLIST= <DDDDDDDDDDDDDDD>
##$VPLIST= <PPPPPPPPPPPPPPP>
##$VTLIST= <TTTTTTTTTTTTTTT>
##$WBST= 2048
##$WBSW= 25
##$XGAIN= (0..3)
0 0 0 0
##$XL= 0
##$YL= 0
##$YMAX_a= 564436
##$YMIN_a= -484044
##$ZGOPTNS= <>
##$ZL1= 120
##$ZL2= 120
##$ZL3= 120
##$ZL4= 120
##$ABSF1= 14.98509
##$ABSF2= -5.573092
##$ABSG= 5
##$ABSL= 3
##$ALPHA= 0
##$AQORDER= 0
##$ASSFAC= 0
##$ASSFACI= 0
##$ASSFACX= 0
##$ASSWID= 0
##$AUNMP= <proc_prof1d_extract_pilot.lims>
##$AXLEFT= 0
##$AXNAME= <>
##$AXNUC= <1H>
##$AXRIGHT= 0
##$AXTYPE= 0
##$AXUNIT= <>
##$AZFE= 0.1
##$AZFW= 0.1
##$BCFW= 0
##$BC_mod= 0
##$BYTORDP= 0
##$COROFFS= 0
##$CY= 15
##$DATMOD= 1
##$DC= 0
##$DFILT= <>
##$DTYPP= 0
##$F1P= 0
##$F2P= 0
##$FCOR= 0.5
##$FTSIZE= 32768
##$FT_mod= 6
##$GAMMA= 0
##$GB= 0
##$INTBC= 1
##$INTSCL= 1
##$ISEN= 128
##$LB= 0
##$LEV0= 0
##$LPBIN= 0
##$MAXI= 10000
##$MC2= 0
##$MEAN= 0
##$ME_mod= 0
##$MI= 0
##$NCOEF= 0
##$NC_proc= -8
##$NLEV= 6
##$NOISF1= 0
##$NOISF2= 0
##$NSP= 0
##$NTH_PI= 0
##$NZP= 0
##$OFFSET= 14.98509
##$PC= 1
##$PHC0= 87.29736
##$PHC1= 0
##$PH_mod= 1
##$PKNL= yes
##$PPARMOD= 0
##$PPDIAG= 0
##$PPIPTYP= 0
##$PPMPNUM= 2147483647
##$PPRESOL= 1
##$PSCAL= 4
##$PSIGN= 0
##$PYNMP= <proc.py>
##$REVERSE= no
##$SF= 400.02
##$SI= 32768
##$SIGF1= 0
##$SIGF2= 0
##$SINO= 400
##$SIOLD= 32768
##$SPECTYP= <>
##$SREGLST= <1H.CDCl3>
##$SSB= 0
##$STSI= 32768
##$STSR= 0
##$SW_p= 8223.68421052631
##$SYMM= 0
##$S_DEV= 0
##$TDeff= 65536
##$TDoff= 0
##$TI= <>
##$TILT= no
##$TM1= 0
##$TM2= 0
##$TOPLEV= 0
##$USERP1= <user>
##$USERP2= <user>
##$USERP3= <user>
##$USERP4= <user>
##$USERP5= <user>
##$WDW= 1
##$XDIM= 32768
##$YMAX_p= 449497857
##$YMIN_p= -706052
##$CURPLOT= <Network HP LaserJet P1505>
##$CURPRIN= <$Network HP LaserJet P1505>
##$DFORMAT= <normdp>
##$LAYOUT= <+/1D_H.xwp>
##$LFORMAT= <normlp>
##$PFORMAT= <normpl>
##$SURQMSG= 1
$$ End of Bruker specific parameters
$$ ---------------------------------
##NTUPLES= NMR SPECTRUM
##VAR_NAME=  FREQUENCY,     SPECTRUM/REAL,   SPECTRUM/IMAG
##SYMBOL=    X,             R,               I
##VAR_TYPE=  INDEPENDENT,   DEPENDENT,       DEPENDENT
##VAR_FORM=  AFFN,          ASDF,            ASDF
##VAR_DIM=   32768,         32768,           32768
##UNITS=     HZ,            ARBITRARY UNITS, ARBITRARY UNITS
##FACTOR=    0.250966925370066, 1,           1
##FIRST=     8223.43324360094, 12059,        -164265
##LAST=      0,             -39956,          -116591
##MIN=       0,             -706052,         0
##MAX=       8223.43324360094, 449497857,    0
$$ Real data points
##PAGE= N=1
##DATA TABLE= (X++(R..R)), XYDATA
$$ [...]
19502b215A91234a82227o9926a16662j0730a0165k87440O3901D469O5318d84136
19490I1100a30452A46020a55487c3790j47339A129b95216a47004M7036j0393k4733
19479a35094j91134A01268A9356C022c23271A15661e7545K3391q6145C44194b04251
19467f7651a044j99855P6351C06944B1131d7481j56181A4639J24274b29607C9217
19455a76081m8654d082k46714B74815b01961n2729B53021g485k45098d3116k54881
19444b97997J27013B74832c18585C820J80321b53878k4058L2946a05893B24541
19433a22004K1079a0463k7523k3861j73879B16800j5134G2634c3332A91274b5046
19421f4299E7449P1816e9763A5370K48294a14447A34126k2578j4823l6383a77979
$$ y = [-2215, 191234, -182227, -252153, -116662, -127392, -10165, -297605, -233704, 4469, 69787, -484136, 91100, -130452, 146020, -155487, -33790, -181129, 1129, -295216, -147004, -99968, -110361, -135094, -326228, 101268, 19356, 3022, -323271, 115661, -57545, -34154, -120299, 344194, -204251, -67651, -1044, -200899, -124548, 306944, 21131, -47481, -203662, 14639, 138913, -229607, 39217, -176081, -224735, -4082, -250796, 274815, -201961, -254690, 253021, -7485, -252583, -43116, -297997, -170984, 274832, -318585, 3820, 184141, -253878, -277936, -244990, -105893, 224541, -122004, -100925, -10463, -37986, -61847, -235726, 216800, 201666, 72634, -33332, 191274, -25046, -64299, 57449, 129265, -59763, 15370, 263664, -114447, 134126, 111548, 96725, 60342, -177979]
19409A32365A0591a22802I6773A9367a43474e7730j08148e4892n5585k11392P6881
19398b44988B22131a91210I8551b01982B00785k9913M3403b12988k23458J80871
19388b55575i8852H8786C4368e0183p3551f0434B8507b44843J2811d8888B0781
19376a27249r3413p7398c0561R916E9586Q4764B5363a0769A29680e9898j65238
19365b25136d9340B16910a27071e0762k99588C24547g7209l79734A54092h6914
19354b30584M0637b9950j19878G0084e0965A22266f9900o7050F2784N6980f6639
19342a73815C04621a44761n1526g6953o1710a0611B07061r2118Q093a95899J6943
19331a78956B6009a05467B1181a71969A20512c18873F379b6858B42090c87154
$$ y = [132365, 10591, -122802, 96773, 19367, -143474, -57730, -165878, -54892, -110477, -321869, -244988, 222131, -191210, 98551, -201982, 200785, 170872, 214275, -212988, -436446, -255575, -98852, 88786, 34368, -50183, -123734, -60434, 28507, -244843, -232032, -48888, 20781, -127249, -220662, -298060, -30561, -20645, 59586, 144350, 25363, -10769, 129680, -59898, -225136, -49340, 216910, -127071, -50762, -350350, 324547, -77209, -456943, 154092, -86914, -230584, -189947, -29950, -149828, 70084, -50965, 122266, -69900, -136950, 62784, 119764, -66639, -173815, 304621, -144761, -196287, -76953, -138663, -10611, 207061, 114943, 123036, -195899, -178956, 26009, -105467, 21181, -171969, 120512, -318873, 6379, -26858, 242090, -387154]
19320i3872B32224a47542k758j9732I5547a81554j04344B51080c57800B9202J07474
19309A36676J82642A6625a43947n0302R5886d981m36413L7404e4370l4670a7948
19297a69269d0056l27129a32483m29613i4987j4739k9960j71510A14014g0876
19286B23059f0822B14848h8099j34520A42549c5740r654j413H2399a81668F2024
19274B66466A25563a93175A44498a96481A16974b28907D4312h8503j07606j12912
19264c09021d9570A668J44417a4985D2553c72609J78701k9000q827A78275n6505
19253A21770a14821h694o6035K5146o9670d8054H0584d23353G7697b0399E3672
19241A42146g2067k14086i9693B56430a306j89495j40584E5260d6194j2582L983
$$ y = [-93872, 232224, -147542, -150300, -170032, 95547, -181554, -285898, 251080, -357800, 29202, 136676, 319318, 16625, -143947, -194249, -98363, -4981, -441394, -403990, -54370, -89040, -17948, -169269, -40056, -367185, -132483, -562096, -94987, -109726, -139686, -311196, 114014, -70876, 223059, -60822, 214848, -88099, -222619, 142549, -35740, -45394, -46807, 82399, -181668, 62024, 266466, 125563, -193175, 144498, -196481, 116974, -228907, 44312, -88503, -196109, -309021, -49570, 1668, 146085, -14985, 42553, -372609, -193908, -222908, -231735, 178275, 121770, -114821, -8694, -74729, -49583, -119253, -48054, 80584, -423353, 77697, -20399, 53672, 142146, -72067, -286153, -99693, 256430, -1306, -190801, -331385, 55260, -46194, -58776, -54793]
19230e4793A5802J29136M093d824j02879j54257A28417f479j24038B3083M7365
19219G0448K79278a13662H3506K23107C6444h077j055M06j93991F6838A7492R716
19207B7208i3000k8432n1927N2084q4450J01853M4133r5672P4518j5672j31156
19196b27721h8643l32519a35506C23039c42252f7185B03138a77505M8889c8552
19185c2504k93931A11645a10497l07502a01558M4089j57636J615f3038j22760
19175a85798K3644f7095A33325a18455A01896J29713g9907B25217f2214j40428
19165b02642F0148a30072E6156b51211J7449C36398a85472h8946k15193h5865
19154a36701A8991a30405E6484e5605F7894c12567B23435a65241B1842K50305
$$ y = [-54793, 15802, 144938, 149031, -4824, -107703, -261960, 128417, -6479, -130517, 23083, 70448, 349726, -113662, 83506, 306613, 36444, -8077, -9132, -8726, -202717, 66838, 17492, 27208, -93000, -121432, -173359, -121275, -205725, -103872, -59739, -155411, -80893, -96565, -227721, -88643, -421162, -135506, 323039, -342252, -67185, 203138, -177505, -128616, -38552, -32504, -326435, 111645, -110497, -417999, -101558, -57469, -215105, -213490, -63038, -185798, -162154, -67095, 133325, -118455, 101896, 231609, -79907, 225217, -62214, -202642, 60148, -130072, 56156, -251211, -233762, 336398, -185472, -88946, -304139, -85865, -136701, 18991, -130405, 56484, -55605, 67894, -312567, 223435, -165241, 21842, 272147]
19144B72147H5669a29237n9938E1633J16483a53278L823M5666B15665j07277i4987
19132a60046j85942J65930I931a4609B04317c5760j47339Q846A74537c37772e7228
19120a26914J4575L9759A06246l140d974H6578b11060K4505C02483j31539c3941
19108G061i3233b2650I5103b88143N0915r2374D145a29139A44730o1647e9371
19096a10563e4699A15149a32584B54926c24182a35742j7093A4520i8253b3040
19085a17968j28536n3265E3976c34899L8424J11218P1882G6791h3048b3920j15458
19074a39378B24183e0188H4511a08540M005A22131N6135c73269c8864G2111b26595
19062a1616A03752i2320j05514C0219h8042L8482A78483a69442r0011D3904M3107
$$ y = [272147, 85669, -129237, -189175, 51633, 168116, -153278, -149455, -103789, 215665, 108388, -94987, -160046, -345988, -180058, 9931, -14609, 204317, -35760, -183099, -174253, 174537, -337772, -57228, -126914, -112339, -72580, 106246, 103106, -4974, 86578, -211060, -186555, 302483, 170944, -33941, 7061, -93233, -22650, 95103, -288143, -237228, -329602, 4145, -129139, 144730, 83083, -59371, -110563, -54699, 115149, -132584, 254926, -324182, -135742, -152835, 14520, -98253, -23040, -117968, -246504, -299769, 53976, -334899, -296475, -185257, -113375, 76791, -83048, -23920, -139378, 224183, -50188, 84511, -108540, -104535, 122131, 178266, -373269, -38864, 72111, -226595, -11616, 103752, -92320, -197834, 30219, -88042, -49560, 178483, -169442, -259453, 43904, 87011]
19051H7011J97000f2651g438j73796P1094r5753E5542a6025k25787B44393c41723
19039b81159e8901B19902d3208o3212F5099a0132k31619d5585n2133q3009M1585
19028a39142A30498b05257k0974K3779A23391b50259d5783j60960B98930I3280
19017C79329e8234q6919A18212a18181C18925d4597C6779b7641j66852A57647
19006H3514f3411o170B07301g5667m1954c5723n5734o9458a3446F1980c95306
18994a11619b5250I9487a68444b335j24806L2211M697M1896j50283R2145A24531
18982H5481a29234A81083e16821A18417C3856b78005B36518q2087J2511J84867
18972C51809H0015M40085K42105A95834c3005A46336c09878B6784j150e0518A02087
$$ y = [87011, 284011, -62651, -7438, -181234, -110140, -205893, 55542, -16025, -241812, 244393, -341723, -281159, -58901, 219902, -43208, -106420, 65099, -10132, -241751, -45585, -97718, -180727, -139142, 130498, -205257, -226231, -202452, 123391, -250259, -45783, -206743, 298930, 93280, 379329, -58234, -145153, 118212, -118181, 318925, -44597, 36779, -27641, -194493, 157647, 83514, -63411, -69581, 207301, -75667, -117621, -35723, -91457, -160915, -13446, 61980, -395306, -111619, -25250, 99487, -168444, -2335, -127141, -94930, -90233, -48337, -198620, -106475, 124531, 85481, -129234, 181083, -516821, 118417, 33856, -278005, 236518, 154431, 166942, 351809, 80015, 520100, 762205, 195834, -33005, 146336, -309878, 26784, 25634, -50518, 102087]
18960c2990k47702B07262j0509K2279a0831A4581M09498b77871N5005r3005a38243
18948F7839J13308E4374i9892F3720N3718a50008N8670A14301a00328k82031J84316
18937a98043A59428o5395l0655b07872M9691C24087e703E7323L09940B8399b00524
18925h3106B05688r7396a9338A2061c5027A56604j5105a3185j1265A13794i7824
18913a61932j03545f4587E2345L6263j6292M39384J68756k46244A65196l761C7552
18901A97035B5265L40687b69755E5217d7854k9542k8143D4470a04092J6401k11027
18890b98718J24674l87733I0570b0548q2619k9354p8625C5331b00658e366j39676
18879a45042I411J06903i0558F284L7711J19439c13602h8930j49151a13840A1000
$$ y = [-32990, -280692, 207262, 196753, 219032, -10831, 14581, 424079, -277871, -222866, -315871, -138243, 67839, 181147, 54374, -99892, 63720, 117438, -150008, -91338, 114301, -100328, -382359, -198043, 159428, 94033, 63378, -207872, -158181, 324087, -5703, 57323, 367263, 28399, -200524, -83106, 205688, 108292, -19338, 12061, -35027, 156604, 141499, -13185, -24450, 113794, -97824, -161932, -265477, -64587, 52345, 88608, 72316, 511700, 680456, 434212, 165196, 161435, 37552, 197035, 25265, 365952, -269755, 55217, -47854, -77396, -105539, 44470, -104092, -87691, -298718, -174044, -561777, 90570, -20548, -103167, -132521, -211146, 35331, -200658, -5366, -145042, 9411, 116314, -90558, 6284, 43995, 163434, -313602, -88930, -238081, -113840, 11000]
18867g5312C2203e08276H0715k0102j2079K4536b07040m6787g3452F3428d13541
18855F4470c12951B1520J29072a92071A65430a04615p507B56266b09378h8531
18844b61346D5963b55937Q6439B8456a67738g4169A2518K88239c64958B08080
18833h3954A06933b16006k1208a7706k6674j26024j35974g2109p7257A77206a94187
18821a46152j4827j8251C3390b50241a13381A72750J13079f3658L878O646m3672
18810i6806r1410o3251a9169C04943B0016b28496n7022a2848k13986C164d29752
18798I9297b01407N6534O2587j25445b6615G1103c66279L0432B109i4173c3942
18786b86404A86375b7973o4071B6155K73036h9151c1394j83529l1946j35433a03815
$$ y = [-75312, 32203, -508276, 80715, 60613, 48534, 73070, -207040, -253827, -73452, 63428, -413541, 64470, -312951, 21520, 150592, -192071, 165430, -104615, -112122, 256266, -209378, -88531, -261346, 45963, -255937, -169498, 28456, -167738, -74169, 12518, 300757, -364958, 208080, -83954, 106933, -216006, -237214, -17706, -44380, -170404, -306378, -72109, -149366, 177206, -194187, -146152, -160979, -179230, 33390, -250241, -113381, 172750, 285829, -63658, -59780, -53134, -96806, -188216, -251467, -19169, 304943, 20016, -228496, -285518, -12848, -226834, 3164, -429752, 99297, -201407, -144873, -82286, -207731, -26615, 71103, -366279, -335847, 2109, -94173, -33942, -286404, 186375, -27973, -92044, 26155, 299191, -89151, -31394, -214923, -246869, -382302, -103815]
18774b25974M249a2E6834b4949o9375a8291E4889a14278C7174b3925B03135i8108
18761a25855J9440k02685D5817a74618D5411c4819j46320B2629Q4256m8657h4543
18749a52303m0293K7004D3192A2518b36713R5904C9122a6348o308o5230j40878
18738b28764B03266a54689h309c921k28045g8810L6018q8091B04121b57810B22840
18726B5277i9810j1809l444d3422j21841A50806h7103m4780J1168o3367e6403
18714A14476b09999D57082e0744F6942e3396k12916d6950j63062g705l17572C01800
18702a1811k30106J19189P185C3823M5699a33906H7845L6181J1290a4748l32169
18691c46917F307d1707l59119J42890j15535c4595j25780F3940a64063A07308
$$ y = [-225974, -221725, -12, 56834, -24949, -94324, -18291, 54889, -114278, 37174, -23925, 203135, -98108, -125855, -106415, -309100, 45817, -174618, 45411, -34819, -181139, 22629, 106885, 58228, -84543, -152303, -192596, -165592, 43192, 12518, -236713, -140809, 39122, -16348, -22656, -87886, -228764, 203266, -154689, -8309, -3921, -231966, -78810, -42792, -130883, 204121, -257810, 222840, 25277, -99810, -111619, -115063, -43422, -165263, 150806, -87103, -131883, -120715, -184082, -56403, 114476, -209999, 457082, -50744, 66942, -53396, -266312, -46950, -210012, -7705, -325277, 301800, -11811, -241917, -122728, -115543, 33823, 79522, -133906, 87845, 124026, 135316, -14748, -346917, 6307, -41707, -400826, -257936, -373471, -34595, -160375, 63940, -164063, 107308]
18680E4502a3849k5214G4603R184a03679q2642e4730a4057k11844d9504B2537
18668F1615a00475l0504e9182o7301k36896b9626A36742i401j92759c3030k20642
18657b53672J06939r8430a17494D2572P0556K9991a57906D786e7679k73314F283
18645A59897h4950E488K62930a20958B73751b5490C1140c58354a07009n6782I4278
18633a29487k36289H5621b43774B85K9538c7070B80236b4338k29477A25204b1715
18621c34117B20101R0290B3168a0655A9874b81006a16091j65974h1750o458B0495
18609b4907E7866A286b16933e0377j73851A32440a67986j03970r4369H1348k4400
18598E6948i3652C4948J96990b90653C49703a0352p0812j53167g546j87564j728
$$ y = [54502, -13849, -39063, 74603, 83787, -103679, -186321, -54730, -14057, -225901, -49504, 22537, 61615, -100475, -130979, -59182, -126483, -363379, -29626, 136742, -9401, -202160, -33030, -253672, -146733, -245163, -117494, 42572, 113128, 143119, -157906, 4786, -57679, -330993, 6283, 159897, -84950, 5488, 268418, -120958, 273751, -25490, 31140, -358354, -107009, -163791, 94278, -129487, -365776, 85621, -243774, 285, 29823, -37070, 280236, -24338, -253815, 125204, -21715, -334117, 220101, 310391, 23168, -10655, 19874, -281006, -116091, -282065, -81750, -88208, 20495, -24907, 57866, 1286, -216933, -50377, -224228, 132440, -167986, -271956, -366325, 81348, 56948, -93652, 34948, 231938, -290653, 349703, -10352, -81164, -234331, -7546, -195110, -196838]
18587a96838A46608C3584P4421a62879c3009l9870K2960C14819A43717b60971
18576A01152a69751A67594b7254l5207A0032c33350A44065O3562b26775I3655
18565a12884j85697A7969c92798J88319E6563b69018a14680k25799b5917G5198
18554a70889C5495j3810c98521a41369c2853a853B61314c28298g44j75370o9361
18543b45475H1121d3732k74051C36114a58843B04573e8350C89047a62483p3702
18533b36185B19075a90028e6331a5505j68938j15546B56950a4167H0117a93126
18522F7682g8990D6389a91929F131c9929j3075K1927B3090a7991B7738N5265l1244
18510E1759e11186A9113J47236G600K3168a07727c4035A73127a44242n5075j5987
$$ y = [-196838, 146608, 33584, 108005, -162879, -33009, -72879, -49919, 314819, 143717, -260971, 101152, -169751, 167594, -27254, -62461, 10032, -333350, 144065, 207627, -226775, 93655, -112884, -298581, 17969, -392798, -204479, 56563, -269018, -114680, -340479, -25917, 75198, -170889, 35495, 21685, -398521, -141369, -32853, -1853, 261314, -328298, -744, -176114, -245475, 81121, -43732, -317783, 336114, -158843, 204573, -58350, 389047, -162483, -236185, 219075, -190028, -56331, -15505, -184443, -299989, 256950, -14167, 80117, -193126, 67682, -78990, 46389, -191929, 6131, -39929, -53004, -31077, 23090, -17991, 27738, 83003, 51759, -511186, 19113, 166349, 7600, 30768, -107727, -34035, 173127, -144242, -199317, -215304]
18499b15304j24795I2107a32253c1920j79521Q7131I7456a49551a007A06225B0727
18487b15527A49912D9347J42307b29337j5212Q9175P1309k5284l84936J75336
18477c18949H6642b29241d1086j32907G7313C8276J42848a72558b243n318j32341
18466a39902e4146A50241a78259A24750k7433a01229K4308j46367j9577A09977
18455i2923E0385Q8873m4877a70297J6354B73129c8985P948l33252B0308a53791
18443a70619h1649A75637b23500A64120b0170c089r0517p0382B14908B5520b57429
18431e6126m3493C660b78744j6565A2703L73107B6275b33561L0103G2866b18445
18419b19011B69827B7636a01369L7093I6113a28561G5692a0347B15798b48581
$$ y = [-215304, -340099, 92107, -132253, -31920, -211441, -124310, 97456, -149551, -1007, 106225, 20727, -215527, 149912, 49347, 191654, -229337, -244549, -155374, -84065, -109349, -494285, -318949, 86642, -229241, -41086, -173993, 77313, 38276, 181124, -172558, -2243, -7561, -139902, -54146, 150241, -178259, 124750, 97317, -101229, -76921, -223288, -242865, 109977, -92923, 50385, 139258, 94381, -170297, -153943, 273129, -38985, -31037, -364289, 20308, -153791, -170619, -81649, 175637, -223500, 164120, -20170, -3089, -93606, -163988, 214908, 25520, -257429, -56126, -99619, 3660, -278744, -295309, 12703, 385810, 26275, -233561, -203458, 72866, -218445, -219011, 269827, 27636, -101369, -64276, 96113, -128561, 75692, -10347, 215798, -248581]
18408A56738a12075l06672a8767B41023D6085J40375a28805B90665l6275j20156
18398A34234C4887J47165a8376j39857j34564A29845a51815c3945F6573J02582
18388A69155c46032Q4085B4584J8372g5734j41852k35179f0656B07565l6536p6508
18377I4521c0463B18262b20382I96J14335k7020c02453J48909g683j06385E0876
18365E8285A1737b08767q23B3683b57847m2723A53565m0986h5072m7499B39615
18353g8045p5321f3941A1164K0574J21895b48646h448j28896E6796K86453b89887
18341A69901a43246f9210B67749M9927C065J57051O2580o8103C9349J55407d13915
18329E3040k114a58592C6487M9033c9052A62719N0432a34885b09j31630G9455
$$ y = [156738, -112075, -418747, -18767, 241023, 46085, 186460, -128805, 290665, 254390, 134234, 34887, 182052, -18376, -158233, -292797, 129845, -151815, -33945, 66573, 169155, -346032, -261947, 24584, 42956, -75734, -217586, -452765, -60656, 207565, 171029, 94521, -30463, 218262, -220382, 996, 115331, 88311, -302453, -153544, -7683, -114068, 50876, 58285, 11737, -208767, -209590, 23683, -257847, -300570, 153565, 112579, -85072, -132571, 239615, -78045, -153366, -63941, 11164, 31738, 153633, -248646, -8448, -137344, 56796, 343249, -289887, 169901, -143246, -69210, 267749, 317676, 3065, 160116, 222696, 154593, 39349, 194756, -413915, 53040, 50926, -158592, 36487, 85520, -39052, 162719, 213151, -134885, -209, -131839, 79455]
18317A05123a94414i3001n5226j56942h5659q4033B8861L26680b4744l7521o4492
18306a26757E050M7917e0494D5806O1300L4982a49175k51880C4897a30825d9629
18294a01999A56141m6953C4148b10649R5119j46702A27370b61681I6655L0883
18284A27538a49318B8721i8629J9303B29861a14666A55098d4056r3969I2235b06222
18272a66784o5298A10395c26178A33506K2052J7332J7743q1440a11444C29369
18261a34386k64733A67013c90743a91725i850j87200j25051f2410j50329B28524
18250a79146B99484E1593N9477a34641A58877J3406a58379k53355g633j5554E9851
18238i6445M1684j65460g2714o5249G0642R7890c27669c5704P363A6424L5288
$$ y = [105123, -194414, -93001, -148227, -305169, -85659, -169692, 28861, 355541, -24744, -62265, -126757, 5050, 52967, -50494, 45806, 107106, 142088, -149175, -401055, 34897, -130825, -49629, -101999, 156141, 109188, 34148, -210649, -115530, -262232, 127370, -261681, 96655, 127538, -149318, 28721, -98629, -79326, 229861, -114666, 155098, -44056, -138025, 92235, -206222, -166784, -232082, 110395, -326178, 133506, 155558, 172890, 190633, 109193, -111444, 329369, -134386, -399119, 167013, -390743, -191725, -9850, -197050, -322101, -62410, -212739, 228524, -179146, 299484, 51593, 111070, -134641, 158877, 172283, -158379, -411734, -7633, -23187, 59851, -96445, -54761, -220221, -72714, -137963, 70642, 168532, -327669, -35704, -28341, 16424, 51712]
18227E1712M607Q7840f3406H9105d1878j13590r7488a6382C879Q6082C5643a09668
18214b10078n1105B72893k5792J36569b83327A82976i3501B14771e75898a14198
18203b7946C8609b44703A9280M2626j5882b2124H3743M0489b6603H6365a30026
18191c92595M2104g6846j89986A99616q5622M1315N0868n8252I578b65598f2200
18179f9654o2710e0621n5384A68748D7861B1236J4170a8939F2541b2613A57348
18167i8817j64205a5615k43328n6413J24003g0220l3463G8316a91507c8727B17526
18155c6934A2986J03287a00565j23241J06613a9666j28706L5929n4121A12056
18144C8643h9863B69320A28755A3424J27215a86283m3427c3593k33387A32702
$$ y = [51712, 56319, 144159, -63406, 89105, -41878, -155468, -252956, -16382, 3879, 89961, 35643, -109668, -210078, -261183, 272893, 247101, 383670, -283327, 182976, -93501, 214771, -575898, -114198, -27946, 38609, -244703, 19280, 61906, 46024, -22124, 83743, 124232, -26603, 86365, -130026, -392595, -350491, -76846, -266832, 199616, 113994, 155309, 206177, 147925, 9578, -265598, -62200, -69654, -132364, -50621, -106005, 168748, 47861, 21236, 35406, -18939, 62541, -22613, 157348, -98817, -263022, -15615, -258943, -315356, -191353, -70220, -103683, 78316, -191507, -38727, 217526, -36934, 12986, 116273, -100565, -223806, -117193, -19666, -148372, -112443, -166564, 112056, 38643, -89863, 269320, 128755, 13424, 140639, -186283, -229710, -33593, -266980, 132702]
18133F6870a26794C8399c20204j81825A19874b76522C8865c4762B16870c00046
18122a01370G8808b88153g7728j56419E3964b80649A24709J43721F4197L22548
18112C86745C4308J8704b18660a02586k71431O8206j23444j3493H6715b06964
18101a13876A90044O8678g0524l0263l9853k06827F8048b61024e9673A75216c9241
18089a87136A03800J94366A01610E0436M3327b89060A12866J81747b4301F3625
18078A79133a18803A28538l4271f6391k61534b710j12994n7822B96662A8562J96854
18067B15416H2093f9082m2207r7752B14461B4521a42310A05759b0292j7592B6406
18055a87256D6803J5603b75661J06293H1700P0210d1920l7241A81816f2521b0957
$$ y = [66870, -126794, 38399, -320204, -502029, 119874, -276522, 38865, -34762, 216870, -300046, -101370, 78808, -288153, -77728, -234147, 53964, -280649, 124709, 268430, 64197, 386745, 34308, 53012, -218660, -102586, -374017, -305811, -429255, -442748, 86715, -206964, -113876, 190044, 258722, -70524, -100787, -140640, -347467, 68048, -261024, -59673, 175216, -39241, -187136, 103800, 298166, 101610, 50436, 93763, -289060, 112866, 294613, -24301, 63625, 179133, -118803, 128538, 94267, -66391, -327925, -2710, -115704, -173526, 296662, 18562, 215416, 82093, -69082, -111289, -209041, 214461, 24521, -142310, 105759, -20292, -37884, 26406, -187256, 46803, 62406, -275661, -169368, 81700, 151910, -41920, -79161, 181816, -62521, -20957]
18043B56713a90463B40574a05549C9995K75423b8971l01546a39463A53399L6968
18033A90367a19913j69716G7188A1983J01607K00101f9507B32294c57791b8053
18022C8358r518o989a45854G9720a9973q9029A84301a20858J4562N1256o6315
18011a21355C96735d7390D4788a69051g5651C76068A6137g9145F835O5634B2085
17999A74996B034R2011J81863a33335C4163i3684j65717J20081M4244F0055K7268
17988H7323B9261d6648H750a03704a323o9843k97328A75494J5054I4165g2817
17976b0233k70362A44291E7560M3424a84976m9132Q7240E5171e2756b3758k0630
17965d4388I8811b68933b0766o2248A71968p9093J58154A225b01143h3978B1562
$$ y = [256713, -190463, 240574, -105549, 39995, 315418, -28971, -330517, -139463, 153399, 190367, -119913, -289629, 77188, 11983, 113590, 313691, -69507, 232294, -357791, -28053, 38358, 28840, 21851, -145854, 79720, -19973, -109002, 184301, -120858, -106296, -55040, -121355, 396735, -47390, 44788, -169051, -75651, 376068, 16137, -79145, 6835, 72469, 22085, 174996, 2034, 94045, 275908, -133335, 34163, -93684, -259401, -139320, -95076, 60055, 87323, 29261, -46648, 8750, -103704, -1323, -71166, -368494, 175494, 190548, 94165, -72817, -20233, -290595, 144291, 57560, 100984, -184976, -234108, -146868, 55171, -52756, -23758, -44388, 98811, -268933, -20766, -83014, 171968, 92875, 251029, 1225, -201143, -83978, 21562]
17953c5068p8332b7090j99858B37367G9415B1891b03093A03504Q6049b27415A5638
17941h0859B99941a8031m9304A23310a07599A40000d9579E1348c17883B85634
17930A5516K46569j14300N6957b50780A92427a46347A42868l7231a06895C10173
17919c15951D60644b4499q4889K129E5141d3145G7368b64704B24743b92863A17192
17907H0625c5688k08656I1185i6702p2635A15944N0409b3940P787k85352D31105
17895b93145F3885a7083F2699N2024R4724G1359h8080A43693e2446A4084J36890
17884A50974D919b55021i0848F9206a60534c1262j61667h1482j34035g1054D8661
17872B72739f3038D76280D1092c56858G2052l0500a2846A88564c89694a43584
$$ y = [-35068, -113400, -27090, -226948, 237367, 79415, 21891, -203093, 103504, 189553, -227415, 15638, -80859, 299941, -18031, -67335, 123310, -107599, 140000, -49579, 51348, -317883, 285634, 15516, 262085, 147785, 204742, -250780, 192427, -146347, 142868, 105637, -106895, 310173, -315951, 460644, -24499, -109388, -107259, 55141, -43145, 77368, -264704, 224743, -292863, 117192, 80625, -35688, -244344, 91185, -96702, -169337, 115944, 166353, -23940, -16153, -301505, 431105, -293145, 63885, -17083, 62699, 114723, 209447, 71359, -88080, 143693, -52446, 14084, 150974, 4919, -255021, -90848, 69206, -160534, -31262, -192929, -81482, -215517, -71054, 48661, 272739, -63038, 476280, 41092, -356858, 72052, 41552, -12846, 188564, -389694, -143584]
17861b01391a5922n4726b2834G7908a15179o35c7610j51721D1077a05411m3077
17850a48488j5120A91784h2646a8288k51476B05035B7971c6527B21314r0887b6993
17838b93404J11474C6933Q0155a47108e3657j81905A17407J90096a03879F2249
17827a0463A40020a45080E2456a14870r8274i9716A21835J98218A12167A8581
17816f2525C12932j43096i423q0610b7036A10620D3386d0750A30580L02519e3761
17804H2345N5072b33759j28001g334A45186i8744c0478I4155J38873a07028j78954
17793b85982B60343D5556h7907C7918a93282A9189J0561b42915A40044N1008a5492
17781a25504l8631B32434a59465d9409l5207A22531Q902c18409I5605K337g8824
$$ y = [-201391, -15922, -70648, -22834, 77908, -115179, -115814, -37610, -189331, 41077, -105411, -148488, -163608, 191784, -82646, -18288, -269764, 205035, 27971, -36527, 221314, 130427, -26993, -293404, -181930, 36933, 117088, -147108, -53657, -235562, 117407, 307503, -103879, 62249, -10463, 140020, -145080, 52456, -114870, -213144, -99716, 121835, 320053, 112167, 18581, -62525, 312932, 169836, -9423, -90033, -27036, 110620, 43386, -40750, 130580, 433099, -53761, 82345, 137417, -233759, -361760, -7334, 145186, -98744, -30478, 94155, 233028, -107028, -285982, 260343, 45556, -87907, 37918, -193282, 19189, 29750, -242915, 140044, 191052, -15492, -125504, -164135, 232434, -159465, -49409, -84616, 122531, 131433, -318409, 95605, 97942, -78824]
17769A81969J92048b50311C10531H2136n971a5944q8087B85227i1390B63686i904
17757D0855K8676J91874f7533b2816q7560B3742b45042I3087a03426A03379L7863
17746A41242J13353f0463m4648D7872J94317R0365C2116J27447a20670A36669
17735E5557A2558L7715M2570M4154q159E774L1208h7990L5826A78153c388l8465
17723d1853r2648e8517p0694d3766B86168a46113m3919A25141b88808C33822H2072
17711A85042b4200A86036M1859d4051p2130E6973c58234A21522c6072A81190I43
17699C26690G7168g7430a4525A58048f563o076E3652a00069M105b5813C7317g8565
17686D7056L7567J54229J72396I3092L1909L7246h2948A63098a24233B59880a80813
$$ y = [181969, 374017, -250311, 310531, 82136, 76165, -15944, -104031, 285227, -91390, 263686, -9904, 40855, 69531, 261405, -67533, -22816, -110376, 23742, -245042, 93087, -103426, 103379, 141242, 254595, -60463, -105111, 47872, 242189, 332554, 32116, 159563, -120670, 136669, 55557, 12558, 50273, 92843, 136997, 128838, 5774, 36982, -87990, -52164, 178153, -3388, -41853, -134501, -58517, -129211, -43766, 286168, -146113, -190032, 125141, -288808, 333822, 82072, 185042, -24200, 186036, 227895, -44051, -116181, 56973, -358234, 121522, -36072, 181190, 943, 326690, 77168, -77430, -14525, 158048, -6563, -12639, 53652, -100069, -95964, -25813, 37317, -78565, 47056, 84623, 238852, 411248, 93092, 125001, 162247, -82948, 163098, -124233, 259880, -180813]
17674B18909J50283E2772R5988A9360a54309L6175A83474K7817E5239H186L44344
17663C52530r5984k6242f7122B93733O3199G5580d266C45736A08596n752d5601
17651H3852J18779d1236o8722B1568J65427b64008I9890g0174B03378a1830l2970
17640d4800A51476l9022C8754M2058a03553e0907p3722P237D78884m2463B17849
17628E6269d0229A37770o547m0626O7953a06980B59516b27985A81966l0477F7969
17616a3492k5646O914B86278a17945C45807j48153J19959A05936J9510E2725a19093
17604a25611A69320m7341C2155l799J12779h1132D4484J44390b25845B64959P1131
17593C36090F404h9319R379q5763A05515K31004a66202A11485b6078j31374D9936
$$ y = [218909, 369192, 52772, 148760, 19360, -154309, -118134, 183474, 211291, 55239, 8186, 352530, 256546, 230304, -67122, 293733, 356932, 75580, -4266, 345736, 108596, 102844, -45601, 83852, 202631, -41236, -109958, 21568, 186995, -264008, 99890, -70174, 203378, -11830, -44800, 151476, 112454, 38754, 80812, -103553, -50907, -124629, -117392, 478884, 436421, 217849, 56269, -40229, 137770, 131223, 90597, 158550, -106980, 259516, -227985, 181966, 151489, 67969, -13492, -39138, -32224, 286278, -117945, 345807, 197654, 317613, 105936, 125446, 52725, -119093, -125611, 169320, 121979, 32155, 28356, 141135, -81132, 44484, 188874, -225845, 264959, 336090, 6404, -89319, -79940, -165703, 105515, 336519, -166202, 111485, -26078, -157452, 49936]
17581A86079e9904A9619b10872C5446J70789D5557O9982j745f562F4841J09764
17570A74605J7296a35093B29161G0783B227L9599R4915K11739A54258h832A18358
17558d1668b146m4757m97189C07158n7607j7633F048K67343j28935J31074o1552
17547B13978J48157A3252L06910j33785P4688o5652a89545A71701J32243j46534
17537A57410h1114G3099N2206k4656M2603C9987O4366J56927K24823A86612K53825
17526D40437J86560j39509M34936k65763K10522j56608k91985j49402R4531J47188
17516E10907K1877B54204K07339j09875j6571K03693q6942J69887J04275K35011
17506I61021j39450K40889k40859l30546B10035M5821K87963j929B21395J19469
$$ y = [186079, -59904, 19619, -210872, 35446, 206235, 45557, 115539, 113794, -6562, 64841, 174605, 191901, -135093, 229161, 70783, 2227, 41826, 136741, 348480, 154258, -8832, 118358, -41668, -2146, -46903, -544092, 307158, 249551, 231918, 6048, 273391, 144456, 275530, 213978, 362135, 13252, 320162, 186377, 261065, 195413, -189545, 171701, 303944, 157410, -81114, 73099, 125305, 100649, 143252, 39987, 104353, 261280, 486103, 186612, 440437, 626997, 487488, 922424, 656661, 867183, 710575, 418590, 269188, 363719, 510907, 532784, 254204, 461543, 351668, 335097, 538790, 451848, 621735, 726010, 961021, 821571, 1062460, 821601, 491055, 210035, 255856, 543819, 541890, 221395, 340864]
17496C40864j23914R4631A30479L33977r6697R1447k14379A13611L94649j23815
17486C84445o5889r6174i84C79310r2808p2552J05168H4300R7621K7045j217J63291
17474C71040A53439L7677p7517n4518i3874C39889j22626J78011D5688b4383A9926
17462B46519p732j04770L7907K61466F5375J78947F31L67379A32528J22164K00300
17451D54992p2779K3525j11187J37593j69938J85722P707R410K4467A02268J57064
17440B59332J79040j35441m2593I8034N22268B35561K6347p2963K96419j20349
17430C65015l1194A57575J9519B4458M34318j35233J61762j00082j03014R0436
17420C72645p4730J32317A25408K65214j76376Q6948R904R8007J77913k90087
$$ y = [340864, 216950, 311581, 130479, 464456, 367759, 459206, 244827, 113611, 508260, 384445, 318556, 222382, -984, 379310, 286502, 213950, 319118, 84300, 181921, 208966, 207749, 371040, 153439, 191116, 113599, 59081, -93874, 339889, 217263, 395274, 45688, -24383, 19926, 246519, 238787, 134017, 171924, 433390, 65375, 244322, 631, 368010, 132528, 254692, 454992, 382213, 405738, 294551, 432144, 262206, 447928, 455635, 465045, 489512, 102268, 259332, 438372, 302931, 260338, 98034, 620302, 235561, 261908, 188945, 485364, 365015, 333821, 157575, 177094, 24458, 458776, 323543, 485305, 385223, 282209, 372645, 297915, 430232, 125408, 390622, 214246, 301194, 311098, 409105, 587018, 296931]
17410B96931M34562l43317M5392j7176A36093J14045J31790j22048j18230L7773
17400A79423J81065d9375A12078J55543P3602p1493n6596g8720C54675E6245K52607
17389C08852p2346l9349I2090I581L36345m8926j32849J63400o4659p8475J90977
17378C75394j84816k9245R0584j18815m8443R1516F639O1731L07551e747B70007
17366G5064M4150L9148N3467r3969l3213L86497p0784H8037K30586l3045r1371
17355A94207O4924M1416G0161L72695E9345L10114N5704Q2377A26701K9403F3611
17343H3178J52501F9945K26610K02530B21475L1615F3155J96858J60092j11762
17333C08343h742B21360G6940R8769e4341D36404D917K59278E7967J27856g446
$$ y = [296931, 731493, 388176, 433568, 416392, 136093, 250138, 381928, 259880, 141650, 179423, 360488, -49375, 112078, 267621, 341223, 269730, 213134, -78720, 354675, 56245, 308852, 236506, 197157, 92090, 9581, 345926, 297000, 164151, 327551, 262892, 184417, 375394, 190578, 161333, 251917, 133102, 84659, 176175, 6639, 68370, 375921, -5747, 270007, 75064, 119214, 158362, 211829, 117860, 84647, 471144, 400360, 88037, 318623, 285578, 194207, 259131, 300547, 70161, 442856, 59345, 369459, 425163, 507540, 126701, 156104, 63611, 83178, 235679, 69945, 296555, 499085, 221475, 253090, 63155, 260013, 420105, 308343, -8742, 221360, 76940, 175709, -54341, 436404, 4917, 264195, 57967, 185823, -7446]
17321D68125H1880K24341a5490A4102J59437a05903A69868l6904J37545I9672
17310b82304C19112q4153J41162M2974c7886B28058N588L4232r8491L11923A88401
17298B90420H9691J17355g4799B99158q0838M9521q3756L18307l1898k31922n2063
17287A86509K76362A23088P8177r6744J58456Q9927J41197A10627L41409c1724
17276D50244j81424j607A1854K84280p6470J51607C0849K95899m4786b4170A46347
17264B51282R5340e6245C10840j40312J01771A09081K39556r758m0072J46259
17254D45066A30245J48533K3852A09415J59071k7941m6373J51970J66850A32147
17243B59812k5768j07914J75187a3250B53565M0190K18319D1121L77053A89138
$$ y = [468125, 81880, 306221, -15490, 14102, 173539, -105903, 169868, 132964, 270509, 99672, -282304, 319112, 234959, 376121, 419095, -37886, 228058, 233646, 267878, 169387, 481310, 188401, 290420, 89691, 207046, -74799, 299158, 218320, 267841, 184085, 502392, 470494, 238572, 186509, 462871, 123088, 201265, 104521, 262977, 352904, 494101, 110627, 452036, -31724, 450244, 268820, 267213, 11854, 296134, 219664, 371271, 30849, 326748, 281962, -24170, 146347, 251282, 346622, -56245, 310840, 170528, 272299, 109081, 348637, 338879, 298807, 445066, 130245, 278778, 302630, 109415, 268486, 240545, 194172, 346142, 512992, 132147, 259812, 234044, 126130, 301317, -13250, 253565, 293755, 512074, 41121, 418174, 189138]
17232C51312A63668Q4670k4655J44015P7062j18717G9050K27010J34305I1064
17221D68708M5167j56597r3261J80564K30919B8505J44292D8971N02508A78268
17210C64939A00940L81650R012k16754K65459B52492J32827j51589o7P5034K34963
17199E43660A36645L18494J7160k4578B07048K49888q9995J32888J63404C03286
17188E42020K16471B15257N66079C88427j62779O4858r8466J32633j47314M43353
17178F20712k92952K5588Q601m2669j957N3948M5791J66212O02k47767k3122K44874
17166E57861j12666A08277N61444k4180B05294K00328J28220j6917j2527k2449
17156D81949Q3340j97842N20591k18417N394j20033m7701j08467J99061A66916
$$ y = [351312, 163668, 248338, 223683, 367698, 444760, 326043, 79050, 306060, 440365, 91064, 468708, 513875, 357278, 264017, 444581, 675500, 28505, 172797, 48971, 551479, 178268, 364939, 100940, 482590, 491602, 274848, 540307, 252492, 385319, 233730, 233663, 308697, 543660, 136645, 455139, 472299, 447721, 207048, 456936, 366941, 499829, 663233, 303286, 542020, 758491, 215257, 781336, 388427, 225648, 290506, 192040, 324673, 177359, 620712, 327760, 353348, 361949, 319280, 317323, 371271, 417062, 583274, 583876, 336109, 312987, 557861, 445195, 108277, 669721, 645541, 205294, 405622, 533842, 516925, 504398, 481949, 565289, 367447, 888038, 669621, 675015, 554982, 507281, 398814, 597875, 166916]
17145F58485k90613L70515j79429j05202P1137Q4761m9448p2437J29425j73499
17135D43695J69113j22686r0211J40025K16549l55630J42824o5505J05280B56569
17124E33961J59691j09197j35067o250P3670J44146K95542l42316r5040J25716
17114F44856P6295O5390r8572J601m7137O4452A71476K71143J79640n5718O508
17103E73049K90269m21489J06002L07259j34245j83868J5314K81748D03520L76529
17093G80049k17347K25086k17454M3546r4393O3397L77997m20678J34003j7565
17083F56641J14441j2478k32935L0783K03872k76047J238J39621K17189l05307
17073E37018O8238o5678K43740l36103K31354j36973J27485l9966J15891o7645
$$ y = [658485, 367872, 738387, 558958, 453756, 524893, 609654, 560206, 487769, 617194, 443695, 612808, 490122, 399911, 539936, 756485, 400855, 543679, 478174, 583454, 256569, 533961, 693652, 584455, 449388, 443138, 516808, 660954, 956496, 614180, 519140, 644856, 721151, 786541, 687969, 689570, 642433, 706885, 171476, 442619, 622259, 566541, 573049, 863318, 441829, 547831, 855090, 720845, 536977, 552291, 834039, 403520, 780049, 562702, 787788, 570334, 613880, 519487, 582884, 960881, 540203, 674206, 656641, 771082, 758604, 525669, 556452, 760324, 484277, 485515, 625136, 842325, 537018, 605256, 539578, 783318, 447215, 678569, 541596, 669081, 629115, 745006, 677361]
17063F77361L02153l69450P7355k03735j56664K58002J05830o4387P9366N3213
17053G59044O4459j30392N386K89602k94937M43825l76884M4090j58440L2671
17043F78424K91428m47701L12309m7641J66954o1021j05307j59765K63238j45631
17033G45287J13064l69660M73455o5244K68348j37687l12546J09416L06073k44797
17023H85709l6470n136J33396O0653M8868j26657K12465P2622l49881J51697J00019
17012A147285J38340K30764m89578j97390N03210l74125J53360l30976K01449
17003I82339K27170N6716r1500k43018K17037P9801K2672j8488l66828L09164
16993A175065P4485j87762K27115p6656O5548j4782L13006o15999O34387l03637
$$ y = [677361, 979514, 610064, 687419, 483684, 327020, 585022, 690852, 626465, 705831, 759044, 823503, 693111, 698497, 988099, 693162, 1136987, 760103, 804193, 645753, 678424, 969852, 522151, 834460, 786819, 953773, 892752, 787445, 627680, 890918, 745287, 858351, 488691, 962146, 896902, 1165250, 1027563, 715017, 824433, 1130506, 885709, 849239, 844103, 977499, 1038152, 1087020, 960363, 1172828, 1245450, 895569, 1047266, 1147285, 1285625, 1516389, 1026811, 829421, 1332631, 958506, 1111866, 780890, 982339, 1209509, 1266225, 1174725, 931707, 1148744, 1228545, 1251217, 1232729, 865901, 1175065, 1249550, 1061788, 1288903, 1212247, 1277795, 1263013, 1576019, 960020, 1594407, 1290770]
16983A290770N7152k37700L17750l13414K75964Q39q4892R0114k43515K34508
16973A387576p0349J44454j50220K8778j52042R3314K3137L23250l24650j0354
16963A292894N26275m74675K01906K37996k15041m0630j28893J61216K9457j22516
16953A467989L71960L5684q3182p8286k41269K75649K4015K88349l68152K69166
16943A961923j7986j03167l08558O51627J3049k17694k53199J30062P0935K38462
16933B165454l92008L57724j38411Q6181p4064K22380k11762l16704N89614p9300
16923B209104M433k7200K44242O5278k41964K47492j65025P692K28706K76896
16913B849654m30576P7724L36496l88800M55605j31166m1183k1866o559K54525
$$ y = [1290770, 1347922, 1110222, 1427972, 1114558, 1390522, 1391361, 1306469, 1396583, 1153068, 1387576, 1317227, 1461681, 1311461, 1340239, 1188197, 1281511, 1304648, 1627898, 1303248, 1292894, 1819169, 1344494, 1546400, 1784396, 1569355, 1528725, 1399832, 1561048, 1590505, 1467989, 1839949, 1875633, 1792451, 1714165, 1472896, 1748545, 1772560, 2060909, 1692757, 1961923, 1943937, 1840770, 1532212, 2183839, 2196888, 1979194, 1725995, 1856057, 1926992, 2165454, 1773446, 2131170, 1992759, 2078940, 2004876, 2227256, 2015494, 1698790, 2288404, 2209104, 2213537, 2186337, 2430579, 2495857, 2253893, 2501385, 2336360, 2344052, 2572758, 2849654, 2419078, 2496802, 2833298, 2444498, 2900103, 2768937, 2727754, 2705888, 2699329, 2953854]
16903B953854l43728K40574J44962N3947K8064k52685M22220j15723J69561m63730
16893B837316M17746K2131P2199K46403l68395K26016j58175L01963l76792M63379
16883C683791k07982K2553Q3507K03439l4451J44041j40166J57295O5063R1797
16873D068887K01566j93522K36673P7121M7599K16450m31155Q8020K20901p6827
16863D455713N74599m04941j37405K82713K760K13442j29181K75298K93238k47167
16853E179069J09662p862K90208j2615J94611L4981L62703j18130K77682j83101
16843F127208l5217N31335j99793K00492J12412L30260k36204J20025Q7127K24407
16833G262052J73963J31451Q8888J84055M18046O266K66554J78778n766J39739
$$ y = [2953854, 2610126, 2850700, 2995662, 3049609, 3077673, 2824988, 3247208, 3131485, 3301046, 2837316, 3255062, 3277193, 3349392, 3595795, 3227400, 3453416, 3295241, 3597204, 3220412, 3683791, 3475809, 3498362, 3581869, 3785308, 3750857, 3894898, 3754732, 3912027, 3977090, 4068887, 4270453, 4076931, 4313604, 4390725, 4438324, 4654774, 4223619, 4311639, 4532540, 4455713, 5030312, 4625371, 4487966, 4770679, 4773439, 4986881, 4857700, 5132998, 5426236, 5179069, 5288731, 5280869, 5571077, 5558462, 5753073, 5788054, 6150757, 6032627, 6310309, 6127208, 6091991, 6623326, 6423533, 6624025, 6736437, 7066697, 6830493, 6950518, 7037645, 7262052, 7436015, 7567466, 7656354, 7840409, 8258455, 8264721, 8531275, 8710053, 8704287, 8844026]
16823H844026J15929L58358j24342J75119K86579L41886j43791K48069L20927
16814A0422760K00042N33658L58974j5819L5751N12353j17748K85858K72425M38604
16804A2926858L84124O7909J04733P26700L35039J52800O09802K57016J27516
16795A5692497M14747M76607O60102O1639O43305J5600J140718M93769L92424
16786A9991408L05901L69802O77121M42276M17434J054558M50879P74189R38589
16777B5422157L30518R64111P96334R19888M87135P61607R22530J286646P77874
16768C2668800Q85731J566743O00075J068466R56602J343694J186323J324325
16760D1600759J166343J472572J416381J527362J366651J477783J293154K024931
$$ y = [8844026, 8959955, 9318313, 9193971, 9369090, 9655669, 9997555, 9853764, 10101833, 10422760, 10622802, 11156460, 11515434, 11499615, 11535366, 12047719, 11929971, 12215829, 12488254, 12926858, 13310982, 13378891, 13483624, 14210324, 14545363, 14698163, 15307965, 15564981, 15692497, 16107244, 16583851, 17243953, 17305592, 17948897, 17964497, 19105215, 19598984, 19991408, 20297309, 20667111, 21344232, 21786508, 22203942, 23258500, 23709379, 24483568, 25422157, 25752675, 26716786, 27513120, 28433008, 28920143, 29681750, 30604280, 31890926, 32668800, 33554531, 35121274, 35721349, 36789815, 37746417, 39090111, 40276434, 41600759, 42767102, 44239674, 45656055, 47183417, 48550068, 50027851, 51321005, 53345936]
16752E3345936J711115J596092J848893J850149J542375J924857J986042J619234
16744F7424693J921198J898788K005418J604155K197004J568866J728052J952637
16736H2300811J690434J409780J536491J191509J147838J297661J021680N93396
16728I2189600Q57375K96074L23603L53075n9214N3910o92457m63311m63414j005640
16718I1389601j120692q84313j544308j110651j423464j796725j708660j619780
16710H0181008j982121j361865k201652j467149k448234j594195j856146j679838
16702F5589808j887422j637960k142528j571767j695191j700035j847952j220488
16694E1886465j594909j349140j681518j069179j794485j442429r80888j317782
$$ y = [53345936, 55057051, 56653143, 58502036, 60352185, 61894560, 63819417, 65805459, 67424693, 69345891, 71244679, 73250097, 74854252, 77051256, 78620122, 80348174, 82300811, 83991245, 85401025, 86937516, 88129025, 89276863, 90574524, 91596204, 92189600, 93046975, 93343049, 93666652, 94019727, 93960513, 94014423, 93321966, 92858655, 92395241, 91389601, 90268909, 89384596, 87840288, 86729637, 85306173, 83509448, 81800788, 80181008, 78198887, 76837022, 74635370, 73168221, 70719987, 69125792, 67269646, 65589808, 63702386, 62064426, 59921898, 58350131, 56654940, 54954905, 53106953, 51886465, 50291556, 48942416, 47260898, 46191719, 44397234, 42954805, 41973917, 40656135]
16686D0656135j087838j239674j230171j144817q91289q97452j097526j024567
16678C2042801r94752p37381q15621o46087j309729m50348o76927j074586m43127
16669B4894243m29081o39096n95571n34803n92836l70229r81992k56713p10725
16660A9783197o69218j7507m06434p00808n66980n21350M7480o09354l40852n62842
16650A5435332J87360n49900k43276l18327m57517j87623l14357l59806k27339
16641A2964547J8160n82836p0620n16418l9128j55521k90673k95872n18103M45141
16631A0958677n17102J08306o21272j46650M218j93329l28336k39834J89849j43421
16621I071106k03004k26804l52932L12769j39301l51576l22652j91558J52999
$$ y = [40656135, 39568297, 38328623, 37098452, 35953635, 35062346, 34164894, 33067368, 32042801, 31048049, 30310668, 29495047, 28848960, 27539231, 27088883, 26411956, 25337370, 24894243, 24465162, 23826066, 23230495, 22695692, 22102856, 21732627, 20750635, 20493922, 19783197, 19113979, 19096472, 18690038, 17989230, 17422250, 16900900, 16948380, 16339026, 15998174, 15435332, 15622692, 15072792, 14829516, 14511189, 14053672, 13866049, 13551692, 13191886, 12964547, 12982707, 12399871, 12329251, 11812833, 11773705, 11618184, 11327511, 11031639, 10513536, 10958677, 10441575, 10549881, 9928609, 9781959, 9786177, 9592848, 9264512, 9024678, 9214527, 9071106, 8868102, 8641298, 8288366, 8601135, 8461834, 8110258, 7787606, 7596048, 7749047]
16612G749047L9160K39985n68527j3892j60387l04953l4292j09435N1457k91205
16602F596958j45143q808J39945k71927l12684r2936J9474r5147K06877k25964
16592E810645j80328o1923k59017M8885J98370k85591l14595J29672j24849J42742
16582E104011k97744L070o3299L9375j60842j1516m96162M58360J5257j14543
16572D475967j344n0636j88799j7783j69032k050j2450j81767J92064J4176p0891
16561C987455K15417l48178J5728j07356M6150p9073l14596P0968J79330j53635
16551C512210k52961L59210l09322l3701Q3801j45786L35081K1656k11660J3751
16541C372279k37254J31816l85328J25903M69794m94978O6562m5796r5721j91571
$$ y = [7749047, 7788207, 8028192, 7459665, 7445773, 7285386, 6980433, 6946141, 6836706, 6888163, 6596958, 6451815, 6443007, 6582952, 6311025, 5998341, 5905405, 5924879, 5829732, 6036609, 5810645, 5630317, 5568394, 5309377, 5358262, 5556632, 5271041, 4956446, 5086118, 4961269, 5104011, 4806267, 4809337, 4746038, 4785413, 4624571, 4613055, 4116893, 4575253, 4590510, 4475967, 4474623, 4423987, 4235188, 4217405, 4048373, 4046323, 4033873, 3852106, 4044170, 4058346, 3987455, 4202872, 3854694, 3870422, 3763066, 3809216, 3730143, 3415547, 3486515, 3665845, 3512210, 3259249, 3618459, 3309137, 3275436, 3359237, 3213451, 3548532, 3570188, 3358528, 3372279, 3135025, 3266841, 2881513, 3007416, 3477210, 2982232, 3048794, 3002998, 2907277, 2715706]
16531B715706L5771J28926k23096O0587R9070j8568k951j32908J2474m5664j65330
16520B464017P8011M4698K68971l69615K62703j20413p4533K50422l73268l870
16510B427123K56298k33256K9546l25987K29147l98192Q07623n46443J2837J78344
16500B437040k70223K56557P7626k45887p6200j47259j89353K25882j37128K81696
16490B212751j85064P0932j98666l305K5575j3668j0444P6330j09345j0432J72484
16479B027148M8943k04877j07548L91915k84902q4171K20996k22178K6654K95794
16469B107774m51257k48219L99507l34859Q9416L36792j15868K2944L5234l11811
16459A529653L62408n27942K47515K1036m52315O14583l42984K87206k96798k29943
$$ y = [2715706, 2751477, 2880403, 2657307, 2717894, 2816964, 2798396, 2795445, 2662537, 2675011, 2629347, 2464017, 2542028, 2586726, 2855697, 2486082, 2748785, 2628372, 2553839, 2804261, 2430993, 2427123, 2683421, 2450165, 2479711, 2153724, 2382871, 1984679, 2792302, 2245859, 2258696, 2437040, 2166817, 2423374, 2501000, 2255113, 2178913, 2031654, 1842301, 2068183, 1931055, 2212751, 2027687, 2098619, 1899953, 1896648, 1922223, 1908555, 1898111, 1974441, 1865096, 1854664, 2027148, 2076091, 1871214, 1763666, 2155581, 1870679, 1786508, 2007504, 1785326, 1811980, 2107774, 1656517, 1408298, 1807805, 1472946, 1562362, 1899154, 1783286, 1806230, 1841464, 1529653, 1892061, 1364119, 1611634, 1632670, 1180355, 1794938, 1451954, 1739160, 1442362, 1212419]
16449A212419L09302j18569K05195k3977q0296j76085K7840j53646L00828m87189
16439A015822M01666k47806Q9662K38314o315p5297J46910L7271j54813k86072
16429A159342K86468n39230N37625J18300n03921K52746k32522J48595P3791J69032
16419A470226j49867p9813k94845L59388L5228Q1959r1965l91417K13530P9730
16409A232154k30269K86812l97493R142K4360J72120O0142n433M36018n21725
16399A065828J76521l77473r0571L12515Q4546k89590R3279M32362j86906k06341
16389A014170J09185q4247J41893j82910o007K98488k10727K9231L765r9135N4037
16378A067743r0192N47931G28302M27546l26276J97561k66091N67481l26510J45379
$$ y = [1212419, 1521721, 1403152, 1608347, 1584370, 1504074, 1327989, 1355829, 1202183, 1503011, 1015822, 1417488, 1169682, 1259344, 1497658, 1491343, 1416046, 1562956, 1600227, 1445414, 1159342, 1445810, 906580, 1444205, 1562505, 1058584, 1311330, 1078808, 1227403, 1301194, 1470226, 1320359, 1240546, 945701, 1305089, 1340317, 1422276, 1330311, 938894, 1152424, 1232154, 1001885, 1288697, 891204, 900346, 924706, 1096826, 1156968, 1151535, 1587553, 1065828, 1242349, 864876, 774305, 1086820, 1171366, 881776, 975055, 1407417, 1220511, 1014170, 1123355, 1039108, 1181001, 998091, 992084, 1290572, 1079845, 1109076, 1112841, 1013706, 1067743, 977551, 1525482, 728302, 1155848, 829572, 1027133, 761042, 1328523, 1002013, 1147392]
16368A147392L9300k78157P0044O201l74388K77258j05511N7348K58697q6085
16358A012099j81359r4620j67738K32922l7176P0561J52035j20243J92281j89800
16348H68962J26173j22799L0581l3767K5867j97553J39828j84373J8621K18033
16338H89573j09608o1928J93894j04447J23419k16512Q526J73056j09514J15872
16328I02331k64503L64284P5167k68316j05772j64775J24910J89667l5217l03388
16318E14388M47144M029k13134k25890R2680K2619L2941J0084j71793J20258j86110
16307D47216j47393L64772p7195J52419l0721j08123R736Q3639K47646k29596
16297G12400K262o3599j18045L4440O6031j91085K54373k27304J39198j10898
$$ y = [1147392, 1186692, 908535, 978579, 984780, 610392, 887650, 782139, 839487, 1098184, 1012099, 830740, 736120, 568382, 801304, 764128, 834689, 986724, 866481, 1058762, 868962, 995135, 872336, 902917, 869150, 895017, 697464, 837292, 652919, 671540, 889573, 779965, 718037, 911931, 807484, 930903, 714391, 722917, 895973, 786459, 902331, 637828, 1002112, 1077279, 808963, 703191, 538416, 663326, 852993, 817776, 514388, 961532, 965561, 752427, 526537, 619217, 641836, 674777, 684861, 513068, 633326, 447216, 299823, 664595, 587400, 739819, 709098, 600975, 610711, 694350, 941996, 712400, 714662, 651063, 533018, 567458, 633489, 442404, 696777, 469473, 608671, 497773]
16287D97773R8405k24208Q8122K81281j38421m1453n9487m8240O5195K34307C46001
16275E54815j63652L74846l71145J5365L55629l02439J95395j85869J06127n5466
16265E23606j4380P4058p1987K42471j51620J42643r6131j22618K4808J65115
16255G15965n3652j23618K37283k93395O4279j22054K4548E1685L93121N8397
16245E03203L1362j08605J7043j16889j25143L02506j61684J62530p4966O907
16235D36264l7393J67152m2013l2719r2255j52835K02062J14738j57148A82606
16224A03329Q9318K22511j34722P4623j2221N9634J9107J68588j3193j01174n5381
16213D20419j85452K37279j07851N1282I3854N08096k94442F0994M54744j47163
$$ y = [497773, 596178, 371970, 460092, 741373, 602952, 561499, 502012, 453772, 518967, 753274, 346001, 554815, 391163, 766009, 394864, 410229, 765858, 463419, 658814, 472945, 579072, 523606, 509226, 583284, 511297, 753768, 602148, 744791, 648660, 526042, 550850, 715965, 662313, 538695, 775978, 482583, 546862, 424808, 449356, 51685, 444806, 503203, 534565, 425960, 443003, 326114, 200971, 503477, 341793, 504323, 429357, 436264, 398871, 566023, 524010, 491291, 399036, 246201, 448263, 563001, 405853, 182606, 103329, 192647, 415158, 280436, 355059, 342838, 402472, 421579, 590167, 576974, 475800, 420419, 234967, 472246, 364395, 415677, 93854, 601950, 307508, 60994, 515738, 368575]
16203C68575j40431j8863O3744M8004j3283K98601j81187k1175j50804m9692J48924
16192C52413K14328A29868R7124M3843M06582j27356n3729B3607J96007J05912
16182C25526p6000Q1804J9822j3696K36098k00077b8008D78026j90732J67401
16172D54695n4979A57227J44304K77736B72786J9317M958j32110J51809K5664
16162C42424Q7441m1521J76003k57282b183A76679L27634n8038a4293D20297D3866
16150A84076J39635F6098L7444L88138L8054j69366L23572B52887L93685A92708
16139a4213C06905J73868o8498P3518E7849j0616L40970j63514I6847K91978j75784
16128B13041Q9177j5141A9568K67539R2349m1112k9697K33251a85660B51273k1765
$$ y = [368575, 228144, 209281, 273025, 321029, 307746, 606347, 425160, 403985, 253181, 203489, 352413, 566741, 129868, 226992, 270835, 677417, 550061, 496332, 23607, 219614, 325526, 249526, 331330, 351152, 337456, 573554, 373477, -28008, 478026, 287294, 454695, 399716, 157227, 301531, 579267, 272786, 292103, 297061, 164951, 316760, 342424, 429865, 388344, 564347, 307065, -2183, 176679, 504313, 446275, -14293, 420297, 43866, 184076, 323711, 66098, 103542, 491680, 529734, 360368, 683940, 252887, 646572, 192708, -14213, 306905, 480773, 412275, 485793, 57849, 47233, 388203, 224689, 96847, 388825, 213041, 302218, 287077, 19568, 287107, 379456, 338344, 308647, 541898, -185660, 251273, 229508]
16117B29508J34990B5169J43784C464P4346L54764A37429N2433k5647p8400K87998
16106C73813q7660n6911A06302l1106Q138K47921A38062K23168B6652J91215J9923
16095B37790J44116j55720j07384m4686K31461j8943J7873L4163D7429N3254J80574
16084B81257r4196K43274A09917c8843I8591N30278c7251A53998J06577N803L2794
16073B99172a23827d0220C00509A13054d8573B00843i6060C53012H0790M69055
16063E49845A43264J8272J33129b6276A11415E2133K90471J17148h1884E7880
16052B0587K33669a14067B03680q6893J03848i1536A37484J72925j00031a24554
16041A24268J55938p9686D9902K0091J23921J95385a47788A80135a18011I9786
$$ y = [229508, 364498, 25169, 168953, 3464, 77810, 432574, 137429, 189862, 164215, 85815, 373813, 286153, 229242, 106302, 75196, 83334, 331255, 138062, 361230, 26652, 217867, 237790, 381906, 226186, 118802, 74116, 305577, 286634, 304507, 338670, 47429, 100683, 281257, 187061, 430335, 109917, -38843, 98591, 628869, -37251, 153998, 260575, 266378, 299172, -123827, -40220, 300509, 113054, -48573, 200843, -96060, 353012, 80790, 549845, 143264, 161536, 294665, -26276, 111415, 52133, 342604, 459752, -81884, 57880, 20587, 254256, -114067, 203680, 116787, 220635, -91536, 137484, 310409, 210378, -124554, 124268, 280206, 200520, 49902, 69993, 193914, 389299, -147788, 180135, -118011, 99786]
16030H2393D1083a13149J0643D68402B29474I1798J4210c29353B03528a08701
16019C04581g6164A75037Q7345j00908l4493L9951c3253A41040D6334J37933a03927
16007F9919K18467D9419J66045A5159L29923q2703A20856K46782H5187i9866E59170
15995C70576m5272b76149A82909M8571A07016N3427L35777j95929L29763B93354
15984I29001K48957E13470K63430k07616A46473K72713j72271r858a06446A27511
15973I5238J21932b60801k30800g5252B379L26625b8089A17286b13379b7867A30431
15961A2323M0033k523b54796B26785E5064i8288m1223N580F3811Q5722J84468
15950C34001j37743p7013m8873a59221B12798B9273O1176K32530a8574p9592B36645
$$ y = [82393, 41083, -113149, -102506, 468402, 229474, 91798, 106008, -329353, 203528, -108701, 304581, -76164, 175037, 262382, 161474, 126981, 166932, -33253, 141040, 46334, 184267, -103927, 69919, 288386, 49419, 215464, 15159, 345082, 262379, 120856, 367638, 85187, -99866, 559170, 370576, 325304, -276149, 182909, 231480, 107016, 160443, 496220, 300291, 630054, 293354, 929001, 1177958, 513470, 776900, 569284, 146473, 419186, 246915, 237057, -106446, 127511, 95238, 217170, -260801, -491601, -75252, 2379, 329004, -28089, 117286, -213379, -27867, 130431, 12323, 52356, 49833, -254796, 226785, 55064, -98288, -139511, -133931, 63811, 149533, 334001, 196258, 119245, 70372, -159221, 212798, 29273, 90449, 322979, -18574, -98166, 236645]
15938B80309o9218m1735D2064A7096K30597d1175B17253B4178K21284H9843g1096
15926h9767j6636I4496b35354a4004B5573c5160C14754A7318L00001R8263E498
15914g3586A32950a29428d5333A08187P7919a90508Q9134b5240k26528O6965A53983
15902A86193m9972J7446b43953D6867K6121o441J39964c40563A92882j9159L9920
15891B13643r2577g1110L5058C7190J21520L0914m6175a3536F7075K75206A28943
15879G2546b08755B71865i243A52932M5518p9894a73088a9194j51366k9901e7827
15867C0925L11227r9260A13492b62637A66243G5145a2310k62824B5999L18368
15857C44367a49359e3801K2109B74551j09555a38532k05447a58462E6108L6130
$$ y = [280309, 211091, 169356, 42064, 17096, 247693, -41175, 217253, 24178, 245462, 89843, -71096, -89767, -106403, 94496, -235354, -14004, 25573, -35160, 314754, 17318, 317319, 415582, 5498, -73586, 132950, -129428, -45333, 108187, 186106, -190508, -101374, -25240, -251768, -184803, 153983, 186193, 136221, 153667, -243953, 46867, 72988, 66547, 206511, -340563, 192882, 173723, 213643, 121066, -71110, -36052, 37190, 158710, 189624, 143449, -13536, 67075, 342281, 128943, 72546, -208755, 271865, -9243, 152932, 198450, 118556, -173088, -19194, -170560, -200461, -57827, 30925, 342152, 242892, 113492, -262637, 166243, 75145, -12310, -275134, 25999, 344367, -149359, -53801, -31692, 274551, 164996, -138532, -343979, -158462, 56108, 92238]
15847I2238J44250A8096a39400d7355A64043G8751l2076K4617k5608d3384j2749
15836e6133B56920m6352a05122A17525B5912J61344h6448G1919b26065A63267
15825A45220n7199n818K38898c1071A1251a9666l22349J09701A83758a6386k3494
15814c9880j5166C35417A7858a84132d9220J5120j93092J2306A86984f1514A41158
15802b8378G3073a08937j40429b1154j02505d4273k442C10526d4849D6023k0004
15791B6019K7127a61744k2559j31665e91j6200A02806l8665K3988a96945h2875
15779a12559e067k63993J08647a8024j54259C9265c94630B54523F4223b11711
15768B42944e1104o6300r7031M6037A53259b65958Q575C0888K5080e3709I407
$$ y = [92238, 236488, 18096, -139400, -47355, 164043, 78751, 46675, 71292, 45684, -43384, -56133, 256920, 210568, -105122, 117525, 25912, 187256, -86448, 71919, -226065, 163267, 145220, 88021, 82203, 321101, -31071, 11251, -19666, -342015, -232314, 183758, -16386, -39880, -55046, 335417, 17858, -184132, -49220, -34100, -227192, -214886, 186984, -61514, 141158, -28378, 73073, -108937, -249366, -21154, -123659, -44273, -46715, 310526, -44849, 46023, 26019, 53146, -161744, -184303, -315968, -591, -16791, 102806, 64141, 88129, -196945, -82875, -112559, -5067, -269060, -160413, -18024, -172283, 39265, -394630, 254523, 64223, -211711, 242944, -51104, -117404, -214435, -168398, 153259, -265958, -257383, 30888, 55968, -53709, 9407]
15756A21421P5181J02759l5247j24733R7799H3451a69475A2072f3214b8090N7
15745b8033C33935A22867c04433l3290a28118d9336o1388d3099r4425j00685h3951
15733e93600e9637m4659H5983a47584k97042a8198B17722b84833A66125a54858
15722C7133o449M238f565j90092K1386D3290j7995K60472A12698c83929C2534
15710b93728f3716A58693a66362g0631B52252e9279B48758b42379k5268e7017
15699a2710j02109M9999p7488c7769D8648O776M9409J52603o8507a16047m4380
15688a60427k32226g9196A38165b11382B31826P0664a1394k37331a9251I2941
15677b20407B26126K4536i8710k44716C81040A04656L37259o8768i7099J2253
$$ y = [121421, 196602, 299361, 264114, 139381, 237180, 83451, -169475, 12072, -63214, -28090, -28033, 333935, 122867, -304433, -337723, -128118, -49336, -110724, -43099, -137524, -238209, -83951, -593600, -59637, -104296, 85983, -147584, -444626, -18198, 217722, -284833, 166125, -154858, 37133, 30684, 34922, -6565, -196657, -175271, 43290, 25295, 285767, 112698, -383929, 32534, -293728, -63716, 158693, -166362, -70631, 252252, -59279, 248758, -242379, -267647, -57017, -12710, -114819, -64820, -142308, -37769, 48648, 55424, 104833, 257436, 188929, -116047, -160427, -392653, -79196, 138165, -211382, 231826, 302490, -11394, -248725, -19251, 92941, -220407, 226126, 250662, -98710, -343426, 381040, 104656, 441915, 373147, -97099, -84846]
15667h4846l0434j72058c8786A43237l5160J51182h0582A0933K62427C6179P9117
15656A15296b97331m2520a31036L7937A53547p1555k0110A5219L20793b25094
15645b11375B25001d07631A01802a20971g371p5131j37854f0035A15147m7221
15635F7926M692K19886b00587k23464e7751E5616Q9992D029P3988a28109d0585
15623a30490l64075d1400d061o8396l06787B46084A0725b84043f5880J3341k47823
15612c00362B04889r0412J17090a10311A50958A173J62368J90821F8780b37774
15601a94667m2986B50964E6410b89640Q7641H5912f6077C06692J1441I6127J8021
15590A14148h0358L1526A54247J10857A12497a05548B13805p7877L4853a84477
$$ y = [-84846, -115280, -287338, -38786, 143237, 108077, 259259, -80582, 10933, 273360, 36179, 115296, -297331, -339851, -131036, -93099, 153547, 81992, 61882, 15219, 336012, -225094, -211375, 225001, -407631, 101802, -120971, -7371, -82502, -220356, -60035, 115147, 67926, 72618, 292504, -200587, -424051, -57751, 55616, 145608, 4029, 78017, -128109, -40585, -130490, -494565, -41400, -4061, -72457, -379244, 246084, 10725, -284043, -65880, -52539, -300362, 204889, 114477, 231567, -110311, 150958, 1173, 163541, 354362, 68780, -237774, -194667, -237653, 250964, 56410, -289640, -201999, 85912, -66077, 306692, 318133, 96127, 114148, -80358, -48832, 154247, 265104, 112497, -105548, 213805, 135928, 170781, -184477]
15579C18449l8411G143K47317h0446c4717j61485h1208A72360a728j19434A7845
15567b0295D3164M4442l1646K2317j865M27086c0519j44575c9633D03900h994
15555b69189R9704I6914C7908P6882A3046c44445j06373A60256d2813D5626c4413
15543A29237o3873P2647c01819l9751A11567c10361B79819r1818p165a15935B55561
15531C03078g7353b6459D42198A43824L9630a9607A76382a88644C451N4956A2605
15519B75127g626D4681K35328A06560D4650Q6800b22761f8859o965F8555L38201
15508D06756B860a63595A06500k7132J18399l3483O9592k0422D6865J18120a37385
15496b09055A75782i159D1156a1683A50801b08465l05273C25711A11486J3116
$$ y = [318449, 280038, 7143, 254460, -80446, -34717, -196202, -81208, 172360, -1728, -121162, 17845, -20295, 43164, 87606, 55960, 78277, 76412, 503498, -30519, -175094, -39633, 403900, -8994, -269189, -169485, 96914, 37908, 114790, 13046, -344445, -450818, 160256, -42813, 45626, -34413, 129237, 65364, 138011, -301819, -341570, 111567, -310361, 279819, 188001, 180836, -115935, 255561, 303078, -77353, -26459, 442198, 143824, 183454, -19607, 176382, -188644, 3451, 58407, 12605, 275127, -7626, 44681, 280009, 106560, 44650, 131450, -222761, -68859, -75824, 68555, 406756, 2860, -163595, 106500, 79368, 197767, 164284, 233876, 213454, 46865, 164985, -137385, -209055, 175782, -9159, 41156, -11683, 150801, -208465, -513738, 325711, 111486, 124602]
15486A24602m6968K48992A39446k7669b93220A04513i3641E0926Q244J35737L86642
15475E81549j53693J00493k5995j12286F9511L4436J80058j03444F4100g995j64930
15464a72925P7205o1664B20749g1055p1494C9114c07741I4983a83300B9181c61255
15452F6297h1413O959C7929a19439B22141A02499K03932L57756k66500N19212
15442I16899o0284m9571j66158k00367R5716B63379d6310l9296e381A07397J26980
15431B34377a25124l4978f9032A27814b03158A05396P6497M8306g4833C7639J41143
15420A78782C7533b27841p9863A76017c3746K217Q978A79742G585f2409j03959
15409a66368Q0390j09131R4916a316A29365a57581B11321B1892R2965N5400i0846
$$ y = [124602, 77634, 326626, 139446, 111777, -293220, 104513, -93641, 50926, 59170, 194907, 581549, 427856, 528349, 502354, 390068, 69511, 103947, 284005, 180561, 64100, -7995, -172925, -95720, -157384, 220749, -71055, -142549, 39114, -307741, 94983, -183300, 29181, -361255, 66297, -81413, -74454, 37929, -119439, 222141, 102499, 306431, 664187, 397687, 916899, 856615, 807044, 640886, 440519, 536235, 263379, -46310, -85606, -5381, 107397, 234377, -125124, -160102, -69032, 127814, -203158, 105396, 181893, 230199, -74833, 37639, 178782, 37533, -227841, -307704, 176017, -33746, -31529, -22551, 179742, 7585, -62409, -166368, -85978, -195109, -100193, -1316, 129365, -157581, 211321, 21892, 114857, 170257, -90846]
15397d9794q2514A98301d5429A76683c4017k37064D17835F0158j7082J02464b0343
15385b8123j13718E8361a01923C37638a64307A8402K33575D9191J28750e7439
15374A03909J6550Q4473D3090L00601A53796l8056e569B60069j04744C952K28168
15363B32120n7910A9647b54365a8825A73506K91283F8960K5117m3299a036k14548
15352b15584F3961L41761L8035a38038J0755c6271j1727b0963D4439J31326q6263
15341H9502K47076j08968B0234J76372G1192J62225A5614K90058r9154p6274J64671
15330B94915a37561A35290B7043g3768H6802l270R1363J80650j33305f7397k49527
15319c16924B63995A0134J22932o3340a79919A29697c2858k7028G8498O3984J70601
$$ y = [-49794, -132308, 198301, -45429, 176683, -34017, -271081, 417835, 60158, 43076, 145540, -20343, -28123, -141841, 58361, -101923, 337638, -164307, 18402, 251977, 49191, 177941, -57439, 103909, 120459, 204932, 43090, 343691, 153796, 115740, -5569, 260069, 155325, 3952, 232120, 174210, 19647, -254365, -18825, 173506, 464789, 68960, 94077, 50778, -1036, -215584, 63961, 405722, 443757, -138038, -127283, -36271, -47998, -20963, 44439, 175765, 89502, 336578, 227610, 20234, 196606, 71192, 233417, 15614, 305672, 206518, 130244, 294915, -137561, 135290, 27043, -73768, 86802, 83532, 174895, 355545, 222240, -67397, -316924, 263995, 10134, 133066, 69726, -179919, 129697, -32858, -59886, 78498, 142482, 313083]
15308C13083G7583M6838K1671h9489A91449I5061f4583A83251L96773B8937d5813
15296d0822o1339n8365K8779r1929O2269j50301J24733A99216K10536A25984a04076
15284B40397d87546D6440l773J00714D1758R092a26939B95939f9482L4491A68515
15272A91870j1763K83972g5597K619I6911f1906A84257a1846A59827J39987A27324
15260D71760E2194b68005D00199a79624F1971L7493K14210d0302A6591a42001
15249e41B80425L52088E5953J0321N6794O98095Q92692j86091j78812P20853r82615
15238A087190A05001N0777N5493p8089f3013b6609E9904J93743j12704b24656
15227c55331J05351c2891J291m0593H3521A6288D366M3351c63323g1613O648b8505
$$ y = [313083, 77583, 124421, 146092, -89489, 191449, 95061, -64583, 183251, 580024, 28937, -45813, -40822, -102161, -160526, -131747, -223676, -161407, -311708, -186975, 199216, 409752, 125984, -104076, 240397, -487546, 46440, 42667, 143381, 41758, 50850, -126939, 295939, -69482, -34991, 168515, 191870, 180107, 464079, -75597, -72978, 96911, -61906, 184257, -11846, 159827, 299814, 127324, 471760, 52194, -268005, 400199, -179624, 61971, 99464, 313674, -40302, 16591, -142001, -541, 280425, 632513, 55953, 66274, 123068, 821163, 1713855, 1527764, 1348952, 2069805, 1087190, 105001, 155778, 211271, 133182, -63013, -26609, 59904, 253647, 140943, -224656, -355331, -249980, -32891, -31600, -72193, 83521, 16288, 4366, 47717, -363323, -71613, -64965, -28505]
15214A05021j8948a41565B17355o3484B4994c53616E6707J22512O907r1564I05
15202G4666M3000K57076b51423K3333A46530F078a4439p4781C2711J71913c52993
15190b96836J02730g6166k4688J1116B18026B3588a54943f2113q62C02015B0864
15178a91325b4261D07584A61640b3344m6752A4069a16956A31843d0075I5269J63585
15167B58854A12258O7196Q4147N9278e8737B62102l2179M845a3474C69927d6199
15155C1805P6876K05877q8114H1234d9562j7347p1179B81378a19842r437f1337
15143B11798a08510A74599L13219d4330j6482A56922Q2097j11394J69006F3152
15132g7908R612C27833A59142F3233J95264d156D17003a71930A26192N0122B0358
$$ y = [105021, 86073, -141565, 217355, 153871, 24994, -353616, 56707, 179219, 186126, 94562, 905, 74666, 117666, 374742, -251423, -228090, 146530, 6078, -14439, -89220, 32711, 204624, -352993, -296836, -194106, -76166, -100854, -89738, 218026, 23588, -154943, -62113, -62975, 302015, 20864, -191325, -24261, 407584, 161640, -23344, -70096, 14069, -116956, 131843, -40075, 95269, 258854, 112258, 179454, 263601, 322879, -58737, 262102, 229923, 234768, -13474, 369927, -46199, 31805, 108681, 314558, 226444, 81234, -49562, -66909, -138088, 281378, -119842, -129279, -61337, 211798, -108510, 174599, 487818, -44330, -60812, 156922, 239019, 127625, 296631, 63152, -77908, -68296, 327833, 159142, 63233, 258497, -4156, 417003, -171930, 126192, 176314, 20358]
15120B29968I0786Q3538O27710k14328A90676L15310a32257A60230A8444J21766
15110A40210d4577l7048B56602a75994A20926a20037D4195J71116a5816B8786
15099B42487a13714B50094m696e9712A6434J10750O8386J13643H2988a64962D08233
15087G0608N9764l5817Q3629a43288D4338Q6196J08361R2398m7816j25409O692
15076A64760o5989J62644A17460N1814a88243c6683A08035J87654A42321a24567
15065A33783E3985K45935a97870B71151a37611B57505a0316D95799C1260J71396
15055B02656G6003O55736C60020j14826M7804D7006L10718j54255A0465J57582
15045A68047P0325d7993E71430B23384G7918M6339R694P8965J07361J25268A84600
$$ y = [229968, 90786, 174324, 802034, 587706, 190676, 505986, -132257, 160230, 18444, 140210, -44577, -81625, 256602, -175994, 120926, -120037, 44195, 215311, -15816, 28786, 242487, -113714, 250094, 245398, -59712, 16434, 127184, 195570, 309213, 82988, -164962, 408233, 70608, 130372, 94555, 178184, -143288, 44338, 130534, 238895, 331293, 283477, 158068, 164760, 98771, 261415, 117460, 169274, -188243, -36683, 108035, 295689, 142321, -124567, 133783, 53985, 299920, -197870, 271151, -137611, 257505, -10316, 495799, 31260, 202656, 76003, 731739, 360020, 245194, 292998, 47006, 357724, 203469, 10465, 168047, 238372, -47993, 571430, 223384, 77918, 124257, 133951, 212916, 320277, 445545, 184600]
15033D8810M41168B34001J80364K2236j9903M7012L13274l11499j53422J02456
15023D14519j66160H004M42726j81664k2484o4334I438N61971B51533n5984i7639
15011C45998K32738m7316j50268j38808C8896L98085r964F349K53286K7243M0047
15000C26925K5920A57363L56412j03349j24290n121J39334q8378F960L74920j88603
14989A93277K32688m905j14772D4961L51592p8027K12182A21779L16739L35411
14979G73929j17496q1973J66476l01867j76385L37428B18348K85394R1605j00093
14969D95254O7059J12380j41386B16427K84076j01693r6343P8106j59206L52865
14959E74232j37300F5420k2970L16328a0330C99144r3037q1330L7419A04385K34062
$$ y = [48810, 489978, 234001, 414365, 436601, 416698, 463710, 776984, 465485, 312063, 414519, 248359, 8004, 450730, 269066, 246582, 182248, 9438, 571409, 251533, 195549, -97639, 345998, 578736, 531420, 381152, 242344, 38896, 436981, 427017, 6349, 259635, 286878, 326925, 352845, 157363, 513775, 410426, 286136, 281015, 420349, 331971, 6960, 381880, 193277, 425965, 421060, 306288, 44961, 396553, 318526, 530708, 121779, 438518, 773929, 656433, 574460, 740936, 439069, 262684, 600112, 218348, 503742, 595347, 495254, 562313, 674693, 533307, 216427, 500503, 398810, 302467, 380573, 221367, 574232, 436932, 65420, 42450, 358778, -10330, 399144, 306107, 224777, 262196, 104385, 338447]
14948C38447L2537k9534j096L37853K5406J11215l20912B17079l4782K9218p5898
14937A35617L79315J16528m7552B00872L81629j77287J80863k4761J58196J59912
14927H79424K88250j29032J66586Q3873O818m02190M84477j34456N03101o7584
14917A679267J50376R3524p32436k89407K56579l29149j13815B41359j8501J50535
14907C73393A65875D2404e9766E10160o4548j40051J34624j14924L03785q9512
14897E39534j22204j66483m9331K9895L6846Q7639J24170m2244j89938L24464
14887E72348j69716p8298K70568l0954B50309J43980K37567J24957k22776m6582
14877D87455O1432m5641G3997L94434A53401L51950B15445r763L43244k18599
$$ y = [338447, 370984, 341450, 340354, 678207, 703613, 814828, 493916, 217079, 182297, 211515, 135617, 514932, 631460, 583908, 200872, 582501, 405214, 586077, 561316, 719512, 879424, 1167674, 1038642, 1205228, 1289101, 1295919, 893729, 1378206, 1243750, 1746851, 1679267, 1829643, 1923167, 1190731, 901324, 1157903, 828754, 714939, 241359, 222858, 373393, 165875, 42404, -59766, 510160, 445612, 305561, 440185, 325261, 629046, 539534, 417330, 250847, 201516, 231411, 268257, 355896, 480066, 437822, 247884, 572348, 402632, 324334, 594902, 563948, 250309, 394289, 631856, 756813, 534037, 487455, 548887, 503246, 73997, 468431, 153401, 505351, 215445, 205682, 548926, 330327]
14867C30327K55866k9841n6684j01979L59076j82174j72112j46603L04220n0834
14857E09262k08261L7511J40293q3533K05536B50212K35577o212J17904B41251
14846C76199E8386M76366K34877K58426P1392l85197K29567l10066L06393J71486
14836A111630l77871k45570J1472j1857K98937B77196K82211P3227N9071B07412
14825E49985k3451h547A27351M81118m4271K39007r6269k06629L68138B82066
14814C56230J79682j38940J89695A86650L35000P2471K0140n8703J4266K41294
14804H11118k57191K99423k49696o1321l3427J2334R7534q3074p082N637j69662
14793C64593L11606J0768j91712R5066R8529k61619o7983L02493k97955K45247
$$ y = [330327, 586193, 556352, 499668, 397689, 756765, 574591, 402479, 255876, 560096, 509262, 301001, 338512, 478805, 395272, 600808, 250212, 485789, 479577, 597481, 241251, 376199, 58386, 534752, 769629, 1028055, 1099447, 714250, 943817, 633751, 940144, 1111630, 733759, 488189, 499661, 487804, 786741, 277196, 559407, 632634, 691705, 207412, 549985, 526534, -8547, 127351, 608469, 564198, 803205, 706936, 500307, 868445, 282066, 356230, 535912, 396972, 586667, 186650, 521650, 594121, 614261, 555558, 569824, 811118, 553927, 853350, 603654, 542333, 508906, 521240, 618774, 535700, 528618, 534255, 364593, 676199, 686967, 495255, 590321, 688850, 427231, 359248, 661741, 363786, 609033]
14783F09033k86130J23753R2045J8038J95232J3627n9880k92100J82057K3491
14773F19166K24975q4023P8331j81928k13100l9965J62007j85917J82555r9028
14763D63073L16989k57580k20594K03193K341B49743K81211J72249o4869q5053
14753E53281k1018K78138l71620N2400j75238O49483D47952j43829J978K73684
14743E79785B33251L25869j89019J96940n1721j8799L53721l64709L71838l31541
14733E25830M06478j89670L1491J70395K6368J2349J70507l5740N01415j38592
14723A480831k93638m1271k61858N6492l51155P5803L55151j93287m5191k11151
14713E70726K3778R7598P3195k14762j67901L32026q0231K3819j92330N63131
$$ y = [609033, 322903, 446656, 538701, 556739, 751971, 765598, 705718, 413618, 595675, 619166, 844141, 760118, 838449, 656521, 443421, 403456, 565463, 379546, 562101, 463073, 780062, 522482, 301888, 505081, 507422, 249743, 530954, 703203, 638334, 553281, 532263, 810401, 438781, 491181, 315943, 965426, 447952, 304123, 306101, 579785, 233251, 559120, 370101, 567041, 515320, 496521, 850242, 485533, 857371, 525830, 932308, 742638, 774129, 944524, 970892, 983241, 1153748, 1118008, 1619423, 1480831, 1187193, 1145922, 884064, 940556, 589401, 665204, 1020355, 827068, 781877, 570726, 594504, 692102, 765297, 550535, 382634, 714660, 634429, 658248, 465918, 1029049]
14703A029049L7083O1970o5151M98761l6332Q4884m81401j24837k1200j77797
14693H05029j04747N7127n0827M3796J98228q7170j52323q4006J74733q3958l52433
14682C63449O04638m64929K22424C57940J19487j7851M14035l71268K81555l8647
14672G45251p8121J03585j44057J01910j84417O29034l95093j36649M05706j40674
14662I06475p5707j53817J78227O2230l62932J78243M30673k56107o899p3429
14652H26957J60109r0515j0958j9662n4615K55295l0189j57160k22510J85500
14642H42252o045O6094L6532j11078l7144J65274J04193m1857m1516J0245L5467
14631A022417J72289l34652j6139J53627k95902J46438J15618K03643o7853j99943
$$ y = [1029049, 1066132, 1128102, 1062951, 1561712, 1525380, 1610264, 1128863, 1004026, 982826, 805029, 700282, 757409, 706582, 750378, 948606, 861436, 709113, 625107, 799840, 715882, 363449, 968087, 503158, 725582, 357940, 477427, 459576, 873611, 502343, 783898, 745251, 667130, 770715, 626658, 728568, 544151, 1173185, 778092, 641443, 1047149, 906475, 830768, 676951, 855178, 917408, 554476, 732719, 1163392, 907285, 900386, 826957, 987066, 896551, 885593, 865931, 811316, 1066611, 1036422, 879262, 656752, 842252, 836207, 902301, 938833, 827755, 790611, 955885, 1060078, 1018221, 976705, 986950, 1022417, 1194706, 860054, 843915, 997542, 701640, 848078, 963696, 1167339, 1099486, 899543]
14621H99543M31949k21544m22872O03024j46339K35481k84617k2905J05672J64192
14611A341584k48530j5012P3830L8453R8666R4566j44086k01451M50746k90752
14601A198014J10176k69362O15439J1877m25357L04329j15817l04343J07121K45571
14591A477648m31072M48972o1320k55435M69124k17611J4092k02197R1918L86901
14581A721020M8720j18600r2833q1531j17039Q2954j5095M38289O7307N1037l18338
14570A665891j42633K16275J22384K5196k36598M69392j32594N1451j98615J32250
14560A972399J4665N3119J48281k6649L34991K02671L3256N75883j46822Q81498
14550D043292N65475K301015L537276Q008246J7912908J865412A6184688G537286
$$ y = [899543, 1331492, 1109948, 687076, 1290100, 1143761, 1379242, 1094625, 1071720, 1177392, 1341584, 1093054, 1078042, 1151872, 1190325, 1288991, 1383557, 1239471, 1038020, 1488766, 1198014, 1308190, 1038828, 1654267, 1666144, 1240787, 1545116, 1429299, 1124956, 1232077, 1477648, 1046576, 1495548, 1434228, 1178793, 1647917, 1430306, 1444398, 1242201, 1334119, 1721020, 1769740, 1651140, 1558307, 1476776, 1359737, 1442691, 1427596, 1865885, 1933192, 1984229, 1665891, 1523258, 1739533, 1861917, 1887113, 1650515, 2119907, 1987313, 2038764, 1840149, 1972399, 1987064, 2040183, 2188464, 2161815, 2496806, 2699477, 2732733, 3308616, 3161794, 4043292, 4608767, 6909782, 10447058, 18455304, 36368212, 38233624, 16184688, 7537286]
14541D016857j109319j16353J553139Q9417k095720p59928O208q9335n3939j0867
14531A430160J36587n1159J5635L7362K23J12693P5140N7378k9671o6834n074
14520A712440L68070p839l14119J39837j22079n7965L52661J61931k89962o5677
14510A877298L46109o8063J17242R9284J59778l42085J8103L8564j57501M48308
14500B537037k90304M1957K49518p7390J95516l07243J70292P677l7109K2819
14490B512770K92164R2456R7970l38923L74738J4149L15591n92107j25408J49554
14480B792954L17427k60688K84280l17028M12535N9413K72048J59161n42668K56428
14470C433862m8890J61461P1895k80065J27275L90918j01469j32119M00334j72928
$$ y = [4016857, 2907538, 2791185, 4344324, 4433741, 2338021, 1578093, 1584301, 1494966, 1441027, 1430160, 1566747, 1515588, 1531223, 1568585, 1568808, 1681501, 1756641, 1814019, 1784348, 1717514, 1712440, 2080510, 2072671, 1758552, 1898389, 1776310, 1718345, 2071006, 2232937, 1942975, 1877298, 2223407, 2155344, 2272586, 2371870, 2531648, 2189563, 2207666, 2246230, 2088729, 2537037, 2246733, 2288690, 2538208, 2460818, 2656334, 2349091, 2519383, 2527060, 2489951, 2512770, 2804934, 2897390, 2995360, 2656437, 3031175, 3045324, 3360915, 2768808, 2643400, 2792954, 3110381, 2849693, 3133973, 2816945, 3229480, 3288893, 3560941, 3720102, 3177434, 3433862, 3384972, 3546433, 3618328, 3338263, 3465538, 3856456, 3754987, 3622868, 4023202, 3850274]
14460C850274q7875P6991J5566J56125q4196M5713J15321J25569J09420J90424
14450D513332k92345L0365J03084r961L62536l58954L20456P4164L8401J06406
14440D887484O7595L10422k06142K68677K0503j64592Q3077l7878L32433m552
14430E557027K37788k11060K07059K68587j85522J32969R579L81468R5257j02492
14420F390660J65314O25838l59326L23100J547p7764l40398P03028j63520K45693
14410G514172N9363R0996J04921j77138J88761M89892L46797m13293j08635P14516
14400H810352L61q6733L45263l07706L99362J62370K3371J47348J00886M35731
14390A0030605J75737M85700j86238L14393j95756N49038m3282M33970K04704
$$ y = [3850274, 3762399, 3839390, 3854956, 4011081, 3926885, 3972598, 4087919, 4213488, 4322908, 4513332, 4220987, 4251352, 4354436, 4344475, 4707011, 4348057, 4668513, 4742677, 4781078, 4887484, 4955079, 5265501, 5059359, 5328036, 5348539, 5183947, 5267024, 5229146, 5561579, 5557027, 5794815, 5583755, 5790814, 6059401, 5873879, 6006848, 6016427, 6397895, 6493152, 6390660, 6555974, 7181812, 6822486, 7145586, 7147133, 7069369, 6728971, 7431999, 7268479, 7514172, 7573535, 7664531, 7769452, 7592314, 7781075, 8270967, 8617764, 8204471, 8095836, 8810352, 8810713, 8723980, 9069243, 8761537, 9160899, 9323269, 9346640, 9493988, 9594874, 10030605, 10206342, 10692042, 10505804, 10820197, 10624441, 11173479, 11130197, 11564167, 11768871]
14381A1768871L55817K58928K85242J88362k20499N52717j45150O04218J58104
14372A3806610N41097P8845L55987N05648l1999N17478J73945O62422J32136m7929
14362A6694240O92886j7504Q84173L4136P92428K70939M03981K45630O78906M17715
14352B1097530P48658N36245L24512Q35342N62042J002040J01251P27417N80246
14343B6515283Q61407P99599M44506Q36369J208521Q88078O59072Q67118R12878
14334C3992831J168766J256162Q49180J234282J446957J007764J573853J152227
14326D3682022J485560J802638J296858K017636J612038J856207K324846J694468
14318E7772273K372403K178282K315980K449393L031309K649490L490312K966957
$$ y = [11768871, 12124688, 12383616, 12668858, 12857220, 12636721, 13189438, 13044288, 13648506, 13806610, 14347707, 14426552, 14782539, 15288187, 15256188, 15773666, 15947611, 16610033, 16742169, 16694240, 17387126, 17369622, 18253795, 18287931, 19080359, 19351298, 19755279, 20000909, 20679815, 21097530, 21846188, 22382433, 22706945, 23542287, 24104329, 25106369, 25207620, 25935037, 26515283, 27376690, 28176289, 28620795, 29457164, 30665685, 31553763, 32212835, 33079953, 33992831, 35161597, 36417759, 37266939, 38501221, 39948178, 40955942, 42529795, 43682022, 45167582, 46970220, 48267078, 50284714, 51896752, 53752959, 56077805, 57772273, 60144676, 62322958, 64638938, 67088331, 70119640, 72769130, 76259442, 79226399]
14310G9226399L358721L595366M057124M064912M388799M494654N141137N167292
14302A13494404N701033O080484N993904O888757P392647P946633P936137Q677383
14294A70111382R918503J0004836J0758029J1324836J2023196J2801207J3416009
14287B50357998J3994806J4771359J5530653J5782156J6459605J6171873J6605227
14280C59673677J5876758J5832365J4741847J3558880J2229184J0028008O352782
14273D48293501J204356l741j258589j747426k684046q130172p234835p756762
14265D20682286j0274962j2604454j4572311j6304531j6744252j6982695j6856474
14258C16342607j6520243j5880171j5171001j4903226j3619762j3253793j2589159
$$ y = [79226399, 82585120, 86180486, 90237610, 94302522, 98691321, 103185975, 108327112, 113494404, 119195437, 125275921, 131269825, 138158582, 145551229, 153497862, 161433999, 170111382, 180029885, 190034721, 200792750, 212117586, 224140782, 236941989, 250357998, 264352804, 279124163, 294654816, 310436972, 326896577, 343068450, 359673677, 375550435, 391382800, 406124647, 419683527, 431912711, 441940719, 448293501, 449497857, 449494116, 448235527, 446488101, 443804055, 435673883, 428439048, 420682286, 410407324, 397802870, 383230559, 366926028, 350181776, 333199081, 316342607, 299822364, 283942193, 268771192, 253867966, 240248204, 226994411, 214405252]
14251B14405252j1778976j0985998q965915r362423j0035713q009119q127329
14244A47139779p110951p228760o590513n994575o065886n287002m967436m571428
14236I9323228m350025m461779l706932l866027l270978k716031l432467k936905
14228G0582084k868021k612839k406481k365780k337377j948290j841565k078685
14220E2123046j705995j862143j346485j687526j884933r83616j127763j390510
14212D0134075j419658j255621j210360q17155q55341o86696q11379j419318q48117
14203C0810430q05982p72498j098807l37198p91757p56628r76842k47341q34881
14194B4188496n03317n99662o71377p18233n36742k10710k04653o42930n13927
$$ y = [214405252, 202626276, 191640278, 182674363, 173311940, 163276227, 155267108, 147139779, 140028828, 132800068, 126209555, 120214980, 114149094, 108862092, 103894656, 99323228, 94973203, 90511424, 86804492, 82938465, 79667487, 76951456, 73518989, 70582084, 67714063, 65101224, 62694743, 60328963, 57991586, 56043296, 54201731, 52123046, 50417051, 48554908, 47208423, 45520897, 43635964, 42652348, 41524585, 40134075, 38714417, 37458796, 36248436, 35431281, 34575940, 33889244, 33077865, 31658547, 30810430, 30004448, 29231950, 28133143, 27795945, 27004188, 26247560, 25270718, 25023377, 24188496, 23685179, 23085517, 22414140, 21695907, 21159165, 20948455, 20743802, 20100872, 19586945]
14185A9586945p30629k59515l95408k46120l99542n21551l68058k89968m29036
14176A5947118J5815m80805n66975P5881n56643r2237n17324k54754k6954o35956
14166A2907166K66328m89206K08281q94523J44948k48839j90941k28357l13223
14157A1161634K937j08460l31843j56019j47426l62960k58791R3910k62716K08495
14147I838761n74326R381m01124m8787m3983n7464k14102o6259k25108O3859o70836
14136G610012L92045N7332j79617k17885j49975k39956j57558J58463o304l46931
14126F919626J04929l06769k84470J05093m31126P7236O5494J58160j77517k27412
14116F003244p7428j59337K00437J99254o34178K06199J0415j07181l00942L16373
$$ y = [19586945, 18856316, 18596801, 18201393, 17955273, 17555731, 17034180, 16666122, 16376154, 15947118, 15962933, 15482128, 14915153, 14991034, 14434391, 14342154, 13824830, 13570076, 13543122, 12907166, 13173494, 12684288, 12892569, 11998046, 12142994, 11894155, 11703214, 11474857, 11161634, 11164571, 11056111, 10724268, 10568249, 10420823, 10057863, 9799072, 9892982, 9630266, 9838761, 9264435, 9273816, 8872692, 8823905, 8779922, 8722458, 8508356, 8442097, 8216989, 8280848, 7610012, 8002057, 8059389, 7879772, 7661887, 7511912, 7271956, 7114398, 7272861, 7266557, 6919626, 7024555, 6717786, 6433316, 6538409, 6107283, 6184519, 6250013, 6408173, 6230656, 6003244, 5925816, 5766479, 5966916, 6166170, 5531992, 5738191, 5748606, 5641425, 5340483, 5656856]
14106E656856m04291K2255J42938k9163l34257k32247O038J8482o5261j7978l19168
14095D444204K23502m0738J05533k30646Q7983l26618J44419j57466j45701K1554
14085D126026J42497K0582j86289j25743K17707k67389K04488j35388p6837j60802
14075C758852J69067m5461k72635J31475k56710M3573J64661j34844l77130L92253
14065C573101r1071j5237j66049P9359L5142P8135l21427J35152J70911k75103
14055C202913J49390l39338K66791k70602k15629J94051j40758J30667K31661
14046C209146l42241K51435k74327J15701m59531L26266m9481j78996n8384K14926
14036B754514j29394J34863o64865N57757J86794k42675Q0104q0896J45061l9483
$$ y = [5656856, 5252565, 5274820, 5417758, 5388595, 5054338, 4822091, 4828129, 4846611, 4781350, 4763372, 4444204, 4667706, 4626968, 4732501, 4501855, 4589838, 4263220, 4407639, 4250173, 4104472, 4126026, 4268523, 4289105, 4102816, 3977073, 4194780, 3927391, 4131879, 3996491, 3919654, 3758852, 3927919, 3882458, 3609823, 3741298, 3484588, 3528161, 3692822, 3557978, 3180848, 3573101, 3482030, 3466793, 3300744, 3380103, 3415245, 3493380, 3171953, 3307105, 3478016, 3202913, 3352303, 3012965, 3279756, 3009154, 2793525, 2987576, 2846818, 2977485, 3209146, 2866905, 3118340, 2844013, 2959714, 2500183, 2826449, 2776968, 2597972, 2539588, 2754514, 2625120, 2759983, 2095118, 2652875, 2839669, 2596994, 2677098, 2596202, 2741263, 2701780]
14026B701780k31978r7644O0866K03799m8586m92260K48718L54133m24129k58324
14016B016375K81779l14205K16335k62325r8861K45167j51423J15996o66527O67185
14006B049496j60796j57964o6935J10330R0993j35731j1134j68236J9481R8935
13996A668439J23137m34348O67246m87082J51650M13126N44015O17437K588277
13987E851897N778687J5409395J5369123j8991124j0788222n210950k224706j358803
13979C835297n57323k07028n66994J3257j47684K00081n18147O1182k49369k4919
13969A838353K49329J58695k92419K81112m59162r250j14036O6123J96559k09250
13959A706054j36172J57133j42358J83367n2235L06307m46367J25457p0941j25254
$$ y = [2701780, 2469802, 2372158, 2433024, 2636823, 2588237, 2095977, 2344695, 2698828, 2274699, 2016375, 2298154, 1983949, 2200284, 1937959, 1839098, 2084265, 1932842, 2048838, 1382311, 2049496, 1888700, 1730736, 1663801, 1774131, 1865124, 1729393, 1718259, 1550023, 1569504, 1668439, 1791576, 1357228, 2024474, 1537392, 1689042, 2102168, 2646183, 3263620, 5851897, 11630584, 27039979, 42409102, 23417978, 12629756, 7418806, 5194100, 3835297, 3277974, 3070946, 2503952, 2517209, 2369525, 2569606, 2051459, 2112641, 1863272, 1838353, 2087682, 2246377, 1953958, 2235070, 1775908, 1766658, 1652622, 1718745, 1915304, 1706054, 1569882, 1727015, 1584657, 1768024, 1715789, 2022096, 1575729, 1701186, 1630245, 1504991]
13949A504991Q0264J25547Q3453j38256l44342M16013j53011k16861p0154J10135
13939A397779J17730j38254J62907j67093p7505K2547K42515m25641K52628j91184
13929A196429K12272r2383J03600j18424j35601J90069j85473K11618n26510M97584
13919A353181j86543P3368L40541p7000l37888j36109L92574n6889m0716k41302
13909A083217K95920m43027M63567n995k51793p8749k7944j7773J2244K97401
13899A327068k66539J60897l64638m814l2249M08650j41805K2645L2001j85806
13889I55410j75978K42412L8777J91559m51919J31472K05245j41998N9454k10198
13879H44236L51990n17287L16257m61046N39319r7473Q2103m07533P63656E12494
$$ y = [1504991, 1585255, 1710802, 1794255, 1655999, 1311657, 1727670, 1574659, 1357798, 1287644, 1397779, 1515509, 1377255, 1540162, 1373069, 1295564, 1318111, 1560626, 1134985, 1387613, 1196429, 1408701, 1316318, 1419918, 1301494, 1165893, 1355962, 1170489, 1382107, 855597, 1353181, 1166638, 1240006, 1580547, 1503547, 1165659, 1029550, 1422124, 1365235, 1324519, 1083217, 1379137, 936110, 1399677, 1393682, 1141889, 1063140, 1035196, 1017423, 1029667, 1327068, 1060529, 1221426, 856788, 851974, 819725, 1228375, 1086570, 1109215, 1141216, 955410, 779432, 1021844, 1060621, 1252180, 800261, 931733, 1136978, 994980, 1054434, 844236, 1196226, 678939, 995196, 534150, 1073469, 975996, 1058099, 650566, 1414222, 512494]
13868A125425k04974j30787L2981J11972J23023L392j88552J0219J17583m1085
13858I59197J86257j24729k71597J8411n2423K14822j99229l8744J47161k43565
13848E95561Q7702L70319k08427j13140O1238J12502m2628m7533m043q8307j35222
13837E88022M55597m07093K87413j65567P0657m5407j94551M94804q3116k68495
13827G32264j37281K01067L29119E16809K32100n1335J17778k56867K38260J60356
13817I57101j97696k22525L11160j12196o841q1516B94701M18810l0401j71737
13807E11373M12571m33696M31284j21503j98231l1884L47838m05064M24130m13963
13797E22855L8667J29070j31369r1571J79303N342j75779K60961k9851j72478
$$ y = [1125425, 920451, 789664, 822645, 934617, 1057640, 1061032, 872480, 882699, 1000282, 959197, 1145454, 1020725, 749128, 767539, 715116, 929938, 730709, 691965, 839126, 595561, 683263, 1053582, 845155, 732015, 793253, 905755, 863127, 815594, 811551, 723244, 588022, 1043619, 636526, 923939, 758372, 829029, 783622, 589071, 1083875, 1000759, 732264, 594983, 796050, 1125169, 516809, 748909, 697574, 815352, 558485, 796745, 957101, 759405, 536880, 848040, 735844, 729003, 647487, 294701, 713511, 683110, 511373, 923944, 490248, 921532, 800029, 601798, 569914, 917752, 512688, 936818, 522855, 561522, 690592, 559223, 467652, 646955, 652297, 476518, 737479, 707628, 535150]
13787E35150J44066M4724j70727j91485Q8330K81055k13001L96854D37446o6797
13777C70649M35113j73624J6006n1459M0296j28144j05235J62651q975J34773
13767F92051j408o79j82745K70995j43152j31566K9568J42836j25110P9417k4427
13756F05780r7237n323A99030K10704L5968j53342R8417k6102J10261A39465J48294
13745B87759K04801A57004L02031r8143L78154A80567J97097K82187r4089B19308
13734B92339P33855m39888j22213R0690L7203j25156L7509K7464j62002K72684
13724F42485J13817k46007j09278q3448K19561k39452J59838j37822J81792R4807
13714E96293j71742j50480N69401j68692j29839N08079D78131N8193K09217l54049
$$ y = [535150, 679216, 723940, 553213, 361728, 450058, 731113, 518112, 914966, 437446, 370649, 805762, 632138, 648144, 596685, 636981, 508837, 403602, 566253, 557278, 692051, 690643, 689964, 507219, 778214, 635062, 503496, 533064, 675900, 550790, 630207, 605780, 508543, 503220, 199030, 409734, 445702, 292360, 390777, 364675, 474936, 139465, 287759, 492560, 157004, 459035, 360892, 739046, 180567, 377664, 659851, 565762, 219308, 292339, 1026194, 586306, 464093, 554783, 591986, 466830, 504339, 531803, 369801, 642485, 756302, 510295, 401017, 317569, 537130, 297678, 457516, 319694, 501486, 596293, 424551, 274071, 843472, 674780, 544941, 1053020, 478131, 536324, 745541, 391492]
13704C91492N529O3048k03131j20059J20646Q4318l9101J96894j64647J44205
13694D79194K9569j52578J3083j3633M0565R7857j7700J48912k26597j43163K48801
13683E04310A56278L42214n0749L29483B91315G5588L49564j8537l644j17446
13673B85525K37901l1400j00238b2548D30371j79010K02447j73491L04723j28116
13663D56924J34577k22079O7572Q3746j51295o5003O3162L232R1194A47165K51589
13652C98754j05617l1217G3180K15539o5150J02606J38584k07401m0109K25223
13642D42472k7564j93129K55371q7533j6278K19367g9780D87637J85030B79984
13631C16481K62547j67047p6120k5634A39974P6120C3228M66278j85996J43042
$$ y = [391492, 397021, 460069, 256938, 136879, 257525, 341843, 302742, 499636, 334989, 479194, 508763, 356185, 369268, 355635, 396200, 494057, 476357, 625269, 398672, 255509, 504310, 156278, 498492, 447743, 777226, 291315, 75588, 425152, 406615, 402971, 285525, 523426, 492026, 391788, -22548, 430371, 251361, 453808, 280317, 585040, 456924, 591501, 369422, 436994, 520740, 369445, 304442, 367604, 370836, 462030, 147165, 398754, 293137, 261920, 73180, 288719, 223569, 326175, 464759, 257358, 217249, 442472, 414908, 221779, 477150, 389617, 373339, 592706, -79780, 487637, 672667, 279984, 316481, 579028, 411981, 335861, 310227, 139974, 216094, 33228, 499506, 313510, 456552]
13621D56552j5370O0101A23855J24920k1519N44601k77119A93252r3998K33560
13611C32814K41499a40083o6933A55441O8976k116g07E74928j56415J94778B63227
13599B67749R2032p9203J47919k5955m8649R0133J01476I8334J60682A1019K25869
13588B36888J49196j91853K16995j3015J31826k21393m1377q7865J1485J52513
13578C43400F1767J33715m5898D942a6740C76698D5013N71333A54774p5902K25337
13567C04209K4272p8172K46425B32097K3675J08501D9742K37818I3556J93575
13557B87131P256j4928n2991l1882J09136j11808O1397I5807M43919B08629J18035
13546C26664l4633j18000K83866a99929B57353j08448n3586J75158K0604J88041
$$ y = [456552, 441182, 501283, 123855, 248775, 227256, 771857, 494738, 193252, 99254, 332814, 574313, -140083, -207016, 155441, 224417, 222301, -707, 574928, 418513, 613291, 263227, 267749, 359781, 280578, 428497, 402542, 353893, 444026, 545502, 98334, 259016, 11019, 236888, 386084, 194231, 411226, 398211, 530037, 308644, 267267, 179402, 190887, 343400, 61767, 195482, 149584, 4942, -16740, 376698, 45013, 616346, 154774, 78872, 304209, 328481, 250309, 496734, 232097, 255772, 364273, 49742, 287560, 93556, 287131, 294387, 279459, 226468, 194586, 303722, 191914, 253311, 95807, 539726, 208629, 326664, 292031, 174031, 457897, -199929, 257353, 148905, 95319, 270477, 291081, 479122]
13536D79122A60443K56429j35438l937M5624j38725l5288j6275a48044c5915B57969
13524B85520J8496A10803Q8031b1806D06423e1608c794k07306D21950a53229F8596
13512C87682M9223j15852j52985j6259N6419a6601A24497J14000F2321L73118
13502D35439B10372K17824a5209l1192A41763M8946m3796K63405E4778M13597
13492D68375k31038p7359E1690R269J57891a33818C81203A73390K11139A15624
13481B03430F282J67980J14439h8076n9960B95457n4328j01951J25360e0320j17284
13470a67604C00121L8099l0297A00242L58732j48645j23223A7275J31548K69951
13460D18774A46068D2247J40595M682J72195E1684a29892C43024j59051M1077
$$ y = [479122, 160443, 416872, 281434, 277497, 323121, 184396, 149108, 132833, -148044, -35915, 257969, 285520, 304016, 110803, 198834, -21806, 406423, -51608, -3794, -211100, 421950, -153229, 68596, 387682, 436905, 321053, 168068, 151809, 208228, -16601, 124497, 238497, 62321, 435439, 210372, 428196, -15209, -46401, 141763, 190709, 146913, 410318, 54778, 468375, 237337, 159978, 51690, 60959, 218850, -133818, 381203, 173390, 384529, 115624, 203430, 6282, 174262, 288701, -88076, -148036, 295457, 241129, 139178, 264538, -50320, -167604, 300121, 338220, 307923, 100242, 458974, 310329, 187106, 17275, 148823, 418774, 146068, 42247, 182842, 187524, 359719, 51684, -129892, 343024, 183973, 225050]
13450B25050l7850N5380R255q1151O8092e368B72675M6845K7308B516K13707B6265
13437C1724K57733E6752L4355L20105j66943E2754N03178A43363j8223j500R7765
13426B21405L67K94324k16341j9805I2616Q137c7750A73939J21706C0897N0196
13415H1093q082a20392F3050g0258K7451A4638J87966G5735J90929l9560D8299
13403a7807E00492A69364e5312A02492J37391L5041M0564A47443e3798F8447J31825
13392B00272D1056c1046G7092a17811b3727E10689B38885R2524k151A28602J55226
13381B83828c0879B54562A24734K39603j56582d18k1746B4092K81694j45130N9017
13370B19673m0584K94177j54343p6454B8166L02255A62051N4787P1196A8991i9826
$$ y = [225050, 187200, 242580, 251835, 170684, 238776, -5368, 272675, 319520, 346828, 2516, 216223, 26265, 31724, 289457, 56752, 91107, 411212, 244269, 52754, 555932, 143363, 125140, 123640, 221405, 221772, 516096, 299755, 279950, 92616, 100753, -37750, 173939, 295645, 30897, 81093, 73011, -120392, 63050, -70258, -42807, 14638, 202604, 75735, 266664, 227104, 48299, -17807, 500492, 169364, -55312, 102492, 239883, 274924, 315488, 147443, -53798, 68447, 200272, 41056, -31046, 77092, -117811, -23727, 510689, 238885, 331409, 329258, 128602, 283828, -30879, 254562, 124734, 364337, 207755, -418, -22164, 24092, 305786, 160656, 219673, 179089, 473266, 318923, 242469, 28166, 330421, 162051, 216838, 288034, 18991, -99826]
13358A09982J26969J5061L7640n2244I6166a516A96801J10638R364q6182J33480
13347C64101i111j90963f7423A98441a31020C41413K44976k25077N3861A58290
13336C65767o1716A48337M30300B83084J00083H5205K4844k2797Q4156K44303
13326D15711j00305m3207B811L60796a09057C90283A52839D5607J97473R7116
13316C40196k5221a03999A75604E9814K70724A63743F3995L1438J26664C8437
13305B27837q2630J24135a34840F6711K07577a14327D3533a71846O4354I0051
13294B29890E6560J86456p7277a02106B20522F3373P9689i8675c9006k72891i7005
13282D8000K08723A24412h7029j18724E8458a63559P1649B96987j34292P1797
$$ y = [109982, 236951, 252012, 289652, 237408, 96166, -1516, 196801, 307439, 316803, 230621, 364101, -9111, -200074, -67423, 198441, -131020, 341413, 586389, 361312, 415173, 158290, 365767, 304051, 148337, 578637, 283084, 383167, 85205, 110049, 87252, 171408, 415711, 315406, 272199, 2811, 363607, -109057, 390283, 152839, 45607, 243080, 340196, 314975, -103999, 175604, 59814, 330538, 163743, 63995, 95433, 222097, 38437, 227837, 145207, 269342, -134840, 66711, 274288, -114327, 43533, -171846, -107492, 90051, 229890, 56560, 243016, 165739, -102106, 220522, 63373, 143062, -98675, -39006, -311897, -97005, 48000, 256723, 124412, -87029, -205753, 58458, -163559, -91910, 296987, 162695, 234492]
13272B34492a62894D59729B17226Q0543a9841G8169f0351A08305h9220k49645
13262c38865g8728A27585a59142F1093J00970I382N4902B1317K7934N9129N889
13251A14269B3286a17639E0696R64L55945j9869A82963g010B03064D3963J13733
13240A57696L8747a51401f0746D1783K57573o8511R9458r8534j14624J05925b9371
13228D0288J77340q1959m0887J23527j5791G1198M6235K4523a06002C3811L1844
13217F5655O6344a2510l9971C1834J12787F1417K51059E6121J75187P2936K1504
13206C25748a18346b5742B38812D940a99632B08340D2930P5690P8420a07835j48712
13195b56547R2747B2657J14430B8251O16179I2040A7859J09602A7294a0174j03693
$$ y = [234492, -162894, 459729, 217226, 297769, -19841, 78169, -60351, 108305, -89220, -338865, -78728, 127585, -159142, 61093, 162063, 9382, 64284, 21317, 49251, 108380, 114269, 23286, -117639, 50696, 51660, 407605, 387736, 182963, -7010, 203064, 43963, 157696, 196443, -151401, -60746, 41783, 299356, 230845, 330303, 231769, 117145, 223070, -29371, 40288, 217628, 135669, 94782, 218309, 202518, 71198, 117433, 141956, -106002, 33811, 65655, 131999, -12510, -52481, 31834, 144621, 61417, 312476, 56121, 231308, 304244, 325748, -118346, -25742, 238812, 4940, -199632, 208340, 42930, 118620, 197040, -107835, -256547, -163800, 22657, 137087, 28251, 644430, 92040, 17859, 127461, 17294, -10174, -113867]
13184a13867B38459r3044K6592p7676J90345j34626M6074l6598F2799Q5633C7683
13172a49676D96164a25424B837d3828k71043D2709a874k90479C05452A06282a90389
13160e2120B74035E3978d7474l27088A61048a89488P0554D17183a8666A07400
13149a33232B95902M2614m6540a16361B33939a07135D7632K86679G1475c31075
13138B54666l7644b78854B22917i6045A71830j4147A0724J47947j398J32899h4697
13126B7922P5211b30081A00177C1859J71593a16083J1291D60634a20167A03416
13115B96728e2619A33871a3776j79424b1532F5087c59112a74509D89936A02526
13104a38134d3939C6476K33898k7591D8369J80064c3718A12927K23064A02505
$$ y = [-113867, 238459, 145415, 172007, 94331, 284676, 150050, 196124, 159526, 62799, 148432, 37683, -149676, 496164, -125424, 2837, -43828, -314871, 42709, -1874, -292353, 305452, 106282, -190389, -52120, 274035, 53978, -47474, -374562, 161048, -189488, -118934, 417183, -18666, 107400, -133232, 295902, 338516, 291976, -116361, 233939, -107135, 47632, 334311, 71475, -331075, 254666, 217022, -278854, 222917, -96045, 171830, 157683, 10724, 158671, 157273, 290172, -84697, 27922, 103133, -230081, 100177, 31859, 203452, -116083, -104792, 460634, -120167, 103416, 296728, -52619, 133871, -13776, -193200, -21532, 65087, -359112, -174509, 489936, 102526, -138134, -43939, 36476, 270374, 242783, 48369, 228433, -33718, 112927, 335991, 102505]
13093b41489e920B48795a09445b9915B68132a34047B75520e6235k9843B23471
13082f1749n1295j64457A05688R8039a96826b2157l0174q8436A39064a0265l09636
13071c19901G6916d021C54636b47397A92298I1388M6404d12453F479b132r0563
13060i2695b6585B18309a88797B42441C2471K834J50423L7110G1643K72956b94719
13048C19061F1033b6456j2036A23724K67990A15650c41558e8640B23814A00214
13037g7640r4671j65781B79850a2231B5050a90217A58516a55844a5250o008G382
13025b1106B09949c2809B63590F451J11480i6661A90188J06925Q5879A86220a18621
13013A91101G3976j6925M8380J81353g2676D30918A51446e67A31919B9947d18788
$$ y = [-241489, -5920, 248795, -109445, -29915, 268132, -134047, 275520, -56235, -86078, 223471, -61749, -113044, -277501, 105688, 203727, -196826, -22157, -52331, -140767, 139064, -10265, -319901, 76916, -4021, 354636, -247397, 192298, 91388, 137792, -412453, 6479, -2132, -92695, -26585, 218309, -188797, 242441, 32471, 35305, 185728, 222838, 71643, 344599, -294719, 319061, 61033, -26456, -38492, 123724, 391714, 115650, -341558, -58640, 223814, 100214, -77640, -172311, -338092, 279850, -12231, 25050, -190217, 158516, -155844, -15250, -21258, 7382, -21106, 209949, -32809, 263590, 6451, 117931, -96661, 190188, 297113, 382992, 186220, -118621, 191101, 73976, 57051, 105431, 286784, -72676, 430918, 151446, -567, 131919, 29947, -418788]
13001A12152K90165R6563a56564A4657c40710b308l4976k72700a37561e1113j15134
12990a66247C7819a01132B4260K01455m7799G4611N7645m7918C6534d5540J5547
12979b9993l8528l15674D04b39608A17864a4929P434F6131C0264j1775K54152
12968B72641q2097a79454e7511p5695J2270b8000q3312A3675b99074B30231a15496
12956B3827L62220A39933a54000G9209B0655a39196I5789M5818J10546A12930
12945F7091K84164d2178H1391c40038h3658A0418a17694A58254l6376J60797c6199
12933i8376m7702M4325B03526E8357L7078a78332e8188p4768d1k6450h341p3949
12921h2290j278F1245a18783M79n4518l4308J01548A09988D3667k392L18054I7791
$$ y = [112152, 402317, 498880, -156564, 14657, -340710, -2308, -37284, -309984, -137561, -51113, -166247, 37819, -101132, 24260, 225715, 177916, 74611, 132256, 84338, 36534, -45540, -29993, -68521, -384195, 404, -239608, 117864, -14929, -7495, 66131, 30264, 18489, 272641, 190544, -179454, -57511, -133206, -120936, -28000, -111312, 13675, -299074, 230231, -115496, 23827, 386047, 139933, -154000, 79209, 20655, -139196, 95789, 141607, 252153, 112930, 67091, 351255, -42178, 81391, -340038, -83658, 10418, -117694, 158254, 121878, 282675, -36199, -98376, -146078, -101753, 203526, 58357, 95435, -178332, -58188, -132956, -41, -26491, -8341, -82290, -83568, 61245, -118783, -118304, -172822, -207130, -105582, 109988, 43667, 41275, 359329, 97791]
12908h594A32955n6608R7987a667A11716N2190a35696H4965B3078R7613b55344
12896a9020k11577A86096b2701m5503o0499G0167K0762D195J43409a9909A00847
12884A62532b17978c4254A13252b58769i3785A74075b3244p5217M901A28213b14081
12872F835a61292H3356L6719a30008J6049M1776G7320b15604G0822r723d351j05044
12860a09395p3856P2095A03936c6714A06952a22804p9305a6193j22580Q978A18292
12848B66864g1070K1407B7771a00203j3476K3782c8027B30772a30243e8296j64411
12837b22707i9028a5808E1287j5775R5113f6992A02776J2167C0904J56986a4341
12825G3907K56130g5656I457b28277D2661a4400k27846d2671j51791F078b84686
$$ y = [-8594, 132955, 76347, 174334, -1667, 111716, 163906, -135696, 84965, 23078, 120691, -255344, -19020, -230597, 186096, -22701, -68204, -128703, 70167, 90929, 4195, 147604, -19909, 100847, 162532, -217978, -34254, 113252, -258769, -93785, 174075, -23244, -98461, -93560, 128213, -214081, 6835, -161292, 83356, 120075, -130008, -113959, -72183, 77320, -215604, 70822, 61099, -4351, -109395, -183251, -111156, 103936, -36714, 106952, -122804, -202109, -16193, -138773, -129795, 118292, 266864, -71070, -49663, 27771, -100203, -113679, -89897, -38027, 230772, -130243, -58296, -222707, -99028, -15808, 51287, 35512, 130625, -66992, 102776, 114943, 30904, 187890, -14341, 73907, 330037, -75656, 9457, -228277, 42661, -14400, -242246, -42671, -194462, 6078, -284686]
12813C96324A53672c25642B09678A7124M0265L6061J81442a06073k48426c0771
12802C7409J1711g5265E5723J31776H7842R9120K5491a95276A5924h7758C3986
12790a31247f5173E1566a40224l7766C65185a10308k30450C19353a4719G811K62675
12779B70486f6768d818l4241G0133e212B26882d32307e4135A25883R2594J3135
12768B31612D9296L8819b46485B15710Q3145A16127b3592A76720k2784I503J76886
12757A86389a0120p3638k01432J21866k78738e2200l2900k4328M7583H5793b09558
12745A75918g8834K8030k07597B83238a2704G8953e6362o2482P903A81805m645
12734A77160e0691F1555A6167c273C0371a09008B1648a9944O506j93369l5291
$$ y = [396324, 153672, -325642, 209678, 17124, 57389, 93450, 274892, -106073, -354499, -30771, 37409, 49120, -75265, 55723, 187499, 87842, 186962, 212453, -195276, 15924, -87758, 33986, -131247, -65173, 51566, -140224, -177990, 365185, -110308, -340758, 319353, -14719, 7811, 270486, -66768, -4818, -39059, 70133, -5212, 226882, -432307, -54135, 125883, 218477, 231612, 49296, 88115, -246485, 215710, 298855, 116127, -23592, 176720, 153936, 9503, 186389, -10120, -83758, -285190, -163324, -442062, -52200, -85100, -109428, -61845, 85793, -209558, 175918, -78834, -50804, -258401, 283238, -12704, 78953, -56362, -118844, -110941, 181805, 177160, -50691, 61555, 16167, -3273, 30371, -109008, 21648, -19944, -13438, -206807, -242098]
12723b42098i3666b5072j89701e7476H3784a55699J6741b0964m8924A61839n3231
12712A08608M7844G1233A4500J08930K81658b08478e9397I8999J45931g8651C71401
12700a16650B6872R4149G374b9355m4867A55816i4494F0713K9452j6057O1524
12689A35632a51255A82005b64106A13398b38766B30264D0172L53369n7196B1746
12678B29207j12602h0004f443A19200E1513b30158B3312b0189k4002A47659j4560
12667A33099b26499e9632C12254A21667j8286a64041n6954A09332a67363A01966
12656F8992K18918A22213M0895P295H397K6866a26367B481J44725p3269a4334
12644C6897A2247a47121K1781j64613J04545A29017a48905D94308A76780n9352
$$ y = [-242098, -93666, -25072, -214773, -57476, 83784, -155699, -138958, -20964, -69888, 161839, 108608, 156452, 71233, 14500, 123430, 405088, -208478, -59397, 98999, 244930, -78651, 371401, -116650, 26872, 121021, 7374, -29355, -74222, 155816, -94494, 60713, 90165, 74108, 135632, -151255, 182005, -264106, 113398, -238766, 230264, 40172, 393541, 336345, 21746, 229207, 116605, -80004, -6443, 119200, 51513, -230158, 23312, -20189, -44191, 147659, 133099, -226499, -59632, 312254, 121667, 103381, -164041, -220995, 109332, -167363, 101966, 68992, 287910, 122213, 163108, 170403, 8397, 35263, -126367, 2481, 147206, 73937, -14334, 36897, 12247, -147121, -125340, -289953, -185408, 129017, -148905, 494308, 176780, 117428]
12634A17428J3614J98150j40017q2825j2939m2312J30625p1941b56500h8828F3929
12622a29114A93466E7099B7479f3065A51025b72859C18451a89790A05045E1417
12611E0331J58348g4382B87656g0729B40708A04612L25989A21469D7798P2890
12601A20688F79b6270B53353A13313H398a39429B54891o1595b9473A47178R0557
12590B37735B0982J1092a99535I4433Q3579b0720j06731G7616c58741h2146k8558
12579a10704B86364h8084k29347N5621e7527A20447E7728c1198j2642c001A67388
12567d2561p9924d966E855a06558E08988i3283C35594j27889A00109C3506K46466
12556B79972e0504j72575I0017J00381b3716j63454A42586j0031a9283A04979
$$ y = [117428, 131042, 329192, 189175, 106350, 93411, 51099, 181724, 109783, -256500, -88828, 63929, -129114, 193466, 57099, 27479, -63065, 151025, -272859, 318451, -189790, 105045, 51417, 50331, 208679, -74382, 287656, -70729, 240708, 104612, 430601, 121469, 47798, 120688, 679, -26270, 253353, 113313, 8398, -139429, 254891, 193296, -29473, 147178, 237735, 20982, 32074, -199535, 94433, 178012, -20720, -127451, 77616, -358741, -82146, -110704, 286364, -88084, -317431, -261810, -57527, 120447, 57728, -31198, -43840, -3001, 167388, -42561, -122485, -4966, 5855, -106558, 508988, -93283, 335594, 207705, 100109, 33506, 279972, -50504, -223079, 90017, 190398, -23716, -187170, 142586, 132555, -19283, 104979]
12545F4320J67962B7735Q7740a20k3843B981J94045B0439c11487A51032M4952
12534A95984F3720M1212m454c95735A55326g3748q665F9910l3506L1611B8745
12522g8335j1618I7000b29976F7500a11344J5547E5815B74J24651B6375Q8987
12511A15362b74395A42529a06565j62964G9583A4312J62556n3150L5241A7987
12500I9562O6112a95278D9236R9707j7240c4543n0185A4791E934L62976q0762
12489B88148j8125c8048A11588j7751b12606B5222a12234B06763f150j14130j37771
12478b58051A3295c8137r4417A49277g604n195A9113J37475d24599a62998m5932
12467b08930E6054J9510O9225J41894F602L37981h1239a1196k2399r5784A02208
$$ y = [64320, 232282, 27735, 115475, -120, -23963, 2981, 197026, 20439, -311487, 151032, 195984, 63720, 104932, 100478, -395735, 155326, -73748, -82413, 69910, 36404, 68015, 28745, -78335, -89953, 97000, -229976, 67500, -111344, -95797, 55815, 274, 124925, 26375, 115362, -274395, 142529, -106565, -269529, 79583, 14312, 176868, 123718, 158959, 17987, 99562, 165674, -195278, 49236, 148943, 131703, -34543, -84728, 14791, 5934, 368910, 288148, 270023, -38048, 111588, 93837, -212606, 25222, -112234, 206763, -6150, -120280, -258051, 13295, -38137, -132554, 149277, -7604, -12799, 19113, 156588, -424599, -162998, -208930, 56054, 75564, 144789, 286683, 6602, 344583, -81239, -11196, -33595, -129379, 102208]
12455a78758A75200h771j13766B79886j32303b07892A8557a9711G5286K8166b61065
12443F4888f3098F4454O7372K50829A05328b01867b9066o2446j71367L4732E6748
12431C2589J2326e26323a87580F0212K45593o6753F7956i6123k06320A65128J35424
12420C00552A13653j8317d3914j85009J02606A26799b24897f8054j54029A28381
12409A09628d52810e9190l5850e427q8355A32246a74830A61433a65082E4915f8262
12397b47601d3519G2285d4970n8281A07429b02208C10196e5082A42615D5038a58849
12385B0586K65968e2875A4663J27788j9615P5032o7830J19362c04993C89382A26692
12373A51083c05860G544i2646A56670P3794b68356I8474e6353j23311N7042H5758
$$ y = [-178758, 175200, -8771, -122537, 279886, 147583, -207892, 18557, -19711, 75286, 103452, -261065, 64888, -63098, 64454, 131826, 382655, 105328, -201867, -29066, -91512, -262879, -228147, 56748, 32589, 44915, -526323, -187580, 60212, 305805, 239052, 67956, -96123, -302443, 165128, 300552, 113653, 95336, -43914, -228923, -126317, 126799, -224897, -68054, -222083, 128381, 109628, -452810, -59190, -95040, -5427, -93782, 132246, -174830, 161433, -165082, 54915, -68262, -247601, -43519, 72285, -44970, -103251, 107429, -202208, 310196, -55082, 142615, 45038, -158849, 20586, 286554, -52875, 14663, 142451, 122836, 197868, 130038, 249400, -304993, 389382, 126692, 151083, -305860, 7544, -92646, 156670, 230464, -268356, 98474, -56353, -179664, -122622, 85758]
12361A8572c00678D083i8059l67353F7634J68748q0238g6884k42695J52386O7503
12350i9690B73107E0492K06794h8114A23326a27443D6345M3897a32431G3218o609
12339F6609i9385K8105C13020j40527p8727j1298Q9088g2228G0777Q5530M9350
12328B05657I2092k6944j1938J31177N1506r2088P6762G5993c4349A14616p979
12317A06637j9838b50083A44396g3714E8665R364K68850c7942F640M2588K9318
12306G8546e3688A50969a3577o382p8610B74666C5080a08004M2182D40242a4198
12294A08126B4227b0427C49030d7977A335b7359A47676l0774N8988H4887J14550
12283A99437f8642j02794H505J27082a13454A34378b06509B33902C3523J66936
$$ y = [18572, -300678, 4083, -98059, -465412, 67634, 236382, 156144, -76884, -319579, -167193, -99690, 273107, 50492, 257286, -88114, 123326, -127443, 46345, 90242, -132431, 73218, 66609, -99385, -71280, 313020, 172493, 93766, 82468, 171556, -72228, 70777, 156307, 205657, 92092, 65148, 53210, 184387, 235893, 143805, 220567, 75993, -34349, 114616, 106637, 86799, -250083, 144396, -73714, 58665, 68029, 336879, -37942, 6640, 49228, 78546, -53688, 150969, -13577, -19959, -98569, 274666, 35080, -108004, -65822, 440242, -14198, 108126, 24227, -20427, 349030, -47977, 1335, -27359, 147676, 116902, 175890, 84887, 199437, -68642, -171436, 8505, 135587, -113454, 134378, -206509, 233902, 33523, 200459]
12273B00459H6620B5463j0518K34540B779J14077K1158J84897f7389A6705a07095
12261E1807J4499J09422P5561g299I9910b24167A89481d4050b1503m9030j14734
12250a85267f2382B05439B3083a66059A11754m741l581d06425A48206N1868l1964
12239A68110n6750A5391R7698N8556a65349a9243J723B25940K2341g3064r8137
12228a71201F4249J34171O2619J8909G4490K78584j11137k5825R6502A21518O748
12217A28266J84018n2494N9990M1061J6604r5962n8830J45700J16801j01875j73120
12206B10159Q779A08802J13310a22545a1151l6651H1303R3681e8662A58082J57489
12195C15571B5060J92456M949L65664A92410L2705m3708c3874E04360j45285P0813
$$ y = [200459, 86620, 25463, 14945, 249485, 2779, 116856, 138014, 322911, -67389, 16705, -107095, 51807, 66306, 175728, 251289, -7299, 99910, -224167, 189481, -44050, -21503, -70533, -185267, -62382, 205439, 23083, -166059, 111754, 107013, 103432, -406425, 148206, 200074, 168110, 111360, 15391, 113089, 171645, -165349, -19243, -17520, 225940, 248281, -73064, -171201, 64249, 198420, 261039, 279948, 74490, 353074, 241937, 216112, 312614, 121518, 128266, 312284, 259790, 319780, 360841, 377445, 281483, 222653, 368353, 485154, 383279, 210159, 218938, 108802, 222112, -122545, -11151, -47802, 81303, 174984, -58662, 158082, 315571, 25060, 217516, 222465, 588129, 192410, 225115, 181407, -33874, 504360, 359075, 429888]
12184D29888a23954A41269J23418j1787K0494i4508N141A98536P1640J28790j89414
12173B09552o8953C4183L86776B06228A01891l6592B6057a3443D04532j26381
12163B78151m0320J44608j13479r3501J4400a40484B84049d1092B25728g131j07831
12152a14962E8586a78506k53552f6187H5992K29485e4785q0916A61699c9570C69709
12140F1508N4664j3836j2847K67752d2159A34636b7503C61609A28307K90211A18870
12128g2215F4731l2340j5023K99236C6998J41825d3197A6068M1221a1396C7188
12116A42242P1331J20779i3771F9537J10899J46001I1286Q6054J27065h292A57126
12104B6243g2389k94552B14543I6306a00361k21468B69336A24979J65317A26564
$$ y = [429888, -123954, 141269, 264687, 252900, 273394, -94508, -89367, 198536, 270176, 398966, 209552, 140599, 34183, 420959, 206228, 101891, 65299, 26057, -13443, 404532, 278151, 237831, 382439, 268960, 175459, 189859, -140484, 284049, -41092, 225728, -7131, -114962, 58586, -178506, -432058, -66187, 85992, 315477, -54785, -135701, 161699, -39570, 369709, 61508, 116172, 102336, 89489, 357241, -42159, 134636, -27503, 361609, 128307, 418518, 118870, -72215, 64731, 32391, 17368, 316604, 36998, 178823, -43197, 16068, 57289, -11396, 37188, 142242, 213573, 334352, -93771, 69537, 180436, 326437, 91286, 177340, 304405, -8292, 157126, 26243, -72389, -366941, 214543, 96306, -100361, -321829, 269336, 124979, 290296, 126564]
12093B11921k9147F3846a2934C50553j45645a20417p782B35873p4309c0258G7427
12081A91418J876b13616j70093C3598R5529n3891J55649a90632A74874F0281b2420
12069C9124A3394a57666A08505m4475Q4549a49924a2579j83448N286j03132b4013
12057i9184A82046B7805r904L14194A63855B2291a02443A75325j580i6092k54528
12046c50620i2396C02733j42522E740a68390b0793l51688A19693D0822e7018G5864
12034c03819B09082K18761b6863C16619B4364h7725B98052m950a05598C18489
12023d16013B63671c14396b7653q1880A58103a9016k51705J20449j91780E6533
12012d5369o3818A16596K51405A35760b3425G333J91790b1658C2239a20604B2564
$$ y = [211921, 182774, 63846, -12934, 350553, 204908, -120417, -128199, 235873, 161564, -30258, 77427, 191418, 193294, -213616, -383709, 33598, 129127, 75236, 230885, -190632, 174874, 60281, -22420, 39124, 13394, -157666, 108505, 64030, 148579, -149924, -12579, -196027, -190741, -293873, -24013, -99184, 182046, 27805, 17901, 332095, 163855, 22291, -102443, 175325, 173745, -96092, -350620, -92396, 302733, 160211, 5740, -168390, -20793, -372481, 119693, 40822, -57018, 75864, -303819, 209082, 427843, -26863, 316619, 24364, -87725, 298052, 293102, -105598, 318489, -416013, 263671, -314396, -27653, -109533, 158103, -19016, -270721, -150272, -342052, 56533, -45369, -109187, 116596, 368001, 135760, -23425, 7333, 199123, -21658, 32239, -120604, 22564]
12000a17285d382B39460E8638k231a90797B7189a91698Q1961A88924m2833F2737
11988f2504J9985k1092a5764F4410k7318J83658j1505i8411B3357a61969D1787
11976a31984H2523d49253B32283b16662P2749P0574C7328J19716d2497E2130J7199
11965F9329P4031P958b10487I514M437a02627k4416E3002a65784L9038K5122P201
11953i4423r1488A8805i8177K6324G5834D26O7404g7459j46760B0248P3399A1138
11940C4022c8718a4800l0604p5205r3338D6910l018N057a1265A78386C6559F998
11927A51699g2351h359k74020a31244j48546a15115I8656N8620a50401C18330
11916D2504b71203B29200f430C20313p0415a81979A38273a15607D7314O588K01392
$$ y = [-117285, -4382, 239460, 58638, 56407, -190797, 27189, -191698, -109737, 188924, 146091, 62737, -62504, -42519, -63611, -15764, 64410, 37092, 220750, 209245, -98411, 23357, -161969, 41787, -131984, 82523, -449253, 232283, -216662, -143913, -73339, 37328, 157044, -42497, 52130, 69329, 143360, 151318, -210487, 9514, 13951, -102627, -127043, 53002, -165784, -126746, -101624, -94423, -185911, 18805, -98177, -71853, 75834, 426, 67830, -77459, -224219, 20248, 93647, 11138, 34022, -38718, -14800, -45404, -120609, -213947, 46910, 43892, 48949, -11265, 178386, 36559, 6998, 151699, -72351, -8359, -282379, -131244, -279790, -115115, 98656, 157276, -150401, 318330, 42504, -271203, 229200, -6430, 320313, 249898, -181979, 138273, -115607, 47314, 53902, 255294]
11905B55294k4681B7939J4892J17627c83922d137j79753P9462R769B00182c6945
11893g425I6490a53915B15666g2215a6671r5341c8759j2180I1513B001a94934
11881b91610B09659a00103o3720j5679D2037A6087f2555j93242A58276A8635d6834
11869e8649K5589p8011K2884N823j34047R476f2348A77281O3347a08806C21449
11857B54072a81504A53464D4254a41825a56k82635b5108r9758D61553b95613A98025
11845h4592j1982b370j74751B29484a19575B03989e4632k3847C4190a68553I2025
11833c23286Q1621B59798i5548b1613I1268c5496A36119c08609f1152A45112K1134
11822A66246a06250o0296e3471C3686b49543C1049a8572j34560l1496E5856c24030
$$ y = [255294, 230613, 27939, 42831, 160458, -383922, -4137, -183890, -104428, -94659, 200182, -36945, -7425, 96490, -153915, 215666, -72215, -16671, -112012, -38759, -50939, 91513, 2001, -194934, -291610, 209659, -100103, -163823, -179502, 42037, 16087, -62555, -255797, 158276, 18635, -46834, -58649, -33060, -111071, -88187, -82364, -216411, -206935, -62348, 177281, 240628, -108806, 321449, 254072, -181504, 153464, 44254, -141825, -156, -282791, -25108, -124866, 461553, -295613, 198025, -84592, -96574, -2370, -177121, 229484, -119575, 203989, -54632, -78479, 34190, -168553, 92025, -323286, -241665, 259798, -95548, -21613, 91268, -35496, 136119, -308609, -61152, 145112, 166246, -106250, -166546, -53471, 33686, -249543, 31049, -18572, -153132, -184628, 55856, -324030]
11810b5112k66868d8825k49637A03566a17920d2560b265A04306a69164P0373K1034
11799g7757F0539J10330D6978P0175f7328j86719b3702P675C7723N1832N3632
11788A43187b75580c2329k01924f6549C31868h1687C19509A14871b86897i813
11777b5419M59p2290L3565D0841c12215i2136j65532D3770e8867G3477a00092
11765I5416c92610C2386b5476l20135i3357o9224B89566c1743H1841e8162A4495
11753F0960c38306F4642j662h6908l1216C11689a01343L3082D7594L55115B5676
11741B94055f0908G2059d02171C17001a2920j40511B34380M0393r2063M8621a5428
11729b56077D3975i104A30507C4837c8342k53818C38421J0911b33926I9527b25431
$$ y = [-25112, -291980, -48825, -298462, 103566, -117920, -42560, -2265, 104306, -169164, -98791, -77757, 60539, 170869, 46978, 117153, -67328, -254047, -23702, -16027, 37723, 89555, 143187, -275580, -32329, -234253, -66549, 331868, -81687, 319509, 114871, -286897, -9813, -25419, -24960, -97250, -63685, 40841, -312215, -92136, -257668, 43770, -58867, 73477, -100092, 95416, -392610, 32386, -25476, -345611, -93357, -162581, 289566, -31743, 81841, -58162, 14495, 60960, -338306, 64642, 62980, -86908, -118124, 311689, -101343, -68261, 47594, 402709, 25676, 294055, -60908, 72059, -402171, 317001, -12920, -153431, 234380, 274773, 182710, 231331, -15428, -256077, 43975, -9104, 130507, 34837, -38342, -292160, 338421, 349332, -233926, 99527, -225431]
11717A41645c9B32179E2015A8838g2067k54441B8646c89514D94145a90009A79212
11705H5577b76743P4378l31901A08803J26909r7066a36431k02468R9031A72781
11694B20258j05991C5294c67891F0441A3770N7953K4274A5991h4176A07316a36784
11682B28634b57103J11201E3331f8580q8550L4346F44140h5804A40600J07518
11672B48118a032m324B65928b27316G5932h8627B4460b38787j2710R2039H4578
11660a22604B7224a76563B2328i4384j61380h0401D5801a65837b5542j86956j1318
11649b23816e6858A2028J86471a80061C0676K33849a5450A7635L8230J49023f4419
11637b9800A34198a51872C15001a86842C422R3368j012b72635f99k04085J844
$$ y = [141645, -39, 232179, 52015, 18838, -72067, -326508, 28646, -389514, 494145, -190009, 179212, 85577, -276743, -202365, -534266, 108803, 235712, 138646, -136431, -338899, -239868, 172781, 220258, 114267, 35294, -367891, 60441, 13770, 71723, 95997, 15991, -84176, 107316, -136784, 228634, -257103, -145902, 53331, -68580, -157130, -122784, 644140, -85804, 140600, 248118, -1032, -5356, 265928, -227316, 75932, -88627, 24460, -238787, -251497, -159458, 84578, -122604, 27224, -176563, 22328, -94384, -255764, -80401, 45801, -165837, -25542, -212498, -223816, -56858, 12028, 198499, -180061, 30676, 264525, -15450, 17635, 55865, 204888, -64419, -29800, 134198, -151872, 315001, -186842, 3422, 96790, 95778, -272635, -699, -204784, -202940]
11626b02940c7124j97244l2047m4062H0963L8330l2177a2334q699I8732b7468
11614b04109b5100B33076H3271J47644b5357H7631b04503M181k1684I7805e2768
11602b0720A25632J64819A05097a16166I2105a32570J6863D2406N3068C6748Q6682
11591A23430m9208f8657J4715n2497A03382l7584a20412D15011j78918I7551L02566
11580D00117A67605l1673C5005e4975j31626A45529b09367A71769a52199e1854
11569h4396l768B28354e3376A99144I4501P12Q4779J64830a0028l81799g3608
11557C1652P2478g086q127r05B22595F0869k5512K96839p5409c56018B73534j36062
11545A37472a05704A26413g9948j15576B1096a06443I6123k8584e16067F0325
$$ y = [-202940, -37124, -234368, -266415, -310477, 80963, 119293, 87116, -12334, -21033, 98732, -27468, -204109, -25100, 233076, 83271, 230915, -25357, 87631, -204503, -200322, -222006, 97805, -52768, -20720, 125632, 290451, 105097, -116166, 92105, -132570, -115707, 42406, 95474, 36748, 123430, 74222, -68657, -53942, -106439, 103382, 65798, -120412, 415011, 236093, 97551, 400117, 167605, 135932, 35005, -54975, -186601, 145529, -209367, 171769, -152199, -51854, -84396, -88164, 228354, -53376, 199144, 94501, 95213, 179992, 344822, -10028, -391827, -73608, 31652, 104130, -7086, -15213, -16118, 222595, 60869, 35357, 332196, 256787, -356018, 273534, 137472, -105704, 126413, -79948, -195524, 21096, -106443, 96123, 67539, -516067, 60325]
11534G4457p160F404J2204a2493m5483a4558A91457i1798L079q9120E4030J63530
11522B17560a05645B73124A2251J04255B8996P38J05918a71348B96475e4020C01448
11510I5750K32264c9583D80385G030J89272b8546E00341b04762G6861J25048k9752
11499A72157m5847K1598A0485f6491A42821B4176P3421b66088D09745F0336k8424
11488C1912K20869j15993m0226a15232C35409A9864K83143B5247a20184C21221
11477E8320a39994I5945b22627A29189R3464k6938a91113I2159K11969F063J75621
11466A81684K77705B27933A9972i9043C57059e4224H7191K31488j28986q4960
11456A04733J71948J51485m7168c8586B14728R7697j23745N9489D9634a85380
$$ y = [74457, 67297, 6404, 18608, -12493, -57976, -14558, 191457, -91798, -88719, -177839, 54030, 217560, -105645, 273124, 12251, 116506, 28996, 29734, 135652, -171348, 296475, -54020, 301448, 95750, 328014, -39583, 480385, 7030, 196302, -28546, 500341, -204762, 76861, 201909, 172157, 126310, 147908, 10485, -66491, 142821, 24176, 97597, -266088, 409745, 60336, 31912, 252781, 136788, 96562, -115232, 335409, 19864, 303007, 25247, -120184, 321221, 58320, -139994, 95945, -222627, 129189, 222653, 195715, -191113, 92159, 304128, 6063, 181684, 459389, 227933, 19972, -99043, 357059, -54224, 87191, 318679, 189693, 104733, 276681, 428166, 380998, -38586, 214728, 312425, 188680, 248169, 49634, -185380]
11445a71446b3370B07687j7983a94109g4490A16889b01312O2519B64161i588q2149
11434i1737D4810b2201l1088B32448q2044M2166L7331j6019r284a79543A99250
11422A57288N7417a51991b1130A33985a63914F2529l276J01986K398C3969A1032
11410B47610b27857H6309b55936G5835b92699a27755A07322J62248a10506B03527
11399b98805M9341D28694G3925h9240G9752d7795N786D9674b51784B53245g8242
11387H227i2358k37872C0896a32395O0890C9302R3892D1459M9649b22116A67355
11375A8343K63094J1700d3695B1226Q9359b51516N2483A26939b6572B91309g1469
11363d4756q9e465l7005A59347j2620K63194i2394B40048b4191C5683c45466J11738
$$ y = [-171446, -23370, 207687, 189704, -194109, -74490, 116889, -201312, -138793, 264161, -9588, -91737, 44810, -22201, -53289, 232448, 150404, 192570, 229901, 213882, 204598, -179543, 199250, 157288, 214705, -151991, -21130, 133985, -163914, 62529, 59253, 161239, 163637, 33969, 11032, 247610, -227857, 86309, -255936, 75835, -292699, -127755, 107322, 269570, -110506, 203527, -298805, -249464, 428694, 73925, -89240, 79752, -47795, -42009, 49674, -251784, 253245, -78242, 8227, -92358, -330230, 30896, -132395, -71505, 39302, 133194, 41459, 91108, -222116, 167355, 18343, 281437, 293137, -43695, 21226, 110585, -251516, -199033, 126939, -26572, 291309, -71469, -44756, -44845, -5465, -42470, 159347, 146727, 409921, -92394, 240048, -24191, 35683, -345466, -233728]
11351b33728E6403b8993A99603H9524f1370m0336B60866b81864h5147G4300J3722
11340H8022i1460B81925n5221b08129j37450P1606J26371d9810A59930g0639j21963
11329a92602Q4023D59298F7802b9327l67734C891P5196i0676h590B78091h2551
11317A54638b52235h7157F3021k7279b62592a2972G6767a96311e1937B874L008
11306E882c22585F1274K60297A12576k1270a13206a001j96606h1117p2373g0441
11294e0454D46957a81985g0021k24583E9915b47041F6668b37040a047n30032a51290
11282A86860k6662e6316K1678r5267G7129K18640H6421b45880j7153A95392a69820
11270A21695k5583j4820i0842A63985L733a58911j4295J2004B23909b6946Q951
$$ y = [-233728, 56403, -28993, 199603, 89524, -61370, -101706, 260866, -281864, -85147, 74300, 88022, -91460, 281925, 226704, -208129, -345579, -273973, -147602, -49810, 159930, -70639, -192602, -108579, 459298, 67802, -29327, -397061, 3891, 79087, -90676, -8590, 278091, -82551, 154638, -252235, -87157, 63021, 35742, -262592, -12972, 76767, -196311, -51937, 2874, 5882, -322585, 61274, 321571, 112576, 91306, -113206, -1001, -197607, -81117, -153490, -70441, -50454, 446957, -181985, -70021, -294604, 59915, -247041, 66668, -237040, -1047, -531079, -151290, 186860, 160198, -56316, -34638, -129905, 77129, 295769, 86421, -245880, -263033, 195392, -169820, 121695, 96112, 81292, -90842, 163985, 167718, -158911, -173206, -161202, 223909, -26946, -17995]
11259a7995j34443A22611a06395l9962N3058r64B30039b51910O0968A93973k0126
11248A73847e635j71232G8387d0354B35529b67277G8330a39145C18940d1906j20200
11237a62106P5721l7878A34114B8065F132c92507A00748e3042j10568J7095I0599
11225b33736j3847R2795k97635F7561H219Q8900A2226B516a35199l0399c3597
11213A2549L18574g1047j53074h4469a6288k036k28570I0551J88795a00064j38970
11202b39034D3042b16262h9700K0224j99719A4649D413c851m1922j06153K1489
11191a30437F0196h4453k54860N4315i0751A75162e4741B41381a5112A2328c42932
11179A21037c86352F0201J49171a52249f1418D4149J12563a25761A81012b22096
$$ y = [-17995, -152438, 122611, -106395, -146357, -93299, -94263, 230039, -251910, -190942, 193973, 173847, -5635, -176867, 78387, -40354, 235529, -267277, 78330, -139145, 318940, -41906, -162106, -86385, -124263, 134114, 28065, 6132, -392507, 100748, -53042, -163610, -146515, 90599, -233736, -247583, -154788, -452423, 67561, 8219, 97119, 12226, 2516, -135199, -165598, -33597, 12549, 331123, -71047, -224121, -84469, -16288, -18324, -246894, 90551, 279346, -100064, -239034, 43042, -216262, -89700, -69476, -269195, 14649, 4413, -3851, -45773, -151926, -130437, 60196, -84453, -339313, -284998, -90751, 175162, -54741, 241381, -15112, 12328, -342932, 121037, -386352, 60201, 209372, -152249, -61418, 44149, 156712, -125761, 181012, -222096]
11168b35368r1617b5189k91986A73914c63671J30501B00260b70513J03348r1640
11158b58805a02181G2060K7914k9715a7499j16448q5934j33939C739a25884p2668
11147a98552D1399i1505A43185l7265j5939l3335g3477H4100h4041m59354D8244
11135D21836j77063C849J31322m5361a16532M6333k7936a6220F7339f4371C741
11123H4780O0264h0326j1344D32167a20035j64664k3944I0980b25613f6343C447
11111C78143A53422b43775Q446H831i4071b5980F8690i5603A69216J96015q4997
11100B80234e3995B5719K72788b27B14507o613n526c9919B17836r4343K60800
11089C84293j65990J43237i1758B55720J82812j62745l3259d9204C94696P763
$$ y = [-235368, -326985, -25189, -317175, 173914, -363671, -233170, 200260, -270513, -167165, -258805, -102181, 72060, 99974, 70259, -17499, -133947, -219881, -353820, 3739, -125884, -198552, 41399, -91505, 143185, 105920, 89981, 56646, -73477, 84100, -84041, -543395, 48244, 421836, 244773, 3849, 135171, 89810, -116532, -70199, -98135, -16220, 67339, -64371, 3741, 84780, 145044, -80326, -91670, 432167, -120035, -284699, -308643, 90980, -225613, -66343, 3447, 378143, 153422, -243775, -235329, 8831, -94071, -25980, 68690, -95603, 169216, 365231, 280234, -53995, 25719, 298507, -227, 214507, 207894, 202368, -39919, 217836, 123493, 384293, 218303, 361540, -91758, 255720, 438532, 275787, 242528, -49204, 394696, 402459]
11079D02459G4161K12202A04289K12013R945j08417q8799J68059p3406K1816l8062
11068B07438K1841A02898M12583l6551j54254A42774K44906K55302r9405k04524
11058C39053L60651k33861O9984r4851K43283N3551l850B97218K71075L3904J17840
11047G20037N933q0414L68102j23515j24544J21225l08360J40244Q743J41596
11037H69047R1907l0799j99549K80957j1960k39897j551L3740N3234j58073j53013
11026E34043K0937J37456L5705j02596Q1131R2751k8513k13483J07523n0954k03004
11015D10996K74232C15532A50794L53299J1331k5595L85766j38429J69346l72258
11005E34254N7068L70222m35613j2995K37182j04064j10501j41155J71806K52830
$$ y = [402459, 74161, 286363, 104289, 316302, 326247, 217830, 129031, 297090, 223684, 245500, 207438, 229279, 102898, 515481, 478930, 324676, 142774, 387680, 642982, 543577, 339053, 699704, 465843, 535827, 440976, 684259, 737810, 733960, 297218, 568293, 602197, 720037, 725970, 645556, 1013658, 890143, 765599, 886824, 578464, 718708, 727451, 869047, 960954, 930155, 730606, 1011563, 999603, 759706, 758155, 791895, 845129, 687056, 534043, 554980, 692436, 728141, 625545, 706676, 799427, 770914, 557431, 664954, 614000, 410996, 685228, 315532, 150794, 504093, 515424, 489829, 875595, 737166, 906512, 534254, 591322, 961544, 525931, 512936, 750118, 646054, 535553, 394398, 566204, 819034]
10995H19034j21914k53301Q8582K67779k5609l03285J68201j25713J74229L84127
10985A072130n04331K44858k381l23521M64326j10492K42480n8953l6372q9639
10975H98105L75796j33383j6102J47801O76138K36179j9296L34345J66909L39477
10965C005969m0358M11727j09012m23671l36215k34583k48915m51677j6242M7603
10955A604626j65959l60607L02623j84004r1574K66516l26436k34423j39642q7400
10945E83720J77680j29840k69677j7256J22617k31696J50521j43454J86136A28426
10934A13134d2064A15366D9101P8576a55472E8449P9606a1912h92k24149A56070
10922h7812n80468A96710m4898E8649B7699p944O43J5420a29212o4474K0415G6649
$$ y = [819034, 697120, 443819, 532401, 800180, 774571, 471286, 639487, 513774, 688003, 1072130, 567799, 812657, 810276, 486755, 951081, 840589, 1083069, 1024116, 987744, 898105, 1273901, 1140518, 1124416, 1272217, 1948355, 2184534, 2165238, 2499583, 2666492, 3005969, 2965611, 3377338, 3268326, 2844655, 2508440, 2273857, 2024942, 1573265, 1557023, 1604626, 1438667, 1078060, 1380683, 1196679, 1105105, 1371621, 1045185, 810762, 671120, 583720, 761400, 631560, 361883, 344627, 467244, 235548, 386069, 242615, 428751, 128426, 113134, -42064, 115366, 49101, 127677, -155472, 58449, 138055, -11912, -892, -225041, 156070, -87812, -668280, 196710, 151812, 58649, 27699, 19755, 20398, 35818, -129212, -193686, -173271, 76649]
10909c4790m7984F5029k2383J29624b57817a5220k37178E4795O9055d5596A79102
10897a06155F9390A351a13259c6950j15633B42576e389j33951C06423a42227q1398
10886b23625R262k1077k24399J28586J53057C09128e933j8369H596N1761k1415
10875C8942a99090K1445h8209o1748a8441j1741B8503i0543B25565b01649J4152
10864a87497A09966a35962B5584c06040c1827F1614o565d0847k9305A00754c02043
10852A88400f447I0048D1819a19373A57584E2122g1050j92748K2533e33l96913
10841c97446I5831M1601F0536a20297M2290J9064e466A27902c6675a2626j53227
10830a65853L8207G7626K0217A7804c62716J50033A61702D2388L6544J04132J90489
$$ y = [-34790, -82774, 65029, 42646, 172270, -257817, -15220, -252398, 54795, 123850, -45596, 179102, -106155, 69390, 1351, -113259, -36950, -152583, 242576, -5389, -139340, 306423, -142227, -223625, -214363, -235440, -459839, -331253, -178196, 309128, -5933, -24302, 8596, 60357, 38942, -199090, -177645, -88209, -149957, -18441, -30182, 28503, -90543, 225565, -201649, -187497, 109966, -135962, 25584, -306040, -31827, 61614, 55049, -40847, -70152, 100754, -302043, 188400, -6447, 90048, 41819, -119373, 157584, 52122, -71050, -263798, -241265, -533, -397446, 95831, 137432, 60536, -120297, -78007, -58943, -5466, 127902, -36675, -12626, -165853, -127646, 77626, 97843, 17804, -362716, -212683, 161702, 42388, 78932, 183064, 373553]
10819C73553Q6104A09509j3768a12643D3492a86342B02783p8715d0661k10277
10809b50938L6600G6848P6690Q4839b5098q1154e1053k41260D7465b09757C5185
10797e1969B08162f9761p7430j56304b4632j02035J0371d7395C5073c68613i5400
10785a36884b4066n4176B10457O9816I9575a7221C54005kC9282J56907b57159
10773A89639a89558k5489e5321b0089j01757B03129d2824p5847l0963F9323a72851
10761H919N1507c5081j30401k2019a698A59344c6832a3747I4613e0989A50297
10749f4244j69384Q0551B08757b5780j41616C0285c1600q1997K4212C2967b0966
10737a49974A81253i2546D5370c76826h7983k97168R0667f7303J3800n20035a25041
$$ y = [373553, 459657, 109509, 95741, -112643, 43492, -186342, 202783, 124068, -40661, -250938, -214338, 76848, 153538, 238377, -25098, -106252, -51053, -292313, 47465, -209757, 35185, -51969, 208162, -69761, -147191, -303495, -24632, -126667, -116296, -47395, 35073, -368613, -95400, -136884, -24066, -78242, 210457, 280273, 99575, -17221, 354005, 354003, 39282, 196189, -257159, 189639, -189558, -215047, -55321, -20089, -121846, 203129, -42824, -118671, -149634, 69323, -172851, 8919, 60426, -35081, -165482, -187501, -1698, 159344, -36832, -13747, 94613, -50989, 150297, -64244, -233628, -153077, 208757, -25780, -167396, 30285, -31600, -113597, -89385, 32967, -20966, -149974, 181253, -92546, 45370, -376826, -87983, -385151, -294484, -67303, -53503, -573538, -125041]
10725g2051k69806a49277j19919i0353a366A33717a51924b367j12665B14471f6168
10713b76265j34568C7958c00948B37880G5206a49123j87076B36273b66270B8107
10702A36488g7330q1686O4423G4424L60280a34835C13529j09371b79738A05064
10691a29956E0224L906B3494e3613n1811J1106a8969c001A29290c48333J48529
10680a99804j31157J27819E2008h588k83813b8184n1793A9709a74638N6257j35553
10669b53934C47696g5738C4743d2259p4508L8751b4476j44027f9596j30864H8259
10657h8774j98097a13660n9147A12403h9006p0579f3512B30685a29965M670M6417
10646g8878Q441b5199k8683E2004a90618B86751b00456r9460e2532j74558A10539
$$ y = [-72051, -341857, -149277, -269196, -90353, -1366, 133717, -151924, -2367, -115032, 214471, -66168, -276265, -410833, 37958, -300948, 237880, 75206, -149123, -336199, 236273, -266270, 28107, 136488, -77330, -159016, -94593, 74424, 434704, -134835, 313529, 204158, -279738, 105064, -129956, 50224, 54130, 23494, -53613, -105424, -94318, -18969, -3001, 129290, -348333, -199804, -330961, -203142, 52008, -8588, -292401, -28184, -79977, 19709, -174638, -118381, -253934, 347696, -75738, 34743, -42259, -116767, -78016, -24476, -168503, -69596, -200460, 88259, -88774, -286871, -113660, -172807, 112403, -89006, -159585, -63512, 230685, -129965, -125295, -78878, -70437, -25199, -53882, 52004, -190618, 286751, -200456, -299916, -52532, -227090, 110539]
10634F9119A7135a7869j85898j59799J21866N2365e9496A21039m5787J41102G2930
10622C741i6607a5023j12198G2862b44047F25J01874f8220k60149O7313a17277
10610a40960j42708a40440A5834a32533b7371I832c6293A16861E3749e23350a9827
10598a12331r4342N1034H8673i4221J7424B12898L4748a08966j14760a9538k36398
10587b55936i2146r2438O0980B53845l0189o6491J73445a77645A36610a97884
10576a44259J9463j63654B2117L8694a16568a9024r8088A94011a53878A42632
10565b88249d0332H1060K035b54025A19699h8132A62253e0384A0038a33980N907
10554a28073F4293J6229N4135d3160A64747d976l9257B8702a54486A10041a64687
$$ y = [69119, 17135, -17869, -203767, -363566, -241700, -189335, -59496, 121039, 75252, 216354, 72930, 3741, -96607, -15023, -127221, 72862, -244047, 625, 102499, -68220, -328369, -261056, -117277, -140960, -283668, -140440, 15834, -132533, -27371, 9832, -36293, 116861, 53749, -523350, -19827, -112331, -206673, -155639, 88673, -94221, -76797, 212898, 247646, -108966, -223726, -19538, -255936, -92146, -184584, -123604, 253845, 223656, 157165, 330610, -177645, 136610, -197884, -144259, -124796, -288450, 22117, 60811, -116568, -19024, -117112, 194011, -153878, 142632, -288249, -40332, 81060, 83095, -254025, 119699, -88132, 162253, -50384, 10038, -133980, -128073, 64293, 80522, 134657, -43160, 164747, -4976, -44233, 28702, -154486, 110041, -164687]
10542G1460h254j92863d6432j91652g3496B50134A24936E3706j9767a51369m6582
10531a97951N4347g697H4759f9922H9590a66489E718a81004M7694F191a31539
10519a20884Q134G1421a62282H8772c49798c5172j79989E6529g7294G5725J716
10508G7441M2324a3726j7551A04117J06384b17549d2474k82797B3929b65138A27437
10496G5505e3974J9670A39492a44671A5346Q7727b23381A46352A5338J9497b45972
10484a4816l02946J32940P8238B23262h0280B5445O6453f6928D0805K93848A44082
10472D80202k26267l6177G5787O8041j0686M153J94965j64554a15766j24482q550
10461b48798h9584c4077A59845h858A39901o5260J69884i4664j89197F4181h2658
$$ y = [71460, -8254, -201117, -46432, -238084, -73496, 250134, 124936, 53706, 33939, -151369, -197951, -143604, -7697, 84759, -69922, 89590, -166489, 5718, -181004, -133310, 6191, -131539, -120884, -112750, 71421, -162282, 88772, -349798, -35172, -215161, 56529, -77294, 75725, 77441, 119765, -13726, -31277, 104117, 210501, -217549, -42474, -325271, 23929, -265138, 127437, 75505, -53974, -34304, 139492, -144671, 15346, 103073, -223381, 146352, 15338, 34835, -245972, -14816, -317762, -184822, -106584, 223262, -80280, 25445, 91898, -66928, 40805, 334653, 144082, 480202, 253935, 217758, 75787, 143828, 133142, 137295, 332260, 167706, -115766, -240248, -248798, -89584, -34077, 159845, -8858, 139901, 74641, 244525, -94664, -283861, 64181, -82658]
10449a01569j3724E6042K1549M88R987b09169k9007n0321b3537j43936M8150K8141
10437i1182L5263A62542a44221D6262g5225k57042A7754J65046b9020k63560J7305
10426b75275h2334F2298a24151c1018m2116A61377D0054o108K7357a93183c8585
10414a62543C6754g5355p4626A5428b64925j64148a00441B5136b89096a22432
10403e74790A16760c3326D361a54232n0145G4057j5040c6317a0260A2536B652
10391a11332A1193Q3484J4076e6353D01385f7480i903D06398j23102j1022B9291
10379A08919a29489B68233N1976j25377j002K61275i267C04940O9457h8810D44882
10367C53907o3739N2533J09920j45553k7320J40609J32286j29319L9901q7897
$$ y = [-101569, -115293, 56042, 77591, 78079, 88066, -209169, -238176, -288497, -23537, -167473, -119323, -91182, -55919, 162542, -144221, 46262, -75225, -332267, 17754, 182800, -29020, -292580, -275275, -82334, 62298, -124151, -31018, -73134, 161377, 40054, 33946, 61303, -193183, -38585, -162543, 36754, -75355, -149981, 15428, -264925, -429073, -100441, 25136, -289096, -122432, -574790, 116760, -33326, 4361, -154232, -204377, 74057, 59017, -36317, -10260, 12536, 2652, -111332, 11193, 94677, 108753, -56353, 401385, -67480, -9903, 406398, 283296, 272274, 29291, 108919, -129489, 268233, 320209, 194832, 193830, 455105, -9267, 304940, 374397, -88810, 444882, 353907, 290168, 342701, 452621, 307068, 279748, 420357, 552643, 423324, 463225, 375328]
10357C75328j15848P4223R3796r7722F4273K0807K06214F7646M21404m2899O7389
10346E13540J70035A70256J64866J48680j48534A17001M7177K087J55383D0016
10335a44600E17086A35124K38830A52905J01581A5056M7033R2391c87042c2734
10324b3612C22972H6758K92142j40582O8242A39620L9579H0665J99229L7573q2479
10313B34988J00345A52223K2412L2073D3216i0468a0246j75090g1758A67059O8647
10302B35706a63760A19183a46722g3170A75520c0629k23925D2514G684a88959
10291B19211b49360j68611B04430c8341j30280J0812A14111D7053M2564A442d9391
10279f3551j4109C1160J09603a4103B15998a89804f9471A05722i4251k36770J38369
$$ y = [375328, 259480, 333703, 427499, 329777, 64273, 85080, 291294, 67646, 489050, 446151, 513540, 683575, 170256, 335122, 483802, 335268, 117001, 164178, 166265, 321648, 40016, -144600, 517086, 135124, 373954, 152905, 254486, 15056, 62089, 154480, -387042, -32734, -23612, 322972, 86758, 378900, 238318, 306560, 139620, 179199, 80665, 279894, 317467, 234988, 335333, 152223, 174635, 206708, 43216, -90468, -10246, -185336, -71758, 167059, 235706, -163760, 119183, -146722, -73170, 175520, -30629, -254554, 42514, 7684, -188959, 219211, -249360, -417971, 204430, -38341, -168621, -157809, 114111, 47053, 89617, 1442, -49391, -63551, -77660, 31160, 140763, -14103, 215998, -189804, -69471, 105722, -94251, -331021, -192652]
10268a92652h1882L9229k32864Q5844B25072F4358K5544J93599c480l8867d082
10256c1556r0179n4537C69522F281L95322m7002C5541b0405r7098n5320b4188
10244d6626l12440J73229F7876b84514G5904b11948A05991c48970G7704L4377
10234A12081e814n7790J5806j12982A71939c6889A20121h372j22685A75546c15453
10222C5516J19835c11321A33427q082b78791G4628f540A69132b04645A04422A654
10210a13947A08820R9669b06747e3297q0833J8448E670a3429k40393J23684F0246
10198f7202A76753a02689A38823c095A60056P0291F198N8591c81127a34472a5760
10186C82844a94804B65037b019n66867d4348j11511A07171b13536I9602a30179
$$ y = [-192652, -81882, -42653, -275517, -189673, 225072, 64358, 89902, 283501, -3480, -42347, -4082, -31556, -121735, -176272, 369522, 6281, 401603, 354601, 35541, -20405, -117503, -172823, -24188, -46626, -359066, -185837, 67876, -284514, 75904, -211948, 105991, -348970, 77704, 112081, -5814, -63604, -47798, -160780, 171939, -36889, 120121, -8372, -131057, 175546, -315453, 35516, 155351, -311321, 133427, 125345, -278791, 74628, -6540, 169132, -204645, 104422, 1654, -113947, 108820, 208489, -206747, -53297, -134130, -115682, 5670, -13429, -253822, -130138, 60246, -67202, 176753, -102689, 138823, -3095, 160056, 230347, 6198, 64789, -381127, -134472, -15760, 382844, -194804, 265037, -2019, -568886, -44348, -155859, 107171, -213536, 99602, -130179]
10175a59902B2613i2400o8258q8081A81130h1160k81629a69956A00426g9593l10523
10164c90116G6813K54372B9913j3669e5967K7520n7557Q070j71671A84409b57051
10152i4233k5480A15128a16449H26b32684j00409J34061p9557C1181K09308a35129
10140b87252A44819a63384j96057J41548j1097d1856l403o2424A33495e5246A95627
10128b46106B18548B1085a66320P476j4004d3532j23404C2581b29497f5190a5997
10116b29840d1214p638Q511k24155F625a64527j00633Q080e2726m30272A393J550
10104B943i879H1644e0845b3869A2603h8937A18620i7095A54530l7198D447a77332
10091i3590A4390R8569d345n5447j64815H2219p549L7085C0085a21546B54019
$$ y = [-159902, 22613, -92400, -160658, -248739, 181130, -81160, -362789, -169956, 100426, -79593, -390116, 76813, 331185, 29913, 16244, -55967, -28447, -86004, -77934, -249605, 184409, -257051, -94233, -119713, 115128, -116449, 826, -232684, -333093, -199032, -278589, 31181, 240489, -135129, -287252, 144819, -163384, -359441, -217893, -228990, -41856, -45259, -107683, 133495, -55246, 195627, -246106, 218548, 21085, -166320, -158844, -172848, -43532, -166936, 32581, -229497, -65190, -15997, -229840, -41214, -48852, -40341, -264496, 6625, -164527, -265160, -257080, -52726, -482998, 1393, 2943, -9879, 81644, -50845, -23869, 12603, -88937, 118620, -97095, 154530, 117332, 4447, -177332, -93590, 14390, 112959, -4345, -59792, -224607, 82219, 74670, 111755, 30085, -121546, 254019]
10079b36872j55456J28277O9498M3951A61757d42072c5951o3996n35186J63289
10069d71844J99913O5810a02445j97762J28729C71997d30563M0912A19948b8159
10058A0199K48719h5403L3908m8026j36705N6310g0972r6327A4004K13729a21392
10046A72143a42484c9698H7499g5264B4775c51949A93947b10365D3218j9675b9520
10034B36496c57677B6965c7446J1882A01273J05784j03277j8725m1857j527a09761
10022a08865r4704O2023A32159c49003d4720C2977a62112l1322I0117J1915b39351
10010A26452o0343J82676a41080j57668O1496A21159c71j95228H4731c53168e350
9998i0003l2646C8689c3721D5934g4051p1948F378J7257H123a82834B53212r6435
$$ y = [-236872, -392328, -264051, -194553, -150602, 161757, -442072, -35951, -99947, -635133, -471844, -271931, -206121, -102445, -300207, -171478, 371997, -430563, -389651, 119948, -28159, 10199, 258918, -85403, -51495, -99521, -236226, -179916, -70972, -167299, 14004, 227733, -121392, 172143, -142484, -39698, 87499, -75264, 24775, -351949, 193947, -210365, 43218, 23543, -29520, 236496, -357677, 26965, -37446, -25564, 101273, 207057, 103780, 85055, 43198, 41671, -109761, -108865, -203569, -141546, 132159, -349003, -44720, 32977, -162112, -193434, 90117, 102032, -239351, 126452, 66109, 248785, -141080, -298748, -237252, 121159, -371, -195599, 84731, -353168, -5350, -90003, -122649, 38689, -33721, 45934, -74051, -145999, 6378, 23635, 8123, -182834, 253212, 156777]
9986A56777N9894k7032c32673k0338A09533N5562F9331C214L36698a00521l40540
9975d41061a50674N4002d4188p5174C1923i6622C0936i5117k61833g493j04261
9964a11754M0233q6426E545a57354M2282K8045f241C5443b6183l3431j37063A94792
9951c31477J28539I5562a40630o9570g2432l673B9786a51478f0448j26337B7393
9939b47470f2193K0734A4956a23175J7151k3308p078j331B6660b37368Q4295O7639
9927h5434E8407a69784d1345p0597A05486G866f2451N416l47573Q3486A56132
9915D459c0791k7346j81751c8978C9179a28055D0733a02711M249B22115g7617
9903a81480I5659J04458K52880j79283a211j85940l7102k52350K07905I4874e0971
$$ y = [156777, 216671, 189639, -332673, -353011, 109533, 165095, 69331, 3214, 339912, -100521, -441061, -150674, -96672, -44188, -119362, 31923, -96622, 30936, -95117, -356950, -7493, -111754, -71521, -157947, 5545, -157354, -115072, -87027, -6241, 35443, -26183, -59614, -196677, 194792, -331477, -202938, 95562, -140630, -210200, -72432, -76105, 29786, -151478, -60448, -186785, 27393, -247470, -62193, -41459, 14956, -123175, -106024, -129332, -136410, -137741, 26660, -237368, -153073, -85434, 58407, -169784, -41345, -111942, 105486, 7866, -62451, -57035, -404608, -321122, 156132, 4459, -30791, -58137, -239888, -38978, 39179, -128055, 40733, -102711, -98462, 222115, -77617, -181480, 95659, 200117, 452997, 273714, -1211, -187151, -224253, -476603, -268698, 94874, -50971]
9891a75701O0412B00297c24027A4210h087j13291j46147a17086k10238c4151r6107
9880a30258A3932a64205A36072n3928I799a15046H3518a65143B7825b00498l6784
9869b37282I1420g1828A4532a05821D4111c14270a4630c417q9411F6680a08989
9857I474g9877J246b3331A30502a80681B41329b10153B3903J9468a39786L1345
9846a08441k56927a35606o9285R5860a2660n81955A00375J26705I4091L503a52303
9834A0787J37759p468a78665M2555J2966a9623k15892O280l1077G0791J6569l1725
9822E5635a01387P153Q169C33964A9579a61940A1224b01634n8257A57524a88453
9810a38727A27516b0287A8313e5157B53066e1652A30574i9986F1850N4764b73511
$$ y = [-175701, -115289, 200297, -324027, 14210, -8087, -121378, -267525, -117086, -327324, -34151, -130258, 13932, -164205, 136072, 82144, 9799, -115046, 83518, -165143, 27825, -200498, -237282, 91420, -71828, 14532, -105821, 44111, -314270, -14630, -3417, -92828, 66680, -108989, 9474, -79877, -78631, -23331, 130502, -180681, 241329, -210153, 23903, 43371, -139786, -108441, -365368, -135606, -204891, -109031, -12660, -594615, 100375, 227080, 94091, 97594, -152303, 10787, 148546, 141078, -178665, -136110, -123144, -19623, -235515, -229235, -260312, 70791, 87360, 55635, -101387, -94234, -86065, 333964, 19579, -161940, 11224, -201634, -259891, 157524, -188453, -138727, 127516, -20287, 18313, -55157, 253066, -51652, 130574, -99986, 61850, 116614, -273511]
9798a84831E6530a2290Q96j81520I1899a60192p2918J2068J7132A06679c17936
9786A56720g1239C5652Q9113D4638g5244l248j84112P5039A42658F4340O0239
9775A24579b6250k12776i1767K8066j61988l2883A16449m5133a30126l7276p0294
9764b37696j18553b0112r549j40519A53250a98492j930J7139a2079A70615h0718
9752G2610a11822k5753q2386Q2656B73990r7579C0115g3270A93237b32815a15745
9740a52534e422H0973d5886A04275a17955C56366a60063j4067l1080D02672h6144
9728A28242b07115C4174b92119I3663c64290d4326J928A3588J50270a38380c1860
9716b83961B79297q8912R761c86938e8175B03621a00711j24057d7723d443D7745
$$ y = [-184831, 56530, -12290, -11394, -192914, 91899, -160192, -233110, -221042, -203910, 106679, -317936, 156720, -71239, 35652, 124765, 44638, -75244, -78492, -262604, -187565, 142658, 64340, 124579, -26250, -239026, -91767, -63701, -225689, -258572, 116449, 71316, -130126, -167402, -237696, -356249, -20112, -29661, -170180, 153250, -198492, -200422, -183283, -12079, 170615, -80718, 72610, -111822, -137575, -219961, -137305, 273990, 176411, 30115, -73270, 193237, -232815, -115745, -152534, -5422, 80973, -45886, 104275, -117955, 356366, -160063, -174130, -205210, 402672, -86144, 128242, -207115, 34174, -292119, 93663, -364290, -44326, -42398, 13588, 163858, -138380, -31860, -283961, 279297, 190385, 200146, -386938, -58175, 203621, -100711, -224768, -47723, -4443, 47745]
9704a49833D0655j791c26525i829G3594b05432M0153p6987F9687J70375B0128
9692A39148c8618r2898e0168o0354r2690n3099B6785b0862E1007b95585E7520
9680I1903b88168K0784D6041a54953n1979j0354N2757H6439a75724B76750C0995
9668b9068B7191a2393j22798Q823E1059K3000c60027J32905g1512l13987g2040
9656a51375A16259n5236a68009g0900C252b79724O6205l6048E0358K2529a27065
9644a88457q4015e7473l94733F3878c58897b410D2178J32897d76887A65513m5732
9633A19781R8867B6837R8521J62114b52934b5869j94000c3354j50310C6079i9275
9621e3938j10096o738g1744d287l06879J53030D2018f5129k75839A13446d3232
$$ y = [-149833, 40655, 38864, -326525, -9829, 73594, -205432, -165279, -242266, 69687, 240062, 20128, 139148, -38618, -131516, -50168, -110522, -203212, -256311, 26785, -20862, 51007, -295585, 57520, 91903, -288168, -267384, 46041, -154953, -206932, -217286, -164529, 86439, -175724, 276750, 30995, -29068, 27191, -12393, -135191, -126368, 51059, 74059, -360027, -227122, -71512, -385499, -72040, -151375, 116259, 61023, -168009, -70900, 3252, -279724, -213519, -249567, 50358, 72887, -127065, -188457, -272472, -57473, -452206, 63878, -358897, -2410, 42178, 175075, -476887, 165513, 119781, 218648, 26837, 125358, 287472, -252934, -25869, -219869, -33354, -183664, 36079, -99275, -53938, -164034, -170772, -71744, -4287, -311166, -158136, 42018, -65129, -340968, 113446, -43232]
9609A10090i0262c7123k27841k4305i1396E5187c14795N3544R6933A22136j7991
9598A04145J07352b91244a07067J02b5138n3209j5473B40748a35339A73855C1544
9586h7272j8769n9294N7048N1105n1469o0396B85211e4876B22171P8956b30644
9574d393k50589f6546A68601a57713A76916b6667k49483A2963d4874p3263J5628
9563a02509C46180A16995A6006c97419a01596C19543A33505m2938b25266A23079
9552F7387b1433j46338A07916J0638a90980i1546B97584g1443q4597A8116d6307
9540b0590E774b67117i2560k1733A6577d1640C0698M503b8641r8505H7380b52761
9527a06345r0247p198A32031b35334B18479J28614g62H2217b55266A00604m6378
$$ y = [110090, -90262, -37123, -264964, -289269, -91396, 55187, -314795, -261251, -164318, 122136, 104145, 211497, -291244, -107067, -106965, -25138, -78347, -93820, 240748, -135339, 173855, 31544, -87272, -106041, -165335, -108287, -57182, -108651, -169047, 285211, -54876, 222171, 301127, -230644, -4393, -254982, -66546, 168601, -157713, 176916, -26667, -276150, 12963, -44874, -118137, -102509, 346180, 116995, 16006, -397419, -101596, 319543, 133505, 90567, -225266, 123079, 67387, -21433, -167771, 107916, 118554, -190980, -91546, 297584, -71443, -156040, 18116, -46307, -20590, 5774, -267117, -92560, -114293, 16577, -41640, 30698, 35201, -28641, -127146, 87380, -252761, -106345, -196592, -203790, 132031, -235334, 218479, 347093, -762, 82217, -255266, 100604, 54226]
9516E4226J55472c447j87227A68492E4746a88606E8035A8973a03518F2206B9719
9504C2412K39702A8713c8291l9004J7461k2344C94684G691i8216j13549L6628
9493a75137q3873f9476k63692J49763q5793B68090b38781m2467n3618h9862d1730
9481B29581a30352j78563O8475K6334I5028Q388a67451e283B36639a47126M9204
9470i7922j51824l119C324i3343A23414D428g0769j24205A0193J5449a86743B83535
9457A71193b0922q7933J4506K8455b5888A10966b16168B5360d03102I4542B5099
9445a59531K9900L3229k36586B02558a27221A1816Q7285B9883Q0964n2451a62531
9433A1128c5187k5135C3418k803a35522l2420b7600n6058c516j38128k35503h3297
$$ y = [54226, 209698, -3447, -190674, 168492, 54746, -188606, 58035, 18973, -103518, 62206, 29719, 32412, 272114, 18713, -38291, -77295, -59834, -82178, 394684, 7691, -98216, -211765, -175137, -259010, -69476, -333168, -183405, -269198, 268090, -238781, -281248, -334866, -89862, -41730, 229581, -130352, -308915, -240440, -214106, 95028, 103416, -167451, -5283, 236639, -147126, -97922, -249746, -252865, 3324, -93343, 123414, 4428, -70769, -194974, 10193, 25642, -186743, 283535, 171193, -20922, -108855, -94349, -65894, -25888, 110966, -216168, 25360, -403102, 94542, 25099, -159531, -129631, -96402, -332988, 202558, -127221, 11816, 99101, 29883, 110847, 58396, -162531, 11128, -35187, -60322, 33418, 30615, -135522, -167942, -27600, -83658, -3516, -141644, -377147, -83297]
9420A85769b80809I2364c38909a19457l2488b6468B69584b02515A27225g2434
9409c39795A72107A4428R0902j6844D2868b38808B6101e40j1465o6375B4577i2997
9396a42144r7866J07065B4946b07500A6990J63211b55066C26753a72056N0888
9386a21168l28736h5345k66392a4958j33126o3895h2893L8311H3441c07462h7944
9374I0798b23443J09978A2986d4250A30234f4223B04089b79526j19646B06660
9363a07801m4299H2468J188g3795j40526i0573I2526a29100A64343j1888c20438
9351b07062K9049M9B5316M9410i3088B54620J32759a37745B23212a65429H6562
9339B07854f4749A05884f6026q2249f6887h201A75463a73921K0253o2530m2002
$$ y = [185769, -280809, 92364, -338909, -119457, -151945, -26468, 269584, -202515, 127225, -72434, -339795, 172107, 14428, 105330, 88486, 42868, -238808, 26101, -540, -12005, -78380, 24577, -92997, -142144, -240010, -132945, 24946, -207500, 16990, 180201, -255066, 326753, -172056, -121168, -449904, -85345, -351737, -14958, -148084, -211979, -82893, -44582, 83441, -307462, -87944, 90798, -223443, -113465, 12986, -44250, 130234, -64223, 204089, -279526, -399172, 206660, -107801, -152100, 82468, 83656, -73795, -214321, -90573, 92526, -129100, 164343, 152455, -320438, -207062, -178013, -177964, 25316, 74726, -93088, 254620, 387379, -137745, 223212, -165429, 86562, 207854, -64749, 105884, -66026, -148275, -66887, -8201, 175463, -173921, -153668, -216198, -258200]
9328b58200B53079b64847A39335g4266r5987c7050j1964j1740p5356e4341B72924
9316f0116k3906m488F8341J91838a39943o9030F8072e0477D3560e1389k72986
9305c24375a23014n1690B92078i2228j78659A3880Q5027a87526j59323i5739E4102
9293B09841a53557A42055a50099B59P4232a54203A41838a0648j31432j28537i2109
9281b89442A26195h3881j3887c5038D1152a46654d1465A51958a60711k64638a45642
9269e5244j2732B96866d30470B12758e2147F8301A2300b7479o6311A37665a85439
9257B38027i0275B45145e9746j14247j3228k31441A6686J71930b66432G4116b9812
9245G4592K2557b48491l1921i3941J5698m6473B1454J13605c47762a20302j4194
$$ y = [-258200, 253079, -264847, 139335, -74266, -170253, -37050, -49014, -60754, -136110, -54341, 272924, -60116, -84022, -88510, 68341, 260179, -139943, -208973, 68072, -50477, 43560, -51389, -324375, -123014, -174704, 292078, -92228, -270887, 13880, 98907, -187526, -346849, -95739, 54102, 209841, -153557, 142055, -150099, 259, 74491, -154203, 141838, -10648, -142080, -270617, -92109, -289442, 126195, -83881, -97768, -35038, 41152, -146654, -41465, 151958, -160711, -425349, -145642, -55244, -67976, 296866, -430470, 212758, -52147, 68301, 12300, -27479, -93790, 137665, -185439, 238027, -90275, 245145, -59746, -173993, -187221, -418662, 16686, 188616, -266432, 74116, -29812, 74592, 97149, -248491, -280412, -93941, -78243, -124716, 21454, 135059, -347762, -120302, -134496]
9234a34496H976c42969A36590e7815G8233J0039a78949k791F1856a89061g0179
9222a36622l20908J21652H556M6105a35825K8248G4948j6029A3117N6663L1677
9211A01457a45607j09479B7838b68629R3456A73451b4181A65517B4586a60743
9200F6890Q3917k4684P5117a50699C7905J3175c46102R245J49032G2900a71757
9188b65504L6104M6948j1158h9137A74619D5961J19028l2905o0536O4532N3750
9177A89830N6412B6839J83962a77586m8208m1009D1817a41078J1819E1396d30760
9165A45441a22298K9321A56569a51833A44165a14597b1080F470a49179d789B26336
9153B34551d0491J6324l5267j64396B29722c90609A76928A4083M498a35105a1583
$$ y = [-134496, 8976, -342969, 136590, -57815, 78233, 88272, -178949, -181740, 61856, -189061, -70179, -136622, -457530, -335878, 8556, 54661, -135825, -107577, 74948, 58919, 13117, 69780, 101457, -145607, -255086, 27838, -268629, -175173, 173451, -24181, 165517, 24586, -160743, 66890, 150807, 126123, 201240, -150699, 37905, 51080, -346102, -336857, -187825, 72900, -171757, -265504, -229400, -182452, -193610, -89137, 174619, 45961, 164989, 132084, 71548, 136080, 189830, 246242, 26839, 210801, -177586, -225794, -266803, 41817, -141078, -129259, 51396, -430760, 145441, -122298, -92977, 156569, -151833, 144165, -114597, -21080, 6470, -149179, -4789, 226336, 234551, -40491, -24167, -59434, -223830, 229722, -390609, 176928, 14083, 18581, -135105, -11583]
9141A46253a8203j2943B22818r2428m3037Q6115b95924A05299b6754o8432I6982
9129a77848B10990a36650h905j790A54218a09980k19770G6677C4358a6426k57932
9118b74358A42524J2550E0888G69b6118H5762A6621b88458J2304i8900j102K4065
9106g5937A16468m0105f0587j11506A04417C1102h6039o08880e0118j64411A49890
9094C4630c64204E5862B3912e9365B6262c7598B6661a88467A19193Q7343a30593
9082i8987A59441a52773J2426j64015J10544A70710i84G4075J8575p99a21760
9070c7347b302A3857c4019A50769a44384A1799K0724a34713D024c32833g5107
9058B52778g1951l7821j68688a9845j85528Q0765J9285j3058A10283c8052j54075
$$ y = [146253, -18203, -31146, 222818, 130390, 87353, 173468, -295924, 105299, -26754, -95186, 96982, -177848, 210990, -136650, -8905, -10695, 154218, -109980, -329750, 76677, 34358, -16426, -274358, 142524, 155074, 50888, 769, -26118, 85762, 16621, -288458, -276154, -98900, -100002, -75937, 116468, 76363, -60587, -172093, 104417, 31102, -86039, -694919, -50118, -214529, 149890, 34630, -364204, 55862, 23912, -59365, 26262, -37598, 26661, -188467, 119193, 206536, -130593, -98987, 159441, -152773, -140347, -304362, -193818, 170710, -984, 74075, 92650, 91851, -121760, -37347, -2302, 13857, -34019, 150769, -144384, 11799, 32523, -134713, 4024, -332833, -75107, 252778, -71951, -109772, -278460, -19845, -205373, -124608, -105323, -118381, 110283, -38052, -192127]
9047a92127j38991K1357N0057A5188c59205A92291a17867l24291B14115c18738
9036b1954F4015h8010B57411h2925F5393e4058B73765a20548K0604m8331a0652
9024e2476B65749c78032a39321J8351k50466a49956A32262h1630A30091P5858
9014B05949B949b9588E9389K58879a14088q9370k7327c2506j59245d1263A59313
9002H369d65840a24733H1798a48445b2548p3688A19805a18749j22017A47296d6825
8990a95066g0668C85910G7281a33345L2r816A03059D3020a04402j1843j14226
8979b30471A50314j1243b6258q9949E2262K35501a11653C2047c36863J64669C63121
8967b74628A07375f8631B84257a5776B9084J6821J66094b64148E458b80988A71522
$$ y = [-192127, -331118, -309761, -259704, 15188, -359205, 192291, -117867, -442158, 214115, -318738, -21954, 64015, -88010, 257411, -82925, 65393, -54058, 273765, -120548, -99944, -148275, -10652, -52476, 265749, -378032, -139321, -120970, -371436, -149956, 132262, -81630, 130091, 205949, 2949, -29588, 59389, 318268, -114088, -203458, -230785, -32506, -191751, -41263, 159313, 8369, -465840, -124733, 81798, -148445, -22548, -96236, 119805, -118749, -240766, 147296, -46825, -195066, -70668, 385910, 77281, -133345, -133313, -143129, 103059, 43020, -104402, -116245, -230471, 150314, 139071, -26258, -116207, 52262, 287763, -111653, 32047, -336863, -172194, 363121, -274628, 107375, -68631, 284257, -15776, 29084, 45905, 211999, -264148, 5458, -280988, 171522]
8955a65556Q988A9995J47620G9758e9610B0450M4491f764j50643k84781a43375
8943b67347A71149E3994b14327O3833e1063A10220a38256Q817M5401p7501B30145
8931A33708o2631P7011a73222A93327L6584I8892c1699A46817l6117m1695J51800
8920B20805l1091K04793J38030a95428D8137g2092H8172L9680n8315l3431J01158
8909A37264o6046j4470d48114M583f406k8520B51617b6866r5765a9453r5980L8878
8897g6555C7509a98652i7132o9970m5146H3939O6146c24229n3572f4825J2094
8886e2731F4930b3920j73943C8372g2833A86467a90168p5470B81318a73013B3573
8874a47542n9443n5065J09560d5701A45362p1858C0344J85976f3812B65132b48615
$$ y = [-165556, -156568, 19995, 167615, 79758, -59610, 20450, 64941, -6764, -157407, -442188, -143375, -267347, 171149, 53994, -214327, -150494, -51063, 110220, -138256, -129439, -84038, -161539, 230145, 133708, 71077, 148088, -173222, 193327, 229911, 98892, -31699, 146817, 110700, 69005, 220805, 189714, 394507, 532537, -195428, 48137, -72092, 88172, 127852, 69537, 36106, 137264, 71218, 56748, -448114, -443531, -6406, -34926, 251617, -26866, -122631, -19453, -115433, -76555, 37509, -198652, -97132, -167102, -212248, 83939, 150085, -324229, -377801, -64825, -52731, 64930, -23920, -197863, 38372, -72833, 186467, -190168, -265638, 281318, -173013, 23573, -147542, -206985, -262050, -152490, -45701, 145362, 73504, 30344, 216320, -63812, 265132, -248615]
8862c75869b9707p5083B57363b40349F3669a02677j24786k4101A28346j8936k1348
8851H8062m395P6118L7683A7616a9402n7576L8268a3752j76706E7678b42940A24117
8838a20856N7077r9730A368a69421b3730o5159A8390c9809G5599a75795A62686
8826a13516B29526a19642C77663c08226A24805H192K28632I6607a55792G1329
$$ y = [-375869, -29707, -104790, 257363, -240349, 63669, -102677, -227463, -251564, 128346, 109410, 88062, 83667, 159785, 197468, 17616, -19402, -76978, -38710, -13752, -190458, 57678, -242940, 124117, -120856, -63779, -163509, 1368, -169421, -23730, -88889, 18390, -39809, 75599, -175795, 162686, -113516, 229526, -119642, 377663, -308226, 124805, 8192, 236824, 96607, -155792, 71329]
$$ [...]
##END NTUPLES=NMR SPECTRUM
##END=
