##TITLE=NES1050_10427_9270609_61D8CKfaId
##JCAMPDX= 6.0         $$ Bruker NMR JCAMP-DX V2.0
##DATA TYPE= NMR SPECTRUM
##DATA CLASS= NTUPLES
##ORIGIN= BRUKER
##OWNER= Administrator
$$ 1.72 TOPSPIN		Version 2.1
$$ 2015-07-18 19:48:48.744 -0700  Administrator@X
$$ Compression mode = diff/dup
##.OBSERVE FREQUENCY= 400.02188249412
##.OBSERVE NUCLEUS= ^1H
##.ACQUISITION MODE= SIMULTANEOUS (DQD)
##.ACQUISITION SCHEME= undefined
##.AVERAGES= 64
##.DIGITISER RES= 22
##SPECTROMETER/DATA SYSTEM= spect
##.PULSE SEQUENCE= noesygpps1d.comp
##.SOLVENT NAME= COFFEE_meoh
##.SHIFT REFERENCE= INTERNAL, COFFEE_meoh, 1, 14.963
##AUDIT TRAIL= $$ (NUMBER, WHEN, WHO, WHERE, PROCESS, VERSION, WHAT)
$$ ##TITLE= Audit trail, TOPSPIN		Version 2.1
$$ ##JCAMPDX= 5.01
$$ ##ORIGIN= Bruker BioSpin GmbH
$$ ##OWNER= Administrator
$$ $$ E:\/data/COFFEE/nmr/NES1050_10427_9270609_61D8CKfaId/32/pdata/1/auditp.txt
$$ ##AUDIT TRAIL=  $$ (NUMBER, WHEN, WHO, WHERE, PROCESS, VERSION, WHAT)
(   1,<2015-07-18 19:48:43.229 -0700>,<Administrator>,<X>,<go>,<TOPSPIN 2.1>,
      <created by zg
	started at 2015-07-18 19:37:13.619 -0700,
	POWCHK enabled, PULCHK disabled,
       configuration hash MD5:
       21 0F 79 D6 B3 7B B4 F6 88 20 88 DB 03 48 BD 9F
       data hash MD5: 64K
       B2 61 8A 24 CB 51 29 C1 E8 AF 54 94 A0 1D CA 19>)
(   2,<2015-07-18 19:48:46.604 -0700>,<Administrator>,<X>,<proc1d>,<TOPSPIN 2.1>,
      <Start of raw data processing
       efp LB = 0.3 FT_mod = 6 PKNL = 1 PHC0 = 0 PHC1 = 0 SI = 128K 
       data hash MD5: 128K
       83 90 BA 41 7D C1 4D 75 68 7A 07 A0 9B 64 D0 74>)
(   3,<2015-07-18 19:48:47.510 -0700>,<Administrator>,<X>,<proc1d>,<TOPSPIN 2.1>,
      <pk PHC0 = 269.209 PHC1 = 0 
       data hash MD5: 128K
       B0 3E 3F D0 E0 6D 0A CB 86 56 53 24 E0 E2 98 F6>)
(   4,<2015-07-18 19:48:47.916 -0700>,<Administrator>,<X>,<proc1d>,<TOPSPIN 2.1>,
      <abs ABSG = 1 
       data hash MD5: 128K
       49 37 31 EC 0A 6D D3 A8 83 E2 67 E5 C2 6C 08 A6>)
(   5,<2015-07-18 19:48:48.010 -0700>,<Administrator>,<X>,<proc1d>,<TOPSPIN 2.1>,
      <abs ABSG = 2 
       data hash MD5: 128K
       FB AE 3E D8 6A 41 C6 80 E6 D5 5E CC 27 28 12 A7>)
(   6,<2015-07-18 19:48:48.104 -0700>,<Administrator>,<X>,<proc1d>,<TOPSPIN 2.1>,
      <abs ABSG = 3 
       data hash MD5: 128K
       4D BF E1 E5 4B 24 7F 92 F5 62 CC 89 01 B9 B6 61>)
(   7,<2015-07-18 19:48:48.197 -0700>,<Administrator>,<X>,<proc1d>,<TOPSPIN 2.1>,
      <abs ABSG = 4 
       data hash MD5: 128K
       28 10 69 97 C8 18 B0 68 B1 AD F1 D2 13 08 74 8C>)
(   8,<2015-07-18 19:48:48.275 -0700>,<Administrator>,<X>,<proc1d>,<TOPSPIN 2.1>,
      <abs ABSG = 5 
       data hash MD5: 128K
       B9 05 FD 2C B7 28 C0 FE BA F2 92 3C CE F6 1B F9>)
$$ ##END=
$$ 
$$ $$ hash MD5
$$ $$ 8B AF 86 8E 1D 6D 74 84 FD 99 5F 69 80 1D 58 C0
##$RELAX= 
##$RELAX= 
##$RELAX= 
##$RELAX= 
##$RELAX= 
##$RELAX= 
##$RELAX= 
##$RELAX= 
$$ Bruker specific parameters
$$ --------------------------
##$DU= <E:\>
##$EXPNO= 32
$$ [...]
150 150 150 150 150 150 150 150
##$TP07= 0
##$TPNAME0= <>
##$TPNAME1= <>
##$TPNAME2= <>
##$TPNAME3= <>
##$TPNAME4= <>
##$TPNAME5= <>
##$TPNAME6= <>
##$TPNAME7= <>
##$TPOAL= (0..7)
0.5 0.5 0.5 0.5 0.5 0.5 0.5 0.5
##$TPOFFS= (0..7)
0 0 0 0 0 0 0 0
##$TUNHIN= 0
##$TUNHOUT= 0
##$TUNXOUT= 0
##$USERA1= <user>
##$USERA2= <user>
##$USERA3= <user>
##$USERA4= <user>
##$USERA5= <user>
##$V9= 5
##$VALIST= <valist>
##$VCLIST= <CCCCCCCCCCCCCCC>
##$VD= 0
##$VDLIST= <DDDDDDDDDDDDDDD>
##$VPLIST= <PPPPPPPPPPPPPPP>
##$VTLIST= <TTTTTTTTTTTTTTT>
##$WBST= 2048
##$WBSW= 25
##$XGAIN= (0..3)
0 0 0 0
##$XL= 0
##$YL= 0
##$YMAX_a= 7242178
##$YMIN_a= -14036164
##$ZGOPTNS= <>
##$ZL1= 120
##$ZL2= 120
##$ZL3= 120
##$ZL4= 120
##$ABSF1= 14.963
##$ABSF2= -5.595181
##$ABSG= 5
##$ABSL= 3
##$ALPHA= 0
##$AQORDER= 0
##$ASSFAC= 0
##$ASSFACI= 0
##$ASSFACX= 0
##$ASSWID= 0
##$AUNMP= <proc_prof1d_extract.lims>
##$AXLEFT= 0
##$AXNAME= <>
##$AXNUC= <1H>
##$AXRIGHT= 0
##$AXTYPE= 0
##$AXUNIT= <>
##$AZFE= 0.1
##$AZFW= 0.1
##$BCFW= 0
##$BC_mod= 0
##$BYTORDP= 0
##$COROFFS= 0
##$CY= 15
##$DATMOD= 1
##$DC= 0
##$DFILT= <>
##$DTYPP= 0
##$F1P= 0
##$F2P= 0
##$FCOR= 0.5
##$FTSIZE= 131072
##$FT_mod= 6
##$GAMMA= 0
##$GB= 0
##$INTBC= 1
##$INTSCL= 1
##$ISEN= 128
##$LB= 0.3
##$LEV0= 0
##$LPBIN= 0
##$MAXI= 10000
##$MC2= 0
##$MEAN= 0
##$ME_mod= 0
##$MI= 0
##$NCOEF= 0
##$NC_proc= -2
##$NLEV= 6
##$NOISF1= 0
##$NOISF2= 0
##$NSP= 0
##$NTH_PI= 0
##$NZP= 0
##$OFFSET= 14.963
##$PC= 1
##$PHC0= 269.209
##$PHC1= 0
##$PH_mod= 1
##$PKNL= yes
##$PPARMOD= 0
##$PPDIAG= 0
##$PPIPTYP= 0
##$PPMPNUM= 2147483647
##$PPRESOL= 1
##$PSCAL= 4
##$PSIGN= 0
##$PYNMP= <proc.py>
##$REVERSE= no
##$SF= 400.020008835306
##$SI= 131072
##$SIGF1= 0
##$SIGF2= 0
##$SINO= 400
##$SIOLD= 131072
##$SPECTYP= <>
##$SREGLST= <1H.CDCl3>
##$SSB= 0
##$STSI= 131072
##$STSR= 0
##$SW_p= 8223.68421052631
##$SYMM= 0
##$S_DEV= 0
##$TDeff= 65536
##$TDoff= 0
##$TI= <>
##$TILT= no
##$TM1= 0
##$TM2= 0
##$TOPLEV= 0
##$USERP1= <user>
##$USERP2= <user>
##$USERP3= <user>
##$USERP4= <user>
##$USERP5= <user>
##$WDW= 1
##$XDIM= 131072
##$YMAX_p= 394695097
##$YMIN_p= -10016
##$CURPLOT= <Network HP LaserJet P1505>
##$CURPRIN= <$Network HP LaserJet P1505>
##$DFORMAT= <normdp>
##$LAYOUT= <+/1D_H.xwp>
##$LFORMAT= <normlp>
##$PFORMAT= <normpl>
##$SURQMSG= 1
$$ End of Bruker specific parameters
$$ ---------------------------------
##NTUPLES= NMR SPECTRUM
##VAR_NAME=  FREQUENCY,     SPECTRUM/REAL,   SPECTRUM/IMAG
##SYMBOL=    X,             R,               I
##VAR_TYPE=  INDEPENDENT,   DEPENDENT,       DEPENDENT
##VAR_FORM=  AFFN,          ASDF,            ASDF
##VAR_DIM=   131072,        131072,          131072
##UNITS=     HZ,            ARBITRARY UNITS, ARBITRARY UNITS
##FACTOR=    0.0627417313425164, 1,          1
##FIRST=     8223.62146879497, -787,         -50006
##LAST=      0,             569,             -50304
##MIN=       0,             -10016,          0
##MAX=       8223.62146879497, 394695097,    0
$$ Real data points
##PAGE= N=1
##DATA TABLE= (X++(R..R)), XYDATA
$$ [...]
63304C08759j883j840j507j360j375j347j296j301j276j143r60o97j99L65M09
$$ 308759 306876 305036 303529 302169 300794 299447 298151 296850 295574 294431 293471 292774 292575 292940 293349
63289B93349l13j167j317p80l09k96k82K65J121J599J487J279J482J939K117J807
$$ 293349 293036 291869 290552 289772 289463 289167 288885 289150 290271 291870 293357 294636 296118 298057 300174 301981
63273C01981J245N85l33j494k364k311j287J90J459J982J497M75M1Q95K284K782
$$ 301981 303226 303811 303478 301984 299620 297309 296022 296212 297671 299653 301150 301625 301666 302561 304845 307627
63257C07627K069J254J313J926K220K008J803J994K569L284L775L722L290L144
$$ 307627 309696 310950 312263 314189 316409 318417 320220 322214 324783 328067 331842 335564 338854 341998
63243C41998L668M495N126N652O426P381Q231R125J0438J2015J3260J4014J4761
$$ 341998 345666 350161 355287 360939 367365 374746 382977 392102 402540 414555 427815 441829 456590
63230D56590J5794J6672J6804J6309J5885J5932J6068J5665J4670J3730J3386
$$ 456590 472384 489056 505860 522169 538054 553986 570054 585719 600389 614119 627505
63219F27505J3488J3597J3770J4398J5375J6052J6111J5897J5642J4950J3419
$$ 627505 640993 654590 668360 682758 698133 714185 730296 746193 761835 776785 790204
63208G90204J1218Q518M904R2n198r765j3204j6091j8915k1442k3046k3302k2282
$$ 790204 801422 809940 814844 814936 809738 799973 786769 770678 751763 730321 707275 683973 661691
63195F61691k0618j9092j7850j6309j4130j1788r706p416m414j279J057K783M824
$$ 661691 641073 621981 604131 587822 573692 561904 552198 544782 540368 539089 540146 542929 547753
63182E47753P173Q881R731J0638J2051J3307J4012J4852J6276J7413J7302J6395
$$ 547753 554926 563807 573538 584176 596227 609534 623546 638398 654674 672087 689389 705784
63170G05784J5807J5684J5395J4881J4716J4896J4576J3135J0871Q432O094L719
$$ 705784 721591 737275 752670 767551 782267 797163 811739 824874 835745 844177 850271 853990
63158H53990R61k516o722j1104j4895j7710j9643k1005k2164k3386k4492k4854
$$ 853990 854951 852435 845713 834609 819714 802004 782361 761356 739192 715806 691314 666460
63146F66460k4089k2520k0655j8504j5866j3043j0658q920p592o577n943n423
$$ 666460 642371 619851 599196 580692 564826 551783 541125 532205 524613 518036 512093 506670
63134E06670m555l416k628k433k299j697q01r1L49P60J233J646J918K067K121
$$ 506670 502115 498699 496071 493638 491339 489642 488841 488750 489099 489859 491092 492738 494656 496723 498844
63119D98844K202K508L026L392L311L015L013L442L907L943L497K928K653K764
$$ 498844 501046 503554 506580 509972 513283 516298 519311 522753 526660 530603 534100 537028 539681 542445
63105E42445K884K412J134m53j495j590j126p73p82q92q11n85m73o04q67j006
$$ 542445 545329 547741 548875 548422 546927 545337 544211 543438 542656 541764 540953 540368 539895 539291 538424 537418
63089E37418p79j22P53J500J958K282K666L112L508L805L961L896L746M026N075
$$ 537418 536639 536517 537270 538770 540728 543010 545676 548788 552296 556101 560062 563958 567704 571730 576805
63074E76805O443P170O892O284O274P037P975Q458Q374Q044P902Q256R180J0556
$$ 576805 583248 590418 597310 603594 609868 616905 624880 633338 641712 649756 657658 665914 675094 685650
63060F85650J2118J3529J4558J5314J6161J7284J8505J9781K1518K3968K6536
$$ 685650 697768 711297 725855 741169 757330 774614 793119 812900 834418 858386 884922
63049H84922K8341K9412L0633L2402L4105L5182L5907L6675L7204L7063L6483
$$ 884922 913263 942675 973308 1005710 1039815 1074997 1110904 1147579 1184783 1221846 1258329
63038A258329L5936L5328L4333L3280L2972L3657L4765L5629L5958L5603L4357
$$ 1258329 1294265 1329593 1363926 1397206 1430178 1463835 1498600 1534229 1570187 1605790 1640147
63027A640147L2028K8392K3213J6624R305J854n786j3915k2240l0013l6708m2099
$$ 1640147 1672175 1700567 1723780 1740404 1749709 1751563 1745777 1731862 1709622 1679609 1642901 1600802
63015A600802m5918m8050m8874m8785m7521m4750m1008l7287l3723k9609k4746
$$ 1600802 1554884 1506834 1457960 1409175 1361654 1316904 1275896 1238609 1204886 1175277 1150531
63004A150531j9783j5137j0520n821j541K087N513Q971J1998J4408J6842J9688
$$ 1150531 1130748 1115611 1105091 1099270 1097729 1099816 1105329 1114300 1126298 1140706 1157548 1177236
62992A177236K2170K3355K3484K3496K3701K3765K3583K3314K2743K1479J9698
$$ 1177236 1199406 1222761 1246245 1269741 1293442 1317207 1340790 1364104 1386847 1408326 1428024
62981A428024J7913J6086J3610J0127N729L98o032j3282k0575k7322l3435l8914
$$ 1428024 1445937 1462023 1475633 1485760 1491489 1491887 1485855 1472573 1451998 1424676 1391241 1352327
62969A352327m3583m7270m9860n1178n1145n0054m8348m6180m3549m0726l8044
$$ 1352327 1308744 1261474 1211614 1160436 1109291 1059237 1010889 964709 921160 880434 842390
62958H42390l5372l2327k8980k5819k3079k0641j8567j7116j6163j5189j4053
$$ 842390 807018 774691 745711 719892 696813 676172 657605 640489 624326 609137 595084
62947E95084j3170j2806j2640j2279j1657j0784r641q568q219q697r222r002q112
$$ 595084 581914 569108 556468 544189 532532 521748 512107 503539 495320 486623 477401 468399 460287
62934D60287p129o302n548m950m774n028n371n392m858l842k779k199k223k547
$$ 460287 453158 446856 441308 436358 431584 426556 421185 415793 410935 407093 404314 402115 399892 397345
62920C97345l027l875n045n832n555m377l071k104j416r13o81o94o49k32N68J427
$$ 397345 394318 390443 385398 379566 374011 369634 366563 364459 363043 362130 361449 360755 360106 359874 360442 361869
62904C61869J842J470M68o31j461k079k534k598k239k006k441l285l767l612l330
$$ 361869 363711 365181 365649 365018 363557 361478 358944 356346 354107 352101 349660 346375 342608 338996 335666
62889C35666l379l570l452k971k495k266k109j698j120r43j540k395k509j590
$$ 335666 332287 328717 325265 322294 319799 317533 315424 313726 312606 311663 310123 307728 305219 303629
62875C03629m36P6n6l19n01o19m43K34J073J579J824K137K277J711O22k26o45
$$ 303629 303193 303269 303213 302894 302393 301774 301331 301565 302638 304217 306041 308178 310455 312166 312788 312562 311917
62858C11917j107j530r97P70K609L210K575J539M56p28j614j621r62n05n61n34
$$ 311917 310810 309280 308283 309053 311662 314872 317447 318986 319442 318714 317100 315479 314517 314012 313451 312917
62842C12917N5Q31J102O80p4p63j181j196o52M29J536J744N62j273k313j962j126
$$ 312917 312972 313803 314905 315585 315511 314748 313567 312371 311719 312148 313684 315428 315990 314717 312404 310442 309316
62825C09316r08j195j078l21L88M84N7o38j440j898j385O9J527K082J724J147
$$ 309316 308408 307213 306135 305814 306202 306686 306743 306105 304665 302767 301382 301451 302978 305060 306784 307931
62809C07931J035J634K611L210K951K262K044K602L493M392N400O343O701O585
$$ 307931 308966 310600 313211 316421 319372 321634 323678 326280 329773 334165 339565 345908 352609 359194
62795C59194O933Q202R584J0235J0510J1197J2164J2909J3925J6242J9695K2945
$$ 359194 366127 374329 383913 394148 404658 415855 428019 440928 454853 471095 490790 513735
62783E13735K5376K7816L1057L4762L8329M1900M5761M9543N2829N6004N9606
$$ 513735 539111 566927 597984 632746 671075 712975 758736 808279 861108 917112 976718
62772I76718O3174O5550O6119O5063O2519N8285N2424M5398L7416K8219J7764
$$ 976718 1039892 1105442 1171561 1236624 1299143 1357428 1409852 1455250 1492666 1520885 1538649
62761A538649O643m465j5295k5656l4994m2770m9034n4187n8254o0829o1774o1566
$$ 1538649 1545292 1540827 1525532 1499876 1464882 1422112 1373078 1318891 1260637 1199808 1138034 1076468
62749A076468o0724n9156n6456n2782m9074m6196m4001m1494l8007l3974l0405
$$ 1076468 1015744 956588 900132 847350 798276 752080 708079 666585 628578 594604 564199
62738E64199k7744k5488k2944k0072j7449j5566j4366j3414j2334j1006r547q178
$$ 564199 536455 510967 488023 467951 450502 434936 420570 407156 394822 383816 374269 366091
62726C66091p092o296n595m768l749k656j611o22L73J346K129K611L017L867N419
$$ 366091 358999 352703 347108 342340 338591 335935 334324 333702 334075 335421 337550 340161 343178 347045 352464
62711C52464P189Q357Q744R155J0429J2436J4395J6017J7830K0280K3126K5932
$$ 352464 359653 368010 376754 385909 396338 408774 423169 439186 457016 477296 500422 526354
62699E26354K8684L1569L4538L7505M0698M4295M7935N0986N3180N4487N4672
$$ 526354 555038 586607 621145 658650 699348 743643 791578 842564 895744 950231 1004903
62688A004903N3491N1199M8105M3727L7144K8433J8943R765N99r254j9380k8416
$$ 1004903 1058394 1109593 1157698 1201425 1238569 1267002 1285945 1295710 1296309 1287055 1267675 1239259
62676A239259l5460m0648m4516m7371m9393n0785n1595n1582n0421m8006m4725
$$ 1239259 1203799 1163151 1118635 1071264 1021871 971086 919491 867909 817488 769482 724757
62665G24757m1401l8712l6478l3862l0488k6997k4179k1990j9929j7983j6491
$$ 724757 683356 644644 608166 574304 543816 516819 492640 470650 450721 432738 416247
62654D16247j5338j4049j2646j1646j1061j0196q664p043o101n818n603n130m596
$$ 416247 400909 386860 374214 362568 351507 341311 332647 325604 319503 313685 308082 302952 298356
62641B98356m352m502m744m562l735k726k238k385k680k867l131l419l188k237
$$ 298356 294004 289502 284758 280196 276461 273735 271497 269112 266432 263565 260434 257015 253827 251590
62627B51590j215p68o83l63K11O33Q21J038J260J193Q15M28K08J72N09J390K484
$$ 251590 250375 249607 248924 248561 248772 249405 250226 251264 252524 253717 254532 254960 255168 255340 255849 257239 259723
62610B59723L240L603M018M633N094N284N693O778Q376J0060J1669J3194J4484
$$ 259723 262963 266566 270584 275217 280311 285595 291288 298066 306442 316502 328171 341365 355849
62597C55849J5486J6545J8067K0020K2095K4234K6621K9210L1550L3215L4132
$$ 355849 371335 387880 405947 425967 448062 472296 498917 528127 559677 592892 627024
62586F27024L4362L3776L2108K9293K5545K1122J6087J0467M515j333o775j1739
$$ 627024 661386 695162 727270 756563 782108 803230 819317 829784 834299 832966 826191 814452
62574H14452j6196k0046k3263k5909k7816k8557k8052k6965k6224k6097k6038
$$ 814452 798256 778210 754947 729038 701222 672665 644613 617648 591424 565327 539289
62563E39289k5328k3628k1058j8248j6161j5399j5428j5014j3579j1825j0758
$$ 539289 513961 490333 469275 451027 434866 419467 404039 389025 375446 363621 352863
62552C52863j0527j0561j0422j0047r324q087o589n488n115n075m775m119l374
$$ 352863 342336 331775 321353 311306 301982 293895 287306 281818 276703 271628 266853 262734 259360
62539B59360k587j567m58K26L47N05J245K120K199J472J030J675K928L835M270
$$ 259360 256773 255206 254748 254974 255321 255826 257071 259191 261390 262862 263892 265567 268495 272330 276600
62524B76600M857N944P310Q687R960J0993J1750J2590J3920J5562J7056J8451
$$ 276600 281457 287401 294711 303398 313358 324351 336101 348691 362611 378173 395229 413680
62512D13680K0198K2273K4099K5465K6785K8222K9263K9478K9030K8048K6120
$$ 413680 433878 456151 480250 505715 532500 560722 589985 619463 648493 676541 702661
62501G02661K2878J8560J3532P817J619m173q805j2560j6218j9840k2730k4392
$$ 702661 725539 744099 757631 765448 767067 762894 754089 741529 725311 705471 682741 658349
62489F58349k4951k4704k3959k3137k2502k1756k0376j8321j6029j3851j1968
$$ 658349 633398 608694 584735 561598 539096 517340 496964 478643 462614 448763 436795
62478D36795j0653j0052r763r169q188p224o454n711m971m390l869l148k372j928
$$ 436795 426142 416090 406327 397158 388970 381746 375292 369581 364610 360220 356351 353203 350831 348903
62464C48903j641q45N25J567J576J032J035J984L276M087M122L695L308L157L001
$$ 348903 347262 346417 346942 348509 350085 351117 352152 354136 357412 361499 365621 369316 372624 375781 378782
62449C78782K486J564M34o98j626k135k426l240n007p012q026p784p162o934p008
$$ 378782 381268 382832 383266 382568 380942 378807 376381 373141 368134 361122 353096 345312 338150 331216 324208
62434C24208p008o826o343n363m172l446l233k677j304R7N39K25K05J019K365
$$ 324208 317200 310374 304031 298668 294496 291050 287817 285140 283836 283933 284472 284697 284902 285921 288286
62419B88286L787M924N347M925M345M568N670O810P306P255O986O556N992N576
$$ 288286 292073 296997 302344 307269 311614 316182 321852 328662 335968 343223 350209 356765 362757 368333
62405C68333N532N686N722N505N014M122K793J364L36k30q29j857k947l338k945
$$ 368333 373865 379551 385273 390778 395792 399914 402707 404071 404407 404177 403348 401491 398544 395206 392261
62390C92261k598k948l542l488k769k135j808j096M63K319L740M794O081P911
$$ 392261 389663 386715 383173 379685 376916 374781 372973 371877 372340 374659 378399 383193 389274 397185
62376C97185J0148J2583J5003J7192J9199K1337K3649K5854K7978L0488L3389
$$ 397185 407333 419916 434919 452111 471310 492647 516296 542150 570128 600616 634005
62365F34005L5858L7303L8115L8818L9031L8042L5753L2259K7123K0172J2562
$$ 634005 669863 707166 745281 784099 823130 861172 896925 929184 956307 976479 989041
62354I89041N843K25n024r722j2813j4426j6281j9488k3127k5752k7267k8447
$$ 989041 994884 995109 990085 980363 967550 953124 936843 917355 894228 868476 841209 812762
62342H12762k9435k9710k9040k7655k5756k3503k1249j9246j7372j5556j4087
$$ 812762 783327 753617 724577 696922 671166 647663 626414 607168 589796 574240 560153
62331E60153j3105j2173j0888r485q297p051n359l594k461j866j016K84J260J346
$$ 560153 547048 534875 523987 514502 506205 499154 493795 490201 487740 485874 484858 485142 486402 487748
62317D87748J022J061J353J095k1j305j955k029k248k971l793m245m407m532m425
$$ 487748 488770 489831 491184 492279 492258 490953 488998 486969 484721 481750 477957 473712 469305 464773 460348
62302D60348l771k909k576k857l030k656k122j859j552o37Q26K264L245L611L288
$$ 460348 456577 453668 451092 448235 445205 442549 440427 438568 437016 436379 437205 439469 442714 446325 449613
62287D49613K510J983K328L380M396M837M719M363M232M778O056P537Q675R517
$$ 449613 452123 454106 456434 459814 464210 469047 473766 478129 482361 487139 493195 500732 509407 518924
62273E18924J0462J1705J3309J5559J8590K1703K3839K4922K6213K8906L2764
$$ 518924 529386 541091 554400 569959 588549 610252 634091 659013 685226 714132 746896
62262G46896L6433L8863L9995M0230L9652L7976L4903L0374K4482J7497R966K616
$$ 746896 783329 822192 862187 902417 942069 980045 1014948 1045322 1069804 1087301 1097267 1099883
62250A099883m031r763j4391j7640j9693k1509k4012k7014k9374l0258k9762k8312
$$ 1099883 1095852 1086089 1071698 1054058 1034365 1012856 988844 961830 932456 902198 872436 844124
62238H44124k6166k3644k1204j8850j6130j3067j0502r008q069o858n378m182
$$ 844124 817958 794314 773110 754260 738130 725063 714561 705553 697484 690626 685248 681066
62226F81066l411k842k504k485k411j834r00J0R97K159K812K267J216J225K685
$$ 681066 677655 674813 672309 669824 667413 665579 664679 664689 665686 667845 670657 672924 674140 675365 678050
62211F78050M425N551O489P750Q810Q997Q759R124J0377J2063J3873J5912J8261
$$ 678050 682475 688026 694515 702265 711075 720072 728831 737955 748332 760395 774268 790180 808441
62198H08441K0836K3511K5969K7771K9027L0515L2586L4272L4239L2404K9795
$$ 808441 829277 852788 878757 906528 935555 966070 998656 1032928 1067167 1099571 1129366
62187A129366K6932K3116J7666J1169N102N28k491m432n640o084n506l671n37
$$ 1129366 1156298 1179414 1197080 1208249 1213351 1213879 1211388 1206956 1201316 1195232 1189726 1186055 1185518
62174A185518L685Q505J3188J7028J9772K1645K2852K3112K1947J9323J5912J2639
$$ 1185518 1189203 1197708 1210896 1227924 1247696 1269341 1292193 1315305 1337252 1356575 1372487 1385126
62162A385126J0090Q294O927N685M447L171J699j79k460m843o952q443q995q384
$$ 1385126 1395216 1403510 1410437 1416122 1420569 1423740 1425439 1425260 1422800 1417957 1411005 1402562 1393567 1385183
62148A385183o725m467k067K06K185L791N182O610P984Q851R081R242J0005J1280
$$ 1385183 1378458 1373991 1371924 1372130 1374315 1378106 1383288 1389898 1397882 1406733 1415814 1425056 1435061 1446341
62134A446341J2411J3179J4114J5654J7340J8230J8096J7780J8213J9356K0472
$$ 1446341 1458752 1471931 1486045 1501699 1519039 1537269 1555365 1573145 1591358 1610714 1631186
62123A631186K1332K2485K4197K5663K5874K4928K3878K3482K3714K4372K5242
$$ 1631186 1652518 1675003 1699200 1724863 1750737 1775665 1799543 1823025 1846739 1871111 1896353
62112A896353K5634K4716K2847K1776K2772K5065K6859K7507K7921K9021L0667
$$ 1896353 1921987 1946703 1969550 1991326 2014098 2039163 2066022 2093529 2121450 2150471 2181138
62101B181138L2250L3649L5298L7583M0438M3324M5515M6579M6601M5899M4719
$$ 2181138 2213388 2247037 2282335 2319918 2360356 2403680 2449195 2495774 2542375 2588274 2632993
62090B632993M3431M2801M3581M5772M8596N1167N2881N3164N1321M6977M0648
$$ 2632993 2676424 2719225 2762806 2808578 2857174 2908341 2961222 3014386 3065707 3112684 3153332
62079C153332L3682K7527K2912J9609J7018J4906J3392J2268J0842Q674O058L439
$$ 3153332 3187014 3214541 3237453 3257062 3274080 3288986 3302378 3314646 3325488 3334162 3340220 3343659
62067C343659P32k410n959r673j3460j7081j9793k1033k1337k1777k2585k3153
$$ 3343659 3344391 3341981 3336022 3326349 3312889 3295808 3276015 3254982 3233645 3211868 3189283 3166130
62055C166130k3341k3879k5110k6250k6462k5918k5234k4348k2700k0250j7618
$$ 3166130 3142789 3118910 3093800 3067550 3041088 3015170 2989936 2965588 2942888 2922638 2905020
62044B905020j5342j3483j1986j0936j0374j0113r877r528r142q870q663q201
$$ 2905020 2889678 2876195 2864209 2853273 2842899 2832786 2822909 2813381 2804239 2795369 2786706 2778505
62032B778505p442p068p918r779j1381j1853j1722j1996j2815j3639j4372j5421
$$ 2778505 2771063 2763995 2756077 2746298 2734917 2723064 2711342 2699346 2686531 2672892 2658520 2643099
62020B643099j6723j7496j7225j6319j5507j5001j4525j3826j2883j1708j0199
$$ 2643099 2626376 2608880 2591655 2575336 2559829 2544828 2530303 2516477 2503594 2491886 2481687
62009B481687q159n525k606J5J923L102L474K511k70m533r406j4544k0320k6729
$$ 2481687 2473528 2468003 2465397 2465412 2467335 2470437 2473911 2476422 2476152 2471619 2462213 2447669 2427349 2400620
61995B400620l2759l7307m0392m2865m5117m6552m6396m4553m1600l8300l5269
$$ 2400620 2367861 2330554 2290162 2247297 2202180 2155628 2109232 2064679 2023079 1984779 1949510
61984A949510l2839l0968k9330k7700k6185k5007k4051k2822k0972j8851j7332
$$ 1949510 1916671 1885703 1856373 1828673 1802488 1777481 1753430 1730608 1709636 1690785 1673453
61973A673453j6917j7089j6824j5757j4582j4108j4179j3886j2758j1274j0087
$$ 1673453 1656536 1639447 1622623 1606866 1592284 1578176 1563997 1550111 1537353 1526079 1515992
61962A515992r190q199p149o426n993n176l482j209J040L185N643Q657J2045J5538
$$ 1515992 1506802 1498603 1491454 1485028 1479035 1473859 1470377 1469168 1470208 1473393 1479036 1487693 1499738 1515276
61948A515276J9016K2401K5615K8733L1830L4616L6619L7867L9053M0766M2868
$$ 1515276 1534292 1556693 1582308 1611041 1642871 1677487 1714106 1751973 1791026 1831792 1874660
61937A874660M4919M6878M9025N1391N3683N5629N7023N7513N6874N5531N4465
$$ 1874660 1919579 1966457 2015482 2066873 2120556 2176185 2233208 2290721 2347595 2403126 2457591
61926B457591N4596N6543O0940O8468P9368R3326J09967J29187J50820J74419
$$ 2457591 2512187 2568730 2629670 2698138 2777506 2870832 2980799 3109986 3260806 3435225
61916C435225J99664K26652K55450K85725L17241L50434L85871M23013M59848
$$ 3435225 3634889 3861541 4116991 4402716 4719957 5070391 5456262 5879275 6339123
61907F339123M93684N21698N40311N44330N27434M84183M12180L13015J91889
$$ 6339123 6832807 7354505 7894816 8439146 8966580 9450763 9862943 10175958 10367847
61898A0367847N6812q2023k13359l27148m17008m81016n20357n37721n36908n22865
$$ 10367847 10424659 10342636 10129277 9802129 9385121 8904105 8383748 7846027 7309119 6786254
61888F786254n00645m73806m44049m12314l79747l47548l16403k86453k57736
$$ 6786254 6285609 5811803 5367754 4955440 4575693 4228145 3911742 3625289 3367553
61879C367553k30572k05655j83652j64443j46950j30218j14544j00875q9161p8185
$$ 3367553 3136981 2931326 2747674 2583231 2436281 2306063 2191519 2090644 2001483 1923298
61869A923298o7303n7387m9369m2619l5662k7997k0206j2633n117K048Q086J2985
$$ 1923298 1855995 1798608 1749239 1706620 1670958 1642961 1622755 1610122 1605005 1607053 1615139 1628124
61857A628124J7720K2734K7081K9764L1180L2393L3458L3346L1347K7714K2991
$$ 1628124 1645844 1668578 1695659 1725423 1756603 1788996 1822454 1855800 1887147 1914861 1937852
61846A937852J7434J1309N189k74m514o996p446o282m378k189N21L940P519J0350
$$ 1937852 1955286 1966595 1971784 1971510 1966996 1960000 1952554 1946272 1941894 1939705 1940226 1944166 1951685 1962035
61832A962035J1946J2331J1506R245N436M86m747r406j3075j5883j8085j9568
$$ 1962035 1973981 1986312 1997818 2007063 2012499 2012985 2008238 1998832 1985757 1969874 1951789 1932221
61820A932221j9828j8445j5510j1637p747m776l206k646k033m11K481O404J1120
$$ 1932221 1912393 1893948 1878438 1866801 1859054 1854278 1851072 1848426 1846393 1845982 1848463 1854867 1865987
61807A865987J6537K2525K8931L5719M2980N0800N9188O8025P7015Q5923R5071
$$ 1865987 1882524 1905049 1933980 1969699 2012679 2063479 2122667 2190692 2267707 2353630 2448701
61796B448701J05406J17740J31992J47501J64069J82417K03543K27865K55186
$$ 2448701 2554107 2671847 2803839 2951340 3115409 3297826 3501369 3729234 3984420
61787C984420K85303L18495L55485L97005M43422M94750N50940O11933O77253
$$ 3984420 4269723 4588218 4943703 5340708 5784130 6278880 6829820 7441753 8119006
61778H119006P45489Q14056Q79048R34734R73246R85204R61129Q92869P75026
$$ 8119006 8864495 9678551 10557599 11492333 12465579 13450783 14411912 15304781 16079807
61769A6079807O07098L95861J55901r3033l30650n40083p09872q34332r13180
$$ 16079807 16686905 17082766 17238667 17145634 16814984 16274901 15565029 14730697 13817517
61760A3817517r50604r53724r30753q89419q36209p76414p14254o52638n92941
$$ 13817517 12866913 11913189 10982436 10093017 9256808 8480394 7766140 7113502 6520561
61751F520561n35663m81521m31720l86995l46928l10643k77859k48875k23624
$$ 6520561 5984898 5503377 5071657 4684662 4337734 4027091 3749232 3500357 3276733
61742C276733k01361j81296j63105j46735j32058j18870j06969r6081q5963p6700
$$ 3276733 3075372 2894076 2730971 2584236 2452178 2333308 2226339 2130258 2044295 1967595
61732A967595o8636o1891n6066n0596m5224m0112l5658l2313l0334k9550k9513
$$ 1967595 1898959 1837068 1781002 1730406 1685182 1645070 1609412 1577099 1546765 1517215 1487702
61721A487702k9916l0712l1751l2543l2599l1866l0683k9369k7940k6162k3887
$$ 1487702 1457786 1427074 1395323 1362780 1330181 1298315 1267632 1238263 1210323 1184161 1160274
61710A160274k1416j9431j8288j7450j6056j4014j2117j0996j0516j0382j0728
$$ 1160274 1138858 1119427 1101139 1083689 1067633 1053619 1041502 1030506 1019990 1009608 998880
61699I98880j1674j2773j3498j3885j4184j4215j3701j2992j2704j2777j2565
$$ 998880 987206 974433 960935 947050 932866 918651 904950 891958 879254 866477 853912
61688H53912j1879j1181j0746j0304r722r303r192r094q870q773q790q422p545
$$ 853912 842033 830852 820106 809802 800080 790777 781585 772491 763621 754848 746058 737636 730091
61675G30091o866o887o980o239m879l983l984m169l718k594j325m11n3l6K30J150
$$ 730091 723225 716338 709358 703119 698240 694257 690273 686104 682386 679792 678467 678056 678003 677967 678197 679347
61659F79347K286K716K205J586J785K774L798M337M470M508M569M537M152L113
$$ 679347 681633 684349 686554 688140 689925 692699 696497 700834 705304 709812 714381 718918 723070 726183
61645G26183J286j056l268m647m892m301l553l109k780j956l52J582L108M032
$$ 726183 727469 726413 723145 718498 713606 709305 705752 702643 699863 697907 697555 699137 702245 706277
61631G06277M898O273P940R023Q923P896O559N072L171P91j800m490p413j0412
$$ 706277 711175 717448 725388 734411 743334 751230 757789 762861 766032 766823 765023 760533 753120 742708
61617G42708j2871j4386j5179j5543j5241j3957j2018j0145q682p528o607n905
$$ 742708 729837 715451 700272 684729 669488 655531 643513 633368 624686 617158 610551 604646
61605F04646n193m313l642l654m020l871l043k348k406k848k998k740k242j412
$$ 604646 599453 595140 591498 587844 583824 579953 576910 574562 572156 569308 566310 563570 561328 559916
61591E59916k09Q59J226J026R17J197J598J893K241K903L895N011N993O677P173
$$ 559916 559707 560566 561792 562818 563735 564932 566530 568423 570664 573567 577462 582473 588466 595143 602316
61576F02316P793Q713R799J0907J2174J3714J5236J6318J7018J7831J8995K0149
$$ 602316 610109 618822 628621 639528 651702 665416 680652 696970 713988 731819 750814 770963
61564G70963K0852K1200K1690K2509K3123K2810K1591K0424K0210K0772K1134
$$ 770963 791815 813015 834705 857214 880337 903147 924738 945162 965372 986144 1007278
61553A007278K0786K0216K0047K0149J9934J9172J8115J6987J5694J3968J1513
$$ 1007278 1028064 1048280 1068327 1088476 1108410 1127582 1145697 1162684 1178378 1192346 1203859
61542A203859Q203M291K44l723p653j1206j3629j4724j5305j6057j6424j5480
$$ 1203859 1212062 1216353 1216597 1212874 1205221 1194015 1180386 1165662 1150357 1134300 1117876 1102396
61530A102396j3482j1585j0130q374n994l726k055k74K441N814R087J2276J5965
$$ 1102396 1088914 1077329 1067199 1058825 1052831 1049105 1047050 1046776 1049217 1055031 1064118 1076394 1092359
61517A092359K0191K4422K8494L2861L7859M3394M9381N6004O3446P1719Q0826
$$ 1092359 1112550 1136972 1165466 1198327 1236186 1279580 1328961 1384965 1448411 1520130 1600956
61506A600956R0643J00780J10998J21768J33857J47227J60859J73821J85862J96503
$$ 1600956 1691599 1792379 1903377 2025145 2159002 2306229 2467088 2640909 2826771 3023274
61496C023274K03985K05757J99947J85969J64012J34708R9513O0939K1814j5730
$$ 3023274 3227259 3433016 3632963 3818932 3982944 4117652 4217165 4278104 4299918 4284188
61486D284188n0414q1151j06553j25332j37189j43159j44881j43513j39368j32556
$$ 4284188 4233774 4152623 4046070 3920738 3783549 3640390 3495509 3351996 3212628 3080072
61476C080072j23615j13325j02204r0614p9208o8629n8660m8324l7262k6507j7269
$$ 3080072 2956457 2843132 2740928 2650314 2571106 2502477 2443817 2395493 2358231 2331724 2314455
61465B314455r375j654O317J3768K0082K5558L0450L4120L5966L6617L7302L8350
$$ 2314455 2305080 2303426 2309743 2323511 2343593 2369151 2399601 2433721 2469687 2506304 2543606 2581956
61453B581956L9019L8708L7609L6270L5200L4873L5482L6596L7656L8797M0586
$$ 2581956 2620975 2659683 2697292 2733562 2768762 2803635 2839117 2875713 2913369 2952166 2992752
61442B992752M2925M4940M6095M6687M6991M6665M5397M3397M0742L6883L1351
$$ 2992752 3035677 3080617 3126712 3173399 3220390 3267055 3312452 3355849 3396591 3433474 3464825
61431C464825K4468J6812Q477m98r495j7826k5515l2808l9191m3690m6073m6934
$$ 3464825 3489293 3506105 3514582 3514084 3504589 3486763 3461248 3428440 3389249 3345559 3299486 3252552
61419C252552m6719m5400m3114m0300l7044l2986k8049k2684j7306j2065p311
$$ 3252552 3205833 3160433 3117319 3077019 3039975 3006989 2978940 2956256 2938950 2926885 2919574
61408B919574l536o41K069M808O807P326O560N112L163P02j874m034n719p034
$$ 2919574 2916038 2915397 2917466 2922274 2929081 2936407 2942967 2948079 2951242 2951944 2950070 2946036 2940317 2933283
61394B933283p537o443l509Q50O348J3240K1890L2225M3789N6145O9205Q3300
$$ 2933283 2925746 2919303 2915794 2916644 2922992 2936232 2958122 2990347 3034136 3090281 3159486 3242786
61382C242786R8787J15450J32509J49409J66260J83089J98918K12106K21479K26460
$$ 3242786 3341573 3457023 3589532 3738941 3905201 4088290 4287208 4499314 4720793 4947253
61372D947253K26101K18684K02701J78021J45932J08556O8444K8312r512m3649
$$ 4947253 5173354 5392038 5594739 5772760 5918692 6027248 6095692 6124004 6114492 6070843
61362F070843p3668r9795j22627j42898j61028j76827j89689j99107k04981k07522
$$ 6070843 5997175 5897380 5774753 5631855 5470827 5294000 5104311 4905204 4700223 4492701
61352D492701k06991k03538j97339j88848j78802j67854j56233j43955j31271
$$ 4492701 4285710 4082172 3884833 3695985 3517183 3349329 3193096 3049141 2917870
61343B917870j18594j06094r3668q1364o9524n8366m7830l7926k8944k0987j3614
$$ 2917870 2799276 2693182 2599514 2518150 2448626 2390260 2342430 2304504 2275560 2254573 2240959
61332B240959o255J097P952J3971J9259K4056K8403L2182L5227L7346L8436L8651
$$ 2240959 2234704 2235801 2243753 2257724 2276983 2301039 2329442 2361624 2396851 2434197 2472633 2511284
61320B511284L8355L7856L7133L5889L3892L1299K8662K6374K4162K1318J7565
$$ 2511284 2549639 2587495 2624628 2660517 2694409 2725708 2754370 2780744 2804906 2826224 2843789
61309B843789J3420R589O309L506J255m42k044m223p133j0356j3531j6687j9993
$$ 2843789 2857209 2866798 2873107 2876613 2877868 2877426 2875382 2871159 2864026 2853670 2840139 2823452 2803459
61296B803459k3561k7508l1784l5896l9174m1442m3039m4101m4263m3211m1086
$$ 2803459 2779898 2752390 2720606 2684710 2645536 2604094 2561055 2516954 2472691 2429480 2388394
61285B388394l8075l4127k9388k4502k0086j6154j2403q719n076j323K449N614
$$ 2388394 2350319 2316192 2286804 2262302 2242216 2226062 2213659 2204940 2199864 2198541 2200990 2206604
61273B206604P691Q949R706R327O708J803m143r975j5435k0431k4292k6362k6709
$$ 2206604 2214295 2223244 2232950 2242277 2248985 2250788 2246645 2236670 2221235 2200804 2176512 2150150 2123441
61260B123441k5652k3001j8331j1819m169M154J3146K2815L2965M3417N3996O4262
$$ 2123441 2097789 2074788 2056457 2044638 2040469 2044623 2057769 2080584 2113549 2156966 2210962 2275224
61248B275224P3748Q2506R0926R8731J04576J06979J05486J00481R1995P9187
$$ 2275224 2348972 2431478 2522404 2621135 2725711 2832690 2938176 3038657 3130652 3209839
61238C209839O1217L8354J2014j6008m4002p0195r2760j10306j22261j28690j30053
$$ 3209839 3271056 3309410 3321424 3305416 3261414 3191219 3098459 2988153 2865892 2737202 2607149
61227B607149j27308j21912j15133j07415r8775q9706q1261p4103o7968o2174
$$ 2607149 2479841 2357929 2242796 2135381 2036606 1946900 1865639 1791536 1723568 1661394
61217A661394n6312n0342m4475l9118l4532l0280k5445j9748j4073r500o166l414
$$ 1661394 1605082 1554740 1510265 1471147 1436615 1406335 1380890 1361142 1347069 1337569 1331403 1327989
61205A327989p39J897M407O525P556O798M394J344j361l299m388m629m268l872
$$ 1327989 1327250 1329147 1333554 1340079 1347635 1354433 1358827 1360171 1358810 1355511 1351123 1346494 1342226 1338354
61191A338354l902m382n063n846o951q700j1081j3522j5416j6923j8795k1128
$$ 1338354 1334452 1330070 1325007 1319161 1312210 1303510 1292429 1278907 1263491 1246568 1227773 1206645
61179A206645k2761k2646k1364k0516k0718k1099k0694j9456j7738j5692j3582
$$ 1206645 1183884 1161238 1139874 1119358 1098640 1077541 1056847 1037391 1019653 1003961 990379
61168I90379j1873j0553r071p336o077n662n304m145k565j666j850k769m309o742
$$ 990379 978506 967953 958882 951546 945469 939807 934503 930358 927793 926127 924277 921508 917199 910457
61154I10457r969j3351j6269j8343j9230j8914j8008j7075j5805j3603j0855q679
$$ 910457 900488 887137 870868 852525 833295 814381 796373 779298 763493 749890 739035 730356
61142G30356p334n904l850j941j078r71p11j70K2m09r99j257j137q29m87k86l52
$$ 730356 723022 717118 713268 711327 710249 709278 708567 708397 708419 708010 707011 705754 704617 703788 703301 703015 702663
61125G02663n25m55l0M50O64O66Q86J694L039M440N333N424M665L076P38k022
$$ 702663 702138 701683 701653 702103 702767 703433 704319 706013 709052 713492 718825 724249 728914 731990 732728 730706
61109G30706m676o844q512r903j1208j2438j3392j3757j3417j2619j1726j0895
$$ 730706 726030 719186 710674 700771 689563 677125 663733 649976 636559 623940 612214 601319
61097F01319j0164r703r634r594q937p497n874m774m387m421m449m100l266k338
$$ 601319 591155 581452 571818 562224 553287 545790 539916 535142 530755 526334 521885 517785 514519 512181
61083E12181j924k068k121j533m86M68R97R57K82n98o62P49L049N014O144O834
$$ 512181 510257 508189 506068 504535 504049 504517 505514 506471 506753 506155 505493 506242 509291 514305 520449 527283
61067E27283P366P410O690N561M700M542N113O031O601O297N407M821N046N734
$$ 527283 534649 542059 548749 554310 559010 563552 568665 574696 581297 587594 593001 597822 602868 608602
61053F08602O370O937P643Q283Q353P650O502N540N353O129P304P893P486O705
$$ 608602 614972 621909 629552 637835 646188 653838 660340 665880 671233 677362 684666 692559 700045 706750
61039G06750O354O308N837M894M356M823N720O018N440M542L888L643L798M272
$$ 706750 713104 719412 725249 730143 734499 739322 745042 751060 756500 761042 764930 768573 772371 776643
61025G76643M734M786M443M186M468N409O953Q934J0940J2618J4265J6635J9888
$$ 776643 781377 786163 790606 794792 799260 804669 811622 820556 831496 844114 858379 875014 894902
61012H94902K3247K6138K9137L3197L8243M3243M7424N0740N3313N5310N7379
$$ 894902 918149 944287 973424 1006621 1044864 1088107 1135531 1186271 1239584 1294894 1352273
61001A352273O0437O4873P0724P8694Q9948J04503J20716J37076J53835J72404
$$ 1352273 1412710 1477583 1548307 1627001 1716949 1821452 1942168 2079244 2233079 2405483
60991B405483J93925K19163K49059K84619L26917L78030M41255N19650O15473
$$ 2405483 2599408 2818571 3067630 3352249 3679166 4057196 4498451 5018101 5633574
60982E633574P32542Q78249J061884J292207J577808J922776K306183K653707
$$ 5633574 6366116 7244365 8306249 9598456 11176264 13099040 15405223 18058930
60974A8058930K835406K716650K242396J493457O65454j8619m01539m37445j85991
$$ 18058930 20894336 23610986 25853382 27346839 28012293 27993674 27592135 27154690 26968699
60965B6968699K14366N75894P06089M77192j07483r03010j689607k276852k576860
$$ 26968699 27183065 27758959 28465048 28942240 28834757 27931747 26242140 23965288 21388428
60956B1388428k609219k455071k204026j923497j652652j408966j196755j013720
$$ 21388428 18779209 16324138 14120112 12196615 10543963 9134997 7938242 6924522
60948F924522q55432p18222o00173n00333m17549l50292k97107k56291k25084
$$ 6924522 6069090 5350868 4750695 4250362 3832813 3482521 3185414 2929123 2704039
60939B704039j99986j78331j59284j42982j29115j16700j04892r3481q2719p3062
$$ 2704039 2504053 2325722 2166438 2023456 1894341 1777641 1672749 1579268 1496549 1423487
60929A423487o5149n9633n6663n5517n4908n3799n1925m9432m6256m2172l7499
$$ 1423487 1358338 1298705 1242042 1186525 1131617 1077818 1025893 976461 930205 888033 850534
60918H50534l3172k9804k6986k3979k0775j7932j5591j3392j1288r692q589p227
$$ 850534 817362 787558 760572 736593 715818 697886 682295 668903 657615 647923 639334 632107
60906F32107n178l119k084k243k856l204l125k841k671k879l483m215m816n229
$$ 632107 626929 623810 621726 619483 616627 613423 610298 607457 604786 601907 598424 594209 589393 584164
60892E84164n425n317n070n171n840o653p101p264p403p223o324n214n055o102
$$ 584164 578739 573422 568352 563181 557341 550688 543587 536323 528920 521697 515373 510159 505104 499002
60878D99002p195p207o412n724n157l865j684L41J241J360J758K778L750M076
$$ 499002 491807 484600 478188 472464 467307 463442 461758 462099 463340 464700 466458 469236 472986 477062
60864D77062M002M201M960O120P481Q905J0101J0747J0900J1035J1512J2202J2739
$$ 477062 481064 485265 490225 496345 503826 512731 522832 533579 544479 555514 567026 579228 591967
60851E91967J2940J2891J2837J3137J4013J5103J5461J4429J2379J0233Q350O361
$$ 591967 604907 617798 630635 643772 657785 672888 688349 702778 715157 725390 733740 740101
60839G40101M053J895M28l83q85j149j205j555k926n419q282j0584j1884j2283
$$ 740101 744154 746049 746477 746094 745209 744060 742855 741300 738374 732955 724673 714089 702205 689922
60825F89922j2199j2129j2301j2394j1835j0476q737p029n449m140l530l774m196
$$ 689922 677723 665594 653293 640899 629064 618588 609851 602822 597373 593233 589703 585929 581733
60812E81733l830k475q60K92R60J573K319K960L212L134L111L398L711L433K370
$$ 581733 577903 575428 574568 574860 575820 577393 579712 582672 585884 589018 592129 595527 599238 602671 605041
60797F05041J140N46O87J010J080R85R44R73R71Q75O35L71M95J281K228K509K162
$$ 605041 606181 606727 607414 608424 609504 610489 611433 612406 613377 614252 614887 615258 615753 617034 619262 621771 623933
60780F23933K273L556N342O521P003P404P773P533O668O062O345P090P469P177
$$ 623933 626206 629762 635104 641625 648628 656032 663805 671338 678006 684068 690413 697503 704972 712149
60766G12149O365N188L834K698K027J612J117N38K5n48j446k619l684m329m477
$$ 712149 718514 723702 727536 730234 732261 733873 734990 735528 735553 735005 733559 730940 727256 722927 718450
60751G18450m172l541k841k315k088k341l393n327p579r309j0153j0359j0186
$$ 718450 714278 710737 707896 705581 703493 701152 697759 692432 684853 675544 665391 655032 644846
60738F44846r589q599p657p200p157p051o631o115n834n796n634m927l622k172
$$ 644846 635257 626658 619001 611801 604644 597593 590962 584847 579013 573217 567583 562656 559034 556862
60724E56862j231r72q34m1J490K955L490L047K313J883J736J538J144O03j68j338
$$ 556862 555631 554659 553825 553784 555274 558229 561719 564766 567079 568962 570698 572236 573380 573983 573815 572477
60708E72477k822m208n187n853o427o886p048p020p225p911q739r046q487p296
$$ 572477 569655 565447 560260 554407 547980 541094 534046 527026 519801 511890 503151 494105 485618 478322
60694D78322o016n073m602m441m213l625k780k159k039k111j878j400j241j570
$$ 478322 472306 467233 462631 458190 453977 450352 447572 445413 443374 441263 439385 437985 436744 435174
60680D35174j693q33Q15K185K498K037J691K005K867L886M828N644O363P022P657
$$ 435174 433481 432648 433463 435648 438146 440183 441874 443879 446746 450632 455460 461104 467467 474489 482146
60665D82146Q186Q346P935P208O831P257Q145Q678Q481Q032Q076Q882J0195J1634
$$ 482146 490332 498678 506613 513821 520652 527909 536054 544732 553213 561245 569321 578203 588398 600032
60651F00032J2898J3663J3554J2330J0103P508N562M991N459N798N205L970K745
$$ 600032 612930 626593 640147 652477 662580 670088 675650 680641 686100 691898 697103 701073 703818
60638G03818J598K30j154k005k372l022m376n960p113p805q390q979r433r690
$$ 703818 705416 705646 704492 702487 700115 697093 692717 686757 679644 671839 663449 654470 645037 635347
60624F35347r769r573r066q461p998p625p110o372n543m776m153l599k830j489
$$ 635347 625578 616005 606939 598478 590480 582855 575745 569373 563830 559054 554901 551302 548472 546983
60610E46983M23K357L687M316M735N518O836Q405R815J0884J1698J2262J2281
$$ 546983 547406 549763 553450 557766 562501 568019 574855 583260 593075 603959 615657 627919 640200
60597F40200J1421R712P523N286L479K539K344J963N56j469k821k933k571k668
$$ 640200 651621 661333 668856 674142 677621 680160 682504 684467 685023 683554 680733 677800 675229 672561
60583F72561l327m292n626p260q537q973r092r713j0709j1172j0655r613q633
$$ 672561 669234 664942 659316 652056 643519 634546 625454 615741 605032 593860 583205 573592 564959
60570E64959p928p548p481p408o980o366o025n900n355m033k280p36J08p1j118
$$ 564959 557031 549483 542002 534594 527614 521248 515223 509323 503968 499935 497655 496919 497027 496956 495838
60555D95838k033j627J39J998K956L488M612O308P535P674P321P514Q685J0551
$$ 495838 493805 492178 492317 494315 497271 500759 505371 511679 519214 526888 534209 541723 550408 560959
60541E60959J2736J5141J7792K0604K3457K6467K9954L3995L8050M1128M2301
$$ 560959 573695 588836 606628 627232 650689 677156 707110 741105 779155 820283 862584
60530H62584M1048L7223L0979K2712J3005K668p188j5426k1459k5384k7370k7216
$$ 862584 903632 940855 971834 994546 1007551 1010219 1003031 987605 966146 940762 913392 886176
60518H86176k4878k1078j6887j2837q927n378k688r99K5N41M47P3K85J570L508
$$ 886176 861298 840220 823333 810496 801569 796191 793503 792504 792529 793070 793517 793590 793875 795445 798953
60503G98953N527P637J0080J2776J5666J9165K3694K9025L4667M0614M7073N3554
$$ 798953 804480 812117 822197 834973 850639 869804 893498 922523 957190 997804 1044877 1098431
60491A098431N8978O2756O5208O6744O7342O7234O7770P0959P8098Q9269J04249
$$ 1098431 1157409 1220165 1285373 1352117 1419459 1486693 1554463 1625422 1703520 1792789 1897038
60480A897038J23503J47719J76288K06592K34806K57038K69343K67313K46876
$$ 1897038 2020541 2168260 2344548 2551140 2785946 3042984 3312327 3579640 3826516
60471C826516K06255J47187P4425n415q4659j55586k12191k51529k73501k79718
$$ 3826516 4032771 4179958 4254383 4248968 4164309 4008723 3796532 3545003 3271502 2991784
60461B991784k73009k57356k37042k15136j92921j70842j49638j30287j13233
$$ 2991784 2718775 2461419 2224377 2009241 1816320 1645478 1495840 1365553 1252320
60452A252320r8149q4548p2441o2232n4105m7601m1936l6600l1578k7004k2868
$$ 1252320 1154171 1069623 997182 934950 880845 833244 791308 754708 723130 696126 673258
60441F73258j9182j6178j4090j2782j1788j0813j0054r879j0219j0393r699q182
$$ 673258 654076 637898 623808 611026 599238 588425 578371 568492 558273 547880 538181 529999
60429E29999o591n545m964m468m020l763l546l118k686k656k782k224p00J026
$$ 529999 523408 517863 512899 508431 504411 500648 497102 493984 491298 488642 485860 483636 482936 483962
60415D83962K068K376K416K399K260J998J634J118O52O75J183J457J078O89J204
$$ 483962 486030 488406 490822 493221 495481 497479 499113 500231 500883 501558 502741 504198 505276 505965 507169
60400E07169K485L570L975M085M300M554M684M672M423L855L239K917K645J867
$$ 507169 509654 513224 517199 521284 525584 530138 534822 539494 543917 547772 551011 553928 556573 558440
60386E58440P01j3J59O33O55J56n24j220j784j794j035m0L30j93j033j327o38
$$ 558440 559141 559128 559287 559920 560575 560731 560207 558987 557203 555409 554374 554334 554664 554471 553438 552111 551473
60369E51473P24J868K028J368Q93J383K646L937M798N220N274N054M823M852N153
$$ 551473 552197 554065 556093 557461 558354 559737 562383 566320 571118 576338 581612 586666 591489 596341 601494
60354F01494N591O167O888P507P689P447P074O681O072N151M152L350K675J857
$$ 601494 607085 613252 620140 627647 635336 642783 649857 656538 662610 667761 671913 675263 677938 679795
60340F79795Q38j16p53j141j535j916j905j250k56N63J190K083L381M475M647
$$ 679795 680633 680517 679764 678623 677088 675172 673267 672017 671761 672324 673514 675597 678978 683453 688100
60325F88100L878K782J880J227O11k15j437l005m541n619o157o394o476o337o036
$$ 688100 691978 694760 696640 697867 698478 698263 696826 693821 689280 683661 677504 671110 664634 658297 652261
60310F52261n886o022o000n234l828k671k433k694k402j158L34J223J469J556
$$ 652261 646375 640353 634353 629119 625291 622620 620187 617493 615091 613933 614267 615490 616959 618515
60296F18515J605J281M96m15j207j929k485k454j631l94O78J287J349R19M09M88
$$ 618515 620120 621401 621897 621482 620275 618346 615861 613407 611776 611382 612060 613347 614696 615615 616024 616512
60280F16512J312K129K124J454R98J265K034K875L516L750L562L447M032N262
$$ 616512 617824 619953 622077 623531 624529 625794 627828 630703 634219 637969 641531 644978 649010 654272
60266F54272O359O730O562O408O631P426Q908J0849J2612J3714J4347J5106J6336
$$ 654272 660631 667361 673923 680331 686962 694388 703296 714145 726757 740471 754818 769924 786260
60253G86260J8008J9946K1969K3930K5897K8232L1221L4775L8597M2534M6582
$$ 786260 804268 824214 846183 870113 896010 924242 955463 990238 1028835 1071369 1117951
60242A117951N0734N5057N9769O4983P0592P6574Q3095Q9872R5711R9359J00751
$$ 1117951 1168685 1223742 1283511 1348494 1419086 1495660 1578755 1668627 1764338 1863697 1964448
60231A964448J00867J00179R7896R3010Q5573P6498O6508N5748M4264L2225J9743
$$ 1964448 2065315 2165494 2263390 2356400 2441973 2518471 2584979 2640727 2684991 2717216 2736959
60220B736959O920n724j7221k6768l4242m0007m4262m6684m6746m4330l9956l4341
$$ 2736959 2743879 2738155 2720934 2694166 2659924 2619917 2575655 2528971 2482225 2437895 2397939 2363598
60208B363598k7686j9639r993P64J1758K2428L2805M3312N4419O6224P8029Q8549
$$ 2363598 2335912 2316273 2306280 2307044 2318802 2341230 2374035 2417347 2471766 2537990 2616019 2704568
60196B704568R6851J03025J07597J10395J10443J06950R9961R0030P7746O3726
$$ 2704568 2801419 2904444 3012041 3122436 3232879 3339829 3439790 3529820 3607566 3671292
60186C671292M8600L2658J5822j795j9462l6158n1049o3578p3385q0378q4576
$$ 3671292 3719892 3752550 3768372 3766577 3747115 3710957 3659908 3596330 3522945 3442567 3357991
60175C357991q5772q3605p8229p0526o1332n0732l8471k4791j0458L798J7463
$$ 3357991 3272219 3188614 3110385 3039859 2978527 2927795 2889324 2864533 2854075 2857873 2875336
60164B875336L0057M1230N0942N9167O5495O9312P0318O8445O3558N5699M5582
$$ 2875336 2905393 2946623 2997565 3056732 3122227 3191539 3261857 3330302 3393860 3449559 3495141
60153C495141L4297K2480J0226k201j4086k4721l3654m0302m3887m4079m1397
$$ 3495141 3529438 3551918 3562144 3559943 3545857 3521136 3487482 3447180 3403293 3359214 3317817
60142C317817l6624l0055k1480j0669K304J7012L2830M9380O6886Q5777J05868
$$ 3317817 3281193 3251138 3229658 3218989 3221293 3238305 3271135 3320515 3387401 3473178 3579046
60131C579046J26292J46437J66583J87413K09172K31485K53532K74118K91966
$$ 3579046 3705338 3851775 4018358 4205771 4414943 4646428 4899960 5174078 5466044
60122E466044L06317L17076L24057L26409L23154L13983K99115K78670K52701
$$ 5466044 5772361 6089437 6413494 6739903 7063057 7377040 7676155 7954825 8207526
60113H207526K21691J86413J47315J04582N8862J1458l6353q3761j29915j73395
$$ 8207526 8429217 8615630 8762945 8867527 8926389 8937847 8901494 8817733 8687818 8514423
60103H514423k12404k45278k70591k87194k94680k93826k86130k72798k54380
$$ 8514423 8302019 8056741 7786150 7498956 7204276 6910450 6624320 6351522 6097142
60094F097142k31429k05132j77012j48130j18927q9695o0878l2878n971J9352
$$ 6097142 5865713 5660581 5483569 5335439 5216512 5126817 5065939 5033061 5027090 5046442
60084E046442M2263O2047P8342R0643R7953R9434R5230Q6126P2629N5149L5016
$$ 5046442 5088705 5150752 5229094 5319737 5417690 5517124 5612354 5698480 5771109 5826258 5861274
60073E861274J4368n386k4400m3234o1454p7930r2113j04441j15662j26159j35711
$$ 5861274 5875642 5870256 5845856 5802622 5741168 5663238 5571125 5466684 5351022 5224863 5089152
60062E089152j43448j48296j49843j48633j45262j39586j31186j20370j07993
$$ 5089152 4945704 4797408 4647565 4498932 4353670 4214084 4082898 3962528 3854535
60053C854535r4569q0142o4913m9299l3370j6904l3J6670L2847M8462O3284P6872
$$ 3854535 3759966 3679824 3614911 3565612 3532242 3515338 3515305 3531975 3564822 3613284 3676568 3753440
60041C753440Q9178J00430J10170J17032J19891J18607J13351J03909R0289P3478
$$ 3753440 3842618 3943048 4053218 4170250 4290141 4408748 4522099 4626008 4716297 4789775
60031D789775N4819L4870J3580q664l0859n2283p2774r1951j08696j21780j30645
$$ 4789775 4844594 4879464 4893044 4884380 4853521 4801238 4728464 4636513 4527817 4406037 4275392
60020D275392j35368j36152j33244j27141j18522j07898r5550q1778o7047n1780
$$ 4275392 4140024 4003872 3870628 3743487 3624965 3517067 3421517 3339739 3272692 3220912
60010C220912l6161k0250m219J1715K7570M3659O0186P6910R3419J09649J25746
$$ 3220912 3184751 3164501 3160282 3171997 3199567 3243226 3303412 3380322 3473741 3583390 3709136
59999C709136J41367J55370J66393J73532J76261J73899J65745J51771J32947
$$ 3709136 3850503 4005873 4172266 4345798 4522059 4695958 4861703 5013474 5146421
59990E146421J10652Q5890N9191L1062K208k6620n4712q1169j04879j24933j40896
$$ 5146421 5257073 5342963 5402154 5433216 5435424 5408804 5354092 5272923 5168044 5043111 4902215
59979D902215j52365j58432j58226j52097j41729j28768j13765r6817p8677o0465
$$ 4902215 4749850 4591418 4433192 4281095 4139366 4010598 3896833 3800016 3721339 3660874
59969C660874m2522k4449o343J0898K6821M2133N7527P2324Q5024R4890J02297
$$ 3660874 3618352 3593903 3587560 3598458 3625279 3667412 3724939 3797263 3882287 3977177 4079474
59958D079474J07578J10258J09644J05665R8915R0177Q0092O9078N7267M4626
$$ 4079474 4187052 4297310 4406954 4512619 4611534 4701711 4781803 4850881 4908148 4952774
59948D952774L1342J8204O531k356p857j0293j0198p265l00J1558K7786M7103
$$ 4952774 4984116 5002320 5008851 5006495 4998638 4988345 4978147 4970882 4970582 4982140 5009926 5057029
59936E057029O8943R3762J21831J52344J83955K15789K47498K78552L07868L34004
$$ 5057029 5125972 5219734 5341565 5493909 5677864 5893653 6141151 6419703 6727571 7061575
59926G061575L55274L69631L74718L68223L48151L13135K63057J99624J26209
$$ 7061575 7416849 7786480 8161198 8529421 8877572 9190707 9453764 9653388 9779597
59917I779597M6921l4071j12417j83474k43205k89388l21849l41427l49108l46190
$$ 9779597 9826518 9792447 9680030 9496556 9253351 8963963 8642114 8300687 7951579 7605389
59907G605389l34641l16658k93856k67351k38463k08743j79106j49426j19312
$$ 7605389 7270748 6954090 6660234 6392883 6154420 5945677 5766571 5617145 5497833
59898E497833q9030n9400l1069m191K1432M6264P0762R4749J17088J36328J51477
$$ 5497833 5408803 5349403 5318334 5314143 5335575 5381839 5452601 5547350 5664438 5800766 5952243
59887E952243J61780J66004J62729J51315J32027J05096P0635K9831j4489n9157
$$ 5952243 6114023 6280027 6442756 6594071 6726098 6831194 6901829 6931660 6917171 6858014
59877F858014j02048j41655j75884k02395k20169k29919k32859k29820k21789
$$ 6858014 6755966 6614311 6438427 6236032 6015863 5785944 5553085 5323265 5101476
59868E101476k10504j97852j84936j72159j59935j48913j39622j32213j26429
$$ 5101476 4890972 4693120 4508184 4336025 4176090 4027177 3887555 3755342 3628913
59859C628913j21494j16290j09989j02561r4414q5646p5961o5286n4160m3438
$$ 3628913 3507419 3391129 3281140 3178579 3084165 2998519 2922558 2857272 2803112 2759674
59849B759674l3867k5939j9911j5876j3929j4317j7172k2098k8232l4645m0488
$$ 2759674 2725807 2699868 2679957 2664081 2650152 2635835 2618663 2596565 2568333 2533688 2493200
59838B493200m4829m6927m6876m5549m3551m0560l6082l0567k5059j9835j4046
$$ 2493200 2448371 2401444 2354568 2309019 2265468 2224908 2188826 2158259 2133200 2113365 2099319
59827B099319o971Q64Q198J4301J9297K3552K7307L0925L4940L9652M4901N0333
$$ 2099319 2092348 2093212 2101410 2115711 2135008 2158560 2185867 2216792 2251732 2291384 2336285 2386618
59815B386618N5451N9297O0545N8439N3392M6308L7568K7271J6341O577p24n677
$$ 2386618 2442069 2501366 2561911 2620350 2673742 2720050 2757618 2784889 2801230 2807807 2807083 2801406
59803B801406r026j0909j0861q646m453J583R480J9033K9832M1727N4909O9469
$$ 2801406 2792380 2781471 2770610 2761964 2757511 2759094 2768574 2787607 2817439 2859166 2914075 2983544
59791B983544Q5321J02670J22122J44164J68801J95948K25726K57971K91335L22788
$$ 2983544 3068865 3171535 3293657 3437821 3606622 3802570 4028296 4286267 4577602 4900390
59781D900390L47552L59349L51331L17972K57408J73063P3676k8630j21760j96892
$$ 4900390 5247942 5607291 5958622 6276594 6534002 6707065 6780741 6752111 6630351 6433459
59771F433459k49834k80406k91212k86612k71472k49735k24020j96559j69768
$$ 6433459 6183625 5903219 5612007 5325395 5053923 4804188 4580168 4383609 4213841
59762D213841j45303j23014j01790q1369o2728m6642l2631j9596o927N405J7512
$$ 4213841 4068538 3945524 3843734 3762365 3699637 3652995 3620364 3600768 3593841 3599246 3616758
59751C616758K9852M2785N6166O9484Q2426R5307J08903J23788J39974J57189
$$ 3616758 3646610 3689395 3745561 3815045 3897471 3992778 4101681 4225469 4365443 4522632
59741D522632J75332J94521K14909K36695K60079K85089L11643L39944L70320
$$ 4522632 4697964 4892485 5107394 5344089 5604168 5889257 6200900 6540844 6911164
59732F911164M02276M34070M63776M90338N12850N29107N35997N31498N15663
$$ 6911164 7313440 7747510 8211286 8701624 9214474 9743581 10279578 10811076 11326739
59723A1326739M89628M54839M13851L71072L31773L00339K79556K70942K74897
$$ 11326739 11816367 12271206 12685057 13056129 13387902 13688241 13967797 14238739 14513636
59714A4513636K90627L16188L48637L84259M19238M50478M75369M90673M92460
$$ 14513636 14804263 15120451 15469088 15853347 16272585 16723063 17198432 17689105 18181565
59705A8181565M77855M46528M00071L40570K70453J93272J13552L5899l5322r5887
$$ 18181565 18659420 19105948 19506019 19846589 20117042 20310314 20423866 20459765 20424443 20328556
59695B0328556j42384j73197j88210j87612j71619j41316r8801m6194J5003Q3453
$$ 20328556 20186172 20012975 19824765 19637153 19465534 19324218 19225417 19179223 19194226 19277679
59685A9277679J57628K36240L18474M03395M89447N74670O56780P32623P97818
$$ 19277679 19435307 19671547 19990021 20393416 20882863 21457533 22114313 22846936 23644754
59676B3644754Q47030Q74204Q72553Q35356P57799O38437M79484K86963P1260
$$ 23644754 24491784 25365988 26238541 27073897 27831696 28470133 28949617 29236580 29307840
59667B9307840j53256l70766n67086p31260q55929r37754r77726r80357r52329
$$ 29307840 29154584 28783818 28216732 27485472 26629543 25691789 24714063 23733706 22781377
59658B2781377r02079q40002p77762p26535o95260o89084p07516p43448p85070
$$ 22781377 21879298 21039296 20261534 19534999 18839739 18150655 17443139 16699691 15914621
59649A5914621q20330q40803q42815q26696p95663p54382p07188o57026o05921
$$ 15914621 15094291 14253488 13410673 12583977 11788314 11033932 10326744 9669718 9063797
59640I063797n55717n07921m63172m21533l83092l47892l15444k85061k56634
$$ 9063797 8508080 8000159 7536987 7115454 6732362 6384470 6069026 5783965 5527331
59631E527331k30640k07210j85723j65450j46317j28739j12908r8446q4774p1722
$$ 5527331 5296691 5089481 4903758 4738308 4591991 4463252 4350344 4251898 4167124 4095402
59621D095402n9796m9754m1919l6049l1920k9787k9948l2190l6017m1276m7932
$$ 4095402 4035606 3985852 3943933 3907884 3875964 3846177 3816229 3784039 3748022 3706746 3658814
59610C658814n5318o2269o8201p3452p8140q1303q1815p9842p6705p3368o9698
$$ 3658814 3603496 3541227 3473026 3399574 3321434 3240131 3158316 3078474 3001769 2928401 2858703
59599B858703o5224n9939n4033m7379l9940l2368k5653j9944j4278p783q50N256
$$ 2858703 2793479 2733540 2679507 2632128 2592188 2559820 2534167 2514223 2499945 2492162 2491312 2496568
59587B496568R832J3393J6803K0152K2756K3979K3750K2437K0662J9135J8345
$$ 2496568 2506400 2519793 2536596 2556748 2579504 2603483 2627233 2649670 2670332 2689467 2707812
59576B707812J8283J8712J9749K1862K5299K9807L4952M0417M6072N2205N9702
$$ 2707812 2726095 2744807 2764556 2786418 2811717 2841524 2876476 2916893 2962965 3015170 3074872
59565C074872O9377Q0838R2575J03479J13916J24914J36938J49927J63935J78802
$$ 3074872 3144249 3225087 3317662 3421141 3535057 3659971 3796909 3946836 4110771 4289573
59555D289573J93471K06564K17629K27090K34897K40010K41391K38810K32421
$$ 4289573 4483044 4689608 4907237 5134327 5369224 5609234 5850625 6089435 6321856
59546F321856K22281K08717J92673J75214J56882J37694J17252R4668O9070M0890
$$ 6321856 6544137 6752854 6945527 7120741 7277623 7415317 7532569 7627237 7696307 7737197
59536G737197J2470j3169l4021m9429n9162o2934o0659n2586l8956j9830M597
$$ 7737197 7749667 7736498 7702477 7653048 7593886 7530952 7470293 7417707 7378751 7358921 7363518
59525G363518L3631O5996R9890J33128J63312J87827K03814K08667K00939J80678
$$ 7363518 7397149 7463145 7563035 7696163 7859475 8047302 8251116 8459783 8660722 8841400
59515H841400J48710J05925N3589n948o9457j33684j95653k52300l00548l38058
$$ 8841400 8990110 9096035 9149624 9143676 9074219 8940535 8744882 8492582 8192034 7853976
59505G853976l63727l77393l79559l71634l56007l35325l11479k85435k57905
$$ 7853976 7490249 7112856 6733297 6361663 6005656 5670331 5358852 5073417 4815512
59496D815512k29967k02890j77491j53779j31331j09862q9281o9391m9832l0496
$$ 4815512 4585545 4382655 4205164 4051385 3920054 3810192 3720911 3651520 3601688 3571192
59486C571192j1644O532K4276M1912N9445P6722R3845J11020J28097J44598J60165
$$ 3571192 3559548 3566080 3590356 3632268 3691713 3768435 3862280 3973300 4101397 4245995 4406160
59475D406160J74667J87852J99145K07702K12446K12043K05282J91535J70697
$$ 4406160 4580827 4768679 4967824 5175526 5387972 5600015 5805297 5996832 6167529
59466F167529J42746J07855O7042K2398k3551o8599j11049j49480j82662k09489
$$ 6167529 6310275 6418130 6485172 6507570 6484019 6415420 6304371 6154891 5972229 5762740
59456E762740k29144k41471k47298k48007k44601k37494k27185k14780k01518
$$ 5762740 5533596 5292125 5044827 4796820 4552219 4314725 4087540 3872760 3671242
59447C671242j88101j74771j61689j48866j36003j22958j10354r9126q9423q0374
$$ 3671242 3483141 3308370 3146681 2997815 2861812 2738854 2628500 2529374 2439951 2359577
59437B359577p1222o2163n3818m6235l8997l2135k6284k1770j7997j4092r848
$$ 2359577 2288355 2226192 2172374 2126139 2087142 2055007 2028723 2006953 1988956 1974864 1965016
59426A965016n708j972J449M566P060Q801J0349J2677J6340K0950K5241K7599
$$ 1965016 1959308 1957336 1958785 1963351 1970411 1979212 1989561 2002238 2018578 2039528 2064769 2092368
59414B092368K6771K2529J5937R092M375L455O521J2377J9636K7869L7251M7123
$$ 2092368 2119139 2141668 2157605 2166697 2171072 2174527 2181048 2193425 2213061 2240930 2278181 2325304
59402B325304N5455O0209O1024N9358N7385N7061N9845O6470P6793R0109J05673
$$ 2325304 2380759 2440968 2501992 2561350 2618735 2675796 2735641 2802111 2878904 2969013 3074686
59391C074686J22710J40420J58544J77926J99845K24736K52075K81571L13714
$$ 3074686 3197396 3337816 3496360 3674286 3874131 4098867 4350942 4632513 4946227
59382D946227L48770L85810M23177M59400M93007N21704N42492N52837N51541
$$ 4946227 5294997 5680807 6103984 6563384 7056391 7578095 8120587 8673424 9224965
59373I224965N38655N15099M82652M43914M01884L59408L18885K82112K49934
$$ 9224965 9763620 10278719 10761371 11205285 11607169 11966577 12285462 12567574 12817508
59364A2817508K21967J96755J72379J46974J18808Q6289M8252M291m5318r9943
$$ 12817508 13039475 13236230 13408609 13555583 13674391 13760680 13808932 13813223 13767905 13667962
59354A3667962j58363k18102k75481l27074l71165m07567m36198m56334m67453
$$ 13667962 13509599 13291497 13016016 12688942 12317777 11910210 11474012 11017678 10550225
59345A0550225m70283m66555m57736m44191m25605m02107l74969l46116l17018
$$ 10550225 10079942 9613387 9155651 8711460 8285855 7883748 7508779 7162663 6845645
59336F845645k88169k59650k31828k05354j80827j58889j40304j25383j13463
$$ 6845645 6557476 6297826 6065998 5860644 5679817 5520928 5380624 5255241 5141778
59327E141778j03595r5695r0380q7629q6475q6239q7234q9643r2471r4325r4819
$$ 5141778 5038183 4942488 4852108 4764479 4678004 4591765 4504531 4414888 4322417 4228092 4133273
59316D133273r4418r3252r0898q7238q2694p7519p1548o4815n7845n1080m4488
$$ 4133273 4038855 3945603 3854705 3767467 3684773 3607254 3535706 3470891 3413046 3361966 3317478
59305C317478l7909l1321k4619j7569j0281l275L230R763J7009K5038L3475M2110
$$ 3317478 3279569 3248248 3223629 3206060 3195779 3192504 3195734 3205497 3222506 3247544 3281019 3323129
59293C323129N0985O0168O9882Q0585R2418J04706J16552J27818J38886J49490
$$ 3323129 3374114 3434282 3504164 3584749 3677167 3781873 3898425 4026243 4165129 4314619
59283D314619J58595J65640J71091J75118J76338J72755J63655J49754J31484
$$ 4314619 4473214 4638854 4809945 4985063 5161401 5334156 5497811 5647565 5779049
59274E779049J07964P8026M1767J003m1233q1345j16147j44024j65203j80597
$$ 5779049 5887013 5965039 6006806 6007809 5966576 5885231 5769084 5625060 5459857 5279260
59264E279260j90672j95645j96290j93852j89181j82470j73831j63685j52546
$$ 5279260 5088588 4892943 4696653 4502801 4313620 4131150 3957319 3793634 3641088
59255C641088j40852j29067j17560j06318r5070q3750p2574o1723n1287m1425
$$ 3641088 3500236 3371169 3253609 3147291 3052221 2968471 2895897 2834174 2782887 2741462
59245B741462l2104k2761j2750k212Q128J8227K9089M1518N5146O9252Q4037J00387
$$ 2741462 2709358 2686597 2673847 2671635 2679763 2697990 2727079 2768597 2823743 2892995 2977032 3077419
59233C077419J18665J38510J59721J82704K07866K35083K63824K93311L22438
$$ 3077419 3196084 3334594 3494315 3677019 3884885 4119968 4383792 4677103 4999541
59224D999541L49804L73899L92813M03737M03398L89406L61031L18595K62717
$$ 4999541 5349345 5723244 6116057 6519794 6923192 7312598 7673629 7992224 8254941
59215H254941J94670J17148L4041n0545j32747k08746k74912l28453l67662l91654
$$ 8254941 8449611 8566759 8600800 8550255 8417508 8208762 7933850 7605397 7237735 6846081
59205F846081m00568l96321l82348l61904l36779l08091k77692k47841k19700
$$ 6846081 6445513 6049192 5666844 5304940 4968161 4660070 4382378 4134537 3914837
59196C914837j93143j68187j45553j25581j07573r0927p6032o3301n2042m1277
$$ 3914837 3721694 3553507 3407954 3282373 3174800 3083873 3007841 2944540 2892498 2851221
59186B851221l1170k2492j4968p348P83Q400J4490J9181K3068K6265K8585K9952
$$ 2851221 2820051 2797559 2782591 2775243 2776026 2784426 2798916 2818097 2841165 2867430 2896015 2925967
59174B925967L0166K8808K5912K2172J8053J3159O969k64p863j5514k3174l0522
$$ 2925967 2956133 2984941 3010853 3033025 3051078 3064237 3071206 3070942 3063079 3047565 3024391 2993869
59162B993869l7107m2779m7484n0858n2566n2940n2684n2066n0725m8231m4524
$$ 2993869 2956762 2913983 2866499 2815641 2763075 2710135 2657451 2605385 2554660 2506429 2461905
59151B461905l9856l4686k9535k4748k0333j6131j1907p307k121L196P761J1353
$$ 2461905 2422049 2387363 2357828 2333080 2312747 2296616 2284709 2277402 2275281 2278477 2286238 2297591
59139B297591J4807J9004K3892K8913L3793L8518M3035M7681N3290O0145O7208
$$ 2297591 2312398 2331402 2355294 2384207 2418000 2456518 2499553 2547234 2600524 2660669 2727877
59128B727877P3236P8238Q2986Q7564R1399R4493R7266R9381R9895R8766R6913
$$ 2727877 2801113 2879351 2962337 3049901 3141300 3235793 3333059 3432440 3532335 3631101 3728014
59117C728014R4566R0865Q5627Q0178P5582P1122O5618N9483N4372N1262N0024
$$ 3728014 3822580 3913445 3999072 4079250 4154832 4225954 4291572 4351055 4405427 4456689 4506713
59106D506713N0576N3332N8384O4995P2005P8207Q2229Q2624P8167O7842N0708
$$ 4506713 4557289 4610621 4669005 4734000 4806005 4884212 4966441 5049065 5127232 5195074 5245782
59095E245782K6406m097l8639p4737j10078j42457j69924j91286k06192k14720
$$ 5245782 5272188 5268091 5229452 5154715 5044637 4902180 4732256 4540970 4334778 4120058
59085D120058k17254k14781k08746k00348j90118j78357j65660j52834j40495
$$ 4120058 3902804 3688023 3479277 3278929 3088811 2910454 2744794 2591960 2451465
59076B451465j28897j18091j08110r9024r0801q3140p5595o8114o1255n5527n0632
$$ 2451465 2322568 2204477 2096367 1997343 1906542 1823402 1747807 1679693 1618438 1562911 1512279
59065A512279m5792m0857l6550l3384l0859k8123k5107k2348j9990j7530j4670
$$ 1512279 1466487 1425630 1389080 1355696 1324837 1296714 1271607 1249259 1229269 1211739 1197069
59054A197069j1873r778q473p564o745n920n018m023l114k548k387k562l061l763
$$ 1197069 1185196 1175418 1166945 1159381 1152636 1146716 1141698 1137675 1134561 1132013 1129626 1127064 1124003 1120240
59040A120240m164l647k096Q7K638N768R667J3923J7721K0427K1874K2219K1648
$$ 1120240 1116076 1112429 1110333 1110420 1113058 1118826 1128493 1142416 1160137 1180564 1202438 1224657 1246305
59027A246305K0097J7270J3158Q620M952K659J078m73j626j543j60J784L758N728
$$ 1246305 1266402 1283672 1296830 1305450 1310402 1313061 1314139 1313666 1312040 1310497 1310337 1312121 1315879 1321607
59013A321607P536Q753R369R929J0606J0656R159O003J812k704p008j0649j3463
$$ 1321607 1329143 1337896 1347265 1357194 1367800 1378456 1387615 1393618 1395430 1392726 1385718 1375069 1361606
59000A361606j5765j8001k0159k1785k2496k2321k1499k0165j8260j5721j2766
$$ 1361606 1345841 1327840 1307681 1285896 1263400 1241079 1219580 1199415 1181155 1165434 1152668
58989A152668r938p724o039m317k217p7J513K403K980L665M668O136Q172J0541
$$ 1152668 1142730 1135006 1128967 1124650 1122433 1122356 1123869 1126272 1129252 1132917 1137585 1143721 1151893 1162434
58975A162434J2513J3393J3243J2893J3133J4018J5165J6484J8258K0436K2376
$$ 1162434 1174947 1188340 1201583 1214476 1227609 1241627 1256792 1273276 1291534 1311970 1334346
58964A334346K3535K4099K4594K5116K5418K5452K5339K4888K3759K2123K0693
$$ 1334346 1357881 1381980 1406574 1431690 1457108 1482560 1507899 1532787 1556546 1578669 1599362
58953A599362J9987K0068K1013K3082K6142K9467L2421L5050L7794M0882M4315
$$ 1599362 1619349 1639417 1660430 1683512 1709654 1739121 1771542 1806592 1844386 1885268 1929583
58942A929583M7993N1586N4694N7464O0720O5027O9996P4994Q0290Q6832R4931
$$ 1929583 1977576 2029162 2083856 2141320 2202040 2267067 2337063 2412057 2492347 2579179 2674110
58931B674110J03826J12751J21998J32549J44919J58657J72993J87778K03631
$$ 2674110 2777936 2890687 3012685 3145234 3290153 3448810 3621803 3809581 4013212
58922D013212K21194K40495K61165K83150L06879L32642L60197L89096M19070
$$ 4013212 4234406 4474901 4736066 5019216 5326095 5658737 6018934 6408030 6827100
58913F827100M49876M81028N11885N41714N69310N92698O09458O17240O13746
$$ 6827100 7276976 7758004 8269889 8811603 9380913 9973611 10583069 11200309 11814055
58904A1814055N96524N63264N12467M43932L58907K60077J51226L6746p8523j89174
$$ 11814055 12410579 12973843 13486310 13930242 14289149 14549226 14700452 14737198 14658675 14469501
58894A4469501k89818l76498m47389n01939n39914n61929n70401n68850n59962
$$ 14469501 14179683 13803185 13355796 12853857 12313943 11752014 11181613 10612763 10052801
58885A0052801n44964n24713n00550m73815m45282m15688l86322l58591l33216
$$ 10052801 9507837 8983124 8482574 8008759 7563477 7147789 6761467 6402876 6069660
58876F069660l10122k88864k68963k50159k32574k16400k01237j86237j71209
$$ 6069660 5759538 5470674 5201711 4951552 4718978 4502578 4301341 4115104 3943895
58867C943895j57125j44978j34480j24384j13895j03214r2921q3473p5231o8236
$$ 3943895 3786770 3641792 3507312 3382928 3269033 3165819 3072898 2989425 2914194 2845958
58857B845958o1849n5206m8244m1743l6154l0919k5269j9182j3093p154j349M047
$$ 2845958 2784109 2728903 2680659 2638916 2602762 2571843 2546574 2527392 2514299 2507145 2505796 2509843
58845B509843Q808J3381J8410K3755K8702L3205L8120M3902M9790N4926N9672
$$ 2509843 2518651 2532032 2550442 2574197 2602899 2636104 2674224 2718126 2767916 2822842 2882514
58834B882514O5227P2137P9860Q7710R5656J04197J13847J24863J37108J50165
$$ 2882514 2947741 3019878 3099738 3187448 3283104 3387301 3501148 3626011 3763119 3913284
58824C913284J63857J78618J94997K12919K31940K52225K74669K99830L27162
$$ 3913284 4077141 4255759 4450756 4663675 4895615 5147840 5422509 5722339 6049501
58815F049501L55771L85472M16615M49014M81470N12429N40667N65053N83827
$$ 6049501 6405272 6790744 7207359 7656373 8137843 8650272 9190939 9755992 10339819
58806A0339819N94372N93877N80048N51175N05674M42278L61052K64276J56151
$$ 10339819 10934191 11528068 12108116 12659291 13164965 13607243 13968295 14232571 14388722
58797A4388722M1760p3639j84940k87583l77894m53090n11337n52374n77796n89986
$$ 14388722 14430482 14356843 14171903 13884320 13506426 13053336 12541999 11989625 11411829 10821843
58787A0821843n90655n80900n62447n37901n09506m78407m45512m12160l79415
$$ 10821843 10231188 9650288 9087841 8549940 8040434 7562027 7116515 6704355 6324940
58778F324940l47482l16648k88444k65017k47471k35282k27000k20702k14089
$$ 6324940 5977458 5660810 5372366 5107349 4859878 4624596 4397596 4176894 3962805
58769C962805k05193j93563j80373j67212j54906j43408j32372j21641j11427
$$ 3962805 3757612 3564049 3383676 3216464 3061558 2918150 2785778 2664137 2552710
58760B552710j02080r3597q5479p7301o9185o1479n4272m7564m1636l6745l2534
$$ 2552710 2450630 2357033 2271554 2194253 2125068 2063589 2009317 1961753 1920117 1883372 1850838
58749A850838k8340k4010j9954j6521j3775j1885j1065j1113j1563j2421j4246
$$ 1850838 1822498 1798488 1778534 1762013 1748238 1736353 1725288 1714175 1702612 1690191 1675945
58738A675945j7220k0609k3279k4467k4001k2379k0765k0329k1150k2220k2826
$$ 1675945 1658725 1638116 1614837 1590370 1566369 1543990 1523225 1502896 1481746 1459526 1436700
58727A436700k3488k5041k7293k9225l0325l1044l1878l2637l2840l2472l1948
$$ 1436700 1413212 1388171 1360878 1331653 1301328 1270284 1238406 1205769 1172929 1140457 1108509
58716A108509l1463l0690k9208k7061k4804k2955k1502k0070j8442j6768j5324
$$ 1108509 1077046 1046356 1017148 990087 965283 942328 920826 900756 882314 865546 850222
58705H50222j4209j3376j2671j1864j0753r439q308p641p341p101o729o175n404
$$ 850222 836013 822637 809966 798102 787349 777910 769602 761961 754620 747519 740790 734615 729211
58692G29211m384l195k048j176p09o23p91j107j524j928k038j648r26k72K39J096
$$ 729211 724827 721632 719584 718408 717699 717076 716285 715178 713654 711726 709688 708040 707114 706842 707081 708177
58676G08177K899N678Q715J1099J2450J3177J4044J5519J7630K0351K3760K7496
$$ 708177 711076 716754 725469 736568 749018 762195 776239 791758 809388 829739 853499 880995
58664H80995L0246L0150K5893J7490O229n904j6926k5415l0685l2565l1306k7882
$$ 880995 911241 941391 967284 984774 991003 985099 968173 942758 912073 879508 848202 820320
58652H20320k3845k0293j7052j3341r196n543k890o94J673L977N707P078Q783
$$ 820320 796475 776182 759130 745789 736593 731050 728160 727466 729139 733116 738823 745901 754684
58639G54684J0977J3094J4713J6094J7834K0282K3324K6463K9068L0864L2322
$$ 754684 765661 778755 793468 809562 827396 847678 871002 897465 926533 957397 989719
58628I89719L4350L7563M1938M7083N2682N8629O4949P1723P9062Q7156R6231
$$ 989719 1024069 1061632 1103570 1150653 1203335 1261964 1326913 1398636 1477698 1564854 1661085
58617A661085J06300J16909J27357J37352J47198J57114J66479J73975J78261
$$ 1661085 1767385 1884294 2011651 2149003 2296201 2453315 2619794 2793769 2972030
58608B972030J78190J72566J60204J40500J13802Q1321M4891O754l0848o6090
$$ 2972030 3150220 3322786 3482990 3623490 3737292 3818613 3863504 3870258 3839410 3773320
58598C773320r7367j22993j41670j53469j59768j61849j59959j54144j45500j35798
$$ 3773320 3675953 3552960 3411290 3257821 3098053 2936204 2776245 2622101 2476601 2340803
58588B340803j25998j15781j04659r2961q1494p0779o0979n2248m4742l8357l2801
$$ 2340803 2214805 2099024 1994365 1901404 1819910 1749131 1688152 1635904 1591162 1552805 1520004
58577A520004k7896k3684k0311j7812j6011j4528j3040j1609j0509r741r058q547
$$ 1520004 1492108 1468424 1448113 1430301 1414290 1399762 1386722 1375113 1364604 1354863 1345805 1337258
58565A337258q863j0566j3561j7408k1887k6766l1289l4424l5655l5095l2929
$$ 1337258 1328395 1317829 1304268 1286860 1264973 1238207 1206918 1172494 1136839 1101744 1068815
58554A068815k9247k4587k0117j6953j5461j5376j6312j7893j9655k1097k1921
$$ 1068815 1039568 1014981 994864 977911 962450 947074 930762 912869 893214 872117 850196
58543H50196k2096k1681k0655j8982j6887j4942j3619j2791j1913j0772r650q661
$$ 850196 828100 806419 785764 766782 749895 734953 721334 708543 696630 685858 676208 667547
58531F67547p520o321n885o632p622p609o804o515p124p575p087o252n862n561
$$ 667547 660027 653706 647821 641189 633567 625958 619154 612639 605515 597940 590853 584601 578739 573178
58517E73178m455k443k75J383K329K641K602K646K901L070K939K690K480K189
$$ 573178 568723 566280 566005 567388 569717 572358 574960 577606 580507 583577 586516 589206 591686 593875
58503E93875J855J830K170K535K970M124O128P991Q890R367J0416J1846J2505
$$ 593875 595730 597560 599730 602265 605235 609359 615487 623478 632368 641735 652151 663997 676502
58490F76502J1817J0126P826N079K269j84k459m971p406q985r635j0125j0963
$$ 676502 688319 698445 706271 711350 713619 713435 710976 706005 698599 689614 679979 669854 658891
58477F58891j1904j2656j3187j3224j2282j0513q846p920p389o606n463m279l348
$$ 658891 646987 634331 621144 607920 595638 585125 576279 568359 560970 554364 548901 544622 541274
58464E41274k776k425j859p73L74P39K29k59L0Q83J650K116K398K548K660L084
$$ 541274 538498 536073 534214 533441 533815 534554 534783 534524 534554 535437 537087 539203 541601 544149 546809 549893
58448E49893M066N336O390P104P803Q821J0240J1896J3382J4095J3545J1721R099
$$ 549893 553959 559295 565685 572789 580592 589413 599653 611549 624931 639026 652571 664292 673391
58435F73391O227L287J48l219o445r015j0649j1263j0763r274p429n882m554k931
$$ 673391 679618 682905 683053 679834 673389 664374 653725 642462 631699 622425 614996 609114 604560 601629
58421F01629j120J53Q35J927M085O620Q521R738J0838J2033J3281J4674J5877
$$ 601629 600509 600662 601497 603424 607509 614129 622650 632388 643226 655259 668540 683214 699091
58408F99091J5800J3755J0436O880L130j071m961p447q635r391r747r192q154
$$ 699091 714891 728646 739082 745962 749092 748021 743060 735613 726978 717587 707840 698648 690494
58395F90494p660p578o772n084l589k764j952r62o41j231j711j430j207j952l219
$$ 690494 682834 675256 668484 663400 659811 657047 655095 654133 653492 652261 650550 649120 647913 645961 642742
58380F42742l870l368j777O44L275N358O833Q178R262R372Q642Q308Q961R732
$$ 642742 638872 635504 633727 634371 637646 643004 649837 658015 667277 676649 685291 693599 702560 712292
58366G12292R809R622R750R824R395Q964R219J0028J0962J2087J3389J4229J4127
$$ 712292 722101 731723 741473 751297 760692 769656 778875 788903 799865 811952 825341 839570 853697
58353H53697J3448J2596J1182Q711N481K165r17l518n184n837n984n910n345m308
$$ 853697 867145 879741 890923 899634 905115 907280 906363 902845 897661 891824 885840 879930 874585 870277
58339H70277l309k310o11J720L505M332N431P730J0238J1507J1709J1933J2364
$$ 870277 866968 864658 864047 865767 869272 873604 879035 886765 897003 908510 920219 932152 944516
58326I44516J2547J2712J3508J4811J6056J7264J8641J9624J9533J8768J8230
$$ 944516 957063 969775 983283 998094 1014150 1031414 1050055 1069679 1089212 1107980 1126210
58315A126210J7775J6362J3599J0180O946M283K336J125N13M73J170K455L785
$$ 1126210 1143985 1160347 1173946 1184126 1191072 1195355 1197691 1198816 1199329 1199802 1200972 1203427 1207212
58302A207212M998O554Q622J0690J2428J4228J6283J8061J9162J9941K0736K1448
$$ 1207212 1212210 1218764 1227386 1238076 1250504 1264732 1281015 1299076 1318238 1338179 1358915 1380363
58290A380363K2251K3693K5552K6841K7530K8879L1469L4319L6758L9542M3091
$$ 1380363 1402614 1426307 1451859 1478700 1506230 1535109 1566578 1600897 1637655 1677197 1720288
58279A720288M6306M8350M9927N1398N1290M8260M3039L6900K9799K1930J5376
$$ 1720288 1766594 1814944 1864871 1916269 1967559 2015819 2058858 2095758 2125557 2147487 2162863
58268B162863J2001J0935J0369J0618J3053J7125K0975K4278K8059L2274L5909
$$ 2162863 2174864 2185799 2196168 2206786 2219839 2236964 2257939 2282217 2310276 2342550 2378459
58257B378459L9112M2974M7474N1704N5701O0142O4621O8166P1106P4548P8442
$$ 2378459 2417571 2460545 2508019 2559723 2615424 2675566 2740187 2808353 2879459 2954007 3032449
58246C032449Q1899Q4932Q8183R1646R5362J00340J07022J13902J19720J25771
$$ 3032449 3114348 3199280 3287463 3379109 3474471 3574811 3681833 3795735 3915455 4041226
58236D041226J33857J43223J52042J60631J70529J81579J92841K05168K19895
$$ 4041226 4175083 4318306 4470348 4630979 4801508 4983087 5175928 5381096 5600991
58227E600991K36015K51813K68246K87514L09439L32597L57748L86573M18334
$$ 5600991 5837006 6088819 6357065 6644579 6954018 7286615 7644363 8030936 8449270
58218H449270M51740M88863N32976N83817O39657P02758P77768Q65907R66528
$$ 8449270 8901010 9389873 9922849 10506666 11146323 11849081 12626849 13492756 14459284
58209A4459284J083463J223983J392677J593846J840004K149712K534405K992686
$$ 14459284 15542747 16766730 18159407 19753253 21593257 23742969 26277374 29270060
58201B9270060L518160M107833M766228N513243O390522P451707Q748282J0339845
$$ 29270060 32788220 36896053 41662281 47175524 53566046 61017753 69766035 80105880
58193H0105880J2319423J4809202J7924373K1754151K6345451L1562252L6762282
$$ 80105880 92425303 107234505 125158878 146913029 173258480 204820732 241583014
58186B41583014M0521530M0826257L5906804K5321244J0536248n497694j9575779
$$ 241583014 282104544 322930801 358837605 384158849 394695097 389197403 369621624
58179C69621624k9505385l4682438l5816837l4212113l1130075k7491419k3848419
$$ 369621624 340116239 305433801 269616964 235404851 204274776 176783357 152934938
58172A52934938k0470287j7447754j4783675j2450348j0410988q625373p054618
$$ 152934938 132464651 115016897 100233222 87782874 77371886 68746513 61691895
58165F1691895n661555m405976l244191k132414j026648J04473J226672K172573
$$ 61691895 56030340 51624364 48380173 46247759 45221111 45325584 46552256 48724829
58157D8724829K648741K373056J271799m18162k236274l718538m597897m864140
$$ 48724829 51373570 53746626 55018425 54600263 52363989 48645451 44047554 39183414
58149C9183414m680612m251084l732304l216905k750572k348256k005814j713390
$$ 39183414 34502802 30251718 26519414 23302509 20551937 18203681 16197867 14484477
58141A4484477j464320j253629j074124r18932p85344o72703n78807n01300m39792
$$ 14484477 13020157 11766528 10692404 9773472 8988128 8315425 7736618 7235318 6795526
58132F795526l93177l57055l27096l02779k84714k70358k55832k40159k24290
$$ 6795526 6402349 6045294 5718198 5415419 5130705 4860347 4604515 4364356 4140066
58123D140066k07591j88856j69505j52213j37074j22293j08047r6616q9090q4724
$$ 4140066 3932475 3743619 3574114 3421901 3284827 3162534 3054487 2957871 2868781 2784057
58113B784057q3141q4473q7400q9421q9197q7053q3470p8782p3814o9205o4650
$$ 2784057 2700916 2616443 2529043 2439622 2350425 2263372 2179902 2101120 2027306 1958101 1893451
58102A893451o0143n6878n5392n4030n1102m7438m4796m3001m0811l8446l6889
$$ 1893451 1833308 1776430 1721038 1667008 1615906 1568468 1523672 1480671 1439860 1401414 1364525
58091A364525l5611l3413l0786k9051k7885k6089k4149k3555k4053k4123k3743
$$ 1364525 1328914 1295501 1264715 1235664 1207779 1181690 1157541 1133986 1109933 1085810 1062067
58080A062067k4084k4697k3743k1128j8912j8221j7998j7271j6451j5897j5094
$$ 1062067 1037983 1013286 989543 968415 949503 931282 913284 896013 879562 863665 848571
58069H48571j3889j2897j2248j1433j0611j0441j0449r153o311l446j906j709
$$ 848571 834682 821785 809537 798104 787493 777052 766603 757450 751139 747693 745787 744078
58057G44078k487m042n723o707p241q205r413r738r025q249p678o540m865l898
$$ 744078 741591 737549 731826 725119 717878 709673 700260 690522 681497 673248 665570 659030 654165 650267
58043F50267m141m554m309l918l972m120l912l482k798j474J12P04j62j433k114
$$ 650267 646126 641572 637263 633345 629373 625253 621341 617859 615061 613587 613699 614403 614241 612808 610694
58028F10694k467l038l462l124k172j174l01N47J282J708J706J189L34k04O6O52
$$ 610694 608227 605189 601727 598603 596431 595257 594956 595503 596785 598493 600199 601388 601722 601518 601584 602236
58012F02236O70Q9l54l56k27K4O35J230J108M18j18o04j811l607m948n723p070
$$ 602236 602906 602995 602641 602285 602058 602082 602717 603947 605055 605473 605355 604751 602940 599333 594385 588662 581592
57995E81592r375j1353j1792j1121j0489j0325j0399j0447j0105r043p581o413
$$ 581592 572217 560864 549072 537951 527462 517137 506738 496291 486186 477143 469562 463149
57983D63149n403l683j229P60J593K032K916L899M308M256M175M049L874M029
$$ 463149 457746 454063 452834 453594 455187 457219 460135 464034 468342 472598 476773 480822 484696 488725
57969D88725M466M378L352K139J489J024L1j348k537l498m427m993m821m235l800
$$ 488725 493191 497569 500921 503060 504549 505573 505604 504256 501719 498221 493794 488801 483980 479745 475945
57954D75945l485k931k146j203J81K070L690M212L893L699L958M093L591K603
$$ 475945 472460 469529 467383 466180 466361 468431 472121 476333 480226 483925 487883 491976 495567 498170
57940D98170J527M79p06k172l804n242o279p239q612j0310j1686j2307j2257j1680
$$ 498170 499697 500176 499470 497298 493494 488252 481973 474734 466122 455812 444126 431819 419562 407882
57926D07882j0672r598q841q066o539m424k886k532k530j816m62P33J370J630
$$ 407882 397210 387612 378771 370705 364166 359742 356856 354324 351794 349978 349516 350249 351619 353249
57912C53249J793K191L120M319M960M749M501N112O383P380P620P416P301P541
$$ 353249 355042 357233 360353 364672 369632 374381 378882 383994 390377 397757 405377 412793 420094 427635
57898D27635P907P700O405M486K977K079Q91j117l205m489n147n818o433o474
$$ 427635 435542 443242 449647 454133 457110 459189 460080 458963 455758 451269 446122 440304 433871 427397
57884D27397n912n175m484l866l486l382l207k708k065j391m02R44K110K861L828
$$ 427397 421485 416310 411826 407960 404474 401092 397885 395177 393112 391721 391319 392263 394373 397234 401062
57869D01062N452O936P190O224M884L605K396J591J570J902J723Q21m07j826l471
$$ 401062 406514 413450 420640 426864 431748 435353 437749 439340 440910 442812 444535 445356 444949 443123 439652
57854D39652m784m979m202l436l121k737j906j072q05j025j230j048l37P46J645
$$ 439652 434868 429889 425687 422251 419130 416393 414487 413415 412610 411585 410355 409307 408970 409716 411361
57839D11361J752J057J37m55n68l15o9n24k208m777p091q123p737o715o281p198
$$ 411361 413113 414170 414307 413852 413284 412969 412900 412376 410168 405391 398300 390177 382440 375725 369444 362246
57823C62246r027j0426j0574r954r419r010q316p496p006o585n512l822k375j598
$$ 362246 353219 342793 332219 322265 312846 303836 295520 288024 281018 274433 268921 265099 262724 261126
57809B61126j012j90O38J241J913K955M152N158N980O889Q134R775J1342J1709
$$ 261126 260114 259924 260562 261803 263716 266671 270823 275981 281961 288850 296984 306759 318101 329810
57795C29810J0060P064M438L136K647K274K227K859L664L780L064J940M72j527
$$ 329810 339870 346934 351372 354508 357155 359429 361656 364515 368179 371959 375023 376963 377435 375908
57781C75908l733n422o433p376q674r922j0422j0023r067p859o545n393m818m892
$$ 375908 372175 366753 360320 352944 344270 334348 323926 313903 304836 296977 290432 285039 280221 275329
57767B75329n108m808l860k677j622o76K31R22J259J489J918K413K681K936L729
$$ 275329 270221 265413 261553 258876 257254 256578 256809 257731 258990 260479 262397 264810 267491 270427 274156
57752B74156M953N639N118M019L565M101M794M801M231L755L720L907M011L943
$$ 274156 279109 284748 289866 293885 297450 301551 306345 311146 315377 319132 322852 326759 330770 334713
57738C34713L782L685L858M291M525M077L193K832L513M569N012M870N095O250
$$ 334713 338495 342180 346038 350329 354854 358931 362124 364956 368469 373038 378050 382920 388015 394265
57724C94265P929R493J0788J1881J2708J3309J3949J4666J5140J5284J5556J6297
$$ 394265 402194 411687 422475 434356 447064 460373 474322 488988 504128 519412 534968 551265
57712E51265J7250J8178J9482K1529K3847K5774K7670L0672L5205M0483M5611
$$ 551265 568515 586693 606175 627704 651551 677325 704995 735667 770872 811355 856966
57701H56966N0533N5669O1188O7010P3195Q0053Q8038R7576J08718J20905J33384
$$ 856966 907499 963168 1024356 1091366 1164561 1244614 1332652 1430228 1538946 1659851 1793235
57690A793235J45946J58818J71659J83085J91366J95222J93595J85086J68307
$$ 1793235 1939181 2097999 2269658 2452743 2644109 2839331 3032926 3218012 3386319
57681C386319J42953J10328P2777L2935o408m2185p1447r2227j03987j07100j02051
$$ 3386319 3529272 3639600 3712377 3745312 3738904 3696719 3625272 3533045 3429058 3321958 3219907
57670C219907q9384p0363m7637k5477r597o139j9160m7764q5432j22750j51545
$$ 3219907 3130523 3060160 3012523 2987046 2977449 2971310 2952150 2904386 2818954 2696204 2544659
57659B544659j67514j70411j62849j48683j31501j13753r6826q1440o7775n5554
$$ 2544659 2377145 2206734 2043885 1895202 1763701 1649948 1553122 1471682 1403907 1348353
57649A348353m4500l4640k5956j8062j0562l377L652J1084J9143K7037L3795L9775
$$ 1348353 1303853 1269213 1243257 1225195 1214633 1211256 1214908 1225992 1245135 1272172 1305967 1345742
57637A345742M6532N5063O4899P5088Q5343R5897J06848J18136J29746J41333
$$ 1345742 1392274 1447337 1512236 1587324 1672667 1768564 1875412 1993548 2123294 2264627
57627B264627J51804J59690J63803J63385J57717J45898J27009J00630O7422K9479
$$ 2264627 2416431 2576121 2739924 2903309 3061026 3206924 3333933 3434563 3501985 3531464
57617C531464j0125m8295q2573j11279j33594j49641j60093j65449j65972j62314
$$ 3531464 3521339 3473044 3390471 3279192 3145598 2995957 2835864 2670415 2504443 2342129
57607B342129j55747j47468j38045j27840j17599j08113r9423r0952q2449p4389
$$ 2342129 2186382 2038914 1900869 1773029 1655430 1547317 1447894 1356942 1274493 1200104
57597A200104o7291o1005n4980m9109m3926l9923l6864l4058l1101k8226k5831
$$ 1200104 1132813 1071808 1016828 967719 923793 883870 847006 812948 781847 753621 727790
57586G27790k3924k2127k0133j7929j5737j3826j2389j1454j0845j0253r371q009
$$ 727790 703866 681739 661606 643677 627940 614114 601725 590271 579426 569173 559802 551793
57574E51793o320m825m011l799l602k965j918o81O48K013L305M531N776O866P517
$$ 551793 545473 540648 536637 532838 529236 526271 524353 523672 524320 526333 529638 534169 539945 546811 554328
57559E54328P965Q937J0607J2155J2892J3340J4518J6517J8592K0508K2916K6344
$$ 554328 562293 571230 581837 593992 606884 620224 634742 651259 669851 690359 713275 739619
57547G39619L0482L4694L8721M2723M7038N2003N7732O4057P0951P8764Q7636
$$ 739619 770101 804795 843516 886239 933277 985280 1043012 1107069 1178020 1256784 1344420
57536A344420R6888J05638J13773J21620J28700J33717J35700J34297J28634J16999
$$ 1344420 1441308 1546946 1660719 1782339 1911039 2044756 2180456 2314753 2443387 2560386
57526B560386R8319P3496M4714J3982j7222m7309p4346r6538j12780j22989j28116
$$ 2560386 2658705 2732201 2776915 2790897 2773675 2726366 2652020 2555482 2442702 2319713 2191597
57515B191597j29506j27982j23735j17090j08911j00110r1186q2508p4450o7027
$$ 2191597 2062091 1934109 1810374 1693284 1584373 1484263 1393077 1310569 1236119 1169092
57505A169092n9828n2762m6377m1072l6391l1570k6458k1485j7078j3449j0643
$$ 1169092 1109264 1056502 1010125 969053 932662 901092 874634 853149 836071 822622 811979
57494H11979q251n450j820K098N566Q687J2155J6123K0096K3851K7879L2718L8294
$$ 811979 803728 798278 796458 798556 804122 812809 824964 841087 861183 885034 912913 945631 983925
57481I83925M4188N0266N6733O3793P1345P9116Q7010R5244J03942J12516J19687
$$ 983925 1028113 1078379 1135112 1198905 1270250 1349366 1436376 1531620 1635562 1748078 1867765
57470A867765J24239J25557J23191J16234J03520Q4485N9702L0696n60l2034o1780
$$ 1867765 1992004 2117561 2240752 2356986 2460506 2544991 2604693 2635389 2634829 2602795 2541015
57459B541015q7875j08556j22887j31399j35618j36667j34592j29225j21274j12138
$$ 2541015 2453140 2344584 2221697 2090298 1954680 1818013 1683421 1554196 1432922 1320784
57449A320784j02960r4248q6155p8615p1344o4210n7587n1979m7364m3256l9358
$$ 1320784 1217824 1123576 1037421 958806 887462 823252 765665 713686 666322 623066 583708
57438E83708l5729l2382k9150k6012k3198k0832j8741j6734j4870j3359j2372
$$ 583708 547979 515597 486447 460435 437237 416405 397664 380930 366060 352701 340329
57427C40329j1926j1823j1624j0990j0007r041q259p467o555n800n594n923o305
$$ 340329 328403 316580 304956 293966 283959 274918 266659 259192 252637 246837 241243 235320 229015
57414B29015o277n874n498n356n176m626l828l196k864k568k123j643j210p66
$$ 229015 222738 216864 211366 206010 200834 196208 192380 189184 186320 183752 181629 179986 178776 178010
57400A78010m37n50j045j307r81o19j006j968k425j639l6J285J599J035K30l60
$$ 178010 177573 177023 175978 174671 173690 173071 172065 170097 167672 166033 165997 167282 168881 169916 170146 169786
57384A69786p82j206j435j111m82m05j289k450k958k794k654k840l052l180l534
$$ 169786 169004 167798 166363 165252 164770 164365 163076 160626 157668 154874 152220 149380 146328 143148 139614
57369A39614m162m485m039l179k715l007l665l990l511k282q35K31P70J149J730
$$ 139614 135452 130967 126928 123749 121034 118027 114362 110372 106861 104579 103744 103975 104745 105894 107624
57354A07624K457L015L319L575L939M230M126L559K842K333K124K095K182K401
$$ 107624 110081 113096 116415 119990 123929 128159 132285 135844 138686 141019 143143 145238 147420 149821
57340A49821K629K621K331K056K151K667L325L716L546K861K063J499J080N32
$$ 149821 152450 155071 157402 159458 161609 164276 167601 171317 174863 177724 179787 181286 182366 182898
57326A82898M3K19J255K512L205L261L248L665M568N632O373O471O129N942O199
$$ 182898 182941 183160 184415 186927 190132 193393 196641 200306 204874 210506 216879 223350 229479 235421 241620
57311B41620O652P132Q014R628J1529J2863J3313J3311J3364J3723J4550J5920
$$ 241620 248272 255404 263418 273046 284575 297438 310751 324062 337426 351149 365699 381619
57299C81619J7488J8663J9237J9627K0334K1396K2447K3131K3283K2878K1845
$$ 381619 399107 417770 437007 456634 476968 498364 520811 543942 567225 590103 611948
57288F11948J9921J6806J2519P490K198l159q539j3797j8734k3201k6893k9373
$$ 611948 631869 648675 661194 668684 670882 667723 659184 645387 626653 603452 576559 547186
57276E47186l0512l0716l0436k9701k8423k6843k5218k3293k0633j7435j4528
$$ 547186 516674 485958 455522 425821 397398 370555 345337 322044 301411 283976 269448
57265B69448j2541j1410j0700j0025r144q047o951n974m895l533k235j615j789
$$ 269448 256907 245497 234797 224772 215628 207581 200630 194656 189761 186228 183993 182378 180589
57252A80589k267k513k318j810j419j700k660l424l136k054j174q10l31O81J742
$$ 180589 178322 175809 173491 171681 170262 168562 165902 162478 159342 157288 156114 155304 154973 155654 157396
57237A57396K248K218J897J237K60n39p25n62o55j092j383j108l73L63O29L12
$$ 157396 159644 161862 163759 164996 165256 164717 163992 163430 162775 161683 160300 159192 158819 159182 159811 160123
57221A60123j92k62L27J210J893K263K478K613K629K562K520K578K745K968L089
$$ 160123 159931 159669 159996 161206 163099 165362 167840 170453 173082 175644 178164 180742 183487 186455 189544
57206A89544K984K745K556K367K001J631J782K675L764M246L829K830J711Q25
$$ 189544 192528 195273 197829 200196 202197 203828 205610 208285 212049 216295 220124 222954 224665 225490
57192B25490M59P88J689K731L523M029M464M904N128M984M799N136O055O987P504
$$ 225490 225949 226737 228426 231157 234680 238709 243173 248077 253205 258189 262988 268124 274179 281166 288670
57177B88670P878Q583R577J0495J1325J2364J3662J5006J6305J7570J8600J9263
$$ 288670 296548 305131 314708 325203 336528 348892 362554 377560 393865 411435 430035 449298
57165D49298J9937K1066K2314K2824K2371K1632K1193K0933K0592K0213J9762
$$ 449298 469235 490301 512615 535439 557810 579442 600635 621568 642160 662373 682135
57154F82135J8951J7839J7039J6907J7007J6794J6333J5942J5594J5138J4696
$$ 682135 701086 718925 735964 752871 769878 786672 803005 818947 834541 849679 864375
57143H64375J4349J3803J2829J1670J0522R124P419O311O919R199J1944J4157
$$ 864375 878724 892527 905356 917026 927548 936672 944091 950402 957321 966520 978464 992621
57131I92621J5855J7467J9059K0331K1038K1244K1399K2230K4289K7463L1088
$$ 992621 1008476 1025943 1045002 1065333 1086371 1107615 1129014 1151244 1175533 1202996 1234084
57120A234084L4599L7948M1531M5873N1411N8333O6432P5018Q3088Q9807R5183
$$ 1234084 1268683 1306631 1348162 1394035 1445446 1503779 1570211 1645229 1728317 1818124 1913307
57109A913307J00202J06098J13476J22399J33154J46485J63098J83587K08951
$$ 1913307 2013509 2119607 2233083 2355482 2488636 2635121 2798219 2981806 3190757
57100C190757K40591K79781L28081L88758M67077N68287O95382Q48633J025944
$$ 3190757 3431348 3711129 4039210 4427968 4895045 5463332 6158714 7007347 8033291
57091H033291J222451J430364J640496J843916K031088K189116K300976K349126
$$ 8033291 9255742 10686106 12326602 14170518 16201606 18390722 20691698 23040824
57083B3040824K322672K224351K071502J886108J677333J430937J118518P22139
$$ 23040824 25363496 27587847 29659349 31545457 33222790 34653727 35772245 36494384
57075C6494384K53729k46627p29183j153024j493830j742823j903287j987071
$$ 36494384 36748113 36501486 35772303 34619279 33125449 31382626 29479339 27492268
57067B7492268k010641j990878j942132j875289j798018j715010j627645j534152
$$ 27492268 25481627 23490749 21548617 19673328 17875310 16160300 14532655 12998503
57059A2998503j431426j318163j196818j072773r51819q38395p35274o43618n62891
$$ 12998503 11567077 10248914 9052096 7979323 7027504 6189109 5453835 4810217 4247326
57050D247326m91322m27159l69607l18644k74237k35910k02857j74255j49605
$$ 4247326 3756004 3328845 2959238 2640594 2366357 2130447 1927590 1753335 1603730
57041A603730j28849j12057r8762q7762p7843o8679o0799n4661m9972m5924m1890
$$ 1603730 1474881 1362824 1264062 1176300 1098457 1029778 968979 914318 864346 818422 776532
57030G76532l7826l4182l1465k9669k7985k5387k1754j8162j5759j4513j3491
$$ 776532 738706 704524 673059 643390 615405 590018 568264 550102 534343 519830 506339
57019E06339j2175j0892r840q417n917k458J297N118R389J4496K0577K7968L7464
$$ 506339 494164 483272 473432 465015 459098 456640 457937 463055 472444 486940 507517 535485 572949
57006E72949M9954O6111Q6487J11055J37407J58645J63880J42955R3361K4010
$$ 572949 622903 689014 775501 886556 1023963 1182608 1346488 1489443 1582804 1606814
56996A606814m8011j05893j40548j52247j47074j32370j13980r5498p8588o3746
$$ 1606814 1558803 1452910 1312362 1160115 1013041 880671 766691 671193 592605 528859
56986E28859n0926l9672k9185j9017r873l358n93j241l887p118j0067j2259j3404
$$ 528859 477933 438261 409076 390059 380186 376828 376235 374994 371107 363989 353922 341663 328259
56973C28259j3411j2486j1022r421p882o375m744k981j276K17J651L435N879Q923
$$ 328259 314848 302362 291340 281919 274037 267662 262918 259937 258661 258878 260529 263964 269843 278766
56959B78766J2354J6080J9920K2945K3417J9888J2462K803o971j5161k0583k2690
$$ 278766 291120 307200 327120 350065 373482 393370 405832 408635 401664 386503 365920 343230
56947C43230k2029k0022j7771j5326j2352r119o305m097k044J94K583N209Q503
$$ 343230 321201 301179 283408 268082 255730 246611 240306 236209 234165 234359 236942 242151 250654
56934B50654J2771J7825K3167K8163L1836L2750K9552K1802J0408k556j4549k3482
$$ 250654 263425 281250 304417 332580 364416 397166 426718 448520 458928 456372 441823 418341
56922D18341k8456k9821k8704k6360k3702k1147j8781j6650j4783j3002j1109
$$ 418341 389885 360064 331360 305000 281298 260151 241370 224720 209937 196935 185826
56911A85826r314q155p675p103n720l855k438j785j329n21M75J198J504J612J769
$$ 185826 176512 168357 160682 153579 147859 144004 141566 139781 138452 137931 138406 139604 141108 142720 144489
56896A44489K075K562L292M385N852P395Q626R720J1447J4220J7276J9236J9287
$$ 144489 146564 149126 152418 156803 162655 170050 178676 188396 199843 214063 231339 250575 269862
56883B69862J7399J3685Q286J971l866q133j0637j1712j1672j0757r137o845l970
$$ 269862 287261 300946 309232 311203 307337 299204 288567 276855 265183 254426 245289 238444 234474
56870B34474j035J359L325N669Q877J2677J6717K1177K6365L2165L8058M3117
$$ 234474 233439 234798 238123 243792 252669 265346 282063 303240 329605 361770 399828 442945
56858D42945M5633M3373L5068K1625N634r990k2736l0770l3534l2182k8650k4203
$$ 442945 488578 531951 567019 588644 594278 584288 561552 530782 497248 465066 436416 412213
56846D12213j9187j3939r132n000q94L954R592J5666K2323L0257L9871N0610O1189
$$ 412213 393026 379087 369955 364955 364061 368015 377607 393273 415596 445853 485724 536334 597523
56833E97523P0017P4984P3152O1706M0267J2433j5532l8058n2641n9549o0277
$$ 597523 667540 742524 815676 877382 917649 930082 914550 876492 823851 764302 704025
56822G04025n6748n1110m5068l9023l2420k5066j7709j1131n149J120Q283J6280
$$ 704025 647277 596167 551099 512076 479656 454590 436881 425750 420601 421721 430004 446284
56810D46284K4775L3527M2283N0370N6272N7401N0798L5145J2692j1144l0854
$$ 446284 471059 504586 546869 597239 653511 710912 761710 796855 809547 798403 767549
56799G67549m3872n0692n2738n0931m6212m0171l4301k8953k3702j8494j3774
$$ 767549 723677 672985 620247 569316 523104 482933 448632 419679 395977 377483 363709
56788C63709r620n512j040L645Q272J2892J7626K2228K5923K7403K5083J8018
$$ 363709 354089 348577 347537 351182 359454 372346 389972 412200 438123 465526 490609 508627
56776E08627O962n712j7336k6129l1356l3079l2119k9749k6959k3994k0737j7280
$$ 508627 515589 509877 492541 466412 435056 401977 369858 340109 313150 289156 268419 251139
56764B51139j3975j1231r384q484q010p189n792m359l421k871k321j748j438j553
$$ 251139 237164 225933 216549 208065 200055 192866 187074 182715 179294 176423 174102 172354 170916 169363
56750A69363j999k510k656k141j314r86j441k025k074j736j444j071l82J31k59
$$ 169363 167364 164854 162198 160057 158743 157757 156316 154291 152217 150481 149037 147966 147584 147715 147456
56735A47456j281j850j554j183j434j903j774j038m24m11p75j015q97n54k78j70
$$ 147456 146175 144325 142771 141588 140154 138251 136477 135439 135015 134604 133829 132814 131917 131363 131085 130915
56719A30915K4N59J157J090P8j202j773j478j030j013j180j003n31l78r00j748
$$ 130915 130939 131498 132655 133745 133823 132621 130848 129370 128340 127327 126147 125144 124613 124235 123335 121587
56703A21587k314k341j917j191l68J39K8m43o48k92L65R97J568K055K199J879
$$ 121587 119273 116932 115015 113824 113456 113595 113623 113180 112532 112240 112605 113602 115170 117225 119424 121303
56687A21303J406J130R65O67M32P23J483J967J548M63m36n75j05M68Q51J027Q98
$$ 121303 122709 123839 124804 125471 125903 126626 128109 130076 131624 132087 131651 131076 130971 131439 132290 133317 134215
56670A34215K50p68j435j134j68N30M74M4l05o94j367j974j889j080k91k19p69
$$ 134215 134465 133697 132262 131128 130960 131490 131964 132008 131703 131009 129642 127668 125779 124699 124408 124189 123420
56653A23420j206r62k80nn90j408j364k73Q22Q96P6p41j049r92q05n39k83j84
$$ 123420 122214 121252 120972 120967 120377 118969 117605 117332 118154 119050 119126 118385 117336 116344 115539 115000 114717 114533
56635A14533j83n3J86K49k0l98n12j84M32R34J009P73O34P39P93O01M38N95Q20
$$ 114533 114350 114297 114483 114732 114712 114314 113802 113618 114050 114984 115993 116766 117400 118139 118932 119533 119971 120566 121386
56616A21386O87L33L30P96J154Q99K58j08J19N80O42R2n55n76J27R21J264J282
$$ 121386 122073 122406 122736 123532 124686 125585 125843 125735 125854 126434 127076 127168 126613 126037 126164 127085 128349 129631
56598A29631J297J205P50J22k80n39j073j775j893r81M69J608K139K391K578K410
$$ 129631 130928 132133 132883 133005 132725 132186 131113 129338 127445 126464 126933 128541 130680 133071 135649 138059
56582A38059J533K60m12K13J654K673K657K132J855J907K028K278K827L430L716
$$ 138059 139592 139852 139440 139653 141307 143980 146637 148769 150624 152531 154559 156837 159664 163094 166810
56567A66810L822M181M884N655O335O800O707N958N262N496O525P257O983O061
$$ 166810 170632 174813 179697 185352 191687 198487 205194 211152 216414 221910 228435 235692 242675 248736
56553B48736N248M903M906M853M223K894J441N07q6j005k286l259l613l758m031
$$ 248736 253984 258887 263793 268646 272869 275763 277204 277711 277625 276620 274334 271075 267462 263704 259673
56538B59673m294m525n008n658n908n614n378n549n659n333n003n093n067m125
$$ 259673 255379 250854 245846 240188 234280 228666 223288 217739 212080 206747 201744 196651 191584 187459
56524A87459k507j362j487k563l597l735k916j973j816k336k555k014j378j266
$$ 187459 184952 183590 182103 179540 175943 172208 169292 167319 165503 163167 160612 158598 157220 155954
56510A55954j291q92m57p21j527k011j838j347p43ON91N55R7n7L24P83J051J289
$$ 155954 154663 153771 153314 152593 151066 149055 147217 145870 145127 145133 145724 146279 146376 146319 146643 147426 148477 149766
56492A49766J383Q59k06q75m25P45J685J933J646J213J092J642K626L178K806
$$ 149766 151149 152008 151802 150927 150502 151247 152932 154865 156511 157724 158816 160458 163084 166262 169068
56477A69068K087J915K300K506K271K206K805L657L987L646L185L095L376L794
$$ 169068 171155 173070 175370 177876 180147 182353 185158 188815 192802 196448 199633 202728 206104 209898
56463B09898M157M272L869K867J555L74n11j235j910k419k551k194j450o14q1
$$ 209898 214055 218327 222196 225063 226618 226992 226481 225246 223336 220917 218366 216172 214722 214108 214027
56448B14027n2l25m91l62r2J31L59P19J185J533J511R73pj093j932k446k804l031
$$ 214027 213975 213650 213159 212797 212705 212836 213195 213914 215099 216632 218143 219116 219109 218016 216084 213638 210834 207803
56430B07803k859k120j144n59o39r87r66m12J80K43k00o92j056j590k355k758
$$ 207803 204944 202824 201680 201121 200482 199495 198529 198117 198297 198540 198340 197648 196592 195002 192647 189889
56414A89889k279j312o86n11j97M14O25j8q79r89l04K99J99k85l76J79Q56R70
$$ 189889 187610 186298 185612 185101 184904 185318 185943 185925 185046 184057 183753 184052 184251 183966 183590 183769 184625 185595
56396A85595N11J19K52O40Q60J095J763K561K651J811P43N1l10l94J58J309K082
$$ 185595 186106 186225 186477 187117 187977 189072 190835 193396 196047 197858 198601 198652 198342 197948 198106 199415 201497
56379B01497J600K81o11l76O74J842K491K136Q75l90o80J7Q68J262J293J280J352
$$ 201497 203097 203378 202767 202391 203065 204907 207398 209534 210409 210019 209339 209356 210224 211486 212779 214059 215411
56362B15411J554J834J897J476Q54O58J093J702J969J849J619J526J642J773J499
$$ 215411 216965 218799 220696 222172 223026 223684 224777 226479 228448 230297 231916 233442 235084 236857 238356
56347B38356O43k76m89R8P78J049J234J853K717L082K655K033K021K760L662M169
$$ 238356 238999 238723 238234 238332 239110 240159 241393 243246 245963 249045 251700 253733 255754 258514 262176 266345
56331B66345M380M824N691O473O520N808M965M576M576M380L603K535J916K082
$$ 266345 270725 275549 281240 287713 294233 300041 305006 309582 314158 318538 322141 324676 326592 328674
56317C28674K541K444J540L28o25j278j822k151j877q90L21R82O62l32j247j573
$$ 328674 331215 333659 335199 335527 334902 333624 331802 329651 327774 326884 327205 328187 328849 328517 327270 325697
56301C25697j405j040n36J18P12J147J772K817L709L676L023K936L858M911N277
$$ 325697 324292 323252 322716 322834 323546 324693 326465 329282 332991 336667 339690 342626 346484 351395 356672
56286C56672N308N718O423O961P436Q331R603J0739J1543J2310J3323J4627J6200
$$ 356672 361980 367698 374121 381082 388518 396849 406452 417191 428734 441044 454367 468994 485194
56273D85194J7993J9882K1838K3937K6179K8567L1556L5693M0596M5046M8585
$$ 485194 503187 523069 544907 568844 595023 623590 655146 690839 731435 776481 825066
56262H25066N2302N7318O3143O8437P2840P7061Q1453Q5446Q8294Q9575Q9010
$$ 825066 877368 934686 997829 1066266 1139106 1216167 1297620 1383066 1471360 1560935 1649945
56251A649945Q6466Q2177P6418O9095O0243N0604M1109L1967K2841J3705M934
$$ 1649945 1736411 1818588 1895006 1964101 2024344 2074948 2116057 2148024 2170865 2184570 2189504
56240B189504l112j0000j5156j8632k1592k5141k8987l2155l4714l7744m1824
$$ 2189504 2186392 2176392 2161236 2142604 2121012 2095871 2066884 2034729 2000015 1962271 1920447
56229A920447m6551n1458n6328o0571o3428o5001o6185o7428o8289o8276o7308
$$ 1920447 1873896 1822438 1766110 1705539 1642111 1577110 1510925 1443497 1375208 1306932 1239624
56218A239624o5341o2370n8899n5574n2335m8734m4916m1388l7976l4101l0027
$$ 1239624 1174283 1111913 1053014 997440 945105 896371 851455 810067 772091 737990 707963
56207G07963k6591k3745k0631j7274j4819j3718j2981j1748j0322r126p826o221
$$ 707963 681372 657627 636996 619722 604903 591185 578204 566456 556134 547008 539182 532961
56195E32961m943m462m273l678k664j421J14J684K614K871L365M576N810O394
$$ 532961 528018 523556 519283 515605 512941 511520 511634 513318 515932 518803 522168 526744 532554 538948
56181E38948O641O971P046O669O562P278Q150Q259P776P385P040O296N318M629
$$ 538948 545589 552560 559606 566275 572837 580115 588265 596524 604300 611685 618725 625021 630339 634968
56167F34968M234L871L714M043M605N045N575O520P639Q550R392J0397J1317J1945
$$ 634968 639202 643073 646787 650830 655435 660480 666055 672575 680214 688764 698156 708553 719870 731815
56153G31815J2757J4302J6451J8874K1776K5472K9708L4225L9455M5997N3864
$$ 731815 744572 758874 775325 794199 815975 841447 871155 905380 944835 990832 1044696
56142A044696O2985P3921Q7316J03045J20523J39022J56726J70005J74985J70051
$$ 1044696 1107681 1181602 1268918 1371963 1492486 1631508 1788234 1958239 2133224 2303275
56132B303275J56551J37648J17224R9094Q5830P7810P3488P0045O3823N1670L3308
$$ 2303275 2459826 2597474 2714698 2813792 2899622 2977432 3050920 3120965 3184788 3236458 3269766
56121C269766J2079p606k3280l4561m1957m7137n3615o5005q2126j02669j23373
$$ 3269766 3281845 3274239 3250959 3216398 3174441 3127304 3073689 3008684 2926558 2823889 2700516
56110B700516j41446j54382j60235j58697j51064j39039j24271j08730r4296q1717
$$ 2700516 2559070 2404688 2244453 2085756 1934692 1795653 1671382 1562652 1468356 1386639
56100A386639p0757o1294n3472m6994m1245l6092l1718k7817k3902k0231j7428
$$ 1386639 1315882 1254588 1201116 1154122 1112877 1076785 1045067 1017250 993348 973117 955689
56089I55689j5348j3251j0997r059p434n636l681k074p95O50K156L048L244L403
$$ 955689 940341 927090 916093 907034 899600 893964 890283 888209 887414 888064 890220 893268 896512 899915
56075H99915L900M521N196O092O960P369P579Q245R282J0041J0489J1176J1982
$$ 899915 903815 908336 913532 919624 926584 933953 941532 949777 959059 969100 979589 990765 1002747
56062A002747J2142J1638J1437J2043J2824J3102J3043J3164J3730J4867J6493
$$ 1002747 1014889 1026527 1037964 1050007 1062831 1075933 1088976 1102140 1115870 1130737 1147230
56051A147230J8024J8851J9195J9764K0702K1596K2383K3352K4410K5331K6493
$$ 1147230 1165254 1184105 1203300 1223064 1243766 1265362 1287745 1311097 1335507 1360838 1387331
56040A387331K8353L0327L1407L1707L2268L3351L4130L4051L3276L1780K9376
$$ 1387331 1415684 1446011 1477418 1509125 1541393 1574744 1608874 1642925 1676201 1707981 1737357
56029A737357K6776K5334K5457K6324K7328K8708L0662L2934L5409L8044M0319
$$ 1737357 1764133 1789467 1814924 1841248 1868576 1897284 1927946 1960880 1996289 2034333 2074652
56018B074652M1801M3174M5461M8455N1197N3736N6932O0721O4182O7211P0488
$$ 2074652 2116453 2159627 2205088 2253543 2304740 2358476 2415408 2476129 2540311 2607522 2678010
56007B678010P3887P6727P9504Q3529Q8746R3826R8430J03506J09287J15077J21177
$$ 2678010 2751897 2828624 2908128 2991657 3080403 3174229 3272659 3376165 3485452 3600529 3721706
55996C721706J28762J37599J45975J53315J60728J68792J77115J86248J97484
$$ 3721706 3850468 3988067 4134042 4287357 4448085 4616877 4793992 4980240 5177724
55987E177724K10391K23249K36399K52215K71258K91537L12457L36179L63948
$$ 5177724 5388115 5611364 5847763 6099978 6371236 6662773 6975230 7311409 7675357
55978G675357L94466M27346M64900N08834N58493O14104O78453P53556Q39339
$$ 7675357 8069823 8497169 8962069 9470903 10029396 10643500 11321953 12075509 12914848
55969A2914848R37743J054485J194604J360911J560453J808425K120759K504518
$$ 12914848 13852591 14907076 16101680 17462591 19023044 20831469 22952228 25456746
55961B5456746K957705L475268M054086M700158N438510O313025P372612Q665552
$$ 25456746 28414451 31889719 35943805 40643963 46082473 52395498 59768110 68433662
55953F8433662J0256761J2243401J4740049J7852349K1669112K6221797L1299442
$$ 68433662 78690423 90933824 105673873 123526222 145195334 171417131 202716573
55946B02716573L6129148L9188837L8518037L2601170K1372384O615410q642898
$$ 202716573 238845721 278034558 316552595 349153765 370526149 377141559 368498661
55939C68498661k1420837k9929569l3932889l4317540l2370840k9244501k5744321
$$ 368498661 347077824 317148255 283215366 248897826 216526986 187282485 161538164
55932A61538164k2334030j9222007j6466560j4062758j1985827j0201347q671880
$$ 161538164 139204134 119982127 103515567 89452809 77466982 67265635 58593755
55925E8593755p366946o263011n334639m553044l893930l340260k876658k486881
$$ 58593755 51226809 44963798 39629159 35076115 31182185 27841925 24965267 22478386
55917B2478386k157777j880540j646677j446895j274782j127442j001395q91414
$$ 22478386 20320609 18440069 16793392 15346497 14071715 12944273 11942878 11051464
55909A1051464p94230p09765o37502n74646n18883m70113m28221l91648l59054
$$ 11051464 10257234 9547469 8909967 8335321 7816438 7346325 6918104 6526456 6167402
55900F167402l30239l04629k80965k59158k40295k24238k09202j94337j80721
$$ 6167402 5837163 5532534 5251569 4992411 4752116 4527878 4318676 4124339 3943618
55891C943618j69135j58785j48837j39514j31070j23267j16284j10506j05191
$$ 3943618 3774483 3615698 3466861 3327347 3196277 3073010 2956726 2846220 2741029
55882B741029r9001r2136q6213q1654p7109p1809o6660o2439n8793n5641n3775
$$ 2741029 2642028 2549892 2463679 2382025 2304916 2233107 2166447 2104008 2045215 1989574 1935799
55871A935799n3261n2820n1671n0418m9400m7607m4205l9883l5813l2314k9240
$$ 1935799 1882538 1829718 1778047 1727629 1678229 1630622 1586417 1546534 1510721 1478407 1449167
55860A449167k6577k4104k1556j9730k0204k3305k7343l0360l1601l0950k8371
$$ 1449167 1422590 1398486 1376930 1357200 1336996 1313691 1286348 1255988 1224387 1193437 1165066
55849A165066k4626k1248j8956j7151j5550j5033j6056j7497j8160j8334j8875
$$ 1165066 1140440 1119192 1100236 1083085 1067535 1052502 1036446 1018949 1000789 982455 963580
55838I63580j9646k0040k0196k0617k1073k0954k0341j9841j9645j9408j8754
$$ 963580 943934 923894 903698 883081 862008 841054 820713 800872 781227 761819 743065
55827G43065j7424j5328j2906j1028j0110r808r820j0247j0875j0910r997q725
$$ 743065 725641 710313 697407 686379 676269 666461 656641 646394 635519 624609 614612 605887
55815F05887p629o446m963l787l428l339k682j615r93j193j895k711l421l872
$$ 605887 598258 591812 586849 583062 579634 576295 573613 571998 571005 569812 567917 565206 561785 557913
55801E57913m146m542n011n058m579m249m663n592o566p575q661r406r424q918
$$ 557913 553767 549225 544214 539156 534577 530328 525665 520073 513507 505932 497271 487865 478441 469523
55787D69523q171o960n091l060j575q46r28k241m976q367j1218j2998j3848j3889
$$ 469523 461352 454392 449301 446241 444666 443820 442892 440651 435675 427308 416090 403092 389244 375355
55773C75355j3146j1966j0835r875q962q121p425o726n957n412n351n591n856
$$ 375355 362209 350243 339408 329533 320571 312450 305025 298299 292342 286930 281579 275988 270132
55760B70132o099o127n403l794k123j331j364j471j329j355k067l549n347o600
$$ 270132 264033 257906 252503 248709 246586 245255 243891 242420 241091 239736 237669 234120 228773 222173
55746B22173o700o115n957o351o045m322k370j705j978j695o67j72p39j335j083
$$ 222173 215473 209358 203401 197050 191005 186683 184313 182608 180630 178935 178268 178096 177357 176022 174939
55731A74939m80l06m33l98l93q00j371j555j369j272j425j577j569j515j485j357
$$ 174939 174459 174153 173720 173322 172929 172129 170758 169203 167834 166562 165137 163560 161991 160476 158991 157634
55715A57634r82m44n9o2j84K32J372K479K737K534L033M440N554N484M967N241
$$ 157634 156652 156208 156149 156087 155903 156135 157507 159986 162723 165257 168290 172730 178284 183768 188735 193976
55699A93976O178O474N494L927K547J246l15j898l102m080n146n944n755m556
$$ 193976 200154 206628 212122 216049 218596 219842 219527 217629 214527 210447 205301 199357 193602 189046
55685A89046l112j921p52N86J644J997K003K307K871L111K797K279J849J426Q90
$$ 189046 185934 184013 183261 183847 185491 187488 189491 191798 194669 197780 200577 202856 204705 206131 207021
55670B07021K62m61j213j606j267n34k20o14j132j168p21NJ078K478L650L857
$$ 207021 207283 206822 205609 204003 202736 202202 201982 201368 200236 199068 198347 198352 199430 201908 205558 209415
55654B09415K870J119o23j700k078k468l566n132o246o516o401o293o059n777
$$ 209415 212285 213404 212781 211081 209003 206535 202969 197837 191591 185075 178674 172381 166322 160545
55640A60545o046o974p600p068n857n041m801m437l595k716k277k321k644k937
$$ 160545 154499 147525 139925 132857 127000 121959 117158 112721 109126 106410 104133 101812 99168 96231
55626I6231k850k356j891j750j601j055l62l5o0j08k20n56q04n65j77l32j000
$$ 96231 93381 91025 89134 87384 85783 84728 84366 84331 84271 84163 83943 83387 82583 82018 81841 81509 80509
55609H0509j503j585j542j435j027n73p14j362j659j246p81p38o34O1R32J250
$$ 80509 79006 77421 75879 74444 73417 72844 72130 70768 69109 67863 67082 66344 65710 65771 66703 67953
55593F7953J020P91P65P29N62K28m34j400k064j691l42J048J552R97o6q86r68
$$ 67953 68973 69764 70529 71258 71820 72048 71614 70214 68150 66459 66117 67165 68717 69714 69648 68762 67794
55576F7794l01P26J663K315K765L200L681M061M183M178M332M559M330L375K173
$$ 67794 67493 68219 69882 72197 74962 78162 81843 85904 90087 94265 98597 103156 107486 110861 113034
55561A13034J312O41l58j599k459k812l192l864m356m262l852l570l444l319l240
$$ 113034 114346 114987 114629 113030 110571 107759 104567 100703 96347 92085 88233 84663 81219 77900 74660
55546G4660l194k886k092r64J81J101J512J261P96R14J670K159J827J359J625
$$ 74660 71466 68580 66488 65524 65705 66806 68318 69579 70375 71289 72959 75118 76945 78304 79929
55531G9929K343K541K044J556J400J083K33p15j122r50o45n88q59j330j827k235
$$ 79929 82272 84813 86857 88413 89813 90896 91129 90414 89292 88342 87697 87109 86250 84920 83093 80858
55515H0858k547k782k890k880k867k852k629k164j862k154k884l453l498l117
$$ 80858 78311 75529 72639 69759 66892 64040 61411 59247 57385 55231 52347 48894 45396 42279
55501D2279k519j781j054n88m73n53p03r19j102r69m02K66N12J10o19j043p24
$$ 42279 39760 37979 36925 36337 35864 35311 34608 33689 32587 31618 31216 31482 31994 32104 31485 30442 29718
55484B9718J67R63J100O07l3m35n78o38p25q18q68q61q37p72n39q0L97O40O93
$$ 29718 29885 30848 31948 32555 32522 32087 31509 30871 30146 29328 28460 27599 26762 25990 25451 25371 25768 26408 27101
55465B7101P58O69K8j039j677j371o51k90j79K84R66J037L03m05m15r0j28n27
$$ 27101 27859 28528 28556 27517 25840 24469 23818 23528 23349 23633 24599 25636 25939 25534 25119 25029 24901 24374
55447B4374p46m58K90J318K241K440J667N34j07j56j48l40m31k71k54o93j252
$$ 24374 23628 23170 23460 24778 27019 29459 31126 31660 31553 31397 31249 30909 30478 30207 29953 29260 28008
55430B8008j297n71O85K016K849K611J222m77j332j015l42k08n66o84k45K56K54
$$ 28008 26711 26140 26825 28841 31690 34301 35523 35046 33714 32699 32357 32149 31583 30899 30654 30910 31164
55413C1164j52m03j38N74J476K254K516K019J057L15J27Q4l96j211j643j329p59
$$ 31164 31012 30609 30471 31045 32521 34775 37291 39310 40367 40682 40809 40893 40497 39286 37643 36314 35555
55396C5555o36r13q99k91L37K58m04q53o63k65k63o52r65r45o91l29J16M91N06
$$ 35555 34919 34006 33107 32816 33153 33411 33007 32154 31491 31226 30963 30311 29346 28401 27710 27381 27497 27988 28494
55377B8494Q9m75p83o10L5Q32J189P05l02r91r65o72o78r05r65q40p46n24J43
$$ 28494 28583 28108 27325 26715 26750 27582 28771 29476 29174 28183 27218 26546 25868 24963 23998 23158 22412 21888 22031
55358B2031R87J210N80j95l96j98k13n16o28k95K28N95P10O25L67K7k15j90J44
$$ 22031 23018 24228 24808 24613 24217 24019 23806 23290 22662 22367 22595 23190 23900 24525 24892 24919 24704 24514 24658
55339B4658N66N87j04j047j223k32J035J367O90l2j32J52L57L90K69n4l54k02
$$ 24658 25224 25811 25707 24660 23437 23205 24240 25607 26297 26265 26133 26285 26642 27032 27301 27247 26893 26691
55321B6691K64K56n66j456j531r50n03m03k20K37O56Q69J052J197R99L98j83l59
$$ 26691 26955 27211 26645 25189 23658 22708 22205 21802 21582 21819 22475 23344 24396 25593 26592 26990 26807 26448
55303B6448j73J38L64K27n01j507k022j640p62rM86Q84J076P71J08l10o4O03J069
$$ 26448 26275 26413 26777 27004 26503 24996 22974 21334 20572 20563 21049 21933 23009 23780 23888 23578 23514 24117 25186
55284B5186R27K94l90p14n47r3K56J99j73l59O7Q66J245P30k04o71m26q4k18o22
$$ 25186 26113 26407 26017 25303 24756 24663 24919 25118 24945 24586 24653 25519 26764 27494 27290 26619 26193 26109 25891 25269
55264B5269o45o3O34Q27M47Nj7L32O28O46N15L93K66J90L22N57M60r8n79m45O0
$$ 25269 24624 24561 25195 26022 26469 26474 26457 26789 27417 28063 28578 28971 29237 29427 29749 30306 30766 30668 30089 29644 29704
55243B9704K75K8k78l76l44k29K0K61K68J79L09N84O42M43K06j86j010j849j795
$$ 29704 29979 30007 29729 29353 29009 28780 28800 29061 29329 29508 29817 30401 31043 31486 31692 31506 30496 28647 26852
55224B6852o76O14J263J325J073M41m04p73l74N8k26r10j168p89p1Q45J712J766
$$ 26852 26176 26790 28053 29378 30451 30892 30488 29715 29341 29399 29173 28263 27095 26306 26235 27080 28792 30558
55206C0558N55j040j590q45J54N90O08N81N12M38N45P22N55Nm92p58j026j218
$$ 30558 31113 30073 28483 27638 27792 28382 28990 29571 30083 30521 31066 31788 32343 32348 31856 31098 30072 28854
55188B8854q14K57J167J134L29m91q66q09m97j57k0q3j07l3q5l40n52o10o94p89
$$ 28854 28040 28297 29464 30598 30927 30436 29570 28761 28264 28107 28087 28004 27897 27864 27779 27439 26887 26277 25583 24794
55168B4794n50P1N21L57j06l14k35j65j27JL6k30n23l91M0K12m5l69n01n05l13
$$ 24794 24244 24315 24836 25193 25087 24773 24538 24373 24246 24247 24283 24053 23530 23139 23179 23391 23346 22977 22476 21971 21658
55147B1658K99J114J411Q79J07j23K56Q07J309J787K054J827J262R53J216J771
$$ 21658 21957 23071 24482 25361 25468 25345 25601 26408 27717 29504 31558 33385 34647 35600 36816 38587
55131C8587K208K492K733K844K665K323K110K060J849J175N2j222k234k634k340
$$ 38587 40795 43287 46020 48864 51529 53852 55962 58022 59871 61046 61098 59876 57642 55008 52668
55116E2668j635r51n60n33q58j368j685j487r07l76j20m9j24l99o95o11r4M13
$$ 52668 51033 50082 49522 48989 48131 46763 45078 43591 42684 42308 42188 42139 42015 41616 40921 40310 40216 40629
55098D0629N81N55N44M51K64L00O59P99K91m32n99j87K14L80O17R64J031P32M74
$$ 40629 41210 41765 42309 42760 43024 43324 43983 44782 45073 44641 44042 43855 44069 44449 45066 46030 47061 47793 48267
55079D8267M57L80J03n0Q6J47j53m49k26M54J029J069O03M7k9O29J563K058J996
$$ 48267 48724 49104 49207 49157 49243 49390 49237 48788 48562 49016 50045 51114 51717 51764 51735 52364 53927 55985 57981
55060E7981J863J812J351K54q80j451j664j969k211j937j219n08Q3O86J101R75
$$ 57981 59844 61656 63007 63261 62381 60930 59266 57297 55086 53149 51930 51422 51505 52191 53292 54267
55044E4267N18M29J051K037K806K920K188Q96j70m98m85p93j274j243o90l24k82
$$ 54267 54785 55214 56265 58302 61108 64028 66216 67112 66942 66444 65959 65166 63892 62649 61959 61635 61353
55027F1353J75J284K033J453j1j102j311j072p17j34N71Q03K25p35j360j444j330
$$ 61353 61528 62812 64845 66298 66287 65185 63874 62802 62085 61951 62522 63325 63550 62815 61455 60011 58681
55010E8681j328j342j100o03j57K7R3K60M92O39P63R23P45j66j351j695q40K12
$$ 58681 57353 56011 54911 54308 54151 54178 54271 54531 55023 55662 56425 57348 58093 57927 56576 54881 54041 54253
54992E4253L96p5l05j91l43p54n46O66K044K569K193J510Q71L25N7K01M86O36
$$ 54253 54649 54574 54269 54078 53735 52981 52435 53101 55145 57714 59907 61417 62288 62613 62670 62871 63357 63993
54974F3993Q74J512K141K010J234Q76J579K695L239L187L381M339N774P167Q313
$$ 63993 64867 66379 68520 70530 71764 72640 74219 76914 80153 83340 86721 91060 96834 104001 112314
54959A12314R259J0079J0896J1759J2363J2141J0769Q444N564K402p95l652n935
$$ 112314 121573 131652 142548 154307 166670 178811 189580 198024 203588 205990 205195 201543 195608
54946A95608p856r742j1483j2496j2369j1306r931q758p947p341o678n802m756
$$ 195608 187752 178010 166527 154031 141662 130356 120425 111667 103720 96379 89701 83899 79143
54933G9143l663k545j360k31N25O70L13j76m12j87M44J209J844K366L037M034
$$ 79143 75480 72935 71575 71344 71869 72539 72852 72676 72264 72077 72521 73730 75574 77940 80977 85011
54917H5011N224O353P267P885Q198Q382Q786R454R878R413P798N103J410k945
$$ 85011 90235 96588 103855 111740 119938 128320 137106 146560 156438 165851 173649 178752 180162 177217
54903A77217o996r583j0407j0223r873r583r228q779q145p122n778m579l711k807
$$ 177217 170221 160638 150231 140008 130135 120552 111324 102545 94400 87278 81500 76921 73210 70403
54889G0403j699r72j099j549j555j334j583j981j433P1J090P26j25j85L81N11
$$ 70403 68704 67732 66633 65084 63529 62195 60612 58631 57198 57269 58359 59085 58960 58775 59156 59667
54873E9667m7n88p22p57r36j062j049j094j213j084n66M2L80L65J89J69M83P78
$$ 59667 59620 59032 58310 57553 56617 55555 54506 53412 52199 51115 50549 50591 50971 51336 51525 51694 52177 52955
54855E2955L30r75k066j834o09J96n7o09o59m30m54n80l96q7j45m22l23J60K96
$$ 52955 53285 52310 50244 48410 47801 47997 47940 47331 46672 46242 45788 45208 44812 44725 44580 44158 43835 43995 44291
54836D4291l02r43o43O89K139K767K438J620P88K18J04M15P35O67M43O34J161
$$ 44291 43989 43046 42403 43092 45231 47998 50436 52056 52844 53062 53166 53581 54316 54983 55426 56060 57221
54819E7221J245O46K78Q94J809J810R59M88J039K110L196M450N841O752O918O990
$$ 57221 58466 59112 59390 60284 62093 63903 64862 65350 66389 68499 71695 76145 81986 88738 95656 102646
54803A02646P608Q616R586J0462J1094J0904R583P589N325K510r14l925n455n847
$$ 102646 110254 118870 128456 138918 150012 160916 170499 178088 183413 185923 185009 181084 175629 169782
54789A69782o342p303q001p930p418o831o085n123m197l460k787k211j916j763
$$ 169782 163440 156137 148136 140206 132788 125957 119872 114749 110552 107092 104305 102094 100178 98415
54775I8415j333n92j1J37J50M21R61J533J989K376L022M391O506Q613R914J0513
$$ 98415 97082 96490 96479 96616 96766 97187 98148 99681 101670 104046 107068 111459 117965 126578 136492 147005
54759A47005J1121J1908J2414J2501J2560J2504J1433Q817N361K072r99m413q105
$$ 147005 158126 170034 182448 194949 207509 220013 231446 240263 245624 247696 246697 242284 234179
54746B34179j1206j3106j3966j4173j3735j2549j0952r575q645p750o528n405
$$ 234179 222973 209867 195901 181728 167993 155444 144492 134917 126272 118522 111994 106589
54734A06589n154n653n658m261k128o69l10l49l62o85j343j529p48K16J83r02
$$ 106589 101435 95782 90124 85863 83735 83066 82756 82407 82045 81360 80017 78488 77740 77956 78139 77237
54718G7237k022k335j833r56p7N92R83J158J149Q97M17j59p83j404j620r33L79
$$ 77237 75215 72880 71047 70091 70014 70606 71589 72747 73896 74793 75210 75051 74268 72864 71244 70311 70690
54701G0690J149O72k52l05N57J052L51q27j233o28J26K77j3q1L75J015J406J554
$$ 70690 71839 72511 72259 71954 72511 73563 73914 73087 71854 71226 71352 71629 71616 71535 71910 72925 74331 75885
54683G5885J728J955J953J592J127Q47P76Q41J099J597K165K548K585K179J348
$$ 75885 77613 79568 81521 83113 84240 85087 85863 86704 87803 89400 91565 94113 96698 98877 100225
54668A00225M92K66Q70J729K152K124K024J871J363O14L23R82K254L299L629L477
$$ 100225 100717 100983 101853 103582 105734 107858 109882 111753 113116 113730 114053 115035 117289 120588 124217 127694
54652A27694L487M065N021N846O364O909P771Q668R066Q865Q472Q148P593O207
$$ 127694 131181 135246 140267 146113 152477 159386 167157 175825 184891 193756 202228 210376 217969 224176
54638B24176L704M41k823n522p687r601j1088j1530j0739r437q507q070p679p140
$$ 224176 227880 228321 225498 219976 212289 202688 191600 180070 169331 159894 151387 143317 135638 128498
54624A28498o545n732m318k405o75L32O61N71J75l80p75q10n81k15K41N59K98
$$ 128498 121953 116221 111903 109498 108823 109155 109816 110387 110562 110182 109407 108597 108016 107801 108042 108601 108899
54607A08899o19j580j857j400q19o80j066j705k315k759l056l217l126k652j922
$$ 108899 108280 106700 104843 103443 102624 101944 100878 99173 96858 94099 91043 87826 84700 82048 80126
54592H0126j323j066r98r01q60j064j389j449j108o57m27l80k55j1J10k1j71l9
$$ 80126 78803 77737 76739 75838 74978 73914 72525 71076 69968 69311 68884 68504 68249 68238 68348 68327 68156 68117
54574F8117K84M18K59J39K95M50K09l27o63n83l33j41O9L54N01L49J55K98P07
$$ 68117 68401 68819 69078 69217 69512 69962 70171 69844 69181 68598 68265 68124 68193 68547 69048 69397 69552 69850 70557
54555G0557Q72M60k64p21o03k8O82J284J609J555J185Q36R05J474K261K976L564
$$ 70557 71429 71889 71625 70904 70301 70273 70955 72239 73848 75403 76588 77424 78329 79803 82064 85040 88604
54538H8604M081M516M835N065N156M969M526M098L753L102J833L19p66j400k256
$$ 88604 92685 97201 102036 107101 112257 117226 121752 125850 129603 132705 134538 134857 134091 132691 130435
54523A30435l650m894n105m302l406l178l502l677l195k207j307r74j173j490
$$ 130435 126785 121891 116786 112484 109078 105900 102398 98721 95526 93319 92012 91038 89865 88375
54509H8375j534j216p11k79o6J5J72M31N65M45J86j29o75j447j884j434l67M31
$$ 88375 86841 85625 84914 84635 84569 84584 84756 85187 85752 86197 86383 86254 85579 84132 82248 80814 80447 80878
54491H0878N36L18K04K28M22R58J570J478L96q32j169o15O5M52P23R65J001Q72
$$ 80878 81414 81732 81936 82164 82586 83544 85114 86592 86988 86156 84987 84372 84437 84889 85612 86577 87578 88450
54473H8450Q49Q36M10l85q26m26L34N90J35m96q17q67q90q60n55NL93K36k92o54
$$ 88450 89299 90135 90545 90160 89334 88908 89242 89832 89967 89471 88654 87787 86897 86037 85482 85487 85880 86116 85824 85170
54453H5170n83l14k6M54J120J370O62o80j771k197k135j609m59Q87J419P65k56
$$ 85170 84587 84273 84247 84701 85821 87191 87853 87173 85402 83205 81070 79461 79002 79889 81308 82073 81817
54436H1817p68r37j351j846j741r86k30J72M81Q39R20N44J5m13q59j274j116o9
$$ 81817 81049 80112 78761 76915 75174 74188 73958 74130 74611 75450 76370 76914 76929 76516 75657 74383 73267 73198
54418G3198J275K011J981J780J831J983K005J978K045K123K093K042K150K442
$$ 73198 74473 76484 78465 80245 82076 84059 86064 88042 90087 92210 94303 96345 98495 100937
54404A00937K783K991K975K785K604K541K457K126J553R25K96m03r97j121p91
$$ 100937 103720 106711 109686 112471 115075 117616 120073 122199 123752 124677 124973 124570 123573 122452 121661
54389A21661o00j021j745k095j919j740k001k533k885k857k592k266j927j522
$$ 121661 121061 120040 118295 116200 114281 112541 110540 108007 105122 102265 99673 97407 95480 93958
54375I3958j055o91o84j083j568j694j322o77m0M07N24K97P4L26J018J504J279
$$ 93958 92903 92212 91528 90445 88877 87183 85861 85184 85144 85551 86075 86372 86446 86772 87790 89294 90573
54358I0573O45K78K94K09j80l18M64K013L382L759L164K223J504J200J282J623
$$ 90573 91218 91496 91790 91999 91819 91501 91965 93978 97360 101119 104283 106506 108010 109210 110492 112115
54342A12115J895J644P22m32j217j486j489j340r38m70n25j319k270k657k494
$$ 112115 114010 115654 116376 115944 114727 113241 111752 110412 109474 109004 108479 107160 104890 102233 99739
54327I9739k248k006j525j046j266k234k951k625j836j858k939l963l841k717
$$ 99739 97491 95485 93960 92914 91648 89414 86463 83838 82002 80144 77205 73242 69401 66684
54313F6684j518q01m81l80m84o40m68Q9M03j80j431k238j813n71L62M11qk17o3
$$ 66684 65166 64365 63884 63504 63020 62380 61912 62001 62404 62224 60793 58555 56742 56171 56533 56944 56936 56719 56656
54294E6656J63K40J58r1m52p05o84n93p50r96p99n1O34P13M64N23R34J144Q68
$$ 56656 56819 57059 57217 57126 56674 55969 55285 54692 53942 52946 52147 52096 52730 53443 53907 54430 55364 56508 57376
54275E7376M34K04J30R6K02M30L87j82q46r23l45K54L70J53J28N54J219J680J711
$$ 57376 57810 58014 58144 58240 58442 58872 59259 59077 58231 57308 56963 57217 57587 57740 57868 58422 59641 61321 63032
54256F3032J554J616J792J427K50r30j065k30N11O19O39J010J125K99r39j372
$$ 63032 64586 66202 67994 69421 69671 68741 67676 67446 67957 68576 69215 70225 71350 71649 70710 69338
54240F9338p56r7k72r65j214n21P12J608J479M40n68o60L3N97M94N8k31l73m68
$$ 69338 68582 68485 68213 67248 66034 65513 66225 67833 69312 69752 69184 68524 68557 69154 69648 69706 69475 69102 68634
54221F8634k81K83O65K42p12j272j030m83k09j14K16P81J196J166P64J54n94j414
$$ 68634 68353 68636 69301 69543 68831 67559 66529 66046 65837 65723 65939 66720 67916 69082 69846 70000 69406 67992
54203F7992k059k141j447k31Q49J228Q78K31k93n46n55l54l6K23K83J35j61n48
$$ 67992 65933 63792 62345 62114 62963 64191 65069 65300 65007 64461 63906 63552 63516 63739 64022 64157 63996 63448
54185F3448q91j004q33n45l30k08j52k71o21r39q17j85N17P71M32j79n31k37O04
$$ 63448 62557 61553 60720 60175 59845 59637 59485 59214 58593 57654 56837 56652 57169 57940 58372 58193 57662 57425 58029
54166E8029J350J366P26J67J92M80M58J19r5q6k22o73j112j156p93k18L26M36
$$ 58029 59379 60745 61471 61638 61830 62310 62768 62887 62792 62706 62484 61811 60699 59543 58750 58532 58858 59294
54148E9294j53r69j022j37N23j08j408j742o57N39N12n22j322j126k16O50Q87
$$ 59294 59141 58172 57150 57013 57536 57428 56020 54278 53621 54160 54672 54150 52828 51702 51486 52136 53023
54131E3023M97O6J70N89N21k46r01p15n9K57K18L84P64P50K27j00K29P24O88J83
$$ 53023 53520 53586 53756 54345 54866 54620 53719 53004 52945 53202 53420 53804 54568 55318 55545 55445 55674 56398 57086 57269
54111E7269j77j10J41K94L43L43J41n15j545k349k231j201q4M27N80J031J731
$$ 57269 57092 56982 57123 57417 57760 58103 58244 57729 56184 53835 51604 50403 50319 50746 51326 52357 54088
54094E4088J942J355N01r0m92q25p83k51J79r9p14p24J08J037J307R84O45O93
$$ 54088 56030 57385 57886 57796 57304 56479 55696 55445 55624 55525 54811 54087 54195 55232 56539 57523 58168 58861
54076E8861J019J181Q06K3n32l43L91R30P68Q2m73l11N89J585J913J532J159J300
$$ 58861 59880 61061 61867 61890 61358 61015 61406 62336 63104 63186 62713 62402 62991 64576 66489 68021 69180 70480
54058G0480J521J138K53l85m42l03l70n75p05o63l23M19J347J964K071J910J717
$$ 70480 72001 73139 73392 73007 72565 72262 71892 71317 70612 69949 69626 70045 71392 73356 75427 77337 79054
54041G9054J482J287J428J958K489K701K751K916L157L312L413L577L709L687
$$ 79054 80536 81823 83251 85209 87698 90399 93150 96066 99223 102535 105948 109525 113234 116921
54027A16921L618L662L736L671L510L365L151K764K425K453K717K592J703M36
$$ 116921 120539 124201 127937 131608 135118 138483 141634 144398 146823 149276 151993 154585 156288 156724
54013A56724m24n58m02n02q13r02p31q11j397k026k201k177k456k823k659k070
$$ 156724 156300 155742 155340 154838 154025 153123 152392 151581 150184 148158 145957 143780 141324 138501 135842 133772
53997A33772j879k376k874k813k498k301j919j070l17m28j182j649j415r79q66
$$ 133772 131893 129517 126643 123830 121332 119031 117112 116042 115725 115297 114115 112466 111051 110072 109206
53982A09206j003r70n45QQ0o87j703j810o88N64Q19L61K52O48P21J49m21m59k57
$$ 109206 108203 107233 106688 106696 106776 106089 104386 102576 101888 102452 103271 103632 103884 104532 105253 105402 104981 104522 104265
53963A04265k36l59n50r61j457j432o82P4J03l39m61j15P2k59o42l82O01J717
$$ 104265 104029 103670 103120 102159 100702 99270 98588 98662 98765 98426 97965 97850 97922 97663 97021 96639 97240 98957
53945I8957K357K428K296K265K320K381K599L177M028M855N491N859N721M804
$$ 98957 101314 103742 106038 108303 110623 113004 115603 118780 122808 127663 133154 139013 144734 149538
53931A49538L230J514J15q04j253j323j225j117r12n27j05K81Q88J828K635K893
$$ 149538 152768 154282 154397 153593 152340 151017 149792 148675 147763 147236 147131 147412 148300 150128 152763 155656
53915A55656L071L937N254N971N768N443N531N562N077M508M330M133L290J969
$$ 155656 158727 162664 167918 173889 179657 185100 190631 196193 201270 205778 210108 214241 217531 219500
53901B19500P47k19r95j327j139j118j833k675k587j752j443k246l332l782l729
$$ 219500 220247 220028 219033 217706 216567 215449 213616 210941 208354 206602 205159 202913 199581 195799 192070
53886A92070l785m059m330m619n088n543n529m888l949l176k760k559k391k267
$$ 192070 188285 184226 179896 175277 170189 164646 159117 154229 150280 147104 144344 141785 139394 137127
53872A37127k289k338k196j997k198k788l055k523j818j887k604k909k325j551
$$ 137127 134838 132500 130304 128307 126109 123321 120266 117743 115925 114038 111434 108525 106200 104649
53858A04649j400j820k300k612k720k439j750j123j020j273j299q23l1Q17J470
$$ 104649 103249 101429 99129 96517 93797 91358 89608 88485 87465 86192 84893 84070 84039 84856 86326
53843H6326J551Q13l63j138j124p84p92j171j373j044l98J78N48P97J004J231
$$ 86326 87877 88690 88327 87189 86065 85281 84489 83318 81945 80901 80503 80681 81229 82026 83030 84261
53827H4261J553J834J647P77l29q54n08K32P74J005J121J229J342J452J447J186
$$ 84261 85814 87648 89295 90072 89743 88889 88381 88613 89387 90392 91513 92742 94084 95536 96983 98169
53811I8169R15J189K134L002L016K343J758J590J523J394J498J908K167J951J662
$$ 98169 99084 100273 102407 105409 108425 110768 112526 114116 115639 117033 118531 120439 122606 124557 126219
53796A26219J964K854L679L942L830L776L768L346K322J235Q76J390K128K349
$$ 126219 128183 131037 134716 138658 142488 146264 150032 153378 155700 156935 157811 159201 161329 163678
53782A63678J850R01q0o78p64p64j284k198k635k184j620j850k620l021k909k921
$$ 163678 165528 166429 166349 165671 164907 164143 162859 160661 158026 155842 154222 152372 149752 146731 143822 140901
53766A40901l198l099k420j874j957k053j405m26k40j092j971j967j355j008j069
$$ 140901 137703 134604 132184 130310 128353 126300 124895 124469 124229 123137 121166 119199 117844 116836 115767
53751A15767q19K1N46k04j653k102q57Q30J455J048N77K96k30q19p39p6J13n84
$$ 115767 114948 114969 115515 115311 113658 111556 110699 111529 112984 114032 114609 114905 114675 113856 113117 113041 113154 112570
53733A12570j252j055m14j26j99k46m15j039j738j717q37K94J143J593J599J115
$$ 112570 111318 110263 109849 109723 109524 109278 108863 107824 106086 104369 103532 103826 104969 106562 108161 109276
53717A09276L67k83p82j313j790j843j343o04K0M88R80J603K253K622K415J685
$$ 109276 109643 109360 108578 107265 105475 103632 102289 101685 101705 102193 103173 104776 107029 109651 112066 113751
53701A13751R18O40R63J598K133K292K073J816J928K401K761K667K344K223K364
$$ 113751 114669 115309 116272 117870 120003 122295 124368 126184 128112 130513 133274 135941 138285 140508 142872
53686A42872K495K485K470K599K805K919K847K683K636K788K987L079L175L373
$$ 142872 145367 147852 150322 152921 155726 158645 161492 164175 166811 169599 172586 175665 178840 182213
53672A82213L430L082K623K578K767K388J270L42L81Q97Q83K79o7L25R32R55J95
$$ 182213 185643 188725 191348 193926 196693 199081 200351 200693 201074 201971 202854 203133 203066 203391 204323 205278 205473
53655B05473q05j273r46m10m55r76r41J71J461J675P96k03q03j289j768j759j052
$$ 205473 204668 203395 202449 202039 201584 200608 199667 199838 201299 202974 203770 203567 202764 201475 199707 197948 196896
53638A96896k06J19j01n24r40j271j319r74m79k65n11r77j213r12j85N73J092
$$ 196896 196690 196809 196708 196184 195244 193973 192654 191680 191201 190936 190425 189448 188235 187323 187138 187711 188803
53621A88803J396J547J466J205J094J291J469J342J220J570K177K351J883J318
$$ 188803 190199 191746 193212 194417 195511 196802 198271 199613 200833 202403 204580 206931 208814 210132
53607B10132J226J698K543L476M013L761L043K776L472M617N311N238M789M467
$$ 210132 211358 213056 215599 219075 223088 226849 229892 232668 236140 240757 246068 251306 256095 260562
53593B60562M384M380M383M583N062N373M910L891L429M174N289N516M851M327
$$ 260562 264946 269326 273709 278292 283354 288727 293637 297528 300957 305131 310420 315936 320787 325114
53579C25114M324M157L465K924L117L551L428K807K331K245K257K073J549N99
$$ 325114 329438 333595 337060 339984 343101 346652 350080 352887 355218 357463 359720 361793 363342 363941
53565C63941n88j449j617j382j304j547j906k158k070j494q30r45k064l127k956
$$ 363941 363353 361904 360287 358905 357601 356054 354148 351990 349920 348426 347596 346651 344587 341460 338504
53550C38504j847j176j514j999j794j297j392k057k422j972j108n15m17n35n31
$$ 338504 336657 335481 333967 331968 330174 328877 327485 325428 323006 321034 319926 319411 318994 318459 317928
53535C17928l26r5RJ52P26J726K343J679R0p37L98K633M012L956L817M709N851
$$ 317928 317602 317507 317516 317668 318394 320120 322463 324142 324232 323495 323893 326526 330538 334494 338311 343020 348871
53518C48871N859M946M617N508O778P638Q305R016R336R134R330J0756J2795J4204
$$ 348871 354730 359676 364293 369801 376579 384217 392522 401538 410874 420008 429338 440094 452889 467093
53504D67093J4870J5751J7190J8369J8688J8753J9420K0520K1219K1408K1973
$$ 467093 481963 497714 514904 533273 551961 570714 590134 610654 631873 653281 675254
53493F75254K3582K5700K7164K7524K7405K7621K8321K9144K9741K9907K9479
$$ 675254 698836 724536 751700 779224 806629 834250 862571 891715 921456 951363 980842
53482I80842K8679K8275K8860K9959L0506L0276L0182L0998L2441L3787L4707
$$ 980842 1009521 1037796 1066656 1096615 1127121 1157397 1187579 1218577 1251018 1284805 1319512
53471A319512L5014L4259L2350L0073K8291K6870K5109K2963K1074J9791J8923
$$ 1319512 1354526 1388785 1421135 1451208 1479499 1506369 1531478 1554441 1575515 1595306 1614229
53460A614229J8380J8247J8185J7584J6591J6114J6482J6740J5785J3696J1363
$$ 1614229 1632609 1650856 1669041 1686625 1703216 1719330 1735812 1752552 1768337 1782033 1793396
53449A793396R215O877L917M40l110o343r132j1667j4227j6789j9027k0819k2489
$$ 1793396 1802611 1809488 1813405 1813845 1810735 1804392 1795260 1783593 1769366 1752577 1733550 1712731 1690242
53436A690242k4264k5824k6752k7270k8062k9405l0913l2192l3222l3954l3959
$$ 1690242 1665978 1640154 1613402 1586132 1558070 1528665 1497752 1465560 1432338 1398384 1364425
53425A364425l2848l0951k9189k8290k8260k8517k8378k7382k5424k2661j9433
$$ 1364425 1331577 1300626 1271437 1243147 1214887 1186370 1157992 1130610 1105186 1082525 1063092
53414A063092j6282j3855j2444j1503r970p406m556k419r29Q95L529O356Q710
$$ 1063092 1046810 1032955 1020511 1009008 999038 991632 987076 984657 983728 984623 988152 994508 1003218
53401A003218J0819J3211J5751J7901J9741K1858K4277K6241K7219K7602K8089
$$ 1003218 1014037 1027248 1042999 1060900 1080641 1102499 1126776 1153017 1180236 1207838 1235927
53390A235927K8903L0024L1739L4397L7682M0604M2370M3193M4164M6303M9706
$$ 1235927 1264830 1294854 1326593 1360990 1398672 1439276 1481646 1524839 1569003 1615306 1665012
53379A665012N3526N6857N9519O1902O4232O6341O8070O9506P0744P1778P2669
$$ 1665012 1718538 1775395 1834914 1896816 1961048 2027389 2095459 2164965 2235709 2307487 2380156
53368B380156P3467P3913P3581P2430P0765O8612O5634O1826N7791N4014N0403
$$ 2380156 2453623 2527536 2601117 2673547 2744312 2812924 2878558 2940384 2998175 3052189 3102592
53357C102592M6899M3936M1773L9870L7496L4675L1812K8788K5105K0702J5868
$$ 3102592 3149491 3193427 3235200 3275070 3312566 3347241 3379053 3407841 3432946 3453648 3469516
53346C469516J0424L780m180j2998k2554l3301m5200n6925o6615p3222p6923p8584
$$ 3469516 3479940 3483720 3479540 3466542 3443988 3410687 3365487 3308562 3241947 3168725 3091802 3013218
53334C013218p9147p9257p9105p8580p7616p6320p4795p3090p1375p0015o9314
$$ 3013218 2934071 2854814 2775709 2697129 2619513 2543193 2468398 2395308 2323933 2253918 2184604
53323B184604o9309o9654o9698o8837o7026o4796o2516n9929n6728n3258n0052
$$ 2184604 2115295 2045641 1975943 1907106 1840080 1775284 1712768 1652839 1596111 1542853 1492801
53312A492801m6896m3109l8641l4236l0305k6482k2553j9186j7193j6518j6324
$$ 1492801 1445905 1402796 1364155 1329919 1299614 1273132 1250579 1231393 1214200 1197682 1181358
53301A181358j5772j4397j2130r476p325o152n533m713l452k034p46L21J171K027
$$ 1181358 1165586 1151189 1139059 1129583 1122258 1116106 1110573 1105860 1102408 1100374 1099628 1099949 1101120 1103147
53287A103147L299N066O737P725Q330R514J1761J4594J7244J9425K1377K3388
$$ 1103147 1106446 1111512 1118249 1125974 1134304 1143818 1155579 1170173 1187417 1206842 1228219 1251607
53275A251607K5521K7658K9628L1286L2482L3072L3089L2911L3008L3417L3661
$$ 1251607 1277128 1304786 1334414 1365700 1398182 1431254 1464343 1497254 1530262 1563679 1597340
53264A597340L3320L2477L1380L0061K8520K7118K6263K5839K5281K4226K2729
$$ 1597340 1630660 1663137 1694517 1724578 1753098 1780216 1806479 1832318 1857599 1881825 1904554
53253A904554K0782J8096J4522J0450O440K662j176n343r718j3978j8044k2210
$$ 1904554 1925336 1943432 1957954 1968404 1974844 1977506 1976330 1970987 1961269 1947291 1929247 1907037
53241A907037k6703l1177l4831l7208l8729m0270m2213m4063m5065m5043m4431
$$ 1907037 1880334 1849157 1814326 1777118 1738389 1698119 1655906 1611843 1566778 1521735 1477304
53230A477304m3563m2180l9896l7087l4884l4029l4039l3846l3152l2648l2907
$$ 1477304 1433741 1391561 1351665 1314578 1279694 1245665 1211626 1177780 1144628 1111980 1079073
53219A079073l3665l4314l4565l4388l3746l2746l1634l0241k7929k4552k1040
$$ 1079073 1045408 1011094 976529 942141 908395 875649 844015 813774 785845 761293 740253
53208G40253j8441j6702j5032j3275j2036j1556j1288j0821j0478j0652j1164
$$ 740253 721812 705110 690078 676803 664767 653211 641923 631102 620624 609972 598808
53197E98808j1599j1821j1822j1524j1091j1046j1606j2216j2164j1372j0251
$$ 598808 587209 575388 563566 552042 540951 529905 518299 506083 493919 482547 472296
53186D72296r138q277q070q679r504r637q947q232q224q790r308r405r212r045
$$ 472296 463158 454881 446811 438132 428628 418991 410044 401812 393588 384798 375490 366085 356873 347828
53172C47828r056r040q579p477o090n057m707m953n632o623p576p892p215n775
$$ 347828 338772 329732 321153 313676 307586 302529 297822 292869 287237 280614 273038 265146 257931 252156
53158B52156m163k916k380k611l254l738l771l465k956k254j616j573k216k832
$$ 252156 247993 245077 242697 240086 236832 233094 229323 225858 222902 220648 219032 217459 215243 212411
53144B12411k773k377k441k950l037k287j354j016j185j275j084q84q62r31j006
$$ 212411 209638 207261 204820 201870 198833 196546 195192 194176 192991 191716 190632 189748 188886 187955 186949
53129A86949j096j133j024q20o57n25l31j30p8k07m17n65m84l2O20R90Q54O51
$$ 186949 185853 184720 183696 182876 182219 181694 181363 181233 181155 180948 180531 179966 179482 179450 180070 181060 181914 182565
53111A82565R56J667K166K202K141K220K203J950J827K091K276J734N92l73p85
$$ 182565 183521 185188 187354 189556 191697 193917 196120 198070 199897 201988 204264 205998 206590 206217 205432
53096B05432j076j760k724l465l752l760l741l796l906l977l870l547l158k871
$$ 205432 204356 202596 199872 196407 192655 188895 185154 181358 177452 173475 169605 166058 162900 160029
53082A60029k705k602k640k894l129k921k192j401j049j154j423j701k001k205
$$ 160029 157324 154722 152082 149188 146059 143138 140946 139545 138496 137342 135919 134218 132217 130012
53068A30012k111j822j683j747j631j024j47M98O28L97J80K18K92j39j174j979
$$ 130012 127901 126079 124396 122649 121018 119994 119847 120345 120973 121370 121550 121768 122060 121921 120747 118768
53052A18768j624m04L75J18l30j04L55J80l87m20N5P7o25j161r27n02o23j020
$$ 118768 117144 116740 117115 117233 116903 116799 117154 117334 116947 116527 116582 116659 116034 114873 113946 113444 112821 111801
53034A11801r25k24N23Q45O38l6r67j768k147k127j857j433j040r13r57q00m00
$$ 111801 110876 110652 111175 112020 112658 112622 111655 109887 107740 105613 103756 102323 101283 100370 99413 98613 98213
53017I8213j44j29J56R84J674J288j79j787k588k266j127P2N05J6o54o76q4M05
$$ 98213 98069 97940 98096 99080 100754 102042 101863 100076 97488 95222 94095 94167 94672 94688 94034 93358 93274 93679
52999I3679K82l49j045j350j071n29k47k03K01J047J443Q08mK18J139J258P0j225
$$ 93679 93961 93612 92567 91217 90146 89617 89370 89167 89368 90415 91858 92666 92662 92880 94019 95277 95347 94122
52981I4122j405o53J45O30R70J210J256J174J103J091J282J887K755L249K907
$$ 94122 92717 92064 92209 92839 93809 95019 96275 97449 98552 99643 100925 102812 105567 108816 111723
52966A11723K015J305J265J836K541K887K859K986L582M110L800K783J890J394
$$ 111723 113738 115043 116308 118144 120685 123572 126431 129417 132999 137109 140909 143692 145582 146976
52952A46976Q24Q9k22m2k50j225j939j429l78j33o92r64o77o86j294j652j188
$$ 146976 147800 147889 147667 147625 147375 146150 144211 142782 142404 142271 141579 140615 139938 139252 137958 136306 135118
52935A35118n65n59q31n99L7K33l53j106j259p09J9L09Om36m39J3L10N3l45j82
$$ 135118 134553 133994 133163 132564 132601 132834 132481 131375 130116 129407 129426 129735 129741 129305 128866 128879 129189 129242 128897 128715
52915A28715N82J211J105M30j79k92J02Q10J537J853J401K80q71j402j230q15
$$ 128715 129297 130508 131613 132043 131864 131572 131674 132484 134021 135874 137275 137555 136684 135282 134052 133237
52899A33237n62m41j78L62J071J650J770J350P79O47J087J611J757J633J601J625
$$ 133237 132675 132234 132056 132418 133489 135139 136909 138259 139038 139685 140772 142383 144140 145773 147374 148999
52883A48999J335O57m8m54n40m06j20J69K74K04J42J16k8k55l01j30j11m88r24
$$ 148999 150334 150991 150943 150489 149949 149543 149423 149592 149866 150070 150212 150328 150300 150045 149744 149614 149503 149015 148091
52864A48091q79k67M65P82M76j70m75J67J571K750K915K330J848J808J865J815
$$ 148091 147212 146945 147410 148192 148668 148498 148023 148190 149761 152511 155426 157756 159604 161412 163277 165092
52848A65092J922K276K392J872J096Q13J173J578J443Q35L02K77O51Q60M64l24
$$ 165092 167014 169290 171682 173554 174650 175463 176636 178214 179657 180492 180794 181071 181722 182582 183046 182722
52832A82722q37q20p55j072j420j239q49j191k386l337l125k189j562j458j288
$$ 182722 181885 181065 180310 179238 177818 176579 175730 174539 172153 168816 165691 163502 161940 160482 159194
52817A59194q70p72j406k378l022l116k800k213j476q58o01o53p30o55n37o58
$$ 159194 158324 157552 156146 153768 150746 147630 144830 142617 141141 140283 139682 139029 138299 137644 137107 136449
52801A36449j146j686j656q49R5K29o04j590j937j685j360j192j061r53j029j245
$$ 136449 135303 133617 131961 131112 131207 131436 130832 129242 127305 125620 124260 123068 122007 121054 120025 118780
52785A18780j294r94n42k91l71n92o66n16l78n47j017j484j688j579j236q67q62
$$ 118780 117486 116492 115950 115659 115288 114696 114030 113514 113136 112589 111572 110088 108400 106821 105585 104718 103856
52768A03856j449k190k249j426n30l25n67m90j5J53m30j391k104k298k032j423
$$ 103856 102407 100217 97968 96542 96012 95687 95120 94630 94615 94768 94338 92947 90843 88545 86513 85090
52752H5090o34P4M86N20K08k19m31l80m32q01j019n55K82N89P2o76j067j122r62
$$ 85090 84456 84530 85016 85536 85744 85525 85094 84714 84282 83481 82462 81907 82189 82778 82850 82174 81107 79985 79023
52733G9023n04Q9L21J67K01N07K07j159k480k312q94J11j61q96r88l66L75Q37
$$ 79023 78519 78608 78929 79096 79297 79804 80011 78852 76372 74060 73166 73277 73116 72220 71232 70866 71241 72078
52715G2078Q52L28n27j168j331j241j075o21Q5M28k2p22p21K04J363K031K004
$$ 72078 72930 73258 72731 71563 70232 68991 67916 67295 67380 67808 67786 67064 66343 66547 67910 69941 71945
52698G1945J502R08N84N84O17N35O06J070J650J956K081K309K429J988J187Q03
$$ 71945 73447 74355 74939 75523 76140 76675 77281 78351 80001 81957 84038 86347 88776 90764 91951 92754
52682I2754J087J364R73P1p78j308j540j499j369j557k142k488j907o30L48K96
$$ 92754 93841 95205 96178 96249 95471 94163 92623 91124 89755 88198 86056 83568 81661 81031 81379 81675
52666H1675n77j502j872j639j223j064j127r75m14J50K55K7m6J29J39l30j065
$$ 81675 81098 79596 77724 76085 74862 73798 72671 71696 71282 71432 71687 71714 71668 71797 71936 71606 70541
52649G0541j563j449p10J97N91K11l70l51L91J294J930K317K419J925Q06l60r89
$$ 70541 68978 67529 66819 67016 67607 67818 67448 67097 67488 68782 70712 73029 75448 77373 78179 77819 76830
52632G6830j082r74p92n46m48o84j040j101q40o24o78q17p41l15L97J163J593
$$ 76830 75748 74774 73982 73436 72988 72304 71264 70163 69323 68699 68021 67204 66463 66148 66545 67708 69301
52615F9301J379O65rj90J31O45J062J257J235J047P65M56J86M2J34N29J154J761
$$ 69301 70680 71345 71336 71146 71277 71922 72984 74241 75476 76523 77288 77744 77930 77972 78106 78635 79789 81550
52597H1550K041J902J551J245J063J007J158J484J556R31j81j046j220r02l42
$$ 81550 83591 85493 87044 88289 89352 90359 91517 93001 94557 95488 95307 94261 93041 92139 91797
52582I1797M26J115J089K95k98J78J268J864J745J558J500J054J90k53K16R61
$$ 91797 92223 93338 94427 94722 94424 94602 95870 97734 99479 101037 102537 103591 103781 103528 103744 104705
52566A04705J187J009R61J039Q92N25J46l27r64j341j064n02k83k58K27J081J374
$$ 104705 105892 106901 107862 108901 109793 110318 110464 110137 109173 107832 106768 106266 105983 105725 105952 107033 108407
52549A08407O96k81q12r76j149j222r54n45l20j76J12L50K92K69P62J464J504
$$ 108407 109103 108822 108010 107034 105885 104663 103709 103164 102844 102668 102780 103130 103422 103691 104453 105917 107421
52532A07421O87j57k80J30M55N18M58K07l24p88o97j69K10K76N18J175J641J230
$$ 107421 108108 107951 107671 107801 108256 108774 109232 109439 109115 108327 107630 107461 107671 107947 108465 109640 111281 112511
52514A12511K81j27M13J113J062M14Q0M44R36R20M75P2k10o42j213j524j380j144
$$ 112511 112792 112665 113078 114191 115253 115667 115747 116191 117127 118047 118522 118594 118384 117742 116529 115005 113625 112481
52496A12481j194j325j019l08J12k71j047j317p73OL80M37O17R00Q48M13J01J63
$$ 112481 111287 109962 108943 108635 108747 108476 107429 106112 105339 105345 105725 106162 106779 107679 108527 108940 109041 109204
52478A09204J44l33p49l26P59J484J344R10Q26R05O01j04p89j241j515j519j129
$$ 109204 109348 109015 108266 107940 108699 110183 111527 112437 113263 114168 114769 114665 113876 112635 111120 109601 108472
52461A08472o16m99q59j275j390j258j003n66P8O86R73R03O94N39M49K59k04q61
$$ 108472 107856 107357 106498 105223 103833 102575 101572 101006 101084 101770 102743 103646 104340 104879 105328 105587 105383 104522
52443A04522j351j397j054n32O8O09P86N28K76M42P23N60J64K91R57J178M24m85
$$ 104522 103171 101774 100720 100188 100256 100865 101651 102179 102455 102897 103620 104180 104344 104635 105592 106770 107194 106709
52425A06709n03J63M80R3l73l62k3L02N84R05J180J268J144R01P79J082J777K271
$$ 106709 106206 106369 106849 106942 106569 106207 106184 106486 107070 107975 109155 110423 111567 112468 113247 114329 116106 118377
52407A18377K008J243P67Q83J116J054Q91Q89Q03L31k22k54K47O40M44j08m51
$$ 118377 120385 121628 122395 123278 124394 125448 126339 127228 128031 128362 128140 127886 128133 128773 129217 129109 128658
52390A28658l33Q9N82J019J305J341J092O44J30k60k87K02R82J496J407J033R32
$$ 128658 128325 128414 128996 130015 131320 132661 133753 134397 134527 134267 133980 134182 135164 136660 138067 139100 140032
52373A40032J156J265J105J087J489J947J968J651J424J286Q76J57l94m03R1Q76
$$ 140032 141188 142453 143558 144645 146134 148081 150049 151700 153124 154410 155286 155443 155049 154646 154737 155613
52357A55613J728K287K235J707J183Q35M18j27l12K58J247J893J779J110L85K6
$$ 155613 157341 159628 161863 163570 164753 165588 166006 165879 165567 165825 167072 168965 170744 171854 172239 172265
52341A72265J07L72N35P05J212J989K453K252J761J587J809K028J981J731J428
$$ 172265 172372 172744 173279 173984 175196 177185 179638 181890 183651 185238 187047 189075 191056 192787 194215
52326A94215J200J177J345J441J334J289J567J897J822J477J500K075K669K896
$$ 194215 195415 196592 197937 199378 200712 202001 203568 205465 207287 208764 210264 212339 215008 217904
52312B17904L084L615M178M233L941M004M592N084N004M703M743N084N309N388
$$ 217904 220988 224603 228781 233014 236955 240959 245551 250635 255639 260342 265085 270169 275478 280866
52298B80866N706O332O859O997O964P086P351P639Q072Q831R747J0397J0554J0330
$$ 280866 286572 292904 299763 306760 313724 320810 328161 335800 343872 352703 362450 372847 383401 393731
52284C93731R984R747R742R911J0099J0313J0715J1228J1451J1224J0915J0822
$$ 393731 403715 413462 423204 433115 443214 453527 464242 475470 486921 498145 509060 519882
52272E19882J0552R577Q174P186O961P070P054O828O284N267M088L455L498L536
$$ 519882 530434 540011 548185 555371 562332 569402 576456 583284 589568 594835 598923 602378 605876 609412
52258F09412L061K403J993J597Q75K30L21J018J426R03l90j804k619k389j321
$$ 609412 612473 614876 616869 618466 619341 619571 619892 620910 622336 623239 622849 621045 618426 616037 614716
52243F14716k37K74N08J039J732K011J960K459M134O549Q645R596R334Q628Q541
$$ 614716 614479 614753 615261 616300 618032 620043 622003 624462 628596 635145 643790 653386 662720 671348 679889
52228F79889R422J0393J0392R539Q965R295R974J0203R842R205Q567Q136P963
$$ 679889 689311 699704 710096 719635 728600 737895 747869 758072 767914 777119 785686 793822 801785
52215H01785P595O438M781L733L718L753K825J332K84l86j608l453m831n048m711
$$ 801785 809380 815818 820599 824332 828050 831803 834628 835960 836244 835858 834250 830797 825966 820918 816207
52200H16207m648m846m946n117n685o340o484o187o089o378o469n856m832m120
$$ 816207 811559 806713 801767 796650 790965 784625 778141 771954 765865 759487 753018 747162 742330 738210
52186G38210m110m591n013m897m218l506l419m039m783n068m832m297l535k614
$$ 738210 734100 729509 724496 719599 715381 711875 708456 704417 699634 694566 689734 685437 681902 679288
52172F79288j851j560j647j719j638j658k004k557k938k800k133j462j589k733
$$ 679288 677437 675877 674230 672511 670873 669215 667211 664654 661716 658916 656783 655321 653732 650999
52158F50999m049m418l681k694k184k079k074k144k267k159j765j522j749k157
$$ 650999 646950 642532 638851 636157 633973 631894 629820 627676 625409 623250 621485 619963 618214 616057
52144F16057k324k359k589k974l331l813m503m872m314l162k452k666l294l653
$$ 616057 613733 611374 608785 605811 602480 598667 594164 589292 584978 581816 579364 576698 573404 569751
52130E69751l566l182k819k962l790m598m415l336k553k725l201l214l023l142
$$ 569751 566185 563003 560184 557222 553432 548834 544419 541083 538530 535805 532604 529390 526367 523225
52116E23225l202k567j625j407k009k408j930j049m05J29R44J864K418K714L394
$$ 523225 520023 517456 515831 514424 512415 510007 508077 507028 506623 506752 507696 509560 511978 514692 518086
52101E18086M746O232O988O681N834N458O198P737R138R869J0312J1067J2038
$$ 518086 522832 529064 536052 542733 548567 554025 560223 567960 577098 586967 597279 608346 620384
52088F20384J2712J3166J4144J5895J7512J7917J7119J6020J5230J4725J4507
$$ 620384 633096 646262 660406 676301 693813 711730 728849 744869 760099 774824 789331
52077G89331J4767J5261J5210J4182J2591J1012R556Q292P652P783P966P391O209
$$ 789331 804098 819359 834569 848751 861342 872354 881910 890202 897854 905637 913603 920994 927203
52064I27203N057L897K183P3j573k448l163m095m784m888m872n183n466n293n091
$$ 927203 932260 936157 938340 938413 936840 934392 931229 927134 922350 917462 912590 907407 901941 896648 891557
52049H91557n550o451o836o259n221m390l932l640l322k955k678k606k551k093
$$ 891557 886007 879556 872720 866461 861240 856850 852918 849278 845956 843001 840323 837717 835166 833073
52035H33073j072K32J498K634L466L712L523L582M157M591M288L764L877M406
$$ 833073 832001 832233 833731 836365 839831 843543 847066 850648 854805 859396 863684 867448 871325 875731
52021H75731M306L290K152J487R98L86kJ07K20k94j289k129k618l194m251n635
$$ 875731 880037 883327 885479 886966 887964 888350 888348 888455 888675 888381 887092 884963 882345 879151 874900 869265
52005H69265o811p409p706q466j0086j1997j3294j3903j4559j5593j6563j7214
$$ 869265 862454 855045 847339 838873 828787 816790 803496 789593 775034 759441 742878 725664
51993G25664j7962j8911j9226j8351j7209j7155j8047j8516j8053j7636j7981
$$ 725664 707702 688791 669565 651214 634005 616850 598803 580287 562234 544598 526617
51982E26617j8384j7911j6868j6173j5872j5217j4038j3078j2913j3206j3275
$$ 526617 508233 490322 473454 457281 441409 426192 412154 399076 386163 372957 359682
$$ [...]
##END NTUPLES=NMR SPECTRUM
##END=
