##TITLE=NES1050_10427_9270609_61D8CKfaId
##JCAMPDX= 6.0         $$ Bruker NMR JCAMP-DX V2.0
##DATA TYPE= NMR SPECTRUM
##DATA CLASS= NTUPLES
##ORIGIN= BRUKER
##OWNER= Administrator
$$ 1.72 TOPSPIN		Version 2.1
$$ 2015-07-18 21:24:12.744 -0700  Administrator@X
$$ Compression mode = diff/dup
##.OBSERVE FREQUENCY= 400.02188249412
##.OBSERVE NUCLEUS= ^1H
##.ACQUISITION MODE= SIMULTANEOUS (DQD)
##.ACQUISITION SCHEME= undefined
##.AVERAGES= 8
##.DIGITISER RES= 22
##SPECTROMETER/DATA SYSTEM= spect
##.PULSE SEQUENCE= zg30
##.SOLVENT NAME= COFFEE_meoh
##.SHIFT REFERENCE= INTERNAL, COFFEE_meoh, 1, 14.98509
##AUDIT TRAIL= $$ (NUMBER, WHEN, WHO, WHERE, PROCESS, VERSION, WHAT)
$$ ##TITLE= Audit trail, TOPSPIN		Version 2.1
$$ ##JCAMPDX= 5.01
$$ ##ORIGIN= Bruker BioSpin GmbH
$$ ##OWNER= Administrator
$$ $$ E:\/data/COFFEE/nmr/NES1050_10427_9270609_61D8CKfaId/20/pdata/1/auditp.txt
$$ ##AUDIT TRAIL=  $$ (NUMBER, WHEN, WHO, WHERE, PROCESS, VERSION, WHAT)
(   1,<2015-07-18 21:24:05.416 -0700>,<Administrator>,<X>,<go>,<TOPSPIN 2.1>,
      <created by zg
	started at 2015-07-18 21:22:58.979 -0700,
	POWCHK enabled, PULCHK disabled,
       configuration hash MD5:
       21 0F 79 D6 B3 7B B4 F6 88 20 88 DB 03 48 BD 9F
       data hash MD5: 64K
       EB BE F6 1D 97 E6 98 F1 34 0B F7 59 4B C9 58 CD>)
(   2,<2015-07-18 21:24:08.572 -0700>,<Administrator>,<X>,<proc1d>,<TOPSPIN 2.1>,
      <Start of raw data processing
       efp LB = 0 FT_mod = 6 PKNL = 1 PHC0 = 0 PHC1 = 0 SI = 32K 
       data hash MD5: 32K
       65 DE 7E 59 EA 97 1E 5F 15 A0 E3 88 B8 0E AC F6>)
(   3,<2015-07-18 21:24:08.869 -0700>,<Administrator>,<X>,<proc1d>,<TOPSPIN 2.1>,
      <pk PHC0 = 86.7041 PHC1 = 0 
       data hash MD5: 32K
       10 3A 93 DD CC 88 A5 7E EC 83 9E 2E 8D C0 DD 62>)
(   4,<2015-07-18 21:24:08.979 -0700>,<Administrator>,<X>,<proc1d>,<TOPSPIN 2.1>,
      <abs ABSG = 1 
       data hash MD5: 32K
       77 CB 66 25 44 A3 C5 17 4D 4D 73 26 F7 46 29 4C>)
(   5,<2015-07-18 21:24:09.057 -0700>,<Administrator>,<X>,<proc1d>,<TOPSPIN 2.1>,
      <abs ABSG = 2 
       data hash MD5: 32K
       A3 05 29 31 C7 D8 78 03 BE 7D 39 0F 45 68 80 6A>)
(   6,<2015-07-18 21:24:09.104 -0700>,<Administrator>,<X>,<proc1d>,<TOPSPIN 2.1>,
      <abs ABSG = 3 
       data hash MD5: 32K
       2B 9A 6D 26 D8 54 CE 92 5B A0 BF 7B E6 03 F9 01>)
(   7,<2015-07-18 21:24:09.166 -0700>,<Administrator>,<X>,<proc1d>,<TOPSPIN 2.1>,
      <abs ABSG = 4 
       data hash MD5: 32K
       0C E0 B0 83 33 D9 3D 3F 50 38 93 66 A2 66 5F C6>)
(   8,<2015-07-18 21:24:09.229 -0700>,<Administrator>,<X>,<proc1d>,<TOPSPIN 2.1>,
      <abs ABSG = 5 
       data hash MD5: 32K
       E7 1C DC 5B 06 EA 77 E9 0F 35 C8 55 4D AE 68 9B>)
$$ ##END=
$$ 
$$ $$ hash MD5
$$ $$ 81 FF C8 F6 C0 E6 00 5C 3B 38 3C 0E DD 7F 46 C0
##$RELAX= 
##$RELAX= 
##$RELAX= 
##$RELAX= 
##$RELAX= 
##$RELAX= 
##$RELAX= 
$$ Bruker specific parameters
$$ --------------------------
##$DU= <E:\>
##$EXPNO= 20
##$NAME= <NES1050_10427_9270609_61D8CKfaId>
##$PROCNO= 1
$$ [...]
##$TP= (0..7)
150 150 150 150 150 150 150 150
##$TP07= 0
##$TPNAME0= <>
##$TPNAME1= <>
##$TPNAME2= <>
##$TPNAME3= <>
##$TPNAME4= <>
##$TPNAME5= <>
##$TPNAME6= <>
##$TPNAME7= <>
##$TPOAL= (0..7)
0.5 0.5 0.5 0.5 0.5 0.5 0.5 0.5
##$TPOFFS= (0..7)
0 0 0 0 0 0 0 0
##$TUNHIN= 0
##$TUNHOUT= 0
##$TUNXOUT= 0
##$USERA1= <user>
##$USERA2= <user>
##$USERA3= <user>
##$USERA4= <user>
##$USERA5= <user>
##$V9= 5
##$VALIST= <valist>
##$VCLIST= <CCCCCCCCCCCCCCC>
##$VD= 0
##$VDLIST= <DDDDDDDDDDDDDDD>
##$VPLIST= <PPPPPPPPPPPPPPP>
##$VTLIST= <TTTTTTTTTTTTTTT>
##$WBST= 2048
##$WBSW= 25
##$XGAIN= (0..3)
0 0 0 0
##$XL= 0
##$YL= 0
##$YMAX_a= 603376
##$YMIN_a= -512866
##$ZGOPTNS= <>
##$ZL1= 120
##$ZL2= 120
##$ZL3= 120
##$ZL4= 120
##$ABSF1= 14.98509
##$ABSF2= -5.573092
##$ABSG= 5
##$ABSL= 3
##$ALPHA= 0
##$AQORDER= 0
##$ASSFAC= 0
##$ASSFACI= 0
##$ASSFACX= 0
##$ASSWID= 0
##$AUNMP= <proc_prof1d_extract_pilot.lims>
##$AXLEFT= 0
##$AXNAME= <>
##$AXNUC= <1H>
##$AXRIGHT= 0
##$AXTYPE= 0
##$AXUNIT= <>
##$AZFE= 0.1
##$AZFW= 0.1
##$BCFW= 0
##$BC_mod= 0
##$BYTORDP= 0
##$COROFFS= 0
##$CY= 15
##$DATMOD= 1
##$DC= 0
##$DFILT= <>
##$DTYPP= 0
##$F1P= 0
##$F2P= 0
##$FCOR= 0.5
##$FTSIZE= 32768
##$FT_mod= 6
##$GAMMA= 0
##$GB= 0
##$INTBC= 1
##$INTSCL= 1
##$ISEN= 128
##$LB= 0
##$LEV0= 0
##$LPBIN= 0
##$MAXI= 10000
##$MC2= 0
##$MEAN= 0
##$ME_mod= 0
##$MI= 0
##$NCOEF= 0
##$NC_proc= -8
##$NLEV= 6
##$NOISF1= 0
##$NOISF2= 0
##$NSP= 0
##$NTH_PI= 0
##$NZP= 0
##$OFFSET= 14.98509
##$PC= 1
##$PHC0= 86.7041
##$PHC1= 0
##$PH_mod= 1
##$PKNL= yes
##$PPARMOD= 0
##$PPDIAG= 0
##$PPIPTYP= 0
##$PPMPNUM= 2147483647
##$PPRESOL= 1
##$PSCAL= 4
##$PSIGN= 0
##$PYNMP= <proc.py>
##$REVERSE= no
##$SF= 400.02
##$SI= 32768
##$SIGF1= 0
##$SIGF2= 0
##$SINO= 400
##$SIOLD= 32768
##$SPECTYP= <>
##$SREGLST= <1H.CDCl3>
##$SSB= 0
##$STSI= 32768
##$STSR= 0
##$SW_p= 8223.68421052631
##$SYMM= 0
##$S_DEV= 0
##$TDeff= 65536
##$TDoff= 0
##$TI= <>
##$TILT= no
##$TM1= 0
##$TM2= 0
##$TOPLEV= 0
##$USERP1= <user>
##$USERP2= <user>
##$USERP3= <user>
##$USERP4= <user>
##$USERP5= <user>
##$WDW= 1
##$XDIM= 32768
##$YMAX_p= 450196381
##$YMIN_p= -684636
##$CURPLOT= <Network HP LaserJet P1505>
##$CURPRIN= <$Network HP LaserJet P1505>
##$DFORMAT= <normdp>
##$LAYOUT= <+/1D_H.xwp>
##$LFORMAT= <normlp>
##$PFORMAT= <normpl>
##$SURQMSG= 1
$$ End of Bruker specific parameters
$$ ---------------------------------
##NTUPLES= NMR SPECTRUM
##VAR_NAME=  FREQUENCY,     SPECTRUM/REAL,   SPECTRUM/IMAG
##SYMBOL=    X,             R,               I
##VAR_TYPE=  INDEPENDENT,   DEPENDENT,       DEPENDENT
##VAR_FORM=  AFFN,          ASDF,            ASDF
##VAR_DIM=   32768,         32768,           32768
##UNITS=     HZ,            ARBITRARY UNITS, ARBITRARY UNITS
##FACTOR=    0.250966925370066, 1,           1
##FIRST=     8223.43324360094, -55048,       -44291
##LAST=      0,             -105576,         -66079
##MIN=       0,             -684636,         0
##MAX=       8223.43324360094, 450196381,    0
$$ Real data points
##PAGE= N=1
##DATA TABLE= (X++(R..R)), XYDATA
$$ [...]
23774 -367653 -235142 -226048 -266685 -19940 458256 31225 -162400 152595 -51051 120625 -11680
23762 -170498 -102846 49036 -225076 -743 4690 -121863 67858 -15669 -21025 -163678 -112016 -17067
23749 -256258 -22564 -216043 -250937 117078 16051 -108302 -105760 68726 -406977 37029 23600
23738 23600 74995 -43418 145125 -110681 331466 -79722 -58407 -59142 223621 -59075 50953
23726 -36110 36473 7585 -117442 226759 -282887 -317936 -33902 -150557 -83444 209070 -266996
23714 -366373 -203884 -31677 259030 174504 151256 -135750 -124063 -277602 76826 368592
23704 368592 20109 -33086 -62074 -152052 145886 96842 -138597 242026 2889 -72360 125038
23692 125715 12761 170633 210501 13354 -272731 -197567 43810 57737 178478 -40267 -244562
23681 -244562 339621 -8607 -477509 -213123 -303675 -362946 -109681 70079 -157040 -54030 58618
23669 54617 12877 -285236 -56168 197583 -37447 -114280 104901 -402807 329393 -252647
23658 277073 -215518 -32483 87948 134222 -24083 -214931 -68825 36282 -112436 7680 -149970
23646 -255787 260097 -73346 -18209 -15732 -94454 110798 225575 -12394 325451 58210 -18297
23634 -394055 -251412 1933 -402809 248522 -191678 31248 17966 102541 63259 -267983 -107138
23622 -285673 141429 -30456 48908 84416 -24767 -124506 83265 58382 -102932 -210192 89384
23610 -441143 83417 299211 185197 -138513 -139484 122201 155631 -47506 290539 33038 139861
23599 139861 25381 19812 138785 1285 -167578 -142823 76949 -121754 -32530 289544 48943
23587 78307 140588 -41041 -56061 185065 173986 -46126 -3153 80374 -244202 195211 71095
23575 -3026 33027 97133 157878 -6331 16251 -152474 308623 -32016 122111 -222456 -159204
23564 -159204 112155 -1464 98152 -53228 -67289 61693 -200956 -65308 -135774 -144126 161771
23552 86928 138830 55689 28545 -43314 20160 -105224 -60366 -177209 -232713 151961 54058
23540 -124971 53858 -247819 141493 57603 -234734 65758 -56203 -16024 394602 -147894
23529 139145 -69218 -180168 -85856 26270 21170 -91822 -104983 168884 -36909 -80405 109367
23517 45575 -409885 2913 174626 54622 232987 -114949 264874 -13228 50506 193521 35738
23505 -315382 -81653 43265 -903 -25449 170968 -236927 18136 -302385 37215 219496 53281
23493 22434 74025 -21540 -19898 -140311 44692 -264575 236346 -59962 -153132 -301798 -308556
23482 -308556 435410 176196 -59218 -140588 -16171 142360 127693 285647 138283 -65561
23471 8242 37077 249725 -62780 319766 -193356 -387338 64948 400151 294521 -80634 64364
23459 -258017 -238344 113474 -186671 51013 47384 -42855 17171 27359 -76026 196117 -153768
23447 109578 -123199 -49518 -119503 40529 -302929 59979 28924 -218372 288561 52154 188809
23436 188809 -325204 -2043 135169 175111 172620 -201034 -290289 -22299 320538 -76082 -131006
23425 -131006 -183040 186005 -136365 -109848 -341957 -40649 -79363 73473 -57087 -32105 -59542
23414 -59542 -411114 104469 -77412 191745 -38324 -150151 -96160 103938 462789 230360
23403 62688 -7799 -14633 170495 -72048 -75005 12027 -68125 124839 -87136 -183892 -117832 -231324
23391 -231324 141117 -99303 -177962 -177349 -146800 -239222 303369 51189 -140184 123781 -35261
23379 210010 445402 -194029 -80234 42691 -118511 184743 -321258 145930 177132 74677
23368 209649 -259884 67507 -165779 133685 -123731 -110716 -3056 59664 52315 -257826 -142255
23357 -142255 -172467 58729 -133514 -86765 -151332 66993 -75432 -53937 -22184 -111676 126102
23345 293086 176791 140448 135099 -147411 13123 104786 -76524 -315673 -189775 -382971 -51922
23333 42538 -298063 105233 -264237 -83890 154120 337378 177416 -134464 299064 -84683
23322 56075 58571 12210 -1946 91449 -323399 -365739 96788 67183 -230338 143251 -71579
23310 100933 -126418 11003 -259973 -19948 -247154 137432 -77542 105106 151909 -248415
23299 -337109 183197 248805 16903 -359000 209077 -43013 97283 -302645 138735 -138283
23288 313812 -111015 258196 -119574 94930 -90750 -134301 157205 -199808 -263550 191084
23277 153178 190365 44604 -146614 100334 -256580 -109320 -161767 -340221 273730 -160207
23266 -68268 55495 -317189 -170375 -344247 -85287 -180499 -223302 110892 -185337 -231092 34671
23254 -83232 448161 -82227 -39314 -213530 -87579 -230898 252021 42019 112690 289925 -145989
23242 -12470 -316371 191824 -231652 -188594 -94179 17521 165688 -143746 -86318 245304
23231 -234098 83337 320212 -11539 -289462 29647 154513 141746 127220 -190234 182188
23220 180215 182516 -229613 10001 -335825 62581 14325 156816 -186858 -214375 -219909 -4487
23208 91343 -59710 -43197 -4818 103718 -82505 17357 -28901 -312008 101374 130747 -58547
23196 150414 59281 -95636 -32431 139364 111900 -7588 -79338 -167177 -89766 5085 125134
23185 125134 -72195 -12658 141150 307985 7945 196260 146077 -111030 -304839 -266362 -144162
23174 -144162 499529 194470 25444 126278 -144590 16400 -155047 251 -20022 -22865 -48632
23163 -48632 254478 75269 47443 26255 -94365 -141199 155770 59800 112932 150637 217476
23152 217476 -99720 26412 26450 -194652 31082 80216 -135718 24577 88456 -556821 130553
23140 245901 -118069 160715 -182243 -35056 -246204 -196077 36225 58081 -352866 -326648
23130 -326648 2663 -101256 184825 140486 327266 -252586 196114 -217972 -194058 -275884
23120 -275884 25635 -288323 -255630 -345881 -169948 64930 -125019 -2099 329112 -107348 17476
23108 -229985 -117577 134822 175426 136592 158194 6136 137170 164950 -94691 -53267 76726
23096 -128829 -206872 324054 5669 -347505 -146260 -37981 30881 -35424 92158 142278 -77747
23084 6313 -20151 -262795 293448 -23000 -131263 -62381 -151016 -110070 -215477 142630 -210011
23072 -64856 336052 -239249 177890 -93549 -57722 92614 -185081 184185 40187 -200866
23061 117378 4270 -13100 -88163 -41039 -178117 79633 -45713 -48346 198420 132210 170724
23050 170724 -30088 -1271 103074 142941 368765 -161009 -161481 8930 189341 62264 -131585
23038 -264106 105433 -185223 -53359 114354 -58413 41090 -133140 -236765 88889 180735
23028 180735 97323 -298659 50712 2040 -81868 320732 108787 3671 106589 -298056 -78775
23016 -126175 133690 -179981 -74706 206671 -201143 55925 -18909 -243699 -345112 98257
23005 -72882 -210900 204869 -32782 230100 -53676 -300532 -134253 -31415 -85618 -300782
22995 -300782 -42150 -172193 -43167 16830 -114753 77184 -182765 59144 -68752 -59343 -239777
22984 -239777 -6762 -31193 -138339 97586 81813 160021 3534 -256503 -462953 31954 -177244
22972 63486 272795 -123990 -36766 93299 36435 -22664 -60342 -62959 -361533 -50923 147688
22960 -76337 -104819 4615 103171 -42506 -176838 94094 42587 -39366 -140300 -2740 104536
22948 -79686 50113 -158773 9081 241365 20962 339670 156422 -59210 -72804 -244858 -233259
22937 -233259 -117678 152601 -321218 -38759 7340 -504167 -123370 228645 -153049 97899
22926 -188788 -195897 -280794 -148304 101413 212876 -212010 110571 46580 28694 -155784
22915 9979 -88267 -61138 -210168 -219741 -27373 -46992 293716 230919 163488 -264808 174940
22903 116473 -87212 -122927 178760 70671 118251 139414 -224882 -23065 -127183 -105574 119725
22891 237043 24767 -207224 27241 -105733 -232597 -79262 -140352 182532 321408 10193
22880 48129 -156887 4450 -252154 -3776 -84364 -289908 -212375 -93527 -309893 95619 -64014
22868 87877 18830 48973 28936 -163541 9063 30661 -297270 186874 199619 100331 19707
22856 -206075 -456759 -70896 -185465 -244832 -151593 55023 -291076 64969 -79881 -67624 -100307
22845 -100307 298814 -173581 -172112 347704 -267278 -47929 78392 99297 -133241 -289745
22835 -289745 147558 72064 -243588 -490 -24405 117304 -286412 40092 -172540 -24283 -119288
22824 -119288 -139052 152742 156025 -172421 -245096 54978 298578 -8140 -190431 -25532 -17959
22813 -17959 -353744 -215625 475443 -182248 -79101 -116823 55276 43580 -98517 20837 309115
22802 309115 -57277 -151526 -40582 181978 -8811 -149640 66814 -262915 320189 -83692 167806
22790 -237332 -2850 -64196 59151 -267006 220715 82606 -227316 106891 -49831 111931 31453
22778 45977 -152595 -801 -222796 -29183 235620 -277806 -227311 -377256 240806 223050 -72585
22766 25514 -62025 -25106 -196794 88067 357406 105359 -184465 -210562 -33667 36138 -2210
22754 107292 206934 -93665 -273983 -179300 253879 -59891 -21151 -429876 78816 -90554 214583
22742 61149 39800 80275 -34520 -158553 39103 -264783 -100342 -112100 -224549 141816 -176731
22730 150196 76969 501989 16109 -89910 -126494 -58546 123170 -116008 -109743 -115976 -123256
22719 -123256 -46932 64352 101861 -88150 -52283 -166544 -153300 234759 -92520 -353456 -98456
22707 142706 -56384 -327148 113055 -42831 28627 13466 61224 228506 -151163 -39481 305405
22695 231222 921 -156702 -77800 291851 2257 260936 -89277 -58905 -93143 -183996 -3355 222842
22682 -47069 -46436 83806 -351224 -350662 10309 -335329 -153905 -311525 -170464 166891 -68940
22670 93594 115888 -84724 -98749 224101 41203 -98033 93245 -208798 -18606 80175 309141
22659 309141 -161687 -367109 -171774 -234890 168396 -16400 120315 -12659 140273 27432
22648 93338 250062 -126446 -262909 -340300 -323669 -423995 11723 -369862 -429568 -240789
22638 -240789 181843 -186990 201407 -78787 17049 -401440 5982 -171171 -341520 -140936
22627 -83461 169787 -123286 -26931 -73024 -217916 467275 -7698 210948 -170141 -301806
22617 -301806 -6021 -255779 169555 337 124450 179515 313658 169623 112051 94042 -281460
22605 280820 230321 167860 -20232 -1884 -236400 23414 126942 -150727 -195742 327986 -194140
22593 59611 -137579 245202 136113 -52060 173002 3295 109962 -228274 -177108 -164018 -166024
22582 -166024 -69065 -63993 -172998 9671 -102765 -28318 7230 93014 142093 234508 -105315
22570 108675 -374394 -68671 -188203 34275 -65806 148765 -56757 168772 68626 -208143
22559 -43111 -16035 -83622 193733 65267 -201226 -7757 154834 -215151 -156583 52156 -46281
22547 -1666 -48340 18198 -52490 346380 -281506 -18355 -36403 -282696 66093 -295349 483233
22535 128529 -205515 -269547 -223456 74192 -2820 165909 -271415 -44894 132979 -70765 384654
22523 -110921 -226390 3353 23290 -20372 -296050 -368798 -110500 63014 -51268 138213 58288
22511 182581 -74177 -109461 23281 -150837 59532 43401 -177213 -62927 -179353 164933 -259803
22499 4575 -146720 198960 -13057 -326115 -114828 -218191 210996 53066 -87841 -295149
22489 -295149 -83760 -212677 -53304 -106921 152413 -8342 -127829 -210864 -285358 -30720 -143689
22478 -143689 -80518 230859 90116 -117274 -176107 60274 348612 -279376 -494230 68590
22467 -125294 -80749 37023 126105 -140885 -271037 -100065 113841 280827 55541 -134396
22456 163844 -113571 -168275 189027 260670 48803 -90572 -104576 -249477 134967 21391 -12863
22444 -90219 -127873 -334567 -207314 -29423 -69335 34045 1478 107444 -242661 -2442 431277
22432 51680 -188791 33895 143527 -56162 -194140 -88043 -75217 -5817 225498 309618 89017
22420 -194854 231868 -29046 -151108 -88976 -4291 -51635 -274082 -274262 -7199 -67811 -189309
22409 -189309 9922 203860 -197197 155019 -167629 35679 40083 -133528 -18821 167436 -311132
22397 72909 -75187 116206 50755 -169425 209821 -107062 -93291 -12190 -36750 -140428 -67343
22385 -244637 -9470 -79789 46630 -309338 -176368 -134949 -184155 274300 -125182 -78650 72662
22373 87018 -266275 -278390 211738 -111241 71288 -3004 -35754 -152703 -76391 47406 -83720
22361 -182439 -107964 -87672 -288003 -66145 -147078 -65241 -3085 17200 -20028 70303 -366091
22349 -96795 139926 -314613 89495 -43046 -242487 25460 125613 -28061 -14456 -5124 72769
22337 -26856 -386968 208545 -59977 316550 24191 62973 -109687 291803 53639 122117 -257045
22325 93458 161957 -239644 -323586 89747 -89013 327461 29182 -19544 -269910 -81524 -37542
22313 26189 -96777 23649 -137784 -386754 -386604 -86117 -23656 -313563 191333 -212585 -188910
22302 -188910 -89835 18584 223828 -195439 -212331 -47316 142782 307874 -187233 42950
22291 -223814 223098 -341451 -81066 182521 -238237 339966 -185805 239251 -69814 -263566
22281 -263566 -108791 -84919 -43887 -109628 -321578 404636 668 -171201 -128351 179158 -197781
22269 75172 157967 167616 -302753 -51843 -197831 82054 92840 241056 244036 -81671 -206796
22258 -206796 -230749 88272 -115152 30734 428765 24748 -152993 -23866 76129 162759 151017
22247 151017 4715 -289339 -29823 160471 -52182 -306938 -220745 41796 -73801 240916 -127358
22235 81758 125615 46546 -310130 233372 7349 293949 -231332 -269256 -64500 32176 111018
22224 111018 -44535 -272932 -26760 -105205 358256 201817 -107608 -65286 185282 -93312
22213 254850 -91287 -96151 -360490 -83552 -21870 -148104 383848 106342 -4491 -184164 -72376
22201 -83715 -101116 -81991 -158947 213966 -142615 -14345 190216 -73795 -41011 -3398 -2262
22190 -2262 -2895 -242412 98151 74057 -78064 201295 157129 181958 -226425 87860 -383581
22178 -156294 -148864 156220 11344 -78488 -227999 -341732 -216895 146855 -77839 -212483
22168 -212483 -218199 88137 -56384 95601 -49083 237124 -283163 101146 333864 -197187 -131102
22157 -131102 89074 110394 -193081 185086 -173164 -115510 -70543 266891 171406 -163635
22146 -189090 100673 -228527 273376 221302 -26754 -12234 -63029 29536 -198093 -174488 -49383
22134 82252 -234900 29226 134305 -16686 -60760 -101730 -179336 44229 973 66312 71167 -203859
22121 254883 32921 72385 126535 -128572 198360 61590 187538 -243572 180404 -25003
22110 -229436 -165451 -324915 -315606 -247901 124527 114851 7478 38423 -253783 -75122 -253337
22099 -253337 -112557 38458 -25283 -147523 -9312 -270306 -129896 -23966 66449 -21075 -151548
22088 -151548 -143786 90923 -174683 -240637 -271189 64270 -64649 -41473 -182018 50003 -266263
22076 -170126 71028 193404 -27327 -1619 -72319 273944 -86912 -180598 -130258 -360871 44987
22064 -107871 277168 -291280 73856 -29484 41117 281511 86602 -16858 39628 172274 18810
22052 -222638 -279893 -114692 -269790 -46078 149044 -98734 28031 88574 35317 -292972 31388
22040 -100964 286179 -186218 -136621 167847 2059 -114667 -211970 -162261 -8525 -67553 -114995
22029 -114995 9616 -69420 -107054 -210604 -87324 -61182 -47439 -182349 -92237 -30767 230421
22017 -7389 -69528 -396343 -96607 -326446 47273 122134 164946 201488 -265344 -30574 -161430
22006 -161430 -18330 143804 -237091 34608 -38860 135614 194100 -145364 -168622 232623
21995 -54471 67713 -66944 186992 -386725 25096 24374 -361849 86571 224966 11810 -132436
21983 -128136 -217018 120940 29190 -206115 -26528 -104677 -96620 133505 -264743 28192 -28575
21971 -417748 183371 116082 -13815 -274749 230016 -117667 23047 267021 24830 -31159
21960 -90074 -195516 -146745 -69988 -72336 55527 -93519 -125858 -184791 91046 171848 65384 242587
21948 242587 35440 36715 26454 -33604 -306931 -221830 -217284 75416 -64199 -177945 -132700
21937 -132700 8675 24554 -336319 -72511 -135348 33257 -106867 330206 57900 -117099 -116524
21926 -116524 -163612 -143492 -224378 -168701 -205772 18176 -177012 -44916 522 -95860 -170523 -48001
21913 -85697 32192 -103768 -245968 115753 74426 13187 81155 -99962 -61356 155805 -5388
21901 -142464 -270465 63218 -271632 -195534 209753 -281192 -108754 -155828 66704 -70529
21890 -133616 -205972 -58870 28998 -243499 25328 -289852 -158803 -29528 -209021 63717 -54276
21878 -40374 7929 95760 -27405 198917 -177215 -220626 -365257 -43741 86405 -108393 -268169
21867 -268169 210048 -423587 15653 -134726 47433 -74926 140405 -39050 398405 -181171
21856 -30641 156143 -95286 -83840 322722 133394 199069 191464 7195 -420305 -99043 -257911
21845 -257911 63251 -20436 21435 99139 -230076 15433 48811 15379 74205 -251400 -83402
21833 149974 229310 38706 -3996 464384 2206 188643 -4331 -86989 6746 272984 12054 25061
21821 25061 -217144 -55534 -215941 -42730 182594 4623 199395 84925 -210394 -58130 -287897
21810 -287897 139971 -180096 172220 73570 -171867 -236925 -95947 -38857 -346226 73477
21799 -102109 35444 -43036 -71918 -35279 -89528 194606 -447239 11024 -560926 -347078 -232379
21788 -232379 143150 -276824 7590 208509 100466 -82940 -22272 10218 233552 -51524 155422
21776 -126173 -176098 -72358 166607 -8198 157102 -68034 276590 29301 274296 -55283 179709
21764 -6002 295684 6151 -77433 228575 285857 -43746 94831 -37460 146543 382781 -73009
21752 -415208 -96715 -138709 -42300 -30708 494 22934 -99019 118461 241935 -111838 -231042
21741 -231042 -55209 -50416 -74426 -69793 395325 -48162 -34190 132454 137489 -175979 -281945
21730 -281945 -230286 -212633 59063 -54350 -127681 -208635 -25625 -205169 -33489 168919 -52637
21718 229783 -196767 -54311 -72222 99245 131676 -267416 74692 45568 -285236 83777 -111085
21706 -466011 -112618 -24670 -367508 157694 -118290 -282762 -92402 -110026 -26228 -8752 -4278
21694 -57103 -224349 -117873 222922 148995 237481 -317787 5774 -126644 -163310 -141374 -19813
21682 198911 444 128342 -89466 -82086 13324 16008 36662 186817 64891 78957 -236701 -410721
21670 -410721 124527 70544 55192 -152119 69557 -124462 -65772 144462 -83532 -120046 31346
21658 125789 -197358 -253353 149923 -51150 -54997 -228146 -213581 -32678 -217531 -480673 1677
21646 -18091 112671 221409 28659 38974 214087 99764 -111737 -401814 140895 -347011
21635 294520 -211162 48771 249877 -93604 74903 90839 -229751 -90800 -249434 138619
21624 128088 -161479 85787 -418932 -160550 175566 -392227 86295 151113 -246555 -44938
21613 105138 -227949 -178833 -27678 -106359 238113 32073 153812 183572 25379 3457 83271
21602 83271 42593 -288101 -84212 -46996 289854 -50042 -19687 -231769 -92877 139868 48913
21590 110728 296879 -112130 -301141 144739 -142833 -302375 -156353 199787 -53191 -83348
21580 -83348 52883 122726 -282913 50077 -181887 65643 -101392 -154972 -137254 -254436 26689
21568 91685 -14637 -292119 126713 -199327 40024 -64677 -203740 -74843 279179 223202 -174224
21556 114071 -57531 -46076 -215018 -171984 38807 -70544 350851 82722 -56775 11425 -74625
21544 112938 106023 -51979 221895 -203321 -14603 -102569 44231 28795 -112152 -130126 -275502
21533 -275502 -152144 191747 -77352 158843 -14714 -560840 -159391 3679 39545 -345310
21522 192901 -110598 161410 -23476 -29408 -307177 -50125 -68866 -295410 -190549 216809
21511 311887 -56271 113649 -63832 13814 304398 -232116 299201 -41879 -3266 76806 63265
21500 63265 -83083 -5893 -381358 -14746 106840 93869 -273349 -107200 -112281 189130 -44602
21488 -201685 21025 31459 161113 -207378 -68997 309386 148250 -144521 163513 14782
21477 50207 87407 -8335 178805 -300355 24275 -27523 79632 75384 -293527 -204348 156163
21465 23565 -245803 207158 -175600 -151896 229510 183311 110555 9689 -73401 51227 -33562
21453 306665 -263366 -195555 123084 106777 -177813 -287740 276842 14335 218301 36562
21442 242588 318935 687308 392061 84979 -152872 92853 120407 -92344 191944 116790 -51950
21430 5007 -228900 58272 -315905 -377361 -101292 -64336 -14811 -43702 260839 -12509 -62604
21419 -62604 84764 254950 -57603 -130411 -241709 -22097 93972 -98794 129796 -88403 164888
21407 -338588 41689 -74284 -189199 -54486 -30792 79215 -278968 141048 -165815 -317590
21397 -317590 21689 -170166 -273052 -273271 -106822 -112686 -194051 -269174 -137808 -295927 -28138
21385 -71946 -12597 12316 -20043 157825 -164255 -339011 -53544 87417 -163927 37542 107117
21374 107117 170497 -99049 -423973 -127387 -19138 -102664 -72515 -116370 -48841 -88729 20427
21362 -164401 -58900 74649 -146994 36504 -367943 -66586 -112880 16696 -199511 5419 159913
21351 159913 -361743 164040 -96819 174822 17265 -12230 -172763 11460 306205 -112690
21340 26811 -346816 259593 -2056 -139883 -215837 53383 -179198 -16483 158382 -99021 -138557
21329 -138557 56330 -75464 255267 -123336 146256 -32560 139304 410070 -220839 -303460
21319 -303460 -157004 -145255 -176380 95977 465499 -309266 60609 -23183 -210359 -125856 -116511
21308 -116511 -69423 -119664 -235090 13488 -63561 63592 -111148 -176137 -26651 -300456 45441
21296 5656 -117321 1669 -329143 -175384 343420 -1535 153477 158656 -316261 -89059 -376438
21285 -376438 -15651 -312385 -10764 -272013 -265671 -170681 173652 60955 -89805 -238115 -198627
21274 -198627 -216988 -99300 234053 204757 84640 -326939 37135 -125492 14521 -67439 -31190
21262 94005 133740 74836 8677 -69407 -272237 176645 -124547 319073 -118379 -215898 -307807
21251 -307807 113880 178019 -223314 249741 -226268 319945 194224 -199406 -14103 -48203
21241 -48203 -79251 -168532 153470 3631 88044 -142725 211023 -26761 -193109 -18225 -107956
21230 -107956 20926 14436 -17286 -64787 -143624 -100104 102463 304806 -109993 88540 -32947
21218 48075 -116791 -16653 75253 -46491 47122 231933 -30141 333197 -258838 144129 -374516
21206 -347147 288647 45284 -132982 312576 99147 389785 -157889 118322 229111 -493621
21195 -160595 -152611 73556 -378054 -69010 -104697 -269151 -36585 142703 -126581 48909 211715
21184 211715 180062 -70750 -37670 -215924 14522 75085 -118256 -338828 -180913 87097 350534
21173 350534 -142432 -96571 427061 -125969 -54044 -286655 -8146 83349 -299491 -100698
21162 334008 -42543 -147859 -311123 100745 126267 -45924 -198533 9199 -137958 -226417 -196319
21151 -196319 22520 -483587 102280 107362 54915 -134461 102124 41564 -49909 -24337 156960
21139 -311701 -2396 180550 -188402 31825 -79233 307255 83212 36513 -182679 -37291 5551
21127 112212 40643 36317 -68042 152742 -181906 94165 -298092 -142185 152655 -220353
21116 118216 15371 226431 -106530 -237262 129200 21468 -116566 -198953 -25293 111827
21105 -38129 196381 43160 -488287 -111877 -606 -329683 -124613 3811 -124954 -15136 414
21093 -131368 -110375 209534 -27773 -127450 -153347 120723 84259 121791 127678 -269785 -16978
21081 -65576 -392372 -64110 -152486 -133238 -208598 62301 34186 71399 -7537 224058 -171673
21069 -257705 196819 334263 190691 185549 -61413 -66878 -239151 -286950 -515448 -63908 -71500
21058 -71500 -230494 -204039 -223861 -3702 -260409 -163502 83621 -86787 -195526 -77830 26715
21046 -235807 -388664 332934 -60005 -37970 -272572 131354 296434 -36157 -122529 43039
21035 -232963 -137189 66030 -74384 137294 -115237 262846 -182345 41128 65098 25835 -55088
21023 76052 -79300 -391042 -246643 -196541 181890 -99786 -395903 -23955 138075 -13856 13659
21011 -151723 12210 123118 43574 55422 -260714 97246 -105134 311395 175478 256614
21001 256614 -289780 220653 67644 103707 67871 -144785 -201065 100444 -184678 -40631
20990 11416 6934 -24769 17572 -42669 57570 128980 -61806 110246 -26277 51700 84672 -217994
20977 -280984 -222973 44061 245547 139753 104380 46656 -62539 -189845 -162179 131737 -4885
20965 -11298 -243337 -86126 136693 98446 -282544 -42078 -66307 -94365 58756 176145 187109
20954 187109 -104025 -503443 37065 -34926 -70451 -82077 -96806 -56057 -214958 -144995 39350
20942 -150269 216338 -135130 186720 -27315 282990 353674 193667 345162 -41595 435790
20931 46788 153763 -246105 -43781 -332183 115945 -279553 -152192 193701 136343 16391
20920 -46012 -125330 -84259 -165940 -71590 -151315 -130061 -117411 -140722 -333661 -12876 35207
20908 125748 366773 -285643 -67066 -199780 -174754 -213763 320831 -186338 165118 -27005
20897 -241517 -217662 -479099 -69001 -299414 -219389 -196084 -272798 -473749 -152329 -36159 146757
20885 -54988 23894 118161 -4646 -7821 -186976 106473 376794 -118680 113612 344772 -484626
20873 55810 -121613 -135674 -267855 -19934 -161689 -155863 -22785 -159168 -130065 -203572 216853
20861 15377 -83032 -76318 -48826 253318 -122267 -531019 -123987 31602 -280972 -247070 77485
20849 -202019 151369 -75397 -132330 -124989 127997 269953 -156477 -13756 -216451 127564
20838 146946 -119173 -70133 -16282 191791 -55874 139654 -332687 -151745 -87967 -143621
20828 -143621 -120006 144692 -87038 90615 77756 -113405 -403666 -75087 86646 -58445 101935
20816 -283996 107340 -103650 163120 -317274 -174614 -19466 100210 -187371 -167961 -17813
20805 88808 -121320 -201324 -206926 114709 -85095 -19783 -17169 263740 -3972 96602 168711 -217134
20792 88136 94327 129135 63331 -241215 23822 -189115 -75251 -46214 75121 64535 213258
20781 213258 -26447 43661 22462 117281 -294650 -102687 -49765 -178564 -96112 136971 26681
20769 -23427 -160997 -7121 49544 -165587 -125269 63899 -134801 27392 -104079 -204372 -271777
20758 -271777 278031 -66472 -59764 -108166 -273893 78190 -181256 -215332 114065 218014 -125367
20746 47799 -18021 -206978 202605 12799 141064 163903 -4213 -157938 -173067 161033 324363
20735 324363 -95929 169028 467784 -405030 -19104 -408495 14186 -360569 -396405 -80586
20724 -306118 -2444 -76678 -284063 -21749 -407094 -101971 83687 -56113 -16587 -63719 -68175
20713 -68175 -289136 -227595 59486 -101870 -429305 -156526 230075 29926 238176 -245292
20702 51236 -188010 155601 189625 239139 -110977 -162165 -146110 90761 -76016 182360 327676
20691 327676 -176690 231405 -199357 -171758 -76732 -294164 -431807 -22332 48319 -207679
20680 -150329 -42150 -57709 183557 -240450 -343588 -235985 -10584 168111 -128638 35171
20669 -86903 329630 -3739 -55641 53991 244915 -40671 4534 -25346 -50120 -60930 21028 -195932
20656 -120660 81828 -133915 -135902 -160870 -354395 -35744 -24067 113770 -261118 -240832 -76457
20644 862 -23131 -22886 -217198 106598 160170 -269929 231284 185219 -365337 -95073 -44537
20632 -228373 -257160 -124320 -152106 -47808 -219138 -39547 82856 -175058 20165 -226426 -206970
20621 -206970 136632 -88390 -403 -254233 273654 -307204 -27059 164327 43512 -8548 142819
20609 -180468 -121661 -102214 -364098 -123590 -14570 -132046 392351 -372072 -329048 -232772
20599 -232772 -71633 245460 264734 -181133 -204502 -39080 -11642 182250 417038 1915 234275
20588 234275 290494 40198 -1444 -100229 25067 10725 148398 15197 237944 90508 133552
20577 133552 110822 1208 -55789 242201 -13673 354837 -150160 -35790 -141762 -67374 -77677
20566 -77677 149438 86083 3038 32219 65979 79171 -185483 -25216 -46382 -216296 29688
20554 -144205 -112144 354902 131538 -122299 -120317 -9206 -80868 206101 -260152 -35143 70721
20542 -157410 -113476 125265 -118426 160946 -3028 21350 -139678 -207750 -139092 131378 -252857
20530 -59345 -331470 158027 -321298 -106692 -250377 -131760 -309608 -197921 479131 -380454
20519 -205256 208694 142969 -121451 -95758 -85067 72345 -179875 58563 66571 -134148 -327388
20508 -327388 -143661 -137136 -345929 -313397 63666 -262400 -176122 14409 -103090 64052 79787
20497 79787 46359 -382122 -14454 -99264 -245219 1396 232527 -259444 -127839 -81404 156181
20485 -189745 -11036 84584 -304311 -241643 141263 -231784 -18226 -320779 160859 -259936
20474 -27283 -277090 -157777 49623 -98836 108315 -151263 52249 -219475 -180954 122858
20463 69703 110265 -192015 -28303 93645 159791 -65483 -77111 -55551 -81367 -224143 -33205
20451 29777 -233983 -223664 -183871 265881 -19901 -388127 89789 -212065 -269985 -312352 38719
20439 -71924 -293421 -193483 -220889 -220977 -314992 -377797 -177768 61195 -160020 -88066 198530
20427 -372045 28690 196656 95897 163673 -102750 -85320 -96138 -5094 -58849 314235 -185146
20415 8722 47306 80228 229174 2618 -78450 -179037 -162189 53233 55646 250734 26517 256425
20403 256425 95100 -196705 94797 -204664 -361715 -400713 303725 -261563 193959 -70587
20392 280323 -82647 69535 92980 107305 -189232 -180039 -247948 -176024 -226375 213458 3913
20380 290427 -80296 -210444 -57421 -11471 -145242 107090 243449 -137078 -114109 -13359
20369 -113290 -104570 -162867 -240040 209398 -254284 75289 43870 336755 91764 -103539 -15854
20357 -60034 -14809 -70232 101446 23225 -36328 2590 -89509 -130142 64677 135864 207785 7813
20344 -43295 144384 -32133 -103726 188183 301910 -94751 24990 4109 114701 -353164 84584
20332 249952 280221 -67948 -235245 -8570 60419 13134 -342304 -134620 -135994 -130213 197204
20320 -27534 -69311 -19744 -178341 26836 -204699 -94656 -200617 -334218 -195825 -39773 166159
20308 -95297 -33825 -169862 -397142 -143052 -91910 48886 -247637 -257889 -87704 -229208 198207
20296 -430619 324328 -272123 -58060 -97723 55598 56541 -326876 -110164 -197154 141268 63898
20284 -171174 42144 -257889 22760 145347 23983 -19695 113368 25659 -3997 157238 103128
20273 103128 -199776 62449 216097 -309513 -201227 -91616 -25429 -79546 160337 -159053
20262 4870 -170206 -138911 212762 -141132 -123588 -138169 -415165 -71564 -97734 -231173 259285
20250 -173093 7043 -121328 -80992 -104491 -228317 -8368 -31615 -243109 -101902 -31820 -122318
20239 -122318 -77261 -26536 28415 -277308 -102069 -97393 -151782 -187147 -163469 -128433 -313761
20228 -313761 -187791 -293400 -272444 -30608 -165315 -41387 142858 192647 87792 105190 153306
20217 153306 -157756 112060 128350 -186473 -349922 129618 128201 50063 -63494 -106241 108556
20205 -95937 -246668 -325164 -208017 -229358 -19653 -179925 79719 -223673 96717 -287101 -47180
20193 -126458 -124666 -14729 -222774 15342 51350 29379 -123746 -139808 -50261 61383 204935
20182 204935 -215294 -76081 335014 -71679 117867 112324 -105805 -156122 -137054 122785 263120
20171 263120 68911 220888 -57363 -271116 -269917 79727 136065 24277 -357433 248923 219792
20160 219792 -218822 85701 -63466 -276689 -34450 -68170 74898 -61738 -126174 68165 458899
20149 458899 110276 90120 131357 665254 89085 174182 49828 178909 125609 616753 -110469
20137 330328 37143 51069 -83222 105865 -131470 197231 -313988 246943 -228717 94834
20126 43569 -212030 -122535 -35788 -249491 80848 175591 -190284 -27409 121076 158397 -217810
20114 -133842 -120309 -49323 38165 -241881 -68533 125194 -293123 -12799 -130722 74505 197786
20103 197786 -105471 219183 -170543 -83659 -50479 -317127 -123163 56175 -125678 -241465
20093 -241465 257867 25404 92249 -25773 -331242 -101665 142325 -99469 140963 189884
20083 189884 321956 -9776 -144561 -156594 29712 -105840 102032 47849 256816 59780 52916
20072 52916 -144994 -41859 -12020 28921 -130831 27596 42211 -225371 -422157 1900 -155513
20060 -111524 44062 -175914 97892 -21201 -332053 -185900 -138295 -4907 -158467 123336 -440834
20048 39100 -135003 -242840 -105090 -3413 -346175 -166312 239361 -399332 8794 -297145
20037 112284 -223721 -28119 -220521 -221181 95338 78646 -20115 -95631 -147602 -188694 35939
20025 -245997 -41908 129887 -63788 -121826 -137782 -194826 -85349 -159972 -180596 -4564 -343701
20014 -343701 -246306 238032 -576299 -97230 77877 235945 103374 15 199287 39034 -88612
20002 -192531 -311389 35390 208956 -110121 63629 251655 -149957 151098 142960 222527
19992 222527 -43255 117996 -85229 -63397 -124492 -32197 14012 12669 368059 -169478 139907
19980 -161026 -31139 -244145 252642 248713 23592 93393 265106 -290689 -198501 50413 187958
19969 187958 32028 -302279 -376200 204268 115386 -185706 54787 -258836 -182938 -129797 121104
19957 -190869 120383 -236971 -167162 -135984 -317842 -31773 165845 305163 -161227 -186640
19947 -186640 -320177 76718 -80747 -22544 112370 118431 72732 -161679 100851 -23200 88381
19935 -162181 103651 -162996 360546 -417091 53283 135044 -94136 -10308 73252 312636
19925 312636 -315953 -9062 -37553 105706 -222220 -82253 -249251 -24599 119220 -163837
19914 -230319 23823 -356292 -312562 -300398 128534 51231 -196345 442657 -78506 -389310
19904 -389310 -74821 185268 -161038 -146625 157664 -158973 -218218 -115354 -102523 -220635
19894 -220635 -40360 -191317 270122 168011 -57864 61663 -147262 177023 35084 -162192
19883 33183 -211600 155278 -204069 -27204 -99641 65564 -84983 32773 131233 -208506 11028
19871 -99321 -360338 -163534 -94475 -89998 26982 -268350 -273946 -82814 88824 -178607 -95685
19860 -95685 -317525 58529 39292 49882 148805 -142092 -19087 -99376 287838 -164003 94573
19848 235814 -179055 20237 152667 -72856 -320751 161036 -403732 -181830 -63928 69734
19837 48506 13180 72962 63533 -23108 -25839 127726 100730 -22326 -147916 -80676 46951 -96169
19824 -25947 200810 -122859 -191725 -242074 133550 128709 -112992 -271496 149125 -31000 67661
19812 18390 -161866 -267045 -6102 -32722 -85805 -75789 240328 -289001 -106400 49035 62373
19801 62373 -444237 -7831 -33840 -391355 -141658 268567 397938 -125542 -137744 -187041 50768
19789 -319334 -309587 -226941 27870 -238276 -394666 161523 93690 99589 -187190 -24255 -121961
19778 -121961 -96665 -115450 -66436 80359 27282 53675 -48336 -149473 -23985 197292 167318
19767 167318 -156154 98906 7794 -80720 72720 -54011 -241 -325002 -354382 -149665 -278020
19756 -278020 -110577 -62164 -385725 11001 210586 -83013 219385 -73461 73536 -179487
19745 -37234 116683 -93381 392414 -121745 -377236 135716 -145225 194723 -24761 -155740
19735 -155740 15149 124325 108991 159347 79377 298979 107120 -202812 -191429 -103602 -274822
19724 -274822 -129061 -287292 -329721 -262295 -312428 318508 -41963 -6292 -26372 -191762 79107
19712 37549 -69282 -69429 -226378 -13954 -215820 88231 207947 -6624 -240182 -68198 -28545
19700 -36284 225654 -75940 352849 202543 226137 49016 234063 133842 -214974 44506
19689 -244814 34354 -482206 -196782 87972 -11155 -48688 -115944 76707 -340801 303938 18677
19677 179691 53606 332956 -34184 -18737 -157153 -73387 -223546 30856 -310505 263718
19666 28349 -280566 4038 -194850 -475402 -226371 -79899 14073 124846 -346007 20943 -149357
19654 3673 152560 197267 -66198 124477 -213265 -28920 -194023 301381 -37428 -130745 -55799
19642 -58200 140797 19748 140734 32294 99678 138447 -134856 -78722 -315793 -58318 -226928
19631 -226928 -32730 -77866 -153245 -48109 -90741 150886 87860 -102800 -128864 -68831 -185993
19620 -185993 -84225 -151228 -187622 -158292 -49382 127570 9534 -196270 -72513 -79743 32151
19608 -133212 -62454 -214513 33724 -9753 124382 -280902 -35335 -29375 -30927 -152507 -118859
19597 -118859 -74580 268835 334657 -178389 9119 154967 -129999 70914 -78808 -232091 -35282
19585 -325180 -133322 -124388 -292564 -119371 37132 -186509 -58298 -159748 134684 -270924
19574 -79239 115464 -152419 176885 297398 -245790 90845 134171 -356585 -151693 -27987
19563 -292111 132331 191366 -262927 -183786 -76716 60089 22353 -197154 -138328 -1721 -148815
19552 -148815 192547 114461 -156717 -277105 -196934 -111263 -272559 355802 -193679 -384514
19542 -384514 -196405 64508 -127485 -132795 -3005 -194888 -89597 112170 -216037 -147041 -222580
19531 -222580 -61912 -59795 -110782 166356 -334456 98350 -214337 -173851 -287504 -35844 8718
19519 -171020 -433717 -356660 37951 -419553 -55878 213801 -133650 52637 316044 273574
19509 273574 202387 -123513 -57718 -58928 -226530 1424 34568 -296078 -192457 -305734 -112795
19497 25274 -96496 111921 -84388 -357223 -152146 110729 51984 -14085 43610 -425034 108463
19485 -371960 272231 -38125 -115014 -168353 -30208 -331402 -27947 -174018 -168843 -280507 38612
19473 -32706 199930 -346797 38030 -376189 -126474 -403108 -112718 -122839 -222217 -159046
19463 -159046 -125302 -20626 -213865 62028 -396799 -163992 -48816 -56235 68007 -99328 -152314
19452 -152314 12208 -22801 85641 52808 -78371 -331717 -66360 -24977 -67083 -368167 13935
19440 -270471 -73652 63984 -104600 -7310 -178938 204179 -5603 -26361 -133659 -204196 -17516
19428 -154175 72716 -139585 3050 34037 -119417 -114076 -577155 142657 -294446 -122183 -79591
19417 -79591 -22688 202556 -139093 149610 72597 -79250 8482 231895 -149127 -184620 -88882
19405 120295 -121074 -24801 -121356 -195168 -40562 -412615 -13420 374895 44592 -52323 97965
19393 -240856 -39901 30462 45652 -65617 -109699 -74706 33345 251994 -383488 -144748 -184945
19382 -184945 -105468 -120424 164038 216960 123041 97613 84700 -144813 709 125901 -46338
19370 -109309 -377755 35234 -27514 33330 31906 86167 122952 -244430 -95620 -19893 -69892
19359 -69892 -34590 -91167 -102815 62439 203297 157823 -59025 -280013 -456995 -73152 -340692
19348 -340692 -5413 -28919 -110194 -146504 280803 -171905 223308 -54654 182907 81051 -116628
19336 -67868 -267202 -201140 -242980 94519 -257702 -265990 -240249 292932 233036 -96740 -281022
19325 -281022 -235830 132749 -684636 -60157 105317 -69927 -187992 -195633 141202 -21674 -110925
19314 -110925 -28131 96907 -71383 -106325 106655 -64484 5687 86561 -134195 79593 -236345
19302 -146042 324186 -138245 -64775 146077 -375070 -337344 -342166 209738 10182 69173 58062
19291 58062 -9215 28196 -60230 -174459 6748 -98968 65492 -41284 114820 -87044 92413 -57544
19278 -124808 -136120 65762 -158505 8371 12351 -136060 94851 146904 65809 -61723 -245869
19267 -245869 21568 46705 -206334 -254258 -35553 -208883 15533 77077 26544 -458217 -208510
19255 46355 -384633 -60716 -20062 -154192 -38840 -159664 50032 36323 -153638 -122483 -162596
19244 -162596 -367842 -113129 -231428 -48065 -55113 -150934 -268096 42540 -179722 165453
19233 -152197 82035 -199064 35785 -163983 175311 170852 9806 -49472 -357483 -76209 -19709
19221 -382677 -82050 -497555 -214808 99340 -260897 -46148 -462244 191987 173236 -253431
19210 198114 -219658 128730 61565 -317080 -77158 92787 82360 141270 -241735 -139571
19200 -139571 -188123 -324685 -136627 -239463 174767 243446 180984 -347633 -147540 -39429
19189 -253476 129832 208216 -266226 -110426 125468 -108448 -422992 -7840 185612 -373859
19178 19665 -245348 -227281 169878 -116406 -312703 -14559 -341003 -10828 -28384 -168063
19168 -168063 -66374 -219395 311455 -66158 40142 -31041 201728 -4714 39470 243360 -208832
19156 16245 22250 40360 5971 -387817 137311 -362616 181449 -71435 326953 54199 -174854
19144 -270658 -114072 -196541 -318011 94475 49536 117254 -179529 13098 -268548 35171 -244389
19132 -230024 -323034 86347 -160427 112941 95768 -274877 -77426 -80527 -126240 -146170 -130545
19121 -130545 -37143 -23951 157236 14172 318291 36553 -71777 -140482 -52928 -90713 -299911
19110 -299911 139337 49890 -174392 -279964 -42917 -133914 -396049 -316352 -186841 31432
19099 -159018 -37980 15633 46631 67800 281047 -69033 -216465 53350 -170832 36298 -151531
19087 -7186 -27913 -110742 -97712 86965 -12129 -106986 -306696 225958 -455916 270093 -106038
19075 63979 -342668 -56208 -361308 93432 133324 -169902 385145 -115469 -220710 -72411
19064 -199327 -144987 191887 -82594 54584 -276096 -9967 -52637 5027 -150751 137448 -202793
19052 -233061 -193006 -44222 107796 -33814 -8247 -84856 -37048 -247501 -90877 303224 -148164
19040 183649 -242947 -125946 -90566 -103918 275013 64446 -173688 71970 86254 271999
19030 271999 -130427 18687 20880 -96537 310396 -59281 83042 -229150 -173757 -24931 -90313
19019 -90313 -85273 -143423 9139 -230369 -59025 -368867 216777 -185341 105672 400628 336601
19008 336601 -367143 50686 309936 -40496 62494 -268085 -203382 -256531 -122559 -176071 -345684
18997 -345684 -74289 25612 -68839 127713 -47367 -197632 -11388 -251524 -448737 -4094 -106733
18986 -106733 -52519 -35722 -238432 -180811 141561 -145207 143655 12819 4692 63941 123005
18975 123005 -106048 89661 190533 277047 74536 145405 -37786 89104 200165 172525 -47457
18963 12306 -136234 -1992 166778 64317 -282921 219928 -167969 -75748 -59915 174212 -480755
18951 -138082 -42811 104973 -349576 -142849 48841 -173570 -213339 94047 -53256 -155063
18941 -155063 167193 -67720 -128188 58832 173716 9374 -66073 -118853 -140350 -142653 2834 -155258
18928 95643 78546 -42694 -112001 -76279 -210885 199297 -164386 -110560 16835 -365478 97162
18916 -381977 167076 109814 69826 40285 86036 129854 -78276 -59190 14156 52937 -60506
18904 170797 168102 399105 -24695 129636 138266 231187 -116433 25342 210738 158721 363371
18893 363371 234755 372508 -38516 180559 6821 134986 -63796 -213849 -413259 -41952
18882 233912 -122908 -64953 -10459 -218334 -116304 -276768 -329180 59748 -126521 -146861
18872 -146861 -168341 -250659 -54341 139148 325206 -15748 -432694 -248723 -209042 14453 210503
18861 210503 -116377 -155475 -284561 -107411 -60058 -113452 -267387 -51837 -39209 -24713 -441551
18850 -441551 217928 142852 -147054 233338 -64744 -73895 -25566 -123552 -168385 -51760 -184638
18839 -184638 99504 -151578 40615 16688 103759 -219751 -153347 -151230 -9584 -191649 38263
18827 254943 -245065 -199016 -40882 -15975 -280423 47948 -392280 -122979 116449 -121852
18816 -74034 280161 70787 -118741 -545055 -159351 -143157 282289 -2705 -85414 74511 189053
18805 189053 -36290 -14376 58221 -77986 -97246 -230399 -138335 64752 -111366 -132472 -8406
18793 129704 97392 -50545 -43605 -98288 79428 -17293 30424 85742 -78657 312514 -13029
18781 126434 -181428 -94343 -406243 -66433 -25379 -126744 -32350 251670 51521 -257193
18770 -138920 -3126 -221642 351001 133265 -70665 97510 40306 -47872 -152852 112574 -46284
18758 -413314 223203 -86712 -38021 101601 36567 -319765 -386334 -49087 -117785 205034 11601
18746 62044 61537 -44496 -88066 53221 -18999 -15602 -223334 -74264 -123019 -64247 -212369 126828
18733 78863 -157676 -223081 -66711 -350197 -58826 -83195 14034 -232332 -78468 141512 -78999
18721 187555 -53524 218598 -11089 -305202 -134429 -356721 -141118 -51126 -5871 -48887 134140
18709 -40325 132072 -36884 -124882 -235546 48879 -145993 228026 43319 -322282 97919 -38159
18697 -181609 361446 -137584 -126850 42065 -138160 -337103 -48825 -42729 25560 -272387 -110909
18685 -171327 36920 -124093 456531 143301 -214344 1513 -271200 -60068 -22144 152146
18674 -51083 -44616 -145230 -31832 488478 -235347 -164036 -51094 8533 84041 -246453 -11038
18662 112924 180650 -125426 -180212 95285 -332948 18377 -73618 -33003 245455 132155 -53519
18650 -79725 -336611 -110535 -8273 34786 102789 -206919 -57860 -68902 -42352 -115075 -202484
18639 -202484 -80611 -140339 -243507 -27273 -100084 -238174 80314 -166400 72830 -15715 28079
18627 89447 116631 184794 147344 34019 -373760 -69339 -131296 -256189 -144545 -233448 203403
18615 -111159 -22589 -279820 -266302 178934 -131374 778 -78449 91093 -135380 21862 -95805
18603 19885 -99492 145059 56549 178116 -120279 -198540 563263 -207065 -106354 -23218
18592 254 -127608 -55810 -299792 -163696 156888 -136451 -103438 104278 174043 56382 -309606
18580 -173365 203061 75140 48063 233413 -137525 54488 -131753 103515 -237393 -101706
18569 -226844 -24290 -102750 95194 127500 -294797 -109525 15803 -75833 -77548 -275764 165480
18557 -332182 108877 -12620 -40906 81266 131966 -13428 -185948 96574 -148723 -115844 26614
18545 -297853 -145794 64151 216943 33525 -312863 -148441 58159 -60268 69940 -113768
18534 -294428 108489 -53997 23555 166449 -4437 -118404 -236073 -86311 -104694 -271452 106718
18522 -175140 -347823 58994 -324186 -94294 -20745 129270 -73503 -93676 -524476 157613
18511 -238813 -64028 -244203 -56633 -38458 -149717 114723 -39095 286747 28414 20353 -136107
18499 82862 104946 224048 -320910 145410 -40629 -42313 -12753 11153 -51573 -88531 -171822
18488 -171822 -184153 137668 19535 34304 7973 74158 -134860 -228065 -173119 -338373 19221
18476 -181501 4071 83746 81285 117858 -283021 -84691 240199 -6403 -70988 103629 -24215
18464 -86611 94425 60738 -70169 -64618 -159918 -106054 -132912 -41834 192129 -147339 -107183
18453 -107183 66947 -92574 -4888 165093 102860 9649 -166650 -133436 25891 -162902 -267211
18442 -267211 -126861 221273 103608 15064 -237762 72225 -83992 -241149 -68403 58133
18431 35240 83520 -47707 -94337 48971 309068 11174 -85569 29852 -209546 -281723 -171453
18420 -171453 143284 -107219 -137439 180153 -164866 -108276 59306 -165519 4017 -177229
18409 -23247 8124 16828 -121322 36916 -230933 -174018 117256 186870 -265744 -207669 -119431
18398 -119431 -85354 -153855 63473 -27306 -4622 91446 235146 -270462 -192078 -127372 17262
18386 -166752 -176862 -180139 -31513 322122 -147212 -144955 228903 -66033 -241204 -93276 97662
18374 26583 106160 -416204 39353 -340603 -334963 51316 -116524 20286 -200117 507672 72499
18362 -45496 -147449 47201 -111956 256856 99096 154967 72584 79878 -94996 199541 54424
18350 -91484 -11304 -63176 144536 63480 230360 113315 -267058 192174 -198697 -321401
18340 -321401 -130409 -151011 -303803 122134 77166 176239 56806 -121142 112202 56146
18330 56146 164909 89008 -125949 289743 -129913 -336101 250985 -307126 -195387 -122272
18320 -122272 41975 -54198 -40453 171422 125716 3591 236648 -59976 30384 -284690 1666
18308 151544 -183611 -52218 117421 281170 243159 367484 241255 -438094 27679 -196684
18297 -42450 160733 -242217 -17451 262557 -184011 266821 -94150 281642 -101120 -16273
18286 -123184 -92243 4728 -116319 -104573 152876 97923 264416 -76434 -71474 122071 -220333
18274 76887 67165 -209941 -126411 -81172 -117351 -175857 12097 -257635 -67790 -285153 364488
18262 155565 142500 195511 -82367 -209342 -70630 -259638 -130798 37416 100027 180418 -85809
18250 44119 -183735 -138867 -98048 -98276 -75487 -183459 118072 15938 27237 -298970 48784
18238 -4003 -316891 -233158 132056 135150 -196089 -51298 -146829 -192942 -441712 286620 295348
18227 295348 -112844 70104 24983 106562 -111682 177468 -87921 -95861 -117881 -37391 -84181
18216 -84181 -325625 209494 -321306 222668 -210504 -25369 -424487 -255172 -53254 166882
18205 -207086 -357715 -190156 -124344 -51745 -84581 -80791 140906 263410 289353 -91885 250986
18193 -138531 -77962 -271613 46218 -306973 -127247 -225545 -233776 17731 -219290 -181991 -222863
18182 -222863 -37577 -13328 112066 -347943 -76521 -248842 -20598 128619 -212207 13689
18171 154917 -113296 -204112 -200408 -130496 119353 61343 37557 221300 2614 215319 193221
18160 193221 -107730 58958 -123524 165545 -42569 -356543 9657 112027 -124254 -118559 -3030
18148 -193477 161696 -253546 4157 -54715 -54163 -93956 223420 -53014 231434 -249000 -86416
18136 -27566 64069 324946 124531 -291075 -30886 -214853 -286885 -50268 77038 198003 159650
18125 159650 -298335 -36850 -125391 -306075 17979 105875 -277904 18564 -71168 406834 83067
18113 -50665 44546 341173 228383 -13081 469165 -61912 364616 -2076 -180658 -72697 -89421
18102 -89421 -98777 -230903 -88713 114043 -98827 -57249 -13617 -67091 358459 58703 97216
18091 97216 -260876 115801 -78319 35629 119036 -37138 40522 -155462 -376943 -171403 -54369
18079 -90771 -84781 -197257 47542 -212048 -115883 -38088 155208 120898 3117 -29934 -71015
18068 -71015 31963 16676 -290531 -26472 187096 110849 -211516 33040 -8901 193155 -133297
18056 23557 109166 311209 -11726 -185779 -94246 -71749 -335336 63620 -221159 -12410 -49335
18045 -49335 -279150 -19051 -156910 -72953 -23150 -191052 169785 -43097 265379 -75064 153222
18033 42162 201622 20233 -72575 62926 -1264 290713 142472 213386 115021 123648 -122814
18021 -166064 -206192 45874 60787 37664 100784 -271246 -105239 216376 6575 161432 427691
18010 427691 71981 -217484 250786 -336941 180437 -174043 207660 -43201 95202 -66446
17999 208428 -193237 -62086 36549 44942 -128053 -152442 -113471 -95408 230909 -129447 -107036
17988 -107036 82760 68308 364391 -70324 8622 -254347 -45666 -31468 271444 -14084 112745
17976 223820 84513 6801 -25693 149610 -280193 141587 -15926 -76645 33403 -142294 200522
17964 138871 152845 91394 76591 44969 -138145 -295360 7060 57024 -8474 -158708 89767
17952 -206815 265115 -117137 146839 -10290 88285 -144498 -26521 -124497 -239817 -114788
17941 -87040 -124374 -242658 -263760 -76670 110468 -286524 -372418 -109224 -132166 226938 -8301
17929 322972 128261 11098 56539 147526 -201260 -159990 71156 -100299 120845 -24329 207820
17917 157742 127262 -73937 -170500 21085 91113 -167546 147372 49928 -84020 -430375 -82288
17905 346084 454158 -57615 -133546 264503 164427 51010 131800 304356 -250518 134274
17894 -158941 -51284 -319897 -16852 64090 -161510 182552 91704 -314195 195944 -190069
17883 -197508 120053 335434 -107398 -93707 154206 13267 -131823 -69992 100701 63360
17873 63360 283819 121451 301912 -325735 -14464 208874 182369 179164 339048 19325 -181095
17861 279379 134020 47800 -91006 52986 -73292 181453 8877 68035 -119673 -209467 -273089
17850 -273089 73667 152324 45184 -124924 -8034 -41750 10371 -78168 -85892 117058 -183215
17838 -306999 109876 17079 22353 152335 262086 224921 -76122 55169 -8017 8890 -14103
17826 140511 -143808 140319 71785 225816 200334 -35483 203490 284835 104770 41229
17815 -119633 159759 -277678 -160757 269924 132318 304300 -32866 -86197 -210387 -74026
17804 -135949 338319 162642 3638 -37841 -165420 62982 229074 65431 -69332 101690 311002
17793 311002 -10713 66033 239154 -233813 65745 -10305 -38331 282165 -292950 21546 -220268
17781 -318843 376800 71872 280502 -203916 224797 158874 399224 -16764 -291172 27824
17770 101130 105219 148019 178531 412923 32238 -94461 -10734 175957 9956 242830 45628
17758 146352 79952 53444 -29169 85690 63688 408719 -77586 -125442 56863 151959 345828
17747 345828 55865 69852 548896 232246 59656 -104235 -47195 168749 -94234 92361 -73508
17735 -10083 -181546 500196 294233 -310307 -454 -261579 -108639 14563 121098 16159 95606
17724 95606 143982 23303 114302 20572 -128457 115473 387239 182269 154108 298620 -130086
17712 -98839 35934 225514 8926 -28152 91664 282705 43712 302852 254567 230015 90446
17700 55920 -58233 6401 -66316 257542 98746 123665 -127424 102782 10389 -76643 136420
17688 414991 121115 32539 190726 147822 316369 23880 150250 334321 342019 -57728 273497
17676 -55286 105224 6707 110080 125392 55249 150866 -34006 282455 463974 262445 -290252
17664 250083 276892 166680 61804 158827 126561 105969 243757 80386 -28595 -165346 243175
17652 29425 243677 -68842 151768 20087 8414 14271 30049 313178 159143 12064 77673
17641 77673 156889 209317 74335 186173 -98489 -10398 321272 74405 74368 64998 154526 173283
17629 173283 3035 236774 -132271 101289 61126 244330 71526 -7809 -161654 41146 -11756
17617 161684 -145589 339103 155928 201836 -9994 221128 98331 60985 -258349 41275 -128164
17605 -26575 -141077 -375746 -6932 76996 -53390 -176862 247227 -98156 -79457 373559 -237828
17593 117922 145380 496417 60333 82901 375870 -91108 -239987 -958 162004 171399 198622
17582 198622 149242 166370 301391 83057 59206 -40450 235593 282017 310997 78373 -94384
17570 384499 269241 666164 44747 340886 319149 88985 161114 -117240 293794 30305
17559 509901 67420 195670 266269 25402 -24902 -101008 90968 94890 110417 162201 -5728 -27534
17547 -27534 48695 327120 165867 48333 290996 248973 -14425 234957 233586 53496 24647
17535 244723 349414 -33030 92901 102416 113698 363593 496740 65769 215434 393303 239757
17524 239757 528862 691078 681302 345927 538951 490668 153274 495725 249018 268502
17514 268502 172285 687682 325654 315657 365474 622027 541803 747129 796930 834475 425308
17503 425308 298170 320669 266644 111778 -113609 52188 128339 418449 309497 122236
17492 238057 146142 276235 134398 186310 257158 11244 651342 302401 279022 333157 110498
17480 122293 61436 213286 161359 134935 178187 147761 353904 -22487 225719 522934 -37332
17468 466529 384406 147915 601528 101645 132987 257134 265712 279860 139122 168806 305852
17457 305852 386975 445855 527998 422028 273947 358759 63370 322138 631346 461492
17447 461492 526531 376676 522318 701602 749247 595667 385521 276693 200554 474653
17437 474653 465518 463396 121721 420502 473257 342618 500274 707015 709945 543496 574939
17426 574939 203184 741635 78314 250662 450172 232234 408523 288205 137398 476106
17416 476106 542381 670978 316462 402750 443832 451336 301245 208096 317924 370186 350109
17405 350109 12254 251951 414586 63360 31824 169870 511649 220665 -60688 50925
17394 352503 448712 506184 352288 148411 275485 -118063 199710 438686 103738 482437
17384 482437 340537 172089 185265 166840 339494 337051 428591 299221 245221 428541 346819
17373 346819 218667 449507 108717 220330 -174287 492801 608794 226416 437287 366445
17363 366445 12749 -59844 165482 48802 297881 352974 214011 417823 27372 395398
17353 395398 50424 391874 291723 178627 361851 86714 112396 -196545 306998 276358
17343 276358 660908 674108 135625 430416 253217 431435 393947 359469 379673 197773
17333 197773 454925 50784 142217 91911 479479 315724 499380 129797 201396 229890
17323 229890 262953 300505 366784 370078 477130 172489 270966 70200 596164 65007 19450
17311 193239 214901 473945 253651 224486 307093 317006 189322 398133 365077 394300 350627
17300 350627 342471 385868 663152 -229838 305276 126989 161595 226479 530664 329627
17290 329627 415504 661262 211742 245165 137602 374979 224192 343681 532917 353329
17280 353329 -62897 128304 516781 679263 325325 231452 241149 288299 143555 205431 358922
17269 358922 428570 197143 365844 330901 292290 241544 383594 674242 161247 421783
17259 421783 273254 478634 129017 334068 520639 368139 240558 649313 366341 408243
17249 408243 342421 474144 180909 582594 417546 115197 219087 1853 502164 183379
17238 389062 236992 466799 361191 380527 368238 308216 173266 413409 236828 455857
17228 455857 408922 221486 300073 674159 383214 262833 428731 620763 154877 145580
17218 145580 409203 281461 253409 536931 478130 410041 628977 492164 274460 241280
17208 241280 183290 469322 531710 444457 469421 418097 542549 602348 225571 698098 173566
17196 605374 360690 199719 533285 618602 877650 479784 101852 313658 449185 559222
17186 559222 513798 381230 303753 608997 505597 963102 365773 294458 420277 585831
17176 585831 453186 506083 602864 389098 477217 645945 477598 604020 715804 622783
17166 622783 218468 484071 475401 648065 530689 567384 576562 570524 273468 660584 487193
17155 487193 646490 421158 595558 609399 504447 619346 1049361 610581 645216 507644
17145 507644 704524 682503 776381 251865 374536 576691 712479 558019 607678 894555
17135 894555 784939 401929 516990 528909 737470 822244 622374 692512 616820 416891
17125 416891 373220 502636 644810 707648 806248 760624 1022607 422845 544112 632088
17115 632088 767684 1112561 720356 570057 570749 688928 832090 854483 834477 758122 729372
17104 729372 581292 609720 1114576 755380 733383 889392 698206 607485 529352 539748
17094 539748 994278 558161 773928 711946 985543 297146 846063 801037 818413 836434
17084 836434 756691 861296 532818 936709 931010 838615 941110 1166406 931259 792426
17074 792426 754803 853571 797264 881233 1163510 471856 821652 915682 955117 1075143 986149
17063 986149 972341 1135299 1117815 1146281 946903 912590 1105088 1554164 1172204 1179376 982641
17052 982641 1135158 1179310 1200923 859523 862684 1077672 1147841 1147707 928011 1092167 980012
17041 980012 1051424 1118051 1022752 1296872 1184197 1052160 1326962 865162 1157250 1127618
17031 1127618 1034259 1017022 1284685 1233135 1208371 1153759 1259922 1118693 1190998 947402
17021 947402 1145897 1042623 1120219 1371029 1210954 1457551 1408156 1344822 1286648 1396791
17011 1396791 1370096 1371933 1591232 1656298 1238268 1541345 1342208 1709993 1640235 1308760
17001 1308760 1446958 1531744 1593828 1516183 1625511 1398359 1449440 1447424 1585828 1674439 1550426
16990 1550426 1456030 1665799 1298521 1607147 1654734 1638013 1372970 1829266 1639055 1631713
16980 1631713 1621474 2063434 1797220 1777073 1793022 2061431 1647717 1710819 1659556 1573425
16970 1573425 1911382 1972784 1952786 1742198 1981015 2083931 1795870 2184098 2066139 2084458
16960 2084458 2044194 2203926 1862441 1941012 1979371 2256022 2292262 2037672 2116853 2232778
16950 2232778 2354228 2474563 2562334 1981473 2578774 2472961 2182958 2220896 2749519 2556483
16940 2556483 2444455 2608516 2637553 2382486 2445106 2534533 2499927 2466533 2718650 2886567
16930 2886567 2644494 2793050 2493670 2670321 2835317 2719212 2724372 3172063 3243144 2862527
16920 2862527 2877288 3176145 3211254 2909903 3095916 3396104 3357958 3401987 3447931 2957561
16910 2957561 3584728 3660467 3475785 3655901 3448399 3509382 3579585 3507672 4221505 3742174
16900 3742174 3772100 3987619 4117497 3885540 3836993 3782562 4218525 4149607 4173345 4119837
16890 4119837 4596683 4415633 4019800 4769995 4596811 4615808 4731191 4723185 4698284 4865092
16880 4865092 5001373 4843146 5078789 5132195 5119394 5295431 5311641 5606998 5514231 5554088
16870 5554088 5477321 5636219 5483407 5662892 5749539 5658255 5952386 6003282 6284118 6606980
16860 6606980 6632919 6217103 6817359 6593779 6706115 6742324 6906890 6845883 7289621 7317724
16850 7317724 7390410 7816705 7616518 7641815 8021782 8122166 8445288 8151437 8502226 8885170
16840 8885170 8511960 8755221 8999478 9107458 9005320 9361262 9696125 10011715 9891733
16831 9891733 10028211 10560926 10415954 10541182 11088621 10673295 11074947 11229400 11777324
16822 11777324 11903011 12076281 12382656 12592619 13017471 13094589 13222156 13490366 13502851 14056454
16812 14056454 14505244 14643680 15103450 15542591 15577183 15758222 16236617 16610709 16951338
16803 16951338 17300924 17619658 17947624 18507712 18774042 19040889 19584810 20256871 20509631
16794 20509631 20828537 21551613 22018428 22226624 23183901 23636380 24160015 24682946 25557627
16785 25557627 26102450 26682592 27471417 27663816 28728660 29238276 29910225 30681747 31284717
16776 31284717 32239380 32976423 33986520 34409826 35551396 36577223 37490545 38517838 39370226
16767 39370226 40456505 41358156 42327108 43735921 44629580 45527478 46756321 47787493 48996381
16758 48996381 50748437 52051337 53062432 54380310 55711767 57028552 58312306 59524975
16750 59524975 61429439 62619447 63843103 65015244 66851056 68117921 69078838 70376950
16742 70376950 71825943 73047695 73957606 75263165 76385579 77315940 78656908 79208564
16734 79208564 80090761 80991485 81457860 82347312 82718340 83197332 83384514 83336965 83694395
16725 83694395 83819967 83717337 83569014 83562112 83005922 82596929 81677984 81147397 80525792 79522198
16715 79522198 78584130 77843184 77042416 75870100 74824286 73534751 72436960 70970350
16707 70970350 70013749 68714571 67439281 66209258 65157782 63726391 62125052 60764595
16699 60764595 59519376 58332508 57085044 55683520 54634700 53070167 52279282 51105787
16691 51105787 49777077 48399960 47211514 46419136 45320758 43904860 43311860 41756285
16683 41756285 41081609 40154256 39015711 38470431 37597936 36547004 35742570 34973368 34050450
16674 34050450 33412130 32556648 31871788 31210186 30211870 29848696 28935296 28417006 27930633
16665 27930633 27273424 26382853 26233391 25495658 24857079 24229933 24020562 23509888 22784801
16656 22784801 22430610 21590389 21454659 21188858 20553057 20224532 20072580 19681251 18868540
16647 18868540 19053373 18375382 17997550 17692718 17141194 17166055 16554771 16677041 16248923
16638 16248923 15543827 15755492 15518107 14999678 14798556 14476201 14232526 14284480 14090324
16629 14090324 13937675 13291389 13236074 12965144 12523069 12292092 12237033 12109004 11843415 11729122
16619 11729122 11821290 11283332 10832918 10982079 10954617 10950744 10237895 10269576 10167904 9931614
16609 9931614 10138167 9892052 9975977 9647034 9201632 9090725 9332964 8783346 9108445 8906079
16599 8906079 8996893 8594127 8821506 8195980 8309834 8514256 8041339 8128520 7531387 7710693
16589 7710693 7382357 7378711 7447253 7221778 7260214 7227599 7045045 7005389 6960715 6988324 6686435
16578 6686435 7016307 6620671 6452967 6167877 6445466 6280873 6210573 5851532 5997905 5835576
16568 5835576 5954605 5905295 5775370 5756452 5625544 5734406 5739410 5465062 5513669 5357524
16558 5357524 5338829 5302827 5533020 5273269 5070101 4929254 4781642 4930327 5153597 5097883
16548 5097883 5183368 4917096 4616365 4656544 4660143 4574968 4540591 4484494 4404241 4556873 4296467
16537 4296467 4267990 4473643 4133398 4512336 4135646 3897182 3746860 4089687 4129532 3988005
16527 3988005 3465251 3649360 3477254 4184493 3588705 3749355 3609423 4005125 3570337
16518 3570337 3730069 3680799 3800192 3299636 3226247 3834024 3585004 3786731 3256166 3678584
16508 3678584 3551408 3282648 3171619 3561116 3650077 3007364 3269817 3402743 3010132 3019139
16498 3019139 2938383 3564420 2776463 3083663 3036736 3059635 3110967 3234051 2932420 2613953
16488 2613953 2858827 3019890 3099851 2924609 2801135 2784879 2708363 2922222 2464074 2638386
16478 2638386 2655716 2920465 2440471 2649106 2429252 2488797 2680988 2446004 2336644 2462719
16468 2462719 2550936 2379340 2355387 2529500 2305186 2422743 2418738 2018578 2327725 2681237
16458 2681237 2436894 2298250 2518625 2280232 2368229 1996394 2387801 2122142 2118101 2392424
16448 2392424 2087332 2010019 2086582 2254373 1877635 2121285 1983326 2133784 2314701 1716785
16438 1716785 1973473 2103481 1963154 2071473 2291324 1932232 1747014 1962443 1808446
16429 1808446 2003812 2004307 1883229 2067155 1798926 2094035 1780165 1733852 2050624 1793130
16419 1793130 1835992 1906041 1687778 1925544 1838998 1799078 1816409 1829730 1744720 1879009 1536210
16408 1536210 1621205 1715553 1855923 1627058 1638118 1747297 1465333 1730755 1425063 1503207
16398 1503207 1735500 1604922 1722413 1492737 1621646 1427865 1549861 1304259 1698361
16389 1698361 1340565 1411727 1507158 1478795 1359224 1421763 1603035 1231976 1483595 1593440
16379 1593440 1574180 1503183 1401809 1584407 1729926 1226140 1466849 1371286 1587909 1296229
16369 1296229 1121568 1176789 1497158 1409477 1282802 1257365 1309429 1214960 1184293 1230293 1237699
16358 1237699 1374266 1186171 1396126 1354651 1184291 1402732 1372231 1357844 1309732 1008913
16348 1008913 1362883 1432718 1535424 1385035 1225358 1031653 1416991 1046009 1067930 1209608
16338 1209608 1249461 1176297 1157235 1069151 1118814 825075 1330355 1186040 1089723 1136386 1045048
16327 1045048 1244597 966512 905619 1086931 985309 1075359 1056053 1074930 1090492 1361780
16317 1361780 1009730 859015 1017851 938068 1009354 798253 889603 1132748 1025175 1128299
16307 1128299 991359 1012816 1001659 783096 867631 921529 900475 1004186 1122758 935070
16297 935070 982382 1037952 825886 900657 771405 787189 1079569 1023136 648972 879939
16287 879939 867942 821100 642067 1207556 903957 952194 947907 558108 807757 992008
16277 992008 1047084 921455 838754 930241 789628 892662 743625 872326 856698 493266
16267 493266 916778 452085 836373 1031509 801761 1238612 1014513 538072 671586 947529
16257 947529 858869 746669 1039638 903157 965020 481684 812317 716918 821557 904649
16247 904649 713604 857329 486235 968762 790041 750583 966794 841521 868459 626802
16237 626802 757383 793096 536668 402103 489796 1113815 306107 673134 668192 952300
16227 952300 552760 400576 909509 559164 693434 552984 554062 669048 237440 268096
16217 268096 462904 794987 455129 565598 694385 543120 651165 808293 491057 568690
16207 568690 712778 790832 280433 538083 540709 723744 257010 144338 871667 683310
16197 683310 705631 718354 904050 776232 478417 361077 737258 477269 740502 243144
16186 736300 680698 570991 586250 409093 702785 356284 475694 514040 632439 634093
16176 634093 601652 520007 405794 175344 665759 565534 565095 438286 425727 326617 408834
16165 408834 432501 834288 526585 409985 621516 268361 446834 376907 192524 310452
16155 310452 401368 612746 123856 305530 510861 123623 508738 473120 482230 474860 381790
16144 381790 546592 256328 320714 362895 351802 155490 356135 571855 387065 361885
16134 361885 427255 156706 291415 401769 62899 322045 439706 458167 89377 532321
16124 532321 200319 599866 373254 295015 317189 917386 351510 274203 542844 583191
16114 583191 461470 359462 182458 350155 431659 206995 625300 258223 224767 459962
16104 459962 382797 503580 305989 376785 -52225 300685 247060 260508 340144 79869 155023
16093 155023 458029 387169 301589 281926 566733 318683 405988 146341 -88289 344004
16082 342661 -27509 323327 318643 173598 72466 425654 405658 78055 464535 407859 430668
16071 430668 470972 506196 344888 55255 48354 174297 191704 397345 19018 424335 213779
16060 213779 380668 111310 134446 283932 -1979 16543 310022 197261 -98862 421968
16049 365315 143158 88355 176649 127208 337590 14244 141470 20922 260905 138657
16039 138657 413085 107762 388839 374116 202553 136976 322589 291576 -107499 246245
16028 252716 271027 374096 148226 32215 228050 24199 423317 33732 141122 134485 62459
16016 73415 58643 146246 138473 348488 46041 76622 50732 245320 83733 41680 -163309
16004 -34859 313029 281173 267961 173971 61470 328102 215497 301870 215103 132732 140679
15993 140679 504211 406803 492550 382316 909432 1052261 947934 863434 769571 477733
15983 477733 143101 69886 461887 353698 236344 -8919 232293 193399 337766 137764
15972 169196 -39839 -101190 126351 361181 23380 -106364 15351 236381 612 -34726 23969
15960 -38713 153739 311537 212480 44523 368963 22881 3132 246701 193861 116151 -38354
15948 160501 -364129 329686 383047 80582 138872 84558 219748 -63055 -58080 154921 -20172
15936 105651 -216439 180066 -92679 343554 -169333 369783 295432 241070 -91889 -236281
15926 -236281 268784 -26241 -19504 78470 488171 204170 -58252 28484 4308 212779 92605
15914 248890 146607 -196745 -28605 197542 57827 249461 263051 164097 82422 318596
15904 318596 389160 150620 30495 220287 288743 154906 -90628 46385 144740 65876 367582
15893 367582 307975 149100 19858 99545 -112865 376425 284388 -170028 43387 48068 -73256
15881 58926 346229 -161693 126503 92673 -63818 114786 151154 105344 191916 198350 64680
15869 -53238 35317 157466 -158572 423032 93408 194327 -99651 193539 74838 28309 123839
15858 123839 91924 31179 -163912 43068 -191623 -402 -225842 26522 -342391 -231131 197272
15846 202439 97412 -146084 95640 17752 35292 -134109 135679 108058 207364 135503 69826
15835 69826 -143857 -164310 156739 -304586 113 83434 211185 136021 -128903 110189 -5291
15823 -77189 227272 -95344 -225104 343386 157747 355987 -120509 -146074 62402 371138
15813 371138 -60016 57211 145818 -197955 -88893 5558 -256751 -33802 -87552 15940 383203
15802 383203 -51302 -86885 27107 213075 168310 181912 143763 61769 -109798 -105402 24912
15790 73928 -17738 9680 -420065 268962 -52089 149772 212589 267514 32055 185744 221524
15779 221524 159856 -60702 152571 -33963 -283037 216694 113643 5021 -20463 -31376 -222224
15768 -222224 136990 -148874 -101010 14096 -39217 318773 152796 4177 159746 3896 -87404
15756 91814 355832 149802 -12154 -120697 270294 -233573 146367 7152 30751 68281 58100
15745 58100 -220767 106412 247725 263891 22294 -33962 249929 -47092 -51896 -57262 149440
15733 3482 65919 -178057 -346796 -153026 170569 26957 -48792 -352788 7580 161442 149260
15722 149260 -36120 -88737 -231451 -129628 -79915 49736 115316 -103437 3805 -137450 11288
15710 -30903 67777 214628 -57048 -64468 -405098 11113 -81027 72433 -322629 1992 -343890
15698 -95642 40674 -42813 -109547 -150634 -204551 -232842 192176 24760 -71720 78701 -150601
15686 -12625 -178288 146200 -252007 16264 -114594 143137 7604 364930 -32093 -97155 -117591
15675 -117591 -177632 186045 81377 -16770 -199511 39653 64061 131667 221415 -22893 -29061
15664 -29061 53917 -221508 -295773 -149973 23306 -344127 5717 -190021 -380198 13105 -47569
15652 -143930 -40444 -243159 -14127 242427 38873 25516 -16582 45135 258317 37740 -5742
15640 -196465 -109861 140890 99618 173739 147692 36188 -7255 51609 -83903 -115706 573 121026
15628 121026 -369211 -40209 47726 -135248 84436 -147759 190039 -56842 -280369 -44435
15617 -97723 79394 -28912 -139816 133881 -230018 47243 296847 -104526 141214 -252526
15606 84529 -30354 121893 -71793 -131450 -53207 104903 -42165 139375 86417 -161343 -141435
15595 -141435 331327 -56401 -143953 -180959 -45461 299355 -14594 80415 -44336 128653 -171397
15583 153199 110434 -203300 -137198 37793 -262765 -47931 112506 -37350 34331 -51446 -239019
15572 -239019 -186914 40185 273011 -285830 -284564 50830 -113562 92251 22582 -62194 9918
15560 -154799 112567 -349776 63376 -123218 -93942 -74976 -134253 -256153 21455 -287692
15549 -122187 47815 -10222 -175551 189392 27537 218259 497314 143183 195455 152993
15539 152993 11861 -11292 42147 -87434 -104795 51929 89344 -83559 127757 -239262 -60249
15527 87821 69647 -231636 -90798 280686 41183 11875 256225 -73902 212700 -493639 228527
15515 212856 -37130 188173 96010 37540 37979 133064 -151688 25688 245701 67073 238327
15504 238327 220336 -38307 -240796 -38464 213437 39907 122502 -185801 -57032 260060 -50523
15492 -42912 -77550 136541 212319 -33631 268283 255014 119416 -237196 133374 225483 112520
15480 36117 363203 430914 340958 242788 565617 289009 20279 272982 -160269 22304 52737
15469 52737 126784 -55438 61540 -48087 207908 -21238 -218985 -96080 -88842 31200 -30990
15457 -51719 398470 -19986 81915 234499 8071 -308085 263176 50759 -79454 24638 162910
15446 162910 550424 478002 539283 515292 199800 177363 318734 44544 73390 -240910 75242
15434 -148659 42242 223337 57469 29936 159928 32872 -46214 120377 130366 163094 -221154
15422 -208760 146156 -61359 -84635 -98114 -66738 40988 45878 245895 309967 -48087 -103344
15411 -103344 152184 -264796 -100475 -33819 120445 -3517 -168483 160020 21611 77605
15401 77605 -89356 -98409 -98 228193 186904 -11858 114725 62314 -36442 67369 75718 -173826
15388 163913 259975 -105455 121106 41767 -283457 14041 -106390 -143551 304303 -28545
15377 172010 29743 -63927 -100600 300475 428208 -84337 153022 140222 -62760 -95895 -17640
15365 219038 127230 287525 94883 -1090 115417 -87954 582959 -54382 338279 221015 -84174
15353 90661 -56594 539861 208340 144511 164926 275607 126545 -28451 301226 144001
15342 32101 354231 -113370 278232 -91209 -15376 -72435 -46296 91881 16515 -78740 212048
15330 172447 -20155 185749 254636 265167 -30711 229417 -95193 27035 -293364 -167115 122757
15318 -80396 153323 -290168 342117 75913 104606 87416 108917 -232550 117097 233672
15308 233672 23176 155731 218697 -50170 81102 57227 427072 205681 251367 -98239 -181152
15297 -181152 41832 -17731 75490 214071 385129 -156029 -17840 32881 -27834 181002 69751
15285 63595 -341172 147483 337615 -450695 -89584 108276 224807 313000 -242917 205800
15274 285737 237709 53346 -7536 -314230 -124218 -19968 -24889 87586 99696 -210390 4826
15262 37280 306912 -4078 187055 137148 -68124 77600 -145657 180335 -46881 22221 399913
15251 399913 143375 32373 684623 1298614 2304102 1601769 1884208 1803127 513480 348076
15241 348076 154875 110229 -26598 312122 165197 23358 43207 -264621 -116917 -181226
15231 -181226 -15295 212518 120630 -152849 120222 -256807 -112517 -174731 55232 92383
15221 92383 51328 -134449 -49298 -22703 -11252 200964 78368 -55308 -333945 326875 183114
15210 183114 -291311 150595 -109615 311799 69011 -79511 -63293 -74882 251408 242166 86723
15198 -286458 -58296 131642 301396 -103563 227237 202790 93636 -148371 13609 -132216
15187 282216 178695 235739 54028 196436 -149633 -96348 208230 397133 -139108 -77529
15177 -77529 120573 297468 48067 138976 13124 59722 -56775 -69123 110885 147493 320075
15166 320075 358560 2230 -123046 156776 -162184 -9334 163189 10699 -8411 -96941 -45889
15154 666 123027 -365051 68030 -53890 242780 265916 -135344 15562 250139 -178281 -184505
15143 -184505 -212374 -76553 -37943 -92583 22311 45519 82029 162540 22770 417859 59658
15131 -121853 -69876 114811 218792 237511 -29768 -106022 123796 254874 8482 -307653 2951
15119 -246977 104370 126078 293902 532538 585746 337522 144402 -88792 135184 216619
15109 216619 152781 274527 -18713 153913 99738 -28666 328134 434177 121735 93693
15099 93693 269116 158259 -182722 167995 264774 88993 329936 229332 60486 167749
15089 167749 494747 -75230 -54855 127968 128006 14368 195052 93154 7142 419486 -82129
15077 34205 285481 -45032 123173 -240471 223354 179674 -54156 617596 -150254 -307808
15067 -307808 -129345 -118548 373609 95536 22447 520883 145528 86060 -153103 140562
15056 72271 114005 327330 416901 318349 416006 251603 253287 118309 266939 131549 317880
15045 317880 185443 560168 132141 410908 419086 212764 -72608 67853 293880 317891
15035 317891 231058 91080 278761 261122 264249 204916 350141 139404 251830 274483 257480
15024 257480 706790 576947 569681 211412 175094 316636 247644 411730 530233 230763
15013 464864 192193 171357 222954 169721 79732 331338 202557 512759 211562 682609
15003 682609 462518 227453 198930 52762 331950 331963 256228 299331 382502 -46526 380930
14991 155293 267600 249224 535919 39073 387314 440983 249277 497134 407535 306505
14981 306505 441263 553026 391630 457889 544689 635729 419122 599193 654674 313335
14970 155814 414006 408976 777238 313091 646929 208789 71827 217832 457082 548079
14960 548079 379294 157858 343184 469847 624688 82707 246209 463155 217106 598150
14950 598150 513473 388741 146243 533496 498854 409792 96962 643370 387860 395723 326172
14939 326172 113487 192568 478110 197561 384549 852088 570498 765600 720213 876412
14929 876412 895356 1006991 1251817 665123 730624 1103812 641197 1070789 784214 1443095
14919 1443095 1392149 1798533 1010812 1053202 979085 767662 694904 499980 646572 95089
14908 152947 255064 261260 572722 327924 360634 397931 293701 431521 170727 448835
14898 448835 398265 128625 499492 493226 309818 -79482 413535 208710 634635 497081
14888 497081 348667 432636 571270 451748 641621 582550 265486 478735 632263 768112
14878 768112 688251 209793 779149 534285 266102 406101 407723 267255 485553 523266
14868 523266 410075 721820 403187 396320 556709 574653 290803 221440 402307 569377
14858 569377 104191 300198 242612 420227 490275 260946 128130 243094 208020 675085
14848 675085 141183 508893 711468 621703 518005 846372 976159 952286 884671 884019 835679
14837 835679 605063 567844 573117 354301 588566 686799 544304 562885 492365 602510 306587
14826 306587 197842 329911 465518 502502 477581 509241 723006 777962 275638 500957
14816 500957 337178 531759 449949 502225 882523 513834 493935 570299 806401 608443
14806 608443 570081 613461 971554 756369 480921 836025 428222 311893 454160 430676
14796 430676 496445 375466 478736 320430 717128 412046 438514 640735 483678 653549
14786 653549 494141 570123 727540 568502 489931 293992 470759 455544 782623 218593
14775 451284 608812 762134 836481 524675 841946 656446 723359 701197 364772 547142
14765 547142 866439 366915 753461 685023 556867 1011919 993554 715172 638018 257218
14754 736702 700063 738332 457537 743976 604249 959860 653964 761413 687111 589291
14744 589291 567669 672528 688340 680745 600918 876988 558360 512816 778722 1048022 615077
14733 615077 590579 822524 561746 510453 332991 768675 1008892 813511 1217242 944760
14723 944760 1213471 1211602 1401417 1195369 1031195 997346 730491 1021075 787282 725129
14713 725129 868764 712906 841878 639476 974302 515112 1148992 694986 831920 765743
14703 765743 932156 832190 994901 1223675 1276811 1219500 1637770 762439 1131306 1105404
14693 1105404 1050568 859161 846050 911392 778977 807958 775888 654522 799687 877340
14683 877340 646638 781015 1041167 497788 946655 1034927 848424 1124334 1037108 1001998
14673 1001998 536964 808111 904203 1030875 969373 1220791 785069 1472354 1160072 1070684
14663 1070684 734203 994770 1007974 906857 1153307 832322 914257 1025365 943939 1042779
14653 1042779 753876 960477 1133207 1115675 1437102 1388831 964763 1070734 992624 1250558
14643 1250558 863024 1224991 1279024 1146781 1177337 1128877 1203403 1301455 1075302 864461
14633 864461 1142538 936467 963818 1247963 1267556 931568 1169699 1018370 1278266 1235690
14623 1235690 955942 1368143 1489844 1440042 1469337 1497622 1251645 1552510 1250013 991145
14613 991145 1163868 1312804 1496094 1383974 1051374 1184201 1594187 1333990 1132576 1580799
14603 1580799 1490208 1295129 1629520 1202504 1580231 1487933 1437842 1582447 1450852 1385492
14593 1385492 1776891 1596551 1689693 1632692 1752040 1503537 1483836 1686551 1593302 1824563
14583 1824563 1744511 1559984 1311589 1744596 1888942 1688963 1650405 1945863 1712546 1697707
14573 1697707 2030590 2059091 2112395 2281312 2380184 2463874 2267636 2126243 2049643 2376520
14563 2376520 2400992 2091339 2527441 2565024 2555213 2791473 2743241 2659583 2854404 3119041
14553 3119041 3277724 3900985 4445045 5607068 6935596 11350117 20008303 38952824
14545 38952824 41454362 19143702 11399195 6332479 3487165 2407667 2282321 2061719
14537 2061719 2111049 1825082 1592129 1604626 2069507 1611221 2072502 2036446 2020669 2164587
14527 2164587 2290838 1749701 2204353 2253289 2032829 2053717 2069553 2110458 2515833 1979898
14517 1979898 2402146 2523159 2185092 2253439 2316352 2677688 2373686 2698369 2551455 2965461
14507 2965461 2627787 2428688 2718604 2958836 2877664 2745394 2899132 2953595 2724688 2962207
14497 2962207 2966281 2996636 3079720 3148101 3146594 3295790 2959692 3244483 3202938 3218866 3362154
14486 3362154 3157986 3136031 3400926 3389670 3504524 3310575 3555956 3366630 3545735 3776651
14476 3776651 3431320 3765245 3531999 3470799 3747745 3855402 3851185 3581313 4194612 4016357
14466 4016357 3960737 3988496 4648389 4323459 4128960 4467064 4223983 4111198 4318140 4571209
14456 4571209 4595401 4923010 4563464 4763093 5011321 4841233 5081058 5160868 4884103 5015413
14446 5015413 5134085 5386772 5386383 5533082 5293811 5415037 5651177 5728335 5590685 5926504
14436 5926504 5951448 5522444 6032782 6132347 6010706 6303811 6407764 6635216 6394148 6910912
14426 6910912 6734218 6751266 7016108 7415536 6958686 7655560 7484780 7649102 7643343 7912205
14416 7912205 7717300 7995729 7797282 8174948 8308409 8234114 8490433 8460956 8699434 8714408
14406 8714408 9181633 9373493 9413496 9500374 9519783 9447211 9451105 9627814 10018101 10292945
14396 10292945 10366863 10670341 10437830 11035207 11218474 11387986 11289020 11489511 11796747 11984584
14386 11984584 12335599 12550300 12810016 13133829 13631865 13780888 13626895 14107346 14256052
14377 14256052 14606805 15060004 14796923 15360463 15511245 15876254 16288557 16577477 16956815
14368 16956815 17253386 17912871 18057956 18462868 18664894 19293853 19547802 20098480 20432410
14359 20432410 20649091 21601222 21820833 22385632 22660493 23501990 24043312 24466712 24989204
14350 24989204 25861339 26163719 26654931 27663597 28143118 29228380 29981557 30605009 31377206
14341 31377206 32469527 33157706 34090065 35353035 36083503 36874219 38307019 39451047 40408958
14332 40408958 41595919 42957503 44632904 45905432 47419968 49228135 50971692 52260070
14324 52260070 54026223 55939077 58181853 60025089 62429283 64224469 66899759 69333617
14316 69333617 71730362 74646179 78061301 80892607 84027739 88169390 91348678 95569108
14308 95569108 99722463 104307251 109312217 114207764 119697359 125120346 130927892 137347723
14300 137347723 144117138 151338995 159110040 167424376 175972504 185300371 195199149 205264028
14292 205264028 216255813 227623162 240015875 252046735 265386127 278682793 293045957
14285 293045957 307101727 322201863 337155182 352357966 367528505 382087560 395986467
14278 395986467 409193880 421184581 431606472 440294247 446776483 450196381 449740257 447753581
14270 447753581 445450033 442847677 437078617 430187605 421626856 410600353 398308364 384549109
14262 384549109 370364290 355504473 341007417 325361657 309938078 294658193 280001649
14255 280001649 265417997 251801963 239531644 228089869 216546378 205062607 194193776
14248 194193776 184970025 175702262 166800877 158763285 151449827 144190898 137209847 130867580
14240 130867580 124798821 119259494 114116158 109051390 104434212 99791830 95408616 91366865
14232 91366865 87971919 84895162 81206183 78246869 74884541 72203448 69392653 67016216
14224 67016216 64291273 62148130 59941741 57840170 56263187 54066773 52131098 50536816
14216 50536816 49094774 47322805 46229888 44887769 43437479 41798793 40769173 39573579
14208 39573579 38725059 37968817 36539101 35613877 34399447 33290144 32613066 31677221 31265304
14199 31265304 30320525 29236715 28494042 27940158 27297137 26990250 26142150 25460659 24597373
14190 24597373 23951659 23544401 22926854 22300249 21898626 21376452 20892778 20651832 19845432
14181 19845432 19652059 19235686 18788763 18233973 17723125 17869078 17112284 16854983 16457506
14172 16457506 16348102 16119129 15603639 15189748 15233178 14994583 14431059 13987899 13937239 13775833
14162 13775833 13806121 13339344 13379045 13124901 12688675 12595041 12223086 11911743 11881998 11642689
14152 11642689 11713407 11540302 10953784 10772162 10807539 10415826 10398463 10211853 10136510 9846509
14142 9846509 9724450 9790141 9338400 9510044 9165479 8889238 9137218 8777052 8741858 8415193
14132 8415193 8217739 8067691 8354930 7959774 8101312 7931810 7671894 7642038 7452407 7448533
14122 7448533 7145185 6994644 7143146 6964387 6828836 7006266 6739954 6742571 6456173 6843662
14112 6843662 6577074 6160283 6457753 5839090 6046054 6453078 5839368 5845523 5776900 5520414
14102 5520414 6105851 5713503 5375071 5389713 5511076 5388531 5357897 5360610 5061741 5133649
14092 5133649 4979153 5094336 5019154 4843499 4945902 4626796 4695929 4692496 4384744 4618988
14082 4618988 4375358 4574963 4156270 4450781 4326979 4158074 4422337 3964297 4273171
14073 4273171 3898350 4362167 4009326 4209190 3992401 4091715 3772985 3952033 3724326 3967648
14063 3967648 3527248 3845978 3779471 3780791 3792278 3842684 3878903 3309104 3589226 3438936
14053 3438936 3342455 3246110 3278349 2913855 3241978 3395260 3136770 3317236 3091612 3247300
14043 3247300 3249947 3068138 2894517 2839130 2891980 2910975 2906603 3318917 3420432 3229295 3214031
14032 3214031 3005134 3174515 2877263 2823123 2852804 2723990 2719337 2660497 2483794 2458591
14022 2458591 2602166 2723153 2038053 2477028 2693410 2451208 2252433 2457125 2468751 2444264
14012 2444264 2121684 2407569 2331518 1948700 2006970 1878753 2184551 2280804 1855570 2086885
14002 2086885 2142690 1863418 2081711 2387028 2172107 2124639 2153392 1879916 1942007 1979476
13992 1979476 1779994 2175206 2456642 2951774 5436958 10927674 26378840 45735990
13984 45735990 26930371 13571966 7885147 6111367 4416305 3678509 3703130 3545619
13976 3545619 2970284 2923301 2506829 2268441 2299338 2233183 2598062 2243477 2351818 2136505
13966 2136505 2326472 2066502 2018073 2110963 2173424 2045478 1981807 1898160 1955260 1945668 2102721
13955 2102721 1646735 1762119 1646037 1501812 1704825 1795239 1800726 1657574 1888082 1948979
13945 1948979 1572002 1749991 1692022 1897688 1524177 1907272 1661908 1729923 1801619 1536955
13935 1536955 1630402 1331702 1542090 1890938 1880006 1635809 1680109 1491408 1532147 1205204
13925 1205204 1557010 1455447 1654273 1557604 1487774 1758304 1602847 1328788 1309042 1459726
13915 1459726 1672252 1181114 1563201 1572939 1338676 1204770 1409343 1137699 1498053 1383660
13905 1383660 1057539 1161916 1343012 1306035 1472136 1069709 1384316 1461060 1268300 1125275
13895 1125275 1242691 1299273 1407643 1376270 1068522 1130908 1256705 1195398 1364180 1373965
13885 1373965 1111068 907848 899381 1036916 1199064 912030 1079486 1192184 1511749 1202430
13875 1202430 959510 1166280 1184676 1076072 828145 1268695 835020 780091 1028253 921881
13865 921881 1020319 853334 1171164 924793 1205890 1080129 1000686 880638 891332 907244
13855 907244 764496 970350 908461 906806 892529 1073838 863283 1052790 865285 1130633
13845 1130633 922447 796645 899587 1019085 822299 907707 809360 1092762 1022406 557764
13835 557764 935143 1130678 1043929 903480 917106 647022 876969 886431 891125 718095 831357
13824 831357 976637 814934 954943 757658 1128664 520088 621327 667497 813405 776056
13814 776056 750341 988361 861750 990019 673187 911191 728052 692530 887790 700727
13804 700727 840652 582195 956257 635559 666243 828355 768190 981694 726280 754268
13794 754268 823188 752444 791888 900266 769122 950971 687905 732425 894454 447992
13784 447992 817910 522162 601570 460464 691877 815590 864312 890345 575309 922558
13774 922558 753895 497033 661410 879028 927888 655789 697105 652794 908949 611319
13764 611319 984184 383618 576759 667195 604787 619593 425058 527065 660723 449862
13754 449862 271058 608901 260947 468976 415473 555513 544645 440480 641598 760395
13744 760395 1121273 490506 395135 430347 639970 845300 730846 641694 640240 725420 525198
13733 525198 526161 377313 382334 277032 677085 341116 490615 563190 699557 552597 475325
13722 475325 781236 563332 394037 591263 785717 555790 570503 606687 484306 508827
13712 508827 982390 630762 517399 430001 522828 828184 180117 384309 918357 550380
13702 550380 485698 392880 693348 770945 325818 795616 402752 305898 463490 378999
13692 378999 243087 253363 623173 623111 336472 487064 430886 485478 169413 433203 609806
13681 609806 496896 290982 539595 543484 500233 517575 402937 798118 520119 361935
13671 361935 491606 98378 574943 463500 444618 358278 460700 364548 556958 340055
13661 340055 484728 260009 712063 671276 573801 509128 285137 236503 165356 366615
13651 366615 499343 544273 638580 365417 514062 339143 414620 364172 465032 36261
13640 324616 584484 499264 605786 546127 305080 297004 265455 623365 371257 579530
13630 579530 432571 393379 375164 497946 134989 188300 292832 484845 260337 196171
13620 196171 119700 463531 166663 286676 292903 394377 586226 309614 486653 132764
13609 539008 300500 311190 638327 304861 758660 613723 272157 332889 407200 93620
13598 457866 560027 -4964 390074 275932 288692 242398 312337 60778 518751 263667 294850
13587 294850 488430 251587 102794 328394 228620 318409 147976 332510 394367 283160
13577 283160 266489 200233 392991 439655 281199 424905 118251 111145 -118143 285969
13566 224034 562814 273528 394588 503095 378788 187702 433646 110495 281550 136634
13555 392042 545349 427399 162413 481175 276677 355681 425320 141097 -7095 521926
13544 268130 255809 189935 36878 22937 413342 442196 197669 147426 89427 172572 441454
13533 441454 124021 433975 367226 40910 226779 370694 106584 46823 351056 367264
13523 367264 394061 425360 254739 246145 155634 231147 5943 -99984 332666 -125004 212171
13511 312150 140204 480871 480704 77297 292397 154696 138795 253664 22405 331276 194708
13500 194708 255917 23530 143648 373245 -22109 310405 156339 11823 177857 241298
13490 241298 398570 161745 -22214 197646 427039 159867 74828 309121 484355 189007
13479 75157 310831 129085 -12556 320256 245719 178197 214933 -4630 330734 197136 81548
13467 203337 178364 286500 -50806 461499 111685 277222 234329 135489 107706 72032 115108
13456 115108 151424 186693 334713 592649 253697 6008 86509 421959 302866 170602
13446 170602 339992 -20264 189045 352154 176393 303078 100713 -47983 257190 -39261
13435 312874 221052 -35889 367417 383455 574898 59895 383635 72827 -224055 148887
13424 203595 434613 536038 116370 23028 455105 385009 260229 428067 -20337 75062
13413 125915 183883 192095 404663 45703 9269 294743 286926 214771 230296 175180 17816 179444
13401 179444 420930 127876 258614 364916 220575 240434 -311422 41441 184711 104934
13391 104934 259673 77496 -24514 37330 192469 22236 180979 176358 257424 324990 316396
13380 316396 456686 133463 496849 135838 56808 141046 320138 370094 72523 -65045
13369 26779 -75189 314964 308235 -143786 316024 577155 88316 263584 -94419 145766 93304
13358 93304 383150 23675 458090 -72741 345420 300748 384364 193091 284675 40458 -6771
13346 124740 -47183 149207 -283079 29754 356483 763355 376417 226344 206305 161122
13336 161122 357955 438066 512261 321458 351369 351404 229586 646919 434870 287715 383994
13325 383994 150668 -292118 258977 224713 419812 51393 486956 239665 123822 206302
13315 206302 217023 247639 158781 65585 522469 136895 308677 235111 515738 285882
13305 285882 102784 -101778 99780 -194788 10397 133732 102667 97291 39192 -34823 90441
13293 342244 152307 44520 312265 294815 145851 20028 318350 144048 88274 -6749 114372
13281 78340 300703 13796 98110 44365 -89198 57804 310451 244528 -7704 228109 -68586
13269 34998 -108968 130492 -35403 69462 454969 112600 204189 304385 305862 233377 -23052
13257 299583 199755 217027 -46949 303563 -46992 132780 -4582 201109 323335 239446 288905
13246 288905 196894 110489 78945 333796 76452 47334 -38793 389481 102395 50323 -122821
13234 355968 109462 66264 -42413 -137621 185544 100282 60707 -142516 175690 -82529 -62215
13223 -62215 -19214 -136264 -23129 -23770 145952 -688 83904 129070 38721 -7418 148661 325459
13211 325459 15012 128094 -49159 -27331 117056 134483 107200 89308 222306 31251 218773
13200 218773 -148662 140034 330296 97177 238515 130228 133246 -16759 -23899 -67843 -23053
13188 6388 190953 -107117 -39730 436048 298257 125398 376836 74864 31831 141618
13178 141618 132132 112450 315245 -25541 -10255 -37405 -7499 82980 29463 -32586 -54747 163257
13165 -100341 101513 114114 134962 119376 -107303 338139 181888 21559 229384 60843
13154 -1584 318000 71066 4386 -75122 -22976 387241 -95355 143808 403339 212799 50456
13142 52296 69412 -15867 -77377 225576 341156 253606 53446 -8554 -135080 278643 -60657
13130 359450 122658 136462 19423 209021 81898 203652 61079 -162700 -168589 10792 156239
13119 156239 229558 59705 -312290 385503 -85839 333980 105911 -135518 74701 307869
13109 307869 274946 -51568 -164241 -25376 467216 204384 23205 8028 98685 86505 72862
13098 72862 -106063 42318 17043 -102208 289217 -47869 -32546 60771 -85510 -48667 -157819
13087 -157819 202152 -14264 -304 -240712 99141 -107047 163575 10527 -29920 15320 -119346
13075 93618 317668 273185 371429 -90755 -113908 66137 -39452 -12971 -34300 -64323 -41095
13064 -41095 96606 48105 -9559 -96224 -157926 146824 177274 -134653 261844 -161688 200027
13052 110314 39419 -48227 -148961 -189674 269118 -70975 -302460 103553 74681 313894
13042 313894 339088 88556 -34270 183738 191133 -67503 -105026 -112235 386846 533577 302783
13031 302783 24556 98358 192613 -62643 239674 -196411 335077 211077 71748 89284 45834
13020 45834 44098 -116425 275247 -37963 131785 22128 210552 68315 163339 139010 280805
13009 280805 -119902 156437 72224 66479 43298 -156618 114233 -52700 -63328 32201 268326
12998 268326 -118586 252226 24691 -74931 -137136 -149730 -101888 374305 142856 54725 -81343
12986 139142 224171 314960 -129582 -1279 -86438 225100 -110415 231049 -12163 -137144 -49549
12974 83511 495416 205603 -51241 249398 -88738 -112370 -140828 7481 178142 -203981 7421
12962 13431 -229233 101328 83718 89660 96685 27311 -41837 -353638 168651 188078 -91584
12950 29164 -53212 -26232 -67338 -245838 9530 946 273350 3108 67026 -19926 91041 -8506
12937 -105394 58128 49775 -300250 10234 159133 -12143 -258906 102422 -6917 261826 108206
12925 151195 270139 124187 -42212 23578 266443 373188 29737 111400 -54108 40462 -22896
12913 56868 29828 -46666 339026 24557 -26757 -207316 114311 33200 -278457 51473 -122107
12901 197420 167421 -291786 -73672 -22980 -24767 33845 -182769 158741 -487754 195167 -216264
12889 72712 386836 276117 148934 63688 143316 5674 -191229 -328249 -43403 75962 162169
12878 162169 -97518 -111856 15417 -16427 -306342 34309 -81535 142659 189726 152566 -17934
12866 131136 43850 165363 3141 122753 142714 154739 -73737 -65690 275084 48136 34743
12855 34743 217232 31461 -84428 63268 -26607 -435 101404 -130444 -177900 50903 23683
12843 -51146 -81069 -196172 54370 -119014 -187304 109234 -61793 -115294 196600 103437 209360
12832 209360 196116 -27096 -119287 193286 258134 -171182 -80239 122195 -102538 159358
12821 77242 -109049 -174235 -143193 131897 201480 206565 36477 5947 -17907 39880 250917
12810 250917 188054 -147077 106223 -262620 64934 27107 21376 -97048 -3843 -85847 10206
12798 238309 -133426 -97947 -197673 -222659 312005 16790 67182 -207488 -26633 12261 24553
12787 24553 49303 -174998 -68877 -18972 -185425 -68594 178968 158123 -46967 73258 268039
12776 268039 182030 240726 -21746 -240636 84072 -279906 -334346 247567 17854 -19781 133305
12764 19289 -59749 132499 111584 -4804 -49341 -98402 -259879 44613 -79908 -196906 85813
12752 63218 -165923 -12870 -68851 -247312 -82495 143577 -242084 15058 175249 -43597 -184711
12741 -184711 -146687 247676 162228 376459 163240 163743 -28750 112142 46606 51193 -90712
12729 152809 179690 48247 58702 -10883 28449 -23769 -53638 -203789 -77328 108386 -163453
12717 -99822 -23984 -31038 308658 -224794 229960 307605 265185 123793 -69255 60276 162623
12706 162623 361491 -100263 32512 -197883 -99342 -9503 -123329 338559 167393 -32451
12695 -192029 136335 -162940 549031 200430 -45974 -226882 -102269 -183066 7042 -200258
12684 -205447 -152024 104779 306698 -101806 -168161 8749 34053 -63030 -145983 51788 114606
12673 114606 310483 23905 168486 -48412 264037 -377722 110695 82366 45700 91488
12663 91488 284739 -123248 61184 31161 32342 -147047 115415 174196 30857 232968 153088
12652 153088 -30983 9767 -168925 78125 -202541 133244 -150980 -85215 -85972 -167522 -211149
12641 -211149 -45434 -66042 181375 108725 -79361 -3795 184729 -178527 -70785 264951 67967
12629 -8501 221439 134726 -30371 -149767 315428 -224865 142445 132289 28847 107108 70295
12618 70295 69567 -187466 -65265 66081 -67331 -244236 -147221 143163 -16921 -181344 43784
12606 289597 151511 137487 -64646 -11475 195776 -6868 -3355 377666 34155 28981 -93379
12594 118724 -79149 -145229 429983 -201096 -32206 -83696 281582 -68175 134601 886 157727
12583 157727 -243433 -110845 -13404 -170669 -44211 74836 198395 29187 -184709 333079
12572 43915 -15758 288782 -178060 -205815 -114297 -134229 -62289 -19750 -87195 -219090 -154076
12561 -154076 64643 217690 257520 2197 34376 99026 95985 8349 105068 -89235 100437 -109335
12548 280363 365965 -17433 20742 528081 70640 463925 110671 244263 193638 439674
12538 439674 94635 -125314 59425 330027 -128561 -271940 54067 -175409 -149606 45853
12527 4624 -296668 -207207 -59007 68258 173362 -194303 156776 -257199 136204 280992
12517 280992 203399 333751 590362 369824 646683 543975 340375 695026 260180 44246
12506 -153794 266355 8304 201711 -208128 -123835 -194459 93160 -183603 160610 115142 -38952
12494 103739 -12779 -28810 402881 78475 136723 67096 70518 13189 -132656 217089 277040
12483 277040 263999 258859 24845 148458 1610 102780 336237 158026 59218 -62953 18863
12471 101667 37237 -10224 -77546 -151212 -67699 73598 -146245 -158532 35402 84465 118363
12460 118363 -21706 78942 -176941 -142313 175285 -255917 -141969 82062 -136396 22140
12449 40301 -204254 99081 -83121 254802 -236722 -202825 -21263 -118599 -94962 286237 329287
12438 329287 49513 -148480 35072 36042 347332 292692 -46335 58669 -45927 49872 150343
12427 150343 148341 81345 -67574 -151295 326292 55185 88293 -11396 -127114 107720 -41717
12415 139482 130267 -230151 -55408 241318 71589 -201914 -78343 31867 -193597 9743 -47745
12403 -32798 -122195 -95219 249957 377397 102413 -47548 -218554 11593 470551 28522 -134916
12391 -31977 121063 -149280 4502 -139485 328585 -126305 153395 -183100 -297716 242503
12380 111280 -309182 7660 49977 46982 343429 30318 -231027 184464 -209692 -189550 973
12368 -15025 124770 163243 -8595 -132350 212162 -11605 -47139 -256417 15639 117462 63372
12357 63372 127421 119621 172795 -193025 -368447 95847 38613 246383 -18891 -47751 -284700
12346 -284700 77117 -1885 -207455 426423 -288455 312519 -297191 9124 -143299 289703
12335 -119153 279330 333310 373396 -23786 451223 141385 390940 325535 125253 284577
12325 284577 41180 100043 283099 26761 -50356 16031 125130 137797 700 93943 -241044
12313 -303326 224153 -245267 207355 184019 7336 197680 108932 -103420 44378 228393
12303 228393 33002 19971 -69841 80607 -79133 164375 189995 -120965 119682 24014 125171
12292 125171 245220 94971 76626 -49816 -177179 259207 -19582 -87124 -51345 399987 20987
12280 -16543 148309 47995 164078 206099 15872 -166164 125098 -375454 204736 372731
12270 372731 46556 236655 25501 208576 72399 -73096 -260520 -33122 16773 34951 316138
12259 316138 -128469 -46400 118664 470876 271746 -531952 8881 404197 50648 -57261
12248 363367 200024 -68943 -121147 37293 -111669 261558 360377 101936 80628 360297
12238 360297 234955 135258 82771 222681 362167 -51020 -132304 47778 53463 -278733 49804
12226 143884 -74639 260271 54847 -228252 191987 209301 293681 -49823 517183 417761 299089
12215 299089 319091 293676 195905 106548 307001 121909 319035 422127 96288 180277 157214
12204 157214 87349 92287 149470 53835 189787 -123296 75759 202893 149089 -289736 104673
12192 258651 112407 248106 256614 59508 217468 352633 293461 277269 296946 106155 178260
12181 178260 2474 157397 80602 450449 7486 89561 411977 -31540 313115 137916 138469
12170 138469 -302822 90111 249306 -89473 202828 -47652 327321 -61725 356864 442849
12160 442849 295146 118129 162143 -142147 18676 138298 257662 140356 -83697 -15295
12149 78061 90613 52813 5396 153988 -310946 287390 -138199 62244 319617 36602 162215
12138 162215 419872 58446 273488 309300 273674 124466 86718 90101 333526 17605 26143
12127 26143 106049 -93440 376525 331519 -156427 -46525 144445 -279933 9884 1238 -43809
12115 228898 226318 144107 -23796 20272 -107411 -107749 100404 -108790 21473 -14588 52037
12103 208771 141148 -100869 -54408 40446 -95321 -302476 -51065 127283 -107626 211585
12092 87539 -116888 -265915 468289 247712 -206308 245250 38265 116450 87 -56165 -23608
12080 212487 86192 -241283 -153941 -46318 104053 399632 -341419 -177884 285193 288337
12070 288337 262023 194446 -394006 -52841 102090 -42994 -146655 -117987 -29945 298681 51911
12058 90966 10895 67897 32400 84704 249634 116216 29948 -87254 13171 115740 -259154
12046 319312 -86590 -81906 44939 232138 100447 -428284 454169 -246502 -163444 -53744 -31166
12035 -31166 5352 178376 157928 111091 136129 66973 -109694 -104378 -244588 364633 -53821
12023 75430 -185250 30645 44412 163001 -103794 -243133 -232389 -185887 32878 4809 -73450
12011 70809 -85515 57119 449267 -259287 146405 132536 52060 -120266 -363674 327079
12000 -266406 5351 118651 -103496 -188168 -360398 184713 -92760 -224507 437924 -21656
11989 -143016 3003 35333 104787 -236712 257716 -22211 71348 -8125 -205783 -184957 138147
11977 277728 45314 -26799 -203110 28156 368247 -281246 216516 112693 89887 30426
11966 -76518 -327139 -182763 229823 264469 -98334 139445 55464 -204814 -2206 103210 14338
11954 148267 73190 -58342 203434 52894 -256033 -13908 -104350 106552 -54881 -162713 -9726
11942 -299195 -306110 -199105 -215469 240551 49227 -6720 125548 118431 -94004 -125819 -84009
11931 -84009 -172590 -65778 152095 83412 88820 37722 65976 147284 60731 -128275 55272
11919 38107 78104 55807 35913 112896 269137 44908 -64289 67045 -73885 -24265 -31128 107013
11906 -194468 -508 69609 90024 -147078 -290556 -92749 87643 -192368 -289859 -163662 27986
11894 -53400 -461527 -22530 -45821 -202362 60823 -115722 29095 -104867 67376 -56403 45205
11882 126698 -188968 -11226 -280607 -182076 -449779 -132916 -38045 187202 128212 75049
11872 75049 168194 133335 74389 -118255 -239662 192180 -328032 63944 446133 -291112
11861 -11789 -122334 -208662 121981 -52304 33357 -216124 -114142 -74871 -95266 -13195 -196407
11850 -196407 41837 -111080 -413120 -136526 -196186 -225507 -31610 -31639 190018 130010 139502
11839 139502 -395148 64034 -74007 -147674 28564 133762 187463 -139941 171342 -291740
11828 158151 -116013 110048 180104 -253113 4585 -289635 -457420 -47234 -25290 -296834
11818 -296834 -6400 227263 -166820 232125 -27283 -184166 -152821 -219368 -11632 -34595 7867
11806 -78541 -202998 56198 -166261 -129911 29924 468 -227692 32349 101396 -197704 12366
11794 -315769 114554 63119 335114 -115689 199428 -364428 -124170 154716 -68583 -168148
11784 -168148 -45946 -35166 -84186 46252 167000 -33654 -634845 90091 303067 233361 -176889
11772 275125 -104004 311539 -47042 163992 120641 -299207 -51434 61588 -18823 75598 78289
11761 78289 -224770 14389 342174 -110163 -125988 -212878 -320934 158937 41351 -243171
11750 -17603 73732 14821 295731 -399846 -129834 62189 32775 141922 140725 42312 -377024
11738 -258818 14188 110330 89901 241594 -88597 51720 -137558 -264250 -104983 -288861
11728 -288861 -53161 21875 338962 94781 143098 -74427 -33629 -129276 19045 -121892 85544
11716 210011 221330 -390636 38843 -124572 -1189 164539 -401815 13418 103963 -80169 -137122
11705 -137122 30776 132660 -79435 -152198 -45021 -73014 269844 -230827 -7177 -75867 42148
11693 123210 10059 87508 135805 35939 21714 151917 37676 -103328 -264092 -94780 -254546
11682 -254546 -268231 128019 185700 -525258 123812 63351 -28652 104057 403141 25436
11671 -197510 9533 -160066 -196413 171579 182360 -61844 -180458 105913 341630 -127535
11660 141836 -72405 132103 72197 -174329 86594 -89538 -63850 -160470 192667 128409 -5719
11648 123515 -373287 68172 -174557 -205589 483791 152762 68802 -249229 -340157 37713
11637 108371 -216646 103437 91441 53379 82843 96459 28827 394159 -142255 -88902 92732
11625 190063 67223 106181 19023 -1585 185248 -168853 -67182 98710 -20072 -129381 -222650
11614 -222650 93420 69530 46701 190908 -106408 -63373 -232482 95842 321643 80472 147939
11603 147939 83804 -173441 -141748 118577 -73781 50566 109899 115033 18054 185542 481515
11592 481515 -59933 -42177 -232703 134308 -132131 425943 -164317 -226663 306780 87309
11581 223330 44625 -275656 -112630 50602 66336 20084 -155524 54301 416276 -205169
11570 -43260 -37633 95655 197140 -92858 188109 169368 -304792 -234863 169472 9548 14907
11559 14907 -122114 203437 28496 -73293 123483 154519 -104825 -43764 -74864 380645 -38122
11547 197063 237156 -230283 -48974 86262 256599 -33467 77292 -102260 -53184 209496 92710
11535 -60181 49031 39640 301021 208169 -130006 21355 52202 -122516 77370 19472 -126574
11523 32157 -17686 57816 100117 131769 -265402 -5060 69402 294156 126629 90551 -28887
11511 207835 32249 231660 209085 -221323 -212029 -63808 245678 -129404 255808 -158676
11500 208345 -227783 -241457 1580 -60004 78865 -168350 298556 135189 88862 277084 31060
11488 274551 236822 -153024 78405 55950 211810 333521 82915 -17038 12824 96153 137052
11477 137052 19668 -209226 134898 -44176 44296 231253 139640 294353 225279 -27295 265057
11465 249437 342373 310719 -229331 19378 454690 218169 277615 219479 219979 314022 176989
11454 176989 10789 87898 172287 -153297 -43011 71401 252833 -116078 197317 129193 143754
11443 143754 226425 244077 126355 171629 -91310 -135874 405117 275373 141565 410586
11433 410586 -7646 64055 329675 135767 172615 -2382 -2080 -164654 278464 -220948 37113
11421 129780 251202 -41816 -22890 17715 -7016 56469 -305754 188706 112075 6600 -411317
11409 237757 -145578 -76277 173943 60620 33675 40050 -30253 117525 22131 3445 34858
11398 34858 -101243 247653 -70298 394208 -149789 -92753 69800 51947 -104024 -137216 -26885
11386 142910 59244 170162 -21021 -188681 -115213 253559 193666 -146672 -344337 114842
11375 -168451 -145053 -69615 -196820 -9259 -21576 135698 10066 242883 94342 -328845 -164175
11363 6149 -347571 -2310 102569 -59353 -191754 -124597 -44066 35914 -257097 -98533 185914
11351 -27198 34129 -221554 -14035 45961 -32559 -284345 -176230 -78116 -170838 101585 -38152
11339 -83526 351506 327583 -111438 68905 -155414 -60289 124954 -248682 -274317 108869
11328 94069 77533 36546 -47897 -102534 62764 184377 -81506 -87801 84559 -269227 155056
11316 -4759 -235687 54541 34720 -49421 165817 -267652 -108931 59823 -159059 9930 -158610
11304 -271055 54694 -231065 198146 -151955 -132205 114773 26915 -318377 -27767 -99926
11294 -99926 288358 -70353 157424 199 236094 -11400 -94776 -433346 -63620 48130 -232325
11282 -42174 -203287 -47139 84204 107312 148988 -16854 68585 -251503 -51235 -183176 1026
11270 224074 -27845 -100408 -204720 99998 19711 -241917 -472942 -47485 20956 -10550 -245046
11259 -245046 -202436 1771 -93466 110822 -6385 231856 -61622 44482 154027 148908 161650
11248 161650 157133 -49260 -73567 16630 -37523 -50038 -236234 53018 98553 -42353 -40640 -101001
11236 -101001 -32040 35152 -385324 112158 37415 -353295 -83792 -395633 14035 -177593
11225 -102245 -84642 66023 -332571 74589 -177589 -146905 -143312 27442 170224 -219311 -101026
11213 -141858 225060 -173361 -32372 130912 75613 -760 -191193 -117012 83037 -3400 -192958
11202 -192958 -324299 -2099 -385003 -46793 43155 -238867 -306840 163898 -11269 182722 -241029
11190 -42159 -103114 -58245 299455 351194 101847 -69506 166274 -226966 -223087 292968 -80959
11178 38849 90499 11189 -145090 -34816 -287338 167140 -231209 28526 -8040 191376 -130161
11166 -28403 -125523 -172652 -201001 -120260 -53234 -22339 124899 236810 -361879 6316 -83845
11154 -162245 70992 103323 -298871 -33308 -24771 -336866 143381 128626 3900 62770 -85872
11142 25858 -500260 -76217 52986 -14559 -227908 192658 352153 -138553 38305 -95992 114565
11130 -162538 -87237 95206 181563 22267 400601 7474 35681 -28471 345 -28823 166329 216951
11118 216951 189406 141109 17488 413082 73291 158984 -40170 -180940 139439 -307878 142348
11106 78501 171668 404668 430254 -95883 147499 390512 53780 203837 254905 181664 137609
11095 137609 -39072 183644 514611 413962 -128309 373942 -63407 113030 262711 260878
11085 260878 266376 156707 422040 13616 38212 173531 218304 418596 261723 493902
11075 493902 260155 485945 229850 33990 -45175 350501 213051 559814 419170 353219
11065 353219 307746 231970 478571 729123 469490 155374 639290 440234 966742 487689
11055 487689 1067801 689624 624094 650236 698828 561296 681977 709134 969193 1016603
11045 1016603 762195 850155 1214284 1078366 1392184 1041877 989564 1116315 1009374 1332342
11035 1332342 1249430 1127028 1019382 925300 753408 912042 907470 1007951 861277 798391
11025 798391 683568 715681 1021778 658835 1232371 1002913 1202566 1056727 1076462 850964
11015 850964 1042941 1011397 647866 277212 792336 805257 698154 755439 628265 777723
11005 777723 828033 631463 665283 1069457 760826 546934 900200 591169 908071 381882
10994 804004 497464 871548 928295 837665 893706 624595 644448 650747 769227 858801 812667
10983 812667 638230 668312 708780 920723 879502 1279481 1124622 1077747 1331647 1395226
10973 1395226 1564816 1871052 1877118 1855782 1984624 2390351 2710049 3034761 3368613 3970237
10963 3970237 4255011 4261805 4224144 3470771 2713663 2288331 1772816 1728175 1172371 1403215
10953 1403215 1200200 1182592 1309549 1599104 1054532 882175 794694 1074054 956168 1189621
10943 1189621 446456 566551 355111 582768 302337 374660 305368 195436 -287863 323375
10932 7137 419 277082 4826 282120 108969 53256 84536 -136639 -30472 101782 84588
10921 84588 -126813 197974 398946 -50051 -9949 -37970 221971 17971 143832 182117 79273
10909 -176014 192984 -8792 -50553 66789 -76415 295155 27146 -84016 -128094 17301 -117519
10897 -121418 -195834 -96552 -1903 30329 364458 12047 25831 -312471 -148545 -236364 221538
10885 -225851 281949 64203 -273269 288245 63376 302749 -11088 87994 -35011 -253036
10875 -253036 -232133 -218618 13130 118798 -38089 237890 -52537 -103706 67325 645 312871
10864 312871 -439780 78331 -211900 17719 -144294 -195066 41340 197906 176952 -41434 17205
10852 -96665 143594 -46865 -103746 -58866 219313 44318 -158445 -118673 -89399 -238239 -20511
10840 31374 -191852 -327606 -104436 72682 188320 -201611 254865 21797 -98294 156097
10829 -84312 96353 49610 -1694 -6466 -311411 173983 -18261 168215 214340 -57280 157427
10817 103711 34467 122411 -275878 -84006 -252933 13676 171638 198747 -137545 -46372 -94367
10806 -94367 329 152346 -113876 151354 -116833 -199378 -230481 103006 97008 6547 -91428
10794 -324406 -13647 -333927 -123654 25393 -66028 -56652 -388826 -436277 469603 12239 -28582
10782 49827 -293926 -159986 330491 -157903 114317 194541 -170088 60993 -165499 -184902
10772 -184902 -159606 -272998 174472 85884 -98412 227704 9671 -9394 -183613 -28660 3630
10760 -226019 -196312 135245 90089 -32851 -103338 -35216 4970 -105473 120712 -76944 26295
10748 66340 -293775 -13715 -113184 10277 -37033 -173069 9025 -82463 31532 -246188 -73855
10736 -120989 -146608 146997 -140343 -63468 147927 -45205 -111177 34403 -119216 78515 -129703
10724 -418848 99616 -326259 -76164 -167898 -195569 -128231 -252550 97905 59175 74720 30947
10712 -77338 -319674 306745 -388524 -99798 61035 -232524 -258563 -70636 -24215 -316199 -171853
10701 -171853 160995 -334486 251285 -101802 11107 -302291 63853 123720 -40587 -836 -8401
10690 -8401 -161035 57788 34775 -123944 -163595 -298179 -79922 -11446 21579 -39265 -50447
10679 -50447 115881 350569 -107375 -122882 55770 -195176 -159479 81173 -256194 83649 55507
10668 55507 -391996 -91616 -444296 -10633 -59940 -198042 -138513 -97769 162538 185868 -179517
10656 91762 -180554 -204803 -106607 -170994 -206399 -190377 62227 -6944 -253827 38355 -123476
10644 -221209 -112825 50204 -55085 -325481 191340 -5987 -186144 -210762 187986 -107281
10633 -59536 237395 -108581 -205484 -189533 -255089 -119085 180923 -188309 -173083 120 -179315
10621 -55023 -338918 -362785 41157 93436 48959 -57476 -18234 104097 -101881 50690 -80702
10609 57929 -118696 -292614 -86609 -279215 72682 -107319 130043 -225370 89360 -36335
10598 -192875 29208 126135 94450 -225601 20316 -104921 24934 140190 -12012 30506 24484
10587 24484 14820 103827 -248505 -558525 8429 35086 -35278 163695 -31108 -15193 149951
10575 101654 -176709 -164288 -244488 -208812 -173015 113654 127624 27953 214857 53945 2602
10563 210532 2302 -96691 168780 -34438 -110034 -186184 -156307 88397 -133919 86293 -120979
10551 -130371 -15069 -405920 -166781 80011 399353 -44864 -77065 1496 -59125 155818 126025
10540 126025 -89782 266995 137146 70985 177506 121069 -185708 -72178 107520 113357 -294251
10528 -257665 -133604 -466295 -48347 38450 140389 -259727 92500 -59215 -107283 -156379 41882
10516 11985 -89772 -399676 -90290 69796 52664 -34146 56890 -389384 -21428 110992 106917
10505 106917 -307515 -404376 -111545 88742 -167221 97386 -25591 -130996 -74039 229763
10494 -92052 -294789 -448128 144530 -60858 -200412 89456 18485 212684 -253071 120066
10483 85142 -194806 -136196 -289337 200661 24692 118881 170974 249674 148086 274717 -20575
10471 329700 -155335 193839 156270 20674 219321 -4942 -254931 108268 -77342 -44211 -190823
10460 -190823 -89734 157837 -82058 -137072 -60550 16474 -168067 -85119 179053 -272940 50300
10448 -185611 -85229 -237270 121375 -355947 -95731 -143075 -85442 49842 -48317 -331076 9727
10436 108370 -32590 -384883 69483 57823 -58368 157139 -213643 78633 -55573 -109030 -325827
10425 -325827 -190054 336453 -336254 -279268 58633 -274112 109854 -24187 -123245 -330242
10415 -330242 -32256 -1353 298596 390784 37694 166731 110871 -186298 -12679 -152598 -102743
10404 -102743 215800 -304068 22188 271020 -126890 -236752 -34287 116426 -39854 -415544
10394 -415544 123347 -226288 -35156 74855 -231349 384373 -25775 -27148 -9498 145842 368284
10383 368284 99792 -21114 281905 -354848 364806 -176326 189011 420920 59397 394780
10373 394780 498603 272044 99590 693573 420550 138855 288520 622772 388752 89058
10362 343077 383318 529205 554043 416032 468919 47708 323552 244339 303891 365822 307600
10351 307600 295494 317083 40002 408971 750051 985077 853348 728212 476036 562976
10341 562976 344858 319376 103035 243989 337510 237986 289351 176873 210747 51046 292608
10330 292608 102241 100813 226580 159734 137096 -168304 97356 228037 202897 -83217 198397
10318 279978 212901 302411 127042 162035 -57219 170730 13329 8654 -34049 -53165 -204175
10307 -204175 237857 -307250 284904 156984 -60536 -27995 -68954 6574 7950 117318 -17340
10295 -17927 -227741 -56119 -55273 18632 -293065 281967 -101118 -418264 149809 -287259 157980
10283 -253755 -528268 -75112 -66952 36815 -21865 101353 8560 -246500 -219857 -109848 236651
10271 -166748 -158968 84965 -81898 -33643 -153247 -188690 56096 200037 -40645 220057 49693
10259 -356887 31623 99550 -65539 13816 241236 228330 -143510 136596 228459 117219 263430
10248 263430 190230 271109 55616 81380 -59834 -66726 42094 17670 49674 -284682 -311749
10237 -311749 -89872 -61697 -15937 9419 -176614 39459 -157211 -79529 347845 -182341 -44729
10225 88870 160310 12696 -86162 -302534 -173928 -32599 21768 9549 -223496 -17816 -32587
10214 -32587 -81366 146528 40532 -88740 100287 -33211 -222849 -65261 75011 -160161 -108258
10203 -108258 295255 319932 -182739 185150 6991 137668 56184 -223799 -164615 -135449 -109268
10192 -109268 -61138 -157162 4080 127936 -71279 -202555 -113209 -50104 -205140 160790 47344
10180 -119048 3295 -265762 177873 244466 -254039 171139 -281289 -199263 13962 -320862
10169 206273 -220274 201491 -296036 -106050 -105301 -181743 100275 -171268 -67690 20738 -65491
10157 343678 108550 -223840 176609 18252 -285967 -103401 17634 250688 39616 156340
10147 156340 -126356 -101958 -171347 287478 -139613 -273926 -237151 -271145 -362217 165714
10136 -77024 -250054 192054 -33194 32416 -183309 -76728 -74866 -140189 -153781 315184 -186076
10124 -238578 -27674 146440 138060 -60813 233637 -142695 -32769 -3342 29838 -178839 -56814
10112 -167519 -102722 117418 14148 -488281 -213917 -83102 -272363 -173469 -215864 36318 -76835
10100 -22206 6967 -22031 -50302 -307744 -111792 -120505 -187565 128729 -75719 31488 290020
10089 290020 -148413 -4500 47710 -171622 34562 -201575 35988 2717 -394425 -389737 120694
10077 -273296 -6853 -10773 -154987 -110707 -178144 52950 -67656 -66054 -324796 -7688 -85793 -2708
10064 75063 -163967 -119884 -10172 39138 -132804 -282439 -73996 -73862 118051 -51061 114457
10052 -29643 197811 39114 -32328 330543 -125721 -103484 -212203 -93466 76980 -222349 -147909
10041 -147909 75965 -184593 101470 -185730 -186436 -324278 47706 -32448 -266902 -315710 -428297
10030 -428297 -139569 -70255 70414 11192 -408 -55942 -39946 106382 -40082 -88945 -9472 -72788
10018 -72788 -382414 -3644 64874 89512 194447 -428456 -163802 -114897 -241574 46688 -98596
10006 -170242 -103146 126768 261530 -187224 -194050 -210912 34466 -95041 -50357 87182 62569
9995 62569 -102495 -91806 72469 -50235 -70460 -346403 177851 -58942 69797 -1883 313422
9983 19055 -261982 508756 127707 11035 67109 36629 11553 -123785 -213787 44662 -112609
9971 75024 31395 36578 -178357 -242958 -66228 180313 31337 -89057 -57099 -163725 24174
9959 -134065 -533592 81049 125352 -335121 -199764 244785 -156499 -181118 4256 104924 144770
9948 144770 -94759 -5203 182715 -8825 -111359 -138526 -187192 146356 115288 -119676 -251224
9937 -251224 -346654 -35954 -120991 236054 38879 119765 133371 -68270 17306 -66554 106160
9925 -140265 86260 74025 -170041 -398043 -104276 205901 -154597 -70416 -19781 -138320
9915 -138320 -157581 237213 80891 -70784 -139420 -167560 -293677 -52875 -121480 2685 110208
9904 110208 -24924 -224381 -254713 -202630 -197382 -228977 287003 -386495 -319316 -15011 -186724
9893 -186724 202387 246110 78134 -306300 -36117 -202056 -304738 241644 -132612 -67045
9883 -67045 -360534 -224186 -207775 -99365 302519 262413 -196299 -7899 -202000 -49077 -68349
9872 -68349 -455599 -128486 -4259 -106642 -303464 232326 168017 -240353 119426 -119728
9861 -336023 75669 -97131 -128468 -128246 -139020 -191190 -136262 -122862 51865 158714 -413325 -183568
9848 33276 -123637 66525 163713 -77764 -102379 -232427 -195088 -78613 -244802 -181896 -191297
9837 -191297 -191584 151103 462 -438115 41914 34271 -207442 -101383 -144357 -52435 -168559 268952
9824 -112599 -43399 -145006 688 32570 35469 276691 28960 -69372 -363286 -4348 48639 -400049
9811 169895 44500 -62657 -121685 -247575 -50636 212878 102144 156450 -71483 -196345 -277489
9800 -277489 223674 -50023 74389 -12025 -315915 78385 91684 77494 152376 -41188 -258611
9789 -258611 -388774 147976 58851 -118113 -89800 -85433 -211213 -29174 -210973 149526 -119617
9777 -114846 -43467 -11228 79637 -150819 -8743 235014 -141156 -8760 -97131 131498 -25326
9765 121220 -398633 -11336 -56001 -319515 -128214 119553 150127 -37221 48308 -184351 -103273
9754 -103273 -118173 33003 -328134 236309 -363783 -190266 -29588 119564 -131872 16681
9743 25606 -23380 18775 120642 -37658 324360 -247430 -106269 -32369 -44821 -55259 -18499
9731 -47078 -214492 83329 -397799 -167961 -146094 -232384 84790 -178643 -309765 181058 209686
9720 209686 75665 -167256 -60031 147823 -336369 122633 81873 -297690 -122281 -281217
9710 -281217 80452 291763 -354856 360580 -136536 -121279 -408510 -65410 -104677 60036 -85252
9698 -208933 79973 299297 73293 -77515 -130443 51609 119208 -288909 83313 136403 -80943
9686 -174405 128434 -131261 -108159 17431 -142160 13019 53352 -176553 140040 73038 280781
9675 280781 -27771 278256 -86269 -24970 -12165 -75059 171003 -303431 -272155 -194142 17646
9663 -188470 -66757 252463 120351 -162518 -109327 206212 -114639 -68336 -146271 -295860
9653 -295860 -195361 -133903 -114161 137998 -358899 -176413 184350 -142912 -70873 -122658
9643 -122658 89323 -143522 -422147 -409398 -341699 -172856 -343597 -195431 -261714 228380
9632 -84795 -112186 303980 -21123 -36636 -289595 117411 -99526 -229397 -13323 135134 87654
9621 87654 121826 -283548 -58704 -178622 -26274 59932 -276576 71371 -73961 -142301 26883
9609 2636 18747 276030 154299 -233435 138548 -208679 -460466 -38975 139745 29521 137966
9598 137966 46021 1747 58808 -233006 -53297 269189 -137116 -106859 199850 -7552 184527
9586 -153648 257766 -49318 -56777 123260 -39098 25636 6397 104579 -194005 -55520 -266787
9575 -266787 -78026 1445 -140887 125795 -132244 -113085 121688 -147940 140243 62376 -384111
9563 -219525 -285403 288313 -347939 -15735 -367059 -167888 -73060 -100089 78894 -265754 -247115
9552 -247115 -27523 32837 86309 148136 117180 -8299 -387030 224554 163036 17235 -365070
9540 40990 -32018 72207 -40037 -15112 -205738 55321 -149723 110261 -132860 4711 -140789
9528 -457252 87885 -113115 -208042 -46980 116472 79075 64167 140831 -97472 -93916 -394127
9517 -394127 163351 19568 -15670 -33136 171610 -61824 -12804 -181673 -173515 -51527 -11998
9505 -173533 8786 19123 219474 20870 -31293 -51606 -119394 -25141 -302038 109020 22979
9493 -153656 -62257 -186672 78296 -158808 -229317 -191968 -237228 -28902 -203922 -184550 75865
9481 156968 -283386 -158578 297353 -185225 -243142 233967 8127 163298 265904 -91350
9470 134680 -74359 14760 -14747 111935 156340 298145 -238116 -12937 132426 -217098 140340
9458 -22016 -213816 137832 -44510 -50357 18099 -466058 -171771 246126 -171024 53607 52741
9447 52741 77747 -89443 -12839 80938 -134745 -101036 103490 -12143 -205558 363417 23225
9435 146348 348311 -219620 -8259 -18869 -49349 -548906 -312673 92996 128968 46441 154305
9424 154305 248701 262435 -107124 -61528 -111301 -284764 -59881 -217458 8874 -238321 38054
9412 -340210 23086 261241 -530923 -285089 249257 -32780 -412702 183085 27196 -116725
9401 -177101 73563 -85712 -26525 -320726 -333335 21434 -88975 -60172 -160028 -98703 -67430
9390 -67430 -114677 26161 187851 -253502 20522 -167527 66560 -274857 52158 -58354 -302949
9379 -302949 65196 153603 -82341 -96315 -143678 -67413 87067 -73179 -204325 91113 -196261
9367 279962 131345 -21327 -149323 -30253 95045 71210 -165747 -13754 -61741 -33884 -117519
9356 -117519 21249 -21503 -64880 -169731 38747 100799 -382475 84739 -129537 211123 163958
9345 163958 137813 -93299 -128021 -390269 -98734 -39494 107861 3124 -342611 -214113 -93637
9333 -248243 374828 153875 3573 -19756 -174404 81286 -11268 -115448 -33734 -168797 -51845
9321 117597 -56593 265886 -38526 -58401 8179 31130 139289 -119143 -133335 -195950 -123882
9310 -123882 -18900 -17014 419254 -8551 14643 -5267 -14411 -275935 -171499 -80167 -79521 11930
9297 -129907 24721 -55015 126161 21351 81455 -49681 -46990 -105423 -190877 -172631 -429478
9286 -429478 3815 -281284 -180038 82696 -94601 -59307 -71322 274779 -266582 26990 140719
9275 140719 -30384 99001 -23573 -333223 -102485 127463 55156 -33580 267182 -52418 -63086
9264 -63086 -67688 -479620 135469 -221036 99278 33026 -173407 403764 -130665 -101821 129735
9252 131915 -296539 91198 -130016 299679 105458 -179888 203483 -196713 -33566 -122634
9242 -122634 -202372 120674 -126186 150873 -113558 -190711 -69161 -109287 -26069 154464 -320510
9230 -295000 -88998 281472 27888 104441 60935 -396538 -16262 127239 41905 -54237 -13941
9218 -304094 -601637 -181915 83312 -13004 -40130 1806 -267274 12172 133485 -43125 56196
9206 -163703 -12550 11242 206698 -92611 127198 -4272 -237440 -333565 118489 109965 -138591
9194 -32157 32349 131065 -424060 -255768 -4572 -164590 -227913 -194329 -144862 -152570 -151458 140326
9181 -342667 -40957 211950 -11136 -234177 -197654 -127027 272806 -102134 -336678 304514
9170 201231 141579 -162544 191890 -187738 -90914 -450790 -1602 231168 10389 -341496 146841
9158 -117889 34187 -65798 -105320 -82125 126011 -332580 -38189 -343144 -106283 -33855 -126107
9147 -126107 -239749 -86449 -58931 96899 -53743 228760 -206431 -109103 55749 52584 95562
9136 95562 38678 63000 -258423 -177996 -136815 -34539 231061 -16283 -209228 -97490 -198909
9125 -198909 19679 -266198 -177758 -279370 98550 9814 66013 -151872 -55075 -312811 -50531
9113 -33893 -299328 -152479 307661 100347 63248 -111409 -48181 -66279 109391 -143403
9102 -110921 -21895 -116237 116496 -113473 -77076 -172988 38994 -181106 83383 271226 -182643
9090 69840 -147072 217568 -131988 -104841 73758 -395923 174275 8384 81772 -26275 29428
9078 119730 61996 -279555 -112585 -73615 -44304 -337391 71474 -253540 210941 83777 -217325
9066 -14551 -146128 -261547 -195997 -167451 -81186 -111566 -298164 -265899 -87323 -39083 119084
9054 37395 -200569 132709 -192586 -124195 151825 41060 55496 -101113 -27317 89295 75396
9043 75396 197617 -140845 -334995 -529 -1357 -193980 -520692 217979 -78917 -210796 -23688
9031 -426830 -152433 31614 -99792 -49562 -415860 -245605 -6993 -159283 -250856 -157840 -13674
9019 -74255 -66042 -191565 -87180 -93654 39504 -99331 88130 -103850 -48375 -118663 23603 116272
9007 116272 49232 76743 -183307 -74330 -13642 -178960 -120756 7502 -79105 316685 -61919
8995 -39221 -128757 -108783 85437 -48368 -86040 -115416 -58464 204223 226888 -277665 -204791
8984 -204791 -106455 -79478 -48892 -43911 -177929 -213437 -236895 89365 -462588 -68493 -91994
8973 -91994 68806 -223324 -43225 -54803 -134751 -286893 141700 169729 -158271 -263754 -13980
8961 -189028 4359 -92709 -424529 -200705 19234 39865 -65783 83410 188808 -290456 -147746
8950 -147746 -33309 -182317 -308508 375492 116958 261076 202212 -332946 -68300 -95927
8940 -95927 -164734 26036 -135780 -31155 -135452 122747 -47745 -30479 -194044 170034 108411
8929 108411 -55110 -42 122290 -223871 -30625 -193068 18716 16411 183786 110196 -72142 99116
8916 119774 363804 181169 -14406 -123106 163950 -6352 350107 -194588 -119221 -274209
8906 -274209 -114013 -127404 -229144 18246 -46400 -94407 48323 -78076 -144326 -152502 -324580
8895 -324580 -72893 -349665 -96292 -226414 136379 -26409 -65133 -43789 -2972 -306280 -31768
8883 -107204 -77145 -77673 -309564 35366 -57428 -136546 -93507 -396539 -151103 -181577 -232775
8872 -232775 65165 27457 -16770 246218 85972 -134129 -253199 -73962 67152 -25894 -132287
8861 -132287 -21103 -129240 179395 -171071 11651 -127401 -82038 -121929 120884 -35866 -62203
8850 -62203 -100772 96634 -78278 274259 321487 -73192 -158276 -50100 -174626 6240 18234 59821
8838 59821 -23238 82766 12773 39844 263234 75041 52129 -127134 114585 52474 -406118
8826 300454 -97818 -155091 41333 225840 -112767 1764 75456 152742 194410 -81762 401360
8814 -326138 -298725 20887 207969 135215 -162521 -5496 -95916 -113305 -253873 -77822 -120178
8803 -120178 -57859 73628 451987 28941 -65803 -357543 139528 -30833 -271367 -93446 -178388
8792 -178388 -396361 1219 42706 26525 2217 241433 -203096 -235077 -406941 -216210 27213
8780 -120449 78530 110015 -55875 -282662 118417 -158102 155616 167136 -40950 146337 -199738
8768 108513 23736 -108886 -216874 146721 -96299 -128774 -36725 137426 273044 -238879
8757 -61628 -274847 222152 -136657 -300662 -127832 -187892 -140238 135049 -291001 -358127
8747 -358127 -15619 -79012 202904 364770 -296988 -38809 31887 391205 195244 77315 -146872
8735 -37583 -28829 79548 169659 40951 182010 -15984 288852 69161 -262340 70332 -96088
8723 -101645 13602 51096 -149968 -269364 -164507 -309136 269325 -41924 36115 -87651 -40208
8711 159788 66381 -230309 -269288 -176572 108910 -140878 1911 -188513 -308010 -17675 -244087
8700 -244087 -29800 -32837 139531 -73939 -102736 -55888 186926 -48226 -37444 125103 -15256
8688 54613 166528 88610 -349909 -133280 -214148 228698 -313992 -73372 -183798 151702
8677 -46384 81140 -241184 -447706 -137914 23386 131296 16527 -178884 -79042 340432 -88723
8665 155087 -193216 -263411 -92999 -44811 -190133 -332101 -24914 125706 -49651 -4841 -250564
8654 -250564 -11121 -95182 -7752 81098 -61267 -145913 -113363 236114 -272788 274639 53347
8642 -145253 309915 -272953 -159578 -121137 90382 -145277 199953 -134908 4362 -128876
8631 -6336 -419520 -106695 12524 -163594 -64309 -166269 41545 5235 96734 -81750 -68538
8620 -68538 -40302 -161326 12092 47103 -93146 -142158 -45505 126633 -121940 106254 -197487
8608 -13354 -37019 -207579 53340 -159780 -12876 164413 70324 154797 -50268 71255 -49099
8596 -172043 -66163 -72609 34329 29051 -14892 110626 121917 -2423 -178909 -195969 -154332 -144363
8584 -144363 -22710 -178476 -36638 225609 -187705 -104112 -253286 -116868 -76011 286527
8573 -12336 -161607 -158152 -8009 36632 37988 -143989 -146208 -231879 319978 -60993 -207690 234129
8560 74494 -311717 138383 37976 -156966 -44859 -233246 -303166 32215 134828 -76284 -30437
8548 35350 -12703 6785 -244647 -19376 -377901 -266467 288922 -192796 -113279 -106495 -364557
8537 -364557 -74032 -50000 53602 -270198 -142858 -100710 -127012 -115178 121114 -150956 46201
8525 -160988 351546 -194453 -181351 144620 253430 -78627 -29793 -43924 36352 -235538 98253
8513 119832 -41926 -38237 -505095 -78431 -233126 -175793 -113710 -290915 -36102 -130815 -45550
8501 -144286 60611 -117049 -142111 -225025 6643 -66912 186664 110381 -227937 -364188 -103676
8489 -464475 -84825 -244990 -157580 45848 410133 -201229 -55059 -82941 -13371 60405 85457
8478 85457 58081 -282916 -9038 -34667 96084 -211043 -131264 171186 -166703 -218530 -148660
8467 -148660 169031 -109699 27501 194532 63040 -420545 -109623 -72727 38978 -148870
8456 5534 -21819 -268522 110934 31675 -4919 -100736 163914 -75188 -152170 -11891 102879
8444 127593 -29267 61245 -36088 -77020 35903 37956 56928 -609474 -132987 -45434 92 -96879
8431 -200509 83563 125242 16864 357667 -94457 -264689 -36198 -116848 -61884 78481 -111311
8419 -118138 6182 18706 -22390 205840 -88300 -85500 278193 213409 45959 -55518 -59804 -13063
8406 -104198 152401 -103525 96282 -320894 81342 -78319 -237374 113780 -202804 326604
8395 -261077 -49448 97928 -99285 183818 -139905 -232497 -71084 15857 -155746 -195915 86353
8383 -301293 -278602 -128589 42252 218726 19299 66812 44811 158377 -99353 -123515 -32612
8371 -259120 -196637 144795 1440 -15967 -97010 100254 -73131 -334545 86382 -55517 -11719
8359 -178484 -147978 -33526 405362 22853 41918 -297890 46308 -206299 130339 -307712 23968
8347 -191874 206926 28971 -205366 183612 -153880 -171727 -124456 -321808 54681 -282357
8336 -260875 155233 -88455 129381 -75655 -355654 49191 -186195 38947 -192850 277763
8325 94826 122110 -166085 23584 -11300 -161789 -7726 -115188 238434 103225 -137262 6053
8313 -95332 -89592 207477 9630 -131355 -20380 -47823 259919 17714 224032 -59960 83486
8301 114035 109954 -86710 17604 170917 224505 -122591 -60255 150780 -61347 -123311 -1182
8289 5001 117319 80630 28832 -215668 -90522 43891 -196866 -21822 -158780 64253 -113643
8277 -161906 -265445 33199 15477 -234319 -85953 264672 41604 -118367 218371 -116496
8266 224531 -24994 133716 -120921 278554 27539 -33608 51996 211317 -137158 200716
8255 -78062 -111139 -120376 180013 32707 -158456 138326 -170205 -32381 -44488 151416 -388734
8243 137268 17692 -274287 21968 223611 -255823 -116769 166448 -73846 -153456 97932 85798
8232 85798 -61817 -189945 203765 -99006 84815 -229066 -108826 -168157 -82608 58800 73810
8221 73810 51950 -183261 -139734 46083 67688 -244337 -125432 81159 -55650 43401 19486
8209 -11054 30784 -180416 -77099 -37862 10857 255189 123773 -11932 -46691 -200046 469470
8197 -52476 -127714 -121508 -112535 -58209 -258447 -159848 95217 62501 -40177 103448 -128269 65715
8184 271917 -60477 -126242 -212632 -228631 133873 -98760 -274131 157921 56229 -157822 -394083
8173 -394083 62845 -174602 -45563 -298733 443581 163925 -256449 4792 -221002 -296099 -6480
8161 4977 -154755 248023 -105676 -276285 106549 -171064 -63936 177019 27354 -250828
8150 -15448 -153850 290853 37704 -18984 -287403 -376474 -270113 46556 57619 -228215 -2947
8138 -28573 -97171 -116865 -97744 -178063 152238 -71611 -167124 -154600 -275616 172241 93113
8127 93113 -192164 110428 14441 56091 -254225 105302 -24620 -107011 -111029 117701 224516
8116 224516 193889 -94587 -88647 174209 1794 -41054 33108 -177488 -35718 -37634 -336458 73957
8103 126528 193735 245986 -52294 -75457 -130076 247597 -168209 -265515 51808 116429 206372
8092 206372 -104831 -281779 5841 -58835 -63982 251682 -101752 -157610 223338 -153587 217198
8080 -32560 66666 93797 -46322 -122505 -87070 -145419 1253 -161539 -369780 -211515 -112032
8069 -112032 232858 98620 -95013 -230275 35359 -212635 -214294 -154119 -24553 -241177 316827
8057 92761 -50692 63701 328703 -171420 122566 234987 -129573 -245303 10784 -68699 22512
8045 -230078 -61819 -249736 -38785 146591 139407 -22193 -53304 189620 90389 -72078 -2095
8033 125709 163262 133155 -114078 -28854 -271333 75012 -71833 134329 -269290 -172574 -13233
8021 -63392 -121908 -49279 -77074 67230 67840 144054 -148705 -91310 -236723 -12616 -137760 -185967
8009 -185967 -55746 -271564 -237389 37449 -201216 -28799 100974 40859 -100634 -113435 -219466
7998 -219466 137527 -86379 55964 121871 173637 110532 22997 182359 -253043 -348512 -265572
7987 -265572 -89501 -260651 -34264 -85137 -48952 -282175 -28023 118747 -193615 236515 -387544
7975 -46696 37370 -91739 79335 -250839 179564 3587 65978 9514 28092 27253 -123133 -317737
7963 -317737 30598 169123 -104049 97509 844 -27541 245202 -227415 -351638 46253 -29313
7951 308921 -354941 83930 -24488 -180363 -240462 11504 -404487 101118 -182005 -280684 -126604
7939 -232206 -89077 -102446 144705 -170978 57961 -19610 148702 152697 6714 100791 -13221
7927 52976 171927 282653 254474 339587 -26224 -46121 73873 -162647 -202276 37746 -182131
7915 78418 119623 3736 307015 90758 -115303 -88846 84765 -137915 -104427 -192630 -112050
7904 -112050 -35475 -102154 96161 -132902 2590 -212203 -308048 91421 126675 -77069 335865
7892 -152559 -26830 -71362 40395 -162223 -33286 -167956 -350918 268960 -26740 -265743 -272267
7881 -272267 234649 38880 -158860 -200986 -321055 -250571 144175 -96929 -268686 17945 235369
7870 235369 173804 42379 457476 137960 -216293 47970 276032 29351 -72319 44641 -56117
7858 -262505 -277816 -53609 230386 70252 -263668 -378195 -142887 -47994 -24271 -157439 -98594
7847 -98594 -31975 -29118 44238 190500 167316 137017 70282 -5258 -121355 12270 -169978 -56954
7834 -148870 -309193 58293 49742 -297438 262984 54497 28601 -178827 141040 -153849 -30535
7822 -275440 -22976 45891 29295 -170763 -72514 -54395 -122780 216921 -287158 173189 97774
7811 97774 259284 45462 13338 -251285 -30744 220079 -94934 -101947 50510 42321 -32119 91508
7798 43864 -206243 -114374 117238 37038 120116 20312 -523277 230139 -5399 -56027 163086
7786 -214421 -208420 71605 121310 -112020 -56400 -125643 -306901 146086 -32014 -102130 -157621
7775 -157621 -349978 -7489 -89194 -260569 138159 135514 -11239 -102437 130665 112197 76059
7764 76059 -30939 14000 -74942 55612 -16261 -169909 -185692 -285264 143154 -77737 -430428
7753 -430428 -91119 132962 128109 54510 -241242 -46226 -170 -1183 85645 101283 -122862 78627
7740 -65979 226421 -152581 174207 -60651 39994 -337683 -11362 -30753 159209 105678 -51903
7728 107421 34167 -129053 -258288 -330817 197621 -367407 -191121 -202093 247317 71865
7717 -165315 403280 -374338 -49817 13225 -66062 74959 -341298 69400 -225770 -129197 92334
7705 74381 8652 118064 -278766 -98625 -164178 52206 262830 -181201 160195 -100774 -67089
7694 -67089 -61799 331678 -190473 -20143 -164704 139276 -146823 97400 10258 -43407 -209771
7683 -209771 -99136 361562 44328 168150 -260157 -181397 13263 -75274 -122503 -84939 65649
7671 -11760 -361618 -177903 -56853 -110109 152890 -33795 -136842 -246293 -313082 -248414 -424107
7660 -424107 -97108 213443 -47263 143711 -27355 -27416 -146737 -55000 94130 30412 186786
7649 186786 5071 122688 -49597 -276754 -23349 -245001 33074 110411 42309 -40057 19607
7637 -100711 -113784 -7077 69635 121562 264505 -122565 -253797 -276752 350742 -79471 -86451
7626 -86451 155378 -116482 -111629 -101142 609 130588 86459 -167269 -166305 -248568 -67542 -24070
7613 -248702 286028 290647 -371621 111215 -432501 -238613 -71474 -224050 -138419 -166729 -151596
7602 -151596 -295923 287176 -17721 160394 -138929 -162437 -113711 45691 208852 106911
7592 106911 -51275 55272 -89158 65546 -101528 166691 -414329 -365980 -117587 -17773 345391
7580 103678 -246833 -389102 98194 17765 -56197 -87450 50856 162755 -227305 106665 -153881
7568 -102447 240993 190745 10541 -70610 -271929 -78584 101678 -183003 -15470 11936 -189701
7556 -131145 -64510 -71619 61687 -50667 -5081 163227 24992 -5649 -172339 -56150 -86663 197595
7543 98212 -38953 191102 -191683 -67334 32294 350090 77986 -27933 7767 -213431 -13139
7531 97509 118233 -57976 -216262 56170 -75776 1605 -35842 4759 -86350 -69288 115594 -342518
7518 -21944 -24666 17206 -49286 221651 -117935 11474 135832 308735 1585 156402 186336
7507 186336 58098 -332167 245956 -257818 -77961 -95574 123097 -5083 199698 -183172 12607
7495 139974 144834 -158491 156844 -119272 -148609 512570 -136139 -187699 32049 121053 -2881
7483 -67377 -53033 150069 -133460 -131964 -169526 116411 -230104 -183197 -364521 24220 186171
7472 186171 -117905 121616 36577 -368146 238752 -219636 70347 -211608 -175568 -124372
7462 -124372 52976 -27165 -13656 -70748 -133872 56229 -124763 -320193 185627 -21430 40032
7450 -60422 52767 -237527 -242814 -54965 119660 -11582 -66106 -293847 116771 77791 134501
7439 134501 -265585 -136452 -343225 -3591 337621 1320 29636 9398 19592 202407 -63051
7427 -93316 -38561 -163213 305630 -55640 234011 -58313 162650 -105685 -89685 108290 -71031
7415 39044 -213784 288630 164094 -218646 142349 -97099 -144928 29335 -5113 -156310 96713
7403 -42040 -511329 62367 -199953 -204405 -153009 -196111 -63306 -220199 84340 276763 -181887
7391 291731 325015 -131957 -267950 83045 151635 -62586 -85202 265153 95663 -237475 -231221
7380 -231221 204167 109488 -91604 17711 44556 -41914 312178 -127044 -39739 24947 -90701
7368 91072 -42668 -8809 -108439 -80190 -52018 215172 -25306 14374 -263339 -233054 157 13629
7356 13629 -140016 442827 -272593 -189647 -177770 -301502 59724 119995 -224951 -35735 -198162
7345 -198162 54052 164818 86957 -385276 -67737 200328 -137925 11464 93090 79998 216123
7334 216123 433 91100 198074 10014 -139791 -33846 -68156 -105017 252267 -237312 166403
7322 -239175 -259577 207178 3435 -255247 260020 -10262 -70462 -125548 160103 -312771 -9401
7310 128531 -310154 -101933 -91327 -163007 -151698 -291631 -477945 183241 180042 213477 -6877
7298 34008 51955 -213846 105028 145876 131418 61968 -301242 72043 149674 -86082 200675
7286 220794 -89349 -59687 -276458 120150 197020 147399 113694 445014 195120 -64970 1634
7274 126838 474093 -319879 -250035 -219211 27156 106795 -251215 24894 93544 231059 83408
7262 86912 77205 70565 95877 55906 -152909 119883 -18419 130890 58682 118019 -61699 -107976
7250 -107976 -253460 -102990 44879 -132924 -125247 48675 -144215 -250201 -60188 80854 -241370
7238 -86694 -3481 201549 -5200 -67360 -206480 -219018 -110833 74495 180403 110472 -38966
7226 -548480 28409 -370872 18097 -83403 9298 -32682 -44360 -151448 -285735 62870 -54040
7214 -353754 -18372 -47794 246074 -100708 -67509 -215963 -112239 25434 -47248 -13613 198845
7202 48586 -47329 103293 -76671 -178723 -300021 -57364 174048 -45006 103156 -46134 -109451
7191 -109451 -49880 267179 -108626 -14457 -277859 140986 -162091 -276561 -855 182160 -259726
7179 13404 -145516 182233 5484 -96159 24293 -8562 -66680 -17907 85444 -126382 2534 109109
7167 109109 -209596 -13535 -126346 -86039 -20623 65357 175159 -47235 -90734 -51548 -33322
7156 -33322 108488 -60070 -103156 29361 -38889 65576 109584 -253107 -163719 42581 -66047
7144 -3168 258459 71505 384363 22146 -193333 69916 60756 -65905 120444 -111417 40669
7132 -11915 -258438 129555 -143566 155944 -392885 -86271 -56870 -259754 246747 146020
7122 146020 -7321 -99626 -267811 -253625 -90995 -17712 -171243 33099 -287635 -242094 -323608
7111 -323608 103677 -162371 44102 95724 -102126 -149158 -184948 89084 264949 102150 -29662
7099 17988 226353 70759 110588 48538 83446 39341 -11259 160579 357654 163204 -100353
7087 119877 -202282 100404 -848 269209 9362 63067 -95410 10371 125605 82106 -27940
7075 127038 95579 -110997 -228846 -425766 -40083 -134531 61900 132811 21796 -174169 4900
7063 168695 -178819 -123757 82084 -247640 85913 -81821 -160565 -125145 55490 -308841 -309035
7052 -309035 -125983 -185294 -33396 119424 -115557 -105024 166855 -350276 194212 -80646
7041 -66721 26150 -214236 239707 -91268 -294978 453232 213506 -83258 160405 -47091 309
7029 -135904 -232681 -96356 -145858 130047 89658 16109 -31172 -116660 -89849 247495 -60696
7017 82974 -326405 -17181 96963 1527 222798 -375667 175 331900 -45887 -159072 189496
7005 -37669 -107880 92479 -48471 -135 -32532 -211723 16961 241841 -247366 203515 -156799
6993 -69947 -137909 -5822 -105818 19945 -291686 -185603 112871 273486 -26203 169310 -167250
6981 4025 208382 201475 -284702 -372012 78992 288613 -118943 -144719 -290048 -67900 -287133
6970 -287133 -70819 -51802 26325 291068 -334832 -19906 -124647 189387 87863 -251193 -14471
6958 -72041 388151 -103866 48267 -49110 -123052 -211279 120128 -146317 7942 -205795 101618
6946 60581 138211 273481 -241172 -58679 -261819 -104683 -108147 53514 -127796 90856 -162595
6934 115578 -114117 69142 -161655 31263 -4137 -23700 -77309 481 -9233 -136175 172639 136227
6922 136227 2294 16971 -178797 -1727 -55717 243319 143525 -124534 -371127 233703 271183
6911 271183 -433938 -85800 -229718 -215479 -67909 89992 -64524 72464 -177950 -30992 -102300
6900 -102300 206145 111772 -119675 91700 -2433 -235508 49398 3398 40389 130687 -173731
6888 -23093 70867 -92824 -367308 70715 -57795 -191742 34859 -216316 51647 99998 15108
6876 248771 -80714 -53528 -136190 269076 281715 206628 30491 -176175 336675 15729 -2709
6864 -325072 -148802 -142968 -269229 -48202 190174 478439 -95839 -151388 -5953 -5384 18895 -254221
6851 -433001 -196714 -26022 121300 -288674 -66733 -175446 118253 -50001 -18286 -19612 -138101
6840 -138101 -302222 -2045 58052 -38472 54314 253463 -20267 -47384 254416 -139667 -163507
6829 -163507 -54633 285487 111130 241412 170254 -142154 112920 107693 -118222 43088 -99453
6817 -114614 47229 -175982 -231273 59589 -279156 73347 -34380 -444020 -29413 -29026 61069
6805 -259732 -288478 -340983 -33678 -75563 133443 7630 -86125 307626 137989 -205427 -15928
6793 -26364 -167528 -103400 -127410 172214 27659 -23126 -53552 36452 -42359 -381247 -171656
6781 207183 45833 154763 351570 16039 -4921 146620 -74837 -8027 -296374 96479 -257321
6769 356408 -82741 264903 53248 1823 -169968 -160614 -44286 -225743 153497 -247403 -108417
6757 -42234 110118 50568 -312955 -133455 -36447 -173144 821 106193 -370602 86796 23811
6745 108677 -127382 -38246 64880 105804 -65096 151748 -59378 270664 -86429 52881 -113127
6733 121031 43276 33606 -156493 190949 41241 -146792 -8955 1188 236379 -128523 -205183
6722 -205183 16580 -66573 -267363 -270709 -224643 61409 88384 136080 -173944 5858 -57720 -221363
6710 -221363 17663 60910 -47959 208577 -23822 -223406 74755 99493 -8077 -86336 49819
6698 -248004 -57288 204230 -65046 -13550 170001 49056 117620 164141 -143331 -333999 -219733
6687 -219733 -78355 -176764 223352 -312746 -68784 185284 -182334 107767 -117533 -162160
6677 -162160 49748 -188422 66842 -15347 -179445 -3826 84940 -86637 15726 -71327 -112784
6666 -112784 93360 95159 242586 -9735 185555 106997 -319838 -150117 33486 -243734 -101651
6654 124851 40920 209000 132935 19920 175249 -268198 -200456 -17056 -55027 105161 -73080
6642 -109129 -244655 -128742 91517 -108452 164142 120236 -96741 277013 225036 -456362
6631 -242640 -213757 -137357 -76191 -63873 145142 -322748 44938 -12847 10338 84648 7856
6619 -165128 -10558 -65969 -137991 -27437 -104675 178422 127188 119318 -255507 -227333 -242570
6608 -242570 64542 -163721 213757 145950 -622 26027 52532 -320271 115780 -101246 146025
6596 -142284 -59785 164450 109371 58652 73418 57833 26973 27051 321092 -307120 -236024 42493
6583 -3946 -36223 -242389 20674 -112090 -227201 -109792 311598 -173140 -58724 177945 -111982
6571 -35524 68934 128206 -61358 193708 -66369 -16757 -80532 -94506 157137 -103514 -301837
6560 -301837 -69192 -216851 -156677 -200714 -155029 205984 63885 15064 -262349 -23196 17839
6548 45716 268182 -34640 -186151 -219114 -73536 360004 -74472 337421 119408 178117 -188081
6536 -101117 18167 233772 33920 -71194 -186579 2842 179925 185363 -115392 -28407 -46615
6525 -46615 -102139 31729 70872 -211623 93021 27970 65940 152676 261781 -266403 392893
6513 -107981 70759 -1603 177440 85024 -100923 213528 13985 -193272 -268146 -122674 -169000
6502 -169000 -91023 -229538 22362 211856 -351769 -116236 -38167 -122073 72785 -41363 169330
6490 104289 -84485 -113764 358932 -17838 155752 87228 178584 146590 228434 184142 -227201
6478 147260 -87205 -18016 120477 -114910 -123870 47191 -73419 -9819 68574 41949 157469
6467 157469 201130 10983 -137923 -25252 272054 -234429 98664 -62930 -231492 35105 -202031
6455 160973 -318239 144593 119628 18913 179138 -174515 -10521 163018 7324 262529 -148373
6443 -31309 -168041 -13078 106623 153533 211376 -98012 -142829 -338469 -50977 308143 -187424
6431 -84371 136562 -190932 -49324 220743 388642 -319651 -323363 28497 -168953 -129248 13226
6419 -80847 138127 -73292 -96486 -264566 -272407 -18388 -98379 -53103 91743 -167411 -250266
6408 -250266 61427 22621 164914 -92236 220421 -25652 -26057 10989 43682 87601 -14621 -337112
6396 -337112 -27582 162544 123403 -3457 117923 -527175 167523 308607 -135759 88060 157636
6385 157636 107252 28796 -14337 -237792 233149 76936 -231440 209194 -130869 -49474 -218276
6374 -218276 27134 -412837 -56135 21511 -166035 -586222 212094 -103943 -200980 -213694 -349263
6363 -349263 234676 78948 -16350 -109937 -55141 152791 -56161 59253 -268886 -159846 -272485
6352 -272485 102321 -169702 -95360 -233546 -1085 -182495 -65471 85047 70140 169635 227374
6341 227374 33897 81270 151847 104784 -324780 25007 -141330 -37567 -345031 99857 -172031
6329 22113 189007 -25097 81954 -66475 -180999 23382 408253 71567 271574 57451 -67456
6317 200687 -193689 -45925 -251487 -137165 -274964 -316555 -41087 -129334 -119089 14205 5382
6305 65072 179982 93103 48768 -143961 -269127 146656 -84062 187968 -147829 -204224 -438842
6294 -438842 162969 -128952 152255 -41191 51659 8649 115175 205545 1609 179060 85108
6282 -138889 71677 2785 -247874 -235903 -222628 -234148 -162269 94281 485528 -120953 39804
6270 215136 -17956 239743 -5454 314741 -158772 78579 224980 199163 212390 -538326 59649
6258 149848 -185061 -198288 -247710 223342 9912 -23086 53553 -110893 -42871 164634 -101117
6246 -29205 -170723 71186 171501 63641 -71468 193751 -101507 75792 9504 82927 -158448
6234 142389 -54112 -314790 -87270 9840 35721 -138986 -197634 -155597 109395 -75478 16783
6222 32164 50502 -207198 174822 328725 350948 67153 115724 43230 137891 42693 224439
6211 224439 194859 -110445 -149682 88144 -42363 150569 -261529 -71626 -54908 -1142 312350
6199 -92792 19278 -304508 148312 -77526 332457 36577 194583 52385 -46971 -36726 -84534
6188 -84534 -211825 -107257 108433 -199874 -374466 -81120 -229734 -336155 284558 -93387
6177 91511 -12224 84906 -294679 -110352 -293365 56738 46596 -37490 2696 -419278 71899
6165 239497 -70557 -2927 -45456 -58070 79410 171478 76908 68716 163009 -102716 -199390 -183310
6153 -183310 -49142 -340106 -58459 -36495 -10019 -53747 246733 -16334 -307252 -186172 -175687
6142 -175687 -99930 287973 -72648 -158569 81976 -146824 86348 -245394 27662 -62520 30300
6130 58730 -298680 -206582 128162 -337710 63285 199390 -55394 -85206 -207005 -149504 -38944
6118 -272189 57861 -4372 196883 -365896 119857 -141779 107155 -62093 206755 -217251
6107 -116724 12005 17834 172573 255591 -146093 -184458 -91281 200476 198111 41438 131153
6096 131153 -249963 28829 129736 99784 -272173 290059 -43383 -91183 -346931 -20086 -133874
6085 -133874 244719 147029 -149154 179107 413844 -306001 99215 -43054 266373 -116155
6074 315558 5729 -18525 79778 92225 91497 -49949 -34430 196135 -171760 -64452 -12749 69642
6061 55303 93002 -200856 -204811 -98580 -207954 -386556 -46131 -65551 -58199 31237 258241
6050 258241 181217 -18565 84477 -200900 140924 -126740 28556 -215237 185361 -6092 -69981
6039 -69981 90396 143943 -150222 213644 -55405 18649 29717 266295 -114350 223246 73326
6027 -63947 1332 -138218 -302017 90903 -191780 292024 -183164 128775 137051 -266275 -311252
6016 -311252 6205 287264 -244173 10318 39768 -221293 -113444 -147310 -249898 38226 -110213
6004 517904 -113261 153272 12720 68170 130290 23710 -108302 114546 -23419 25418 -127011
5992 -244490 -90915 -245804 -27284 171393 83134 19005 103695 -45192 -143964 -39014 52123
5980 122674 157066 28657 49513 -136170 -119831 -41229 -107828 -348850 -116639 -199942 82924
5968 -131402 -131694 54513 -780 40013 167663 23422 265602 -111401 28176 104097 455453 -195002
5955 -17936 -100368 -216473 -337622 -329290 158312 -55449 -331185 12233 -106085 41794 -299326
5943 85048 108059 46380 6901 1185 94020 -58488 353915 75269 47629 220320 -107761 256823
5930 -61613 -92008 -181743 -58721 179880 162025 -241913 79858 1169 223873 67262 -169612
5918 54231 5593 25354 -235799 -50643 130847 223543 160123 -19559 -45901 -114850 -96960 60016
5905 73660 99738 -208613 257819 -104397 -310175 -56049 234094 47955 -238643 119905
5894 100593 256776 -104068 238254 2570 -80665 -27136 -168114 50047 -226900 -152240 4594
5882 -71861 233970 74565 3664 -140108 -193888 -85931 -127427 87639 271702 -180625 42390
5870 49165 40411 -12366 3867 133765 321890 -93654 9656 107532 178511 -172919 -47741 274736
5857 -82086 -175069 126603 -43459 -33720 170115 -238806 237020 4930 96586 -146714 184244
5845 182927 -63144 106119 -229299 126735 232631 192998 -182762 -212855 10006 -124280
5834 128048 -3471 -266218 135435 279233 167645 18849 63650 135582 -298268 -101536 70802
5822 287740 -63795 -31839 -44271 -89347 -382271 -7701 -38927 -249051 30563 -15094 8538 -387557
5809 -701 133359 -153673 -12470 -1031 96818 207580 -275646 110316 -209737 -12848 -86039
5798 -86039 -232202 -262090 75661 40629 122031 427018 318222 60636 74081 -63941 -155614
5787 -155614 61525 -39720 -28152 123017 132858 15016 72986 -77237 -10661 -28745 185102
5775 -123992 -153273 29172 -69288 77582 46273 85957 -265702 -357805 -153857 190870 -141600
5763 144395 39581 -55975 274609 173060 119415 -101770 10748 -436914 -1360 124607 275371
5752 275371 -9231 -14859 -10045 -238577 63536 -80353 85402 -59318 -227105 9264 167285 -181425
5739 179167 27679 -193388 231580 37605 347452 341870 35198 -68269 264830 -157821 99588
5727 -125416 -102457 118751 219305 214257 78653 -305715 170981 -115991 -173359 -54639 -200206
5716 -200206 -281812 208245 -42948 -24343 54066 132525 -324620 -438837 -17316 -128598 -169520
5705 -169520 68813 201630 165973 113480 14087 -1944 -432291 -189116 370253 98009 274185
5694 274185 106175 15938 -196943 -32922 -168180 24575 38813 164662 -173705 -75320 293237
5682 188941 106770 -58058 -230277 -339319 -166972 -327787 78743 303963 174031 22237
5671 151756 400161 -250213 159312 70777 -7649 -128910 -119553 -117313 20254 -63915 178105
5659 13178 -12549 -58305 372153 -65566 194212 157504 178868 145285 103552 528526 100301
5647 62151 -238868 -229601 42279 -170483 -237516 83510 15488 -86789 129349 112509 -311785
5635 89254 72017 234303 -20273 -358965 -52904 -125469 267649 139677 247868 -26797 72999
5623 -24213 -255773 42547 197597 79386 116588 89677 -5038 -136965 -36884 41824 -76027
5611 58557 -22654 53801 166443 139720 -72950 -134815 -157816 113814 669 168059 -114195
5599 -407388 -95650 128415 2584 172019 99993 -242829 15357 318131 -267524 -98944 65635
5587 -70507 44129 -47911 239774 176388 -35597 -118159 -56862 229619 -335953 -37692 -44689
5576 -44689 -554443 -6880 -301240 -16861 102777 -59955 63889 197350 -65425 -76287 172642
5564 139571 73611 -45255 24470 417494 89677 91529 -332178 -147810 -344692 3008 144936
5553 144936 51141 -242746 286343 115118 -77783 148873 -76537 -48963 -79862 192520 -137197
5541 -187831 -119003 46775 -393913 190554 -92903 -29303 2665 -108434 250831 337408 145264
5529 155858 -25570 -315635 12098 -148774 220261 377082 -17975 236830 -11810 -99852 -68912
5518 -68912 322085 -285193 149082 40586 -160753 -302362 38411 125893 305052 10258 -45503
5506 -9161 -177590 -15238 -58343 74245 35405 162882 -46831 107347 124756 311683 2842
5494 126332 -119476 -180098 -217273 198729 -169 -18156 -73984 181356 260066 103821 -78914
5482 357225 -1939 -123251 258138 202926 -195487 214413 300346 124705 12777 162846 -86960
5470 122251 -115160 137973 -295248 -124159 141852 -49128 72577 -195429 -53860 4872 21714
5459 21714 -167074 -113425 10713 261962 249256 117983 40077 101149 129265 16938 -67162
5447 -282673 -159472 -152910 73325 -43568 41087 202334 114652 -147421 315265 289564 55542
5435 -200329 -218627 108992 73543 174607 52051 44845 15296 -163238 241349 -142341 -315367
5424 -315367 165587 -99080 -208149 -125129 -164737 219114 33062 -131989 24844 318698 -71067
5412 46092 286200 -268438 -106422 -244859 41717 74252 224270 92756 45957 184128 -112965
5400 -81656 268018 80312 74623 48961 239375 95101 73416 -28435 -224675 39669 -109366
5388 -148964 58577 -75452 -21507 -46119 -220985 -162236 18881 -31422 -106384 246921 85157
5376 -103715 -21715 -73601 -57683 253089 -470706 -69425 25309 -112930 -135496 52373 -124789
5364 -241574 -164121 -13502 8697 365571 237651 38107 341793 -238306 -294996 -166335 1297
5352 82243 272867 -60454 -176375 261348 10825 164973 97140 252537 -22610 63000 131118
5341 131118 -243892 -141041 16224 283130 79031 200616 -46241 128696 -56529 91806 -135029
5329 -190497 201012 -278772 -29548 -114750 -14477 -249110 -76701 -27130 -112401 56465 -36163
5317 -61269 38832 138544 113110 234749 -270939 147159 -124713 -102727 27901 72474 267292
5306 267292 1685 -118844 146999 -75190 -34313 -10037 -2198 2220 -143426 -135376 55552 264030
5294 264030 -412044 117771 -180305 307287 -485567 -195924 167176 24646 -197217 184556
5283 23259 -15135 -137406 183960 -403101 393920 70893 106403 80541 -135134 162377 94037
5272 94037 81460 -90996 -276803 106240 131797 -28721 -42432 109536 94373 120654 -335933
5260 252238 -148543 4547 -125633 128824 212362 -374981 -46707 63450 31703 -137349 54049
5248 -252968 70167 -42134 73971 140302 -303579 218478 160428 145644 -187114 -22492 129209
5236 -191776 57248 -111565 52624 302198 68431 162179 21944 -42472 -108654 -92031 -10686
5224 408280 -219922 -497115 168723 188779 238050 207839 136311 -199048 -145261 116108 -65226
5212 -141168 -51973 -242920 108064 259763 428419 -481650 209176 -63408 -172019 -331391
5202 -331391 -222965 -26465 207068 -55217 -226304 -31558 -26265 108345 -17462 150187 -366133
5190 17501 31998 -153250 -33367 38732 5491 -162674 195941 183662 -47724 -106600 -132414
5179 -132414 275018 182806 -55566 -57051 187371 -295319 49214 -203395 -39703 -21547 173777
5167 -28370 -78082 131566 236711 168873 46836 262730 130194 97538 75960 135483 -67001
5155 -154118 117635 230016 75927 -88211 -143496 13840 -38443 -97602 -241146 -290905 -25574
5143 54919 -53849 -110599 -220832 88552 -71593 -98719 -94616 -54643 -110334 -279948 75663 2415
5130 -85230 -243781 55951 -137154 -62825 82743 219062 -47893 -157610 123686 279195 -222137
5118 -159203 -128937 334805 78566 30898 -65540 -54643 68528 220377 -210452 95417 164536
5107 164536 80862 -7762 -92725 -77546 202493 80359 222360 -49848 -23397 -234375 -18352
5095 -37125 31102 -70237 -132678 -62881 368042 17447 105526 -66853 186924 41959 -152853
5083 -470482 -53765 -39268 230173 77376 136370 -163559 211997 -12333 38143 60055 278113
5072 278113 340728 65786 -76264 250052 159278 94936 13737 349267 -229583 190915 130449
5061 130449 -103592 -86402 191347 -41860 134702 -51573 157106 172617 20206 -134217 246363
5049 193905 -155522 72264 37480 -153458 -192752 -18962 -29771 208983 207383 48406 -349899
5037 266287 104100 291211 -30660 19666 168229 53836 -252888 146317 -134158 133747
5026 213179 -131015 -253637 72474 -240409 -329410 -261149 -141842 -152754 8296 262835 -308731
5014 196343 30233 -253094 -434235 -179045 241933 39290 69777 196846 -91085 85089 -88336
5002 42470 -56885 -185799 -45272 198578 60691 159619 -69602 -170252 125871 101584 218701
4991 218701 -307148 86397 16141 199736 -248384 155874 135765 -138847 -44470 -20914 136954
4979 -31706 40639 182905 -385584 1101 -160210 337609 -228063 104661 -76674 -147908 57253
4967 138778 -229617 -110969 85084 -145275 23054 242246 111328 -135537 161953 48398
4956 -38212 -277510 100270 294720 109443 -179386 -133007 48196 185113 -78802 -76884 34235
4944 -169189 158400 100909 57780 162178 -220824 -178879 96932 -360966 -545744 113330
4933 212031 -3219 -137853 -182056 -43388 130534 348390 -423777 195002 93128 114562 334300
4922 334300 12390 -103782 52362 233094 -59880 -202043 11601 -13771 171764 -26723 114149
4910 153367 180940 -136985 -83369 182652 -29552 50100 -835 270200 -80133 130821 -337082
4898 -33744 -13260 -22847 -121974 -173489 -22857 -20457 206023 -65495 -304678 132480 136718 -99776
4885 -137495 142631 257864 172397 13508 228713 61186 188290 -396038 46515 195717
4875 195717 56119 -207825 -28952 137923 9434 31180 -111600 -229281 -52862 -152542 -297160
4864 -297160 38549 225149 -40747 -132515 -184736 -343110 13354 205557 -26438 72003 165822
4853 165822 -139123 317966 87991 -102094 -193130 -2329 106625 158378 226698 37886 348403
4842 348403 212799 282729 150035 93050 224198 221773 -131537 267507 35230 88607 144025
4831 144025 324450 -118552 -112097 6243 83102 -63891 -196425 -51090 372562 -139236 -167865
4820 -167865 -143228 -29620 -171605 72901 12610 248474 -144366 -65490 121371 307538 -145284
4808 6388 69266 -279629 60493 114660 -158855 -226769 68218 136943 65656 72968 50423 -215091
4795 120483 212246 -156739 -225566 297059 -100887 -121410 -124247 -147746 9144 -212259 -82818
4783 36739 116017 -60512 54685 22699 -154650 337570 72540 159992 -70650 17324 297759
4772 297759 294759 203999 -156742 -104994 -171249 -96896 118237 8757 -172047 75504 -125061
4760 127950 213237 189598 -13998 -16890 325297 -211170 -139868 -299475 34595 -296575 -143496
4748 239244 -129076 198468 32469 -88046 -26165 -245357 -265246 490899 81816 106094 166106
4737 166106 37413 214452 -47819 38149 1517 -60593 -118133 66425 126353 -58621 76495 25947
4724 -70877 114669 -118044 -141492 -107095 -75084 97794 208506 -242676 242791 178222 -21126
4712 358678 -80484 -63092 -189300 372334 104151 -252297 -39435 -5603 134602 -218432 20507
4700 206625 123155 111887 118485 307691 30902 153093 -154211 230326 -59569 -131416 235395
4688 -273783 29939 -61163 -206972 74684 -7860 -143245 44678 -34023 -259729 -42384 151408
4676 176238 -8781 -170235 -26505 91305 251568 154487 -90592 -138568 -36222 72052 8724 -39723
4663 -9400 41176 133917 -97812 214481 -255394 46460 163315 21099 -176979 71816 300217
4652 300217 -144765 102687 -43217 88224 69477 -30034 -104739 84206 61817 -89137 137031
4640 56165 -16184 -85133 -199880 -3870 -130186 248603 117782 238290 151338 272560 -54725
4628 341348 120000 -130402 23087 -279411 -12069 138991 -51633 133028 10818 -119590
4617 -186943 -134309 -286601 -95245 48009 -53677 -178576 -82634 -4654 -135434 -83394 -36583
4605 222698 -44611 -188503 55212 -69399 -132670 -105748 -45558 152823 343490 -6963 109322
4593 -14896 45328 -112161 -109656 -452160 117899 -134438 158390 -431639 -53770 204827 75995
4581 209245 48520 -48889 60927 -68799 8896 12527 94148 -68201 209919 -98147 15232 -42611
4568 -214734 190964 -32174 -150989 -80061 54668 155692 84369 -101213 50264 232315 -372130
4556 25459 -167434 43251 -45529 -63170 153760 -77743 -61885 165709 -92161 -70946 35127
4544 25992 49515 -129535 -294721 111176 -97124 -16896 268796 80376 242309 -119473 -13632
4532 46170 17388 163600 171551 -79333 -12266 -291574 -77493 -146155 -228292 -336499 -55151
4520 -208701 233502 21146 327038 -80634 112705 196633 57165 -305725 170986 -33515 128532
4508 -157405 66050 268927 -180933 -266430 11556 -88944 8953 237149 -104387 67611 45867
4497 45867 230317 20711 146535 -9331 -2064 540512 -151655 -123368 -111988 -262583 90691
4485 341959 78500 101890 39649 -306406 -171106 333490 -11539 -15280 -76712 -93670 65823
$$ [...]
##END NTUPLES=NMR SPECTRUM
##END=
