##TITLE=NES1050_10427_9270609_61D8CKfaId
##JCAMPDX= 6.0         $$ Bruker NMR JCAMP-DX V2.0
##DATA TYPE= NMR SPECTRUM
##DATA CLASS= NTUPLES
##ORIGIN= BRUKER
##OWNER= Administrator
$$ 1.72 TOPSPIN		Version 2.1
$$ 2015-07-18 21:37:17.104 -0700  Administrator@X
$$ Compression mode = diff/dup
##.OBSERVE FREQUENCY= 400.02188249412
##.OBSERVE NUCLEUS= ^1H
##.ACQUISITION MODE= SIMULTANEOUS (DQD)
##.ACQUISITION SCHEME= undefined
##.AVERAGES= 64
##.DIGITISER RES= 22
##SPECTROMETER/DATA SYSTEM= spect
##.PULSE SEQUENCE= noesygpps1d.comp
##.SOLVENT NAME= COFFEE_meoh
##.SHIFT REFERENCE= INTERNAL, COFFEE_meoh, 1, 14.96342
##AUDIT TRAIL= $$ (NUMBER, WHEN, WHO, WHERE, PROCESS, VERSION, WHAT)
$$ ##TITLE= Audit trail, TOPSPIN		Version 2.1
$$ ##JCAMPDX= 5.01
$$ ##ORIGIN= Bruker BioSpin GmbH
$$ ##OWNER= Administrator
$$ $$ E:\/data/COFFEE/nmr/NES1050_10427_9270609_61D8CKfaId/22/pdata/1/auditp.txt
$$ ##AUDIT TRAIL=  $$ (NUMBER, WHEN, WHO, WHERE, PROCESS, VERSION, WHAT)
(   1,<2015-07-18 21:37:11.729 -0700>,<Administrator>,<X>,<go>,<TOPSPIN 2.1>,
      <created by zg
	started at 2015-07-18 21:25:41.432 -0700,
	POWCHK enabled, PULCHK disabled,
       configuration hash MD5:
       21 0F 79 D6 B3 7B B4 F6 88 20 88 DB 03 48 BD 9F
       data hash MD5: 64K
       0C 60 F5 27 15 DD 31 C7 C6 D0 AA 28 A5 DD 84 CB>)
(   2,<2015-07-18 21:37:14.963 -0700>,<Administrator>,<X>,<proc1d>,<TOPSPIN 2.1>,
      <Start of raw data processing
       efp LB = 0.3 FT_mod = 6 PKNL = 1 PHC0 = 0 PHC1 = 0 SI = 128K 
       data hash MD5: 128K
       38 AD BA A0 8E 09 6E 1A 3C 70 5E 94 85 01 B3 15>)
(   3,<2015-07-18 21:37:15.869 -0700>,<Administrator>,<X>,<proc1d>,<TOPSPIN 2.1>,
      <pk PHC0 = 268.4674 PHC1 = 0 
       data hash MD5: 128K
       15 DF B2 B6 56 35 DA 59 DF AE F8 05 47 C0 D0 FA>)
(   4,<2015-07-18 21:37:16.260 -0700>,<Administrator>,<X>,<proc1d>,<TOPSPIN 2.1>,
      <abs ABSG = 1 
       data hash MD5: 128K
       63 E2 F0 9F E8 29 3D 85 C1 56 8C 15 CC B8 26 88>)
(   5,<2015-07-18 21:37:16.369 -0700>,<Administrator>,<X>,<proc1d>,<TOPSPIN 2.1>,
      <abs ABSG = 2 
       data hash MD5: 128K
       27 95 E3 2F B2 2A DE 42 F0 21 15 8A 13 F6 21 1C>)
(   6,<2015-07-18 21:37:16.447 -0700>,<Administrator>,<X>,<proc1d>,<TOPSPIN 2.1>,
      <abs ABSG = 3 
       data hash MD5: 128K
       77 D1 C3 10 2A 68 99 D7 2D F4 60 D6 DD 5F 25 CC>)
(   7,<2015-07-18 21:37:16.541 -0700>,<Administrator>,<X>,<proc1d>,<TOPSPIN 2.1>,
      <abs ABSG = 4 
       data hash MD5: 128K
       EC 4B 49 79 C8 F6 72 91 F5 19 64 65 E1 06 45 47>)
(   8,<2015-07-18 21:37:16.635 -0700>,<Administrator>,<X>,<proc1d>,<TOPSPIN 2.1>,
      <abs ABSG = 5 
       data hash MD5: 128K
       1A 8D F9 AB DF 99 20 8C 81 14 5B 20 34 C8 17 58>)
$$ ##END=
$$ 
$$ $$ hash MD5
$$ $$ D2 3F CF 50 61 0A 49 88 FE 6E 39 3C B8 A2 F0 0F
##$RELAX= 
##$RELAX= 
##$RELAX= 
##$RELAX= 
##$RELAX= 
##$RELAX= 
##$RELAX= 
##$RELAX= 
$$ Bruker specific parameters
$$ --------------------------
##$DU= <E:\>
##$EXPNO= 22
$$ [...]
##$TP07= 0
##$TPNAME0= <>
##$TPNAME1= <>
##$TPNAME2= <>
##$TPNAME3= <>
##$TPNAME4= <>
##$TPNAME5= <>
##$TPNAME6= <>
##$TPNAME7= <>
##$TPOAL= (0..7)
0.5 0.5 0.5 0.5 0.5 0.5 0.5 0.5
##$TPOFFS= (0..7)
0 0 0 0 0 0 0 0
##$TUNHIN= 0
##$TUNHOUT= 0
##$TUNXOUT= 0
##$USERA1= <user>
##$USERA2= <user>
##$USERA3= <user>
##$USERA4= <user>
##$USERA5= <user>
##$V9= 5
##$VALIST= <valist>
##$VCLIST= <CCCCCCCCCCCCCCC>
##$VD= 0
##$VDLIST= <DDDDDDDDDDDDDDD>
##$VPLIST= <PPPPPPPPPPPPPPP>
##$VTLIST= <TTTTTTTTTTTTTTT>
##$WBST= 2048
##$WBSW= 25
##$XGAIN= (0..3)
0 0 0 0
##$XL= 0
##$YL= 0
##$YMAX_a= 8059250
##$YMIN_a= -13846371
##$ZGOPTNS= <>
##$ZL1= 120
##$ZL2= 120
##$ZL3= 120
##$ZL4= 120
##$ABSF1= 14.96342
##$ABSF2= -5.594762
##$ABSG= 5
##$ABSL= 3
##$ALPHA= 0
##$AQORDER= 0
##$ASSFAC= 0
##$ASSFACI= 0
##$ASSFACX= 0
##$ASSWID= 0
##$AUNMP= <proc_prof1d_extract.lims>
##$AXLEFT= 0
##$AXNAME= <>
##$AXNUC= <1H>
##$AXRIGHT= 0
##$AXTYPE= 0
##$AXUNIT= <>
##$AZFE= 0.1
##$AZFW= 0.1
##$BCFW= 0
##$BC_mod= 0
##$BYTORDP= 0
##$COROFFS= 0
##$CY= 15
##$DATMOD= 1
##$DC= 0
##$DFILT= <>
##$DTYPP= 0
##$F1P= 0
##$F2P= 0
##$FCOR= 0.5
##$FTSIZE= 131072
##$FT_mod= 6
##$GAMMA= 0
##$GB= 0
##$INTBC= 1
##$INTSCL= 1
##$ISEN= 128
##$LB= 0.3
##$LEV0= 0
##$LPBIN= 0
##$MAXI= 10000
##$MC2= 0
##$MEAN= 0
##$ME_mod= 0
##$MI= 0
##$NCOEF= 0
##$NC_proc= -2
##$NLEV= 6
##$NOISF1= 0
##$NOISF2= 0
##$NSP= 0
##$NTH_PI= 0
##$NZP= 0
##$OFFSET= 14.96342
##$PC= 1
##$PHC0= 268.4674
##$PHC1= 0
##$PH_mod= 1
##$PKNL= yes
##$PPARMOD= 0
##$PPDIAG= 0
##$PPIPTYP= 0
##$PPMPNUM= 2147483647
##$PPRESOL= 1
##$PSCAL= 4
##$PSIGN= 0
##$PYNMP= <proc.py>
##$REVERSE= no
##$SF= 400.020008668159
##$SI= 131072
##$SIGF1= 0
##$SIGF2= 0
##$SINO= 400
##$SIOLD= 131072
##$SPECTYP= <>
##$SREGLST= <1H.CDCl3>
##$SSB= 0
##$STSI= 131072
##$STSR= 0
##$SW_p= 8223.68421052631
##$SYMM= 0
##$S_DEV= 0
##$TDeff= 65536
##$TDoff= 0
##$TI= <>
##$TILT= no
##$TM1= 0
##$TM2= 0
##$TOPLEV= 0
##$USERP1= <user>
##$USERP2= <user>
##$USERP3= <user>
##$USERP4= <user>
##$USERP5= <user>
##$WDW= 1
##$XDIM= 131072
##$YMAX_p= 437697807
##$YMIN_p= -11619
##$CURPLOT= <Network HP LaserJet P1505>
##$CURPRIN= <$Network HP LaserJet P1505>
##$DFORMAT= <normdp>
##$LAYOUT= <+/1D_H.xwp>
##$LFORMAT= <normlp>
##$PFORMAT= <normpl>
##$SURQMSG= 1
$$ End of Bruker specific parameters
$$ ---------------------------------
##NTUPLES= NMR SPECTRUM
##VAR_NAME=  FREQUENCY,     SPECTRUM/REAL,   SPECTRUM/IMAG
##SYMBOL=    X,             R,               I
##VAR_TYPE=  INDEPENDENT,   DEPENDENT,       DEPENDENT
##VAR_FORM=  AFFN,          ASDF,            ASDF
##VAR_DIM=   131072,        131072,          131072
##UNITS=     HZ,            ARBITRARY UNITS, ARBITRARY UNITS
##FACTOR=    0.0627417313425164, 1,          1
##FIRST=     8223.62146879497, 4365,         -54454
##LAST=      0,             6225,            -54943
##MIN=       0,             -11619,          0
##MAX=       8223.62146879497, 437697807,    0
$$ Real data points
##PAGE= N=1
##DATA TABLE= (X++(R..R)), XYDATA
$$ [...]
63412C22099p649p130o274n500m989m276l000j540n35o0L27R24J634K339L212
63397B89582M488N886O646O376N777O043P431R031J0087J0869J1828J2695J3014
63384C99753J2979J2841J2130J0395Q224O432M629J887j381l662m501m924n384
63371D49418m900k957q83j81m95m71N8O2r19k196l164m042n142o213o895p315
63355D03765p821q438q870q965q865q726q474q004p515p425p781q061p700o735
63341B90385n622m687m048l830l983l964l212j895p53k01n3j54o74j652k674l203
63325B49780k952j891l16J119J869J968J760J269L84n37r46r04r26j039p99k94
63309B47545k35q54j491j622j531j652j952k297k745l113k964k393k140k469k692
$$ y = [322099, 314450, 307320, 301046, 295546, 290557, 286281, 283281, 281741, 281206, 281146, 281473, 282397, 284031, 286370, 289582, 294070, 299956, 306602, 312978, 318755, 324798, 332229, 341260, 351347, 362216, 374044, 386739, 399753, 412732, 425573, 437703, 448098, 456322, 462754, 467383, 469270, 467889, 464227, 459726, 454802, 449418, 444518, 441561, 440678, 440497, 440002, 439531, 439589, 439651, 438732, 436536, 433372, 429330, 424188, 417975, 411080, 403765, 395944, 387506, 378636, 369671, 360806, 352080, 343606, 335602, 328087, 320662, 312881, 304820, 297120, 290385, 284763, 280076, 276028, 272198, 268215, 264251, 261039, 259144, 258391, 258190, 258137, 257983, 257309, 255657, 252983, 249780, 246828, 244937, 244621, 245740, 247609, 249577, 251337, 252606, 252990, 252453, 251507, 250603, 249677, 248638, 247839, 247545, 247310, 246456, 244965, 243343, 241812, 240160, 238208, 235911, 233166, 230053, 227089, 224696, 222556, 220087, 217395]
63294B17395k186j290o36k92j08k65q23j289j279j084j023p69oP31O23l50j469
63277B05880k104j981j066J74P99L97l07m11r7j67o79r09n02J59P17J231J738
63260B02872K033K022J891J800J747J733J769J821K023K693L780M588M492L792
63246B39056L349L603M404N510O652P355P340P120P491Q444R238R650J0395J2026
63232C41633J3967J5144J5262J4975J5006J5409J5762J5739J5342J4725J4053
63221E07017J3528J3404J3713J4130J4364J4565J5021J5508J5422J4538J3177
63210F64387J1494R170N983K204j840o093j0288j3743j6126j7983j9891k1409
63198E85865k1569k0324j8825j8117j7991j7380j5659j3370j1493j0177q507n767
$$ y = [217395, 215209, 213919, 213283, 212991, 212883, 212618, 211795, 210506, 209227, 208143, 207120, 206351, 206345, 207076, 207699, 207349, 205880, 203776, 201795, 200729, 200903, 201702, 202099, 201792, 201381, 201284, 201117, 200438, 199529, 199027, 199186, 199903, 201134, 202872, 204905, 206927, 208818, 210618, 212365, 214098, 215867, 217688, 219711, 222404, 226184, 230772, 235264, 239056, 242405, 246008, 250412, 255922, 262574, 269929, 277269, 284389, 291880, 300324, 309562, 319212, 329607, 341633, 355600, 370744, 386006, 400981, 415987, 431396, 447158, 462897, 478239, 492964, 507017, 520545, 533949, 547662, 561792, 576156, 590721, 605742, 621250, 636672, 651210, 664387, 675881, 685051, 691034, 693238, 691398, 685305, 675017, 661274, 645148, 627165, 607274, 585865, 564296, 543972, 525147, 507030, 489039, 471659, 456000, 442630, 431137, 420960, 412453, 406686]
63186D06686k549kJ651L092M491N267N426O039P737R641J0521J0332R840R417
63172D87589R057R032R544J0050R859R208Q896Q997Q743P623N863L857J771k21
63158E89868j928l496n380p825j0606j3190j5032j5953j6344j6677j6679j5643
63146D51115j3769j2322j1935j1596j0164q109o739o316o045n519m976m422l639
63133C45564k927k765k782k216j271r37j347j491p80J93P85J162J626J924J705
63118C36443J064K36o17j082o36N59J527J529P66j13o89p52k53M40O99L54j47
63101C39328l57j97K65R56J540J689J609J788K147K125J679J471J845K370K677
63086C60935L006L576M011L903L388K772K050J214O46P98J697L004M311N180N267
$$ y = [406686, 404137, 404135, 405786, 408878, 413369, 418636, 424062, 430101, 437838, 447479, 458000, 468332, 478172, 487589, 496646, 505678, 515222, 525272, 535131, 544339, 553235, 562232, 570975, 578598, 584461, 588318, 590089, 589868, 587940, 584444, 579064, 571239, 560633, 547443, 532411, 516458, 500114, 483437, 466758, 451115, 437346, 425024, 413089, 401493, 391329, 383220, 376481, 370165, 364120, 358601, 353625, 349203, 345564, 342637, 339872, 337090, 334874, 333603, 332666, 331319, 329828, 329048, 329241, 330026, 331188, 332814, 334738, 336443, 337507, 337743, 337126, 336044, 335408, 335967, 337494, 339023, 339789, 339676, 338987, 338235, 337982, 338422, 339121, 339475, 339328, 338971, 338774, 339039, 339995, 341535, 343224, 344833, 346621, 348768, 350893, 352572, 354043, 355888, 358258, 360935, 363941, 367517, 371528, 375431, 378819, 381591, 383641, 384855, 385501, 386299, 387996, 391000, 395311, 400491, 405758]
63071D05758M713M112L905M062M407M954N786O930Q394J0027J1345J1965J2243
63058D98601J3066J4855J7210J9520K1588K3565K5682K8069L0464L2255L3229
63047G58104L4034L5306L6644L7176L6871L6364L5666L4223L2243L0837L0440
63036A137908L0300K9832K9452K9574K9830K9877K9876K9474K7345K2718J6483
63025A442669R867K700n840j5314k4078l1091l6682m1555m5787m8903n0384n0094
63013A105508m8560m6617m4487m1577l7568l3142k9055k5067k0588j5894j1768
63002G51185q213m521n77K945N699Q121J0510J2458J3533J3906J3937J3702J3284
62989H45969J3072J3270J3527J3432J3157J3120J3174J2562J0827Q321N660K923
$$ y = [405758, 410471, 414583, 418488, 422550, 426957, 431911, 437697, 444627, 453021, 463048, 474393, 486358, 498601, 511667, 526522, 543732, 563252, 584840, 608405, 634087, 662156, 692620, 724875, 758104, 792138, 827444, 864088, 901264, 938135, 974499, 1010165, 1044388, 1076631, 1107468, 1137908, 1168208, 1198040, 1227492, 1257066, 1286896, 1316773, 1346649, 1376123, 1403468, 1426186, 1442669, 1452536, 1455236, 1449396, 1434082, 1410004, 1378913, 1342231, 1300676, 1254889, 1205986, 1155602, 1105508, 1056948, 1010331, 965844, 924267, 886699, 853557, 824502, 799435, 778847, 762953, 751185, 742972, 738451, 737874, 740819, 746518, 754639, 765149, 777607, 791140, 805046, 818983, 832685, 845969, 859041, 872311, 885838, 899270, 912427, 925547, 938721, 951283, 962110, 970431, 976091, 979014]
62977I79014l52m469r216j4193j9092k3509k6912k9189l1033l3193l5397l6515
62965G15944l5849l3883l1648k9736k8164k6712k5120k3233k1227j9497j8118
62954D22757j6727j5095j3502j2288j1333j0315r267q510q107p720p049o221n595
62941B91028n268m910m152l115k277j864j654j517j685k158k340j783r66o56q13
62926B55870q47o91p83j052r13l99k50o77r73o85k77j67K1O26J112P75k68j407
62908B49015k369l146l501l213k498j750j153q85j222j984k410k121j757j993
62894B19013k418k058p53O22J188P55k78j215j383o40M18J016Q57J45o43r19m03
62877B13304L90N97K15J31P07J171R16N46Q27J345J196M12k52n66p98q01j89P44
$$ y = [979014, 978662, 974193, 964977, 950784, 931692, 908183, 881271, 852082, 821049, 787856, 752459, 715944, 680095, 646212, 614564, 584828, 556664, 529952, 504832, 481599, 460372, 440875, 422757, 406030, 390935, 377433, 365145, 353812, 343497, 334230, 325720, 317613, 309893, 302844, 296623, 291028, 285760, 280850, 276698, 273583, 271306, 269442, 267788, 266271, 264586, 262428, 260088, 258305, 257339, 256683, 255870, 255023, 254332, 253549, 252497, 251584, 251185, 250935, 250258, 249285, 248600, 248323, 248156, 248177, 248803, 249915, 250690, 250422, 249015, 246646, 243500, 239999, 236786, 234288, 232538, 231385, 230500, 229278, 227294, 224884, 222763, 221006, 219013, 216595, 214537, 213784, 214406, 215594, 216349, 216071, 214856, 213473, 212833, 213251, 214267, 215124, 215269, 214626, 213707, 213304, 213694, 214291, 214506, 214637, 215344, 216515, 217431, 217977, 218804, 220149, 221345, 221757, 221505, 220939, 220141, 219340, 219151, 219895]
62859B19895J285J412J724K265K436K141K105K708L325L178K317J391Q55O96O44
62844B48377M63J95J36M38Q75J165J328J379J082L51l80o54n38k29M22J416K107
62827B57933J989J619J892K688L145L030K880K901K808K771L392M522N121M697
62813C01388L962L678L727L757L958M474M714M024K747K014K600M229N903O734
62799C57909O754O952Q212J0208J1939J3280J5217J8311K1769K4579K6795K9038
62787E50963L1335L3341L5360L8153M1768M5381M8496N1549N4969N8143N9934
62776A049392N9976N8912N7231N4404M9495M2413L4022K5060J5486N144n477j5620
62764A430438k5046l3853m1734m7985n2296n4978n6397n6652n5989n4887n3556
$$ y = [219895, 221180, 222592, 224316, 226581, 229017, 231158, 233263, 235971, 239296, 242474, 244791, 246182, 247037, 247733, 248377, 248840, 249035, 249171, 249609, 250484, 251649, 252977, 254356, 255438, 255789, 255409, 254755, 254217, 253988, 254410, 255826, 257933, 259922, 261541, 263433, 266121, 269266, 272296, 275176, 278077, 280885, 283656, 287048, 291570, 296691, 301388, 305350, 309028, 312755, 316512, 320470, 324944, 329658, 333682, 336429, 338443, 341043, 345272, 351175, 357909, 364663, 371615, 379827, 390035, 401974, 415254, 430471, 448782, 470551, 495130, 521925, 550963, 582298, 615639, 650999, 689152, 730920, 776301, 824797, 876346, 931315, 989458, 1049392, 1109368, 1168280, 1225511, 1279915, 1329410, 1371823, 1405845, 1430905, 1446391, 1451535, 1446058, 1430438, 1405392, 1371539, 1329805, 1281820, 1229524, 1174546, 1118149, 1061497, 1005508, 950621, 897065]
62753H97065n1742m9298m6532m3770m0855l7504l3896l0600k7963k5806k3686
62742D85413k1336j8914j6881j5538j4621j3538j1993j0256q740p533o470n491
62730C34102m744m326m084l722l141k537k051j404k14J349K612L235L574L968
62716C22617M204M151M437N757P744R352J0322J1466J3394J5678J7626J9312K1287
62703D67347K3706K6207K8546L0891L3366L5600L6920L7060L6435L5542L4130
62692H25750L1429K7260K2380J7350J1606M370l816j1324j7195k1944k6466l0779
62680H28621l4150l5992l6311l5656l4790l4154l3461l2060k9812k7317k5248
62669D69670k3757k2536k1158j9319j7103j5003j3376j1924j0179q375p222o825
$$ y = [897065, 845323, 796025, 749493, 705723, 664868, 627364, 593468, 562868, 534905, 509099, 485413, 464077, 445163, 428282, 412744, 398123, 384585, 372592, 362336, 353596, 346063, 339593, 334102, 329358, 325032, 320948, 317226, 314085, 311548, 309497, 308093, 307879, 309228, 311840, 315075, 318649, 322617, 326821, 330972, 335409, 341166, 348910, 358262, 368584, 380050, 393444, 409122, 426748, 446060, 467347, 491053, 517260, 545806, 576697, 610063, 645663, 682583, 719643, 756078, 791620, 825750, 857179, 884439, 906819, 924169, 935775, 940145, 936329, 925005, 907810, 885866, 859400, 828621, 794471, 758479, 722168, 686512, 651722, 617568, 584107, 552047, 522235, 494918, 469670, 445913, 423377, 402219, 382900, 365797, 350794, 337418, 325494, 315315, 306940, 299718, 292893]
62657B92893o454n659m945m967n558n923n493m262k633j286r16j673k921l711
62643B36492l461k252p78j8m26j322j462m74O84Q88O0r93j468j007K50J606K137
62626B28456J607Q00N95R69J350J604K064K694K961K674K417K863L910M844N202
62611B65010N248N626O638P962R049R699J0188J0882J1891J3139J4639J6540J8905
62598D05416K1538K4011K5907K7174K8236K9535L0906L1489L0443K7696K3922
62587G06273J9806J5495J0722N322n14o388j1874j6515j9893k2036k3547k5066
62575F31785k6542k7417k7402k6755k5808k4723k3714k2924k1914j9957j7232
62564C67397j4981j3999j3510j2336j0621r452r064q472p013n367m656n077n750
$$ y = [292893, 286439, 280780, 275835, 270868, 265310, 259387, 253894, 249632, 246999, 245713, 244797, 243124, 240203, 236492, 233031, 230779, 230001, 229983, 229557, 228235, 226773, 226299, 226983, 227871, 227931, 226938, 225470, 224463, 224713, 226319, 228456, 230063, 230863, 231458, 232427, 233777, 235381, 237445, 240139, 243100, 245774, 248191, 251054, 254964, 259808, 265010, 270258, 275884, 282522, 290484, 299533, 309232, 319420, 330302, 342193, 355332, 369971, 386511, 405416, 426954, 450965, 476872, 504046, 532282, 561817, 592723, 624212, 654655, 682351, 706273, 726079, 741574, 752296, 757618, 757104, 750716, 738842, 722327, 702434, 680398, 656851, 631785, 605243, 577826, 550424, 523669, 497861, 473138, 449424, 426500, 404586, 384629, 367397, 352416, 338417, 324907, 312571, 301950, 292498, 283434, 274962, 267949, 262582, 257926, 252849, 247099]
62551B47099n638m467k877j751j306j007n07j95m19o74k28P48J393J356J054Q78
62535B33459Q80J135J748K506L127L724M444M930M946N175O438Q336R761J0601
62521C01210J1694J3156J4197J4804J6060J8200J9863K0057J9661J9875K0319
62510D89096J9851J8364J6529J4344J1218P226L124p03m403p889j0794j3097j5013
62497E27853j6274j6348j5390j4327j3775j3399j2503j0915r197q066p688p449
62485C82522o660n472m726m802n194n419n692o293o932p232p352p452p167o261
62471B95868n354n133n235m721l511k447k057k035j960j821j736j704j818k218
62457B54118k726k904k573k001j581j558j929k346k316j786j285j169j088o41
$$ y = [247099, 241461, 236994, 234117, 232366, 231060, 230053, 229546, 229351, 228932, 228258, 228030, 228778, 230171, 231527, 232581, 233459, 234339, 235474, 237222, 239728, 242855, 246579, 251023, 255953, 260899, 266074, 272512, 280848, 290609, 301210, 312904, 326060, 340257, 355061, 371121, 389321, 409184, 429241, 448902, 468777, 489096, 508947, 527311, 543840, 558184, 569402, 576628, 579752, 579049, 574646, 566757, 555963, 542866, 527853, 511579, 495231, 479841, 465514, 451739, 438340, 425837, 414922, 405725, 397659, 389971, 382522, 375862, 370390, 365664, 360862, 355668, 350249, 344557, 338264, 331332, 324100, 316748, 309296, 302129, 295868, 290514, 285381, 280146, 275425, 271914, 269467, 267410, 265375, 263415, 261594, 259858, 258154, 256336, 254118, 251392, 248488, 245915, 243914, 242333, 240775, 238846, 236500, 234184, 232398, 231113, 229944, 228856, 228215]
62443B28215j21p4l93n23l22j9M73J404K401K701K279K010K431K997K974K584
62427B49017K762L890N216N610M852L975M118N195O067O091N861O107O581O609
62413C21951O220N940N767N230M295L438K842K234J527R18L80k55p58p46m70n62
62397C57951r23p39K18J164J550J868K724L761M224M128M240N155O868R025J1154
62382D12368J2867J4196J5609J7423J9428K1328K3277K5640K8369L0925L2712
62371F54142L3437L3195L2310L0950K8764K5236K0512J5512J0977O775K530j477
62359H92863m554o573q188j0023j2137j4281j6321j8218j9862k1101k1843k2141
62347G17621k2189k2177k1989k1231j9760j8081j6908j6337j5762j4692j3226
$$ y = [228215, 228094, 228020, 227627, 227104, 226782, 226763, 227236, 228640, 231041, 233742, 236021, 238031, 240462, 243459, 246433, 249017, 251779, 255669, 260885, 266495, 271347, 275322, 279440, 284635, 290702, 296793, 302654, 308761, 315342, 321951, 328171, 334111, 339878, 345108, 349403, 352841, 355683, 357917, 359444, 360362, 360742, 360487, 359729, 358983, 358513, 357951, 357028, 356289, 356507, 357671, 359221, 361089, 363813, 367574, 371798, 375926, 380166, 385321, 392189, 401214, 412368, 425235, 439431, 455040, 472463, 491891, 513219, 536496, 562136, 590505, 621430, 654142, 687579, 720774, 753084, 784034, 812798, 838034, 858546, 874058, 885035, 891810, 894340, 892863, 888309, 881736, 873548, 863525, 851388, 837107, 820786, 802568, 782706, 761605, 739762, 717621, 695432, 673255, 651266, 630035, 610275, 592194, 575286, 558949, 543187, 528495, 515269]
62336E15269j1668r984q064o185m789l810k714j291o0L83J64m0J12K59j11r60
62320D66511j685j744j250q96j264k187k942l110k969k926k935k815k774l015
62306D33999l009j931qJ353J158M1n98k18O08J250J700K217K901L673M298M425
62290D51859L945L392L528M458N502O106O517P274Q399R516J0652J2284J4454
62277E47886J6350J7281J7775J9046K1352K3525K4524K4748K5249K6091K6356
62266G90183K5500K3747K1150J7391J2853Q914O483M888L022R24o38j780l558
62253I09079o353r104j0493j0373r676r278r317r338q812p551n802l973k359j098
62239H05552k37L39R11J650K439L075L579M035M394M603M835N268N742N967N999
$$ y = [515269, 503601, 493617, 485553, 479368, 474579, 470769, 468055, 466764, 466704, 467087, 467251, 467211, 467323, 467582, 467471, 466511, 464826, 463082, 461832, 460936, 459672, 457485, 454543, 451433, 448464, 445538, 442603, 439788, 437014, 433999, 430990, 429059, 429051, 430404, 431562, 431603, 431005, 430787, 431395, 432645, 434345, 436562, 439463, 443136, 447434, 451859, 455804, 459196, 462724, 467182, 472684, 478790, 485307, 492581, 500980, 510496, 521148, 533432, 547886, 564236, 581517, 599292, 618338, 639690, 663215, 687739, 712487, 737736, 763827, 790183, 815683, 839430, 860580, 877971, 890824, 899738, 906221, 911109, 914131, 915055, 914417, 912637, 909079, 902726, 893622, 883129, 872756, 863080, 853802, 844485, 835147, 826335, 818784, 812982, 809009, 806650, 805552, 805315, 805654, 806565, 808215, 810654, 813729, 817308, 821343, 825737, 830340, 835175, 840443, 846185, 852152, 858151]
62224H58151O216O774P413P855Q174Q666R490J0518J1458J2097J2522J3055J3901
62211I86290J4935J5886J6651J7335J8144J9346K1160K3433K5546K6914K7604
62200A213244K8213K9155L0178L0690L0300K8936K6567K3147J8945J4688J1120
62189A485183Q489O719N948O498Q218J0452J2900J5954J9721K3294K5610K6663
62177A655649K7099K6996K5916K3992K1939J9947J7555J4774J2371J0780R595
62166A866613Q461P531O684N200K829L60j477k908m326n394n730n776o109o409
62152A859549n936m671l235k033j153q01j094j656k011k124k110j856j414j225
62138A828230j350j089m3R72J015M54L43P70R35O30N65J149J999K695L258L693
$$ y = [858151, 864367, 871141, 878554, 886409, 894583, 903249, 912739, 923257, 934715, 946812, 959334, 972389, 986290, 1001225, 1017111, 1033762, 1051097, 1069241, 1088587, 1109747, 1133180, 1158726, 1185640, 1213244, 1241457, 1270612, 1300790, 1331480, 1361780, 1390716, 1417283, 1440430, 1459375, 1474063, 1485183, 1493672, 1500391, 1506339, 1512837, 1521055, 1531507, 1544407, 1560361, 1580082, 1603376, 1628986, 1655649, 1682748, 1709744, 1735660, 1759652, 1781591, 1801538, 1819093, 1833867, 1846238, 1857018, 1866613, 1875074, 1882605, 1889289, 1894489, 1897318, 1897678, 1896201, 1893293, 1888967, 1883573, 1877843, 1872067, 1865958, 1859549, 1853613, 1848942, 1845707, 1843674, 1842521, 1841720, 1840626, 1838970, 1836959, 1834835, 1832725, 1830869, 1829455, 1828230, 1826880, 1825791, 1825748, 1826720, 1827735, 1828189, 1828532, 1829302, 1830237, 1830867, 1831432, 1832581, 1834580, 1837275, 1840533, 1844226]
62122A844226L769L523L425L950N249P156R225J1017J2558J4006J4577J2640P756
62109A953077J892k376m331m729l784j077K619N149M958K226k010o694j0475j2021
62095A922424j1251r488p868o353m580k884j939k049l197n263p808j0100j1701
62082A837943j2781j3720j4699j5630j6144j5906j5311j5503j7028j8965k0163
62071A662093k0858k1924k3050k3133k2275k1768k1961k1830k1032k0794k1929
62060A421539k3431k3944k3442k2542k1165j9009j6460j4045j1687r428q146q527
62048A219713r935j1413j3199j6112j9754k2589k3735k3685k3163k2227k0779
62037A013122j9134j7682j6492j5574j5183j5456j6012j6208j5811j5137j4473
$$ y = [1844226, 1847995, 1851518, 1854943, 1858893, 1864142, 1871298, 1880523, 1891540, 1904098, 1918104, 1932681, 1945321, 1953077, 1954969, 1952593, 1948262, 1943533, 1939749, 1938672, 1941291, 1946440, 1951398, 1953624, 1951614, 1944920, 1934445, 1922424, 1911173, 1901685, 1893817, 1887464, 1882884, 1880000, 1878061, 1876012, 1872815, 1867552, 1859744, 1849644, 1837943, 1825162, 1811442, 1796743, 1781113, 1764969, 1749063, 1733752, 1718249, 1701221, 1682256, 1662093, 1641235, 1619311, 1596261, 1573128, 1550853, 1529085, 1507124, 1485294, 1464262, 1443468, 1421539, 1398108, 1374164, 1350722, 1328180, 1307015, 1288006, 1271546, 1257501, 1245814, 1236386, 1228240, 1219713, 1209778, 1198365, 1185166, 1169054, 1149300, 1126711, 1102976, 1079291, 1056128, 1033901, 1013122, 993988, 976306, 959814, 944240, 929057, 913601, 897589, 881381, 865570, 850433, 835960]
62026H35960j3667j2475j1137j0105r221p818n868m356l960l923l011j127Q54
62013G50146K494M051N581O808P804Q772R203Q268O083L504O19l318q241j2753
61999G89021j5682j7120j7521j6943j5661j4442j3512j2203j0224q267o792n302
61987F35352l525k220j862j548k99J418K521L010L650M570N306N911O858Q108
61973F67250R174J0002J0941J2109J3432J5010J6690J7630J7204J6108J5735J6558
61961H37843J7913J9124K0124K0947K1573K2322K3776K6106K8866L1518L3891
61950A104003L6200L8867M2161M5800M9215N2450N6282O1171O6568P1774P6853
61939A701344Q2151Q7365R1736R4616R5202R2340Q5779P7481P0801O8329P1095
$$ y = [835960, 822293, 809818, 798681, 788576, 779355, 771537, 765669, 761313, 757353, 753430, 750419, 749292, 750146, 752640, 756691, 762272, 769080, 776884, 785656, 794859, 803127, 809210, 812714, 813333, 810015, 801774, 789021, 773339, 756219, 738698, 721755, 706094, 691652, 678140, 665937, 655713, 647446, 640654, 635352, 631827, 629607, 627745, 626197, 625898, 627316, 629837, 632847, 636497, 641067, 646373, 652284, 659142, 667250, 676424, 686426, 697367, 709476, 722908, 737918, 754608, 772238, 789442, 805550, 821285, 837843, 855756, 874880, 895004, 915951, 937524, 959846, 983622, 1009728, 1038594, 1070112, 1104003, 1140203, 1179070, 1221231, 1267031, 1316246, 1368696, 1424978, 1486149, 1552717, 1624491, 1701344, 1783495, 1870860, 1962596, 2057212, 2152414, 2244754, 2330533, 2408014, 2478815, 2547144, 2618239]
61928B618239P9480R3690J13104J36047J60873J86969K14503K43435K72963L01701
61918D421004L28249L51524L70276L82182L83777L71509L42807K96209K31447
61909G478984J50346N7679l9331j32717k15547k83087l33252l66065l82665l85010
61899E549335l76153l59794l38970l15613k91488k68577k47940k28993k10670
61890B911137j92767j75620j59223j43510j28991j16181j04747r4028q3987p4943
61880A637140o6720n8857n1361m4543l8392l2826k8104k4213k0284j5487j0199
61869A246154n359j010L521Q245J2383J5662J8710K2038K5438K8473L0856L2304
61857A437415L2663L2226L1234K9235K5635K0835J5993J1628P340L075k74j794
$$ y = [2618239, 2697719, 2791409, 2904513, 3040560, 3201433, 3388402, 3602905, 3846340, 4119303, 4421004, 4749253, 5100777, 5471053, 5853235, 6237012, 6608521, 6951328, 7247537, 7478984, 7629330, 7687009, 7647678, 7514961, 7299414, 7016327, 6683075, 6317010, 5934345, 5549335, 5173182, 4813388, 4474418, 4158805, 3867317, 3598740, 3350800, 3121807, 2911137, 2718370, 2542750, 2383527, 2240017, 2111026, 1994845, 1890098, 1796070, 1712083, 1637140, 1570420, 1511563, 1460202, 1415659, 1377267, 1344441, 1316337, 1292124, 1271840, 1256353, 1246154, 1240795, 1239785, 1243306, 1251551, 1263934, 1279596, 1298306, 1320344, 1345782, 1374255, 1405111, 1437415, 1470078, 1502304, 1533538, 1562773, 1588408, 1609243, 1625236, 1636864, 1644204, 1647279, 1647005, 1645211]
61845A645211j521j79J554L264M889O748R021J1028J1530J0012P271M514K295
61832A715637O03m98o59M23K834O609J1812J8224K4906L0266L2894L2208K8252
61819A903511K1269J2213L449k231l708j969J774P491J5424K4858L4778M5007
61807B061866N5739O6560P6947Q7367R8956J12244J27014J43094J60542J79374
61797C169703J99935K23214K50019K80050L12625L47940L86701M28706M72672
61788F071565N17255N61260O02705O38291O63692O73758O62716O25017N56441
61779A1572700M54948L22105J65068l533j69301l20368m48564n48440o17430o56835
61769I750350o70866o64326o41832o08466n69170n27093m83771m40904m00484
$$ y = [1645211, 1643690, 1643511, 1645065, 1648329, 1653218, 1659966, 1668987, 1680015, 1691545, 1701557, 1708828, 1713342, 1715637, 1716240, 1715742, 1715083, 1715506, 1718340, 1724949, 1736761, 1754985, 1779891, 1810157, 1843051, 1875259, 1903511, 1924780, 1936993, 1940442, 1938211, 1934503, 1932534, 1934308, 1941799, 1957223, 1982081, 2016859, 2061866, 2117605, 2184165, 2261112, 2348479, 2447435, 2559679, 2686693, 2829787, 2990329, 3169703, 3369638, 3592852, 3842871, 4122921, 4435546, 4783486, 5170187, 5598893, 6071565, 6588820, 7150080, 7752785, 8391076, 9054768, 9728526, 10391242, 11016259, 11572700, 12027648, 12349753, 12514821, 12511288, 12341987, 12021619, 11573055, 11024615, 10407185, 9750350, 9079484, 8415158, 7773326, 7164860, 6595690, 6068597, 5584826, 5143922, 4743438]
61760D743438l63099l27889k94710k64914k39334k16876j96045j76797j59972
61751B503802j45699j33180j21556j10341r9563q9835q1787p5102o8719o2284
61741A515736n6602n2301m8891m5568m2232l9169l6406l3942l1992l0447k8589
61730A069597k5909k2883k0415j8830j7787j6837j5699j4271j2736j1502j0805
61719H81923j0488j0215r762r103q383p732o955n600l668j882r69j051k115m461
61705G99539q045j1899j5043j7408j9127j9541j8140j5920j4452j3895j3254j2281
61693F20534j1554j0862r245o894n317n218n683n880o123o685p005o797o705p086
61679E19480p332p066o858p096p238o896o542o306n397l605k226k329l052k853
$$ y = [4743438, 4380339, 4052450, 3757740, 3492826, 3253492, 3036616, 2840571, 2663774, 2503802, 2358103, 2224923, 2103367, 1993026, 1893463, 1803628, 1721841, 1646739, 1578020, 1515736, 1459134, 1406833, 1357942, 1312374, 1270142, 1230973, 1194567, 1160625, 1128633, 1098186, 1069597, 1043688, 1020805, 1000390, 981560, 963773, 946936, 931237, 916966, 904230, 892728, 881923, 871435, 861220, 851458, 842355, 833972, 826240, 819285, 813685, 810017, 808135, 807166, 806115, 804000, 799539, 791494, 779595, 764552, 747144, 728017, 708476, 690336, 674416, 659964, 646069, 632815, 620534, 608980, 598118, 588873, 581979, 576662, 571444, 565761, 559881, 553758, 547073, 540068, 533271, 526566, 519480, 512148, 505082, 498224, 491128, 483890, 476994, 470452, 464146, 458749, 455144, 452918, 450589, 447537, 444684]
61665D44684j657n81j46K9J87K07J48J35p1o27j126j208j297k051l346m444m897
61648D23939m779m369m045m101m233l729k532j554j485j890k008j784j584j502
61634C84344j520j755j944j397o2J011J013N22N58J122J438J164M69n98j915k876
61618C79574k981k582k351k310k078j707j529j417j011m30j50k71m73n05j95P12
61602C60296K196L650M444M557M320L879L330K970K929K897K707K770L453M447
61588D08845N223N737O152O369O347O521P350Q744J0327J1925J3361J4373J5178
61575E26452J6583J8940K1426K2976K3506K3731K4140K4601K4537K3059J9653
61564G69604J5141J1384R434Q532P397N810M410L777M289O087Q410R830R923R840
$$ y = [444684, 443027, 442446, 442300, 442329, 442516, 442723, 442871, 443006, 442935, 442308, 441182, 439974, 438677, 436626, 433280, 428836, 423939, 419160, 414791, 410746, 406645, 402412, 398683, 396151, 394597, 393112, 391222, 389214, 387430, 385846, 384344, 382824, 381069, 379125, 377728, 377666, 378677, 379690, 380212, 380770, 381892, 383330, 384494, 384963, 384365, 382450, 379574, 376593, 374011, 371660, 369350, 367272, 365565, 364036, 362619, 361608, 361178, 361028, 360757, 360284, 359779, 359584, 360296, 362492, 366142, 370586, 375143, 379463, 383342, 386672, 389642, 392571, 395468, 398175, 400945, 404398, 408845, 414068, 419805, 425957, 432326, 438673, 445194, 452544, 461288, 471615, 483540, 496901, 511274, 526452, 543035, 561975, 583401, 606377, 629883, 653614, 677754, 702355, 726892, 749951, 769604, 784745, 796129, 805563, 814095, 821492, 827302, 831712, 835489, 839778, 845865, 854275, 864105, 874028, 883868]
61550H83868J0462J1046J0698R998R764R252P373M921L578L030J291k118n211
61537I57952o308o072o041o592p193p520p360o227l998j447N68K042L469N018
61523I10291O589Q362J0729J3729J6912J9768K2279K5119K9140L4512M0434M6040
61511A183904N1349N7006O3389P0483P8381Q7262R6825J06398J15649J24693J33494
61500B168833J41550J48221J52908J54870J53281J47606J37634J23238J04425
61491C432566Q1718N6263K9653L784j9423l8704n3857o5281p3217p7659p8841
61480C197002p7541p5048p2845p1881p1885p1844p1372p0993p0815o9725o6611
61469B406442o1673n5745m8864m0556l1174k1988j3943p146j502L020O778J0344
$$ y = [883868, 894330, 905376, 916074, 926072, 935836, 945088, 952461, 957382, 960960, 963990, 965281, 963163, 957952, 951644, 945572, 939531, 932939, 925746, 918226, 910866, 904639, 900641, 899194, 899762, 901804, 905273, 910291, 916880, 925242, 935971, 949700, 966612, 986380, 1008659, 1033778, 1062918, 1097430, 1137864, 1183904, 1235253, 1292259, 1355648, 1426131, 1504512, 1591774, 1688599, 1794997, 1910646, 2035339, 2168833, 2310383, 2458604, 2611512, 2766382, 2919663, 3067269, 3204903, 3328141, 3432566, 3514284, 3570547, 3600200, 3603984, 3584561, 3545857, 3492000, 3426719, 3353502, 3275843, 3197002, 3119461, 3044413, 2971568, 2899687, 2827802, 2755958, 2684586, 2613593, 2542778, 2473053, 2406442, 2344769, 2289024, 2240160, 2199604, 2168430, 2146442, 2132499, 2125353, 2123851, 2126871, 2133649, 2143993]
61457B143993J3816J6746J8794K0028K0625K0759K0761K1003K1737K3283K6036
61446B367581K9805L3516L6289L8551M1400M5081M8791N1850N4178N5477N4705
61435B857224N0728M3368L3672K3329J3566M486m395j2960k0362k6243l1122l5088
61423B896203l6991l5920l2805k9419k6165k2038j6556j0690n814k792k131m005
61411B670877p748j1934j5266j7092j7239j6002j4246j2804j1653j0263q625p334
61399B520671o692o364o028n709n357m570k856J54M687J0595J7270K4141L1257
61386B571199L9099M8067N8426P0304Q3258R6258J08629J20722J33126J45570
61376C474658J57134J66950J74111J77233J74992J66661J51597J28919R8808O3872
$$ y = [2143993, 2157809, 2174555, 2193349, 2213377, 2234002, 2254761, 2275522, 2296525, 2318262, 2341545, 2367581, 2397386, 2430902, 2467191, 2505742, 2547142, 2592223, 2641014, 2692864, 2747042, 2802519, 2857224, 2907952, 2951320, 2984992, 3008321, 3021887, 3026373, 3021978, 3009018, 2988656, 2962413, 2931291, 2896203, 2859212, 2823292, 2790487, 2761068, 2734903, 2712865, 2696309, 2685619, 2679805, 2677013, 2674882, 2670877, 2663129, 2651195, 2635929, 2618837, 2601598, 2585596, 2571350, 2558546, 2546893, 2536630, 2528005, 2520671, 2513979, 2507615, 2501587, 2495878, 2490521, 2485951, 2483095, 2483249, 2487936, 2498531, 2515801, 2539942, 2571199, 2610298, 2658365, 2716791, 2787095, 2870353, 2966611, 3075240, 3195962, 3329088, 3474658, 3631792, 3798742, 3972853, 4150086, 4325078, 4491739, 4643336, 4772255, 4871063, 4934935]
61366D934935K8130n450l5854o2967q6659j06749j23086j35670j45178j52790
61356D108662j58813j62058j61543j58218j53822j48571j41414j32254j22413
61347B769556j12825j03217r3349q3736p4773o6159n7666m9543m1889l4313k6518
61336B025568j8612j0748l083M000J0283J6281K2629K9055L4650L8915M1630M2010
61324B232578L9103L3039K4969J5930O734j305o865r850j1178j1408j0631r434
61312B291682q581p764o066l687j791n16J381M523P957J0569J2131J2511J1174
61299B323523Q232M831J882p71l576o677j0334j4821j9436k2803k4506k5274k5255
61286B185015k3516j9825j5388j1043o240r62K645K071k722r403j5659k0505k3786
$$ y = [4934935, 4963065, 4957615, 4921761, 4858794, 4772135, 4665386, 4542300, 4406630, 4261452, 4108662, 3949849, 3787791, 3626248, 3468030, 3314208, 3165637, 3024223, 2891969, 2769556, 2656731, 2553514, 2460165, 2376429, 2301656, 2235497, 2177831, 2128288, 2086399, 2052086, 2025568, 2006956, 1996208, 1993125, 1997125, 2007408, 2023689, 2046318, 2075373, 2110023, 2148938, 2190568, 2232578, 2271681, 2304720, 2329689, 2345619, 2352353, 2351048, 2344183, 2334333, 2323155, 2311747, 2301116, 2291682, 2283101, 2275337, 2269271, 2265584, 2263793, 2263277, 2264658, 2269181, 2277138, 2287707, 2299838, 2312349, 2323523, 2331755, 2336586, 2338468, 2337697, 2334121, 2327444, 2317110, 2302289, 2282853, 2260050, 2235544, 2210270, 2185015, 2161499, 2141674, 2126286, 2115243, 2109003, 2108041, 2110686, 2112757, 2110035, 2100632, 2084973, 2064468, 2040682]
61273B040682k5656k6461k6448k5601k4023k2070j9803j6930j3596j0533p953
61262A821608m990r30L683P698J0652J2905J5046J7760K1806K7558L4734M2822
61250B010352N1307N9423O6357P2066P7225Q2046Q5777Q7656Q7511Q4910P8485
61239B843115O6753M9354K7142J675k5037n0833p4012r3466j08203j17295j20524
61228B398669j18513j12193j02687r1560q0221o8858n6812m4100l1693k0286r955
61217A661791j350L966M900J607n341j5395k6960l7108m3375m5385m4302m1449
61205A411599l7952l4679l1758k8783k5920k4077k3473k3069k1949k0378j8833
61194A120728j7024j4733j2695j1631j1029r951q548p832q156q789q881q312p588
$$ y = [2040682, 2015026, 1988565, 1962117, 1936516, 1912493, 1890423, 1870620, 1853690, 1840094, 1829561, 1821608, 1816618, 1815688, 1819371, 1827069, 1837721, 1850626, 1865672, 1883432, 1905238, 1932796, 1967530, 2010352, 2061659, 2121082, 2187439, 2259505, 2336730, 2418776, 2504553, 2592209, 2679720, 2764630, 2843115, 2909868, 2959222, 2986364, 2988039, 2963002, 2912169, 2838157, 2744691, 2636488, 2519193, 2398669, 2280156, 2167963, 2065276, 1973716, 1893495, 1824637, 1767825, 1723725, 1692032, 1671746, 1661791, 1660441, 1664407, 1669307, 1670914, 1665573, 1650178, 1623218, 1586110, 1542735, 1497350, 1453048, 1411599, 1373647, 1338968, 1307210, 1278427, 1252507, 1228430, 1204957, 1181888, 1159939, 1139561, 1120728, 1103704, 1088971, 1076276, 1064645, 1053616, 1043665, 1035117, 1027285, 1019129, 1010340, 1001459, 993147, 985559]
61181I85559p221p146o669n243l167j044J266M363Q084J1452J3795J4831J3672
61168A022532R024R42q672j7663k4942l0060l2784l3601l3541l2991l1515k9161
61156G57568k6793k4866k3010k1225k0137j9578j8334j6015j3824j2754j2258
61145E48774j1521j0703j0055r048p413n901n010m013k264l90Q75K007L743N758
61131D94839P403Q923J0855J2925J4533J5572J5875J4524J0753N017j467p552
61119F02200j2127j4295j4372j3748j3199j2301j0972j0134j0086r690q244o778
61107D66254o330o202n317m020l210k691j897j211j182j231n59M18Q59J042J759
61092D36482K820L386L294K965K538K035J825K087K446K703L211L940M307M402
$$ y = [985559, 978338, 971192, 964523, 959280, 956113, 955069, 956335, 960698, 968782, 980234, 994029, 1008860, 1022532, 1031556, 1032498, 1023826, 1006163, 981221, 951161, 918377, 884776, 851235, 818244, 786729, 757568, 730775, 705909, 682899, 661674, 641537, 621959, 603625, 587610, 573786, 561032, 548774, 537253, 526550, 516495, 507447, 500034, 494133, 489123, 485110, 482846, 482456, 483331, 485338, 489081, 494839, 502242, 511165, 522020, 534945, 549478, 565050, 580925, 595449, 606202, 611219, 609752, 602200, 590073, 575778, 561406, 547658, 534459, 522158, 511186, 501052, 490966, 481276, 473032, 466254, 459924, 453722, 448405, 444385, 441175, 438484, 436587, 435376, 434194, 432963, 432404, 432822, 433681, 434723, 436482, 439302, 442688, 445982, 448947, 451485, 453520, 455345, 457432, 459878, 462581, 465792, 469732, 474039, 478441]
61078D78441N116O434P132O923P213Q684R906R597Q595Q157Q034P604P337P498
61064E86671P050N481M111L967M025L301K912M013N466N771N710O739Q267R007
61050F62491R644J1571J4189J5996J7281J9234K1409K2650K3566K5553K8168K9944
61038I01696L1051L2761L5013L6789L8103L9449M0328M0438M1087M3166M5229
61027A325110M6009M7162N0698N5385N8608O0237O1600O2580O3212O6186P3943
61016A970730Q4998R6964J11163J29758J50445J69080J85987K04825K27479K55919
61006C587348K96510L55354M31151N20105O25451P53363R02808J072208J274528
60997I818826J530841J850193K235365K701751L237673L704755L816324L310642
$$ y = [478441, 483557, 489991, 497123, 504046, 511259, 519943, 529849, 539446, 548041, 556198, 564232, 571836, 579173, 586671, 593721, 599202, 603313, 607280, 611305, 614606, 617518, 621531, 626997, 632768, 638478, 645217, 653484, 662491, 672135, 683706, 697895, 713891, 731172, 750406, 771815, 794465, 818031, 843584, 871752, 901696, 932747, 965508, 1000521, 1037310, 1075413, 1114862, 1155190, 1195628, 1236715, 1279881, 1325110, 1371119, 1418281, 1468979, 1524364, 1582972, 1643209, 1704809, 1767389, 1830601, 1896787, 1970730, 2055728, 2152692, 2263855, 2393613, 2544058, 2713138, 2899125, 3103950, 3331429, 3587348, 3883858, 4239212, 4670363, 5190468, 5815919, 6569282, 7472090, 8544298, 9818826, 11349667, 13199860, 15435225, 18136976, 21374649, 25079404, 28895728, 32206370]
60989C2206370K205935Q65598k33440q10588q71394n54140J3922O73632J133650
60980C4629545J050571K84525r40657k171685l031420l406790l397796l159893
60972A9856400k811260k429443k065101j740481j455601j207663r99027q28408
60964F319416o87313n69050m73312l99464l42459k97699k63669k37600k14224
60955B834626j91108j70405j53253j36977j19653j02970q8412p4761o1723n2253
60945A683111m8587m8817m9699n0233n0523m9733m7492m5128m3599m1981l9614
60934A167705l7689l7031l6365l4429l2074l0573k9519k8026k6522k5674k4861
60923H24942k3342k1794k1185k1106k0548j9457j8319j7046j5394j3715j2413
$$ y = [32206370, 34412305, 35277903, 35044463, 34233875, 33362481, 32808341, 32822263, 33495895, 34629545, 35680116, 35964641, 35023984, 32852299, 29820879, 26414089, 23016293, 19856400, 17045140, 14615697, 12550596, 10810115, 9354514, 8146851, 7147824, 6319416, 5632103, 5063053, 4589741, 4190277, 3847818, 3550119, 3286450, 3048850, 2834626, 2643518, 2473113, 2319860, 2182883, 2063230, 1960260, 1871848, 1797087, 1735364, 1683111, 1634524, 1585707, 1536008, 1485775, 1435252, 1385519, 1338027, 1292899, 1249300, 1207319, 1167705, 1130016, 1092985, 1056620, 1022191, 990117, 959544, 930025, 901999, 875477, 849803, 824942, 801600, 779806, 758621, 737515, 716967, 697510, 679191, 662145, 646751, 633036, 620623]
60912F20623j1400j0689j0598j0725r901p931o230n865o137n952n456n214m901
60899E19624m006l011k645k643k323j782j491j139o6J505K613K852K739K887L327
60884E16441L649L438K680J872J449J144L80o80j203r18n71p54j103j069q00p26
60868E23229q24p83m77J58J216K497L513M161M820N520N586M531K801J180Kp15
60852E56415q13k88L27M14j29j075k373m015n597o533o731o680o811o979o723
60837E02409n918m966m280l762l085k364k123k464k799k640k164j677j108m61
60823D62598k14o47j211j225p85l54R4P91J464J737J873K241K433J887J038P81
60807D72501J029R62N34N18R48Q81j7p71n12L69R06O53k91j527k294j909p31J4
$$ y = [620623, 609223, 598534, 587936, 577211, 567310, 559379, 553149, 547284, 541147, 535195, 529739, 524525, 519624, 515618, 512607, 509962, 507319, 504996, 503214, 501723, 500584, 500518, 502023, 504636, 507488, 510227, 513114, 516441, 520090, 523528, 526208, 528080, 529529, 530673, 531053, 530373, 529170, 528252, 527681, 526927, 525824, 524755, 523955, 523229, 522405, 521622, 521145, 521303, 522519, 525016, 528529, 532690, 537510, 543030, 548616, 553147, 555948, 557128, 557130, 556415, 555602, 555314, 555641, 556055, 555926, 554851, 552478, 548463, 542866, 536333, 529602, 522922, 516111, 509132, 502409, 496491, 491525, 487245, 483483, 480398, 478034, 475911, 473447, 470648, 468008, 465844, 464167, 463059, 462598, 462384, 461737, 460526, 459301, 458516, 458162, 458256, 459047, 460511, 462248, 464121, 466362, 468795, 470682, 471720, 472501, 473530, 474492, 475026, 475544, 476492, 477373, 477356, 476585, 476073, 476442, 477348, 478001, 477710, 476183, 473889, 471980, 471249, 471263]
60789D71263k66r41j353j740k417k878k568k045k443l892n154n009l589k221k026
60774D32721k860l591l442k747k281k180j995j520j056q43p80o74l84K08R64J338
60758D10878R71L30L08J127K132K545K109J073m3p79j207j900k999l717l307k164
60742D05357j345j260j527j797j985j915j521j229j342j420j025p17j270k298
60728C84706k805k884l506m721n490n472n535o051o109n099l766k905k103p90
60714C27470L65K85p97j483r77J43Q36P49L37K38O01J001J120J274J932K864L372
60697C39330L345L377L774M108L998L726L760M150M602M782M368L265J895R07
60683C89387M94M00N21R36J430J542J166N85M2j95L79J811L021K840J650R24J176
$$ y = [471263, 470997, 470056, 468703, 466963, 464546, 461668, 459100, 457055, 454612, 450720, 445566, 440557, 436968, 434747, 432721, 429861, 426270, 422828, 420081, 417800, 415620, 413625, 412105, 411049, 410206, 409426, 408752, 408368, 408576, 409540, 410878, 411849, 412179, 412487, 413614, 415746, 418291, 420400, 421473, 421430, 420651, 419444, 417544, 414545, 410828, 407521, 405357, 404012, 402752, 401225, 399428, 397443, 395528, 394007, 392778, 391436, 390016, 388991, 388274, 387004, 384706, 381901, 379017, 375511, 370790, 365300, 359828, 354293, 348242, 342133, 337034, 333268, 330363, 328260, 327470, 327835, 328120, 327323, 325840, 324863, 325006, 325842, 326591, 326928, 327166, 327767, 328768, 329888, 331162, 333094, 335958, 339330, 342675, 346052, 349826, 353934, 357932, 361658, 365418, 369568, 374170, 378952, 383320, 386585, 388480, 389387, 389881, 390281, 390802, 391738, 393168, 394710, 395876, 396461, 396503, 396308, 396687, 398498, 401519, 404359, 406009, 406933, 408109]
60666D08109J530J412J331J606J697J411J532K486L335L113K225J615J298O34
60652D33334m63j508k284k828l009k742k383k218j924j105M4J042J811K446K756
60637D20969K657K630L148L931M377M437M459M417L973L128K174J126j97j495
60623D59734k115j928j640j920k499k447j324J69Q55L85l71l62N17J661K728L747
60607D55190M547M820M832N270O147O616O065M854L590K337Q83p40k435m223n878
60592D91875o821o739o001n180m518m012l613l131k412j787j774k225k377j970
60578D39315j549j397j084m79l95j405k703k962j957o36J47K77J16R8N06J156
60562D27048J532J512J602K117K600K480J898J346R05L65k35p55j298j881k062
$$ y = [408109, 409639, 411051, 412382, 413988, 415685, 417096, 418628, 421114, 424449, 427562, 429787, 431402, 432700, 433334, 432871, 431363, 429079, 426251, 423242, 420500, 418117, 415899, 413975, 412870, 412914, 413956, 415767, 418213, 420969, 423626, 426256, 429404, 433335, 437712, 442149, 446608, 451025, 454998, 458126, 460300, 461426, 461229, 459734, 457619, 455691, 454051, 452131, 449632, 447185, 445861, 446030, 446885, 447270, 446899, 446537, 447054, 448715, 451443, 455190, 459737, 464557, 469389, 474659, 480806, 487422, 493487, 498341, 501931, 504268, 505151, 504411, 501976, 497753, 491875, 485054, 478315, 472314, 467134, 462616, 458604, 454991, 451860, 449448, 447661, 445887, 443662, 441285, 439315, 437766, 436369, 435285, 434806, 434411, 433006, 430303, 427341, 425384, 424748, 424895, 425172, 425288, 425386, 425892, 427048, 428580, 430092, 431694, 433811, 436411, 438891, 440789, 442135, 443040, 443405, 443170, 442415, 441117, 439236, 437174]
60547D37174j448l75M12O05N27O54J347K775M716O639Q231R599J0817J1805J2956
60532E06434J5199J8846K2881K6046K8116K9454K9744K8129K4410J9185J2919
60521G61363N697j923q584j3098j5408j6372j6843j7083j6893j6051j4669j3004
60509F17132j1026q520n702l278j642l50J237L203N346P835J0985J4608J8054
60496F47882K0929K3284K5053K5663K4327K0757J5638J0476O620M407L455L752
60484H32243N901J0035J5215K0295K4988K9592L4127L8371M2436M6727N1613N7592
60472A209135O5618P6524R0190J05724J22404J39909J57444J72876J82776J83240
60462B505840J71080J45001J06075N7300K945n1954j02244j43675j73545j90659
$$ y = [437174, 435726, 435351, 435763, 436368, 436895, 437549, 438896, 441671, 446387, 453026, 461257, 470856, 481673, 493478, 506434, 521633, 540479, 563360, 589406, 617522, 646976, 676720, 704849, 729259, 748444, 761363, 767060, 765137, 756553, 743455, 728047, 711675, 694832, 677749, 660856, 644805, 630136, 617132, 606106, 597586, 591884, 588606, 586964, 586614, 587851, 591054, 596400, 604235, 615220, 629828, 647882, 668811, 692095, 717148, 742811, 767138, 787895, 803533, 814009, 820629, 825036, 828491, 832243, 838144, 848179, 863394, 883689, 908677, 938269, 972396, 1010767, 1053203, 1099930, 1151543, 1209135, 1274753, 1351277, 1441467, 1547191, 1669595, 1809504, 1966948, 2139824, 2322600, 2505840, 2676920, 2821921, 2927996, 2985296, 2988241, 2936287, 2834043, 2690368, 2516823, 2326164]
60452B326164j95379j89988j78151j63184j46824j29900j13492r8709q5728p3954
60442I50855o3167n3830m6303m0368l5548l1457k7768k4274k1015j8079j5345
60431E73701j2779j0727r525q937q490q182q241q298p567n992m448l524k683j163
60417D73145Q18K346L051L379L704L814L514L336M096N927Q182J0242J1957J3272
60403E50783J3941J4032J4205J4996J6083J6748J6826J6543J5672J3681J0731
60392G14241P740N259L083J181J24R6K64j75q07o13N80J892K440J994Q36m68j178
60375G36489r10p2N70Q18J208K243L753N155O074O535O599N982M323J842o22k541
60359G77446m304o495q811j0411j1170j1697j2120j1809j0604r450r227r710j0136
$$ y = [2326164, 2130785, 1940797, 1762646, 1599462, 1452638, 1322738, 1209246, 1110537, 1024809, 950855, 887688, 833858, 787555, 747187, 711639, 680182, 652414, 628140, 607125, 589046, 573701, 560922, 550195, 540670, 531733, 523243, 515061, 506820, 498522, 490955, 484963, 480515, 476991, 474308, 473145, 473963, 476309, 479360, 482739, 486443, 490257, 493771, 497107, 501203, 507130, 515312, 525554, 537511, 550783, 564724, 578756, 592961, 607957, 624040, 640788, 657614, 674157, 689829, 703510, 714241, 721981, 727240, 730323, 731504, 731628, 731724, 731988, 731813, 731006, 730393, 730973, 732865, 735305, 737299, 738135, 737667, 736489, 735579, 735507, 736077, 736895, 738103, 740346, 744099, 749254, 755328, 761863, 768462, 774444, 778767, 780609, 779987, 777446, 773142, 766647, 757836, 747425, 736255, 724558, 712438, 700629, 690025, 680575, 671348, 661638, 651502]
60346F51502j0201r889r010p620o407n917n779n229m146k919j719n24L91O71M76
60331E83680K68J84J3l51r05j752k830l663l854l647l504l397l010k473k282k521
60315E49956k672k297j572j042j068j509j902j975j982k313k885l267l353l379
60301E18740l302k837k190j989k266k251j555p32l18p7L09O32Q11J268K013K227
60285E08483J564J000J410K150K087J434J250J752K415L284M789O418P088O826
60271E51950O823P642Q619R234R863J0729J1186J0626R403Q376Q045Q411R115
60258F70022R530R321R005R416J0473J1279J1465J1687J2472J3516J4500J5877
60246H08563J8156K0945K3355K5084K6659K8794L1797L5448L9172M2507M5643
$$ y = [651502, 641301, 631412, 622402, 614782, 608375, 602458, 596679, 591450, 587304, 584385, 582666, 582142, 582533, 583204, 583680, 583948, 584132, 584145, 583794, 582889, 581137, 578307, 574644, 570790, 567143, 563639, 560242, 557232, 554759, 552477, 549956, 547284, 544987, 543415, 542373, 541305, 539796, 537894, 535919, 533937, 531624, 528739, 525472, 522119, 518740, 515438, 512601, 510411, 508422, 506156, 503905, 502350, 501618, 501300, 501223, 501532, 502164, 502975, 504243, 506256, 508483, 510047, 511047, 512457, 514607, 516694, 518128, 519378, 521130, 523545, 526829, 531618, 538036, 545124, 551950, 558773, 566415, 575034, 584268, 594131, 604860, 616046, 626672, 636075, 644451, 652496, 660907, 670022, 679552, 688873, 697878, 707294, 717767, 729046, 740511, 752198, 764670, 778186, 792686, 808563, 826719, 847664, 871019, 896103, 922762, 951556, 983353, 1018801, 1057973, 1100480, 1146123]
60235A146123M9260N3786N8970O4298O9488P4437P8996Q3012Q6404Q8991R0422
60224A944187R0391Q8818Q5699Q0881P4213O5950N6946M8262M0387L2844K4829
60213B633407J6200P568n11p848j4021j8196k0093k0573k0591j9933j7680j3627
60201B504102q440k518M452J2626K1433L0204L8876M7695N6501O4688P1738P7523
60189B918880Q1977Q4709Q5197Q3447Q0095P5558O9287O0453M9208L6649K3590
60178C649050J0065l811j7493l0807m4222n7641o9702p8998q5367q9291r0686
60167C091097q9116q4808p8443p0291o0289m8784l6455k3702j0778J764J3345
60156B603540K3898L3568M2190M9410N4869N7760N6872N1850M3864L4276K3318
$$ y = [1146123, 1195383, 1249169, 1308139, 1372437, 1441925, 1516362, 1595358, 1678370, 1764774, 1853765, 1944187, 2034578, 2123396, 2209095, 2289976, 2364189, 2430139, 2487085, 2535347, 2575734, 2608578, 2633407, 2649607, 2657175, 2656664, 2648816, 2634795, 2616599, 2596506, 2575933, 2555342, 2535409, 2517729, 2504102, 2495662, 2493144, 2497596, 2510222, 2531655, 2561859, 2600735, 2648430, 2704931, 2769619, 2841357, 2918880, 3000857, 3085566, 3170763, 3254210, 3334305, 3409863, 3479150, 3539603, 3588811, 3625460, 3649050, 3659115, 3655304, 3637811, 3607004, 3562782, 3505141, 3435439, 3356441, 3271074, 3181783, 3091097, 3001981, 2917173, 2838730, 2768439, 2708150, 2659366, 2622911, 2599209, 2588431, 2590195, 2603540, 2627438, 2661006, 2703196, 2752606, 2807475, 2865235, 2922107, 2973957, 3017821, 3052097, 3075415]
60145C075415J0911j895j3587k3787l2874m0378m5025m6419m5324m2216l6703
60134B758118k8621j8727q031K842J3595K4354L5810M8523O2124P5911Q9978J04850
60122C160726J20251J35387J50307J65703J81261J95520K07596K17849K26380
60113D760980K32024K33467K30442K23248K11817J95932J75872J52291J25850
60104F541923R7230O7103L5905L939k8209n9820r0513j19967j47238j71025j90597
60093E938731k05827k16317k21259k20173k13221k00949j84442j65519j45758
60084D165266j25281j03383q0273n7148l4601j2262R731L0142M7974O3341P6346
60073C979852Q6009R1044R1087Q6636P8282O6477N1689L4386J5215m723k4095
$$ y = [3075415, 3086326, 3084431, 3070844, 3047057, 3014183, 2973805, 2928780, 2882361, 2837037, 2794821, 2758118, 2729497, 2710770, 2702739, 2705581, 2719176, 2743530, 2779340, 2827863, 2889987, 2965898, 3055876, 3160726, 3280977, 3416364, 3566671, 3732374, 3913635, 4109155, 4316751, 4534600, 4760980, 4993004, 5226471, 5456913, 5680161, 5891978, 6087910, 6263782, 6416073, 6541923, 6639153, 6706256, 6742161, 6746100, 6717891, 6658071, 6567558, 6447591, 6300353, 6129328, 5938731, 5732904, 5516587, 5295328, 5075155, 4861934, 4660985, 4476543, 4311024, 4165266, 4039985, 3936602, 3856329, 3799181, 3764580, 3752318, 3762049, 3792191, 3840165, 3903506, 3979852, 4065861, 4156905, 4247992, 4334628, 4412910, 4479387, 4531076, 4565462, 4580677, 4575954, 4551859]
60062D551859m1977n7942p1832q3926r4975j05202j13576j19054j22192j24242
60052C616941j24827j22061j15221j05780r5383q4158p1729n8569m5391l2031
60042B761791j7959l356J0945K4233L6272M7313N7930O8255P7303Q3889Q8135
60031C234751R1026R2317R0200Q3495P3072O0576M6776L1749J5629j388j9019
60020C799184l6368n2368o7001q0896r3333j02044j05839j06023j04325j00668
60010B950319r4187q5270p5196o4490n2971m0850k8520j5722k122J1706K4905
59999B527602L7651N0873O4838P9033R3192J07507J21792J35064J45850J52566
59989C515968J53975J49890J41140J28509J12180R2741P1920N1448L1510J1166
$$ y = [4551859, 4509882, 4451940, 4380108, 4296182, 4201207, 4096005, 3982429, 3863375, 3741183, 3616941, 3492114, 3370053, 3254832, 3149052, 3053669, 2969511, 2897782, 2839213, 2793822, 2761791, 2743832, 2740476, 2751421, 2775654, 2811926, 2859239, 2917169, 2985424, 3062727, 3146616, 3234751, 3325777, 3418094, 3508294, 3591789, 3664861, 3725437, 3772213, 3803962, 3819591, 3818203, 3799184, 3762816, 3710448, 3643447, 3562551, 3469218, 3367174, 3261335, 3155312, 3050987, 2950319, 2856132, 2770862, 2695666, 2631176, 2578205, 2537355, 2508835, 2493113, 2490991, 2502697, 2527602, 2565253, 2616126, 2680964, 2759997, 2853189, 2960696, 3082488, 3217552, 3363402, 3515968, 3669943, 3819833, 3960973, 4089482, 4201662, 4294403, 4366323, 4417771, 4449281, 4460447]
59979D460447j0091l1793n3158p3462r1876j07578j19931j28220j31517j29364
59969C583457j22307j11480r7987q2943o7471n2162l6953k1883p374O519K0356
59958C009772L4245M7248N8432O7802P5603Q1472Q5028Q6523Q6103Q3160P7399
59947C792787O9891O1998N3800M4579L4457K4426J5001N907k947j1071j7832k2447
59935D048549k3729k0668j3344k691J0522K6036M3709O3353Q4768J07417J30447
59924D454369J53494J76989K00908K23815K43889K60473K73585K82167K83862
59915F553551K76512K59091K31348J93427J46151R1229L1260l0082q8336j39610
59905G524541j81893k14629k37406k49807k52383k46942k35614k19996k01089
$$ y = [4460447, 4450356, 4418563, 4365405, 4291943, 4200067, 4092489, 3972558, 3844338, 3712821, 3583457, 3461150, 3349670, 3251683, 3168740, 3101269, 3049107, 3012154, 2990271, 2982897, 2989416, 3009772, 3044017, 3091265, 3149697, 3217499, 3293102, 3374574, 3459602, 3546125, 3632228, 3715388, 3792787, 3862678, 3924676, 3978476, 4023055, 4057512, 4081938, 4096939, 4102846, 4099899, 4088828, 4070996, 4048549, 4024820, 4004152, 3990808, 3988117, 3998639, 4024675, 4068384, 4131737, 4216505, 4323922, 4454369, 4607863, 4784852, 4985760, 5209575, 5453464, 5713937, 5987522, 6269689, 6553551, 6830063, 7089154, 7320502, 7513929, 7660080, 7751309, 7782569, 7752487, 7664151, 7524541, 7342648, 7128019, 6890613, 6640806, 6388423, 6141481, 5905867, 5685871, 5484782]
59896E484782j79583j56103j31380j06107q0543n4643k8761l678K0407M4159O7763
59885D876313Q9884J08623J23030J33003J38384J39204J36450J31375J23924J12611
59875F112801R5986P3657M6082J4175k0706n6918r2791j26489j55959j79526j96454
59864E513858k06622k09937k06544j97319j83669j67032j48836j30381j12215
59855C951303r3983p5489n7493m1052k6626j4426m987J508O013R804J3052J4832
59843C682456J4141J0132J876j0938k6924m3295n7291o6989p1343p0408o5495
59832C295922n8536n1265m5294m2160m2283m4086m5161m4248m1445l6840l0022
59821B814582k1053j1149k048M959R512J2081J3262J2912J0291N454j84n148r128
$$ y = [5484782, 5305199, 5149096, 5017716, 4911609, 4831066, 4776423, 4747662, 4743984, 4764391, 4808550, 4876313, 4966197, 5074820, 5197850, 5330853, 5469237, 5608441, 5744891, 5876266, 6000190, 6112801, 6208787, 6282444, 6328526, 6342701, 6321995, 6265077, 6172286, 6045797, 5889838, 5710312, 5513858, 5307236, 5097299, 4890755, 4693436, 4509767, 4342735, 4193899, 4063518, 3951303, 3857320, 3781831, 3724338, 3683286, 3656660, 3642234, 3637247, 3638755, 3644768, 3654572, 3667624, 3682456, 3696597, 3706729, 3708605, 3697667, 3670743, 3627448, 3570157, 3503168, 3431825, 3361417, 3295922, 3237386, 3186121, 3140827, 3098667, 3056384, 3012298, 2967137, 2922889, 2881444, 2844604, 2814582, 2793529, 2782380, 2780332, 2785291, 2794803, 2806884, 2820146, 2833058, 2843349, 2848803, 2848619, 2843471, 2834343]
59808B834343j2250j3850j2951r526m239K693J1520K2059L3752M6473O0528P6146
59796C034698R3671J13961J37664J64367J93046K22787K52053K77433K93941K96125
59786E079746K78556K36942J71303Q8529M91q0938j47140j93084k17493k23424
59776D993488k16799k02972j84879j64271j43129j23233j05221q8862p3731n9437
59766C630954m5761l2916k1203j0502n75Q327J5977K2944K9949L6638M2073M6326
59754C722231N0464N5019N9746O4902P1446P9652Q8814R8705J10177J23878J39433
59743D664467J56405J75031J95446K17108K39535K62773K86569L09837L31390
59734F838561L50297L64909L72467L70584L58747L37944L09551K75532K39240
$$ y = [2834343, 2822093, 2808243, 2795292, 2785766, 2781527, 2784220, 2795740, 2817799, 2851551, 2898024, 2958552, 3034698, 3128369, 3242330, 3379994, 3544361, 3737407, 3960194, 4212247, 4489680, 4783621, 5079746, 5358302, 5595244, 5766547, 5855076, 5855567, 5774629, 5627489, 5434405, 5216912, 4993488, 4776689, 4573717, 4388838, 4224567, 4081438, 3958205, 3852984, 3764122, 3690391, 3630954, 3585193, 3552277, 3531074, 3520572, 3519997, 3528324, 3544301, 3567245, 3597194, 3633832, 3675905, 3722231, 3772695, 3827714, 3887460, 3952362, 4023808, 4103460, 4192274, 4290979, 4401156, 4525034, 4664467, 4820872, 4995903, 5191349, 5408457, 5647992, 5910765, 6197334, 6507171, 6838561, 7188858, 7553767, 7926234, 8296818, 8655565, 8993509, 9303060, 9578592, 9817832]
59725I817832K05048J76932J57502J48051J48908J59568J78612K03708K32039
59716A1428200K61039K88587L12294L29326L37591L36787L27471L09523K82629
59707A4213447K48022K08447J66243J22593P8967L8062K676k5503m5519n6486
59697A4950949n7972n0376l4189r268K4577O6663J15521J69587K27486K87908
59687A5690886L49529M10768M69468N23038N68882O04245O25576O28595O09251
59678B0480238N64635M93446L96552K77459J41930k752j47984k84213m02761m98083
59668B1018467n68072o12570o32801o32517o18778o00867n88275n88602o05030
59659A5570955o34283o67484o94300p07327p03935o85619o56416o21020n83115
$$ y = [9817832, 10022880, 10199812, 10357314, 10505365, 10654273, 10813841, 10992453, 11196161, 11428200, 11689239, 11977826, 12290120, 12619446, 12957037, 13293824, 13621295, 13930818, 14213447, 14461469, 14669916, 14836159, 14958752, 15037719, 15075781, 15078457, 15052954, 15007435, 14950949, 14892977, 14842601, 14808412, 14799144, 14823721, 14890384, 15005905, 15175492, 15402978, 15690886, 16040415, 16451183, 16920651, 17443689, 18012571, 18616816, 19242392, 19870987, 20480238, 21044873, 21538319, 21934871, 22212330, 22354260, 22351508, 22203524, 21919311, 21516550, 21018467, 20450395, 19837825, 19205024, 18572507, 17953729, 17352862, 16764587, 16175985, 15570955, 14936672, 14269188, 13574888, 12867561, 12163626, 11478007, 10821591, 10200571, 9617456]
59650I617456n44845n07385m71514m37649m05897l76252l48484l22072k96722
59641E906636k72793k50592k29537k08748j88240j68683j50119j31939j14196
59632D191789r7901q3733p1332o0093m9966m1223l4138k8956k5541k2982k0319
59621C655605j7797j6640j7466j9832k3344k8179l4210m0490m6185n1203n5609
59610C304650n9042o1141o1950o1522n9547n5774n0466m4381l8431l3197k8415
59599B750784k3241j7493j2096p659l311K054Q000J3243J7571K1546K4707K5814
59587B799919K4876K3241K1440J8664J4688J0796Q184O900O869Q515J1781J5833
59575B971706K0378K6016L2798L9828M6843N4697O3610P2463Q0758Q9755J00501
$$ y = [9617456, 9072611, 8565226, 8093712, 7656063, 7250166, 6873914, 6525430, 6203358, 5906636, 5633843, 5383251, 5153714, 4944966, 4756726, 4588043, 4437924, 4305985, 4191789, 4093888, 4010155, 3938823, 3878730, 3828764, 3787541, 3753403, 3724447, 3698906, 3675924, 3655605, 3637808, 3621168, 3603702, 3583870, 3560526, 3532347, 3498137, 3457647, 3411462, 3360259, 3304650, 3245608, 3184467, 3122517, 3060995, 3001448, 2945674, 2895208, 2850827, 2812396, 2779199, 2750784, 2727543, 2710050, 2697954, 2690295, 2686984, 2689038, 2697038, 2710281, 2727852, 2749398, 2774105, 2799919, 2824795, 2848036, 2869476, 2888140, 2902828, 2913624, 2921808, 2928708, 2935577, 2944092, 2955873, 2971706, 2992084, 3018100, 3050898, 3090726, 3137569, 3192266, 3255876, 3328339, 3409097, 3498852, 3599353]
59564C599353J12029J22689J32135J40848J48762J55582J61521J66422J69004
59555D908345J68231J64729J59549J52395J42474J30457J17768J03874Q5820O1120
59545F194762L0578j922l1976n7091p7215r3416j06213j15317j20552j22189j20358
59534E379091j14829j05502r2418p5305n4040k9643l716K3341N2305Q3073J13920
59523E176277J43222J70469J94872K14324K26646K30702K25376K08822J80110
59514F970820J40805R3823M1464j4445p1350j26129j76068k18768k51799k73541
59504F114812k84043k84427k76016k60624k40767k18600j95089j70862j46999
59495D037385j24221j02110q0159n8986l9608k2074n573J0649K7133M4231O1546
$$ y = [3599353, 3711382, 3834071, 3966206, 4107054, 4255816, 4411398, 4572919, 4739341, 4908345, 5076576, 5241305, 5400854, 5553249, 5695723, 5826180, 5943948, 6047822, 6133642, 6194762, 6225340, 6223418, 6191442, 6134351, 6057136, 5963720, 5857507, 5742190, 5621638, 5499449, 5379091, 5264262, 5158760, 5066342, 4991037, 4936997, 4907354, 4903638, 4926979, 4979284, 5062357, 5176277, 5319499, 5489968, 5684840, 5899164, 6125810, 6356512, 6581888, 6790710, 6970820, 7111625, 7205448, 7246912, 7232467, 7161117, 7034988, 6858920, 6640152, 6388353, 6114812, 5830769, 5546342, 5270326, 5009702, 4768935, 4550335, 4355246, 4184384, 4037385, 3913164, 3811054, 3730895, 3671909, 3632301, 3610227, 3604654, 3615303, 3642436, 3686667, 3748213]
59484C748213P8084R3485J08270J22291J34013J42069J46299J46398J40913J28846
59474D988881J11149Q9299O3459L3493Q50l2162o4250r4798j22380j45292j63143
59463D665106j76503j85387j89462j89310j86098j80288j71981j62101j51888
59454C072088j41597j30872j20103j10082j00754r1588q2788p4823o7311n9615
59444B092555n2128m5511l9217l2361k5523j9987j5550j0926o024j922J355M981
59432A849742R101J2538J5078J8031K1966K5844K9271L3350L7911L9613L5057
59421B127502K5203J5080R270Q766J1809J6372K1505K7412L4873M4064N3234N8706
59409B453796N7226M9057L8548L0933K8276K9046L1296L5019M0995M8796N7257
$$ y = [3748213, 3826297, 3919782, 4028052, 4150343, 4284356, 4426425, 4572724, 4719122, 4860035, 4988881, 5100030, 5189329, 5252788, 5286281, 5287131, 5254969, 5190719, 5095921, 4973541, 4828249, 4665106, 4488603, 4303216, 4113754, 3924444, 3738346, 3558058, 3386077, 3223976, 3072088, 2930491, 2799619, 2679516, 2569434, 2468680, 2377092, 2294304, 2219481, 2152170, 2092555, 2040427, 1994916, 1955699, 1923338, 1897815, 1877828, 1862278, 1851352, 1845328, 1843406, 1844761, 1849742, 1858843, 1871381, 1886459, 1904490, 1926456, 1952300, 1981571, 2014921, 2052832, 2092445, 2127502, 2152705, 2167785, 2177055, 2185821, 2197630, 2214002, 2235507, 2262919, 2297792, 2341856, 2395090, 2453796, 2511022, 2560079, 2598627, 2629560, 2657836, 2686882, 2718178, 2753197, 2794192, 2842988, 2900245]
59398B900245O6118P5855Q6371R7093J08127J20065J32762J45483J58171J71463
59388D061753J85424J99403K13388K28394K45269K63939K84253L06695L31714
59379F320232L58730L85923M10644M29939M41297M43274M35460M18278L93177
59370A0036954L62718L29706K96333K64253K34911K08985J85796J63826J41422
59361A2224904J16513Q6338M8593K616n1155j12336j80073k51613l22359l87300
59351A1174128m41867m82247n06414n15002n10308m94467m69338m37617m02668
59342F914200l67055l32148k99005k68665k41506k17366j96251j78115j62131
59333D651958j47235j33526j22055j13196j06134j00089r5083r1281q8486q6460
$$ y = [2900245, 2966363, 3042218, 3128589, 3225682, 3333809, 3453874, 3586636, 3732119, 3890290, 4061753, 4247177, 4446580, 4659968, 4888362, 5133631, 5397570, 5681823, 5988518, 6320232, 6678962, 7064885, 7475529, 7905468, 8346765, 8790039, 9225499, 9643777, 10036954, 10399672, 10729378, 11025711, 11289964, 11524875, 11733860, 11919656, 12083482, 12224904, 12341417, 12427755, 12476348, 12478964, 12427809, 12315473, 12135400, 11883787, 11561428, 11174128, 10732261, 10250014, 9743600, 9228598, 8718290, 8223823, 7754485, 7316868, 6914200, 6547145, 6214997, 5915992, 5647327, 5405821, 5188455, 4992204, 4814089, 4651958, 4504723, 4371197, 4249142, 4135946, 4029812, 3929723, 3834640, 3743359, 3654873, 3568413]
59323C568413q5070q3974q2754q1377p9896p7865p4756p0771o6497o1952n6831
59312B746670n1355m5967m0414l4207k7741k1776j5922q965q15P093J3721J9601
59300B539923K5795L2668M0086M7887N5741O3406P1426Q0646R0340R7500R8806
59289C244224R3421Q3771P3796O6283O1270N6677N0397M1606L0184J5879j138
59278C816370j9529l7577n4378o9498q1962r0752r6061r8951r9831r8254r4203
59267B975374q8606q2501p6436p0617o4943n9020n2782m6820m1459l5918k9375
59256B326897k2296j5784r964m168J720P256J2440J7564K2304K6210K9777L3823
59244B425779L8173M2296M6867N3177O1198O9773P8644Q8643R9882J11518J23479
$$ y = [3568413, 3483343, 3399369, 3316615, 3235238, 3155342, 3077477, 3002721, 2931950, 2865453, 2803501, 2746670, 2695315, 2649348, 2608934, 2574727, 2546986, 2525210, 2509288, 2500323, 2499508, 2506601, 2520322, 2539923, 2565718, 2598386, 2638472, 2686359, 2742100, 2805506, 2876932, 2957578, 3047918, 3145418, 3244224, 3337645, 3421416, 3495212, 3561495, 3622765, 3679442, 3729839, 3771445, 3801629, 3817508, 3816370, 3796841, 3759264, 3704886, 3635388, 3553426, 3462674, 3366613, 3267662, 3167831, 3069577, 2975374, 2886768, 2804267, 2727831, 2657214, 2592271, 2533251, 2480469, 2433649, 2392190, 2356272, 2326897, 2304601, 2288817, 2278853, 2274685, 2276405, 2283661, 2296101, 2313665, 2335969, 2362179, 2391956, 2425779, 2463952, 2506248, 2553115, 2606292, 2667490, 2737263, 2815907, 2904550, 3004432, 3115950, 3239429]
59233C239429J36872J52266J69095J87054K06600K27524K48441K68118K86116
59224E121515L01716L13474L20364L21978L17077L03151K78203K42146J96103
59215G715727J41375P9569J2918n6007j24238j88052k43690k88626l21476l41130
59205F386370l47325l41958l28324l08892k85048k58788k32762k08384j85504
59196C889385j64279j45705j29884j15541j01877q9337p8045o7146n6397m6719
59186B894455l8364l0214k1765j4178q392l866k63J209m46m325q994j4376k0833
59173B729648k7530l3302l8215m2834m6635m8568m8630m7616m5794m2931l9229
59162B268364l5074l0376k5121k0174j6456j3644j0733p649n356m427m252l676
$$ y = [3239429, 3376301, 3528567, 3697662, 3884716, 4091316, 4318840, 4567281, 4835399, 5121515, 5423231, 5736705, 6057069, 6379047, 6696124, 6999275, 7277478, 7519624, 7715727, 7857102, 7936671, 7949589, 7893582, 7769344, 7581292, 7337602, 7048976, 6727500, 6386370, 6039045, 5697087, 5368763, 5059871, 4774823, 4516035, 4283273, 4074889, 3889385, 3725106, 3579401, 3449517, 3333976, 3232099, 3142762, 3064717, 2997571, 2941174, 2894455, 2856091, 2825877, 2804112, 2789934, 2781542, 2777676, 2777413, 2778622, 2778176, 2773851, 2764857, 2750481, 2729648, 2702118, 2668816, 2630601, 2587767, 2541132, 2492564, 2443934, 2396318, 2350524, 2307593, 2268364, 2233290, 2202914, 2177793, 2157619, 2141163, 2127519, 2116786, 2109137, 2103781, 2099354, 2095102, 2091426]
59150B091426j848J432N738J0369J4833J8894K2225K4443K5504K5555K4503K2431
59138B285505K0256J9015J8489J7527J5769J3860J1913R058M950L14m422r716
59126B402518j5461k0266k2916k3489k2358j9347j4717r775n523j569K617O349
59114B256063Q552R234R297R617J0968J3944J8106K2008K4884K7590L1214L5634
59102B477111M0138M4501M8655N2195N5155N8384O2392O6544P0176P3496P6525
59091C125272P8152P7292P4071O8805O0636M8399L2313J3693o327k6764m5975
59080C499567o2133p4364q2705q7369q8794q7878q5351q1311p6075p0928o7196
59069B635463o4950o3223o1070n7776n2705m5771l7664k8937j9290q279L874J6648
$$ y = [2091426, 2089578, 2091010, 2096748, 2107117, 2121950, 2140844, 2163069, 2187512, 2213016, 2238571, 2263074, 2285505, 2305761, 2324776, 2343265, 2360792, 2376561, 2390421, 2402334, 2411392, 2416342, 2416656, 2412234, 2402518, 2387057, 2366791, 2343875, 2320386, 2298028, 2278681, 2263964, 2254189, 2248666, 2247097, 2249714, 2256063, 2264615, 2273849, 2283146, 2292763, 2303731, 2317675, 2335781, 2357789, 2382673, 2410263, 2441477, 2477111, 2517249, 2561750, 2610405, 2662600, 2717755, 2776139, 2838531, 2905075, 2975251, 3048747, 3125272, 3203424, 3280716, 3354787, 3423592, 3484228, 3532627, 3564940, 3578633, 3572306, 3545542, 3499567, 3437434, 3363070, 3280365, 3192996, 3104202, 3016324, 2930973, 2849662, 2773587, 2702659, 2635463, 2570513, 2507290, 2446220, 2388444, 2335739, 2289968, 2252304, 2223367, 2204077, 2195798, 2199672, 2216320]
59057B216320K9785M2675N3593O0065N9623N0228L1256N096k3007m7763o6433
59046B411438p8619q4667q5191q1345p4374o4998n3749m1593k9673j8805r629
59035A788795k820J050J471k056r133j7557k4491k8816l1272l2157l0532k6272
59023A586210k1224j7200j4006j0484o419k376J428M999Q045J0424J2449J4086
59011A565932J4756J4526J4468J5101J5671J5729J6158J7619J9122J9272J7985
59000A746339J5957J3390J0318P319M911L031J944K591N118Q034R915J0925J1797
58987A851589J2321J1959J0862R175O301J937l010p424j0831j2464j0926o074
58975A853415J04N861J1673J8482K5250L0008L2339L3000L1969K8597K3247J7165
$$ y = [2216320, 2246105, 2288780, 2342373, 2402438, 2462061, 2512289, 2543545, 2548641, 2525634, 2477871, 2411438, 2332819, 2248152, 2162961, 2081616, 2007242, 1942244, 1888495, 1846902, 1817229, 1798424, 1788795, 1785975, 1787025, 1788496, 1786440, 1777307, 1759750, 1735259, 1706443, 1675171, 1643014, 1612482, 1586210, 1564986, 1547786, 1533780, 1523296, 1516877, 1514501, 1515929, 1520928, 1528973, 1539397, 1551846, 1565932, 1580688, 1595214, 1609682, 1624783, 1640454, 1656183, 1672341, 1689960, 1709082, 1728354, 1746339, 1762296, 1775686, 1786004, 1793323, 1798234, 1801265, 1803209, 1805800, 1810918, 1818952, 1828867, 1839792, 1851589, 1863910, 1875869, 1886731, 1895906, 1902207, 1904144, 1901134, 1893710, 1882879, 1870415, 1859489, 1853415, 1853519, 1859380, 1871053, 1889535, 1914785, 1944793, 1977132, 2010132, 2042101, 2070698, 2093945, 2111110]
58963B111110J1130N484R14k061l886n178n678n031l702k142M9K904N066N174
58949B114153L461Q50k313n424o782n207j476L229R067J6219K3134K8108L1538
58936B208557L4613L6751L6475L4142L1764L0571L0631L2320L6171M1584M7431
58925B601010N3563O0365O7532P4796Q3002R2653J02380J10915J19719J31309
58915C497244J45683J60743J75715J91584K08451K25122K41442K58479K75963
58906E380426K91834L05007L16668L28255L39795L50856L61538L71803L80903
58897H427085L87815L91272L89328L79944L61844L33852K93966K40865J76348
58888A1382319J04896L0964m2152j11497j74614k30761k80511l23922l60244l89054
$$ y = [2111110, 2122240, 2127724, 2128638, 2126577, 2122691, 2117513, 2111835, 2106804, 2103102, 2100960, 2101009, 2103913, 2108979, 2114153, 2117614, 2118464, 2116151, 2110727, 2103945, 2098738, 2097262, 2100491, 2109558, 2125777, 2148911, 2177019, 2208557, 2243170, 2279921, 2316396, 2350538, 2382302, 2412873, 2443504, 2475824, 2511995, 2553579, 2601010, 2654573, 2714938, 2782470, 2857266, 2940268, 3032921, 3135301, 3246216, 3365935, 3497244, 3642927, 3803670, 3979385, 4170969, 4379420, 4604542, 4845984, 5104463, 5380426, 5672260, 5977267, 6293935, 6622190, 6961985, 7312841, 7674379, 8046182, 8427085, 8814900, 9206172, 9595500, 9975444, 10337288, 10671140, 10965106, 11205971, 11382319, 11487215, 11518179, 11476027, 11364530, 11189916, 10959155, 10678644, 10354722, 9994478, 9605424]
58878I605424m10310m23521m28445m26388m19421m08468l93583l75589l55799
58869E963900l34463l11307k87372k64593k43619k23732k04745j87271j71229
58860C735569j55845j41146j27862j15957j04751r4351q5300p7139o8870o0682
58850B703666n3445m6898m0125l3497k8152k3791j8999j3619q770m677o24L071
58838B434140N372O917R887J5054K1089K6994L3123L9511M5364N0800N7076O4490
58826B809817P1856P8495Q4897R1031R5983R9834J04132J09957J17214J26148
58816C789364J37558J51047J65052J79344J95529K14447K34878K55604K76822
58807E599645K98592L19759L39405L57842L74995L89179L98426M01836L98690
$$ y = [9605424, 9195114, 8771593, 8343148, 7916760, 7497339, 7088871, 6695288, 6319699, 5963900, 5629437, 5318130, 5030758, 4766165, 4522546, 4298814, 4094069, 3906798, 3735569, 3579724, 3438578, 3310716, 3194759, 3090008, 2995657, 2910357, 2833218, 2764348, 2703666, 2650221, 2603323, 2563198, 2529701, 2501549, 2477758, 2458759, 2445140, 2436370, 2431693, 2431069, 2434140, 2439512, 2446429, 2456316, 2471370, 2492459, 2519453, 2552576, 2592087, 2637451, 2688251, 2745327, 2809817, 2881673, 2960168, 3045065, 3136096, 3232079, 3331913, 3436045, 3546002, 3663216, 3789364, 3926922, 4077969, 4243021, 4422365, 4617894, 4832341, 5067219, 5322823, 5599645, 5898237, 6217996, 6557401, 6915243, 7290238, 7679417, 8077843, 8479679, 8878369]
58798H878369L87386L66154L34071K90954K37295J74835J06308L4346l8460j08668
58788A0662590j72551k27813k73582l08942l32960l46148l50222l46520l36684
58779G967168l25045l17958l19247l27204l36265l40717l37057l24961l06936
58770E031778k86019k63545k39773k16026j94227j74671j56215j38617j22616
58761C240069j07734r2274p5833n9739m4576k9380j3607K227J8426L6364N6130
58750B930073P5804R3581J08581J18802J20411J10214Q7722N4680J4599k6874
58740C687593o3427r1334j10323j21361j25429j24443j20802j15316j07511r8395
58730B609252r0633q5374q1281p7433p4868p4337p4792p5129p5404p5381p3958
$$ y = [8878369, 9265755, 9631909, 9965980, 10256934, 10494229, 10669064, 10775372, 10809718, 10771258, 10662590, 10490039, 10262226, 9988644, 9679702, 9346742, 9000594, 8650372, 8303852, 7967168, 7642123, 7324165, 7004918, 6677714, 6341449, 6000732, 5663675, 5338714, 5031778, 4745759, 4482214, 4242441, 4026415, 3832188, 3657517, 3501302, 3362685, 3240069, 3132335, 3040061, 2964228, 2904489, 2859913, 2830533, 2816926, 2819153, 2837579, 2873943, 2930073, 3005877, 3099458, 3208039, 3326841, 3447252, 3557466, 3645188, 3699868, 3714467, 3687593, 3624166, 3532832, 3422509, 3301148, 3175719, 3051276, 2930474, 2815158, 2707647, 2609252, 2518619, 2433245, 2351964, 2274531, 2199663, 2125326, 2050534, 1975405, 1900001, 1824620, 1750662]
58719A750662p0968o7564o3935n8721n1566m4114l7507l1035k4246j8331j4258
58708A268417j1650j0402j1352j4219j7001j8514j9533k0446k0015j7557j4212
58697A093516j0833o849k314J260L457O028R836J2929J3301J1643R870Q840Q977
58684A159661J1134J5287K0160K5414L2208M0422M7659N2633N7131O2810O8304
58673A592823P1546P2933P4020P4918P5052P4517P2150O3691M4623J4663k1732
58662B209204n8244q9000j09922j20105j21586j16879j07656r5953q4403p4080
58652A231376o3984n3767m4910l8119l1911k5279j9503j5631j2410q533m846k491
58640I09992r15N23J079O33R76L066N118N548N660P152R113J0018J0722J2847
$$ y = [1750662, 1679694, 1612130, 1548195, 1489474, 1437908, 1393794, 1356287, 1325252, 1301006, 1282675, 1268417, 1256767, 1246365, 1235013, 1220794, 1203793, 1185279, 1165746, 1145300, 1125285, 1107728, 1093516, 1082683, 1075834, 1073520, 1074780, 1078237, 1084265, 1094101, 1107030, 1120331, 1131974, 1141844, 1150684, 1159661, 1170795, 1186082, 1206242, 1231656, 1263864, 1304286, 1351945, 1404578, 1461709, 1524519, 1592823, 1664369, 1737302, 1811322, 1886240, 1961292, 2035809, 2107959, 2171650, 2216273, 2230936, 2209204, 2150960, 2061960, 1952038, 1831933, 1710347, 1593468, 1485812, 1389859, 1305456, 1231376, 1167392, 1113625, 1068715, 1030596, 998685, 973406, 953903, 938272, 925862, 917329, 912483, 909992, 909077, 909600, 910679, 911312, 912288, 915354, 920472, 926020, 931680, 938832, 947945, 957963, 968685, 981532]
58626I81532J5854J8283K0451K3399K6628K9262L2073L6058M0396M4098M8139
58615A316173N3697N9791O5088P0485P7399Q5045R2024R9094J07571J16183J22434
58604B264984J26061J28322J28694J25086J16752J04481Q8421O8258M5173K1433
58594C217665j641k3456m2517n6963o6229p0610o9946o4414n5612m5091l2709
58583B688477j8087k484J2563K7385M3054N9306P5339R1453J08006J24084J38995
58572C348091J53581J67762J77921J78737J66390J38441R2913L0930m0496j10905
58562D303365j71389k16317k42577k50457k44357k29731k09664j86130j62952
58553B389791j44443j31687j22683j15618j09785j04067r7100q8843q0170p1380
$$ y = [981532, 997386, 1015669, 1036120, 1059519, 1086147, 1115409, 1147482, 1183540, 1223936, 1268034, 1316173, 1369870, 1429661, 1494749, 1565234, 1642633, 1727678, 1819702, 1918796, 2026367, 2142550, 2264984, 2391045, 2519367, 2648061, 2773147, 2889899, 2994380, 3082801, 3151059, 3196232, 3217665, 3216024, 3192568, 3150051, 3093088, 3026859, 2956249, 2886303, 2821889, 2766277, 2721186, 2688477, 2670390, 2667906, 2680469, 2707854, 2750908, 2810214, 2885553, 2977006, 3085012, 3209096, 3348091, 3501672, 3669434, 3847355, 4026092, 4192482, 4330923, 4423836, 4454766, 4414270, 4303365, 4131976, 3915659, 3673082, 3422625, 3178268, 2948537, 2738873, 2552743, 2389791, 2245348, 2113661, 1990978, 1875360, 1765575, 1661508, 1564408, 1475565, 1395395, 1324015]
58543A324015o2558n4603m8235m2844l7798l3708l0920k8283k5012k2174k0588
58532I17292j9048j6513j4154j3080j2087r923p775o949o162l842j156K12J365
58519H08180M156P620R755J1318J4385J8489K1558K3681K6632L0554L4191L7561
58507A048080M1501M5519M8969N3256O0071O8590P7205Q6627R8171J10332J20233
58496A858554J27095J31008J29671J20079J02730Q1004N7309L2745R022j2996
58486B636221l5511o0926q7416j10504j27749j38768j42340j37792j28114j17690
58476A549411j07486r6083q4287p4593o6919n9152n1311m5154m0214l4410k8160
58465H61642k3808k1247j8187j4535j2437j2104j1533j0331j0028j0589j0454
$$ y = [1324015, 1261457, 1206854, 1158619, 1115775, 1077977, 1044269, 1013349, 985066, 960054, 937880, 917292, 898244, 881731, 867577, 854497, 842410, 832487, 824712, 817763, 811601, 807759, 806603, 806815, 808180, 812336, 819956, 829711, 841029, 855414, 873903, 895461, 919142, 945774, 976328, 1010519, 1048080, 1089581, 1135100, 1184069, 1237325, 1297396, 1365986, 1443191, 1529818, 1627989, 1738321, 1858554, 1985649, 2116657, 2246328, 2366407, 2469137, 2550141, 2607450, 2640195, 2649217, 2636221, 2600710, 2539784, 2452368, 2341864, 2214115, 2075347, 1933007, 1795215, 1667101, 1549411, 1441925, 1345842, 1261555, 1186962, 1120043, 1060891, 1009580, 964426, 924212, 889802, 861642, 837834, 816587, 798400, 783865, 771428, 759324, 747791, 737460, 727432, 716843, 706389]
58454G06389r861j0380j1366j0620q456p283p237o148l713j864j012K09J518J155
58440F31331m96j183p22r50j888j776p81q63j964k095j155q42j057j58J380J593
58424F18374J032K046M396N585N381N763O633O027M408M264N358M951K784J392
58410F78394J316N64r07q51P57J377N23L40J246J385P37J254K629K421P03J25
58394F92013J048J235N27J179L208M132L607L629M035K700L15j65R76N34j579
58379G17394k087m07O58O90K306N343O311M644L745M715M809L269K836M187M656
58364G63069L791M435O923Q033P120P356R434J0069Q378P624Q918R191P368O393
58350H68102P232O977M919M349O181O972N545N303P583Q991P911P427R163J0380
$$ y = [706389, 696528, 686148, 674782, 664162, 655706, 648423, 641186, 635038, 631325, 629461, 628449, 628658, 630176, 631331, 630835, 629652, 628930, 627980, 626092, 624316, 623535, 622672, 620708, 618613, 617458, 616616, 615559, 615401, 616781, 618374, 619406, 621452, 625848, 631433, 636814, 642577, 649210, 655237, 659645, 663909, 669267, 674218, 677002, 678394, 679710, 680274, 679367, 678516, 679273, 680650, 681173, 681513, 682759, 684144, 684881, 686135, 688764, 691185, 691888, 692013, 693061, 694296, 694823, 696002, 699210, 703342, 706949, 710578, 714613, 717313, 717628, 717463, 718439, 718973, 717394, 715307, 714900, 715558, 716248, 718554, 723897, 730208, 734852, 738597, 743312, 748121, 751390, 754226, 758413, 763069, 766860, 771295, 778218, 786251, 793371, 800727, 810161, 820230, 828608, 836232, 845150, 854341, 861709, 868102, 875334, 882311, 887230, 891579, 897760, 904732, 910277, 915580, 923163, 932154, 940065, 947492, 956655, 967035]
58336I67035R896J0642J3574J5219J4143J3725J5673J6975J6248J6772K0043K2503
58324A152448K1888K0820K0951J9750J6277J3985J4493J4611J2748J1988J3683
58313A333642J4428J2683J2043J4490J6802J6995J7947K1248K4017K5030K7374
58302A536699L1819L4494L4379L5900M0763M4738M6077M9312N6795O4458P0158
58291B045592P8159R0873J04186J15671J29424J47978J67346J84869K03557K23487
58281C491142K37274K39398K31783K15050J83416J34533P6128J6962m0447r2817
58271D692422j31498j51974j59598j59720j50685j32449j12324r5116p6871n5148
58261C467039l5841k2800j0727M152J6519K2724K8633L8670M7548N1298N5688
$$ y = [967035, 976931, 987573, 1001147, 1016366, 1030509, 1044234, 1059907, 1076882, 1093130, 1109902, 1129945, 1152448, 1174336, 1195156, 1216107, 1235857, 1252134, 1266119, 1280612, 1295223, 1307971, 1319959, 1333642, 1348070, 1360753, 1372796, 1387286, 1404088, 1421083, 1439030, 1460278, 1484295, 1509325, 1536699, 1568518, 1603012, 1637391, 1673291, 1714054, 1758792, 1804869, 1854181, 1910976, 1975434, 2045592, 2123751, 2214624, 2318810, 2434481, 2563905, 2711883, 2879229, 3064098, 3267655, 3491142, 3728416, 3967814, 4199597, 4414647, 4598063, 4732596, 4808724, 4825686, 4785239, 4692422, 4560924, 4408950, 4249352, 4089632, 3938947, 3806498, 3694174, 3599058, 3522187, 3467039, 3431198, 3408398, 3397671, 3401823, 3418342, 3441066, 3469699, 3508369, 3555917, 3607215, 3662903]
58250C662903O4912P2909P5152P7944Q6516R5130R8787J03203J13106J22444J26570
58239D699576J32030J43642J54423J59423J66232J80297J93752K00972K10657
58230F241004K29346K48253K60349K74837K99668L25970L45777L68457M02532
58221H996193M38518M67852N01090N48236N99655O46650P01369P74865Q56133
58212A4530561R36011J029699J150753J286601J427387J593871J807288K059073
58204B5821244K343582K691398L134284L670219M303870N084698O058242P221231
58196F0328768Q578406J0195837J2137410J4413059J7073471K0282073K4183855
58189A67192879K8779933L4008260L9629835M4501349M5968045M0808586K7717554
$$ y = [3662903, 3727815, 3800724, 3875876, 3953820, 4040336, 4135466, 4234253, 4337456, 4450562, 4573006, 4699576, 4831606, 4975248, 5129671, 5289094, 5455326, 5635623, 5829375, 6030347, 6241004, 6470350, 6718603, 6978952, 7253789, 7553457, 7879427, 8225204, 8593661, 8996193, 9434711, 9902563, 10403653, 10951889, 11551544, 12198194, 12899563, 13674428, 14530561, 15466572, 16496271, 17647024, 18933625, 20361012, 21954883, 23762171, 25821244, 28164826, 30856224, 33990508, 37660727, 41964597, 47049295, 53107537, 60328768, 68907174, 79103011, 91240421, 105653480, 122726951, 143009024, 167192879, 195972812, 229981072, 269610907, 314112256, 360080301, 400888887, 428606441]
58182D28606441R091366r983548k4818911l3440623l6436363l5379666l1790435
58175B65848261k7123836k2858784k0060526j8864964j8555725j8203647j7276032
58168A22904747j5777747j3993061j2181779j0472908q921515p564247o410105
58161D7583385n432877m604559l916945l358559k897192k503528k171289j898211
58153B0800225j667603j465398j296278j165105j058601r61850q77427q11626
58145A1496337p55943o98652o42093n92911n46710m97254m49991m12020l78499
58136F522264l42289l07449k80294k56460k29587k04183j87774j78483j71429
58127D364316j68798j72259j74002j66891j55870j48413j41579j29515j15804
$$ y = [428606441, 437697807, 427714259, 402895348, 369454725, 333018362, 297638696, 265848261, 238724425, 215865641, 195805115, 176940151, 158384426, 140180779, 122904747, 107127000, 93133939, 80952160, 70479252, 61557737, 53993490, 47583385, 42150508, 37545949, 33629004, 30270445, 27373253, 24869725, 22698436, 20800225, 19132622, 17667224, 16370946, 15205841, 14147240, 13185390, 12307963, 11496337, 10740394, 10041742, 9399649, 8806738, 8260028, 7762774, 7312783, 6900763, 6522264, 6179975, 5872526, 5592232, 5335772, 5106185, 4902002, 4714228, 4535745, 4364316, 4195518, 4023259, 3849257, 3682366, 3526496, 3378083, 3236504, 3106989, 2991185]
58118B991185j06841r9814q8748p6227o8045o1880n2006m0063l0842k2287r679
58107B334753M905J6809K7981M2608N7715O6789O8554O3816M8479J9034j8506
58096B732937n3722q2689j06331j22394j27763j25512j21373j15661j05949r4522
58086A677021q5751p8891p0697o2420n7269n3771m8520m2777l9829l8382l5088
58075A063626l0891k8726k7598k5004k2323k1831k1344j7982j4142j3598j4664
58064H25523j3466j0948j0239j0056p369m064m196o924q536r223j1421j3682j2796
58051G02603j0175r655j0580r428o697n846o639n890l789l455m885n154l934l434
58037F13042l541k242k17R8p22j49J381J348R7N2J027J115J225L782P768J0029
$$ y = [2991185, 2884344, 2784530, 2695782, 2619555, 2551510, 2489630, 2437624, 2397561, 2366719, 2344432, 2334753, 2339658, 2356467, 2384448, 2427056, 2484771, 2551560, 2620114, 2683930, 2732409, 2751443, 2732937, 2679215, 2596526, 2490195, 2367801, 2240038, 2114526, 1993153, 1877492, 1771543, 1677021, 1591270, 1512379, 1441682, 1379262, 1321993, 1268222, 1219702, 1176925, 1137096, 1098714, 1063626, 1032735, 1004009, 976411, 951407, 929084, 907253, 885909, 867927, 853785, 840187, 825523, 812057, 801109, 790870, 780814, 773445, 769381, 765185, 758261, 749725, 740502, 729081, 715399, 702603, 692428, 682773, 672193, 662765, 656068, 650222, 643583, 637693, 633904, 630449, 625564, 620410, 616476, 613042, 609501, 607259, 607042, 607140, 606418, 606269, 607650, 608998, 609095, 609147, 610174, 611289, 612514, 616296, 624064, 634093]
58021F34093J0823J3134J7204K0553K3064K7254L3644M0296M6720N4123O2105
58010I83013O9036P5228Q1701Q6476Q6020P9738O9230N4353L4377J2167p363k2590
57998A601386l4923m4169m8690m9707n0593n1861n1066m7735m4217m1563l8517
57987A098345l4732l1182k7311k1496j4389q299l462J423N229M983L79n875j2284
57974I51329j9406k6489l1199l3108l3968l4156l2115k7648k2545j7639j2304
57963F60752o893k669P86M965R326J1805J2317J2689J3283J2819J1297R823P810
57950G58110L783j230m616o460r159j2809j4690j3825j2327j1515j0162p472m564
57937F53064k025J011M492O863P544P351N980J884m741j1562j7260k2431k6908
$$ y = [634093, 644916, 658050, 675254, 695807, 718871, 746125, 779769, 820065, 866785, 920908, 983013, 1052049, 1127277, 1208978, 1295454, 1381474, 1461212, 1530442, 1584795, 1619172, 1631339, 1623976, 1601386, 1566463, 1522294, 1473604, 1423897, 1373304, 1321443, 1270377, 1222642, 1178425, 1136862, 1098345, 1063613, 1032431, 1005120, 983624, 969235, 960936, 957474, 958897, 964126, 969109, 969488, 963613, 951329, 931923, 905434, 874235, 841127, 807159, 773003, 740888, 713240, 690695, 673056, 660752, 653859, 651190, 651976, 656941, 666267, 678072, 690389, 703078, 716361, 729180, 740477, 750300, 758110, 761893, 760663, 756047, 749587, 740428, 727619, 712929, 699104, 686777, 675262, 665100, 657628, 653064, 651039, 652050, 656542, 663405, 670949, 678300, 684280, 686164, 681423, 669861, 652601, 630170, 603262]
57924F03262k9057k8446k6634k4581k1713j8079j4900j2381r396n861l045j108
57912D08061J186L872N438N562N712O461O547N231L260J083j664m499o189o907
57898D33154q050r565r841q546p162o319m978k725n85R18K391L928M997O107Q235
57883D01959J0568J1295J0779J1186J2835J3643J2711J1543J1106J0359Q484O068
57871E32536L366j63l956o534q106j0414j3500j5390j5626j6096j7419j7606j5606
57858C95486j3243j2111j1100q746n735l297j155J334L765N794P900R877J0446
57845C79215R514Q865R354R371P450M538K238N13j364l192m605o023p603q489
57831C99782q305p995q298q590q276p815p532o785n182l266j257J336M306O597
$$ y = [603262, 574205, 545759, 519125, 494544, 472831, 454752, 439852, 427471, 418075, 412214, 409169, 408061, 409247, 413119, 418557, 424119, 429831, 436292, 442839, 448070, 451330, 452413, 450749, 446250, 440061, 433154, 425104, 415539, 405698, 397152, 389990, 383671, 378693, 375968, 375383, 376301, 378692, 382620, 387617, 393724, 401959, 412527, 423822, 434601, 445787, 458622, 472265, 484976, 496519, 507625, 517984, 526468, 532536, 535902, 535739, 531783, 525249, 517143, 506729, 493229, 477839, 462213, 446117, 428698, 411092, 395486, 382243, 370132, 359032, 350286, 344551, 341254, 340099, 341433, 345198, 350992, 358892, 368769, 379215, 388729, 397594, 406948, 416319, 423769, 428307, 430545, 431058, 429694, 426502, 421897, 415874, 408271, 399782, 391477, 383482, 375184, 366594, 358318, 350503, 342971, 336186, 331004, 327738, 326481, 327817, 332123, 338720]
57817C38720Q231J0575J4049J7476K0500K4373K9253L2858L3359L1783L0162K9016
57805F20355K8140K8076K8980K9360K7528K3385J7571J0202J759o032j1695j5495
57793G82134j8372k0537k2074k3640k5396k6423k6330k6232k6998k7749k7248
57782E11135k5645k3717k1574j9232j7283j5903j4240j1947j0139r707r843r424
57770C22481q740q589q676q224p351o615n966n131m347l784l070k171j735j818
57756B46264j309N00K752M298N053N425N571O018P630J0002J1197J0147Q118O812
57742C28478O324N996N867N960N513M325L681M570O123P062P579Q358Q969Q821
57728D17626Q626R289J0239J0471J0396J1053J2192J2793J2820J2965J3202J3061
$$ y = [338720, 346951, 357526, 371575, 389051, 409551, 433924, 463177, 496035, 529394, 561177, 591339, 620355, 648495, 676571, 705551, 734911, 762439, 785824, 803395, 813597, 815356, 809324, 797629, 782134, 763762, 743225, 721151, 697511, 672115, 645692, 619362, 593130, 566132, 538383, 511135, 485490, 461773, 440199, 420967, 403684, 387781, 373541, 361594, 351455, 341748, 331905, 322481, 313741, 305152, 296476, 288252, 280901, 274286, 268320, 263189, 258842, 255058, 251988, 249817, 248082, 246264, 244955, 245455, 248207, 252505, 257558, 262983, 268554, 274572, 282202, 292204, 303401, 313548, 321666, 328478, 334802, 340798, 346665, 352625, 358138, 362463, 366144, 370714, 376837, 383899, 391478, 399836, 408805, 417626, 426252, 435541, 445780, 456251, 466647, 477700, 489892, 502685, 515505, 528470, 541672, 554733]
57716E54733J2783J2786J2568J1679J1106J2231J4815J7566K0214K3441K7211
57705G31133L0770L4087L7787M1803M5650M9922N5845O3285P0780P7846Q5741
57694A324649R5400J05844J15377J23304J29645J33691J33805J28656J18100J02753
57684B511224Q3009N9034L2019M754j9762m0245n6740o8601p4229p3098o6554
57673B290811n5946m1167k1872J070K5828M9239O4574O1897L4472j3907o9317
57662B325682j16136j45334j56271j53432j42446j27602j11092r3836p6760o1135
57652A141638m7924l7287k8694k1258j4231p431j060M949J0989J7140K3121K9040
57640A068992L5440M2389M9397N6525O4508P3398Q2057Q9661R6612J03271J08833
$$ y = [554733, 567516, 580302, 592870, 604549, 615655, 627886, 642701, 660267, 680481, 703922, 731133, 761903, 795990, 833777, 875580, 921230, 971152, 1026997, 1090282, 1161062, 1238908, 1324649, 1420049, 1525893, 1641270, 1764574, 1894219, 2027910, 2161715, 2290371, 2408471, 2511224, 2594233, 2653267, 2685286, 2690040, 2670278, 2630033, 2573293, 2504692, 2430463, 2357365, 2290811, 2234865, 2193698, 2171826, 2172896, 2198724, 2247963, 2312537, 2374434, 2408906, 2394999, 2325682, 2209546, 2064212, 1907941, 1754509, 1612063, 1484461, 1373369, 1279533, 1202773, 1141638, 1093714, 1056427, 1027733, 1006475, 992244, 984813, 983753, 988702, 999691, 1016831, 1039952, 1068992, 1104432, 1146821, 1196218, 1252743, 1317251, 1390649, 1472706, 1562367, 1658979, 1762250, 1871083]
57629A871083J12279J13290J11359J05091R3500P7102N6765L2612N273k2859m8996
57618B506499p1779r0555j04079j11663j14797j15743j15006j11802j06443j00373
57608A464259r4192q7508q0618p4489o8995o3026n6534n0838m6516m2608l8395
57597G60540l4465l1355k8576k5707k3323k1984k1135j9850j8043j6278j4847
57586E04977j3586j2267j0809r334q158p437o833n855m476l034j775q59n05n18
57572D19531j12J119K406K824K699L011L793M340M739N816P454Q393Q099P651
57558D81763Q242R708J1110J2070J2915J4145J6118J8849K1849K4608K7352L0814
57546F89543L5125L9576M3649M7683N2342N7926O4281P0849P6763Q1467Q5270
$$ y = [1871083, 1983362, 2096652, 2208011, 2313102, 2406602, 2483704, 2540469, 2573081, 2578354, 2555495, 2506499, 2434720, 2344165, 2240086, 2128423, 2013626, 1897883, 1782877, 1671075, 1564632, 1464259, 1370067, 1282559, 1201941, 1127452, 1058457, 995431, 938897, 888059, 841543, 798935, 760540, 726075, 694720, 666144, 640437, 617114, 595130, 573995, 554145, 536102, 519824, 504977, 491391, 479124, 468315, 458981, 450823, 443386, 436553, 430698, 426222, 423188, 421413, 420554, 420049, 419531, 419419, 420538, 422944, 425768, 428467, 431478, 435271, 439611, 444350, 450166, 457620, 466013, 474112, 481763, 490005, 499713, 510823, 522893, 535808, 549953, 566071, 584920, 606769, 631377, 658729, 689543, 724668, 764244, 807893, 855576, 907918, 965844, 1030125, 1100974, 1177737, 1259204, 1344474]
57535A344474Q8686R1234R1557Q8675Q2344P2319N8269M0682K0905R2k1115m1553
57523A916569n9221p2577q1562q6940q9288q8933q6289q1757p5856o9643o4243
57512A060260n9580n4381m8082m1886l7227l3871l0411k6251k2141j8886j6388
57501F71156j4065j1565q866o088l418r61J342L572N622P362Q992J1015J3790
57488F77888J7169K0640K3872K7127L1022L5839M1264M6831N2397N7979O3425
57477A095453O8627P3740P8668Q2566Q4398Q3791Q0728P4564O4157M9144L0476
57466A866312R594j2218l3551n2723o8470q0393q8543r3046r4345r3279r0518
57455A168820q6362q1220p5782p0362o4641n8524n2662m7736m3637l9871l6320
$$ y = [1344474, 1433160, 1524394, 1615951, 1704626, 1786970, 1859289, 1917558, 1958240, 1979145, 1979237, 1958122, 1916569, 1857348, 1784771, 1703209, 1616269, 1526981, 1438048, 1351759, 1270002, 1194146, 1124503, 1060260, 1000680, 946299, 898217, 856331, 819104, 785233, 754822, 728571, 706430, 687544, 671156, 657091, 645526, 636660, 630572, 627154, 626193, 627535, 631107, 636729, 644091, 653083, 664098, 677888, 695057, 715697, 739569, 766696, 797718, 833557, 874821, 921652, 974049, 1032028, 1095453, 1164080, 1237820, 1316488, 1399054, 1483452, 1567243, 1647971, 1722535, 1786692, 1835836, 1866312, 1875906, 1863688, 1830137, 1777414, 1708944, 1628551, 1540008, 1446962, 1352617, 1259338, 1168820, 1082458, 1001238, 925456, 855094, 790453, 731929, 679267, 631531, 587894, 548023, 511703]
57444E11703l3044k9778k6298k3006k0547j8999j7930j7015j6101j4916j3317
57433B80752j1668j0469r679q929q204p776p566p266o968p002p092o511n208m058
57419A72356l683l736l718l807m259m598m183l278k756k910l213l252l170l050
57405A22743k631j902j412j474j517q22L45J015Q69O94J255K167K394J630O57
57390A24011K83M03L94J41J11N52J064J184J008R12J007J123J181J154Q73K82
57374A35683k10j30L54N76J88n90j497k432l053k934k351k259l018l762l519k479
57358A08567j571j208j106j009q53m81J48N86M44J63N02J350J811J506J033R83
57342A10865J217J350J424J670K128K762L574M373M775M634M223L856L717M043
$$ y = [511703, 478659, 448881, 422583, 399577, 379030, 360031, 342101, 325086, 308985, 294069, 280752, 269084, 258615, 248936, 240007, 231803, 224027, 216461, 209195, 202227, 195225, 188133, 181622, 176414, 172356, 168673, 164937, 161219, 157412, 153153, 148555, 144372, 141094, 138338, 135428, 132215, 128963, 125793, 122743, 120112, 118210, 116798, 115324, 113807, 112985, 113330, 114345, 115214, 115908, 117163, 119330, 121724, 123354, 124011, 124294, 124697, 125091, 125232, 125343, 125895, 126959, 128143, 129151, 130063, 131070, 132193, 133374, 134528, 135401, 135683, 135473, 135343, 135697, 136273, 136461, 135871, 134374, 131942, 128889, 125955, 123604, 121345, 118327, 114565, 111046, 108567, 106996, 105788, 104682, 103673, 102820, 102339, 102487, 103073, 103517, 103680, 104182, 105532, 107343, 108849, 109882, 110865, 112082, 113432, 114856, 116526, 118654, 121416, 124990, 129363, 134138, 138772, 142995, 146851, 150568, 154611]
57328A54611N004O257P094P254P163P236P421P613P995Q691R466J0131J0851J1802
57314B68589J2825J3731J4637J5687J6725J7502J7958J8097J7815J7089J6075
57303D46730J4772J2795R762N749J265l175p383j1535j5772j9676k2329k3256
57291C87947k3099k2844k2626k1866k0419j8780j7180j5412j3592j2298j1626
57280A88205j0954r871q547o934m645k064n10n23r04l61P45J266J172J269J571
57265A48915J344O59N69J519K638L027K803K481K123J663J435J703K034J789J081
57250A75783O42P51Q67N34J37L54J103J658J773K067K932L730L633K838K253K226
57234B03281K344K420K761L432M098M710N569O493O784O365O098O591P402P896
$$ y = [154611, 159615, 165872, 172966, 180220, 187383, 194619, 202040, 209653, 217648, 226339, 235805, 245936, 256787, 268589, 281414, 295145, 309782, 325469, 342194, 359696, 377654, 395751, 413566, 430655, 446730, 461502, 474297, 484059, 489808, 491073, 487898, 480515, 468980, 453208, 433532, 411203, 387947, 364848, 342004, 319378, 297512, 277093, 258313, 241133, 225721, 212129, 199831, 188205, 177251, 167380, 158833, 151899, 147254, 145190, 144680, 144157, 143253, 142892, 143637, 144903, 146075, 147344, 148915, 150259, 150918, 151487, 153006, 155644, 158671, 161474, 163955, 166078, 167741, 169176, 170879, 172913, 174702, 175783, 176425, 177176, 178043, 178577, 178714, 179068, 180171, 181829, 183602, 185669, 188601, 192331, 195964, 198802, 201055, 203281, 205625, 208045, 210806, 214238, 218336, 223046, 228615, 235108, 241892, 248257, 254355, 260946, 268348, 276244]
57220B76244Q121Q382Q700R225J0388J1970J2910J2716J2388J3066J4495J5675
57208D14280J6381J6998J7359J7010J6228J5737J5563J5212J4818J4996J5693
57197E90275J6279J6804J8080K0287K2457K3650K3915K3826K3826K4188K4938
57186H28525K5639K5868K6083K7260K9487L1625L2706L3021L3495L4536L5897
57175A164142L7226L8360L9379M0565M2044M3378M3917M3646M3278M3519M4800
57164A624254M7705N2747N9159O4534O6334O3834N8345N1872M5854M0839L6822
57153B212299L3630L1096K8946K6774K4454K2410K1073K0113J8677J6497J4280
57142B470249J2833J2183J1754J1066J0006Q701P365O111M726K942R17q03k012
$$ y = [276244, 284365, 292747, 301447, 310672, 321060, 333030, 345940, 358656, 371044, 384110, 398605, 414280, 430661, 447659, 465018, 482028, 498256, 513993, 529556, 544768, 559586, 574582, 590275, 606554, 623358, 641438, 661725, 684182, 707832, 731747, 755573, 779399, 803587, 828525, 854164, 880032, 906115, 933375, 962862, 994487, 1027193, 1060214, 1093709, 1128245, 1164142, 1201368, 1239728, 1279107, 1319672, 1361716, 1405094, 1449011, 1492657, 1535935, 1579454, 1624254, 1671959, 1724706, 1783865, 1848399, 1914733, 1978567, 2036912, 2088784, 2134638, 2175477, 2212299, 2245929, 2277025, 2305971, 2332745, 2357199, 2379609, 2400682, 2420795, 2439472, 2455969, 2470249, 2483082, 2495265, 2507019, 2518085, 2528091, 2536792, 2544157, 2550268, 2554994, 2557936, 2558853, 2558050, 2556038]
57129B556038l201m967p268r529j1276j2546j3693j4941j5976j5972j4173j0520
57117B421976n647m49M169P394Q954R428R715J0227J1079J2920J6716K2681L0176
57104B559339L8997M9983O4080Q1934J05187J37146J80817K36526L02808L79685
57094D136502M70185N78413P06646Q54030J016967J190248J367865J542308J702945
57085A3566109J836609J931304J977265J961056J860640J655165J347081R73537
57077B7108766N90017K39662o2616l21590n46375p45301r27361j099052j258003
57068B2978147j393032j491571j545987j554436j519780j449326j353461j242481
57060A1428073j124436j005451q90318p82166o82680n93224n15043m48230l91536
$$ y = [2556038, 2552837, 2547870, 2540602, 2531073, 2519797, 2507251, 2493558, 2478617, 2462641, 2446669, 2432496, 2421976, 2416329, 2415880, 2420049, 2427443, 2436397, 2445825, 2455540, 2465767, 2476846, 2489766, 2506482, 2529163, 2559339, 2598336, 2648319, 2712399, 2794333, 2899520, 3036666, 3217483, 3454009, 3756817, 4136502, 4606687, 5185100, 5891746, 6745776, 7762743, 8952991, 10320856, 11863164, 13566109, 15402718, 17334022, 19311287, 21272343, 23132983, 24788148, 26135229, 27108766, 27698783, 27938445, 27875829, 27554239, 27007864, 26262563, 25335202, 24236150, 22978147, 21585115, 20093544, 18547557, 16993121, 15473341, 14024015, 12670554, 11428073, 10303637, 9298186, 8407868, 7625702, 6943022, 6349798, 5834755, 5386525, 4994989]
57051D994989l43553l03325k69766k41577k18068j99214j84759j74014j66433
57042B894280j61228j56536j50377j42611j34605j26728j17814j07454r7065q7864
57032A611998p9301p0554o2081n4568m7554m0316l3060k5986j8174q596K593J4869
57020A189270K8496M3864O0783P9096R7594J10109J05056P3715K0249l8908q6815
57009A682509j16204j29061j30197j23651j12899j00907q9061p7352o5859n5293
56999F82025m6012l7531k9387k1996j6207j2086q576m598l47K898M374M785N385
56986E22727O582P965R349J0904J2301J2385J0080N356p85o990j2183j5848j7909
56973E43934j8415j7482j5536j3242j1007q886p043n788m848l255m90K742N494
$$ y = [4994989, 4651436, 4348111, 4078345, 3836768, 3618700, 3419486, 3234727, 3060713, 2894280, 2733052, 2576516, 2426139, 2283528, 2148923, 2022195, 1904381, 1796927, 1699862, 1611998, 1532697, 1462143, 1400062, 1345494, 1297940, 1257624, 1224564, 1198578, 1180404, 1171808, 1174401, 1189270, 1217766, 1261630, 1322413, 1401509, 1499103, 1609212, 1714268, 1787983, 1808232, 1769324, 1682509, 1566305, 1437244, 1307047, 1183396, 1070497, 969590, 880529, 803177, 737318, 682025, 636013, 598482, 569095, 547099, 530892, 518806, 510230, 505632, 505285, 508183, 512557, 517342, 522727, 529309, 537274, 546623, 557527, 569828, 582213, 592293, 597649, 596864, 589874, 577691, 561843, 543934, 525519, 508037, 492501, 479259, 468252, 459366, 452323, 446535, 441687, 438432, 437942, 440684, 446178]
56960D46178P869J0733J4381J8204K1219K2269J9979J3574L957o476j5217k0675
56948E35995k2411k1176j8612j6145j3937j1306p957m388j231J307L444N707Q618
56935D37908J2081J5399J8339K1723K6130L0298L1609K8145J9833Q030m994j6444
56923F28057k4158k7955k9348k9765k9512k8331k6178k3260j9927j6817j4559
56912C58247j3116j1811j0195q513p274o602o209n674m761l638k740k205j626
56899B73883o29N72J538K237K904L568M182N019O365Q004R514J0960J2762J5017
56885C55896J7204J8415J7513J3588O946m92o405r760j1029j1150j0756j0106
56873C69864r104p471n298l108j000J752N657J0042J3867J7106K0516K4496K9022
$$ y = [446178, 454047, 464780, 479161, 497365, 518584, 540853, 560832, 574406, 578363, 571887, 556670, 535995, 513584, 492408, 473796, 457651, 443714, 432408, 424451, 420063, 418832, 420139, 423583, 429290, 437908, 449989, 465388, 483727, 505450, 531580, 561878, 593487, 621632, 641465, 649495, 644501, 628057, 603899, 575944, 546596, 516831, 487319, 458988, 432810, 409550, 389623, 372806, 358247, 345131, 333320, 323125, 314612, 307338, 300736, 294527, 288853, 284092, 280454, 277714, 275509, 273883, 273254, 273826, 275364, 277601, 280505, 284073, 288255, 293274, 299639, 307643, 317157, 328117, 340879, 355896, 373100, 391515, 409028, 422616, 429562, 429070, 422665, 412905, 401876, 390726, 379970, 369864, 360760, 353289, 347991, 344883, 343883, 345635, 351292, 361334, 375201, 392307, 412823, 437319, 466341]
56860D66341L4317M0170M4527M3909L5981K1550M131j2000k3670k9902l1757l0954
56848E62643k8537k4840k0188j4977r374l475K330P756J3122J9068K5977L4024
56836E63529M3316N3507O3657P2615P8632P8163O6725M2933J1453j9430m3248
56825A011852n7948o4393o4413o0315n4378m7803m0762l3428k6230j9194j2137
56814E30851n376P67P054J4690K3590L2526M1039M9572N7051N9566N2758L5490
56802H99578J1108j4304l5018m8127n3999n4624n1714m6458m0151l3902k7895
56791E04494k1843j6005j0892o258j479L304P474J1264J5615K0812K6120L0514
56779E63120L2577L0043K1197P183q252k1610l1362l7139l8936l7580l4628l1164
$$ y = [466341, 500658, 540828, 585355, 629264, 665245, 686795, 690926, 678926, 655256, 625354, 593597, 562643, 534106, 509266, 489078, 474101, 464727, 461252, 463582, 471338, 484460, 503528, 529505, 563529, 606845, 660352, 724009, 796624, 875256, 953419, 1020144, 1063077, 1074530, 1055100, 1011852, 953904, 889511, 825098, 764783, 710405, 662602, 621840, 588412, 562182, 542988, 530851, 525475, 526242, 533296, 547986, 571576, 604102, 645141, 694713, 751764, 811330, 864088, 899578, 910686, 896382, 861364, 813237, 759238, 704614, 652900, 606442, 566291, 532389, 504494, 482651, 466646, 455754, 449496, 448017, 451321, 458795, 470059, 485674, 506486, 532606, 563120, 595697, 625740, 646937, 654120, 645868, 624258, 592896, 555757, 516821, 479241, 444613, 413449]
56767D13449k7449k3858k0998j8710j6187j3413j1289j0098r050p743o753o321
56755B41580n767m740l866l545l251k650k237k265k089j403r83j422k071k079
56741B03212j627j255p91J20R76R55Q3q10j092p85k23K80O55J095J628J873J664
56724B05958J616K220K719K025O46L85J957M174N829P012Q183R116R546R738R842
56709B80966R585R036Q675Q290O958M644K629J730J310O72K26M17O46L40O4N89
56693C36777J561K092K026J719J270P50N37P17P84N08L76N12Q3j372k979l743
56677C41618l984m562n377n766n794o028o339o050n165m505m567m856m510l233
56663B70882j705j083j909l371m072l560k520j545n85L16P11O54R43J951K986
$$ y = [413449, 386000, 362142, 341144, 322434, 306247, 292834, 281545, 271447, 262397, 254654, 247901, 241580, 235813, 231073, 227207, 223662, 220411, 217761, 215524, 213259, 211170, 209767, 208784, 207362, 205291, 203212, 201585, 200330, 199539, 199659, 200635, 201590, 201673, 200863, 199771, 198986, 198763, 199043, 199698, 200793, 202421, 204294, 205958, 207574, 209794, 212513, 214538, 215184, 215569, 217526, 221700, 227529, 234541, 242724, 251840, 261386, 271124, 280966, 290551, 299587, 308262, 316552, 323510, 328154, 330783, 332513, 333823, 334495, 334721, 335138, 335784, 336124, 336188, 336777, 338338, 340430, 342456, 344175, 345445, 346195, 346732, 347449, 348233, 348741, 349117, 349629, 349712, 348340, 345361, 341618, 337634, 333072, 327695, 321929, 316135, 310107, 303768, 297718, 292553, 288048, 283481, 278625, 274115, 270882, 269177, 268094, 266185, 262814, 258742, 255182, 252662, 251117, 250532, 250848, 251559, 252213, 253156, 255107, 258093]
56648B58093L277K871K133J243N58O33J253J352M75m43l79M32J043R78L21o99
56632B73141j695k271k600l139l611l188j982j281j697k196j660m04O75J467K315
56617B51874L054L341L346L400L462L399L296L038K343J495J149J157O80k15l65
56602B84454N24J176Q06M16R33J474Q92j36j60O94J048M38m02j052j792k478k352
56585B84483j219R2O98N32J53R5L98O47N44M34P70J197Q37l44j386j738j853k062
56567B82278j991j438r03o39j83O11J093Q82M73J96l50j219j603j162q03j306
56551B73936k099k275j942j745j856k189k822l535l797l680l878m335m109l114
56537B32560k582l016l204k298j426j855k841k812j768r88j010j335j642k145
$$ y = [258093, 261370, 264241, 266374, 267617, 268175, 268808, 270061, 271413, 271888, 271445, 271066, 271498, 272541, 273519, 273840, 273141, 271446, 269175, 266575, 263436, 259825, 256637, 254655, 253374, 251677, 249481, 247821, 247417, 248092, 249559, 251874, 254928, 258269, 261615, 265015, 268477, 271876, 275172, 278210, 280553, 282048, 283197, 284354, 285034, 284819, 284454, 284978, 286154, 286960, 287376, 288309, 289783, 290675, 290539, 290379, 291073, 292121, 292559, 292157, 291105, 289313, 286835, 284483, 283264, 283356, 284054, 284586, 284739, 284834, 285232, 285879, 286423, 286857, 287627, 288824, 289661, 289317, 287931, 286193, 284340, 282278, 280287, 278849, 277946, 277307, 277124, 277735, 278828, 279710, 280183, 280379, 280029, 278810, 277207, 276045, 275242, 273936, 271837, 269562, 267620, 265875, 264019, 261830, 259008, 255473, 251676, 247996, 244118, 239783, 235674, 232560, 229978, 226962, 223758, 221460, 220034, 218179, 215338, 212526, 210758, 209770, 208760, 207425, 205783, 203638]
56523B03638k939l857m684n030m610l921l791l956l273j727p32q57r16j80K37
56508A63402n38j382r53J86P42P70R20Q93K69p9Q38K331K941K519J953J597J323
56491A77732J380J876K039J279L27J46N43Q57J197J808K169J892J552J582J375
56476A97754O55M45J331K045J307p2n05L8O32J201J990K246J229k04p11m00k33
56459B08748l21k56l39r25j412j279j097j274r73K28J025M41k52L60J215M65j405
56442B02949k475k410k234j970r41K77N09J36L53R04P06J65N23J403J336M39K80
56425A99950J229K079K217K192K235K018J771J932J965J182K05o4j72j049j958
56410B15732j680r04j194k186k242j406j190j781j896j252q65r17o79m01r78j821
$$ y = [203638, 200699, 196842, 192158, 187128, 182518, 178597, 174806, 170850, 167577, 165850, 165118, 164261, 163345, 163165, 163402, 162864, 161482, 160529, 160715, 161457, 162227, 163147, 164040, 164309, 164230, 165068, 167399, 170340, 172859, 174812, 176409, 177732, 179112, 180988, 183027, 184306, 184633, 184779, 185322, 186179, 187376, 189184, 191353, 193245, 194797, 196379, 197754, 198409, 198854, 200185, 202230, 203537, 203465, 202960, 202998, 203630, 204831, 206821, 209067, 210296, 210092, 209381, 208981, 208748, 208427, 208171, 207832, 206907, 205495, 204216, 203119, 201845, 200872, 201100, 202125, 202566, 202314, 202674, 203889, 204354, 202949, 200474, 198064, 195830, 193860, 192919, 193196, 193705, 193841, 194194, 195098, 195804, 195969, 196492, 197895, 199231, 199670, 199950, 201179, 203258, 205475, 207667, 209902, 211920, 213691, 215623, 217588, 218770, 218975, 218911, 218739, 217690, 215732, 214052, 213148, 211954, 209768, 207526, 206120, 204930, 203149, 201253, 200001, 199136, 198219, 197540, 197139, 196161, 194340]
56394A94340j367K65J297J059N50L26oj97M68J358J007l68j033m95oj25o4M13
56376A97422N46L63Q51J967K461J969J392J048L42n01l72P55J592J579J401J384
56360B14199J154R64J514K338K220J298R05J302J464J147J226J778J776R51K28
56345B34464J28K93O27J291J742J331O84Q17J298J062N04P60J511J593J235J396
56329B50736J506M13r13m60J369K198J488R87J350J283M54K98J267J904J429Q91
56313B66200R88J030O65N77Q78P86K86K35N97N56L62R47J803J558N75N19J357
56296B79919J429N59L83J306J821J274P17O38L64Q4Q95K455L116K687K600L150
56280C03397L166K660K966L966M002K984K769L915M934N211N845P059P652P625
$$ y = [194340, 192973, 193238, 194535, 195594, 196144, 196470, 196464, 196267, 196735, 198093, 199100, 198732, 197699, 197204, 197198, 197073, 197009, 197422, 197968, 198331, 199182, 201149, 203610, 205579, 206971, 208019, 208361, 207860, 207488, 208243, 209835, 211414, 212815, 214199, 215353, 216317, 217831, 220169, 222389, 223687, 224592, 225894, 227358, 228505, 229731, 231509, 233285, 234236, 234464, 234592, 234885, 235512, 236803, 238545, 239876, 240560, 241377, 242675, 243737, 244241, 245001, 246512, 248105, 249340, 250736, 252242, 252655, 251742, 251282, 252651, 254849, 256337, 257324, 258674, 259957, 260411, 260709, 261976, 263880, 265309, 266200, 267188, 268218, 268883, 269460, 270338, 271124, 271410, 271645, 272242, 272798, 273160, 274107, 275910, 277468, 278043, 278562, 279919, 281348, 281907, 282290, 283596, 285417, 286691, 287408, 288046, 288410, 288494, 289389, 291844, 294960, 297647, 300247, 303397, 306563, 309223, 312189, 316155, 320157, 323141, 325910, 329825, 334759, 339970, 345815, 352874, 360526, 368151]
56266C68151Q474J0253J1273J1348J2326J4656J6453J6875J7422J8874J9867J9697
56254E45669J9786K1141K2797K3825K4524K4794K3744K1704K0197J9265J7247
56243G84693J3666R838O242K070k316n466p685j0726j4335j6406j6953j8361k1004
56230G03257k2349k1375k0291k0565k0772j9718j8355j7280j5465j2787j0801
56219E03499r782q141n707m347m347l662j817r16j581j645l20J75j164k073j034
56204D57138K30K82M49J719K488J610P27J302K168J949J331J191J100J122K380
56189D77186M535N561N193N502P121Q153P954Q328R778J0368R563R456J0728J1343
56175E90769J0726J1187J3505J5254J5297J5844J8070J9904K0246K1278K4356
$$ y = [368151, 376625, 386878, 398151, 409499, 421825, 436481, 452934, 469809, 487231, 506105, 525972, 545669, 565455, 586596, 609393, 633218, 657742, 682536, 706280, 727984, 748181, 767446, 784693, 798359, 808197, 814439, 816509, 814193, 808727, 801042, 790316, 775981, 759575, 742622, 724261, 703257, 680908, 659533, 639242, 618677, 597905, 578187, 559832, 542552, 527087, 514300, 503499, 493717, 485576, 479869, 475522, 471175, 467513, 465696, 464780, 463199, 461554, 461234, 461409, 460245, 458172, 457138, 457368, 457650, 458099, 459818, 462306, 463916, 464643, 465945, 468113, 470062, 471393, 472584, 473684, 474806, 477186, 481721, 487282, 492475, 497977, 505098, 513251, 521205, 529533, 539311, 549679, 559242, 568698, 579426, 590769, 601495, 612682, 626187, 641441, 656738, 672582, 690652, 710556, 730802, 752080, 776436]
56164G76436K7566K9687L2577L7404M2445M6955N3234O2751P4024Q6505J02353
56153A371937J22390J44658J69106J98866K34269K69963L00346L22920L33749
56144C468204L25655K95688K50809K02667J60178J29333J14159J12555J14310
56135E173558J07926Q8074N5573J5012k4814n3384o6339o8857o9673p5682r3409
56124D987985j28533j79071k33338k78864l10025l25111l22302l03089k74564
56115B633088k43364k10974j78110j48663j25191j05391q7268p3113o4411n7763
56105A338840n0236m3860m0504l7413l2304k7828k6252k4735k0735j6970j6073
56094A001930j5358j2047q703q189q164n925l834m425m957k432O45R61L29J562
$$ y = [776436, 804002, 833689, 866266, 903670, 946115, 993070, 1046304, 1109055, 1183079, 1269584, 1371937, 1494327, 1638985, 1808091, 2006957, 2241226, 2511189, 2811535, 3134455, 3468204, 3793859, 4089547, 4340356, 4543023, 4703201, 4832534, 4946693, 5059248, 5173558, 5281484, 5369558, 5425131, 5440143, 5415329, 5361945, 5295606, 5226749, 5157076, 5081394, 4987985, 4859452, 4680381, 4447043, 4168179, 3858154, 3533043, 3210741, 2907652, 2633088, 2389724, 2178750, 2000640, 1851977, 1726786, 1621395, 1534127, 1461014, 1396603, 1338840, 1288604, 1244744, 1204240, 1166827, 1134523, 1106695, 1080443, 1055708, 1034973, 1018003, 1001930, 986572, 974525, 965822, 957633, 949469, 943544, 939710, 935285, 930328, 927896, 928541, 929502, 929831, 931393]
56080I31393L025K641K595M881O853O318O091Q421J0277R238Q440J0431J1970
56067A022574J0422R143J0833J2022J0136R287J2570J5488J3932J1769J3375J5580
56055A167131J4574J3766J6767J9555J7961J6063J8525K1509K0132J8058K0376
56044A364417K3616K2577K0583K3089K7264K7825K7082K9377L1820L0494K9430
56033A657574L3307L7781L7325L5907L9320M3937M4004M2930M6020M9344M7596
56022B115045M5531M9333N4174N3039N0371N3683N9254N9860N9144O4089P0749
56011B734272P2088P2490P9389Q8044R0203R0305R7030J06345J09551J10626J18394
56000C768737J28918J33146J34576J41707J50624J53290J54935J64493J76385
$$ y = [931393, 934418, 937059, 939654, 944535, 951388, 957706, 963797, 972218, 982495, 991733, 1000173, 1010604, 1022574, 1032996, 1042139, 1052972, 1064994, 1075130, 1084417, 1096987, 1112475, 1126407, 1138176, 1151551, 1167131, 1181705, 1195471, 1212238, 1231793, 1249754, 1265817, 1284342, 1305851, 1325983, 1344041, 1364417, 1388033, 1410610, 1431193, 1454282, 1481546, 1509371, 1536453, 1565830, 1597650, 1628144, 1657574, 1690881, 1728662, 1765987, 1801894, 1841214, 1885151, 1929155, 1972085, 2018105, 2067449, 2115045, 2160576, 2209909, 2264083, 2317122, 2367493, 2421176, 2480430, 2540290, 2599434, 2663523, 2734272, 2806360, 2878850, 2958239, 3046283, 3136486, 3226791, 3323821, 3430166, 3539717, 3650343, 3768737, 3897655, 4030801, 4165377, 4307084, 4457708, 4610998, 4765933, 4930426, 5106811]
55991E106811J81140J84918J98212K14950K24354K33274K53987K80313K99811
55982G177770L18833L50096L86607M14931M42819M85290N35329N78466O23895
55973A1314036O88991P66149Q39241R19094J026021J151963J279798J424688J613686
55964B1023667J841463K093338K394270K784109L264719L828695M517881N389492
55956D7137634O449564P692064R173509J0966197J3079564J5535607J8477368
55949A28511507K2070702K6347403L1264339L6666259M1632395M3753261L9804840
55942C70050706K8091856J0423021q521007k4033851l3794770l8048520l8268474
55935B65898961l5989673l2424211k8423538k4470343k0779271j7473314j4637900
$$ y = [5106811, 5287951, 5472869, 5671081, 5886031, 6110385, 6343659, 6597646, 6877959, 7177770, 7496603, 7846699, 8233306, 8648237, 9091056, 9576346, 10111675, 10690141, 11314036, 12003027, 12769176, 13608417, 14527511, 15553532, 16705495, 17985293, 19409981, 21023667, 22865130, 24958468, 27352738, 30136847, 33401566, 37230261, 41748142, 47137634, 53587198, 61279262, 70452771, 81418968, 94498532, 110034139, 128511507, 150582209, 176929612, 208193951, 244860210, 286492605, 330245866, 370050706, 398142562, 408565583, 400044576, 376010725, 342215955, 304167435, 265898961, 229909288, 197485077, 169061539, 144591196, 123811925, 106338611, 91700711]
55928I1700711j2266305j0280313q623601p273853o180680n268276m497682l866215
55920C3443786l350935k908050k522505k205939j948925j721547j516954j350277
55912A5918654j217492j095664r80922q88071q15087p43478o71529o13517n68023
55903H324871n18923m66086m24689l95392l63975l29258l03752k87356k66957
55894D968483k41679k23466k12858j98221j78889j65915j59687j49021j32867
55885C305880j21730j17079j09629r8559r2811r2571q8313p8950p2971p0944o4310
55874B298013n2342m3757m1036l8999l8811m7020o0476o7933o7311o6505o7251
55863A706572o3342n4864m9005m6092l9473k9708k4467k3850k0020j2049p088
$$ y = [91700711, 79434406, 69154093, 60530492, 53256639, 47075959, 41807683, 37310001, 33443786, 30092851, 27184801, 24662296, 22456357, 20507432, 18785885, 17268931, 15918654, 14701162, 13605498, 12624576, 11736505, 10921418, 10177940, 9506411, 8892894, 8324871, 7805948, 7339862, 6915173, 6519781, 6155806, 5826548, 5522796, 5235440, 4968483, 4726804, 4503338, 4290480, 4092259, 3913370, 3747455, 3587768, 3438747, 3305880, 3184150, 3067071, 2957442, 2858883, 2766072, 2673501, 2585188, 2506238, 2433267, 2362323, 2298013, 2245671, 2201914, 2160878, 2121879, 2083068, 2036048, 1975572, 1907639, 1840328, 1773823, 1706572, 1643230, 1588366, 1539361, 1493269, 1453796, 1424088, 1399621, 1375771, 1355751, 1343702, 1336614]
55852A336614o117k636L459M622k86m161n411j0373k0087k7488l0023l2937l7817
55839A167359l9708l7772l7508l9998l9842l5819l3024l2589k9776k4061k0722
55828G96540k0644j8718j4000j1420j1848j0526o939o217r054j0120q146p672
55816F61236r295q188m114k804n376o308m088l911p345r122p044n533o407n380
55802E76321r06K446K740M150Q476J1542J1479J2481J6755K0456K0947K0804K1405
55789G29096J9774J4938J0498P907L980k393p884j1532j6665k3644k7902k7983
55777F68190k8286l0929l2090k9539k6740k6142k5101k1855j9118j8381j6859
55766C93150j3287j0741j0590r748o848n097n954o184m212l339n304o749n495
$$ y = [1336614, 1330497, 1327861, 1331320, 1335942, 1335656, 1331495, 1326084, 1315711, 1295624, 1268136, 1238113, 1205176, 1167359, 1127651, 1089879, 1052371, 1012373, 972531, 936712, 903688, 871099, 841323, 817262, 796540, 775896, 757178, 743178, 731758, 719910, 709384, 702445, 696228, 687174, 677054, 668908, 661236, 651941, 643753, 639639, 636835, 631459, 625151, 621063, 617152, 609807, 600685, 593641, 588108, 581701, 576321, 575415, 577861, 580601, 584751, 593227, 604769, 616248, 628729, 645484, 665940, 686887, 707691, 729096, 748870, 763808, 774306, 782213, 786193, 783800, 775916, 764384, 747719, 724075, 696173, 668190, 639904, 608975, 576885, 547346, 520606, 494464, 469363, 447508, 428390, 410009, 393150, 379863, 369122, 358532, 348784, 341936, 336839, 330885, 324701, 320489, 317150, 311846, 305097, 299602]
55753B99602m484n908p086n848m644n651o839o396o205p563q240o923n946o557
55739B11312o227l676j704k094k455j159n29j994k877j276L46k16j184p71o29
55724A84867k059l006j906o54p84o74O88J274Q2m57J075K407K082K358M766O951
55708A97010P025O982Q688J0482J0873J1651J3991J5247J3000Q965N719K803r15
55695C11521m290o223p895j0020j0934r865q876r139q710o401m311l976l535j363
55681B15983R58J958L018N165O659O540P072R790J2521J3242J3540J5405J7820
55668C29671J9552K1980K6099K9693L0569K9710K8381K5111J8540J0578L760j935
55656E71709p086j0528j1615j2039j2726j1779q047l802j163J089M474P451Q052
$$ y = [299602, 295118, 289210, 282124, 276276, 271632, 265981, 259142, 252746, 246541, 238978, 230738, 223815, 217869, 211312, 205085, 201409, 199705, 197611, 195156, 193997, 193468, 191474, 188597, 187321, 187667, 187451, 186267, 185496, 184867, 182808, 179802, 177896, 177242, 176458, 175784, 176472, 177746, 177828, 177371, 178446, 180853, 182935, 185293, 190059, 197010, 204035, 211017, 219705, 230187, 241060, 252711, 266702, 281949, 294949, 303914, 309633, 312436, 311521, 307231, 301008, 293113, 283093, 272159, 262294, 253418, 244279, 235569, 229168, 224857, 220881, 217346, 215983, 216941, 218899, 221917, 227082, 233741, 240281, 247353, 257143, 269664, 282906, 296446, 311851, 329671, 349223, 371203, 397302, 426995, 457564, 487274, 515655, 540766, 559306, 569884, 573644, 571709, 564623, 554095, 542480, 530441, 517715, 505936, 497889, 494087, 492924, 494013, 498487, 505938, 513990]
55643E13990P043N594K530l234r990j5771k1064k6445l0134l0665k9525k8514
55631C33815k7010k4258k1680k0281j8500j5311j2687j2233j2123j0258p851o955
55619A44668o933o278n521n458m947l190j815j974j954m11O77o51k702k969k224
55604I8318k556l477l229k094j373q52mJ84p86j260k45L61r68k390j769l63l13
55587G7184p79J39J682J937J252J031R22J39j64J163K760L041L132M649O488O843
55571A11419O535P222Q027P081M801K664M11k563m879n268n278o704q137p306
55557A08025n181m302m494l833k541k376l041k689j270l18k0O31J436J491J331
55542H2849K023K993L195L396M763O324O447N787O114P297Q051Q603J0020J1856
$$ y = [513990, 521033, 526627, 529157, 525923, 515933, 500162, 479098, 452653, 422519, 391854, 362329, 333815, 306805, 282547, 260867, 240586, 222086, 206775, 194088, 181855, 169732, 159474, 151623, 144668, 137735, 131457, 125936, 120478, 115531, 112341, 110526, 108552, 106598, 106187, 106864, 106213, 103511, 100542, 98318, 95762, 92285, 89056, 86962, 85589, 84737, 84733, 84917, 84131, 82871, 82626, 82987, 82019, 79629, 77860, 77497, 77184, 76405, 76544, 78226, 80163, 81415, 82446, 83368, 83507, 83343, 84506, 87266, 90307, 93439, 98088, 104576, 111419, 117954, 125176, 133203, 140284, 145085, 147749, 148160, 145597, 140718, 135450, 130172, 123468, 115331, 108025, 102844, 98542, 94048, 90215, 87674, 85298, 82257, 79568, 78298, 77980, 77960, 78591, 80027, 81518, 82849, 84872, 87865, 91060, 94456, 99219, 105543, 111990, 117777, 123891, 131188, 139239, 147842, 157862, 169718]
55528A69718J3060J4228J6467J9065K0624K1368K1967K1501J9094J6158J4189
55517C67439J1731O375j321q691j4605j9519k3116k4734k5174k5367k4322k1026
55505A97670j7169j5135j4453j3158j1381j0533j0071q387o085n130n419n201
55493G5548m343m071m146l266j873j512j903j511o32r37k281k817k140j564j448
55478D1104q91O3L82J30K65N78J09p78r16n25o52r98n48K40R7p42j111j144j669
55459C2994k102j328m2K00l80l89J65K06j83j05K39J89K73J068J456M01p57l07
55441C1598Q09O47k96k94K08m04j500j189J18N07J73Q21J994J620o0p10R0M59
55423C4591j37k37M60O07J03L77J392J475M56QM68K82r64j747j363p93m23M13
$$ y = [169718, 182778, 197006, 213473, 232538, 253162, 274530, 296497, 317998, 337092, 353250, 367439, 379170, 385545, 384224, 375533, 360928, 341409, 318293, 293559, 268385, 243018, 218696, 197670, 180501, 165366, 150913, 137755, 126374, 115841, 105770, 97383, 91298, 86168, 80749, 75548, 71205, 67134, 62988, 59722, 57849, 56337, 54434, 52923, 52291, 51354, 49073, 46256, 44116, 42552, 41104, 40213, 40276, 40658, 40788, 41053, 41631, 41740, 40962, 40046, 39521, 38869, 37871, 37323, 37563, 37660, 36918, 35807, 34663, 32994, 30892, 29564, 29522, 29722, 29342, 28953, 29118, 29324, 29141, 29036, 29275, 29464, 29737, 30805, 32261, 32662, 31905, 31598, 32407, 33054, 32758, 32464, 32672, 32268, 30768, 29579, 29697, 30204, 30377, 31198, 33192, 34812, 34752, 34042, 34132, 34591, 34454, 34217, 34677, 35284, 35387, 35764, 37156, 38631, 39087, 39095, 39563, 39845, 38881, 37134, 35771, 34978, 34555, 34968]
55405C4968J290P77r05j895j621j289j207l77R79J264L49m2O99J246Q97M89L70
55388C5992p9n57L2J152Q90r22k257k021j283r18n32n2j38n37k90K55j54j163
55370B7418j221m46m51j221j000L86J005J02r02j219j658k291j959q41o16j377
55354A3709j216K57R59n8r65l46O22O23L50O71R12L95j82k21k98o68n24K73O12
55335A4905J48K9P62J243P72J32j06n44j364j630r46j09M75J204J763J220M0r3
55317A7901J034J781J450J081J069M00r51j461p57m39j260j830j177k79J0L11
55301A6883R51J035M18L59J193J415K60r81j213j041r69l79O82R19J22j85N02
55284A9971O03o21j527r78l36q86j501p01Q26J591J529J204M01q96j622j194n42
$$ y = [34968, 36258, 37035, 36130, 34235, 32614, 31325, 30118, 29741, 30720, 31984, 32333, 32291, 32990, 34236, 35133, 35622, 35992, 35913, 35356, 35388, 36540, 37430, 36508, 34251, 32230, 30947, 30029, 29497, 29445, 29307, 28770, 28480, 28735, 28581, 27418, 26197, 25751, 25300, 24079, 23079, 23465, 24470, 24572, 23670, 22451, 20793, 18502, 16543, 15702, 15086, 13709, 12493, 12750, 13709, 13651, 12686, 12340, 12962, 13585, 13935, 14606, 15518, 15913, 15731, 15510, 15212, 14544, 14020, 14293, 14905, 15053, 15082, 15844, 17087, 17859, 17991, 17885, 17341, 15977, 14347, 13401, 13292, 13767, 14971, 16734, 17954, 17994, 17901, 18935, 20716, 22166, 23247, 24316, 24716, 23765, 22304, 21547, 21108, 19848, 18018, 16841, 16562, 16572, 16883, 17834, 18869, 19287, 19646, 20839, 22254, 22514, 21533, 20320, 19279, 18310, 17931, 18613, 19532, 19654, 19469, 19971, 20574, 19953, 18426, 17448, 17112, 16226, 14725, 14024, 14850, 16441, 17970, 19174, 19575, 18679, 17057, 15863, 15321]
55267A5321l99j22O64R60K00m89j26O01P93P17P13M24M6N39J604J478j90j396
55249B1338r03m9j30l35J52K48q86j857j216J70P89Q44J120J150L90k63J8N08
55231B1088M59N62J258J378K34p16j83O66L02n29l84K01Ll48M01J454J024o82
55213B6188j787j549q43l12J25L29J41O2M53O44P8m92j88N29Q25Q99J120Q95j55
55194B6962j013p50j55l56r01p83l13l25m66JN41J91o44q37l03K30N38O79K39
55175B2535q82j736j574j025q97q46m06j54n32o72J32R48P23J11K19O60N30K33
55157A7367N84J073Q25L81P42J457J438R16Q63J076O54j65l25K56P46R02J107
55140B9897J396J508J518J457R62K90N32J882K893K635K239K882L750L678L443
$$ y = [15321, 14922, 14800, 15464, 16424, 16624, 16135, 16009, 16610, 17403, 18120, 18833, 19257, 19303, 19842, 21446, 22924, 22734, 21338, 20435, 20386, 20256, 19921, 20073, 20321, 19435, 17578, 16362, 16532, 17321, 18165, 19285, 20435, 20825, 20562, 20580, 21088, 21547, 22109, 23367, 24745, 24979, 24263, 24080, 24746, 25048, 24519, 24135, 24336, 24339, 23991, 24392, 25846, 26870, 26188, 24401, 22852, 22009, 21697, 21822, 22151, 22292, 22354, 22807, 23451, 23529, 23037, 22849, 23378, 24203, 25102, 26222, 27117, 26962, 25949, 25199, 25044, 24688, 23787, 23004, 22691, 22366, 21900, 21901, 22442, 22633, 21989, 21152, 20849, 21079, 21617, 22296, 22535, 21653, 19917, 18343, 17318, 16421, 15575, 15169, 15015, 14483, 13811, 13943, 14891, 15614, 15725, 15944, 16604, 17134, 17367, 17951, 19024, 19849, 20230, 20972, 22429, 23867, 24783, 25646, 26722, 27376, 27211, 26886, 27142, 27888, 28790, 29897, 31293, 32801, 34319, 35776, 36738, 37028, 37560, 39442, 42335, 44970, 47209, 50091, 53841, 57519, 60962]
55125F0962M343N645N585L985J981q6k407m183m462l973m120m704m513l626l147
55110D7280l126k712j963j622j470p94j25n06j396j236QQ34O40K80J94j82r48
55093C3156j294q61k19J83L97L48l9k15L16R83R39N28O68J154J034L69J96P76
55075C8419J262J110O58K55j77o47r65r82n44L82J176J036M15Q00K292K953J676
55058D9119Q8P4R71J107O63Q63J433J255P61J229K306K505J821J599K102K397
55042G0293K419K981L820L774K920K438K303J234q74k394k303j339m67K03O80
55027H5688P04M16J70l53j600k889l110k545k488l189l713l724l763l808l196
55012E2600k101j469j402j017p3P20J045J262J331Q41J46N4M31M41M8q6k2l72
$$ y = [60962, 65305, 70950, 76535, 80520, 82501, 82415, 80008, 75825, 71363, 67390, 63270, 58566, 54053, 50427, 47280, 44154, 41442, 39479, 37857, 36387, 35593, 35468, 34962, 33566, 32330, 32338, 33172, 33812, 34092, 34286, 34104, 33156, 31862, 31001, 30782, 30965, 31362, 31710, 31671, 31456, 31772, 32755, 33694, 34222, 34890, 36044, 37078, 37447, 37643, 38419, 39681, 40791, 41449, 41704, 41527, 40880, 39915, 38933, 38389, 38771, 39947, 40983, 41398, 42198, 44490, 47443, 49119, 49207, 49281, 50252, 51359, 52022, 52885, 54318, 55573, 56334, 57563, 59869, 62374, 64195, 65794, 67896, 70293, 72712, 75693, 79513, 83287, 86207, 88645, 90948, 92182, 91308, 88914, 86611, 85272, 84805, 85008, 85688, 86392, 86808, 86978, 86625, 85025, 82136, 79026, 76481, 73993, 70804, 67091, 63367, 59604, 55796, 52600, 50499, 49030, 47628, 46611, 46538, 47258, 48303, 49565, 50896, 51737, 51883, 51937, 52368, 52809, 52857, 52771, 52749, 52377]
54994E2377q15l95P49J397J109O28M93N62Q57J551K217K319K226K537K881K741
54978G3434K796L820M963N051M877O040Q026Q900Q600R028J0754J2260J2728J3071
54964A84348J3585J2978J0558P320M128O91k941n823p737r652j1807j3120j3146
54951A69382j2792j2438j1244r151p645p493p478o397m800l645k791j889j386
54938H0233j516j550r84m05k32J64J216K199K557L049M571O786Q728J0051J0859
54923A25726J1117J0914J0526R721P731M450P86k490n414q021r904j0914j1382
54910A32846j1329j0455r096q096p446o328m673l486l230l192k845k554k486k068
54896E5562j059r4L51M78M60K60K95R99J659J102k80q20j23M16Km55k36m6m76
$$ y = [52377, 51562, 51167, 51916, 53313, 54422, 55050, 55543, 56105, 56962, 58513, 60730, 63049, 65275, 67812, 70693, 73434, 76230, 80050, 85013, 90064, 94941, 100981, 109007, 117907, 126507, 135535, 146289, 158549, 171277, 184348, 197933, 210911, 221469, 228789, 232917, 233608, 230667, 224844, 217107, 207455, 195648, 182528, 169382, 156590, 144152, 132908, 123757, 116112, 108619, 101141, 94744, 89944, 86299, 83508, 81619, 80233, 78717, 77167, 76183, 75778, 75546, 75710, 76926, 79125, 81682, 84731, 89302, 96088, 104816, 114867, 125726, 136843, 147757, 158283, 168004, 175735, 180185, 180971, 178481, 173067, 165046, 155142, 144228, 132846, 121517, 111062, 101966, 93870, 86424, 80096, 75423, 71937, 68707, 65515, 62670, 60116, 57630, 55562, 54503, 54409, 54760, 55238, 55698, 55958, 56253, 57252, 58911, 60013, 59733, 58913, 58790, 59206, 59208, 58753, 58517, 58471, 57995]
54877E7995q68p02n92r78j178p42m15p82j176q79l35j73j62R0L02K34J60L0o90
54858D9139j676j604j42J158R33k33j035j286j506j699j621j415j094k35J032
54843C8716J663J126L17K29N79N29n6p96j390j439m49J323K795L320L175K644
54827E2286J759J130J654K899L285K499K145L273M816N511N809O729Q118R354
54813A11267J0537J1800J2444J1984J1021J0018Q269N199J608j553m503p556r722
54800A70813r973q960q177p965p667p012o131m851l212k075k014k220j657p00
54786I8199m32q12q86l85J21M00Q35J575K450L561N102O719P815Q485R504J1404
54770A53655J3910J6166J7375J7468J7205J7119J6490J4134J0168N945K244j288
$$ y = [57995, 57127, 56425, 55833, 54855, 53677, 52935, 52520, 51738, 50562, 49683, 49348, 49175, 49013, 49103, 49405, 49639, 49799, 49829, 49139, 47463, 45859, 45717, 46875, 47808, 47575, 46540, 45254, 43748, 42049, 40428, 39013, 37919, 37684, 38716, 40379, 41505, 41822, 42051, 42630, 43159, 43103, 42307, 40917, 39478, 39029, 40352, 43147, 46467, 49642, 52286, 54045, 55175, 56829, 59728, 63013, 65512, 67657, 70930, 75746, 81257, 87066, 93795, 101913, 111267, 121804, 133604, 146048, 158032, 169053, 179071, 187340, 192539, 194147, 192594, 188091, 180535, 170813, 160840, 151880, 143703, 135738, 128071, 121059, 114928, 110077, 106865, 104790, 102776, 100556, 98899, 98199, 97767, 96955, 96069, 95684, 95805, 96205, 97040, 98615, 101065, 104626, 109728, 116447, 124262, 132747, 142251, 153655, 167565, 183731, 201106, 218574, 235779, 252898, 269388, 283522, 293690, 299635, 301879, 300591]
54758C00591m738p480r595j2148j5312j7577j7754j6530j5153j3821j2309j0995
54746A47179j0127r180p894o958o705o270n090m007l787l716k984k237k332k611
54732G3281j975q45m79r58j319j172q13l02L49N28j93j080j145n65o7L82J160
54715F4787J833J714J134Q96R21N86J2j60M6N7k39n42p79q94m47O50J471J234
54697G2280M93L26P66J061J011R71R93Q90Q07R12R62R02J217K011K468K119J764
54680I1953K167K727K589K174K341K808K730K243K108K320K355K308K563K854
54666A26240K810K939L907N275O215O878P918R171J0075J0893J2228J3887J5395
54653B33831J7083J9372K1466K2163K1358J9508J6198J0805M097k411q303j3937
$$ y = [300591, 295853, 288373, 278778, 266630, 251318, 233741, 215987, 199457, 184304, 170483, 158174, 147179, 137052, 127872, 119978, 113020, 106315, 100045, 94955, 90948, 87161, 83445, 80461, 78224, 75892, 73281, 71306, 70461, 69982, 69024, 67705, 66533, 65720, 65418, 65767, 66295, 66102, 65022, 63877, 63312, 63245, 63627, 64787, 66620, 68334, 69468, 70364, 71285, 71871, 71883, 71723, 71769, 71826, 71587, 71045, 70266, 69372, 68925, 69575, 71046, 72280, 72773, 73099, 73865, 74926, 75937, 76908, 77901, 78791, 79598, 80510, 81472, 82374, 83591, 85602, 88070, 90189, 91953, 94120, 96847, 99436, 101610, 103951, 106759, 109489, 111732, 113840, 116160, 118515, 120823, 123386, 126240, 129050, 131989, 135896, 141171, 147386, 154264, 162182, 171353, 181428, 192321, 204549, 218436, 233831, 250914, 270286, 291752, 313915, 335273, 354781, 370979, 381784, 385881, 383470, 375167, 361230]
54641C61230j8706k1397k2054k1851k1159j9391j6753j4454j2961j1521r744q254
54629A62985p409o574n160l464k102j372j308j687j954j786j593j777j923j531
54615A23345j172j732k816l114k226j025l11p0l6o6J5J87np43j352j231q33q78
54597A05937j121r34m97l72m62m89q73j881k571j979q12m56q77j009p39q66j382
54580H8617j493j135r31p74p3Q92J282J198J244R88l53j948k079p67K52K80L66
54563H5566J100J721J884K311L076L094K065J278J619K298K373K167K369K976
54549A15897L840N137O635P588P937Q472R363R868R901J0431J1664J2236J1064
54536B30033Q713O072L015o57m065o257p514q602r521r819r533q939p990o782
$$ y = [361230, 342524, 321127, 299073, 277222, 256063, 236672, 219919, 205465, 192504, 180983, 171239, 162985, 155576, 149002, 143842, 140378, 138276, 136904, 135596, 133909, 131955, 130169, 128576, 126799, 124876, 123345, 122173, 120441, 117625, 114511, 112285, 111260, 110949, 110879, 110843, 110777, 110792, 110979, 110974, 110231, 108879, 107648, 106815, 105937, 104816, 103882, 103385, 103013, 102551, 102062, 101189, 99308, 96737, 94758, 93946, 93490, 92613, 91604, 90865, 89999, 88617, 87124, 85989, 85058, 84284, 84211, 85103, 86385, 87583, 88827, 89815, 89462, 87514, 85435, 84668, 84920, 85200, 85566, 86666, 88387, 90271, 92582, 95658, 98752, 100817, 102095, 103714, 106012, 108385, 110552, 112921, 115897, 119737, 124874, 131509, 139097, 147034, 155506, 164869, 174737, 184638, 195069, 206733, 218969, 230033, 238746, 244818, 247833, 247176, 243111, 236854, 229340, 220738, 211217, 201398, 191865, 182926, 174936, 168154]
54522A68154n991o055o454o420n928n412n019m640m216l649k805j947j591j686
54508A06341j578r67j79O32J671K564K303P01r63j418q51k29Q4L06L91Rp68j397
54490A06652j459j062o62n73n81j95N18O87k35j475j772r85q8L02M48O30P23P46
54472A01619R81J352J414J091P30M28%m31n96p34j224j717j531q57n14o39o34
54455I8738l67l13m59k27M08Q34Q89R53R34L81l52l55K76M69m8l54o1Oo41j296
54435I9415j298r43o07j24M00L14m00p65k55M09N23L93M48M13J34J82Q77J502
54417A00618J341P49M92P04J088J516J870J846J392Q77N48L37K89M95N59Qp39
54400A13990q69n66q05j612j963j584j447j995k380k014j499j314r33l9O17M18
$$ y = [168154, 162163, 156108, 149654, 143234, 137306, 131894, 126875, 122235, 118019, 114370, 111565, 109618, 108027, 106341, 104763, 103796, 103617, 104249, 105920, 108484, 110787, 111488, 110525, 109107, 108256, 108027, 108111, 108417, 108808, 108817, 108049, 106652, 105193, 104131, 103469, 102896, 102315, 102120, 102638, 103325, 103090, 101615, 99843, 98858, 98770, 99072, 99520, 100150, 100873, 101619, 102600, 103952, 105366, 106457, 107187, 107615, 107615, 107184, 106588, 105854, 104630, 102913, 101382, 100525, 100011, 99372, 98738, 98371, 98058, 97599, 97372, 97780, 98614, 99503, 100456, 101390, 101771, 101419, 101064, 101340, 101809, 101761, 101407, 101346, 101352, 100711, 99415, 98117, 97174, 96567, 96443, 96843, 97157, 96757, 95992, 95737, 96146, 96669, 97062, 97510, 97923, 98057, 98239, 99116, 100618, 101959, 102708, 103200, 103904, 104992, 106508, 108378, 110224, 111616, 112493, 113041, 113378, 113667, 114162, 114721, 114729, 113990, 113121, 112555, 111750, 110138, 108175, 106591, 105144, 103149, 100769, 98755, 97256, 95942, 95009, 94970, 95587, 96005]
54384I6005j45n21r71j654j944j499r29o44r6R78J737J524R47P72P07K51k40k86
54366I3992j49j17J29N89M49m87r66kJ543K226J992J745J760J762J789J855J430
54349A09540L37m65j92M25K18o03j039j056j427k204k670k619k486k365j913j220
54333I0261q30r51j300j646j907j925j690j541j617j540j063o01n65o86n76m01
54317G1422m44n60n79o68q05n68M8L68R2j69n2j53q59j400j016j96J90K20M19
54298F5290O42M97K35J85l9q08j549j571j222j214j345r85k98N1k2j40k34k95
54280E7178M8Q38J273Q57L82P96J727K196K189K215K047J183J29k05q1m84j322
54263G0966j483o56K14M17K99L78O61J050J514J775J503R14N55M39Q6o08j113
$$ y = [96005, 95860, 95339, 94368, 92714, 90770, 89271, 88342, 87698, 87602, 88580, 90317, 91841, 92788, 93560, 94267, 94518, 94278, 93992, 93843, 93726, 93855, 94444, 94893, 94406, 93440, 93438, 94981, 97207, 99199, 100944, 102704, 104466, 106255, 108110, 109540, 109877, 109412, 109220, 109645, 109863, 109260, 108221, 107165, 105738, 103534, 100864, 98245, 95759, 93394, 91481, 90261, 89431, 88480, 87180, 85534, 83627, 81702, 80012, 78471, 76854, 75314, 74251, 73650, 73085, 72399, 71823, 71422, 70978, 70418, 69839, 69171, 68366, 67798, 67846, 68214, 68306, 68137, 68085, 67932, 67073, 65673, 64657, 64461, 64651, 64871, 65290, 65932, 66429, 66664, 66849, 66810, 66002, 64453, 62882, 61660, 60446, 59101, 58116, 57818, 57869, 57847, 57707, 57473, 57178, 57226, 58064, 59337, 60194, 60576, 61372, 63099, 65295, 67484, 69699, 71746, 72929, 73058, 72853, 72772, 72288, 70966, 69483, 68827, 69041, 69458, 69757, 70135, 70796, 71846, 73360, 75135, 76638, 77552, 78107, 78546, 78632, 78024, 76911]
54246G6911r12J1J184J788J143m99j984k494k286j898j307m64O8j57o88q45o23
54229F6948l09R7M79L84r3j20L91K35j108k136j351L90J168Q12O19Q70O31k02
54211F7705n22O4O26M97J39R3K57M90Q68J138Q28Q5m02m45n32r81j663k395k907
54192F2943k652j542n36n62j158j168m55J08J11r3k89n83q02p89r41j503j750
54175D8339r92M5J67l78m67j11l02j010j150n38j75l28l2J044J829J557Q42M37
54157D8777J25m50r75j026o53N5J084J860J500R8j160j452j082n67K1N27N70K31
54139D7483P0J71P7j99j36J93J32k77j90N28R62P37O17J062J348Q37J4n15r12
54120E2002j257q90M54J699J640N78k67m55n17p85r20o16j93k55r73j700j427
$$ y = [76911, 75999, 76010, 77194, 78982, 80125, 79626, 77642, 75148, 72862, 70964, 69657, 69193, 69261, 69104, 68416, 67571, 66948, 66639, 66736, 67215, 67599, 67506, 67386, 67777, 68012, 66904, 64768, 63417, 63807, 64975, 65787, 66406, 67276, 67907, 67705, 67183, 67247, 67873, 68370, 68509, 68602, 68859, 69349, 70217, 71355, 72183, 72268, 71866, 71421, 70889, 69908, 68245, 65850, 62943, 60291, 58749, 58213, 57651, 56493, 55325, 54870, 54978, 55089, 54996, 54707, 54124, 53322, 52533, 51592, 50089, 48339, 47347, 47392, 47559, 47181, 46714, 46603, 46301, 45291, 44141, 43603, 43428, 43100, 43068, 44112, 45941, 47498, 48340, 48777, 48902, 48452, 47477, 46451, 45798, 45853, 46937, 48797, 50297, 50395, 49235, 47783, 46701, 46134, 46155, 46682, 47252, 47483, 47553, 47724, 47801, 47602, 47466, 47659, 47791, 47514, 47324, 47852, 48814, 49551, 50168, 51230, 52578, 53415, 53429, 52914, 52002, 50745, 49855, 50309, 52008, 53648, 54226, 53959, 53504, 52987, 52202, 51282, 50666, 50473, 50218, 49245, 47545, 46118]
54103D6118N0J547J635L40r47j179n92J17O27Q31O40L19M26J033J577J593J126
54086E5261L35n19p57J98J695K202J092o54j737j835j300m98J60K21k51o81p88
54069E2144p83o69o6R77J787K037K137K405K537K280J886J550J073M62J22J15
54053F9994m6n51r19q48o99o98m09M60J448K024K302K531K534K223K101K561L164
54036H7172L231K838K613K781K978K897K733K875L408L975M162L984L756L435
54022A32838K571J272N85J185K184K219J387R23J132R88l6j043j155q40j103k102
54006A41005l235m015m299m076l517k974k658k535k522k528k386k179k290k625
53992I9166k245o37J064J240l0j232j630j946k643l017k424j242j93M16M59l5
$$ y = [46118, 46168, 47715, 49350, 49690, 48743, 47564, 46972, 47089, 47716, 48547, 49187, 49506, 49932, 50965, 52542, 54135, 55261, 55596, 55077, 54320, 54518, 56213, 58415, 59507, 58853, 57116, 55281, 53981, 53483, 53643, 53864, 53613, 52932, 52144, 51361, 50692, 50626, 51603, 53390, 55427, 57564, 59969, 62506, 64786, 66672, 68222, 69295, 69757, 69879, 69994, 69948, 69397, 68478, 67630, 66931, 66233, 65824, 66284, 67732, 69756, 72058, 74589, 77123, 79346, 81447, 84008, 87172, 90403, 93241, 95854, 98635, 101613, 104510, 107243, 110118, 113526, 117501, 121663, 125647, 129403, 132838, 135409, 136681, 137266, 138451, 140635, 142854, 144241, 145164, 146296, 147284, 147248, 146205, 145050, 144210, 143107, 141005, 137770, 133755, 129456, 125380, 121863, 118889, 116231, 113696, 111174, 108646, 106260, 104081, 101791, 99166, 96921, 96284, 97348, 98588, 98558, 97326, 95696, 93750, 91107, 88090, 85666, 84424, 84231, 84647, 85106, 85071]
53976H5071m45r2O06N82j86p02o83q48j241r68j4K93m99j053l62N79M76l10p22
53957G9482o95o65l83M45J173J160R65J392K088K223J931J923K255K620L250M370
53941A03534N218M949M106M056N116O238O425N577M075K442J266P74N60J90j82
53926A54344k45j23MM05J221J940K109K026K118K146J880J906K820M072M622M403
53910A85648M224M462M770M850M643L896K433P73k54n94r28j568k011j782j191
53895B07371j029j711k790l363l089k700l108m142m799m755m673m878m797m159
53881A57378l719l996m255l675k745k498k891l015k501j820j415j396j777k306
53867A19369k413j930j527j755k109j784r45m11m29n69o82j084j845k554k779
$$ y = [85071, 84626, 84534, 85140, 85722, 85536, 84834, 84151, 83303, 82062, 81094, 81080, 81373, 80874, 79821, 79459, 80038, 80514, 80204, 79482, 78787, 78122, 77739, 78184, 79357, 80517, 81482, 82874, 84962, 87185, 89116, 91039, 93294, 95914, 99164, 103534, 108752, 113701, 117807, 121863, 126979, 133217, 139642, 145219, 149294, 151736, 153002, 153776, 154336, 154526, 154344, 154099, 153976, 153980, 154385, 155606, 157546, 159655, 161681, 163799, 165945, 167825, 169731, 172551, 176623, 181245, 185648, 189872, 194334, 199104, 203954, 208597, 212493, 214926, 215699, 215445, 214851, 213923, 212355, 210344, 208562, 207371, 206342, 204631, 201841, 198478, 195389, 192689, 189581, 185439, 180640, 175885, 171212, 166334, 161537, 157378, 153659, 149663, 145408, 141733, 138988, 136490, 133599, 130584, 128083, 126263, 124848, 123452, 121675, 119369, 116956, 115026, 113499, 111744, 109635, 107851, 106906, 106495, 106066, 105497, 104815, 103731, 101886, 99332, 96553]
53852I6553k405j645j005r58j312j338q49n45q99j368j271q11m94k27K62N94K34
53835H2516n78j069r20l45L71R46J040P05M51N03N03L44N51J232J562R93K09R7
53817H9111M71O82P51R70J082Q21O82J159J773J788J359J046Q83Q13J320K604
53801A07315L790M079L958M145M139L205K045J911K533K647K175K232K983L319
53787A50476K703J884J398Q40k4o49o53m08l76o85j462k711l726l647k707k127
53771A38126k553l401l784l341k147o83J66j48j091j743j990k181k100j384o91
53756A11055j036k036k210j215l81o92j474j600r82k67J16R8j38j18M80J188J137
53739A01925K49p22j305j697j956j720r93m18m21p04p72m73Q2N73N86J64l0L41
$$ y = [96553, 94148, 92503, 91498, 90540, 89228, 87890, 87041, 86496, 85597, 84229, 82958, 82147, 81653, 81426, 81688, 82282, 82516, 81938, 80869, 79949, 79604, 79975, 80921, 81961, 82666, 83117, 83620, 84123, 84467, 85018, 86250, 87812, 88805, 89014, 89111, 89582, 90264, 91015, 91985, 93067, 93888, 94570, 95729, 97502, 99290, 100649, 101695, 102578, 103391, 104711, 107315, 111105, 115184, 119142, 123287, 127426, 130631, 132676, 134587, 137120, 139767, 141942, 144174, 147157, 150476, 153179, 155063, 156461, 157301, 157277, 156628, 155975, 155567, 155191, 154506, 153044, 150333, 146607, 142960, 140253, 138126, 135573, 132172, 128388, 125047, 122900, 122217, 122383, 122235, 121144, 119401, 117411, 115230, 113130, 111746, 111055, 110019, 107983, 105773, 104558, 104177, 103485, 102011, 100411, 99429, 99162, 99278, 99376, 99238, 99120, 99600, 100788, 101925, 102174, 101452, 100147, 98450, 96494, 94774, 93781, 93363, 92942, 92238, 91466, 90993, 91075, 91648, 92234, 92398, 92368, 92709]
53721I2709N71op03m04N89R47M02L5L67O44K98j09L3M94Q66J233J703K032K082
53702A03783K026J906J624J406J530J718J611J678K554L671L813K987K419K607
53688A35333K791K542K371K463K261J856K235L497M226L570K607K747L767M511
53674A76777M545M189L628L013K804L218L746L826L439K725J763J123J685L262
53660B19743M354L912K557J383N28l29r34q78l94R0N90J093J145O38K71M54M79
53643B34702l58j431j642j039o40r72j639k111k192j914j517j334j267q35n9K86
53627B16038j89q22r14p66r75j307j119m25K74P92J147J136P08L23K27j19j061
53610B12948j738j030P62K179K383J879J508J606K135K922L638M047M295M628
$$ y = [92709, 93280, 93274, 92571, 92167, 92756, 93703, 94105, 94140, 94507, 95151, 95449, 95340, 95373, 95867, 96733, 97966, 99669, 101701, 103783, 105809, 107715, 109339, 110745, 112275, 113993, 115604, 117282, 119836, 123507, 127320, 130307, 132726, 135333, 138124, 140666, 143037, 145500, 147761, 149617, 151852, 155349, 159575, 163145, 165752, 168499, 172266, 176777, 181322, 185511, 189139, 192152, 194956, 198174, 201920, 205746, 209185, 211910, 213673, 214796, 216481, 219743, 224097, 228009, 230566, 231949, 232477, 232148, 231214, 230336, 229942, 230032, 230622, 231715, 232860, 233498, 233769, 234223, 234702, 234344, 232913, 231271, 230232, 229592, 228620, 226981, 224870, 222678, 220764, 219247, 217913, 216646, 215811, 215752, 216038, 215849, 215027, 214113, 213347, 212372, 211065, 209946, 209521, 209795, 210587, 211734, 212870, 213578, 213901, 214128, 214009, 212948, 211210, 210180, 210942, 213121, 215504, 217383, 218891, 220497, 222632, 225554, 229192, 233239, 237534, 242162]
53596B42162M931M973M861M793M583L934L115K801L298M228M877M740L908L180
53582C00384L396M461N370N453N116N057N329N564N595N391M891M377M431N001
53568C69816N106M093K606J648J219P14Q6k28k63m82r68j431j826k253k497k364
53552C72976k247k652l368l751l677l484l259k947k869l350l954l995l722l969
53538C25732m628m537l103j251k66l87r20j179r50m01M5j6n50j097j296j113o06
53521C03477J87J021J566J864K335L155L979M377M380M353M636N330O298P192
53507C54150P733Q049Q581R598J0898J2140J3234J4280J5228J5825J6001J6142
53495E01859J6763J7978J9444K0910K2456K4052K5295K6020K6778K8110K9528
$$ y = [242162, 247093, 252066, 256927, 261720, 266303, 270237, 273352, 276153, 279451, 283679, 288556, 293296, 297204, 300384, 303780, 308241, 313611, 319064, 324180, 329237, 334566, 340130, 345725, 351116, 356007, 360384, 364815, 369816, 374922, 379015, 381621, 383269, 384488, 385202, 385288, 385060, 384797, 384315, 383347, 381916, 380090, 377837, 375340, 372976, 370729, 368077, 364709, 360958, 357281, 353797, 350538, 347591, 344722, 341372, 337418, 333423, 329701, 325732, 321104, 316567, 313464, 312213, 311947, 311560, 310640, 309461, 308511, 308110, 308155, 308139, 307589, 306492, 305196, 304083, 303477, 303664, 304685, 306251, 308115, 310450, 313605, 317584, 321961, 326341, 330694, 335330, 340660, 346958, 354150, 361883, 369932, 378513, 388111, 399009, 411149, 424383, 438663, 453891, 469716, 485717, 501859, 518622, 536600, 556044, 576954, 599410, 623462, 648757, 674777, 701555, 729665, 759193]
53484G59193L0011K9463K8873K8877K9059K9000K9182L0320L2436L5161L8350
53473A099925M1779M4734M6658M7869M8948M9640M8978M6405M2214L7122L1919
53462A586191K7353K3776K0928J8457J6555J5737J6159J7648K0129K3467K7006
53451A813406K9752L1092L1010K9747K7618K5079K2461J9601J6009J1417O029
53440B063221L74m879r162j2415j5157j7846k0457k2842k5336k8501l2390l6322
53428A838288l9327m0619l9980l8051l6124l5275l5667l6867l8577m0746m3093
53417A413962m4904m5355m3987m1019l7261l3537l0055k6594k3196k0267j7848
53406A049939j5344j2246q683n017j312K437N965R067J1902J4751J7688K0709
$$ y = [759193, 789204, 818667, 847540, 876417, 905476, 934476, 963658, 993978, 1026414, 1061575, 1099925, 1141704, 1186438, 1233096, 1280965, 1329913, 1379553, 1428531, 1474936, 1517150, 1554272, 1586191, 1613544, 1637320, 1658248, 1676705, 1693260, 1708997, 1725156, 1742804, 1762933, 1786400, 1813406, 1843158, 1874250, 1905260, 1935007, 1962625, 1987704, 2010165, 2029766, 2045775, 2057192, 2063221, 2063595, 2058716, 2049554, 2037139, 2021982, 2004136, 1983679, 1960837, 1935501, 1907000, 1874610, 1838288, 1798961, 1758342, 1718362, 1680311, 1644187, 1608912, 1573245, 1536378, 1497801, 1457055, 1413962, 1369058, 1323703, 1279716, 1238697, 1201436, 1167899, 1137844, 1111250, 1088054, 1067787, 1049939, 1034595, 1022349, 1013666, 1008649, 1007337, 1009774, 1015739, 1024806, 1036708, 1051459, 1069147, 1089856]
53394A089856K3752K6421K8214K9282L0348L1640L2505L2539L2371L2793L3782
53383A423503L5058L6960M0011M3973M8118N2171N6295O0490O4632O8763P2729
53372B002703P5857P7700P8790Q0005Q1607Q3488Q5917Q9030R1814R2666R1036
53361B930613Q7795Q3948P9723P5080P0507O7000O5483O6160O8140P0019P1166
53350C735634P2245P4139P6675P8834P9639P8185P3241O3645M9031K9753O609
53339D417630j8633m2978o3520p8987q9513r5598r8241r9503j01398j04103j06295
53328C518861j07241j07380j06926j05359j02776j00525r9844j00597j01830j02797
53318B483586j02917j01626r8937r5673r2488q9051q4640p9206p3333o7457o1530
$$ y = [1089856, 1113608, 1140029, 1168243, 1197525, 1227873, 1259513, 1292018, 1324557, 1356928, 1389721, 1423503, 1458561, 1495521, 1535532, 1579505, 1627623, 1679794, 1736089, 1796579, 1861211, 1929974, 2002703, 2078560, 2156260, 2235050, 2315055, 2396662, 2480150, 2566067, 2655097, 2746911, 2839577, 2930613, 3018408, 3102356, 3182079, 3257159, 3327666, 3394666, 3460149, 3526309, 3594449, 3664468, 3735634, 3807879, 3882018, 3958693, 4037527, 4117166, 4195351, 4268592, 4332237, 4381268, 4411021, 4417630, 4398997, 4356019, 4292499, 4213512, 4123999, 4028401, 3930160, 3830657, 3729259, 3625156, 3518861, 3411620, 3304240, 3197314, 3091955, 2989179, 2888654, 2788810, 2688213, 2586383, 2483586, 2380669, 2279043, 2180106, 2084433, 1991945, 1902894, 1818254, 1739048, 1665715, 1598258, 1536728]
53307A536728n5346m8830m2129l5571k9518k4182j9716j6343j4096j2604j1375
53296A227018j0233r143p888o369n005m232l747k918j794r58m10N66K231L842
53282A180960M661M922N510P076R704J2983J6164J8536K0010K1115K2381K3943
53270A347965K5633K7231K8641L0122L2206L5012L7844L9906M1113M1742M1677
53259A729092M0845M0117M0803M3221M6546N0004N3213N5335N4999N1592M5931
53248B251698L9306L2438K5580J8802J1758L838n120j4685k4468l4127m2678m8831
53236B213511n2548n5359n8619o2047o4552o5651o5461o3830o0466n5555m9821
53225A559602m4192l9851l7998l8920m1605m4830m8286n2110n5837n8498n9573
$$ y = [1536728, 1481382, 1432552, 1390423, 1354852, 1325334, 1301152, 1281436, 1265093, 1250997, 1238393, 1227018, 1216785, 1207642, 1199754, 1193385, 1188380, 1184148, 1180401, 1177483, 1175689, 1174731, 1174321, 1174887, 1177118, 1180960, 1185621, 1190543, 1196053, 1203129, 1212833, 1225816, 1241980, 1260516, 1280526, 1301641, 1324022, 1347965, 1373598, 1400829, 1429470, 1459592, 1491798, 1526810, 1564654, 1604560, 1645673, 1687415, 1729092, 1769937, 1810054, 1850857, 1894078, 1940624, 1990628, 2043841, 2099176, 2154175, 2205767, 2251698, 2291004, 2323442, 2349022, 2367824, 2379582, 2383420, 2378300, 2363615, 2339147, 2305020, 2262342, 2213511, 2160963, 2105604, 2046985, 1984938, 1920386, 1854735, 1789274, 1725444, 1664978, 1609423, 1559602, 1515410, 1475559, 1437561, 1398641, 1357036, 1312206, 1263920, 1211810, 1155973, 1097475, 1037902]
53214A037902n9169n7495n4725n1317m7766m4063l9808l4942k9974k5516k1799
53203E71328j8637j5661j2747j0308r014r023r719j0382j0805j1063j1096j0897
53191D31976j0741j0788j0748j0328r774r569r777j0079j0261j0233r786q866
53179C11026p892p328p042o601o091o090o789p696q312q527q220p115n452m235
53165B13636m172m651m454l343k312k175k622k975l174l407l287k306r39l83r97
53150A72439j796j801j176o45m29l67n50j083j573j561j223r88p48j52M97M65
53134A59309l58j350k064k525k586j972j111j030j985k908k680j443j93L89L04
53119A37797j33n09m95k27k58q33j510j691j238l41P75J677J786J094M62O55J304
$$ y = [1037902, 978733, 921238, 866513, 815196, 767430, 723367, 683559, 648617, 618643, 593127, 571328, 552691, 537030, 524283, 513975, 504961, 495938, 486219, 475837, 465032, 453969, 442873, 431976, 421235, 410447, 399699, 389371, 379597, 370028, 360251, 350172, 339911, 329678, 319892, 311026, 303134, 295806, 288764, 282163, 276072, 269982, 263193, 255497, 247185, 238658, 230438, 223323, 217871, 213636, 209464, 204813, 200359, 197016, 194704, 192529, 189907, 186932, 183758, 180351, 177064, 174758, 173819, 173436, 172439, 170643, 168842, 167666, 167021, 166592, 166225, 165675, 164592, 163019, 161458, 160235, 159247, 158499, 158347, 158844, 159309, 158951, 157601, 155537, 153012, 150426, 148454, 147343, 146313, 144328, 141420, 138740, 137297, 137104, 137493, 137797, 137664, 137155, 136660, 136433, 136175, 135342, 133832, 132141, 130903, 130562, 131337, 133014, 134800, 135894, 136356, 137011, 138315]
53102A38315J414P92L25P69J746K256J846R75L27O3j40n22r45j185j261j304j257
53085A42214r69m58J20O02P74L85m29r97q59n25r00j942k523j786k46Q34P64q0
53067A33979q35r83p56p81j324j893j846j183m74p5J04J52k4l38m69l18j76l22
53049A22438p35j235j608j638j345j138j352j703j690j418j448j850k095j903
53035A01280j575j318r25l68k1m3r6q6m87j491k336k142j143m70p27j324j288
53018H5440n06J49j12r85j434j104p52r91j241o44M39Q06J99l88k57J02Mm44p29
52999G7552o87m29j00k6n32j331j667j326q35n26j03N34R18Q31P32Q52P16J03
52981G4676l26j30M7l96o83L49K307L433K832J465P61R48J171P78Nm51k88J33
$$ y = [138315, 139729, 140521, 140846, 141615, 143361, 145617, 147463, 148438, 148765, 148828, 148688, 148166, 147221, 146036, 144775, 143471, 142214, 141245, 140787, 140907, 141509, 142283, 142668, 142239, 141242, 140383, 139858, 138958, 137016, 134493, 132707, 132461, 133295, 134059, 133979, 133144, 132161, 131405, 130624, 129300, 127407, 125561, 124378, 123904, 123829, 123933, 124085, 124061, 123723, 123254, 122936, 122760, 122438, 121703, 120468, 118860, 117222, 115877, 114739, 113387, 111684, 109994, 108576, 107128, 105278, 103183, 101280, 99705, 98387, 97462, 97094, 97073, 97030, 96934, 96848, 96361, 94870, 92534, 90392, 89249, 88779, 88052, 86728, 85440, 84934, 85083, 84971, 83986, 82552, 81448, 80696, 79705, 78464, 77820, 78259, 79065, 79264, 78876, 78619, 78721, 78725, 78281, 77552, 76865, 76436, 76336, 76310, 75778, 74447, 72780, 71454, 70619, 70093, 69990, 70524, 71442, 72273, 73005, 73857, 74573, 74676, 74350, 74220, 74267, 73871, 73188, 73537, 75844, 79277, 82109, 83574, 84335, 85283, 86454, 87232, 87237, 86786, 86498, 86631]
52963H6631L27K53J35m5l93n85j55O57J001O05J77L62R52J444J716J794J619J479
52945I7974J959K955L423K763J774J491J764J807J700K236L461M338L973K555
52931A34173R31j42l60N6N09N61L12M0k87q64j511j743j298n03p1n62j706k421
52913A25114j886o20N0m01j285j920k258k182j269K06J070Q04L43N81R64N43l92
52896A17462r05r77j256j714j764j409j096o69L70J627K052J474Q10O17M50j07
52880A14965o36n66KM42K52m97j056m94J158K589K570J411L75K1j1Q4M98J024
52862A22131J156J021J258J842J977J422Q73P31M20n84j768k220j749j008p73
52847A24729j345k262k539j721n89k45n74n29R1K23p07j700j540n01J72r7p61
$$ y = [86631, 86958, 87211, 87346, 87301, 86908, 86323, 86168, 86825, 87826, 88431, 88608, 88970, 89922, 91366, 93082, 94876, 96495, 97974, 99933, 102888, 106311, 109074, 110848, 112339, 114103, 115910, 117610, 119846, 123307, 127645, 131618, 134173, 135104, 134962, 134602, 134658, 135167, 135728, 136040, 136080, 135793, 134929, 133418, 131675, 130377, 129874, 129803, 129241, 127535, 125114, 123228, 122608, 122658, 122257, 120972, 119052, 116794, 114612, 113343, 113549, 114619, 115423, 115766, 116347, 117311, 117854, 117462, 116557, 115580, 114324, 112610, 110846, 109437, 108341, 107672, 108042, 109669, 111721, 113195, 114005, 114622, 115072, 114965, 114329, 113763, 113765, 114207, 114459, 113962, 112906, 112412, 113570, 116159, 118729, 120140, 120515, 120536, 120525, 120609, 121107, 122131, 123287, 124308, 125566, 127408, 129385, 130807, 131680, 132411, 132831, 132247, 130479, 128259, 126510, 125502, 124729, 123384, 121122, 118583, 116862, 116273, 116028, 115454, 114925, 115016, 115239, 114532, 112832, 111292, 110791, 110963, 110866, 110105]
52830A10105j028o37R4N33K75l40n07J4O04P57P30Q49Q19L34j42P5Q09J272J203
52811A15819J036J038R04M45j7j15R1K74J70m36j561k657k824j816n82l50j197
52794A08222k044k031j475j250j665k292k634k545k109j531j132j040r15l40N30
52779H5749J081J011N54q4r73j957k479k199j469q79o81q48j271j611j442r00
52763G1602o81j031j292r33m57n39q12l31R07J885K023J844K036K490K592K017
52747H1320R43k25j158j759k165k468k561k360j972j484q37k05j08o73j181q64
52731F2243L7O08M76J02n5m6n2j02j93k94k15J39L49j67j318k335k601k139j231
52712E3206p9J079J887K147J967J571J131P02K24l96r87j107n79J35M52L23J44
$$ y = [110105, 109077, 108440, 108534, 109067, 109342, 109002, 108495, 108509, 109113, 109870, 110600, 111449, 112268, 112602, 112460, 112535, 113344, 114616, 115819, 116855, 117893, 118797, 119242, 119225, 119110, 119201, 119475, 119645, 119209, 117648, 114991, 112167, 110351, 109769, 109419, 108222, 106178, 104147, 102672, 101422, 99757, 97465, 94831, 92286, 90177, 88646, 87514, 86474, 85559, 85219, 85749, 86830, 87841, 88395, 88311, 87338, 85381, 82902, 80703, 79234, 78355, 77674, 76826, 75555, 73944, 72502, 71602, 70921, 69890, 68598, 67665, 67208, 66669, 65857, 65526, 66433, 68318, 70341, 72185, 74221, 76711, 79303, 81320, 82263, 82038, 80880, 79121, 76956, 74488, 71927, 69567, 67595, 66111, 65274, 65069, 64961, 64288, 63107, 62243, 62280, 62888, 63364, 63466, 63411, 63365, 63313, 63211, 63018, 62724, 62509, 62648, 62997, 62830, 61512, 59177, 56576, 54437, 53206, 53127, 54206, 56093, 58240, 60207, 61778, 62909, 63611, 63835, 63439, 62452, 61345, 60766, 60901, 61353, 61676, 61820]
52695F1820J88M80J013J699K227K313J953J258L28n31p96l68J76K92J02m2j15
52678G1997j12K65J093J847K134K254K428K139J035m7k3R07J705K071K455K803
52662I4951K553J817J354J308J111P38Q80J617K177K369L122M880O370N851L090
52647A34188m94l280m602m822m715m698m538l891k961k256j858j523j293j372
52633I1885j542j440j270j535k039k043j377o34j97O0J83P6Q9O61J309J083Q8
52616H3357n35m43n90j485k098j382J09J027R65N53K99K34L94Q66J467J751J414
52599H5903N31l92p16l31J3l83j083j064k52L84L49K77P14J232J259R15N81K80
52581H8217j9q0K37P76J436K127K296J392l8o71j74L60J23l64m07k45k77j75L49
$$ y = [61820, 62008, 62488, 63501, 65200, 67427, 69740, 71693, 72951, 73279, 72748, 71952, 71584, 71760, 72052, 72154, 72112, 71997, 71885, 72150, 73243, 75090, 77224, 79478, 81906, 84045, 85080, 85033, 85010, 85917, 87622, 89693, 92148, 94951, 97504, 99321, 100675, 101983, 103094, 103832, 104712, 106329, 108506, 110875, 113997, 118877, 125247, 131098, 134188, 133694, 130414, 125812, 120990, 116275, 111577, 107039, 103148, 100187, 97931, 96073, 94550, 93257, 91885, 90343, 88903, 87633, 86098, 84059, 82016, 80639, 80005, 79808, 79868, 80051, 80127, 80216, 80877, 82186, 83269, 83357, 82822, 82379, 81789, 80304, 78206, 76824, 76933, 77960, 78925, 79478, 79777, 80011, 80405, 81271, 82738, 84489, 85903, 86434, 86042, 85326, 84995, 85008, 84625, 83542, 82478, 82226, 82610, 82959, 83236, 83950, 85182, 86441, 87356, 87937, 88217, 88198, 88118, 88355, 89131, 90567, 92694, 94990, 96382, 96344, 95673, 95499, 95859, 95982, 95618, 95211, 94966, 94689, 94514, 94863]
52562I4863P94P16N47P38Q34L25k78k04L09M83K23nj37m46p86q03n83m57m24m05
52542I5304o73j278j493o68P36J698J908J730J275M34m29p11m88m39q26j205j156
52525I3719p62l53k24n16r36q55p6P18P19M4n03m43K2M43M74j5p28j070q35m68
52505H8355l20j10M26Q15M31n07j173j111m97K85Q67R09M80J02R0R0k29n10k58
52486H8135L94R91J450J801J744J093L70K05M61O21O90R55J205R71L90K3j1n0
52468A01438j57q6J28K72M97J003J335P89m24j202r06k6O60R39J001R51Q21P01
52450A07734N67K79j10k94j24R7o9o14r59n11N86J449J399P36K35J18M6r2j02
52431A10371j48n82j022n86O94J685J727J377J117M67p55j497q14N60J217R81
$$ y = [94863, 95657, 96373, 96920, 97658, 98492, 98817, 98539, 98335, 98644, 99127, 99350, 99345, 99208, 98762, 97976, 97173, 96590, 96133, 95709, 95304, 94631, 93353, 91860, 91192, 91928, 93626, 95534, 97264, 98539, 98973, 98544, 97833, 97345, 96906, 96080, 94875, 93719, 92957, 92604, 92380, 91864, 90928, 90073, 89997, 90715, 91434, 91478, 90975, 90532, 90554, 90997, 91471, 91456, 90728, 89658, 88823, 88355, 88035, 87925, 88351, 89166, 89597, 89090, 87917, 86806, 86309, 86594, 87461, 88370, 88850, 88952, 89042, 89132, 88903, 88393, 88135, 88529, 89520, 90970, 92771, 94515, 95608, 95978, 96183, 96644, 97265, 97955, 98910, 100115, 101086, 101476, 101499, 101488, 101438, 101281, 101195, 101323, 101595, 102092, 103095, 104430, 105219, 104795, 103593, 102687, 102661, 103321, 104260, 105261, 106212, 107033, 107734, 108301, 108580, 108470, 108176, 108052, 108149, 108080, 107466, 106507, 105996, 106582, 108031, 109430, 110166, 110401, 110519, 110565, 110473, 110371, 110223, 109641, 108619, 108033, 108727, 110412, 112139, 113516, 114633, 115100, 114345, 112848, 112034, 112594, 113811, 114792]
52415A14792P15P35O07J93k14n43q67q94m28L7k4k80j97j08n81j154r00L7O40
52396A11566N92M98O37O54N10O30R85R84M68j31n73q98p77K10J530J943J034l30
52378A19532j178j275p74M7N77L34j92K0J010J643J168J70l04J14J046J828J880
52361A25646J134K65n5L3M9K02R36J704J393N0r51p60j0M52O75J007J253J146
52343A34169R22Q69Q24O03M63O67J053J257J112O42J26J25R29J927K224J793J311
52326A51016R39K38o53q64j43O45Q19P87J114J551J635J528J584J630J395J127
52310A64348J234J633J926J994J997K092K421L071L826M309M460M523M527M349
52296B06710M289M894O043O901P057P000P219P567P822Q168Q642Q821Q558Q377
$$ y = [114792, 115507, 116242, 116849, 117042, 116828, 116285, 115418, 114524, 114096, 114133, 114109, 113829, 113632, 113524, 112943, 111789, 110889, 110926, 111566, 112158, 112656, 113293, 113947, 114457, 115087, 116072, 117056, 117524, 117393, 116820, 115922, 115145, 115355, 116885, 118828, 119862, 119532, 118354, 117079, 116305, 116352, 116929, 117263, 117071, 117091, 118101, 119744, 120912, 121082, 120778, 120892, 121938, 123766, 125646, 126780, 127045, 126990, 127023, 127072, 127274, 128210, 129914, 131307, 131357, 130406, 129646, 129636, 130088, 130763, 131770, 133023, 134169, 135091, 135960, 136784, 137387, 137850, 138517, 139570, 140827, 141939, 142581, 142707, 142832, 143761, 145688, 147912, 149705, 151016, 151955, 152193, 151540, 150676, 150533, 151178, 151997, 152784, 153898, 155449, 157084, 158612, 160196, 161826, 163221, 164348, 165582, 167215, 169141, 171135, 173132, 175224, 177645, 180716, 184542, 188851, 193311, 197834, 202361, 206710, 210999, 215893, 221936, 228837, 235894, 242894, 250113, 257680, 265502, 273670, 282312, 291133, 299691, 308068]
52282C08068Q675R076R115R042R352R928J0220J0057R738R610R860J0508J1275
52269D34524J1688J1525J0950J0157R277Q651Q631Q897Q589P412O084N324M950
52256E46659M365L500K825K640K758K750K301J467O48J56p3j53J02O89J012N39
52240E72185l27q41j069j440j504l32J784L408L980M465N481O229O037N785O678
52225F10519Q437R707R751Q956Q136P979Q687R619R786R118Q560Q512Q118O763
52211G32648N243M520M192L289J934J036P22K90n61j449k147k840l595m319n114
52196G33849o043o753o957p017p387p848p962p906q110q353q101p499p184p282
52182F29447p352p227p157p116o811o313n971n717n112m175l455l297l484l649
$$ y = [308068, 316743, 325819, 334934, 343976, 353328, 363256, 373476, 383533, 393271, 402881, 412741, 423249, 434524, 446212, 457737, 468687, 478844, 488121, 496772, 505403, 514300, 522889, 530301, 536385, 541709, 546659, 551024, 554524, 557349, 559989, 562747, 565497, 567798, 569265, 569913, 570069, 569996, 569843, 569945, 570634, 571646, 572185, 571858, 571017, 569948, 568508, 567004, 566672, 568456, 571864, 575844, 580309, 585790, 592019, 598056, 603841, 610519, 618956, 628663, 638414, 647370, 655506, 663485, 672172, 681791, 691577, 700695, 709255, 717767, 725885, 732648, 737891, 742411, 746603, 749892, 751826, 752862, 753584, 753874, 753313, 751864, 749717, 746877, 743282, 738963, 733849, 727806, 721053, 714096, 707079, 699692, 691844, 683882, 675976, 667866, 659513, 651412, 643913, 636729, 629447, 622095, 614868, 607711, 600595, 593784, 587471, 581500, 575783, 570671, 566496, 563041, 559744, 556260, 552611]
52168E52611l468k643j294k65l55j242j872j829j640j683j641j272r46j078j538
52153E29845j944k091j891j341q43j010j831k450k194j514j393k074k796k832
52139E03641k350k140k704l757m525m471l760l065k958l405l912m175m433n014
52125D52972n627n584m793m027l883l909l326k266j553j435j322q67m45l56k93
52110D13286N8M51N57N16O49J012J515K112K633K825K794K978L452L808L960M442
52094D47048N550O779P524P855Q215Q805R632J0693J1733J2295J2367J2488J2930
52081E73914J3408J3882J4783J5907J6083J4710J2917J2206J2560J2826J2522
52070G25718J2172J2063J1761J0836R309P396N478M143L612L249K304R19k40j087
$$ y = [552611, 549143, 546500, 545206, 544941, 544586, 543344, 541472, 539643, 538003, 536320, 534679, 533407, 532461, 531383, 529845, 527901, 525810, 523919, 522578, 521735, 520725, 518894, 516444, 514250, 512736, 511343, 509269, 506473, 503641, 501291, 499151, 496447, 492690, 488165, 483694, 479934, 476869, 473911, 470506, 466594, 462419, 457986, 452972, 447345, 441761, 436968, 432941, 429058, 425149, 421823, 419557, 418004, 416569, 415247, 414380, 413935, 413579, 413286, 413344, 413795, 414352, 414868, 415517, 416529, 418044, 420156, 422789, 425614, 428408, 431386, 434838, 438646, 442606, 447048, 452598, 459377, 466901, 474756, 482971, 491776, 501408, 512101, 523834, 536129, 548496, 560984, 573914, 587322, 601204, 615987, 631894, 647977, 662687, 675604, 687810, 700370, 713196, 725718, 737890, 749953, 761714, 772550, 781859, 789255, 794733, 798876, 802488, 805737, 808041, 808960, 808720, 807633]
52056H07633k061l219m234n139o220p257p712p639p615p723p471o857o572o890
$$ y = [807633, 805572, 802353, 798119, 792980, 786760, 779503, 771791, 764152, 756537, 748814, 741343, 734486, 727914, 721024]
$$ [...]
##END NTUPLES=NMR SPECTRUM
##END=
