##TITLE=NES1050_10427_9270609_61D8CKfaId
##JCAMPDX= 6.0         $$ Bruker NMR JCAMP-DX V2.0
##DATA TYPE= NMR SPECTRUM
##DATA CLASS= NTUPLES
##ORIGIN= BRUKER
##OWNER= Administrator
$$ 1.72 TOPSPIN		Version 2.1
$$ 2015-08-24 13:11:58.936 -0700  Administrator@X
$$ Compression mode = diff/dup
##.OBSERVE FREQUENCY= 400.02188249412
##.OBSERVE NUCLEUS= ^1H
##.ACQUISITION MODE= SIMULTANEOUS (DQD)
##.ACQUISITION SCHEME= undefined
##.AVERAGES= 8
##.DIGITISER RES= 22
##SPECTROMETER/DATA SYSTEM= spect
##.PULSE SEQUENCE= zg30
##.SOLVENT NAME= COFFEE_meoh
##.SHIFT REFERENCE= INTERNAL, COFFEE_meoh, 1, 14.98509
##AUDIT TRAIL= $$ (NUMBER, WHEN, WHO, WHERE, PROCESS, VERSION, WHAT)
$$ ##TITLE= Audit trail, TOPSPIN		Version 2.1
$$ ##JCAMPDX= 5.01
$$ ##ORIGIN= Bruker BioSpin GmbH
$$ ##OWNER= Administrator
$$ $$ E:\/data/COFFEE/nmr/NES1050_10427_9270609_61D8CKfaId/40/pdata/1/auditp.txt
$$ ##AUDIT TRAIL=  $$ (NUMBER, WHEN, WHO, WHERE, PROCESS, VERSION, WHAT)
(   1,<2015-08-24 13:11:51.420 -0700>,<Administrator>,<X>,<go>,<TOPSPIN 2.1>,
      <created by zg
	started at 2015-08-24 13:10:45.670 -0700,
	POWCHK enabled, PULCHK disabled,
       configuration hash MD5:
       21 0F 79 D6 B3 7B B4 F6 88 20 88 DB 03 48 BD 9F
       data hash MD5: 64K
       40 4F 64 2C 9A 78 75 C6 D6 D4 D9 CD 9B 97 32 32>)
(   2,<2015-08-24 13:11:54.858 -0700>,<Administrator>,<X>,<proc1d>,<TOPSPIN 2.1>,
      <Start of raw data processing
       efp LB = 0 FT_mod = 6 PKNL = 1 PHC0 = 0 PHC1 = 0 SI = 32K 
       data hash MD5: 32K
       40 21 11 AA 69 D5 27 E5 69 46 3C BC 2B 69 EB A5>)
(   3,<2015-08-24 13:11:55.139 -0700>,<Administrator>,<X>,<proc1d>,<TOPSPIN 2.1>,
      <pk PHC0 = 94.78455 PHC1 = 0 
       data hash MD5: 32K
       69 EB ED 9D C3 E7 7F 9E 86 63 26 9B 37 C6 96 8E>)
(   4,<2015-08-24 13:11:55.248 -0700>,<Administrator>,<X>,<proc1d>,<TOPSPIN 2.1>,
      <abs ABSG = 1 
       data hash MD5: 32K
       DB 42 29 A0 A7 AA 30 2E E8 E2 54 E2 50 06 24 FD>)
(   5,<2015-08-24 13:11:55.311 -0700>,<Administrator>,<X>,<proc1d>,<TOPSPIN 2.1>,
      <abs ABSG = 2 
       data hash MD5: 32K
       FC BD D3 0A 53 EA DF 07 87 A4 6D E0 57 54 C4 92>)
(   6,<2015-08-24 13:11:55.373 -0700>,<Administrator>,<X>,<proc1d>,<TOPSPIN 2.1>,
      <abs ABSG = 3 
       data hash MD5: 32K
       B7 E9 BF 00 8C 22 B9 77 B4 A8 EA BF B1 1C 41 12>)
(   7,<2015-08-24 13:11:55.436 -0700>,<Administrator>,<X>,<proc1d>,<TOPSPIN 2.1>,
      <abs ABSG = 4 
       data hash MD5: 32K
       50 9E ED 15 C9 7B 00 F7 8A 0D 4B 66 C4 98 83 A2>)
(   8,<2015-08-24 13:11:55.514 -0700>,<Administrator>,<X>,<proc1d>,<TOPSPIN 2.1>,
      <abs ABSG = 5 
       data hash MD5: 32K
       33 6E 1F E8 25 C8 FE 80 81 19 2A F8 2E 4E E4 17>)
$$ ##END=
$$ 
$$ $$ hash MD5
$$ $$ 4D E4 EC 2A A0 7F 29 C6 5A 93 78 DC 75 DB FA 08
##$RELAX= 
##$RELAX= 
##$RELAX= 
##$RELAX= 
##$RELAX= 
##$RELAX= 
##$RELAX= 
$$ Bruker specific parameters
$$ --------------------------
##$DU= <E:\>
##$EXPNO= 40
##$NAME= <NES1050_10427_9270609_61D8CKfaId>
##$PROCNO= 1
$$ [...]
150 150 150 150 150 150 150 150
##$TP07= 0
##$TPNAME0= <>
##$TPNAME1= <>
##$TPNAME2= <>
##$TPNAME3= <>
##$TPNAME4= <>
##$TPNAME5= <>
##$TPNAME6= <>
##$TPNAME7= <>
##$TPOAL= (0..7)
0.5 0.5 0.5 0.5 0.5 0.5 0.5 0.5
##$TPOFFS= (0..7)
0 0 0 0 0 0 0 0
##$TUNHIN= 0
##$TUNHOUT= 0
##$TUNXOUT= 0
##$USERA1= <user>
##$USERA2= <user>
##$USERA3= <user>
##$USERA4= <user>
##$USERA5= <user>
##$V9= 5
##$VALIST= <valist>
##$VCLIST= <CCCCCCCCCCCCCCC>
##$VD= 0
##$VDLIST= <DDDDDDDDDDDDDDD>
##$VPLIST= <PPPPPPPPPPPPPPP>
##$VTLIST= <TTTTTTTTTTTTTTT>
##$WBST= 2048
##$WBSW= 25
##$XGAIN= (0..3)
0 0 0 0
##$XL= 0
##$YL= 0
##$YMAX_a= 553903
##$YMIN_a= -463505
##$ZGOPTNS= <>
##$ZL1= 120
##$ZL2= 120
##$ZL3= 120
##$ZL4= 120
##$ABSF1= 14.98509
##$ABSF2= -5.573092
##$ABSG= 5
##$ABSL= 3
##$ALPHA= 0
##$AQORDER= 0
##$ASSFAC= 0
##$ASSFACI= 0
##$ASSFACX= 0
##$ASSWID= 0
##$AUNMP= <proc_prof1d_extract_pilot.lims>
##$AXLEFT= 0
##$AXNAME= <>
##$AXNUC= <1H>
##$AXRIGHT= 0
##$AXTYPE= 0
##$AXUNIT= <>
##$AZFE= 0.1
##$AZFW= 0.1
##$BCFW= 0
##$BC_mod= 0
##$BYTORDP= 0
##$COROFFS= 0
##$CY= 15
##$DATMOD= 1
##$DC= 0
##$DFILT= <>
##$DTYPP= 0
##$F1P= 0
##$F2P= 0
##$FCOR= 0.5
##$FTSIZE= 32768
##$FT_mod= 6
##$GAMMA= 0
##$GB= 0
##$INTBC= 1
##$INTSCL= 1
##$ISEN= 128
##$LB= 0
##$LEV0= 0
##$LPBIN= 0
##$MAXI= 10000
##$MC2= 0
##$MEAN= 0
##$ME_mod= 0
##$MI= 0
##$NCOEF= 0
##$NC_proc= -8
##$NLEV= 6
##$NOISF1= 0
##$NOISF2= 0
##$NSP= 0
##$NTH_PI= 0
##$NZP= 0
##$OFFSET= 14.98509
##$PC= 1
##$PHC0= 94.78455
##$PHC1= 0
##$PH_mod= 1
##$PKNL= yes
##$PPARMOD= 0
##$PPDIAG= 0
##$PPIPTYP= 0
##$PPMPNUM= 2147483647
##$PPRESOL= 1
##$PSCAL= 4
##$PSIGN= 0
##$PYNMP= <proc.py>
##$REVERSE= no
##$SF= 400.02
##$SI= 32768
##$SIGF1= 0
##$SIGF2= 0
##$SINO= 400
##$SIOLD= 32768
##$SPECTYP= <>
##$SREGLST= <1H.CDCl3>
##$SSB= 0
##$STSI= 32768
##$STSR= 0
##$SW_p= 8223.68421052631
##$SYMM= 0
##$S_DEV= 0
##$TDeff= 65536
##$TDoff= 0
##$TI= <>
##$TILT= no
##$TM1= 0
##$TM2= 0
##$TOPLEV= 0
##$USERP1= <user>
##$USERP2= <user>
##$USERP3= <user>
##$USERP4= <user>
##$USERP5= <user>
##$WDW= 1
##$XDIM= 32768
##$YMAX_p= 434293816
##$YMIN_p= -785956
##$CURPLOT= <Network HP LaserJet P1505>
##$CURPRIN= <$Network HP LaserJet P1505>
##$DFORMAT= <normdp>
##$LAYOUT= <+/1D_H.xwp>
##$LFORMAT= <normlp>
##$PFORMAT= <normpl>
##$SURQMSG= 1
$$ End of Bruker specific parameters
$$ ---------------------------------
##NTUPLES= NMR SPECTRUM
##VAR_NAME=  FREQUENCY,     SPECTRUM/REAL,   SPECTRUM/IMAG
##SYMBOL=    X,             R,               I
##VAR_TYPE=  INDEPENDENT,   DEPENDENT,       DEPENDENT
##VAR_FORM=  AFFN,          ASDF,            ASDF
##VAR_DIM=   32768,         32768,           32768
##UNITS=     HZ,            ARBITRARY UNITS, ARBITRARY UNITS
##FACTOR=    0.250966925370066, 1,           1
##FIRST=     8223.43324360094, -3583,        -239192
##LAST=      0,             -41310,          -63739
##MIN=       0,             -785956,         0
##MAX=       8223.43324360094, 434293816,    0
$$ Real data points
##PAGE= N=1
##DATA TABLE= (X++(R..R)), XYDATA
$$ [...]
19505a00716F4911h4527q8621M5667k34956J63625f810m28451b08068J03565n7279
19494a61782H7735d7461m1866E8973a03700j34807I0006c15756B58293a7059o1036
19483g8095l8016K4485j19015R4692q2604F1159B122a80560o8629e8954j65221
19472b24175E1414J15239G4855R8474a79368D2483a60786A33218a96639a2511
19461a9342j1718j52095A62262h9403b3841j8208B11870d98315g3714m1661k44964
19450c60339a37409j43428C9747J30453G0879f154j06717d8257g253r4643r8564
19439b00460R4336m22967b7722C03561e3037o7798A99120A9303a87140b9826j07530
19428a37356A61464d18753b5240B6956Q4559A8390a64300g5309G1753a27903k08897
$$ y = [-100716, 64911, -84527, -173148, -127481, -362437, -198812, -6810, -435261, -208068, -104503, -161782, 87735, -47461, -89327, 58973, -103700, -238507, 90006, -315756, 258293, -17059, -78095, -116111, -91626, -210641, -115949, -198553, 61159, 2122, -180560, -249189, -58954, -224175, 51414, 166653, 74855, 173329, -179368, 42483, -160786, 133218, -196639, -12511, -19342, -31060, -183155, 162262, -89403, -23841, -42049, 211870, -498315, -73714, -115375, -360339, -137409, -280837, 39747, 170200, 70879, -6154, -112871, -48257, -7253, -101896, -200460, -106124, -529091, -27722, 303561, -53037, -120835, 199120, 19303, -187140, -29826, -137356, 161464, -418753, -25240, 26956, 111515, 18390, -164300, -75309, 71753, -127903, -336800]
19417c36800L423p6031a69107O3331j59505A81618q9926c91k75332a3295m76400
19406d89695b25969j40537A09342a29129l5859N3053A358J46148a15147M5465
19396f9682o5250j9436A59033N6075b73567h8281A95986A5905J38470K0443a30232
19384c43364L8463A08296a12314p3389B45510b92686B37124a06628A62964J3421
19374A76385i7719F153M5380b95018G2769a32488A43786b3444A32894c33040A26914
19362c80899a67286c0372j47301n6016j09278A64009q1996m0201b94591g7252
19351C1207a13802k80890B31598e032q5085k84523h6213r6005e8003m3237A80771
19339c17456J52076m5519A90072b57975l4669j20796F0631a7272r6758A37886
$$ y = [-336800, -333377, -409408, -169107, -105776, -265281, 181618, 91692, -391, -275723, -13295, -489695, -225969, -366506, 109342, -129129, -164988, -111935, 1358, 147506, -115147, -69682, -134932, -154368, 159033, 215108, -273567, -88281, 195986, 15905, 154375, 174818, -130232, -343364, -304901, 108296, -112314, -185703, 245510, -292686, 237124, -106628, 162964, 176385, -97719, 6153, 51533, -295018, 72769, -132488, 143786, -23444, 132894, -333040, 126914, -380899, -167286, -30372, -177673, -233689, -342967, 164009, 82013, 41812, -294591, -77252, 31207, -113802, -394692, 231598, -5032, -90117, -374640, -86213, -182218, -58003, -101240, 180771, -317456, -165380, -210899, 190072, -257975, -292644, -413440, 60631, -17272, -114030, 137886]
19328b0426m1936D5361J13388f7008j13654D6551a2954j07637p8221c3557A05053
19316A1380b74396f4049j30192N5669A45170E1098c36297b6484l1290j47934A96791
19304G5808e0594k41331a95j28420q78j52397A50599a38443B1912J2317f2122
19292H2943b23391O642R4282K0684b5786I0515a93321k6225M3638n4656P4054
19281a56510f1356j13964L4142i944M551k37592B88530b01410i9570E5056L2732
19270H7788b63284J19063J2827c297l7403j39274o288G2858J76848f9923r8191
19259a68114E5530e1894m9264p6918D7008c35777C6079a6105j03210A95034a76975
19247C1136J9255d6306G8899d2560A21566g7489k15958J21963O7180c6557l1141
$$ y = [-20426, -62362, 45361, 158749, -67008, -180662, 46551, -12954, -120591, -198812, -33557, 105053, 11380, -274396, -64049, -194241, -138572, 145170, 51098, -336297, -26484, -57774, -205708, 196791, 75808, -50594, -291925, -195, -128615, -129493, -281890, 150599, -138443, 21912, 34229, -62122, 82943, -223391, -216749, -122467, -101783, -25786, 90515, -193321, -219546, -175908, -230564, -156510, -61356, -175320, -141178, -9944, -5393, -242985, 288530, -201410, -99570, 55056, 87788, -263284, -144221, -131394, -3297, -40700, -179974, -186262, 72858, 249706, -69923, -168114, 55530, -51894, -101158, -178076, 47008, -335777, 36079, -16105, -119315, 195034, -176975, 31136, 50391, -46306, 78899, -42560, 121566, -77489, -293447, -171484, -104304, -36557, -67698]
19236f7698p077C8630P7357a45483O6157h279o3070a8361B95671b64578H0274
19224b1461A97254H4367K4048b75282C16684A53028k3846J6720q598d2601E3941
19212a14133j19324B61000c4612A34349h9834E8048b31468A09696b38783O0460
19202a78323M7831b5991F3071g9371A88507J83867e6572f781A01907l140A23e4691
19189b55753B85541c54320a67049J1445l7905A90935d787F8333a67181M9818l4361
19178a51724E4756c72595A35905c36043c1363k41547a27698d243B3137c9142a1445
19166f2123q7610j27414M3060A02406a623F5397b20631Q4055d4334B74835m3820
19155B31015a7961A39701a01388j99312c629A23169a46108l6378j16960c953C7605
$$ y = [-67698, -74775, 38630, 115987, -145483, -79326, -8279, -71349, -18361, 295671, -264578, 80274, -21461, 197254, 84367, 108415, -275282, 316684, 153028, 129182, 145902, 137304, -42601, 53941, -114133, -233457, 261000, -34612, 134349, -89834, 58048, -231468, 109696, -238783, -178323, -130492, -25991, 63071, -79371, 188507, 372374, -56572, -6781, 101907, 98767, 123, -54691, -255753, 285541, -354320, -167049, -155604, -193509, 190935, -4787, 68333, -167181, -117363, -151724, 54756, -372595, 135905, -336043, -31363, -272910, -127698, -4243, 23137, -39142, -11445, -62123, -149733, -277147, -234087, 102406, -1623, 65397, -220631, -136576, -44334, 274835, 231015, -17961, 139701, -101388, -300700, -3629, 123169, -146108, -182486, -299446, -3953, 37605]
19143B23156j06777b47134f6257j26709B20340k0503F5563h9126o364A76515e3799
19131A64234A5137a78975R239e8085B01711c80584a66332d4288G6492j7639a46808
19119a905j75859j42886a08368k8277K1764K2433B2239a61129K749m5316d5670
19107b47310A4254K09803a29786A98206H638J99795A6291l119c01031a21669M4578
19096g7091j09185e6254B63926A0679J3814a20020G1694g1927k11008A53408J35918
19085B89326A11331b37333l3299q750o6447J52155c4710j24710A7437Q1750N5297
19074A54484e0640A24995a91871d6488k16498H0923c8869F6471g5011A22507b61887
19062a14677m7716c3389Q499n2060A8382b49940K2736O5096A39983e9885K0326
$$ y = [223156, 116379, -247134, -66257, -192966, 220340, 199837, 65563, -89126, -95490, 176515, -53799, 164234, 15137, -178975, -169736, -58085, 201711, -380584, -166332, -44288, 76492, 58853, -146808, -1905, -177764, -320650, -108368, -136645, -114881, -92448, 22239, -161129, -158380, -203696, -45670, -247310, 14254, 224057, -129786, 198206, 8638, 208433, 16291, 13172, -301031, -121669, -77091, -186276, -56254, 263926, 10679, 24493, -120020, 71694, -71927, -282935, 153408, 289326, 111331, -237333, -270632, -279382, -345829, -193674, -34710, -159420, 17437, 99187, 154484, -50640, 124995, -191871, -46488, -262986, 80923, -38869, 66471, -75011, 122507, -261887, -114677, -162393, -33389, -24890, -76950, 18382, -249940, -227204, -162108, 139983, -59885, -39559]
19051c9559j28079Q3384L7209D7078J20270r458f0969C28684c41616G191a41491
19039c58462c2611A7155i1552q0075g5391f539q1255G5533i5547k38539f4366
19027a50565b8763B81386I6972B7644c43247f8472J7283j9181j37901C215a61130
19015a97784d8491C34057a92382A28446k6472J86072d1381k51183A29737b30107
19004B58844i6769a8487l23514C29944A34083n6187l4607b75769D2105j5521c29020
18992G5e023j5437j98891A55550J48039n2643c2497j34706B11629P0040a89090
18980a84084j23546A14437H644a79947N7359m4939Q0202I1357h3859A43383J59046
18969C02429K5115Q9391a3529k6367E3663P0939Q578a18506a6351n969E8412c5264
$$ y = [-39559, -167638, -84254, -47045, 47078, 167348, 157890, -60969, 328684, -341616, 7191, -141491, -358462, -32611, 17155, -91552, -171627, -75391, -6539, -87794, 75533, -95547, -334086, -64366, -150565, -28763, 281386, 96972, 27644, -343247, -68472, -51189, -70370, -208271, 3215, -161130, -197784, -48491, 334057, -192382, 128446, 101974, 288046, -41381, -292564, 129737, -230107, 258844, -96769, -18487, -342001, 329944, 134083, 77896, 43289, -275769, 42105, 26584, -329020, 75, -5023, -20460, -219351, 155550, 303589, 250946, -32497, -167203, 211629, 281669, -189090, -184084, -307630, 114437, 8644, -179947, -122588, -167527, -87325, 91357, -83859, 143383, 302429, 327544, 416935, -13529, -39896, 53663, 124602, 133180, -118506, -16351, -22320, 58412, -35264]
18956A06919b8099j37902A28976b33824d1267B35877a22755l1178r7805A7023
18945a29397l7105P6856k6691j21411B8510K04492f2072A8473b94907n6761h1218
18933I3842a18819B7707J82022a29189k36835D42159A60729K6995b00489f0121
18922C6609a15262N2831j24671D03874C2998i3211j79696J8487b7666A57845o3995
18911I3850a41669C9569d4865E7387M51304j14875P7631I451K09175D184b40677
18899b35074B8414i2449j72858e4311j1429i008j98918Q2557J9678j0653A61210
18887d7234F8100b37946e8376G1119a150k5432A42728d86462F6939c2604d581
18875d09243f0790k03235E5246j6661i7539B59448D1112c24454b0325A04525a41854
$$ y = [106919, -28099, -166001, 128976, -233824, -41267, 235877, -122755, -153933, -251738, 17023, -129397, -166502, -89646, -116337, -237748, 28510, 233002, -62072, 18473, -294907, -351668, -81218, 93842, -118819, 27707, 209729, -129189, -366024, 442159, 160729, 187724, -200489, -60121, 36609, -115262, -62431, -187102, 403874, 32998, -93211, -272907, -254420, -27666, 157845, 93850, -141669, 39569, -44865, 57387, 508691, 393816, 471447, 9451, 218626, 4184, -240677, -235074, 28414, -92449, -265307, -54311, -65740, -9008, -207926, -125369, -105691, -116344, 161210, -47234, 68100, -237946, -58376, 71119, -1150, -26582, 142728, -486462, 66939, -32604, -4581, -409243, -60790, -264025, 55246, 38585, -97539, 259448, 41112, -324454, -20325, 104525, -141854]
18863A5525K58329d5808L485j22968k1061J4122c830E9979a40688J0670O3379
18852f6639m4318e3568j2527A32637j421K0441a01858B06192A4686A177a19221
18840b75342p701d2985C0547L1923R0827a11893A25032b68247N1034A88769a9992
18828c1224H8024a4889H3396l8022a45472B10155g7058B98200l9196J24261a22755
18816B36733B3842L5242a4966B14009H0852j9982a07429d0773a0718A48672O4214
18805B12886a03727B9854a64252b8166l34640a42446b8981B81896F4624a82652
18794b22349B12416A1579e965j82551c6261I5809b21092h5092D7690c29086A73504
18782i2156j86867G1249a06154B22776a44914A36412l6612b58086a25208c8343
$$ y = [15525, 273854, -45808, -42323, -165291, -186352, -172230, -3830, 59979, -140688, -130018, -66639, -110957, -53568, -66095, 132637, 131216, 151657, -101858, 206192, 14686, 1177, -119221, -275342, -283043, -42985, 30547, 62470, 153297, -111893, 125032, -268247, -217213, 188769, -19992, -31224, 88024, -14889, 83396, 45374, -145472, 210155, -77058, 298200, 259004, 383265, -122755, 236733, 23842, 59084, -14966, 214009, 80852, 60870, -107429, -40773, -10718, 148672, 212886, -103727, 29854, -164252, -28166, -362806, -142446, -28981, 281896, 64624, -182652, -222349, 212416, 11579, -5965, -188516, -36261, 95809, -221092, -85092, 47690, -329086, 173504, -92156, -279023, 71249, -106154, 222776, -144914, 136412, 99800, -258086, -125208, -38343]
18771b08278Q0729B126R0404R937a8556o3686j12545o5581e0520m305J5741H9374
18758c69119a37799k07748n0720A27140a27230j67200a3309H483K1804a14620
18747E7316d01533A53898i6752p6960p0141E8698a22577L8831M77o6071r4547
18736b43887O2382A08561c35468i4382M1433j24095e9991A91606c84171J03534
18726b80637M7322H3669J523a06148o3919j89265a07785j27105a3584H4035a07303
18714D0040J89041N932j08400a4111A5648a37276N9323K74j05006B39350e8079
18702a88778r2635H1932N8577c43258B06465a32139L2358A6280b37828i7550A55414
18690a65677j8185H3047b86054a30605i269B6648a85597P2885d6326k8271R497
$$ y = [-208278, -127549, 2126, 92530, 102467, -18556, -82242, -194787, -260368, -50520, -54825, -39084, 89374, -369119, -137799, -345547, -396267, 127140, -127230, -294430, -13309, 8483, 30287, -114620, 57316, -401533, 153898, -96752, -173712, -243853, 58698, -122577, -83746, -83269, -149340, -243887, -181505, 108561, -335468, -94382, -52949, -177044, -59991, 191606, -384171, -280637, -233315, 83669, 85192, -106148, -170067, -359332, -107785, -234890, -13584, 84035, -107303, 40040, 229081, 235013, 126613, -14111, 15648, -137276, -77953, -77679, -182685, 239350, -58079, -188778, -281413, 81932, 140509, -343258, 206465, -132139, -99781, 16280, -237828, -97550, 155414, -165677, -183862, 83047, -286054, -130605, -9269, 26648, -185597, -112712, -46326, -74597, -65100]
18679f5100E1884A7203b0862k92747E135c0516l5962l5214r553L3592K8805a4387
18666b4153j46026C6595i4567B74904d7089F4646J39872A0130d9846G0334j6550
18655E3784b07056J8195G2140c9736j76385A65975a70534l630b4141m3845k78417
18644c46403a17878N4672D4144J12390b4629j31729E6257J39626K78712C3455
18633C7308K1796b99213C29898f4369A02040a3259j04202N0811j18498p3706B14249
18621a39837H4741a44674j43568A3691a65829q9632A97353H1495c8344j82055
18611b20399f7234G4768J99522j36020h6828j35385A59306b51875J23710j56419
18601b84584a41582I65a258m56732b27279C1225K7411b78991N7843c006m3805
$$ y = [-65100, 51884, 17203, -20862, -313609, 5135, -30516, -66478, -101692, -111245, -77653, -48848, -14387, -24153, -170179, 36595, -94567, 274904, -47089, 64646, 204518, 10130, -49846, 70334, 53784, -207056, -188861, 72140, -39736, -216121, 165975, -170534, -174164, -24141, -67986, -346403, -117878, -63206, 44144, 156534, -24629, -156358, 56257, 195883, 474595, 33455, 37308, 59104, -299213, 329898, -64369, 102040, -13259, -117461, -66650, -185148, -258854, 214249, -139837, 84741, -144674, -288242, 13691, -165829, -255461, 197353, 81495, -38344, -220399, -67234, 74768, 274290, 138270, -86828, -222213, 159306, -251875, -128165, -284584, -141582, 965, -1258, -457990, -227279, 31225, 58636, -278991, -221148, -3006, -46811]
18590d6811j35410D1221a52516a1779j01340A36109A426g2178F0180e98n9444
18579f0042F29b4634A9073O3957a98911A87955e2486A31753a59181A62455k2772
18568A39683k9406a93205C9471n413J48185F5495O9099c02965e852G4843a13454
18556c08411a10117B21105B116c18437a36866H2098a95225Q2572r379c6022m1514
18545g7536D1907g8748j01175E6499a67862O0063C367Q3680a99497c1254E9003
18533A32137D9825b19828B1581a18020A76601g3599k8026j07024P3318k36782
18523c72113a35172g499l5934j40795D8624J32650a87603J0350I6161i6574A34959
18511a50420e2143B33913H6529f9420D5717d2009q7998c9607A66139J35917c23489
$$ y = [-46811, -182221, 41221, -152516, -11779, -113119, 136109, 1426, -72178, 60180, -598, -60042, 629, -24634, 19073, 83030, -198911, 187955, -52486, 131753, -159181, 162455, 139683, 110277, -193205, 39471, 34058, 182243, 65495, 134594, -302965, -5852, 74843, -113454, -308411, -110117, 221105, 2116, -318437, -136866, 82098, -195225, -112653, -122032, -36022, -77536, 41907, -78748, -179923, 56499, -167862, -107799, 3367, 87047, -199497, -31254, 59003, 132137, 49825, -219828, 21581, -118020, 176601, -73599, -101625, -208649, -135331, -372113, -135172, -7499, -43433, -184228, 48624, 181274, -187603, -177253, 96161, -96574, 134959, -150420, -52143, 233913, 86529, -69420, 45717, -42009, -130007, -39607, 166139, 302056, -323489]
18499A32286f0225D1868g9740J3297j43971C797h7039j6321D5378g4261b5680
18487A07589k8202l1422Q9088i3965F8423k7822d07586q519J75878A23343d17676
18475a7653l8174j42521B75624j20705a50779K3474d1444A82973b1033B5737f8952
18463e8977j71065B5159a82206j58753C07948a56699c2877l40404O4252g4408
18452c40586A27827d9230j3776D268e4590K4298l21949A66627p2121f6702A13888
18440B77416c13004e3438A61376F1611b04985h6555F9184b9747k38254G2280a01231
18428A01119i1056m65990A955b36551M4551F9439k2916d7358K3118D2058j3171
18417B8887K1232a14770k9039l71685a73662E9997P1156N0956c08739p214b8542
$$ y = [132286, -60225, 41868, -79740, -66443, -210414, 3797, -87039, -103360, 45378, -74261, -25680, 107589, 79387, 47965, 137053, -93965, 68423, 40601, -407586, -416105, -240227, 123343, -417676, -17653, -55827, -198348, 275624, 154919, -150779, -127305, -41444, 182973, -21033, 25737, -68952, -58977, -230042, 25159, -182206, -340959, 307948, -156699, -32877, -373281, -309029, -74408, -340586, 127827, -49230, -63006, 4268, -54590, -30292, -352241, 166627, 94506, -66702, 113888, 277416, -313004, -53438, 161376, 61611, -204985, -86555, 69184, -29747, -268001, 72280, -101231, 101119, -91056, -557046, 1955, -236551, -192000, 69439, 46523, -47358, -24240, 42058, 28887, 50119, -114770, -143809, -515494, -173662, 59997, 131153, 182109, -308739, -315953, -28542]
18405I9059J4497B2624J4539a79048j08097C23809B6987a78237g0023k28650g9310
18393b0008I7955P7333D1077O211e1299j08119A90725e6746j70058h113k08339
18382b16452h1200B05229G3834b70648J5046E6176B0457b72510A52446f962E7068
18370g4768B0042e4738m3068C2208a40349D45350a34757j76535B33281a14127
18359c07324C31394e3680D1574c76985a9890j64644q2391f7810A02924a34492
18348C6882g5796A59171d2237C22253b74007B48898k1805F8201a51034A03485
18337B3493N6485a90707M9379E6058c8557A7607N4734J0081K27799c37684B32643
18325E6699L1059M309g5205j03391I264D217L70904d08044D9285K18090a60595
$$ y = [99059, 113556, 22624, 37163, -179048, -287145, 323809, 26987, -178237, -70023, -298673, -79310, -20008, 97955, 175288, 41077, 47288, -51299, -159418, 190725, -56746, -226804, -8113, -216452, -81200, 205229, 73834, -270648, -255602, 56176, 20457, -272510, 152446, -6962, 57068, -74768, 20042, -54738, -97806, 32208, -140349, 445350, -134757, -311292, 233281, -114127, -307324, 331394, -53680, 41574, -376985, -19890, -184534, -266925, -67810, 102924, -134492, 36882, -75796, 159171, -42237, 322253, -274007, 248898, 227093, 68201, -151034, 103485, 23493, 79978, -190707, -141328, 56058, -38557, 17607, 72341, 82422, 310221, -337684, 232643, 56699, 87758, 92067, -75205, -178596, 9264, 4217, 375121, -408044, 49285, 267375, -160595]
18313B5393d16010A47934b45422O4872J0511q6702I4532a38407n6791R2849A37687
18301E4700a37945c9015H3782j7599f0227K8512q07n74k47734d5982C34761b14341
18288c67973A6245N2100i8930J7836j80092A98063c22226a35317C61468a88649
18277B13210j03399c3367B42128A8993J45120c348A72415L7462h7734k33165a45299
18265A36037d70837C43515a82926A99839a51933k18719A10523e0432A98493b1594
18254i3344a5760A39220b36831d0380o7726L3927k0807o8771H7275L3047c7013
18242F9249f15424a4725p6864l3689l59331a71025B02312f2484l45526g5258j27295
18231b02553f5882B7456K69374a19907A1577l325a35449F8590a33015f2127j30696
$$ y = [25393, -416010, 147934, -245422, -180550, -170039, -256741, 94532, -138407, -195198, -102349, 137687, 54700, -137945, -39015, 83782, 66183, -60227, -31715, -32522, -33096, -280830, -45982, 334761, -214341, -367973, 16245, 68345, -98930, -81094, -261186, 198063, -322226, -135317, 361468, -188649, 213210, 109811, -33367, 242128, 18993, 164113, -3348, 172415, 209877, -87734, -320899, -145299, 136037, -470837, 343515, -182926, 199839, -151933, -370652, 110523, -50432, 198493, -21594, -93344, -15760, 139220, -236831, -40380, -108106, -74179, -94986, -163757, 87275, 120322, -37013, 69249, -615424, -14725, -91589, -125278, -484609, -171025, 202312, -62484, -408010, -75258, -202553, -65882, 27456, 296830, -119907, 11577, 8252, -135449, 68590, -133015, -62127, -192823]
18220a92823C35660H3664a49247A6687a28053K41B53796j08733F0100a35404k18923
18209c54327C28304b10697B01196I3729K39076a25309j7159j7628N2676A42725
18198D97538k07399b07646M8893A56275R0044a21178D4302e5310B87724b46079
18187c6652C0603J87738g9449I398J0532a1939E4639K8388a5101j72388A42869
18175f464j5780j43473c2210J5368l53242a24138q0944j21264f0276j1606E1851
18163F0448a36986A38385a60504A37381c01841b0948p1804A47054f3719r6450
18153a60169K7062E8377a03087A52881d5593A78448b01617e50j21215j8710e5865
18141b688m0946j62454B0627f9291l51952B79976a21897B72052A977J1305K51531
$$ y = [-192823, 335660, 83664, -149247, 16687, -128053, -127812, 253796, 145063, 60100, -135404, -354327, 328304, -210697, 201196, 93729, 332805, -125309, -142468, -160096, -107420, 142725, 497538, 290139, -207646, -158753, 156275, 246319, -121178, 44302, -55310, 287724, -246079, -36652, 30603, 218341, -79449, 9398, 19930, -11939, 54639, 83027, -15101, -187489, 142869, -6464, -22244, -165717, -32210, -16842, -370084, -124138, -205082, -326346, -60276, -71882, 51851, 60448, -136986, 138385, -160504, 137381, -301841, -20948, -92752, 147054, -63719, -160169, -133107, 58377, -103087, 152881, -45593, 178448, -201617, -550, -121765, -140475, -55865, -2688, -43634, -206088, 20627, -69291, -421243, 279976, -121897, 272052, 1977, 13282, 264813]
18130B64813b14453A78417b21337B46518a28098Q21j86859B10244f2043r3759
18120a55802B6268L9199b990A19491a81815A91399M3396h7437l29669J87481h1221
18108a7369E9405j8150Q4398l8393i2359K51A09023H180m046b2888B2081a57307
18095a24095G7637M336J33207c3991j48700H2404c06698i3425n6099d2884j26227
18084a69111E2210c30142A68052a27612B40146a7059k5244l4530r3153A97713
18073D3807n991J98858f2012J9120j22144B5259O4599O2556b6742k6171B38308
18061A05398B3645h2618l3227b0399o3902j31166j42475A3953a22375B21560j01781
18050A19779f5747B28243G5819a18478L8625A96546F2503o251b4716E4377a71793
$$ y = [264813, -214453, 178417, -221337, 246518, -128098, -127277, -314136, 210244, -62043, -155802, 26268, 65467, -2990, 119491, -181815, 191399, 234795, -87437, -417106, -229625, -81221, -17369, 59405, 41255, 125653, 87260, -92359, -92108, 109023, 8180, 4134, -22888, 22081, -157307, -124095, 77637, 81973, 215180, -33991, -182691, 82404, -306698, -93425, -149524, -42884, -169111, 52210, -330142, 168052, -127612, 240146, -17059, -42303, -76833, -169986, 197713, 43807, 37816, 236674, -62012, -42892, -165036, 25259, 89858, 152414, -26742, -52913, 238308, 105398, 23645, -82618, -115845, -20399, -84301, -215467, -357942, 13953, -122375, 221560, 119779, -65747, 228243, 75819, -118478, -79853, 196546, 62503, 56252, -24716, 54377, -171793]
18038a67098A90941o3959B0474d4823l8041B22121c698A10782g7963B50282a94830
18026b7864j25895j33255J36897e9943n3280J7254n4618c7437B196K47690g4155
18014b39679A45448a93762j56750J68946B07184b0966D7896b21471J05942A14955
18003a06377K1382b1611A73073a59144d8788j78440b2306J0364r9838D8070g9074
17991B20443a47488A77686b0932j37416A28255a39685b3833q3374F3255e1960
17980a31755I8550g0949j45566b4309k78860b7002e846H5978K1612L2281J59105
17969B98976K28a21857j23244B40574b33745P9145C16394d5598q601J6693A1293
17957d7762p9107A02315D2798g373k2965k23655A20974K781D7400J3636F760a66761
$$ y = [-167098, 190941, 126982, 20474, -44823, -82864, 222121, -3698, 110782, -77963, 250282, -194830, -27864, -153759, -287014, -150117, -59943, -113223, -95969, -150587, -37437, 2196, 249886, -74155, -239679, 145448, -193762, -350512, -181566, 207184, -20966, 47896, -221471, -115529, 114955, -106377, -84995, -21611, 173073, -159144, -48788, -227228, -22306, -11942, -111780, 48070, -79074, 220443, -147488, 177686, -20932, -158348, 128255, -139685, -23833, -107207, 63255, -51960, -131755, 98550, -70949, -216515, -24309, -303169, -27002, -5846, 85978, 107590, 139871, 298976, 299204, -121857, -245101, 240574, -233745, -154600, 316394, -45598, -54199, -37506, 11293, -47762, -126869, 102315, 42798, -7373, -30338, -253993, 120974, 123755, 47400, 61036, 6760, -166761]
17944d8335A99287a46215A92265I3715N4127e4227j27652A91464a57274M0350
17934a16924c69B41412f4259G7545g0312I6957J709r06h725l00990a42476M1352
17922a01124B24545f3666j42600c6347j15183b9357k25812C64204L29650A08790
17911C26018p6104F0842B6720R4405L38439B7565R1289c546G7487J39232b02487
17899A02616b91721B6045R7560P6828a5599j10907a2749n2182k44365A14686P6456
17888A91142i8399j04836A21719c91832A7381L56179b15636b4973k60742a13460
17877a96723B36068N5307G7329K5043a30239n3808a2890j27197M2823D6542a07715
17865h1548C6078i1855C2936a03832A69492K8341j5752a78111o6151A68205d2693
$$ y = [-48335, 199287, -146215, 192265, 93715, 147842, -54227, -181879, 191464, -157274, -116924, -369, 241412, -64259, 77545, -70312, 96957, 98666, 97760, -8725, -309715, -142476, -101124, 224545, -63666, -206266, -36347, -151530, -29357, -255169, 364204, 693854, 108790, 326018, 249914, 60842, 26720, 121125, 459564, 27565, 118854, -3546, 77487, 216719, -202487, 102616, -291721, 26045, 123605, 200433, -15599, -126506, -12749, -64931, -309296, 114686, 191142, -98399, -203235, 121719, -391832, 17381, 373560, -215636, -24973, -285715, -113460, -196723, 236068, 291375, 77329, 102372, -130239, -184047, -12890, -140087, -97264, 46542, -107715, -81548, 36078, -91855, 32936, -103832, 169492, 197833, 182081, -178111, -244262, 168205, -42693]
17853C62065h6279j12829d4633b946E3849J10108R3507c5790B72465G0817K38535
17842C09352a54916A99421r5812l6512G622J75622D3951g4528B19359I763a61907
17830E9641b08696C5524D253M9794P5024a34097f4450B1069M0335J08774a14247
17818a56162A30177K5933D5545N8291J18990g4046A70589e6704n1229H1798a18962
17806A43466a33764L9629G4458a94697d0419j86391M3320B10842k6174q294c7870
17794a26782A89924C8481J92149F2452a8848q0812C2520a76600D02016A9359P6333
17783I5692k7036a22587A61276c55956A26201o1133h2535M0550j07573B24220
17772a32A12375P2176c15463A02009b29760a4366A31158J14178h0247A17004E1222
$$ y = [362065, -86279, -199108, -44633, -2946, 53849, 163957, 257464, -35790, 272465, 70817, 309352, -154916, 199421, 103609, 67097, 7622, 183244, 43951, -74528, 219359, 9763, -161907, 59641, -208696, 35524, 4253, 54047, 129071, -134097, -64450, 21069, 61404, 170178, -114247, -156162, 130177, 156110, 45545, 103836, 222826, -74046, 170589, -56704, -107933, 81798, -118962, 143466, -133764, -94135, 74458, -194697, -40419, -226810, -183490, 210842, 184668, 176374, -37870, -126782, 189924, 38481, 230630, 62452, -18848, -99660, 32520, -176600, 402016, 19359, 95692, 68656, -122587, 161276, -355956, 126201, 65068, -82535, -41985, -149558, 224220, -132, 112375, 184551, -315463, 102009, -229760, -14366, 131158, 245336, -80247, 117004, 51222]
17760B48443a45161I1321K169a47621B93433A23824M09066g2814j85246b4135
17749A23609C7223a94318M4940r2644A74799h9937m0246o0194B0805c46784A74626
17737B10687J22880f6615m5081A16801R6034D8141P8723j5894K7179J7726L6618
17726A92493J00403b67503I2422H86L66821H7325P7852c0779j95135D8697a34820
17714i9575B9388M1681O9761J26770r361i876l31330B35682p2291e5821j59526
17703b15347g0383D1434K0289M045i646B54403a46868B12933a48930B10648D4102
17691D03365A46838L4734a35905A20306j3356b4824C55968j64266e2044A25772
17680b79562A60842Q4480a8674l1562B49376q8908c56486a34969A3056J19216
$$ y = [248443, -145161, 91321, 93490, -147621, 293433, 123824, 532890, -72814, -258060, -24135, 123609, 37223, -194318, -149378, -242022, 174799, -89937, -130183, -190377, 20805, -346784, 174626, 210687, 333567, -66615, -111696, 116801, 212835, 48141, 126864, 110970, 138149, 155875, 192493, 292896, -267503, 92422, 886, 367707, 87325, 165177, -30779, -225914, 48697, -134820, -99575, 29388, 71069, 140830, 267600, 258239, -9876, -341206, 235682, 163391, -55821, -215347, -70383, 41434, 61723, 65768, -9646, 254403, -146868, 212933, -148930, 210648, 44102, 403365, 146838, 181572, -135905, 120306, 106950, -24824, 355968, 191702, -52044, 125772, -279562, 160842, 245322, -18674, -50236, 249376, 160468, -356486, -134969, 13056, 132272]
17670A32272b2300R955j32669n1987E6449J9843C2349i2170j19639B45431p9390
17659A66041J47855e3892A40567L8624K29880A26630g0259A31761a25293H4266
17648A86180a50244C21804O554A20832i6486B84366A19577J92880p9860d2219
17637C3846K09243c41697A21400d2733B85316a68566A82575a9190F7175a13596
17626B1865J75192a26475A31105J42660a045j51535A08658N7893J10106A27071
17615a76114a3968A37457J01996l0132k3793p099a61469P8684B03690b38692E46448
17603D26621B7407Q5276J54928F3538N4570d9265J9332H542K34929A1276M7386
17592E8662a61835A59856k8594J78710A1300K05797p5346b41205B27861J08261
$$ y = [132272, -22300, -12345, -145014, -197001, 56449, 76292, 32349, -92170, -211809, 245431, 166041, 313896, -53892, 140567, 179191, 409071, 126630, -70259, 131761, -125293, 84266, 186180, -150244, 321804, 328358, 120832, -96486, 284366, 119577, 312457, 232597, -42219, 33846, 243089, -341697, 121400, -42733, 285316, -168566, 182575, -19190, 67175, -113596, 21865, 197057, -126475, 131105, 273765, -1045, -152580, 108658, 166551, 276657, 127071, -176114, -13968, 137457, 239453, 209321, 185528, 178429, -161469, -82785, 203690, -238692, 546448, 426621, 27407, 112683, 267611, 63538, 118108, -49265, -29933, 8542, 243471, 11276, 58662, -161835, 159856, 131262, 309972, 11300, 217097, 141751, -241205, 227861, 336122]
17582C36122A11790C5354J78389J047i2825j7710E7712J01134p8546J71767q4250
17571A67817L4849J25834K8341c8010F3516K61090j45589k5335n2450J27522J79727
17560D08481j47437A13400D748a09706C8094K49094a03190d8281A3221g1329b5888
17548E74851A32805k768n9784J42796k925J69501A30145E5624a75820D22639A60660
17536C72341j22385o5375J77924j77086K8909A2884M09535r4108Q1431j36111
17526B73631N9252O13876l06963K20883L53316D77352J19852P1844C31445j15636
17516B15809Q8876J67582k19548K68530r658J42038J72819o9753J71162l23951
17506F03906k05772M0328a14778B49273a70114A36556L4204L15361B35804r469
$$ y = [336122, 111790, 35354, 213743, 214790, -92825, -110535, 57712, 158846, 80300, 252067, 167817, 202666, 328500, 356841, -38010, 63516, 324606, 179017, 153682, 101232, 228754, 408481, 261044, 113400, 4748, -109706, 38094, 287188, -103190, -48281, 13221, -71329, -25888, 574851, 132805, 130037, 70253, 213049, 210124, 379625, 130145, 55624, -175820, 422639, 160660, 372341, 249956, 184581, 362505, 185419, 214328, 12884, 422419, 328311, 409742, 273631, 332883, 946759, 639796, 860679, 1213995, 477352, 597204, 669048, 331445, 215809, 304685, 472267, 252719, 521249, 511591, 653629, 826448, 756695, 927857, 603906, 398134, 438462, -114778, 249273, -170114, 136556, 170760, 486121, 235804, 226335]
17496B26335k236l9810J49351O2133J51022B13486J50408q3316P4842i5339A71923
17484E83054A35571k9023J00667G4235J54982j02636J43075p6801J41856n4131
17474B80580A05938J12387j148j9193K76602j79653q2315J73499B5221L14487
17464C39708A5409O6492J29372L6298J72304j65907b57290B1208L81278j19211
17454B83275O773o2397R4009B8517J43831K71897J00649k16791J17929n5597J24874
17443E15309p1241K23036j04342k76724J94833R1883B75987r0066K9763l230L32169
17432E44623B11704J58396K8293K74296A96750m0520J98761j53244J97473j6428
17422C82792J45320l1346n3271Q1561B60768K29885r2440K6210Q9195j08025O5685
$$ y = [226335, 224099, 184289, 333640, 395773, 546795, 213486, 363894, 280578, 355420, -95339, 171923, 583054, 135571, 106548, 207215, 74235, 229217, 126581, 269656, 192855, 334711, 280580, 105938, 218325, 217177, 197984, 474586, 294933, 212618, 386117, 25221, 339708, 15409, 81901, 211273, 247571, 419875, 253968, -257290, 21208, 402486, 283275, 290048, 227651, 321660, 28517, 172348, 444245, 544894, 328103, 446032, 390435, 515309, 444068, 667104, 562762, 286038, 480871, 572754, 275987, 185921, 215684, 212454, 544623, 211704, 370100, 398393, 672689, 196750, 156230, 354991, 201747, 399220, 382792, 528112, 496766, 443495, 525056, 260768, 490653, 398213, 424423, 513618, 405593, 471278]
17411D71278P6336p2761j56144A35187L02078O6590B38497J36648G2362A4452
17400I3444K07138J35075a6651G8563J60304n0645G1875A2056K14057J29811A31486
17388A23763J46122A17483K2563o4902K48152J56624F7267M44097B190d3092C67283
17376B59754I9237J00378c4425D69721A64321n7435J35330K8471n162J47144n8462
17365C54207A73585J63889j13971o0617g5480D7552J0513J75197N0994Q4892G8978
17353a63501F0762J94673B1846J3310K25057J24127P5102r7422m1955q3611K0798
17342B57252n5656l8736J43599p0714j16344K47117N9764A9679K94001K15099
17332E28779k14190A30001M505J18136A16245O38217B31971K17054J24754B46602
$$ y = [471278, 547614, 474853, 318709, 135187, 437265, 503855, 238497, 375145, 72362, 14452, 93444, 300582, 435657, -16651, 78563, 238867, 188222, 71875, 12056, 226113, 355924, 131486, 123763, 269885, 117483, 140046, 75144, 323296, 479920, 67267, 511364, 2190, -43092, 367283, 259754, 99237, 199615, -34425, 469721, 164321, 106886, 242216, 270687, 265525, 412669, 354207, 173585, 337474, 223503, 162886, -75480, 47552, 58065, 233262, 284256, 369148, 78978, -163501, 60762, 255435, 21846, 35156, 260213, 384340, 459442, 362020, 320065, 236454, 257252, 201596, 162860, 306459, 235745, 119401, 366518, 426282, 19679, 313680, 528779, 314589, 130001, 134506, 252642, 116245, 754462, 231971, 449025, 573779, 246602]
17321A55397J14586a56036k2392E11887D6354p632M69711j37741C8954K16919
17311B55873L5584M8540J28852A79485a25239B93631l4103K39175B46496J53450
17301C99946A10297J80981j21998n4053K42960L03366l09769q9373J12624A19080
17290B22396K7105G8463L51538j61649H6609L19528r1364A48051n2748L92618
17280D87921A57764J83707J27945p6576A28794M23618B61300J36652m8815q0078
17270B69059K86166J13807A56683M27664B22318J65857A42960L44592k15248p8172
17260A94132n2749c4915E10525j64892D407K91573O5149A49788O2555J49009N2047
17249D13399o6974i2605D28191A08928J07182J3596l3598L23214B53643J25328
$$ y = [155397, 269983, -156036, -178428, 511887, 46354, 38722, 508433, 370692, 38954, 255873, 291457, 339997, 468849, 179485, -125239, 293631, 259528, 498703, 246496, 399946, 110297, 291278, 169280, 115227, 358187, 661553, 351784, 262411, 375035, 119080, 222396, 249501, 78463, 430001, 268352, 86609, 406137, 314773, 148051, 95303, 487921, 157764, 341471, 469416, 392840, 128794, 552412, 261300, 397952, 349137, 269059, 555225, 669032, 156683, 584347, 222318, 388175, 142960, 487552, 272304, 194132, 141383, -34915, 510525, 345633, 4407, 295980, 361129, 149788, 212343, 361352, 413399, 346425, -92605, 428191, 108928, 216110, 229706, 196108, 519322, 253643, 378971]
17239C78971j68859M9657K67851A55932N4569J98647l5782j10865M2803K11188
17229E16492k57158n5941L7981K08441j24131A41476J44004L8890K66750q2813
17219E08307M1762j73337J72601A67274m2510e069E95085r4645j23672H6716L85774
17208D72490n3192N3986j31047j07731K08040J44380k59680m6179L59330C02805
17197E15102k16706K14280A91244L89032K77902B78516R3804N6524A59254P0352
17187B29606K82577R358j00435o4497j15355P1325J23414j3282k03313M14846
17177F34244k41451J62461B40872J61043r4008M49416l12832n7125L33129B96508
17166D01664K19673B61059K45414K11804k37618j23884J85416J47368l14913K85333
$$ y = [378971, 210112, 259769, 527620, 155932, 210501, 409148, 373366, 262501, 305304, 516492, 259334, 203393, 241374, 449815, 325684, 141476, 285480, 324370, 591120, 508307, 550069, 376732, 549333, 167274, 124764, -5069, 595085, 500440, 376768, 86716, 472490, 419298, 473284, 342237, 234506, 442546, 586926, 327246, 281067, 640397, 302805, 515102, 298396, 512676, 191244, 580276, 858178, 278516, 372320, 428844, 159254, 229606, 512183, 521541, 421106, 356609, 241254, 312579, 435993, 422711, 219398, 634244, 392793, 555254, 240872, 401915, 307907, 757323, 444491, 387366, 720495, 296508, 401664, 621337, 261059, 506473, 718277, 480659, 356775, 542191, 689559, 374646, 659979]
17156F59979k74012c0446D53492J68228p5649B13412K8296J90053N2167j92431
17146B91497L75015j4972J3973B94018J47640J5985k03799N18838j38901k28478
17136D05303L20240j29735j87989K4749J19251j70382J04490J59651n0978J18303
17126G12903j4040L4233o1182j41889O9327K48135j61400k45785l4935J30623
17116E35990L41058j76139j83749J34967C19251M13260k02626o1657J18514k08687
17106C78055J45240p2376J42951l4094L4607O3907O1271O5903k25378K80903k24133
17095F16856K11337j90419r9959j1568k61250L23350K37212j55091J34915p1017
17085G34366j911L7482j11085Q6168K8357j86692J22263K7758J81861j1113k05473
$$ y = [659979, 385967, -30446, 453492, 621720, 546071, 213412, 241708, 431761, 483928, 291497, 666512, 651540, 665513, 294018, 441658, 457643, 253844, 772682, 633781, 405303, 725543, 595808, 407819, 432568, 551819, 381437, 485927, 645578, 594600, 712903, 698863, 733096, 671914, 530025, 599352, 847487, 686087, 440302, 405367, 535990, 877048, 700909, 517160, 652127, 319251, 732511, 529885, 468228, 586742, 378055, 523295, 450919, 593870, 559776, 594383, 658290, 719561, 785464, 560086, 840989, 616856, 828193, 637774, 537815, 526247, 264997, 588347, 825559, 670468, 805383, 734366, 732455, 769937, 658852, 745020, 773377, 586685, 708948, 736706, 918567, 907454, 701981]
17074G01981J97067k30760j09963n4719L9737R514K54248j91713M4530J11468
17064G71390j42180L24896q4466J500k09285n757l0666K3145K14934M2434l63862
17053E42083L14479J81668l24370O3076K95151j15657m6468r6874J76884n3421
17043I36551k26128M86653k63839N5867J84967l24711P2747p8518p9364r0460
17033F73765L74961m7927k2741j2021J10039j57048L603K84206n548l74863O9233
17022H95659%K62604J14145J33787o01509M58282J9382k07508o6167P3473N6964
17011A139112l3516J23768l49325L08089M3734k53724K86157k31725J45466K88005
17001A466041l21576N6742k49913K78578n7530j7322L82793j56707o5407j51654
$$ y = [701981, 899048, 668288, 558325, 503606, 543343, 552857, 807105, 615392, 659922, 771390, 629210, 954106, 869640, 871140, 661855, 656098, 625432, 648577, 863511, 905945, 542083, 856562, 1038230, 713860, 776936, 1072087, 956430, 909962, 813088, 989972, 936551, 710423, 1197076, 933237, 989104, 1174071, 849360, 922107, 843589, 764225, 673765, 1048726, 1000799, 978058, 966037, 1076076, 919028, 922631, 1206837, 1201289, 826426, 895659, 895659, 1158263, 1272408, 1406195, 804686, 1262968, 1282350, 1074842, 1008675, 1082148, 1139112, 1105596, 1229364, 880039, 1188128, 1231862, 978138, 1264295, 1032570, 1178036, 1466041, 1144465, 1201207, 951294, 1229872, 1172342, 1155020, 1537813, 1381106, 1315699, 1164045]
16991A164045R0766p8442L70531l6267k90001k1056J06620k47354L58340K84775
16981A701957l15726J09857o1596J88608m54821K38265J61424k27110K35195P1211
16971A647264K7607p5105r9061P2715J45543k38520J15876K29207m598k58490
16961A562438J4137K52024k08321K86224J90840o01319L91216r2877J8856l08345
16951A504873K80053P4040P2160P5883j25557J69705K6685k99415K46719j04463
16941A920683j2193J11554N8673k08365J40144K4620J37740k9492M2612P3754
16931B259730q7151P4041m8961j03641Q4630J69351k09024q900J76923O55084
16921B962082m61181o7839J24905K4176O8019J835m13207L23035N3717k69032
$$ y = [1164045, 1254811, 1176369, 1546900, 1510633, 1220632, 1199576, 1306196, 1058842, 1417182, 1701957, 1386231, 1496088, 1434492, 1623100, 1168279, 1406544, 1567968, 1340858, 1576053, 1647264, 1674871, 1599766, 1500705, 1573420, 1718963, 1480443, 1596319, 1825526, 1820928, 1562438, 1576575, 1828599, 1620278, 1906502, 2097342, 1496023, 1887239, 1794362, 1813218, 1504873, 1784926, 1858966, 1931126, 2007009, 1881452, 2051157, 2077842, 1778427, 2025146, 1920683, 1908490, 2020044, 2078717, 1870352, 2010496, 2035116, 2172856, 2143364, 2185976, 2259730, 2172579, 2246620, 2197659, 2094018, 2178648, 2347999, 2138975, 2130075, 2306998, 2962082, 2500901, 2433062, 2557967, 2582143, 2650162, 2651997, 2238790, 2561825, 2615542, 2346510]
16911B346510J58257O5290J5231L74175R5241k62515j47456J64045J92149j95347
16901B805580L44585k61085K46199l29564J35694K45530J83496k10067L55036
16892C515404J6643n355j81786J90063l67349K59751K87520l15556M23075j13222
16882C709188j88070L66629k21975N47877j76786P4569m8039j66958K73156j40098
16872D029493J48898K67153j75713r7633L94199J98732k39874J70332K46604K8858
16862D971049N056K12491k93617R135K40551L84195j57335M2465O009J22856O9523
16851E612378K0036L58041r6486p6606P9758L46796l1008L18502j99696J52376
16841F484091N924J99360K84509P539K17390L16848j47149O570J17564l7585L01329
$$ y = [2346510, 2504767, 2570057, 2585288, 2959463, 3054704, 2792189, 2644733, 2808778, 3000927, 2805580, 3150165, 2889080, 3135279, 2805715, 2941409, 3186939, 3370435, 3160368, 3515404, 3532047, 3526692, 3344906, 3534969, 3167620, 3427371, 3714891, 3399335, 3822410, 3709188, 3521118, 3887747, 3665772, 4213649, 4036863, 4111432, 4063393, 3896435, 4169591, 4029493, 4178391, 4445544, 4269831, 4172198, 4566397, 4765129, 4525255, 4695587, 4942191, 4971049, 4976105, 5188596, 4894979, 4904114, 5144665, 5528860, 5371525, 5413990, 5419999, 5542855, 5612378, 5632414, 5990455, 5893969, 5817363, 5897121, 6243917, 6212909, 6531411, 6331715, 6484091, 6490015, 6689375, 6973884, 6981423, 7198813, 7515661, 7368512, 7375082, 7492646, 7455061, 7756390]
16830G756390Q6750K58181k04467L27656K30498M48686j0956L1042O448L59591
16820I289819J24398J98371K03010N3393M00221K6209j33313N12006J39472K74985
16810A1088571M45671L99624r6957J40572M03220J99983J52175L26281O73364
16801A3732504L15687L7283K96518L90318j01048O50575K14444N02846L61490
16792A6400617K33992O3852L90135Q83214L90499M56810L83173O51356K75516
16783B0129164M10585O48394L57484N74291R15110L40160Q16629P77772K07511
16774B5177100J002025O00290M16594P77592J038574O07403P31030O41175J171898
16765C2163681J089246Q83319Q52588R05962P46342J510019R60865J001905J199360
$$ y = [7756390, 7843140, 8101321, 7896854, 8224510, 8455008, 8903694, 8892738, 8923780, 8930228, 9289819, 9414217, 9612588, 9815598, 9868991, 10269212, 10295421, 10162108, 10674114, 10813586, 11088571, 11534242, 11933866, 11836909, 11977481, 12380701, 12580684, 12732859, 13059140, 13732504, 14048191, 14085474, 14381992, 14772310, 14671262, 15321837, 15536281, 16039127, 16400617, 16634609, 16698461, 17088596, 17971810, 18362309, 18819119, 19202292, 19853648, 20129164, 20539749, 21188143, 21545627, 22119918, 23035028, 23375188, 24191817, 24969589, 25177100, 26179125, 26779415, 27196009, 27973601, 29012175, 29619578, 30350608, 30991783, 32163681, 33252927, 34136246, 34988834, 35894796, 36641138, 38151157, 39112022, 40113927, 41313287]
16756D1313287R26918J304966R21760J651335Q59522J856325J321981J041134
16748E1197228J637610J493633J416843J573351J396570J367243J221293J506783
16740F2810554J746882J392778J397978J038414J963769R69094J412817Q93877
16732G3626163J287036J182402J081457Q04251R70608N72706O19899N41134M90536
16723H1176192K72711j02486L50572l50001R398l88699m62849p01620m14934j112407
16713G8275877n50468r86328j010733j134095j212674j154666j301292j327487
16705F9598134j253733j765351j424478j092308j554247j471957j579108j838991
16697E7617961r13861j488053j606548j188064j514906j136482j580038j240080
$$ y = [41313287, 42240205, 43545171, 44466931, 46118266, 46977788, 48834113, 50156094, 51197228, 52834838, 54328471, 55745314, 57318665, 58715235, 60082478, 61303771, 62810554, 64557436, 65950214, 67348192, 68386606, 70350375, 71319469, 72732286, 73626163, 74913199, 76095601, 77177058, 77981309, 78951917, 79524623, 80144522, 80685656, 81176192, 81448903, 81346417, 81696989, 81346988, 81356386, 80967687, 80504838, 79803218, 79388284, 78275877, 77725409, 76739081, 75728348, 74594253, 73381579, 72226913, 70925621, 69598134, 68344401, 66579050, 65154572, 64062264, 62508017, 61036060, 59456952, 57617961, 56704100, 55216047, 53609499, 52421435, 50906529, 49770047, 48190009, 46949929]
16689D6949929j401768j216123j003321j299156r10070j326261r48350r03274
16681C7941606j463864l57761j620053p16056o65383r70086q48270r20592r14831
16672B9464710m49354o70564j018694n50873o91173p46048n07564n34490n50517
16663B3745433p34455o07631k84447r94097l78856m64972l38298n12819n05600
16654A8924258n43248q4378n04157m58253o13007k11266k65964m25704o38747
16645A5179534J11187k87839m69897m19922k1004k60191k85167n54301J18888
16636A3111288k32037m73006l37314K51149o24927l42294l00521O2680m05706
16627A0709312J62162j86096m86362j21569l85149J19633l21061p4015j60785
$$ y = [46949929, 45548161, 44332038, 43328717, 42029561, 41119491, 39793230, 38844880, 37941606, 36477742, 36119981, 34499928, 33783872, 33118489, 32148403, 31300133, 30379541, 29464710, 29015356, 28344792, 27326098, 26775225, 26084052, 25338004, 24830440, 24295950, 23745433, 23010978, 22403347, 22118900, 21124803, 20745947, 20280975, 19942677, 19429858, 18924258, 18381010, 18296632, 17792475, 17334222, 16721215, 16509949, 16243985, 15818281, 15179534, 15290721, 15002882, 14532985, 14113063, 14092059, 13831868, 13546701, 12992400, 13111288, 12879251, 12406245, 12068931, 12320080, 11695153, 11352859, 11052338, 11115018, 10709312, 10871474, 10685378, 10199016, 10077447, 9692298, 9811931, 9490870, 9416855, 9256070]
16618I256070k24170j78965k0862k82645j99113j14707k57548K81152J04229k19712
16608H143729n57275k4410j19697j62208Q9887l42946J03281J06268m26485j92997
16598F617147J94812k96398O2781k86232J47298k38439j72912L364p1062j99828
16588E760531J00457l08831M2528k59016J33336J69958p6254j07162k20589j56847
16578E078111Q4851j77588p183q0497l3196o575k4014m37347J21154K63082k17662
16567D563136r105M7679n63823K38177k69384O7854l5306P4236O1764k42788k29653
16556C702787K83570N3817j17423n0030K8580l96666K16451J26006n63283K76880
16546C560689j15482J61545O9840m00946J64846j10271j9773J00322j48332k95611
$$ y = [9256070, 9031900, 8852935, 8832073, 8549428, 8350315, 8235608, 7978060, 8259212, 8363441, 8143729, 7586454, 7562044, 7442347, 7280139, 7370026, 7027080, 7130361, 7236629, 6810144, 6617147, 6811959, 6515561, 6578342, 6292110, 6439408, 6200969, 6028057, 6031421, 5960359, 5760531, 5860988, 5552157, 5594685, 5335669, 5469005, 5638963, 5562709, 5455547, 5234958, 5078111, 5162962, 4985374, 4978191, 4897694, 4864498, 4857923, 4833909, 4396562, 4517716, 4780798, 4563136, 4554031, 4601710, 4037887, 4276064, 4006680, 4074534, 4039228, 4113464, 4175228, 3932440, 3702787, 3986357, 4040174, 3922751, 3872721, 3901301, 3504635, 3721086, 3847092, 3283809, 3560689, 3445207, 3606752, 3676592, 3275646, 3440492, 3330221, 3310448, 3410770, 3262438, 2966827]
16536B966827j24233N39449m22999K3240k66402M584J21972k20369K17674p3294
16526B766449L88019l44194n2859j17728j27859n1174m9360J0558J01365K3827
16516B547044R4353l48280M39458J2638j92154k65391k0383K83751r9813K50404
16506B701627k20006q094J64858m61289J65433l72271J59629M20242o42294K58440
16496B166275J33947m65096L81510k21007J83329j58066m1592l87942O00161j50937
16486B040582J844l24602L56245k23326j40596j45375K8355K26071J68184m68535
16476A518847J69703J73605m07006M86772l16668J98149n8511j22356k27226J35752
16466A551061L1953J61097R5835l79683p1007Q4460K34387n3232o0076m6532k27537
$$ y = [2966827, 2842594, 3382043, 2959044, 2982284, 2715882, 2720466, 2842438, 2622069, 2839743, 2766449, 3154468, 2810274, 2757415, 2639687, 2511828, 2460654, 2411294, 2421852, 2523217, 2547044, 2641397, 2293117, 2732575, 2745213, 2553059, 2287668, 2267285, 2551036, 2451223, 2701627, 2481621, 2473527, 2638385, 2177096, 2342529, 1970258, 2129887, 2550129, 1907835, 2166275, 2300222, 1835126, 2216636, 1995629, 2178958, 2020892, 1979300, 1591358, 2191519, 2040582, 2042426, 1717824, 2074069, 1850743, 1710147, 1564772, 1593127, 1819198, 1987382, 1518847, 1688550, 1862155, 1455149, 1941921, 1625253, 1823402, 1764891, 1642535, 1415309, 1551061, 1583014, 1744111, 1839946, 1460263, 1389256, 1473716, 1708103, 1654871, 1594795, 1548263, 1320726]
16455A320726K37753M8295j03853k5147J44581k76712j31376J37433k6304j71292
16445A154104J87022l2897m1749J57387j52452K85523j1699l52531L44504o5510
16435A471702M4143J27876l59128Q8882L3749m4572O0389l40805J23771K35502
16425A441509k19049R2465r4672K5665j79486j42513K04234J29529q6262J29922
16415A301342j7618k30951k2170P1375j58234j82648M41507j49639M782R0659
16405A148405K72778j48400j94138Q3055j24001m8908P8574M9462J03687l99465
16395H21049J44669j51481J98665m18730M36705j3798q6896j6262m6022k5358
16385H42541j23226j1616K82640j31723n3802L59564p7207k58876J41904j17971
$$ y = [1320726, 1558479, 1606774, 1502921, 1477774, 1622355, 1345643, 1214267, 1351700, 1325396, 1154104, 1341126, 1308229, 1266480, 1423867, 1271415, 1556938, 1545239, 1192708, 1537212, 1471702, 1515845, 1643721, 1284593, 1373475, 1407224, 1362652, 1423041, 1082236, 1206007, 1441509, 1222460, 1314925, 1220253, 1245918, 1066432, 923919, 1128153, 1257682, 1171420, 1301342, 1283724, 1052773, 1030603, 1101978, 943744, 761096, 1202603, 1052964, 1057746, 1148405, 1421183, 1272783, 1078645, 1161700, 1037699, 988791, 1067365, 1116827, 1220514, 821049, 965718, 814237, 1012902, 594172, 1030877, 1017079, 930183, 913921, 867899, 842541, 719315, 707699, 990339, 858616, 804814, 1164378, 1087171, 828295, 970199, 852228]
16375H52228p8428M73349k83848L23j76246O4581l3045j53274J54585K81677j65328
16364I36574q6450O1989Q0678M7906J4052m19005M26991j16454j25482K43356
16354A064155l07568K52574k77529N0375J1955j39929J72835l46099M68863j72463
16344G77169j14137J63711K35757m91639J34064j29155m3509J41959J61469C50261
16333E32647j32968O38513k17451k23482J66092C64671L56583L3550l5359K56764
16323I76209m46533K5103K43634K09158k02648j08404k53009R5880K40411l0906
16313G48895O8020m1209k14542k6568R4214j88569K85803j52629m8696p8135J1506
16302D58090K20898J71359l16349p4150N1223K57211k63908J47193C20026L84923
$$ y = [852228, 773800, 1247149, 963301, 963624, 787378, 851959, 818914, 665640, 820225, 1101902, 936574, 850124, 912113, 992791, 1040697, 1054749, 635744, 1062735, 946281, 820799, 1064155, 756587, 1009161, 731632, 782007, 793962, 654033, 826868, 480769, 949632, 777169, 663032, 826743, 1062500, 570861, 704925, 575770, 532261, 674220, 835689, 350261, 532647, 399679, 1038192, 820741, 597259, 763351, 364671, 721254, 754804, 719445, 976209, 529676, 554779, 798413, 1007571, 804923, 696519, 443510, 539390, 779801, 748895, 816915, 775706, 561164, 534596, 628810, 440241, 726044, 573415, 524719, 446584, 458090, 678988, 850347, 533998, 459848, 511071, 768282, 504374, 651567, 320026, 704949]
16292G04949C14049J99619m4682k0047J56413r5006j07668J35196j73664J28359
16282D92569q8523O1487n0532J64049k23344J56798R1162j38616L1023j33362
16272C62711P9045L6605O6947J92615j67156k77454F2438J17048M7374M75237
16262G02097l23135K02455l1429j94697J15940J59966L3939j26158D6256M30505
16252D76761Q6183O2818k56029M3560J32005A84080J88270j72893L26379j02709
16242D23127R860j2625L93953l64609B11296K95110M0820J87525j99569e2967
16231C78507N3529J50403n3595R2757k96133A3484K83072K78251j48624p5196
16221C50987n9371r0585M52826j92023j15321R1180M9625N7332k789O8448j46334
$$ y = [704949, 314049, 513668, 468986, 448939, 605352, 510346, 402678, 537874, 364210, 492569, 404046, 465533, 415001, 579050, 355706, 512504, 603666, 465050, 496073, 362711, 441756, 478361, 545308, 737923, 570767, 293313, 62438, 179486, 226860, 702097, 378962, 581417, 549988, 355291, 471231, 631197, 665136, 538978, 46256, 476761, 562944, 625762, 369733, 413293, 545298, 184080, 372350, 199457, 525836, 423127, 432987, 420362, 814315, 449706, 211296, 506406, 547226, 734751, 535182, -52967, 378507, 432036, 582439, 528844, 621601, 325468, 13484, 296556, 574807, 426183, 350987, 291616, 201031, 653857, 461834, 346513, 437693, 487318, 544650, 541861, 610309, 463975]
16210D63975r9019P9793m1928A84008Q3932M1629J17047j20494M6507K32906k90121
16199B95414K91641B63404N7582j16711H9856K36307j8579N9736A66693J13742
16189B80435K24384B39174J11766m8073J14894j19559Q9264n2565j20711J6088
16179B30278L26736B49887E8811L22566A39448q170e6561D40536b1589A98075
16168C68197j45096J09250c295A56405Q6413j8163J47655r1741o6692K0542n3193
16157A81226J02645A29233J95012c0679C95018R1594A30123L00619j97370M4962
16147B78334J11501C2938M07312A98962o8269J14832n1369A4000J13038a14989
16136D56115e5309C9490J51126E4960K2903J65525r0537L42595j81477R7038H8363
$$ y = [463975, 364956, 444749, 402821, 184008, 267940, 309569, 426616, 306122, 352629, 585535, 295414, 587055, 263404, 320986, 204275, 89856, 326163, 307584, 367320, 166693, 280435, 504819, 239174, 350940, 302867, 417761, 298202, 387466, 334901, 214190, 230278, 557014, 249887, 58811, 381377, 139448, 131278, -56561, 440536, -21589, 198075, 368197, 223101, 332351, -3295, 156405, 242818, 224655, 372310, 280569, 213877, 234419, 181226, 283871, 129233, 324245, -30679, 395018, 486612, 130123, 430742, 233372, 278334, 389835, 32938, 440250, 198962, 130693, 245525, 194156, 14000, 127038, -114989, 456115, -55309, 39490, 190616, 54960, 77863, 243388, 152851, 495446, 313969, 411007, 88363]
16124c3376D53043k05864G8791L498j9269a55891B38713o8250R02J39630j23160
16113A87835n2545M5938k5665k342F7762K66047J5075q4297E4272a38649A62210
16101B43397a94484B41590a40999C68804I1461J13570p9781f306A17567J03011
16091B20578L7054l392J78584A32497a17005B31394d9194B95510l5428O2383A25958
16079f7236M343A20867m3406P6174M42053F8878K6915J30728E2218K22289J38398
16068D12905d9339j38311C29443a53070B20860D4966J31344A143K96392e7047
16057I3883P1195F4341K14386o6386d6309C6418L95632a56347H9564j4021J41550
16046B17093N3496e1246B9779L43884A20564K9060J65556a2293k36094D06477
$$ y = [-33376, 453043, 247179, 78791, 82289, 63020, -155891, 238713, 170463, 171365, 310995, 187835, 135290, 181228, 155563, 153221, 67762, 333809, 348884, 264587, 54272, -138649, 162210, 243397, -194484, 241590, -140999, 368804, 91461, 205031, 125250, -6306, 117567, 220578, 257632, 254240, 432824, 132497, -117005, 231394, -49194, 295510, 260082, 322465, 125958, -67236, -62893, 120867, 77461, 153635, 595688, 68878, 95793, 226521, 52218, 274507, 412905, -49339, -187650, 329443, -153070, 220860, 44966, 176310, 1143, 297535, -57047, 93883, 165078, 64341, 278727, 212341, -46309, 36418, 432050, -156347, 89564, 75543, 217093, 270589, -51246, 29779, 373663, 120564, 149624, 315180, -12293, -248387, 406477]
16035B11919B4765h678r5618A70328l4386B5588J05367C1740J67022j781r2824
16024A04157J25563O0444A39643e0995A37745C688J00961J48413a20581F0843
16013A66886N29903b78316I1027K2797J79954B7160J55721H1851c8400I6770M7456
16002A44226A8995J34645C878K58880j24096L9560J64317a68382C83688a18637
15991A51372K5571a04851D16465A00627M5187M32062L39376m9994o9801l08270
15981D89187j68717o6826F4303c5806C9155P2562a41317H292K18210h4879C40595
15969B59776B3740J17083a79311C46377A33764n9108J82843J10669j38906C3029
15958C75022A11519J60458D9538K56406b01718j58068A95204a15772j35498B92258
$$ y = [211919, 24765, -8678, -104296, 170328, 135942, 25588, 130955, 31740, 198762, 196981, 104157, 229720, 290164, 139643, -50995, 137745, 3688, 104649, 253062, -120581, 60843, 166886, 696789, -278316, 91027, 113824, 293778, 27160, 182881, 81851, -38400, 96770, 144226, 18995, 153640, 3878, 262758, 138662, 178222, 342539, -168382, 383688, -118637, 151372, 176943, -104851, 416465, 100627, 145814, 577876, 917252, 867258, 797457, 489187, 320470, 253644, 64303, -35806, 39155, 111717, -141317, 8292, 226502, -84879, 340595, 259776, 23740, 140823, -179311, 346377, 133764, 74656, 257499, 368168, 229262, 33029, 375022, 111519, 271977, 49538, 305944, -201718, -359786, 195204, -115772, -251270, 292258]
15947D5958g5727A06476b8588A31301c9855A8286b88565A30509A5396P7504L16794
15936D09694A22091J19880f1202H0337a40108O0673J1452b7631I3789d6272p1219
15925a17491O050A38749b51333B8761J48883g9547B51191f1645B3980J35477F7785
15913b73811I4497k3340k8959L94413I9508a41978D23910c1455G4798a49337A72391
15901b2116k555A89158E1633L87583G1124K4288i6819B355b5122F2222A0727d044
15888C0261J27829e1443h45E19439B01215p3823d9746A84590K9298b6541A0407
15876C4265L2032b7036c361j24320j34051L17a26530A55005M6579a5533j20330
15865a35863c2991k79451B06607J2928p4113J424C0851a58452A20205Q3074o8288
$$ y = [45958, -75727, 106476, -28588, 131301, -39855, 18286, -288565, 130509, 15396, 92900, 409694, 122091, 241971, -61202, 80337, -140108, -79435, -67983, -27631, 93789, -46272, -117491, -111441, 138749, -251333, 28761, 177644, -79547, 251191, -61645, 23980, 159457, 67785, -273811, 94497, 71157, 42198, 436611, 99508, -141978, 423910, -31455, 74798, -149337, 172391, -22116, -24671, 189158, 51633, 439216, 71124, 95412, -96819, 2355, -25122, 62222, 10727, -4044, 30261, 158090, -51443, -845, 519439, 201215, 127392, -49746, 184590, 213888, -26541, 10407, 34265, 66297, -27036, -3361, -127681, -261732, -261415, -126530, 155005, 201584, -15533, -135863, -32991, -312442, 206607, 219535, 145422, 146846, 30851, -158452, 120205, 203279, 134991]
15854A34991n9340J43435E2410J245d8667E4942a00403a4053j77231R3632a2333
15842C9213K56785A11438a42120j5183o4068i6610E1403Q644d20491e6357a3218
15830b51506A0190b18195F5937r698h0674p3856B75850N19G6273g3417C5832p300
15818B8532P6081L64246d36233A89561p2978a63180F4043K31905c5609A3019K18751
15807B31770J9237a43184J5504m4431C4136f8251o4838F6706a21515c3059k3033
15796e6092p5054A0852L25151b8322C58428h8319k93263A25232i5637H6937j6634
15785G0303B7311J59060b93659A45022l5952J4397P9520h3467B51151E2916a38132
15773f580o4497J8130K1744B09205C3714a75992A54873d1855j66630e6149A72049
$$ y = [134991, 75651, 219086, 52410, 53655, -48667, 54942, -100403, -14053, -191284, -97652, -12333, 39213, 295998, 111438, -142120, -157303, -221371, -96610, 51403, 60047, -420491, -56357, -13218, -251506, 10190, -218195, 65937, 56239, -80674, -154530, 275850, 276369, 76273, -73417, 35832, 28532, 104613, 468859, -436233, 189561, 116583, -163180, 64043, 295948, -35609, 13019, 231770, 251007, -143184, -127680, -172111, 34136, -68251, -133089, 66706, -121515, -33059, -56092, -131146, 10852, 336003, -28322, 358428, -88319, -381582, 125232, -95637, 86937, 70303, 27311, 186371, -293659, 145022, 109070, 123467, 202987, -83467, 251151, 52916, -138132, -6580, -71077, -52947, -31203, 209205, 33714, -175992, 154873, -41855, -208485, -56149, 172049]
15761B89447E9488f9366A38953a19454C24263p716c9934j81369A43304L2986R9844
15750B76134a5429C03685i1358D10514i4264A34883a79103G9820K10096A05809
15739d8395n2129n7588C05171A5201K10168d6529A36042J29681b13532M1298Q0998
15728i1236I586L01688A12426L1354l6149a02036J0887A81114a59287k2347a538
15716C47234A26562L4043A7373a72141A90994k3132e8502A32002b50872a9003
15705A37560E6263J90826I0871g2899A78084b10073b7015o4827k41528A34962
15694c99777a90265A74284d8145F3322a36993H2029J51795K11705b56641c0777
15683a12937n2875k27619A5777O0061e34894b66841m7843c1225D16626b01038
$$ y = [289447, 59488, -69366, 138953, -119454, 324263, 316547, -39934, -221303, 143304, 176290, 276134, -15429, 303685, -91358, 410514, -94264, 134883, -179103, 79820, 289916, 105809, -48395, -100524, -158112, 305171, 15201, 225369, -46529, 136042, 265723, -213532, -172234, -91236, 9586, 311274, 112426, 143780, 107631, -102036, -91149, 181114, -159287, -181634, -1538, 347234, 126562, 160605, 17373, -172141, 190994, 167862, -58502, 132002, -250872, -19003, 137560, 56263, 247089, 90871, -72899, 178084, -210073, -27015, -91842, -333370, 134962, -399777, -190265, 174284, -48145, 63322, -136993, 82029, 233824, 445529, -256641, -30777, -112937, -165812, -393431, 15777, 75838, -534894, -266841, -314684, -31225, 416626, -201038]
15672B52085c9815A43677L18448a3632G328b10034b2207n3945A44860F5872c2494
15660A4612c60923A98185r8297b10105k34409e4800j76486f5239j76376A69942
15649I7064k2516a50356j11239a05288r701I1255a36604K4281A35200D4760h2424
15637B26589F0315K9384m426a98868N3910I8283B145a06792p7747c0213J4972
15626a5241j0149m7304j91337O0346l454A08135k5829h3140B69390c3885G3895
15614h3778j86909K4810j31753A30743P3023b43376j01207B27111D566J4914a91841
15602d23970A3533R3176b11417a9841A31639b91283g0530B0337J04310a05156
15591A45330J3209E5529J79252H0225R0467h0625j99240B54970a11949j25962
$$ y = [252085, -39815, 143677, 462125, -13632, 7328, -210034, -22207, -76152, 144860, 65872, -32494, 14612, -360923, 198185, 99888, -210105, -444514, -54800, -231286, -65239, -241615, 169942, 97064, 74548, -150356, -261595, -105288, -114989, 91255, -136604, -112323, 135200, 44760, -82424, 226589, 60315, 89699, 85273, -198868, -144958, 98283, 2145, -106792, -184539, -30213, -15241, -25390, -72694, -264031, -203685, -207139, 108135, 82306, -83140, 269390, -33885, 73895, -83778, -270687, -245877, -377630, 130743, 203766, -243376, -344583, 227111, 4566, 19480, -191841, -423970, 13533, 106709, -211417, -19841, 131639, -291283, -70530, 20337, 124647, -105156, 145330, 158539, 55529, 234781, 80225, 170692, -80625, -279865, 254970, -111949, -237911]
15581b37911B22856i3483J0669I5540a18235a6824A1947J67255c8863j35598j46448
15570c20909J51354A13544a04391A68411a59489c3474E1189a79088e580A62797
15559d3142m0849a0086D5219j8751i1351C3386A2629b71325A35363b76327A11062
15547a04124j18976k42695B59183D7884K16165A25555C4355N4875J21881a45012
15536B75450a34736A04401A1193b85173H2554c9230Q433A26445L49615b52458
15525D9342K12558F3161b7662A98013q8323K68071F1968a4939C8416Q272d0188
15513a5469A92385D3138a40858A19820R9987D0176a86396G7357b51446D28916
15502i9785j00613A02568b0753A45004d57010b7300C15692a29627A3247J82776
$$ y = [-237911, 222856, -93483, -82814, 95540, -118235, -16824, 11947, 179202, -38863, -174461, -320909, -169555, 113544, -104391, 168411, -159489, -33474, 51189, -179088, -5580, 162797, -43142, -83991, -10086, 45219, 26468, -91351, 33386, 12629, -271325, 135363, -276327, 111062, -104124, -223100, -465795, 259183, 47884, 264049, 125555, 34355, 89230, 211111, -145012, 275450, -134736, 104401, 11193, -285173, 82554, -39230, -30797, 126445, 476060, -252458, 49342, 261900, 63161, -27662, 198013, 109690, 377761, 61968, -14939, 38416, 46688, -40188, -15469, 192385, 43138, -140858, 119820, 219807, 40176, -186396, 77357, -251446, 428916, -99785, -200398, 102568, -20753, 145004, -457010, -27300, 315692, -129627, 13247, 196023]
15492A96023m835q0945d2082A20975j2553R6130c3007D7784L23198j18123e7667
15480A32435K72171o2098l9387M03315C49365R9604q0264D739K88720D2004b14007
15468D9467J38575n5250j1811c22030J11456d4764E1364a00248f012p7169F6620
15456B61005A21405Q162J15829j04279R989a14106a6559D6539K93965P8073G3903
15444C53447M37934L77537p7689C43604j58788J89116j13917b9883E1302J93739
15434B45041a83424h87B18788C070b24921I0626j4369A438R0045L9158K8530a24725
15421D3028A6932f1123p3757A3646Q6610b25631e8579R918C1256b10623D62207
15409a91173K9077j27430A05946a73082O3458B01659q926a92519k0001Q5911l0816
$$ y = [196023, 191188, 110243, -42082, 120975, 108422, 204552, -33007, 47784, 370982, 252859, -57667, 132435, 404606, 342508, 303121, 706436, 349365, 448969, 368705, 4739, 293459, 42004, -214007, 49467, 188042, 132792, 120981, -322030, -210574, -44764, 51364, -100248, -6012, -83181, 66620, 261005, 121405, 129567, 245396, 141117, 151106, -114106, -16559, 46539, 340504, 418577, 73903, 353447, 791381, 1168918, 1091229, 343604, 184816, 373932, 260015, -29883, 51302, 245041, -183424, -887, 218788, 3070, -224921, 90626, 76257, 1438, 91483, 130641, 159171, -124725, 43028, 16932, -61123, -134880, 13646, 100256, -225631, -58579, -48661, 31256, -210623, 462207, -191173, -162096, -289526, 105946, -173082, -109624, 201659, 192733, -192519, -212520, -126609, -157425]
15398a57425A76035A1589P6065g360r0230A48714a24397c7992b651E4052b25571
15386i8952A50841O957a12589j1305d5237r8029n1554B15153G8257J00279e9441
15374A96578Q9270e2694A60117A5704R2382L02348A68174i7160c7578B0070N6003
15363G6073K5426O7563A5608J81912n4510J73052a95631A30766K00007A54344
15352B27322M5090H0990D990J58671n2861J58896A30971P2010J92590j08737J97868
15341D84702P9237B45729d6146G3280K33924A15977m8948K82041H2390C4054i3200
15329I9972D9956L58560a44433A45429J7981c00969b8893F019b35139j4078J23401
15318a25816C30177A51721a70650d3759E359P732L83063d9484c29G0036M3790
$$ y = [-157425, 176035, 11589, 87654, -7360, -97590, 148714, -124397, -37992, -2651, 54052, -225571, -98952, 150841, 157798, -112589, -123894, -45237, -143266, -194820, 215153, 78257, 178536, -59441, 196578, 285848, -52694, 160117, 15704, 108086, 410434, 168174, -97160, -37578, 20070, 76073, 101499, 169062, 15608, 197520, 143010, 316062, -195631, 130766, 330773, 154344, 227322, 272412, 80990, 4990, 163661, 110800, 269696, 130971, 202981, 395571, 286834, 484702, 563939, 245729, -46146, 73280, 307204, 115977, 67029, 349070, 82390, 34054, -93200, 99972, 49956, 408516, -144433, 145429, 163410, -300969, -28893, 6019, -235139, -249217, -125816, 330177, 151721, -170650, -43759, 5359, 13091, 396154, -49484, -329, 70036, 113826]
15307A13826i5884A96158O5174i846B54097g623A16575M0079A1181R158N0557
15296G0896I314b35351E1248J75511i8713C00683a53004C05627b2967A35818d1070
15284g6470j5098a9125q506A68570a68637A53314p0603b94018B95817b13082b0926
15272h7236c1412A81253b40725f4545B9939B956a52872C20740a88616L179j63614
15261c49051A06441j1661a09260A96804c8931B89826H7838a11106c0047j87087
15251b17134B92344I1066K65974P2324c3548I8703a31951b3136D18442N11459
15241I29901J414210q33240J52484J99931F11253j92437b22703N8620f901A46489
15230a89032A00250l6441b06996g9580D9376a28891B0352K68936A19774J46788
$$ y = [113826, -95884, 196158, 261332, -9846, 254097, -7623, 116575, 156654, 11181, 20339, 70896, 9314, -235351, 51248, 226759, -98713, 300683, -153004, 305627, -22967, 135818, -41070, -76470, -91568, -19125, -27631, 168570, -168637, 153314, 82711, -294018, 295817, -213082, -20926, -87236, -31412, 181253, -240725, -64545, 29939, 2956, -152872, 320740, -188616, -185437, -349051, 106441, 94780, -109260, 196804, -38931, 289826, 87838, -111106, -30047, -217134, 292344, 91066, 357040, 429364, -33548, 98703, -131951, -23136, 418442, 929901, 2344111, 1510871, 1663355, 1863286, 611253, 418816, -222703, -164083, -6901, 146489, -189032, 100250, 63809, -206996, -79580, 49376, -128891, 20352, 289288, 119774, 266562]
15220B66562A32157e0000A46241B691h4789A72054M5830a72620n421B41837a23373
15208I5716g3563j41381C3118j2756g0500A4793g5672j99542D86038B03078P5188
15197B78266b1724a677k9828A16958O2508B2429J6056b90298c7854j7653A25727
15185B22495b6930A89915L4046m4712j3342a44833K2920B32158N1270f9483j32523
15174b02006R2777A42631a28416A21483c53763A07276a28569n3086C00879a50764
15163B83852b70405J21708L1606F569J54587l2986J7179m3995a06419B22281B2073
15151D0786d1055E5054J71530A00827b10952C02591I3429C5744A7407M8475a27669
15139b5255A52522P7254d8828k47198B44959e4902J1493C0160M65947b1855p905
$$ y = [266562, 132157, -50000, 146241, 2691, -84789, 172054, 217884, -172620, -178041, 241837, -123373, 95716, -73563, -214944, 33118, 20362, -70500, 14793, -75672, -275214, 486038, 203078, 278266, -21724, -1677, -31505, 116958, 179466, 22429, 38485, -290298, -37854, -55507, 125727, 222495, -26930, 189915, 223961, 179249, 165907, -144833, -121913, 232158, 283428, -69483, -202006, -109229, 142631, -128416, 121483, -353763, 107276, -128569, -181655, 300879, -150764, 283852, -270405, -148697, -117091, 6569, 161156, 128170, 145349, 101354, -106419, 222281, 22073, 40786, -41055, 55054, 226584, 100827, -210952, 302591, 93429, 35744, 17407, 65882, -127669, -25255, 152522, 229776, -48828, -296026, 244959, -54902, -43409, 30160, 496107, -21855, -29760]
15128b9760p9751D5751Q3006E3366M4788K22313a82626F4814L46769k8730A9171
15116A69591J11683R4300h4257B83927l6968g0818G1992c9282k4823H5195A1086
15104A30482a46220F1993b05803C34798a40818B10333q1167f441l547E9119B6833
15092H4663A0155J48247r946L66404B09363p279J68700j72315m5136k0252c2873
15080A79548J31965j45511a44675H781K51486A27959b64638B19285A06775e0998
15069a35746D60525G6382b8820A54764J9375K9563H6236C0160J65091h9500A68101
15057D22327r0003j14220A02190K32479M956a05850C63057n9483o1044J43853
15047C86383J9369A16531D6182K67262g592j82927B15096L3079l8217A04098N8628
$$ y = [-29760, -109511, 45751, 128757, 53366, 98154, 320467, -182626, 64814, 411583, 382853, 19171, 169591, 281274, 375574, -84257, 283927, 246959, -70818, 71992, -39282, -64105, 85195, 11086, 130482, -146220, 61993, -205803, 334798, -140818, 210333, 129166, -6441, -9988, 59119, 26833, 84663, 10155, 158402, 148456, 514860, 209363, 202084, 370784, 198469, 153333, 133081, -32873, 179548, 311513, 166002, -144675, 8781, 260267, 127959, -264638, 219285, 106775, -50998, -135746, 460525, 76382, -28820, 154764, 174139, 203702, 86236, 30160, 195251, -89500, 168101, 422327, 332324, 218104, 102190, 334669, 339625, -105850, 363057, 303574, 242530, 386383, 405752, 116531, 46182, 313444, -7592, -190519, 215096, 248175, 209958, 104098, 162726]
15036A62726J24035H7721J96419O1532J05466A95812L25541J58334j26561J88120
15026G41246k11287k18495J76438A11601Q1040K726K83313K52649j59968B28454
15015D74004k26211k2364J09313o48K7313q9990K13520J72202A91201J59364K6164
15004C76729A79841J60749r465Q5543N1228k20234K2626M53485k23909B43821
14993C81411j42780K08268A13183J73964A18405L55216j83006J30531j67693k7845
14983B25608L78630A97110P94894m13553R4809q5578A27934J75958L85816k88855
14973D00853N2118p3211J23910r0026L7535m3669A94465R6085a08896B10954O7984
14962B78938A09220L64871A88647J51122a7956A46666N6725M0444L3820J56089
$$ y = [162726, 286761, 87721, 284140, 345672, 451138, 195812, 521353, 679687, 553126, 741246, 529959, 311464, 487902, 111601, 192641, 195367, 478680, 731329, 571361, 228454, 474004, 247793, 225429, 334742, 334094, 361407, 271417, 484937, 657139, 191201, 350565, 376729, 179841, 340590, 331125, 416668, 467896, 247662, 270288, 723773, 499864, 243821, 381411, 238631, 446899, 113183, 287147, 118405, 473621, 290615, 421146, 253453, 225608, 604238, 197110, 992004, 578451, 673260, 587682, 127934, 303892, 689708, 400853, 452971, 379760, 503670, 413644, 451179, 407510, 194465, 290550, -108896, 210954, 278938, 109220, 474091, 188647, 339769, -17956, 146666, 203391, 243835, 277655, 433744]
14952D33744q6990A54945b00147B46627n8247M42079P6350B94156P1907J68957
14942E35020A07586J6172N6698L21282B27650K60608j57561K34144o5503N38899
14932A038237q1041k49909L31624j36058J9497L44934M5685L1066j03851k09038
14922A031146J10457K92417K87668J79925p450m2586n78388j2816P684l05626
14912I62431m53584j52794J27279r5320L25532B04820k1417R2506A33952K43098
14902C77050A77591J01176O0522P295q3147N2163j49547K53101j7397n8585A21511
14890A47884J63242N0413M6272K98945m9862o5614j09884k26747L12205L1170
14880E98024K81718l55473B02358M62267k72320J36622j59001K829L7474j27088
$$ y = [433744, 346754, 154945, -200147, 246627, 188380, 630459, 706809, 294156, 366063, 535020, 107586, 123758, 180456, 501738, 227650, 488258, 330697, 564841, 499338, 1038237, 957196, 707287, 1038911, 902853, 922350, 1267284, 1312969, 1344035, 1240184, 1031146, 1141603, 1434020, 1721688, 1901613, 1894163, 1851577, 1273189, 1260373, 1268057, 962431, 508847, 356053, 483332, 388012, 713544, 204820, 183403, 275909, 133952, 377050, 177591, 278767, 339289, 346584, 263437, 315600, 166053, 419154, 401757, 343172, 121511, 147884, 311126, 361539, 407811, 706756, 656894, 591280, 481396, 254649, 566854, 598024, 879742, 524269, 202358, 664625, 392305, 528927, 369926, 372755, 410229, 283141]
14870B83141k3114N5589M00714j77902j42382j36045K86905o0927B31220N08889
14860G40109B83919L82524k76833K25932B21129K84313j19843j19546q686M7354
14850C04721J27714b3353E57211k15166K7131L76357Q9902N179J32310l46653
14840F26271N71803n42449j71387J78870j77324n5672j97862K40565Q3723m3741
14830E12797n4949B09125j5138K89178K02724k52504o4220O2473N0356n5602M87741
14819I14133j77285k42667K8770j65100J70829j84292O9825n8690j20540K99684
14809E34667k01983Q9011M21028j27863j17538J47784l16350L5679K24622j66706
14799E22351l0804j13132K7893J6697g210D89792j23645j62104M81356k21159
$$ y = [283141, 260027, 315616, 716330, 538428, 396046, 260001, 546906, 485979, 231220, 740109, 283919, 666443, 389610, 615542, 221129, 505442, 385599, 266053, 257367, 304721, 432435, -23353, 557211, 342045, 369176, 745533, 835435, 840614, 972924, 626271, 1198074, 655625, 484238, 663108, 485784, 430112, 232250, 472815, 556538, 512797, 457848, 209125, 193987, 483165, 685889, 433385, 369165, 431638, 481994, 426392, 914133, 736848, 494181, 522951, 357851, 528680, 344388, 414213, 355523, 234983, 534667, 332684, 421695, 842723, 714860, 597322, 745106, 428756, 464435, 689057, 522351, 491547, 378415, 406308, 423005, -7210, 489792, 366147, 204043, 685399, 464240]
14789D64240N3j40115K04248J03318p7532L01616B02571N73837p2971B13771m6466
14778A67305L07189J25264m1330N50523k66889l69324N1701B59479N21641k34332
14768E46788j83563j6306J15902j42700K53573M5243m5443G2601L23125o9230
14758C26496J01398K3879Q1514j12219K8102A66358O17202n886C74488J27929
14748E02417A50091K56171J23461K4333k18076p2304M20153r4703O9489k94918
14738C63697K53415Q0770l47085J53464J282L54208j57568J0523K30541j71195
14728G72052L09632L25713J51222l2176l67223j64307M5566k25828l03910J94652
14718G05393C16860o844K99144j78107L86890k16463p5503m3159L27207n0797
$$ y = [464240, 464293, 324178, 528426, 631744, 554212, 855828, 202571, 776408, 703437, 213771, 167305, 474494, 599758, 558428, 1108951, 842062, 472738, 524439, 259479, 781120, 546788, 363225, 346919, 462821, 320121, 573694, 618937, 573494, 72601, 395726, 326496, 427894, 451773, 533287, 421068, 449170, 166358, 783560, 777674, 374488, 502417, 150091, 406262, 529723, 554056, 335980, 263676, 683829, 589126, 658615, 363697, 617112, 697882, 350797, 504261, 505543, 859751, 702183, 712706, 943247, 772052, 1081684, 1407397, 1558619, 1526443, 1159220, 994913, 1040479, 814651, 510741, 705393, 316860, 310016, 609160, 431053, 817943, 601480, 525977, 482818, 810025, 759228]
14708G59228n2276k5134J20577J06016P0578M44335l1856M158K15767l13052j57085
14697A141256J18660n05772k56102j6754Q0248K26261k38020J90387l09514M86386
14687I17036j12954l70553M64537C53640K62195J29346J55059j47059j67951m8328
14677E36902l669L72560q4671j48985J62889l39508K39288J18061C83971L79211
14667G63182j7886j00562J10124L68102n32376M11414k47178J0329N0758L6L17259
14656A133202l83439O8218K00505l14533O5037n6652K75276n1898k87087L08502
14646I57131j07813r6046k6455B65650P17910J64187r4845j6310m73688M45170
14636A008074j6602p4839o7146L46j1150k35323P4090M5377K88525r7431N0671
$$ y = [759228, 706952, 681818, 802395, 908411, 978989, 1423324, 1391468, 1395626, 1611393, 1298341, 1141256, 1259916, 754144, 498042, 481288, 561536, 787797, 549777, 740164, 430650, 917036, 804082, 433529, 898066, 353640, 615835, 745181, 900240, 753181, 585230, 536902, 533233, 905793, 821122, 672137, 835026, 495518, 734806, 852867, 383971, 763182, 745296, 644734, 754858, 1122960, 590584, 1001998, 754820, 765149, 815907, 815943, 1133202, 749763, 817981, 1018486, 703953, 768990, 712338, 987614, 935716, 648629, 957131, 849318, 753272, 726817, 265650, 983560, 1147747, 1052902, 1036592, 562904, 1008074, 991472, 916633, 849487, 849833, 838683, 603360, 677450, 722827, 1011352, 913921, 964592]
14625I64592J64287M0822k42738l35729N79584m45229L45949l43558L77292l90676
14615G14596L05847k20331R5797L40034j79151O1114j34211P5850m01117M04592
14605A063020K3740K0357J50833k78247o0883J77449J92879K6672j20326R8314
14595A293808p1250j56402J50652j34739K2844l0155R5826J81631r5258r127K09190
14584A457020k50837Q1301r9413K44128k41801M23364J84278m37001L15391k08085
14574A468345k64745L84083J37265j80726J50689l363J38406j76870J24410j28555
14564A648939L934J80652r6494m1022k266M55515l50171L88670p2814M29717N4316
14553B598976J55155J31844K39838P47403J100903L428292Q449458K2272521n71293
$$ y = [964592, 1128879, 1169701, 926963, 591234, 1170818, 725589, 1071538, 727980, 1105272, 714596, 1020443, 800112, 895909, 1235943, 1056792, 1117906, 983695, 1059545, 658428, 1063020, 1086760, 1107117, 1257950, 979703, 918820, 1096269, 1289148, 1315820, 1195494, 1293808, 1222558, 1066156, 1216808, 1082069, 1104913, 1074758, 1170584, 1352215, 1256957, 1247830, 1457020, 1206183, 1287484, 1188071, 1432199, 1190398, 1613762, 1798040, 1361039, 1676430, 1468345, 1203600, 1587683, 1724948, 1544222, 1694911, 1691548, 1829954, 1653084, 1777494, 1648939, 1652873, 1833525, 1737031, 1696009, 1693743, 2149258, 1799087, 2187757, 2114943, 2544660, 2598976, 2754131, 2885975, 3125813, 3873216, 4974119, 8402411, 16851869, 39124390, 38553097]
14544C8553097A4705822E810639B794294j005899k06766K60713M33844K394467
14536D670653p11674j802362o14994r4340L4462j54125M8875M3649K65343O4205
14526A749692j69123M3619l2193o85J06656j73296N03254k37689J84402Q076j59379
14515A823334L8363r7403j2529N03411m43981J20735j01652J67984j50597M9117
14505A896782K34278j35322R6051j65449J08837O82233o87625M43931l06277K81020
14495B448459L4570p0680K06407k29373L2563M6236r4860p2095K39267N5585k01291
14484B394788K59101K7147J34361j30304J51483j8270M174j26183M30538n62321
14474B564514O15433J26582k54126j72300L71282j53020k4015J55568J44562n2463
$$ y = [38553097, 14705822, 5810639, 2794294, 1788395, 1581629, 1842342, 2276186, 4670653, 3958979, 2156617, 1541623, 1447283, 1481745, 1327620, 1376495, 1420144, 1685487, 1749692, 1580569, 1624188, 1591995, 1591310, 1697966, 1524670, 2027924, 1790235, 1974637, 1982713, 1823334, 1861697, 1764294, 1751765, 2255176, 1811195, 1931930, 1830278, 1998262, 1847665, 1896782, 2131060, 1995738, 2091789, 1926340, 2035177, 2717410, 2029785, 2473716, 2167439, 2448459, 2483029, 2412349, 2618756, 2389383, 2421946, 2468182, 2373322, 2301227, 2540494, 2596079, 2394788, 2653889, 2681036, 2815397, 2685093, 2836576, 2818306, 2822480, 2696297, 3126835, 2564514, 3179947, 3306529, 3052403, 2880103, 3251385, 3098365, 3074350, 3229918, 3374480, 3322017]
14464C322017p3600m1867o9709K31761j12293J77717K19661k1639R2832j92506
14454C532374J6842K40778K00726k28301p4811N00355l510J2959j00900q3522
14444D012990r3260Q1079N24107P8757k97516K77159K07816j11257r1371P3488
14434D661992K11641K36576k88013Q1355L00846J64676Q2924m27507L28028J33932
14424E486450K93926L32102j11005m90777L12890M15417j64873k73986O60350
14415F460494j24909r2689j05873M77264j0376J90409J85864L29640K52068j13404
14405G448488m43833M3803L22309r1723N87898j84817K42033j3947J00794J27993
14395H138998J20259K59330q7819L65963J26309Q8754J50032J28442K58304L83167
$$ y = [3322017, 3248417, 3206550, 3136841, 3368602, 3256309, 3434026, 3653687, 3632048, 3724880, 3532374, 3549216, 3789994, 3990720, 3762419, 3687608, 4187963, 4184453, 4197412, 4096512, 4012990, 3919730, 4000809, 4524916, 4603673, 4306157, 4583316, 4791132, 4679875, 4588504, 4661992, 4873633, 5110209, 4822196, 4903551, 5204397, 5369073, 5451997, 5024490, 5352518, 5486450, 5780376, 6112478, 6001473, 5510696, 5823586, 6239003, 6074130, 5800144, 6460494, 6335585, 6242896, 6137023, 6614287, 6603911, 6794320, 6980184, 7309824, 7561892, 7448488, 7004655, 7048458, 7370767, 7279044, 7866942, 7682125, 7924158, 7910211, 8011005, 8138998, 8259257, 8518587, 8430768, 8796731, 8923040, 9011794, 9161826, 9290268, 9548572, 9931739]
14385I931739j70419L95297K72820M07790l46266M23789K40925q3809O04993J3160
14375A1690019J45831K30998L69261J20775O21811Q4757K25334M76873M23276
14366A4388935K5829j50179N98083J96950K34335L47489K94153N53862L24908
14357A6814365L15537K32106O07017Q44214J84899J51520N22167N49590P19219
14348B0940634J62877Q00409M25802N43969R34845K73733P02255Q83829O20304
14339B6288657M95628R39484J008280N93953O48133J310347R61879O03677J578092
14330C4428130Q41734J395082M01619J794422J235458J489117J356220J507410
14322D4449192J766099J446218J340924J863380J792000J969125K085627K339966
$$ y = [9931739, 9761320, 10156617, 10429437, 10837227, 10490961, 10914750, 11155675, 11071866, 11676859, 11690019, 11835850, 12066848, 12436109, 12556884, 13178695, 13263452, 13488786, 13965659, 14388935, 14414764, 14264585, 14862668, 15059618, 15293953, 15641442, 15935595, 16489457, 16814365, 17129902, 17362008, 17969025, 18813239, 18998138, 19149658, 19671825, 20221415, 20940634, 21103511, 21903920, 22329722, 22873691, 23808536, 24082269, 24784524, 25668353, 26288657, 26784285, 27723769, 28732049, 29326002, 29974135, 31284482, 32246361, 32850038, 34428130, 35269864, 36664946, 37066565, 38860987, 40096445, 41585562, 42941782, 44449192, 46215291, 47661509, 49002433, 50865813, 52657813, 54626938, 56712565, 59052531]
14314E9052531K295404K481918K688431K477354L329754K903235L136035L562709
14306H1927371L900825M017769M358615M300446M829961N092645N655246O022849
14298A20105727N919061O617343P165411P451869Q109549R089790R292974R999047
14290A83750771J0673497J1259381J1896880J2377824J3484108J3634814J4670562
14283B71747837J5028249J5413727J5830102J5687129J5939950J5402901J4933219
14276C79983114J3824941J2834664J1591785R189568M756568K047134O6042k183293
14268D32110523j611409k419546m647649r452033j1923163j3809274j5050734
14261C73196715j5859780j6489606j6293232j6253929j6215912j5478521j5134416
$$ y = [59052531, 61347935, 63829853, 66518284, 68995638, 72325392, 75228627, 78364662, 81927371, 85828196, 89845965, 94204580, 98505026, 103334987, 108427632, 114082878, 120105727, 126024788, 132642131, 139807542, 147259411, 155368960, 164458750, 173751724, 183750771, 194424268, 205683649, 217580529, 229958353, 243442461, 257077275, 271747837, 286776086, 302189813, 318019915, 333707044, 349646994, 365049895, 379983114, 393808055, 406642719, 418234504, 427424072, 432180640, 434227774, 434293816, 432110523, 430499114, 428079568, 423431919, 413979886, 402056723, 388247449, 373196715, 357336935, 340847329, 324554097, 308300168, 292084256, 276605735, 261471319]
14254B61471319j4597353j3341966j3111874j2313825j1431905j1198830j0006523
14247A75469043p107492r180372q488005p526127p623140p034966o425198n926754
14239A16156989n835120m801290n014774m487264m681026m197510l760241l342169
14231H0037595k800132l468713l441232k558019l121799k404353k667087k300524
14223E7275736k015311j764730j997924j878324j430947k052675j397181j938773
14215D2799871j032059q42668j546854j349835j046525j065859j452928j067534
14207C3395609J8752j340644j339494o20835q60872r21284m47091n02784r62104
14198B6419253o14104r53676p66619l11976o31259m91678n26927o03815p41413
$$ y = [261471319, 246873966, 233532000, 220420126, 208106301, 196674396, 185475566, 175469043, 168361551, 159181179, 150693174, 143167047, 135543907, 128508941, 122083743, 116156989, 110321869, 105520579, 100505805, 96018541, 91337515, 87140005, 83379764, 80037595, 77237463, 73768750, 70327518, 67769499, 64647700, 62243347, 59576260, 57275736, 55260425, 53495695, 51497771, 49619447, 48188500, 46135825, 44738644, 42799871, 41767812, 40925144, 39378290, 38028455, 36981930, 35916071, 34463143, 33395609, 33414361, 32073717, 30734223, 30113388, 29252516, 28331232, 27884141, 27381357, 26419253, 25805149, 24851473, 24084854, 23772878, 23141619, 22649941, 22123014, 21519199, 20777786]
14189B0777786k15526m60670o73926n71199o36220O3301n48723l25945j21927
14180A7286951p99790k55993l66490k70700j50565l81070l82012M685q74170J90229
14170A4001075o00210k49192j17197l38761j66080m53610J36091k00102n36666
14161A1475348J75892p71952k1643l43391J40655j10947m77038J94429l93220
14152I868133j05423j79509J703m16497R4253k82557R454L858l30748l76458r4619
14141H191590J61342j30710j95116l96027L30853o22723K58609j68306q6813p7878
14131G264821k5313k05115k85971j9006O7864r1113j23420L3591M5782m86281
14121F175839m16365M76231m00865K95376j04192n21149K24719J07731o9675j88897
$$ y = [20777786, 20562260, 20101590, 19427664, 18856465, 18220245, 18283546, 17734823, 17408878, 17286951, 16487161, 16231168, 15864678, 15593978, 15443413, 15062343, 14680331, 14685016, 13810846, 14001075, 13400865, 13151673, 13034476, 12695715, 12529635, 12076025, 12212116, 12012014, 11475348, 11651240, 10879288, 10857645, 10514254, 10654909, 10543962, 10066924, 10261353, 9868133, 9762710, 9583201, 9584904, 9168407, 9262660, 8980103, 8989557, 8993415, 8662667, 8286209, 8191590, 8352932, 8222222, 8027106, 7631079, 7961932, 7339209, 7597818, 7429512, 7342699, 7264821, 7239508, 7034393, 6748422, 6729416, 6797280, 6706167, 6582747, 6616338, 6662120, 6175839, 5759474, 6235705, 5834840, 6130216, 6026024, 5504875, 5729594, 5837325, 5767650, 5578753]
14111E578753j83345q6714k02775k211M02593k01915l52769J10342j5949k13672
14101D832338m7093j4274P3931j66020n0300P4261l04707K1008K05460l52163
14091D272441J90091O0093n26675L47891o0769m18808N6917n879K21760n46962
14081C590100K44113k16646K97359j90506k03721Q2296J77538m52596J7864n4037
14071C291764J22823n9325K16589m40680L33430k35491o7332J96115J10212j90352
14061C277753J7927l5612Q5283j85488j74191K01087l64718K8171r3514K64844
14051C021542k11820Q184L8618l0113j0867k41910L26874m79844K58534n07378
14041B171820N55879j11854l2325J4880Q7712l82728L1746J20551Q9589m1248
$$ y = [5578753, 5395408, 5308694, 5105919, 5103708, 5506301, 5304386, 4951617, 5061959, 5046010, 4832338, 4785245, 4770971, 4844902, 4678882, 4628582, 4702843, 4398136, 4419144, 4624604, 4272441, 4462532, 4522625, 3995950, 4343841, 4283072, 3864264, 3921181, 3915302, 4137062, 3590100, 3834213, 3617567, 3914926, 3724420, 3520699, 3602995, 3780533, 3327937, 3345801, 3291764, 3414587, 3355262, 3571851, 3131171, 3464601, 3229110, 3161778, 3357893, 3468105, 3277753, 3295680, 3260068, 3345351, 3159863, 2985672, 3186759, 2822041, 2850212, 2756698, 3021542, 2809722, 2817906, 2856524, 2826411, 2815544, 2573634, 2900508, 2420664, 2679198, 2171820, 2727699, 2615845, 2583520, 2598400, 2686112, 2303384, 2335130, 2455681, 2545270, 2504022]
14031B504022P6368j81487K10723J2858k17031j10391q0758J62207l32075K10124
14021B254560M7308k05522k02834N75568l70706k06989R8397l19675J84846q0545
14011A774408L6779J15153K12685j80072o38420L21193N03851k44146R6820k13286
14001A784965j30797J45452J03611k44262l00430m8196L23830R1131J95500l12529
13991A608275K08191K31959K83019J216263N692657J8271288J8886365k2697240
13983B3700777A1242760n043637j878186r24006l43550k67914j81154k33968o2209
13974B308136k36883K00298j32058j13331k35844J41948k7471M10956n19395m8165
13964A748191K34130J43562k58767k60047j49126j0658L43282k69048o35K58078
$$ y = [2504022, 2580390, 2398903, 2609626, 2622484, 2405453, 2295062, 2214304, 2376511, 2044436, 2254560, 2301868, 2096346, 1893512, 2469080, 2098374, 1891385, 1989782, 1670107, 1854953, 1774408, 1811187, 1926340, 2139025, 1958953, 1320533, 1641726, 2145577, 1901431, 1998251, 1784965, 1654168, 1799620, 1903231, 1658969, 1358539, 1310343, 1634173, 1725304, 1920804, 1608275, 1816466, 2048425, 2331444, 3547707, 9240364, 27511652, 46398017, 23700777, 11242760, 6199123, 4320937, 3396931, 3053381, 2785467, 2604313, 2370345, 2308136, 2071253, 2271551, 2139493, 2026162, 1790318, 1932266, 1904795, 2315751, 1796356, 1748191, 1982321, 2125883, 1867116, 1607069, 1457943, 1447285, 1790567, 1521519, 1520884, 1778962]
13954A778962m6419j00270l15601J10370K43759J70672l23895K72427k96643j7274
13944A476088j3884J45106P9710k86700K18237n85234P5330K27148Q5657j08748
13934A312710J71697K01890k40602K46823m08526l29966L47677J47283R5523Q2907
13924A627416n24766N6698M8062J48584p172r2139n6358j31730J04015o1793J35382
13913A246199p4007n699J17259k45602J3905N8698J19409m33471J44005L8075
13903I78771K6488K6319K01345j37933M8298J32696j16297j48792j21813K17098
13893A106180j20623P9700j51880M6293O23623o44417J60629r978k49633l3270
13883H06624J62154l6712L8820J66521m56416j8602L98494k26697L26378k20131
$$ y = [1778962, 1732543, 1632273, 1316672, 1427042, 1670801, 1841473, 1517578, 1790005, 1493362, 1476088, 1462204, 1607310, 1687020, 1400320, 1618557, 1033323, 1108653, 1335801, 1421458, 1312710, 1484407, 1686297, 1445695, 1692518, 1283992, 954026, 1301703, 1448986, 1544509, 1627416, 1102650, 1159348, 1207410, 1355994, 1348822, 1256683, 1200325, 1068595, 1172610, 1110817, 1246199, 1172192, 1166493, 1283752, 1038150, 1052055, 1110753, 1230162, 796691, 940696, 978771, 1005259, 1031578, 1232923, 1094990, 1143288, 1275984, 1159687, 1010895, 889082, 1106180, 985557, 1065257, 913377, 959670, 1583293, 938876, 1099505, 1089527, 839894, 806624, 968778, 932066, 970886, 1137407, 680991, 662389, 1060883, 834186, 1160564, 940433]
13873I40433K12873Q0135E15017M01749M5448p4103Q3463k52692k54992M4417
13863E08307K82885R0506l03731L47865k36405K92256o4771j65255J52570N4003
13853I58230m1909j71555L00424k76743n0622J84719k75879K71879M0193l03798
13843F34939L27993l87288K50639m8959J80480J22295n40030K35964j09217j32842
13833E33974J14154K80177l07709K49736j99421q5138K07284o3166K25172l5984
13823I19079l89620L17846D12674N57969k81568J0202j16918L11531j74748p6677
13813F42465k39760L74437j09397k83034J07385k0597l4776p2176L74364j46137
13803E92774L3550k69996M72929p7040O4400N1619j80005J19971j96767p7660
$$ y = [940433, 1153306, 1233441, 515017, 916766, 962214, 888111, 971574, 718882, 463890, 508307, 791192, 881698, 577967, 925832, 689427, 981683, 916912, 751657, 904227, 958230, 916321, 744766, 1045190, 768447, 717825, 902544, 626665, 898544, 938737, 634939, 962932, 575644, 826283, 777324, 957804, 1080099, 540069, 776033, 666816, 533974, 648128, 928305, 620596, 870332, 670911, 585773, 793057, 729891, 955063, 919079, 529459, 847305, 412674, 970643, 689075, 699277, 582359, 893890, 719142, 642465, 402705, 777142, 667745, 384711, 492096, 471499, 436723, 364547, 738911, 592774, 626324, 356328, 829257, 752217, 816617, 868236, 688231, 808202, 611435, 533775]
13793E33775M07523j20696l50621J28758j02308j10711L53963K7218k13077j64769
13783C89055J90667j00979J08228j85756m05K47881o2948k14005J31460K68210
13773G71408j89148K81110A53903K43916K91437k37956N1546Q1141J34853m1829
13763F77011Q8808j405j19470m4057r1386j59670J55107J31788K2236n0690K58337
13752H66609l68236L7810K13272j54125j33116o7757M15695G8640K73455p829
13742C44266J35832A90675j2065L67769j54266K33639j99525j03727J19495R6711
13732E38706j59325A29924K56506j84211M57659k87281K59629j75204B19827G285
13721D75910K29550B85441j9697K42195J58590C12969K99026j23503I7319M54638
$$ y = [533775, 941298, 820602, 469981, 598739, 496431, 385720, 739683, 766901, 553824, 389055, 579722, 478743, 586971, 401215, 400810, 648691, 585743, 371738, 503198, 771408, 582260, 863370, 153903, 397819, 689256, 451300, 502846, 583987, 718840, 677011, 765819, 764414, 644944, 600887, 509501, 349831, 504938, 636726, 658962, 608272, 866609, 498373, 536183, 749455, 595330, 462214, 394457, 810152, 78640, 352095, 344266, 480098, 190675, 178610, 546379, 392113, 625752, 426227, 322500, 441995, 538706, 379381, 129924, 386430, 202219, 659878, 372597, 632226, 457022, 219827, 7285, 475910, 705460, 285441, 265744, 507939, 666529, 312969, 611995, 488492, 97319, 551957]
13711E51957J07574J41970C48173L06373l02503J23737J40473k14712j87055L76029
13701E90515k89199M09728B30807L41700j88642J22301H9264L19673D6274L27586
13691C73860K95815k59665N7661a1530B89046L67765j65215j42528L11413O535
13681F67016j88781o6887A95532N37923C41777J50615l1025A71235K02979K04994
13671E79208n6503j31632j46641N2408o987R7382J95956A32256N0166J53848K95692
13660F31962j95976m4351J73460k43141J49639o9129j45567E3705M1537N07993
13650F03235A69528N0267J71616d705A22850K54950K38037l02855O0545L20862
13640F94389C09724j36408D5814L72376j56711o8117K0891K45753j06297Q2203
$$ y = [551957, 659531, 801501, 348173, 654546, 352043, 475780, 616253, 401541, 214486, 590515, 301316, 711044, 230807, 572507, 383865, 506166, 89264, 408937, 46274, 373860, 669675, 410010, 467671, -11530, 289046, 656811, 491596, 349068, 660481, 667016, 478235, 411348, 195532, 733455, 341777, 492392, 461367, 171235, 374214, 579208, 522705, 391073, 244432, 296840, 289853, 387235, 583191, 132256, 182422, 336270, 631962, 435986, 391635, 565095, 321954, 471593, 402464, 256897, 53705, 95242, 603235, 169528, 219795, 391411, -4705, 122850, 377800, 615837, 312982, 373527, 694389, 309724, 173316, 45814, 418190, 261479, 193362, 214253, 460006, 353709, 435912]
13630D35912J14964A477N04122j21191A28279D5852R38153B29791A00123K43181
13620C43304j0793j59992k0872M1949q6616n674J5895K02305A55982J05080J69423
13609D30485G2324K4730J08729E6910K76164r3721l0400J88574P6290c5629A08916
13597C19274O1707H5636K11336n9480Q4402A46594J85000K09928B12668P2378
13587B85046j05816J02502D4401L16893m2855J35009A68474P8651j027a21100
13576C88719J5839j52875K283I1226K64570N1587j63373q6160P5237O8668j24375
13565A77380J7770Q600K12562j86444G1436L83219A47267K88770r8319a72274
13554B20214p0065N37529j57870j19458A77099l6323K25429A73380J68044n7962
$$ y = [435912, 550876, 1477, 505599, 384408, 128279, 45852, 984005, 229791, 100123, 343304, 332511, 172519, 151647, 193596, 106980, 101306, 117201, 319506, 155982, 261062, 430485, 72324, 97054, 205783, 56910, 333074, 239353, 208953, 397527, 473817, -35629, 108916, 319274, 380981, 85636, 296972, 237492, 321894, 146594, 331594, 541522, 212668, 285046, 179230, 281732, 44401, 361294, 318439, 453448, 168474, 247125, 246098, -121100, 388719, 404558, 251683, 253966, 91226, 355796, 407383, 244010, 157850, 233087, 301755, 177380, 195150, 203750, 416312, 229868, 71436, 454655, 147267, 436037, 337718, -172274, 220214, 150149, 687678, 529808, 410350, 177099, 140776, 366205, 173380, 341424, 283462]
13544B83462A6163N33214k63485C5681M76436r3796a0691B28941d9530C84510
13533D02675k4254j23123I9998J08112K6775F5965M20794H6364O0203g7520L5563
13522d1957C79731A359J91944p1025a54220C85233A5065L73137r6449i4848A7349
13510A36522k4864R8314J21295l347D8616J99436J3766j26509P1781J22486j21642
13499B07934L1676R4007m3734E1475M2701J15517a03886G0981a0213F6774L20668
13488C87442A52040J78762q4856n2034K4013L38456j41916A50601K91054b93527
13477A62540k1017J39206r4639B2867J98476a05366A36035M19337H9036h9462
13466B91857J0892A48600M73J00076p3145n4319Q57J53525a69351B88012h129
$$ y = [283462, 16163, 549377, 285892, 35681, 512117, 418321, -10691, 228941, -49530, 384510, 402675, 378421, 255298, 99998, 208110, 234885, 65965, 486759, 86364, 146567, -77520, -41957, 379731, 1359, 193303, 122278, -154220, 385233, 15065, 388202, 291753, -94848, 17349, 136522, 111658, 209972, 331267, 327920, 48616, 248052, 261818, 135309, 207090, 329576, 207934, 239610, 333617, 289883, 51475, 94176, 209693, -103886, 70981, -10213, 66774, 387442, 152040, 330802, 245946, 193912, 217925, 556381, 414465, 150601, 441655, -293527, 162540, 141523, 280729, 186090, 22867, 221343, -105366, 136035, 555372, 89036, -89462, 291857, 302749, 148600, 149073, 249149, 176004, 121685, 122542, 276067, -169351, 288012, -8129]
13454B51733A03475e2840A93451f4646r570C01480q9755K55333A48500R9683q784
13443B39399N9486A16700K2910a43182A34725A4297K37834K1107G2917h2364F0594
13431B37478j755A13901K7621P2354a06674D41608k09557b47226a2562A65851
13420d0156C43421i7481A03231J85976L0872J18621I3139L64250j54995n9607
13410B42787d3183C78195m9075n0997M7456l1418g7428A94799H9627d9C76617
13398B16960l6476L60671A30263a75173B36477J85753b08982B06024H5454R4667
13388A80121L35717A6592J13555L62422A68356k003P0557m6379a1058A2846b8865
13376B94284E1311f5400H5237a637D16214A95597L5188q8690J05476K11030A96842
$$ y = [251733, 103475, -52840, 193451, -64646, -74216, 301480, 211725, 467058, 148500, 248183, 239399, 298885, 116700, 139610, -143182, 134725, 14297, 252131, 273238, 72917, -82364, 60594, 237478, 235723, 113901, 141522, 213876, -106674, 441608, 232051, -247226, -12562, 165851, -40156, 343421, -97481, 103231, 289207, 320079, 438700, 93139, 457389, 302394, 242787, -43183, 378195, 329120, 278123, 325579, 294161, -77428, 194799, 89627, -49, 376617, 216960, 180484, 541155, 130263, -175173, 236477, 422230, -208982, 206024, 85454, 180121, 515838, 16592, 130147, 492569, 168356, 166353, 236910, 190531, -11058, 12846, -28865, 294284, 51311, -65400, 85237, -1637, 416214, 195597, 230785, 142095, 247571, 458601, 196842]
13364A55758L82267A63153O8412e7790E31668M6380H5012J6718J19432I0805N3322
13353A44127n1586a26686D59774a01503A25886M8870n4662P3031J0668L47779
13343E51572A22445J37250J72797k10825k4308k2000Q8630E2823R4218R8265J93971
13332D39277j55052j40098o1748J07019J07694P8106j34944j9220G283L93904
13322D01187A09957N6255a54234C45580j10391a76671G13661A52375K21834F8884
13311D23318p9754j11245l053J51277J07685A34630J39117m9262f9705H5109A4418
13299d3924E6368J28774H3049i3074e084I2479c09058C55806L1372n6710A31403
13287A65684f9296J9442A74834B8396N2248O0805K24974r1102k3317c956E8803
$$ y = [155758, 538025, 163153, 231565, -57790, 531668, 578048, 85012, 101730, 221162, 90805, 144127, 92541, -126686, 459774, -101503, 125886, 174756, 120094, 193125, 203793, 551572, 122445, 259695, 432492, 221667, 197359, 175359, 263989, 52823, 147041, 245306, 439277, 284225, 144127, 82379, 189398, 297092, 375198, 240254, 221034, 7283, 401187, 109957, 166212, -154234, 345580, 235189, -176671, 713661, 152375, 374209, 68884, 423318, 343564, 232319, 229266, 380543, 488228, 134630, 273747, 224485, -69705, 85109, 14418, -43924, 56368, 185142, 83049, -93074, -5084, 92479, -309058, 355806, 387178, 330468, 131403, 165684, -69296, -49854, 174834, 28396, 80644, 141449, 366423, 275321, 252004, -3956, 58803]
13275A07106g8401A00282j9542a85828d066E4021j845Q9135J9164e6947B2685
13263C66275h374B38322e723A19674K29056A04457J15040a05228F6070k4879i039
13251B68659M2881G5966k9247h7826b0748k79026B13976J13655d8120r6648E7343
13239A27513a7918A5356P4922a97071A10238P2670m9326m2821b19418A12773a04880
13227C23412e3288F0208A3007k982e99A66829a40562N8731c0859j95082F4499
13215A9116O3563a60348d5398D42387A03888k0871a02197A95621C4782A2946J71502
13204A84448A8975a68953O640A16813l5757l6460c07847A3941K54115a43878f0904
13192C82801A30108R2040n7973J14930A7641J94074J33808b99365A33130b20999
$$ y = [107106, -78401, 100282, 80740, -185828, -4066, 54021, 52176, 141311, 160475, -56947, 22685, 366275, -8374, 238322, -5723, 119674, 348730, 104457, 219497, -105228, 66070, 41191, -9039, 268659, 311540, 75966, 46719, -87826, -20748, -299774, 213976, 327631, -48120, -144768, 57343, 127513, -17918, 15356, 90278, -197071, 110238, 182908, 133582, 90761, -219418, 112773, -104880, 323412, -53288, 60208, 13007, 10025, -599, 166829, -140562, -81831, -30859, -225941, 64499, 19116, 82679, -160348, -45398, 442387, 103888, 83017, -102197, 195621, 34782, 12946, 184448, 18975, -168953, -162313, 116813, 81056, 44596, -307847, 13941, 268056, -143878, -60904, 382801, 130108, 222148, 164175, 279105, 17641, 211715, 345523, -299365, 133130, -220999]
13181C14612j19852m4959J7685K50070F5972J4193c50713B17994n4892J37661
13171C00763A8104L80511f3268B5552b15387C34158A46417J40047A7321K49076
13161B66397m1972J5638I9333M3177L097J54791G1728j3770J04998L5074b12016
13149A9446J67398J75714a42388j15454C2792e3666C45708E8777d01162C1690
13138B47892C7877e8331l8475f343j61276A88660a9790C63480i3373L8686A86719
13126h2617k9736A67754B8981L0046b62879E8800J27322b41537E7236O7600K5649
13115A50485c8885I7633J10652C4482L6096L2468a45615J9546A89095K9256B3102
13103d6786m40A34803i719B33138J22329B1669a67588A2620a79360p7213j8682
$$ y = [314612, 194760, 149801, 167486, 417556, 65972, 80165, -350713, 217994, 163102, 300763, 18104, 398615, -63268, 25552, -215387, 334158, 146417, 286464, 17321, 266397, 224425, 240063, 99333, 142510, 145607, 300398, 71728, 57958, 162956, 198030, -212016, 19446, 186844, 362558, -142388, -257842, 32792, -53666, 345708, 58777, -401162, 31690, 247892, 37877, -58331, -96806, -6343, -167619, 188660, -19790, 363480, -93373, -54687, 186719, -82617, -112353, 167754, 28981, 59027, -262879, 58800, 186122, -241537, 57236, 124836, 150485, -38885, 97633, 208285, 34482, 70578, 103046, -145615, -126069, 189095, 218351, 23102, -46786, -47226, 134803, -9719, 233138, 355467, 21669, -167588, 12620, -179360, -256573, -275255]
13092b75255C50367b5254j6326B66449a53533P52j06435Q4185N3371d0684G0629
13080A78817N8838c0140D0074A1436J36374A4960c1361l8798A45331k0736E7218
13068C36096f2849B80061H4973j4636c74957J80507P8920C08993q7903f6675J9381
13057d7294j48147g0368B6817J55900b18675B15585C4504a6981j2076F6221e2597
13045C81221E4509b75781A85308C5264K20002A4789J73512P9963a0542D21455
13034G7534J80239b49379D3911K08908g264l56473A74125b01231B0193a67263
13023a61126d5303A40060a53272k19600D941J33599o1943a10444A99411Q0961
13013B80372g7583r4193A32291F4156J76959E3781L8963A5299J22063a94505h3945
$$ y = [-275255, 350367, -25254, -41580, 266449, -153533, -152781, -259216, -175031, -121660, -40684, 70629, 178817, 237655, -30140, 40074, 11436, 147810, 14960, -31361, -70159, 145331, 124595, 57218, 336096, -62849, 280061, 84973, 70337, -374957, -194450, -115530, 308993, 221090, -66675, -47294, -195441, -70368, 26817, 182717, -218675, 215585, 34504, -16981, -29057, 66221, -52597, 381221, 54509, -275781, 185308, 35264, 255266, 14789, 188301, 268264, -10542, 421455, 77534, 257773, -249379, 43911, 252819, -7264, -363737, 174125, -201231, 20193, -167263, -161126, -45303, 140060, -153272, -372872, 4941, 138540, 76597, -110444, 199411, 280372, -77583, -171776, 132291, 64156, 241115, 53781, 92744, 15299, 137362, -194505, -83945]
13001g2766G0934J5399J21807P8537k1950r7700a84461j49869A20048a13015B2784
12989a2406k7278I2744a2898l62992e9765a7417B54640J01521i0929A43035P7291
12978B20326c5792j07710H7775J16760N808O1831a44664B0572N5177J07162K8452
12967B11363J16134F5383R7907J37300A11169a09542j32441B77620C4286J26739
12957A61025r72h9069B21634B9628b81153A81825c09303A23766N3250E7660j7432
12946D0228N5992P8054H4175a64489g9243o985n2312C672J74347n8863P9230a9336
12933b25116I3651P9200b09458H5461a09267A03777d2412B36472F9216b32804
12922a26508A31551N4457K1704c05191j86253E8959k7010L2660j982b33765A45968
$$ y = [-72766, 70934, 86333, 208140, 286677, 264727, 167027, -184461, -334330, 120048, -113015, 22784, -12406, -39684, 92744, -12898, -375890, -59765, -17417, 254640, 356161, -90929, 143035, 220326, -35792, -143502, 87775, 204535, 210343, 272174, -144664, 20572, 75749, 182911, 211363, 327497, 65383, 163290, 300590, 111169, -109542, -241983, 277620, 34286, 161025, 160053, -89069, 221634, 29628, -281153, 181825, -309303, 123766, 177016, 57660, 40228, 96220, 174274, 84175, -164489, -79243, -86228, -138540, 3672, 178019, 119156, 198386, -19336, -225116, 93651, 172851, -209458, 85461, -109267, 103777, -42412, 236472, 69216, -232804, -126508, 131551, 186008, 207712, -305191, -491444, 58959, 31949, 64609, 62627, -233765, 145968]
12910F5237Q4482C1949a42378L6a6033p6558c6714B3278d1005A56889J76490b39936
12897E3763a28523C897a01034B28464B3154A115L79205m721I0093f5837L1378
12886c4459k07916A9386c3307j51604A22368a50262j06863L7005n3022a3484j11015
12875a24499A1171d9672A92174I949L73170h2877A10080a36436B1775e1332a8942
12863d1512r5732d2560k56601g3991a7576j37734J3211A6645e3569d636q2865
12852h7501k24618A03556a22499A29006d3180j4860J4266A25379M9941c71558
12841b30359A90931P2170b76085J23951A9031a32977j075N0672L7083C9025L5106
12830G4131b25580i1028A55622a21807A1891b78068j1150B37577n9822p0626Q7388
$$ y = [65237, 149719, 31949, -142378, -142342, -16033, -92591, -36714, 23278, -41005, 156889, 333379, -239936, 53763, -128523, 3897, -101034, 228464, 23154, 1115, 380320, 375599, 90093, -65837, -34459, -242375, 19386, -33307, -184911, 122368, -150262, -257125, -220120, -273142, -13484, -124499, 11171, -49672, 192174, 9949, 383119, -82877, 110080, -136436, 21775, -51332, -18942, -41512, -137244, -42560, -299161, -73991, -17576, -155310, -142099, 16645, -53569, -4636, -87501, -312119, 103556, -122499, 129006, -43180, -58040, -43774, 125379, 175320, -371558, -230359, 190931, 263101, -276085, -152134, 19031, -132977, -134052, -83380, -46297, 39025, 74131, -225580, -91028, 155622, -121807, 11891, -278068, -289218, 237577, 177755, 107129, 194517]
12819A94517p9311a95965G7219M9780L0141E7838k4831i6997D5874d0201A9534
12807a43970b655B03492C6316b0698A16285D9326F791J791b0176j25441K9876
12796a15741C67061C8702J808J6858c450m3705A51524R8175c6173k7432B10258
12784A22991B7729a36210j47369B0085h9418n9208A09444K13976A44818a31487
12773H4633a16678j16414A32815K7036d07129a32751F7469a06422j07174H2246
12762G3360a66638J5475b9033f961A15138O9853b07975d4972j45490B2949g3083
12750A04151D2721b2368l2859B8979c4686n5076d1400l12109A93891Q5231A31525
12738B47547a24014k3752b7607j30856A17333A8285e255E3497J92405a87702K0591
$$ y = [194517, 115206, -195965, 77219, 126999, 157140, 57838, 33007, -96997, 45874, -40201, 19534, -143970, -2655, 203492, 36316, -20698, 116285, 49326, 6791, 8582, -20176, -145617, -115741, 367061, 38702, 40510, 57368, -3450, -47155, 151524, 249699, -36173, -63605, 210258, 122991, 27729, -136210, -283579, 20085, -89418, -148626, 109444, 323420, 144818, -131487, 84633, -116678, -233092, 132815, 159851, -407129, -132751, 67469, -106422, -213596, 82246, 73360, -166638, -151163, -29033, -6961, 115138, 184991, -207975, -44972, -190462, 22949, -73083, 104151, 42721, -22368, -55227, 28979, -34686, -89762, -41400, -353509, 193891, 279122, 131525, 247547, -124014, -147766, -27607, -158463, 117333, 18285, -5255, 53497, 245902, -187702, -167111]
12727a67111I6113B4610a16949d2214j78296B65940F6883K42120b82198C77841
12716A80650a0431G4510B6110h9654B02666a25960f1097A61278n6617a00116D5909
12704B92387o1170f5872A09327b421F4426M2188b32805a6970j7368m6499L2678
12693d8159B93875a5260l06876A56062n066b53962J17795B45251g3935A80733
12682B05939H9169a80205A15646a59959b0026q8951o9049L9044A22578J64083
12672B86661r4110K18973a28939A92957H416O1360c17259G7465K30429p3544a13041
12660B6783L10868b92636J09563a4125B16204J01792A11320J12246e104j29682
12650a34786A40069a93797A77034a45204O3986E5353J52725m8579d03733a7403
$$ y = [-167111, 96113, 24610, -116949, -42214, -220510, 265940, 66883, 309003, -282198, 377841, 180650, -10431, 74510, 26110, -89654, 202666, -125960, -61097, 161278, 104661, -100116, 45909, 292387, 231217, -65872, 109327, -2421, 64426, 106614, -232805, -16970, -34338, -80837, -48159, 293875, -15260, -322136, 156062, 150996, -253962, -136167, 245251, -73935, 180733, 205939, 89169, -180205, 115646, -159959, -20026, -108977, -178026, -138982, 122578, 286661, 192551, 411524, -128939, 192957, 8416, 69776, -317259, 77465, 307894, 234350, -113041, 26783, 337651, -292636, -183073, -14125, 216204, 317996, 111320, 223566, -5104, -134786, 140069, -193797, 177034, -145204, -81218, 55353, 208078, 159499, -403733, -17403]
12639A88825g0723C8121O9848Q4989p5417A0568C662i0737B12171B8435b914A21689
12626A27395J14953K5639a94652B37578n2708h5855A71373e2622A43604h014A49334
12614i6413r5288J8521A49064b65366g8096F4968F537M8876O831b52670A02581
12602A1007K2380A0271M1263K92791A14151L29328a76944A14026K4516I656a25775
12590b09636a01931O125j19665l8808G2581a38512O0903K1215j12964D0751L2046
12579G2797b77288f2448C56380b72404H552J95591a32138A12878D0240e3062C9423
12567a9628A44912E2075c1920A23011N9576o3660a07945B62278G514e5419j83756
12556b39175K42a6309F4128a91184H686f0131k25102E5822c3471A15093N3182
$$ y = [188825, -70723, 38121, 107969, 192958, 117541, 10568, 3662, -90737, 212171, 28435, -2914, 121689, 127395, 242348, 267987, -194652, 237578, 184870, -85855, 171373, -52622, 143604, -8014, 149334, -96413, -191701, -173180, 149064, -265366, -78096, 64968, 6537, 55413, 62244, -252670, 102581, 11007, 33387, 10271, 51534, 344325, 114151, 443479, -176944, 114026, 138542, 9656, -125775, -209636, -101931, -95806, -215471, -254279, 72581, -138512, -77609, -56394, -169358, 40751, 72797, -277288, -62448, 356380, -272404, 8552, 204143, -132138, 112878, 40240, -53062, 39423, -19628, 144912, 52075, -31920, 123011, 182587, 118927, -107945, 262278, 7514, -55419, -239175, -238933, -16309, 64128, -191184, 8686, -60131, -285233, 55822, -33471, 115093, 168275]
12545A68275b36229B98186i7964C83062c9534B22658q4990a69238A81375H0040
12534f5336I5611B7459b0891G3385b3595k9954B20207B7259k5N30P8600K33076
12522C39440a23211B94422C6698a38822C7014c5152n0095B45157j10677J38245
12512B72725b78891E4277a4050l6812j8301m5201G8919l5876a08990B54132H8513
12500A19197E4081N92505C00043L12879A30128K74425A78820o2639Q6172J68648
12490C71001A36425h8595q6598k7402l1948C57219a42801f8669r7998j013B16728
12478a38655D1652J2945o455e958j81694N1530A58469E5791M8454J65873J09119
12467C79237j51233h8373C59094A10577C838b67122f1298C56456c372A0415K04347
$$ y = [168275, -236229, 298186, -97964, 383062, -39534, 222658, 137668, -169238, 181375, 80040, -65336, 95611, 27459, -20891, 73385, -23595, -53549, 220207, 27259, 27234, 27764, 106364, 339440, -123211, 294422, 36698, -138822, 37014, -35152, -85247, 245157, 134480, 272725, -278891, 54277, -14050, -50862, -69163, -114364, 78919, 43043, -108990, 254132, 88513, 119197, 54081, 646586, 300043, 612922, 130128, 404553, 178820, 116181, 202353, 371001, 136425, -88595, -175193, -202595, -234543, 357219, -142801, -68669, -166667, -167680, 216728, -138655, 41652, 54597, 48142, -5958, -187652, -136122, 158469, 55791, 104245, 270118, 379237, 228004, -88373, 359094, 110577, 3838, -267122, -61298, 356456, -3372, 10415, 214762]
12456B14762m2563b47167B6847b23879B29048b19228C2883b06368P8249C11141
12445B15332g8491D5028J12491b2065F6272P6818L1837a54297A35706J72949q8652
12434B20003a77729B21024r3203Q2055E6248c05464K4724h1762A88077a00672
12423c8551E2730G722P0572A9532c7423l8112b7023j8378q8630c4531E3833A0446
12410A91599b29306A25214E145f5355k19702e5205F0627a5030B4841b8151l6039
12399f4190j54584d2012A92779E5286f0072B80291g627k06430a9521A15722J5975
12388A31697N8687I997L3870K5401P4090b42552B07617a4715A58614p6845d119
12376H1365f657A19346D594g8872G8849f8853q1243B10532a86917g7511J2920
$$ y = [214762, 172199, -247167, 26847, -223879, 229048, -219228, 32883, -206368, -128119, 311141, 215332, -78491, 45028, 157519, -22065, 66272, 143090, 174927, -154297, 135706, 308655, 220003, -177729, 221024, 127821, 209876, 56248, -305464, -280740, -81762, 188077, -100672, -38551, 52730, 7722, 78294, 19532, -37423, -75535, -27023, -45401, -134031, -34531, 53833, 10446, 191599, -229306, 125214, 5145, -65355, -285057, -55205, 60627, -15030, 24841, -28151, -64190, -218774, -42012, 192779, 55286, -60072, 280291, -7627, -214057, -19521, 115722, 131697, 190384, 9997, 43867, 69268, 143358, -242552, 207617, -14715, 158614, 81769, -4119, 81365, -6657, 119346, 4594, -78872, 78849, -68853, -150096, 210532, -186917, -77511, -64591]
12365f4591j72400N7498G4118E527J68703i9401A41316c82768a22743j03346I2786
12353a84228C5437a09507b6538H1932c1807l4710A65861d2943o8274L8954D1539
12341c0265r883H2840J9186a78140K0400A54891a6888l4963r235B50849M5190
12330B96039A24830J57722e6408B45252e1365F8285N3699B0615q880O1202J96627
12319B69564A17080c07875a49498e1049C57503o3456c1400B70327I6084c3277
12308A19937P6505K9892a64701O4489I960K74885m3270a23392f115j77694Q0921
12297a02888C15764A21452I372J03223a40810I3585B5382d2284A5298J39697j0595
12286A44400b77963A15165L1020I456K7564b6560E874J62314G4968k4447J3527
$$ y = [-64591, -236991, -179493, 74118, 5527, 174230, -99401, 141316, -382768, -122743, -226089, 92786, -184228, 35437, -109507, -26538, 81932, -31807, -66517, 165861, -42943, -111217, -72263, 41539, -30265, -40148, 82840, 102026, -178140, -157740, 154891, -16888, -51851, -61086, 250849, 296039, 124830, 282552, -56408, 245252, -51365, 68285, 121984, 20615, 11735, 72937, 269564, 117080, -307875, -149498, -51049, 357503, 294047, -31400, 270327, 96084, -33277, 119937, 196442, 226334, -164701, -100212, 9960, 284845, 241575, -123392, -6115, -183809, -102888, 315764, 121452, 9372, 112595, -140810, 93585, 25382, -42284, 15298, 154995, 144400, -277963, 115165, 146185, 9456, 37020, -26560, 5874, 168188, 74968, 50521, 64048]
12275F4048J78819d7634a6695B14273d4045A65150M2896F7929J26833b42380B40037
12263E8203J64593Q4520d7580K1213A67109N8139e5612r3536j49303C78714j82968
12252A95746K10653e4828F3756M4090J35070F6034J70818C9182M5357P1388a03106
12240A52600J76309A29289A2230L31191b1862Q2O478B33177q9965j2171k9873
12229A01168r917K37992a0673j57875C32199n9838A11414R0314B7836K83562r4249
12218B17149J58522D3502K49684H8605L08395P2336A23667K72445A02256C4287
12207B25208O0168F1903L91590G1867J08234M0209a45545D78368I6075o649J85355
12196B74781I2221P1570o2750J70632J6934q814G6195N7786K61379o2035J48032
$$ y = [64048, 242867, -47634, -16695, 214273, -44045, 165150, 208046, 67929, 194762, -242380, 240037, 58203, 222796, 307316, -47580, -26367, 167109, 225248, -55612, -149148, -298451, 378714, 195746, 406399, -54828, 63756, 107846, 242916, 66034, 236852, 39182, 84539, 155927, -103106, 152600, 328909, 129289, 12230, 343421, -21862, -21780, -15302, 233177, 143212, 131041, 101168, 91251, 329243, -10673, -168548, 332199, 272361, 111414, 201728, 27836, 311398, 217149, 375671, 43502, 293186, 88605, 397000, 469336, 123667, 396112, 102256, 34287, 225208, 285376, 61903, 453493, 71867, 180101, 220310, -145545, 478368, 96075, 89426, 274781, 92221, 163791, 101041, 271673, 288607, 279793, 76195, 133981, 395360, 333325, 481357]
12185D81357J47265j52201k33019n5534K71391B10866a11331E62013A90792R2318
12175B83110J60550A37218M93064D5121K28032L36103B61615J57284j90892P271
12165B35278N8469J0813J05080j60093h374A17526J85945o1541j14244j4223K9577
12154A43040E9319N3061J52865B4912a32039A66295a69223p2020D20476G0054
12143A87861F0445a10308C18459M9229Q2915h7048c6730B80814a5591j67174Q4653
12132i8112b3471C47490e7837B04006k3229J18995o8216d412A88801l3121J09218
12121B64898a2586A27586J36532n7270M6489D8289f9327A58292E6741K0368a12292
12109B09049F3889L8707K90412j72972a76952e4843b123B58549H0390C3284b1901
$$ y = [481357, 628622, 476421, 243402, 187868, 459259, 210866, -111331, 562013, 190792, 283110, 443660, 137218, 630282, 45121, 273153, 609256, 261615, 418899, 228007, 235278, 293747, 304560, 409640, 249547, -8374, 117526, 303471, 241930, 127686, 113463, 143040, 59319, 112380, 265245, 24912, -132039, 166295, -169223, -241243, 420476, 70054, 187861, 60445, -110308, 318459, 367688, 450603, -87048, -36730, 280814, -15591, -182765, -98112, -23471, 347490, -57837, 204006, 180777, 299772, 231556, -4412, 188801, 155680, 264898, -12586, 127586, 264118, 206848, 253337, 48289, -69327, 158292, 56741, 77109, -112292, 209049, 63889, 102596, 393008, 220036, -176952, -54843, -2123, 258549, 80390, 33284, -21901]
12097B07397e9855G2955b03140B3512J15479O9709J52068E7734a60289A49943
12086A88349b32258D01719a80303F3691J52071E186c9652A78821k2459J40118
12076B96480F2701e5853I13b05811A35330R3884a95667C1868a79684C19122R2972
12065D12094A4337L6751a44690B1719K5494a94398I0392d7195A33808g4410I726
12053A93203a37319A43933e1784a18A04972Q6204a72397b937A36618g0145L2501
12042c7644B8305L08386j41556D3218J1551a80596g7815B0507e4496a568n3808
12031e5376I4582K6402i349B1416K26057g3865j22440A98357c2493m5602B681
12019a64286A62463J36851a79169A02182j0312K8170h8502B30822c0300A78120
$$ y = [207397, -59855, 72955, -203140, 23512, 138991, 208700, 360768, 57734, -160289, 149943, 188349, -232258, 401719, -180303, 63691, 215762, 5186, -39652, 178821, 156362, 296480, 62701, -55853, 913, -205811, 135330, 229214, -195667, 31868, -179684, 319122, 412094, 14337, 51088, -144690, 21719, 47213, -194398, 90392, -47195, 133808, -74410, 9726, 193203, -137319, 143933, -51784, -118, 104972, 191176, -172397, -2937, 136618, -70145, -37644, 28305, 336691, 195135, 43218, 54769, -180596, -77815, 20507, -54496, -1568, -55376, 94582, 120984, -9349, 21416, 247473, -73865, -196305, 198357, -32493, -78095, 2681, -164286, 162463, 299314, -179169, 102182, 91870, 120040, -88502, 230822, -30300, 178120]
12008a32197B54326a53802B8627K53542K6693A01958b8455j54319A4771f5679
11997c01098R0381B28708R8287H0164d55724B48821b62355N158J20035L2405p7693
11986a82450c5466J3883A60084b6800o4467j39835P8347A30279b9207B48721g9577
11974h149k34527c5835B5994N8918a1428j70617C39313i2827m5684C8384i7089
11962b54656N4611B39903c6609o0806F832a62447e8332E5037a82534A8310a64957
11950g0328E0358b99249J28165e847k52951b312A13295b28195a5562F0561b2375
11938b42602f5630A09161e7768D1300a44118a9248r3096D9800a33107A8525c59354
11926C438M41636F6550c34478a34102M1902j94774i4565M4121D47146A17250e9093
$$ y = [-132197, 254326, -153802, 28627, 282169, 308862, 101958, -28455, -182774, 14771, -65679, -301098, -210717, 228708, 326995, 80164, -455724, 248821, -262355, -257197, -137162, -104757, -182450, -35466, -21583, 160084, -26800, -91267, -231102, -152755, 130279, -29207, 248721, -79577, -8149, -242676, -35835, 25994, 84912, -11428, -182045, 339313, -92827, -138511, 38384, -97089, -254656, -200045, 239903, -36609, -97415, 6832, -162447, -58332, 55037, -182534, 18310, -164957, -70328, 50358, -299249, -171084, -5847, -258798, -2312, 113295, -228195, -15562, 60561, -22375, -242602, -65630, 109161, -57768, 41300, -144118, -19248, -112344, 49800, -133107, 18525, -359354, 3438, 445074, 66550, -334478, -134102, -92200, -286974, -94565, -50444, 447146, 117250, -59093]
11914a62048o922B35146a77355A26768k1044R4344c7226r5945d1098j02105L664
11903a39539l08284A08488a25447l1843b6148k23345C6712i9897j34160P3169
11893a60888H8624c7798A04993R3877K1592H1800L7423a03910C746g9480A32618
11881a58143j04369o0595a2541l0682A29734a5233j07333o1339P4591J2990m3493
11870a39817B42032h660q6808c0902k12123A40871a77230f9688j4892C0591K69172
11859B99763b0874H3377a97981f86k59013o3299M648B03092n2360i5548M0660
11848e4888B287b95303A36683N4314b4318D8928a53095B6239b85744A96769J03637
11837C00406A00500c54261a24367B1192a54252E9693J10335g7190a728G3204b50569
$$ y = [-162048, -168970, 235146, -177355, 126768, 105724, 200068, -37226, -133171, -41098, -143203, -139539, -447823, 108488, -125447, -157290, -26148, -249493, 36712, -99897, -234057, -160888, 88624, -37798, 104993, 198870, 220462, 81800, 119223, -103910, 3746, -79480, 132618, -158143, -262512, -323107, -12541, -43223, 129734, -15233, -122566, -183905, -109314, -96324, -139817, 242032, -8660, -95468, -30902, -243025, 140871, -177230, -69688, -84580, 30591, 299763, -20874, 83377, -197981, -686, -259699, -322998, -318350, 203092, 150732, -95548, -54888, 2287, -295303, 136683, 190997, -24318, 48928, -153095, 26239, -285744, 196769, 300406, 100500, -354261, -124367, 21192, -154252, 59693, 170028, -77190, -1728, 73204, -250569]
11825E0418a00465B60700A5406J71520a44739r7448J2383A06391a0669D986L0655
11814C5641o905a77349D0317O0482a32365Q263B24981i9450D2325e1210B09405
11802i6192C718J37460n3871M2647e0219k1138F4260b02207j20777c0059j87213
11791b17272Q0747E1949a16865j31189i3982k1012j9654k25152A9973L36845E7507
11779A76193c98807b4579m43017A56889f2775A71823o1532C6846b25263R6920
11769a28343N2486b3308C2337d6826j35928M4313c8265k89164P5735C9274D723
11757a2819B27195E8930J18963A3432a73189h3558k7569A97648a2293A74019N4412
11746B28431a32182j4495B23333a14865B5767h2578j20967m270i1694A05222a24977
$$ y = [50418, -100465, 260700, 15406, 186926, -144739, -242187, -229804, 106391, -10669, 4986, 35641, 28736, -177349, 40317, 100799, -132365, -124102, 224981, -99450, 42325, -51210, 209405, -96192, 3718, 141178, 87307, 129954, -50219, -71357, 64260, -202207, -322984, -30059, -217272, -136525, 51949, -116865, -248054, -93982, -114994, -134648, -359800, 19973, 356818, 57507, 176193, -398807, -24579, -467596, 156889, -62775, 171823, 110291, 36846, -225263, -128343, -75857, -23308, 32337, -46826, -182754, -138441, -38265, -327429, -251694, 39274, 4723, -12819, 227195, 58930, 177893, 13432, -173189, -83558, -111127, 197648, -12293, 174019, 228431, -132182, -146677, 223333, -114865, 25767, -82578, -203545, -207815, -91694, 105222, -124977]
11734d570A0171d3680l3967l248A09385B7279J86728c5763C03724H2883b333l30988
11722c33321J59481E7418a18362C0438J00846d67529a27348C60059a06817j57373
11712b64190b1789C174d5667a2426j92557c8148j00255f6839j51467d0958m2151
11701h3109h033k6802B0247m305a51884l7548d1291l68060b02349E0650K48283
11690B98933j34708e3220J0377D5501a4424G466a38922l0461B90221r8374k0840
11679A71007N0171b4824B97000a72262L3687r2373A85357r2408J91763J54519
11669D39231b17544M6273j35454A23662m6424k5759J42170c3721j20820A3997
11658A29908e9927A40206l5814h7965I9003a1013G1370J15304D6275b25242H4848
$$ y = [-4570, 10171, -43680, -77647, -80895, 109385, 27279, 214007, -35763, 303724, 82883, -2333, -333321, -173840, 57418, -118362, 30438, 131284, -467529, -127348, 360059, -106817, -264190, -21789, 3174, -45667, -12426, -204983, -38148, -138403, -66839, -218306, -40958, -83109, -8033, -34835, 20247, 15942, -151884, -189432, -41291, -409351, -202349, 50650, 298933, 164225, -53220, -42843, 45501, -14424, 7466, -138922, -169383, 290221, 191847, 171007, 221178, -24824, 297000, -172262, -138575, -230948, 185357, 92949, 284712, 439231, -217544, -171271, -306725, 123662, 77238, 51479, 193649, -33721, -154541, 13997, 129908, -59927, 140206, 104392, -87965, 99003, -11013, 71370, 186674, 46275, -225242, 84848]
11646A23397c02305A17393a33722d8007A53923b65151a08064q7786d6533D7095
11635a29030j9060f4814E7135d4720A05941C7872K36460b43608B89587a17710
11624I7768J27002A00528J91085B7727L37100A28527a26208A03601k742J9952
11614A20811L3175J1965B7494J25274h0644j96365B6369d3780B65801d2049B99826
11602B05238b05240A91716H9239a09352C1612i1986o6992d7805B70174q6944C8212
11590F1938b8781j15615E9387a21765j10294j90480A91561b38840a17870D4509
11579a60066q5008i8742B39693I4101J20523c6926C01451I2534N5578F0139Q0817
11568A40956J73917j40615J40321D1987a25856e1762n7024I310a9950k7098A80171
$$ y = [123397, -302305, 117393, -133722, -48007, 153923, -265151, -108064, -195850, -46533, 47095, -129030, -148090, -64814, 57135, -44720, 105941, 37872, 274332, -243608, 289587, -117710, 97768, 224770, 100528, 291613, 27727, 364827, 128527, -126208, 103601, 100859, 120811, 153986, 165951, 27494, 152768, -80644, -277009, 26369, -43780, 265801, -42049, 299826, 205238, -205240, 191716, 89239, -109352, 31612, -91986, -158978, -47805, 270174, 183230, 38212, 61938, -28781, -144396, 59387, -121765, -232059, -422539, 191561, -238840, -117870, 44509, -160066, -245074, -98742, 239693, 94101, 214624, -36926, 301451, 92534, 148112, 60139, 140956, 314873, 174258, 314579, 41987, -125856, -51762, -108786, 9310, -19950, -47048, 180171]
11556a80853I3074J23114K1875A17496Q2293p3907M8382A64J81597N3604B0491
11544A1079L50589e0430B62097F5252A936L48951b3573J120A41843o6033L7554
11533A13364Q963K2258o8271a22266j49949C32414a63597I7899e5480G9301a59163
11521a31775A79121c1940l7463C58003H7089K44437b0919C52444A61286C5986
11510A24678m8782B3653a13416B40430O8705H7774a27045B89750C4713c705j78132
11499a81837C48590J6517E3447O8516n2726i94j9938H2144O6335C5791K21479
11488B57270M5387Q9698j91546q713b6271j91110B85511A34052J78547j12681
11478A99918b69046B99069p6485Q45H2426J75747A9602J85215o5190h7069j6333
$$ y = [-180853, 93074, 216188, 238063, 117496, 199789, 125882, 174264, 164, 181761, 235365, 20491, 11079, 361668, -50430, 262097, 65252, 1936, 350887, -23573, -22453, 141843, 75810, 113364, 122327, 144585, 76314, -122266, -272215, 332414, -163597, 97899, -55480, 79301, -159163, -131775, 179121, -31940, -69403, 358003, 87089, 331526, -20919, 352444, 161286, 35986, 124678, 75896, 23653, -113416, 240430, 309135, 87774, -127045, 289750, 34713, -3705, -181837, 348590, 365107, 53447, 121963, 69237, -994, -20932, 82144, 148479, 35791, 257270, 302657, 392355, 200809, 192096, -26271, -217381, 285511, 134052, 312599, 199918, -269046, 299069, 222584, 223429, 82426, 258173, 19602, 204817, 139627, -87069, -103402]
11467a03402A83174F6612L0081L44310B11390L06634b44578B15947p9774a19005
11456B19530o4330J63819m4090D7685J0853f1406r9048K6270M1119H3164e648
11444C39024F9949L03624o4875g8523E4605J38960o9978R2728h2837A10056J15853
11433B25909H7135J52785a00714B92268E8075J19152o6333b08785A84294a66752
11422b06243N3377A3268L28031a45466O6932A01612c4603j35129C53647j19157
11412B34490f1270B2037a46928A03745K90002F8594a40773A96868A7545a38166
11401B0532J69928c0114m8348l49414H5971B8601J86526e4654j44229Q7866A6463
11389a39214N9392q4930A02515a86796E763g9767A68471b23201O5088A4588a66239
$$ y = [-103402, 183174, 66612, 96693, 441003, 211390, 518024, -244578, 215947, 136173, -119005, 219530, 155200, 319019, 274929, 47685, 58538, -61406, -160454, -134184, -93065, 83164, -5648, 339024, 69949, 373573, 308698, -78523, 54605, 193565, 123587, 216315, -82837, 110056, 225909, 87135, 239920, -100714, 292268, 58075, 177227, 110894, -208785, 184294, -166752, -206243, -152866, 13268, 341299, -145466, -78534, 101612, -34603, -169732, 353647, 234490, -61270, 22037, -146928, 103745, 393747, 68594, -140773, 196868, 17545, -138166, 20532, 190460, -30114, -78462, -427876, 85971, 28601, 215127, -54654, -198883, -111017, 16463, -139214, -79822, -164752, 102515, -186796, 5763, -79767, 168471, -223201, -158113, 14588, -166239]
11377b24020e6831m9674q1958e0099G14J03941a05530C38276g3586c5320q2008
11366a17328k00507B3804c95539C4505e0980A46563p0024b99590J29307n2431
11356b22714F3803d813r7274A06457a75711A24252F410i9646R053j15713M4709
11345a61597o821N0805B11500a48973a5246k70831A44680c46834f0160l1704j18017
11334b09881Q8987a8671A42800b35976A44378k8408i7j49062E8706c75516E6710
11322a0512C0035d3120o3512o8688A05117C3572a00228E6900b25901a07005n6855
11311a63860F7285K62825p0978o7834a36322A02689b29411R8651r897E3146f7849
11299b78192N3836k46220R9470D5461K38801a2220q8646G439B567c60327a9704
$$ y = [-224020, -56831, -106505, -188463, -50099, 714, 104655, -105530, 338276, -73586, -35320, -117328, -317835, 23804, -395539, 34505, -50980, 146563, 76539, -299590, -170283, -222714, 63803, -4813, -102087, 106457, -175711, 124252, 6410, -99646, -90593, -206306, -161597, -168418, -117613, 211500, -148973, -15246, -286077, 144680, -346834, -60160, -91864, -209881, -120894, -18671, 142800, -235976, 144378, 115970, -97, -149159, 58706, -375516, 56710, -10512, 30035, -43120, -106632, -175320, 105117, 33572, -100228, 56900, -225901, -107005, -163860, 67285, 330110, 259132, 191298, -136322, 102689, -229411, -130760, -140657, 53146, -67849, -278192, -224356, -470576, -371106, 45461, 284262, -12220, -100866, 7439, 2567, -360327, -19704]
11287f3657p2003k69813d95A19151a82905j27182B05742B8835J03509h8011o5841
11276a53852A96040H319e7936l1025A14024i8744A60805d0167F8275c1860A76599
11264A20826a22897e3418B66375Q719c6913k57063b8821j66737k4981C7061e0819
11252a10974I8902m7095Q5597c9239k17356n4892e1544G375b22343A65997a23852
11240B77088o5447G4879b84832b2357l22537a5991j95154L6083a3939A16532b1268
11228a91993A87189I085d85234B820L954a7480A94669e6327D9887b5470k7143
11217e2613Q95K2619r8446A21872c0706a464A04980b57205k1442J16252F391P2767
11205G9158d793A57493n1193Q8168e2378l02213A13377a04539c0949A5382b21317
$$ y = [-63657, -135660, -405473, -495, 119151, -182905, -310087, 205742, 28835, 132344, -88011, -153852, 196040, 8319, -57936, -88961, 114024, -98744, 160805, -40167, 68275, -31860, 176599, 120826, -122897, -53418, 266375, 275094, -36913, -293976, -28821, -195558, -220539, 37061, -50819, -110974, 98902, 51807, 137404, -39239, -256595, -311487, -51544, 7375, -222343, 165997, -123852, 277088, 211641, 74879, -284832, -22357, -344894, -15991, -211145, -175062, -13939, 116532, -21268, -191993, 187189, 9085, -485234, 2820, 6774, -17480, 194669, -56327, 49887, -25470, -52613, -51718, -29099, -127545, 121872, -30706, -1464, 104980, -257205, -278647, -162395, 6391, 79158, -4793, 157493, 106300, 194468, -52378, -354591, 113377, -104539, -30949, 15382, -221317]
11193a65798G9979a62493I9931g963j50527J5948J5400k3363N566B7382J85928
11182B13310b1766k14856G8509b87154Q5958K8353D2263h4399A08477h2448a1931
11170h1215A1207J24884b51079g1673L3857k91019A92921b20349j08541F6233
11159h9323L0272J4669E2391a04546d9753k32118J20146e6322A90014E198B150
11147a64799L2369L7746A04730d145n8031E3874K03603a44124D2853a3571B47217
11135A08534O0237a68088d7631J8248a2563k0764P770j6943C9303a09364A078
11123D6600K2101O2282a88769e5378C58181J3195a3655k78347A382K63229j06307
11112A58304o4226Q4913m8192C4119J7828c80756a00373A21915A1764d7107C24237
$$ y = [-165798, 79979, -162493, 99931, -7963, -158490, -142542, -127142, -150505, -144939, 27382, 213310, -21766, -236622, 78509, -287154, -201196, -172843, 42263, -84399, 108477, -82448, -11931, -81215, 11207, 136091, -251079, -71673, -37816, -328835, 192921, -220349, -328890, 66233, -89323, -59051, -44382, 52391, -104546, -49753, -281871, -161725, -56322, 190014, 5198, 2150, -164799, -132430, -94684, 104730, -4145, -62176, 53874, 257477, -144124, 42853, -13571, 247217, 108534, 168771, -168088, -47631, -29383, -12563, -33327, -25557, -42500, 39303, -109364, 1078, 46600, 68701, 130983, -188769, -55378, 358181, 371376, -13655, -292002, 1382, 264611, 158304, 94078, 178991, 130799, 34119, 51947, -380756, -100373, 121915, 11764, -47107, 324237]
11100I0705a97965g0500b9895P333B15658o9338F7285K36698q6168G3532L01362
11089C74894j7258n7561K12198A88762J0692K92235j33639A54244k4275A9000
11078B53834o1445q6684J42133I1345K33913j49104o580K2958J95103C7272N33167
11067E70439j4144F1873M71943O8172l8308B20131L19865L5849n9567q9237K22712
11056F49753J36266k39170n6885J06880O2479K12829l79224K55128k77769Q6362
11046E56649L70683J65201j58640l19732j7478L14090K4943J35627O2189K0760
11036A154292m30966R0106k05398L09898k7316j83350J29525J16787j59746j12205
11026F81627K15317n5236J10885K13073l36000m9477K68070k16773k76959r7674
$$ y = [90705, -197965, -70500, -29895, -22562, 215658, 146320, 67285, 303983, 217815, 73532, 374894, 357636, 300075, 512273, 188762, 199454, 491689, 358050, 154244, 129969, 19000, 253834, 192389, 105705, 247838, 91345, 325258, 176154, 169574, 192532, 387635, 37272, 570439, 556295, 61873, 533816, 601988, 563680, 220131, 539996, 575845, 516278, 427041, 649753, 786019, 546849, 489964, 596844, 659323, 872152, 492928, 748056, 470287, 556649, 927332, 1092533, 933893, 614161, 596683, 910773, 935716, 1071343, 1133532, 1154292, 723326, 813432, 608034, 917932, 890616, 707266, 836791, 953578, 793832, 681627, 896944, 841708, 952593, 1165666, 829666, 780189, 1048259, 831486, 554527, 456853]
11016D56853K24799R2406n1371J91575l39770J49352J80397C59247K00271q2630
11006D76888K94965M08813m12065J31186P4399r4721k44918J39613k0868j0904
10996G42388n371j58551K68303k24973O9944m6247J85158j21415K16122j93768
10986G31590r2409J48835j55707L39430K5113Q0990k37154j41001M14870K81318
10976A395875k99749L81672j61850J38639J89723k71095N75289J64062K95416
10967B407982K99531p1351M83222O02157K56242k43541K03996q03695j43969q95592
10957B094982j21723k46045k71100Q9644k49296q9100K37428j46092j31697m2627
10947A124374P348N8502k09761J03148m44335r60j2249k54003J01866A85834j6766
$$ y = [456853, 681652, 774058, 722687, 914262, 574492, 723844, 904241, 359247, 559518, 476888, 771853, 1180666, 768601, 899787, 974186, 879465, 634547, 774160, 753292, 742388, 737017, 578466, 846769, 621796, 691740, 645493, 830651, 709236, 925358, 731590, 639181, 788016, 632309, 971739, 996852, 1077842, 840688, 699687, 1114557, 1395875, 1096126, 1477798, 1315948, 1454587, 1644310, 1373215, 1948504, 2112566, 2407982, 2707513, 2636162, 3119384, 3721541, 3977783, 3734242, 3938238, 3134543, 2990574, 2094982, 1973259, 1727214, 1456114, 1545758, 1296462, 1207362, 1444790, 1298698, 1167001, 1124374, 1131722, 1190224, 980463, 1083611, 639276, 638316, 626067, 372064, 473930, 185834, 169068]
10936A69068K00934C8035J83556d4114C77360A24490J72261H904a30631r1589
10926b22220I7454L8851a00843k0387C98251C7827f5966H7954J32786c2754A11756
10914b18646f2862j08974D7666O6081c68458h0183A84554q4010m8638j3813J94890
10903B32983b64623h7058a2362l59588a27013B48006a29435k1427C27044e872
10892C2085a78710e7062I7968a03348l5271L2535m0752K4247A06560M2606l4663
10881A14503K00130A01202R5910B4170b26712N6869h2339k5943q8827E0627a13666
10869C0484J70680n0699D2145b35252F978J25829a63805C04475d37897a08453
10858d369j34069j7109o2398a9054E2254A6409Q8378K06846G8127a17452A08715
$$ y = [169068, 370002, 38035, 221591, -44114, 377360, 124490, 296751, 8904, -130631, -222220, 97454, 136305, -100843, -121230, 398251, 37827, -65966, 87954, 220740, -32754, 111756, -218646, -62862, -171836, 47666, 113747, -368458, -80183, 184554, 100544, 51906, 38093, 232983, -264623, -87058, -12362, -371950, -127013, 248006, -129435, -150862, 327044, -5872, 32085, -178710, -57062, 97968, -103348, -138619, -106084, -146836, -122589, 106560, 149166, 114503, 314633, 101202, 197112, 24170, -226712, -169843, -82339, -108282, -197109, 50627, -113666, 30484, 201164, 150465, 42145, -235252, 6978, 132807, -163805, 304475, -437897, -108453, -4369, -138438, -155547, -217945, -19054, 52254, 16409, 104787, 311633, 78127, -117452, 108715]
10846B31168F3952J03831b37027a10861j85436a5980j39050F0290h1381B97649
10835a63619B26748e5178B12336b24773R6270l025I0537A0227a02472C20790H615
10823A66837a13859l4781B73391q0217b6603j32172d8344A43016A9007a19889
10812A58170a01058G9778O6968c94314A99214J35934B8805P2639J28372E4378
10801b15653J06254k3677E336d5257b0745C6433j107G906a81085a6376k58882
10790b75258m0937A91105a18628p3227A12975d8771A9766b98682d5166B3711n866
10779A7845H831a50331A55536a51613D6956b16332e8051B2511c6523g391n3618
10768f1009k50693h806r1181Q200B06100a00302A16736a56577j21879c9415h19
$$ y = [231168, 63952, 167783, -237027, -110861, -296297, -15980, -155030, 60290, -81381, 297649, -163619, 226748, -55178, 212336, -224773, -128503, -131528, 90537, 10227, -102472, 320790, 8615, 166837, -113859, -148640, 273391, 193174, -26603, -158775, -48344, 143016, 19007, -119889, 158170, -101058, 79778, 146746, -394314, 199214, 335148, 28805, 101444, 229816, 54378, -215653, -109399, -133076, 5336, -45257, -20745, 36433, 35326, 7906, -181085, -16376, -275258, -316195, 191105, -118628, -191855, 112975, -48771, 19766, -298682, -45166, 23711, 17845, 8831, -150331, 155536, -151613, 46956, -216332, -58051, 22511, -36523, -7391, -61009, -311702, -8806, -99987, -91787, 206100, -100302, 116736, -156577, -278456, -39415, -819]
10756a04166G0758c92023a07346A68569a54038l14J3966J9569A70594i3432k89821
10745c83253B18338C9606a75526g7005A28570i6974N99j45907D1256c04920J08602
10734a96318j9067A96184a65715e2803H739J74947J33276D5107C770c9548a3649
10722a22101K9447o9887c3896A14553b96859a10074K9897b3250J0906j61758n2485
10711b26587g0637G4103p411b44189O6693e733p3612B1732a11951L4417A57270
10699A8008a86787C93702d20876J98290k6726O4117K2564C332J63477n9369a62029
10687b45852I6596b3478A0745L7565l14a58136c0299k406h584A13121n1665h845
10674a47553B12459a7616j28200j5539A7517K75593p905o6175L5128m5459a29474
$$ y = [-104166, 70758, -392023, -107346, 168569, -154038, -154352, -140386, -120817, 170594, -93432, -383253, 218338, 39606, -175526, -77005, 128570, -96974, -96375, -242282, 41256, -304920, -196318, -215385, 196184, -165715, -52803, 8739, 183686, 316962, 45107, 3770, -39548, -13649, -122101, -92654, -162541, -33896, 114553, -296859, -110074, -80177, -23250, -12344, -174102, -226587, -70637, 74103, 66692, -244189, -177496, -5733, -79345, 21732, -111951, -77534, 157270, 18008, -186787, 393702, -420876, -222586, -249312, -185195, -162631, 3332, 166809, 107440, -162029, -245852, 96596, -23478, 10745, 48310, 47996, -158136, -30299, -32705, -8584, 113121, 61456, -8845, -147553, 212459, -17616, -145816, -161355, 17517, 293110, 285205, 219030, 254158, 208699, -129474]
10662b02740e4997F5424c05633a31273l7236c5313j51929A14878H454h0335A3090
10650c67295A22978J7591e9202F1945a05564I5710P6508G398h8314L3340p8853
10639a33827a7232A34083c6539F4234c95972A91805a22455k53242B98444b13908
10628B17720a07809A13824J39290b6604A7728K27830d3884r475k06903e7311j40614
10617a97925j14741C8055J79326D9596h6061F9595J05942a04382M4329K1984C84066
10605a09499Q674E9155c38598d7738B3654b1362A05388L7173i3479A70177c7536
10593E3273b83414Q0921C149a1235m64313a12412B3799K07284b14123Q9657a5346
10581H9472L1675M8634a00201L1690o8293A66027K9108p5059J4661i5311m4734
$$ y = [-202740, -54997, 65424, -305633, -131273, -168509, -35313, -187242, 114878, 8454, -80335, 13090, -367295, 122978, 140569, -59202, 61945, -105564, 95710, 172218, 7398, -88314, -54974, -133827, -17232, 134083, -36539, 64234, -395972, 191805, -122455, -375697, 298444, -213908, 217720, -107809, 113824, 253114, -26604, 17728, 245558, -43884, -53359, -260262, -57311, -197925, -312666, 38055, 217381, 49596, -86061, 69595, 175537, -104382, -60053, -38069, 384066, -109499, -100825, 59155, -338598, -47738, 23654, -21362, 105388, 142561, -93479, 170177, -37536, 53273, -283414, -202493, 3149, -11235, -475548, -112412, 23799, 231083, -214123, -124466, -15346, 89472, 121147, 169781, -100201, -68511, -136804, 166027, 195135, 120076, 134737, -95311, -140045]
10570a40045J5982A73831f649j19484e3425C00941G4468c02291b7279B1523N8752
10559H0275a17656A29203d12828e1586A92565B3635h3655j79791B1566e4981C0683
10547A99352C6817a98215O8542B06699E2725b14266B54557p6380o4612b42126
10536b27892A3687h6635j59565e7150K2991j37888E0296c17011D5980L4727b50391
10524b41436R1382m7335a5160l09302h9424b5104A04076J7776b02453A21425b98631
10512a58758B5405G360c540j83204C54936C8823a46458a3957k7137k068j42507
10501a85669j88435b7985m4019A52710D003a03557K9549A22971f9286B05075f6945
10489B3540L04780b8715j6783o1562r8797B8183a37233A31912a5919p2761b1392
$$ y = [-140045, -124063, 173831, -6649, -126133, -53425, 300941, 74468, -302291, -27279, 21523, 80275, -117656, 129203, -412828, -51586, 192565, 23635, -83655, -263446, 21566, -54981, 30683, 199352, 36817, -198215, -129673, 206699, 52725, -214266, 254557, 178177, 113565, -242126, -227892, 13687, -86635, -246200, -57150, -34159, -172047, 50296, -317011, 45980, 80707, -250391, -241436, -150054, -197389, -15160, -324462, -89424, -25104, 104076, 121852, -202453, 121425, -298631, -158758, 25405, 7360, -3540, -186744, 354936, 38823, -146458, -13957, -41094, -43162, -185669, -374104, -27985, -72004, 152710, 4003, -103557, -74008, 122971, -69286, 205075, -66945, 23540, 328320, -28715, -45498, -107060, -205857, 28183, -137233, 131912, -15919, -88680, -21392]
10477a58317A58598l3715K0477c3276B57474a6285E57447B28328J79505G8538
10466B87673B7587a6126q1809M5038j4086C0802J02909c68937h4612m130A5937
10454b61814I938J6849K6776a02833j10924P566m1981K8616n4920r826A55762
10442D8445K0265a08754q3555F6170b6695Q433m8974j75564a860p2747k42526
10431c17133F5734f4359j72431A4183K32826B7373j0159b12069R3633J7283j0024
10420a11177K2696J6659a6133k73163k485D9488a76982a2045d769F9320f9119
10408i4513m505E541a39734c1000r8171i834n2411P922A68488O9614c23389a4416
10395E8566h1593C4524a16238A17808k3849a20591B32973q8681O2331j4697r4891
$$ y = [-158317, 158598, 124883, 145360, -33276, 257474, -16285, 557447, 228328, 407833, 78538, 287673, 27587, -16126, -97935, -52897, -66983, 30802, 133711, -368937, -84612, -88742, 15937, -261814, 9938, 26787, 53563, -102833, -213757, -206191, -248172, -219556, -274476, -284302, 155762, 48445, 68710, -108754, -192309, 66170, -26695, -18262, -67236, -242800, -1860, -74607, -317133, 65734, -64359, -236790, 14183, 247009, 27373, 17214, -212069, -118436, -101153, -111177, -88481, -71822, -16133, -289296, -291781, 49488, -176982, -12045, -4769, 69320, -69119, -94513, -99018, 5541, -139734, -31000, -129171, -9834, -62245, -54323, 168488, 238102, -323389, -14416, 58566, -81593, 34524, -116238, 117808, 93959, -120591, 232973, 144292, 206623, 191926, 97035]
10384I7035D210M3837K99489o1471J88177A77937F1349e954C94786j86921k7014
10373A80851a14155A30960A7739J72713K2129K564e7275B63753G6098L64094j80940
10362B59252J53265B01709K31210L15320k31432L5167k28103K5245C5991J77235
10352B13226i8209E50560A65114N4812B5748O39694j20030K25422r7741l02931
10342C70162b8771B41684l1719F4132J55513r5336J92741J14831A23396e9467
10331C76796A31192l8633M47361A52441p5140J95117c8110A30975e5882H3744
10320F2033J68239A14108K48515r4236K7109A17120a23107F6354a62950p0558
10310b33508A28677A4531a83970Q5013r399A76505b04087c5079k38255D04a0815
$$ y = [97035, 4210, 48047, 347536, 286065, 474242, 177937, 61349, -5954, 394786, 207865, 180851, -114155, 130960, 17739, 190452, 212581, 215145, -57275, 263753, 76098, 440192, 259252, 412517, 201709, 432919, 748239, 516807, 551974, 323871, 349116, 35991, 213226, -98209, 550560, 165114, 219926, 25748, 665442, 545412, 770834, 673093, 370162, -28771, 241684, 209965, 64132, 219645, 124309, 317050, 431881, 123396, -59467, 376796, 131192, 92559, 539920, 152441, 77301, 272418, -38110, 130975, -55882, 83744, 62033, 230272, 114108, 362623, 268387, 295496, 117120, -123107, 66354, -162950, -233508, 128677, 14531, -183970, -98957, -108356, 176505, -204087, -35079, -273334, 404, -10815]
10298a40628C10779a39317N1001M1387j40963b0443j83611E7252e12230F7914
10287b32233J06744m0121A28217e3408C10604a456k53534L2286A51025b28556
10276e7338A84492F290N8481a35330A53388b01695R4306b4670j87773A21935J6036
10265A37971C2671K19689a67647I7389d78278b14496f8489A09496a57612f8663
10254c17330A45064A3154N0358K60436k5452r2993j3391c2944h569B55344m6541
10243B08803B432K06031g2962n3505F6485f2789B172d67241b29681A32585a6780
10231f2839J1260A75829d6424k6205B27942g811q2613k16569J15644L2730j09812
10220b68431B74992a8276O616B13712a68474L7886D8685O1284P8172b32160h8141
$$ y = [-140628, 310779, -139317, -88316, -46929, -187892, -20443, -204054, 57252, -512230, 67914, -232233, -125489, -165610, 128217, -53408, 310604, -1456, -254990, -222704, 151025, -228556, -57338, 184492, 6290, 64771, -135330, 153388, -201695, -107389, -24670, -212443, 121935, 137971, 32671, 252360, -167647, 97389, -478278, -214496, -68489, 109496, -157612, -68663, -317330, 145064, 13154, 63512, 323948, 298496, 205503, 192112, -32944, -8569, 255344, 208803, 2432, 208463, -72962, -126467, 66485, -62789, 2172, -467241, -229681, 132585, -16780, -62839, -51579, 175829, -46424, -72629, 227942, -7811, -90424, -306993, -191349, -158619, -268431, 274992, -18276, -11660, 213712, -168474, -130588, 48685, 109969, 188141, -232160, -88141]
10208b23409A75407R1501D7876M4851J38286a76808A96420a65972Q0124k43147
10198c28995A19754h175o7049a0979C6558b24521A99363b25204P6557L6991H0457
10186a8133j40522E6147a44695q170f2239r60k0315E6239d85651J61421J16415
10175b07815d590G5846N6701d2287k61473e960I2300J31857h1185m5123B06065
10163D8830i294k76198G267a04808A81694a48009A7212P3620J89371b12224e7843
10151b04449k9725a8762k6173J0422I0979K030O3075J58181e7945K7832l2722
10140f2835C7354f2980m50848c931p5374A51575a04917j58468a23814A4002b02917
10128h6934a2409n2696a094B0166a88599O2335q5255e6799q2669a0355D37220
$$ y = [-223409, 175407, 266908, 47876, 92727, 231013, -176808, 196420, -165972, -85848, -328995, 119754, -8175, -75224, -10979, 36558, -224521, 199363, -225204, -148647, -111656, 80457, -18133, -158655, 56147, -144695, -152865, -62239, -63199, -83514, 56239, -485651, -324230, -207815, -4590, 75846, 132547, -42287, -303760, -5960, 92300, 224157, -81185, -126308, 206065, 48830, -9294, -285492, 7267, -104808, 181694, -148009, 17212, 90832, 280203, -212224, -57843, -204449, -234174, -18762, -44935, -34513, 90979, 93009, 156084, 314265, -57945, -30113, -62835, 37354, -62980, -513828, -3931, -79305, 151575, -104917, -263385, -123814, 14002, -202917, -86934, -12409, -65105, -1094, 20166, -188599, -126264, -211519, -56799, -139468, -10355, 437220]
10116a39169A7099b84372d911j35505e2659M916j44681N9083r3926A4630a78350
10104B19095f1211q5073b7734I6247a12820j53201A08431D57a8350j94954G8175
10092A38478h8484j33908A37429d2489k62038b1434f716j03459B26860J04410
10082C31270a60495e8409A93499b812j02265B01993b8356k59933G9017b99441
10071d10436a49830m9974j23541a0961A1852O1574j9983h2298j07583B47576e4613
10059a03208d1855j25592C8063f4647b5547q9783I5868O0937O3716c5438k43935
10048b79373A6463a08980J231j20892M9566q0268J05565o2348H4803Q6281a80059
10036C37342a04348d1879i417k22199A41701d05085i6880n6981d6823A00654q889
$$ y = [-139169, 17099, -284372, -4911, -140416, -52659, -47743, -192424, -133341, -227267, 14630, -178350, 219095, -61211, -146284, -27734, 96247, -112820, -266021, 108431, 457, -18350, -213304, 78175, 138478, -88484, -222392, 137429, -42489, -304527, -21434, -6716, -110175, 226860, 331270, -160495, -58409, 193499, -2812, -105077, 201993, -28356, -288289, 79017, -299441, -410436, -149830, -199804, -323345, -10961, 11852, 73426, 53443, -82298, -189881, 247576, -54613, -103208, -41855, -167447, 38063, -64647, -25547, -115330, 95868, 156805, 220521, -35438, -279373, 16463, -108980, -107749, -228641, -179075, -259343, -153778, -216126, 84803, 171084, -180059, 337342, -104348, -41879, -9417, -231616, 141701, -405085, -96880, -153861, -46823, 100654, 91765]
10025I1765b3194B14583b03092I8586a85424h0444j12164A22788c48431g8638
10014c85567a50433A42715j1147b97423a18194k5560p9247a05648H2684i4446
10003b1111k96922c3218k8130A8154J38543b43229B8560c752k34062B42048e3253
9991b06026m6923M5706F8152a35589B33520i495A3947P0320a81758g3485A28767
9979I4612C4261L132c0134l11222J30602B47881a59122A7581b29234J8837r3529
9968c03926g4730l160I0464a57538e6635k5255D2961b1246o7457o5374f7055C2752
9955g3914k10644F1447a63446G6634g5920p1643p2902A57315c95825a07583A7335
9943D1108B0282b32663B41285b50739b2244k1699B52245c53855D4457d5039k6886
$$ y = [91765, -23194, 214583, -203092, 98586, -185424, -80444, -192608, 122788, -348431, -78638, -385567, -150433, 142715, 131568, -297423, -118194, -143754, -223001, -105648, 82684, -94446, -21111, -318033, -33218, -61348, 18154, 156697, -243229, 28560, -3752, -237814, 242048, -53253, -206026, -252949, -207243, 68152, -135589, 233520, -9495, 13947, 84267, -181758, -73485, 128767, 94612, 34261, 37393, -30134, -341356, -210754, 247881, -159122, 17581, -229234, -210397, -303926, -74730, -77890, 90464, -157538, -56635, -81890, 42961, -21246, -88703, -154077, -67055, 32752, -73914, -284558, 61447, -163446, 76634, -75920, -147563, -220465, 157315, -395825, -107583, 17335, 41108, 20282, -232663, 241285, -250739, -22244, -43943, 252245, -353855, 44457, -45039, -71925]
9932g1925H2562K70126A26626K07719i255k66457c181p4025j99885a15547q3048
9921a98595L7287B51599g8416C86885e2919l5635A5576a27130F0702h762m81957
9910d90719a43094A03268a51604l4714D3343M9134g4310A00218d7254B0746J32656
9899A53402A9715a74873B07497H662O152b58906Q0623d6703m7801j39824A07098
9887i1062a8025j26678A93148H590d3673H1644i8500N922j10764P9904j07548
9876b30986F3742a09033j9030B4971a83685B70997g011C08883b42664e3000E6057
9864b66409c4907A56802C7193e6077j30416j7534f7658A36858a2892l9098a8507
9852i9602C5079h7329e482k10964A27709c91478d1488j22924q8438A83710G7197
$$ y = [-71925, 82562, 352688, 126626, 334345, -9255, -275712, -3181, -77206, -277091, -115547, -198595, -161308, 251599, -78416, 386885, -52919, -88554, 15576, -127130, 60702, -8762, -490719, -143094, 103268, -151604, -186318, 43343, 92477, -74310, 100218, -47254, 20746, 153402, 19715, -174873, 207497, 8662, 14814, -258906, -178283, -46703, -94504, -234328, 107098, -91062, -18025, -144703, 193148, 8590, -43673, 81644, -98500, -92578, -203342, -123438, -230986, 63742, -109033, -128063, 24971, -183685, 270997, -7011, 308883, -242664, -53000, 56057, -266409, -34907, 156802, 37193, -56077, -186493, -204027, -67658, 136858, -12892, -51990, -18507, -99602, 35079, -87329, -5482, -216446, 127709, -391478, -41488, -164412, -252850, 183710, 77197]
9840b42692h7631D48390a1684k20969a3016B09101E3210b22842M2665D7918J5694
9829F3612c9756k82501R0667A0725J5019c99694J80812c1515B41433b23547B8887
9817b38192B67969g9832l09971h6122j24343B01569g0941c1173k77991A305Q6322
9806H7627D0293i7675B16425p1539m6221j8872a31451B29383A1215c6089J1969
9795b4120m8619F2297J8626a10742E5029o523b20797d6459F6869i1828H9564b57075
9782b17227B2937d2382l2040j58414M6206c6487j24014g5011D1584k0574e4112
9770C6769c1140E6078a16581C21666c66642A19061c01159J33752p7902O7938A20536
9758A63160d1468j35079D07779h240A71927q1419b75804a26311B3664N2363a45328
$$ y = [-242692, -87631, 448390, -11684, -232653, -13016, 209101, 53210, -222842, -180177, 47918, 63612, -39756, -322257, -231590, 10725, 25744, -399694, -218882, -31515, 241433, -223547, 28887, -238192, 267969, -79832, -389803, -86122, -210465, 201569, -70941, -31173, -309164, 1305, 87627, 40293, -97675, 216425, 144886, 98665, 79793, -131451, 229383, 11215, -36089, -24120, -72739, 62297, 80923, -110742, 55029, 48506, -220797, -46459, 66869, -91828, 89564, -257075, -217227, 22937, -42382, -74422, -232836, -186630, -36487, -160501, -75011, 41584, 21010, -54112, 36769, -31140, 56078, -116581, 321666, -366642, 119061, -301159, -167407, -245309, -177371, 120536, 163160, -41468, -176547, 407779, -8240, 171927, 90508, -275804, -126311, 23664, 76027, -145328]
9746c38689A21689a59354Q601F750N4990a61748m84712Q8218E1435a02930j48892
9735b51822A27880i4308b381o1066j24902j82360a78455B53527g4391l08314K6228
9724c56477A49807b3168j62241F1900f4687E3298b43732J292H7164f1168P008
9713e4160L982l0314C2107Q7955K30089e0871a2184p5200m2039I6171e3838n6959
9701a10797B45150a19266M2712c3900D5249g3380j64957i3072j61205a10148j56963
9690b67111B46623a18835n5953B33289R8354c8167j34492H2398R6682a72422a8175
9678h5020k51927G7034c6274B13386n3736b69795C3100a97015L0460e8819j7819
9667g6638j05869A27358i1136m4290O4337j27210j5811j6487H0533A9892b1322
$$ y = [-338689, 121689, -159354, -150753, 6750, 61740, -161748, -646460, -558242, 51435, -102930, -251822, 127880, -94308, -2381, -63447, -188349, -370709, -178455, 253527, -74391, -382705, -356477, 149807, -23168, -185409, 61900, -64687, 53298, -243732, -242440, 87164, -61168, -54160, -50178, -80492, 32107, 120062, 350151, -50871, -12184, -87384, -129423, 96171, -53838, -110797, 245150, -119266, -76554, -33900, 45249, -73380, -238337, -93072, -254277, -110148, -267111, 246623, -118835, -174788, 233289, 331643, -38167, -172659, 82398, 179080, -172422, -18175, -85020, -336947, 77034, -36274, 213386, 159650, -269795, 33100, -197015, -166555, -58819, -76638, -182507, 127358, -91136, -135426, -71089, -198299, -214110, -230597, 80533, 19892, -21322]
9655a57299o2960A09971a49595j51056C5446G485a77246a3685C2663a68338C1944
9643E7573a94699H4890A2140a12443B98483a24199j80717J1584A80799h6394k3073
9632a09467G7489C2497K83280h6077j80977B82265d1418D8663g8688B21880r8645
9621A23235D8836Q831a72266C1730K44378B5300J5162J31901A5367b04775b5425
9609a17870C1373b582j76069J3460f2607l6682j0007j76583R0414d6320a253l73119
9597c74372a76268B23415J69680G0191e9109j33906L9250k9251E2001L7522J5656
9586A05179a60097l4525B01459n0622j4156a7136j43382f7172k29966J21608G4077
9574c46663c8972q5464K5969b9459n0770K97A00848b83449b5437A52163J31122
$$ y = [-157299, -220259, 109971, -149595, -300651, 35446, 7485, -177246, -13685, 32663, -168338, 31944, 57573, -194699, 84890, 12140, -112443, 298483, -124199, -304916, -293332, 180799, -86394, -109467, 77489, 32497, 315777, -86077, -267054, 282265, -41418, 48663, -78688, 221880, 123235, 48836, 57667, -172266, 31730, 276108, 25300, 40462, 172363, 15367, -204775, -25425, -117870, 31373, -2582, -178651, -165191, -62607, -99289, -109296, -285879, -195465, -46320, -1253, -374372, -176268, 223415, 393095, 70191, -59109, -193015, -153765, -183016, 52001, 89523, 105179, -160097, -194622, 201459, 150837, 136681, -17136, -160518, -67172, -297138, -175530, 74077, -346663, -38972, -124436, -98467, -29459, -80229, -79932, 100848, -283449, -25437, 152163, 283285]
9563B83285f6661G9087J0691d16568J54891j5826A47228b5203B76771a0199G1176
9551c1097P543A22984K6983e0876j3778a4473A88327d0916r9806I6763c39239
9539c45135c8611k49439J23698m4428K5451g9136p876k6429k81548a04052M1424
9528f2628j87386A37403b20359A89305F2873c15182b5309A29576a57611a6155
9517a68627O5478k23984H4804b91695K7821M3368e3383m11472A70119c81058l1910
9506d12968f3374m3782C57279i4086p8984A46724a41693Q262k12397A56283N6907
9495B13190A8897d90F6946a07180j4758n7761j10367k3811L9686a9406A04316
9483a67543n5523C2870a76740Q0664D1549b3231D3153J75350g0058j92226B18621
$$ y = [283285, -66661, 79087, 89778, -416568, -261677, -277503, 147228, -25203, 276771, -10199, 71176, -31097, -23554, 122984, 149967, -50876, -64654, -14473, 188327, -40916, -140722, 96763, -339239, -345135, -38611, -288050, -164352, -208780, -183329, -79136, -87012, -113441, -394989, -104052, -62628, -250014, 137403, -220359, 189305, 62873, -315182, -25309, 129576, -157611, -16155, -168627, -103149, -327133, 84804, -291695, -263874, -220506, -53383, -464855, 170119, -381058, -412968, -63374, -107156, 357279, -94086, -173070, 146724, -141693, -133431, -345828, 156283, 213190, 18897, -490, 66946, -107180, -121938, -179699, -290066, -313877, -274191, -19406, 104316, -167543, -223066, 32870, -176740, -96076, 41549, -23231, 43153, 218503, -70058, -262284, 218621]
9471g3621E2382M1596a69992B83923f4782C7398a275k28426M8288A40765a48747
9459C3641J56896q7355m6748a06928k26316B3644J30598J24406e02360a50915
9448A11304J56002C7621b3492I3312h351k80748D6189L10470b60889C88850d2723
9436E3171k1330c4185B39537b92673D3287b65354A18930D259a27184B23797b80177
9424B887d43362g7262k56933A03779J05763a70089O5105I491P5834d5250B68708
9412A99554J42165A4751K60504a67148j53813j7028P4594a29391A60903a879B5129
9400c15255A4243e44016a9622j5461C81544h2518b129j7025k28712D2502J80751
9389B23253J47690A69995F5514g2131j0920d1493j00909o4347j41395n0600A20609
$$ y = [-73621, 52382, 93978, -169992, 283923, -64782, 37398, -1275, -229701, -181413, 140765, -148747, 33641, 190537, 103182, 56434, -106928, -333244, 23644, 154242, 278648, -502360, -150915, 111304, 267306, 37621, -23492, 93312, -8351, -289099, 46189, 356659, -260889, 388850, -42723, 53171, 31841, -34185, 239537, -292673, 43287, -265354, 118930, 4259, -127184, 223797, -280177, 2887, -443362, -77262, -334195, 103779, 209542, -170089, -104984, 9491, 85325, -45250, 268708, 199554, 341719, 14751, 275255, -167148, -320961, -337989, -263395, -129391, 160903, -1879, 25129, -315255, 14243, -544016, -19622, -35083, 381544, -82518, -2129, -19154, -247866, 42502, 223253, 370943, 169995, 65514, -72131, -83051, -41493, -142402, -206749, -348144, -398744, 120609]
9377b19582A21418A3162a43991O7834A37510b21366N1477B58759A21804a69880
9366D1388e23364J55259B37718b3124j63793A30328A3979a22790e5491A30056
9355a81265G1515E1a07129j88204H3683K4292c10869A72477a12778F2443a45605
9343f8747C9194h8727K2530r7979B66252a41240O4390j64243L0676P5839P816
9332a26762j22290J20933p6654j17503a43763K6396J6459q6770R1539J0641E0844
9320i6157D1709J18547b29024d7929A34934h4742k1878E4700a05362A31086a29813
9308a80977K9840A00220a22367M2335K203B23458e1016p6290F0589c75476A71043
9296E411N9749O9827g0923k1976k43301C85196b93242i6580A05132d4832J8765
$$ y = [-219582, 121418, 13162, -143991, -76157, 137510, -221366, -169889, 258759, 121804, -169880, 41388, -523364, -368105, 237718, -23124, -186917, 130328, 13979, -122790, -55491, 130056, -181265, 71515, 51, -107129, -295333, 83683, 107975, -310869, 172477, -112778, 62443, -145605, -68747, 39194, -88727, -66197, -164176, 266252, -141240, -76850, -241093, -210417, -134578, -126762, -249052, -128119, -204773, -322276, -143763, -117367, -100908, -187678, -96139, -85498, 50844, -96157, 41709, 160256, -229024, -47929, 134934, -84742, -106620, 54700, -105362, 131086, -129813, -180977, -151137, 100220, -122367, -80032, -77829, 223458, -51016, -127306, 60589, -375476, 171043, 5411, 65160, 134987, -70923, -92899, -336200, 385196, -293242, -96580, 105132, -44832, -26067]
9285b6067D2735a07784k108F9380a15015A33410h2667r2868A53371a41816E1904
9273a39852J1312E7195A4569d0222k4777n9193A66674q2702b52402A38489J2744
9262A51233a67392A25683b3618j12917j46785i7619K216A01044l3656c8436A63642
9250A75069G7053c11698K6200K3357c2693j17780O7663j54120I6145a2266o3844
9239g6110b2534A75023b9708j31364H8675f8021K5458C0213a89994A51813P1438
9228B23251b68145D0942a53051b4962p205k1837A639a99058N8504l4142A27179
9216A12710D7723m435J76583A3243b75492J27867j17954G4334a12092c5230A30834
9204e3849I9767a19007a4194I0669R0854k9559a30197o0350A18792b62637O9071
$$ y = [-26067, 42735, -107784, -109892, 69380, -115015, 133410, -82667, -175535, 153371, -141816, 51904, -139852, -128540, 57195, 14569, -40222, -64999, -124192, 166674, 83972, -252402, 138489, 151233, -167392, 125683, -23618, -136535, -283320, -97619, -95403, 101044, 67388, -38436, 163642, 175069, 77053, -311698, -285498, -262141, -32693, -150473, -82810, -236930, 96145, -12266, -76110, -22534, 175023, -29708, -161072, 88675, -68021, -42563, 30213, -189994, 151813, 223251, -268145, 40942, -153051, -24962, -32167, -54004, 1639, -199058, -140554, -174696, 127179, 112710, 47723, 43288, 219871, 13243, -275492, -147625, -265579, 74334, -112092, -35230, 130834, -53849, 99767, -119007, -14194, 90669, 181523, 151964, -130197, -190547, 118792, -262637, -193566]
9193a93566c6051k1323r2257N9562p1125g0569l2554r0201A0021a21293F2387
9181I8706J81273b01047m8427Q6008g4588A10985a38847d1803a8160j4915j98969
9170b32044B02544e5327F301J67650J7075f2940H8949b94397c0455M145A28486
9158H7884a19038j35988C7557c3672c713j0619l8220K4494O094j1569B081a3262
9145c77550g7838C70416I8688j3900Q5171a91683J7781B27345D0293a40447A68648
9133A684J48817F6587a21448L450K5206k87368J05177N057B10303d4245P795A19810
9120i4729E0542O0144a05883k7422K4179m19688D9815i5734b6578k15572E043
9108b49801F7539K4842c15562A28702c14740h8685k5156I7145P9146E2823a38682
$$ y = [-193566, -36051, -57374, -149631, -90069, -161194, -70569, -103123, -193324, 10021, -121293, 62387, 98706, 279979, -201047, -249474, -163466, -74588, 110985, -138847, -41803, -18160, -33075, -232044, 202544, -55327, 6301, 173951, 191026, -62940, 88949, -294397, -30455, -26310, 128486, 87884, -119038, -255026, 37557, -33672, -3713, -14332, -52552, -28058, -21964, -33533, 2081, -13262, -377550, -77838, 370416, 98688, 84788, 169959, -191683, -173902, 227345, 40293, -140447, 168648, 1684, 150501, 66587, -121448, -117998, -92792, -380160, -274983, -269926, 210303, -44245, -36450, 119810, -94729, 50542, 110686, -105883, -133305, -109126, -528814, 49815, -95734, -26578, -242150, 5043, -249801, 67539, 92381, -315562, 128702, -314740, -88685, -113841, 97145, 176291, 52823, -138682]
9096b30460B86584b08241g8557n9531m2557A6391b8079k4238I7825c04931j14390
9085d19321J91800m290n6161e3014B1754d06929A44119J2750o5464c1608j16934
9074a48542k20577L5780o6938J68570r0376R4388F4086Q8252b9189j37270A30153
9062A95406H1871K19406c2276r6868o9033D5863a03695B01346b31308e7510a648
9050a90130O2999c2995j0226k0512C1223N2006L0966D6702h4094E0913J8158e18052
9037E6341a10807j62950i5669l35033I860a38393r5082A11578d41459A4377a57319
9025h6638j96242a10766A33797O793a17755A07097b64872c8393r9611b1466r8036
9014a19502B62875f3550E3543a43673d1534C3479A1918b02084A87704C1237c10260
$$ y = [-230460, 286584, -208241, -78557, -138088, -180645, 16391, -28079, -52317, 97825, -304931, -419321, -227521, -231811, -287972, -53014, 21754, -406929, 144119, 156869, 91405, -31608, -148542, -369119, -333339, -400277, -231707, -322083, -227695, 64086, 152338, -29189, -166459, 130153, 195406, 81871, 301277, -32276, -129144, -198177, 45863, -103695, 201346, -231308, -57510, -1648, -190130, -127131, -32995, -43221, -63733, 31223, 83229, 114195, 46702, -84094, 50913, 69071, -518052, 56341, -110807, -273757, -95669, -430702, 9860, -138393, -233475, 111578, -441459, 14377, -157319, -86638, -282880, -110766, 133797, 140590, -117755, 107097, -264872, -38393, -138004, -21466, -119502, 262875, -63550, 53543, -143673, -41534, 33479, 11918, -202084, 187704, 31237, -310260]
9002b15985I2512b21716A33400g4707k83423A66685i4006J4032j05321m8529H7700
8990h5582B07140h684l22650D66054C6840J92894o5268g4351m0841j57544Q0093
8979a92643a6748q2335k14532R5357F2110E125M12589D2364a75977k17364A39596
8967b02648H6776c8380j21285A14279e9876A77183b89122k9717h696j82583B87657
8955B3531a1684A11976a7986l26069a65539j52200N9953D1153J8806Q0115a18369
8943h4168J892A25974P626M6668N7039a42555A50442c14681a4506A3620a5404
8931E3948b19620h8258i868j30732I2918g2819k708C1517O8857h8058E6824M76745
8919E33569o0943K623802N67290I25724A80352D8076P2543c14991A54093f46l1034
$$ y = [-215985, 92512, -221716, 133400, -74707, -358130, 166685, -94006, -79974, -185295, -233824, 87700, -85582, 207140, -8684, -331334, 466054, 36840, 229734, 164466, -74351, -115192, -272736, -192643, -16748, -99083, -313615, -218258, 62110, 5125, 417714, 42364, -175977, -393341, 139596, -202648, 86776, -38380, -159665, 114279, -59876, 177183, -289122, -318839, -8696, -191279, 287657, 23531, -11684, 111976, -17986, -344055, -165539, -317739, -257786, 41153, 59959, 140074, -118369, -84168, -82276, 125974, 133600, 180268, 237307, -142555, 150442, -314681, -14506, 13620, -15404, 53948, -219620, -88258, -9868, -140600, 92918, -72819, -75527, 31517, 100374, -88058, 56824, 533569, 472626, 3096428, 3663718, 925724, 180352, 48076, 120619, -314991, 154093, -646, -31680]
8908c1680p1708n6423B82503A20030J84164d8158B0071b41405Q9142f2143B55125
8896a37132p634c5618B31714a38835b65B09940c6643C4386d8463q535l2285l69571
8884d58854a40007a1647I3819b39928A13600c57198a71206B90383A0388a60063
8873i0685C0217a30896B91209a797C8621j636e2115A12235a46837d5815j7429
8862f3244k2525n4760d1098j33072p8080f2833A82235J7973b47313G1169b6631
$$ y = [-31680, -103388, -159811, 282503, 120030, 304194, -48158, 20071, -241405, -152263, -62143, 255125, -137132, -144766, -35618, 231714, -138835, -265, 209940, -36643, 34386, -48463, -56998, -89283, -458854, -140007, -11647, 93819, -239928, 113600, -357198, -171206, 290383, 10388, -160063, -90685, 30217, -130896, 291209, -1797, 38621, 36985, -52115, 112235, -146837, -45815, -63244, -85769, -140529, -41098, -174170, -252250, -62833, 182235, 200208, -247313, 71169, -26631]
$$ [...]
##END NTUPLES=NMR SPECTRUM
##END=
