##TITLE=NES1050_10427_9270609_61D8CKfaId
##JCAMPDX= 6.0         $$ Bruker NMR JCAMP-DX V2.0
##DATA TYPE= NMR SPECTRUM
##DATA CLASS= NTUPLES
##ORIGIN= BRUKER
##OWNER= Administrator
$$ 1.72 TOPSPIN		Version 2.1
$$ 2015-08-24 13:25:03.280 -0700  Administrator@X
$$ Compression mode = diff/dup
##.OBSERVE FREQUENCY= 400.02188249412
##.OBSERVE NUCLEUS= ^1H
##.ACQUISITION MODE= SIMULTANEOUS (DQD)
##.ACQUISITION SCHEME= undefined
##.AVERAGES= 64
##.DIGITISER RES= 22
##SPECTROMETER/DATA SYSTEM= spect
##.PULSE SEQUENCE= noesygpps1d.comp
##.SOLVENT NAME= COFFEE_meoh
##.SHIFT REFERENCE= INTERNAL, COFFEE_meoh, 1, 14.96338
##AUDIT TRAIL= $$ (NUMBER, WHEN, WHO, WHERE, PROCESS, VERSION, WHAT)
$$ ##TITLE= Audit trail, TOPSPIN		Version 2.1
$$ ##JCAMPDX= 5.01
$$ ##ORIGIN= Bruker BioSpin GmbH
$$ ##OWNER= Administrator
$$ $$ E:\/data/COFFEE/nmr/NES1050_10427_9270609_61D8CKfaId/42/pdata/1/auditp.txt
$$ ##AUDIT TRAIL=  $$ (NUMBER, WHEN, WHO, WHERE, PROCESS, VERSION, WHAT)
(   1,<2015-08-24 13:24:57.733 -0700>,<Administrator>,<X>,<go>,<TOPSPIN 2.1>,
      <created by zg
	started at 2015-08-24 13:13:28.108 -0700,
	POWCHK enabled, PULCHK disabled,
       configuration hash MD5:
       21 0F 79 D6 B3 7B B4 F6 88 20 88 DB 03 48 BD 9F
       data hash MD5: 64K
       91 FE BB 49 F3 AA 0E 85 9A 3F AA 46 4B 69 28 D4>)
(   2,<2015-08-24 13:25:00.858 -0700>,<Administrator>,<X>,<proc1d>,<TOPSPIN 2.1>,
      <Start of raw data processing
       efp LB = 0.3 FT_mod = 6 PKNL = 1 PHC0 = 0 PHC1 = 0 SI = 128K 
       data hash MD5: 128K
       01 56 EB 04 55 53 C1 26 51 6F B4 5B BC 3C 7F 40>)
(   3,<2015-08-24 13:25:01.748 -0700>,<Administrator>,<X>,<proc1d>,<TOPSPIN 2.1>,
      <pk PHC0 = -83.88611 PHC1 = 0 
       data hash MD5: 128K
       E1 99 12 92 C8 26 66 36 0E 49 CC 24 D2 F3 88 37>)
(   4,<2015-08-24 13:25:02.139 -0700>,<Administrator>,<X>,<proc1d>,<TOPSPIN 2.1>,
      <abs ABSG = 1 
       data hash MD5: 128K
       10 95 F6 78 54 6B 6A 4C C4 D8 B6 83 B3 1A D6 29>)
(   5,<2015-08-24 13:25:02.264 -0700>,<Administrator>,<X>,<proc1d>,<TOPSPIN 2.1>,
      <abs ABSG = 2 
       data hash MD5: 128K
       92 13 80 38 A3 F2 8D EE 76 6C 31 D8 39 1F F0 BF>)
(   6,<2015-08-24 13:25:02.592 -0700>,<Administrator>,<X>,<proc1d>,<TOPSPIN 2.1>,
      <abs ABSG = 3 
       data hash MD5: 128K
       D6 FB 9E 77 04 49 D2 2C 73 1D F6 F2 94 04 DA DE>)
(   7,<2015-08-24 13:25:02.748 -0700>,<Administrator>,<X>,<proc1d>,<TOPSPIN 2.1>,
      <abs ABSG = 4 
       data hash MD5: 128K
       94 E5 34 C8 53 4C 4C A6 45 51 B8 A0 D4 95 48 A1>)
(   8,<2015-08-24 13:25:02.811 -0700>,<Administrator>,<X>,<proc1d>,<TOPSPIN 2.1>,
      <abs ABSG = 5 
       data hash MD5: 128K
       E7 67 0C 20 1E 57 99 08 8B 19 E5 40 7C 82 2A 3D>)
$$ ##END=
$$ 
$$ $$ hash MD5
$$ $$ 85 33 17 1F 81 A1 5B D2 48 16 62 EF 6E 58 8E 05
##$RELAX= 
##$RELAX= 
##$RELAX= 
##$RELAX= 
##$RELAX= 
##$RELAX= 
##$RELAX= 
##$RELAX= 
$$ Bruker specific parameters
$$ --------------------------
##$DU= <E:\>
##$EXPNO= 42
$$ [...]
##$TP07= 0
##$TPNAME0= <>
##$TPNAME1= <>
##$TPNAME2= <>
##$TPNAME3= <>
##$TPNAME4= <>
##$TPNAME5= <>
##$TPNAME6= <>
##$TPNAME7= <>
##$TPOAL= (0..7)
0.5 0.5 0.5 0.5 0.5 0.5 0.5 0.5
##$TPOFFS= (0..7)
0 0 0 0 0 0 0 0
##$TUNHIN= 0
##$TUNHOUT= 0
##$TUNXOUT= 0
##$USERA1= <user>
##$USERA2= <user>
##$USERA3= <user>
##$USERA4= <user>
##$USERA5= <user>
##$V9= 5
##$VALIST= <valist>
##$VCLIST= <CCCCCCCCCCCCCCC>
##$VD= 0
##$VDLIST= <DDDDDDDDDDDDDDD>
##$VPLIST= <PPPPPPPPPPPPPPP>
##$VTLIST= <TTTTTTTTTTTTTTT>
##$WBST= 2048
##$WBSW= 25
##$XGAIN= (0..3)
0 0 0 0
##$XL= 0
##$YL= 0
##$YMAX_a= 7649521
##$YMIN_a= -16143043
##$ZGOPTNS= <>
##$ZL1= 120
##$ZL2= 120
##$ZL3= 120
##$ZL4= 120
##$ABSF1= 14.96338
##$ABSF2= -5.594802
##$ABSG= 5
##$ABSL= 3
##$ALPHA= 0
##$AQORDER= 0
##$ASSFAC= 0
##$ASSFACI= 0
##$ASSFACX= 0
##$ASSWID= 0
##$AUNMP= <proc_prof1d_extract.lims>
##$AXLEFT= 0
##$AXNAME= <>
##$AXNUC= <1H>
##$AXRIGHT= 0
##$AXTYPE= 0
##$AXUNIT= <>
##$AZFE= 0.1
##$AZFW= 0.1
##$BCFW= 0
##$BC_mod= 0
##$BYTORDP= 0
##$COROFFS= 0
##$CY= 15
##$DATMOD= 1
##$DC= 0
##$DFILT= <>
##$DTYPP= 0
##$F1P= 0
##$F2P= 0
##$FCOR= 0.5
##$FTSIZE= 131072
##$FT_mod= 6
##$GAMMA= 0
##$GB= 0
##$INTBC= 1
##$INTSCL= 1
##$ISEN= 128
##$LB= 0.3
##$LEV0= 0
##$LPBIN= 0
##$MAXI= 10000
##$MC2= 0
##$MEAN= 0
##$ME_mod= 0
##$MI= 0
##$NCOEF= 0
##$NC_proc= -2
##$NLEV= 6
##$NOISF1= 0
##$NOISF2= 0
##$NSP= 0
##$NTH_PI= 0
##$NZP= 0
##$OFFSET= 14.96338
##$PC= 1
##$PHC0= -83.88611
##$PHC1= 0
##$PH_mod= 1
##$PKNL= yes
##$PPARMOD= 0
##$PPDIAG= 0
##$PPIPTYP= 0
##$PPMPNUM= 2147483647
##$PPRESOL= 1
##$PSCAL= 4
##$PSIGN= 0
##$PYNMP= <proc.py>
##$REVERSE= no
##$SF= 400.020008682864
##$SI= 131072
##$SIGF1= 0
##$SIGF2= 0
##$SINO= 400
##$SIOLD= 131072
##$SPECTYP= <>
##$SREGLST= <1H.CDCl3>
##$SSB= 0
##$STSI= 131072
##$STSR= 0
##$SW_p= 8223.68421052631
##$SYMM= 0
##$S_DEV= 0
##$TDeff= 65536
##$TDoff= 0
##$TI= <>
##$TILT= no
##$TM1= 0
##$TM2= 0
##$TOPLEV= 0
##$USERP1= <user>
##$USERP2= <user>
##$USERP3= <user>
##$USERP4= <user>
##$USERP5= <user>
##$WDW= 1
##$XDIM= 131072
##$YMAX_p= 424327102
##$YMIN_p= -11115
##$CURPLOT= <Network HP LaserJet P1505>
##$CURPRIN= <$Network HP LaserJet P1505>
##$DFORMAT= <normdp>
##$LAYOUT= <+/1D_H.xwp>
##$LFORMAT= <normlp>
##$PFORMAT= <normpl>
##$SURQMSG= 1
$$ End of Bruker specific parameters
$$ ---------------------------------
##NTUPLES= NMR SPECTRUM
##VAR_NAME=  FREQUENCY,     SPECTRUM/REAL,   SPECTRUM/IMAG
##SYMBOL=    X,             R,               I
##VAR_TYPE=  INDEPENDENT,   DEPENDENT,       DEPENDENT
##VAR_FORM=  AFFN,          ASDF,            ASDF
##VAR_DIM=   131072,        131072,          131072
##UNITS=     HZ,            ARBITRARY UNITS, ARBITRARY UNITS
##FACTOR=    0.0627417313425164, 1,          1
##FIRST=     8223.62146879497, 980,          -60842
##LAST=      0,             2979,            -60802
##MIN=       0,             -11115,          0
##MAX=       8223.62146879497, 424327102,    0
$$ Real data points
##PAGE= N=1
##DATA TABLE= (X++(R..R)), XYDATA
$$ [...]
60975E430360P68843R47526J173294J461763J821755K260015K762165L235108
60967A9860829L476821L262002K518123J432334L62698l77571o64988n40148j11355
60958B9218745M68421R61573J079670O41745k77627j374955k308597k881273l079399
60949B2448303k995445k742063k413617k076706j766133j490076j246366j034520
60941F683377q54566p03044n75778m71557l89796l26972k78114k39972k10515
60932B633063j86996j66805j49216j34412j21565j09251r6923q4711p2609o1138
60922A449437n2056m6917m5220m4946m4715m4380m3927m2829m0632l7432l3652
60911I72731k9872k6851k5142k4481k3900k2635k0836j9246j8298j7695j6866
$$ y = [5430360, 6199203, 7146729, 8320023, 9781786, 11603541, 13863556, 16625721, 19860829, 23337650, 26599652, 29117775, 30550109, 30912807, 30535236, 29870248, 29330100, 29218745, 29687166, 30648739, 31728409, 32370154, 32092527, 30717572, 28408975, 25527702, 22448303, 19452858, 16710795, 14297178, 12220472, 10454339, 8964263, 7717897, 6683377, 5828811, 5125767, 4549989, 4078432, 3688636, 3361664, 3083550, 2843578, 2633063, 2446067, 2279262, 2130046, 1995634, 1874069, 1764818, 1667895, 1583184, 1510575, 1449437, 1397381, 1350464, 1305244, 1260298, 1215583, 1171203, 1127276, 1084447, 1043815, 1006383, 972731, 942859, 916008, 890866, 866385, 842485, 819850, 799014, 779768, 761470, 743775, 726909]
60900G26909j5764j4873j4405j3845j2581j0723q906p483o418n775n662n664n035
60887E99775l731k681k652l240l447k915k056j213k91P69J730K492L269M120M753
60872E94682N140N860P292Q795R386R034Q501Q062P313O367O132O834P336O716
60858F97450N729N672O406O654N951N114M825M859M834M741M497L829K785J740
60844G65086P10o31k122l077l288l358l816m590n525o660p704q022p530o828o105
60829F96540m659k083O87K207K041R46j28p50r46r27q13m70K49J076J453J166
60813F95589N55j1m84r55j457k068k778l288l294k946k590k109j166N9J012J658
60797F75727K536L746M694M909M563M009L520L533M348N386N581M772L911L651
$$ y = [726909, 711145, 696272, 681867, 668022, 655441, 644718, 635812, 628329, 621911, 616136, 610474, 604810, 599775, 596044, 593363, 590711, 587471, 584024, 581109, 579053, 577840, 577549, 578318, 580048, 582540, 585809, 589929, 594682, 599822, 605682, 612974, 621769, 631155, 640189, 648690, 656752, 664065, 670432, 676564, 683398, 690734, 697450, 703179, 708851, 715257, 721911, 727862, 732976, 737801, 742660, 747494, 752235, 756732, 760561, 763346, 765086, 765796, 765165, 763043, 759966, 756678, 753320, 749504, 744914, 739389, 732729, 725025, 717003, 709473, 702645, 696540, 691881, 689798, 690485, 692692, 694733, 695679, 695551, 694801, 693855, 692928, 692115, 691645, 691894, 692970, 694423, 695589, 696144, 696133, 695649, 694694, 693237, 691169, 688391, 685103, 681809, 678863, 676273, 674164, 672998, 673057, 674069, 675727, 678263, 682009, 686703, 691612, 696175, 700184, 703704, 707237, 711585, 716971, 722552, 727324, 731235, 734886]
60783G34886L589L344L404M240N287N555M877L928L363L316L501L466K991K376
60769G88123J968J527N69o77j553k212l586n766p531q029p973q445r372r998j0167
60754G16878j0170r856q853p429o386o135o484p078p628p871p749p470p007n946
60740F10816m189k429j432j123p85Q1J418K816L759L952L672L473L407L032K295
60725F28763J754J528Q70p77k884m613n905p160q357r255j0006j0804j1291j1024
60711E50839j0298r773r496q988q197p614p380o974n938m431k927j739r89p21
60697D65374q07q87o08J13J085K092L094M021M474L936K536J269J046J757K725
60682D91220L725M968O309P318Q058R032J0215J1036J1432J2065J3208J4187J4355
$$ y = [734886, 738475, 741819, 745223, 749463, 754750, 760305, 765182, 769110, 772473, 775789, 779290, 782756, 785747, 788123, 790091, 791618, 792187, 791510, 789957, 787745, 784159, 778393, 770862, 762833, 754860, 746415, 737043, 727045, 716878, 706708, 696852, 687999, 680570, 674184, 668049, 661565, 654487, 646859, 638988, 631239, 623769, 616762, 610816, 606627, 604198, 602766, 601643, 600858, 600939, 602357, 605173, 608932, 612884, 616556, 620029, 623436, 626468, 628763, 630517, 632045, 632915, 632138, 629254, 624641, 618736, 611576, 603219, 593964, 583958, 573154, 561863, 550839, 540541, 530768, 521272, 512284, 504087, 496473, 489093, 482119, 476181, 471750, 468823, 467084, 466095, 465374, 464567, 463680, 463072, 463185, 464270, 466362, 469456, 473477, 477951, 481887, 484423, 485692, 486738, 488495, 491220, 494945, 499913, 506222, 513540, 521598, 530630, 540845, 551881, 563313, 575378, 588586, 602773, 617128]
60669F17128J3920J3461J3196J3125J3226J3189J2526J1317J0234R518Q576O987
60657G56403N274M193L812L684L402K658J360r2j220k407m554p577j0115j1220
60643G43601j1390j1436j1333j0933j0850j1592j2499j2559j1769j0796r807q590
60631F10047p454o962o911o440n131l358j687m98L1J70O46J835L099L534L166
60616E84087K889L373M559O070P573Q773R532R919R991R701R179Q835Q830Q871
60602F92182Q781Q853R231R451Q998P935O498M541J886j089l798o139q338j0357
60588G28635j1908j2898j3414j3463j3066j2510j2188j2207j2294j1948j0796
60577E91943r054p614p179p386p281o576n788n260m831m454m234l802k741j661
$$ y = [617128, 631048, 644509, 657705, 670830, 684056, 697245, 709771, 721088, 731322, 740840, 749416, 756403, 761677, 765870, 769682, 773366, 776768, 779426, 780786, 780694, 779474, 777067, 772513, 764936, 754821, 743601, 732211, 720775, 709442, 698509, 687659, 676067, 663568, 651009, 639240, 628444, 618637, 610047, 602593, 595631, 588720, 582280, 577149, 573791, 572104, 571606, 571637, 571807, 572453, 574288, 577387, 580921, 584087, 586976, 590349, 594908, 600978, 608551, 617324, 626856, 636775, 646766, 656467, 665646, 674481, 683311, 692182, 700963, 709816, 719047, 728498, 737496, 745431, 751929, 756470, 758356, 757267, 753469, 747330, 738992, 728635, 716727, 703829, 690415, 676952, 663886, 651376, 639188, 626981, 614687, 602739, 591943, 582889, 575275, 568096, 560710, 553429, 546853, 541065, 535805, 530974, 526520, 522286, 518484, 515743, 514082]
60563E14082j693k579k608j012Q67J612J639K104K918L117K539J938J752J697
60549E26373J399Q11K70M71J880L903N331N949O725Q158R604J0858J3007J6727
60535F11466K0975K4528K7798L1823L6426M0758M4809M8822N1774N1984M8893
60524A040056M3000L4452K3183J0249k377j3331k2179k8391l1245l0781k8000
60513I94636k4036j9853j6418j4254j2912j1663j0443r535q751p690o375m897
60501H47809k959n27J756L751O613J1309J7059K2460K7448L2771L8229M2959M6979
60488A095657N0695N3183N2740M9230M4391L9737L5653L2722L2396L5998M4136
60477A566538N7315P5930R9444J26698J57262J91472K28827K67075L02476L29637
$$ y = [514082, 512389, 509810, 507202, 506190, 507057, 508669, 510308, 512412, 515330, 518447, 520986, 522924, 524676, 526373, 527772, 528583, 528853, 529324, 531204, 535107, 540438, 546387, 553112, 561270, 570874, 581732, 594739, 611466, 632441, 656969, 684767, 716590, 753016, 793774, 838583, 887405, 939179, 991163, 1040056, 1083056, 1117508, 1140691, 1150940, 1148563, 1135232, 1113053, 1084662, 1053417, 1022636, 994636, 970600, 950747, 934329, 920075, 907163, 895500, 885057, 875522, 866771, 859081, 852706, 847809, 844850, 844323, 846079, 849830, 856443, 867752, 884811, 907271, 934719, 967490, 1005719, 1048678, 1095657, 1146352, 1199535, 1252275, 1301505, 1345896, 1385633, 1421286, 1454008, 1486404, 1522402, 1566538, 1623853, 1699783, 1799227, 1925925, 2083187, 2274659, 2503486, 2770561, 3073037, 3402674]
60467C402674L41354L30655K94193K33346J52450N7564m2951j38736k20179k81032
60457D129338l18851l34345l31024l14276k89467k60659k30814k02154j75880
60448A671868j52226j31195j12839r6878q2818p0571o0318n1738m4211l7697l2584
60437G98793k8553k4651k0675j7428j5321j3683j1826r972q635p823p318p058
60425F25850o861o283n168l962l246l205l570l728l098j881j105j285j454m30
60411E80574J289K085J468N96M38O27N18K14R7J20P2k7j38l00l39JO33J313K155
60392E91396L276M215M403M104M023M197M111L669L085K133N40j035j654j513
60378F24950j547j733j250j65M66M18O01J340J741J288O84N59O40P21J248K383
$$ y = [3402674, 3744028, 4074683, 4368876, 4602222, 4754672, 4812236, 4769285, 4630549, 4410370, 4129338, 3810487, 3476142, 3145118, 2830842, 2541375, 2280716, 2049902, 1847748, 1671868, 1519642, 1388447, 1275608, 1178730, 1095912, 1025341, 965023, 913285, 869074, 831377, 798793, 770240, 745589, 724914, 707486, 692165, 678482, 666656, 656684, 648049, 640226, 632908, 625850, 618989, 612706, 607538, 603576, 600330, 597125, 593555, 589827, 586729, 584848, 583743, 582458, 581004, 580574, 581863, 583948, 585416, 586012, 586450, 587077, 587595, 587809, 587906, 588026, 588098, 588071, 587933, 587633, 587294, 587295, 587928, 589241, 591396, 594672, 598887, 603290, 607394, 611417, 615614, 619725, 623394, 626479, 628612, 629152, 628117, 626463, 624950, 623403, 621670, 620420, 620255, 620721, 621139, 621740, 623080, 624821, 626109, 626793, 627352, 627992, 628713, 629961, 632344]
60362F32344L562M413N096N424M952M267M710O250P140O448N435N550O390O851
60348G08832O920P107P086O323N259M577L922K531O16r95k152l237m083m105l271
60333G35330k080p52P82K284L395M223N087N784N743M807L364J781J49j546l266
60318G65085m839n895o171n929n699n546n117m453m004l751l153k262j952k541
60304G03773l088k636j457l44O07J775L068M014M420M258L253J272j073k774l429
60289G11639l466l595m143m793m796l746k225j246j016p03M58K376M525O414P481
60274G03164P302O289N591N936P023Q227R264R959J0093R923J0233J1438J3119
60261H17561J4718J6136J7448J8621J9782K1209K2820K4314K5931K8328L1556
$$ y = [632344, 635906, 640319, 645415, 650839, 655791, 660058, 664768, 671018, 678158, 684606, 690041, 695591, 701981, 708832, 715752, 722859, 729945, 736268, 741527, 746104, 750026, 752557, 753173, 752178, 750026, 746789, 742706, 738601, 735330, 733250, 732498, 733280, 735564, 738959, 743182, 748269, 754053, 759796, 764603, 767967, 769748, 769897, 768351, 765085, 760246, 754351, 748180, 742251, 736552, 731006, 725889, 721436, 717432, 713681, 710528, 708266, 706314, 703773, 700685, 698049, 696592, 696248, 696855, 698630, 701698, 705712, 710132, 714390, 717643, 718915, 717842, 715068, 711639, 708173, 704578, 700435, 695642, 690846, 687100, 684875, 683629, 682613, 681910, 682368, 684744, 689269, 695683, 703164, 710466, 716755, 722346, 728282, 735305, 743532, 752796, 762755, 772848, 782771, 793004, 804442, 817561, 832279, 848415, 865863, 884484, 904266, 925475, 948295, 972609, 998540, 1026868, 1058424]
60250A058424L4947L8373M2617M8146N4295O0210O5838P1520P7364Q3429Q9858
60239A725021R6293J01841J05990J08931J10559J10031J06830J01513R4766Q6407
60229B748182P6005O3804N0457L6353K1793P447o007j8307k9342l8785m6297n1643
60217B813660n4445n4351n1613m6923m0592l2511k2961j2617j626J0415K3434
60206B529870L6784N0251O4087P7831R0392J01556J12085J21809J28898J31777
60196C445340J30551J25905J17862J06494R2643P6952N9141L9251J8549j744k1739
60185D189205m1845o1328p8841r3522j04606j10960j12156j09252j03413r4544
60175C278738q2356o7858n2478l6359j8975q92J6519L2891M8917O4600P8623Q9478
$$ y = [1058424, 1093371, 1131744, 1174361, 1222507, 1276802, 1337012, 1402850, 1474370, 1551734, 1635163, 1725021, 1821314, 1923155, 2029145, 2138076, 2248635, 2358666, 2465496, 2567009, 2661775, 2748182, 2824187, 2887991, 2938448, 2974801, 2996594, 3004041, 2998034, 2979727, 2950385, 2911600, 2865303, 2813660, 2759215, 2704864, 2653251, 2606328, 2565736, 2533225, 2510264, 2497647, 2496021, 2506436, 2529870, 2566654, 2616905, 2680992, 2758823, 2849215, 2950771, 3062856, 3184665, 3313563, 3445340, 3575891, 3701796, 3819658, 3926152, 4018795, 4095747, 4154888, 4194139, 4212688, 4210944, 4189205, 4147360, 4086032, 4007191, 3913669, 3809063, 3698103, 3585947, 3476695, 3373282, 3278738, 3196382, 3128524, 3076046, 3039687, 3020712, 3019820, 3036339, 3069230, 3118147, 3182747, 3261370, 3350848]
60163C350848R6362R8915R6920R0475Q0005O6162N0038L3110J6525O99j4036k7000
60151C939023l7789m6641n3523n7521n7788n4578m8709m0577l0327j8323m681
60140C488566J1082K9257M9278P0362R2204J14587J37158J60269J85041K11722
60130D549526K38811K64723K89469L13561L36078L55035L69131L77950L80821
60121G475105L76688L64982L45762L19264K85987K46920K03023J54856J03209
60112I875796M9524m953n9744j14237j66804k15388k58208k93393l19044l34479
60102H159070l40491l37719l25988l06172k81203k53809k24379j92472j59177
60093E737660j26291r4094o1826k9750J076L0404N8330Q3647J04399J19730J29584
$$ y = [3350848, 3447210, 3546125, 3643045, 3733520, 3813525, 3879687, 3929725, 3962835, 3979360, 3980059, 3966023, 3939023, 3901234, 3854593, 3801070, 3743549, 3685761, 3631183, 3582474, 3541897, 3511570, 3493247, 3488566, 3499648, 3528905, 3578183, 3648545, 3740749, 3855336, 3992494, 4152763, 4337804, 4549526, 4788337, 5053060, 5342529, 5656090, 5992168, 6347203, 6716334, 7094284, 7475105, 7851793, 8216775, 8562537, 8881801, 9167788, 9414708, 9617731, 9772587, 9875796, 9925320, 9920367, 9860623, 9746386, 9579582, 9364194, 9105986, 8812593, 8493549, 8159070, 7818579, 7480860, 7154872, 6848700, 6567497, 6313688, 6089309, 5896837, 5737660, 5611369, 5517275, 5455449, 5425699, 5426775, 5457179, 5515509, 5599156, 5703555, 5823285, 5952869]
60082E952869J33008J28621J16640R8780P6334N0146K2255m550k9218n2825p6142
60071F415918r8248j17921j34915j49362j61099j70080j76400j79671j79282j75491
60061D873449j69283j61046j50378j37225j22161j05468q7090o7526m7771k8168
60051C797333q345J1760L1758N1671P1781R1547J09710J25443J38412J47695J51856
60040D720621J50226J43092J30745J13489R2497O9373M4652J7933j0429l8900
60030E433299o6201r1835j15031j34423j49160j59341j65007j65796j61956j54542
60020D070007j44332j31362j15876r8779q0868o2431m3837k5646p959R555K6968
60009C395440M4360O2627Q2801J04450J25834J45812J64336J80936J94115K02635
$$ y = [5952869, 6085877, 6214498, 6331138, 6429918, 6506252, 6556398, 6578653, 6574103, 6544885, 6492060, 6415918, 6317670, 6199749, 6064834, 5915472, 5754373, 5584293, 5407893, 5228222, 5048940, 4873449, 4704166, 4543120, 4392742, 4255517, 4133356, 4027888, 3940798, 3873272, 3825501, 3797333, 3788988, 3800748, 3832506, 3884177, 3955958, 4047505, 4157215, 4282658, 4421070, 4568765, 4720621, 4870847, 5013939, 5144684, 5258173, 5350670, 5420043, 5464695, 5482628, 5472199, 5433299, 5367098, 5275263, 5160232, 5025809, 4876649, 4717308, 4552301, 4386505, 4224549, 4070007, 3925675, 3794313, 3678437, 3579658, 3498790, 3436359, 3392522, 3366876, 3358917, 3368472, 3395440, 3439800, 3502427, 3585228, 3689678, 3815512, 3961324, 4125660, 4306596, 4500711, 4703346]
59999D703346K06082K03737J94317J77576J55137J28995J00158O9406L8114P334
59989E984202k3109n3585q3236j10346j33639j52366j65625j72625j73551j69554
59979D746566j61779j50785j36843j20443j02383q3376o3700m3417k2944k978
59969C857918J6353L5666N5149P3727R0013J03638J14838J23251J28028J28847
59959D727428J25836J18794J07605R3289P7565O1382M4769K8016J1982k679j5552
59948E378435k5674l1749l3231l0316k2988j1032N064K4423M6982P3361J03519
59937E476794J36648J72371K10818K51337K92330L32573L71461M07620M38279
59928H090231M60303M70747M66243M43331M00206L37566K57681J63751O0687m4714
$$ y = [4703346, 4909428, 5113165, 5307482, 5485058, 5640195, 5769190, 5869348, 5938754, 5976868, 5984202, 5961093, 5907508, 5824272, 5713926, 5580287, 5427921, 5262296, 5089671, 4916120, 4746566, 4584787, 4434002, 4297159, 4176716, 4074333, 3990957, 3927257, 3883840, 3860896, 3857918, 3874271, 3909937, 3965086, 4038813, 4128826, 4232464, 4347302, 4470553, 4598581, 4727428, 4853264, 4972058, 5079663, 5172952, 5250517, 5311899, 5356668, 5384684, 5396666, 5393987, 5378435, 5352761, 5321012, 5287781, 5257465, 5234477, 5223445, 5228509, 5252932, 5299914, 5373275, 5476794, 5613442, 5785813, 5996631, 6247968, 6540298, 6872871, 7244332, 7651952, 8090231, 8550534, 9021281, 9487524, 9930855, 10331061, 10668627, 10926308, 11090059, 11150746, 11106032]
59918A1106032j45367k35469l10703l68127m06704m27419m32475m24539m06487
59909G948742l80939l49742l14451k77046k39352k01924j64471j27302r1273n6553
59899E745689k2724R960M0758O9939R8638J26938J53461J76969J96837K11520
59889F807985K18191K14778K01169J77749J44138J00419M8747p154o3458j16706
59879G725858j63829k02613k32009k51824k62730k66545k65421k60490k52203
59870E568194k41898k31719k22665k13929k04526j94332j83279j70970j57668
59861C747208j44241j30609j15592r9058q2736o8014n4312m0674k7794j7241r725
59850B957212n283m305p136j3246k1649l1561m1746n0124n5144n7138n7440n6659
$$ y = [11106032, 10960665, 10725196, 10414493, 10046366, 9639662, 9212243, 8779768, 8355229, 7948742, 7567803, 7218061, 6903610, 6626564, 6387212, 6185288, 6020817, 5893515, 5802242, 5745689, 5722965, 5732925, 5773683, 5843622, 5942260, 6069198, 6222659, 6399628, 6596465, 6807985, 7026176, 7240954, 7442123, 7619872, 7764010, 7864429, 7913176, 7906022, 7842564, 7725858, 7562029, 7359416, 7127407, 6875583, 6612853, 6346308, 6080887, 5820397, 5568194, 5326296, 5094577, 4871912, 4657983, 4453457, 4259125, 4075846, 3904876, 3747208, 3602967, 3472358, 3356766, 3257708, 3174972, 3106958, 3052646, 3011972, 2984178, 2966937, 2957212, 2951929, 2947624, 2940488, 2927242, 2905593, 2874032, 2832286, 2782162, 2727018, 2669880, 2612440, 2555781]
59838B555781n4499n0706m5345l8659l1302k4182j7397r955j175Q279J7447K6391
59826B334678L5683M5122N3936O1842O9032P5367Q0244Q3020Q2925P8862O9991
59815C070702N6683M0623K4109R219k667j0919j5240j5564j2702q640n167k181
59803C128256K006Q822J8689L1791M8318O7925R0095J15244J44444J78014K15474
59792D049078K56661L01273L46908L88765M21159M37570M29190L86604L05760
59783G322968J92620O1771o8938j83384k70652l27005l54936l59650l46546l21226
59773E345022k89401k55207k20517j86603j55157j26980j01288p7655n7259m0958
59763C833997k7439j4723k422Q929J9752L1045M2807N4420O6006P8182R0924J03972
$$ y = [2555781, 2501282, 2450576, 2405231, 2366572, 2335270, 2311088, 2293691, 2283736, 2282561, 2290840, 2308287, 2334678, 2370361, 2415483, 2469419, 2531261, 2600293, 2675660, 2755904, 2838924, 2921849, 3000711, 3070702, 3127385, 3168008, 3192117, 3201336, 3198669, 3187750, 3172510, 3156946, 3144244, 3135604, 3130437, 3128256, 3130262, 3139084, 3157773, 3189564, 3237882, 3305807, 3395902, 3511146, 3655590, 3833604, 4049078, 4305739, 4607012, 4953920, 5342685, 5763844, 6201414, 6630604, 7017208, 7322968, 7515588, 7577359, 7508421, 7325037, 7054385, 6727380, 6372444, 6012794, 5666248, 5345022, 5055621, 4800414, 4579897, 4393294, 4238137, 4111157, 4009869, 3932214, 3874955, 3833997, 3806558, 3791835, 3789413, 3798342, 3818094, 3849139, 3891946, 3946366, 4012372, 4090554, 4181478, 4285450]
59751D285450J17854J33377J50462J68545J87722K08508K30957K54949K80919
59742F018743L09430L40443L73645M08817M45009M80074N11775N38519N58081
59733I984536N66589N60313N38186N01822M53934L98083L39426K84144K37805
59724A3864838K04627J87629J88265K06004K38958K84696L40070M01020M63496
59715A6379603N24161N79545O25109O56014O68456O59766O28033N72750M95708
59706B1789145M00876K93753J81030O9883l3141j22362j92490k39580k63007k65066
59696B1619041k47785k11456j56974q7792p960Q0566J77289K81055L90163N03529
59686B2339676O19896P36313Q48538R52124J041495J108430J142775J134512J074788
$$ y = [4285450, 4403304, 4536681, 4687143, 4855688, 5043410, 5251918, 5482875, 5737824, 6018743, 6328173, 6668616, 7042261, 7451078, 7896087, 8376161, 8887936, 9426455, 9984536, 10551125, 11111438, 11649624, 12151446, 12605380, 13003463, 13342889, 13627033, 13864838, 14069465, 14257094, 14445359, 14651363, 14890321, 15175017, 15515087, 15916107, 16379603, 16903764, 17483309, 18108418, 18764432, 19432888, 20092654, 20720687, 21293437, 21789145, 22190021, 22483774, 22664804, 22734687, 22701546, 22579184, 22386694, 22147114, 21884107, 21619041, 21371256, 21159800, 21002826, 20915034, 20907074, 20987640, 21164929, 21445984, 21836147, 22339676, 22959572, 23695885, 24544423, 25496547, 26538042, 27646472, 28789247, 29923759, 30998547]
59677C0998547R56981P79610N49060K78988j2327l03902n73987q03862r81356
59668C0887752j101098j163042j172429j140178j081128j011369r47211r03808
59660B2367489q90562r06332r40179r77389j005118j014972j004001r74563r31832
59651A3722541q80509q24019p65632p08297o53274o00365n49770n02508m59072
59642G779095m18904l81437l46630l14435k84624k57126k31723k07707j84695
59633E151814j63335j44208j26522j09106r2251p7187o4102n2091m0992l1844
59623D250176k5450k1725k0530k2046k6188l2598m1146n1499o2352p2089q0190
59612C794363q7108r2879r6760r8104r6771r2955q7378q1310p5473o9275o1922
$$ y = [30998547, 31955528, 32735138, 33284198, 33563186, 33550859, 33246957, 32672970, 31869108, 30887752, 29786654, 28623612, 27451183, 26311005, 25229877, 24218508, 23271297, 22367489, 21476927, 20570595, 19630416, 18653027, 17647909, 16632937, 15628936, 14654373, 13722541, 12842032, 12018013, 11252381, 10544084, 9890810, 9290445, 8740675, 8238167, 7779095, 7360191, 6978754, 6632124, 6317689, 6033065, 5775939, 5544216, 5336509, 5151814, 4988479, 4844271, 4717749, 4608643, 4516392, 4439205, 4375103, 4323012, 4282020, 4250176, 4224726, 4203001, 4182471, 4160425, 4134237, 4101639, 4060493, 4008994, 3946642, 3874553, 3794363, 3707255, 3614376, 3517616, 3419512, 3322741, 3229786, 3142408, 3061098, 2985625, 2916350, 2854428]
59601B854428n3732m5438l6965k8028j9325j1774n018J869Q611J4012J7714K0331
59589B716685K2131K2910K2940K2728K1973K0164J7972J6762J6877J7679J9093
59578B937914K1743K5675L0245L5324M1421M8577N6291O4449P3404Q3273R4103
59567C512419J06476J20849J36641J52992J69921J87676K05551K22610K39040
59558E054175K55207K69866K80832K87226K89621K88290K82768K72858K58669
59549G539512K40073K17600J93368J69455J45854J21804R8501P8099O0121M1403
59539H905790K0337n90j6839k4643k1646o979J7876M9460Q4336J19994J53734
59528I280830J81900K00679K06731J97210J70678J28399P3684R828o0305j33066
$$ y = [2854428, 2800696, 2755258, 2718293, 2690265, 2670940, 2659166, 2654148, 2656017, 2664628, 2678640, 2696354, 2716685, 2738816, 2761726, 2784666, 2807394, 2829367, 2849531, 2867503, 2884265, 2901142, 2918821, 2937914, 2959657, 2985332, 3015577, 3050901, 3092322, 3140899, 3197190, 3261639, 3335043, 3418316, 3512419, 3618895, 3739744, 3876385, 4029377, 4199298, 4386974, 4592525, 4815135, 5054175, 5309382, 5579248, 5860080, 6147306, 6436927, 6725217, 7007985, 7280843, 7539512, 7779585, 7997185, 8190553, 8360008, 8505862, 8627666, 8726167, 8804266, 8864387, 8905790, 8926127, 8925537, 8908698, 8884055, 8862409, 8855430, 8873306, 8922766, 9007102, 9127096, 9280830, 9462730, 9663409, 9870140, 10067350, 10238028, 10366427, 10440111, 10449939, 10389634, 10256568]
59518A0256568k04036k69490l26769l73416m07592m29381m40157m40626m30972
59509F934129m12838l89243l62295l32563l00930k69311k39053k10252j83086
59500D234558j58278j35839j14804r4751p6158n8987m2266k5499r027P263K4130
59489C550342M1506N8483P5080R2579J11611J31413J51380J71775J92397K12097
59479D788663K30149K46591K60544K69671K71963K66739K53367K30484J97349
59470G015520J54832J04529M8134j1722p1285j27123j77005k19257k52580k76801
59460F187242k92560l00046k99302k91921k80750k67534k52231k34959k16926
59451C751013j99050j81300j63947j47879j33229j19206j05792r3915q3585p3591
$$ y = [10256568, 10052532, 9783042, 9456273, 9082857, 8675265, 8245884, 7805727, 7365101, 6934129, 6521291, 6132048, 5769753, 5437190, 5136260, 4866949, 4627896, 4417644, 4234558, 4076280, 3940441, 3825637, 3730886, 3654728, 3595741, 3553475, 3527976, 3518949, 3526212, 3550342, 3591848, 3650331, 3725411, 3817990, 3929601, 4061014, 4212394, 4384169, 4576566, 4788663, 5018812, 5265403, 5525947, 5795618, 6067581, 6334320, 6587687, 6818171, 7015520, 7170352, 7274881, 7323015, 7311293, 7240008, 7112885, 6935880, 6716623, 6464043, 6187242, 5894682, 5594636, 5295334, 5003413, 4722663, 4455129, 4202898, 3967939, 3751013, 3551963, 3370663, 3206716, 3058837, 2925608, 2806402, 2700610, 2606695, 2523110, 2449519]
59441B449519o3585n4598m6942l9499l1820k4907j9145j3490p751l459j206Q69
59429B143986M368Q182J0452J1311J1976J2541J2586J2838J4360J6951K0056K4330
59417B303937L0356L6298L8680L5857K9773K4450K3325K7498L5447M4659N4122
59406B684402O4883P7957R2360J05668J15908J22673J27558J33928J45229J62618
59396C833184J84904K10925K40870K74962L12421L52618L95898M42250M89975
59387F738007N36287N78171O11986O33629O40221O31224O07512N70711N23935
59378A2071683M71795M18546L66939L19160K77333K42078K11895J84839J59651
59369A4723919J34414J05722P0651K8724j8881p0843j25223j78608k27117k67835
$$ y = [2449519, 2385934, 2331336, 2284394, 2244895, 2213075, 2188168, 2169023, 2155533, 2147782, 2144323, 2143117, 2143986, 2148354, 2156536, 2166988, 2178299, 2190275, 2202816, 2215402, 2228240, 2242600, 2259551, 2279607, 2303937, 2334293, 2370591, 2409271, 2445128, 2474901, 2499351, 2522676, 2550174, 2585621, 2630280, 2684402, 2749285, 2827242, 2919602, 3025270, 3141178, 3263851, 3391409, 3525337, 3670566, 3833184, 4018088, 4229013, 4469883, 4744845, 5057266, 5409884, 5805782, 6248032, 6738007, 7274294, 7852465, 8464451, 9098080, 9738301, 10369525, 10977037, 11547748, 12071683, 12543478, 12962024, 13328963, 13648123, 13925456, 14167534, 14379429, 14564268, 14723919, 14858333, 14964055, 15034706, 15063430, 15044549, 14973706, 14848483, 14669875, 14442758, 14174923]
59359A4174923k98840l19248l30307l35409l37871l39451l41599l46429l55010
59350A1170759l65723l75799l83816l89566l92485l91692l87111l79393l69046
59341G736128l56481l42320l26935l10205k92386k74486k57132k39934k22548
59332E113701k05478j89243j73635j58541j44393j31261j18508j06032r4629q4478
59322C707503p4491o4003n3816m4724l6229k7683j9363j1438l084O143J5269K3267
59310C417351L0409L7225M3371M8605N3796N9694O5642P0617P4522P7468P8942
59299D057642P8784P7955P7180P5950P3820P1598P0152O9261O8772O9603P2327
59288D863044P5945P9276Q2332Q5007Q5662Q2526P5403O4657M9681K9969O635
$$ y = [14174923, 13876083, 13556835, 13226528, 12891119, 12553248, 12213797, 11872198, 11525769, 11170759, 10805036, 10429237, 10045421, 9655855, 9263370, 8871678, 8484567, 8105174, 7736128, 7379647, 7037327, 6710392, 6400187, 6107801, 5833315, 5576183, 5336249, 5113701, 4908223, 4718980, 4545345, 4386804, 4242411, 4111150, 3992642, 3886610, 3791981, 3707503, 3633012, 3569009, 3515193, 3470469, 3434240, 3406557, 3387194, 3375756, 3372672, 3378815, 3394084, 3417351, 3447760, 3484985, 3528356, 3576961, 3630757, 3690451, 3756093, 3826710, 3901232, 3978700, 4057642, 4136426, 4214381, 4291561, 4367511, 4441331, 4512929, 4583081, 4652342, 4721114, 4790717, 4863044, 4938989, 5018265, 5100597, 5185604, 5271266, 5353792, 5429195, 5493852, 5543533, 5573502, 5580137]
59277E580137j8611m5084p2175r7848j19685j36690j48707j55067j55515j51777
59267D478978j46675j42181j39308j38729j39800j39774j35831j27634j16803
59258C252243j04647r1612p8112o4459n0514l6588k3811j2531j359J0966K3862
59247B823438L6424M9399O3986P9801R5944J13237J33476J57016J82918K11072
59237C946711K42360K76951L13996L52643L91910M29575M62350M86989N00318
59228G403803M98873M79732M41642L84857L10784K22565J24922K2401q1283j81429
59218I626867k71635l46414m03407m41876m60926m61151m46569m22434l91838
59209E980617l56178l17721k79250k41874k05509j71104j40287j13157q8548o6338
$$ y = [5580137, 5561526, 5516442, 5444267, 5346419, 5226734, 5090044, 4941337, 4786270, 4630755, 4478978, 4332303, 4190122, 4050814, 3912085, 3772285, 3632511, 3496680, 3369046, 3252243, 3147596, 3055984, 2977872, 2913413, 2862899, 2826311, 2802500, 2789969, 2788610, 2799576, 2823438, 2859862, 2909261, 2973247, 3053048, 3148992, 3262229, 3395705, 3552721, 3735639, 3946711, 4189071, 4466022, 4780018, 5132661, 5524571, 5954146, 6416496, 6903485, 7403803, 7902676, 8382408, 8824050, 9208907, 9519691, 9742256, 9867178, 9889579, 9808296, 9626867, 9355232, 9008818, 8605411, 8163535, 7702609, 7241458, 6794889, 6372455, 5980617, 5624439, 5306718, 5027468, 4785594, 4580085, 4408981, 4268694, 4155537, 4066989, 4000651]
59199D000651m7600l2629k0656j1528n851l504l512n501r834j6333k4069l2392
59187C787242m1126m9870n8130o5846p2927p8656q2378q4221q4470q3077q0489
59176C006052p7866p5449p1975o6730o0836n5340m9607m3027l6709l1677k6849
59165B409987k0804j4235q607l630J821P411J2148J6525K1616K6945L1387L5363
59153B515927M0065M5253M9866N3880N7564N9994O0503O0421O1036O0915N7932
59142C123356N2778M7644M2261L4422K4006J3391L960m938j3435k0331k5083k8214
59130C249817k9648k8788k6201k3015j8791j2213l647N359J4815K6036L8783N1260
59118C243767O2944P4858Q6970R7897J07400J16731J26233J34964J42874J50933
$$ y = [4000651, 3953051, 3920422, 3899766, 3888238, 3882387, 3878883, 3875371, 3869870, 3860036, 3843703, 3819634, 3787242, 3746116, 3696246, 3638116, 3572270, 3499343, 3420687, 3338309, 3254088, 3169618, 3086541, 3006052, 2928186, 2852737, 2780762, 2714032, 2653196, 2597856, 2548249, 2505222, 2468513, 2436836, 2409987, 2389183, 2374948, 2366341, 2362711, 2364532, 2371943, 2384091, 2400616, 2422232, 2449177, 2480564, 2515927, 2555992, 2601245, 2651111, 2704991, 2762555, 2822549, 2883052, 2943473, 3004509, 3065424, 3123356, 3176134, 3223778, 3266039, 3300461, 3324467, 3337858, 3341818, 3336880, 3323445, 3303114, 3278031, 3249817, 3220169, 3191381, 3165180, 3142165, 3123374, 3111161, 3107514, 3112873, 3127688, 3153724, 3192507, 3243767, 3306711, 3381569, 3468539, 3566436, 3673836, 3790567, 3916800, 4051764, 4194638, 4345571]
59108D345571J58782J64411J66379J64111J55881J39051J12762P8387L7209r903
59098E512641o0304j09451j53579j90663k18946k37096k46104k48603k45787k37174
59088C564934k23563k07706j91642j75601j59904j45528j32313j19047j05903
59079B103727r4508q5244p6763o8595o1676n5899m9745m3169l8248l5949l4594
59068A459337l2470k9810k7227k4346k1039j8065j5507j2421q726n666l649j614
59056A258797Q75K849L842M485M524K408k309q040j3296j7785k0868k1199j8790
59043A175493j5383j1892p483j844L793Q762J4031K0087K5733K9834L2357L2957
59031A306445L0589K5481J9560J3999Q296K535j637l347l792m020l385j323J158
$$ y = [4345571, 4504353, 4668764, 4835143, 4999254, 5155135, 5294186, 5406948, 5485335, 5522544, 5512641, 5452337, 5342886, 5189307, 4998644, 4779698, 4542602, 4296498, 4047895, 3802108, 3564934, 3341371, 3133665, 2942023, 2766422, 2606518, 2460990, 2328677, 2209630, 2103727, 2009219, 1923975, 1847212, 1778617, 1716941, 1661042, 1611297, 1568128, 1529880, 1493931, 1459337, 1426867, 1397057, 1369830, 1345484, 1324445, 1306380, 1290873, 1278452, 1269726, 1264060, 1260411, 1258797, 1259672, 1262521, 1266363, 1270848, 1275372, 1277780, 1275471, 1267431, 1254135, 1236350, 1215482, 1194283, 1175493, 1160110, 1148218, 1140735, 1138891, 1142684, 1151446, 1165477, 1185564, 1211297, 1241131, 1273488, 1306445, 1337034, 1362515, 1382075, 1396074, 1404370, 1406905, 1405268, 1401921, 1398129, 1394109, 1390724, 1389401, 1390559]
59018A390559L124N140P937J1003J3534J5356J6175J5297J2775R414N254k91o541
59005A498736j1762j5668j9596k3680k6164k6248k5303k4362k2669j9730j6625
58994A266929j4011j0971p031l450j219M78K657N048P178R258J1069J1657J1009
58981A288601J0394J0327R983R324R787J2059J5048J7923K1161K4887K8116L0549
58969A488159L3049L5617L6892L6401L5186L3548L0526K6357K3022K1360K0077
58958A820194J8599J8399K0295K3004K5628K9160L4101L8940M2534M5732M9280
58947B165866N2366N4695N7674O2027O6513P0462P5328Q2078Q9301R5791J02883
58936B974984J12393J24066J36750J50398J65315J81094J97784K16459K37436
$$ y = [1390559, 1393683, 1398823, 1406760, 1417763, 1431297, 1446653, 1462828, 1478125, 1490900, 1500314, 1505568, 1505277, 1498736, 1486974, 1471306, 1451710, 1428030, 1401866, 1375618, 1350315, 1325953, 1303284, 1283554, 1266929, 1252918, 1241947, 1234916, 1231466, 1230247, 1230725, 1233382, 1238430, 1245608, 1254866, 1265935, 1277592, 1288601, 1298995, 1309322, 1319305, 1328629, 1338416, 1350475, 1365523, 1383446, 1404607, 1429494, 1457610, 1488159, 1521208, 1556825, 1593717, 1630118, 1665304, 1698852, 1729378, 1755735, 1778757, 1800117, 1820194, 1838793, 1857192, 1877487, 1900491, 1926119, 1955279, 1989380, 2028320, 2070854, 2116586, 2165866, 2218232, 2272927, 2330601, 2392628, 2459141, 2529603, 2604931, 2687009, 2776310, 2872101, 2974984, 3087377, 3211443, 3348193, 3498591, 3663906, 3845000, 4042784, 4259243, 4496679]
58927D496679K59627K82702L07991L36270L66809L99502M35530M74905N15791
58918G875806N57478O01108O46065O88326P23979P51456P68565P70267P51599
58909A4134649P10417O45490N54976M39402L03979J55873J403j52277k96019m22274
58899A6075619n28080o12489o73636p10790p26760p25378p08661o78912o41161
58890A0069752o00512n58886n16898m76825m40754m07838l76440l47394l22380
58881F021825l00719k80648k62183k45964k30762k14906j98853j83748j68968
58872C935074j53631j39019j26748j15952j04873r3873q4288p5804o7488o0015
58862B913383n4234m8956m2738l6338l0964k5670j9236j2990q729n334m08N930
$$ y = [4496679, 4756306, 5039008, 5346999, 5683269, 6050078, 6449580, 6885110, 7360015, 7875806, 8433284, 9034392, 9680457, 10368783, 11092762, 11844218, 12612783, 13383050, 14134649, 14845066, 15490556, 16045532, 16484934, 16788913, 16944786, 16946189, 16793912, 16497893, 16075619, 15547539, 14935050, 14261414, 13550624, 12823864, 12098486, 11389825, 10710913, 10069752, 9469240, 8910354, 8393456, 7916631, 7475877, 7068039, 6691599, 6344205, 6021825, 5721106, 5440458, 5178275, 4932311, 4701549, 4486643, 4287790, 4104042, 3935074, 3781443, 3642424, 3515676, 3399724, 3294851, 3200978, 3116690, 3040886, 2973398, 2913383, 2859149, 2810193, 2767455, 2731117, 2700153, 2674483, 2655247, 2642257, 2633528, 2628194, 2627786, 2633716]
58850B633716J1820J7086K2932K9245L5051M0747M7226N3779N9413O5218P2748
58839C088981Q1194Q8792R5995J04477J14089J23641J33735J46009J60224J74849
58829D311986J89949K07055K26734K48562K72795K99919L29374L60759L95238
58820F842371M33772M75144N17688N61331O05706O47896O84498P14154P35211
58811A2217771P42599P30177O95012O36723N54344M47423L19308J76411K5077
58802A6544845j28093k74409m05236n15782o04454o69922p11689p32391p36273
58793A1766596p25985p03453o72457o37192n99140n58345n16588m76313m37535
58784F439588l99077l61894l27965k96891k66845k38157k12872j91710j74511
$$ y = [2633716, 2645536, 2662622, 2685554, 2714799, 2749850, 2790597, 2837823, 2891602, 2951015, 3016233, 3088981, 3170175, 3258967, 3354962, 3459439, 3573528, 3697169, 3830904, 3976913, 4137137, 4311986, 4501935, 4708990, 4935724, 5184286, 5457081, 5757000, 6086374, 6447133, 6842371, 7276143, 7751287, 8268975, 8830306, 9436012, 10083908, 10768406, 11482560, 12217771, 12960370, 13690547, 14385559, 15022282, 15576626, 16024049, 16343357, 16519768, 16544845, 16416752, 16142343, 15737107, 15221325, 14616871, 13946949, 13235260, 12502869, 11766596, 11040611, 10337158, 9664701, 9027509, 8428369, 7870024, 7353436, 6877123, 6439588, 6040511, 5678617, 5350652, 5053761, 4786916, 4548759, 4335887, 4144177, 3969666]
58775C969666j62604j57072j55482j53609j49887j45112j38928j30110j19593
58766B657269j09585j00133q9831p9224p0209o2631n4858m7073m0630l4873k8000
58755A940222k0496j4255q989k949L505Q550J2349J6029J7961J5000P194k528
58743A971593j2763k3877l4333m1171m4234m5924m6757m5135m1659l9375l9212
58732A557153l9000l7711l6943l7445l7741l7064l6532l6659l6561l6030l5645
58721A149822l4677l1868k8157k5669k4167k1747j8618j6706j5766j3697j0615
58710I08135q749q224o933m796m158n498o693p140q693j1735j4042j4536j4645
58697G92293j5132j4943j3890j3162j2526j0390p115m925m112k803q51q6k71J248
$$ y = [3969666, 3807062, 3649990, 3494508, 3340899, 3191012, 3045900, 2906972, 2776862, 2657269, 2547684, 2447551, 2357720, 2278496, 2208287, 2145656, 2090798, 2043725, 2003095, 1968222, 1940222, 1919726, 1905471, 1896482, 1893533, 1897038, 1905588, 1917937, 1933966, 1951927, 1966927, 1974121, 1971593, 1958830, 1934953, 1900620, 1859449, 1815215, 1769291, 1722534, 1677399, 1635740, 1596365, 1557153, 1518153, 1480442, 1443499, 1406054, 1368313, 1331249, 1294717, 1258058, 1221497, 1185467, 1149822, 1115145, 1083277, 1055120, 1029451, 1005284, 983537, 964919, 948213, 932447, 918750, 908135, 899386, 891162, 884229, 879433, 875275, 869777, 863084, 855944, 847251, 835516, 821474, 806938, 792293, 777161, 762218, 748328, 735166, 722640, 712250, 705135, 700210, 696098, 693295, 692444, 692358, 692087, 693335]
58683F93335N031Q575J0706J3105J6403J8573J8503J7653J6881J5134J2541J1393
58671H57833J2658J4622J6251J8722K2437K5500K6258K4509J9450R723l321j5446
58659A029196k3737k8467l0370k9294k6287k3622k1715j8774j4249r768o189k717
58647G94007O51K948M777P786J1462J3824J5264J7997K1720K3999K5020K7620
58635I67075L2200L6177L9128M3656N0243N6057O0320O6167P5483Q6278R6880
58624A609664J08567J22245J36610J51308J67871J85838K01869K14345K24741
58615C123058K32907K35149K28642K13515J88998J52354J04142N0290l421n5113
58605D470521j03013j42681j71082j89795k01328k05679k02846j95272j85112
$$ y = [693335, 698366, 706941, 717647, 730752, 747155, 765728, 784231, 801884, 818765, 833899, 846440, 857833, 870491, 885113, 901364, 920086, 942523, 968023, 994281, 1018790, 1038240, 1047963, 1044642, 1029196, 1005459, 976992, 946622, 917328, 891041, 867419, 845704, 826930, 812681, 802913, 796724, 794007, 794658, 797606, 802383, 810169, 821631, 835455, 850719, 868716, 890436, 914435, 939455, 967075, 999275, 1035452, 1074580, 1118236, 1168479, 1224536, 1284856, 1351023, 1426506, 1512784, 1609664, 1718231, 1840476, 1977086, 2128394, 2296265, 2482103, 2683972, 2898317, 3123058, 3355965, 3591114, 3819756, 4033271, 4222269, 4374623, 4478765, 4529055, 4525634, 4470521, 4367508, 4224827, 4053745, 3863950, 3662622, 3456943, 3254097, 3058825, 2873713]
58596B873713j72220j57025j42040j28461j14666j00212q7698p8551p0532o1760
58586A760548n3607m7333m1453l4888k9222k5425k1656j6639j1808p882k793M687
58574A472529J2597J9272K5564L1452L4051L1359K4474J4054j448k1403m0772
58563A601729n5081o4356o9858p0775o6953o1196n5801m9741m1865l3708k6896
58552A005499k1107j6723j5792j8079j9919j9332j8526j9116j9104j7059j5041
58541H05701j4518j3583j1122r583j0536j1573j0696r758j0416j0817r619r121
58529F74359j0955j2680j2046j0686j0209q836n533l188l800m571k769m93m14
58516E88179q52O31K432K243J709L227N337N696N588P254R650J1000J2622J6176
$$ y = [2873713, 2701493, 2544468, 2402428, 2273967, 2159301, 2059089, 1971391, 1892840, 1822308, 1760548, 1706941, 1659608, 1618155, 1583267, 1554045, 1528620, 1506964, 1490325, 1478517, 1470635, 1467842, 1472529, 1485126, 1504398, 1529962, 1561414, 1595465, 1626824, 1651298, 1665352, 1663904, 1642501, 1601729, 1546648, 1482292, 1412434, 1341659, 1274706, 1213510, 1157709, 1107968, 1066103, 1032395, 1005499, 984392, 967669, 951877, 933798, 913879, 894547, 876021, 856905, 837801, 820742, 805701, 791183, 777600, 766478, 756895, 746359, 734786, 724090, 714332, 703916, 693099, 683480, 674359, 663404, 650724, 638678, 627992, 617783, 608947, 603414, 600226, 596426, 591855, 589086, 588593, 588179, 587327, 587958, 590390, 592633, 594342, 597569, 602906, 608602, 614190, 621444, 631094, 642094, 654716, 670892]
58502F70892K0022K2234K4319K8096L1841L3247L3176L2864L0675K5412J9542
58491I72320J5375J1321N551k60m648r881j7551k4438k7197k7590k8630k9148
58479H35224k6942k3784k2358k1360j8492j5298j4365j4514j3465j2362j3183
58468F39101j4472j4069j3206j3612j3548j1005p758o077m645j895J47l34q90
58455E37737J013L415L929M434P037R419R197Q991J1894J5840J7745J9195K2425
58442F72271K4588K2012J6513J1633O293j718r579j3184j3878j5290j6574j5029
58430F68058j2192j1044j0117o617k494j124r06J577N023O340O994J0059J3922
58417F67479J5435J6289J9602K3060K2278J8252J4801J1384N254j981o829j0295
$$ y = [670892, 690914, 713148, 737467, 765563, 797404, 830651, 863827, 896691, 927366, 952778, 972320, 987695, 999016, 1004567, 1004307, 999659, 989778, 972227, 947789, 920592, 893002, 864372, 835224, 808282, 784498, 762140, 740780, 722288, 706990, 692625, 678111, 664646, 652284, 639101, 624629, 610560, 597354, 583742, 570194, 559189, 551431, 545354, 540709, 538814, 538961, 538627, 537737, 538750, 542165, 546094, 550528, 557565, 566984, 576181, 585172, 597066, 612906, 630651, 649846, 672271, 696859, 718871, 735384, 747017, 753310, 751592, 742013, 728829, 714951, 699661, 683087, 668058, 655866, 644822, 634705, 628088, 625594, 624470, 623564, 625141, 630164, 636504, 643498, 653557, 667479, 682914, 699203, 718805, 741865, 764143, 782395, 797196, 808580, 813834, 811853, 805024, 794729]
58405G94729j5033j8926j8470j5866j5628j6686j4928j1006q582p329m690k099
58393F45486k353l434j942J49p22k327n38K601K559R13K074M456L559J187K576
58378F54244O592P731O054O239Q373Q464O735O901Q485Q117P019Q909J2220J2638
58364G68721J1604J3798J8009J9326J8504K0108K2986K1779J6576J2052Q339J885
58352I53687n918j0086j0981j3023j5779j5148j1948j0378r569n786j085l25j485
58339H42176J267O715Q806P819R010J1997J2078J0503J2490J6570J6885J4737
58327I71053J6503K1413K2937K1282K2631K6642K6664K2021J8304J5853R804J286
58315A196393l428m634q220j3392j3612r314p243p508m004K617N433M576O785
$$ y = [794729, 779696, 760770, 742300, 726434, 710806, 694120, 679192, 668186, 659604, 652275, 647585, 645486, 643133, 639699, 637757, 637906, 637184, 634857, 634319, 636920, 639479, 640392, 642466, 646922, 650481, 651668, 654244, 660836, 668567, 674621, 680860, 689233, 697697, 704432, 711333, 719818, 727935, 734954, 743863, 756083, 768721, 780325, 794123, 812132, 831458, 849962, 870070, 893056, 914835, 931411, 943463, 951802, 953687, 947769, 937683, 926702, 913679, 897900, 882752, 870804, 860426, 850857, 845071, 843986, 843661, 842176, 843443, 850158, 858964, 866783, 875793, 887790, 899868, 910371, 922861, 939431, 956316, 971053, 987556, 1008969, 1031906, 1053188, 1075819, 1102461, 1129125, 1151146, 1169450, 1185303, 1195107, 1196393, 1192965, 1188331, 1180111, 1166719, 1153107, 1143793, 1136550, 1129042, 1125038, 1127655, 1133088, 1137664, 1144449]
58302A144449J1788J2666R886J1083J6561J9044J8246K1289K8002L0427K8045
58291A351486K8696L3348L4889L3327L6791M5858N2221N4621O0499P0195P5416
58280A877347P5324P7610Q1374P5808N8821M0394K4793O458j3493k4470k4079
58269B255887k1681k0830j5189m991M14J45L859J2772J7028J5357J8159K7215
58257B288145L2049L0630L3431M2502M7364M6367N0724O2177O8552O7056O9532
58246B838529P8847Q3301Q0614Q3548R4866J01243R9237J02203J13806J20641
58236C796835J19389J24506J40150J51862J55252J64672J83788J97052K00628
58227E234134K11203K33339K49909K56433K71457L00558L24979L39356L63935
$$ y = [1144449, 1156237, 1168903, 1178789, 1189872, 1206433, 1225477, 1243723, 1265012, 1293014, 1323441, 1351486, 1380182, 1413530, 1448419, 1481746, 1518537, 1564395, 1616616, 1671237, 1731736, 1801931, 1877347, 1952671, 2030281, 2111655, 2187463, 2246284, 2286678, 2311471, 2317929, 2304436, 2279966, 2255887, 2234206, 2213376, 2198187, 2193196, 2193610, 2193755, 2197614, 2210386, 2227414, 2242771, 2260930, 2288145, 2320194, 2350824, 2384255, 2426757, 2474121, 2520488, 2571212, 2633389, 2701941, 2768997, 2838529, 2917376, 3000677, 3081291, 3164839, 3259705, 3360948, 3460185, 3562388, 3676194, 3796835, 3916224, 4040730, 4180880, 4332742, 4487994, 4652666, 4836454, 5033506, 5234134, 5445337, 5678676, 5928585, 6185018, 6456475, 6757033, 7082012, 7421368, 7785303]
58218G785303M04950M41478M67427N05960N65046O21559O68342P31859Q22588
58209A3014512R15975J005313J122496J281417J455447J638739J871641K175843
58201B4481383K529468K942563L490245M235078N192640O411811P998422J0015640
58193F7297250J2473202J5478325J9273925K4053900K9858551L6591170M3615254
58186B48641577M8891057M8921954M0635962K4065274L116189j6633312l1091220
58179C66547481l9068748m1512573m0115717l6528720l2077712k7591123k3399007
58172A26253881j9587232j6228403j3375504j0989282q992067p347027o025767
58165D3708599m954031m051353l287646k652876k104247j588386j089955o14956
$$ y = [7785303, 8190253, 8631731, 9099158, 9605118, 10170164, 10791723, 11460065, 12191924, 13014512, 13930487, 14935800, 16058296, 17339713, 18795160, 20433899, 22305540, 24481383, 27010851, 29953414, 33443659, 37678737, 42871377, 49283188, 57281610, 67297250, 79770452, 95248777, 114522702, 138576602, 168435153, 205026323, 248641577, 297532634, 346454588, 387090550, 411155824, 414272013, 397638701, 366547481, 327478733, 285966160, 245850443, 209321723, 177244011, 149652888, 126253881, 106666649, 90438246, 77062742, 66073460, 57081393, 49734366, 43708599, 38754568, 34703215, 31415569, 28762693, 26658446, 25070060, 23980105, 23365149]
58157B3365149j40336L82997R85694J675784K479551L429204M434493N145994
58149D1758530N031350L733607J436675j158832l286560m564722n049919m981395
58141C2918734m577208m013911l437562k920352k456592k034274j674112j388195
58133A0416528j152995r48002p81536o57586n54438m57509l80189l31952k96317
58124D856004k59521k32150k23132k18744k06101j93023j86978j77577j57209
58115C001569j37230j26881j16676r8265q0857p2474o4433m9838l8926m0565m5801
58104B129623m4661m2762m6942n0597m7616m5651n1511n7879n7805n7937o4115
58093A562147o7948o1338n1181m6440m3237l5706k9350l0459l3591l2102l0441
$$ y = [23365149, 23224813, 23607810, 24593504, 26269288, 28748839, 32178043, 36612536, 41758530, 46789880, 50523487, 51960162, 50801330, 47514770, 42950048, 37900129, 32918734, 28341526, 24327615, 20890053, 17969701, 15513109, 13478835, 11804723, 10416528, 9263533, 8315531, 7533995, 6876409, 6321971, 5864462, 5484273, 5152321, 4856004, 4596483, 4364333, 4141201, 3922457, 3716356, 3523333, 3336355, 3158778, 3001569, 2864339, 2737458, 2620782, 2522517, 2441660, 2369186, 2304753, 2254915, 2215989, 2175424, 2129623, 2084962, 2042200, 1995258, 1944661, 1897045, 1851394, 1799883, 1742004, 1684199, 1626262, 1562147, 1494199, 1432861, 1381680, 1335240, 1292003, 1256297, 1226947, 1196488, 1162897, 1130795, 1100354]
58082A100354l4060l7730l5556l2335l3522l4025k8262k1524k0206k0233j6099
58071G86802j2032j3259j5216j2220q284q811r937o499k494l355n662m493l278
58058F81262o498j0125r151p366r948j3380j2253r366r665j0757q530n846o641
58045E61736p644m689j179j752l655k697j466l316m582j256K766K522R85K771
58031E38544N004L143N0N14K140N36j748j92K811K627J304L260O599P071O378
58016E78041Q396J1193J0928R678J1523J4681J5213J4648J6275J7669J4580Q721
58004G31546M252J80o470j3523j7118j8819k2138k5361k4978k2774k2406k2338
57992E40053j9216j4980j3419j2960j0000o215n389o011m208j210p55j809q77
$$ y = [1100354, 1066294, 1028564, 993008, 960673, 927151, 893126, 864864, 843340, 823134, 802901, 786802, 774770, 761511, 746295, 734075, 725791, 716980, 707043, 700544, 698050, 694695, 689033, 684540, 681262, 674764, 664639, 655488, 648122, 638174, 624794, 612541, 603175, 593510, 582753, 574223, 568377, 561736, 554092, 549403, 548224, 546472, 542817, 540120, 538654, 535338, 530756, 529500, 532266, 534788, 535773, 538544, 543548, 546691, 546741, 547255, 549395, 549931, 548183, 547991, 550802, 553429, 554733, 557993, 564592, 571663, 578041, 586437, 597630, 608558, 618236, 629759, 644440, 659653, 674301, 690576, 708245, 722825, 731546, 735798, 735978, 729508, 715985, 698867, 680048, 657910, 632549, 607571, 584797, 562391, 540053, 520837, 505857, 492438, 479478, 469478, 463263, 457874, 451863, 447655, 446445, 445690, 443881, 443004]
57979D43004J017O07q36K27K863L732L586N254P550P467O048N894N548K549p53
57964D93757q52K61j302l941l624j525j580k912j971R4m47k318j144K528M370
57949D79394M013M613N893M755J924J031J749M11l086n478o603r191j2715j3838
57935D52872j2801j3146j5191j5707j4015j2717j2416j1262r610r669j0743r993
57923C05602p720o704o789n342k573j118q34O54K790K873J595K293N016O729P124
57908C03596Q699J1295J2082J1043J1011J2090J1401Q519O023M442J984o06l58
57895D01221K291L461K001O49M84n34k750l729l021l162m726n069l209j554j464
57880C80889j333k89K08k74J9J682L071L543M351N666N991N144M585M479L653
$$ y = [443004, 444021, 444628, 443792, 444019, 446882, 450614, 454200, 459454, 467004, 474471, 480519, 486413, 491961, 494510, 493757, 492905, 493166, 491864, 487923, 484299, 482774, 481194, 478282, 476311, 476405, 475958, 473640, 472496, 475024, 479394, 483407, 488020, 493913, 498668, 500592, 501623, 503372, 503783, 500697, 495219, 488616, 479425, 466710, 452872, 440071, 426925, 411734, 396027, 382012, 369295, 356879, 345617, 336007, 326338, 315595, 305602, 297882, 291178, 284389, 279047, 276474, 275356, 274522, 275176, 277966, 280839, 282434, 284727, 289743, 296472, 303596, 312295, 323590, 335672, 346715, 357726, 369816, 381217, 389736, 395759, 400201, 402185, 401579, 401221, 403512, 406973, 408974, 409623, 410107, 409573, 406823, 403094, 400073, 396911, 392185, 387116, 383907, 382353, 380889, 379556, 379267, 379475, 379201, 379220, 380902, 383973, 387516, 391867, 397533, 403524, 408668, 413253, 417732, 421385]
57865D21385K523K540K955J750m28j202j020k503n354o455n266m513n078m796
57851C94538l102k234k780k404l03J252J158J353L013M618N174N818O894O793
57837D19788N023L233K124M48k034l779m577o110q617j0196j0321j0703j1852
57824C62427j2103j0992j0298j0664j0431q841p378o885o345n326m714m415l289
57811B60746j886k048l316l176j302o3j75M01K411L990M431N519P888R653J0043
57796B93116J0882J3091J5105J6060J7085J8027J6462J1650O182K075j594n597
57784D12544q494r556j0489j2300j3365j2575j1582j1869j2299j1513j0290r615
57772B78597q774p172n763n051l919j872j84O12J800L695M405L001J458J717L140
$$ y = [421385, 423908, 426448, 429403, 431153, 430725, 429523, 428503, 426000, 420646, 414191, 408925, 404412, 399334, 394538, 391436, 389202, 386422, 384018, 383715, 384967, 386125, 387478, 390491, 395109, 400283, 406101, 412995, 419788, 424811, 428044, 430168, 430616, 428582, 424803, 420226, 414116, 405499, 395303, 384982, 374279, 362427, 350324, 339332, 329034, 318370, 307939, 299098, 291720, 284835, 278490, 273164, 268450, 264035, 260746, 258860, 256812, 253496, 250320, 249018, 248955, 248780, 249181, 251592, 255582, 260013, 265532, 273420, 283073, 293116, 303998, 317089, 332194, 348254, 365339, 383366, 399828, 411478, 417660, 419735, 418141, 412544, 404050, 394494, 384005, 371705, 358340, 345765, 334183, 322314, 310015, 298502, 288212, 278597, 269823, 262651, 256888, 251837, 247918, 246046, 245862, 246474, 248274, 251969, 256374, 259375, 260833, 262550, 265690]
57757B65690M333N191N648M837L089K414L502M556M424M306M966N034L860L260
57743C25110M433N616N076M065M533N969O777O981P447P915P864P953Q867R981
57729D18587J0635J1297J2311J3054J3438J4514J6496J8035J8621J9620K1848
57718E88456K4185K5807K7687L0625L3966L7475M2160M8027N3406N7982O3975
57707A033751P2784Q2957R3156J04551J18346J33497J48992J65974J85158K04296
57697B343462K20516K33178K42032K44388K36543K16725J84809J41128Q7827K9847
57687D180455k7595q1103j27484j62668j84791j96391k00945j99024j90135j76125
57677B634194j59676j41009j19164r5354p1849m8459k3061N054L4746O4648R1678
$$ y = [265690, 270023, 275214, 280862, 285699, 288788, 291202, 294704, 299260, 303684, 307990, 312956, 317990, 321850, 325110, 329543, 335159, 340235, 344300, 348833, 354802, 361579, 368560, 376007, 383922, 391786, 399739, 408606, 418587, 429222, 440519, 452830, 465884, 479322, 493836, 510332, 528367, 546988, 566608, 588456, 612641, 638448, 666135, 696760, 730726, 768201, 810361, 858388, 911794, 969776, 1033751, 1106535, 1189492, 1282648, 1387199, 1505545, 1639042, 1788034, 1954008, 2139166, 2343462, 2563978, 2797156, 3039188, 3283576, 3520119, 3736844, 3921653, 4062781, 4150608, 4180455, 4152860, 4071757, 3944273, 3781605, 3596814, 3400423, 3199478, 3000454, 2810319, 2634194, 2474518, 2333509, 2214345, 2118991, 2047142, 1998683, 1975622, 1980676, 2015422, 2080070, 2171748]
57666B171748J08256J04742P6537K8199k8767q0947j17693j34820j35382j25847
57656A866026j11221r3926p5637n7817m0840k4486r222M372J6949K9666M2614
57645A546478N5329O8267Q2307R7266J12437J28041J44692J61829J78056J92402
57635B767104K03876K10211K08561J97188J75491J43195J00997N1645q72n2860
57625D004536j00935j41602j72406j93131k04886k08727k06105j99474j90766
57616B386504j79925j66349j51156j36577j23663j11979j01108r1168q2166p3926
57606A168487o6467n9652n3069m6872m1903l8246l4722l0710k7186k4979k3225
57595G21456k0877j8476j7050j6276j5238j3973j2927j1778j0243r019q587q075
$$ y = [2171748, 2280004, 2384746, 2461283, 2489482, 2460715, 2379768, 2262075, 2127255, 1991873, 1866026, 1754805, 1660879, 1585242, 1527425, 1486585, 1462099, 1452877, 1457249, 1474198, 1503864, 1546478, 1601807, 1670074, 1752381, 1849647, 1962084, 2090125, 2234817, 2396646, 2574702, 2767104, 2970980, 3181191, 3389752, 3586940, 3762431, 3905626, 4006623, 4058268, 4057396, 4004536, 3903601, 3761999, 3589593, 3396462, 3191576, 2982849, 2776744, 2577270, 2386504, 2206579, 2040230, 1889074, 1752497, 1628834, 1516855, 1415747, 1324579, 1242413, 1168487, 1102020, 1042368, 989299, 942427, 900524, 862278, 827556, 796846, 769660, 744681, 721456, 700579, 682103, 665053, 648777, 633539, 619566, 606639, 594861, 584618, 575599, 567012, 558937]
57583E58937o708n266m648m157k782j101r4P07K071L169K913K274L056N004O304
57568E59679O557P135Q759J0740J2565J4480J6506J8384K0451K3236K6438K9544
57556G54474L3069L7738M2955M7610N2091N7911O5653P4724Q4774R5853J07431
57545A454283J18794J30171J42107J53907J63914J70812J73376J69472J56940
57536B833776J35334J05633O8972K7204j5982n6372r1579j20816j43050j57187
57526B585933j63740j64454j60394j52071j41111j29855j19148j08203r6689q5476
57516A264792p5235o5830n7193m9429m2134l4985k8839k4729k1912j8487j4006
57505H32013r803o701m025j143J613L999O536R683J3385J7643K2501K7478L2118
$$ y = [558937, 552229, 546963, 542315, 538158, 535376, 534275, 534181, 534888, 536959, 540128, 543041, 545315, 548371, 553375, 559679, 566236, 573371, 582130, 592870, 605435, 619915, 636421, 654805, 675256, 698492, 724930, 754474, 787543, 825281, 868236, 915846, 967937, 1025848, 1091501, 1166225, 1250999, 1346852, 1454283, 1573077, 1703248, 1845355, 1999262, 2163176, 2333988, 2507364, 2676836, 2833776, 2969110, 3074743, 3143715, 3170919, 3154937, 3098565, 3006986, 2886170, 2743120, 2585933, 2422193, 2257739, 2097345, 1945274, 1804163, 1674308, 1555160, 1446957, 1350268, 1264792, 1189557, 1123727, 1066534, 1017105, 974971, 939986, 911147, 886418, 864506, 846019, 832013, 822210, 815509, 811484, 810341, 811954, 815953, 822489, 832172, 845557, 863200, 885701, 913179, 945297]
57492I45297L7074M3501N1321N9338O7142P5679Q5846R7529J10095J22784J34642
57481A830248J44976J53653J60035J61975J56949J43866J22607R2732N4499J0931
57471C032471l2984p3342j08272j36293j55872j66969j71331j70638j65635j57243
57461A693892j46981j35805j23814j11453r9837q9551q0221p1537o3626n6399
57451G14668m9660m3906l9768l6679l3379k9785k6889k4874k2802k0379j8400
57440C68147j7114j5728j3932j2430j1516j0487r079q093p943p826p028n921n154
57427B35896m788m742n160n820o112n892n558n110m196l152k803l060k947k221
57413A74335j741j917k128j981j901k022j861j480j685k474k617j403K89J261
$$ y = [945297, 982371, 1025872, 1077193, 1136531, 1203673, 1279352, 1365198, 1462727, 1572822, 1695606, 1830248, 1975224, 2128877, 2288912, 2450887, 2607836, 2751702, 2874309, 2967041, 3021540, 3032471, 2999487, 2926145, 2817873, 2681580, 2525708, 2358739, 2187408, 2016770, 1851135, 1693892, 1546911, 1411106, 1287292, 1175839, 1076002, 986451, 906230, 834693, 771067, 714668, 665008, 621102, 581334, 544655, 511276, 481491, 454602, 429728, 406926, 386547, 368147, 351033, 335305, 321373, 308943, 297427, 286940, 277861, 269768, 261825, 253999, 246971, 241050, 235896, 231108, 226366, 221206, 215386, 209274, 203382, 197824, 192714, 188518, 185366, 182563, 179503, 176556, 174335, 172594, 170677, 168549, 166568, 164667, 162645, 160784, 159304, 157619, 155145, 152528, 151125, 151414, 152675]
57399A52675J304P92M4m20r2O21O66p4o09m97m05n97l01Q05J804J902J462J036
57381A60116N30p7l18j49j30k25K89J235J402O60M96J489J985O12j357j883j119
57364A63556p64j321j804j712j585j748j901k013k506l438m314m761m758m364
57350A26567l755l369l496l905m234m426m513m469m452m722n001m600l453k256
57336F9916j310r8J632L358M769O208P607Q161P739P489Q198R109R340R302R603
57321A61023R647Q709P589P684Q955J0194J0896J1486J2116J2544J3161J4736
57309B88740J7015J8669J8872J8200J7869J8635K0395K2316K3478K3807K4095
57298E12091K4732K4995K4145K2523K0683J8040J3452O849p33q418j5841k2477
$$ y = [152675, 153979, 154771, 154815, 154395, 154303, 154924, 155590, 155516, 154907, 154410, 154005, 153408, 153107, 153912, 155716, 157618, 159080, 160116, 160646, 160569, 160251, 160102, 159972, 159747, 160036, 161271, 162673, 163333, 163829, 165318, 167303, 167915, 166558, 164675, 163556, 162792, 161471, 159667, 157955, 156370, 154622, 152721, 150708, 148202, 144764, 140450, 135689, 130931, 126567, 122812, 119443, 115947, 112042, 107808, 103382, 98869, 94400, 89948, 85226, 80225, 75625, 72172, 69916, 68606, 68508, 70140, 73498, 78267, 84475, 92082, 100243, 107982, 115471, 123669, 132778, 142118, 151420, 161023, 170670, 179379, 186968, 194652, 203607, 213801, 224697, 236183, 248299, 260843, 274004, 288740, 305755, 324424, 343296, 361496, 379365, 398000, 418395, 440711, 464189, 487996, 512091, 536823, 561818, 585963, 608486, 629169, 647209, 660661, 667510, 666777, 658359, 642518, 620041]
57286F20041k7681l1395l3948l5260l5038l3632l1868l0079k8061k5870k3785
57275B83424k1573j8712j5426j2714j1194j0512r991r301q452p636p111o830o306
57262A37666n260m147l513l175k658k096j886j768j179m39n22j590k586k571j725
57247A02551q57m64n61q88j153j323j649k146k363k105j943k312k525j642m6R71
57231H1545J025R13J048Q77K58J32J192K774L766L938L753L486L197L074L188
57216A14166L300L238L105K755J803M88j18N00J450J682J469J723K350K528K326
57201A42765K732L842M419L710K731K894M065N005N240N464O159O797O796O460
57187B09079O464O747O594N696M619M150M472N189N882O481P119P854Q650R541
$$ y = [620041, 592360, 560965, 527017, 491757, 456719, 423087, 391219, 361140, 333079, 307209, 283424, 261851, 243139, 227713, 214999, 203805, 193293, 183302, 174001, 165549, 157913, 150802, 143972, 137666, 132406, 128259, 124746, 121571, 118913, 116817, 114931, 113163, 111984, 111545, 111023, 109433, 106847, 104276, 102551, 101694, 101230, 100669, 99781, 98628, 97305, 95656, 93510, 91147, 89042, 87099, 84787, 82262, 80620, 80574, 81545, 82570, 83483, 84531, 85408, 85666, 85798, 86990, 89764, 93530, 97468, 101221, 104707, 107904, 110978, 114166, 117466, 120704, 123809, 126564, 128367, 128855, 128737, 129237, 130687, 132369, 133838, 135561, 137911, 140439, 142765, 145497, 149339, 153758, 157468, 160199, 163093, 167158, 172163, 177403, 182867, 189026, 195823, 202619, 209079, 215543, 222290, 228884, 234580, 239199, 243349, 247821, 253010, 258892, 265373, 272492, 280346, 288996, 298537]
57173B98537J0658J1980J3164J3878J4256J4832J5869J7062J8044J8942K0197
57162D67419K1982K4128K6422K8612L0300L1285L2078L3527L5833L8257M0023
57151H09866M1126M2085M3210M4456M5686M6728M7317M7268M6714M5910M4871
57140A305237M3422M1578L9720L8513L8870M1942M8766N9674P4015R0305J06437
57129A928479J19849J28057J29633J24746J14583J00418Q3675O6847N3727M7996
57119B898010N1381O2868P9158R5820J08858J16266J18425J17185J15227J16202
57109C879400J23941J39815J61219J84020K06750K31704K62729L03439L57193
57100E850210M26958N15093O25137P64152R41798J166843J445756J783065K178561
$$ y = [298537, 309195, 321175, 334339, 348217, 362473, 377305, 393174, 410236, 428280, 447222, 467419, 489401, 513529, 539951, 568563, 598863, 630148, 662226, 695753, 731586, 769843, 809866, 850992, 893077, 936287, 980743, 1026429, 1073157, 1120474, 1167742, 1214456, 1260366, 1305237, 1348659, 1390237, 1429957, 1468470, 1507340, 1549282, 1598048, 1657722, 1731737, 1822042, 1928479, 2048328, 2176385, 2306018, 2430764, 2545347, 2645765, 2729440, 2796287, 2850014, 2898010, 2949391, 3012259, 3091417, 3187237, 3296095, 3412361, 3530786, 3647971, 3763198, 3879400, 4003341, 4143156, 4304375, 4488395, 4695145, 4926849, 5189578, 5493017, 5850210, 6277168, 6792261, 7417398, 8181550, 9123348, 10290191, 11735947, 13519012, 15697573]
57091A5697573K622284L094582L571876M030039M443156M785048N033700N167452
57083D8445710N154379M957151M561894L999678L326556K579410J759898Q63245
57075G5647921q7622j040440j935305k721449l365008l857482m217763m474652
57067E3948200m641490m709622m664875m504897m242233l899792l507467l097434
57059B0680390k696301k320816j980608j681640j425620j209405j027854q76424
57051G461722p50552o45157n56393m82274m20527l67718l21599k82345k50067
57042C385090k22814j98437j76831j58886j44384j32225j21697j12296j03287
57033B014233r4480q6598q0020p4020o8001o2435n7855n3830m9799m5907m2428
$$ y = [15697573, 18319857, 21414439, 24986315, 29016354, 33459510, 38244558, 43278258, 48445710, 53600089, 58557240, 63119134, 67118812, 70445368, 73024778, 74784676, 75647921, 75560299, 74519859, 72584554, 69863105, 66498097, 62640615, 58422852, 53948200, 49306710, 44597088, 39932213, 35427316, 31185083, 27285291, 23777824, 20680390, 17984089, 15663273, 13682665, 12001025, 10575405, 9366000, 8338146, 7461722, 6711170, 6066013, 5509620, 5027346, 4606819, 4239101, 3917502, 3635157, 3385090, 3162276, 2963839, 2787008, 2628122, 2483738, 2351513, 2229816, 2117520, 2014233, 1919753, 1833155, 1753135, 1679115, 1611114, 1548679, 1490824, 1436994, 1387195, 1341288, 1298860]
57022A298860l9130l5889l3001l0417k7610k4616k2155k0277j8164j5677j3774
57011A018150j2822j1835j0034p817n354j619M324J2129K1133L1486M3842N9122
56999A140705P9009J05471J39554J81571K30567K78826L06144K86362K07104Q4138
56989C039451m6532j51445k15261k39551k33997k10421j80064j51206j28051j11775
56979A371148j01801r6007r1380q5580p7844o8552n8729m9712m2189l5657k9556
56968F34141k4499k1239j8914j5802j1545p204l190J349P007J3531K0782K8586
56956F03003L5028L6448L0186J6850k37j6941k9674l6488l7959l6401l3682l0169
56944D99964k5805k1193j7029j3217r205m813l13M051Q410J3308J9358K6624L4520
$$ y = [1298860, 1259730, 1223841, 1190840, 1160423, 1132813, 1108197, 1086042, 1065765, 1047601, 1031924, 1018150, 1005328, 993493, 983459, 975642, 970288, 968669, 972993, 985122, 1006255, 1037741, 1081583, 1140705, 1219714, 1325185, 1464739, 1646310, 1876877, 2155703, 2461847, 2748209, 2955313, 3039451, 2992919, 2841474, 2626213, 2386662, 2152665, 1942244, 1762180, 1610974, 1482923, 1371148, 1269347, 1173340, 1081960, 996380, 918536, 849984, 791255, 741543, 699354, 663697, 634141, 609642, 588403, 569489, 553687, 542142, 534938, 531748, 533097, 540104, 553635, 574417, 603003, 638031, 674479, 704665, 721515, 721278, 704337, 674663, 638175, 600216, 563815, 530133, 499964, 474159, 452966, 435937, 422720, 413515, 408702, 408389, 412440, 420850, 434158, 453516, 480140, 514660]
56931E14660M2259M8607N0680M4454K8264N696j6455l3234m3638m8560m8844m5739
56919D98150m1207l6506l1466k5956k0985j7540j5195j2838j0206p886o243n088
56907B67034m167l387k758k300j848r81M23J670J936J525J644K801M246N241O041
56892B77120P332R375J2092J5342J8895K2548K6279K9609L0784K7649J9716Q791
56880E05532k460j1924j8230k0918k0829j9426j7302j4193j0452p221m802k151
56868C55624J451N366R060J3365J9380K7024L5675M5276N5548O4343O7789O2230
56856G62131M6249K1890n323k8597m3508m9865n0099m6668m1272l5254k9350k3361
56844D76973j6827r842k648N058J3741K3401L3857M5337N8312P2985Q8868J03659
$$ y = [514660, 556919, 605526, 656206, 700660, 728924, 734620, 718165, 684931, 641293, 592733, 543889, 498150, 456943, 420437, 388971, 363015, 342030, 324490, 309295, 296457, 286251, 278365, 272122, 267034, 262867, 259480, 256722, 254422, 252574, 251593, 252016, 253686, 255622, 257147, 258791, 261592, 265838, 271079, 277120, 284452, 293827, 305919, 321261, 340156, 362704, 388983, 418592, 449376, 477025, 496741, 505532, 503072, 491148, 472918, 452000, 431171, 411745, 394443, 380250, 369798, 362577, 357775, 355624, 357075, 362441, 371501, 384866, 404246, 431270, 466945, 512221, 567769, 632112, 699901, 762131, 808380, 830270, 824947, 796350, 752842, 702977, 652878, 606210, 564938, 529684, 500334, 476973, 460146, 450304, 447656, 452714, 466455, 489856, 523713, 569050, 627362, 700347, 789215, 892874]
56832H92874J11974J06570Q2865M3112l909m7231p8523r4789r8279r3830q5515
56821G35319p5353o4352n3420m2750l1759k0467j0072j265P009J6185K6371L7120
56809E22566M9005O2753P6696Q5994Q4708O9002L9742L190l1591n7499p2260p7240
56797G55066p4976o8389o0602n3448m6469l8520k9864k1662j4215p060k48N907
56785C45520J1884J8431K5411L2296L9104M5070M6948M0850K6339P382j1032k5983
56773F02220l6397m1780m2317l9420l5074l0723k6901k3475k0069j6632j3527
56762B75905j0959q653o524n090m576m184l189k121j889k235k257j952j982k222
56748B18072j967j411j492k228k556k052j532j660k068k222k173k081j836j481
$$ y = [892874, 1004848, 1111418, 1194283, 1237395, 1233486, 1186255, 1107732, 1012943, 914664, 820834, 735319, 659966, 595614, 542194, 499444, 467685, 447218, 437146, 435881, 442890, 459075, 485446, 522566, 571571, 634324, 711020, 797014, 881722, 950724, 990466, 993656, 962065, 904566, 832306, 755066, 680090, 611701, 551099, 497651, 451182, 412662, 382798, 361136, 346921, 339861, 339613, 345520, 357404, 375835, 401246, 433542, 472646, 517716, 564664, 605514, 631853, 639235, 628203, 602220, 565823, 524043, 481726, 442306, 407232, 376509, 349608, 326133, 306064, 289432, 275905, 264946, 256293, 249769, 244679, 240103, 235919, 232730, 230609, 228720, 226485, 224228, 222276, 220294, 218072, 216105, 214694, 213202, 210974, 208418, 206366, 204834, 203174, 201106, 198884, 196711, 194630, 192794, 191313]
56734A91313j348j492j582j443j159p83m66o29j329j828j552j078j202j515j039
56719A72868Q0Q16Q78Q48Q23L39m21p03m68l74m47r8N53P65O28J006J831J957
56701A80881J097L80N48R31P84M20L03J54l43q06q79q71j199j773k250k301j606
56684A73470k90N88m3j771l059l051k129p89P56J890J814Q05J1j54k85n66m33
56667A66764R8J58m89j010r33q07r97j089r12r28j167r79l03L9k33l68NK15j91
56648A56873p00q87j038j253j076n02j84k34pN70P61M84N85J198J332O33P0J87
56630A56812K56j67l62L8K21k20l71L03Q08K85m94m67Q0L37L68N67P13O25P16
56611A60048J096J080M17j51l43r74k242k823j857m38J44L08R46J547J193M36
$$ y = [191313, 189965, 188473, 186891, 185448, 184289, 183506, 183040, 182411, 181082, 179254, 177702, 176624, 175422, 173907, 172868, 172948, 173764, 174642, 175490, 176313, 176652, 176231, 175528, 175060, 174686, 174239, 174141, 174694, 175459, 176087, 177093, 178924, 180881, 181978, 182358, 182906, 183837, 184621, 185041, 185344, 185498, 185155, 184349, 183470, 182599, 181400, 179627, 177377, 175076, 173470, 173180, 173768, 173725, 171954, 168895, 165844, 163715, 162926, 163682, 165572, 167386, 168191, 168202, 168048, 167763, 167197, 166764, 166862, 167020, 166531, 165521, 164588, 163781, 162784, 161695, 160783, 159855, 158688, 157709, 157406, 157445, 157212, 156844, 156849, 157064, 156873, 156173, 155286, 154248, 152995, 151919, 151417, 151233, 150999, 150992, 151562, 152323, 152807, 153392, 154590, 155922, 156555, 156625, 156812, 157068, 156901, 156539, 156577, 156798, 156578, 156207, 156510, 157318, 157603, 157109, 156642, 156722, 157059, 157427, 157994, 158707, 159332, 160048, 161144, 162224, 162641, 162490, 162147, 161173, 158931, 156108, 154251, 153813, 153957, 154265, 155211, 156758, 157951, 158387]
56595A58387M82J160J288O51K01N65J459K371K925K858K312J828J624J457J367
56580A80935J696K102J759R05Q43J871K668K460K226K847L595L571L233L312L559
56565B17582L776M668O372P539P223O482O737P752Q503Q838Q894Q125O428N017
56551C13936M763M702L598J800K28j200k630l172k475k116l540n749o793o552
56537B94800o228o152o006o229p232q010p481o402o082o053n022l469l055l875
56523B13504m356l748k889k538k544k612k599k213j517j327k075k850k629j664
56509A77943p62j09J62n01j761j994o77M23k7o21L44J832J843Q09N92J206J245
56492A79947P57R45J615J585J150J566K395K037P00K33J003J468J056J008K024
$$ y = [158387, 158869, 160029, 161317, 161968, 162169, 162734, 164193, 166564, 169489, 172347, 174659, 176487, 178111, 179568, 180935, 182631, 184733, 186492, 187397, 188240, 190111, 192779, 195239, 197465, 200312, 203907, 207478, 210711, 214023, 217582, 221358, 226026, 232398, 239937, 247160, 253642, 260379, 268131, 276634, 285472, 294366, 302491, 308919, 313936, 318699, 323401, 326999, 328799, 329027, 327827, 325197, 322025, 319550, 317434, 313894, 308145, 301352, 294800, 288572, 282420, 276414, 270185, 262953, 254943, 247462, 241060, 234978, 228925, 223903, 220434, 217379, 213504, 209148, 205400, 202511, 199973, 197429, 194817, 192218, 190005, 188488, 187161, 185086, 182236, 179607, 177943, 177181, 177072, 177234, 176733, 174972, 172978, 172301, 172724, 172697, 172076, 172420, 174252, 176095, 176904, 177496, 178702, 179947, 180704, 181649, 183264, 184849, 185999, 187565, 189960, 191997, 192697, 192930, 193933, 195401, 196457, 197465, 199489]
56477A99489L168L612L660L661L528L514L988M403L902K819K196K114J907J560
56463B43521J374Q15n97j897j884j141j078j659j921j926k217k121p40J064J877
56448B31470K113K881L380K137J57m3J695K984K531J307K18q16j402q84m1l08
56432B47379j358j715j494k004k957k828j828j704k574k815k194k200k996l065
56418B15647k150j753k148j869o57j08o27n83O49J504J050M02L52Q5o79o93M81
56401B08903J304O56n10r68q63p09l21L76R45J431K261K983K639J514P56M41j18
56384B20720m46M44J778J854J023J156K225K296J015K08O14R64P94J210K289K539
56368B40683J644J013R93L77p57o74P70J525Q78N98J577K314J882J529K016K197
$$ y = [199489, 202657, 206269, 209929, 213590, 217118, 220632, 224620, 229023, 232925, 235744, 237940, 240054, 241961, 243521, 244895, 245710, 245113, 243216, 241332, 240191, 239113, 237454, 235533, 233607, 231390, 229269, 228529, 229593, 231470, 233583, 236464, 239844, 241981, 242138, 242095, 243790, 246774, 249305, 250612, 250830, 250014, 248612, 247728, 247687, 247379, 246021, 244306, 242812, 240808, 237851, 235023, 233195, 231491, 228917, 226102, 223908, 221708, 218712, 215647, 213497, 211744, 209596, 207727, 207070, 206962, 206335, 205752, 206401, 207905, 208955, 209357, 209709, 209794, 209115, 208422, 208903, 210207, 210863, 210353, 209385, 208522, 207813, 207492, 207868, 208813, 210244, 212505, 215488, 218127, 219641, 220397, 220838, 220720, 220274, 220718, 222496, 224350, 225373, 226529, 228754, 231050, 232065, 232273, 232887, 233851, 234645, 235855, 238144, 240683, 242327, 243340, 244333, 244710, 243953, 243279, 244049, 245574, 246452, 247050, 248627, 250941, 252823, 254352, 256368, 258565]
56352B58565J532J417K609L788L970M058M806N504N765O290O990O670N453N016
56338C22433N696N836M809L923L675K841J146n8o04j959m043m724l488k384k322
56323C30777j808n23n23k297l213j805k77o54j599j226k45o1l38m23p91j319p13
56306C12962Q97J473N93M16J715K291J093M33J894L484L285K806L932N473N593
56291C48340N118N697O929P794Q790J0350J1240J0751J0290J0873J1383J1171
56279D58726J1778J4070J6324J7298J8458K1072K3777K5402K7466L1466L6223
56268G02060M0341M4736N0390N6135O1042O6512P3604Q0718Q6260R1025R5715
56257A448538R8681R8670R7257R6050R3779Q8573Q0843P1729O1078M9134L7791
$$ y = [258565, 260097, 261514, 264123, 267911, 271881, 275939, 280745, 286249, 292014, 298304, 305294, 311964, 317417, 322433, 328129, 333965, 338774, 342697, 346372, 349213, 350359, 350301, 349697, 347738, 343695, 338971, 335483, 333099, 330777, 328969, 328446, 327923, 325626, 322413, 320608, 320331, 319677, 318078, 316852, 316607, 316546, 316208, 315785, 314994, 313675, 312962, 313859, 315332, 315925, 316341, 318056, 320347, 321440, 321873, 323767, 327251, 330536, 333342, 337274, 342747, 348340, 353458, 359155, 366084, 373878, 382668, 393018, 404258, 415009, 425299, 436172, 447555, 458726, 470504, 484574, 500898, 518196, 536654, 557726, 581503, 606905, 634371, 665837, 702060, 742401, 787137, 837527, 893662, 954704, 1021216, 1094820, 1175538, 1261798, 1352823, 1448538, 1547219, 1645889, 1743146, 1839196, 1932975, 2021548, 2102391, 2174120, 2235198, 2284332, 2322123]
56246B322123K8150J9191J0546L724j087o207j2443j7324j9496k1369k5121k9617
56234B251070l3756l9086m6398n3472n9135o5723p4368q1708q4758q5314q5993
56223A541359q5565q2140p7505p4115p0875o5898o0529n6669n2999m7729m2326
56212H25009l8624l5115k9966k4870k2011j9998j6741j3507j2169j1227q617n705
56200E86459m579m026k163k71p1l1J647L284K975K572M227O007N247L366K945
56185F07588K940J204j060j788k202m068n739n205m172m765n230l435j292j061
56171E71715o50K388N573N492L908M492O449O885O514P583Q829Q037O965Q287
56157F52467J0436J0739J0726J2891J5300J5132J4526J7121K1751K5444K9603
$$ y = [2322123, 2350273, 2369464, 2380010, 2383734, 2382647, 2376440, 2363997, 2346673, 2327177, 2305808, 2280687, 2251070, 2217314, 2178228, 2131830, 2078358, 2019223, 1953500, 1879132, 1797424, 1712666, 1627352, 1541359, 1455794, 1373654, 1296149, 1222034, 1151159, 1085261, 1024732, 968063, 915064, 867335, 825009, 786385, 751270, 721304, 696434, 674423, 654425, 637684, 624177, 612008, 600781, 592164, 586459, 581880, 577854, 575691, 575420, 575349, 575318, 576965, 580249, 583224, 585796, 590023, 596030, 601277, 604643, 607588, 610528, 611732, 610672, 608884, 606682, 602614, 596875, 591670, 587498, 582733, 577503, 574068, 572776, 571715, 571065, 573453, 579026, 584518, 588426, 592918, 599367, 606252, 612766, 620349, 629178, 637215, 644180, 652467, 662903, 673642, 684368, 697259, 712559, 727691, 742217, 759338, 781089, 806533, 836136]
56146H36136L7151M6535N4871O4125P7972R5418J13705J34252J58950J83563K01433
56135B004111K10901K12531K02999J79718J48888J21048J00586Q6232P8293P6860
56125C422167P5502O5741M7085K5556M604j5030k9306l4043l3296l6622m8837
56114C443521o8990r6704j31071j65082j89802k03363k08884k05960j92481j72497
56104A808687j53241j35669j16278r6401q0907o9388n7627m6301l9283l4899k8118
56093I50575k0004j5745j4774j2168q352p680q851o680k280j345l285k282J691
56080H48820L138J644J949M095L720J541K220M630L658Q30K185O531P080M077
56066H96118M258Q139R629Q119Q980J2039J1630Q451R145J3705J5405J3703J4862
$$ y = [836136, 873287, 919822, 974693, 1038818, 1116790, 1212208, 1325913, 1460165, 1619115, 1802678, 2004111, 2215012, 2427543, 2630542, 2810260, 2959148, 3080196, 3180782, 3267014, 3345307, 3422167, 3497669, 3563410, 3610495, 3636051, 3640655, 3625625, 3596319, 3562276, 3528980, 3492358, 3443521, 3374531, 3277827, 3146756, 2981674, 2791872, 2588509, 2379625, 2173665, 1981184, 1808687, 1655446, 1519777, 1403499, 1307098, 1226191, 1156803, 1099176, 1052875, 1013592, 978693, 950575, 930571, 914826, 900052, 887884, 879532, 871852, 863001, 856321, 854041, 852696, 849411, 847129, 848820, 851958, 853602, 855551, 859646, 863366, 864907, 867127, 871757, 875415, 876245, 878430, 884961, 892041, 896118, 900376, 908515, 918144, 926263, 935243, 947282, 958912, 967363, 976508, 990213, 1005618, 1019321, 1034183]
56053A034183J9197K0258J7420J6772J8752J7529J3472J3237J6751J7142J4392
56042A219105J5705K1566K5116K6172L1677M1014M5272M2515L9611L7878L1839
56031A577470K3404K1741K7192L0465K9333L0616L4479L3313K7862K7595L3014
56020A896484L4673L1575L2892L9516M2194M0254M3370N2237N6816N6325O0981
56009B387317P1182P5723P3729P6928Q6685R0981Q7977Q9653R7926J00818R6901
55998C335820R9078J09113J13731J11343J16380J31299J41429J43898J53296J72053
55988D627440J84667J88667K00555K23211K39495K46690K63497K93701L18379
55979F786302L34183L61867M05741M44137M72518N14428N76105O34155O83369
$$ y = [1034183, 1053380, 1073638, 1091058, 1107830, 1126582, 1144111, 1157583, 1170820, 1187571, 1204713, 1219105, 1234810, 1256376, 1281492, 1307664, 1339341, 1380355, 1425627, 1468142, 1507753, 1545631, 1577470, 1600874, 1622615, 1649807, 1680272, 1709605, 1740221, 1774700, 1808013, 1835875, 1863470, 1896484, 1931157, 1962732, 1995624, 2035140, 2077334, 2117588, 2160958, 2213195, 2270011, 2326336, 2387317, 2458499, 2534222, 2607951, 2684879, 2771564, 2862545, 2950522, 3040175, 3138101, 3238919, 3335820, 3434898, 3544011, 3657742, 3769085, 3885465, 4016764, 4158193, 4302091, 4455387, 4627440, 4812107, 5000774, 5201329, 5424540, 5664035, 5910725, 6174222, 6467923, 6786302, 7120485, 7482352, 7888093, 8332230, 8804748, 9319176, 9895281, 10529436, 11212805]
55970A1212805P50354Q43252R37331J028478J148438J307506J478970J661921
55962B0369055J898401K205831K561801K984182L553806M330051N326608O599162
55954D9828897Q257950J0361204J2920040J6059120K0035029K5039234L1117283
55947A73618757L8180731M5512232N0831996N0376867M1065140K3291044J450335
55940D24327102j8632300l2970394m0627474m2724650m1022496l7206123l2618632
55933A78525033k8061996k3820252j9962182j6567459j3684462j1262345r233385
55926E5932952p581109o275012n224677m353022l647387l098096k652320k267450
55918B0833879j950178j705737j500896j309849j147319j024954r19625q13188
$$ y = [11212805, 11963159, 12806411, 13743742, 14772220, 15920658, 17228164, 18707134, 20369055, 22267456, 24473287, 27035088, 30019270, 33573076, 37903127, 43229735, 49828897, 58086847, 68448051, 81368091, 97427211, 117462240, 142501474, 173618757, 211799488, 257311720, 308143716, 358520583, 399585723, 422876767, 424327102, 405694802, 372724408, 332096934, 289372284, 248349788, 211143665, 178525033, 150463037, 126642785, 106680603, 90113144, 76428682, 65166337, 55932952, 48351843, 42076831, 36852154, 32499132, 28851745, 25753649, 23101329, 20833879, 18883701, 17177964, 15677068, 14367219, 13219900, 12194946, 11275321, 10462133]
55910A0462133p21429o56385n99024n34625m78405m41917m08825l66844l30749
55901E923930l11462k93598k65072k39343k27624k17130j96901j78451j71499
55892C822850j64655j48844j35493j33383j30916j18893j08213j07781j06808
55883B667864r6132q5947q5401q4794p4890o4708o3420o2868n4521m6529m7873
55872A900781n1652m9559m7415n1481n4358m9156m3351m4435m5586l9216l1323
55861A393249k9049k6890j8395r108n412k512M518R894R076R382J6635K2801J8666
55848A392855P739l468j7365l6002n1185n5868n5478n6978n6818n0493m3502m1593
55836I31844l9883l2738k5012k2603k1176j5184r078q673r923o883k678k245k342
$$ y = [10462133, 9740704, 9084319, 8485295, 7950670, 7472265, 7030348, 6621523, 6254679, 5923930, 5612468, 5318870, 5053798, 4814455, 4586831, 4369701, 4172800, 3994349, 3822850, 3658195, 3509351, 3373858, 3240475, 3109559, 2990666, 2882453, 2774672, 2667864, 2571732, 2485785, 2400384, 2315590, 2240700, 2175992, 2112572, 2049704, 1995183, 1948654, 1900781, 1849129, 1799570, 1752155, 1700674, 1646316, 1597160, 1553809, 1509374, 1463788, 1424572, 1393249, 1364200, 1337310, 1318915, 1309807, 1304395, 1301883, 1306401, 1316295, 1325371, 1334753, 1351388, 1374189, 1392855, 1400594, 1397126, 1379761, 1343759, 1292574, 1236706, 1181228, 1124250, 1067432, 1016939, 973437, 931844, 891961, 859223, 834211, 811608, 790432, 775248, 766170, 757497, 747574, 740691, 738013, 735768, 733426]
55823G33426J099L662N52l772l851l287o959j0974j0280q679j1371j4789j3640
55810F51137j1112j2173j3576j0318n653n098o534n441l843n101o013l149q68
55797E62258m040q719r070p531r119j1530j0143p288p467q513o400l622m016m522
55783D60278r74K918J293l938p516j0208j5001j8794j7107j2935j2038j3292j2136
55770C40550r605r366r685o907l414l709n850n006k217j707k699j816l98j665
55756B76506l658k643l87p10k032q20R49n94l485l470k016l090n171m312k092
55741B42975k547m145k841l93j370m294m082j277o54k204j690J006J920N56N4
55726B21014N75n66k855l246k092k243l179k109K46R05M13J579L789M371M064
$$ y = [733426, 734525, 738187, 738739, 734967, 731116, 727829, 720870, 709896, 699616, 690937, 679566, 664777, 651137, 640025, 627852, 614276, 603958, 598305, 593207, 586673, 581232, 577389, 572288, 566275, 563126, 562258, 558218, 549499, 540429, 532898, 523779, 512249, 502106, 494818, 487351, 478838, 472438, 468816, 464800, 460278, 459304, 462222, 463515, 459577, 452061, 441853, 426852, 408058, 390951, 378016, 365978, 352686, 340550, 330945, 321579, 311894, 304987, 301573, 297864, 292014, 287008, 284791, 283084, 280385, 278569, 278171, 276506, 272848, 270205, 269818, 269108, 267076, 266256, 267205, 266611, 263126, 259656, 257640, 254550, 249379, 245067, 242975, 240428, 236283, 233442, 233049, 231679, 227385, 223303, 222026, 221372, 219168, 217478, 218484, 220404, 220960, 221014, 221589, 221023, 218168, 214922, 212830, 210587, 207408, 205299, 205545, 206450, 206863, 208442, 212231, 216602, 220666]
55711B20666N364P113O581N123N836P413O410L741K715K424l86m506n956n080
55697B57458n470p011o488m231l638m809m770l345k868k788n54K858M093L428
55683B21865L954N524N307L609L348M378L947K265K046L034K459M42l13L36K54
55668B62455l40L12J049n18k977l203k347m089p862r691r008q727r130p728m951
55653A93245m035n208n504m380m167n023m784l723m212n749n518l717l211m100
55639A29914l852k519k497l447k760q93p93k167j868R7N07j087j794r81r65j890
55623A03005j368M16N99r03j149K63N97o11q44J71r5j737j924l19K27q60r83K46
55605I4731R1j882k645j212k40q94j006L43J111N43N40J543J429k33j199q13r37
$$ y = [220666, 226030, 233143, 239724, 244847, 250683, 258096, 264506, 268247, 270962, 273386, 273000, 268494, 262538, 257458, 251988, 244977, 238489, 234258, 230620, 225811, 221041, 217696, 214828, 212040, 211486, 214344, 218437, 221865, 225819, 231343, 236650, 240259, 243607, 247985, 251932, 254197, 256243, 259277, 261736, 262178, 261865, 262201, 262455, 262115, 262427, 263476, 262958, 259981, 256778, 254431, 250342, 242480, 232789, 223781, 215054, 205924, 198196, 193245, 189210, 184002, 178498, 174118, 169951, 164928, 160144, 156421, 152209, 146460, 140942, 137225, 134014, 129914, 126062, 123543, 121046, 117599, 114839, 113946, 113153, 110986, 109118, 109215, 109722, 108635, 106841, 105860, 104895, 103005, 101637, 102053, 102652, 101749, 100600, 100863, 101460, 100849, 100005, 100176, 100081, 98344, 96420, 96101, 96328, 95468, 94485, 94731, 94822, 92940, 90295, 89083, 88843, 87949, 86943, 87286, 88397, 88940, 89480, 91023, 92452, 92219, 91020, 90207, 89270]
55588H9270j669p17J865K960J592L95O78N04r57j670p90k56q55p93M28P54m76
55571I0263j218o41m10r69n33J080J573L07n55j26j3n78r6J359J419j41o86M29
55553I0464P34n16q34P19J842J588K131M142M888L074J439K128L384L084K031
55538A20298J541J065K36J86J012R92k78j079j037j891l682l978k342j648l316
55523A06079m996m777l965l892l556k326j560j744j397l46n73k312k969j611o65
55508F9390j494k115j264q15j953k687j528j45j01k39M18N39n26r04M56J715J496
55491F0243J077J274N07j780l146k054n37o64j378j153p59j023q45K52N58o69
55475D9903j446n96N4p42j128L54J853J385J01k24j95p79r96j35L67m07q73Q5
$$ y = [89270, 87601, 86884, 88749, 91709, 93301, 93696, 94374, 94878, 93921, 92251, 91461, 91205, 90350, 89557, 89985, 90739, 90263, 89045, 88404, 87994, 87025, 86492, 87572, 89145, 89452, 88897, 88771, 88758, 88180, 88084, 89443, 90862, 90721, 90035, 90464, 91198, 90682, 89848, 90567, 92409, 93997, 96128, 100270, 105158, 108232, 109671, 111799, 115183, 118267, 120298, 121839, 122904, 123140, 123326, 124338, 125330, 125052, 123973, 122936, 121045, 117363, 113385, 111043, 109395, 106079, 101083, 96306, 92341, 88449, 84893, 82567, 81007, 79263, 77866, 77520, 76947, 74635, 71666, 70055, 69390, 67896, 65781, 64517, 63702, 61749, 59062, 57534, 57389, 57288, 57049, 57467, 58006, 57480, 56576, 57032, 58747, 60243, 61320, 62594, 63101, 61321, 58175, 56121, 55584, 54920, 53542, 52389, 51630, 50607, 49762, 50014, 50572, 49903, 48457, 47861, 47915, 47173, 46045, 46399, 48252, 49637, 49738, 49514, 49319, 48540, 47544, 47409, 47776, 47369, 46496, 46581]
55457D6581R02K81l95Q9M20m30r41n1M60p67j883j032M25N67K47Q90J533Q79k3
55438D7752J01K50o39j279m30O10M03m7M02O76j19m73P36J796J235O36J563K345
55420E5518J080p11p27J44j27q43k20R60Q38l5R2Q52P34j8l18n89j519j990r42
55401E2179K10k33j280j137l74n05r83n06K43n2o85l85Q7n36j413j147m07l93
55383D2683l12Q48J782R58l63j96O83L31p11n42N45P97J89pJ20k45m65L21R21
55364D7337j50j749j742m94P6j60J5L55k42j162r51J7L35K37P82J348O15p30r59
55345D2778k00Q7k39l75n80j381j699m18J188J228L15K60P54K54p99p52J02P8
55327D0601p24p79j21j20p15o58r4j70n44P1J230J332M97K50P20P32L30O29J394
$$ y = [46581, 47483, 47764, 47369, 47458, 47878, 47448, 46507, 46456, 46916, 46149, 44266, 43234, 43659, 44226, 44473, 45363, 46896, 47775, 47752, 47853, 48103, 47464, 46185, 45755, 46365, 46768, 46721, 47123, 47799, 47680, 47207, 47943, 49739, 50974, 51610, 53173, 55518, 56598, 55887, 55160, 55304, 55177, 54334, 54114, 55074, 55912, 55877, 55969, 56821, 57555, 57537, 57219, 56630, 55111, 53121, 52179, 52389, 52156, 50876, 49739, 49365, 48860, 47877, 47371, 47614, 47562, 46877, 46492, 46579, 46043, 44630, 43483, 43076, 42683, 42371, 43219, 45001, 45959, 45596, 45400, 46083, 46414, 45703, 45161, 45706, 46503, 46692, 46685, 46805, 46560, 46095, 46416, 47337, 47187, 45438, 43696, 43202, 43278, 43118, 43133, 43488, 43246, 42084, 41133, 41150, 41485, 41722, 42504, 43852, 44467, 43737, 42778, 42578, 42665, 42426, 42051, 41471, 40090, 38391, 37973, 39161, 40389, 40704, 40964, 41718, 41972, 41173, 40421, 40523, 40601, 39877, 39098, 38977, 38857, 38142, 37484, 37390, 37220, 36676, 36747, 37977, 39309, 39806, 40056, 40776, 41508, 41838, 42467, 43861]
55308D3861J309M02j41k17o03r49l95L52j9q60n12P00R45K9n54l66l42n91l22
55289D1727K51J95k16q0J41m82j117l22J108J142j38q44n48m65o91j35R34J087
55271D1547M18L67Q72M66p15q74K13O70k46j060p80k89l49l47J72O30O71O47O15
55252D2628L01J29O22J023K49j012j103j7P63P60P80R45O30J03J11J56o53j437
55234D4978o65R78J332K58l40J28K72m10p09k01K2l54k89L87M72k83n47K17Q90
55215D6136P51N10O06M79K1lM59M91j20n13m16m48o28l45J03k56j198j487r59
55196D3183n73l76N01J720J764M87m57j23O07Q04O19L00k67o92l73K78L18j23
55178D7597k81m33j250j921j106N61J175N78L60R60J209P90O01O50k9j131j271
$$ y = [43861, 45170, 45572, 45431, 45214, 44611, 43662, 43267, 43619, 43600, 42740, 42228, 42928, 43873, 43902, 43348, 42982, 42640, 42049, 41727, 41978, 42173, 41957, 41877, 42018, 41536, 40419, 40097, 41205, 42347, 42209, 41365, 40817, 40352, 39661, 39526, 40460, 41547, 41965, 42332, 43204, 43670, 42955, 42081, 42294, 42964, 42718, 41658, 40878, 40589, 40240, 39893, 40065, 40695, 41366, 42013, 42628, 42929, 43058, 43680, 44703, 44952, 43940, 42837, 42820, 43583, 44343, 45123, 46068, 46698, 46801, 46912, 47068, 46415, 44978, 44313, 45291, 46623, 46881, 46541, 46669, 46941, 46531, 45822, 45621, 45643, 45289, 45000, 45387, 45859, 45576, 45029, 45246, 46136, 46887, 47397, 48003, 48482, 48503, 48500, 48959, 49450, 49330, 48817, 48401, 47953, 47325, 46980, 47083, 46827, 45629, 44142, 43183, 42610, 42234, 42735, 44455, 46219, 46706, 46249, 46126, 46733, 47537, 48156, 48456, 48189, 47497, 47124, 47402, 47720, 47597, 47316, 46883, 45633, 43712, 42606, 43167, 44342, 44920, 45280, 46240, 47449, 48239, 48840, 49490, 49461, 48330, 47059]
55161D7059n24l44o84O5J880K633J492J85O6L98L84N19R52P37k47o72O2R13J187
55142E6061J496K113K355K238K729L742L946L147K686K878K369P70m54n64p21
55127H4791j634k275k047k015k782l216k549j793j839j988j591j299j522j401
55113E6840m97J70k4j21N99J211Q03N5k5M04P99J184J432R10l11j140j091q64
55095F0334q05k86P59J347J119R42J196J146N94M29Q70R26L31K10J090J979K108
55078G4289J901J576O60m91o23K54O10k4k56N60J165P60L85Q04J129O98L38N51
55060H4286M26m49r72n64k93o57l77J224K640K531J727J405J106K01m66j13L10
55043I1965k84j268j543j271r92l90P13J472J439J400J695J310j33j274j276j298
$$ y = [47059, 46535, 46191, 45507, 45572, 47452, 50085, 51577, 51762, 51828, 52226, 52610, 53129, 54081, 54818, 54571, 53899, 53961, 54874, 56061, 57557, 59670, 62025, 64263, 66992, 70734, 74680, 77827, 80513, 83391, 85760, 86530, 86076, 85512, 84791, 83157, 80882, 78835, 76820, 74038, 70822, 68273, 66480, 64641, 62653, 61062, 59763, 58241, 56840, 56343, 56513, 56489, 56368, 56967, 58178, 58981, 59036, 59011, 59415, 60214, 61398, 62830, 63740, 63429, 62289, 61198, 60334, 59529, 59243, 60002, 61349, 62468, 63410, 64606, 65752, 66346, 66775, 67645, 68571, 68902, 69112, 70202, 72181, 74289, 76190, 77766, 78426, 77935, 77312, 77566, 78176, 78152, 77896, 78456, 79621, 80381, 80766, 81570, 82699, 83397, 83735, 84286, 84712, 84263, 83291, 82727, 82434, 81777, 81400, 82624, 85264, 87795, 89522, 90927, 92033, 92234, 91768, 91655, 91965, 91681, 90413, 88870, 87599, 86607, 86217, 86930, 88402, 89841, 91241, 92936, 94246, 94113, 92839, 91563, 90265]
55027I0265k233k808j779l43l68j585k435k525k390j955r89j11R8R4J70m17j798
55010F8891k415j143P59J481J131Q76Q21N03K99O43Q34K23l87k6P47Q75N26L80
54992G5018K55j13r5N77Q43N0n68J75J331J403Q53J085J936K222K008K384L481
54975I2845M468N064N658O336P109Q423J0286J1654J1889J1960J2919J4147J4390
54962B17148J3552J2086R667N936J618k443o386j0237j2895j3757j4004j4680
54950A85605j4776j3029j0429q825q098o877n262m537m735m618l824l081k519
54937I4995j617n86j57j57K05Q34J077J208K071L497M574N264O328P858R257J0488
54921A45139J1949J3273J3504J2368J0301P437L694m11m046o939r206j0731j1548
$$ y = [90265, 88032, 85224, 83445, 83102, 82734, 81149, 78714, 76189, 73799, 71844, 70855, 70744, 70842, 70936, 71106, 70689, 68891, 66476, 65333, 66092, 67573, 68704, 69580, 70401, 70904, 71203, 71846, 72680, 72903, 72516, 72490, 73237, 74112, 74638, 75018, 75273, 75160, 75065, 75642, 76485, 76535, 75967, 76142, 77473, 78876, 79729, 80814, 82750, 84972, 86980, 89364, 92845, 97313, 102377, 108035, 114371, 121480, 129903, 140189, 151843, 163732, 175692, 188611, 202758, 217148, 230700, 242786, 252453, 258389, 260007, 257564, 251178, 240941, 228046, 214289, 200285, 185605, 170829, 157800, 147371, 138546, 130448, 123571, 118309, 113772, 109037, 104419, 100595, 97514, 94995, 93378, 92792, 92635, 92478, 92683, 93517, 94594, 95802, 97873, 101370, 105944, 111208, 117536, 125394, 134651, 145139, 157088, 170361, 183865, 196233, 206534, 213971, 217665, 217254, 213208, 206269, 197063, 186332, 174784]
54908A74784j2145j2564j1975j0083q079p061o372m849k913j975k290k839k839
54895H8800k291j369m36j31m87n70J23O25o3j361k023j874j549j252r22r10j420
54878G2890j923j996j928j785r83L30Q51R2o12j99M46K49k04l6J67l37q16m00
54860F3806K22J74J9K93J0j358k094o72J419J794P53J63Q1p00j657j205K35P43
54842F2026J68J34R13J105M31K01Q00J106O95M11M90K22k88l6R65J578J503J644
54824G4068K336K998L499M188M650M204L450L604M499N097N620P121R238J0550
54810A45122J1064J2111J3752J4435J3428J1450Q836N120P11l110o015q582j0405
54797B07917j0411r172q647r272r487q507p428p021o549n417m160l135j920n46
$$ y = [174784, 162639, 150075, 138100, 128017, 119938, 112877, 106505, 101656, 98743, 96768, 94478, 91639, 88800, 86509, 85140, 84704, 84573, 84086, 83516, 83639, 84264, 84201, 82840, 80817, 78943, 77394, 76142, 75220, 74310, 72890, 70967, 68971, 67043, 65258, 64275, 64605, 65456, 65548, 64936, 64737, 65183, 65432, 65228, 65192, 65359, 65022, 64206, 63806, 64028, 64202, 64221, 64514, 64524, 63166, 61072, 60400, 61819, 63613, 64366, 64529, 64610, 63910, 62253, 61048, 61283, 62026, 62194, 62328, 63241, 64346, 64777, 64978, 65778, 66884, 67579, 67990, 68480, 68702, 68414, 68378, 69343, 70921, 72424, 74068, 76404, 79402, 82901, 87089, 91739, 95943, 99393, 102997, 107496, 112593, 118213, 125334, 134572, 145122, 156186, 168297, 182049, 196484, 209912, 221362, 230198, 235318, 236029, 232919, 226904, 218322, 207917, 197506, 188334, 179687, 170415, 160928, 152421, 144993, 137972, 131423, 126006, 121846, 118711, 116791, 116245]
54783A16245K91N73R65J307Q94L39J163L271M904N382N843O852P545P764Q817
54768A72155J1256J3841J5538J6726J7594J7274J5358J2596R280M735q24n782
54756B99747r312j2315j5286j7151j7229j6528j5931j4770j2437r914q389p619
54744A42866o847o157n817n323m201k895j975j380j054j287j850j893j277q94
54730A00016j101j145o69l87o25n88R2N14N9n39n50m86j013j731j942j637j004
54713H7264O6J254J680J175O79P26O86J33k21J84P27O87M09N01P58O72K90j00
54695I7570m45n98k83K93O02P91J475K403K516J595O18K08K2l8N39J584K128K038
54677A13018K319L225L651L059K439K621L061L129L179L481L515L117L024L457
$$ y = [116245, 116536, 117109, 118074, 119381, 120275, 120614, 121777, 125048, 129952, 135334, 141177, 148029, 155574, 163338, 172155, 183411, 197252, 212790, 229516, 247110, 264384, 279742, 292338, 301618, 306353, 305529, 299747, 290435, 278120, 262834, 245683, 228454, 211926, 195995, 181225, 168788, 158874, 150485, 142866, 136019, 129862, 124045, 118722, 114521, 111626, 109651, 108271, 107217, 105930, 104080, 102187, 100910, 100016, 98915, 97770, 97101, 96714, 96089, 95501, 95593, 96107, 96166, 95627, 95077, 94591, 93578, 91847, 89905, 88268, 87264, 87330, 88584, 90264, 91439, 92118, 92844, 93530, 93663, 93442, 93626, 94353, 95040, 95449, 95950, 96708, 97380, 97670, 97570, 97125, 96527, 96244, 96537, 97139, 97930, 99405, 101808, 104324, 105919, 106537, 106745, 106767, 106729, 107268, 108852, 110980, 113018, 115337, 118562, 122213, 125272, 127711, 130332, 133393, 136522, 139701, 143182, 146697, 149814, 152838, 156295]
54663A56295L602L280L615N068O362O538O579P733R546J0881J1685J2361J2465
54650B56010J1374R415P093M050l2m332p872j0782j3507j5481j5848j4853j3475
54637A91760j2159j0862r702q752p650o211m907m120l569k966k474k068j279j23
54623A14918O23O88P83J280J492R94N04P51J397J857K129K143J370p3j099j168
54607A28589j083j502j907j916k226l141l523k511j181j071j962k472k118j480
54593A00496r88p17q48j215j047p8P02M11l42m26J29N04M65L33N5n90j267j469
54575I4108j234q53k99M20R16R69Q52O39J8p67q07K5N63M3p11n87K82J126J689
54556I6392J966J729J173J110J734K204K154K458L608M553M307L523L345L781
$$ y = [156295, 159897, 163177, 166792, 171860, 178222, 184760, 191339, 199072, 208618, 219499, 231184, 243545, 256010, 267384, 276799, 283892, 287942, 287910, 283578, 275706, 264924, 251417, 235936, 220088, 205235, 191760, 179601, 168739, 159037, 150285, 142635, 136424, 131517, 127397, 123828, 120862, 118388, 116320, 115041, 114918, 115541, 116229, 117012, 118292, 119784, 120778, 121282, 122033, 123430, 125287, 127416, 129559, 130929, 130856, 129757, 128589, 127506, 126004, 124097, 122181, 119955, 116814, 113291, 110780, 109599, 108528, 106566, 104094, 101976, 100496, 99508, 98791, 97943, 96728, 95681, 95603, 96305, 96716, 96374, 95948, 96077, 96581, 97046, 97379, 97434, 96844, 95577, 94108, 92874, 92021, 91722, 92142, 93058, 94027, 94879, 95518, 95536, 94769, 93962, 93987, 94550, 94593, 93882, 93295, 93577, 94703, 96392, 98358, 100087, 101260, 102370, 104104, 106308, 108462, 110920, 114528, 119081, 123388, 126911, 130256, 134037]
54542A34037M347N236O443O842N539L420J920R73n18k748m829o065o307n579m338
54527A38373l559l683m038m033m010m150l636k079o10l94r39j097q40p06m16N38
54511A04721J638J976J572R84L13l46l48M28Q57J08r82j295j111j073o66O98K052
54494A09526K066J126M96K36l27q43n40M0j90q37o53K05M52p7l54j72l52r30r50
54475A07922k54K23M5k47m21q16j229r71k04J19j18l4O23R40L21o61j215j201
54457A02822p81q4N47O67K65l36r36j280q50L55J258R10j31n51p9M67N36J97m64
54438A02532j286j611j028k14j29o50r71q55o00j91M61R48J049J376K274K797
54422A03902K042Q52O99J505J958J575R90N97L04K99O59P07Q0j70R81K684L445
$$ y = [134037, 138384, 143620, 150063, 156905, 162444, 165864, 167784, 168757, 168239, 165491, 160662, 154597, 148290, 142711, 138373, 134814, 131131, 127093, 123060, 119050, 114900, 111264, 109185, 108575, 108181, 107242, 106145, 105305, 104599, 104183, 104721, 106359, 108335, 109907, 110891, 111204, 110858, 110510, 110938, 111795, 111903, 110921, 109626, 108515, 107442, 106776, 107474, 109526, 111592, 112718, 113214, 113450, 113123, 112280, 111740, 111780, 111590, 110753, 110100, 110305, 110757, 110680, 110326, 110154, 109802, 108872, 107922, 107668, 107891, 107936, 107689, 107268, 106452, 105223, 104252, 104048, 104167, 104049, 104015, 104638, 105578, 105899, 105238, 104023, 102822, 102041, 101957, 102504, 103171, 103436, 103100, 102164, 100884, 100034, 100389, 101647, 102557, 102426, 101875, 101796, 102263, 102799, 102996, 102532, 101246, 99635, 98607, 98393, 98264, 97614, 96643, 95788, 95188, 94997, 95458, 96406, 97455, 98831, 101105, 103902, 105944, 106796, 107495, 109000, 110958, 112533, 113523, 114120, 114424, 114723, 115382, 116089, 116169, 115999, 116980, 119664, 123109]
54405A23109L541M261N280M993L295J822J375J067L16l35o46j131j727j753j476
54390A41991k017l332l980l408k711k667k657k128j602j436j110m38j90p63j365
54375A12187j300r47r06j107j288j418j293o70qn3m97k89N78R94P37R59K155L092
54357A10926K651J461Q38J012J381J659J980K375K749K983K779J954J024P94J265
54342A37831J648J527J115M57o24j760k261k260k559l237l505l063k485k090j642
54327A17092j307j723k795l532l412k835k153j329o99q35j435j576j245j324j887
54312H9005j961j241n87m11p5N70N59m98j564j738j473j389j121l15K85j83j358
54295G6505k126j880q21L42P42J24n30n0J116J315J17j055j084m86j8N26J295
$$ y = [123109, 126650, 130911, 136191, 141184, 144479, 146301, 147676, 148743, 149059, 148724, 148078, 146947, 145220, 143467, 141991, 139974, 136642, 132662, 129254, 126543, 123876, 121219, 119091, 117489, 116053, 114943, 114505, 114315, 113552, 112187, 110887, 109940, 109034, 107927, 106639, 105221, 103928, 103258, 103250, 103197, 102700, 102411, 102989, 103983, 104720, 105679, 107834, 110926, 113577, 115038, 115876, 116888, 118269, 119928, 121908, 124283, 127032, 130015, 132794, 134748, 135772, 136566, 137831, 139479, 141006, 142121, 142578, 141954, 140194, 137933, 135673, 133114, 129877, 126372, 123309, 120824, 118734, 117092, 115785, 114062, 111267, 107735, 104323, 101488, 99335, 98006, 97307, 96472, 95037, 93461, 92216, 90892, 89005, 87044, 85803, 85216, 84805, 84730, 85300, 85859, 85361, 83797, 82059, 80586, 79197, 78076, 77761, 78046, 77863, 76505, 74379, 72499, 71678, 72020, 72762, 72886, 72356, 72306, 73422, 74737, 74854, 73799, 72715, 72229, 72211, 72737, 74032]
54278G4032J594J062M99N06M42k72q67l95O73J204J063R57J138J243J083P61L35
54261H5058p9j89L8K83M30O36P58M60R4L54R15N78q04j853j691j138j071r97k20
54242H1562O80P66K12k76o89j212j223r3J483K089J340J51n33m68O9N30L54m46
54224H4296j198j444j447j470j202m11M26P81Q42J007J118P63K0o21q00m23L32
54207H0569R02O98j47q80j089j015p84j62O99J144Q98M09Pm35q54q87o33o30q03
54188G7007m88K97O69K81j47j28OQ0M57R65P61k05q27n84k82m69n20q6K5o34j124
54167G5054p44l15o97j248j081o45o99p72o3J007J514J499J458J195M87L1L92
54150G6373Q19N02J02N22J062N10o27p96J6L49l06r00p87n80p73r36o75l06j12
$$ y = [74032, 75626, 76688, 77187, 77693, 78135, 77863, 76996, 76601, 77274, 78478, 79541, 80498, 81636, 82879, 83962, 84723, 85058, 84979, 84790, 84828, 85111, 85541, 86177, 86935, 87395, 87489, 87843, 88758, 89336, 88532, 86679, 84988, 83850, 82779, 81782, 81562, 82242, 83008, 83220, 82944, 82255, 81043, 79820, 79727, 81210, 83299, 84639, 84790, 84257, 83789, 83858, 84388, 84742, 84296, 83098, 81654, 80207, 78737, 77535, 77124, 77550, 78331, 79173, 80180, 81298, 82061, 82081, 81460, 80660, 80237, 80569, 81471, 82169, 82022, 81142, 80053, 79038, 78254, 78092, 78791, 79935, 80833, 81242, 81249, 80814, 79960, 79073, 78440, 77810, 77007, 76519, 76816, 77485, 77766, 77619, 77491, 77497, 77577, 78034, 78999, 79760, 79555, 78728, 78144, 77862, 77393, 76873, 76787, 76812, 76178, 75054, 74310, 73995, 73298, 72050, 70969, 70324, 69625, 68853, 68790, 69797, 71311, 72810, 74268, 75463, 75950, 75981, 76373, 77192, 77694, 77796, 78318, 79380, 79890, 79263, 78467, 78483, 78832, 78526, 77626, 76839, 76259, 75486, 74550, 73875, 73569, 73457]
54131G3457Q3L31L65J48o5l20q84j497j439m63Q36J682J672Q96q8n90n16m52o85
54112G2471o99j28M48L21k96p73r67r03k96P00J012M0j160j215m33q0k44N6Q89
54093F8743J201O03o6k50l92p69q67m17j6j13j96L58J237J630J276O19J37l4j9
54074G2665K3Qo1j41j04K64R65J488J273N65K53O35R93P48L61N09J016J204R01
54055H3565M43N6j95j81R3L72N61Q06R54N98l7q0O33J160R70Q06J285J778J633
54036I5220J548K327L241L094K346K556M014N456O001N969N774N284M509L834
54022A51173L395L017K863L244L815L778K906J696O24q8j54M78J166J143M62l19
54006A79199j045j858k507k701k745l018l150k695k201k496l238l350k729k285
$$ y = [73457, 73540, 73871, 74236, 74384, 74319, 73999, 73115, 71618, 70179, 69716, 70552, 72234, 73906, 74802, 74714, 74124, 73608, 73156, 72471, 71772, 71644, 72092, 72413, 72117, 71344, 70377, 69474, 69178, 69878, 70890, 70930, 69770, 68555, 68122, 68042, 67798, 67854, 68743, 69944, 70547, 70481, 70231, 69839, 69070, 68203, 67786, 67770, 67657, 67461, 67819, 69056, 70686, 71962, 72581, 72718, 72684, 72665, 72688, 72696, 72635, 72494, 72390, 72654, 73619, 75107, 76380, 76945, 77198, 77833, 78826, 79574, 79935, 80444, 81460, 82664, 83565, 84008, 84064, 83869, 83688, 83781, 84153, 84714, 85520, 86474, 87072, 87035, 86955, 87588, 88748, 89718, 90524, 91809, 93587, 95220, 96768, 99095, 102336, 105430, 107776, 110332, 114346, 119802, 125803, 131772, 137546, 142830, 147339, 151173, 154568, 157585, 160448, 163692, 167507, 171285, 174191, 175887, 176511, 176423, 176269, 176747, 177913, 179056, 179518, 179199, 178154, 176296, 173789, 171088, 168343, 165325, 162175, 159480, 157279, 154783, 151545, 148195, 145466, 143181]
53992A43181k361k343j939j635j683j682j471j455j771j960j710j279r56p86q81
53977A19269j351j839j844j467j220j127p07J38R63J421J458R87J14m73j95M79
53961A14606N72K0l08L7N69P61O24L46N5M8N40J200J519J550J702J980K079K102
53943A30002K423L082L926N041O297O897O280N101M299L644K343P14j47j88m83
53928A79231j389k016j768j165p38k59N28J360K003K567K984L019K959L422M263
53913A95001M600M118L477L299L561M165N095N851N712M851M220M111L755K660
53899B54476J354M17k49q17j063j041j329k156k951l212l147l128l230l601m478
53884B25845n481n728n140m805n493o469o427n126l506k568k625l302l903l926
$$ y = [143181, 140820, 138477, 136538, 134903, 133220, 131538, 130067, 128612, 126841, 124881, 123171, 121892, 120936, 120150, 119269, 117918, 116079, 114235, 112768, 111548, 110421, 109714, 109852, 110815, 112236, 113694, 114681, 114795, 114322, 114127, 114606, 115178, 115198, 114890, 114927, 115496, 116257, 116881, 117227, 117282, 117330, 117870, 119070, 120589, 122139, 123841, 125821, 127900, 130002, 132425, 135507, 139433, 144474, 150771, 157668, 163948, 169049, 173348, 176992, 179335, 180049, 179902, 179714, 179231, 177842, 175826, 174058, 172893, 172155, 171896, 172424, 173784, 175787, 178354, 181338, 184357, 187316, 190738, 195001, 199601, 203719, 207196, 210495, 214056, 218221, 223316, 229167, 234879, 239730, 243950, 248061, 251816, 254476, 255830, 256247, 255998, 255181, 254118, 253077, 251748, 249592, 246641, 243429, 240282, 237154, 233924, 230323, 225845, 220364, 214636, 209496, 204691, 199198, 192729, 186302, 181176, 177670, 175102, 172477, 169175, 165272, 161346]
53870A61346l490l083k914k790k618k469k292j985j778j953k283k305k071j978
53856A27337j989j738j312j176j357j499j594j888k132j845j303j272j771j998
53842A04463j600r82l73L66R22P13O5j5M98M58n35j318r38kM79N64P87R98Q08
53823A05358N31P25J236J496J456J443J453J237Q64O56O17M99K68J97M98J050
53807A19584J462J436J161J213J840K572K903L029L310L430K908K182K219L130
53793A52379M108M724N238N608N313M394L578L046K139O94l11p4Q73J413J113
53778A94235K46q05j731k250k326k134j776j436j614k508l371l395l056l492m547
53763A60040m789l653k258j666j575j349j141j255j388j205q63m16L94J181P73
$$ y = [161346, 157856, 154773, 151859, 149069, 146451, 143982, 141690, 139705, 137927, 135974, 133691, 131386, 129315, 127337, 125348, 123610, 122298, 121122, 119765, 118266, 116672, 114784, 112652, 110807, 109504, 108232, 106461, 104463, 102863, 101881, 101508, 101874, 102796, 103509, 103574, 103559, 104057, 104515, 103980, 102662, 101724, 101722, 102201, 102765, 103552, 104550, 105358, 105889, 106614, 107850, 109346, 110802, 112245, 113698, 114935, 115799, 116455, 117072, 117571, 117839, 118036, 118534, 119584, 121046, 122482, 123643, 124856, 126696, 129268, 132171, 135200, 138510, 141940, 144848, 147030, 149249, 152379, 156487, 161211, 166449, 172057, 177370, 181764, 185342, 188388, 190527, 191221, 190910, 190836, 191709, 193122, 194235, 194481, 193676, 191945, 189695, 187369, 185235, 183459, 182023, 180409, 177901, 174530, 171135, 168079, 164587, 160040, 155251, 151598, 149340, 147674, 146099, 144750, 143609, 142354, 140966, 139761, 138898, 138482, 138876, 140057, 140830]
53748A40830j083k864k981j731o49n48j068j653k020j930j211j27P86J137Q60
53733A25748K22k19j30J08j44q62j450j674j742j570q70l4J52j78m3P96J390J111
53715A20611M41j03o85j280j213k66P10R99J005J421K182K766K858K330J347P12
53699A33835J183K198K383J618J287K087K968K955K570K558K568K113J688J875
53685A63886K294K507K847L493L764L351L159L843M557M381L832L732L582K595
53671B11823J447J391K204K612K355K313K880L492L734L718L469K902K322K126
53657B48788K139J876J200K18r50j742j325J12J099Q09K51N51J023L47j070j536
53641B51790n19P41R73R0j162j867j504o41o21j808k832k528j718j825k522k341
$$ y = [140830, 139747, 136883, 133902, 132171, 131522, 130974, 129906, 128253, 126233, 124303, 123092, 122965, 123751, 124888, 125748, 125970, 125751, 125621, 125729, 125585, 124723, 123273, 121599, 119857, 118287, 117417, 117383, 117535, 117357, 117314, 118110, 119500, 120611, 121052, 120949, 120264, 118984, 117771, 117505, 118215, 119214, 120219, 121640, 123822, 126588, 129446, 131776, 133123, 133835, 135018, 137216, 139599, 141217, 142504, 144591, 147559, 150514, 153084, 155642, 158210, 160323, 162011, 163886, 166180, 168687, 171534, 175027, 178791, 182142, 185301, 189144, 193701, 198082, 201914, 205646, 209228, 211823, 213270, 214661, 216865, 219477, 221832, 224145, 227025, 230517, 234251, 237969, 241438, 244340, 246662, 248788, 250927, 252803, 254003, 254221, 253271, 251529, 250204, 250316, 251415, 252224, 252475, 253026, 254049, 254396, 253326, 251790, 251271, 252012, 252985, 253075, 251913, 250046, 248542, 247901, 247280, 245472, 242640, 240112, 238394, 236569, 234047, 231706]
53625B31706j085k1J64L5O3K1k57n65q21r38m34Q41J894J702P87N08J117J804
53607B36521K370L284M252M267L341K703L049L763M167M365M546M545M435M573
53593B90181M837M735M397M499N029N137M510L871L921M573N492O511P297P425
53579C62415O989O425N722M599L491L278L962M578M659M780N344N805N491M415
53565D31953K915J206l35j109r42l74m8k06p93j539j970j887j731j946k225k114
53549D18855k005k564l415l470k593j776j669k001k557l459m245l897k332p68
53535C82104r2O9K41J00o34j279j083l39J84M29Q28J347J534J336J184J365J803
53518C89097K340K896L461M166N160O230O849O914P047P876R187J0229J0658J0871
$$ y = [231706, 230621, 230600, 230764, 230799, 230862, 230883, 230626, 230061, 229240, 228302, 227868, 228709, 230603, 232305, 233092, 233600, 234717, 236521, 238891, 242175, 246427, 250694, 254035, 256738, 259787, 263550, 267717, 272082, 276628, 281173, 285608, 290181, 295018, 299753, 304150, 308649, 313678, 318815, 323325, 327196, 331117, 335690, 341182, 347693, 354990, 362415, 369404, 375829, 381551, 386150, 389641, 392919, 396881, 401459, 406118, 410898, 416242, 422047, 427538, 431953, 434868, 436074, 435739, 434630, 433688, 433314, 433266, 433060, 432267, 430728, 428758, 426871, 425140, 423194, 420969, 418855, 416850, 414286, 410871, 407401, 404808, 403032, 401363, 399362, 396805, 393346, 389101, 385204, 382872, 382104, 382012, 382081, 382322, 382422, 381788, 380509, 379426, 379087, 379271, 379700, 380528, 381875, 383409, 384745, 385929, 387294, 389097, 391437, 394333, 397794, 401960, 407120, 413350, 420199, 427113, 434160, 442036, 451223, 461452, 472110, 482981]
53504D82981J1448J2542J3887J5160J6238J7206J8190J9236K0249K1003K1394
53493F69534K1736K2613K4121K5571K6395K7040K8299K9981L1200L1913L2937
53482I71340L4213L4392L2873L1067L0650L1474L2352L3003L4041L5647L7490
53471A338542L9560M1893M3756M4266M3548M2391M1003L9048L6561L3843L0846
53460A775257K7602K4834K3102K1869K0420J9177J8901J9298J9746K0721K2748
53449B013675K4564K4325K2350K0584J9400J7111J3026Q627N042J373l368q448
53437B158261j2764j6524k0296k3600k5737k7118k8591l0217l1778l3702l6406
53426A871528l9240m1148m1928m2069m1759m0970m0107l9784l9994m0181l9896
$$ y = [482981, 494429, 506971, 520858, 536018, 552256, 569462, 587652, 606888, 627137, 648140, 669534, 691270, 713883, 738004, 763575, 789970, 817010, 845309, 875290, 906490, 938403, 971340, 1005553, 1039945, 1072818, 1103885, 1134535, 1166009, 1198361, 1231364, 1265405, 1301052, 1338542, 1378102, 1419995, 1463751, 1508017, 1551565, 1593956, 1634959, 1674007, 1710568, 1744411, 1775257, 1802859, 1827693, 1850795, 1872664, 1893084, 1912261, 1931162, 1950460, 1970206, 1990927, 2013675, 2038239, 2062564, 2084914, 2105498, 2124898, 2142009, 2155035, 2163662, 2168704, 2170077, 2166709, 2158261, 2145497, 2128973, 2108677, 2085077, 2059340, 2032222, 2003631, 1973414, 1941636, 1907934, 1871528, 1832288, 1791140, 1749212, 1707143, 1665384, 1624414, 1584307, 1544523, 1504529, 1464348, 1424452]
53415A424452l9037l7691l6036l4201l1950k8952k5438k2123j9265j6405j3184
53404A120170r794o355k638J258M629P092R206J1715J4673J7736K0795K3806K6385
53391A238678K8099K8963K9436L0122L1494L3595L5879L7738L9142M0542M2254
53380A615942M4444M7371N1029N4788N8193O1797O6324P1231P5174P7802P9923
53369B304018Q1952Q3535Q4869Q6907Q9829R2473R3813R3991R3288R1312Q7806
53358C283793Q3351P8641P3843O9221O5550O3345O2358O2205O2635O2902O1962
53347D029806N9769N7338N4955N1446M5839L8506K9753J8458L368j4920l4329
53336D339989n3025o9791q3398r2910r8531j01368j02470j02583j02403j02299
$$ y = [1424452, 1385415, 1347724, 1311688, 1277487, 1245537, 1216585, 1191147, 1169024, 1149759, 1133354, 1120170, 1110376, 1104021, 1101383, 1102641, 1107270, 1114362, 1123568, 1135283, 1149956, 1167692, 1188487, 1212293, 1238678, 1266777, 1295740, 1325176, 1355298, 1386792, 1420387, 1456266, 1494004, 1533146, 1573688, 1615942, 1660386, 1707757, 1758786, 1813574, 1871767, 1933564, 1999888, 2071119, 2146293, 2224095, 2304018, 2385970, 2469505, 2554374, 2641281, 2731110, 2823583, 2917396, 3011387, 3104675, 3195987, 3283793, 3367144, 3445785, 3519628, 3588849, 3654399, 3717744, 3780102, 3842307, 3904942, 3967844, 4029806, 4089575, 4146913, 4201868, 4253314, 4299153, 4337659, 4367412, 4385870, 4389238, 4374318, 4339989, 4286964, 4217173, 4133775, 4040865, 3942334, 3840966, 3738496, 3635913, 3533510, 3431211]
53326C431211j01954j00871r9023r6786r4587r3053r2899r4156r5851r6790r6330
53315B368911r4326r0999q7126q3532q0041p5605o9876o3805n8320n3167m7650
53304A564464m1785l6110l1112k7209k4644k2856k0701j7807j4891j2428r970
53293A304951p359n443m758m501l709k596j792j032K58J736K610K897L386M663
53279A289311O879J0011J3632J6935J9545K1903K4398K6850K9255L1997L4720
53268A525436L6120L5811L5354L6344L8373M0087M1308M2725M4154M4640M3950
53257A964302M2680M1257L9973L9615M0695M2250M2610M1262L8893L5868L1855
53246B401260K6859K1471J5978J0102L630l396j0982j8914k6473l3174l9420m5613
$$ y = [3431211, 3329257, 3228386, 3129363, 3032577, 2937990, 2844937, 2752038, 2657882, 2562031, 2465241, 2368911, 2274585, 2183586, 2096460, 2012928, 1932887, 1857282, 1787406, 1723601, 1665281, 1612114, 1564464, 1522679, 1486569, 1455457, 1428248, 1403604, 1380748, 1360047, 1342240, 1327349, 1314921, 1304951, 1297592, 1292149, 1287391, 1282890, 1279181, 1276585, 1274793, 1273761, 1274019, 1275755, 1278365, 1281262, 1284648, 1289311, 1296190, 1306201, 1319833, 1336768, 1356313, 1378216, 1402614, 1429464, 1458719, 1490716, 1525436, 1561556, 1597367, 1632721, 1669065, 1707438, 1747525, 1788833, 1831558, 1875712, 1920352, 1964302, 2006982, 2048239, 2088212, 2127827, 2168522, 2210772, 2253382, 2294644, 2333537, 2369405, 2401260, 2428119, 2449590, 2465568, 2475670, 2479300, 2475904, 2464922, 2446008, 2419535, 2386361, 2346941, 2301328]
53234B301328n1024n4662n6838n8739o0585o1462o0811n8978n6326n2971m9453
53223A679479m6598m4542m2884m1858m2298m4198m6399m8020m9305n0690n1901
53212A170786n2364n1880n0400m7749m3964l9580l5233l1208k7491k3987k0665
53201G46265j7742j5679j4693j4378j4113j3656j3116j2607j2269j2278j2498
53190E93236j2463j2071j1834j2010j2122j1835j1608j1768j1710j0904j0020
53179D64891r974j0414j0338r788r618r909r973r759r924j0371j0137r020q069
53166C37597q078q539q605q177p565o837n992n247m778m529m400m231l646k528
53152B54445j574j627k443k875k420j797j789k257k571k402j761p61L57J302J953
$$ y = [2301328, 2250304, 2195642, 2138804, 2080065, 2019480, 1958018, 1897207, 1838229, 1781903, 1728932, 1679479, 1632881, 1588339, 1545455, 1503597, 1461299, 1417101, 1370702, 1322682, 1273377, 1222687, 1170786, 1118422, 1066542, 1016142, 968393, 924429, 884849, 849616, 818408, 790917, 766930, 746265, 728523, 712844, 698151, 683773, 669660, 656004, 642888, 630281, 618012, 605734, 593236, 580773, 568702, 556868, 544858, 532736, 520901, 509293, 497525, 485815, 474911, 464891, 454917, 444503, 434165, 424377, 414759, 404850, 394877, 385118, 375194, 364823, 354686, 345666, 337597, 329519, 320980, 312375, 304198, 296633, 289796, 283804, 278557, 273779, 269250, 264850, 260619, 256973, 254445, 252871, 251244, 248801, 245926, 243506, 241709, 239920, 237663, 235092, 232690, 230929, 230168, 230525, 231827, 233780]
53137B33780K220J795N51r00j614j313m88M15J359K232K628K199Q75j140l184
53122B39415m250l936l015k482k299j846j287j403k192k761k670k437k479k499
53108B03859k243k022k109k300k379k320j891p17Q51J692J165j02j020j194r99
53093A88271r28j181j661k100k357k522k637k537k335k553l313l758l105j867
53079A55417j193j247j252r75r79j377j518j163r03j084j218r31o03o31q19r25
53063A38599j091j332j255p45k50n6J20M25M99K07M8L81P77P16L54J57K26M24
53045A38204P08R03O38l4m31j38K70nq30j356j235j020j275j758j747j090n82
53028A29222j088k307k903k045m32O86R84R78Q40K60o55j207j073o37k88j5J30
$$ y = [233780, 236000, 237795, 238346, 237446, 235832, 234519, 234031, 234446, 235805, 238037, 240665, 242864, 243739, 242599, 239415, 235165, 231229, 228214, 225732, 223433, 221587, 220300, 218897, 216705, 213944, 211274, 208837, 206358, 203859, 201616, 199594, 197485, 195185, 192806, 190486, 188595, 187878, 188729, 190421, 191586, 191484, 190464, 189270, 188271, 187343, 186162, 184501, 182401, 180044, 177522, 174885, 172348, 170013, 167460, 164147, 160389, 157284, 155417, 154224, 152977, 151725, 150750, 149771, 148394, 146876, 145713, 144810, 143726, 142508, 141577, 140974, 140343, 139524, 138599, 137508, 136176, 134921, 134176, 133926, 133870, 133990, 134415, 134914, 135121, 135169, 135550, 136327, 137043, 137397, 137554, 137780, 138204, 138912, 139815, 140453, 140419, 139988, 139850, 140120, 140115, 139285, 137929, 136694, 135674, 134399, 132641, 130894, 129804, 129222, 128134, 125827, 122924, 120879, 120447, 121133, 122117, 123095, 123935, 124195, 123540, 122333, 121260, 120623, 120335, 120320, 120450]
53011A20450j25p02j032p93k85O0J15p8m10n99n10n30j049j643j484m96O38J599
52993A13126K600L371L116J874R15J212K252K932K966K810K776K869L039L118
52979A48976K784J983J057K35n71j319j680j653j690j986k161j929j519j162p59
52964A38606l86m28q39q60q3P72P19k33j206j560j364r69n77j99J84M63M31J32
52946A32603m2Q7N0n62j227j023M1J065J547J821K094K078J753J547J466R66O3
52929A44327l75P3P36R23P86N30j59j192j556n89R05J704J670J320O97k92r81
52912A48527o06M09Q87N40J72L19O50P54P42Q12Q91R32J082J361J568J613J673
52895A62326J873K061J972J517R19N76O79R16Q03L67J30L39O30O27M66M80O60
$$ y = [120450, 120325, 119623, 118591, 117798, 117513, 117573, 117688, 117610, 117200, 116601, 116091, 115561, 114512, 112869, 111385, 110889, 111527, 113126, 115726, 119097, 122213, 124087, 125002, 126214, 128466, 131398, 134364, 137174, 139950, 142819, 145858, 148976, 151760, 153743, 154800, 155035, 154464, 153145, 151465, 149812, 148122, 146136, 143975, 142046, 140527, 139365, 138606, 138220, 137792, 136953, 136093, 136010, 136782, 137501, 137268, 136062, 134502, 133138, 132169, 131592, 131393, 131577, 132040, 132471, 132603, 132561, 132648, 132698, 132136, 130909, 129886, 129927, 130992, 132539, 134360, 136454, 138532, 140285, 141832, 143298, 144264, 144327, 143952, 144025, 144761, 145684, 146470, 147000, 146841, 145649, 144093, 143504, 144409, 146113, 147783, 149103, 149800, 149508, 148527, 147921, 148330, 149217, 149757, 149929, 150248, 150898, 151652, 152394, 153206, 154097, 155029, 156111, 157472, 159040, 160653, 162326, 164199, 166260, 168232, 169749, 170668, 171244, 171923, 172839, 173642, 174009, 174139, 174478, 175108, 175735, 176201, 176681, 177341]
52878A77341Q09Q50P64M92J96K17O38J143J494J711J706J264P00Q76K145L685
52862A96031M392M099L423K827K271J643J036O32N35O46O75M92M26P64J066N95
52846B21553m96j193j102j050j803k923l503l416l180l058k953k841k724k425
52832A88886j952j746k070k461k289j621j052r07j050j286j518j686j852k102
52818A65294k207j719p41j16m61j335j811j600j144r01q89q91o86j89M12P99Q23
52801A52638N50R3l84n46l43l09q38j309q17K92O24l57j587j999j770j520j280
52784A41138r50q86j238j408r05j65J63J75K88M48M04K60J10k98r52j280j042
52767A33862q93j384k017k007j342n48j6j73j466l374m293l386j761r04p55l97
$$ y = [177341, 178150, 179000, 179764, 180256, 180452, 180669, 181307, 182450, 183944, 185655, 187361, 188625, 189325, 190201, 192346, 196031, 200423, 204522, 207945, 210772, 213043, 214686, 215722, 216354, 216889, 217535, 218210, 218702, 219128, 219892, 220958, 221553, 221057, 219864, 218762, 217712, 215909, 212986, 209483, 206067, 202887, 199829, 196876, 194035, 191311, 188886, 186934, 185188, 183118, 180657, 178368, 176747, 175695, 174788, 173738, 172452, 170934, 169248, 167396, 165294, 163087, 161368, 160627, 160511, 160050, 158715, 156904, 155304, 154160, 153259, 152370, 151479, 150793, 150604, 151016, 151815, 152638, 153188, 153281, 152897, 152351, 152008, 151699, 150861, 149552, 148735, 149027, 149651, 149294, 147707, 145708, 143938, 142418, 141138, 140188, 139302, 138064, 136656, 135751, 135586, 135749, 135924, 136212, 136660, 137064, 137324, 137434, 137136, 136184, 134904, 133862, 132969, 131585, 129568, 127561, 126219, 125671, 125655, 125482, 124016, 120642, 116349, 112963, 111202, 110298, 109543, 109146]
52751A09146R9l4o84r95p93o17n32j26L84K63n30j245j454j404j268r47n93m29
52733I8241k60J40L33j56p93o12K94Q39M57l90j102j383r32L05J595K099K013
52716A00688K121K384K125J515J505K151K311J391K32l20o18j331k169k320j660
52701A08005r49r90j899k962l201k416j506j335j524j107p3O67P46P16Q13N31
52685I3516l38j184j553j731j950j892j448j111j122r78m21j09o01j304j258n61
52669G5955j75m57p51m38J89M34J71QM57J248J567J056K32j88p1K28M20L55j09
52650H0131q03j107o27J99P04R72J536K369K951L152L286L268K623J397K58m50
52634I9859j016j581j784j434q46k84K83O49L44m80q71k26Q53J375J207R95J203
$$ y = [109146, 109245, 109211, 108527, 107532, 106739, 106122, 105590, 105464, 105848, 106111, 105581, 104336, 102882, 101478, 100210, 99263, 98670, 98241, 97981, 98121, 98454, 98298, 97505, 96893, 97187, 98026, 98483, 98093, 96991, 95608, 94676, 94981, 96576, 98675, 100688, 102809, 105193, 107318, 108833, 110338, 112489, 114800, 116191, 116423, 116103, 115485, 114154, 111985, 109665, 108005, 107056, 106066, 104167, 101205, 98004, 95588, 94082, 92747, 91223, 90116, 90043, 90710, 91456, 92172, 92985, 93516, 93178, 91994, 90441, 88710, 86760, 84868, 83420, 82309, 81187, 80209, 79788, 79679, 79078, 77774, 76516, 75955, 75780, 75323, 74572, 74134, 74323, 74757, 74928, 74936, 75393, 76641, 78208, 79264, 79496, 79308, 79237, 79465, 79885, 80240, 80131, 79328, 78221, 77594, 77793, 78497, 79469, 81005, 83374, 86325, 89477, 92763, 96031, 98654, 100051, 100309, 99859, 98843, 97262, 95478, 94044, 93198, 92914, 93197, 93846, 94190, 93710, 92839, 92613, 93466, 94841, 96048, 97043, 98246]
52617I8246J591J613J031K04j44L08J040J291R82O69P03R13J094J185R84L23l86
52600A11647l84L56R44O93J1k69K2K75n7p67j057m18O38J028M75m4L03R54Q80
52581A15230L11M19J389K008J430K87l59l00M6M05O85P16M28nm88r74j148p05
52563A19375k6J76rK53J069J391N55o25r64m25K38P76J479K242K461J836P89L
52545A30594j33K54O06M20j71n28l79j67l03n51n40m17n40p27m56L01R26R12M43
52526A29544J28K94O68P63N07L57O30R38O82J9j99M49J318J509R24K54P2K91L92
52507A39540M5n63r66r88q76q54q31p29p99j223j645j625j335j334j735k047j876
52490A20159j327p70n37q04j384j771j740j638j737j641q92J72Q33R79R98R65
$$ y = [98246, 99837, 101450, 102481, 102685, 102541, 102849, 103889, 105180, 106162, 106831, 107534, 108447, 109541, 110726, 111710, 112033, 111647, 111263, 111619, 112563, 113256, 113267, 112998, 113020, 113295, 113238, 112471, 111414, 110996, 111634, 112662, 113137, 113093, 113396, 114350, 115230, 115541, 115960, 117349, 119357, 120787, 121074, 120715, 120415, 120461, 120866, 121551, 122267, 122695, 122690, 122202, 121228, 120080, 119375, 119349, 119525, 119516, 119769, 120838, 122229, 122784, 122159, 121195, 120770, 121008, 121784, 123263, 125505, 127966, 129802, 130591, 130594, 130461, 130715, 131321, 131741, 131570, 131042, 130663, 130496, 130193, 129642, 129102, 128685, 128145, 127418, 126962, 127263, 128189, 129101, 129544, 129672, 129966, 130634, 131397, 131904, 132261, 132891, 133829, 134511, 134530, 134331, 134780, 136098, 137607, 138531, 138785, 138857, 139148, 139540, 139585, 139022, 138056, 137068, 136192, 135338, 134507, 133778, 132979, 131756, 130111, 128486, 127151, 125817, 124082, 122035, 120159, 118832, 118062, 117525, 116721, 115337, 113566, 111826, 110188, 108451, 106810, 105918, 106090, 106923, 107902, 108900, 109865]
52474A09865O96L71K18r1q86j527j052K99J320J534J542J661J436P99M39O32P75
52457A18031N48M77Q08Q26N7p95q11p1P62J372J660J324L07p36j091p52j84L10
52439A22042O15O52N66O47Q24P25L78K79O00R68J210J517J783J605J232J439K160
52422A39242K295J393M72M71R56J100J000J060R23J39p07o03M92J710K327K108
52406A54378J130o8n70j73J97j79o75l39N36R20O67N35Q34J099J009P50M16j64
52388A60303r30j523j709j422n60P24J760K002J686J438J401J321J171J066Q20
52373A67548K31m00o61o84p95o89J86J561K362J979R44K11K22P70J398J797J945
52356A77925J925J669J101N74O86J491K324K625K473K116J530Q23M80P28J202
$$ y = [109865, 110561, 110932, 111150, 111059, 110173, 108646, 107594, 107893, 109213, 110747, 112289, 113950, 115386, 116185, 116624, 117256, 118031, 118579, 119056, 119864, 120690, 120747, 119952, 119141, 119070, 119832, 121204, 122864, 124188, 124495, 123759, 122668, 121916, 121732, 122042, 122657, 123309, 123875, 124522, 125346, 126071, 126449, 126728, 127328, 128296, 129506, 131023, 132806, 134411, 135643, 137082, 139242, 141537, 142930, 143402, 143873, 144829, 145929, 146929, 147989, 148912, 149051, 148344, 147741, 148233, 149943, 152270, 154378, 155508, 155440, 154870, 154697, 154894, 154715, 154040, 153701, 154237, 155157, 155824, 156359, 157193, 158292, 159301, 160051, 160467, 160303, 159373, 157850, 156141, 154719, 154159, 154883, 156643, 158645, 160331, 161769, 163170, 164491, 165662, 166728, 167548, 167779, 167379, 166718, 166034, 165239, 164550, 164736, 166297, 168659, 170638, 171582, 171793, 172015, 172785, 174183, 175980, 177925, 179850, 181519, 182620, 183194, 183880, 185371, 187695, 190320, 192793, 194909, 196439, 197262, 197742, 198470, 199672]
52341A99672J537J849K163K061J424Q77Q85J065R72R30J284J574J254P02N54N75
52325B19378J79l69l46J69M98N56P79J042P36m2m83k75Q2L07P29J431J925J978
52307B28274K010K265K304J678O85L1J09Q36J940L102M040M612M818M756M656
52292B66116M778N108N342N402N642O325P203P928Q496Q951R010Q500P817P553
52278C64171P882Q651R700J0718J1212J1132J0994J0975J0502R336Q408Q702R847
52265D92230J0696J0900J0965J1033J0692R935R295Q996Q736Q379Q143Q111Q149
52252F16260Q278Q518Q472P711O507N576N151M850M309L428K199Q18j40k91OJ23
52236F81775l0j99l49m57j63O75J500J869K291L436M962O017O510O864P034O837
$$ y = [199672, 201209, 203058, 205221, 207282, 208706, 209583, 210468, 211533, 212505, 213435, 214719, 216293, 217547, 218249, 218803, 219378, 219557, 219188, 218842, 219011, 219509, 220065, 220844, 221886, 222622, 222580, 222097, 221822, 221904, 222211, 222940, 224371, 226296, 228274, 230284, 232549, 234853, 236531, 237216, 237247, 237356, 238192, 240132, 243234, 247274, 251886, 256704, 261460, 266116, 270894, 276002, 281344, 286746, 292388, 298713, 305916, 313844, 322340, 331291, 340301, 348801, 356618, 364171, 372053, 380704, 390404, 401122, 412334, 423466, 434460, 445435, 455937, 465273, 473681, 482383, 492230, 502926, 513826, 524791, 535824, 546516, 556451, 565746, 574742, 583478, 591857, 600000, 608111, 616260, 624538, 633056, 641528, 649239, 655746, 661322, 666473, 671323, 675632, 679060, 681259, 682077, 681937, 681646, 681652, 681775, 681745, 681546, 681197, 680740, 680577, 681252, 682752, 684621, 686912, 690348, 695310, 701327, 707837, 714701, 721735, 728572]
52220G28572O876P854R220R769R476R472J0192J0918J1145J1061J0669R675Q528
52207H53427Q205Q635Q633P744O855O493N883M421K879K177J871Q70r93k864l927
52192I10309m001l492l244l910n136n883n774n559n948o740p457q049q486q421
52178H28209p824p344p450p721p502o808o108n657n517n755o174o251n783n178
52164G37137m774m335l551k642k056k004k580l779n027n244l971k080r21r56j578
52149F91639j988j891j507j222j161j098r30j030j677k332k229j630j634k587
52135F68723l523l616l327l558m330m948n075m965m939n019m997m645l966l361
52121F08454l226l398l450l469l868m507m692m274l863l764l508k873k456k632
$$ y = [728572, 735448, 743302, 752522, 762291, 771767, 781239, 791431, 802349, 813494, 824555, 835224, 844899, 853427, 861632, 870267, 878900, 886644, 893499, 899992, 905875, 910296, 913175, 915352, 917223, 918093, 917100, 914236, 910309, 906308, 902816, 899572, 895662, 890526, 884643, 878869, 873310, 867362, 860622, 853165, 845116, 836630, 828209, 820385, 813041, 805591, 797870, 790368, 783560, 777452, 771795, 766278, 760523, 754349, 748098, 742315, 737137, 732363, 728028, 724477, 721835, 719779, 717775, 715195, 711416, 706389, 701145, 697174, 695094, 694173, 693217, 691639, 689651, 687760, 686253, 685031, 683870, 682772, 681842, 680812, 679135, 676803, 674574, 672944, 671310, 668723, 665200, 661584, 658257, 654699, 650369, 645421, 640346, 635381, 630442, 625423, 620426, 615781, 611815, 608454, 605228, 601830, 598380, 594911, 591043, 586536, 581844, 577570, 573707, 569943, 566435, 563562, 561106, 558474]
52107E58474k766k180j271q58r36q68m96j70J03P82J917K854K969K492K345L221
52091E65612M855O265O873P152P913R155J0175J0656J0993J1503J2053J2614J3436
52078F89255J4446J5206J5691J6387J7303J7733J7395J6969J6951J6785J5882
52067H70003J4793J4438J4671J4550J3727J2740J2015J1323J0315Q967P452N927
52055A010921M579L486K460J236j70j514k597l492m487n822p249q029p725o910
52041I74687o592o978p437p611p810q118q034p401o884o963p081o464n257m237
52027H77820l705l259k450j257n1O49O76N89J154K287L098L232L379M106M968
52012H91236N321N363N652O157O463O506O371N763M444K874J751J098L52q05k333
$$ y = [558474, 555708, 553528, 552257, 551399, 550463, 549595, 549099, 548929, 549032, 549814, 551731, 554585, 557554, 560046, 562391, 565612, 570467, 576732, 583605, 590757, 598670, 607825, 618000, 628656, 639649, 651152, 663205, 675819, 689255, 703701, 718907, 734598, 750985, 768288, 786021, 803416, 820385, 837336, 854121, 870003, 884796, 899234, 913905, 928455, 942182, 954922, 966937, 978260, 988575, 997542, 1004994, 1010921, 1015500, 1018986, 1021446, 1022682, 1022512, 1020998, 1018401, 1014909, 1010422, 1004600, 997351, 989322, 981597, 974687, 968095, 961117, 953680, 946069, 938259, 930141, 922107, 914706, 907822, 900859, 893778, 887314, 882057, 877820, 874115, 870856, 868406, 867149, 867098, 867747, 868423, 869012, 870166, 872453, 875551, 878783, 882162, 886268, 891236, 896557, 901920, 907572, 913729, 920192, 926698, 933069, 938832, 943276, 946150, 947901, 948999, 949351, 948546, 946213]
51997I46213m205o322q211r382j0013j0754j2015j3707j5516j7019j7814j7958
51985H03297j8129j8939k0240k1378k1944k2027k1928k1955k2230k2470k2222
51974E69835k1496k0735k0058j9089j7810j6862j6550j6173j4981j3268j1844
51963C80969j0893j0081r366q934q594p950p093o464o148n877n557n227m664l621
51949B80500k400j665j702k214k733k924k654k133j844k033k389k471k183j632
51935B49523r78o26j051k007k493j996j272j338k140k890l207l231k978k475k190
51920B18651k540l091l091k632k462k724k737k183j675j875k539k815k197j006
51906A85084q8p9p74j274r45r5M86M50L5m64r71j351j287n32O68J509J179k03
$$ y = [946213, 942008, 935686, 927475, 918093, 908080, 897326, 885311, 871604, 856088, 839069, 821255, 803297, 785168, 766229, 745989, 724611, 702667, 680640, 658712, 636757, 614527, 592057, 569835, 548339, 527604, 507546, 488457, 470647, 453785, 437235, 421062, 406081, 392813, 380969, 370076, 359995, 350629, 341695, 333101, 325151, 318058, 311594, 305446, 299569, 294012, 288785, 284121, 280500, 278100, 276435, 274733, 272519, 269786, 266862, 264208, 262075, 260231, 258198, 255809, 253338, 251155, 249523, 248545, 247919, 246868, 244861, 242368, 240372, 239100, 237762, 235622, 232732, 229525, 226294, 223316, 220841, 218651, 216111, 213020, 209929, 207297, 204835, 202111, 199374, 197191, 195516, 193641, 191102, 188287, 186090, 185084, 184996, 184917, 184143, 182869, 181924, 181829, 182315, 182765, 182800, 182336, 181365, 180014, 178727, 178195, 178863, 180372, 181551, 181348]
51888A81348j416j401n62j48m78o82k78J15pj36K26O50O15M48N94P06L53q7j31
51869A79729j00l55k94P41K099K529J938J310J113R93P92P93Q79O06J32J81R25
51852A94011J688J883J574J099P25O39P19N15p2m48k14P9j73n66m83l07p04j178
51834A98787p14M41J030P31M41O82J001J093J129R07J8r43p65M29J076M42l57
51817B05428k27M03O85P34R00Q11K11j26N21J486J575Q45M00P39J257J347J120
51800B18109R50R66J209J827K823L766L898K776R09m93p15l28l23p99j162j349
51784B32064j855k565k619j796j044j130j587j603j174p81n77n43q91j627k137
51769B10135j970j542j464j559j276p21m94o97q75q66r75j183r74j55O36O76P5
$$ y = [181348, 179932, 178531, 177969, 177821, 177343, 176661, 176383, 176498, 176491, 176355, 176581, 177231, 177846, 178294, 178888, 179594, 179947, 179860, 179729, 179629, 179274, 178980, 179721, 181820, 184349, 186287, 187597, 188710, 189703, 190495, 191288, 192167, 192773, 192905, 193086, 194011, 195699, 197582, 199156, 200255, 200980, 201619, 202338, 202853, 202781, 202333, 202119, 202198, 202025, 201459, 200976, 200669, 199965, 198787, 198073, 198514, 199544, 200275, 200716, 201398, 202399, 203492, 204621, 205528, 205546, 204603, 203838, 204267, 205343, 205785, 205428, 205201, 205604, 206289, 207023, 207923, 208734, 208945, 208819, 209340, 210826, 212401, 213246, 213646, 214385, 215642, 216989, 218109, 219059, 220025, 221234, 223061, 225884, 229650, 233548, 236324, 237233, 236740, 236025, 235697, 235374, 234575, 233413, 232064, 230209, 227644, 225025, 223229, 222185, 221055, 219468, 217865, 216691, 215910, 215333, 214790, 213899, 212272, 210135, 208165, 206623, 205159, 203600, 202324, 201603, 201109, 200412, 199537, 198671, 197696, 196513, 195539, 195384, 196020, 196696, 196771]
51752A96771m39m52k75l47n94o14l21j15l04o93r10r31j034j321j591j610j309
51735A83911q54o29r13j401j392p19j53m28j208j576j288r26r39j168j293j147
51719A67877o64NL88K00j45j02J64J44n0J61P07P68l6j101j671j617j229p80m25
51700A62594j40L75J205J849J831J506J519J681J264L70m8L95J065J537K229L480
51684A82712M947O311P664Q619Q018N222J171k578n375p428q719q747p294m995
51670A79528l003k163k375k753k661k335k246k177j661q97m71l49j18ln77j465
51654A54274j620j001o91j063j179m87K26K46J08N04J082J175Q51M25k60j264
51638A51326j976j926j466j048n91j76l14q81q01K83J096N62m44m56M41J187J619
$$ y = [196771, 196332, 195880, 195605, 195258, 194664, 194050, 193729, 193614, 193310, 192617, 191707, 190776, 189742, 188421, 186830, 185220, 183911, 183057, 182428, 181515, 180114, 178722, 178003, 177850, 177422, 176214, 174638, 173350, 172424, 171485, 170317, 169024, 167877, 167213, 167218, 167606, 167806, 167661, 167559, 167723, 167867, 167817, 167978, 168685, 169453, 169417, 168316, 166645, 165028, 163799, 163019, 162594, 162454, 162829, 164034, 165883, 167714, 169220, 170739, 172420, 173684, 174054, 174006, 174401, 175466, 177003, 179232, 182712, 187659, 193970, 201634, 210253, 218271, 223493, 224664, 222086, 216711, 209283, 200564, 191817, 184523, 179528, 176525, 174362, 171987, 169234, 166573, 164238, 161992, 159815, 158154, 157257, 156786, 156437, 156319, 156316, 155739, 154274, 152654, 151653, 150962, 149899, 148720, 148233, 148459, 148705, 148813, 149317, 150399, 151574, 152425, 152850, 152590, 151326, 149350, 147424, 145958, 144910, 144319, 144143, 143829, 142948, 142147, 142430, 143526, 144088, 143644, 143188, 143629, 144816, 146435]
51621A46435K207K537J761L05m66k03J91K72M98R52J033O79O25J085J295Q95N93
51604A60694R81J623J938K129K584K993K799K075J369R73Q86J148J723K215K126
51589A88256J407N33J3L0L97Q17J102J284J502J773J984J980J718J329J061J006
51573B06192R56P24N18O06P77N20j29n11l14p4m31j340k292k850k756k014j173
51556A96409r39j191j006o7P15N45k0PN20O63K67k3P2Q8l74j098j603j526p42
51537A90697M80J511J915J793J393P38pl64j99p2l40n01q2M34L95Q8J80M84L94
51518A98937J49M68J103R89j48j342j795j701j544j397j220j095r42n51n7K02
51502A90056K34J97j48j034j866j752q59k39k16J3R39J911K210K035J879J728
$$ y = [146435, 148642, 151179, 152940, 153245, 152779, 152576, 152767, 153039, 153537, 154489, 155522, 156201, 156826, 157911, 159206, 160101, 160694, 161675, 163298, 165236, 167365, 169949, 172942, 175741, 177816, 179185, 180158, 181044, 182192, 183915, 186130, 188256, 189663, 190196, 190209, 190239, 190636, 191453, 192555, 193839, 195341, 197114, 199098, 201078, 202796, 204125, 205186, 206192, 207148, 207872, 208390, 208996, 209773, 210293, 210164, 209653, 209339, 209265, 208834, 207494, 205202, 202352, 199596, 197582, 196409, 195470, 194279, 193273, 193206, 193921, 194466, 194446, 194453, 194973, 195636, 195903, 195880, 195952, 196040, 195666, 194568, 192965, 191439, 190697, 191177, 192688, 194603, 196396, 197789, 198527, 198520, 198156, 197957, 197885, 197545, 197044, 196962, 197396, 197791, 197879, 198059, 198543, 198937, 199086, 199554, 200657, 201646, 201498, 200156, 198361, 196660, 195116, 193719, 192499, 191404, 190462, 189911, 189854, 190056, 190290, 190487, 190339, 189305, 187439, 185687, 184828, 184589, 184373, 184386, 185325, 187236, 189446, 191481, 193360, 195088]
51486A95088J429J236J406J759K044K296K433J965O47r74k030k154j624j017r06
51471B01598j490k328k801k883l025l216k837j654l40L46L47kn45j123j370j094
51455A77583o04k73o2K63P22J137J235O71o30k060k802k831k807k842k260r92
51439A63448k17p98j846j915j166j051k061k976k680j654j045j049j000o99p57
51424A42534j551k521k779k066q44K48P47L96o61j710k020j599j123r35o88j45
51408A25283K18p1o75r45q61q36q66n65nL25L25L90O19O55M23K74K41j07p59j026
51388A22037o08k15n96j479k087k191k013j518n94L59O72L02j18j12K08N01N39
51371A13087J83m90r64n63P84K294K975K467J213P7k56K63J004J206O78o6m63
$$ y = [195088, 196517, 197753, 199159, 200918, 202962, 205258, 207691, 209656, 210303, 209329, 207299, 205145, 203521, 202504, 201598, 200108, 197780, 194979, 192096, 189071, 185855, 183018, 181364, 181024, 181370, 181717, 181715, 181170, 180047, 178677, 177583, 176979, 176706, 176644, 176907, 177629, 178766, 180001, 180672, 180042, 177982, 175180, 172349, 169542, 166700, 164440, 163448, 163231, 162433, 160587, 158672, 157506, 156455, 154394, 151418, 148738, 147084, 146039, 144990, 143990, 143291, 142534, 140983, 138462, 135683, 133617, 132773, 133021, 133768, 134164, 133503, 131793, 129773, 128174, 127051, 126116, 125428, 125283, 125501, 125430, 124755, 123810, 122949, 122113, 121247, 120682, 120677, 121002, 121327, 121717, 122336, 122991, 123414, 123688, 123929, 123822, 123063, 122037, 121429, 121214, 120618, 119139, 117052, 114861, 112848, 111330, 110736, 111095, 111767, 112069, 111951, 111839, 112047, 112548, 113087, 113270, 112780, 111816, 111253, 112037, 114331, 117306, 119773, 120986, 121063, 120807, 121070, 122074, 123280, 123958, 123892, 123429]
51354A23429m84m87o74r68j348j899k424k345j421l73k55j138j883j543n48l2
51338A05607l59q25p48k55J35K15J05j15m26o37m38K29R16J008L64m31o55k55
51320A03435J86K44J16J80M32O34O68M86J5n87q50n19Q3N11P02O87K44o38j312
51301A04717j164m86k1J78O17J255J318M62o90j352j367r82m12O8J40j78n02o26
51283A00975o72o38l11K40N48M17K41L24L70On63q27o38k75J6K56N72R81J261
51264A02283J035K18o51q07q8Q81J359J074K41o05q43l02L71L51l34q06n42P6
51246A02911M89O65P63O68L45J53L82P83R89J095J371J668J526Q46J6n05n58k62
51228A13345J68O08J097J612J822J351L54n00p07k67O04J655K397K288J474Q60
$$ y = [123429, 122945, 122458, 121784, 120816, 119468, 117569, 115145, 112800, 111379, 111006, 110751, 109613, 107730, 106187, 105639, 105607, 105248, 104423, 103675, 103420, 103555, 103770, 103875, 103760, 103334, 102697, 102259, 102488, 103404, 104412, 104776, 104345, 103690, 103435, 103621, 103865, 103981, 104161, 104593, 105227, 105895, 106381, 106396, 105809, 104959, 104440, 104523, 105034, 105736, 106423, 106667, 106029, 104717, 103553, 103067, 103046, 103224, 103841, 105096, 106414, 106876, 106186, 104834, 103467, 102485, 102073, 102141, 102281, 102103, 101601, 100975, 100303, 99665, 99354, 99594, 100142, 100559, 100800, 101124, 101494, 101500, 100937, 100110, 99472, 99197, 99213, 99469, 100041, 101022, 102283, 103318, 103536, 102885, 102078, 101990, 102871, 104230, 105304, 105545, 104940, 104097, 103795, 104166, 104517, 104183, 103377, 102835, 102911, 103400, 104065, 104828, 105496, 105841, 105994, 106376, 107159, 108148, 109243, 110614, 112282, 113808, 114654, 114670, 114165, 113607, 113345, 113513, 114121, 115218, 116830, 118652, 120003, 120357, 119857, 119150, 118883, 119487, 121142, 123539, 125827, 127301, 128161]
51212A28161J068J666J797J195K54n66r50o92j3M49L82L14Q08J410J151l6j102
51195A35296j257q41n38l66OL94K64l53p20l91J44J36m37r41r57o65l14J10N60
51176A29130O36K9r47j641j719j335q37n58p69j471k192k352j795r07k10l7l66
51159A12659p61o30J08P96P26p5j012j605j645r75K47J296J400O53j25l94l49
51142A10314l61m69m84k44L09R63J264J032O96O72O46J05o75q76l42L34Q80J615
51124A15379K461K624J733O42M35J091J666J539J017Q83J526K505K918K375J450
51109A40244Q65N13j09p74o85K49J122J291J094J063J138J060Q90O91K64m63j157
51092A47296j500j531j352j036q55j108j482j310n66lo1l53m25l16q5L68P50N22
$$ y = [128161, 129229, 130895, 132692, 133887, 134141, 133575, 132625, 131933, 131920, 132369, 132751, 133065, 133873, 135283, 136434, 136398, 135296, 134039, 133198, 132660, 132294, 132300, 132694, 132958, 132605, 131885, 131494, 131638, 131774, 131337, 130396, 129439, 128774, 128460, 128570, 129130, 129766, 129795, 128848, 127207, 125488, 124153, 123316, 122758, 121989, 120518, 118326, 115974, 114179, 113272, 113062, 113025, 112659, 111898, 111268, 111376, 112172, 112898, 112823, 111811, 110206, 108561, 107586, 107833, 109129, 110529, 111182, 111057, 110663, 110314, 109953, 109484, 109000, 108756, 109065, 110028, 111292, 112324, 113020, 113692, 114338, 114443, 113768, 112892, 112550, 112884, 113764, 115379, 117840, 120464, 122197, 122839, 123274, 124365, 126031, 127570, 128587, 129470, 130996, 133501, 136419, 138794, 140244, 141109, 141622, 141513, 140739, 140054, 140303, 141425, 142716, 143810, 144873, 146011, 147071, 147961, 148652, 148916, 148453, 147296, 145796, 144265, 142913, 141877, 141022, 139914, 138432, 137122, 136556, 136553, 136492, 136139, 135714, 135398, 135313, 135681, 136431, 136953]
51074A36953j24k81K42N13L6l52O6N55O7j015j443r45l56j74n6K95O12N98L68
51055A35559K36L39N75P39Q02R83J241R05m45j882j910n20O88P25L36L69M19J02
51037A39261K44J482K708K492J328Q19J211J335P59L55O35J060J170J195J264
51022A57318J146R93J358K139K483K031J473J541K117K623K736K515K358K787
51008A85618L782M512M362L960M283N073N198M490M035M440N030N186N384O259
50994B51612P449Q129Q167Q141Q497R171R803J0114J0188J0496J1385J2656J3957
50981C79765J5386J7244J9388K1484K3661K6233K8955L1390L3919L7359M1546
50970F76330M5287M7966N0147N2312N3895N4131N2994N0777M7512M3299L8601
$$ y = [136953, 136829, 136548, 136790, 137303, 137339, 136987, 137053, 137608, 137675, 136660, 135217, 134272, 133916, 133742, 133686, 133981, 134593, 135191, 135559, 135795, 136134, 136709, 137448, 138250, 139233, 140474, 141379, 140934, 139052, 137142, 136622, 137310, 138035, 138371, 138740, 139159, 139261, 139505, 140987, 143695, 146187, 147515, 148334, 149545, 150880, 151639, 151994, 152629, 153689, 154859, 156054, 157318, 158464, 159457, 160815, 162954, 165437, 167468, 168941, 170482, 172599, 175222, 177958, 180473, 182831, 185618, 189400, 193912, 198274, 202234, 206517, 211590, 216788, 221278, 225313, 229753, 234783, 239969, 245353, 251612, 259061, 267190, 275357, 283498, 291995, 301166, 310969, 321083, 331271, 341767, 353152, 365808, 379765, 395151, 412395, 431783, 453267, 476928, 503161, 532116, 563506, 597425, 634784, 676330, 721617, 769583, 819730, 872042, 925937, 980068, 1033062, 1083839, 1131351, 1174650, 1213251]
50959A213251L3642K8109K1939J5845J0523N866J485k489n684q076r720j0289
50947A294402r534p889o127m585l270k433k496l544n339p748j0749j4174j7818
50934A198696k1764k6181l0862l5242l8886m1716m3774m5049m5491m5063m3775
50923G80893m1760l9306l6741l4273l2005k9938k7831k5290k2122j8674j5690
50912D57263j3716j2504j1202r293p324o208n809m874k709k36J201J606J934K401
50898C90530K260J289L29L1K7j22K1J076K735M034M490M399M208M127M272M732
50882D28438N444O181O724O994P157P628Q761J0365J1821J2777J3559J4753J6495
50869E57097J8393K0084K1736K3952K7148L1085L5171L9253M3803M9240N5420
$$ y = [1213251, 1246893, 1275002, 1296941, 1312786, 1323309, 1329175, 1330660, 1328171, 1322487, 1314411, 1304691, 1294402, 1284868, 1276979, 1270852, 1266267, 1262997, 1260564, 1258068, 1254524, 1249185, 1241437, 1230688, 1216514, 1198696, 1176932, 1150751, 1119889, 1084647, 1045761, 1004045, 960271, 915222, 869731, 824668, 780893, 739133, 699827, 663086, 628813, 596808, 566870, 539039, 513749, 491627, 472953, 457263, 443547, 431043, 419841, 410548, 403224, 397016, 391207, 386333, 383624, 383388, 384589, 386195, 388129, 390530, 392790, 394079, 394408, 394439, 394466, 394344, 394365, 395441, 398176, 402210, 406700, 411099, 415307, 419434, 423706, 428438, 433882, 440063, 446787, 453781, 460938, 468566, 477327, 487692, 499513, 512290, 525849, 540602, 557097, 575490, 595574, 617310, 641262, 668410, 699495, 734666, 773919, 817722, 866962, 922382]
50858I22382O2123O9558P7871Q6473R4527J01877J08905J15565J21219J25288
50848A885788J27334J26584J22144J13936J02745Q9247P3634N6423L8904K2391
50838B759130P419n979j7608k6893l3062l5435l3974k9642k3770j7067r634j911
50826B531574M986R894J1933J0305M660m153j4480k5330l6859m9174o1504p2902
50814B308950q2972r1406r7512j00815j01634j00469r7254r1820q4616p6508o8152
50803A315792n9902n1896m3902l5540k7078j9442j2978o768K45P947J5468K2437
50791A104383K9078L5356M0758M4773M7108M7551M6148M3281L9202L3683K6633
50780A537954J8815J1358M714j513p792j4141k0232k5623l0033l3649l7042m0476
$$ y = [922382, 984505, 1054063, 1131934, 1218407, 1312934, 1414811, 1523716, 1639281, 1760500, 1885788, 2013122, 2139706, 2261850, 2375786, 2478531, 2567778, 2641412, 2697835, 2736739, 2759130, 2766549, 2760570, 2742962, 2716069, 2683007, 2647572, 2613598, 2583956, 2560186, 2543119, 2533485, 2531574, 2536560, 2546454, 2558387, 2568692, 2573352, 2569199, 2554719, 2529389, 2492530, 2443356, 2381852, 2308950, 2225978, 2134572, 2037060, 1936245, 1834611, 1734142, 1636888, 1545068, 1460452, 1383944, 1315792, 1255890, 1203994, 1160092, 1124552, 1097474, 1078032, 1065054, 1058286, 1058531, 1066478, 1081946, 1104383, 1133461, 1168817, 1209575, 1254348, 1301456, 1349007, 1395155, 1438436, 1477638, 1511321, 1537954, 1556769, 1568127, 1572841, 1571328, 1563536, 1549395, 1529163, 1503540, 1473507, 1439858, 1402816, 1362340]
50768A362340m3578m5926m7600m8828m9434m9018m7377m4452m0285l5429l0894
50757H79519k7094k3301j8730j3737r268n458j613K632O946J1048J5029J8971
50745H34944K2898K7134L2087L7639M3395M9410N6044O3072O9796P6056Q2237
50734A394712Q8073R2307R4020R3513R1237Q6570P8407O6703N2628L7365K1396
50723B196931N057j0774k4749l5699m3135m7313m8766m7651m3811l7531k9994
50712A832565k2432j5151p889j130L773N980N982M498J184m701j2681k1026k8501
50699A740471l5251m1702m7396n1499n3848n4720n4065n1625m7668m2894l7658
50688A222145l1962k6043k0345j4823q924k410M452J1606J9499K8386L7950M7824
$$ y = [1362340, 1318762, 1272836, 1225236, 1176408, 1126974, 1077956, 1030579, 986127, 945842, 910413, 879519, 852425, 829124, 810394, 796657, 787389, 781931, 780318, 782950, 789896, 800944, 815973, 834944, 857842, 884976, 917063, 954702, 998097, 1047507, 1103551, 1166623, 1236419, 1312475, 1394712, 1482785, 1575092, 1669112, 1762625, 1853862, 1940432, 2018839, 2085542, 2138170, 2175535, 2196931, 2201988, 2191214, 2166465, 2130766, 2087631, 2040318, 1991552, 1943901, 1900090, 1862559, 1832565, 1810133, 1794982, 1787093, 1785963, 1789736, 1795716, 1801698, 1806196, 1807380, 1802679, 1789998, 1768972, 1740471, 1705220, 1663518, 1616122, 1564623, 1510775, 1456055, 1401990, 1350365, 1302697, 1259803, 1222145, 1190183, 1164140, 1143795, 1128972, 1120048, 1117638, 1122090, 1133696, 1153195, 1181581, 1219531, 1267355]
50676A267355N8040O8670P9464R0057J00051J08590J14401J16688J15591J11441
50666B230348J04092R3481Q0491O6537N2507L8527K4727J1678o3j0552k0444l0381
50654B640948m0372m9742n7805o4541p0365p5316p8806q0257p9531p6643p1521
50643A896049o4378n5984m7207l8517l0058k1974j4458p716k063K202N020O456
50631A627372O319M501J793l16r70o36j15O08K050M338P191J0492J4237J8040
50617A694904K1127K2818K2776K0943J7560J3082P875K177l536q467j2134j4815
50605A784310j7100j9230k1130k2783k4398k6424k9474l3779l8572m2578m5308
50594A463534m7261m8706m9012m7737m5598m3615m1870l9856l7577l5423l3308
$$ y = [1267355, 1325395, 1394065, 1473529, 1563586, 1663637, 1772227, 1886628, 2003316, 2118907, 2230348, 2334440, 2427921, 2508412, 2574949, 2627456, 2665983, 2690710, 2702388, 2702325, 2691773, 2671329, 2640948, 2600576, 2550834, 2493029, 2428488, 2358123, 2282807, 2204001, 2123744, 2044213, 1967570, 1896049, 1831671, 1775687, 1728480, 1689963, 1659905, 1637931, 1623473, 1615757, 1613694, 1615896, 1620916, 1627372, 1633691, 1638192, 1639985, 1639669, 1638699, 1638063, 1637948, 1638556, 1640606, 1644944, 1652135, 1662627, 1676864, 1694904, 1716031, 1738849, 1761625, 1782568, 1800128, 1813210, 1821085, 1823262, 1819726, 1811259, 1799125, 1784310, 1767210, 1747980, 1726850, 1704067, 1679669, 1653245, 1623771, 1589992, 1551420, 1508842, 1463534, 1416273, 1367567, 1318555, 1270818, 1225220, 1181605, 1139735, 1099879, 1062302, 1026879, 993571]
50583I93571l0826k8112k5734k3776k1797j9620j7536j5634j3560j1017q072m919
50571G72968j790R57L121N064P411J0362J3657J7102K0731K4519K8457L2912L8431
50558I73902M5088N2354N9636O6657P3270P9206Q4050Q7301Q8469Q7309Q3868
50547A781110P8271P0683O1649N2220M3507L6263L0965K7728K5908K4221K1705
50536B254230J8309J4342R906N306J416j053k221k337q16L119Q983J5096K0156
50523B344436K4171K7707L0788L2750L2794L0524K6133K0108J2764M261m947j4120
50511B567369k2960l1869m1159n0325n8380o4494o8118o9034o7691o4874o0618
50500A967847n4276m6064l7675l0563k4464j8600j3437r890p407m295J17M923
$$ y = [993571, 962745, 934633, 908899, 885123, 863326, 843706, 826170, 810536, 796976, 785959, 777887, 772968, 771178, 772135, 775256, 780320, 787731, 798093, 811750, 828852, 849583, 874102, 902559, 935471, 973902, 1018990, 1071344, 1130980, 1197637, 1270907, 1350113, 1434163, 1521464, 1609933, 1697242, 1781110, 1859381, 1930064, 1991713, 2043933, 2087440, 2123703, 2154668, 2182396, 2208304, 2232525, 2254230, 2272539, 2286881, 2296787, 2302093, 2303509, 2302456, 2300235, 2297898, 2297082, 2300201, 2309184, 2324280, 2344436, 2368607, 2396314, 2427102, 2459852, 2492646, 2523170, 2549303, 2569411, 2582175, 2586436, 2581489, 2567369, 2544409, 2512540, 2471381, 2421056, 2362676, 2298182, 2230064, 2161030, 2093339, 2028465, 1967847, 1913571, 1867507, 1829832, 1799269, 1774805, 1756205, 1742768, 1732878, 1725471, 1721176, 1721293, 1726216]
50488A726216R158J2623J5111J5911J4327R956K520p755j9643l1680m3279n4197
50476A649268o3291o9102p1634p2281p1877p0076o6827o3004n9113n4634m9298
50465I38131m3941l9381l5383l1359k7354k3696k0335j7123j4211j1723r504p507
50453F56614n844m261k332k99J100J967L341N591P659Q650R200J0475J2527J4556
50439G18944J6205J7753J9418K1217K3338K6012K9150L2434L5489L7835L9207
50428A017002M0186M1831M4268M6349M7187M7274M7511M7828M7632M7000M6481
50417A520549M6073M5299M4105M2912M1874M0669L9033L6920L4269L1026K7331
50406A950060K3295J8784J3748Q483L151k647r306j6480k3413k9815l6004m2237
$$ y = [1726216, 1735374, 1747997, 1763108, 1779019, 1793346, 1803302, 1805822, 1798067, 1778424, 1746744, 1703465, 1649268, 1585977, 1516875, 1445241, 1372960, 1301083, 1231007, 1164180, 1101176, 1042063, 987429, 938131, 894190, 854809, 819426, 788067, 760713, 737017, 716682, 699559, 685348, 673625, 664121, 656614, 650770, 646509, 644177, 643878, 644978, 646945, 650286, 655877, 663536, 672186, 681386, 691861, 704388, 718944, 735149, 752902, 772320, 793537, 816875, 842887, 872037, 904471, 939960, 977795, 1017002, 1057188, 1099019, 1143287, 1189636, 1236823, 1284097, 1331608, 1379436, 1427068, 1474068, 1520549, 1566622, 1611921, 1656026, 1698938, 1740812, 1781481, 1820514, 1857434, 1891703, 1922729, 1950060, 1973355, 1992139, 2005887, 2014370, 2017521, 2014874, 2005568, 1989088, 1965675, 1935860, 1899856, 1857619]
50394A857619m8381n4113n9133o3164o6049o7727o8095o7039o4705o1414n7291
50383A180508n2371m7053m1877l6704l0834k4216j7805j2312p383k539J896N497
50371I14807Q641J1798J4420J5455J4594J2158Q173K646l582r307j4312j9211
50359I56280k3936k7427k9005k9197k8819k8067k6915k5704k4717k3585k1757
50348F67151j9322j6929j4980j3268j1368r184p030n248l851k543j079M60J790
50335E64599K659K959K856K894L665N186O767P720P978P923P992Q581R975J1958
50321F53712J3785J4876J5374J5782J6426J7488J9160K1240K3003K3994K4598
50310H59438K5334K5945K5837K5118K4367K3585K2270K0465J8856J7593J5842
$$ y = [1857619, 1809238, 1755125, 1695992, 1632828, 1566779, 1499052, 1430957, 1363918, 1299213, 1237799, 1180508, 1128137, 1081084, 1039207, 1002503, 971669, 947453, 929648, 917336, 909953, 907414, 909310, 914807, 923448, 935246, 949666, 965121, 979715, 991873, 1000046, 1002692, 999110, 989803, 975491, 956280, 932344, 904917, 875912, 846715, 817896, 789829, 762914, 737210, 712493, 688908, 667151, 647829, 630900, 615920, 602652, 591284, 582100, 575070, 569822, 565971, 563428, 562349, 562809, 564599, 567258, 570217, 573073, 575967, 579632, 584818, 591585, 599305, 607283, 615206, 623198, 631779, 641754, 653712, 667497, 682373, 697747, 713529, 729955, 747443, 766603, 787843, 810846, 834840, 859438, 884772, 910717, 936554, 961672, 986039, 1009624, 1031894, 1052359, 1071215, 1088808, 1104650]
50299A104650J2864Q935M866J168j945m268n825p149q827j1010j3593j6615k0127
50286A043124k3750k6779k8721k9543k9493k8839k7832k6663k5456k4318k3327
50275G48403k2372k1117j9298j7101j5027j3335j1829j0299r033q524q696q820
50263E82952q350p487o651n780m670l728l641m248m510l796k657j914j640j406
50249E22474j099q50n03J93J044J674K176K990M157N193N753N948O012O063O214
50234E67439O514O692O315N335M184L200K360J654J301J389J624J641J392R45
50220F11985K13q36j825k264k204k212k580k916k781k388k233k235j825q82K6
50205E85043O28J467K974M549N341N659O699Q966J1667J3836J5279J6176J6536
$$ y = [1104650, 1117514, 1126449, 1131315, 1132483, 1130538, 1126270, 1120445, 1113296, 1104469, 1093459, 1079866, 1063251, 1043124, 1019374, 992595, 963874, 934331, 904838, 875999, 848167, 821504, 796048, 771730, 748403, 726031, 704914, 685616, 668515, 653488, 640153, 628324, 618025, 608992, 600468, 591772, 582952, 574602, 567115, 560464, 554684, 550014, 546286, 542645, 538397, 533887, 530091, 527434, 525520, 523880, 522474, 521375, 520525, 520022, 520215, 521259, 522933, 525109, 528099, 532256, 537449, 543202, 549150, 555162, 561225, 567439, 573953, 580645, 586960, 592295, 596479, 599679, 602039, 603693, 604994, 606383, 608007, 609648, 611040, 611985, 612198, 611362, 609537, 607273, 605069, 602857, 600277, 597361, 594580, 592192, 589959, 587724, 585899, 585017, 585043, 585671, 587138, 590112, 594661, 600002, 605661, 612360, 621326, 632993, 646829, 662108, 678284, 694820]
50192F94820J6394J5919J4993J3159J0365P267M378J581j143l142l946m191m872
50179G61582o003o821p114p472q202q752q492p468o144m827l627k700k159j800
50165F80001j160O1J618K823L197L026L107L877N057O114O761O872O423N771N621
50150G39169O313P456Q517R463J0461J1397J2152J3001J4201J5463J6413J7451
50138H81457J9494K2845K6926L1106L5393M0189M5870N2858O1692P2785Q6128
50127A376743J01330J17809J34958J52084J68087J81122J88859J89346J81600
50118B791938J65634J42567J15131Q7580O4217M7636L8254L4959L5661L7419L6863
50107C597859L0976J7725l693l2563o6571j02159j35379j62799j82256j93172
$$ y = [694820, 711214, 727133, 742126, 755285, 765650, 772917, 777295, 778876, 777733, 774591, 770645, 766454, 761582, 755579, 748758, 741644, 734172, 725970, 717218, 708726, 701258, 695114, 690287, 686660, 683960, 681801, 680001, 678841, 678902, 680520, 683343, 686540, 689566, 692673, 696550, 701607, 707721, 714482, 721354, 727777, 733548, 739169, 745482, 752938, 761455, 770918, 781379, 792776, 804928, 817929, 832130, 847593, 864006, 881457, 900951, 923796, 950722, 981828, 1017221, 1057410, 1103280, 1156138, 1217830, 1290615, 1376743, 1478073, 1595882, 1730840, 1882924, 2051011, 2232133, 2420992, 2610338, 2791938, 2957572, 3100139, 3215270, 3302850, 3367067, 3414703, 3452957, 3487916, 3523577, 3560996, 3597859, 3628835, 3646560, 3642867, 3610304, 3543733, 3441574, 3306195, 3143396, 2961140, 2767968]
50097B767968j96088j91958j82086j68443j53174j37486j21549j05773r1342p8971
50087A341098o7979n7394m7480l9293l3157k8420k4410k0779j7078j3026r188
50076I82894o597n526n254n061m829m644m489m402m445m426m128l772l681l602
50062I18038k927j533Q1J470K413K723K483K404L165M437N316N617N920O416O677
50047I62700O696P161Q362R762J0991J2417J4304J6212J7721J9033K0353K1328
50035A127040K1766K2210K3228K4575K5695K6669K7976K9659L1351L2892L4391
50024A427452L5892L7399L9109M1126M3309M5830M9641N5800O4413P4888Q7096
50013B001955J01731J19462J40311J63992J90241K18404K46901K73385K95189
$$ y = [2767968, 2571880, 2379922, 2197836, 2029393, 1876219, 1738733, 1617184, 1511411, 1420069, 1341098, 1273119, 1215725, 1168245, 1128952, 1095795, 1067375, 1042965, 1022186, 1005108, 992082, 982894, 976297, 970771, 965517, 960456, 955627, 950983, 946494, 942092, 937647, 933221, 929093, 925321, 921640, 918038, 915111, 913578, 913659, 915129, 917542, 920265, 922748, 925152, 928317, 932754, 938070, 943687, 949607, 956023, 962700, 969396, 976557, 984919, 994681, 1005672, 1018089, 1032393, 1048605, 1066326, 1085359, 1105712, 1127040, 1148806, 1171016, 1194244, 1218819, 1244514, 1271183, 1299159, 1328818, 1360169, 1393061, 1427452, 1463344, 1500743, 1539852, 1580978, 1624287, 1670117, 1719758, 1775558, 1839971, 1914859, 2001955, 2103686, 2223148, 2363459, 2527451, 2717692, 2936096, 3182997, 3456382, 3751571]
50004C751571L09416L13016L03826K82299K52312K19911J90777J68389J53798
49995E945315J46243J43519J42213J38180J27153J05385P0640K3488l2254r0804
49985F719078j46588j95558k35396k65402k86376k99879l07184l08928l05618
49976D368149k98022k86936k72913k56467k38337k19327k00013j80637j61371
49967B254126j42742j25779j11449r9688q9295p9182o9546o1422n5235n0277m5594
49956A323917m0987l7004l4185l2423l0976k9234k7477k6550k6671k7008k6725
49945I84677k5933k5141k4324k3132k1639k0156j8651j7064j5764j4914j3773
49934G64186j1643r183p605o848n794m324l622m082m352l177j131M09J070J392
$$ y = [3751571, 4060987, 4374003, 4677829, 4960128, 5212440, 5432351, 5623128, 5791517, 5945315, 6091558, 6235077, 6377290, 6515470, 6642623, 6748008, 6818648, 6842136, 6809882, 6719078, 6572490, 6376932, 6141536, 5876134, 5589758, 5289879, 4982695, 4673767, 4368149, 4070127, 3783191, 3510278, 3253811, 3015474, 2796147, 2596134, 2415497, 2254126, 2111384, 1985605, 1874156, 1774468, 1685173, 1605991, 1536445, 1475023, 1419788, 1369511, 1323917, 1282930, 1245926, 1211741, 1179318, 1148342, 1119108, 1091631, 1065081, 1038410, 1011402, 984677, 958744, 933603, 909279, 886147, 864508, 844352, 825701, 808637, 792873, 777959, 764186, 752543, 743360, 735755, 728907, 723113, 718789, 715167, 711085, 706733, 703556, 702425, 702834, 703904, 705296]
49920G05296J601J484J134R71J103J258J295J359J606J990K283K304K331L123
49906G29138N070P486R394J0954J3244J6543J9889K2635K5450K9256L4112L9874
49894I63045M7080N6287O7131P9001R2180J07522J25217J44557J64619J84297
49884B030936K01715K14215K19072K14226J98974J74626J44491J12769Q3415N9822
49874C654261M4482L8046L8724M2954M6429M4610L3436J0826k2455o3528j08490
49863C759295j52518j90219k17453k32983k37895k33835k22503k06227j87591
49854A878071j68337j49225j30860j13902r8548q4682p2554o2566n4444m7410
49844H95543m1227l6252l2418k8991k5553k2458k0053j8062j6143j4442j3222
$$ y = [705296, 706897, 708381, 709515, 710486, 711589, 712847, 714142, 715501, 717107, 719097, 721380, 723684, 726015, 729138, 734208, 741694, 751088, 762042, 775286, 791829, 811718, 834353, 859803, 889059, 923171, 963045, 1010125, 1066412, 1133543, 1212544, 1304724, 1412246, 1537463, 1682020, 1846639, 2030936, 2232651, 2446866, 2665938, 2880164, 3079138, 3253764, 3398255, 3511024, 3594439, 3654261, 3698743, 3736789, 3775513, 3818467, 3864896, 3909506, 3942942, 3953768, 3931313, 3867785, 3759295, 3606777, 3416558, 3199105, 2966122, 2728227, 2494392, 2271889, 2065662, 1878071, 1709734, 1560509, 1429649, 1315747, 1217199, 1132517, 1059963, 997397, 942953, 895543, 854316, 818064, 785646, 756655, 731102, 708644, 688591, 670529, 654386, 639944, 626722]
49833F26722j2343j1468j0454r307q079o986o240n725n186m872n367o541p310
49820E26844o880n747m971m759m449l663k837k505k584k580k190j558j113j285
49806D79723k144l217l852l975m139m628m813l940k386j445j713k324k218j525
49792D37404j145j380j739j901k034k091j638o54J52J63m36r70r72l64N71J240
49776D24206J167N79J32M7j3j57p0K30K15k15m26r5K46J92K40Q04J278R97N18
49757D29875Q53J802K188J663J098J119J261R06K29k17k09J84R66K089L246L967
49741D51020L888K934J507M39L84J183J992K011J055l63j290j039N5P82M63j97
49725D64824j05P06J269J117O45J29p38k013l006l023k222j330q02n73m03k09
$$ y = [626722, 614379, 602911, 592457, 583150, 575071, 568085, 561845, 556120, 550934, 546062, 540695, 534154, 526844, 519964, 514217, 509246, 504487, 500038, 496375, 493538, 491033, 488449, 485869, 483679, 482121, 481008, 479723, 477579, 474362, 470510, 466535, 462396, 457768, 452955, 449015, 446629, 445184, 443471, 441147, 438929, 437404, 436259, 434879, 433140, 431239, 429205, 427114, 425476, 424822, 424974, 425137, 424701, 423731, 422759, 422395, 422966, 424206, 425373, 425952, 426084, 426131, 426118, 425961, 425891, 426121, 426336, 426121, 425695, 425600, 425846, 426038, 426278, 427082, 428360, 429357, 429875, 430728, 432530, 434718, 436381, 437479, 438598, 439859, 440765, 440994, 440777, 440568, 440752, 441718, 443807, 447053, 451020, 454908, 457842, 459349, 459788, 460172, 461355, 463347, 465358, 466413, 466050, 464760, 463721, 463776, 464558, 465021, 464824, 464719, 465425, 466694, 467811, 468456, 468585, 467847, 465834, 462828, 459805, 457583, 456253, 455451, 454878, 454475, 454266]
49709D54266j49l90q10j060j098j351k021k525k180j247n57k64J63P58P63j40
49693D42158j122j277p04r0K98N45N29J31k43q8L75M31j16p42r97r69q06m16J66
49674D37063N76O47P32J084J328J015M77N13J233J849J759J270R98J092J342J707
49658D54685K223K708K967L089L131K847K169J646J826K426K720K593K522K694
49644D90246K840K929L168L354L060K632L035M397N594N700N089M624M531M639
49630E45838N004N603N939N657N105M645L979K763J478Q89J015J300J510J799
49616E92524K134K313K383K479K476K343K476L174M049M629N135O021P032P496
49602F46664P372P348P927R017J0291J1397J2001J2158J2483J3404J4486J5038
$$ y = [454266, 454117, 453727, 452917, 451857, 450759, 449408, 447387, 444862, 442682, 441435, 440878, 440614, 440777, 441535, 442298, 442158, 441036, 439759, 439055, 438965, 439263, 439808, 440337, 440468, 440225, 440137, 440512, 440943, 440827, 440085, 439088, 438119, 437313, 436897, 437063, 437639, 438286, 439018, 440102, 441430, 442445, 442922, 443435, 444668, 446517, 448276, 449546, 450544, 451636, 452978, 454685, 456908, 459616, 462583, 465672, 468803, 471650, 473819, 475465, 477291, 479717, 482437, 485030, 487552, 490246, 493086, 496015, 499183, 502537, 505597, 508229, 511264, 515661, 521255, 526955, 532044, 536668, 541199, 545838, 550842, 556445, 562384, 568041, 573146, 577791, 581770, 584533, 586011, 586900, 587915, 589215, 590725, 592524, 594658, 596971, 599354, 601833, 604309, 606652, 609128, 612302, 616351, 620980, 626115, 632136, 639168, 646664, 654036, 661384, 669311, 678328, 688619, 700016, 712017, 724175, 736658, 750062, 764548, 779586]
49590G79586J5103J5256J5731J6400J7345J8694K0104K1103K1838K2799K3962
49579I87921K4924K5705K6704K7949K9091L0043L1002L1915L2635L3394L4449
$$ y = [779586, 794689, 809945, 825676, 842076, 859421, 878115, 898219, 919322, 941160, 963959, 987921, 1012845, 1038550, 1065254, 1093203, 1122294, 1152337, 1183339, 1215254, 1247889, 1281283, 1315732]
$$ [...]
##END NTUPLES=NMR SPECTRUM
##END=
