##TITLE=NES1052_944593_9270656_77ro0bMBqx
##JCAMPDX= 6.0         $$ Bruker NMR JCAMP-DX V2.0
##DATA TYPE= NMR SPECTRUM
##DATA CLASS= NTUPLES
##ORIGIN= BRUKER
##OWNER= Administrator
$$ 1.72 TOPSPIN		Version 2.1
$$ 2015-07-11 21:44:38.785 -0700  Administrator@X
$$ Compression mode = diff/dup
##.OBSERVE FREQUENCY= 400.02188249412
##.OBSERVE NUCLEUS= ^1H
##.ACQUISITION MODE= SIMULTANEOUS (DQD)
##.ACQUISITION SCHEME= undefined
##.AVERAGES= 8
##.DIGITISER RES= 22
##SPECTROMETER/DATA SYSTEM= spect
##.PULSE SEQUENCE= zg30
##.SOLVENT NAME= COFFEE_meoh
##.SHIFT REFERENCE= INTERNAL, COFFEE_meoh, 1, 14.98509
##AUDIT TRAIL= $$ (NUMBER, WHEN, WHO, WHERE, PROCESS, VERSION, WHAT)
$$ ##TITLE= Audit trail, TOPSPIN		Version 2.1
$$ ##JCAMPDX= 5.01
$$ ##ORIGIN= Bruker BioSpin GmbH
$$ ##OWNER= Administrator
$$ $$ E:\/data/COFFEE/nmr/NES1052_944593_9270656_77ro0bMBqx/10/pdata/1/auditp.txt
$$ ##AUDIT TRAIL=  $$ (NUMBER, WHEN, WHO, WHERE, PROCESS, VERSION, WHAT)
(   1,<2015-07-11 21:44:31.472 -0700>,<Administrator>,<X>,<go>,<TOPSPIN 2.1>,
      <created by zg
	started at 2015-07-11 21:43:25.566 -0700,
	POWCHK enabled, PULCHK disabled,
       configuration hash MD5:
       21 0F 79 D6 B3 7B B4 F6 88 20 88 DB 03 48 BD 9F
       data hash MD5: 64K
       82 5E 47 EB 73 85 40 6E 6D C3 1C 66 DF C1 16 CA>)
(   2,<2015-07-11 21:44:34.628 -0700>,<Administrator>,<X>,<proc1d>,<TOPSPIN 2.1>,
      <Start of raw data processing
       efp LB = 0 FT_mod = 6 PKNL = 1 PHC0 = 0 PHC1 = 0 SI = 32K 
       data hash MD5: 32K
       EA A3 90 50 EC 6B 99 1B EE 2E BF 9D 96 D3 66 7F>)
(   3,<2015-07-11 21:44:34.910 -0700>,<Administrator>,<X>,<proc1d>,<TOPSPIN 2.1>,
      <pk PHC0 = 91.61499 PHC1 = 0 
       data hash MD5: 32K
       56 DD 92 12 AF 09 03 57 E9 00 39 6B 44 8D CB E8>)
(   4,<2015-07-11 21:44:35.035 -0700>,<Administrator>,<X>,<proc1d>,<TOPSPIN 2.1>,
      <abs ABSG = 1 
       data hash MD5: 32K
       88 10 D4 8B 3D 5C 16 FA 47 62 FD 44 39 A6 61 39>)
(   5,<2015-07-11 21:44:35.097 -0700>,<Administrator>,<X>,<proc1d>,<TOPSPIN 2.1>,
      <abs ABSG = 2 
       data hash MD5: 32K
       3B AA F7 1A AC EB 16 A0 3E DB 37 A4 4E 91 26 D8>)
(   6,<2015-07-11 21:44:35.160 -0700>,<Administrator>,<X>,<proc1d>,<TOPSPIN 2.1>,
      <abs ABSG = 3 
       data hash MD5: 32K
       F3 1F 7B 86 C0 27 F3 15 70 32 A9 D2 96 D7 69 5B>)
(   7,<2015-07-11 21:44:35.222 -0700>,<Administrator>,<X>,<proc1d>,<TOPSPIN 2.1>,
      <abs ABSG = 4 
       data hash MD5: 32K
       F0 0B A7 80 2F F1 CE 4A A2 87 D4 FA 0F 54 C5 77>)
(   8,<2015-07-11 21:44:35.285 -0700>,<Administrator>,<X>,<proc1d>,<TOPSPIN 2.1>,
      <abs ABSG = 5 
       data hash MD5: 32K
       75 77 1D 44 FF 90 43 36 46 A7 16 A9 B0 2F 05 96>)
$$ ##END=
$$ 
$$ $$ hash MD5
$$ $$ 49 34 EE EA 35 29 AB 32 33 B2 5C 2E BD 7E 64 B3
##$RELAX= 
##$RELAX= 
##$RELAX= 
##$RELAX= 
##$RELAX= 
##$RELAX= 
##$RELAX= 
$$ Bruker specific parameters
$$ --------------------------
##$DU= <E:\>
##$EXPNO= 10
##$NAME= <NES1052_944593_9270656_77ro0bMBqx>
##$PROCNO= 1
$$ [...]
150 150 150 150 150 150 150 150
##$TP07= 0
##$TPNAME0= <>
##$TPNAME1= <>
##$TPNAME2= <>
##$TPNAME3= <>
##$TPNAME4= <>
##$TPNAME5= <>
##$TPNAME6= <>
##$TPNAME7= <>
##$TPOAL= (0..7)
0.5 0.5 0.5 0.5 0.5 0.5 0.5 0.5
##$TPOFFS= (0..7)
0 0 0 0 0 0 0 0
##$TUNHIN= 0
##$TUNHOUT= 0
##$TUNXOUT= 0
##$USERA1= <user>
##$USERA2= <user>
##$USERA3= <user>
##$USERA4= <user>
##$USERA5= <user>
##$V9= 5
##$VALIST= <valist>
##$VCLIST= <CCCCCCCCCCCCCCC>
##$VD= 0
##$VDLIST= <DDDDDDDDDDDDDDD>
##$VPLIST= <PPPPPPPPPPPPPPP>
##$VTLIST= <TTTTTTTTTTTTTTT>
##$WBST= 2048
##$WBSW= 25
##$XGAIN= (0..3)
0 0 0 0
##$XL= 0
##$YL= 0
##$YMAX_a= 618799
##$YMIN_a= -517044
##$ZGOPTNS= <>
##$ZL1= 120
##$ZL2= 120
##$ZL3= 120
##$ZL4= 120
##$ABSF1= 14.98509
##$ABSF2= -5.573092
##$ABSG= 5
##$ABSL= 3
##$ALPHA= 0
##$AQORDER= 0
##$ASSFAC= 0
##$ASSFACI= 0
##$ASSFACX= 0
##$ASSWID= 0
##$AUNMP= <proc_prof1d_extract_pilot.lims>
##$AXLEFT= 0
##$AXNAME= <>
##$AXNUC= <1H>
##$AXRIGHT= 0
##$AXTYPE= 0
##$AXUNIT= <>
##$AZFE= 0.1
##$AZFW= 0.1
##$BCFW= 0
##$BC_mod= 0
##$BYTORDP= 0
##$COROFFS= 0
##$CY= 15
##$DATMOD= 1
##$DC= 0
##$DFILT= <>
##$DTYPP= 0
##$F1P= 0
##$F2P= 0
##$FCOR= 0.5
##$FTSIZE= 32768
##$FT_mod= 6
##$GAMMA= 0
##$GB= 0
##$INTBC= 1
##$INTSCL= 1
##$ISEN= 128
##$LB= 0
##$LEV0= 0
##$LPBIN= 0
##$MAXI= 10000
##$MC2= 0
##$MEAN= 0
##$ME_mod= 0
##$MI= 0
##$NCOEF= 0
##$NC_proc= -8
##$NLEV= 6
##$NOISF1= 0
##$NOISF2= 0
##$NSP= 0
##$NTH_PI= 0
##$NZP= 0
##$OFFSET= 14.98509
##$PC= 1
##$PHC0= 91.61499
##$PHC1= 0
##$PH_mod= 1
##$PKNL= yes
##$PPARMOD= 0
##$PPDIAG= 0
##$PPIPTYP= 0
##$PPMPNUM= 2147483647
##$PPRESOL= 1
##$PSCAL= 4
##$PSIGN= 0
##$PYNMP= <proc.py>
##$REVERSE= no
##$SF= 400.02
##$SI= 32768
##$SIGF1= 0
##$SIGF2= 0
##$SINO= 400
##$SIOLD= 32768
##$SPECTYP= <>
##$SREGLST= <1H.CDCl3>
##$SSB= 0
##$STSI= 32768
##$STSR= 0
##$SW_p= 8223.68421052631
##$SYMM= 0
##$S_DEV= 0
##$TDeff= 65536
##$TDoff= 0
##$TI= <>
##$TILT= no
##$TM1= 0
##$TM2= 0
##$TOPLEV= 0
##$USERP1= <user>
##$USERP2= <user>
##$USERP3= <user>
##$USERP4= <user>
##$USERP5= <user>
##$WDW= 1
##$XDIM= 32768
##$YMAX_p= 449647224
##$YMIN_p= -678597
##$CURPLOT= <Network HP LaserJet P1505>
##$CURPRIN= <$Network HP LaserJet P1505>
##$DFORMAT= <normdp>
##$LAYOUT= <+/1D_H.xwp>
##$LFORMAT= <normlp>
##$PFORMAT= <normpl>
##$SURQMSG= 1
$$ End of Bruker specific parameters
$$ ---------------------------------
##NTUPLES= NMR SPECTRUM
##VAR_NAME=  FREQUENCY,     SPECTRUM/REAL,   SPECTRUM/IMAG
##SYMBOL=    X,             R,               I
##VAR_TYPE=  INDEPENDENT,   DEPENDENT,       DEPENDENT
##VAR_FORM=  AFFN,          ASDF,            ASDF
##VAR_DIM=   32768,         32768,           32768
##UNITS=     HZ,            ARBITRARY UNITS, ARBITRARY UNITS
##FACTOR=    0.250966925370066, 1,           1
##FIRST=     8223.43324360094, -217988,      -121076
##LAST=      0,             -58556,          -171938
##MIN=       0,             -678597,         0
##MAX=       8223.43324360094, 449647224,    0
$$ Real data points
##PAGE= N=1
##DATA TABLE= (X++(R..R)), XYDATA
$$ [...]
19484a99763B3971b88393P717g0924k10520O4207a03079p4742J2625A56064G462
19472e2l4826k74189i6166k2763j5558p325j51533C246a19185I3690b74509c9058
19459d9601q3372f1109A18794a01397j72989d2984G4649B8756a51113O8742q4850
19448a67221k0460P3091m8902o4690J4913g18n71474a97726Q6643o1607g5655
19436a39806N9518j97530a16582M740K5625k16322d8287k96510h0212j04965D1137
19424G7014b1532A02525c7295k25710k7132J3086K4386B0927J79432b50802N5395
19413a95407B13308I557f5689A82018g9383J3415D9609a96572e5328j45196O6516
19402a34008a4479n4354j54318E7743o193c67737a33889N3458r2679B33039g4721
$$ plain form
19484 -199763 23971 -288393 -280676 -70924 -281444 -217237 -103079 -177821 -165196 156064 7462
19472 -52 -34878 -309067 -96166 -118929 -134487 -141812 -293345 3246 -119185 93690 -274509 -39058
19459 -49601 -132973 -61109 118794 -101397 -274386 -42984 74649 28756 -151113 -82371 -167221
19448 -167221 -187681 -114590 -163492 -228182 -213269 -718 -572192 -197726 -111083 -172690 -75655
19436 -139806 -80288 -277818 -116582 -111842 -86217 -302539 -48287 -344797 -80212 -185177 41137
19424 77014 -21532 102525 -37295 -263005 -290137 -277051 -252665 20927 200359 -250802 -195407
19413 -195407 213308 9557 -65689 182018 -79383 -65968 49609 -196572 -55328 -200524 -134008
19402 -134008 -14479 -68833 -223151 57743 51550 -367737 -133889 -80431 -173110 233039 -74721
19390b96045O8370A21306J12739a58690A35815b01334j83064B13539a88944O4728
19380a24216k06485J12542j31030J34597j02690e7261k688k43943O587J39107
19370a58198b4759B24042i3066C20472c195m3500k2178D4180c3898C7282b23344
19358h5529n6808r6677G71g9745b6757j11971p44I024a68537A98410G9122a53893
19345b13246a02591j02257a0151k42271A83115a41609B34207A08706a61225e5100
19334f3160l6209l3206M1470b7530k85172J06651A1773a0263l9187G9793h8974
19322a45370A00125c27546D9090A7119J03273c03133A11924J16832a47885c0338
19311d36237c6568k08422b1078m5735o0661E288b36991A34107B1030a72892A17018
$$ plain form
19390 -296045 -227675 121306 234045 -158690 135815 -201334 -384398 213539 -188944 -124216
19380 -124216 -330701 -218159 -349189 -214592 -317282 -57261 -59949 -303892 -297305 -158198
19370 -158198 -24759 224042 -93066 320472 -3195 -46695 -68873 44180 -33898 37282 -223344
19358 -85529 -142337 -239014 771 -79745 -26757 -138728 -139472 9024 -168537 198410 79122 -153893
19345 -213246 -102591 -204848 -10151 -252422 183115 -141609 234207 108706 -161225 -55100
19334 -63160 -99369 -132575 -91105 -27530 -312702 -206051 11773 -10263 -49450 79793 -88974
19322 -145370 100125 -327546 49090 17119 120392 -303133 111924 228756 -147885 -30338
19311 -436237 -36568 -244990 -21078 -66813 -127474 5288 -236991 134107 21030 -172892 117018
19299f4303B10399a4939l19852j20619B9110b30018D6049e2501r0564B51490g4995
19287b20177A40525c5959j18800H346g5407j71516Q6104B26612I2520a67706K5666
19276a42040C0486e3534j21244f9467B0603f05632b88317I1464A7341b9708j04578
19265a34286M2983I8184b96955L201A10273A8709a46199k58112a0023A05474b68701
19253i0990C4668C319a18870E483J68548E2031J25743l2682m2734d7343A52857
19241a56714J2970a396q0877k46487e1865l76756a55069L8153I7617A877b03983
19229B17353b76689a36582j21713O8645R3002H7027i160r5608l19988F9287p736
19218F1551a65745g7885A4068a41332a724F0885b52349a15759A58739B6317c7109
$$ plain form
19299 -64303 210399 -14939 -334791 -455410 29110 -230018 46049 -52501 -143065 251490 -74995
19287 -220177 140525 -35959 -154759 8346 -75407 -246923 -160819 226612 92520 -167706 -142040
19276 -142040 30486 -53534 -174778 -69467 20603 -605632 -288317 91464 17341 -29708 -134286
19265 -134286 -91303 98184 -296955 -293754 110273 18709 -146199 -404311 -10023 105474 -268701
19253 -90990 34668 3319 -118870 5483 174031 52031 177774 145092 102358 -47343 152857
19241 -156714 -143744 -1396 -82273 -328760 -51865 -428621 -155069 -116916 97617 1877 -203983
19229 217353 -276689 -136582 -258295 -189650 -96648 87027 -9160 -104768 -424756 69287 61551
19218 61551 -165745 -77885 14068 -141332 -1724 60885 -252349 -115759 158739 26317 -37109
19206a50604F6397h4827A34898D8885K3993b12812f0288k6669k16277G4015e2339
19194E9082a33885a8144H7655b94569h9977j1742B278a67704e1236B15605a65905
19182A54335a38329B09046A9131a84564J3515n5001R3216O621o4429j18261R4011
19171b14892L1382k36431i8469B23255D4546b06479h561m01036B2150M4048h253
19159a44979I3630k7667j4272B1289J63570J28934A1270b26835f4554j04991O1437
19148a08108A4540h3948C1113b79162a0505k21964A81473b69536C0857b87771
19137c02759J21207n266b9694j85728n1009L8936E8421d815q5382j86029C29718
19125b27765k05956f8723o068B9137R7632g7300j27027b546H7085J81029c0625
$$ plain form
19206 -150604 66397 -84827 134898 48885 72878 -212812 -60288 -86957 -303234 74015 -52339
19194 59082 -133885 -18144 87655 -294569 -89977 -101719 2278 -167704 -51236 215605 -165905
19182 154335 -138329 209046 19131 -184564 -171049 -226050 -132834 -126213 -190642 -308903 -214892
19171 -214892 -183510 -419941 -98469 223255 44546 -206479 -8561 -409597 22150 66198 -8253
19159 -144979 93630 65963 51691 21289 184859 313793 11270 -226835 -64554 -169545 -108108
19148 -108108 14540 -83948 31113 -279162 -10505 -232469 181473 -269536 30857 -287771
19137 -302759 -181552 -186818 -29694 -215422 -266431 -227495 58421 -4815 -90197 -276226 329718
19125 -227765 -433721 -68723 -74791 29137 126769 -77300 -204327 -2546 87085 268114 -30625
19113H8231B8479R5225a25205A16734c66155d7734B7161b04977f8171O175m7787
19102a09783E0479a83390C12695a21366j65729F7350B5052a6846o6387A40160
19091b51993L989H5550a67205l4451g5787b3520B5221J58243I0012b75776K5354
19080b50422P8760E499N8794a86046A6589a02309j2073p8005a5292j19378M8051
19069h6619n6865b1099A94451a67242C9000Q2760c0480j25122C8622c84609A52147
19057b56760B6227b15713Q0342D1418L64J2217a47010J5563n902j66897A40088
19045A37573i7074l9836L1729k6231a4830B93865b06322A1675J46216e7513C36522
19033a29088j05168i5101G0042J30607e6435H7967B3232d5753H8557J96087j7812
$$ plain form
19113 88231 28479 123704 -125205 116734 -366155 -47734 27161 -204977 -68171 -61996 -109783
19102 -109783 50479 -183390 312695 -121366 -287095 67350 25052 -16846 -83233 140160
19091 -251993 -248004 85550 -167205 -201656 -75787 -23520 25221 183464 90012 -275776 -250422
19080 -250422 -171662 5499 64293 -186046 16589 -102309 -114382 -192387 -15292 -134670 -86619
19069 -86619 -143484 -21099 194451 -167242 39000 121760 -30480 -155602 38622 -384609 152147
19057 -256760 26227 -215713 -135371 41418 41782 53999 -147010 -131447 -137349 -304246 140088
19045 137573 -97074 -136910 -105181 -131412 -14830 293865 -206322 11675 157891 -57513 336522
19033 -129088 -234256 -95101 70042 200649 -56435 87967 23232 -45753 88557 284644 266832
19022B66832E1745B1026b63602D23128A5896a70328a6261F3816N2515C656P7219
19011H0875L3089m6637J11469a1030I3330f8623c2951o525H2255a82077C03483
18999c9426A09809a75244h2649A11396a86506c3365p1283A3877b23052k03529
18989d26581a95879d3500B50335a37686D8502M4577C5080d5021C2234g7892J0497
18978f7395B49450b08813O457g9870A56422a4370D99993L1493p0857A98380N1704
18967B50084j19039J90113a6755A26670b11456e920r2674H8208a63051p5723a4886
18955B02441b66138J15765a6770j16338A66350K0287E6316b46044l4994L3009
18945b48029a06726j78078a39811r4445a07561j07293h0373D9387a12276C19231
$$ plain form
19022 266832 51745 21026 -263602 423128 15896 -170328 -16261 63816 116331 3656 80875
19011 80875 113964 67327 178796 -11030 93330 -68623 -32951 -39476 82255 -182077 303483
18999 -39426 109809 -175244 -82649 111396 -186506 -33365 -104648 13877 -223052 -426581
18989 -426581 -195879 -43500 250335 -137686 48502 93079 35080 -45021 32234 -77892 -67395
18978 -67395 249450 -208813 -202356 -79870 156422 -14370 499993 531486 460629 198380 250084
18967 250084 131045 321158 -16755 126670 -211456 -5920 -98594 88208 -163051 -238774 -14886
18955 202441 -266138 -150373 -16770 -133108 166350 186637 56316 -246044 -281038 -248029
18945 -248029 -106726 -284804 -139811 -234256 -107561 -214854 -80373 49387 -112276 319231
18934A10223a95263k789C2084K58020i4433K8767A02329b13862a02476A58571
18923a40486N6419B0170M7992c64822H710a90535A46652r681l0332J51223k2004
18912B35858c20268B63557G5252M65293Q5020k6893q701A66155a7910D39824A30605
18900b47599k8101C5547a60004j177N9376J6695j62612c3100k52441g1125j0398
18889h1523c1657n09103A87012a60708E9563j0089f0080j60543I1514D0278c7810
18877d3998k19131j74980C4661F95M4449J25554a66840j6978I1545J67722b03395
18865b02883e8435R147A58211O7940D5035f6815B91945A0137P9435b57357N6279
18854b01078A73250d4294r6595C44508j57784F1249h5446A08236J72855p5650
$$ plain form
18934 110223 -195263 -198052 32084 290104 -94433 -65666 102329 -213862 -102476 158571
18923 -140486 -84067 20170 68162 -364822 8710 -190535 146652 136971 106639 257862 235858
18912 235858 -320268 263557 75252 540545 625565 598672 589971 166155 -17910 439824 130605
18900 -247599 -275700 35547 -160004 -161181 -101805 -85110 -247722 -33100 -285541 -71125 -81523
18889 -81523 -31657 -540760 187012 -160708 59563 49474 -60080 -220623 91514 40278 -37810
18877 -43998 -263129 -438109 34661 695 45144 170698 -166840 -183818 91545 259267 -203395
18865 -202883 -58435 -49288 158211 226151 45035 -66815 291945 10137 89572 -257357 -201078
18854 -201078 173250 -44294 -140889 344508 186724 61249 -85446 108236 281091 205441
18844B05441f1230K141k22942g4470A90812o9050b6249A7848a17444q5962j0576
18833b13982I9407a98610m437j19918a05203k38313C3008g750A93194E8277M9142
18822A07419B0205N0982d72643A41083g538C3608K49870j29594a35615M0908p5256
18811a69963C02502f941C24859Q7961a73351A85406i9640O997B97835C1792a05021
18799F6769J27821B5604P8874b6986l5908A07051c01912A38061n6329b63551J04255
18788a59296N3277A01466a75744G6069q397a17987B7485e45552a15055J3010l3312
18777a35357O4949A38266a0836A9671H693J58044f9679K9436A47774a80565A93750
18765B742f871A1814b01555B00503a31030L3554J6556j28224K9938B8231K470
$$ plain form
18844 205441 -61230 -59089 -282031 -74470 190812 121762 -26249 17848 -117444 -203406 -213982
18833 -213982 99407 -198610 -203047 -322965 -105203 -343516 33008 -7750 193194 58277 107419
18822 107419 20205 71187 -472643 141083 -7538 33608 283478 153884 -135615 -94707 -169963
18811 -169963 302502 -6941 324859 412820 -173351 185406 -99640 -92643 297835 31792 -105021
18799 66769 194590 25604 104478 -26986 -62894 107051 -301912 138061 81732 -263551 -159296
18788 -159296 -106019 101466 -175744 76069 67672 -117987 27485 -545552 -115055 -102045 -135357
18777 -135357 -70408 138266 -10836 19671 8693 166737 -69679 -40243 147774 -180565 193750
18765 2742 -6871 11814 -201555 200503 -131030 -97476 -80920 -209144 -179206 28231 30701
18754C0701M988K4733b13301Q9985N75B93665a96650L2152A65004a17928E8879
18742H548a22045o4665Q1985A39046d25955b0833p7804L2686k03938j69100a73974
18730E760c4689A64966d12229c0938o8738c4708o656H6206D2506N5278i7749D9555
18717C04517d6131A07797a82981B94507g1839r3128C2350e3131l09669B32432
18706a63118p9407o343A07209b80770k46369C14657a10750g37k17101b9550B01941
18694h6462q9189A9623R7844b78939B31454a03039J9315j16334Q8148k84439a89594
18682a58753A74772b1283j31163e3886j45184d3856E5133O1923k0195c8091k5018
18671f3109D6669a15595C07556c3271B134f6168A03293a84021H31K58074b3730
$$ plain form
18754 30701 35689 60422 -213301 -123316 -122741 293665 -196650 -164498 165004 -117928 58879
18742 8548 -122045 -186710 -104725 139046 -425955 -20833 -98637 -65951 -269889 -438989 -173974
18730 5760 -34689 164966 -412229 -30938 -99676 -34708 -41364 86206 42506 97784 -97749 49555
18717 304517 -46131 107797 -182981 294507 -71839 -164967 32350 -53131 -362800 232432
18706 -163118 -242525 -248868 107209 -280770 -527139 314657 -110750 -737 -217838 -29550 201941
18694 -86462 -175651 19623 117467 -278939 231454 -103039 -83724 -200058 -111910 -396349 -189594
18682 -158753 174772 -21283 -152446 -53886 -199070 -43856 55133 117056 96861 -38091 -63109
18671 -63109 46669 -115595 307556 -33271 2134 -66168 103293 -184021 831 258905 -23730
18659F3534c2682j00577e0300a2023A47847a20393l1470j9182K3839l9927B6274
18647C576K1735i6561J1591l6875N8395j55995G0206P9665a63332j10835a417
18635e5766J4755B54878A04563b61403R6910j30446R5463d2418q7743J5721L621
18624a10819B12639h4490k5095k77485b6716j42772B4789i4025J5669A69803K10081
18613C79884a50009l866J3871E9038b56442i7537B86672a60269k21495I119a4154
18601F268b66190d5035o4813A06714a4065k68219A58825J92380a38682c2838A51347
18589i6870A4728b03125B75499a50282h705j38776N6607F0445c2685D8957J30085
18578A79042a24135b6549A54729c20874F1936M8204e6431A85006G1306d5433B05720
$$ plain form
18659 63534 -32682 -133259 -50300 -12023 147847 -120393 -151863 -171045 -147206 -187133 26274
18647 3576 25311 -96561 -84970 -121845 -63450 -219445 70206 149871 -163332 -274167 -1417
18635 -55766 -41011 254878 104563 -261403 -164493 -294939 -199476 -42418 -130161 -114440 -110819
18624 -110819 212639 -84490 -109585 -387070 -26716 -169488 24789 -94025 -78356 169803 379884
18613 379884 -150009 -153875 -140004 59038 -256442 -97537 286672 -160269 -381764 9119 -14154
18601 6268 -266190 -45035 -109848 106714 -14065 -282284 158825 351205 -138682 -32838 151347
18589 -96870 14728 -203125 275499 -150282 -8705 -147481 -90874 60445 -32685 48957 179042
18578 179042 -124135 -26549 154729 -320874 61936 110140 -56431 185006 71306 -45433 205720
18566d03142a30054B10570i379j48733A04528J05155E3566b72142I2072c0591
18555F7781b50196G8408i4267k1670o2259l467o6594A58903D5383a07827a5621
18543a8296A25365a28155p9017C5241K25958h6368n1736F2633a58131O8166F9680
18531e8868j94062M5110P1099A0346f677m8118r0127N2905n5831D0059i5534b9251
18518h0088B4108a61747r9200A91259a13658j2758E1771c50423a21136j90103
18508c11239e4916J4147k55075A76970c72268B020a8894j35733A1159a50329f6417
18496a06048C7447b84492J27183j17241A857i7496l807j9407p6540j44330A71281
18484A45212J07271G2728i5455B4572b6527C69676a01927k8151A09794a27964
$$ plain form
18566 -403142 -130054 210570 -9379 -158112 104528 209683 53566 -272142 92072 -30591
18555 67781 -250196 78408 -94267 -115937 -178196 -181663 -248257 158903 45383 -107827 -15621
18543 -18296 125365 -128155 -207172 35241 261199 -86368 -138104 62633 -158131 -89965 69680
18531 -58868 -252930 -207820 -136721 10346 -6677 -54795 -144922 -92017 -147848 40059 -95534 -29251
18518 -80088 24108 -161747 -260947 191259 -113658 -126416 51771 -350423 -121136 -311239
18508 -311239 -54916 -40769 -295844 176970 -372268 2020 -18894 -154627 11159 -150329 -66417
18496 -106048 37447 -284492 -157309 -274550 1857 -97496 -101303 -120710 -197250 -341580 171281
18484 145212 252483 72728 -95455 24572 -26527 369676 -101927 -130078 109794 -127964
18473a28739a7613o6688C8756O902b91162H0839b15395c2779m3241k67999B54617
18461f0973j96459J02399A28400a63200j43432b0357C98756j55381E7015L1004
18451H8019d6772r2503A24024A6874c01796n4671A1930h0515C74070a76897H7898
18439C1917b62127A79344b64199K4662e6646F535J91016I505J59045f5151k05518
18428b70669H2930d9547A46269E7066K2964c3993n4727A205b7722H0434R4005
18417A74439c647k43512c1258i202l31841a69456A8620L617a83497A10480a32795
18405a82087B21948o3101a72672A6163b19557F2540N6435M2123c9131b918n7220
18394f0138j1403G9295b23206h2590H4402a12830B4330a59903Q856B07197b28882
$$ plain form
18473 -128739 -17613 -84301 38756 45658 -291162 80839 -215395 -32779 -76020 -344019 254617
18461 -60973 -257432 -155033 128400 -163200 -306632 -20357 398756 243375 57015 88019
18451 88019 -46772 -139275 124024 16874 -301796 -356467 11930 -80515 374070 -176897 87898
18439 31917 -262127 179344 -264199 -239537 -56646 6535 197551 9505 168550 -65151 -270669
18428 -270669 82930 -49547 146269 57066 80030 -33993 -88720 1205 -27722 80434 174439
18417 174439 -3647 -247159 -31258 -9202 -341043 -169456 18620 22237 -183497 110480 -132795
18405 -182087 221948 158847 -172672 16163 -219557 62540 118975 161098 -39131 -2918 -60138
18394 -60138 -71541 79295 -223206 -82590 84402 -112830 24330 -159903 -151047 207197 -228882
18382d4562k00848A11625B0525J05278d1870j32738h5819A12164g5087o7465m6132
18371a88684j83424B36256a6179j02583A44334a1466A59723a14472n8080M6022
18361a26530B86595a30966C01852F1851c38749d8230m070E5826a81836G4091J4637
18350H8728B209a20911F3505L7340a0271G9322a13658a6496D01228a90393A91244
18338a76559B1223f8835n0162A7175a37820A64714i704o8593C49391b28774M0071
18327a88703B0062J74542a89508B23014g4624H460J53221d15179J51814d5880
18316A25677J77418E3299A9258K97112c39584H2633c03782c4958C0468O8468b58966
18304c24790A9829K0604e8195m9108D0158b02902A10744c59766f5681b9723A18534
$$ plain form
18382 -44562 -245410 111625 20525 125803 -41870 -174608 -85819 112164 -75087 -142552 -188684
18371 -188684 -372108 236256 -16179 -118762 144334 -11466 159723 -114472 -172552 -126530
18361 -126530 286595 -130966 301852 61851 -338749 -48230 -52300 55826 -181836 74091 88728
18350 88728 2209 -120911 63505 100845 -10271 79322 -113658 -16496 401228 -190393 191244
18338 -176559 21223 -68835 -118997 17175 -137820 164714 -9704 -78297 349391 -228774 -188703
18327 -188703 20062 194604 -189508 223014 -74624 8460 161681 -415179 -263365 -45880
18316 125677 303095 53299 19258 316370 -339584 82633 -303782 -34958 30468 98936 -258966
18304 -324790 19829 40433 -58195 -107303 40158 -202902 110744 -359766 -65681 -29723 118534
18292A63715a80146A13399c09731J2160e4378A82565a5980k8681q1845F1648a42412
18280b9147l15083B2006J79821q2296c02468A68935B5593N0874b31991O7688A7970
18268B91138G1832K14252r5103q5884p290c60220A26817C0357c5638j4588B05974
18256A49828d1531k38098N5394C7451J09775K3849c33609a2098n5572a6776A42758
18244a45598j601B29627J377d3951j79245l01052a17613A1842f7851c3417A4269
18232i4147d6838j73739g2674A04817k4286a25350a1922n8306n882j72341A71971
18220a27477B97873M8658A44470J20509E6307b001k6949R01A78698c13954i4043
18208h4994I543K5505L6965C1370h0033j21285m1569A76260b48467j20983L6099
$$ plain form
18292 163715 -180146 113399 -309731 -297571 -54378 182565 -15980 -44661 -126506 61648 -142412
18280 -29147 -344230 22006 201827 119531 -302468 168935 25593 76467 -231991 -164303 17970
18268 291138 71832 286084 190981 105097 97807 -360220 126817 30357 -35638 -50226 205974
18256 149828 -41531 -279629 -224235 37451 147226 171075 -333609 -12098 -67670 -16776 142758
18244 -145598 -147199 229627 231004 -43951 -223196 -524248 -117613 11842 -67851 -33417 14269
18232 -94147 -46838 -220577 -72674 104817 80531 -125350 -11922 -70228 -76110 -248451 171971
18220 -127477 297873 346531 144470 264979 56307 -2001 -28950 -28049 178698 -313954 -94043
18208 -84994 9543 35048 72013 31370 -80033 -201318 -242887 176260 -248467 -369450 -333351
18197c33351Q9966A74101b90038h7757B47920M09a63770k5195j01035j9390f5150
18185g7106k3201C2882P1666J94472b73152K8416J01502c1351C52528A69642C3372
18173a89937B69872c7576L741l2652A53294O3209d2924A71615G0069L9706b94504
18161a01404d0809C901J00902J54951a8896p188r4889G9846K08888J5565h344
18149A45566G2240d67720K00446A23839E6330N2200j3664J06413G2229N8987e28880
18137d3513k05784J17291E7115d71700K08122A6017h7286B00641b23669A33273
18126h0234l3894A3938J14808b3086A19866D5214a57634A3035K38278G6542g4102
18114a37716K9277A89812e7155D8913K5599a0415b860p9982d1363m4871k88929
$$ plain form
18197 -333351 -243385 174101 -290038 -87757 247920 248329 -163770 -188965 -290000 -309390 -65150
18185 -77106 -100307 32882 104548 299020 -273152 -244736 -143234 -31351 352528 169642 33372
18173 -189937 269872 -37576 -33835 -66487 153294 216503 -42924 171615 70069 109775 -294504
18161 -101404 -40809 3901 104803 259754 -18896 -26084 -120973 79846 288734 304299 -8344
18149 145566 72240 -467720 -267274 123839 56330 108530 94866 201279 72229 131216 -528880
18137 -43513 -249297 -132006 57115 -471700 -263578 16017 -87286 200641 -223669 133273
18126 -80234 -114128 13938 128746 -23086 119866 45214 -157634 13035 251313 76542 -74102
18114 -137716 -108439 189812 -57155 48913 74512 -10415 -2860 -82842 -41363 -86234 -375163
18103c75163B11579c26472C38L5825b23230g1423B02451k9866h3369G1191M6751
18092A17942Q9338l329e880m0888l22269A64152b1793D1829b4419A73987j7019
18081A56968C0192a25499B7957J93223q5025N4422a41949O8836A64722h8751J546
18070h7205A84274g6736p0400B10629C938i1178B77222n5512a55989J00E0205
18058i1762l44313I841P4966a68235C1823J59165c52352J51143N7020E6743N2930
18047A09673c3907j74148a01125A28642J8438a34394H9943M1938c43125a3301
18036b29725o8176Q9759A38566a41712B45943E1953J4924a23255A05512b42637
18025i8180j1827C4450L16476c03248J33742A46123i2065C03952j23639a31882
$$ plain form
18103 -375163 211579 -326472 338 36163 -223230 -71423 202451 172585 -83369 71191 117942
18092 117942 207280 203951 -5880 -46768 -369037 164152 -21793 41829 -24419 173987 156968
18081 156968 30192 -125499 27957 221180 136155 190577 -141949 -73113 164722 -88751 -87205
18070 -87205 184274 -76736 -147136 210629 3938 -91178 277222 221710 -155989 -155889 50205
18058 -91762 -436075 9841 84807 -168235 31823 190988 -352352 -201209 -144189 56743 109673
18047 109673 -33907 -208055 -101125 128642 147080 -134394 89943 131881 -343125 -13301
18036 -229725 -297901 -208142 138566 -141712 245943 51953 66877 -123255 105512 -242637
18025 -98180 -110007 34450 350926 -303248 -169506 146123 -92065 303952 180313 -131882
18014c172r9174m8695e0313B36913O8281A0612K2458i3570C3977d05509a11574
18002B52141b5135G8429l6434O9667r4m1167J02458a41098A27153D9723f664k93265
17990b99929n897J24585A4454a46707m5587b323H6784h0755d104j53893f8204
17978a1952l0219J8350A30802c7166F2479b167A42025M835a5913j4429k55618
17967b85960A22412b41012B36777l5754b7648A62013E9509q652e7888E8666R278
17956F7944c60383A35284J26486J5355H2982I361i8314k1987M8139n2869I2064
17944a50539A78840E6728j8941P2115K81067a76347k01477A41363J20485a3808
17933a16196j35727j40546M199C10904B4633L55545r6897a46084B56854C4471
$$ plain form
18014 -3172 -102346 -151041 -50313 236913 305194 10612 33070 -93570 33977 -405509 -111574
18002 252141 -25135 78429 41995 111662 111568 70401 172859 -141098 127153 49723 -6664 -299929
17990 -299929 -305826 -181241 14454 -146707 -192294 -2323 86784 -80755 -4104 -157997 -68204
17978 -11952 -42171 -23821 130802 -37166 62479 -2167 142025 146860 -15913 -30342 -285960
17967 -285960 122412 -241012 236777 201023 -27648 162013 59509 50857 -57888 58666 67944
17956 67944 -360383 135284 261770 277125 82982 9361 -98314 -120301 -72162 -125031 92064
17944 -150539 178840 56728 37787 109902 390969 -176347 -377824 141363 261848 -13808
17933 -116196 -251923 -392469 -388270 310904 24633 380178 283281 -146084 256854 34471
17922b05894j13875I8049a54230B64864o6085H8047k9622L1179J54838G8494i4930
17910d0678j28197b8397j04090B48999r5576C7143f7083o6962N0989A89832b51192
17898b22104f4480E0685f2954j07231A15092d9024b1331j84937B3942K10685G134
17886G2340a26940A41772O8438a91757k21722I2364c8076q2480F7679d03866b1017
17874B19282a11311E7441a05450A74809K86318p8240h2300C02962A26576d0712
17863A36440a06045D11673b49196a19311m7776g1939o4364a6817G0077f9223G7953
17851f2235A2704B239D92K49861l8086a85392c2772j84752G4138J70241c04614
17839B6767R362e6328B98920b67153B28198b05418A36678K38658A53811K02892
$$ plain form
17922 -205894 -319769 98049 -154230 264864 198779 88047 58425 89604 244442 78494 -94930
17910 -40678 -168875 -28397 -132487 248999 153423 37143 -67083 -134045 -83056 189832 -251192
17898 -222104 -64480 50685 -62954 -170185 115092 -49024 -21331 -206268 23942 234627 7134
17886 72340 -126940 141772 210210 -191757 -413479 92364 -38076 -120556 67679 -403866 -21017
17874 219282 -111311 57441 -105450 174809 461127 382887 -82300 302962 126576 -40712
17863 136440 -106045 411673 -249196 -119311 -167087 -71939 -136303 -16817 70077 -69223 77953
17851 -62235 12704 2239 492 250353 212267 -185392 -32772 -217524 74138 244379 -304614
17839 26767 36129 -56328 298920 -267153 228198 -205418 136678 375336 153811 356703
17829C56703a28610F34958B61018b50919g2237B17254A06747Q3175a53073l1381
17819a84454F2966J633J53585m3926l6287l9216b03327c6600A71293n6934J53533
17808B67892o8576F9258g6987A53412a73977B45425p6175K68639j97347E1354
17797C67581j05974a65515B47817J24215a73848P6515A81441P6844a22629B21843
17786b12741L9894E0912J73582H7741J39469A04225J49661k5589G7203K18183
17776B95386i8403A90884r4982P8833n1346Q0070c6746l6791C27983E560d4750
17764E0346J83697n6998J91986f6436E0197k2200K15917a77072A52596a6441A0377
17752B49430a79147C97793A71362I935J16538c78033B13655p1743n2375L25017
$$ plain form
17829 356703 -128610 634958 261018 -250919 -72237 217254 106747 189922 -153073 -184454
17819 -184454 62966 64599 218184 174258 137971 98755 -203327 -36600 171293 114359 267892
17808 267892 199316 69258 -76987 153412 -173977 245425 169250 437889 240542 51354
17797 367581 261607 -165515 247817 372032 -173848 -97333 181441 258285 -122629 221843
17786 -212741 -172847 50912 224494 87741 227210 104225 253886 228297 77203 295386
17776 295386 -98403 190884 95902 174735 123389 203459 -36746 -73537 327983 5560 -44750
17764 50346 234043 177045 369031 -66436 50197 27997 243914 -177072 152596 -16441 10377
17752 249430 -179147 397793 171362 9935 126473 -378033 213655 141912 89537 414554
17742D14554b29436A43300a81867Q9860B7189i6963E6779b17437f2330J8742m7104
17731i0692A01528k0585a39481A31626L0692a3498A90710E6745k2915J77495I7599
17719I609a88764A13193O46762C16829D7141J98997m9562m3647m6172N6628l0268
17708A33117L30849A18698B4642f004B85010K2195H2603J5968c55692A77742o814
17697A70928g9591A33990l9736j8174b6797A63535c1587A75827C3012a22391n3224
17686a75615A68833a35433C1637J55793k1251b3694A7134d0626D13513a92929
17675a34423A86797g5338D5368c3878A88170H4423P1069J88467C2959e7962m369
17664f2331D53883a75198L9072N1607A16698f5786B51791g304B41442r3236C7670
$$ plain form
17742 414554 -229436 143300 -181867 -92007 27189 -96963 56779 -217437 -62330 -43588 -90692
17731 -90692 101528 80943 -139481 131626 162318 -13498 190710 56745 33830 211325 97599
17719 9609 -188764 113193 759955 316829 47141 246138 196576 152929 106757 163385 133117
17708 133117 463966 118698 24642 -6004 285010 307205 82603 98571 -355692 177742 170928
17697 170928 -79591 133990 94254 76080 -26797 163535 -31587 175827 33012 -122391 -175615
17686 -175615 168833 -135433 31637 187430 166179 -23694 17134 -40626 413513 -192929
17675 -134423 186797 -75338 45368 -33878 188170 84423 155492 343959 32959 -57962 -62331
17664 -62331 453883 -175198 -136126 -84519 116698 -65786 251791 -7304 241442 148206 37670
17652F2656J59734D8747J62556H0063b84392A73663K36720B1134R830i5134B67321
17640B35196a68477E713J76763b05497d4885A1975R3637K5248K11278j41885a49591
17628f9472C32705A53139c38839C92885f8090B13765k8859L3868d64647B7886
17617c6213A38867E7964f8750A02191L51955h4390A74067L18640B5005R5627b45770
17605c7253q1375A52661R0955p8126b88314M9096A44347b05700C12522j6193j37754
17594A58575g3372A07494k199L04452a4180A90238k1860J43317D8642J47922B1724
17582C0140K34006j23008a8882C31735A36758b3596A92495m3549K60592M7025
17572D56563D8282B0994d729D05546j53214K30107F208K28166P465G1130J71379
$$ plain form
17652 62656 222390 48747 211303 80063 -284392 173663 410383 21134 30964 -95134 267321
17640 235196 -168477 5713 182476 -205497 -44885 11975 105612 130860 342138 200253 -149591
17628 -69472 332705 153139 -338839 392885 -68090 213765 184906 218774 -464647 27886
17617 -36213 138867 57964 -68750 102191 454146 -84390 174067 492707 25005 120632 -245770
17605 -37253 -118628 152661 243616 165490 -288314 -239218 144347 -205700 312522 296329 158575
17594 158575 -73372 107494 105295 409747 -14180 190238 168378 311695 48642 196564 21724
17582 30140 264146 141138 -18882 331735 136758 -23596 192495 148946 409538 456563
17572 456563 48282 20994 -4729 405546 252332 482439 6208 234374 241839 71130 242509
17561B42509i413C56605J92228A40682M7288I1950j199l3897Q4390b0757B6685
17549b1786D31950j22384b33046b2949D4246J79916J4233q2298K28829j00689
17539B84237R6153c5877B97776A28460Q4294M5868E2674K30767j6216G4205L48374
17528D22579J51188j450K75730J64117K01381k43842r7259k40564k4148j9230
17518E88502B83040m6523K14074J12816J22838k73077L45673L460R0212o90K56840
17507A108663k86588k64308q6346A93962K20521p4653J3431q0888I6597J37718
17497B34315R0116O5774A67913l9321J95764O0891J3346J06763A75464l5725K35898
17486C75637q6674a12099C76736K9143k1270G2035K86714J82184J23190B63441
$$ plain form
17561 242509 -9413 356605 548833 140682 187970 91950 90751 56854 141244 -20757 26685
17549 -21786 431950 309566 -233046 -22949 44246 224162 238395 156097 384926 284237
17539 284237 380390 -35877 297776 128460 212754 258622 52674 283441 267225 74205 422579
17528 422579 573767 572317 848047 1012164 1213545 969703 872444 631880 607732 588502
17518 588502 283040 236517 450591 563407 686245 413168 758841 762301 852513 851823 1108663
17507 1108663 822075 557767 471421 193962 414483 339830 353261 272373 96597 234315
17497 234315 324431 390205 167913 128592 324356 385247 398593 505356 175464 139739 375637
17486 375637 288963 -112099 376736 405879 384609 72035 358749 540933 664123 263441
17475B81643j18761K50010j39027p37D807N17751B23484j00176b15064A63173
17464A00761Q527J76197J21662F6693M91616A41332Q0007B3946K93526j49704
17454A67768K87967A55800K56944A07487O4764K19981J22636K49507C81801J55961
17444E37762B05161K89959A57750L18485P3806O6469k40788K49853j78788n3572
17434C93215j22303H5023L28436j72345J0907J25643K14124k33567j8317O8926
17424D08830j60150D3909L07085r3540J06971A81165K0573J31510A14906L3676
17414A48582G3082M84238k26128O5616k2705K57975g7070B91248F4841L58965
17404D23806A78600l9841a22775E84581A64897L9815J7942P3547L11658B73021
$$ plain form
17475 281643 162882 412892 273865 273128 4807 522558 223484 123308 -215064 163173
17464 100761 109288 285485 407147 66693 558309 141332 221339 23946 317472 167768
17454 167768 455735 155800 412744 107487 172251 392232 514868 764375 381801 537762
17444 537762 205161 495120 157750 476235 550041 616510 375722 625575 446787 393215
17434 393215 270912 85023 413459 241114 252021 377664 591788 358221 339904 408830
17424 408830 248680 43909 350994 257454 364425 181165 201738 333248 114906 148582
17414 148582 73082 557320 331192 396808 374103 632078 -77070 291248 64841 423806
17404 423806 178600 138759 -122775 584581 164897 204712 222654 296201 607859 273021
17393B56709j0340p2388Q0327H1651L56972B15615R3374q5338L6655j17978K49676
17382C92004a41578C45378M7832g7747A11514L18092j60838j13334M29226A58739
17371B22065l4182K8283q4009B3255L50018O2897D5322N45881B56223N8924J29863
17360D45010G3567O8590N4131M4752h5609A82031J7253B6498J62052J53365j7889
17349C24026o163J05732j00895a32243d4936A14705J77257L7549j18622L4601
17339B45490L0383L9613h8849F0216J36009p7958N4479K04284A8046K24056o7983
17328A74119K36484j73856J84355j28606J67678r8238j41946A00377L08208I8069
17317A25048O7407j1955K66436j36366J84523a13453E19407j07718J55338k21579
$$ plain form
17393 256709 246369 173981 254308 81651 438623 215615 308989 223651 260306 142328 392004
17382 392004 -141578 345378 393210 -77747 111514 429606 268768 155434 584660 158739
17371 222065 187883 216166 132157 23255 373273 436170 45322 591203 256223 315147 445010
17360 445010 73567 142157 196288 241040 -85609 182031 199284 26498 188550 341915 324026
17349 324026 317863 423595 322700 -132243 -44936 114705 291962 329511 210889 245490
17339 245490 275873 315486 -88849 60216 196225 118267 172746 377030 18046 242102 174119
17328 174119 410603 236747 421102 292496 460174 361936 219990 100377 408585 98069
17317 125048 192455 180500 446936 310570 495093 -113453 519407 411689 567027 345448
17307C45448L33224H0656c8089F01673R648j68326j81984P1597n0495H9172L7354
17296A26526J72988O10313H530N54256B71821m4782L75812A35503M69362j96638
17286D08227J33590n1062A08728R5846a1777B18319R822J81407H9916K4359J84260
17275B98535J17065j99736K02136j25869n7107R7596J6401M5988k8570J24133
17265D90572r6958p4899L84891B11462J19361m1285j17475L39566O580k07533
17255C10676R6204J78551j21591A31934J15874N8334p9033J7040J00257Q6023
17245D30429A37290K05962K08560B55595L68025B93523j21666L9360K39896j63785
17235B87328M6898k7858F2375M10595j49107m328L12641J61588l19994n8767A57503
$$ plain form
17307 345448 678672 80656 -38089 601673 611321 442995 261011 332608 282113 89172 126526
17296 126526 299514 909827 8530 562786 271821 227039 602851 135503 604865 408227
17286 408227 541817 490755 108728 204574 -11777 218319 228141 409548 89916 114275 298535
17275 298535 415600 215864 418000 292131 235024 332620 349021 395009 366439 490572
17265 490572 393614 318715 703606 211462 330823 289538 172063 511629 518209 310676
17255 310676 406880 585431 463840 131934 247808 306142 227109 244149 344406 430429
17245 430429 137290 343252 551812 255595 623620 293523 171857 211217 451113 287328
17235 287328 334226 306368 62375 472970 323863 319535 632176 793764 473770 415003 157503
17223B22857Q8701O3212O738J12258q5633J34327c7645D98874B39483K61262j9056
17212D81689B26360J27452K54722j59716r9563M03759k8389j83328q3616M3287
17202E00968k34773L88033l9173k87399j53100L94330k69072Q8068A34593K95686
17192D30279J81457k95420J77078q1747B00891L69904k5400j90685M3258j01826
17182B96142J39361B11186J65192m2578J54299J23034k30644M46975C38249K09129
17172E47378J29793j76776o8216P2412J4480J5429j51378J02747n5899L78979
17162H08949C20591K12353M6739A18524L64685K887J44385O9404l35940L50702
17152G14647k09343l8731J98509L7613B62973L77552j07720j55822K1919J38392
$$ plain form
17223 222857 311558 374770 381508 493766 408133 542460 -37645 498874 239483 500745 481689
17212 481689 226360 353812 608534 448818 349255 753014 724625 541297 457681 500968
17202 500968 266195 654228 615055 327656 174556 568886 299814 387882 134593 430279
17192 430279 611736 316316 493394 411647 200891 570795 545395 354710 397968 296142
17182 296142 435503 211186 376378 333800 488099 611133 380489 827464 338249 547378
17172 547378 677171 500395 432179 504591 519071 534500 383122 485869 429970 808949
17162 808949 320591 532944 579683 118524 483209 486096 630481 699885 363945 714647
17152 714647 505304 466573 665082 702695 262973 640525 532805 376983 398902 537294
17142E37294k2255P0187R7484J94565j69165k18324K04737j81491O9447m4848
17132E37631j6285J31644j06330K39595l74930N01580l07908J5734o9434o0097
17122D91200J46993J44789j74377L05439j64442p0519q3204J3062j3810J55711
17112G50842l254k50502L44681k13458K14884O5060k19567R406J48296k82197
17102E64191L44837k69256L35371m84803K82865M2469m02195L55449J11091k52071
17092F27948J02865J18685j45040l26242P72279j08918E17356K17713n516L77059
17082A106612E10022K41897K9763O6598k63109L51840k82423J30255J1504k93528
17072E02819K52363J46788o9857j81043L72233k54091R988L50901m51078J71537
$$ plain form
17142 537294 515039 585226 682710 877275 708110 489786 694523 513032 582479 537631
17132 537631 521346 652990 546660 786255 411325 912905 604997 620731 551297 491200
17122 491200 638193 782982 608605 914044 749602 679083 595879 608941 595131 750842
17112 750842 747588 497086 841767 628309 843193 908253 688686 698092 846388 564191
17102 564191 909028 639772 975143 490340 773205 815674 413479 768928 880019 627948
17092 627948 730813 849498 704458 378216 1150495 1041577 517356 735069 729553 1106612
17082 1106612 510022 751919 781682 848280 585171 937011 654588 784843 796347 502819
17072 502819 755182 901970 832113 651070 1023303 769212 779200 1130101 679023 850560
17062H50560k55612M71323k41528L07500k25431K60595j25378j8554k52468K10295
17052I81302j8891J77539j42752q2529j46654L49321l99193m0189L65945K25425
17042A269324j18128J04103m73213J74819j38221p8959K62854J36317k6672j5600
17032A096624J07577k37525j23895K20232p7841N0600n8047N00339l53146j34818
17022I90100J09909J31921k85398K89297j94408q0688N09737j76147l0381N4255
17012A318197k884M7698k76598J6727o7826J12093Q6333j51592J51885R1576o9616
17001A255993O3172O4344j4787R7283O8003o3408j56587q6493L89851j57392o6436
16990A393543J36920j1877J46137L14101o40161L27036k03487j7560k11180M72506
$$ plain form
17062 850560 594948 1066271 824743 1132243 906812 1167407 1042029 1023475 771007 981302
17052 981302 962411 1139950 997198 914669 768015 1117336 718143 677954 1043899 1269324
17042 1269324 1151196 1255299 782086 956905 818684 739725 1002579 1138896 1112224 1096624
17032 1096624 1204201 966676 842781 1063013 985172 1035772 977725 1478064 1124918 990100
17022 990100 1100009 1231930 946532 1235829 1041421 960733 1470470 1294323 1263942 1318197
17012 1318197 1315313 1363011 1086413 1103140 1035314 1147407 1233740 1082148 1234033 1325609 1255993
17001 1255993 1319165 1383509 1368722 1466005 1534008 1470600 1314013 1227520 1617371 1459979 1393543
16990 1393543 1530463 1518586 1664723 1978824 1338663 1665699 1462212 1444652 1233472 1705978
16980A705978k80203r3369J16595M36448j92531L5693m85974N68753j50761Q8505
16970A749134j52986J46910k87285K57872j58952J14947p5778K98073O5525k55671
16960A701789R8177p7352O3736J81834K1851j62367j57670J59522k52798N05659
16950B082381k80159K74329l15308J0923K98202Q5927j6407P9586k77680N05093
16940B446887n31203J50802M17492n46262L13644J76843q3010K52554o02245L81112
16930B376614K10648m7432j03831k70141K79272j64493K53094j08667K99497j85529
16920B539032R2466J826j92352O0701O36338l21224k33320K81941k36911K25897
16910B854394j26098j7455K5863J69365p3529J22320L08213k4203q4121J80246
$$ plain form
16980 1705978 1425775 1332406 1449001 1885449 1692918 1728611 1242637 1811390 1660629 1749134
16970 1749134 1596148 1743058 1455773 1713645 1554693 1669640 1593862 1891935 1957460 1701789
16960 1701789 1799966 1722614 1786350 1968184 1990035 1827668 1669998 1829520 1576722 2082381
16950 2082381 1802222 2076551 1761243 1772166 2070368 2156295 2139888 2219474 1941794 2446887
16940 2446887 1915684 2066486 2483978 1937716 2251360 2428203 2345193 2597747 1995502 2376614
16930 2376614 2587262 2539830 2435999 2165858 2445130 2280637 2533731 2425064 2724561 2539032
16920 2539032 2631498 2633324 2440972 2501673 3138011 2816787 2583467 2865408 2628497 2854394
16910 2854394 2728296 2710841 2736704 2906069 2832540 2954860 3263073 3238870 3154749 3334995
16900C334995l6183j267J20119L5079J07323p2518j78744P3186M83913k37149
16890C628754J76412l09941J70781j89258j5242K43257k95395N70328k04464K52676
16880D027908j73768M66387j99988J09869R9177J92900j99496J34599J38601k22739
16870D373450K54808k455l5501K18464m07440M01887O3533L64706k87953R4352
16860E037851k5690L82907M8193j675K351L84580n17896L12200N468L03383q0418
16849E851254K0331L70733j72708K534P79772l79986K79073k66712L55170j38231
16839F701230L96656P4395P0573J48874L74575l91272P20994l40260J98981j6535
16829G938211M6690O07876k2260j04206M72176J4165L26327o5753L80850J24160
$$ plain form
16900 3334995 3298812 3297545 3417664 3452743 3560066 3487548 3308804 3381990 3865903 3628754
16890 3628754 3805166 3495225 3666006 3476748 3461506 3704763 3409368 3979696 3775232 4027908
16880 4027908 3854140 4320527 4120539 4230408 4329585 4522485 4322989 4457588 4596189 4373450
16870 4373450 4628258 4625803 4590302 4808766 4401326 4803213 4866746 5231452 4943499 5037851
16860 5037851 5012161 5395068 5443261 5441586 5443937 5828517 5310621 5622821 5628289 5931672 5851254
16849 5851254 5871585 6242318 6069610 6072144 6851916 6471930 6751003 6484291 6839461 6701230
16839 6701230 7097886 7172281 7242854 7391728 7766303 7375031 8096025 7755765 7954746 7938211
16829 7938211 7984901 8592777 8570517 8466311 8938487 8952652 9278979 9213226 9594076 9718236
16819I718236O86642n58057O69Q35142J25395j26168O22406N5739q669N75584
16809A1926919k1421M10115K58147J25841J84655L64055J42492L09768N27877
16800A4228448L03121L35720q6021O50236J37262M47009Q23336K5229O81817N8514
16790A7604671Q35474m3941O36882N15674L07467O75816N53557M66437O22889
16781B2174926N86102O71050L90349P42568Q54649N78352O01125Q68535Q01570
16772B8269226N34927J023413P07802O77194Q68102J271506Q40190J128930J249692
16763C6570982J094622J186549R35106Q12226J544187J536839J464685J074937
16755D6220133J641982J376744J510773J629626J835479J388798J949442J985465
$$ plain form
16819 9718236 10404878 9846821 9847490 10682632 10808027 10681859 11304265 11360004 11351335 11926919
16809 11926919 11905498 12315613 12573760 12699601 12884256 13248311 13390803 13700571 14228448
16800 14228448 14531569 14867289 14781268 15431504 15568766 16015775 16839111 16864340 17546157 17604671
16790 17604671 18440145 18396204 19033086 19548760 19856227 20532043 21085600 21552037 22174926
16781 22174926 22761028 23432078 23822427 24564995 25419644 25997996 26599121 27467656 28269226
16772 28269226 28804153 29827566 30535368 31212562 32080664 33352170 34192360 35321290 36570982
16763 36570982 37665604 38852153 39787259 40599485 42143672 43680511 45145196 46220133
16755 46220133 47862115 49238859 50749632 52379258 54214737 55603535 57552977 59538442
16747E9538442J814770J491276K155309K005480J898738K071275J777926K167053
16739G4920269K056083J988419J993706J969675J771187K177889K070385J531047
16731I0478660J871672J638416J463719J108389J410399Q28899J461749J79012
16723A00440915O81885N21448J31734k23914l6449m80854k92118j214524o04269
16714I8923854j176499j413104j264477j581454j484174j942974j798204j864470
16706H6398498j866075k129979j998443k011862k662081j335747k229976k251733
16698F9912602j859007k300853j445042k313579j649830j808047j859664j718071
16690E4958509j896986j401108j472762j578913j661050j258842j375790j245444
$$ plain form
16747 59538442 61353212 62844488 64999797 67005277 68904015 70975290 72753216 74920269
16739 74920269 76976352 78964771 80958477 82928152 84699339 86877228 88947613 90478660
16731 90478660 92350332 93988748 95452467 96560856 97971255 98800154 100261903 100440915
16723 100440915 101122800 101644248 101775982 101552068 101515619 101034765 100742647 99528123 98923854
16714 98923854 97747355 96334251 95069774 93488320 92004146 90061172 88262968 86398498
16706 86398498 84532423 82402444 80404001 78392139 75730058 74394311 72164335 69912602
16698 69912602 68053595 65752742 64307700 61994121 60344291 58536244 56676580 54958509
16690 54958509 53061523 51660415 50187653 48608740 46947690 45688848 44313058 43067614
16682D3067614j321916j451001j465640p09582j300379j350012o72041j177984
16674C3619059j025676r18421q83366q29526q75710o84771j052245m48201p10588
16665B6190555p35792j207500n60651l86517l62499o44437o29897n78091p73724
16656B0311447j75654q82940l25087l09469p46820k88654l80648m50674l57766
16647A6393735j45697m65244m58311L1558p52518k56753m12533k69439k3359l03180
16637A3338259m22021j86890m64785M6793m52704N808n13482n30278Q0608L76078
16627A1277386p98270l88325r129P517k51920m59320l4544O1423j76650j34341
16617I093827k80274l06810k1141k22596J89965m09889k17074j39376l14610R6531
$$ plain form
16682 43067614 41745698 40294697 38829057 38119475 36819096 35469084 34797043 33619059
16674 33619059 32593383 31674962 30791596 29962070 29086360 28401589 27349344 26901143 26190555
16665 26190555 25454763 24247263 23686612 23300095 22937596 22293159 21663262 21085171 20311447
16656 20311447 20135793 19252853 18927766 18618297 17871477 17582823 17202175 16751501 16393735
16647 16393735 16248038 15782794 15324483 15356041 14603523 14346770 13934237 13664798 13641439 13338259
16637 13338259 12916238 12729348 12264563 12311356 11858652 11864460 11350978 10820700 10901308 11277386
16627 11277386 10479116 10090791 10081662 10089179 9837259 9377939 9343395 9404818 9228168 9093827
16617 9093827 8813553 8506743 8485602 8263006 8452971 8043082 7826008 7686632 7372022 7468553
16607G468553o2450j41640k35600n7940j65471N1282j56148n7921j47524p4407
16597F420734k66352J77346K92880n13869l95647J70337J49974l16822j85389
16588E533192J82952m68776r4527J87455j40000j95440K86279k88126l52087K69251
16578D920173r7352m0141j37420M0912J33747m30773j52041L25865k52364j79980
16568D130626L55618p1239l35930M5743j95681j63216J68668k07368j00359P3336
16558C700198j0771m236k28338M16398m18667m6276K74284r395o7459j45726j45889
16547C314123P0329P4885r2951n70287M21445j72316m2598k43973J56315o6374
16537B848598J16174N1813n70024K66077j47091L20053o0943j15846j3435j86461
$$ plain form
16607 7468553 7406103 7264463 7028863 6970923 6805452 6856734 6700586 6642665 6495141 6420734
16597 6420734 6154382 6331728 6624608 6110739 5715092 5885429 6035403 5718581 5533192
16588 5533192 5716144 5247368 5152841 5340296 5200296 5004856 5291135 5003009 4650922 4920173
16578 4920173 4822821 4782680 4645260 4686172 4819919 4389146 4237105 4562970 4310606 4130626
16568 4130626 4486244 4415005 4079075 4124818 3929137 3765921 3934589 3727221 3626862 3700198
16558 3700198 3689427 3685191 3456853 3873251 3454584 3408308 3682592 3673197 3605738 3460012 3314123
16547 3314123 3384452 3459337 3366386 2796099 3217544 3045228 3002630 2758657 2914972 2848598
16537 2848598 2964772 3016585 2446561 2712638 2565547 2885600 2824657 2708811 2695376 2508915
16527B508915J32875K24866m86461o8453J90605K270l61460Q057P29076n50761
16517B329529M2203J43061m53834R9177R5769j20978j51986K65661K58762l31348
16507B176016q4561j05746j13450L94582l1933m37507J96305m9908J96732j25148
16497B015382M6791J64142m53604K66287m00342J48181j89364k71325N06354R3130
16487A925632k62006K82880q3221l59472M29552k79609K01176k80424O4052J35376
16477A773936p1446o0922n9884R6103j38649J96202l08859O5371j04158J83974
16467A571668O1766k37165M0912L51505J48387l63769m7829N5774j59137j3665
16457A408447j04405q9064K88491n0872l48896J30349L2118K6993l48550L41158
$$ plain form
16527 2508915 2641790 2866656 2380195 2311742 2502347 2504617 2143157 2151214 2880290 2329529
16517 2329529 2371732 2514793 2060959 2160136 2255905 2134927 1982941 2248602 2507364 2176016
16507 2176016 2091455 1985709 1872259 2266841 2234908 1797401 1993706 1943798 2140530 2015382
16497 2015382 2062173 2226315 1772711 2038998 1638656 1786837 1597473 1326148 1832502 1925632
16487 1925632 1663626 1946506 1863285 1503813 1933365 1653756 1854932 1574508 1638560 1773936
16477 1773936 1702490 1641568 1581684 1677787 1539138 1735340 1426481 1491852 1387694 1571668
16467 1571668 1633434 1396269 1437181 1788686 1937073 1573304 1525475 1581249 1422112 1408447
16457 1408447 1304042 1214978 1503469 1452597 1103701 1234050 1266168 1293161 944611 1285769
16447A285769l8275j48589j1123j578P2052N3341J68835n2025m3505k11824r755
16436A063323L41001l07741N12222r9124l77804k61263J97069j09213M56459l16753
16426A098176J25194K95749k97230j32873j03345K24702j59432o6513j50653L18432
16416A152207l05027P7142j1465k6553P2380j54691K92120p2920m2968j90791
16406G89434J77067o9022J33513P0789j35669Q950o4473n0790J79067Q7316m84432
16395F41750N35208k92966K2494J19472m85489M10211l01q3092J2688N6794J4629
16384I51398j44655L7998J91744l22813B97934N38174K7459J73185j57187k71887
16374F07678p8622J10301m627K98037k29489Q8410J8266j36847M44199k72353
$$ plain form
16447 1285769 1247494 1098905 1087782 1086204 1158256 1211597 1380432 1328407 1284902 1073078 1063323
16436 1063323 1404324 1096583 1608805 1509681 1131877 870614 1067683 958470 1414929 1098176
16426 1098176 1223370 1519119 1221889 1089016 985671 1210373 1050941 984428 833775 1152207
16416 1152207 847180 924322 912857 886304 958684 803993 1096113 1023193 980225 789434
16406 789434 966501 897479 1030992 1101781 966112 975062 910589 859799 1038866 1126182 641750
16395 641750 1176958 883992 906486 1025958 540469 950680 950379 867287 879975 936769 951398
16384 951398 806743 844741 1036485 713672 297934 836108 863567 1036752 879565 607678
16374 607678 529056 639357 634730 932767 703278 791688 809954 673107 1117306 844953
16364H44953k66461L19892k03345J07782m969l8272N5485k40159l964P732L20376
16353H99050j39658O9493l59589K03246l0290P8668J34207l12211L83058k41709
16343F84265Q511n9180l07063M30410l07111j21423L59822p370L1673k59742J44015
16332E96807J0425o6076L2644j22112J87909F9472N74289k67793M25612j76844
16322F24736k93487j28937L14576l2910J53069O0058k09545o6915J749L21926
16312G44320k18122K73136l46939J44980j62634n5709K94621j80418j77621J62761
16302D78375j36213J13047J34481J26391C1490L91713j59421K96322J26553C24645
16291D02570K7792J45670A83995J56821L49661A56792M48100k16247J4080G4412
$$ plain form
16364 844953 578492 898384 695039 802821 797852 759580 815065 574906 570942 578674 899050
16353 899050 759392 828885 469296 672542 642252 720920 855127 542916 925974 684265
16343 684265 692776 633596 326533 756943 449832 328409 688231 680861 712534 452792 596807
16332 596807 607232 541156 573800 451688 639597 69472 643761 375968 801580 624736
16322 624736 331249 202312 516888 483978 637047 697105 487560 420645 422394 744320
16312 744320 526198 799334 452395 597375 434741 379032 673653 493235 315614 478375
16302 478375 342162 455209 589690 716081 31490 423203 263782 560104 686657 324645
16291 402570 430362 576032 183995 340816 690477 156792 604892 388645 402725 74412
16280F02137A67122G0255N07156o4010k23653J31130N4110K8815j65999J8799
16270C56603J10093J9557A26541J54852Q9711K39717j11616r8262J93835B03599
16259E89001j31140J60862A42155J51346M1322P7873p3728J40187j01853J11452
16249D88754m7706K71175a4227E31091k29042J25249A54136K51897h863E43134
16238C99950j02778L8090j31482J01767A07129P8069K6875L28068p2099L7739
16228E05781A36012l3477J25670L94574l08826N1985K6458o1213r3108L81713
16218F19788k70019p3133J6093j36975K1532K34171r6014H5765J71643K31378
16208D88786B09271K17056j4251A53902J74947a06997b7671C69235C7381L27601
$$ plain form
16280 602137 167122 70255 577411 513401 289748 420878 474988 503803 337804 356603
16270 356603 466696 486253 126541 281393 371104 610821 499205 400943 594778 203599
16259 589001 457861 618723 142155 293501 334823 412696 338968 479155 377302 488754
16249 488754 441048 712223 -14227 531091 302049 427298 154136 406033 -8863 543134
16238 399950 297172 335262 203780 305547 107129 185198 212073 540141 468042 505781
16228 505781 136012 102535 228205 622779 313953 365938 392396 331183 238075 619788
16218 619788 349769 276636 292729 155754 177286 411457 315443 85765 257408 488786
16208 488786 209271 426327 412076 153902 328849 -106997 -27671 369235 37381 364982
16198C64982C3484J78902A03331J99366d0634C53503A73247K32259D7995L66285
16188D14280J86143B67990N3212a06646B11304n1891B8443M4092m800J35832Q6205
16177B89772A39674Q3646k2359J04619a13712G24793k22985j72331K68922A30837
16166D0048K54812B8644J60512J10468A27720N425L80086j09013j33688K85145
16156E55675k61071m745I6402L29453j50123m2843J87882J84151j52344a10119
16145C00212j28254a1228B89471L05887B43925J01128k8221E9246P9274b6620
16134A25119j1855a00297D14823c44205H0566j1966h241A89831E4384L06439N3205
16123D14028A6532L86111A19080C5424P3667K82097A80260K0404q9233K9992K5169
$$ plain form
16198 364982 33484 212386 103331 302697 -40634 353503 173247 405506 47995 414280
16188 414280 600423 267990 321202 -106646 211304 159413 28443 72535 67735 203567 289772
16177 289772 139674 223320 200961 305580 -113712 724793 501808 329477 598399 130837
16166 40048 294860 28644 189156 299624 127720 133145 513231 404218 270530 555675
16156 555675 294604 289859 96402 425855 275732 232889 420771 604922 452578 -110119
16145 300212 171958 -11228 289471 595358 243925 345053 316832 59246 138520 -26620
16134 125119 113264 -100297 414823 -344205 80566 68600 -8241 189831 54384 360823 414028
16123 414028 16532 402643 119080 35424 109091 391188 180260 200664 111431 141423 166592
16112A66592L7061P3143r4768J35498L096l5008b15795b0791F196M0795b641G1245
16099C1278L43970a91885A06032a00596C01213I6095c9093A07973m1466N3011
16089A19518k3470N0123O2655J49553D6306J70469L0983J55844A69179i7183B51593
16077b2650E4909K1204L62151a51018A21325L0525a84048C51738l3650a78813
16066G853J0310G628K70850A22418L27876D5592K36700o2872m4942M8027m5669
16055A76836o8962J03204M3026J58993a5231j08888B15282J31239I9743J47959
16045B47702D0521a5746A02127h9953D95420b1991D4003K69259j36382L10522
16035D87402A94548g9639C10335b87051G5451J16472a39779B68651e706D82627
$$ plain form
16112 166592 203653 276796 182028 317526 320622 285614 -215795 -20791 6196 46991 -2641 71245
16099 31278 375248 -191885 106032 -100596 301213 96095 -39093 107973 66507 119518
16089 119518 96048 146171 208826 358379 46306 216775 247758 403602 169179 -97183 251593
16077 -22650 54909 76113 438264 -151018 121325 151850 -184048 351738 318088 -178813
16066 7853 18163 7628 278478 122418 450294 45592 282292 219420 174478 222505 176836
16055 176836 107874 211078 254104 413097 -15231 -124119 215282 346521 99743 247702
16045 247702 40521 -15746 102127 -89953 495420 -21991 44003 313262 176880 487402
16035 487402 194548 -79639 310335 -287051 75451 191923 -139779 268651 -5706 482627
16024B80007A28660a87363D5244g6020A29213k020i5630K1797r4052B33717l3109
16013B00608h6626j25003A59641C998J49188a69674C2541J8636a57304j2356A48505
16001g1681D15602A69479R5489f2217A68516G2446k3915g4012G5880a2539B92829
15989D28956r5991i192G76398L4859M49853j2945k8293m59712Q7515D20913k03970
15978B16943m746g9213A73051D2863K19689F9792h7364B62958d7228q3293I1829
15966B06472F4343a51060B19262a81627Q7947l32034B968h3814K8138j15822c6971
15954A92930b67334K7927k1491E8341F360a8874m8251A80973C1809K17966b45525
15942a86927a6709j2343A75924a6872D64699a0569k60533a05130D3342J68551
$$ plain form
16024 280007 128660 -187363 45244 -76020 129213 127193 -95630 -73833 -167885 233717 200608
16013 200608 -86626 -211629 159641 3998 153186 -169674 32541 51177 -157304 -169660 148505
16001 -71681 415602 169479 264968 -62217 168516 72446 48531 -74012 75880 -12539 292829
15989 428956 332965 -9192 776398 811257 1261110 1248165 1219872 760160 847675 420913 216943
15978 216943 212197 -79213 173051 42863 262552 69792 -87364 262958 -47228 -130521 91829
15966 206472 64343 -151060 219262 -181627 -93680 -425714 2968 -83814 -55676 -171498 -36971
15954 192930 -267334 -239407 -260898 58341 6360 -18874 -67125 180973 31809 249775 -245525
15942 -186927 -16709 -29052 175924 -16872 464699 -10569 -271102 -105130 43342 211893
15932B11893i7851G1721a62742N9805a1242m55325I0966c43953P1278A06130e1231
15920A38401K08191d218o1641C59848H5090d1513H3523a60165K8175H611e0954
15908G6241K11462a2855m7308k28108i1358d4796A02826L14661b04708E5471f8433
15896B72093A07537P8560q4646l9620a12058A36108a4713l5890C0098a00718H905
15884i6442c7277n0994H0488M02907b55896d7368j46128j05391i949A14912c9133
15872A60420d9207B1676b76918A16669H476b99993H0593a83231D8019K16437b3292
15860b13634A41697a75112G702M0118r526b61275c8285j14510B0524a14409H1277
15848C02735d7047H0620e31k54857P1410A35153c2799A27802l6233b77918F4341
$$ plain form
15932 211893 -97851 71721 -162742 -102937 -11242 -466567 90966 -343953 -272675 106130 -51231
15920 138401 346592 -4218 -65859 359848 85090 -41513 83523 -160165 -131990 8611 -50954
15908 76241 287703 -12855 -60163 -288271 -91358 -44796 102826 417487 -204708 55471 -68433
15896 272093 107537 186097 101451 61831 -112058 136108 -14713 -50603 30098 -100718 8905
15884 -96442 -37277 -88271 80488 483395 -255896 -47368 -193496 -298887 -9949 114912 -39133
15872 160420 -49207 21676 -276918 116669 8476 -299993 80593 -183231 48019 264456 -23292
15860 -213634 141697 -175112 7702 47820 38294 -261275 -38285 -152795 20524 -114409 81277
15848 302735 -47047 80620 -531 -255388 -183978 135153 -32799 127802 91569 -277918 64341
15836G6460C4681J44416b85944M5938q1773h4982M2418K1022k09307p7414A69046
15824H8379g397n9764j05952F1709L02903g5418G2455K92037A04416b37716A09342
15812B74838b7642A72346J65301A61335h7199A6574J00648k6681a35916j73813
15802c09729J30555l3509A92544a44431j4294C6910g580k66586B27002F5788a59437
15790a40632B84068a44577G3576K24566a30774A7105J4587P9130a72869J6071
15780a56798F9606a24933G6122r201f0274A02772c24626G3924K20790a96321C272
15768B51336j12923k8978b35326A80556d7789n3295A40547g9195k3819N736A15602
15756f7832f506o6554F21901a72533A21427c87792a00194a27l65119A42172L13169
$$ plain form
15836 76460 34681 179097 -285944 -240006 -321779 -84982 -42564 -21542 -230849 -308263 169046
15824 88379 -7397 -67161 -173113 61709 364612 -75418 72455 364492 104416 -237716 109342
15812 274838 -27642 172346 337647 161335 -87199 16574 117222 90541 -135916 -309729
15802 -309729 -179174 -212683 192544 -144431 -158725 36910 -7580 -274166 227002 65788 -159437
15790 -140632 284068 -144577 73576 298142 -130774 17105 31692 110822 -172869 -156798
15780 -156798 69606 -124933 76122 66921 -60274 102772 -324626 73924 294714 -196321 3272
15768 251336 138413 109435 -235326 180556 -47789 -101084 140547 -79195 -103014 -97278 115602
15756 -67832 -6506 -73060 621901 -172533 121427 -387792 -100194 -127 -365246 142172 455341
15745D55341A9051b25478h7676a8217C52921A46673m5369b06201N1215a7555E7839
15733C5631h0072k471E0716N7266a32293m209j08942A08486P2404a49962g57A5887
15720a32697d1643k09903A52298R7772c8111k0438A7824a77879Q5800b2112A9923
15708a39345j54098d103n496j83763A06506m4115b8598C0763c4666O130G6758
15696a63999b1218A3194b9313D9832a42143A49649n8000g0169A98085q6730a94778
15684F1816a70506B851J61034a68522k04060C46015D4916Q3101C5161g5396o9599
15673a44995d8835A45217F7573K24587K32043A07320P1036P4370c20958c2049
15662e7761B12193E3047B4078i5756b9152j24593F8059R065A6139J12347D2827
$$ plain form
15745 455341 19051 -225478 -87676 -18217 352921 146673 101304 -206201 -154986 -17555 57839
15733 35631 -80072 -82543 50716 107982 -132293 -136502 -245444 108486 180890 -149962 -757 15887
15720 -132697 -41643 -251546 152298 250070 -38111 -58549 17824 -177879 -92079 -22112 19923
15708 -139345 -293443 -4103 -9599 -193362 106506 62391 -28598 30763 -34666 -28536 76758
15696 -163999 -21218 13194 -29313 49832 -142143 149649 91649 -70169 198085 111355 -194778
15684 61816 -170506 2851 163885 -168522 -372582 346015 44916 128017 35161 -75396 -144995
15673 -144995 -48835 145217 67573 292160 524203 107320 178356 252726 -320958 -32049
15662 -57761 212193 53047 24078 -95756 -29152 -153745 68059 77124 16139 128486 42827
15650A20104i1971L6379A08920a85640C0689b49438A83093C7184g2463E8388b88577
15638b40355A98271a29047b3257r9463E1600h6813k08631D7048a25757j19559
15628b45316A9647p838c52861a60328j41501B04477b8664J0650r455E7332A6947
15616b0431k12825N0172k11330c280k13676f9266k07282K412d6875A34688a18736
15604B55167a30648j77684f6443b1805l42661J09803G057c5303A34395b1287H0153
15592a17569D1281a46072M3276D8438J66312q2430A5773a74093N4851b1289P140
15581a4149I661d0101B30195B2413J20693a29419B5197a06325G0859a60626f3833
15569i8869A89306j875a7058l11971a08965r4066A23591a72717D2891c1174A50012
$$ plain form
15650 120104 -91971 -55592 108920 -185640 30689 -249438 183093 37184 -72463 58388 -288577
15638 -240355 198271 -129047 -23257 -122720 51600 -86813 -295444 47048 -125757 -245316
15628 -245316 19647 11809 -352861 -160328 -301829 204477 -28664 -18014 -27469 57332 16947
15616 -20431 -233256 -183084 -394414 -3280 -216956 -69266 -276548 -274136 -46875 134688 -118736
15604 255167 -130648 -308332 -66443 -21805 -364466 -254663 7057 -35303 134395 -21287 80153
15592 -117569 41281 -146072 -102796 48438 214750 132320 15773 -174093 -119242 -21289 -14149
15581 -14149 9661 -40101 230195 22413 143106 -129419 25197 -106325 70859 -160626 -63833
15569 -98869 189306 187431 -17058 -329029 -108965 -203031 123591 -172717 42891 -31174 150012
15557C13849A01979m9332b0660C63935i2311A90942e165B0307b69614R2829O0872
15546a15913B904J91652b3893j67482A16575a26750F6128K18289A00171l4256
15536F5915J69324A5754N08917b24183A89024b7111J2094A61445g6972F4623L7594
15525A02217J38986h8363D3188b1519C91771o0758a30674H637K57220k8619j5533
15514B21705M5791A01285K74723A34825J42788i2923A08883h3880A87527M2916
15504B30443n0762Q968K8885L8063p3461J71516J94136A13077O6577l8907c01434
15492B10605a1868A31526N1207F2997a36869F1935f4116E0169a5687E5468L28767
15481C84235a48447c554B75745j04948K49798j61698M29514K20440j13433B22032
$$ plain form
15557 313849 101979 52647 -20660 363935 -92311 190942 -5165 20307 -269614 -176785 -115913
15546 -115913 2904 194556 -23893 -191375 116575 -126750 66128 284417 100171 65915
15536 65915 235239 15754 524671 -224183 189024 -27111 -15017 161445 -76972 64623 102217
15525 102217 241203 -88363 43188 -21519 391771 331013 -130674 8637 265857 237238 221705
15514 221705 267496 101285 376008 134825 277613 -92923 108883 -83880 187527 230443
15504 230443 179681 188649 217534 255597 182136 353652 547788 113077 179654 140747 -301434
15492 210605 -11868 131526 182733 62997 -136869 61935 -64116 50169 -15687 55468 384235
15481 384235 -148447 -3554 275745 170797 420595 258897 688411 908851 795418 222032
15470E20569c2236l42605A94615k4088G7588a6119m4448F5097b24802D621Q8969
15459I3590M9327J0468o2787K1954b7479a927j23121B12020j8949k5335R9822
15448B67558A3005K30933J7370o4135R2089M28238M71430P2340j18396m93398
15438F49476a00792A36239P0863L1062j18702g9925C04254H9394N5179J06511
15428B51084m9057O8926H3271b36085B30592b01930I6635R7719B7516a94679e328
15416b76559R1220B32233R5452b26557g5247A75389i8224j33628G8518b30762
15405C8833J60482a66629A04825M7649b38618c0751B77480o9323g3653G4613a67893
15393c23954a234A80945g4431a7116j48717O2356C90711A9851M6882A5687M6199
$$ plain form
15470 520569 -32236 -374841 194615 170527 77588 -16119 -60567 65097 -224802 4621 93590
15459 93590 142917 153385 90598 112552 -27479 -1927 -125048 212020 193071 167736 267558
15448 267558 13005 243938 261308 197173 289262 717500 1188930 1261270 1142874 649476
15438 649476 -100792 136239 207102 238164 119462 -79925 304254 89394 144573 251084
15428 251084 202027 270953 83271 -236085 230592 -201930 96635 194354 27516 -194679 -5328
15416 -276559 -185339 232233 327685 -226557 -75247 175389 -98224 -231852 78518 -230762
15405 38833 199315 -166629 104825 152474 -238618 -30751 277480 208157 -73653 74613 -167893
15393 -323954 -1234 180945 -74431 -17116 -165833 -103477 390711 19851 66733 15687 61886
15382F1886A6842J95012a86026D16870B01200J36965a52615B91283j36415J98683
15372C53551j75965P2028r9041G4003J99104i7141A26290g0805B10373m2050K21748
15361C90071A87029q1472R358Q5620L45335B5885J12978E4370J69765F5881j1889
15350E3992L12406j53379G8500K2872B4115L71536A24234K46033J28704A29422
15339A36231c8285B08208a56975A07733J30645F4640c8791D097g8740A3475O2562
15328G6037K58240I3139k8838O3452L9896k5525o9659a555j30594A98162F8566
15316B07895J1001e6751j82998B04913J84558A784J11589L61919c9275A50366
15305b19318h0888A31268r617E3782a90963B07273g82B27021j10107d0217B22343
$$ plain form
15382 61886 16842 211854 -186026 416870 201200 338165 -152615 291283 154868 353551
15372 353551 177586 249614 150573 74003 273107 -97141 126290 -70805 210373 168323 390071
15361 390071 187029 105557 114915 200535 545870 25885 138863 54370 224135 65881 53992
15350 53992 366398 213019 78500 101372 24115 395651 124234 370267 498971 129422
15339 136231 -38285 208208 -156975 107733 238378 64640 -38791 4097 -78740 13475 76037
15328 76037 334277 93139 64301 127753 167649 142124 72465 -1555 -132149 198162 68566
15316 207895 218896 -56751 -239749 204913 389471 1784 113373 475292 -39275 150366
15305 -219318 -80888 131268 121651 53782 -190963 207273 -782 227021 116914 -40217 222343
15293B03235a13317c6951l423F7181A7228d5557C16984j32251q7373N9774A6388
15281b24931d9635A36555k4141d6874A1873K89467a1049k5063A92992r3879l7491
15270F1622c4157k21542n7954D9050b02285O458G8314K30673B5165N0478O105
15259H1748a92960J0262b6425C04164C2715K9085K2996j2469L47494q0119b71965
15247D7282L56275e9403D09524j10687K81305J27320Q92040Q3792l24542M86854
15237A845606H86153m19483G1296L4454J27966A01528a30134A36368d8928n4590
15227a03518j2592j10589A90444j2419A8561e4753C8846i9927A50905I426L02088
15216C11514Q5944b75917a3134A72375H776J33467N2163L0089a51537c2983A26858
$$ plain form
15293 203235 -113317 -36951 -40374 67181 17228 -45557 316984 184733 97360 157134 16388
15281 -224931 -49635 136555 112414 -46874 11873 301340 -11049 -36112 192992 99113 61622
15270 61622 -34157 -255699 -313653 49050 -202285 -195827 78314 308987 25165 75643 81748
15259 81748 -192960 -182698 -26425 304164 32715 61800 84796 72327 419821 339702 -271965
15247 47282 403557 -59403 409524 298837 580142 707462 1599502 1683294 1358752 1845606
15237 1845606 886153 466670 71296 105750 233716 101528 -130134 136368 -48928 -103518
15227 -103518 -116110 -226699 190444 178025 18561 -54753 38846 -99927 150905 9426 311514
15216 311514 397458 -275917 -13134 172375 8776 142243 194406 224495 -151537 -32983 126858
15204C06176A18206n5237a5134A10901A1156b3749p0872L0685k2213B64275H3581
15192b6320A73217C274f3217C66756j0993C8696a81041A46086c19318J00462D19517
15180A94763J19269A43963A2098N925h2213p5464A66213a19204C1708c7675E7764
15168b4135A1688K63145b05371B40579f5516A64580L6668K3420a22642n8543B08161
15156c093C83407p8241a4829A01714J34580A16685n6733J64385q9191l5356h0344
15144C6882L49793h8899A99966L3749o353a21996k956a8094A60818O4328A11372
15132B7525a22978F9694K01372G1323B7996f4883A71610J23488F354J4717A0220
15120A8272N4602K98618j71953m8901L91509B2222m467J25676K56965q4427b8343
$$ plain form
15204 306176 118206 62969 -15134 110901 11156 -23749 -94621 -63936 -86149 264275 83581
15192 -26320 173217 3274 -63217 366756 355763 38696 -181041 146086 -319318 -218856 419517
15180 194763 314032 143963 12098 18023 -82213 -157677 166213 -119204 31708 -37675 57764
15168 -24135 11688 274833 -205371 240579 -65516 164580 201248 224668 -122642 -181185 208161
15156 -3093 383407 305166 -14829 101714 236294 116685 59952 224337 135146 99790 -80344
15144 36882 386675 -88899 199966 233715 227362 -121996 -124952 -18094 160818 225146 111372
15132 27525 -122978 69694 271066 71323 27996 -64883 171610 295098 6354 21071 10220
15120 18272 72874 371492 199539 150638 542147 22222 17755 143431 400396 315969 -28343
15108D8387a49115A89852o7775Q7884a19897A13109m9854e3215A91473K09042
15098D00515B44M11867d378B04355N4584a6415B61972a21005A54272p4423L4622
15087A14471b5498A67464c5505F6269J12364f6757K9555G3010h4045c4339B79197
15075A0853h293D11623j34227g2636A58923K81202A74231L6119h5640L9172l8858
15064h5326A33362K59426L8331j94600R7664F2993J76838l2070K21919j46551
15054B83129K13260j91914a4132B47474L7864q6663M68555B45629c1874A56939
15043g8146J4273A59333G0048J50630J53331o6142E5597M58541p1467k09538K50720
15032D83853r6132J83900J82695J11351k18792l8201j7913A13060K79216K13777
$$ plain form
15108 48387 -149115 189852 122077 209961 -119897 113109 63255 -53215 191473 400515
15098 400515 244 412111 -4378 204355 258939 -16415 261972 -121005 154272 79849 114471
15087 114471 -25498 167464 -35505 66269 178633 -66757 -37202 73010 -84045 -34339 279197
15075 10853 -8293 411623 277396 -72636 158923 440125 174231 210350 -85640 -46468 -85326
15064 -85326 133362 392788 431119 236519 334183 62993 239831 207761 429680 283129
15054 283129 496389 304475 -14132 247474 285338 198675 667230 245629 -31874 156939
15043 -78146 -63873 159333 70048 220678 374009 307867 55597 514138 442671 233133 483853
15032 483853 387721 571621 754316 865667 646875 608674 590761 113060 392276 606053
15022F06053J42998j79060k48298K48455J15399k11524k8751j93760r9453N27214
15012F79273q2246k32822j50773J45787K70645k38260j77217L53540k45672j2504
15002C09751G3700L47998j15425L14271l04007R5953r2202j57458J47434J66592
14992D76856j57532A48987L77294l3663p3049J18214A86377K6218M9074L50432
14982F12101K62353l39530J73039q7266A44048L52962G0987J88372J31236r5722
14972B94873L46158j96042K18151r860B30005M11035j8513B90688A35601M66730
14962F02331B25220O4148J28268k05361L25446A53804J21326m3462l2548P0070
14952B69190J12939m8674K03067r5491K11237A56400J72033J35192K0947K19726
$$ plain form
15022 606053 749051 569991 321693 570148 685547 474023 445272 251512 152059 679273
15012 679273 597027 364205 213432 359219 629864 391604 214387 567927 322255 309751
15002 309751 73700 421698 306273 620544 316537 412490 320288 162830 310264 476856
14992 476856 319324 148987 526281 492618 419569 537783 186377 212595 261669 612101
14982 612101 874454 534924 707963 620697 144048 497010 70987 259359 390595 294873
14972 294873 641031 444989 663140 653280 230005 641040 622527 290688 135601 602331
14962 602331 225220 289368 417636 212275 537721 153804 275130 231668 199120 269190
14952 269190 382129 333455 536522 441031 652268 156400 328433 463625 484572 704298
14942G04298A19430K51049K02445n2555n1047L2352M3667j98257K27956M84360
14932A059400k4543k74586N24315N6581k41535K91054J3632O37392m07132j12363
14922A522215j78912J11429M90157l19664O99332K98638l11700o04124l70721
14913A336650j55752o4588o0712l80294k03399L9491m4726L60820j58269A91419
14902C54431i7913H4407A0742K34107Q9813K0956M52839k72390p7758E1590L59981
14891D11571K6088J31525j1171k0904K04179p9061K33606K2366L34678k48000
14881A004877q4548j36359M3039J41021D40423J89731j43353A01631L30368n2668
14871C79331J57917Q0162N1956N8088k6721J34426k62596L81687l22535p0315
$$ plain form
14942 704298 119430 370479 572924 520369 469322 501674 545341 347084 575040 1059400
14932 1059400 1034857 760271 1284586 1341167 1099632 1390686 1404318 2041710 1634578 1522215
14922 1522215 1343303 1454732 1944889 1625225 2324557 2623195 2311495 1707371 1336650
14913 1336650 1180898 1116310 1055598 675304 471905 511396 466670 827490 669221 191419
14902 354431 -97913 84407 10742 244849 334662 355618 808457 536067 458309 51590 411571
14891 411571 437659 569184 558013 537109 741288 662227 895833 918199 1252877 1004877
14881 1004877 920329 783970 827009 968030 440423 630154 486801 101631 431999 379331
14871 379331 537248 617410 669366 727454 700733 835159 572563 954250 631715 561400
14861E61400J98735l61015O2192j10381K9664j40301r6622J3763M43858k77995
14851C23298J61592P6170n9129K43813k26658j96434O04285r3438L08687j76850
14841I65336L7409M10145o56313J93921J8293L041k4279j21621j05977K15412
14831I35367l49050L67365l86100K76857l60792L00362k90342J98422j35294B45910
14820F27081J07561n535K83285k24006j00479q7727j01914K12435j54255q9844
14810D66602K69607l42831K30158J73430K61002k85338J18581q3861p9593J82229
14800I09986n8205l47830q9875A85333L55134r6549k6718o2273K93684n0921j40727
14789D56963J06375L50305l54159K700K49616j69778r5496N1559q1352K07262
$$ plain form
14861 561400 760135 399120 461312 350931 380595 240294 143672 157435 601293 323298
14851 323298 484890 561060 501931 745744 519086 322652 926937 833499 1142186 965336
14841 965336 1002745 1412890 756577 950498 968791 971832 947553 825932 719955 935367
14831 935367 586317 953682 567582 844439 483647 784009 493667 692089 556795 245910
14820 627081 734642 729107 1012392 788386 687907 600180 498266 710701 556446 466602
14810 466602 736209 393378 623536 796966 1057968 772630 891211 807350 727757 909986
14800 909986 851781 503951 414076 185333 540467 443918 417200 354927 648611 597690 456963
14789 456963 563338 913643 559484 562184 811800 642022 546526 598085 516733 723995
14779G23995j19081K76854j61766q3077M144M4679J86433j91862j36608J43782
14769F87493j75470P9948K93079j35951o8484C13917J50464L51440l04927p2120
14759D38774K4055K26178J46186P803j59971J28113l88221L0927K09706K7286
14749F90836C34950q6633L00138k44984N00479l01257J87173k9050j33489K66140
14739G93467k83656J62154j09106J57335j40113J47917J83791j70237M09368N9242
14729A210162o8823L48923N82706j74165m30430j09116k33660l5602l10627o8064
14719G11304J25131l8764L1540K23230n1743j52662j1002J98345j96685m0888
14709G97806K28075k56708M36975m12013K09650K16158P7043N39712P7532j46934
$$ plain form
14779 723995 604914 881768 720002 636925 641069 685748 872181 680319 543711 687493
14769 687493 512023 591971 885050 749099 680615 313917 464381 815821 510894 438774
14759 438774 462829 689007 835193 842996 683025 811138 422917 453844 663550 690836
14749 690836 334950 248317 548455 303471 803950 502693 689866 660816 527327 793467
14739 793467 509811 671965 562859 720194 580081 727998 911789 741552 1150920 1210162
14729 1210162 1141339 1490262 2072968 1898803 1468373 1359257 1125597 1089995 779368 711304
14719 711304 836435 797671 829211 1052441 1000698 848036 837034 1035379 838694 797806
14709 797806 1025881 769173 1206148 794135 1003785 1219943 1296986 1836698 1914230 1767296
14699A767296j8226o18638K01766m65647J06470j53608j42150J98407j18388O1243
14689H18525O2224j7907k15358J97740k44598K30759L96967l71406J6681j21528
14679G52099n5772K73091P4426l02857J76316j64823L3700o459N8831n1502J79110
14668I66160j9528J15981j72431l47377L66016J16983o432P1122p0931J4139N8050
14657A091752K3214J18120l26330J17702M53173k71019r374N9373R8388m94990
14647H60009M74733k12043p4140J05500j96599L01731k06993J31432n3420K37064
14637A367274m74654L75435l50490M0293J05287N9187J95909J57185m41282j12989
14627I21155K12385k127K64024q8107j43261J04922L54n7434j93663J67387k74741
$$ plain form
14699 1767296 1749070 1130432 1332198 866551 973021 819413 677263 875670 757282 818525
14689 818525 880749 862842 647484 845224 600626 831385 1228352 856946 873627 752099
14679 752099 696327 969418 1043844 740987 917303 752480 786180 779721 838552 787050 966160
14668 966160 946632 1062613 890182 542805 908821 1025804 1019372 1090494 1019563 1033702 1091752
14657 1091752 1114966 1233086 906756 1024458 1477631 1206612 1197238 1256611 1354999 860009
14647 860009 1334742 1122699 1048559 1154059 957460 1259191 1052198 1183630 1130210 1367274
14637 1367274 892620 1268055 917565 957858 1063145 1122332 1318241 1475426 1034144 921155
14627 921155 1133540 1131413 1395437 1307330 1164069 1268991 1269345 1211911 1018248 1185635 910894
14616I10894O27551k79698j6581J75884J97577l13787J13258Q2862j55432l2568
14606A309960r6302O5570K51056J12041N0917j08432M3407j12113p2583J36672
14596A580193k4242j85546L90713J07385m73125L96036J09391m16391J984K04565
14586A690963j6531j33022M6010L39515j78306O5022j84828M31299m04869Q9768
14576A745021J58355l5168l7066p9141J48758O4235K03525k77151J77930J42944
14566B212242k39908l66218J014765n9926k79987O7201J39361o7081K30195J94050
14556B844694j05068K57266p2685N25158M44621j9813J255656K058394L940131
14547A1128354P465081J9046668L567294A8365028H813227l783799j972986k88654
$$ plain form
14616 910894 1538445 1258747 1242166 1418050 1615627 1301840 1415098 1497960 1342528 1309960
14606 1309960 1213658 1279228 1530284 1642325 1693242 1584810 1628217 1516104 1443521 1580193
14596 1580193 1555951 1370405 1761118 1868503 1395378 1791414 1900805 1484414 1486398 1690963
14586 1690963 1674432 1541410 1587420 1926935 1748629 1813651 1628823 2060122 1655253 1745021
14576 1745021 1903376 1868208 1831142 1752001 1900759 1964994 2168519 1891368 2069298 2212242
14566 2212242 1972334 1606116 2620881 2560955 2280968 2348169 2487530 2420449 2650644 2844694
14556 2844694 2739626 2996892 2924207 3449365 3893986 3874173 5129829 7188223 11128354
14547 11128354 18593435 37640103 41207397 18365028 8813227 5029428 3056442 2767788
14539B767788l84511N16646J311758Q21404k223334p53636J46210l7940k67435
14530A896950J20761k66401K20358n197J7771K10607k49473O7624j34724N94225
14520B472501k31213J09840j02468J53121l64424M68350k47613L37559J05237
14511B700890j59317p1534O0009L68121m26442K09141j77667J92089J81014N3901
14501B930205J98613l60891J89396q0787J7796K57908k22504L31986k94822K37443
14491C204343O8562R2967n9623j74386L14938k26633J29240n409L34786p877j77144
14480C493764J00858l822J57973k45778K10292K63747k19058J47323j13509O0355
14470C852145N48468m11285J62169J06940J62079j20761j19456L11857k96924
$$ plain form
14539 2767788 2383277 2899923 4211681 5033085 2809751 2056115 2202325 2164385 1896950
14530 1896950 2017711 1751310 1971668 1966471 1984242 2194849 1945376 2013000 1878276 2472501
14520 2472501 2241288 2351128 2248660 2401781 2037357 2505707 2258094 2595653 2700890
14511 2700890 2541573 2470039 2530048 2898169 2471727 2680868 2503201 2695290 2876304 2930205
14501 2930205 3128818 2767927 2957323 2876536 2894332 3152240 2929736 3261722 2966900 3204343
14491 3204343 3272905 3365872 3306249 3131863 3446801 3220168 3349408 3343999 3678785 3670908 3493764
14480 3493764 3594622 3590800 3748773 3502995 3713287 3977034 3757976 3905299 3791790 3852145
14470 3852145 4400613 3989328 4151497 4258437 4420516 4299755 4180299 4492156 4195232
14461D195232K71819N4241k34481j9648L27599P7719L5644J26333n8665L41730
14451E117523j41177L83448m30706K2942K14105L04007l52633q6692K65605L96211
14441E692633O7067j83306M1603L38640j53388K88682k69079J71073L33635k34706
14431F092854M3559L47913k36968P65538m58482M24643J45162j55592P74689k82550
14421G460766J37141J79203P61J91273J27853M752j84932L25680M2364j66301
14411H118560K98972m60659Q51317O5566M66863L32444J04593k5759m18384M47345
14401I780858L00906j82967o3545N6316K96557j01370N45458l2701M50722J58441
14391A1208675J63050j73782O08864R0816L72544J44426K39156M59040j03178
$$ plain form
14461 4195232 4467051 4521292 4286811 4267163 4594762 4672481 4708125 4834458 4775793 5117523
14451 5117523 4976346 5359794 4929088 4952030 5166135 5470142 5117509 5030817 5296422 5692633
14441 5692633 5759700 5576394 5617997 5956637 5803249 6091931 5822852 5993925 6327560 6092854
14431 6092854 6136413 6484326 6247358 7012896 6554414 6979057 7124219 6968627 7743316 7460766
14421 7460766 7597907 7777110 7777871 7969144 8096997 8101749 7916817 8242497 8284861 8118560
14411 8118560 8417532 7956873 8808190 8873756 9340619 9673063 9777656 9751897 9333513 9780858
14401 9780858 10081764 9898797 9835252 9891568 10188125 10086755 10632213 10599512 11050234 11208675
14391 11208675 11371725 11197943 11806807 11897623 12270167 12414593 12653749 13112789 13009611
14382A3009611P32220l6845j34917N87878m2256N12363J40699p919N81887K48798
14372A5591519N25262L39926K85693L80838M85561L81769P552K86076J54012P90521
14362A9228729L92911L47121K30973L06022O50241N32959L16573R37904M5121
14353B2988554R61125M33344M70410O50778O16577O62136P35871Q22437O15042
14344B8956274P97145R09194O84660J139089M91374J176836J289374N61592J068409
14335C7073947J049258R83046J349375J572615J064839J224899J455766J489976
14327D7263721J362492J702190K218813J396005K013866J707979K383792J902397
14319F1951255K220044K011491K180483K784186K914264K836856K956649L173176
$$ plain form
14382 13009611 13741831 13704986 13570069 14157947 14115691 14628054 14768753 14760834 15342721 15591519
14372 15591519 16116781 16456707 16742400 17123238 17608799 17990568 17998120 18284196 18438208 19228729
14362 19228729 19621640 19968761 20199734 20505756 21155997 21688956 22005529 22943433 22988554
14353 22988554 23949679 24383023 24853433 25504211 26120788 26782924 27518795 28341232 28956274
14344 28956274 29753419 30662613 31347273 32486362 32977736 34154572 35443946 36005538 37073947
14335 37073947 38123205 39106251 40455626 42028241 43093080 44317979 45773745 47263721
14327 47263721 48626213 50328403 52547216 53943221 55957087 57665066 60048858 61951255
14319 61951255 64171299 66182790 68363273 71147459 74061723 76898579 79855228 83028404
14311H3028404L287670L851844L433224M308188L798270M845032M546940N161375
14303A16260947N193415N449366O172145O509304O848231P179863P584545Q140652
14295A69338468Q528164Q902291R846096R995488J0923870J1166103J2192543
14288B40893023J2214138J3477615J3364309J3900364J4562439J4770919J4985835
14281C38168642J5292824J5360867J4246288J4344431J3708424J2616029J0745687
14274D34483192Q249361L904862J245571Q86991Q77247j368629n834258m726423
14266D37717914n583385p869986j0358694j1337131j2111029j3615834j4152213
14259C62689642j4842410j6103106j5909489j5327268j4782386j4455042j3701830
$$ plain form
14311 83028404 86316074 90167918 93601142 97909330 101707600 106552632 111099572 116260947
14303 116260947 121454362 126903728 133075873 139585177 146433408 153613271 161197816 169338468
14295 169338468 177866632 186768923 196615019 206610507 217534377 228700480 240893023
14288 240893023 253107161 266584776 279949085 293849449 308411888 323182807 338168642
14281 338168642 353461466 368822333 383068621 397413052 411121476 423737505 434483192
14274 434483192 442732553 446637415 447882986 448769977 449647224 448278595 442444337 437717914
14266 437717914 432134529 424264543 413905849 402568718 390457689 376841855 362689642
14259 362689642 347847232 331744126 315834637 300507369 285724983 271269941 257568111
14252B57568111j3371978j2554134j1975364j1198483j0763004q477280r427715
14245A79800153q881712p920296q159122p337998p188754o674344n981577n421016
14237A22235334n364285n322709m982358m498227m469648l878360k975925l952845
14229H6790977l860207l181733k806852l007489k958526k466337k838124k463310
14221F3208399j872499j852232k285031j992146j609853j824931j735533j501033
14213D8535141r96678j580684j688582j286186j141429j458921l05969j299030
14205C8777662j122731j114102j570871p30796r18540o18034j108882m59056j357937
14196B9776713j58952q54963p64274p05785n14562p81584o02208n77243o53667
$$ plain form
14252 257568111 244196133 231641999 219666635 208468152 197705148 189227868 179800153
14245 179800153 170918441 162998145 154839023 147501025 140312271 133637927 127656350 122235334
14237 122235334 116871049 111548340 106565982 102067755 97598107 93719747 90743822 86790977
14229 86790977 82930770 79749037 76942185 73934696 70976170 68509833 65671709 63208399
14221 63208399 61335900 59483668 57198637 55206491 53596638 51771707 50036174 48535141
14213 48535141 47538463 45957779 44269197 42983011 41841582 40382661 40076692 38777662
14205 38777662 37654931 36540829 34969958 34239162 33320622 32702588 31593706 31134650 29776713
14196 29776713 29617761 28762798 27998524 27292739 26778177 25996593 25394385 24817142 24163475
14187B4163475m42872m73501p99208j81710p66229j34688p36573o49465j92724
14178A9786505m13854j74762m99418m53244l19731n44402o67796J31861m03736
14169A6441423l40436j33463k86340l69067l92328N341m77007k66529k24317k91262
14159A3666015k94193k41024j20003m7287k24629l61888j80539l85661k05206
14150A1605585q6802j98789J43113k77142n94194j74875q0782J18241k66795j82378
14140A0005182n8331K2984p12420J35466k4140k65789j90424m390l71394K20856
14130H757600Q0197l18748j62340l6383l27156L5108j12896k88791P883k627k10492
14119G421355j87744k17265J88321L902l67128l7266N9011J1636k22408j89883
$$ plain form
14187 24163475 23720603 23247102 22447894 22266184 21499955 21365267 20628694 19979229 19786505
14178 19786505 19372651 19197889 18698471 18245227 17925496 17381094 16713298 16845159 16441423
14169 16441423 16100987 15967524 15681184 15312117 14919789 14925130 14448123 14181594 13957277 13666015
14159 13666015 13371822 13130798 13010795 12963508 12738879 12376991 12196452 11810791 11605585
14150 11605585 11518783 11319994 11463107 11185965 10591771 10416896 10336114 10454355 10187560 10005182
14140 10005182 9946851 9969835 9257415 9392881 9368741 9102952 8912528 8908138 8536744 8757600
14130 8757600 8837797 8519049 8356709 8320326 7993170 8028278 7915382 7626591 7634474 7631847 7421355
14119 7421355 7233611 7016346 7204667 7208569 6841441 6804175 6863186 6874822 6652414 6462531
14109F462531L8257O3583j16329j04499k1615k95943j41003j94169K59412k52987
14099E697238k8624L98995n35516j62577L88611m63637K20667j08364j27892P4071
14089E352972N6348l48593P6386j10568k22463k66099K50032j71024K3375j55069
14079D485297J62261j5836j56771P0279n5560n3104l7558m37311K08690l01815
14069C868572N79763m54179J02134l2020n03523M06480J86150j25937j89130R8372
14059C936682K90538o00252L8279N5097l76330J00739q2586L09108m02232M64040
14049C733083m20035k6222l3714L4720n9002L23435m12704j70663J32337j48336
14039B952899K30756l29854J0824j21820M69523j56894l34579M36079J69161l41722
$$ plain form
14109 6462531 6500788 6564371 6448042 6343543 6321928 6025985 5884982 5690813 5950225 5697238
14099 5697238 5668614 6067609 5532093 5369516 5758127 5294490 5515157 5406793 5278901 5352972
14089 5352972 5409320 5060727 5137113 5026545 4804082 4537983 4788015 4616991 4640366 4485297
14079 4485297 4647558 4631722 4474951 4545230 4489670 4436566 4399008 3961697 4170387 3868572
14069 3868572 4448335 3994156 4096290 4064270 3560747 3967227 4153377 4027440 3838310 3936682
14059 3936682 4227220 3626968 3665247 3720344 3344014 3444753 3362167 3671275 3269043 3733083
14049 3733083 3313048 3286826 3253112 3287832 3228830 3552265 3139561 2968898 3101235 2952899
14039 2952899 3183655 2853801 2864625 2742805 3212328 3055434 2720855 3156934 3326095 2984373
14029B984373k83794M03412m27945J25355P2972L4901l54254J28741K63789l51807
14019B595743L10537k40744l87663M0136J22832j32036p3474K34430l79634N13087
14009B603214k94267j60159M24344l19955K9249K93257m91689K84993j05178j83981
13999B079828n3480J12012l7368P8329o7328j34582R8644J912J15693M24670R68984
13988C587314K797949M862121J6852173J7533571j9759037j1261125n875173k513819
13980F223974j226405q59722j67751o55241k49613q9816k79732k35962J60424
13971B620156l87812Q7135j1906R4262K76213l35536j9558j63967K71936q8507
13961B342416j45173r2840n4241o1295m73995K77750N9820J10587k22458K89893
$$ plain form
14029 2984373 2700579 3103991 2676046 2801401 2874373 2909274 2555020 2683761 2947550 2595743
14019 2595743 2906280 2665536 2277873 2318009 2440841 2308805 2235331 2469761 2090127 2603214
14009 2603214 2308947 2148788 2573132 2253177 2282426 2575683 2083994 2368987 2263809 2079828
13999 2079828 2026348 2138360 2100992 2179321 2111993 1977411 2076055 2077967 2193660 2618330 3587314
13988 3587314 6385263 11247384 28099557 45633128 25874091 14612966 8737793 6223974
13980 6223974 4997569 4137847 3970096 3314855 3065242 2975426 2695694 2459732 2620156
13971 2620156 2232344 2319479 2307573 2401835 2678048 2342512 2322954 2158987 2430923 2342416
13961 2342416 2197243 2104403 2050162 1988867 1514872 1792622 1852442 1963029 1740571 2030464
13951B030464J6325k94567K65823Q392m48660L30033m0418l86631l5745J44191
13941A589207K54333l30601p493l7883L57583m10572L19819k42253R1960O1559
13931A645659J90858k11764j12180J37660J02540p0054j68485j5750J6869L63860
13921A879213k83752m17290L23454O4927k33176J08294K38592j63836Q3368q5728
13911A514066J24229j88380O2518J8343l67513Q1784J30088k58880J86818K57479
13901A560552j27610J81555l54304R9515k36773K88199j8408m88911M32179J72778
13891A508772k24258J14914l38122L60686l74787L46175l49798L08829l0640l59452
13881I62319L65653k6203j10609k02167J92639j7539l9205M3362j22197k35887
$$ plain form
13951 2030464 2046789 1752222 2018045 2026437 1577777 1907810 1867392 1480761 1445016 1589207
13941 1589207 1843540 1512939 1505446 1467563 1825146 1414574 1734393 1492140 1584100 1645659
13931 1645659 1836517 1624753 1512573 1650233 1752773 1682719 1514234 1498484 1515353 1879213
13921 1879213 1595461 1178171 1501625 1566552 1333376 1441670 1680262 1516426 1599794 1514066
13911 1514066 1638295 1449915 1512433 1530776 1163263 1245047 1375135 1116255 1303073 1560552
13901 1560552 1432942 1614497 1260193 1359708 1122935 1411134 1392726 903815 1335994 1508772
13891 1508772 1284514 1399428 1061306 1421992 1047205 1393380 1043582 1352411 1321771 962319
13881 962319 1327972 1301769 1191160 988993 1181632 1164093 1124888 1168250 1046053 810166
13871H10166J83878l528J57178E53553N91697J92498m06714J61817l6892l43701
13861G12258J98752J97753k56573L63296O2166j10502j57107k7207M9983j21086
13851I11733M83495l90645k76598K62020N8334R5360k38944L8893L56133l55407
13841I44374J85608k96838J41576L4378j69512P6414k04198P1959J94823j48316
13831H30268l13038L65462j01002Q554L22572k96818J65113q6145n0189j18529
13821G26248L67080k01405j25741j92464j19039M27894j30601K7493J36757q6928
13811H29294j90804P6771m6947M76798m72467J88785O1225m23303M3381J10965
13801F53698J17282R8986k47504K19928j03866R9772K15499k06513j03637J98892
$$ plain form
13871 810166 994044 990516 1147694 553553 1145250 1337748 931034 1092851 1055959 712258
13861 712258 911010 1108763 852190 1215486 1277652 1167150 1010043 982836 1032819 911733
13851 911733 1395228 1004583 727985 990005 1048339 1143699 904755 943648 1299781 944374
13841 944374 1129982 833144 974720 1009098 839586 916000 711802 783761 978584 830268
13831 830268 517230 882692 781690 790244 1112816 815998 981111 894966 844777 726248
13821 726248 1093328 891923 766182 573718 454679 882573 751972 779465 916222 829294
13811 829294 638490 715261 668314 1145112 672645 861430 922655 499352 542733 653698
13801 653698 770980 869966 622462 842390 738524 838296 1053795 847282 743645 942537
13791I42537k75155k20884K75967k55685L66690l74510r0826J04007L32264j30956
13781F73449k73545M68151n4227j1207J05629l55589K47314n5889j00225o1805
13771E82056k1543l4665j4534L12531o1708r1495K17308k27320L08746m02720
13761E66656L12573l42763J78800M412m9387K7284J16115N7871k31320j79053
13751D61188j71243L68454r519J30536l65940M7080K0990J94580l33201j1564
13741C31361J43496L84080j71342j0077o4444j58490L62374j47977o1709l5054
13731E72218j99361K17515j58846M1910J63942j73535q1634M08201C62047J13395
13721D75442K5710K31066j35617J88595k04044j69787P4416K08262k68389J62562
$$ plain form
13791 942537 667382 446498 722465 466780 833470 458960 368134 472141 804405 673449
13781 673449 399904 868055 813828 802621 908250 552661 799975 744086 643861 582056
13771 582056 560513 525848 511314 823845 762137 670642 887950 660630 969376 566656
13761 566656 879229 536466 715266 719678 670291 697575 813690 871561 640241 461188
13751 461188 289945 658399 648880 779416 413476 460556 481546 676126 342925 331361
13741 331361 474857 858937 687595 677518 613074 454584 816958 668981 607272 572218
13731 572218 372857 590372 431526 473436 637378 463843 382209 790410 362047 475442
13721 475442 501152 732218 596601 785196 581152 411365 485781 694043 425654 588216
13711E88216k73329j36728p9638O61753k37034r8734L304L60523k81628Q4650
13701E91355j01160p9148p246K3243K6741J33852B08838P8697N60422l06255R3671
13690F35373j80003L8702j89368K92257o6018L4719l8126m3106j26578j34780
13680B23072M21732k58015J5703q6871L87805C43052J61150j6916n0469j94981
13670B41836Q1717J32430K26773A53281K96364J70568q5397R6070j41781J80455
13660F69560C22382J60184j04944m0936A19383N01297J61229k09854k49924j32830
13650A89301J87139M54575A74578L59554A77466K27361A71732N2410M15355k18320
13640D21177j58978K18142B08331M3558J51806p0957N5206n958j15317P4938J08441
$$ plain form
13711 588216 314887 178159 98521 760274 523240 424506 427810 788333 506705 591355
13701 591355 490195 411047 403801 427044 453785 587637 208838 287535 847957 541702 635373
13690 635373 455370 494072 304704 596961 530943 565662 527536 484430 357852 223072
13680 223072 644804 386789 402492 315621 703426 343052 504202 487286 436817 241836
13670 241836 323553 455983 682756 153281 449645 620213 534816 630886 489105 669560
13660 669560 322382 482566 377622 336686 119383 620680 781909 572055 322131 189301
13650 189301 376440 831015 174578 534132 177466 404827 171732 224142 639497 421177
13640 421177 262199 480341 208331 251889 403695 332738 387944 381986 266669 341607 450048
13629D50048J11745j64573Q7381k41078M62908B06562K14155j17680L01882j82850
13619D22069j34787J48277j48371a70803E62547p1636r3794P2331j82184K07260
13609D94524o5452m4645j00972J63300J28697A35120J25269M43806C03014L2819
13599C35833R6714j34427A29129J61476m1827P5595j09228Q7554q2580P7105N6971
13588C54195Q6083A41411J94796J48323H8936j43L47712n4869A42609l9680K32630
13577C35559j52104R7165C9466M03906C2549N7410K8186K6757n3561L26062j59387
13566B58016L21503j08988r4411B3713J19492P4439L0159M44454B60454p1935
13556A88519N31470a5861C72214j34185q9212N5568n7489o991K86855K6260K3448
$$ plain form
13629 450048 561793 397220 484601 243523 706431 206562 420717 303037 604919 422069
13619 422069 287282 435559 287188 -170803 562547 490911 397117 469448 287264 494524
13609 494524 429072 384427 283455 446755 575452 135120 260389 704195 303014 335833
13599 335833 432547 298120 129129 290605 248778 324373 215145 302699 220119 297224 354195
13588 354195 440278 141411 336207 484530 88936 88793 436505 381636 142609 102929 335559
13577 335559 183455 280620 39466 443372 32549 89959 118145 144902 91341 417403 258016
13566 258016 579519 470531 376120 23713 143205 217644 247803 692257 260454 188519
13556 188519 719989 -15861 372214 238029 148817 204385 146896 139905 426760 453020 476468
13545D76468A50724O3687A4689L35007L37872l12388p6819Q4794A90078M00668
13535E90746k85572O5751A78699J12060A7307L75913J495A94356J47770H5701
13524B52537A20916K22998a542C37034A28746M6123J43269J58263B32260A12003
13513D36947h2652A53563D4306M42742k04999m2831E0669J94287C5921N14036
13503E49957k55613K82238j81800m5382A33110L15142o6322f5582B17602K81064
13493D98666A56531l3911O6405M1516N1069F7185J57751L00600a15766B79151
13482D09062o3877F8833N551B6152J98318J56790r8201c4166D17145j52987l6481
13471B27677F8875J01977K48568h1727B28250B1872L36214j21453I0214L7333
$$ plain form
13545 476468 150724 214411 14689 349696 687568 375180 298361 383155 190078 590746
13535 590746 305174 370925 178699 290759 17307 393220 394715 194356 342126 85701
13524 252537 120916 343914 -1542 337034 128746 174869 318138 476401 232260 112003
13513 436947 -82652 153563 44306 487048 282049 239218 50669 244956 35921 549957
13503 549957 294344 576582 394782 349400 133110 448252 381930 -65582 217602 498666
13493 498666 156531 122620 189025 230541 281610 67185 224936 525536 -115766 279151
13482 409062 345185 68833 74384 26152 224470 381260 283059 -34166 417145 264158 227677
13471 227677 68875 170852 419420 -81727 228250 21872 358086 236633 90214 127547
13461A27547o0617l037J44177L12222a45979G8558J25779l7841K55781j12817
13451C09460e7797C38861r3716j20392J91221J21405j05153c0538A73748J78812
13441C52560q2049a4006C12459R3853p0418q1942b3844C11503J37434n6665j37745
13430B54527Q0632o3976j18180L01694C7172d3417B19534K04699J8114F3992J22999
13419A86991j8939p202e3054B41024C4216K86707l0233F5129J08218n1863K79956
13408D01440A37884J07896A08175C3590R2625L0837J6642K9136R8655E1938J17707
13397A69645K3465k8637B8701K62959L0484k3650p5246k761J74518l5900j34709
13386B24396O3198l6578J78386j25280m491K21009B6929J47685N2642i1607A34694
$$ plain form
13461 127547 66930 63893 208070 520292 -145979 78558 204337 166496 422277 309460
13451 309460 -57797 338861 245145 124753 315974 437379 332226 -30538 173748 352560
13441 352560 270511 -14006 312459 406312 335894 253952 -23844 311503 448937 392272 254527
13430 254527 335159 271183 153003 454697 37172 -43417 219534 424233 442347 63992 186991
13419 186991 168052 160850 -53054 241024 34216 320923 290690 65129 173347 121484 401440
13408 401440 137884 245780 108175 33590 126215 157052 173694 202830 301485 51938 169645
13397 169645 193110 164473 28701 291660 322144 298494 223248 220487 395005 359105 224396
13386 224396 287594 251016 429402 304122 299631 520640 26929 174614 227256 -91607 134694
13374C75051d8020B73418L4158G2766J98823K9150m733A0009i6133D06460E8508
13362H002J86381I1012R217K32406G3720L43665A58918a2654C50175j62768l6858
13351A50549A754K416L55240J17896F2726o935J37362j8587n3554K39722j649
13340C59085j35178I5271J55722j17512g5134C00553J75110B03863R2307J23682
13330D19852n9783f3840B59136a36423B24155a6053G1326L57172j51207G1275
13319A56983K09849k3847P163K7151i9318A35682F1941J54205j4023r4411B0138
13307B59838J36927a55317A50097n8852B4943L4989L12986j20939p9898K9546
13297B01627G133M2802K87911e90p7331B92658i2380E50344b5272B4623J39704
$$ plain form
13374 375051 -48020 273418 307576 72766 271589 300739 296006 10009 -96133 406460 58508
13362 8002 194383 91012 100229 332635 73720 417385 158918 -12654 350175 187407 150549
13351 150549 1754 4170 359410 477306 62726 55791 193153 174566 121012 360734 359085
13340 359085 223907 95271 250993 133481 -75134 300553 475663 203863 296170 419852
13330 419852 360069 -63840 259136 -136423 224155 -16053 71326 428498 277291 71275
13319 156983 366832 342985 350148 377299 -99318 135682 61941 216146 202123 107712 20138
13307 259838 396765 -155317 150097 91245 24943 59932 372918 251979 172081 201627
13297 201627 7133 49935 337846 -590 -77921 292658 -92380 550344 -25272 24623 164327
13286A64327d934A49484o5998J2383L96683a6979F1642a8344A35803J60205a04473
13274G1783a71522C75594J18057A37066j9095A2436L82553g1472p9944f5795B93582
13262C84793H9014K13734j37187q123J73278r942A05076K8549B2972r75J21259
13251A43256B9728M01744A73482J71517a13150K9806B01228k2316G4508J09858
13241A84366b04986A4071c96891A84379B412b35292B67406H8930K2942b89786
13230d4624A4190N39483A32990J40475B0314h7552B7231b01220C01477g6025C69453
13218B17142f7489B43725k2216N4794L4017p1327A14755N2823o3206q916m7303
13207D8153g3430A47973g1991j92366B25052F9631A2641h9691b1780j76819A02584
$$ plain form
13286 164327 -4934 149484 83486 95869 492552 -16979 61642 -18344 135803 296008 -104473
13274 71783 -171522 375594 493651 137066 117971 12436 394989 -71472 -151416 -65795 293582
13262 384793 89014 302748 165561 157438 330716 320774 105076 133625 22972 21997 143256
13251 143256 29728 431472 173482 344999 -113150 -83344 201228 178912 74508 184366
13241 184366 -204986 14071 -396891 184379 2412 -235292 267406 88930 111872 -289786
13230 -44624 14190 553673 132990 273465 20314 -87552 27231 -201220 301477 -76025 369453
13218 217142 -67489 243725 221509 276303 310320 238993 114755 167578 104372 95456 48153
13207 48153 -73430 147973 -71991 -264357 225052 69631 12641 -89691 -21780 -198599 102584
13195c8836A29517E0212L4463f7213A62515D2431A9661c5961B04273J05983b87442
13183A8284p867a41286C9910c26137J0939C1026j1910e5042j4177A11911K03827
13172C15738j19386c2191B51970c5060B50062A7689g0819D45024a07679K4063
13162h3616j97890C39582j32686N8671d9529A90967F5363K90036A02132J13405
13152B15537i333A40771J19413J88366k04962B0696K16143g3496E6188L77122
13142D33310b69251I2767f9422B18522a05838L4185B384J68523b50240A07190
13131f3784l2883K0224A12880E4772c0055A15733B4945a56635K2044B30583m8224
13120A82359c16139b0782A70999q841N6005j03033J68687F8377d8836A95969F1068
$$ plain form
13195 -38836 129517 50212 84675 -67213 162515 42431 19661 -35961 204273 310256 -287442
13183 18284 10417 -141286 39910 -326137 -315198 31026 19116 -55042 -69219 111911 315738
13172 315738 196352 -32191 251970 -35060 250062 17689 -70819 445024 -107679 -83616
13162 -83616 -281506 339582 206896 265567 -49529 190967 65363 355399 102132 215537
13152 215537 -9333 140771 260184 448550 243588 20696 236839 -73496 56188 433310
13142 433310 -269251 92767 -69422 218522 -105838 -71653 2384 170907 -250240 107190
13131 -63784 -96667 -76443 112880 54772 -30055 115733 24945 -156635 -134591 230583 182359
13120 182359 -316139 -20782 170999 162158 218163 115130 283817 68377 -48836 195969 61068
13108F4992c59617E0727K04934B9445J49253a03435N0793A4952L37470A63723
13097i1919A74293F2399K32227q0517q2541g0354A24881J69426J40730C7341b2681
13085C25317o728a52927B19091n4305J80620E1995b9773A30591o1939B448M54958
13074D57406a95565B07753G9614P2735p3305j166J33320B9636J36169K61431b039
13062B50111j10481C5741K32507e1803C22829A12938o907c48936B07445a13348
13051B37857B6444J87164F2013i6686D2016K65304a56262A49719k0711J81184
13041C10192b84507E3691Q032A8784Q0368K0886b1612j26671A97593C1186b48794
13029D6311c6600C94366A06435a49076A37357A2609K34606m9070g887l1091j45577
$$ plain form
13108 64992 -359617 50727 255661 29445 178698 -103435 -52642 14952 352422 163723
13097 -91919 174293 62399 294626 214109 131568 -70354 124881 294307 435037 37341 -22681
13085 325317 318589 -152927 219091 164786 345406 51995 -29773 130591 68652 2448 457406
13074 457406 -195565 207753 79614 152349 79044 77878 211198 29636 165805 427236 -2039
13062 250111 139630 35741 268248 -51803 322829 112938 106031 -348936 207445 -113348
13051 237857 26444 213608 62013 -96686 42016 307320 -156262 149719 129008 310192
13041 310192 -284507 53691 61723 18784 99152 120038 -21612 -148283 197593 31186 -248794
13029 46311 -36600 394366 106435 -149076 137357 12609 247215 198145 -7887 -38978 -184555
13018a84555A85887A6828g8365F8381N1592J68010e6014I8187l5712N3195d7901
13006A20898m30c219j5372B37270D2713i3295B11793R8214A2353b40093D15286
12994a54086D3791A6692J31665a30840q204M7566E3185c07124c3982o235l9391
12983g9608F5407J3210J06960C5929f838C00094b7126R275n7116K9429C18429
12971b13332b6074j3046I9608J1205c45727B4507d7129l8808K6486C2925J51967
12960A84892a45840J3472o807A26773c8223p1287q1363A07551b06023d6689C03691
12948C62944m8165E5382b55493j35920G758i0034E6120K01931d3746j176j89538
12937b34460i5434k1325j99579A56844n0678C9289K43290j02309K5375a86133
$$ plain form
13018 -184555 185887 16828 -78365 68381 119973 287983 -56014 98187 62475 115670 -47901
13006 120898 120468 -3219 -18591 237270 42713 -93295 211793 310007 12353 -240093 415286
12994 -154086 43791 16692 148357 -130840 -139044 -91478 53185 -307124 -33982 -40217 -79608
12983 -79608 65407 78617 185577 35929 -6838 300094 -27126 -17851 -74967 -45538 318429
12971 -213332 -26074 -39120 99608 110813 -345727 24507 -47129 -85937 -59451 32925 184892
12960 184892 -145840 -132368 -139175 126773 -38223 -109510 -190873 107551 -206023 -46689 303691
12948 362944 314779 55382 -255493 -391413 7758 -90034 56120 258051 -43746 -44922 -234460
12937 -234460 -95434 -116759 -316338 156844 106166 39289 282579 180270 205645 -186133
12926b68937I8682b8719f409k33448k9819C18090A18226c00517A44903o1379J62298
12915B45822b17261j7981r3473A67963R0989h659B02756a21180k9181A64897M5164
12904B10061C3432b98700G5105a23357n2263B60082g2363k2804C1249Q4279J26372
12893B41900b7313I6676j6167b0105A31694K27685e6714A87550R1642a76454B9868
12881B6483J26419a3913B42769a09708J8312l0167m1144A10424m4345h0562r902
12870i0464F1153R1501a55774p0227K0271B60712B2489c080A86688K9023B8020
12858d9846B6077p410K9827a37147B90227b08689N7953A6568J07834J62215j15943
12847A70674i8784A51825N5337j7232f2610C2667K28868c48415J22822A42075
$$ plain form
12926 -268937 98682 -28719 -6409 -239857 -269676 318090 118226 -300517 144903 83524 245822
12915 245822 -217261 -235242 -328715 167963 258952 -8659 202756 -121180 -150361 164897 210061
12904 210061 33432 -298700 75105 -123357 -175620 260082 -72363 -95167 31249 115528 241900
12893 241900 -27313 96676 80509 -20105 131694 359379 -56714 187550 279192 -176454 29868
12881 26483 152902 -13913 242769 -109708 -91396 -121563 -162707 110424 66079 -80562 -90464
12870 -90464 61153 152654 -155774 -226001 -205730 260712 22489 -3080 186688 215711 28020
12858 -49846 26077 18667 48494 -137147 290227 -208689 -150736 16568 124402 286617 170674
12847 170674 -98784 151825 207162 189930 -62610 32667 261535 -348415 -225593 142075
12836H5443d0281l1906B69199p7959A308f0895B73508b54037A06530d8858D58763
12824a15245d4202C0240a6835D6391R4077J63554G4041Q1127b2942m7043G9295
12812a98671B39929q1568b99684H5136J05197J11982a25903O809e2035B0280O758
12801B7038P8595d585k2206A50996G933b18753j799j70803C0946b25556B37200
12789e2052H0238J8654b16534d7721A24366h9355I6392a61220c6230B46599n3652
12778A92947a04789k05536g8448G7810N7487i1221L4099o5970j74775J32170I5778
12766c72904a5898r3217j48322P8520H1899N9232a24814A09636a6642B0888Q5685
12755A06573J07200a57251D43146e482k98427b0911j39266B0889J21558K6827
$$ plain form
12836 85443 -40281 -72187 269199 191240 1308 -60895 273508 -254037 106530 -48858 458763
12824 -115245 -44202 30240 -16835 46391 140468 304022 74041 155168 -22942 -69985 79295
12812 -198671 239929 158361 -299684 85136 190333 302315 -125903 -119094 -52035 20280 27038
12801 27038 105633 -4585 -26791 150996 7933 -218753 -220552 -391355 30946 -225556 237200
12789 -52052 80238 98892 -216534 -47721 124366 -89355 96392 -161220 -36230 246599 192947
12778 192947 -104789 -310325 -78448 77810 135297 -91221 -57122 -123092 -297867 -165697 95778
12766 -372904 -15898 -109115 -257437 -178917 81899 141131 -124814 109636 -16642 20888 106573
12755 106573 213773 -157251 443146 -5482 -303909 -20911 -160177 20889 142447 169274
12745A69274e5478l9180A20384g2218C7247b1452A21535B0380i0465B19637o5095
12734A54542c38170B59686a24842p4061A40019J28632h0545E9139O7136a81525
12723a23741B69717H3114K4225b96907i1165I9817J65528b63929A01497c76297
12712g9243C87726B6881a58547A93818l9022b8715A10776C8439h5015D01824A40464
12700A8846K2589i5494m3269B77835q2859b4358B75771A06632K42716A35479K39936
12689C75415A31885g8265E4496J06366K37542j88789D7335O2903a53966f5848
12678B1938K6842J48033K62527C3572K05381G923J55794A7213b4927a1910k432
12667a4342C3896J54031O1188b41542c9794j04657A14463J75962b39276C67602
$$ plain form
12745 169274 -55478 -94658 120384 -72218 37247 -21452 121535 20380 -90465 219637 154542
12734 154542 -338170 259686 -124842 -198903 140019 268651 -80545 59139 126275 -181525
12723 -123741 269717 83114 107339 -296907 -91165 99817 265345 -263929 101497 -376297
12712 -79243 387726 26881 -158547 193818 154796 -28715 110776 38439 -85015 401824 140464
12700 18846 41435 -95494 -138763 277835 194976 -24358 275771 106632 349348 135479 375415
12689 375415 131885 -78265 54496 160862 398404 209615 47335 110238 -153966 -65848
12678 21938 48780 196813 459340 33572 238953 7923 163717 17213 -24927 -11910 -14342
12667 -14342 33896 187927 249115 -241542 -39794 -144451 114463 290425 -239276 367602
12656C75414q2699A40007a17604B44037a17751A07822J99857f4604B77989j38545
12646A39444a95931N7652d6781j47249c4442A73678H3183g4310b930E7557J62457
12635B20014f930A02464a04788H2091J54607c50757a52265E0934K36559L3974
12625C21467A33980M21084k19959H7067K81928A23639a84656H8823m2381Q6973
12615A33415b62305I9445h9881q3556j9060a3268l5600a3490j49269B76688H9945
12603C282a93166A16297R0866I0661R6949n995a88513C61099c4507l59728A61529
12591b27453F1115e3901f309D7796M6117R464a57050J2950j9256g4167D5326J49179
12579A94505K05306B3800g2788B11909b84626H2387J0222K73895G6313K1505Q7190
$$ plain form
12656 375414 292715 140007 -117604 244037 -117751 107822 307679 -64604 277989 139444
12646 139444 -195931 -138279 -46781 -194030 -34442 173678 83183 -74310 -2930 57557 220014
12635 220014 -6930 102464 -104788 82091 236698 -350757 -152265 50934 287493 321467
12625 321467 133980 555064 335105 87067 368995 123639 -184656 88823 46442 133415
12615 133415 -262305 99445 -89881 -173437 -192497 -13268 -48868 -13490 -162759 276688 89945
12603 3282 -193166 116297 207163 90661 187610 181615 -188513 361099 -34507 -394235 161529
12591 -227453 61115 -53901 -6309 47796 93913 103377 -157050 -144100 -163356 -74167 45326 194505
12579 194505 399811 23800 -72788 211909 -284626 82387 92609 366504 76313 97818 185008
12568A85008A2889a03423j07827D3549a90827m8236A54282c2470m08059g2978
12557B19597g1100j5700A3527N9415a12999k0705B0273J9172c0441k60779J07778
12546a83442A98851c34759A56678b53952J2077C808a4575E86343b23382q2506
12536c05888e8804F2255B0165P2837D4335a18026K6013D11345E8609a36089A07269
12524A18617b09260A3815a74415F7471g435A97441q4785P4482P8683k3085A14599
12512A51368J32433N7277i2651B06014J18899j05999n2957C7573L34038h2150
12501B9432J15150K6646B2367J64783f901k46130E3402a39728k01745a08983e4403
12489b7336j00052D6225k875a61136d8818l925D25355a04144D5700K92859i5015
$$ plain form
12568 185008 12889 -103423 -211250 43549 -190827 -239063 154282 -32470 -440529 -72978
12557 219597 -71100 -86800 13527 72942 -112999 -133704 20273 39445 -30441 -291220 -183442
12546 -183442 198851 -334759 156678 -253952 -241875 3808 -14575 586343 -223382 -305888
12536 -305888 -58804 62255 20165 93002 44335 -118026 -92013 411345 58609 -136089 107269
12524 118617 -209260 13815 -174415 67471 -7435 197441 112656 187138 265821 242736 114599
12512 151368 283801 341078 -92651 206014 324913 218914 165957 37573 371611 -82150
12501 29432 144582 171228 22367 187150 -6901 -253031 53402 -139728 -341473 -108983 -54403
12489 -27336 -127388 46225 43350 -161136 -48818 -52743 425355 -104144 45700 338559 -95015
12477b23124J07679I4009a15315G5406A5589a09898C0476A0123N2920B8788g2873
12465e0412j47345B89979l196j36964m3412B6745h3241l602j32157B15247N8046
12454B73293b20985N1970C04421b3646e063k50233B26776b06193C40693A66561
12443b7246A72704H4471R3467a09895k1896B07706G1446a35209j56970A61457
12432A03581a91351c7547A79476F7209c02436a17340M7086L901l8707k0372B12923
12420h2138D2278A8535h0218c3921k2848j27902J5495c1091A96911b18023A20582
12408a93740C44526a32071k39837l7374A34669b93071R5761d3744A89872d3479
12397d8k46602e5855A01425A0496J85911b01501B3116N99827A27873f8468G9714
$$ plain form
12477 -223124 -115445 94009 -115315 75406 15589 -109898 30476 10123 63043 28788 -72873
12465 -50412 -197757 289979 286783 149819 106407 26745 -83241 -86843 -219000 215247 273293
12454 273293 -220985 -169015 304421 -23646 -5063 -255296 226776 -206193 340693 166561
12443 -27246 172704 84471 177938 -109895 -131791 207706 71446 -135209 -292179 161457
12432 103581 -191351 -37547 179476 67209 -302436 -117340 -70254 -66353 -105060 -125432 212923
12420 -82138 42278 18535 -80218 -33921 -56769 -184671 -169176 -31091 196911 -218023 120582
12408 -193740 344526 -132071 -371908 -409282 134669 -293071 -197310 -43744 189872 -43479
12397 -48 -246650 -55855 101425 10496 196407 -201501 23116 622943 127873 -68468 79714
12385c5327E17355B41898b60171B58168N4476I6265L3798K0399a9279i168A1606
12373G3259L78044I4424C9116J62808b04383p7365f7211L294m9908A55753J28541
12362B84294i8344A53418B1785J21593a68103j28284J34944G123J75114b30981
12351F1859h7523G8519h1142A35517a2326j00651L5790D953J32848a522k0885
12340b2407A53138e4648j34795j05154B12765J30364j61428e4836C62128J53627
12330E15755A10653K07222Q2346j3709l4366I891J28217e6037H5832R8260J59693
12319C43785m4007K4476j35164K93259o8141j28046K4986M5206d9250C7404P5482
12308A12886Q6515q4046o60n7224Q7590n0944R121a2245D00226e579A63326K1199
$$ plain form
12385 -35327 517355 241898 -260171 258168 312644 96265 130063 150462 -19279 -9168 11606
12373 73259 451303 94424 39116 201924 -204383 -281748 -67211 -63917 -113825 155753 284294
12362 284294 -98344 153418 21785 143378 -168103 -296387 -161443 7123 182237 -230981
12351 61859 -87523 78519 -81142 135517 -12326 -112977 -77187 4953 137801 -1522 -22407
12340 -22407 153138 -54648 -189443 -294597 212765 343129 181701 -54836 362128 515755
12330 515755 110653 317875 400221 386512 352146 9891 138108 -56037 85832 184092 343785
12319 343785 299778 324254 189090 482349 414208 286162 311148 356354 -49250 37404 112886
12308 112886 199401 115355 114695 57471 145061 94117 103238 -12245 400226 -5579 163326 184525
12296A84525q4436R2324L0491A797a28247q247D11247j15445i3782B49063k1947
12285B27116a64710C79082l3342j23271j08538f2399C9146a09855N4120A10927
12274A82383J08399j04015J28327j29185G6724B595J38116e0735A38610d919B58236
12262E8127J98689A25843o43J63724M3287i4119l13441I6049K01501q4332a4043
12250d6536B27612Q8297E6746b0874j87142a7434E0800I748a802A70667L0849
12239B01516F1690b69197C00475b7260D2211b66866B40850J16692g9200p7011
12229a56211o1640A356K48688n7063O2571a85956Q5769I2759M59022D6261L67184
12218D13445j15897e0878B86709a31326B38998C3139L87599A62158J98555j43579
$$ plain form
12296 184525 100089 192413 222904 1797 -128247 -136494 411247 295802 -93782 249063 227116
12285 227116 -164710 379082 345740 222469 113931 -62399 39146 -109855 -55735 110927
12274 182383 290782 186767 315094 185909 76724 2595 140711 -50735 138610 -4919 258236
12262 58127 256816 125843 125200 288924 332211 -94119 -407560 96049 297550 213218 -14043
12250 -46536 227612 315909 56746 -20874 -208016 -17434 50800 9748 -1802 170667 201516
12239 201516 61690 -269197 300475 -27260 42211 -266866 240850 357542 -79200 -156211
12229 -156211 -217851 1356 250044 192981 255552 -185956 -100187 92759 551781 46261 413445
12218 413445 297548 -50878 286709 -131326 238998 33139 420738 162158 360713 217134
12208B17134n7289a77715A65956J39168j28737P9334i5669E599g5151o7863d5371
12196I1470A6186J2163L91879i1302A64009Q4307b9269A78944G4059J06252a14550
12184A92105R4650A29746K43395m9004f9253A82907J3856a01895P659A79227c27094
12172B55513A22703a03101C13008n8218Q7999k3974j8178A46359K3394K74027
12162D43780o2183a90611A67893d1874A34422i98E3485R8773a62402B59201D9346
12150c8651k11396C7185j0349M6213q980K41415D3590O4682B9175K12182e3917
12138B27805C6981J28078F2227J75245k4089p8578a45836A61524B5233a12852
12127i1414i281H3279k595L82286F9485M82811k37455I0350J30873G2926L51233
$$ plain form
12208 217134 159845 -177715 165956 305124 176387 255721 -95669 5599 -75151 -143014 -45371
12196 91470 16186 28349 420228 -91302 164009 248316 -29269 178944 74059 180311 -114550
12184 192105 286755 129746 373141 324137 -69253 182907 196763 -101895 -94236 179227 -327094
12172 255513 122703 -103101 313008 254790 342789 318815 300637 146359 169753 443780
12162 443780 381597 -190611 167893 -41874 134422 -998 53485 152258 -162402 259201 49346
12150 -38651 -250047 37185 26836 73049 64069 305484 43590 108272 29175 241357 -53917
12138 227805 36981 165059 62227 237472 213383 134805 -145836 161524 25233 -112852
12127 -91414 -9281 83279 80684 462970 69485 552296 314841 90350 221223 72926 424159
12116D24159C7641K36200D2302a1684B38144b8631F523K48524L296j19968g878
12104A59125N9539b7196C7429L21108A9455g3126A59271c8898d418j66851B33212
12092c4159G6103J87290j07540i3432D9165L96620A01743J97072L2715G9033g7621
12080f9720j55310a3370D21886d69287a00346B54994H075L56797j77588Q3419
12070B70703l8118N7120A21892R2129H6226J06008c5585A14736J58006i1050j97363
12059b88413B9141d4265k74591A08555k9171J13729E9321j2249q369L8275a56807
12047c56731A00241j3310h8530D54911A10648j4775J46327J0882e9581B44928
12036A68229e6753A26286i5651M2787B10900a95543a8474C50926j74495J29024
$$ plain form
12116 424159 37641 273841 42302 -11684 238144 -28631 6523 255047 258343 138375 -7878
12104 159125 218664 -27196 37429 358537 19455 -73126 159271 -38898 -4418 -171269 233212
12092 -34159 76103 263393 155853 -93432 49165 445785 101743 298815 331530 79033 -77621
12080 -69720 -225030 -13370 421886 -469287 -100346 254994 8075 364872 187284 270703
12070 270703 232585 289705 121892 214021 86226 192234 -35585 114736 272742 -91050 -288413
12059 -288413 29141 -44265 -318856 108555 79384 193113 59321 47072 38703 76978 -156807
12047 -356731 100241 86931 -88530 454911 110648 95873 242200 253082 -59581 244928
12036 168229 -56753 126286 -95651 -52864 210900 -195543 -18474 350926 176431 305455
12026C05455o2667K51606A96694j3778d6132C90922f1699o8560B1787J58858B7570
12014A69581D0673K0766o989L05303j69258a30386B22653r1625f3688j44272c7509
12002A25025n2903c56522J23513E5025a54916C04406f2310j7580C11810e9736
11991A70526a56233a9326j00682A45881B3930b92833a06738K019b340j56588A6003
11979g6007A24054f8256c951j48611G0012G813e1508H5674a68131B05126b24633
11967A76159a52255K2674r2380J10803p0225q1523H2662C8907e5875I660O6323
11956G5983Q8473e5337j74415f979A82081H9825m2943J75131a70303A32673d7204
11944d1216j76379p292A73970a12162B7852N8900c26483G8532N7987A2647b34263
$$ plain form
12026 305455 242788 494394 196694 182916 -46132 390922 -61699 -130259 21787 180645 27570
12014 169581 40673 61439 54450 359753 190495 -130386 222653 131028 -63688 -207960 -37509
12002 125025 72122 -356522 -233009 55025 -154916 304406 -62310 -79890 311810 -59736
11991 170526 -156233 -19326 -120008 145881 23930 -292833 -106738 -104719 -2340 -158928 16003
11979 -76007 124054 -68256 -3951 -152562 70012 7813 -51508 85674 -168131 205126 -224633
11967 176159 -152255 -129581 -221961 -111158 -181383 -262906 82662 38907 -55875 9660 75983
11956 75983 164456 -55337 -229752 -6979 182081 89825 46882 222013 -170303 132673 -47204
11944 -41216 -217595 -224887 173970 -112162 27852 86752 -326483 78532 136519 12647 -234263
11932f2075j16276A20128J37427h3202n8130n0667O8580d1186F8804a16445l8048
11921a54493j8822d1881B67293F7731J354J31272B271a54526f7251j03815B98669
11909b22047P3I5937j6890d78049a95602B57959G8648c62455B67267D3180O6589
11898A09769P0385E2690J08430a90642B21700i3438f301j53615A62835a59602
11887b08544C66797c9214k55130g0719E5778a07118C7201b25482L129N5896E3030
11875B7866i9693l3293j3620A84183p4278Q9784c7893G766K11270c29836C40286
11863h5725j74543b852B34753g1638b2969A66019F4797e6375j054k39710i0635
11851a33837k58032A5435a14747l32600F8084C3215N3707b98585a08900j47392
$$ plain form
11932 -62075 -178351 120128 257555 -83202 -141332 -191999 -123419 -41186 68804 -116445 -154493
11921 -154493 -173315 -41881 267293 67731 69085 200357 2271 -154526 -67251 -171066 298669
11909 -222047 -221974 95937 79047 -478049 -195602 257959 78648 -362455 267267 43180 109769
11898 109769 180154 52690 161120 -190642 221700 -93438 -6301 -159916 162835 -159602
11887 -208544 366797 -39214 -294344 -70719 55778 -107118 37201 -225482 -222353 -166457 53030
11875 27866 -99693 -132986 -146606 184183 109905 199689 -37893 7766 219036 -329836 340286
11863 -85725 -260268 -2852 234753 -71638 -22969 166019 64797 -56375 -57429 -297139 -90635
11851 -133837 -391869 15435 -114747 -447347 68084 33215 86922 -298585 -108900 -256292
11841b56292C03102b62954I3772a57429A02490c35011d2450a1768j0713A05404
11830A69962o924r434b48661b2127k0146j40410k44631a2971k67317M7668b7437
11818A55109a51456P2419j17853A04658a11732A55012d52395a35591j04903C43780
11807B32006b21079A9749f8683j23525A85647f1572A33561Q5297o3437c26251
11796a22697F1307c5682j04988A11496a13277C2854b15420q8158E2739d38443
11785c952B71710f2850A14517d05396J49801f2849H4384i7863d7302C986h2622
11773b06328A27856G908e50334E8786J9000C7854c1771B15235b14186j10159J14266
11762b10079A28922a7006n5614J6102M145a16j22393B1662b8810j64480C292O3270
$$ plain form
11841 -256292 303102 -262954 93772 -157429 102490 -335011 -42450 -11768 -22481 105404
11830 169962 163038 153604 -248661 -22127 -42273 -182683 -427314 -12971 -280288 -232620 -27437
11818 155109 -151456 -79037 -196890 104658 -111732 155012 -452395 -135591 -240494 343780
11807 232006 -221079 19749 -68683 -192208 185647 -61572 133561 218858 155421 -326251
11796 -122697 61307 -35682 -140670 111496 -113277 32854 -215420 -303578 52739 -438443
11785 -3952 271710 -62850 114517 -405396 -255595 -62849 84384 -97863 -47302 3986 -82622
11773 -206328 127856 7908 -550334 58786 77786 37854 -31771 215235 -214186 -324345 -210079
11762 -210079 128922 -17006 -72620 -56518 -52373 -116 -122509 21662 -28810 -193290 3292 66562
11750F6562b01984B64003f8217B54446I5155L23119a24871j97460I6773b54248
11739F3201L47151a02705m8063a0722A47478a44801l0868b2820n0941F97R0057
11728I0754L3707a28537C38222G7288J78053a09545A79724B3064a49322B70978
11717I9250a01265E20324B10960C0958e5482A39898a08589I2581b84773A89546
11706g4626a1297A3634a82462N7593d7777A28185l9761e0258C76a67153A40827
11694b2235G4957J70916g4342D17883b9222A86511m4462M6990p3129b22443f3538
11682B16353b55708A2707L75547i2094l5784e4913A61003a8664C05425c7310l803
11671d1113j36969A5575L30169A60787o9512L3987a62434n8297i5839c7625E6940
$$ plain form
11750 66562 -201984 264003 -68217 254446 95155 418274 -124871 -322331 96773 -254248
11739 63201 410352 -102705 -150768 -10722 147478 -144801 -175669 -22820 -73761 697 90754
11728 90754 124461 -128537 338222 77288 255341 -109545 179724 23064 -149322 270978
11717 99250 -101265 520324 210960 30958 -55482 139898 -108589 92581 -284773 189546
11706 -74626 -11297 13634 -182462 -124869 -47777 128185 88424 -50258 376 -167153 140827
11694 -22235 74957 245873 -74342 417883 -29222 186511 142049 189039 115910 -222443 -63538
11682 216353 -255708 12707 388254 -92094 -127878 -54913 161003 -18664 305425 -37310 -41113
11671 -41113 -178082 15575 345744 160787 91275 125262 -162434 -220731 -95839 -37625 56940
11659B16077e6170j3046A10471d2149L272f223A96927b3103j31533J4735H7398
11647E1093k3756Q0331c7783j46502N2827D40844a76025B73850D6681a38446e7631
11635b67075J2524C70136A10187G92a41889L1206G4407b26577d6292m4115F2779
11623B20185n6571h7780B14678a00247a0364A21572a32779D37636A0724C703K57951
11612B61654d9293A11700e2018H3521J14055a99826G8047b76589b9363o4244B45529
11600c39146J26839F2319j9138H273a37266C9586K01802R9939j62085H6088j1316
11589G4772d0660A33015D5414J13606F7877a11649h582C51688e4340A89241a04363
11577g0886j4476I103L37150k5183B6078J69601G3941a72753d8308p5003L6488
$$ plain form
11659 216077 -56170 -69216 110471 -42149 -38877 -6223 196927 -23103 -154636 -139901 87398
11647 51093 27337 107668 -37783 -184285 -131458 440844 -176025 273850 46681 -138446 -57631
11635 -267075 -254551 370136 110187 792 -141889 -110683 74407 -226577 -46292 -90407 62779
11623 220185 163614 -87780 214678 -100247 -10364 121572 -132779 437636 10724 3703 261654
11612 261654 -49293 111700 -52018 83521 197576 -199826 78047 -276589 -29363 -93607 245529
11600 -339146 -212307 62319 43181 8273 -137266 39586 241388 341327 179242 86088 74772
11589 74772 -40660 133015 45414 159020 67877 -111649 -8582 351688 -54340 189241 -104363
11577 -70886 -85362 9103 346253 321070 26078 195679 73941 -172753 -48308 -123311 -86823
11566h6823H0763e6023G2104a11080B70759c034A32670d6445J0588k5028A16292
11554A74725G5774g5596C02833D7510j2053J04054A3559b68058H0584R535K26646
11543C16765h1501C95131D1472J29979K540K2823A2897M13262j06528r7494b18300
11531d8856l34110J69125B2142P5318P2848n2977M5903f3650G1547g3638F0535
11519A81861a47922C67186c36481A14936K66115F4570f6019A21059a15309c7603
11508a41474m0509A94509B8613L98627A7277L30272e2747R771A95875e4110C25743
11496A64489b3726E4083J45289f9318a5366C0867p207J03149E242K75852e3175
11484B83196o3499o8070d035B30927j12485c25908d1168A26925a05149A87118
$$ plain form
11566 -86823 80763 -56023 72104 -111080 270759 -3034 132670 -46445 -35857 -60885 116292
11554 174725 75774 -75596 302833 47510 35457 139511 13559 -268058 80584 90119 316765
11543 316765 -81501 395131 41472 171451 173991 196814 12897 426159 319631 222137 -218300
11531 -48856 -382966 -213841 22142 97460 170308 117331 163234 -63650 71547 -73638 60535
11519 181861 -147922 367186 -336481 114936 381051 64570 -66019 121059 -115309 -37603
11508 -141474 -181983 194509 28613 427240 17277 347549 -52747 -42976 195875 -54110 325743
11496 164489 -23726 54083 199372 -69318 -15366 30867 23660 126809 5242 281094 -53175
11484 283196 219697 151627 -4035 230927 118442 -325908 -41168 126925 -105149 187118
11473e7482H9033M2434F2674L37152j45173m7502J45554c9917B69081b66927B97991
11461C14417G090L97787m8798A02894i1313K170B17031E5154e6847C72072b6265
11449D14737d1360A37529R2107J97540h2911J5054E0899b39499a3058l8737j59103
11438b10898I6863K9533P6450l8801a458E682a50016R315B4634L55853A13625
11426B45883H8292a25769c3121A30826a72383G4158J17551B3401J82649a55460
11415B37106a90945N1624h843A69913A5517K48971a96603j14994G8465J76901
11405B55366a01471D2269J50301f7341D3779d4172m1858k85413a50033C39160
11394b00657B79303B216J03149a7372k99573A83835f4353j33422B8853O4785l6906
$$ plain form
11473 -57482 89033 131467 62674 399826 254653 207151 352705 -39917 269081 -266927 297991
11461 314417 7090 404877 356079 102894 -91313 -89143 217031 55154 -56847 372072 -26265
11449 414737 -41360 137529 229636 427176 -82911 -67857 50899 -239499 -13058 -51795 -210898
11438 -210898 96863 126396 202846 164045 -1458 5682 -150016 -140701 24634 380487 113625
11426 245883 88292 -125769 -33121 130826 -172383 74158 191709 23401 206050 -155460
11415 237106 -190945 -139321 -8843 169913 15517 264488 -196603 -311597 78465 255366
11405 255366 -101471 42269 192570 -67341 43779 -44172 -86030 -371443 -150033 339160
11394 -200657 279303 2216 105365 -17372 -316945 183835 -64353 -197775 28853 93638 56732
11383E6732f8908F614e2897o8949q2880d8497A36921b54981e7691j48814A39855
11371d6222D8811j7903M043D471O1039b57297B5203h2149l77564g0479C4043c0627
11358a83384j67509A47002j5644C4242P2239P5428i3658l27628B8637b29392A69663
11346A70832a59033B8692f5384B07976a47815D02265F9854J91022A19378E9151
11335c36406C01921A30293c10685J13384A19806h7509A27247B1467a52991o5680
11325b18671g8742p1252b3292p0571j40041k13242B05639H3622J4835h6588H2974
11313a29422B00530b68863c3946D0171J61699B8435a44649j41827J29993n7899
11303b14382j22447B99051e01244a57768O7562l6919j80230a30692p6261g404
$$ plain form
11383 56732 -68908 6614 -52897 -121846 -204726 -48497 136921 -254981 -57691 -206505 139855
11371 -46222 48811 30908 34951 4471 65510 -257297 25203 -82149 -459713 -70479 34043 -30627
11358 -183384 -350893 147002 131358 34242 106481 181909 -93658 -421286 28637 -229392 169663
11346 170832 -159033 28692 -65384 207976 -147815 402265 69854 260876 119378 59151
11335 -336406 301921 130293 -310685 -197301 119806 -87509 127247 21467 -152991 -218671
11325 -218671 -78742 -149994 -23292 -93863 -233904 -447146 205639 83622 98457 -86588 82974
11313 -129422 200530 -268863 -33946 40171 201870 28435 -144649 -286476 -156483 -214382
11303 -214382 -336829 299051 -501244 -157768 -90206 -127125 -307355 -130692 -206953 -7404
11292e1460D7447a94247Q619c5171l4801C7840J64261E9518j2233b2600k54949
11281b77549I0897b31554j2563A72233c62586C1346J95753D4594a82772C3208
11270G1225c08109Q0604E2653a39654m8082k0322A06701b18717a08232n2401M2823
11259a17810A84236C6146i4247D92125I8305j3306j8409b10554g930D1421b01588
11247g3639j63604b9720q2592A50785h2205j33800R7205e2087E7049a26065k43828
11236c69893a58790r5357A1273K23695a03417K8126q1459j18042J13760A9537
11225B5668a23162G4626O0733c65488A31409b04004O4038b046H166a6897A69060
11213e6862j70132K3439B5029K58295b14487A12513m8258a42782A49794a18991
$$ plain form
11292 -51460 47447 -194247 -185628 -35171 -69972 37840 202101 59518 47285 -22600 -277549
11281 -277549 90897 -231554 -244117 172233 -362586 31346 227099 44594 -182772 33208
11270 71225 -308109 -227505 52653 -139654 -187736 -208058 106701 -218717 -108232 -160633 -117810
11259 -117810 184236 36146 -94247 492125 98305 84999 66590 -210554 -7930 41421 -201588
11247 -73639 -237243 -29720 -112312 150785 -82205 -216005 -118800 -52087 57049 -126065 -369893
11236 -369893 -158790 -254147 11273 234968 -103417 -75291 -156750 -274792 -161032 19537
11225 25668 -123162 74626 135359 -365488 131409 -204004 -139966 -2046 8166 -16897 169060
11213 -56862 -226994 -203555 25029 283324 -214487 112513 64255 -142782 149794 -118991
11202B9585e3419l11769d576A26452g4262I6276a56080P3635r1214p8567e0737
11190B91377j00536O8525b30524A71153a12337C80280i8538G0258a17151A24821
11179F6045a62820g4670J2097k25878J05664f9399A72294b6968k25041A26775
11168G5314K71804a44447l0180b1376k9180A89783c19516f9074E5163d16106A05541
11156b28750G9552K97275b06898A50317l7652j1204J7885g384m3019j91538A61141
11144b5000A27564L982n9865K22453F5706K75443a39248j46829f9551h072H2790
11132c7521D2076d5827m2907j2557q8806A4112K74335e0445G2808l904p808L27137
11120C88233A71215K6078C5070a67222A07052i9453k6662I4053a5794B62301a18623
$$ plain form
11202 29585 -53419 -365188 -4576 126452 -74262 96276 -156080 -82445 -173659 -252226 -50737
11190 291377 190841 259366 -230524 171153 -112337 380280 -98538 70258 -117151 124821
11179 66045 -162820 -74670 -62573 -288451 -182787 -69399 172294 -26968 -252009 126775
11168 75314 347118 -144447 -174627 -21376 -50556 189783 -319516 -69074 55163 -416106 105541
11156 -228750 79552 376827 -206898 150317 112665 101461 119346 -7384 -50403 -241941 161141
11144 -25000 127564 131546 71681 294134 65706 341149 -139248 -286077 -69551 -8072 82790
11132 -37521 42076 -45827 -88734 -101291 -190097 14112 288447 -50445 72808 68904 61096 388233
11120 388233 171215 197293 35070 -167222 107052 -99453 -126115 94053 -15794 262301 -118623
11108C33028i5945j7615B41329J49693F3392O578d19575C19233N0071j37653O5020
11097B96671F9600J12304G1188B2682K37909r3859D0656o592J14162J38449n6832
11086B29843j09303K94602A0592c526j34241f1148B2527K89217j47867L31440
11076D95317B42165K54091A81684G7319J34172r7673K02189k3587k3623K07801
11066D76598A90158J50655M5926n6881K3305J6382Q9132K5335B40803K25202M49157
11055I15162k24332B32355N9021J35669J58007J66448K18525k20710C00163J79598
11045D79761K07819j01057O3233Q4048o4982o4432R8097M5761R429l2572l7993
11034F87112L4180k97858J8173O89320k87526j32935P6070L25661l40730o6690
$$ plain form
11108 333028 -95945 -113560 241329 391022 63392 69970 -419575 319233 369304 231651 296671
11097 296671 69600 181904 71188 22682 260591 166732 40656 34064 148226 286675 229843
11086 229843 120540 415142 10592 -3526 -137767 -61148 22527 311744 163877 495317
11076 495317 242165 496256 181684 77319 211491 113818 316007 292420 268797 476598
11066 476598 190158 340813 386739 329858 353163 369545 458677 484012 240803 466005 915162
11055 915162 690830 232355 291376 427045 585052 751500 970025 749315 300163 479761
11045 479761 687580 586523 649756 733804 668822 604390 702487 748248 757677 725105 687112
11034 687112 721292 423434 441607 1130927 843401 710466 786536 1112197 771467 704777
11024G04777C46674L3093K61928p1849K83852l02678K08518J7551j30034j52375
11014D94680m1854K66265k90633J94481R6347j79194K5612k63514N68149j34316
11004G36023l11450K65824l05840K30347j704k99026L08367J5840l0282n4422
10994E53677j41350K35849J22807k50429K9354K71630L206l66828K64444o4659
10984F57701n2708K85243R9695l73907K98999o1824K05695j48597Q2809K77004
10974A270110n3363J65364J78789K50587k04459O32247j21012N86248j37361L39963
10964B907113j05376r1815J13186m90131o2564l81308l19974j29699l32200L89506
10954A496738J35794l46565Q164j21165P1904k64408J88838q4702k07379j54563
$$ plain form
11024 704777 346674 379767 641695 569846 853698 551020 759538 777089 647055 494680
11014 494680 452826 719091 428458 622939 719286 540092 565704 302190 870339 736023
11004 736023 424573 690397 384557 614904 613200 314174 622541 638381 608099 553677
10994 553677 412327 648176 770983 520554 549908 821538 824744 457916 722360 657701
10984 657701 604993 890236 989931 616024 915023 853199 1058894 910297 993106 1270110
10974 1270110 1216747 1382111 1560900 1811487 1607028 2239275 2118263 2704511 2567150 2907113
10964 2907113 2801737 2709922 2823108 2332977 2270413 1889105 1569131 1439432 1107232 1496738
10954 1496738 1632532 1285967 1294131 1172966 1244870 980462 1169300 1084598 877219 722656
10944G22656Q2551k48616q7500J14042H1233L20616c2970j80683C3084P8433a07073
10932A21820n4087L78946j35525e1064K0003A60266K00450A24328b59032a14211
10921D2387N9705J33736j2830a08900d5061j7443o346j78245a0829D7794Q6125
10910A33919K78270b3080D1885O3443b58769o642J29179k14086A02846b51299
10899B4133J86931a48571K8023C2092c1962E5080a150A06023a43734M7482j70804
10888b67056R7607C6131h0499B8495a86576D4555L06175A07860C020d7017A12286
10876b88031f7302k6898B26775a26073k6585f9935k34034A08693J96880d9703
10865A37805b14678j55382d5620m4320A16471a10336B38766D7196a87026h8362
$$ plain form
10944 722656 805207 556591 469091 583133 81233 401849 -32970 -213653 33084 111517 -107073
10932 121820 67733 446679 311154 -51064 -31061 160266 360716 124328 -259032 -114211
10921 42387 102092 235828 222998 -108900 -45061 -62504 -68850 -247095 -10829 47794 133919
10910 133919 412189 -23080 41885 105328 -258769 -265411 -136232 -350318 102846 -251299
10899 24133 211064 -148571 -120548 32092 -31962 55080 -1150 106023 -143734 -96252 -267056
10888 -267056 -169449 36131 -80499 28495 -186576 44555 350730 107860 3020 -47017 112286
10876 -288031 -67302 -94200 226775 -126073 -152658 -69935 -303969 108693 305573 -49703
10865 137805 -214678 -370060 -45620 -89940 116471 -110336 238766 47196 -187026 -88362
10854a62620q4453P4773B71393i7921C8018N6348l6974a59168A93405Q4642I1184
10842a01618d9444I0924K23530A25742K05205b55196c3119j26516O7857K1195
10832g0583k43933A8431d6199C0271c28645a00819B36651c16518B46324i002C45888
10820b7393F6460b38066e8857B8802a01343L4263A04562j0824c58534C07747a17280
10808C3057N8505c88435N2876G0943a52490j31801F8383C1566J06438b74318A15619
10796I0183M840b16004B56913f5548B13784H1637k0143a48828c0054A63277D8491
10784b06744f2029A97179e69378K84100C1878g4979m0992a1261E7988K09726d7936
10772a67603d7327B57766A27422l8713a90242l3933E1333c9253E6094a42445a4256
$$ plain form
10854 -162620 -247073 -172300 271393 -97921 38018 94366 57392 -159168 193405 278047 91184
10842 -101618 -49444 90924 314454 125742 330947 -255196 -33119 -159635 -91778 -70583
10832 -70583 -314516 18431 -46199 30271 -328645 -100819 236651 -316518 246324 -9002 345888
10820 -27393 66460 -238066 -58857 28802 -101343 -67080 104562 93738 -358534 307747 -117280
10808 33057 91562 -388435 -335559 70943 -152490 -284291 68383 31566 138004 -274318 115619
10796 90183 95023 -216004 256913 -65548 213784 81637 61494 -148828 -30054 163277 48491
10784 -206744 -62029 197179 -569378 -285278 31878 -74979 -115971 -11261 57988 267714 -47936
10772 -167603 -47327 257766 127422 88709 -190242 -224175 51333 -39253 56094 -142445 -14256
10760c05201a33272N7587B619a19156c7564l24386a60760o9623n8053A46028b41051
10748A97704l6295J86445A33458a25008A49956d3570a2493C55166a81649N4261
10738a27388M9003l11669a32779a215k01973C4331a00756j47442F2266J53804
10728B16070f3938A16733c35513A06678f6688k14889d2500a3481B36989b2786
10717A74072E4880R5253K1694g0039B04523d6418B63052G3708h801p9143D8163
10705a5346D3711a07435D3551b23971J10624A24565h5328q3864M931D3353a85481
10693A31098P7075b98799J18774d5628k45867c4420r11B1353b3363j1819n9318
10682i4500G1132o774K47953f5606k37911B33377e7605A898a38801j60642I8883
$$ plain form
10760 -305201 -133272 -75685 2619 -119156 -37564 -361950 -160760 -230383 -288436 146028 -241051
10748 197704 161409 347854 133458 -125008 149956 -43570 -12493 355166 -181649 -127388
10738 -127388 -78385 -390054 -132779 -1215 -203188 34331 -100756 -248198 62266 216070
10728 216070 -63938 116733 -335513 106678 -66688 -281577 -42500 -13481 236989 -22786
10717 174072 54880 150133 171827 -70039 204523 -46418 263052 73708 -8801 -87944 48163
10705 -15346 43711 -107435 43551 -223971 -113347 124565 -85328 -169192 -164261 43353 -185481
10693 131098 208173 -298799 -180025 -45628 -291495 -34420 -35331 21353 -23363 -35182 -94500
10682 -94500 71132 64358 312311 -65606 -303517 233377 -57605 1898 -138801 -299443 98883
10670b81896o8472J57081N3664j71568A77587a27732A15129B4933A0184i1450
10659F306a6127m5874B96465a33547K7965k2001B33246a41768E3652a31303A0395
10647g6455r6401b3530a720m63667h8255E4713K8759a94309K420B8777R496J55795
10635A94068a46111k9362C1401c99927A86284e6133j98447k15858A77951o8629
10625A09322a64057j29071a16585j53310E5994a40842e211j60048A10714A1515
10614g1865A24140J0849d27003J52101I4218O2805g2797A5796J5463b61310b2105
10602h9915j05635j08112C6723a38068k06386A9680d46059N1330c3489G5175a44951
10590A03373K10620a46938A66841D601d1129j04645k26726D5950d6351a8571o9837
$$ plain form
10670 -281896 -350368 -193287 -139623 -311191 177587 -127732 115129 24933 10184 -91450
10659 6306 -16127 -62001 296465 -133547 -105582 -127583 233246 -141768 53652 -131303 10395
10647 -76455 -172856 -23530 -1720 -465387 -88255 54713 83472 -194309 -191889 28777 38273 194068
10635 194068 -146111 -175473 31401 -399927 186284 -56133 -254580 -470438 177951 109322
10625 109322 -164057 -293128 -116585 -269895 55994 -140842 -5211 -165259 110714 11515
10614 -71865 124140 134989 -427003 -274902 94218 157023 -72797 15796 31259 -261310 -22105
10602 -89915 -195550 -303662 36723 -138068 -344454 19680 -446059 -394729 -33489 75175 -144951
10590 103373 313993 -146938 166841 4601 -41129 -145774 -372500 45950 -46351 -18571 -88408
10579h8408F5343e3394K4450m43367a36507r6209F9980b82132J19304D6772J34987
10568A81759a02055H2544g7099n0332q872H0054a23761B93355c19494a18987l5401
10557a54388l9579A26442f2976A59980a56795E411a42140N8614K5957n3923o0810
10546a72302A04837K9943h0220C76872c03713a34876e8155J6527m9008d3231k95944
10535c39175J67804L4243k439n4623c4267A22544l9422k9474B1126a15685A16269
10523D2932b66407h9370m3776l3863G8586R5860a80024F6729M4257b13709j34074
10512c47783a5384D98527c3883r8717J7292B65728b70853J01317k3304b2610j42722
10501a65332G4011L009P8027a8457E0973B5432b81859B23509b32426R4004f3102
$$ plain form
10579 -88408 65343 -53394 -28944 -472311 -136507 -232716 69980 -282132 -162828 46772 181759
10568 181759 -102055 82544 -77099 -127431 -136303 80054 -123761 293355 -319494 -118987 -154388
10557 -154388 -193967 126442 -62976 159980 -156795 5411 -142140 -83526 -57569 -111492 -172302
10546 -172302 104837 134780 -80220 376872 -303713 -134876 -58155 -41628 -90636 -43231 -339175
10535 -339175 -171371 -137128 -139567 -194190 -34267 122544 83122 53648 21126 -115685 116269
10523 42932 -266407 -89370 -133146 -167009 78586 174446 -180024 66729 110986 -213709 -347783
10512 -347783 -15384 498527 -33883 -132600 -115308 265728 -270853 -169536 -192840 -22610 -165332
10501 -165332 74011 77020 155047 -18457 50973 25432 -281859 223509 -232426 -138422 -63102
10489c4110A19422a80135F8035J8863a13496N0318F0219J16201a42272E7431d1334
10477A33748a33406C85756A60842L7718L2846p8242O5924k1862J5422h8072B48958
10465C13947a15312a6786B7868L96487a66122e9230A76580d0378B34245b84337
10454B23675p2598a6007B50569g5540K2161H144J86271c67002a73473B8968b67722
10442a6992k17252f7888k31254d5007k0870k09581A47535c6363l07012A94516
10431B39638A11755K1180m8807Q9016a11432N5399a2332r3531A32986E4559a7232
10419A93878a66146a3094j18412A71730d8765A15666c37444J12359O5892E799
10408g4585A72071c8084D1493e270A49303j4740e2048j89228N6371r3593n9395
$$ plain form
10489 -34110 119422 -180135 68035 86898 -113496 -63178 60219 176420 -142272 57431 -41334
10477 133748 -133406 385756 160842 198560 231406 153164 219088 197226 212648 -88072 248958
10465 313947 -115312 -16786 27868 424355 -166122 -59230 176580 -40378 234245 -284337
10454 223675 151077 -16007 250569 -75540 -53379 8144 194415 -367002 -173473 28968 -267722
10442 -16992 -234244 -67888 -299142 -45007 -65877 -275458 147535 -36363 -343375 194516
10431 239638 111755 132935 84128 173144 -111432 -56033 -12332 -105863 132986 54559 -17232
10419 193878 -166146 -13094 -131506 171730 -48765 115666 -337444 -225085 -159193 5799
10408 -74585 172071 -38084 41493 -5270 149303 134563 -52048 -241276 -184905 -278498 -337893
10397c37893C6495b48421B58358a65678A78632i9193c9956A18257n2011a11533
10386b1445r7829d1191A81540i479m0528f489n0828C91470F1955L0791h7491B51667
10373c6516j7383C24219h8132B73737q4276J6601m5385J58077A28671M28121k1396
10362E35396k45995j25129L98054A24090a0644B71445K75624a27641D39789j61831
10352B77958A10154M3946J09348A18025J88382L81993k40340N0705n9383j43679
10342B95703J223J78934a33214A6484N45976k22579d6304A11393J5116K20007
10332C46516A22718e531A62996b1525H2859J21938J0740J42461h3233C90353A3472
10320H1924J70958J48399c433D40105N8399b2719A54676F3078O6196O6175K08518
$$ plain form
10397 -337893 36495 -248421 258358 -165678 178632 -99193 -39956 118257 66246 -111533
10386 -21445 -119274 -41191 181540 -9479 -50007 -6489 -57317 391470 61955 92746 -87491 251667
10373 -36516 -53899 324219 -88132 273737 189461 206062 160677 318754 128671 556792 535396
10362 535396 289401 164272 562326 124090 -10644 271445 547069 -127641 439789 277958
10352 277958 110154 154100 263448 118025 306407 688400 448060 498765 439382 295703
10342 295703 296926 475860 -133214 16484 562460 339881 -46304 111393 126509 346516
10332 346516 122718 -5531 162996 -21525 82859 204797 215537 357998 -83233 390353 13472
10320 81924 252882 401281 -3433 440105 498504 -22719 154676 63078 129274 195449 403967
10309D03967j66132A07687m6008c711F8125J6857J15051b1829l21890D8774B2459
10297a69764j10622P8825I2197L319c56289A90406m3569b7903c277k09653c0862
10285f2033I7169P1800d51974c7798A2862h9060l35423f3059K5172j83606m6451
10274b67944H1806d61023B59369j13637b36301K7762q295C67506f7457a3715B20476
10262D9364d04734A94920b25614e2019l19648A20852b47185B24182c66867E3624
10251a53579H3761j3646f3246j11051f6313E1821J95979a83924F0145k1502R7741
10240A36384D0227b34867J06707B91309E8480J3277J3287A0034a30621B5740a57392
10228B31729a93684B8287a09250M8734B0064d4671B0387b03151Q2021L255E0381
$$ plain form
10309 403967 237835 107687 61679 -3711 68125 84982 200033 -21829 -343719 48774 22459
10297 -169764 -280386 -201561 92197 95516 -356289 190406 146837 -27903 -3277 -212930 -30862
10285 -62033 97169 168969 -451974 -37798 12862 -89060 -424483 -63059 -37887 -221493 -267944
10274 -267944 81806 -461023 259369 145732 -236301 -208539 -216834 367506 -67457 -13715 220476
10262 49364 -404734 194920 -225614 -52019 -371667 120852 -247185 224182 -366867 53624
10251 -153579 83761 70115 -63246 -174297 -66313 51821 247800 -183924 60145 38643 136384
10240 136384 40227 -234867 -128160 291309 58480 71757 85044 10034 -130621 25740 -157392
10228 231729 -193684 28287 -109250 -60516 20064 -44671 20387 -203151 -121130 -117875 50381
10216b48024a3036j65848j61854O7212Q2436M0801A08832b34399C1002a3884G6245
10204h8272C45225d6411l08756A14876b26708Q7534F1976a44237K9733e4497K3752
10193c0745E7271P9828e4939B6553j2104J71123G2990c3244k54856Q6207P9746
10182a22147j46497C32157c18648a34467A15135c9793o7390m7256C6471K3394
10172E9865a81306A58711i5974A29350a32485l17380a28185e9086o7053I3193
10161A26597b40811k3915A04809e2717C8399K2230b30705l0511f4396E9679Q2211
10150A41890l3296J09143o9531c22591A11465M044d1527A36032R2383D4265b39079
10138b32117f7135K6583J8160o0183l18801J89881C3927a80348C33278A36089
$$ plain form
10216 -248024 -13036 -178884 -340738 -273526 -191090 -150289 108832 -234399 31002 -13884 76245
10204 -88272 345225 -46411 -355167 114876 -226708 -139174 61976 -144237 -114504 -54497 -30745
10193 -30745 57271 137099 -54939 26553 14449 185572 72990 -33244 -288100 -201893 -122147
10182 -122147 -268644 332157 -318648 -134467 115135 -39793 -107183 -154439 36471 59865
10172 59865 -181306 158711 -95974 129350 -132485 -449865 -128185 -59086 -126139 93193
10161 126597 -240811 -264726 104809 -52717 38399 60629 -230705 -261216 -64396 59679 141890
10150 141890 108594 217737 148206 -322591 111465 115509 -41527 136032 228415 44265 -239079
10138 -232117 -67135 -40552 -22392 -82575 -401376 -211495 33927 -180348 333278 136089
10127b01423e9026q58j11580C4658M2737a168l2751k15918I749a42458e7105A53123
10114b82301A09820K9122a89493L1528A38065A9066a05068l3585p023A8071b42897
10102g0979f289B93890I1947c65892O3759J26734H79L59423a20773F3556a09194
10090a62070A70743A4951a93826A51228e3978j12452d383m2469j07845A6161b32182
10078a87538E9051c01198R2484L4854j04479a16766B5116c7622l9922j81524B55318
10066A8205J0029K148b73415B0404c19946m1402f2837A38676K26644a86711r084
10055a95795o1674N478A38835b65349c3872k89803c4785E0727c8277k06980L4436
10044b10821h7032B58160L6509a12724B85560a01549m4767D2886h2498j7743A31391
$$ plain form
10127 -201423 -59026 -59884 -171464 34658 77395 -1168 -33919 -249837 9749 -142458 -57105 153123
10114 -282301 109820 138942 -189493 -157965 138065 19066 -105068 -138653 -145676 18071 -242897
10102 -70979 -6289 293890 91947 -365892 -302133 -175399 879 360302 -120773 63556 -109194
10090 -162070 170743 14951 -193826 151228 -53978 -166430 -4383 -46852 -154697 16161 -232182
10078 -187538 59051 -301198 -208714 -173860 -278339 -116766 25116 -37622 -77544 -259068 255318
10066 18205 28234 30382 -273415 20404 -319946 -361348 -62837 138676 365320 -186711 -195795
10055 -195795 -257469 -251991 138835 -265349 -33872 -323675 -34785 50727 -38277 -245257 -210821
10044 -210821 -87032 258160 294669 -112724 285560 -101549 -146316 42886 -82498 -100241 131391
10032A6786J63350n8616a17922k52174A1127L55935d6856j24597M0193M6956F2716
10020a22754C61048a12858C64375f3750l6809I5887J14900L4117A19491h807j02271
10009a11078a9913m56173D6247R4868a39538j85784f5169J2789C7439d3038m8950
9998i1988k58280A74457D8842P6542b20007j5705D5435J33739b8781m2854A06876
9986b51830A6816a65540k6073k252o2205a428m5985C8598b02478d4184H2061a04591
9973a77055r9553M9591d9542A95596o3103J28302g8170E6470L3660a22979A4272
9961B12270a13886H6539b17401P2786m11789K77502A58910K6858b36748R7106
9951a39642e0627J8697j62073A94635a58266A85622L6017a78349r51C57530b14583
$$ plain form
10032 16786 180136 121520 -117922 -370096 11127 367062 -46856 -171453 -131260 -84304 62716
10020 -122754 361048 -112858 364375 -63750 -100559 95887 210787 244904 119491 -8807 -111078
10009 -111078 -19913 -476086 46247 141115 -139538 -325322 -65169 -52380 37439 -43038 -91988
9998 -91988 -350268 174457 48842 125384 -220007 -235712 45435 179174 -28781 -71635 106876
9986 -251830 16816 -165540 -191613 -193865 -256070 -1428 -47413 38598 -202478 -44184 82061 -104591
9973 -177055 -276608 -227017 -49542 195596 132493 260795 -78170 56470 90130 -122979 14272
9961 212270 -113886 86539 -217401 -144615 -556404 -278902 158910 185768 -236748 -139642
9951 -139642 -50627 -31930 -194003 194635 -158266 185622 221639 -178349 -179300 357530 -214583
9939a36843f7063H2941b56220f5896j12707h6597p3803C3658d5039A33456b16245
9927a18366L208H6526a41815P0200j58840A3096a9660j01971k87906B95599l3264
9916B62335c98826b3727A86890A7931b76642M3005f8194D5716J01759h9134l0724
9905a19858A37807A4127c38518J34536C13060g393m2322A54175a69974o8885C1131
9893A45116c7473A6716b38395B24768C9327a43025a1400q3966j37994J822j18265
9882c49803A42948l3974b16771j4417f0849n6489k15621K0687A83034A7995i4038
9870c28l7115m11447J69687G2291a77418j99544i5906F6800c38772e9227q6309
9859a45536j15758B22042r7866c10098e189m0020j66093E4845d16410J01815A6386
$$ plain form
9939 -136843 -67063 82941 -256220 -65896 -178603 -86597 -160400 33658 -45039 133456 -216245
9927 -118366 -115158 86526 -141815 -71615 -230455 13096 -19660 -121631 -409537 295599 262335
9916 262335 -398826 -23727 186890 17931 -276642 -233637 -68194 45716 147475 -89134 -119858
9905 -119858 137807 14127 -338518 -203982 313060 -7393 -49715 154175 -169974 -238859 31131
9893 145116 -37473 16716 -238395 224768 39327 -143025 -11400 -95366 -233360 -231538 -349803
9882 -349803 142948 108974 -216771 -231188 -60849 -117338 -332959 -312272 183034 17995 -94038
9870 -328 -37443 -448890 -279203 72291 -177418 -376962 -95906 66800 -338772 -59227 -145536
9859 -145536 -261294 222042 124176 -310098 -5189 -45209 -211302 54845 -416410 -314595 16386
9847G064b63638e8845j26080j69359k2636A3364a02830K408j53532i1651r8627
9836a90278Q4037D7839d41263F6473a02258A9508a85166f991j90857N3055m643
9825a49436K0514m0892F1175J6681d71322b31495a08371l2714A77618a62341q2348
9814b44689J06457J729Q110A5778M4015b27116J11576E5614L3158C896N7654R5424
9802A56974C2598e01713G26045d25356A77394L0784b69501Q5330r6327h5359q3355
9791a68714c350l14558B8409Q3420c84753a19345I5086c38816a07150L3657l7942
9780a11435C5724K12756G223a99381F2795e7992n248a1666M043j17766r3604d6764
9767h3919B18011a27407A39107M91a50659F1882b70381h2413G1665b75246E2923
$$ plain form
9847 7064 -263638 -58845 -184925 -354284 -376920 13364 -102830 -100422 -253954 -91651 -190278
9836 -190278 -106241 47839 -441263 66473 -102258 19508 -185166 -6991 -197848 -144793 -149436
9825 -149436 -128922 -169814 61175 77856 -471322 -231495 -108371 -141085 177618 -162341 -244689
9814 -244689 -138232 -136503 -128393 15778 59793 -227116 -115540 55614 88772 3896 61550 156974
9802 156974 32598 -501713 726045 -425356 177394 208178 -269501 -184171 -280498 -85359 -168714
9791 -168714 -3350 -317908 28409 111829 -384753 -119345 95086 -338816 -107150 -73493 -111435
9780 -111435 35724 248480 7223 -199381 62795 -57992 -63240 -11666 -7623 -125389 -218993 -46764
9767 -83919 218011 -127407 139107 139598 -150659 61882 -270381 -82413 71665 -275246 52923
9755c69701M4255A3968b7278l41711F2653M2407a4949m6150c0017A21755e9484
9743H4122B0168a39117e2852l15504J69286j36287J46453h8658g74G5438a98692
9731I8135a18388j31952A6933a6499n9347a9247H5729N6934b83792A05514l0886
9720G4628J49987C8406a56002A61541e2793I3971d74922b33276e4759A70267P3653
9709B43920b01252b9530p4760j48887a23695K409b0134B80624c36851J34009j09473
9698c12315E5982J24359A1523a70090D6249a54673A70636a62821C2423c93503
9687g3199A1162a15440H8548J8683c9384k19830B84753f0076B19062k6981l3427
9676A58654a2627A32158h4594l2503C2064A5100L5152i3295C71689F1605b92213
$$ plain form
9755 -369701 -325446 13968 -27278 -368989 62653 105060 -14949 -61099 -30017 121755 -59484
9743 84122 20168 -139117 -52852 -368356 -199070 -335357 -188904 -88658 -774 75438 -198692
9731 98135 -118388 -250340 16933 -16499 -75846 -19247 85729 142663 -283792 105514 74628
9720 74628 224615 38406 -156002 161541 -52793 93971 -474922 -233276 -54759 170267 243920
9709 243920 -201252 -29530 -104290 -253177 -123695 -121286 -20134 280624 -336851 -202842 -312315
9698 -312315 55982 180341 11523 -170090 46249 -154673 170636 -162821 32423 -393503
9687 -73199 11162 -115440 88548 107231 -39384 -259214 284753 -60076 219062 192081 158654
9676 158654 -12627 132158 -84594 -117097 32064 15100 50252 -93295 371689 61605 -292213
9664b3083k88143a03173b6865A9277K24934b16027P818N2542K2951f5954r098
9653g5052k24325b5917j50157A1921f8743E9130h858A57633c12463J54120A17259
9641c1547l51890n3799F2214R2195g7914A4453J31811f4542A84631K6215b07898
9629A77353b04437B10933a40348B24941q4084a57443p6951a9325j43369q4171
9619b46865B9113b85814a3406q7166k99368B18131A04370d3506A00771C6197g311
9607a18203L6494p8511j08018b7798L936l7438l0358j94892b0869p2676k52165
9596c45710d4894n5868a4629k4397A15450l43K7866c91389I4097c10526B46800
9584b95837a08056l8854j39526H2265b58435C8576P4228b84850j4029E5357a50516
$$ plain form
9664 -23083 -311226 -103173 -26865 19277 244211 -216027 -208209 -155667 -132716 -65954 -75052
9653 -75052 -299377 -25917 -176074 11921 -68743 59130 -8858 157633 -312463 -158343 117259
9641 -31547 -383437 -437236 62214 154409 -77914 14453 146264 -64542 184631 210846 -207898
9629 177353 -204437 210933 -140348 224941 140857 -157443 -234394 -19325 -162694 -246865
9619 -246865 29113 -285814 -13406 -100572 -399940 218131 104370 -43506 100771 36197 -7311
9607 -118203 -81709 -160220 -268238 -27798 -23862 -61300 -91658 -286550 -20869 -93545 -345710
9596 -345710 -44894 -100762 -14629 -39026 115450 115107 142973 -391389 94097 -310526 246800
9584 -295837 -108056 -146910 -286436 82265 -258435 38576 112804 -284850 -298879 55357 -150516
9572a97954K6701M096j3670F865M4210J21481G532b96800e169C1023e6854o046
9560f2900F2540a61539b5483B5668e9617A1359a53727m0790A23606d261C8354
9548a37189r1426a13165j4588j06897H0336b54728j31693g7423k09349a25874
9537B6372L13179j53642a02565j74413H6241a45061f4052B10692a61454A22341
9526d20481P9895A12891a53478D168c26679a32593B7382J18395a25403D4845a48413
9514b54619A7816a35856A57780c57376a65410j43667h5359D2005a05601B18689
9503c1132l03235I0549l8366H312a79304D0614l704L53513c50822J04209I3428
9491h0023H401b36642k87635a0515B74523a41391A9290a24743j76140J02591M8196
$$ plain form
9572 -197954 -171253 -167157 -180827 6865 51075 172556 7532 -296800 -5169 31023 -56854 -62900
9560 -62900 62540 -161539 -25483 25668 -59617 11359 -153727 -194517 123606 -4261 38354
9548 -137189 -228615 -113165 -127753 -234650 80336 -254728 -386421 -77423 -286772 -125874
9537 26372 339551 185909 -102565 -276978 86241 -145061 -64052 210692 -161454 122341
9526 -420481 -340586 112891 -153478 4168 -326679 -132593 27382 145777 -125403 44845 -148413
9514 -254619 17816 -135856 157780 -357376 -165410 -309077 -85359 42005 -105601 218689
9503 -31132 -334367 90549 52183 8312 -179304 40614 36910 390423 -350822 -246613 93428
9491 -80023 8401 -236642 -524277 -10515 274523 -141391 19290 -124743 -300883 -198292 -150096
9480a50096A16725d1094A52749a37407A06326a47610k2935d6927I2398b15471
9469d71743a26616A10366h3717A39278a47154f2459A25966B3605f7886A52218
9458A02090a46080e7194l15672g0468A62527E0066b83077J11978g7686M038n7483
9447a31131j54807D8578A2581b28139H8832m0425D052f3251j54169F5541O6568
9436A32109d9748A32915J23921N5472C0979d85557C89063b77095H2512d65589
9425a44470H4897a33101A42608E589J63169b76947A47717J12153b91202A99964
9414i0479A7123b21093j5775i7045j0234b7262k03050a3121k46172Q48A76629
9402C0177b13574g4282B19049G9660J13313j7037m4681b22894h9539B0179J60007
$$ plain form
9480 -150096 116725 -41094 152749 -137407 106326 -147610 -170545 -46927 92398 -215471
9469 -471743 -126616 110366 -83717 139278 -147154 -62459 125966 23605 -67886 152218
9458 102090 -146080 -57194 -372866 -70468 162527 50066 -283077 -171099 -77686 -73648 -131131
9447 -131131 -285938 48578 12581 -228139 88832 48407 4052 -63251 -217420 65541 132109
9436 132109 -49748 132915 256836 312308 30979 -485557 389063 -277095 82512 -465589
9425 -144470 84897 -133101 142608 5589 168758 -276947 147717 259870 -291202 199964
9414 -90479 17123 -221093 -236868 -97045 -107279 -27262 -230312 -13121 -259293 -258445 176629
9402 30177 -213574 -74282 219049 79660 192973 175936 131255 -222894 -89539 20179 180186
9391A80186b22917b58j16803k16748k3137a14246k10723h7464j79497C4428O7399
9380A01827a34973d3537A11286a51575L5682H8147G031Q7783a47245B4775a27285
9368e0731D864P9466L20893f6969a9021j07712j67458A4591N7781g9274C16225
9356D9089a19449j5420F3830K9615c05175J20345B18338a07608j65415g885q5290
9345i3175B71236c34287a38192N9243A24232c8722l21403c2466P510B9054c22228
9333B11226a57085k3374O3763p8030L4035K1403j54069g3522l17530C29223b68382
9321H2381a18904D0431r776O9931D2201b3588G2188d32340F760h28p828m8070
9309e6726B13180D4115b41880F3199c5023p7320K7437n0224A39098b87184A55506
$$ plain form
9391 180186 -222917 -258 -117061 -333809 -356946 -114246 -324969 -87464 -266961 34428 101827
9380 101827 -134973 -43537 111286 -151575 -115893 88147 7031 94814 -147245 24775 -127285
9368 -50731 4864 84330 405223 -66969 -19021 -126733 -294191 14591 72372 -79274 316225
9356 49089 -119449 -134869 63830 93445 -305175 -184830 218338 -107608 -273023 -7885 -93175
9345 -93175 271236 -334287 -138192 -78949 124232 -38722 -360125 -32466 -24956 29054 -322228
9333 211226 -157085 -180459 -116696 -194726 -160691 -139288 -293357 -73522 -391052 329223 -268382
9321 82381 -118904 40431 30655 100586 42201 -23588 72188 -432340 6760 -828 -8656 -56726
9309 -56726 213180 44115 -241880 63199 -35023 -112343 -84906 -135130 139098 -287184 155506
9297D9973J39277D3050a90808h5261A8678c0186j13777c3684o6122E5397O2952
9286A18349m7849a5922A08688k2838e7817l83916D2847e99412A53391b4916n962
9275c0878A51000e2415q2315m1488p2321h2557F0088P5073K0914c94023M8612
9264c45411a72006C63167B9013b98460B18170M1262a91309A34662E7467b85266
9253E6494A5328c47771a05897k02497j8554A25586f9505o9498G848a99047f7901
9241a84570e2304l64358d2607j50295g6512o0276j19733a22003A6908b53528B9714
9229h7561j8610j06237A25275a93464l9859h9665I3388h6732A58526c41258a25217
9217a51085k8735D4974a89880K3116f4446L2032B73778h0127k06173g9545j0827
$$ plain form
9297 49973 189250 43050 -190808 -85261 18678 -30186 -143963 -33684 -99806 55397 118349
9286 118349 70500 -15922 108688 85850 -57817 -441733 42847 -599412 153391 -24916 -30878
9275 -30878 151000 -52415 -134730 -176218 -248539 -82557 60088 135161 156075 -394023 -345411
9264 -345411 -172006 363167 29013 -298460 218170 259432 -191309 134662 57467 -285266
9253 56494 15328 -347771 -105897 -308394 -326948 125586 -69505 -139003 7848 -199047 -67901
9241 -184570 -52304 -416662 -42607 -192902 -76512 -136788 -256521 -122003 16908 -253528 29714
9229 -87561 -106171 -212408 125275 -193464 -233323 -89665 93388 -86732 158526 -341258 -125217
9217 -151085 -179820 44974 -189880 -166764 -64446 -32414 273778 -80127 -286300 -79545 -90372
9206i0372A8248b8117A15542c19218f3278B0277f8200A62304a91991f3373R978
9195e3395k08016I867i346l28276h9518H3149J1173A6876P025N5387f2038j85098
9183b47136o6107o3606a38516m364g520A9156a47945G8795J90144b36559A82089
9171f7856k81486k7667A37962a52222K5294j76647G8508Q1191K7230b92264k5820
9160c18084a2800C16307d02329C33804j58307e0240A0798J93556a54531I9939
9149a2482A8025J31224O0480p6227B5085f278l4895l74337J64842i1942B0112
9137e6289j8404F5625c00422J33777n8124a02282j82079J39697A16168b82479
9126A82644i1675a058l6911m43436B13463E4020j194c7180A97953a97406K652
$$ plain form
9206 -90372 18248 -28117 115542 -319218 -63278 20277 -68200 162304 -191991 -63373 -53395
9195 -53395 -261411 9867 -9346 -337622 -89518 83149 94322 16876 23901 79288 -62038 -247136
9183 -247136 -313243 -376849 -138516 -142880 -7520 19156 -147945 78795 268939 -236559 182089
9171 -67856 -349342 -377009 137962 -152222 -126928 -303575 78508 159699 186929 -292264 -318084
9160 -318084 -12800 316307 -402329 333804 175497 -50240 10798 204354 -154531 99939
9149 -12482 18025 149249 209729 133502 25085 -6278 -41173 -415510 -250668 -91942 20112
9137 -56289 -74693 65625 -300422 -166645 -224769 -102282 -284361 -144664 116168 -282479
9126 182644 -91675 -1058 -37969 -481405 213463 54020 52826 -37180 197953 -197406 -194754
9115a94754G0062c12604B11449l1319C7245c81694h831o3892l44217b8362j5316
9104d3678B8781a91374a1528j49987o4629D463b62812B10419a82904A6096K12996
9093B29092e1429j66750g4251B54778e732j09923E2227R9667i090k10588g2375
9081b29904G9439l1934J04959b30075A9042d4843A2559e8970m8575k98666G0069
9069i0959A96528d6593F160f9666A40753L4600i8840C4718A839a27201b4274j71699
9057a95973A51714l2597b16089d3302A75955j8645h721m1371F4004J1521j9197
9046E6328k2654Q515J947J77095a9979k22587o2853A48249g4003L2070F7023a72736
9033b6732L324H2072c777G7802a88588A22201A7111K41819d95468g6497j17642
$$ plain form
9115 -194754 70062 -312604 211449 180130 37245 -381694 -8831 -72723 -416940 -28362 -43678
9104 -43678 28781 -191374 -11528 -161515 -226144 4463 -262812 210419 -182904 16096 229092
9093 229092 -51429 -218179 -74251 254778 -5732 -115655 52227 151894 -9090 -219678 -72375
9081 -229904 79439 47505 152464 -230075 19042 -44843 12559 -58970 -107545 -406211 70069
9069 -90959 196528 -46593 6160 -69666 140753 175353 -98840 34718 1839 -127201 -24274 -195973
9057 -195973 151714 119117 -216089 -43302 175955 157310 -8721 -50092 64004 75525 56328
9046 56328 33674 42189 44136 221231 -19979 -242566 -305419 148249 -74003 -41933 67023 -172736
9033 -26732 -23408 82072 -3777 77802 -188588 122201 17111 258930 -495468 -76497 -194139
9022a94139J4866A61434F5846b10095J00642b7667G2178b16967f0309k6950j8844
9011a06103k05996a39629B5120M5210b85349F4809b01662D3231J00587A5591J4942
9000C0533a02601n9732f0166C94422a3635j61490j98342J06511g8833j5320j31041
8989b25194B13906a72278C7647J2351b19006B4841J26143F1979M3461K370a62691
8977a79304n338g5412A991J78096A949b4327l98624N7372c5795C0109a3958r2945
8965a06903J0458j89378n1351F6250L841A8017K08456d4177j12597j40464f5604
8953A13180h665j48768A20985J21694a26737j21675j90228f9929b5871A79889
8942f9971O670a7708A37166c35762B62790I4108e7906k34487k44705a55636A78435
$$ plain form
9022 -194139 -179273 161434 65846 -210095 -109453 -27667 72178 -216967 -60309 -87259 -106103
9011 -106103 -312099 -139629 25120 70330 -285349 64809 -201662 43231 143818 15591 30533
9000 30533 -102601 -162333 -60166 394422 -13635 -175125 -373467 -266956 -78833 -94153 -225194
8989 -225194 213906 -172278 37647 49998 -219006 24841 150984 61979 105440 107810 -162691
8977 -179304 -184642 -75412 1991 180087 1949 -24327 -422951 -365579 -35795 30109 -13958 -106903
8965 -106903 -96445 -285823 -337174 66250 70091 18017 226473 -44177 -156774 -297238 -65604
8953 113180 -8665 -157433 120985 242679 -126737 -248412 -438640 -69929 -25871 179889
8942 -69971 -63301 -17708 137166 -335762 262790 94108 -57906 -292393 -537098 -155636 178435
8930i0423B397K44678a59670l4755G1787b67375A08297k0698c18178A68672M178
8919A72850J46141M12873B21003m9602b56140A66682R179b53888J11537d6721
8908a5854B70530C502e3079D3064e1091E8947a29085D6692J31602a41568l5951
8897a77519e1508E5128J3200J1224a14166D6507e3327A87970b28619J6456a9123
8885I9632H855M5984h0691q6615j39170A24998B1943K1524f4750A7235b13371
$$ plain form
8930 -90423 2397 247075 -159670 -194425 71787 -267375 108297 87599 -318178 168672 172850
8919 172850 318991 731864 221003 171401 -256140 166682 175861 -253888 -142351 -46721
8908 -15854 270530 3502 -53079 43064 -51091 58947 -129085 46692 178294 -141568 -177519
8897 -177519 -51508 55128 68328 79552 -114166 46507 -53327 187970 -228619 -212163 -19123
8885 99632 8855 54839 -80691 -167306 -306476 124998 21943 43467 -64750 17235 -213371
$$ [...]
##END NTUPLES=NMR SPECTRUM
##END=
