##TITLE=NES1054_925993_9270556_EApet5ZD6d
##JCAMPDX= 6.0         $$ Bruker NMR JCAMP-DX V2.0
##DATA TYPE= NMR SPECTRUM
##DATA CLASS= NTUPLES
##ORIGIN= BRUKER
##OWNER= Administrator
$$ 1.72 TOPSPIN		Version 2.1
$$ 2015-07-11 19:15:11.878 -0700  Administrator@X
$$ Compression mode = diff/dup
##.OBSERVE FREQUENCY= 400.02188249412
##.OBSERVE NUCLEUS= ^1H
##.ACQUISITION MODE= SIMULTANEOUS (DQD)
##.ACQUISITION SCHEME= undefined
##.AVERAGES= 8
##.DIGITISER RES= 22
##SPECTROMETER/DATA SYSTEM= spect
##.PULSE SEQUENCE= zg30
##.SOLVENT NAME= COFFEE_meoh
##.SHIFT REFERENCE= INTERNAL, COFFEE_meoh, 1, 14.98509
##AUDIT TRAIL= $$ (NUMBER, WHEN, WHO, WHERE, PROCESS, VERSION, WHAT)
$$ ##TITLE= Audit trail, TOPSPIN		Version 2.1
$$ ##JCAMPDX= 5.01
$$ ##ORIGIN= Bruker BioSpin GmbH
$$ ##OWNER= Administrator
$$ $$ E:\/data/COFFEE/nmr/NES1054_925993_9270556_EApet5ZD6d/10/pdata/1/auditp.txt
$$ ##AUDIT TRAIL=  $$ (NUMBER, WHEN, WHO, WHERE, PROCESS, VERSION, WHAT)
(   1,<2015-07-11 19:15:04.378 -0700>,<Administrator>,<X>,<go>,<TOPSPIN 2.1>,
      <created by zg
	started at 2015-07-11 19:13:58.144 -0700,
	POWCHK enabled, PULCHK disabled,
       configuration hash MD5:
       21 0F 79 D6 B3 7B B4 F6 88 20 88 DB 03 48 BD 9F
       data hash MD5: 64K
       67 9E A5 66 AF 8C 15 96 1A D0 98 09 1F 3F AD DA>)
(   2,<2015-07-11 19:15:07.753 -0700>,<Administrator>,<X>,<proc1d>,<TOPSPIN 2.1>,
      <Start of raw data processing
       efp LB = 0 FT_mod = 6 PKNL = 1 PHC0 = 0 PHC1 = 0 SI = 32K 
       data hash MD5: 32K
       F6 39 80 47 39 7D F5 4B 1E 09 3D 69 FA 08 88 A2>)
(   3,<2015-07-11 19:15:08.050 -0700>,<Administrator>,<X>,<proc1d>,<TOPSPIN 2.1>,
      <pk PHC0 = 91.96655 PHC1 = 0 
       data hash MD5: 32K
       26 7D 93 21 0C A8 57 8B C4 03 FB 3F 42 CF 71 E4>)
(   4,<2015-07-11 19:15:08.160 -0700>,<Administrator>,<X>,<proc1d>,<TOPSPIN 2.1>,
      <abs ABSG = 1 
       data hash MD5: 32K
       D3 C1 87 5D E8 02 EA 48 02 B0 A0 87 61 10 B0 E9>)
(   5,<2015-07-11 19:15:08.222 -0700>,<Administrator>,<X>,<proc1d>,<TOPSPIN 2.1>,
      <abs ABSG = 2 
       data hash MD5: 32K
       7B 32 D1 9B 47 79 6E 6C E6 01 DC B3 C4 52 87 EA>)
(   6,<2015-07-11 19:15:08.285 -0700>,<Administrator>,<X>,<proc1d>,<TOPSPIN 2.1>,
      <abs ABSG = 3 
       data hash MD5: 32K
       BE 01 D6 43 26 57 92 0B 2D 7B 8B 9E E7 63 57 EA>)
(   7,<2015-07-11 19:15:08.347 -0700>,<Administrator>,<X>,<proc1d>,<TOPSPIN 2.1>,
      <abs ABSG = 4 
       data hash MD5: 32K
       79 98 36 11 AF D0 7D 88 00 D8 AF D6 40 77 FF 3F>)
(   8,<2015-07-11 19:15:08.410 -0700>,<Administrator>,<X>,<proc1d>,<TOPSPIN 2.1>,
      <abs ABSG = 5 
       data hash MD5: 32K
       D0 1A 51 32 B1 68 41 6E A2 5C 3F 65 CA 2F FA B0>)
$$ ##END=
$$ 
$$ $$ hash MD5
$$ $$ 6D B6 F5 87 30 89 02 B3 73 25 A7 FD 18 30 CC CF
##$RELAX= 
##$RELAX= 
##$RELAX= 
##$RELAX= 
##$RELAX= 
##$RELAX= 
##$RELAX= 
$$ Bruker specific parameters
$$ --------------------------
##$DU= <E:\>
##$EXPNO= 10
##$NAME= <NES1054_925993_9270556_EApet5ZD6d>
##$PROCNO= 1
$$ [...]
150 150 150 150 150 150 150 150
##$TP07= 0
##$TPNAME0= <>
##$TPNAME1= <>
##$TPNAME2= <>
##$TPNAME3= <>
##$TPNAME4= <>
##$TPNAME5= <>
##$TPNAME6= <>
##$TPNAME7= <>
##$TPOAL= (0..7)
0.5 0.5 0.5 0.5 0.5 0.5 0.5 0.5
##$TPOFFS= (0..7)
0 0 0 0 0 0 0 0
##$TUNHIN= 0
##$TUNHOUT= 0
##$TUNXOUT= 0
##$USERA1= <user>
##$USERA2= <user>
##$USERA3= <user>
##$USERA4= <user>
##$USERA5= <user>
##$V9= 5
##$VALIST= <valist>
##$VCLIST= <CCCCCCCCCCCCCCC>
##$VD= 0
##$VDLIST= <DDDDDDDDDDDDDDD>
##$VPLIST= <PPPPPPPPPPPPPPP>
##$VTLIST= <TTTTTTTTTTTTTTT>
##$WBST= 2048
##$WBSW= 25
##$XGAIN= (0..3)
0 0 0 0
##$XL= 0
##$YL= 0
##$YMAX_a= 580758
##$YMIN_a= -484354
##$ZGOPTNS= <>
##$ZL1= 120
##$ZL2= 120
##$ZL3= 120
##$ZL4= 120
##$ABSF1= 14.98509
##$ABSF2= -5.573092
##$ABSG= 5
##$ABSL= 3
##$ALPHA= 0
##$AQORDER= 0
##$ASSFAC= 0
##$ASSFACI= 0
##$ASSFACX= 0
##$ASSWID= 0
##$AUNMP= <proc_prof1d_extract_pilot.lims>
##$AXLEFT= 0
##$AXNAME= <>
##$AXNUC= <1H>
##$AXRIGHT= 0
##$AXTYPE= 0
##$AXUNIT= <>
##$AZFE= 0.1
##$AZFW= 0.1
##$BCFW= 0
##$BC_mod= 0
##$BYTORDP= 0
##$COROFFS= 0
##$CY= 15
##$DATMOD= 1
##$DC= 0
##$DFILT= <>
##$DTYPP= 0
##$F1P= 0
##$F2P= 0
##$FCOR= 0.5
##$FTSIZE= 32768
##$FT_mod= 6
##$GAMMA= 0
##$GB= 0
##$INTBC= 1
##$INTSCL= 1
##$ISEN= 128
##$LB= 0
##$LEV0= 0
##$LPBIN= 0
##$MAXI= 10000
##$MC2= 0
##$MEAN= 0
##$ME_mod= 0
##$MI= 0
##$NCOEF= 0
##$NC_proc= -8
##$NLEV= 6
##$NOISF1= 0
##$NOISF2= 0
##$NSP= 0
##$NTH_PI= 0
##$NZP= 0
##$OFFSET= 14.98509
##$PC= 1
##$PHC0= 91.96655
##$PHC1= 0
##$PH_mod= 1
##$PKNL= yes
##$PPARMOD= 0
##$PPDIAG= 0
##$PPIPTYP= 0
##$PPMPNUM= 2147483647
##$PPRESOL= 1
##$PSCAL= 4
##$PSIGN= 0
##$PYNMP= <proc.py>
##$REVERSE= no
##$SF= 400.02
##$SI= 32768
##$SIGF1= 0
##$SIGF2= 0
##$SINO= 400
##$SIOLD= 32768
##$SPECTYP= <>
##$SREGLST= <1H.CDCl3>
##$SSB= 0
##$STSI= 32768
##$STSR= 0
##$SW_p= 8223.68421052631
##$SYMM= 0
##$S_DEV= 0
##$TDeff= 65536
##$TDoff= 0
##$TI= <>
##$TILT= no
##$TM1= 0
##$TM2= 0
##$TOPLEV= 0
##$USERP1= <user>
##$USERP2= <user>
##$USERP3= <user>
##$USERP4= <user>
##$USERP5= <user>
##$WDW= 1
##$XDIM= 32768
##$YMAX_p= 417663080
##$YMIN_p= -743157
##$CURPLOT= <Network HP LaserJet P1505>
##$CURPRIN= <$Network HP LaserJet P1505>
##$DFORMAT= <normdp>
##$LAYOUT= <+/1D_H.xwp>
##$LFORMAT= <normlp>
##$PFORMAT= <normpl>
##$SURQMSG= 1
$$ End of Bruker specific parameters
$$ ---------------------------------
##NTUPLES= NMR SPECTRUM
##VAR_NAME=  FREQUENCY,     SPECTRUM/REAL,   SPECTRUM/IMAG
##SYMBOL=    X,             R,               I
##VAR_TYPE=  INDEPENDENT,   DEPENDENT,       DEPENDENT
##VAR_FORM=  AFFN,          ASDF,            ASDF
##VAR_DIM=   32768,         32768,           32768
##UNITS=     HZ,            ARBITRARY UNITS, ARBITRARY UNITS
##FACTOR=    0.250966925370066, 1,           1
##FIRST=     8223.43324360094, 212250,       -201759
##LAST=      0,             69278,           177846
##MIN=       0,             -743157,         0
##MAX=       8223.43324360094, 417663080,    0
$$ Real data points
##PAGE= N=1
##DATA TABLE= (X++(R..R)), XYDATA
$$ [...]
19499a05695B89383d9426j10671B69116G080f8140A24553a79261g519l38352A8999
$$ -105695 289383 -49426 -160097 269116 7080 -68140 124553 -179261 -7519 -345871 18999
19487c1720l9533m3049o1419o4647J10213k42375A35623A0448J54756c44283a5968
$$ -31720 -71253 -114302 -175721 -240368 -130155 -372530 135623 10448 165204 -344283 -15968
19475a14795e7335a7617m6339r6387K3533r2921R7327o7823A96715i2541D4303
$$ -114795 -57335 -17617 -63956 -160343 -136810 -229731 -132404 -200227 196715 -92541 44303
19463b46675K9691C0479c40970E585K99453o7507a21401K6539j12434H5546d8359
$$ -246675 -216984 30479 -340970 5585 305038 237531 -121401 -94862 -207296 85546 -48359
19451B4570n469g309A7377b41145k01447d2566j04756E3350b21266M4768g9079
$$ 24570 19101 -7309 17377 -241145 -442592 -42566 -147322 53350 -221266 -176498 -79079
19439c00421J21188n497d0224k24057e3780j28889L3166c2833o0078k39319J22939
$$ -300421 -179233 -184730 -40224 -264281 -53780 -182669 -149503 -32833 -92911 -332230 -209291
19428b09291j11093R7955O8284c0610B41354c17660h7298k54270j77240J99569
$$ -209291 -320384 -222429 -154145 -30610 241354 -317660 -87298 -341568 -518808 -319239
19418c19239B15414b00954D2634b86612N2565b9097j05666o4497P8502r1913n3033
$$ -319239 215414 -200954 42634 -286612 -234047 -29097 -134763 -199260 -120758 -212671 -265704
19407b65704K8985h2386j46680Q9168q6710A236L9162J68372h3604C30556a64577
$$ -265704 -236719 -82386 -229066 -139898 -226608 1236 40398 208770 -83604 330556 -164577
19395C2738a42315o7282A36781D0095b10378d2062C5984Q0072c03742J38399l68680
$$ 32738 -142315 -209597 136781 40095 -210378 -42062 35984 116056 -303742 -165343 -534023
19384e34023A04077a03443l6338J661j4971b3791j78639C07756A12894d14846
$$ -534023 104077 -103443 -139781 -138120 -153091 -23791 -202430 307756 112894 -414846
19373d6802k82986a60590j18428J09154N1147k4355j41684N2769A4892N7495a97971
$$ -46802 -329788 -160590 -279018 -169864 -118717 -143072 -284756 -231987 14892 72387 -197971
19361a43096A12567e8345j96267l13837E1008a29413c1401J4632D722J38174d0551
$$ -143096 112567 -58345 -254612 -568449 51008 -129413 -31401 -16769 4722 142896 -40551
19349b78090A8776e23998i9858K2489k59526A8227a15435N1587B7848o502g1331
$$ -278090 18776 -523998 -99858 -77369 -336895 18227 -115435 -63848 27848 21346 -71331
19337A23838a77159m342B51052j10026d5903B09225a67897k42660A75258a02917
$$ 123838 -177159 -181501 251052 141026 -45903 209225 -167897 -410557 175258 -102917
19326a80803a4922G636R5091E735f3878j6991A75897b00992D0547a03975k26741
$$ -180803 -14922 7636 102727 5735 -63878 -80869 175897 -200992 40547 -103975 -330716
19315c30716i4020C05580D9838a46498q7790A48041b37471j5960a08216q0771
$$ -330716 -94020 305580 49838 -146498 -234288 148041 -237471 -253431 -108216 -188987
19305a88987f2208k83939a47064b7743C8671K9195K10003a93395j7896A163Q5444
$$ -188987 -62208 -346147 -147064 -27743 38671 67866 277869 -193395 -211291 1163 86607
19294H6607c97504i2431J3525j18777G3123a22451K6822k70635a37558a8251k54012
$$ 86607 -397504 -92431 -78906 -197683 73123 -122451 -95629 -366264 -137558 -18251 -272263
19283b72263E5063c2279j6576m8736C08881q3493k4624L3636B1823l522R8292
$$ -272263 55063 -32279 -48855 -97591 308881 225388 200764 234400 21823 18301 116593
19272A16593b38093B79107b81824R4852D5138N3246Q191b69113J17300A58778
$$ 116593 -238093 279107 -281824 -186972 45138 98384 106575 -269113 -151813 158778
19261A79367b31775B9001A1827c51613c6743C2201a10584l4504j2322d3604B58836
$$ 179367 -231775 29001 11827 -351613 -36743 32201 -110584 -145088 -157410 -43604 258836
19249A85845a3394j67261J0620O217c7630k48470j2343J09626f7053o5783M6856
$$ 185845 -13394 -180655 -170035 -163818 -37630 -286100 -298443 -188817 -67053 -132836 -85980
19238h5980m22392e7400b5924E4644b94525a1906j26128d3097A9417b61576J6169
$$ -85980 -508372 -57400 -25924 54644 -294525 -11906 -138034 -43097 19417 -261576 -245407
19227b45407g3608k06481j9872o8797G2472b85840A2418b04972Q6443F6729c20859
$$ -245407 -73608 -280089 -299961 -368758 72472 -285840 12418 -204972 -118529 66729 -320859
19215a54222B98094C8771O3422a38901A22661a54005F4928d40026A37661A5831
$$ -154222 298094 38771 102193 -138901 122661 -154005 64928 -440026 137661 15831
19204A04173a79009e9251A95747r0339A3527J00138f2870G7737J44010q570n7645
$$ 104173 -179009 -59251 195747 105408 13527 113665 -62870 77737 221747 213177 155532
19193A55532b16052M1739A7538J50075c20189A37514b80284a02938G5690c23681
$$ 155532 -216052 -174313 17538 167613 -320189 137514 -280284 -102938 75690 -323681
19182A20318a9875j11818k26844K364b4197B91550b43558J16660L318B11243p1291
$$ 120318 -19875 -131693 -358537 -356173 -24197 291550 -243558 -126898 -123580 211243 139952
19171A39952P7600b78743a05553j6769O724A2071e08947g5071j53324F6070a9738
$$ 139952 217552 -278743 -105553 -122322 -115598 12071 -508947 -75071 -228395 66070 -19738
19159A72801a61153N2239B40964a31089j7181c6217j11880m03270B07021a61919
$$ 172801 -161153 -108914 240964 -131089 -148270 -36217 -148097 -551367 207021 -161919
19148E1211h9103H820J65477c00198d3168A92946i9431D0510d8481q207j8471
$$ 51211 -89103 8820 174297 -300198 -43168 192946 -99431 40510 -48481 -56688 -75159
19137g5159F7635b01485j86739J88362M4799d3920j03548l22599E4961b67779
$$ -75159 67635 -201485 -388224 -199862 -155063 -43920 -147468 -470067 54961 -267779
19126g810j74574P3225I3000h8310H4866i861j06135a8038G0790a58054g6233
$$ -7810 -182384 -109159 93000 -88310 84866 -9861 -115996 -18038 70790 -158054 -76233
19114E4537Q6914b5258j39570k11040L9207D1010b05444J6507D6113j2283J1656
$$ 54537 141451 -25258 -164828 -375868 -336661 41010 -205444 -188937 46113 33830 45486
19103D5486b52485j15733a0140A9807e9995E4478c65335J42117Q2549A05858O191
$$ 45486 -252485 -368218 -10140 19807 -59995 54478 -365335 -223218 -140669 105858 112049
19092A12049D5515L94942j43711d9005B11283J4472d4010F9615M1601b85428C47
$$ 112049 45515 440457 296746 -49005 211283 225755 -44010 69615 111216 -285428 347
19080c39545i9256B12001A05833k7120h1434j62366j9761J16393l2181m5176e4500
$$ -339545 -99256 212001 105833 78713 -81434 -243800 -263561 -147168 -179349 -224525 -54500
19068A02486d11081a21260N8003I1155b4422j37298j6541N8679C7939i4519A68068
$$ 102486 -411081 -121260 -63257 91155 -24422 -161720 -178261 -119582 37939 -94519 168068
19056B35279K278b49487e348j20785A11876C0997L35157o9988d91885J80965D7701
$$ 235279 237557 -249487 -5348 -126133 111876 30997 366154 296166 -491885 -310920 47701
19044A67445K5989d428j52141I2230h3598l31189J73416J15895A29940c01788
$$ 167445 193434 -4428 -156569 92230 -83598 -414787 -241371 -125476 129940 -301788
19033c3260j51342G2404c27714J61806K9438j46594A47612a15290A05068e9327
$$ -33260 -184602 72404 -327714 -165908 -136470 -283064 147612 -115290 105068 -59327
19022c67344A94589b5272G6549b18453Q0506k2089a6749k133j44860g1390G9634
$$ -367344 194589 -25272 76549 -218453 -137947 -160036 -16749 -18882 -163742 -71390 79634
19010B9052a92996p9907b3627B77317b792D0608c26858C41600a41060p7001D3421
$$ 29052 -192996 -272903 -23627 277317 -2792 40608 -326858 341600 -141060 -218061 43421
18998a02649A04283a98928A5891K21647c6011A13087a00920k30759i6003L8223
$$ -102649 104283 -198928 15891 237538 -36011 113087 -100920 -331679 -96003 -57780
18988e7780A70405j0069a83482A04587l8863b93627e3464j39335G0567J5691e8888
$$ -57780 170405 160336 -183482 104587 65724 -293627 -53464 -192799 70567 86258 -58888
18976a68230G5647B3932N15537k02728J50158L88208m12818j73516p2208f5211
$$ -168230 75647 23932 539469 336741 486899 875107 462289 288773 216565 -65211
18965A98071r4888l1167a29778j52663h3359k30675e7596l8646j18124j5045A91034
$$ 198071 103183 72016 -129778 -282441 -83359 -314034 -57596 -96242 -214366 -229411 191034
18953a5286F6031J81457b61738A31831m3957a16595f904m7593p8529j41048a9979
$$ -15286 66031 247488 -261738 131831 87874 -116595 -6904 -54497 -133026 -274074 -19979
18941a51985i75B208c8090B8821a01702G1131a18616D0771Q0355l4280c82204
$$ -151985 -975 2208 -38090 28821 -101702 71131 -118616 40771 121126 86846 -382204
18929B53578a00465F8491Q8121A0408a88236b1804I4774B9541M7035g7417B535
$$ 253578 -100465 68491 156612 10408 -188236 -21804 94774 29541 76576 -77417 2535
18917i3989D5664b8438A91444e6229j09296n9275F422M26519j27846J77236L95251
$$ -93989 45664 -28438 191444 -56229 -165525 -224800 6422 432941 305095 482331 877582
18906H77582B56860M95168A35535M9274O9821d86205a28501B34960a86068h0696
$$ 877582 256860 752028 135535 184809 254630 -486205 -128501 234960 -186068 -80696
18895a12273I137a88904j02b5867G4151b07158k02138A32899a95849L3126Q0347
$$ -112273 9137 -188904 -189006 -25867 74151 -207158 -409296 132899 -195849 -162723 -82376
18884h2376Q151F02b56691R2402D723J45702k2380m7593c14070d5753k56196m1089
$$ -82376 -74225 602 -256691 -164289 4723 150425 128045 80452 -314070 -45753 -301949 -343038
18872c43038a03510A06339l4333a940j69792j40368R2411g8875G8966P4943D4718
$$ -343038 -103510 106339 72006 -1940 -171732 -312100 -219689 -78875 78966 153909 44718
18860C2491G13O7650b51797j00762J50522H7471J2704Q7890A4448K25216a76501
$$ 32491 713 68363 -251797 -352559 -202037 87471 100175 188065 14448 239664 -176501
18848A07081b90866l8101R6852b5085B6196P7820a30491D3979a89644B88424c1797
$$ 107081 -290866 -328967 -232115 -25085 26196 104016 -130491 43979 -189644 288424 -31797
18836A50460h1771L4054F6667c00324g3148J8325A70224c58106C22114g3897j16925
$$ 150460 -81771 -47717 66667 -300324 -73148 -54823 170224 -358106 322114 -73897 -190822
18825a90822Q927c5219k36842R3355b3303A99873c0346l7028m8637q3004c4894
$$ -190822 -181895 -35219 -272061 -178706 -23303 199873 -30346 -67374 -116011 -199015 -34894
18813A458b08818A77881a99115q8375A81490a80257f3675k5282D8182a25418K2142
$$ 1458 -208818 177881 -199115 -287490 181490 -180257 -63675 -88957 48182 -125418 -103276
18802a03276r751B05929a57509c8313k9664p9399J4346c8080A80805O0297a78123
$$ -103276 -113027 205929 -157509 -38313 -67977 -147376 -133030 -38080 180805 241102 -178123
18790g3262b3557I8069J02556L4446C1401b15959j08890B1205D729f669j62657
$$ -73262 -23557 98069 200625 235071 31401 -215959 -324849 21205 4729 -6669 -169326
18779a69326M4518e8443k87696P3270A16499e9280B5200J1764g9393A31393C4388
$$ -169326 -124808 -58443 -346139 -272869 116499 -59280 25200 36964 -79393 131393 34388
18767G1406a87610o9447a19289d6552l40580a44897m3918I6773c0191j35474J6031
$$ 71406 -187610 -257057 -119289 -46552 -387132 -144897 -188815 96773 -30191 -165665 -149634
18756a49634M0715j70297A36238c03246D285i3046k45873n4894a55681D802d7968
$$ -149634 -108919 -279216 136238 -303246 4285 -93046 -338919 -393813 -155681 4802 -47968
18744B41119c0176r1596r6857P2456j38608f3430j6741k47509E9250J9349a58480
$$ 241119 -30176 -121772 -218629 -146173 -284781 -63430 -80171 -327680 59250 78599 -158480
18732a82629B77436a97178E9009M6788a12762L87D2415J02255p0402Q7772a4736
$$ -182629 277436 -197178 59009 105797 -112762 -112375 42415 144670 74268 162040 -14736
18720b06282B47676d22540J87156A80986J31874b20061B8998b22406M9538Q5307
$$ -206282 247676 -422540 -235384 180986 312860 -220061 28998 -222406 -172868 -87561
18710h7561j08415F0289g4404A96439G4372d6284F1114R9586a83223D56670a4998
$$ -87561 -195976 60289 -74404 196439 74372 -46284 61114 160700 -183223 456670 -14998
18698a99305a4985j86243L718k1152N4901d2000G5685a03786j90647J32403H8513
$$ -199305 -14985 -201228 -197510 -218662 -163761 -42000 75685 -103786 -294433 -162030 88513
18686A18443h8553K3869B44512b40887a11547k1898J5144d8384l01721B39138
$$ 118443 -88553 -64684 244512 -240887 -111547 -133445 -118301 -48384 -350105 239138
18675a89765n7410j09784h453A59152a63560C0945c67235e8538q8972j40177a5535
$$ -189765 -247175 -356959 -8453 159152 -163560 30945 -367235 -58538 -147510 -287687 -15535
18663d0241k20895J27799k03705J01337j27971A4820b35854A40313k9662P1345
$$ -40241 -261136 -133337 -337042 -235705 -363676 14820 -235854 140313 110651 181996
18653A81996i8557A11348B5835a14701K5459j00594M0706A25395C6342c88231
$$ 181996 -98557 111348 25835 -114701 -89242 -189836 -149130 125395 36342 -388231
18642b22975E0013a59783j22246G004J49989m1428a1494n2591A16450a57386e1592
$$ -222975 50013 -159783 -282029 7004 156993 115565 -11494 -64085 116450 -157386 -51592
18630F0810a39283A4179a87875P6284J8636A82890a84154B3061K5041b06134B3669
$$ 60810 -139283 14179 -187875 -111591 -92955 182890 -184154 23061 48102 -206134 23669
18618h9225A45984b40093I286a27909G5992b05849j12499e3953p5994k302k62851
$$ -89225 145984 -240093 9286 -127909 75992 -205849 -318348 -53953 -129947 -132249 -395100
18607c95100d9236B11866H1922a36965D06823E7139b11850i2759C12725b94481
$$ -395100 -49236 211866 81922 -136965 406823 57139 -211850 -92759 312725 -294481
18596B29314b32372G8477i6724k93528e1475o6351l4541q2871A50713o3347L7080
$$ 229314 -232372 78477 -96724 -390252 -51475 -117826 -152367 -235238 150713 87366 124446
18585A24446A4028K52460a25982q8193A84885c5589n1777p0005B5212J51057b02804
$$ 124446 14028 266488 -125982 -214175 184885 -35589 -87366 -157371 25212 176269 -202804
18573g5901I5546a35131p5232j30929A77434c36981e316B6189b92343h2704q5079
$$ -75901 95546 -135131 -210363 -341292 177434 -336981 -5316 26189 -292343 -82704 -167783
18562a67783K0160n9328j21535O2124g0676B3276c36243A78184k3289c0983p0784
$$ -167783 -147623 -206951 -328486 -266362 -70676 23276 -336243 178184 154895 -30983 -101767
18551a01767j27496b4684r512l32222e2260A79184b0638j16699m5795B18176e8205
$$ -101767 -229263 -24684 -34196 -366418 -52260 179184 -20638 -137337 -183132 218176 -58205
18539H2789c1370E7563a5949n8166B1785i0957H4635O3307a63338q9560A14563
$$ 82789 -31370 57563 -15949 -74115 21785 -90957 84635 147942 -163338 -252898 114563
18527A6713g5528j5916A19604b08025L5567J4642p7484B43783m6383J4066a0834
$$ 16713 -75528 -91444 119604 -208025 -172458 -157816 -235300 243783 197400 211466 -10834
18515B7276J85508b44174g0563k30042q145A5862i4941B10763b63348A19843a20663
$$ 27276 212784 -244174 -70563 -300605 -308750 15862 -94941 210763 -263348 119843 -120663
18503F8197a5548B60879b5241A00997O8292j764D4591h2424R429b7109A96246
$$ 68197 -15548 260879 -25241 100997 169289 167525 44591 -82424 -72995 -27109 196246
18491G7307c9790D7478a19012C98110g6312l68750a04721A38241d72262A12133
$$ 77307 -39790 47478 -119012 398110 -76312 -445062 -104721 138241 -472262 112133
18480C7201K5385M3639d40871d640o1038A23376a31887A57677h7895l3446j1957
$$ 37201 62586 106225 -440871 -4640 -65678 123376 -131887 157677 -87895 -121341 -133298
18469a33298A30811k0785A3731a07691j15500L373B32127A14713A6731e1220A47202
$$ -133298 130811 110026 13731 -107691 -223191 -219818 232127 114713 16731 -51220 147202
18457a97888D2539f4766o8640o5981A54893Q7383I8269i6777c0442q2800j60973
$$ -197888 42539 -64766 -133406 -199387 154893 242276 98269 -96777 -30442 -113242 -274215
18446b74215C95973C598J27181D4675c29039J03719A31229k8474a78276L2936
$$ -274215 395973 3598 130779 44675 -329039 -225320 131229 102755 -178276 -145340
18436a45340A74624e02626K41789g1364j2214j48684A86137d8945A64360e4154
$$ -145340 174624 -502626 -260837 -71364 -83578 -232262 186137 -48945 164360 -54154
18425A14667O9901Q5467f3388n96k1638B2090a12899j25293Q9910J6378E8966
$$ 114667 184568 270035 -63388 -63984 -85622 22090 -112899 -238192 -148282 -131904 58966
18413C7534e7563A91037a01273j41024f9216p2891f6401B17782b7153k43508h8601
$$ 37534 -57563 191037 -101273 -242297 -69216 -142107 -66401 217782 -27153 -270661 -88601
18401a11714A6721a46614A14523l8895e1988E0401R1436C1198J70a69093n5389
$$ -111714 16721 -146614 114523 75628 -51988 50401 141837 31198 31368 -169093 -224482
18390b24482R2179D6597O0952m3242a18205D7129B0623a64536d035l95861f6718
$$ -224482 -132303 46597 107549 64307 -118205 47129 20623 -164536 -4035 -399896 -66718
18378I9994L6234a47381k14243A40490h0782D2686N8329C8365a12427B26694b37866
$$ 99994 136228 -147381 -361624 140490 -80782 42686 101015 38365 -112427 226694 -237866
18366f2378l43158h4375C1412c7049k09814A0263B758b68677P1587d0444j06158
$$ -62378 -405536 -84375 31412 -37049 -246863 10263 2758 -268677 -197090 -40444 -146602
18355a46602b9807E9992g1361j30356A61724k2845d3167l6120j12950H3753l5409
$$ -146602 -29807 59992 -71361 -201717 161724 138879 -43167 -79287 -192237 83753 48344
18344D8344K34463A04664M4354d8947A05407b37138D48616a15474r3344A6559
$$ 48344 282807 104664 149018 -48947 105407 -237138 448616 -115474 -208818 16559
18333A08421a03029j36561C09992a61636b4255c165o7938a2478E2586N0120h3479
$$ 108421 -103029 -239590 309992 -161636 -24255 -3165 -71103 -12478 52586 102706 -83479
18321B74686A13490d3452A9536h3871o8000E0257c06090B55272b10500A1505a08780
$$ 274686 113490 -43452 19536 -83871 -151871 50257 -306090 255272 -210500 11505 -108780
18309h030A90300g0810A50269D2672K6628f908j02989E9152j3839d59378B00081
$$ -8030 190300 -70810 150269 42672 69300 -6908 -109897 59152 45313 -459378 200081
18297a12104j29307A17979a02977j37533A43356K03679A34681g959B36007A4509
$$ -112104 -241411 117979 -102977 -240510 143356 347035 134681 -7959 236007 14509
18286a43991q4806g2841K2140m0256k32303P1189b8549C1918b04107B25220N7019
$$ -143991 -228797 -72841 -50701 -90957 -323260 -252071 -28549 31918 -204107 225220 282239
18275B82239a31412M5931j74680g3171j09353A02058b32524j7332f7640B05579
$$ 282239 -131412 -85481 -260161 -73171 -182524 102058 -232524 -249856 -67640 205579
18264b78561g5991a6284G0256f5722A64264O9997c67835a38500b7608A0546c7306
$$ -278561 -75991 -16284 70256 -65722 164264 234261 -367835 -138500 -27608 10546 -37306
18252A70229b44017C5600b19409A50476e5311C849J16653a18359G9631L6709c5384
$$ 170229 -244017 35600 -219409 150476 -55311 3849 120502 -118359 79631 116340 -35384
18240B6332a68696C80306j87819a53098B9665b02237B77649p29a99126j06145
$$ 26332 -168696 380306 192487 -153098 29665 -202237 277649 276920 -199126 -305271
18230c05271a48301K911c006C18274A50537d3123m0932j2208C1623a54852c7093
$$ -305271 -148301 -145390 -3006 318274 150537 -43123 -84055 -96263 31623 -154852 -37093
18218i2575j41188N0150P1221j86505Q3639I8889m4591d2006A05117a53737N9165
$$ -92575 -233763 -183613 -112392 -298897 -215258 98889 54298 -42006 105117 -153737 -94572
18207i4572A20245d30582C4897J00571J21616M8515a04627C1123B952Q2592b10952
$$ -94572 120245 -430582 34897 135468 257084 305599 -104627 31123 2952 85544 -210952
18195i4798M0761G6914J26379F6882b8485A05258d9747l1583I3684a46155H1087
$$ -94798 -54037 76914 203293 66882 -28485 105258 -49747 -81330 93684 -146155 81087
18183a3590r7590l4670A98974I3391d5448A09361A2050k028L72359b71755m4357
$$ -13590 -111180 -145850 198974 93391 -45448 109361 12050 10022 382381 -271755 -316112
18172c16112e0077o1209B39081b86469B86561a76800l395A29704A3095b00738
$$ -316112 -50077 -111286 239081 -286469 286561 -176800 -180195 129704 13095 -200738
18161C9887f9278l2541F1019g0360A52215c89610I1356b37580a5153B64309C2028
$$ 39887 -69278 -101819 61019 -70360 152215 -389610 91356 -237580 -15153 264309 32028
18149h0584K7711k3005B23387q607a4637b989A66310B5597E268J78793h2960k38499
$$ -80584 -52873 -75878 223387 214780 -14637 -2989 166310 25597 5268 184061 -82960 -321459
18137c21459K0788A03038c3624j36941H9329h3218c7671A41332B6500O9655J2871
$$ -321459 -300671 103038 -33624 -170565 89329 -83218 -37671 141332 26500 96155 109026
18126A09026j173d1366l6152A94414d8924A72174p5879b09736m0203C26702h9463
$$ 109026 107853 -41366 -77518 194414 -48924 172174 96295 -209736 -249939 326702 -89463
18114b865k75174D256J4922b02825A01922O4460c9106n4030l7011N1975A67789
$$ -2865 -278039 4256 19178 -202825 101922 166382 -39106 -93136 -130147 -78172 167789
18102A33657l639a70429q4084n5441A85437R8230a27529k86540B842J98564f635
$$ 133657 130018 -170429 -254513 -309954 185437 283667 -127529 -414069 2842 201406 -6635
18090A04392l7585a38913M2524B37925c0679j4805j08098E2578d9695H4163J62997
$$ 104392 66807 -138913 -96389 237925 -30679 -45484 -153582 52578 -49695 84163 247160
18079B47160a1848C9420N7583J79322d674k58574Q2984M7696C50a4066l06214
$$ 247160 -11848 39420 97003 276325 -4674 -263248 -180264 -132568 350 -14066 -320280
18068c20280i8924k0452I7721b88313F1127K8483a89128h0959k61464A77088b5288
$$ -320280 -98924 -119376 97721 -288313 61127 89610 -189128 -80959 -342423 177088 -25288
18056a25372B56782a02640B7770a50555k78775A11104a57725e5165A54730r792
$$ -125372 256782 -102640 27770 -150555 -429330 111104 -157725 -55165 154730 144938
18046A44938a8430G9660R8057E270K22229d18444b5052G5576R4695b57169K8609
$$ 144938 -18430 79660 177717 5270 227499 -418444 -25052 75576 170271 -257169 -228560
18035b28560q6335a27385N6156d374p3288m3340A04769B471R1178K48723e5251
$$ -228560 -314895 -127385 -71229 -4374 -77662 -121002 104769 2471 93649 342372 -55251
18023i5241E5241L11878j82947i250l55179l2592a86739K6254k33B83569A2220
$$ -95241 55241 367119 184172 -9250 -364429 -397021 -186739 -160485 -160718 283569 12220
18011d4683k38102B0248D029b10825A34390d0749A25561d7825J5095r3394A25433
$$ -44683 -282785 20248 4029 -210825 134390 -40749 125561 -47825 -32730 -126124 125433
17999a17289B46923g9556L0542j90297a17709B8502K72325G9185a73485O0466
$$ -117289 246923 -79556 -49014 -239311 -117709 28502 300827 79185 -173485 -113019
17989a13019D5904k2500c1517n8846H6223a43408L7816k00959A36891D9789J87391
$$ -113019 45904 23404 -31517 -90363 86223 -143408 -105592 -306551 136891 49789 237180
17978B37180f084k90398F9376e0455E2151A9965b05239C40077A20216J76552A30831
$$ 237180 -6084 -296482 69376 -50455 52151 19965 -205239 340077 120216 296768 130831
17966i2801I2351o038h3150b7690L708k33109B32694D5056i7999A40576f8039
$$ -92801 92351 86313 -83150 -27690 -23982 -257091 232694 45056 -97999 140576 -68039
17954B84903H3578R598P1259M8382c6026g392p0959I850a98263I6767c4389k10699
$$ 284903 83578 93176 164435 212817 -36026 -7392 -78351 9850 -198263 96767 -34389 -245088
17942b45088B09459m064E777a91376b1099A24548m7871B2436d037A03013h3105
$$ -245088 209459 205395 5777 -191376 -21099 124548 76677 22436 -4037 103013 -83105
17930I6041J7895L2088f494l8651j94378A96381C1785a88439d4234j79632R6232
$$ 96041 113936 146024 -6494 -45145 -239523 196381 31785 -188439 -44234 -223866 -127634
17919a27634J692H3503M5253Q8515k0170B7905J45189a79352h41j8580C90037
$$ -127634 -125942 83503 128756 217271 197101 27905 173094 -179352 -841 -19421 390037
17907C46959A11409c44424f1164D2776k1175J8654J8815a06960k32413J59478
$$ 346959 111409 -344424 -61164 42776 21601 40255 59070 -106960 -339373 -179895
17897a79895L1391C44747j28026a53974A36137b02050E6102g32o0713j09529G3545
$$ -179895 -148504 344747 216721 -153974 136137 -202050 56102 -732 -61445 -170974 73545
17885d1699q7799A14145E7050j2180c51967C2112g6840f469B14730I8406b63040
$$ -41699 -129498 114145 57050 44870 -351967 32112 -76840 -6469 214730 98406 -263040
17873C7984J79399d64164C5410N4687f2122r8404I4118b46910C9527d3995A40561
$$ 37984 217383 -464164 35410 90097 -62122 -160526 94118 -246910 39527 -43995 140561
17861A98307B273J27247K297L926a13505A72831a10217a825H8852A5005J13435
$$ 198307 2273 129520 131817 135743 -113505 172831 -110217 -1825 88852 15005 128440
17850A28440C3694K8297K34475g9580A75053P3712C146b12115m1581P1243A12813
$$ 128440 33694 61991 296466 -79580 175053 248765 3146 -212115 -253696 -182453 112813
17838i4631n5801D32105a5698A25814b33360G5443d593C29058A32510g7566j16780
$$ -94631 -150432 432105 -15698 125814 -233360 75443 -4593 329058 132510 -77566 -194346
17827a94346g9519E6472P282a73358I043K96746d5203a3700C23743d96028E2066
$$ -194346 -79519 56472 63754 -173358 9043 305789 -45203 -13700 323743 -496028 52066
17815A74599j2950N5420c04884A75520j832A9218b2121A06842n0049a47830G7611
$$ 174599 161649 217069 -304884 175520 173688 19218 -22121 106842 56793 -147830 77611
17803a43916p9507a4246j50034E3469d4975o1555l3049J5803B1435F724J1144
$$ -143916 -223423 -14246 -164280 53469 -44975 -106530 -139579 -123776 21435 6724 17868
17792A7868h8896I397J22037k7425k51c3227H6992J77749A01227J59650d4503
$$ 17868 -88896 9397 131434 104009 103758 -33227 86992 264741 101227 260877 -44503
17780d4345k09324j095J8238h097j86922A66769g0891K0286B18909B3410L25174
$$ -44345 -253669 -254764 -236526 -8097 -195019 166769 -70891 -50605 218909 23410 348584
17769C48584c3347A4266J52002M2615k7669a52526D58105j28541I0769Q7262q6927
$$ 348584 -33347 14266 166268 208883 181214 -152526 458105 329564 90769 178031 91104
17758I1104J08739I8366c2647B21419a32748B8418J53288E3081b30566a13361
$$ 91104 199843 98366 -32647 221419 -132748 28418 181706 53081 -230566 -113361
17747e3225B33J86195I094Q3928J49962m6926q1490d0523A51299A7562d23809
$$ -53225 233 186428 9094 93022 242984 196058 114568 -40523 151299 17562 -423809
17735f7909A73388O9647H3900J08195a27167K5968C04870B1435A871J89981K12300
$$ -67909 173388 243035 83900 192095 -127167 -101199 304870 21435 1871 191852 404152
17724D04152c9445k8910B68993J08162h099A18274l8173A9863Q9965a90543E1394
$$ 404152 -39445 -68355 268993 377155 -8099 118274 80101 19863 109828 -190543 51394
17712A99503R1329c27354I8993J32884b05588h8911B83054J2769A16890f4663
$$ 199503 290832 -327354 98993 231877 -205588 -88911 283054 295823 116890 -64663
17701H2096N6501M8888b94605G6076L60029G1791k6017J32856e1841j689C07074
$$ 82096 138597 187485 -294605 76076 436105 71791 45774 178630 -51841 -53530 307074
17689D5929J09260F9259a97826B61094b58895A24078c97242J29919F4398c69847
$$ 45929 155189 69259 -197826 261094 -258895 124078 -397242 -267323 64398 -369847
17678G3034O8073l537e3903K5873o47A58565K49658A32829h553j45719H3569J7138
$$ 73034 141107 137570 -53903 -28030 -28677 158565 408223 132829 -8553 -154272 83569 100707
17666A00707j8182J91563f1416B15875b17150c3874E29814A70900q2354J97271
$$ 100707 82525 274088 -61416 215875 -217150 -33874 529814 170900 88546 285817
17656B85817A13305l2231M11710I785a25199A29678Q6616K1858L0978A33839j2556
$$ 285817 113305 81074 492784 9785 -125199 129678 216294 238152 269130 133839 121283
17645A21283b1761B22895c3477F4089K48053p7090J60676j55356q2806d7299F4997
$$ 121283 -21761 222895 -33477 64089 312142 235052 395728 240372 157566 -47299 64997
17633A27468J0090R8590C1014q707R6902a40830C39941b6266B45392g7346B62630
$$ 127468 137558 236148 31014 22307 119209 -140830 339941 -26266 245392 -77346 262630
17621A07247e8596A41595e5550k09032M2906B76839a1090A34207J45686a11471
$$ 107247 -58596 141595 -55550 -264582 -221676 276839 -11090 134207 279893 -111471
17610c403A26980c1360E3594d5127j64938G6440b6216m3778C06144n1690E6413
$$ -3403 126980 -31360 53594 -45127 -210065 76440 -26216 -69994 306144 254454 56413
17598a4286D2948J07758L18544F697e5633C1521J58221n5552Q8896G4331q292
$$ -14286 42948 150706 469250 6697 -55633 31521 189742 134190 223086 74331 66039
17587F6039j0892B2378M4456J72495C4458J68913q7402j8663M9926g6982A6085
$$ 66039 55147 22378 66834 239329 34458 203371 115969 97306 147232 -76982 16085
17575C69699a21041C40067N1320e3258C50313b113A48501a29573A96597K05326
$$ 369699 -121041 340067 391387 -53258 350313 -2113 148501 -129573 196597 401923
17565D01923j57954n043a45316C67549C8819J38986N7807a56598a6479A56173
$$ 401923 243969 238926 -145316 367549 38819 177805 235612 -156598 -16479 156173
17554A24738N0678P386N8403A9419K67547L9380n1068P1421A00018C6380K9002
$$ 124738 175416 182802 241205 19419 286966 326346 275278 346699 100018 36380 65382
17543F5382N966J8858J79972c0825B07834p8942Q1749o3160k9520b1735C51304
$$ 65382 71348 90206 270178 -30825 207834 128892 210641 147481 117961 -21735 351304
17531A43121L51067j62248q1875J63582K81041L98034l95230O72543o71094R7831
$$ 143121 494188 331940 250065 413647 694688 1092722 697492 1370035 698941 796772
17521G96772C65053M01822k73864j61622j50717m4465L59375J24323j51485L61302
$$ 796772 365053 766875 493011 331389 180672 136207 495582 619905 468420 829722
17511H29722l9516J32339J35762k47264J11727C98168J6842j22637L04466A5352
$$ 829722 790206 922545 1058307 811043 922770 398168 415010 292373 596839 15352
17500I3509N85942B314J73444N2648J94944m7400r340P5947k20934J8840L0846
$$ 93509 679451 2314 175758 228406 423350 375950 366610 442557 221623 240463 271309
17489B71309C3621M25439j988A65255J9216K84137N4434A48267J76048L61868
$$ 271309 33621 459060 457072 165255 184471 468608 523042 148267 324315 686183
17479F86183k75865R177A63261j888L09475f7743C58276j70377a04280B90690
$$ 686183 410318 419495 163261 161373 470848 -67743 358276 187899 -104280 290690
17468G5223K56412L33053A35642a07904A79927b6804B79966l2937q7388N9605
$$ 75223 331635 664688 135642 -107904 179927 -26804 279966 247029 159641 219246
17458B19246a15754A64830G7600M48071c0910A31988J73027K41213n742j87535
$$ 219246 -115754 164830 77600 525671 -30910 131988 305015 546228 540486 352951
17448C52951Q3153A86326J07382J44390M00578j25056j18517K5219A22540J8132
$$ 352951 436104 186326 293708 438098 838676 713620 595103 620322 122540 140672
17438A40672K24319A68565L99444j87671n8931o5512K83763j34596K6128I9770
$$ 140672 364991 168565 568009 380338 321407 255895 539658 405062 431190 99770
17427E73656B28825K021R1549M730a4897D46025j53274K50187m0869m4983q954
$$ 573656 228825 230846 322395 327125 -14897 446025 292751 542938 502069 457086 448132
17416D48132A98799J39721j68585L40269B9198L43356j9189r2460J7484L05567
$$ 448132 198799 338520 169935 510204 29198 372554 353365 260905 278389 583956
17406E83956B67859n2591L25300E4064M7075J34007J41423A82157O5118C503J88298
$$ 583956 267859 215268 540568 54064 101139 235146 376569 182157 247275 3503 191801
17395A91801J93101r3916j23244L13967B29631n6385P4350a811j31508C63095
$$ 191801 384902 290986 167742 481709 229631 173246 247596 -1811 -133319 363095
17384D9475J74764R9311R8532j79235L37251B67190I0491J87931B8931L12737
$$ 49475 224239 323550 422082 242847 580098 267190 90491 278422 28931 341668
17374C41668j4931k1110j15022J93264H8388K34735a77812C09877e3269E94918
$$ 341668 326737 305627 190605 383869 88388 323123 -177812 309877 -53269 594918
17363C32733j57180c6804C38547j27923M1923J42954D3265K50974m5840O2508
$$ 332733 175553 -36804 338547 210624 252547 395501 43265 294239 248399 310907
17353C10907O0804j33141q3725J71981k6939J94119j81256J39593j41773K374
$$ 310907 371711 238570 154845 326826 299887 494006 312750 452343 310570 312944
17343C12944r7932R7761c7120C23282M4218A40338K50602q3065r1691a77425E71916
$$ 312944 215012 312773 -37120 323282 367500 140338 390940 307875 216184 -177425 571916
17331C79039C6949M75498j92495p3675k9577g3493D04014j2546K07177k04342
$$ 379039 36949 512447 319952 246277 216700 -73493 404014 391468 598645 394303
17321C94303J14128n6630G6203K27725L34657A49626l9519J44501n4830K68379
$$ 394303 508431 451801 76203 303928 638585 149626 110107 254608 199778 468157
17311D68157j41647A57261K44687o8794A35112L4163O9689G9542L5700J23637
$$ 468157 326510 157261 401948 333154 135112 169275 238964 79542 115242 238879
17301B38879J14629I3116q51K12337j6920n1972j1199j4266J39683K10675F5736
$$ 238879 353508 93116 92265 304602 287682 235710 224511 210245 349928 560603 65736
17289D71609B03277B0913K51316j1675m9188K13697j86634J16929M6165A52394
$$ 471609 203277 20913 272229 260554 211366 425063 238429 355358 401523 152394
17278B80242P3634L06537C3227J42114b4620A20994R5733d963A43794O638J15012
$$ 280242 353876 660413 33227 175341 -24620 120994 216727 -4963 143794 150432 265444
17267B65444M27762C23595j01236e5202D45276l3553k05693n2729L18350A93957
$$ 265444 693206 323595 222359 -55202 445276 411723 206030 153301 471651 193957
17256B32894K31774k16043A10014N9758L28464Q1654k01403C5146N17933j69503
$$ 232894 464668 248625 110014 169772 498236 579890 378487 35146 553079 383576
17246C83576R0538j73577L0108n5755J10282j26851j320J77298A31854K30237
$$ 383576 474114 300537 330645 274890 385172 258321 257001 434299 131854 362091
17236C62091K26874A61907K4535m6333L10903J22981j30419j41697K15020M5709
$$ 362091 588965 161907 186442 140109 451012 573993 443574 301877 516897 562606
17226E62606n7410p5083J5985K27276C21339M0222n9910H3158F419O60441J97678
$$ 562606 505196 430113 446098 673374 321339 361561 301651 83158 6419 666860 864538
17215H64538l72232k2227J57833k69621N2867m9491K06019B55782M42244k00399
$$ 864538 492306 470079 627912 358291 411158 361667 567686 255782 698026 497627
17205D97627j90557o4723N04286p0303j56161j44128M1664K00468J42424j16355
$$ 497627 307070 242347 746633 676330 520169 376041 417705 618173 760597 644242
17195F44242B44770M37959r931k7644j40987j19159K8313j67146K55330k38607
$$ 644242 244770 682729 672798 645154 504167 385008 413321 246175 501505 262898
17185B62898J04779L8813L47797B91039L17156k90266q8271L08118P0141j02857
$$ 262898 367677 406490 754287 291039 608195 317929 229658 537776 607917 505060
17175E05060K9205J71246k03534M37207k22959m2380j45365A52722L71901k7684
$$ 505060 534265 705511 501977 939184 716225 673845 528480 152722 524623 496939
17165D96939J22175p5185J40463j00941J8027J71388A32047M10750J92751k66364
$$ 496939 619114 543929 684392 583451 601478 772866 132047 542797 735548 469184
17155D69184J93724N1772k03375L26703l53191K54678k19164p7898R8308J72751
$$ 469184 662908 714680 511305 838008 484817 739495 520331 442433 540741 713492
17145G13492j12697J36483B83561M23869k07047K35692l08115j87437L14652j58066
$$ 713492 600795 737278 283561 707430 500383 736075 427960 240523 555175 397109
17135C97109K66195k8971j35626K58062n8158k74400q919K39871K75235k67603
$$ 397109 663304 634333 498707 756769 698611 424211 415292 655163 930398 662795
17125F62795R75j30261K06995R3163A95105Q91316l39335l15955J12673j50783
$$ 662795 663770 533509 740504 833667 195105 1086421 747086 431131 543804 393021
17115C93021M17677Q0021n4712B89473O64384j23339K4549j87144J02254j27843
$$ 393021 810698 890719 836007 289473 953857 830518 855067 667923 770177 642334
17105F42334r1336J47615m8528p9472k5774K32607k65381M9748K92427L19632
$$ 642334 550998 698613 650085 570613 544839 777446 512065 561813 854240 1173872
17095A173872n77662j21601P7933P2283L6160L16913m05815k52K9882N17645n11630
$$ 1173872 596210 474609 552542 624825 660985 977898 572083 571831 601713 1119358 607728
17084F07728K72627K447L61999E52385N36258E27233J60271J24231M7965k03984
$$ 607728 880355 882802 1244801 552385 1088643 527233 687504 811735 859700 655716
17074F55716M00461j48279N8973j54395K91137j35275J85374j68375l4419o5822
$$ 655716 1056177 907898 966871 812476 1103613 968338 1153712 985337 950918 885096
17064H85096K2074r2951J2583K21291K94845m14878M32738o01802J07236J69175
$$ 885096 907170 814219 826802 1048093 1342938 928060 1360798 758996 866232 1035407
17054A035407j43796M5811Q5519r1068N5820j47503j51444K18635O7777J43984
$$ 1035407 891611 937422 1022941 931873 987693 840190 688746 907381 975158 1119142
17044A119142j74688J80723j0362j88859J84813j47616r3301M1902q973J96588
$$ 1119142 944454 1125177 1114815 925956 1110769 963153 869852 911754 902781 1099369
17034A099369J36783j5332J67523m25340L4917k9833j6682o1406M17761m44219
$$ 1099369 1236152 1220820 1388343 963003 997920 968087 951405 889999 1307760 863541
17024H63541M14848j10972j56927K35294K15786l94493K7944n2317k6398K50479
$$ 863541 1278389 1167417 1010490 1245784 1461570 1067077 1095021 1042704 1016306 1266785
17014A266785N596J64662k80864J87029J2209l49477K47720j43473K11092m07160
$$ 1266785 1272381 1437043 1156179 1343208 1355417 1005940 1253660 1110187 1321279 914119
17004I14119K90244M44955l24999j98298L36805j93029O92073n09757K09551k75904
$$ 914119 1204363 1649318 1324319 1126021 1462826 1269797 1961870 1452113 1661664 1385760
16994A385760N0468K46200j09549o1505k23939K70823J91838j81198K6971n2946
$$ 1385760 1436228 1682428 1572879 1511374 1287435 1558258 1750096 1568898 1595869 1542923
16984A542923J11177J3086m01404L90396J76826k35030Q8603J00506p4723m922
$$ 1542923 1654100 1667186 1265782 1656178 1833004 1597974 1686577 1787083 1712360 1707438
16974A707438o6688l9k7562L6977K0865K09347k01638O6353k03618N07112k08102
$$ 1707438 1640750 1640711 1613149 1650126 1670991 1880338 1678700 1745053 1541435 2048547 1840445
16963A840445m2271J9018J09293k7370J0022l5229O6431j29588L47846l79013
$$ 1840445 1798174 1817192 1926485 1899115 1909137 1873908 1940339 1810751 2158597 1779584
16953A779584J23781r9736K38868J57191j9931l10662n2942L97313J01894l56
$$ 1779584 1903365 1803629 2042497 2199688 2179757 1869095 1816153 2213466 2315360 2315004
16943B315004k46900L59768L8410m46969L51116j22340k18864L92549L2915r2824
$$ 2315004 2068104 2427872 2466282 2019313 2370429 2248089 2029225 2421774 2454689 2361865
16933B361865J94105l08647J17083j46315M21038j07556Q5001K59349m19974M74620
$$ 2361865 2555970 2247323 2364406 2218091 2639129 2531573 2616574 2875923 2455949 2930569
16923B930569k39365j80615J00572K40243j11528P9196n6453M57668l51999p048
$$ 2930569 2691204 2510589 2611161 2851404 2739876 2819072 2762619 3220287 2868288 2861240
16913B861240k2886M87178l43127k07953M95510j32139k28708J54405p6847K42491
$$ 2861240 2838354 3325532 2982405 2774452 3269962 3137823 2909115 3063520 2986673 3229164
16903C229164j2064q6294J23856r1849J65800J84809k25016J62974K94782l20546
$$ 3229164 3217100 3130806 3254662 3162813 3328613 3513422 3288406 3451380 3746162 3425616
16893C425616K31973k88509N35336J94016n0940j63958l0863L36004j64542j33439
$$ 3425616 3657589 3369080 3904416 4098432 4047492 3883534 3852671 4188675 4024133 3890694
16883C890694J06937Q0581L14839l9060l4559k00965M20692K90107o86897K13172
$$ 3890694 3997631 4078212 4393051 4353991 4319432 4118467 4539159 4829266 4142369 4355541
16873D355541R4798K41440J00353J71986l56517M77513q6404j5269J94945o2737
$$ 4355541 4450339 4691779 4792132 4964118 4607601 5085114 4998710 4983441 5178386 5115649
16863E115649M88752j24112j67361L38406k64366j28370L54712M68569j84056
$$ 5115649 5604401 5480289 5312928 5651334 5386968 5258598 5613310 6081879 5897823
16854E897823j94643N36981l3292K64484k87796j16489K40013L11824L3733P7026
$$ 5897823 5703180 6240161 6206869 6471353 6183557 6067068 6307081 6618905 6652638 6729664
16844F729664M01785N2025j88469K39297K90542J9598k9135J91495K2495N09959
$$ 6729664 7131449 7183474 6995005 7234302 7524844 7544442 7515307 7706802 7729297 8239256
16834H239256l39415K86960M79989j52791K63465J24795J9541K18772k2682M34265
$$ 8239256 7899841 8186801 8666790 8513999 8777464 8902259 8921800 9140572 9117890 9552155
16824I552155R4917L49695J22280j23839O09493j81078J43295L81580L07473n6342
$$ 9552155 9647072 9996767 10119047 9995208 10604701 10423623 10566918 10948498 11255971 11199629
16814A1199629n362O53776m9001M88052K17499J99297K95992K09325J27674L95188
$$ 11199629 11194267 11848043 11799042 12287094 12504593 12703890 12999882 13209207 13336881 13732069
16804A3732069j6243N09778K38702M70696K08893N43185N1557J94959N03524K34790
$$ 13732069 13715826 14225604 14464306 14935002 15143895 15687080 15738637 15933596 16437120 16671910
16794A6671910N08203N07289N37792M09835K83787L66029M45981N88981O26462
$$ 16671910 17180113 17687402 18225194 18635029 18918816 19284845 19730826 20319807 20946269
16785B0946269M14276M11598N31814L60771N91267P50546O01889N66994P91200
$$ 20946269 21360545 21772143 22303957 22664728 23255995 24006541 24608430 25175424 25966624
16776B5966624O91894N81415M89847J213875O50348R04510N18372Q23004J260626
$$ 25966624 26658518 27239933 27729780 28943655 29594003 30498513 31016885 31839889 33100515
16767C3100515N23125J344987P63145O88589J108701J271507P70683J574385J177428
$$ 33100515 33623640 34968627 35731772 36420361 37529062 38800569 39571252 41145637 42323065
16758D2323065N66448J392638J092806J803088J239281J244360J236801J411230
$$ 42323065 42889513 44282151 45374957 47178045 48417326 49661686 50898487 52309717
16750E2309717J368058J570577J602887J049024J906021J300605J731376J525031
$$ 52309717 53677775 55248352 56851239 57900263 59806284 61106889 62838265 64363296
16742F4363296J325052J722012J501685J495140J666247J347308J589630J657716
$$ 64363296 65688348 67410360 68912045 70407185 72073432 73420740 75010370 76668086
16734G6668086J209834J219947J034337J805248J83867J139515J152276R53751
$$ 76668086 77877920 79097867 80132204 81937452 82121319 83260834 84413110 85366861
16726H5366861K76231N71509J58992L14901J18680j66227K33071r08391Q1979
$$ 85366861 85643092 86214601 86373593 86688494 86807174 86640947 86874018 85965627 86047606
16717H6047606p13889k30361j337386n35495j244754q27216j357594j317713j537892
$$ 86047606 85333717 85103356 83765970 83230475 81985721 81158505 79800911 78483198 76945306
16708G6945306j056961j599882r65844j753001j727940j492203j550231j979813
$$ 76945306 75888345 74288463 73322619 71569618 69841678 68349475 66799244 64819431
16700F4819431j276862k015933j226273j414740j955046j001788j705686j354349
$$ 64819431 63542569 61526636 60300363 58885623 56930577 55928789 54223103 52868754
16692E2868754j386482j666750j432187j068285j523395j419862j176410j276445
$$ 52868754 51482272 49815522 48383335 47315050 45791655 44371793 43195383 41918938
16684D1918938j040810q94236j185060j184160j064448j039482q67753j516151
$$ 41918938 40878128 39983892 38798832 37614672 36550224 35510742 34642989 33126838
16676C3126838k36165j287545n94007p42775o75411j252527n68682o40517p61373
$$ 33126838 32890673 31603128 31009121 30266346 29590935 28338408 27769726 27129209 26367836
16667B6367836q17116m20704p45719n90141n14323n13845o83649o58583o13983
$$ 26367836 25550720 25130016 24384297 23794156 23279833 22765988 22082339 21423756 20809773
16658B0809773k25436l91985n40271q27643l42492k74564m28463o3438j198820
$$ 20809773 20584337 20192352 19652081 18824438 18481946 18207382 17778919 17715481 16516661
16649A6516661j36284R0602n78679k75046j67492o03546j22099n55305n29675
$$ 16516661 16380377 16470979 15892300 15617254 15449762 14846216 14724117 14168812 13639137
16640A3639137j63237Q6449n93464Q9060j09992p46872j57768j60180q698p25776
$$ 13639137 13475900 13562349 12968885 13057945 12947953 12201081 12043313 11883133 11874435 11148659
16630A1148659K4605l56656q7186j47039k66991k33225l01268j54649k24508J51286
$$ 11148659 11173264 10816608 10729422 10582383 10315392 10082167 9780899 9626250 9401742 9553028
16620I553028l21225m54589J07894j79936j02035l70702K7318j03246k25778J34405
$$ 9553028 9231803 8777214 8885108 8705172 8603137 8232435 8259753 8156507 7930729 8065134
16610H065134j63117m58030J96449j12828j34341j68396j92993k28596l0036K55402
$$ 8065134 7902017 7443987 7640436 7527608 7393267 7224871 7031878 6803282 6773246 7028648
16600G028648j82926k81255l02192l08961M86591l49487M4497l37981q1423L18699
$$ 7028648 6845722 6564467 6262275 5953314 6439905 6090418 6134915 5796934 5715511 6034210
16590F034210m35757R9123R544k76565k67254K37318l2654j54938j98900J14285
$$ 6034210 5598453 5697576 5707120 5430555 5163301 5400619 5367965 5213027 5014127 5128412
16580E128412l95295j3821J50838j67933J72770j96138r5013j80927N3265n2443
$$ 5128412 4733117 4719296 4870134 4702201 4874971 4678833 4583820 4402893 4456158 4403715
16570D403715Q7638j78281m02155M76753j89300k98314J04617L26522k76037l76135
$$ 4403715 4491353 4313072 3910917 4387670 4198370 3900056 4004673 4331195 4055158 3679023
16560C679023L67438k58168J13441k06705K1539l91790M20233j65079l29870K8045
$$ 3679023 4046461 3788293 3901734 3695029 3716568 3324778 3745011 3579932 3250062 3278107
16550C278107L25245j12638m13700L16091K86774m72733Q848k29891J89770J1452
$$ 3278107 3603352 3490714 3077014 3393105 3679879 3207146 3215994 2986103 3175873 3187325
16540C187325k48437J77068J37750l4393m47933K1252K28565j24016Q6210l29051
$$ 3187325 2938888 3115956 3253706 3219313 2771380 2792632 3021197 2897181 2983391 2654340
16530B654340J07694k5080l43290M00993j43292j10231j88556K22084j03389Q639
$$ 2654340 2762034 2736954 2393664 2794657 2651365 2541134 2352578 2574662 2471273 2479912
16520B479912p2230l05324k04J63330K69829j37405n8346O1609l83578K06834
$$ 2479912 2407682 2102358 2102154 2265484 2535313 2397908 2339562 2401171 2017593 2224427
16510B224427K02102j19511J3791l13010J65833j75379M62760j55929j04640j78534
$$ 2224427 2426529 2307018 2320809 2007799 2173632 1998253 2461013 2305084 2200444 2021910
16500B021910k37969M9116J3674l9579K81539R6811l54382o1261J5086J34587
$$ 2021910 1783941 1833057 1846731 1807152 2088691 2185502 1831120 1769859 1784945 1919532
16490A919532l09469K04943J71586j68607K07264j06731k72611J21021p0768J15903
$$ 1919532 1610063 1815006 1986592 1817985 2025249 1918518 1645907 1766928 1696160 1812063
16480A812063m47817N15128j80139L06400l26996J24511k4949j92229J24057l93986
$$ 1812063 1364246 1879374 1699235 2005635 1678639 1803150 1778201 1585972 1710029 1316043
16470A316043J33947M62304o75773K60162j09457N2582J87122o4978p251j21929
$$ 1316043 1449990 1912294 1236521 1496683 1387226 1439808 1626930 1561952 1554701 1432772
16460A432772n929N0810J2509m1166j61376K50604M22801m09938n32011L53338
$$ 1432772 1426843 1477653 1490162 1448996 1287620 1538224 1961025 1551087 1019076 1372414
16450A372414j20108N7031M3539p7657j47620n0347K06047j2131N0708R5089l72890
$$ 1372414 1252306 1309337 1352876 1275219 1127599 1077252 1283299 1271168 1321876 1416965 1044075
16439A044075L47011j09194J79862j11591j43571J82008K1804j46125L4748k39312
$$ 1044075 1391086 1281892 1461754 1350163 1206592 1388600 1410404 1264279 1299027 1059715
16429A059715L33408k32772J60631j96116j11451l2519K42934j0997l99316K87500
$$ 1059715 1393123 1160351 1320982 1124866 1013415 980896 1223830 1212833 813517 1101017
16419A101017j44148J85415P0502j50500n1057j42693K64756k14058K79583p05
$$ 1101017 956869 1142284 1212786 1062286 1011229 868536 1133292 919234 1198817 1198112
16409A198112n6092l55159L39007O696j02331j14555K27675R7926k40904o2769
$$ 1198112 1142020 786861 1125868 1132564 1030233 915678 1143353 1241279 1000375 937606
16399I37606k29028K93127j03135q810l5609N6413L64876m86917O8454l3107j7077
$$ 937606 708578 1001705 898570 889760 854151 910564 1275440 788523 856977 823870 806793
16388H06793M8537p7138j87540J68547K84744l5305D47608O44511k23655j425
$$ 806793 855330 778192 590652 759199 1043943 1008638 447608 1092119 868464 867039
16378H67039l1406K09897B83042O86455k00322j76217K52471L9750J73268k15503
$$ 867039 835633 1045530 283042 969497 769175 592958 845429 885179 1058447 842944
16368H42944k70353M43093O98k5643D23393M35382r4107k246O6044p5328k64773
$$ 842944 572591 1015684 1016382 990739 423393 858775 764668 762422 828466 753138 488365
16357D88365J68493j58548J07160K47069l82093L86633J16805C23380k7746M99358
$$ 488365 656858 498310 605470 852539 470446 857079 973884 323380 295634 794992
16347G94992P3899j79385L3712j89305J34913k99878L63695m7264j60455K107
$$ 794992 868891 689506 723218 533913 668826 368948 732643 685379 524924 527031
16337E27031K02870N3739C39433M45580l13999L21985p5674l38303J70870L33490
$$ 527031 729901 783640 339433 785013 471014 792999 717325 379022 549892 883382
16327H83382C32653K50415k08248K35416j45787J69088N8416J20861j43668A1549
$$ 883382 332653 583068 374820 610236 464449 633537 691953 812814 669146 11549
16316F95854l28303J41063r3546J60342B04469K75694G9152M47841k00719M41999
$$ 695854 367551 508614 415068 575410 204469 480163 79152 526993 326274 768273
16306G68273l67610r8689K24936K86279C05641J77917B40585J21994L07944H0527
$$ 768273 400663 301974 526910 813189 305641 483558 240585 362579 670523 80527
16295B78832K31742j36357J30924J35649q5429L5925D8913J21190M81534B90209
$$ 278832 510574 374217 505141 640790 555361 591286 48913 170103 651637 290209
16284G00980k22082k2864J95953k46219j36939K90372J40982B65657k328o9J20221
$$ 700980 478898 456034 651987 405768 268829 559201 700183 265657 263329 263260 383481
16273C83481m1817L1403L30272B37471J87262j98642O5306K93385p7720A77232
$$ 383481 341664 373067 703339 237471 424733 226091 291397 584782 507062 177232
16262B15818L93832j89609K5699J40115L18047m24342k17355I8343K50383j24979
$$ 215818 609650 420041 445740 585855 903902 479560 262205 98343 348726 223747
16252B23747I5193a1986B36938J76700j15908E3231K51998J35180K8567h2805
$$ 223747 95193 -11986 236938 413638 297730 53231 305229 440409 468976 -82805
16241F46058A31227N63447B61506K77995k04313B3780J17745M26180K4730r0485
$$ 646058 131227 694674 261506 539501 335188 23780 141525 567705 592435 501950
16231E01950j10536j47583j2110A06013n2180Q8005L13621k04177j18400K3430
$$ 501950 391414 243831 231721 106013 53833 141838 455459 251282 132882 156312
16221A56312J17179K57606k45490M259E6357J37610J39121P1622O6133A06469
$$ 156312 273491 531097 285607 289866 56357 193967 333088 404710 470843 106469
16210F56457j74448B06898r3007K57929A73136m7238L04944A67221L16021A46689
$$ 656457 482009 206898 113891 371820 173136 125898 430842 167221 483242 146689
16199D7516f3485A52611J89650l1353A23617N342L29833j75455a19122C45704
$$ 47516 -63485 152611 342261 310908 123617 128959 458792 283337 -119122 345704
16188B98204O0995A00669L33964j37237H1131K20032N2314J09389j09171j21738
$$ 298204 359199 100669 434633 297396 81131 301163 353477 462866 353695 231957
16178B31957a8656A42760J6182G2234K06947D9408K25332K3020r9811L1549a03902
$$ 231957 -18656 142760 158942 72234 279181 49408 274740 297760 197949 229498 -103902
16166C13927k825j28557G990O6759K60572A39792K26784r4379M422c5271C15667
$$ 313927 311102 182545 7990 74749 335321 139792 366576 272197 276619 -35271 315667
16154D64091B11461D3923N4623J00573Q5L12520B24962b3909F2781K3920d9394
$$ 464091 211461 43923 98546 199119 199204 511724 224962 -23909 62781 86701 -49394
16142A38066K76985k07137N2871I5358J45695O2088p7904n0664H3753K36378O5455
$$ 138066 415051 207914 260785 95358 241053 303141 225237 174573 83753 320131 385586
16131C85586N1590e1306B49050q4544D0061N44378E4878A8545J20925J6416l0741
$$ 385586 437176 -51306 249050 164506 40061 584439 54878 18545 139470 155886 125145
16120A25145K46743r3902G536J33187g269n047A44182J20854A15970i9065A80152
$$ 125145 371888 277986 7536 140723 -7269 -12316 144182 265036 115970 -99065 180152
16108a2625A08351J31094N585a26444B66245e906C5700d0232C32031h2776A82518
$$ -12625 108351 239445 245030 -126444 266245 -5906 35700 -40232 332031 -82776 182518
16096E5329M10935o3322A30173p766J04329p40L90836a5715A45412J02001p4722
$$ 55329 466264 402942 130173 122407 226736 225996 616832 -15715 145412 247413 172691
16085A72691a47129n9187D9699K2757a79948B33115B1064J08292O1038b72034
$$ 172691 -147129 -206316 49699 72456 -179948 233115 21064 129356 190394 -272034
16074E1333J1729C020J2277g8375G7073b18852D9584L2844N0369A4263J00134
$$ 51333 63062 3020 15297 -78375 77073 -218852 49584 82428 132797 14263 114397
16063A14397k7117J04361e2259j32206D37065I0096m3468H950e7610E2323L6609
$$ 114397 87280 191641 -52259 -184465 437065 90096 46628 8950 -57610 52323 88932
16052H8932K04718D1454L03321a58423C98818B6524g1572k05355E265h5645A56670
$$ 88932 293650 41454 344775 -158423 398818 26524 -71572 -276927 5265 -85645 156670
16040B1223a13159J1863A95390M4688R3557A62440O2325a99404D01494A36674
$$ 21223 -113159 -101296 195390 240078 333635 162440 224765 -199404 401494 136674
16029H4938k6431J49911k2243H6213K907b87871A33482Q3813g8033A75173q5678
$$ 84938 58507 208418 186175 86213 89120 -287871 133482 217295 -78033 175173 89495
16018H9495b43233a18074E4043K60279a02939B29706o8410L8638A4129K09968
$$ 89495 -243233 -118074 54043 314322 -102939 229706 161296 199934 14129 224097
16008B24097a60428l03168B48696B4167g4958A5512J12240A6709R2942m5613K05743
$$ 224097 -160428 -463596 248696 24167 -74958 15512 127752 16709 109651 64038 269781
15997B69781j04559B5334J91818h902A08458j3229R3765G008L94721J43229K17409
$$ 269781 165222 25334 217152 -8902 108458 95229 188994 7008 401729 544958 762367
15986G62367K72384M60466j28118k92008j50511l89430o3544B2982K09565L9534
$$ 762367 1034751 1495217 1367099 1075091 924580 535150 471606 22982 232547 272081
15976B72081K6593l468I7383J9526J19740a79351L5810M5441K5484G097a63777
$$ 272081 298674 295206 97383 116909 236649 -179351 -143541 -98100 -72616 7097 -163777
15964a07797j56864C11119i5807A69019d1773C35426p7776A07169J34241D1733
$$ -107797 -264661 311119 -95807 169019 -41773 335426 257650 107169 241410 41733
15953H7747i8397A05158a88768e2813D2722c24104A87552l9009h2196C5014a57318
$$ 87747 -98397 105158 -188768 -52813 42722 -324104 187552 148543 -82196 35014 -157318
15941B5183K78451A30722L2278K22186A14938b26946A6929L13121b50083A62601
$$ 25183 303634 130722 163000 385186 114938 -226946 16929 330050 -250083 162601
15930G4578a75320A00564a35154J7725G3727a08463k9813f2811H1477J90334j32494
$$ 74578 -175320 100564 -135154 -117429 73727 -108463 -138276 -62811 81477 271811 139317
15919A39317L1352a60894C32071F405e0442A64107P8139B1855e5400d891D04142
$$ 139317 170669 -160894 332071 6405 -50442 164107 242246 21855 -55400 -4891 404142
15907G7537c7658A51795J21536g4060D48446F1269b26474B03011g0624A2277c5364
$$ 77537 -37658 151795 273331 -74060 448446 61269 -226474 203011 -70624 12277 -35364
15895a69335Q2874i603l9344A56923a25536j292A22872K02275a10934e4426b460
$$ -169335 -86461 -9603 -48947 156923 -125536 -126828 122872 325147 -110934 -54426 -2460
15883a01080b1020k54739f6066A48940J57480a54225d1952l1567p5452d1030c309
$$ -101080 -21020 -275759 -66066 148940 306420 -154225 -41952 -73519 -148971 -41030 -3309
15871c4338H6376i4357A08694a93597A30505c03854C15893D6792J57827L1590
$$ -34338 86376 -94357 108694 -193597 130505 -303854 315893 46792 204619 236209
15861B36209I9369A0869b2667d409A03106O7688b06062B93561A45637e5140j24537
$$ 236209 99369 10869 -22667 -4409 103106 170794 -206062 293561 145637 -55140 -179677
15850a79677A43272h4389A3365a52846A99565F7108P4808d8490j43156R2728D7583
$$ -179677 143272 -84389 13365 -152846 199565 67108 141916 -48490 -191646 -98918 47583
15838d4935l07709c6820F7636e7409A07578J22110d6956A65115g3869F4707L61376
$$ -44935 -352644 -36820 67636 -57409 107578 229688 -46956 165115 -73869 64707 426083
15827D26083A34674b51327B79821c01479H4593f9593A58929M7340d76723B65517
$$ 426083 134674 -251327 279821 -301479 84593 -69593 158929 206269 -476723 265517
15816D178J58567J45519d9809l2246o3081c4705B13623c16841l7400i0003B0206
$$ 4178 162745 308264 -49809 -82055 -145136 -34705 213623 -316841 -354241 -90003 20206
15804A42746c0038A42377g9058n4691j2901D7241J61868e7042A19012n0841a0457
$$ 142746 -30038 142377 -79058 -133749 -146650 47241 209109 -57042 119012 68171 -10457
15792a39095j78977a05208B00579K6847A5014b82085J32857A08451J19848c41395
$$ -139095 -318072 -105208 200579 227426 15014 -282085 -149228 108451 228299 -341395
15781A64348g8369D3562r393e309j84167A24274N9671b54072A8890P72i6783C0879
$$ 164348 -78369 43562 34169 -5309 -189476 124274 183945 -254072 18890 19662 -96783 30879
15768A36432N40068a27818A73526C7051b2583e446C0047J23535l3699J60314g1943
$$ 136432 676500 -127818 173526 37051 -22583 -5446 30047 153582 119883 280197 -71943
15756h0434o6421l77606B82412B5189P5666b10670A34471a10391k49393d053j06831
$$ -80434 -146855 -524461 282412 25189 100855 -210670 134471 -110391 -359784 -4053 -110884
15745a10884D4318h9513A68220J78069A26875A3170K20695j9541a7147A17475
$$ -110884 44318 -89513 168220 346289 126875 13170 233865 214324 -17147 117475
15734a51028B24130a34607A24488c40354O1830B70222a26447C08800c64115i0380
$$ -151028 224130 -134607 124488 -340354 -278524 270222 -126447 308800 -364115 -90380
15723a18890B1472b82725a19242H2268J20917b11060a8684o1824A79677a45908
$$ -118890 21472 -282725 -119242 82268 203185 -211060 -18684 -80508 179677 -145908
15712F3337g3681G1708c3780j37083g9926R542n5552H084J09284d17890J99197
$$ 63337 -73681 71708 -33780 -170863 -79926 -70384 -125936 8084 117368 -417890 -218693
15701b18693I1795a55236p7276h6792j23687p1653a18311B22659a20821A39224
$$ -218693 91795 -155236 -232512 -86792 -210479 -282132 -118311 222659 -120821 139224
15690a39889B21560E1989a47198G7213A4278P5645d6988E1458b35442e9506A28392
$$ -139889 221560 51989 -147198 77213 14278 89923 -46988 51458 -235442 -59506 128392
15678A51109A9344e7688A74828m7669K49957A32299a19258j17344B95993e2449
$$ 151109 19344 -57688 174828 127159 377116 132299 -119258 -236602 295993 -52449
15667A44468l2764a28243j51312J32701I2710A1468b49180A0044f2429A82218
$$ 144468 111704 -128243 -279555 -146854 92710 11468 -249180 10044 -62429 182218
15656a59704e8082B13407b24096c4398o9924j17290H2420a36631c4836j64466
$$ -159704 -58082 213407 -224096 -34398 -104322 -221612 82420 -136631 -34836 -199302
15646a99302D6601J11217F0381A3188m805b6161A97693b88815G9983c39013a53117
$$ -199302 46601 157818 60381 13188 8383 -26161 197693 -288815 79983 -339013 -153117
15634c07341B01350R1019c37374A07316a83852A09129F083K5884h3278r1307A4496
$$ -307341 201350 292369 -337374 107316 -183852 109129 6083 31967 -83278 -174585 14496
15622A48825f2997C49929e8206H2910j5028b40841B35333h6193n8093L1324B70037
$$ 148825 -62997 349929 -58206 82910 67882 -240841 235333 -86193 -144286 -112962 270037
15610h9944j01742Q1040d9596m3602h78j48139A13497b12454P2480j0333M4871
$$ -89944 -191686 -110646 -49596 -93198 -878 -149017 113497 -212454 -139974 -150307 -105436
15599a05436A17003c00696R2893a00849j76550b4510j44571A38694a52353c5615
$$ -105436 117003 -300696 -207803 -100849 -277399 -24510 -169081 138694 -152353 -35615
15588d4367F5448R6679K4253F4733a6502B73110A6967N3367g3169A8731c7113
$$ -44367 65448 162127 186380 64733 -16502 273110 16967 70334 -73169 18731 -37113
15576b0149l7196b4228j70323M8663A52234L4131B9499a45391A11784b31858D7732
$$ -20149 -57345 -24228 -194551 -145888 152234 186365 29499 -145391 111784 -231858 47732
15564a80575A04892a93878K5896A24041a92017e4224o8234j22409B31051B4279
$$ -180575 104892 -193878 -167982 124041 -192017 -54224 -122458 -244867 231051 24279
15553a69733A4242G26L56192a17763C50103e4063C54333r941a30788j12264B4640
$$ -169733 14242 726 356918 -117763 350103 -54063 354333 344392 -130788 -243052 24640
15541e3332I1844J73743a04096A88209p635a16167K2124b2118C6011P2481a39987
$$ -53332 91844 265587 -104096 188209 180574 -116167 -94043 -22118 36011 108492 -139987
15529a65346A82630j8226a5863A43546H546a8108A1378a05848D4720K39044a5910
$$ -165346 182630 164404 -15863 143546 8546 -18108 11378 -105848 44720 283764 -15910
15517B04789j00367a72199B23532e5306K1428a0914j90298G7157K28051f47A0560
$$ 204789 104422 -172199 223532 -55306 -33878 -10914 -201212 77157 305208 -647 10560
15505C36488K76077F2648O4128j5647J18315J33423K0521A3932M4903b281B44131
$$ 336488 612565 62648 126776 111129 229444 362867 383388 13932 58835 -2281 244131
15493c3862A1692l615J76781a3887d735B01255a71647B83746a17831C8004a9246
$$ -33862 11692 8077 184858 -13887 -4735 201255 -171647 283746 -117831 38004 -19246
15481E9777c6388l2419b1884B67957l9532R5574K74787j14938k37660G4294K60262
$$ 59777 -36388 -68807 -21884 267957 228425 323999 598786 483848 246188 74294 334556
15470C34556O2302b4113r8414K6123E15042B07808a60349a9303A57922j9881F7863
$$ 334556 396858 -24113 -122527 -96404 515042 207808 -160349 -19303 157922 138041 67863
15458D7248b58189D9363J76271l226P4775B3384c9252A36940D6335J04041J25393
$$ 47248 -258189 49363 225634 222408 297183 23384 -39252 136940 46335 150376 275769
15447B75769n7571J24588o0726O17938J88635L26004k71465D13679j76188D7570
$$ 275769 218198 342786 282060 899998 1088633 1414637 1143172 413679 237491 47570
15436C20091A39766B0570h3096A1746a72038N4522E62350B0569J63502M3534F9857
$$ 320091 139766 20570 -83096 11746 -172038 -117516 562350 20569 184071 227605 69857
15424C6692b6997A00659A3557J92501I2980c21939f3866l45243A57628o8934M2357
$$ 36692 -26997 100659 13557 206058 92980 -321939 -63866 -409109 157628 88694 131051
15413A31051J04875c12348D16586A09820D5109R7350n7898J1751h7719C0879c07289
$$ 131051 235926 -312348 416586 109820 45109 142459 84561 96312 -87719 30879 -307289
15401c646G101L6112d01500g1832q0374c2703A74128B3603J3825a20307C84099
$$ -3646 7101 43213 -401500 -71832 -152206 -32703 174128 23603 37428 -120307 384099
15389A58104K16134H382L71101H5795a77834c1319A3617J06853f783j86026H6486
$$ 158104 374238 8382 379483 85795 -177834 -31319 13617 120470 -6783 -192809 86486
15377a69514J7087B36707G5307i7827D26419P7553A57320b46903A13680L94692
$$ -169514 -152427 236707 75307 -97827 426419 503972 157320 -246903 113680 508372
15367E08372j47213b3248m6781l6881C34540D6479b09614C67671F961K68248a25261
$$ 508372 361159 -23248 -70029 -106910 334540 46479 -209614 367671 6961 275209 -125261
15355C13997A52521A2946J05875g0330A90404j667E5702A1302Q1805K50056j23764
$$ 313997 152521 12946 118821 -70330 190404 188737 55702 11302 93107 343163 219399
15344B19399f6050C54091o5514K65581j52391j23238j24384A2698b9229A12314
$$ 219399 -66050 354091 288577 554158 401767 278529 154145 12698 -29229 112314
15333A8774J14016f6640A75453J14191I1268L4684j3779K46351E3409g9144C9684
$$ 18774 132790 -66640 175453 289644 91268 125952 112173 358524 53409 -79144 39684
15321e3787j0614I1950m3666a74461B53438E2474j9644O6875R333b4209A35047
$$ -53787 -64401 91950 48284 -174461 253438 52474 32830 99705 109038 -24209 135047
15309A50714K97245k14141b991A02991D9431h3189A5546M4064J09230P7374C9062
$$ 150714 447959 233818 -2991 102991 49431 -83189 15546 59610 168840 246214 39062
15297A78688c6919A27911l8099b53450G4206R8473b06891B93130K199G8933a46539
$$ 178688 -36919 127911 89812 -253450 74206 172679 -206891 293130 295329 78933 -146539
15285A53967g9467B54995D1829b21216n4463D23563a09306p9793A08633B9839
$$ 153967 -79467 254995 41829 -221216 -275679 423563 -109306 -189099 108633 29839
15274c92846b9796A25872b06088h237k25703g5529B00728c6440r7268A7231J54857
$$ -392846 -29796 125872 -206088 -8237 -233940 -75529 200728 -36440 -133708 17231 172088
15263A72088G8481c6324A83774a51287C22635a83602l0091C53156b00043q1722
$$ 172088 78481 -36324 183774 -151287 322635 -183602 -213693 353156 -200043 -281765
15253b81765J25731F9831J22333A2002b48805d4903j74689B20263c41171A63644
$$ -281765 -156034 69831 192164 12002 -248805 -44903 -219592 220263 -341171 163644
15242A54947Q8028L57194N30583K85731l53591P09094H20293B40519q3643J20678
$$ 154947 242975 600169 1130752 1416483 1062892 1771986 820293 240519 156876 277554
15232B77554l1738a05408h287E0495K60734i9825B23689j11662b06647C9768o123
$$ 277554 245816 -105408 -8287 50495 311229 -99825 223689 112027 -206647 39768 33645
15221C3645K7303K1157B149b3841C27846H2178h6891k73134a48128m63A06266
$$ 33645 60948 82105 2149 -23841 327846 82178 -86891 -360025 -148128 -148591 106266
15209E9131J6213a8555j14631A32375q691e7988j29881D1205Q4683J21466J36747
$$ 59131 75344 -18555 -133186 132375 123684 -57988 -187869 41205 125888 247354 384101
15198C84101D0570K63337A25662m5192K12857p7380o0508a92741Q3036C701a44877
$$ 384101 40570 303907 125662 80470 293327 215947 155439 -192741 -109705 3701 -144877
15186F1891a44819C29130a14913H343K47918a23509M7425K6862E9516J08887d8094
$$ 61891 -144819 329130 -114913 8343 256261 -123509 -76084 -49222 59516 168403 -48094
15174a28466A15171J28058r5121a05675A57415a90553a9800k36436B5733R0416
$$ -128466 115171 243229 148108 -105675 157415 -190553 -19800 -256236 25733 116149
15164A16149b98B09524o6360a01346F3527d66o4367b2323j78802D01185G0061
$$ 116149 -298 209524 143164 -101346 63527 -466 -64833 -22323 -201125 401185 70061
15152I2934b8126F627R4871a95844A23780b47176i8873A41473j5756M675g7698
$$ 92934 -28126 6627 101498 -195844 123780 -247176 -98873 141473 125717 130392 -77698
15140A69174n7489C0906c47584A43317k9191J27944c6949A01182J97572F9865
$$ 169174 111685 30906 -347584 143317 114126 242070 -36949 101182 298754 69865
15129A94349a45736A61778J35619f3762I9834n442r699l4649K54715I5023L77276
$$ 194349 -145736 161778 297397 -63762 99834 94392 84693 50044 304759 95023 472299
15118D72299A51131K47816j65946I7958a45747G6665a34491q5691A46856J40963
$$ 472299 151131 398947 233001 97958 -145747 76665 -134491 -220182 146856 287819
15108B87819D6177P5809c8417C45847b28078b0321C02591J49151B04454b6421
$$ 287819 46177 121986 -38417 345847 -228078 -20321 302591 451742 204454 -26421
15097c9833J4084j04056j35650A51114Q1689b4644H2299Q9628L2560O7856b49171
$$ -39833 -25749 -129805 -265455 151114 232803 -24644 82299 171927 204487 272343 -249171
15085H8221L0034b00174A10175l8923A4573J95364J85186A04550Q8981r3673J20547
$$ 88221 118255 -200174 110175 71252 14573 209937 395123 104550 193531 99858 220405
15074B20405l4843J4120K05177c2598n2383C0291h552E3089b68916B69328p1916
$$ 220405 185562 199682 404859 -32598 -84981 30291 -8552 53089 -268916 269328 197412
15063A97412K63053j07847n1361p1572q6117J23260b29378C18167f4958B98995
$$ 197412 460465 352618 301257 229685 143568 266828 -229378 318167 -64958 298995
15052C05212j11630K05760A91416K17265B0153K09406q3706M55052j51845A85631
$$ 305212 193582 399342 191416 408681 20153 229559 145853 600905 449060 185631
15041E02333q3723A14120m2912a77298E9861L83086j94750L93853j44069K8875
$$ 502333 418610 114120 71208 -177298 59861 442947 248197 642050 497981 526856
15031E26856o6752j22686L35071L5493B91357L63990q0168B45982L14068j99252
$$ 526856 460104 337418 672489 707982 291357 655347 575179 245982 560050 360798
15021C60798M5246m8951J79341j82191A58401L26469L0636k30223c8454B54271
$$ 360798 406044 357093 536434 354243 158401 484870 515506 285283 -38454 254271
15010D33921j27901Q4881E0623M34383F1529L92986N7228A11041K63152j1716
$$ 433921 306020 390901 50623 485006 61529 454515 511743 111041 374193 362477
15000C62477J37162o9436M2547L23197A80454L02028j82772K18492B41647J30475
$$ 362477 499639 430203 472750 795947 180454 482482 299710 518202 241647 372122
14990C72122J57799k33719L3202K52906l3108j05053K41928k5154K09377N9745
$$ 372122 529921 296202 329404 582310 549202 444149 686077 660923 870300 930045
14980I30045l58742J04447k70160k7612G4772P2905p1898O51647J8192j82775
$$ 930045 571303 675750 405590 377978 74772 147677 75779 727426 745618 562843
14970E62843M1716J9836r7072j81770J9292K8624j58465J03967r0028d0330C6605
$$ 562843 604559 624395 527323 345553 364845 393469 235004 338971 248943 -40330 36605
14958B32723L09287B60774J6100J10257j30144J45785K0313A50609K97219M4326
$$ 232723 542010 260774 276874 387131 256987 402772 423085 150609 447828 492154
14948D92154j48751J31428J27193j70788j69935J6665M1739J52319I0026O05780
$$ 492154 343403 474831 602024 431236 261301 277966 319705 472024 90026 695806
14938F95806B37357r3384K36113K98855C07783N45703L1273P1540J70979p1313
$$ 695806 237357 143973 380086 678941 307783 853486 884759 956299 1127278 1055965
14928A055965L25198K35467j37441M8518j68117r5067K77881j02802O15647L51967
$$ 1055965 1381163 1616630 1479189 1527707 1359590 1264523 1542404 1439602 2055249 2407216
14918B407216j70315k31277o42920M7266n03019J1593k69618j05793l9412j49400
$$ 2407216 2236901 2005624 1362704 1409970 906951 918544 648926 543133 503721 354321
14908C54321J92149A27366O80061A32467R4774M14806l0966k89591L76445k90141
$$ 354321 546470 127366 807427 132467 227241 642047 611081 321490 697935 407794
14898D07794j40315o5634J31755K11866k12051K01530B41063J99517O5982J50007
$$ 407794 267479 201845 333600 545466 333415 534945 241063 440580 506562 656569
14888F56569K58764C94030N15373J24751p1968j13096B65817P04369k40685l0336
$$ 656569 915333 394030 909403 1034154 962186 849090 265817 970186 729501 699165
14878F99165j09860k59728J51976k4429N8087J96687j34350k27091J15318O7774
$$ 699165 589305 329577 481553 457124 515211 711898 577548 350457 465775 533549
14868E33549Q2356K59658j33256J08412k05211R1101l25042O6461M5930j72415
$$ 533549 615905 875563 742307 850719 645508 736609 411567 478028 523958 351543
14858C51543r8687k7379N3079J44847N8853N6560A4389N18824B49848K12783N33782
$$ 351543 252856 225477 278556 423403 482256 538816 14389 533213 249848 462631 996413
14847I96413D72708N03410L9499L11717n46898j79712J96685J96037k98894q1971
$$ 996413 472708 976118 1015617 1327334 780436 600724 797409 993446 694552 612581
14837F12581l3898K26439J75466D59607Q2422Q5632k08880m3463J90724J32157
$$ 612581 578683 805122 980588 459607 542029 627661 418781 375318 566042 698199
14827F98199o9479j48688L06868C91660P3878P7632j14850J40599L73853k24681
$$ 698199 628720 480032 786900 391660 465538 543170 428320 568919 942772 718091
14817G18091j18167J54894J03914N2126D45546K34228N4068j59041L77801j44585
$$ 718091 599924 754818 858732 910858 445546 679774 733842 574801 952602 808017
14807H08017N62155n63455p4761C62686L70594M7232C61141J95023q000k74000
$$ 808017 1370172 806717 731956 362686 733280 780512 361141 556164 548164 274164
14797B74164K59794k58313k0257J68286K03315k27812K06008J31549j67534J7274
$$ 274164 533958 275645 255388 423674 626989 399177 605185 736734 569200 586474
14787E86474j44993J18616m542J82954l26984J45659O6124P5054K0349K0047J42468
$$ 586474 441481 560097 555555 738509 411525 557184 623308 698362 718711 738758 881226
14776H81226J10031m19507o2050P3025N4664J27327C55371M38974k76684J6871
$$ 881226 991257 571750 509700 582725 637389 764716 355371 794345 517661 534532
14766E34532J10917J63650k55114B25084N8753J94023j47705J47859K28827n3343
$$ 534532 645449 809099 553985 225084 283837 477860 330155 478014 706841 653498
14756F53498k3705J40274p5813j24140j07027L7677J71407C19682L54304j48294
$$ 653498 629793 770067 694254 570114 463087 500764 672171 319682 673986 525692
14746E25692m4929l0480K64461k80547R5109A64257N24010J71313k12342q2017
$$ 525692 480763 450283 714744 434197 529306 164257 688267 859580 647238 565221
14736E65221P31166n88635N8666J98185J49684j83560P6216M83044K78018k30271
$$ 565221 1296387 707752 766418 964603 1114287 930727 1006943 1489987 1768005 1537734
14726A537734Q9664j81184j09821l71325j72356P8813R4446k40143L4811J40136
$$ 1537734 1627398 1446214 1336393 965068 792712 871525 965971 725828 760639 900775
14716I00775J89185l33493R3867M4263J66369j18146n8148l26532K93309K36338
$$ 900775 1089960 756467 850334 894597 1060966 942820 884672 558140 851449 1087787
14706A087787j52607M99500j25712N68166l08192K03278o89550n5079k28695L27849
$$ 1087787 935180 1434680 1308968 1877134 1568942 1772220 1082670 1027591 798896 1126745
14696A126745r0775l37813o7991L02591J16718m40276L06144k20863J99400J195
$$ 1126745 1035970 698157 630166 932757 1049475 609199 915343 694480 893880 895075
14686H95075j74509M8137j30229L08043q3974j52927Q9674L1875p7659K43851
$$ 895075 720566 768703 638474 946517 862543 709616 799290 831165 753506 997357
14676I97357P7504L9296l09059n1505K32070l26583J74153n2485J95351k67519
$$ 997357 1074861 1114157 805098 753593 985663 659080 833233 780748 976099 708580
14666G08580N24563k66633r1261q5326j00184J26138K9846q6293j55664Q3498
$$ 708580 1233143 966510 875249 789923 689739 815877 845723 759430 603766 687264
14656F87264L66103R8266M6360k80948P25021n19542J27258j98051J19901m20158
$$ 687264 1053367 1151633 1197993 917045 1642066 1122524 1249782 1051731 1171632 751474
14646G51474L20688o065n2369P3897j2221j16919j08805J07997r7671K51825K70670
$$ 751474 1072162 1066097 1013728 1087625 1075404 958485 849680 957677 860006 1111831 1382501
14635A382501m19656l520J76493j6880J67857n53178J94932J75788L3299l399
$$ 1382501 962845 959325 1135818 1118938 1286795 733617 928549 1104337 1137636 1134237
14625A134237J96430k03487J75329r1688l37718K30909K08346J5620k8673m10972
$$ 1134237 1330667 1127180 1302509 1210821 873103 1104012 1312358 1327978 1299305 888333
14615H88333L10903L0515Q9679k00597J90935j6353R3402l9670l07668K96007
$$ 888333 1199236 1229751 1319430 1118833 1309768 1293415 1386817 1347147 1039479 1335486
14605A335486l4027n3570M41147l43559J64741J97717k56350J4212J54674l83139
$$ 1335486 1301459 1247889 1689036 1345477 1510218 1707935 1451585 1465797 1620471 1237332
14595A237332J77056j61681o6769P6493q8902L01047L18219m05595K83600k73584
$$ 1237332 1414388 1252707 1185938 1262431 1173529 1474576 1792795 1387200 1670800 1397216
14585A397216O0158Q7938j8854M1452p4614j35121J92199K52035l37036M84503
$$ 1397216 1457374 1545312 1526458 1567910 1493296 1358175 1550374 1802409 1465373 1949876
14575A949876Q4332j44944p1050l7315n3496J30134M5249J49382j09101L22525
$$ 1949876 2034208 1889264 1818214 1780899 1727403 1857537 1902786 2052168 1943067 2265592
14565B265592l16767j1904L12469l14515m0738N67077m5309L40302j96448N0515
$$ 2265592 1948825 1936921 2249390 1934875 1894137 2461214 2415905 2756207 2559759 2610274
14555B610274L06544M47790J22779N76971M89909R32310K161533K724473O394287
$$ 2610274 2916818 3364608 3487387 4064358 4554267 5486577 7648110 10372583 16766870
14546A6766870J4496090R334083A6570709F916386l108018j237788l48394J02128
$$ 16766870 31262960 40597043 16570709 6916386 3808368 2570580 2222186 2324314
14538B324314j15161J79143R79182J542217j810934j042778k27728q2204J02981
$$ 2324314 2209153 2388296 3367478 4909695 3098761 2055983 1828255 1746051 1849032
14529A849032k77055L10735j69669K17968j64062N8598J83899L14155k38242J43096
$$ 1849032 1571977 1882712 1713043 1931011 1766949 1825547 2009446 2323601 2085359 2228455
14519B228455J08993L6878J36986j52142O3025k7336j97024K68650j43134J04353
$$ 2228455 2337448 2374326 2511312 2359170 2422195 2394859 2197835 2466485 2323351 2427704
14509B427704J41497n528k987o3334R3695J61991l36564O24517n48826M44259
$$ 2427704 2569201 2563673 2560686 2497352 2591047 2753038 2416474 3040991 2492165 2936424
14499B936424r1942J54657l61681J61089K58561j02676j53346K04111O5865J7671
$$ 2936424 2844482 2999139 2637458 2798547 3057108 2954432 2801086 3005197 3071062 3088733
14489C088733m7154Q1044j07444q2878N40873j69939J49817J69047k72116J38743
$$ 3088733 3041579 3122623 3015179 2932301 3473174 3303235 3453052 3622099 3349983 3488726
14479C488726j86683K60782k79572M22571j39076J66273K07183l61693j646R7034
$$ 3488726 3302043 3562825 3283253 3705824 3566748 3733021 3940204 3578511 3576865 3673899
14469C673899J6038j58736K69580j9475K2049L0155M91158k13252k94807K46367
$$ 3673899 3689937 3531201 3800781 3781306 3803355 3833510 4324668 4111416 3816609 4062976
14459D062976L92005r4335O5299k513Q3097j13480J91363m9173L12148l46489
$$ 4062976 4454981 4360646 4425945 4423432 4506529 4393049 4584412 4535239 4847387 4500898
14449D500898R4928L17748N378K62554l18944J2624K62393K76510k90565K32696
$$ 4500898 4595826 4913574 4918952 5181506 4862562 4875186 5137579 5414089 5123524 5356220
14439E356220n4225N02089k50784J61737n1311j25521M4895M25676N7070M6002
$$ 5356220 5301995 5804084 5553300 5715037 5663726 5538205 5583100 6008776 6065846 6111848
14429F111848J82377K96633k47941L18901J22454L18409O2676M18830l99946k10113
$$ 6111848 6294225 6590858 6342917 6661818 6784272 7102681 7165357 7584187 7184241 6974128
14419F974128J60350m5000L10217J22621J16211L64531j7179P0494N24163j38695
$$ 6974128 7134478 7089478 7399695 7522316 7638527 8003058 7985879 8056373 8580536 8441841
14409H441841k33862N67122p5914K39871j91683J79004K25297N2467l5207K31991
$$ 8441841 8207979 8775101 8699187 8939058 8747375 8926379 9151676 9204143 9168936 9400927
14399I400927J00574K10801R4253L02548L24361k27029M55369K60317J02462K16207
$$ 9400927 9501501 9712302 9806555 10109103 10433464 10206435 10661804 10922121 11024583 11240790
14389A1240790P0005J81135M79698L28521j1139K33266M36415l26728N94735k96265
$$ 11240790 11310795 11491930 11971628 12300149 12289010 12522276 12958691 12631963 13226698 12930433
14379A2930433L97567J46690O06317J51749K43132K20494M31803J83762N80279
$$ 12930433 13328000 13474690 14081007 14232756 14475888 14696382 15128185 15311947 15892226
14370A5892226M35579O5933N45270j63713M29395K69382N00339K21496N08336
$$ 15892226 16327805 16393738 16939008 16775295 17204690 17474072 17974411 18195907 18704243
14361A8704243M58177J24677M75858P51487M41731J63277L66971Q01899N70526
$$ 18704243 19162420 19287097 19762955 20514442 20956173 21119450 21486421 22288320 22858846
14352B2858846M56669O50179K42026R04926O33469N96213P68026M56992J000506
$$ 22858846 23315515 23965694 24207720 25112646 25746115 26342328 27110354 27567346 28567852
14343B8567852Q82964O15233Q42118Q79639O32235J150325P77632J020265J130806
$$ 28567852 29450816 30066049 30908167 31787806 32420041 33570366 34347998 35368263 36499069
14334C6499069J013987J144549R01065J640935J013923J306628J779934J242447
$$ 36499069 37513056 38657605 39558670 41199605 42213528 43520156 45300090 46542537
14326D6542537J395807J996710J440045J622421J855583J794197K344117J706378
$$ 46542537 47938344 49935054 51375099 52997520 54853103 56647300 58991417 60697795
14318F0697795K151365K392579K236824K579502K918228L057590K943870L149796
$$ 60697795 62849160 65241739 67478563 70058065 72976293 76033883 78977753 82127549
14310H2127549L191776L535987M074770L872553M169748M211126M602921N099482
$$ 82127549 85319325 88855312 92930082 96802635 100972383 105183509 109786430 114885912
14302A14885912N029083N854479N622586O450430O493974P044759P442211P739132
$$ 114885912 119914995 125769474 131392060 137842490 144336464 151381223 158823434 166562566
14294A66562566Q243828Q616779R364519R688027R908841J0582472J1397539J1611788
$$ 166562566 174806394 183423173 192787692 202475719 212384560 222967032 234364571 245976359
14286B45976359J2031391J2323383J2931299J3231580J2804874J3562101J3239187
$$ 245976359 258007750 270331133 283262432 296494012 309298886 322860987 336100174
14279C36100174J3135276J2376957J1769059J0606577R207353O467540M578754
$$ 336100174 349235450 361612407 373381466 383988043 393195396 399662936 404241690
14272D04241690L930781L507253K583029L400327o085501k737722n740725p243213
$$ 404241690 408172471 411679724 414262753 417663080 411577579 408839857 403099132 395855919
14264C95855919r069306j0591357j2040352j3582881j4019926j4712647j4131764
$$ 395855919 386786613 376195256 364154904 350572023 336552097 321839450 307707686
14257C07707686j4459761j3893977j3585649j3137041j2730719j1961608j1500020
$$ 307707686 293247925 279353948 265768299 252631258 239900539 227938931 216438911
14250B16438911j1027917j0420234r879459r347437p282150p758223p358210p759561
$$ 216438911 205410994 194990760 185111301 175763864 168481714 160723491 153365281 145605720
14242A45605720o855079o846375o132058n704761n176036m791307m975126m561231
$$ 145605720 138750641 131904266 125772208 120067447 114891411 110100104 105124978 100563747
14234A00563747m237161m213938l859339l075232l370930l156650l436688k402292
$$ 100563747 96326586 92112648 88253309 85178077 81807147 78650497 75213809 72811517
14226G2811517l121193k106302k800680k368321j980984k287807k097892j796117
$$ 72811517 69690324 67584022 64783342 62415021 60434037 58146230 56048338 54252221
14218E4252221j904400j670570j376945j992361j273365r95718j460626j318940
$$ 54252221 52347821 50677251 49300306 47307945 46034580 45038862 43578236 42259296
14210D2259296j416791j195005q82027j055296r87398j328806j034489j143110
$$ 42259296 40842505 39647500 38765473 37710177 36722779 35393973 34359484 33216374
14202C3216374n34596p21543n69604j468901n15733r64092n36487q32671n62163
$$ 33216374 32681778 31960235 31390631 29921730 29405997 28441905 27905418 27072747 26510584
14193B6510584m29953q05903o49889m85254n00457r85796j11075p47886o43699
$$ 26510584 26080631 25274728 24624839 24139585 23639128 22653332 22542257 21794371 21150672
14184B1150672k39693m36207j62572q09839k99754o37786j87987m39491n40879
$$ 21150672 20910979 20474772 20312200 19502361 19202607 18564821 18376834 17937343 17396464
14175A7396464k50863n02299K9947k21305m28097n24710k30924j79336j75717
$$ 17396464 17145601 16643302 16673249 16451944 16023847 15499137 15268213 15088877 14913160
14166A4913160m20581j96094l29863k56179k89344j31434j38662m35956j4597
$$ 14913160 14492579 14296485 13966622 13710443 13421099 13289665 13151003 12715047 12700450
14157A2700450k73098l87710k96750l11987J62138n78322K24649l28986j79838
$$ 12700450 12427352 12039642 11742892 11430905 11593043 11014721 11239370 10910384 10730546
14148A0730546J19728m45243j94281j61528l98985L80151k49329k74629n89008
$$ 10730546 10850274 10405031 10210750 10049222 9650237 10030388 9781059 9506430 8917422
14139H917422L83475j39617j06336m07791m68067K63196J69591j56450l14030
$$ 8917422 9300897 9161280 9054944 8647153 8179086 8442282 8611873 8455423 8141393
14130H141393M6558j46414j61684k27928j85411J10431J55464m65262J53624l60355
$$ 8141393 8187951 8041537 7879853 7651925 7466514 7576945 7732409 7267147 7420771 7060416
14120G060416J0887k67163k56879N19942l74110j75607K6388R3311l16055L56667
$$ 7060416 7071303 6804140 6547261 7067203 6693093 6517486 6543874 6637185 6321130 6677797
14110F677797m71068J15792j27766J52552j74348m07787k2759k86941P3037K3053
$$ 6677797 6206729 6322521 6194755 6347307 6172959 5765172 5742413 5455472 5528509 5551562
14100E551562M21092l74437j96587p8181J4902J63570l02581r0138m6690k74028
$$ 5551562 5972654 5598217 5401630 5323449 5338351 5501921 5199340 5109202 5062512 4788484
14090D788484P8877J26019l66616K48820q7057l92620k6335L72125n47052K32913
$$ 4788484 4867361 4993380 4626764 4875584 4788527 4395907 4369572 4741697 4194645 4427558
14080D427558J91024l70463J89178j89212k13296K14329l7368l0521J09443q9172
$$ 4427558 4618582 4248119 4437297 4248085 4034789 4249118 4211750 4181229 4290672 4201500
14070D201500j77233P4990J25276q8702m25966L66444j96372n1887L57346k01706
$$ 4201500 4024267 4099257 4224533 4135831 3709865 4076309 3879937 3828050 4185396 3983690
14060C983690j62576r2916k26777K80568j24205o7745m2166k55597M5031j9090
$$ 3983690 3821114 3728198 3501421 3781989 3657784 3590039 3547873 3292276 3337307 3318217
14050C318217j65754J62178k35832R7513k4182n246j13252j450J72766m17094
$$ 3318217 3152463 3314641 3078809 3176322 3152140 3146894 3033642 3032192 3204958 2787864
14040B787864Q1412L82485n44156O8282j102l8289j02076L02430J28738j25515
$$ 2787864 2869276 3251761 2707605 2775887 2774785 2736496 2634420 2936850 3065588 2940073
14030B940073K78245l10191j831O1737j97093k0555k89606K54603l80325j22827
$$ 2940073 3218318 2908127 2906296 2968033 2770940 2750385 2460779 2715382 2335057 2212230
14020B212230M32229l16348K74901l2344j4192l22922M7975l13020J60537K98012
$$ 2212230 2644459 2328111 2603012 2570668 2556476 2233554 2281529 1968509 2129046 2427058
14010B427058R1805r4385n50258O59208m12319j10702P6465j40919K66902k46450
$$ 2427058 2518863 2424478 1874220 2533428 2121109 2010407 2086872 1945953 2212855 1966405
14000A966405J51699l10165N29575j4427J28300m69900l2666M51428J31254J36402
$$ 1966405 2118104 1807939 2337514 2323087 2451387 1981487 1948821 2400249 2531503 2667905
13990B667905N92990J067181J925003M474534J1780865K1264752j9133741j1998086
$$ 2667905 3260895 4328076 6253079 10727613 22508478 43773230 24639489 12641403
13982A2641403m777557k279864j496248m70655p24662j18645L1370j07610k55051
$$ 12641403 7863846 5583982 4087734 3617079 2892417 2773772 2805142 2697532 2442481
13973B442481j60870k5632k01471J57052J63809L4957n15376K30453j04151L1739
$$ 2442481 2281611 2255979 2054508 2211560 2375369 2410326 1894950 2125403 2021252 2052991
13963B052991k26036k161K71862J44508k00841k71156L03192K30346o22050J23794
$$ 2052991 1826955 1824794 2096656 2241164 2040323 1769167 2072359 2302705 1680655 1804449
13953A804449J27037k48269L5892k20536Q3132M74824k26872j95319l17354Q05151
$$ 1804449 1931486 1683217 1719109 1498573 1581705 2056529 1829657 1634338 1316984 2122135
13943B122135k23448q3631k98421K35068K5928l48607R2009L07344k84535J06716
$$ 2122135 1898687 1815056 1516635 1751703 1777631 1429024 1521033 1828377 1543842 1650558
13933A650558j75778J6309j98561P9857J88227L3986r0088K23726m06950J61429
$$ 1650558 1474780 1491089 1292528 1372385 1560612 1594598 1504510 1728236 1321286 1482715
13923A482715O3350l17693L06023O5093m29084K48047r893j76619L66219n82429
$$ 1482715 1546065 1228372 1534395 1599488 1170404 1418451 1408558 1231939 1598158 1015729
13913A015729M04231j04096K75934m19932L28575O735l01598k08359K94300j18697
$$ 1015729 1419960 1315864 1591798 1171866 1500441 1507176 1205578 997219 1291519 1172822
13903A172822K18023l14833J21133M7021K721k6232j74192J34691R5247p2147
$$ 1172822 1390845 1076012 1197145 1244166 1246887 1220655 1046463 1181154 1276401 1204254
13893A204254j10915K50351k02659o6139L05241l96871L23568q0644m44188N81405
$$ 1204254 1093339 1343690 1141031 1074892 1380133 983262 1306830 1226186 781998 1363403
13883A363403j90028J74997j66853k58221P3040q2126j46015L45730J21947Q5937
$$ 1363403 1173375 1348372 1181519 923298 996338 914212 768197 1113927 1235874 1321811
13873A321811j76389j21026J08732k27223K48889j75679K36456j02413j69061
$$ 1321811 1145422 1024396 1133128 905905 1154794 979115 1215571 1113158 944097
13864I44097R5835L19824l92699K43870m32871M61887m70039L66363M9725m41069
$$ 944097 1039932 1359756 967057 1210927 778056 1239943 769904 1136267 1185992 744923
13854G44923K29503k7170L5470k25144K57791k66984J21272P7002J21360L35806
$$ 744923 974426 947256 982726 757582 1015373 748389 869661 946663 1068023 1403829
13844A403829k60203k26976o9608j87187M36494k89472O6610J29097J66995m54370
$$ 1403829 1143626 916650 847042 659855 1096349 806877 873487 1002584 1169579 715209
13834G15209k86565O87104n5913m59759M96891E35114K60903J26902p344r0893
$$ 715209 428644 1115748 1059835 600076 1096967 535114 796017 922919 915575 824682
13824H24682L9536j16465K24088j07635p4479L10092m34193L96878q0107k467
$$ 824682 864218 747753 971841 864206 789727 1099819 665626 1062504 982397 979930
13814I79930j55374k9273J8492J09458m2300j57336M7414j95859P9899J97004
$$ 979930 824556 795283 813775 923233 880933 723597 771011 575152 655051 852055
13804H52055k89431J59209q4146m540M81904m56109J23387k08976K81387k11908
$$ 852055 562624 721833 637687 633147 1115051 658942 782329 573353 854740 642832
13794F42832J54712n6229M43329m04330M03042E04871R0335l7932L46789m9027
$$ 642832 797544 741315 1184644 780314 1183356 504871 595206 557274 904063 855036
13784H55036k56876l4579L0992M5091k701K10373N1986j15211k29616J33830J78699
$$ 855036 598160 563581 594573 639664 636963 847336 899322 784111 554495 688325 867024
13773H67024C04770J98449L07194j00957K44912l88310L4724Q5811M95377m28611
$$ 867024 304770 503219 810413 709456 954368 566058 600782 686593 1181970 753359
13763G53359K3758k09313J42581j34293N3061k8537Q9878k62717j43957K81466
$$ 753359 777117 567804 710385 576092 629153 600616 690494 427777 283820 565286
13753E65286B29553K48547J387L2357K19756l57925K54621l06963K04188P2351
$$ 565286 229553 478100 479487 511844 731600 373675 628296 321333 525521 597872
13743E97872Q1359j28227K46218j95311L0529A68617K69615K44634j58421m5374
$$ 597872 679231 551004 797222 601911 632440 168617 438232 682866 524445 479071
13733D79071L59788r0804B09335N40840o6468l13323j42575L33197J75763A89237
$$ 479071 838859 748055 209335 750175 683707 370384 227809 561006 736769 189237
13722F53022k22028K47510J98613k10103j79823M34754D54283j63490L20497B53408
$$ 653022 430994 678504 877117 667014 487191 921945 454283 290793 611290 253408
13711F02946R9925k15364J43688O091j82292K8059L59850k82930L0162J11040
$$ 602946 702871 487507 631195 637286 454994 483053 842903 559973 590135 701175
13701G01175B8051P53220k72337q6099M9810j94707G0636J22277L72920o0417
$$ 701175 28051 781271 508934 422835 472645 277938 70636 192913 565833 505416
13691E05416j26234K67940C16510K24074J1213R7769k58520K43059J0804C14599
$$ 505416 379182 647122 316510 540584 551797 649566 391046 634105 644909 314599
13680E11078L4620p7385M9190m7755n1834K15572j46914L927A64721K89767K79430
$$ 511078 545698 468313 517503 469748 417914 633486 486572 490499 164721 454488 733918
13669G33918l02055k4345l1617Q608p590L87670k38686j11394M6601J16751k72282
$$ 733918 431863 407518 375901 384509 376919 764589 525903 414509 461110 577861 305579
13658C05579J23039C1361M52235Q3591j07869K1948j11170K53227J1557r3608
$$ 305579 428618 31361 483596 567187 459318 481266 370096 623323 634880 541272
13648E41272A37262M84945m7648j16158j06496J37587K28753j15363k63899J52515
$$ 541272 137262 622207 574559 458401 351905 489492 718245 602882 338983 491498
13638D91498k37508o4209L69692k23777P8937K23255k74310J54340j95399L76230
$$ 491498 253990 189781 559473 335696 414633 637888 363578 517918 322519 698749
13628F98749k58409B06213O8169J33280J48163r9991J248L1249L0209R9138j58823
$$ 698749 440340 206213 274382 407662 555825 455834 457082 488331 518540 617678 458855
13617D58855Q3677j33781N2653B13478P9195p4585N8458N231j16951L10418P345
$$ 458855 542532 408751 461404 213478 292673 218088 276546 281777 164826 475244 482589
13606D82589j65346G8250J74541N4466j6359J12545j66803L24869B70856J01035
$$ 482589 317243 78250 252791 307257 290898 403443 236640 561509 270856 371891
13596C71891J48771A88339J30820j2072K8503n2473J44952j94399L8151A29058
$$ 371891 520662 188339 319159 307087 335590 283117 428069 233670 271821 129058
13585B05597L06095k53516A19385K95156A27404J20008j06485L10582J34169k64798
$$ 205597 511692 258176 119385 414541 127404 247412 140927 451509 585678 320880
13575C20880f7910G0530L58726j05330O37P9973j8639K4776L0079b7497A62330
$$ 320880 -67910 70530 429256 323926 324563 404536 385897 410673 440752 -27497 162330
13563B25897K8583J53055k6435G8453N8342a76651C78410J92082j04176k00866
$$ 225897 254480 407535 381100 78453 136795 -176651 378410 570492 466316 265450
13553B65450J33490j49736A5007L55365q4682j06747O35942C35275A44382L48013
$$ 265450 398940 249204 15007 370372 285690 178943 814885 335275 144382 492395
13543D92395k25092A23097J98844I4697J35716l3840P1895J82128j41281m3686
$$ 492395 267303 123097 321941 94697 230413 196573 268468 450596 309315 265629
13533B65629j0849H5925K01823a52867B59798M9855j10224Q4826p7162j0769n3277
$$ 265629 254780 85925 287748 -152867 259798 309653 199429 284255 207093 196324 143047
13522A43047J25344g9481E04498A4354h7521D84355b68251A93934J93045j42971
$$ 143047 268391 -79481 504498 14354 -87521 484355 -268251 193934 386979 244008
13512B44008M0304J10552Q322a00247G115J15867M13908A00669N83163C04280
$$ 244008 284312 394864 403186 -100247 7115 122982 536890 100669 683832 304280
13501C93131L8706j30876E8129L4899K37189j27970q6985N6439L64293j75498
$$ 393131 431837 300961 58129 93028 330217 202247 115262 171701 535994 360496
13491C60496J1791A62286M8577J01316p9448r7107L92788F0653L82360A20757
$$ 360496 372287 162286 210863 312179 232731 135624 528412 60653 443013 120757
13480B19119J1825n8640M60616B0092M33423o1794q8407b3315A25998K32345J7214
$$ 219119 230944 172304 632920 20092 453515 391721 303314 -23315 125998 358343 375557
13469C75557A87254J00593A40941K15275A70542L43577i3839B40973f6057B10215
$$ 375557 187254 287847 140941 356216 170542 514119 -93839 240973 -66057 210215
13458D22958A5167N037M54863E9821J92994n3832J21350D9272L54847F0201j9993
$$ 422958 15167 20204 475067 59821 252815 198983 320333 49272 404119 60201 40208
13447D0208I902N17273b2490r232C55280A57917e2850A13417q197b37927B71588
$$ 40208 9902 527175 -22490 -31722 355280 157917 -52850 113417 105220 -237927 271588
13435B87085A07787C9411N39414A47899J11751l1492J1219J12453j4265o3390
$$ 287085 107787 39411 578825 147899 259650 228158 239377 351830 337565 274175
13425B74175K36933j02019j41685J21366A92417N3833J2623j14641d174B68419
$$ 274175 511108 409089 267404 388770 192417 246250 258873 144232 -4174 268419
13414C66988A77784M9030J96474B0546P8635M0281J84901h8489A02234P406K96997
$$ 366988 177784 226814 423288 20546 99181 139462 324363 -88489 102234 109640 406637
13403D06637F0827K29847R9323j39309J40983a1236A35681O5004r9532i3533A54329
$$ 406637 60827 290674 389997 250688 391671 -11236 135681 200685 101153 -93533 154329
13391H7627g1418K8113A66311k7262c8537D43J31790J95048A35909N5358q9121
$$ 87627 -71418 -43305 166311 139049 -38537 443 132233 327281 135909 191267 102146
13380A02146J52735A13885a19749C45897E4318f7755C6399R0413L80505J48221
$$ 102146 254881 113885 -119749 345897 54318 -67755 36399 126812 507317 655538
13370F55538A69855L46384j16411r4917A05125J05193K9383J05759j37389K9803
$$ 655538 169855 516239 399828 304911 105125 210318 239701 345460 208071 237874
13360B37874Q5128n9833n9987F2163Q0185K83230A81020e4532F6911R7145e2753
$$ 237874 323002 263169 203182 62163 142348 425578 181020 -54532 66911 164056 -52753
13348H2151J12689N9040O8949j02760J08812a60958E5304R346M7113J38841K91800
$$ 82151 194840 253880 322829 220069 328881 -160958 55304 64650 111763 250604 542404
13337E42404A44808J5624N0552L32756B44226a66623A74329J36460r4803k3019
$$ 542404 144808 160432 210984 543740 244226 -166623 174329 310789 215986 192967
13327A92967G6320M87661C8991J80424a53032B59242J20228H6474j4404J52546
$$ 192967 76320 563981 38991 219415 -153032 259242 379470 86474 72070 224616
13317B24616K04620a19987b3224D55801A25967K14113j67441R6258H3450p561
$$ 224616 429236 -119987 -23224 455801 125967 340080 172639 268897 83450 75889
13307G5889J83168R5720A46548a0039B73304L7662j22682A4301K57417p05d1322
$$ 75889 259057 354777 146548 -10039 273304 310966 188284 14301 271718 271013 -41322
13295C46244r4224i2856l731n0353D676J62688J1793c7120E1679a1786q0189r4131
$$ 346244 252020 -92856 -96587 -146940 4676 167364 179157 -37120 51679 -11786 -91975 -186106
13283a86106B47146K8725a09610D05457B902J43871A0432e476C48353A02374A9313
$$ -186106 247146 275871 -109610 405457 2902 146773 10432 -5476 348353 102374 19313
13271B4617R7268J08143R4500n558c9582A1613K85571j11528J05949A16109a35237
$$ 24617 121885 230028 324528 318970 -39582 11613 297184 185656 291605 116109 -135237
13259C04512m1359E6525k5784J35577J63812h958C88919j64000f3895r1958A93058
$$ 304512 263153 56525 30741 166318 330130 -8958 388919 224919 -63895 -155853 193058
13247d9451B17151r7772J19894F6070B1029J4748J5837K3946L11049F7421b12910
$$ -49451 217151 119379 239273 66070 21029 35777 51614 75560 386609 67421 -212910
13235a31998G8969L7908J55832l5929n8779c26712A75577J41315A30308B3237
$$ -131998 78969 116877 272709 236780 178001 -326712 175577 316892 130308 23237
13224B34461b24286N4223B15261a11156d8620B86425r7522e826k05920C10070
$$ 234461 -224286 -170063 215261 -111156 -48620 286425 188903 -5826 -211746 310070
13213F1935J93448o4614J28434n6838f5832G612K76800j27256k3194h4005j16391
$$ 61935 255383 190769 319203 262365 -65832 7612 284412 157156 133962 -84005 -200396
13202b00396B93937f3942A52768J79310C4575J43387q8827J78724b23557e3500
$$ -200396 293937 -63942 152768 332078 34575 177962 89135 267859 -223557 -53500
13191D58504a8791C76007b52072D8450J46261b39077F2182N9922a48736e4405
$$ 458504 -18791 376007 -252072 48450 194711 -239077 62182 122104 -148736 -54405
13180A88476j3044A4535J14758J45030M877a04188B14555a51623C26535a09146
$$ 188476 175432 14535 129293 274323 279200 -104188 214555 -151623 326535 -109146
13169H2942L46121b0434B75334a89367A4199K66354I3112g3136E13590b84678
$$ 82942 429063 -20434 275334 -189367 14199 280553 93112 -73136 513590 -284678
13158A82262B5710d6942A74548m8861K4862O9048G1674J14734O4719a88080G9986
$$ 182262 25710 -46942 174548 125687 150549 219597 71674 186408 251127 -188080 79986
13146A84880o0649a64216D8776h4731A01674J79787j12946i2096H8554k4281a22444
$$ 184880 124231 -164216 48776 -84731 101674 281461 168515 -92096 88554 64273 -122444
13134b04973B40170O1650d6455l2670k06875A05449I337K26918m9989J6411D226
$$ -204973 240170 301820 -46455 -79125 -286000 105449 9337 236255 186266 202677 4226
13122e9347g776C69000j77102H3703a34261D7594Q896E130a81145A40915L81139
$$ -59347 -7776 369000 191898 83703 -134261 47594 56490 5130 -181145 140915 522054
13111E22054A50905R6566e2419l453A35725Q0222n8601o2978a55659B1981J40546
$$ 522054 150905 247471 -52419 -55872 135725 215947 157346 94368 -155659 21981 162527
13100A62527c8812B94989j22220D1267K3896Q0393a51436A47292b10661B11559
$$ 162527 -38812 294989 172769 41267 65163 145556 -151436 147292 -210661 211559
13089C21482b9629A57456b96764C84022C5186J76455H2626L30051a66164B37499
$$ 321482 -29629 157456 -296764 384022 35186 211641 82626 412677 -166164 237499
13078c47800a57011B14652j2463O0377j04299b01471j9021B15831r4183b02893
$$ -347800 -157011 214652 202189 262566 158267 -201471 -220492 215831 121648 -202893
13067d7306l48561A21588J20702j05859e8273A45501K36567A31167a77109f8594
$$ -47306 -395867 121588 242290 136431 -58273 145501 382068 131167 -177109 -68594
13056A80674G649J47002J75495D5314J2885M4775b14229H2034j2667a5719k27687
$$ 180674 7649 154651 330146 45314 58199 102974 -214229 82034 69367 -15719 -243406
13045b43406c6615j03595C61007A09323K5098C2825M1453K40628c0248k33154
$$ -243406 -36615 -140210 361007 109323 134421 32825 74278 314906 -30248 -263402
13035b63402h8215E1354J32726O0920A8227R5939J92203A8739d2089H6975J03191
$$ -263402 -88215 51354 184080 245000 18227 114166 306369 18739 -42089 86975 190166
13024A90166p1546K5570d1687C17983i9722D98046a09704B46879K1525A32162
$$ 190166 118620 144190 -41687 317983 -99722 498046 -109704 246879 268404 132162
13013D8757R8006d5338A76752a44811d925B69885H0185K1640M1337c9316k22689
$$ 48757 146763 -45338 176752 -144811 -4925 269885 80185 101825 143162 -39316 -262005
13002b62005f8526C05899J64387C8548J19386a99712A59090i5065K2325B24357
$$ -262005 -68526 305899 470286 38548 157934 -199712 159090 -95065 -72740 224357
12991A20243O0023a11522j21228m759A76599b1666j49994B23621f2462q9886P3360
$$ 120243 180266 -111522 -232750 -237509 176599 -21666 -171660 223621 -62462 -152348 -78988
12980g8988A55401J1325R2428J01163A55064b94755D940J22417c774F2384a38639
$$ -78988 155401 166726 259154 360317 155064 -294755 4940 127357 -3774 62384 -138639
12968A21556O1776F8337L8234J97874j25051l3868b23131A65956b16658N8835
$$ 121556 183332 68337 106571 304445 179394 145526 -223131 165956 -216658 -157823
12958a57823A76759a7916o2235A1342d29066a23437C17154H2894c3106B6027N2185
$$ -157823 176759 -17916 -80151 11342 -429066 -123437 317154 82894 -33106 26027 78212
12947G8212J9770b04480E95677A05956K07848b8612A19354A0021L72980C9382
$$ 78212 97982 -204480 595677 105956 313804 -28612 119354 10021 383001 39382
12936A20536B7101e1769A13344A5346a31379A4039K03075H9791h106A34307a48462
$$ 120536 27101 -51769 113344 15346 -131379 14039 217114 89791 -8106 134307 -148462
12924b1807G3622K96789m6907f2718J0395a1169k66617a5197B56562A5895J10638
$$ -21807 73622 370411 323504 -62718 -52323 -11169 -277786 -15197 256562 15895 126533
12913A26533J75485a86447g9101B10013c4015A68864m2510J71064A02600B8449
$$ 126533 302018 -186447 -79101 210013 -34015 168864 126354 297418 102600 28449
12902A23169a79971c6589r1318e3362m4571j92093J02081D6321K17271f846D2946
$$ 123169 -179971 -36589 -127907 -53362 -97933 -290026 -187945 46321 263592 -6846 42946
12890H6289J95276a0850k77503J41551A69598J4869R7587a4722r5564E2898c19347
$$ 86289 281565 -10850 -288353 -146802 169598 184467 282054 -14722 -110286 52898 -319347
12878A2202K16190a23898C30902a39550A25345a11389b470j12720l4485A00378
$$ 12202 228392 -123898 330902 -139550 125345 -111389 -2470 -115190 -149675 100378
12867h0482k91753J38262L8874Q1248K3908D376L09947A46065k1076b0215I6205
$$ -80482 -372235 -233973 -195099 -113851 -89943 4376 314323 146065 124989 -20215 96205
12855A20473a33370A03974l0951O0949d0065B69375b1425A29083L68476A52869
$$ 120473 -133370 103974 73023 133972 -40065 269375 -21425 129083 497559 152869
12844b16557A25320a26685E674a21930A82724F7410c17706i7988f792j70273A57533
$$ -216557 125320 -126685 5674 -121930 182724 67410 -317706 -97988 -6792 -177065 157533
12832B13544b7553A77887f0703N675j81885C77480A76039a03803j4071k08712
$$ 213544 -27553 177887 -60703 -55028 -236913 377480 176039 -103803 -117874 -326586
12822c26586B5763K69921a13434B63895c9757j53087A85621j8860b06333P0225
$$ -326586 25763 295684 -113434 263895 -39757 -192844 185621 166761 -206333 -136108
12812a36108p3621R6081A65025d1562B04442h1473j52450b7219A56423C7527a23629
$$ -136108 -209729 -113648 165025 -41562 204442 -81473 -233923 -27219 156423 37527 -123629
12800I2953J07815N0929B463f6967j95714a03226H3699J12755B4079q322J48006
$$ 92953 200768 251697 2463 -66967 -262681 -103226 83699 196454 24079 15757 163763
12789A63763A925g8462k6200G8409b42032C19630A476J13022a81906a5511k03616
$$ 163763 1925 -78462 -104662 78409 -242032 319630 1476 114498 -181906 -15511 -219127
12778b19127B04569a49600f9729A32865e3480j43648B9547d31834E3027a69383
$$ -219127 204569 -149600 -69729 132865 -53480 -197128 29547 -431834 53027 -169383
12767c427j0187l42054A27965a08861D2357K99081a0243A174L15599a2255C31900
$$ -3427 -13614 -355668 127965 -108861 42357 341438 -10243 1174 316773 -12255 331900
12755a23416H0632j0335e0118q2625O523e5645A03685K76336b5613p3125j15498
$$ -123416 80632 70297 -50118 -132743 -126220 -55645 103685 380021 -25613 -98738 -214236
12744b14236N0176P5759A70517j4320A0213J14439m6108a10954L0181L0776p1649
$$ -214236 -164060 -88301 170517 156197 10213 124652 78544 -110954 -80773 -49997 -121646
12733a21646E8392J71557r5176a58901p3736B05102n6443G0987J07720b04376
$$ -121646 58392 229949 134773 -158901 -232637 205102 148659 70987 178707 -204376
12722f1795b4257A21100c3095A63829P5680L6787j32521h6847p9306B45346b2280
$$ -61795 -24257 121100 -33095 163829 239509 276296 143775 -86847 -166153 245346 -22280
12710A64551a87989A65213n4043J68296a83966B5990J81086i5798m1341A11138
$$ 164551 -187989 165213 111170 279466 -183966 25990 207076 -95798 -137139 111138
12699A36465a77970H213K1555J64262d82504C69808j08738j16847m69P77n6622
$$ 136465 -177970 8213 29768 194030 -482504 369808 261070 144223 143754 144531 87909
12688H7909K6169b02398B54857A3880L9975K08162e0924a3366D8635k3216a85568
$$ 87909 114078 -202398 254857 13880 53855 262017 -50924 -13366 48635 25419 -185568
12676f980j79528C69673A17293a88691m5287G6586O9588c5642F8614N2348F617
$$ -6980 -186508 369673 117293 -188691 -233978 76586 146174 -35642 68614 120962 6617
12664C83441a21606C81544A04673O9227p1870J92441a8919A9014M44839A91263
$$ 383441 -121606 381544 104673 173900 102030 294471 -18919 19014 463853 191263
12653A07779K62876a74004c7619q6022A50089l3579K4473a45845N1284m2354A0830
$$ 107779 370655 -174004 -37619 -123641 150089 116510 140983 -145845 -94561 -136915 10830
12641e5648B22090M2206A26360P1970g4047A28542L44972g3508a2315j05926b8905
$$ -55648 222090 264296 126360 198330 -74047 128542 473514 -73508 -12315 -118241 -28905
12629e9019H5844K8755b9170A80770o5794C2582a04468B88996i6279K875A17176
$$ -59019 85844 114599 -29170 180770 114976 32582 -104468 288996 -96279 -93404 117176
12617a67300e7354n2274B42629k4271a07620F3212h2668I994c28940B09837q5109
$$ -167300 -57354 -109628 242629 218358 -107620 63212 -82668 9994 -328940 209837 124728
12606A24728b17564a4170D0880K46996c01704a02496m9138B1888P3262N4726B9355
$$ 124728 -217564 -14170 40880 287876 -301704 -102496 -151634 21888 95150 149876 29355
12594b67186A19692n4293H442g2990A66113R5542h8707B03488D478i4042k4633
$$ -267186 119692 65399 8442 -72990 166113 261655 -88707 203488 4478 -94042 -118675
12583a18675k7316A19583h7177A53788j346e6549m1328j2283B0593P8228l0582
$$ -118675 -145991 119583 -87177 153788 152442 -56549 -97877 -110160 20593 98821 68239
12572F8239a06877o1935F5952A9964c04046a31776L2240n8716B3362h841A26501
$$ 68239 -106877 -168812 65952 19964 -304046 -131776 -99536 -158252 23362 -8841 126501
12560B78399a60910B7822a42386A02594b33037B63235b01303h3448B78013A1324
$$ 278399 -160910 27822 -142386 102594 -233037 263235 -201303 -83448 278013 11324
12549c859k71698F381Q3985J8588c98441a14207C36048f2723E1459b6503C0508
$$ -3859 -275557 6381 90366 108954 -398441 -114207 336048 -62723 51459 -26503 30508
12537e0823b23l8092C6799c6891A81112h6131b4439A66784A1737a89434h8855
$$ -50823 -223 -38315 36799 -36891 181112 -86131 -24439 166784 11737 -189434 -88855
12525a33077C15994c12413e3110F9626K33655l1563o8521b49334A15893I282a96032
$$ -133077 315994 -312413 -53110 69626 303281 271718 203197 -249334 115893 9282 -196032
12513B09606o1284P6578d9504A71311K05912b88623B20992F5528i781j50726B0812
$$ 209606 148322 224900 -49504 171311 377223 -288623 220992 65528 -9781 -160507 20812
12501a19724A28599b96285c6783J3771q7901A04757b76059C12732A51225K734
$$ -119724 128599 -296285 -36783 -23012 -110913 104757 -276059 312732 151225 153959
12491A53959G4841I944J83661d8131A82749c8058C15838q5913I6966C8366Q3153
$$ 153959 74841 9944 193605 -48131 182749 -38058 315838 229925 96966 38366 121519
12480A21519i2254I9200B5382b18677R9998A27963a18137k19913d6835o7572j22023
$$ 121519 -92254 99200 25382 -218677 -118679 127963 -118137 -338050 -46835 -114407 -236430
12469b36430G2924F779a72653G9817g3479b0252j99151e3564G1730a09512d2279
$$ -236430 72924 6779 -172653 79817 -73479 -20252 -219403 -53564 71730 -109512 -42279
12457E1905d5347I4522a49170A95961O7762E6307K17949q2135n2110d0348l24827
$$ 51905 -45347 94522 -149170 195961 263723 56307 274256 192121 140011 -40348 -365175
12446c65175D8016e4113A6791e3596B01206e27870C07120E7365R0432j9191a26580
$$ -365175 48016 -54113 16791 -53596 201206 -527870 307120 57365 147797 128606 -126580
12434d969q4533K5869r0232A15966a67787C7100i3614A20015c27011A65212b2546
$$ -4969 -89502 -63633 -153865 115966 -167787 37100 -93614 120015 -327011 165212 -22546
12422C80904d4516B55804d89568i9977B41787i8825L3720A91768a76544o481C41625
$$ 380904 -44516 255804 -489568 -99977 241787 -98825 -65105 191768 -176544 -183025 341625
12410c1892D1294a44178B12191B7952b95394f6894H7918e2457A75960q0297c00987
$$ -31892 41294 -144178 212191 27952 -295394 -66894 87918 -52457 175960 95663 -300987
12398a19083L7305j78882B49169d35907d8354B34179F2421f3810B42739I5037
$$ -119083 -81778 -260660 249169 -435907 -48354 234179 62421 -63810 242739 95037
12387b45948E55258A51011l3055K72383A24928J08578D4647K60548j05880j9154
$$ -245948 555258 151011 117956 390339 124928 233506 44647 305195 199315 180161
12377A80161A5828M17073A75042d3653i206E01565a74705D57863b46080A61669
$$ 180161 15828 432901 175042 -43653 -9206 501565 -174705 457863 -246080 161669
12366G1895b11351F2904b04101J01634M6746g115k05317i339A35819l7558d33295
$$ 71895 -211351 62904 -204101 -102467 -55721 -7115 -212432 -9339 135819 98261 -433295
12354c8277A22862K18115a47397O6894C11080f6485K4061r6985r7606G1420B6054
$$ -38277 122862 340977 -147397 -80503 311080 -66485 -42424 -139409 -237015 71420 26054
12342b3919j8240n0959A1085J30610b05225R8282D6192K59950j37949m1638K90190
$$ -23919 -42159 -93118 11085 141695 -205225 -106943 46192 306142 168193 126555 416745
12331D16745r3627J37770B12524l9573O7169p0297J19852A27233a28191H4065
$$ 416745 323118 460888 212524 172951 240120 169823 289675 127233 -128191 84065
12320A11863J64269J61988A94012J5032M1539q2701n9799N9235F0079J69144j02863
$$ 111863 276132 438120 194012 209044 250583 167882 108083 167318 60079 229223 126360
12309A26360c7422o5900p2193A35558a66784N1716I2954A8903a62899D8843d4017
$$ 126360 -37422 -103322 -175515 135558 -166784 -115068 92954 18903 -162899 48843 -44017
12297H9178l9975a33197I5140m342b85811G894c929A38704j3549D6555J59834
$$ 89178 49203 -133197 95140 90798 -285811 7894 -3929 138704 125155 46555 206389
12286B06389b22883R7268C98170B5470A0487J87018n8392a50088C47686j68843
$$ 206389 -222883 -125615 398170 25470 10487 197505 139113 -150088 347686 178843
12276A78843J49248a9242C15728l890a66261c5503B69677j30112n0464K4230B6227
$$ 178843 328091 -19242 315728 311838 -166261 -35503 269677 139565 89101 113331 26227
12264A31314D6383i2258B52698H8550i1702D9890M4100K23779o7810A0330a1895
$$ 131314 46383 -92258 252698 88550 -91702 49890 93990 317769 249959 10330 -11895
12252A89853J03428q8378l4166D284J48272b0558E7876K44494E2932J14899J6880
$$ 189853 293281 204903 170737 4284 152556 -20558 57876 302370 52932 167831 184711
12241A84711d2824A66596b6329E1569P4376J88250F5003e6333B46125F5513L73831
$$ 184711 -42824 166596 -26329 51569 125945 314195 65003 -56333 246125 65513 439344
12230D39344G8037j2498K39595a81663Q7631a5240C38463j02774I0645A5910J81951
$$ 439344 78037 65539 305134 -181663 -94032 -15240 338463 235689 90645 15910 197861
12219A97861M37608B57034n6776M6077A23039h491C43723q029A27918j1476l0358
$$ 197861 635469 257034 200258 246335 123039 -8491 343723 335694 127918 116442 86084
12208H6084A8557b24127A33025L48613b13680B2293L6889J80093K67410j07765
$$ 86084 18557 -224127 133025 481638 -213680 22293 59182 239275 506685 398920
12198C98920d287C3095P2438J93709c3151j63303C10141j11529k6977l5022P9151
$$ 398920 -4287 33095 105533 299242 -33151 -196454 310141 198612 171635 136613 215764
12187B15764o5609J85246A40222P39Q9619o2167K26075D0310K21919e6905D4186
$$ 215764 150155 335401 140222 140961 230580 168413 394488 40310 262229 -56905 44186
12175G8792J98943j13175K12968H5229i2556D32043E2892J24860J71115J4116
$$ 78792 277735 164560 377528 85229 -92556 432043 52892 177752 348867 362983
12165C62983o544K15003A52633c6285B60612P4224A58366P9361g6137F6821a86319
$$ 362983 356439 571442 152633 -36285 260612 334836 158366 237727 -76137 66821 -186319
12153E9331L1433a51189E298K16232A8873N6054M5967a22887D83500A03044L1459
$$ 59331 90764 -151189 5298 221530 18873 74927 120894 -122887 483500 103044 134503
12142A34503N5488J38775G1710Q4080K71157a4723A05438R3082B5215K9443Q3579
$$ 134503 189991 328766 71710 155790 426947 -14723 105438 198520 25215 54658 138237
12131A38237Q4233d9278a6008B75085A748M08715j95124m3049P5186k1322l0897
$$ 138237 222470 -49278 -16008 275085 1748 410463 215339 172290 247476 226154 195257
12120A95257K50708j42101j00734l5592E285J74866n5646J70813j39528j8043
$$ 195257 445965 303864 203130 167538 5285 180151 124505 295318 155790 137747
12110A37747N8627a38466B62988j8745E022J87796K25370f4055l48877a30507
$$ 137747 196374 -138466 262988 244243 5022 192818 418188 -64055 -412932 -130507
12099b4596B88065O5554p0163j9520N2629a49241D8906K54014O0138a73236N1654
$$ -24596 288065 353619 283456 263936 316565 -149241 48906 302920 363058 -173236 -121582
12088a21582F3379K83850j58536a0500B55675B0762j0103K17549N4171A08754
$$ -121582 63379 347229 188693 -10500 255675 20762 10659 228208 282379 108754
12077C53252A45929N5282K36296j25283d8144C03094G1291M7526J77374A28495
$$ 353252 145929 201211 437507 312224 -48144 303094 71291 118817 296191 128495
12066B73814a25343D61891B4981b3974n5949C07169A45776a62425c8937r5781
$$ 273814 -125343 461891 24981 -23974 -79923 307169 145776 -162425 -38937 -134718
12056a34718c6466C4885i6050I2784a49447M6686j44211C40837a20038j04703
$$ -134718 -36466 34885 -96050 92784 -149447 -102761 -246972 340837 -120038 -224741
12046b24741G4232b53301I2842B9332L5246c48654B68776b6406H6965h948e21
$$ -224741 74232 -253301 92842 29332 64578 -348654 268776 -26406 86965 -8948 -521
12034a26424M6763A54917F0785i4902D4546b9443D69921A44235J76030o4218A19883
$$ -126424 -79661 154917 60785 -94902 44546 -29443 469921 144235 320265 256047 119883
12022H9582R0321d1215B07234p4913A9903L20291p2663b69836C9342a60861P9589
$$ 89582 179903 -41215 207234 132321 19903 340194 267531 -269836 39342 -160861 -81272
12011h1272I5423H435b1015n108A45066a48926D2136J28239N9058g3327I6941
$$ -81272 95423 8435 -21015 -26123 145066 -148926 42136 170375 229433 -73327 96941
11999A21981D427g1751R291E736K00031a48887F274d4974A03686C7938b46827
$$ 121981 4427 -71751 -62460 5736 205767 -148887 6274 -44974 103686 37938 -246827
11987D0861A8615L29077b6877j10524q7926g7825m3868B48028g4908b8321P820
$$ 40861 18615 347692 -26877 -137401 -225327 -77825 -121693 248028 -74908 -28321 -20501
11976b0501h343j2269C5697a51593c9585l9904j61913M9182B49885a44021A14287
$$ -20501 -8343 -20612 35697 -151593 -39585 -79489 -241402 -192220 249885 -144021 114287
11964e13786A54019e7789A26079k5052C6947J7879J23106c8782B9855b59781H6723
$$ -513786 154019 -57789 126079 101027 36947 54826 177932 -38782 29855 -259781 86723
11952a35381O5292o3155e4021C0225h1459H0301M1028a5908e906n5530B63375
$$ -135381 -70089 -133244 -54021 30225 -81459 80301 121329 -15908 -5906 -61436 263375
11940A48868q522N984c12949a04255I7061a30365r0317O6148a3944B35325a16189
$$ 148868 140346 146330 -312949 -104255 97061 -130365 -220682 -154534 -13944 235325 -116189
11928H6997a2115G6820O7124b83162h9844B6796J05470m6191K2709e6829K5302
$$ 86997 -12115 76820 143944 -283162 -89844 26796 132266 86075 108784 -56829 -31527
11917c1527A11191c1564B28752j10038J03629a11731m7884B30418B3861J17689
$$ -31527 111191 -31564 228752 118714 222343 -111731 -159615 230418 23861 141550
11907A41550o9904Q0535J72499a89825b3800j1082j25356N6775A15812M1010c0671
$$ 141550 71646 152181 324680 -189825 -23800 -34882 -160238 -103463 115812 156822 -30671
11895b8598n9716A20189l4648l0300a96093B0156a00964m30626a95817i273B27167
$$ -28598 -88314 120189 85541 55241 -196093 20156 -100964 -531590 -195817 -9273 227167
11883c67557C26719c27703H3967f2996C06438c26026P1538a02940H762c40922
$$ -367557 326719 -327703 83967 -62996 306438 -326026 -254488 -102940 8762 -340922
11872g5763j12340d170k01975A58064o6036a76102l9549A53323c34823F6315f296
$$ -75763 -188103 -4170 -206145 158064 92028 -176102 -215651 153323 -334823 66315 -6296
11860c24480J22164I9805i5971d1291o3316j00319C1344a20765j35022A88731
$$ -324480 -202316 99805 -95971 -41291 -104607 -204926 31344 -120765 -255787 188731
11849A31837d5994A65816b6393l25595J57620j12552A14511m1467a51355M145
$$ 131837 -45994 165816 -26393 -351988 -194368 -306920 114511 73044 -151355 -147210
11839a47210A45300g5205m1323k9898A66992j060n6945e1535b570j90379m3267
$$ -147210 145300 -75205 -116528 -146426 166992 165932 108987 -51535 -2570 -192949 -236216
11828b36216J00157j6687J3626A08756a61792M4215e5468E5035O5251J79140a65387
$$ -236216 -136059 -152746 -139120 108756 -161792 -117577 -55468 55035 120286 299426 -165387
11816A5907k105c57923b0160r5460B32423D6468d2043J7819B49550c8810B06251
$$ 15907 13802 -357923 -20160 -115620 232423 46468 -42043 -24224 249550 -38810 206251
11804h6864k0143j19534b8833p8312k5380C9228N6770j7193c46526e3417j63458
$$ -86864 -107007 -226541 -28833 -107145 -132525 39228 95998 78805 -346526 -53417 -216875
11793b16875A61097a94048f7993q0905J90A46536a80600a9078B93522b15289A19663
$$ -216875 161097 -194048 -67993 -148898 -148708 146536 -180600 -19078 293522 -215289 119663
11781A06070e2212a9456j39908d1163a6898A00977f9796C4189J8516b92476B0011
$$ 106070 -52212 -19456 -159364 -41163 -16898 100977 -69796 34189 52705 -292476 20011
11769B73727e5937E5955B3929I783a9112A02601N8633J00323a51426A78630d570
$$ 273727 -55937 55955 23929 9783 -19112 102601 161234 261557 -151426 178630 -4570
11757e2748j06100l71307D2982J13900a9919F1650B0637d2624J1120J0593C2755
$$ -52748 -158848 -530155 42982 156882 -19919 61650 20637 -42624 -31504 -20911 32755
11745D8482c81367c780l0515j09443j01881r9418a55551e079l7726r2732J7665
$$ 48482 -381367 -3780 -34295 -143738 -245619 -345037 -155551 -5079 -42805 -135537 -117872
11734a17872B51374j21847Q9377a09898k45810f6648A56883C6890J59212M1378
$$ -117872 251374 129527 218904 -109898 -355708 -66648 156883 36890 196102 237480
11724B37480b63003B15547d21280h8008n5563A06046b74127c802k40559A3439
$$ 237480 -263003 215547 -421280 -88008 -143571 106046 -274127 -3802 -244361 13439
11713H7289c25968A14718m8548K97108H566K56148d4606C3513J60840E5166B1834
$$ 87289 -325968 114718 66170 363278 8566 264714 -44606 33513 194353 55166 21834
11701A10451K02840a62396n2770A03669m0514N0295i4707h891H3164n039a44285
$$ 110451 313291 -162396 -215166 103669 63155 113450 -94707 -8891 83164 78125 -144285
11689C8842a41103m8669A55696h6109A09118a9112A57839b1011j97651O0803g7657
$$ 38842 -141103 -189772 155696 -86109 109118 -19112 157839 -21011 -218662 -157859 -77657
11677I611J03350J22028i8989D4791b69051B89983j6378a30064A52623o5029e8993
$$ 9611 112961 234989 -98989 44791 -269051 289983 273605 -130064 152623 87594 -58993
11665G2272J31414a61829j0918c8414A63151A9698a36191C6479c15242g6676j94862
$$ 72272 203686 -161829 -172747 -38414 163151 19698 -136191 36479 -315242 -76676 -271538
11654b71538C87217A16696a38111a5116A6244K36329J16702I0697i0254A59587
$$ -271538 387217 116696 -138111 -15116 16244 252573 369275 90697 -90254 159587
11643E6874f0953A08515A3565c88796E5176J58230c12187l427R1598L3157I8058
$$ 56874 -60953 108515 13565 -388796 55176 213406 -312187 -315614 -224016 -190859 98058
11631a65522L1447r0549a6153E0026b05750G6102b0733r7677A91460G0314a72424
$$ -165522 -134075 -224624 -16153 50026 -205750 76102 -20733 -118410 191460 70314 -172424
11619A38711C500i3993c4705A46423b47978R1986E27643i1317j26301J08648k5376
$$ 138711 3500 -93993 -34705 146423 -247978 -155992 527643 -91317 -217618 -108970 -134346
11608a34346B0092K14103a72959I0047J05149g3784B18398E4127b58957F1731
$$ -134346 20092 234195 -172959 90047 195196 -73784 218398 54127 -258957 61731
11597a86894f6630A92210r4888N2760J91470j8611H5915l6753b46100A5630f9638
$$ -186894 -66630 192210 97322 150082 341552 322941 85915 49162 -246100 15630 -69638
11585c65491R1573A00587L0523O5947p4622D6722h7409G6091R243f6600d504p6267
$$ -365491 -273918 100587 131110 197057 122435 46722 -87409 76091 85334 -66600 -4504 -80771
11573h0771B12790c01164G8873p428A2689J15625K36902j03709H666M4046J80488
$$ -80771 212790 -301164 78873 71445 12689 128314 365216 261507 8666 52712 233200
11562B33200a12358B16613A03937J95364A17026b76250g7705j8589A87349g6565
$$ 233200 -112358 216613 103937 299301 117026 -276250 -77705 -96294 187349 -76565
11551f8572B12853a60943J4300B67068j33450o4073h4988a5094A03252O34g3750
$$ -68572 212853 -160943 -146643 267068 133618 69545 -84988 -15094 103252 103886 -73750
11539A74589O5884r3288a26727A28863K6853J30446H9545h690l4963A57119m8460
$$ 174589 240473 147185 -126727 128863 155716 286162 89545 -8690 -43653 157119 108659
11528A08659c88798F4340R5172E0763P4912g933C48623G7748a28398e5263j3128
$$ 108659 -388798 64340 159512 50763 125675 -7933 348623 77748 -128398 -55263 -68391
11517f8391l13785A07628l291M4126J75509o5196Q9567j45111K3911q1184F1305
$$ -68391 -382176 107628 104337 148463 323972 258776 348343 203232 227143 145959 61305
11505C95327A91047j8707O9343H2971B9176Q1795C5686B328J20195N8994Q310
$$ 395327 191047 172340 241683 82971 29176 110971 35686 2328 122523 181517 189827
11494A89827A4207J58654h6284l8030j83157b6485I2287M8558B061J23280b8029
$$ 189827 14207 172861 -86284 -124314 -307471 -26485 92287 140845 2061 125341 -28029
11482A8847R3386A1567K13968q840l9640a11385A05347C8672Q6468b38040D739
$$ 18847 112233 11567 225535 216695 177055 -111385 105347 38672 125140 -238040 4739
11470D8191d2504C15400E5263f6966p8799g395A77136a34552B87021Q7135A62382
$$ 48191 -42504 315400 55263 -66966 -145765 -7395 177136 -134552 287021 374156 162382
11458B84999I2711K00925D7419J6759M39330n0453H799h0833B08329h664A23096
$$ 284999 92711 293636 47419 64178 503508 453055 8799 -80833 208329 -8664 123096
11446I0401k7068J19009G9916B0296b49939A22401e5441b3788n4397B37682G9113
$$ 90401 63333 182342 79916 20296 -249939 122401 -55441 -23788 -78185 237682 79113
11434F9997c9307q7343A07844a11881d6362b0235D3052K1956J52280a1697B17527
$$ 69997 -39307 -126650 107844 -111881 -46362 -20235 43052 65008 217288 -11697 217527
11422c7839B7315h3368B7314d077k28707d6443k02441j68050C42604c7767A15747
$$ -37839 27315 -83368 27314 -4077 -232784 -46443 -248884 -416934 342604 -37767 115747
11410B40497B3286J98112F3492b0000r4280I3926a1160p8145B06793I1198a16088
$$ 240497 23286 221398 63492 -20000 -114280 93926 -11160 -89305 206793 91198 -116088
11398a20030B21007J98081a0625n2091B497L2429d4212A93916J27684c00153k775
$$ -120030 221007 419088 -10625 -62716 2497 34926 -44212 193916 321600 -300153 -302928
11387c02928R7745F1736K5114i994o1401A32888a01177M2163O445k2874c4993
$$ -302928 -205183 61736 86850 -9994 -71395 132888 -101177 -59014 -52569 -75443 -34993
11375E0249a74696G780J81104a6115p8001H3564h406j44252I3193R5297a86874
$$ 50249 -174696 7780 188884 -16115 -94116 83564 -8406 -152658 93193 188490 -186874
11363B03964f5566A21247J9880C1732j672h1251D603J84461i971j05128D15934
$$ 203964 -65566 121247 141127 31732 30060 -81251 4603 189064 -9971 -115099 415934
11351F9448i7935A39229a86196J4972G4215k5078a23709E8790N9791b65827F1636
$$ 69448 -97935 139229 -186196 -171224 74215 49137 -123709 58790 118581 -265827 61636
11339I2231a81385r4920B6278e412j77613B22342Q8501b08078j70568J64320E1345
$$ 92231 -181385 -276305 26278 -5412 -183025 222342 310843 -208078 -378646 -214326 51345
11327g669j60872A5148c25088j1180b5833A35769Q1768g8574B12253M6836f692
$$ -7669 -168541 15148 -325088 -336268 -25833 135769 217537 -78574 212253 259089 -6692
11315a43553j32625C07073B7143K1891J24728J83913b80504d321m018A67628a46069
$$ -143553 -276178 307073 27143 49034 173762 357675 -280504 -4321 -8339 167628 -146069
11303b73346N4503R0430k18264C13706a49002B44334a61123g754l0953l5540j01286
$$ -273346 -218843 -128413 -346677 313706 -149002 244334 -161123 -7754 -38707 -74247 -175533
11292a75533B0750a53223B4859c5863A56981b391r0211a3399A08127i1633A77266
$$ -175533 20750 -153223 24859 -35863 156981 -2391 -92602 -13399 108127 -91633 177266
11280G2730N9657Q6164o1280k5162c2088j21327j77918N4764a20178A29406j0349
$$ 72730 132387 218551 157271 132109 -32088 -153415 -331333 -276569 -120178 129406 119057
11269A19057a14169j4198O1364j94758C24625b4049j22270e4706m5709F5298N4751
$$ 119057 -114169 -128367 -67003 -261761 324625 -24049 -146319 -54706 -100415 65298 120049
11258A20049L6175c60354a39490F8651f3024G479b81126N6532c1182r9058A51221
$$ 120049 156224 -360354 -139490 68651 -63024 7479 -281126 -224594 -31182 -130240 151221
11246F2885k2702K423L1838e5192J9386k20248h5226G5298J6879h7224m0744r5241
$$ 62885 40183 42606 74444 -55192 -35806 -256054 -85226 75298 92177 -87224 -127968 -223209
11234b23209B755a02539G3349g8667D4390a52185C726J26434f2696c0523B13750
$$ -223209 2755 -102539 73349 -78667 44390 -152185 3726 130160 -62696 -30523 213750
11222c1693a3917k2503k47911f1954j63709O8997j77985A61566a09460G415b01572
$$ -31693 -13917 -36420 -284331 -61954 -225663 -156666 -334651 161566 -109460 7415 -201572
11210C6614g3123C11722i4130c5933P395p4345J0704m6681H0572K43728J5081
$$ 36614 -73123 311722 -94130 -35933 -28538 -102883 -92179 -138860 80572 324300 339381
11199C39381I3577a12649j11580M1525m4379j71661A00898g1149A15467E1739
$$ 339381 93577 -112649 -224229 -182704 -227083 -398744 100898 -71149 115467 51739
11188h5200l411l1457j32502j11554c6167m0325j25482d9680j30784f8380j2113
$$ -85200 -88611 -120068 -252570 -364124 -36167 -76492 -201974 -49680 -180464 -68380 -80493
11177h0493c0402A64296a52160C96025g7760k9835m7046q4547f6596p7657O2965
$$ -80493 -30402 164296 -152160 396025 -77760 -107595 -154641 -239188 -66596 -144253 -81288
11166h1288j13683A95442B6086b83242h6478M0416K0213C6012J29818J684b87998
$$ -81288 -194971 195442 26086 -283242 -86478 -46062 -25849 36012 165830 167514 -287998
11154a63070o7126R587A01280A0604d44182B8909a2740l28051q772a45087E1142
$$ -163070 -230196 -220609 101280 10604 -444182 28909 -12740 -340791 -349563 -145087 51142
11142b02633n1093h3347c7555j56987B7732a40799k2551O0182J4565G4031a32433
$$ -202633 -253726 -83347 -37555 -194542 27732 -140799 -163350 -103168 -88603 74031 -132433
11130B6271a47250M286A31980K77336H0913c36049B2368J79680h5455D1200J7078
$$ 26271 -147250 -142964 131980 409316 80913 -336049 22368 202048 -85455 41200 58278
11119E8278L26252A58979L7533J50965b66633a8714k58153d6321B31541b982B15116
$$ 58278 384530 158979 196512 347477 -266633 -18714 -276867 -46321 231541 -2982 215116
11107B17007d0514l24397C9903K89168B2389K62170Q3164A04311J96322h0966
$$ 217007 -40514 -364911 39903 329071 22389 284559 367723 104311 300633 -80966
11096i694H4447Q4716H774L49071A0001K63170H4734K34680A27627J71870A03947
$$ -9694 84447 169163 8774 357845 10001 273171 84734 319414 127627 299497 103947
11084A27041g106B06119e8752C69905j07604o78o5118g9752F1732K46193Q8984
$$ 127041 -7106 206119 -58752 369905 262301 261623 196505 -79752 61732 307925 396909
11073C96909q9196k3321E8547K17290J63308A8135J20551B7552J03558K55276
$$ 396909 307713 284392 58547 275837 439145 18135 138686 27552 131110 386386
11063C86386J7851k1842o5516O3591J52917B23647J34789N5987R1561j09095J68757
$$ 386386 404237 382395 316879 380470 533387 223647 358436 414423 505984 396889 565646
11052E65646j86115L94812k76869J05407p5872K67654O3624C27074M87678Q0248
$$ 565646 379531 774343 497474 602881 527009 794663 858287 327074 814752 895000
11042H95000j99825K68388J66807k78659l8966j97877M33702j3157B87728N49415
$$ 895000 695175 963563 1130370 851711 812745 614868 1048570 1035413 287728 837143
11032H37143K04217E08129K55406K05239k59098R3418k11729j04641j33651M53336
$$ 837143 1041360 508129 763535 968774 709676 803094 591365 486724 353073 806409
11022H06409k6161K6201J07929N7723k0616r0830o2446m6902k19614L0469P3650
$$ 806409 780248 806449 914378 972101 951485 860655 798209 751307 531693 562162 635812
11011F35812p8072o1709j5069j13267r653K71700k71073K76419C12213K94268
$$ 635812 557740 496031 480962 367695 358042 629742 358669 635088 312213 606481
11001F06481q1956K28201m312k71936k15942J66688p8213N61902l32341J37511
$$ 606481 524525 752726 748414 476478 260536 427224 349011 910913 578572 716083
10991G16083J62646k09206o8582L24094m09357J2272J06046N5465M9671j6606
$$ 716083 878729 669523 600941 925035 515678 527950 633996 689461 739132 722526
10981G22526L7510J5484L29970j98230j37719K58563L01342j40489J82092j70623
$$ 722526 760036 775520 1105490 907260 769541 1028104 1329446 1188957 1371049 1200426
10971A200426L74846p2432M37274K22080K32004J21485k942K89564j063J35591
$$ 1200426 1575272 1502840 1940114 2162194 2394198 2515683 2512741 2802305 2801242 2936833
10961B936833k06559j35244j21497n63668m8421l34170Q0553m68455M63384l02351
$$ 2936833 2730274 2595030 2473533 1909865 1861444 1527274 1607827 1139372 1602756 1300405
10951A300405J08845j44168K1497K77632n95489K4913p251m4643j95988j67566
$$ 1300405 1409250 1265082 1286579 1564211 968722 993635 986384 941741 745753 578187
10941E78187I0920L87130k5134a01062H6K02323J82303A59619K16172j23565C6078
$$ 578187 90920 478050 452916 -101062 86 202409 384712 159619 375791 252226 36078
10929C45428a9604G1250g9573a4182q2825c6732A21970d3764C1885b57281H2845
$$ 345428 -19604 71250 -79573 -14182 -97007 -36732 121970 -43764 31885 -257281 82845
10917c36622g8664C1405q175o659b2497p7735p9534b9498j26184b3798B38102
$$ -336622 -78664 31405 23230 16571 -22497 -100232 -179766 -29498 -155682 -23798 238102
10905H679f354C16650o9722g3465A79396j0423A6173Q1815B2936a81836E6745
$$ 8679 -6354 316650 246928 -73465 179396 168973 16173 97988 22936 -181836 56745
10893G3870G363a34834A64928c1506A2544f4085A06666i4561A55137b73615p885
$$ 73870 7363 -134834 164928 -31506 12544 -64085 106666 -94561 155137 -273615 -281500
10882b81500C16088p8755c8495A51830a26904C26009A61252a44623A84017H3770
$$ -281500 316088 237333 -38495 151830 -126904 326009 161252 -144623 184017 83770
10871F9620a03492A91619G9600a08494B96660b19122d5763J4345o7240A40620
$$ 69620 -103492 191619 79600 -108494 296660 -219122 -45763 -31418 -98658 140620
10860b9779k34196d9667b3848l15959b4678E8893J63239K17093a88998A84948
$$ -29779 -263975 -49667 -23848 -339807 -24678 58893 222132 439225 -188998 184948
10849i9146D026e96018B07434a27906C43920C0580A4444a01536G0508a1056j46795
$$ -99146 4026 -596018 207434 -127906 343920 30580 14444 -101536 70508 -11056 -157851
10838a57851J790G3990O3445a4698A2227J80877J90482e8153K839B3777a64243
$$ -157851 -156061 73990 137435 -14698 12227 193104 383586 -58153 -55314 23777 -164243
10826A4063a55587B00631p3911O5454f9795F7339a02454j8538q7505A0337a45970
$$ 14063 -155587 200631 126720 192174 -69795 67339 -102454 -120992 -208497 10337 -145970
10814b138q1778a8683H9797f4652l6200J5153F9386g6463b5382r3350j17575A64936
$$ -2138 -83916 -18683 89797 -64652 -100852 -85699 69386 -76463 -25382 -118732 -236307 164936
10801b025p8226C5167a11847A5820P4454G62a09816a107G480a77517G9543c0962
$$ -2025 -80251 35167 -111847 15820 90274 762 -109816 -1107 7480 -177517 79543 -30962
10788b32213A22969o0225a21411k55923H4662J5198b20154K4456e5180E6907a03860
$$ -232213 122969 62744 -121411 -377334 84662 99860 -220154 -195698 -55180 56907 -103860
10776A57248a07792A10812g424A3828J87003E870P0412a97162B89084F7182f3527
$$ 157248 -107792 110812 -7424 13828 200831 5870 76282 -197162 289084 67182 -63527
10764h4111E9077Q1002B3435b016k30943O6995m1897e3741a6555A29099N6138
$$ -84111 59077 140079 23435 -2016 -232959 -165964 -207861 -53741 -16555 129099 185237
10753A85237b00963j4391e0558H6047b08746g3222A58390G7014d70061a66138
$$ 185237 -200963 -215354 -50558 86047 -208746 -73222 158390 77014 -470061 -166138
10742B58479a23199o0728e0955j6l982H9916A5985e63815D452i9352A57289b05331
$$ 258479 -123199 -183927 -50955 -50971 -54953 89916 15985 -563815 4452 -99352 157289 -205331
10729b61847C2005e8339o6530N3174C398a63253g1629k18062D8815c29096a5025
$$ -261847 32005 -58339 -124869 -71695 3398 -163253 -71629 -289691 48815 -329096 -15025
10717d58815g3754a5178j14687E3448R9487a73218l4639f7027K3646l27380J79107
$$ -458815 -73754 -15178 -129865 53448 152935 -173218 -207857 -67027 -43381 -370761 -191654
10706a91654C83080j90868b71844j50254a34270l0403j08455k72824H0493g7654
$$ -191654 383080 192212 -271844 -422098 -134270 -164673 -273128 -545952 80493 -77654
10695b83497a23460J9696k6940e9258B23221r2513P8045b00788k6821a01804C0269
$$ -283497 -123460 -103764 -130704 -59258 223221 130708 208753 -200788 -227609 -101804 30269
10683A73920f869B02397d3986j35514C3746J0395c61259d7826k3779j59670O4955
$$ 173920 -6869 202397 -43986 -179500 33746 44141 -361259 -47826 -71605 -231275 -166320
10672a66320A72439a88812E8648b64604f7908C5223a85836O7541A34422J21885
$$ -166320 172439 -188812 58648 -264604 -67908 35223 -185836 -118295 134422 256307
10662B56307o8660d0350j31977C02447g3521E9856c75521l2410B77513a16085
$$ 256307 187647 -40350 -172327 302447 -73521 59856 -375521 -407931 277513 -116085
10651b24898N0581M8439B21174d4055k07648c2742A86768b67773h6192j8721I9356
$$ -224898 -174317 -125878 221174 -44055 -251703 -32742 186768 -267773 -86192 -104913 99356
10639b58956J01745L6316M5414a6855B41969n0136a72400C6818c9878a3263A11811
$$ -258956 -157211 -120895 -75481 -16855 241969 191833 -172400 36818 -39878 -13263 111811
10627a34665L4605l42486B01433a31883K4500A11231f0136G6904J770L61261g33
$$ -134665 -100060 -442546 201433 -131883 -107383 111231 -60136 76904 78674 439935 -733
10615b18177K3643P0542j93123c6677q6235m34218I972b45375B0855d5758G6285
$$ -218177 -194534 -123992 -317115 -36677 -122912 -557130 9972 -245375 20855 -45758 76285
10603a32215e7646j33134A32961b39937A12964L1076J27507b64008A3591d19207
$$ -132215 -57646 -190780 132961 -239937 112964 144040 271547 -264008 13591 -419207
10592d64193D172J0437M8973O6168l8227b89430J30525B38485a13207A0280e5205
$$ -464193 4172 14609 63582 129750 91523 -289430 -158905 238485 -113207 10280 -55205
10580B68928A22697b86924Q1336L370A48492O6598a39B6871J58573J6332b47055
$$ 268928 122697 -286924 -205588 -202218 148492 215090 -139 26871 185444 201776 -247055
10568B07064A4559c05461D7040a79856e0076A27208E1461N3486b56013B11230
$$ 207064 14559 -305461 47040 -179856 -50076 127208 51461 104947 -256013 211230
10557e9507b7080A05092b74603a23307p2741a8141I2840a4134k90257B7669J75233
$$ -59507 -27080 105092 -274603 -123307 -196048 -18141 92840 -14134 -304391 27669 202902
10546B02902g8288A30570a32114O5956m3834K8216K0011F823i6092E1851J56610
$$ 202902 -78288 130570 -132114 -66158 -109992 -81776 -61765 6823 -96092 51851 208461
10535B08461d884p9353j41302b5783j4952j3296l7099d844A16174d42257a08186
$$ 208461 -4884 -84237 -225539 -25783 -40735 -54031 -91130 -4844 116174 -442257 -108186
10523B75190b90695A2654L73738b51352c9624l5176A63059c2045I4382b9113j54518
$$ 275190 -290695 12654 386392 -251352 -39624 -74800 163059 -32045 94382 -29113 -183631
10512a83631h1520j0998A1754a09749j51908D4099b61995i9252b2398B71981a04292
$$ -183631 -81520 -92518 11754 -109749 -261657 44099 -261995 -99252 -22398 271981 -104292
10500a94602A57541m5347b48132K7852G0820a2764A24905E4391b81270f5691B1560
$$ -194602 157541 112194 -248132 -220280 70820 -12764 124905 54391 -281270 -65691 21560
10488c51032J24543K7029f269j70677C2125H589J6792K28314c12582J31454e6496
$$ -351032 -226489 -199460 -6269 -176946 32125 8589 25381 253695 -312582 -181128 -56496
10476A06253K55149A51185L3690j640M7875J29684B2295J25434K4085b2609E01032
$$ 106253 361402 151185 184875 183235 231110 360794 22295 147729 171814 -22609 501032
10464F7663j7874A6407M48543a24972M057A4789e9336B2855c4285j21160b3865
$$ 67663 49789 16407 464950 -124972 -120915 14789 -59336 22855 -34285 -155445 -23865
10452a97254B0712c60628R6300J28953B0597e2195k41566c030o8263L363p753
$$ -197254 20712 -360628 -264328 -135375 20597 -52195 -293761 -3030 -71293 -67930 -75683
10441g5683j06095A76338c9073j03618O122A182R0084i5987j2702b2670B23993
$$ -75683 -181778 176338 -39073 -142691 -136569 1182 91266 -95987 -108689 -22670 223993
10429c18087A72384G1230a0231G543b8132j2251D6678R5341j6322l6748J6278
$$ -318087 172384 71230 -10231 7543 -28132 -40383 46678 142019 125697 88949 105227
10418A05227c18196a10219c3342n6930B43309A20624a56648B8786b7805B06171
$$ 105227 -318196 -110219 -33342 -90272 243309 120624 -156648 28786 -27805 206171
10407C4174a42376k50237A91068b57278P9436k15007A1565a61521r0515H0770
$$ 34174 -142376 -392613 191068 -257278 -177842 -392849 11565 -161521 -252036 80770
10396A09494J33299d1434m2148r4178D2605a48511A10491a16389B33298j10822
$$ 109494 242793 -41434 -83582 -177760 42605 -148511 110491 -116389 233298 122476
10386A22476K15133L9465e7546b7194D03030A0354b54893A35871a05739A15155
$$ 122476 337609 377074 -57546 -27194 403030 10354 -254893 135871 -105739 115155
10375F738c30314D4616c499B09583L9159A7207O46666j95199A69076L34341r2609
$$ 6738 -330314 44616 -3499 209583 248742 17207 663873 468674 169076 503417 410808
10364D10808j00538c0728C22730O30736B99140N3866j3332I7226K20823a1445
$$ 410808 310270 -30728 322730 953466 299140 353006 339674 97226 318049 -11445
10353A24836m9976N1710K35049c4194D10487j31090R1378N5685R2845l1401j67250
$$ 124836 74860 126570 361619 -34194 410487 279397 370775 426460 519305 487904 320654
10342C20654j23143b4453A73999J83102l8798M868n445c5363D2363K26832L7230
$$ 320654 197511 -24453 173999 357101 318303 323171 317726 -35363 42363 269195 306425
10331C06425a58493J8725B81967a69119E5933B0915a66526j67831B0394R6549
$$ 306425 -158493 -139768 281967 -169119 55933 20915 -166526 -334357 20394 116943
10321A16943d0622A58584P2859I6963J66525b6933A27706l0913K84654E9273R7573
$$ 116943 -40622 158584 231443 96963 263488 -26933 127706 96793 381447 59273 156846
10310A56846C1632O8287M36205a59459C27038I1899D5034J41808C9448e1267j21037
$$ 156846 31632 99919 536124 -159459 327038 91899 45034 186842 39448 -51267 -172304
10299a72304j12513f968A7944K30235a42112e1317o1935H7989b9191k13440J06717
$$ -172304 -284817 -6968 17944 248179 -142112 -51317 -113252 87989 -29191 -242631 -135914
10288a35914D7746b8859I6014a22312O0987A3606b3912m7089A67891b65488R7378
$$ -135914 47746 -28859 96014 -122312 -61325 13606 -23912 -71001 167891 -265488 -168110
10277a68110k5674B49235c4809A69739d2349H0105a62706A76776m8673a12665
$$ -168110 -193784 249235 -34809 169739 -42349 80105 -162706 176776 128103 -112665
10266b45475A61261a22600j51329g9880p9532A9038f9475j10735N3393f233j82494
$$ -245475 161261 -122600 -273929 -79880 -159412 19038 -69475 -180210 -126817 -6233 -188727
10255a88727a2039j17476A13909C9947P7387M1117J06640J16112e759n6860A16424
$$ -188727 -12039 -129515 113909 39947 117334 158451 265091 381203 -5759 -62619 116424
10243A06568M71768e5618A45465c388H3715a11322D10778j72952A08991a07833
$$ 106568 578336 -55618 145465 -3388 83715 -111322 410778 237826 108991 -107833
10232b45299A02595a42254d4047k9430n9159j41835a02567r58K7948j42826K7874
$$ -245299 102595 -142254 -44047 -73477 -132636 -274471 -102567 -103525 -75577 -218403 -190529
10221a90529q8823A70607G543n53c0795j36680m7812C37576a35856k99555e2393
$$ -190529 -279352 170607 7543 6990 -30795 -167475 -215287 337576 -135856 -435411 -52393
10209I7851P5957H2679k5876h299k64865B8701a36109L3619A85226a79257A04622
$$ 97851 173808 82679 56803 -8299 -273164 28701 -136109 -102490 185226 -179257 104622
10197a61646A52522b33179d8277k27727a5566l13344E1598g3511k7207A43780
$$ -161646 152522 -233179 -48277 -276004 -15566 -328910 51598 -73511 -100718 143780
10186C76546d3099j34559B07489a41497c8700F628a0452D8108K911L8963K06338
$$ 376546 -43099 -177658 207489 -141497 -38700 6628 -10452 48108 51019 89982 296320
10175B96320A38158m1624i9427k91849e8244k87100A53202b05806k52707D6061
$$ 296320 138158 96534 -99427 -391276 -58244 -345344 153202 -205806 -458513 46061
10164I3124d3917a2698A04234a58265P3928D3850a98011A75664A7761L8456c86488
$$ 93124 -43917 -12698 104234 -158265 -84337 43850 -198011 175664 17761 56217 -386488
10152B23080h0444p9793A14301a13368M4456A62067N3492D3592e7959F6589a614
$$ 223080 -80444 -160237 114301 -113368 -68912 162067 215559 43592 -57959 66589 -1614
10140g6638K7807a1774F5558J68423d594j15830e8796A03318f4594I4519a51902
$$ -76638 -48831 -11774 65558 233981 -4594 -120424 -58796 103318 -64594 94519 -151902
10128a93624I5513d0209A53223A0850b55482Q1528q5369c2716r5038f1884a7447
$$ -193624 95513 -40209 153223 10850 -255482 -173954 -259323 -32716 -127754 -61884 -17447
10116a90611A05231b43953a17878j87616b9789l1549k07546B8293K45759i1040
$$ -190611 105231 -243953 -117878 -305494 -29789 -61338 -268884 28293 274052 -91040
10105c18255d5119n8993j65389J08464n7524A00631a63977h0001G8624b23724
$$ -318255 -45119 -104112 -269501 -161037 -218561 100631 -163977 -80001 78624 -223724
10094B01555c10009c0070j59648H6139e9832j51113C30208i3428C46211a42326
$$ 201555 -310009 -30070 -189718 86139 -59832 -210945 330208 -93428 346211 -142326
10083G2640k457k8269L7026e91265A70745b0975j53840J2831J500o4903c962p1337
$$ 72640 70183 41914 78940 -591265 170745 -20975 -174815 -161984 -160484 -225387 -3962 -75299
10071g5299D3006a25557O1113l1818f866j38716k43449c3172D4943j8152a53691
$$ -75299 43006 -125557 -64444 -96262 -6866 -145582 -389031 -33172 44943 26791 -153691
10059F2346c4740l65450e7750A51556c1316A46218N0822f2541A40386a78662E9534
$$ 62346 -34740 -400190 -57750 151556 -31316 146218 197040 -62541 140386 -178662 59534
10047f7407m4343L4886m19134a71205j43428D7364g0048A9098f4664m2728A1882
$$ -67407 -111750 -76864 -495998 -171205 -314633 47364 -70048 19098 -64664 -107392 11882
10035B44945b69895a19556J7247D219a03173q4767A4584c873k00708P2413k4097
$$ 244945 -269895 -119556 -102309 4219 -103173 -187940 14584 -3873 -204581 -132168 -156265
10024a56265A18439E3577C726i9690K3374l8957j3033A12707L2777B1375a68173
$$ -156265 118439 53577 3726 -99690 -76316 -115273 -128306 112707 145484 21375 -168173
10012c31A78019c27102A26502D4883c60666f4618m7496q5052p9823Q9651c6860
$$ -331 178019 -327102 126502 44883 -360666 -64618 -112114 -197166 -276989 -187338 -36860
10000g1547g164l9018a2964B91402c86253a90227K4526I3067b89203A41997k4402
$$ -71547 -7164 -46182 -12964 291402 -386253 -190227 -165701 93067 -289203 141997 117595
9989A17595g365D7809O5339K26590B6359b42157a01387H0263b09665N7574j0667
$$ 117595 -7365 47809 113148 339738 26359 -242157 -101387 80263 -209665 -152091 -162758
9978a62758j06422A11726P6679i2339B5626a70911r9087E1183c1064C70738I8594
$$ -162758 -269180 111726 188405 -92339 25626 -170911 -269998 51183 -31064 370738 98594
9966h6000j13710i3925j12290F1392a89019h4128o7583F703a8855k66913b8610
$$ -86000 -199710 -93925 -206215 61392 -189019 -84128 -151711 6703 -18855 -285768 -28610
9954a0804A8749a63870g0072A98528E0724i7607B68179a98970J5409I269b35258
$$ -10804 18749 -163870 -70072 198528 50724 -97607 268179 -198970 -183561 9269 -235258
9942c47009a692B11482c79348e3528B1720a03681j08688j75913a01808D2908a26005
$$ -347009 -1692 211482 -379348 -53528 21720 -103681 -212369 -388282 -101808 42908 -126005
9930A95805B1660b74669A55408a24112j12904j41103A84769H6162a68399O6267
$$ 195805 21660 -274669 155408 -124112 -237016 -378119 184769 86162 -168399 -102132
9920a02132k8775j17727f4751p2225B4489d3194j43691e7465A65511a0800A9177
$$ -102132 -130907 -248634 -64751 -136976 24489 -43194 -186885 -57465 165511 -10800 19177
9908a29075A87564a23945F2901d0898A5995d8969o6945B02549d6502k48552J12389
$$ -129075 187564 -123945 62901 -40898 15995 -48969 -115914 202549 -46502 -295054 -182665
9897a82665b4325A39621k7161e7913i242r6489C0076b7282B2842a42449R278F0427
$$ -182665 -24325 139621 112460 -57913 -9242 -105731 30076 -27282 22842 -142449 -133171 60427
9884D4043b33593a688l1873j91668C7505b19727n6561B91020A35829a81771A42988
$$ 44043 -233593 -1688 -33561 -225229 37505 -219727 -276288 291020 135829 -181771 142988
9872A14477R1814d3406B17196K04205a87436B94095D4009k702L2471a01343m8115
$$ 114477 206291 -43406 217196 421401 -187436 294095 44009 41307 73778 -101343 -149458
9861a49458F7903b15377p4689f8115D8651b70081c8913k43814n2323g2697j7668
$$ -149458 67903 -215377 -290066 -68115 48651 -270081 -38913 -282727 -335050 -72697 -90365
9850i0365B81455c71158J23680h9571A4892e1335I61J87058i1104E2109N338c69570
$$ -90365 281455 -371158 -247478 -89571 14892 -51335 961 188019 -91104 52109 57447 -369570
9837a29499b0344j83358F5283C1319a63067N2994m11484a60193A44326a88695
$$ -129499 -20344 -203702 65283 31319 -163067 -110073 -521557 -160193 144326 -188695
9826A93998b25151e4301j46324R7581j3738e404R41k36968a19938j3247B08122
$$ 193998 -225151 -54301 -200625 -103044 -116782 -5404 -4463 -241431 -119938 -133185 208122
9814a55716A98244r8201B3986r69f9948m8498d9736h971L624q9443L6368o3287
$$ -155716 198244 100043 23986 23017 -69948 -118446 -49736 -8971 -5347 -94790 -58422 -121709
9802a21709j23538g8565j15299O6885j69404J35312J0583K815A54515m9472c29910
$$ -121709 -245247 -78565 -193864 -126979 -296383 -161071 -150488 -147673 154515 105043 -329910
9790c34114a54396H8964a24130e7853J4186r3377L0017F8207d41949a7513p1195
$$ -334114 -154396 88964 -124130 -57853 -43667 -137044 -107027 68207 -441949 -17513 -88708
9779h8708H9454d9821E0385c8061F3481d6037A7772N0307J66018b25723a3053
$$ -88708 89454 -49821 50385 -38061 63481 -46037 17772 68079 234097 -225723 -13053
9767e6573j41285A70166b91379P4862B00361k2861b01830k9558k9864r8218A29220
$$ -56573 -197858 170166 -291379 -216517 200361 177500 -201830 -231388 -261252 -359470 129220
9755c30512a19637A73481M6724f0438j8561J7981A3404J10474f0636j31358h6838
$$ -330512 -119637 173481 220205 -60438 -78999 -61018 13404 123878 -60636 -191994 -86838
9743C3731a81465o0525h5068L510A87021a79629c0329j73372H3078b29412I1813
$$ 33731 -181465 -241990 -85068 -81558 187021 -179629 -30329 -203701 83078 -229412 91813
9731g9297j0510L5953j43626G1335K7068c27441F6203j3470J78065b14514D3553
$$ -79297 -89807 -53854 -197480 71335 98403 -327441 66203 52733 230798 -214514 43553
9719a23290M4498f790k10920a6010k11072d0022F4571c45586N6456a37559b6442
$$ -123290 -78792 -6790 -217710 -16010 -227082 -40022 64571 -345586 -289130 -137559 -26442
9707A58691K7748d34401h7825B608e6486o7227j1041A41461b33380A68947a99300
$$ 158691 186439 -434401 -87825 2608 -56486 -123713 -134754 141461 -233380 168947 -199300
9695H8944k1669K68029C9261b43615a09041L3990m4951N5914r8698j64264i4885
$$ 88944 67275 335304 39261 -243615 -109041 -75051 -120002 -64088 -162786 -327050 -94885
9683b23380f1097j4112k08428C4312d7031l7231m6106H7390C4970b923k37591
$$ -223380 -61097 -75209 -283637 34312 -47031 -84262 -130368 87390 34970 -2923 -240514
9672b40514D810M0699b04756j0904f2446j1721q8582E6497R3252a12318l52409
$$ -240514 4810 45509 -204756 -215660 -62446 -74167 -162749 56497 149749 -112318 -464727
9661d64727N3324a47797k9243l7651f3771p3559f0447A35716C6353f854j8018
$$ -464727 -411403 -147797 -177040 -214691 -63771 -137330 -60447 135716 36353 -6854 -24872
9650b4872G3695e7209p2157e6448A76146G5857h2739G125K37869b22143P4226
$$ -24872 73695 -57209 -129366 -56448 176146 75857 -82739 7125 244994 -222143 -147917
9639a47917j432N2155G7509e2428j20371P0880k35522G382c12031l243a39824
$$ -147917 -149349 -97194 77509 -52428 -172799 -101919 -337441 7382 -312031 -315274 -139824
9627A53291c06398J39078J2328I4829g6202A14854b14831P9727j0913B95728h8869
$$ 153291 -306398 -167320 -154992 94829 -76202 114854 -214831 -135104 -146017 295728 -88869
9615H5852l8264c6963k9033r4102d7072o1696B3836k178J33031c50177d5176D9488
$$ 85852 47588 -36963 -65996 -160098 -47072 -108768 23836 21658 154689 -350177 -45176 49488
9602d79857a54934c3199A03523B2248K73437a50326H6861B2933c2796n7461A8853
$$ -479857 -154934 -33199 103523 22248 295685 -150326 86861 22933 -32796 -90257 18853
9590A42522m4178L2277f2771C3218a88442h9025l44137f6345l17110E5993K2012
$$ 142522 98344 130621 -62771 33218 -188442 -89025 -433162 -66345 -383455 55993 78005
9579G8005b34588A61635o0991f4662j45640P985F9311R9708E205b7092p7415a5422
$$ 78005 -234588 161635 100644 -64662 -210302 -202317 69311 169019 5205 -27092 -104507 -15422
9566g0894k06982A37175b70800A27339c09588J41060O9393q2312l96641G6590
$$ -70894 -277876 137175 -270800 127339 -309588 -168528 -99135 -181447 -578088 76590
9555a98694A08422a41543A35558a31872l8522h1982A72121i118j87679f315B03848
$$ -198694 108422 -141543 135558 -131872 -170394 -81982 172121 -9118 -196797 -6315 203848
9543B89024j35624a81957j71403B911a96803d3394j94775N9498k56123A04512
$$ 289024 153400 -181957 -353360 2911 -196803 -43394 -238169 -178671 -434794 104512
9532a87326j8965C6192J58173h9511p3380j71572G9434M8235d07961b3161B24009
$$ -187326 -206291 36192 194365 -89511 -162891 -334463 79434 127669 -407961 -23161 224009
9520a52874E6515J4596R4726p4285i7228L3334A36199O6453c32709F7144n474
$$ -152874 56515 71111 165837 91552 -97228 -63894 136199 202652 -332709 67144 61670
9509F1670b3590l5125k71786a48004L8750A94349a53418d0295J4685H7076L9802
$$ 61670 -23590 -58715 -330501 -148004 -109254 194349 -153418 -40295 -25610 87076 126878
9498A26878i1443p2683H4862a90331B21305c97555a62186A22301a13813A01701
$$ 126878 -91443 -164126 84862 -190331 221305 -397555 -162186 122301 -113813 101701
9487a76489B36068j4856q0602F9317b88124K911a3815n0132m9325A94328H2320
$$ -176489 236068 221212 140610 69317 -288124 -285213 -13815 -63947 -113272 194328 82320
9475b9123j19916L7421j8469L531N5100k15318C65940A38401L6245c9396j52058
$$ -29123 -149039 -111618 -130087 -126556 -71456 -286774 365940 138401 174646 -39396 -191454
9464a91454N2679D71683a54374O3699a809C4242a99067a7693k8910G9288a07630
$$ -191454 -138775 471683 -154374 -90675 -1809 34242 -199067 -17693 -46603 79288 -107630
9452a36756C16409E530M0341i4827I3200c49044d8625B16723E7040b83442A20127
$$ -136756 316409 5530 45871 -94827 93200 -349044 -48625 216723 57040 -283442 120127
9440B67888e5223A76401h0594k08272a22365a7388m1007k91494P6934e5918l1613
$$ 267888 -55223 176401 -80594 -288866 -122365 -17388 -58395 -349889 -272955 -55918 -87531
9429h7531n2639C0551P208N9298a82346l8106d1153H6685b22709L472E073O4413
$$ -87531 -140170 30551 37759 97057 -182346 -220452 -41153 86685 -222709 -219237 5073 69486
9417F9486b94198g4952k3668J3573l4680D7397P8698a37171M2696J4788L5655
$$ 69486 -294198 -74952 -98620 -85047 -119727 47397 126095 -137171 -94475 -79687 -44032
9406d4032m2534o1472C2102b83316P8947D34421e8646l4357k895j35316f1725
$$ -44032 -86566 -148038 32102 -283316 -204369 434421 -58646 -93003 -95898 -231214 -61725
9394e8097A29437k5504i5374A6836c45703N5526M0819J02308H9874a30831B98261
$$ -58097 129437 103933 -95374 16836 -345703 -290177 -249358 -147050 89874 -130831 298261
9382E4144d39538R3092A6906a11747D6907K9077B9790J78937a50089A10527a46199
$$ 54144 -439538 -346446 16906 -111747 46907 75984 29790 208727 -150089 110527 -146199
9370a86467G4767a02613k18234g0629A91570c03851J45105I8918C9799g3740j89192
$$ -186467 74767 -102613 -320847 -70629 191570 -303851 -158746 98918 39799 -73740 -262932
9359b62932H3777C9272f6497k78241f7088d552k00516C51086A20706K5215K9622
$$ -262932 83777 39272 -66497 -344738 -67088 -4552 -205068 351086 120706 145921 175543
9348A75543a48504F1180c03570A99095b94088A00606a57670c4515B0112f140j03464
$$ 175543 -148504 61180 -303570 199095 -294088 100606 -157670 -34515 20112 -6140 -109604
9337a09604p3192M4848A9170R7396b13168Q0370p1730d0177n6282A8730g9421
$$ -109604 -182796 -137948 19170 116566 -213168 -132798 -204528 -40177 -96459 18730 -79421
9325b00945F212c08967B84208d9505A8715g2649l8544j8306j4632E5766B6972
$$ -200945 6212 -308967 284208 -49505 18715 -72649 -111193 -129499 -144131 55766 26972
9313A87364a35215E1298J20466E0052a99839e2686k49411R8169h2324j25540C28434
$$ 187364 -135215 51298 171764 50052 -199839 -52686 -302097 -203928 -82324 -207864 328434
9301E3214J43788D9044P546b5273j13835p836A62633a16799n2791B7827Q7583
$$ 53214 197002 49044 56590 -25273 -139108 -146944 162633 -116799 -169590 27827 115410
9290A15410a69408d4951n0454H3592O6686b7084k33814a1853D9179P3158d27127
$$ 115410 -169408 -44951 -95405 83592 150278 -27084 -260898 -11853 49179 122337 -427127
9278a88456R0027d5889k97398A6807e4387j61490B64402a17311j41742C047c5997
$$ -188456 -98429 -45889 -343287 16807 -54387 -215877 264402 -117311 -259053 3047 -35997
9266b38959E8197a1876k42410J09482B73159F8425f12866A28190b20066n6666
$$ -238959 58197 -11876 -254286 -144804 273159 68425 -612866 128190 -220066 -276732
9256b76732c4716G4b34119H2488h1789I5366a98097k98879B141R7054B4314J39242
$$ -276732 -34716 74 -234119 82488 -81789 95366 -198097 -496976 2141 99195 24314 163556
9244A63556b23149b4663l4857k23067a047k32651K559F0562e5810j43865n4334
$$ 163556 -223149 -24663 -59520 -282587 -1047 -233698 -231139 60562 -55810 -199675 -254009
9233b54009i3934A5883a68380K3034E0227a1763r9249n3013B64559g0770A00573
$$ -254009 -93934 15883 -168380 -145346 50227 -11763 -111012 -164025 264559 -70770 100573
9221b21133l7829a01803L3174j9074b8918D8946J39154a89561f3921k21721i5519
$$ -221133 -258962 -101803 -68629 -87703 -28918 48946 188100 -189561 -63921 -285642 -95519
9209a95275A70702c1355C62597a55229A3032L4758c15082f4853F8360a89322A02471
$$ -195275 170702 -31355 362597 -155229 13032 47790 -315082 -64853 68360 -189322 102471
9197b68895J10722b611l51724J76037B5714a34057A58295i5742c710j46432c4269
$$ -268895 -158173 -2611 -354335 -178298 25714 -134057 158295 -95742 -3710 -150142 -34269
9185H2069a97489j49459d7183A58455E8042a58128B2849J01305n2401H203K92853
$$ 82069 -197489 -346948 -47183 158455 58042 -158128 22849 124154 71753 8203 301056
9174C01056H001a59263o0858A76375l780n6107m6004d657m9657m0789j6157I4541
$$ 301056 8001 -159263 -220121 176375 172595 116488 70484 -4657 -54314 -95103 -111260 94541
9161A72989e6147E8012b59467A87123E6669b36366B14016f5444H318a6033l29383
$$ 172989 -56147 58012 -259467 187123 56669 -236366 214016 -65444 8318 -16033 -345416
9150c45416m6175g2760j4407A30323h3604A10450b64432Q032B04812a60087o2958
$$ -345416 -391591 -72760 -87167 130323 -83604 110450 -264432 -256400 204812 -160087 -223045
9139b23045A06407a72140A55958L1917c14123O5460o222c554F585L20737e9664
$$ -223045 106407 -172140 155958 187875 -314123 -248663 -254885 -3554 6585 327322 -59664
9127e4673G9252h4842F2440d2745k03972b496j8764B769e6218A00146a5449D1778
$$ -54673 79252 -84842 62440 -42745 -246717 -2496 -21260 2769 -56218 100146 -15449 41778
9114A82196J22031a24080e3773j2501B3302K47286a84586a4143j14374A69788
$$ 182196 304227 -124080 -53773 -66274 23302 270588 -184586 -14143 -128517 169788
9103a53361l6313d8974F1337b18473N5057d3580l1223a5955k60682E6917K4770
$$ -153361 -189674 -48974 61337 -218473 -163416 -43580 -74803 -15955 -276637 56917 81687
9092H1687a60099j37368i8061L0176A10294P8324d24125P7083A2654Q5633r010
$$ 81687 -160099 -297467 -98061 -67885 110294 188618 -424125 -347042 12654 98287 89277
9081H9277B5368h656B4714a82174D1568j8304K8693a09232C6758f7390p2086F021
$$ 89277 25368 -8656 24714 -182174 41568 23264 51957 -109232 36758 -67390 -139476 6021
9068b41142a0526l25201H4108a12328A05813B0099f5161l66450a97433A28040
$$ -241142 -10526 -335727 84108 -112328 105813 20099 -65161 -431611 -197433 128040
9057A69041b49003h6373L8379j65034j69812F5168C0271c44112G2933a88351f9746
$$ 169041 -249003 -86373 -47994 -213028 -382840 65168 30271 -344112 72933 -188351 -69746
9045a97518H3471J4697C9202b43575o940E5602b19378L540B08084J29845a79281
$$ -197518 83471 98168 39202 -243575 -250515 55602 -219378 -215838 208084 337929 -179281
9033B16289d8565m11760J77568J21180c8841A0075d0320j02045h209A4642a21264
$$ 216289 -48565 -460325 -282757 -161577 -38841 10075 -40320 -142365 -8209 14642 -121264
9021B30293a36381r4174D5539i6244c8538k19304e6228n0624j60558A62783c38147
$$ 230293 -136381 -230555 45539 -96244 -38538 -257842 -56228 -106852 -267410 162783 -338147
9009b16619j47441A12715f2043D0335g2731l83839a40338a3870l8860j92165j0513
$$ -216619 -364060 112715 -62043 40335 -72731 -456570 -140338 -13870 -52730 -244895 -255408
8998b55408R0431A65991i9437m7060D3411B0503c84528G043i4124k679E6596k4044
$$ -255408 -164977 165991 -99437 -146497 43411 20503 -384528 7043 -94124 -96803 56596 32552
8986C2552C038M1955M6688b05298A21774K36347A26152b49729J00585c2942H8254
$$ 32552 3038 44993 91681 -205298 121774 358121 126152 -249729 -149144 -32942 88254
8974b94784J37003C1922G543a44657a7251k01421J05368e3458m13973b3746k80417
$$ -294784 -157781 31922 7543 -144657 -17251 -218672 -113304 -53458 -467431 -23746 -304163
8963c04163h0259A75007K2954j1460k7237a47208j6908g4749j8120i702k47250
$$ -304163 -80259 175007 197961 186501 159264 -147208 -164116 -74749 -92869 -9702 -256952
8952b56952h2722M1127A22047f07758G4489c9762j16565k20391d8853l1391j4688
$$ -256952 -82722 -41595 122047 -607758 74489 -39762 -156327 -376718 -48853 -80244 -94932
8941i4932H4388B5584a20916D50094b15815C26456c48913A10988J91509G4948
$$ -94932 84388 25584 -120916 450094 -215815 326456 -348913 110988 302497 74948
8930c0863l95747h6894A6690a71107E7123a23213q1253M6448n6947l7255C9536
$$ -30863 -426610 -86894 16690 -171107 57123 -123213 -204466 -158018 -214965 -252220 39536
8918h4193D39185Q9541A06624k2738b11925g6272p2749J8978a9085r150l26638
$$ -84193 439185 528726 106624 83886 -211925 -76272 -149021 -130043 -19085 -28235 -354873
8907c54873p7500K16120L5074E5608P2863b87718a30332G8031b15840C8923a26170
$$ -354873 -432373 -216253 -181179 55608 128471 -287718 -130332 78031 -215840 38923 -126170
8895C92192a39932A3912i9510K9240A2100a89305G7808h2542L7004a8988n3452
$$ 392192 -139932 13912 -99510 -70270 12100 -189305 77808 -82542 -45538 -18988 -72440
8884g2440A05592a2288j79322A29692E9729a99350N6629k0887j4925e4376l83916
$$ -72440 105592 -12288 -191610 129692 59729 -199350 -142721 -163608 -178533 -54376 -438292
8873d38292J97042R8194j56375R3402c2348o8259A66560b45460C1759c28234h6372
$$ -438292 -241250 -143056 -299431 -206029 -32348 -100607 166560 -245460 31759 -328234 -86372
8861a47560M2932a2247B6669c1499k74425a5197A24303b4425j18918A92641e5322
$$ -147560 -104628 -12247 26669 -31499 -305924 -15197 124303 -24425 -143343 192641 -55322
8849f1493A64019h3483r3339O7666d9167D5832b37708J14121o5269L5866b6110
$$ -61493 164019 -83483 -176822 -109156 -49167 45832 -237708 -123587 -188856 -152990 -26110
$$ [...]
##END NTUPLES=NMR SPECTRUM
##END=
