##TITLE=NES1054_925993_9270556_EApet5ZD6d
##JCAMPDX= 6.0         $$ Bruker NMR JCAMP-DX V2.0
##DATA TYPE= NMR SPECTRUM
##DATA CLASS= NTUPLES
##ORIGIN= BRUKER
##OWNER= Administrator
$$ 1.72 TOPSPIN		Version 2.1
$$ 2015-07-11 19:28:16.019 -0700  Administrator@X
$$ Compression mode = diff/dup
##.OBSERVE FREQUENCY= 400.02188249412
##.OBSERVE NUCLEUS= ^1H
##.ACQUISITION MODE= SIMULTANEOUS (DQD)
##.ACQUISITION SCHEME= undefined
##.AVERAGES= 64
##.DIGITISER RES= 22
##SPECTROMETER/DATA SYSTEM= spect
##.PULSE SEQUENCE= noesygpps1d.comp
##.SOLVENT NAME= COFFEE_meoh
##.SHIFT REFERENCE= INTERNAL, COFFEE_meoh, 1, 14.96356
##AUDIT TRAIL= $$ (NUMBER, WHEN, WHO, WHERE, PROCESS, VERSION, WHAT)
$$ ##TITLE= Audit trail, TOPSPIN		Version 2.1
$$ ##JCAMPDX= 5.01
$$ ##ORIGIN= Bruker BioSpin GmbH
$$ ##OWNER= Administrator
$$ $$ E:\/data/COFFEE/nmr/NES1054_925993_9270556_EApet5ZD6d/12/pdata/1/auditp.txt
$$ ##AUDIT TRAIL=  $$ (NUMBER, WHEN, WHO, WHERE, PROCESS, VERSION, WHAT)
(   1,<2015-07-11 19:28:10.253 -0700>,<Administrator>,<X>,<go>,<TOPSPIN 2.1>,
      <created by zg
	started at 2015-07-11 19:16:40.816 -0700,
	POWCHK enabled, PULCHK disabled,
       configuration hash MD5:
       21 0F 79 D6 B3 7B B4 F6 88 20 88 DB 03 48 BD 9F
       data hash MD5: 64K
       22 BC 02 0B 87 B7 ED 30 73 16 B4 33 51 F4 A4 8C>)
(   2,<2015-07-11 19:28:13.847 -0700>,<Administrator>,<X>,<proc1d>,<TOPSPIN 2.1>,
      <Start of raw data processing
       efp LB = 0.3 FT_mod = 6 PKNL = 1 PHC0 = 0 PHC1 = 0 SI = 128K 
       data hash MD5: 128K
       A6 3B B5 19 36 5D C6 30 8E 81 9D A6 08 74 20 F3>)
(   3,<2015-07-11 19:28:14.738 -0700>,<Administrator>,<X>,<proc1d>,<TOPSPIN 2.1>,
      <pk PHC0 = -84.88586 PHC1 = 0 
       data hash MD5: 128K
       11 60 5B 21 39 C2 F2 7A 24 5D 07 0C DB D0 C5 58>)
(   4,<2015-07-11 19:28:15.128 -0700>,<Administrator>,<X>,<proc1d>,<TOPSPIN 2.1>,
      <abs ABSG = 1 
       data hash MD5: 128K
       D1 D1 66 7B 6E B5 5D 9B 02 A7 48 79 44 DA E6 9A>)
(   5,<2015-07-11 19:28:15.238 -0700>,<Administrator>,<X>,<proc1d>,<TOPSPIN 2.1>,
      <abs ABSG = 2 
       data hash MD5: 128K
       82 E1 29 02 AD 6D 48 2A 32 EA A4 6F E2 2B 04 86>)
(   6,<2015-07-11 19:28:15.316 -0700>,<Administrator>,<X>,<proc1d>,<TOPSPIN 2.1>,
      <abs ABSG = 3 
       data hash MD5: 128K
       EC 8F 12 1A E6 59 17 37 D8 8C EC 46 99 45 8D 3F>)
(   7,<2015-07-11 19:28:15.425 -0700>,<Administrator>,<X>,<proc1d>,<TOPSPIN 2.1>,
      <abs ABSG = 4 
       data hash MD5: 128K
       73 08 DA 2E 0A BF 86 57 2C 6E 6C 96 A0 66 A7 4F>)
(   8,<2015-07-11 19:28:15.566 -0700>,<Administrator>,<X>,<proc1d>,<TOPSPIN 2.1>,
      <abs ABSG = 5 
       data hash MD5: 128K
       2A 20 55 A9 62 2A 7F FE B5 B9 D5 2C E3 05 00 B2>)
$$ ##END=
$$ 
$$ $$ hash MD5
$$ $$ 10 87 CA 40 F0 AF 3E A0 83 F8 88 8E E6 85 2F 5A
##$RELAX= 
##$RELAX= 
##$RELAX= 
##$RELAX= 
##$RELAX= 
##$RELAX= 
##$RELAX= 
##$RELAX= 
$$ Bruker specific parameters
$$ --------------------------
##$DU= <E:\>
##$EXPNO= 12
$$ [...]
##$TP07= 0
##$TPNAME0= <>
##$TPNAME1= <>
##$TPNAME2= <>
##$TPNAME3= <>
##$TPNAME4= <>
##$TPNAME5= <>
##$TPNAME6= <>
##$TPNAME7= <>
##$TPOAL= (0..7)
0.5 0.5 0.5 0.5 0.5 0.5 0.5 0.5
##$TPOFFS= (0..7)
0 0 0 0 0 0 0 0
##$TUNHIN= 0
##$TUNHOUT= 0
##$TUNXOUT= 0
##$USERA1= <user>
##$USERA2= <user>
##$USERA3= <user>
##$USERA4= <user>
##$USERA5= <user>
##$V9= 5
##$VALIST= <valist>
##$VCLIST= <CCCCCCCCCCCCCCC>
##$VD= 0
##$VDLIST= <DDDDDDDDDDDDDDD>
##$VPLIST= <PPPPPPPPPPPPPPP>
##$VTLIST= <TTTTTTTTTTTTTTT>
##$WBST= 2048
##$WBSW= 25
##$XGAIN= (0..3)
0 0 0 0
##$XL= 0
##$YL= 0
##$YMAX_a= 8825079
##$YMIN_a= -18903038
##$ZGOPTNS= <>
##$ZL1= 120
##$ZL2= 120
##$ZL3= 120
##$ZL4= 120
##$ABSF1= 14.96356
##$ABSF2= -5.594622
##$ABSG= 5
##$ABSL= 3
##$ALPHA= 0
##$AQORDER= 0
##$ASSFAC= 0
##$ASSFACI= 0
##$ASSFACX= 0
##$ASSWID= 0
##$AUNMP= <proc_prof1d_extract.lims>
##$AXLEFT= 0
##$AXNAME= <>
##$AXNUC= <1H>
##$AXRIGHT= 0
##$AXTYPE= 0
##$AXUNIT= <>
##$AZFE= 0.1
##$AZFW= 0.1
##$BCFW= 0
##$BC_mod= 0
##$BYTORDP= 0
##$COROFFS= 0
##$CY= 15
##$DATMOD= 1
##$DC= 0
##$DFILT= <>
##$DTYPP= 0
##$F1P= 0
##$F2P= 0
##$FCOR= 0.5
##$FTSIZE= 131072
##$FT_mod= 6
##$GAMMA= 0
##$GB= 0
##$INTBC= 1
##$INTSCL= 1
##$ISEN= 128
##$LB= 0.3
##$LEV0= 0
##$LPBIN= 0
##$MAXI= 10000
##$MC2= 0
##$MEAN= 0
##$ME_mod= 0
##$MI= 0
##$NCOEF= 0
##$NC_proc= -2
##$NLEV= 6
##$NOISF1= 0
##$NOISF2= 0
##$NSP= 0
##$NTH_PI= 0
##$NZP= 0
##$OFFSET= 14.96356
##$PC= 1
##$PHC0= -84.88586
##$PHC1= 0
##$PH_mod= 1
##$PKNL= yes
##$PPARMOD= 0
##$PPDIAG= 0
##$PPIPTYP= 0
##$PPMPNUM= 2147483647
##$PPRESOL= 1
##$PSCAL= 4
##$PSIGN= 0
##$PYNMP= <proc.py>
##$REVERSE= no
##$SF= 400.020008612769
##$SI= 131072
##$SIGF1= 0
##$SIGF2= 0
##$SINO= 400
##$SIOLD= 131072
##$SPECTYP= <>
##$SREGLST= <1H.CDCl3>
##$SSB= 0
##$STSI= 131072
##$STSR= 0
##$SW_p= 8223.68421052631
##$SYMM= 0
##$S_DEV= 0
##$TDeff= 65536
##$TDoff= 0
##$TI= <>
##$TILT= no
##$TM1= 0
##$TM2= 0
##$TOPLEV= 0
##$USERP1= <user>
##$USERP2= <user>
##$USERP3= <user>
##$USERP4= <user>
##$USERP5= <user>
##$WDW= 1
##$XDIM= 131072
##$YMAX_p= 407710701
##$YMIN_p= -11558
##$CURPLOT= <Network HP LaserJet P1505>
##$CURPRIN= <$Network HP LaserJet P1505>
##$DFORMAT= <normdp>
##$LAYOUT= <+/1D_H.xwp>
##$LFORMAT= <normlp>
##$PFORMAT= <normpl>
##$SURQMSG= 1
$$ End of Bruker specific parameters
$$ ---------------------------------
##NTUPLES= NMR SPECTRUM
##VAR_NAME=  FREQUENCY,     SPECTRUM/REAL,   SPECTRUM/IMAG
##SYMBOL=    X,             R,               I
##VAR_TYPE=  INDEPENDENT,   DEPENDENT,       DEPENDENT
##VAR_FORM=  AFFN,          ASDF,            ASDF
##VAR_DIM=   131072,        131072,          131072
##UNITS=     HZ,            ARBITRARY UNITS, ARBITRARY UNITS
##FACTOR=    0.0627417313425164, 1,          1
##FIRST=     8223.62146879497, -1484,        -58096
##LAST=      0,             1186,            -59183
##MIN=       0,             -11558,          0
##MAX=       8223.62146879497, 407710701,    0
$$ Real data points
##PAGE= N=1
##DATA TABLE= (X++(R..R)), XYDATA
$$ [...]
63167G87425J6183J5200J3895J2784J1714J0590R584Q515O887M653K301n5k920
63154H96756o448r923j2528j4246j5586j6828j7909j8753j9334j9461j8883j7649
63142G09208j6193j4980j4052j3084j1934j0957j0479j0115r170p720o625o213
63130E77686n730m558l220k422j859q94R9K83nM84K026L488M078M281M658M808
63114E83203M315L809M180N299O245O467O033N107L928L064L057L796M693N378
63100F48574N803N894N595N168M987N031M972M713M443M282M139L989L852L556
63086G14998K896K127J835K195K645K538J915J310J057J030R97R51J018J275J727
63071G40514K392L273M283N246N959O342O553P003Q096R915J2134J4264J5937
$$ y = [787425, 803608, 818808, 832703, 845487, 857201, 867791, 877375, 885890, 892777, 897430, 899731, 899676, 896756, 890308, 880385, 867857, 853611, 838025, 821197, 803288, 784535, 765201, 745740, 726857, 709208, 693015, 678035, 663983, 650899, 638965, 628008, 617529, 607414, 598244, 590524, 583899, 577686, 571956, 567398, 564178, 561756, 559897, 559003, 559102, 559385, 559380, 559864, 561890, 565378, 569456, 573737, 578395, 583203, 587518, 591327, 595507, 600806, 607051, 613518, 619551, 624658, 628586, 631650, 634707, 638503, 643196, 648574, 654377, 660271, 665866, 671034, 676021, 681052, 686024, 690737, 695180, 699462, 703601, 707590, 711442, 714998, 717894, 720021, 721856, 724051, 726696, 729234, 731149, 732459, 733516, 734546, 735543, 736494, 737512, 738787, 740514, 742906, 746179, 750462, 755708, 761667, 768009, 774562, 781565, 789661, 799576, 811710, 825974, 841911]
63058H41911J7109J8107J9478K1486K3748K5691K7418K9689L2771L5755L7597
63047A130760L8486L9577M1488M3779M5777M7181M7736M7189M5944M4989M4669
63036A617575M4158M2706M0756L9175L7928L6322L4272L2376L0902K9430K7470
63025B013070K4710K0695J5109Q457J666n150j2823k1616l0403l7836m3759m8800
63013A883320n2964n5483n5931n4760n2551m9340m5015l9922l4616k9225k3558
63002A389955j7779j2421p608k802K312P177J1157J4585J8240K1942K4596K5780
62990A475134K6337K6960K7169K6337K4972K4034K3419K2231K0283J8312J6638
62979A731826J4654J1865Q581N148J196l870j0077j6953k3989l0605l6099m0141
$$ y = [841911, 859020, 877127, 896605, 918091, 941839, 967530, 994948, 1024637, 1057408, 1093163, 1130760, 1169246, 1208823, 1250311, 1294090, 1339867, 1387048, 1434784, 1481973, 1527917, 1572906, 1617575, 1661733, 1704439, 1745195, 1784370, 1822298, 1858620, 1892892, 1925268, 1956170, 1985600, 2013070, 2037780, 2058475, 2073584, 2082041, 2083707, 2078557, 2065734, 2044118, 2013715, 1975879, 1932120, 1883320, 1830356, 1774873, 1718942, 1664182, 1611631, 1562291, 1517276, 1477354, 1442738, 1413513, 1389955, 1372176, 1359755, 1352147, 1349345, 1351657, 1358834, 1369991, 1384576, 1402816, 1424758, 1449354, 1475134, 1501471, 1528431, 1555600, 1581937, 1606909, 1630943, 1654362, 1676593, 1696876, 1715188, 1731826, 1746480, 1758345, 1766926, 1772074, 1773270, 1769400, 1759323, 1742370, 1718381, 1687776, 1651677, 1611536]
62967A611536m3213m6071m8808n0757n1306n0512m8854m6655m3933m0737l7415
62956A103275l4405l1828k9452k6993k4401k1817j9486j7779j6940j6695j6308
62945H47171j5242j3668j2088j0765r712q986q637q466q185p717p177o643o210
62932G23675n995n898n571m933m431m476m817m906m677m527m723n167n686o083
62918F51785o066n534m820m299l910l391k770k176j474o04l2j95o82o68j32J27
62902F15159k67p70q78r33j571k821m054m605m305l579l075l018l057k906k784
62887E76536k799k418j280j88k98j430k171j687n14N67J415K061K332K359K572
62872E75057K784K179O72n56n52K19Q35J259J947K682K824K301J531O55l81j217
$$ y = [1611536, 1568323, 1522252, 1473444, 1422687, 1371381, 1320869, 1272015, 1225360, 1181427, 1140690, 1103275, 1068870, 1037042, 1007590, 980597, 956196, 934379, 914893, 897114, 880174, 863479, 847171, 831929, 818261, 806173, 795408, 785696, 776710, 768073, 759607, 751422, 743705, 736528, 729885, 723675, 717680, 711782, 706211, 701278, 696847, 692371, 687554, 682648, 677971, 673444, 668721, 663554, 657868, 651785, 645719, 640185, 635365, 631066, 627156, 623765, 620995, 618819, 617345, 616741, 616709, 616514, 615832, 615164, 615032, 615159, 614892, 614122, 613244, 612311, 610740, 607919, 603865, 599260, 594955, 591376, 588301, 585283, 582226, 579320, 576536, 573737, 571319, 570039, 569851, 569553, 568123, 565952, 564265, 563751, 564318, 565733, 567794, 570126, 572485, 575057, 577841, 580020, 580692, 580136, 579584, 579803, 580638, 581897, 583844, 586526, 589350, 591651, 593182, 593837, 593456, 592239]
62856E92239j388j052p64o89o16n78p52r44q45p03j009j585j743j420j360j997
62840E74794k820l168l128l230l677m220m590m731m747m828n052n197m927m293
62826E16186l795l789m032m005l552k930k375j873j373r93q43p57m16K79J048
62811D86780J489J469J201J028J196J711K327K740K877L008L477M421N742P210
62797E26676Q473R127R089Q797Q831R400J0364J1569J2928J4360J5972J8165K1109
62784F84860K4192K6480K7827K9117L1277L4392L7958M1601M5313M9131N2827
62773A084975N5997N8444O0506O2664O4761O5928O5627O4360O2689O0014N5056
62762A761021M7531L8416K8596J8128P078l959j4666k5424l6317m6290n4150n9865
$$ y = [592239, 590851, 589799, 589035, 588346, 587730, 587152, 586400, 585456, 584611, 583908, 582899, 581314, 579571, 578151, 576791, 574794, 571974, 568806, 565678, 562448, 558771, 554551, 549961, 545230, 540483, 535655, 530603, 525406, 520479, 516186, 512391, 508602, 504570, 500565, 497013, 494083, 491708, 489835, 488462, 487469, 486626, 485869, 485453, 485732, 486780, 488269, 489738, 490939, 491967, 493163, 494874, 497201, 499941, 502818, 505826, 509303, 513724, 519466, 526676, 535149, 544276, 553365, 562162, 570993, 580393, 590757, 602326, 615254, 629614, 645586, 663751, 684860, 709052, 735532, 763359, 792476, 823753, 858145, 896103, 937704, 983017, 1032148, 1084975, 1140972, 1199416, 1259922, 1322586, 1387347, 1453275, 1518902, 1583262, 1645951, 1705965, 1761021, 1808552, 1846968, 1875564, 1893692, 1900770, 1896811, 1882145, 1856721, 1820404, 1774114, 1719964, 1660099]
62750A660099o4265o7696o9799p0373o9750o8252o5921o2891n9586n6351n3134
62739I52081m9676m5877m1961l8294l5079l2198k9411k6626k3880k1129j8390
62728E89560j5987j4332j3408j2751j1923j0757r227p543o205n454m716l282j459
62715D72516k84K0M44J768L600N200O433P416Q016Q406R374J1285J3267J4314
62701E61775J4802J6059J8638K1856K4907K7641L0301L3072L6030L9113M2074
62690H66268M4680M6872M8581M9669N0182N0191M9166M6134M0959L4808K8647
62679A356157K1899J3446L584o037j4215k1108k7398l3400l9027m3945m7597m9578
62667A112781n0081m9603m8342m6325m3897m1520l9226l6824l4440l2290l0116
$$ y = [1660099, 1595834, 1528138, 1458339, 1387966, 1318216, 1249964, 1184043, 1121152, 1061566, 1005215, 952081, 902405, 856528, 814567, 776273, 741194, 708996, 679585, 652959, 629079, 607950, 589560, 573573, 559241, 545833, 533082, 521159, 510402, 501175, 493632, 487427, 481973, 477257, 473975, 472516, 472232, 472252, 472696, 474464, 478064, 483264, 489697, 497113, 505129, 513535, 522909, 534194, 547461, 561775, 576577, 592636, 611274, 633130, 658037, 685678, 715979, 749051, 785081, 824194, 866268, 910948, 957820, 1006401, 1056070, 1106252, 1156443, 1205609, 1251743, 1292702, 1327510, 1356157, 1378056, 1391502, 1395086, 1389049, 1374834, 1353726, 1326328, 1292928, 1253901, 1209956, 1162359, 1112781, 1062700, 1013097, 964755, 918430, 874533, 833013, 793787, 756963, 722523, 690233, 660117]
62656F60117k7571k4932k2754k0911j8748j6173j3766j1908j0489r554r358r686
62644D64267r829r467q929q470p922p255o805o686o557o151n556m838l940l103
62630C68759k743k749k488j763j116r70j062j031r52r59r17p76p56q71p39k15
62614C48652L51P91J475K573L538L857L800L966M460N081N894P039Q245R174R976
62599D18872J1027J2278J3431J4546J5920J7485J8880K0102K1558K3413K5419
62588F12931K7450K9708L2176L4286L5403L5452L4815L3757L2150K9686K6159
62577I63973K1600J6244J0372M174k226q556j4316j9088k2885k6016k8504k9906
62565H64866k9915k9026k8190k7819k7565k7033k6270k5304k3856k1989k0540
$$ y = [660117, 632546, 607614, 584860, 563949, 545201, 529028, 515262, 503354, 492865, 483311, 473953, 464267, 454438, 444971, 436042, 427572, 419650, 412395, 405590, 398904, 392347, 386196, 380640, 375802, 371862, 368759, 366016, 363267, 360779, 359016, 357900, 356930, 355868, 354837, 353885, 352926, 352009, 351233, 350477, 349606, 348867, 348652, 349003, 349794, 351269, 353842, 357380, 361237, 365037, 369003, 373463, 378544, 384438, 391477, 399722, 408896, 418872, 429899, 442177, 455608, 470154, 486074, 503559, 522439, 542541, 564099, 587512, 612931, 640381, 670089, 702265, 736551, 771954, 807406, 842221, 875978, 908128, 937814, 963973, 985573, 1001817, 1012189, 1016363, 1014137, 1005581, 991265, 972177, 949292, 923276, 894772, 864866, 834951, 805925, 777735, 749916, 722351, 695318, 669048, 643744, 619888, 597899, 577359]
62554E77359k0232k0566k0346j9161j7651j6333j4965j3283j1624j0405r535q749
62542C94509q075p521o718n356l766k641k248k296k394k312j827p81O73K034K803
62527C54084K866K585K586L344M790O355P500Q147Q607R168R892J0743J1750J3006
62513D55423J4468J5895J7103J8222J9555K1169K2888K4708K6792K8800K9781
62502F94804K9208K7724K6227K4529K1724J7691J3295R005M346r68o219j0627
62490H50739j4316j7690k0411k1880k2355k2730k3275k3352k2406k0635j8547
62479F23142j6446j4518j2918j1483r768p661n683m418l816l385k845k226j466
62466E26509l98Q06J623J866K081K824L815M278M051L813M141M836N366N534N390
$$ y = [577359, 557127, 536561, 516215, 497054, 479403, 463070, 448105, 434822, 423198, 412793, 403258, 394509, 386434, 378913, 372195, 366839, 363073, 360432, 358184, 355888, 353494, 351182, 349355, 348574, 349247, 351281, 354084, 356950, 359535, 362121, 365465, 370255, 376610, 384110, 392257, 400864, 410032, 419924, 430667, 442417, 455423, 469891, 485786, 502889, 521111, 540666, 561835, 584723, 609431, 636223, 665023, 694804, 724012, 751736, 777963, 802492, 824216, 841907, 855202, 864207, 868553, 867585, 861366, 850739, 836423, 818733, 798322, 776442, 754087, 731357, 708082, 684730, 662324, 641689, 623142, 606696, 592178, 579260, 567777, 558009, 550348, 544665, 540247, 536431, 533046, 530201, 527975, 526509, 526111, 526917, 528540, 530406, 532487, 535311, 539126, 543404, 547455, 551268, 555409, 560245, 565611, 571145, 576535]
62451E76535M951M355L863L273J744j153m506o893p989q706r782j0991j1816j2181
62437E20704j2194j1773j0913r908q979p918o423m511k464n53J028K194L125M138
62423D55553N362O694Q100R622J1079J2067J2360J2017J1153R938Q770P969P305
62410E77989O306M986L693K279J61k605n042o402o931p145p068o629o192o048
62396E41352n809m963l693k600j850j171l86N03J572K839M081N187O493Q302J0361
62381E60218J2296J4240J6591J9295K1938K4351K6610K8595L0164L1600L3332
62370H19230L5159L6275L6108L4749L2576K9939K7133K4315K1394J8317J5322
62359A130517J2445R069M574o28n414r350j2972j6591j9607k1452k2464k3241
$$ y = [576535, 581486, 585841, 589704, 592977, 594721, 593568, 589062, 582169, 574180, 565474, 555692, 544701, 532885, 520704, 508510, 496737, 485824, 475916, 466937, 459019, 452596, 448085, 445621, 445068, 446096, 448290, 451415, 455553, 460915, 467609, 475709, 485331, 496410, 508477, 520837, 532854, 544007, 553945, 562715, 570684, 577989, 584295, 589281, 592974, 595253, 595414, 592809, 587767, 581365, 574434, 567289, 560221, 553592, 547400, 541352, 535543, 530580, 526887, 524287, 522437, 521266, 520880, 521383, 522955, 525794, 529875, 535062, 541555, 549857, 560218, 572514, 586754, 603345, 622640, 644578, 668929, 695539, 724134, 754298, 785898, 819230, 854389, 890664, 926772, 961521, 994097, 1024036, 1051169, 1075484, 1096878, 1115195, 1130517, 1142962, 1152031, 1156605, 1155977, 1150563, 1141213, 1128241, 1111650, 1092043, 1070591, 1048127, 1024886]
62347A024886k3597k2999k1683k0645k0468k0766k0817k0279j9113j7369j5323
62336H01827j3495j2140j0886r245p335n738m696l942l381l419m207n102n372
62323G12869n267n690o862p995q473q724r524j0870j2012j2380j2024j1356j0766
62310E90926j0372r851q682o887n337m902n344n482m475k618q19L67J095J856
62296E29475K995M413N695O503O895P186P582Q023Q331Q385Q204P955P873Q041
62282F27556Q286Q333Q080P651P254O992O757O396O082O387P738R874J2118J4191
62268G43695J6314J8554K0648K2639K5097K8329L1855L5082L7979M0499M1800
62257A062491M0828L7584L3067K8011K2304J5712Q534J338n388j1233j5943j9761
$$ y = [1024886, 1001289, 978290, 956607, 935962, 915494, 894728, 873911, 853632, 834519, 817150, 801827, 788332, 776192, 765306, 756061, 748726, 742988, 738292, 734350, 730969, 727550, 723343, 718241, 712869, 707602, 701912, 695050, 687055, 678582, 669858, 660334, 649464, 637452, 625072, 613048, 601692, 590926, 580554, 570703, 562021, 555134, 549797, 544895, 539551, 534069, 529594, 526976, 526157, 526524, 527619, 529475, 532470, 536883, 542578, 549081, 555976, 563162, 570744, 578767, 587098, 595483, 603687, 611642, 619515, 627556, 635842, 644175, 652255, 659906, 667160, 674152, 680909, 687305, 693387, 699774, 707512, 717386, 729504, 743695, 760009, 778563, 799211, 821850, 846947, 875276, 907131, 942213, 980192, 1020691, 1062491, 1103319, 1140903, 1173970, 1201981, 1224285, 1239997, 1248531, 1249869, 1244481, 1233248, 1217305, 1197544]
62245A197544k3178k6211k8346k9368k9722k9763k9150k7455k5035k2763k1096
62234I05457j9857j8770j7706j6419j4578j2294j0284r234r085r075q500p300
62222G52355n939m759l642k366j140m50k77J07J274K827L944M545N325O605P862
62207G66271Q683R578J1190J3151J4461J4936J5489J6852J8769K0638K2325K3920
62195I56263K5269K6301K7386K8774K9900K9864K8499K6357K3741K0388J6187
62184A238929J1675P578M231J579n30k121k923k426m70K248M727O716Q854J1648
62170A289715J4824J7730J9910K1062K0860J9190J6347J2826R083N504K335m31
62158A448955k820m609n670o451p480q443q518p729p174p486p888p265n578l620
$$ y = [1197544, 1174366, 1148155, 1119809, 1090441, 1060719, 1030956, 1001806, 974351, 949316, 926553, 905457, 885600, 866830, 849124, 832705, 818127, 805833, 795549, 786315, 777230, 768155, 759655, 752355, 746416, 741657, 738015, 735649, 734509, 734059, 733782, 733889, 735163, 737990, 741934, 746479, 751804, 758409, 766271, 774954, 784532, 795722, 808873, 823334, 838270, 853759, 870611, 889380, 910018, 932343, 956263, 981532, 1007833, 1035219, 1063993, 1093893, 1123757, 1152256, 1178613, 1202354, 1222742, 1238929, 1250604, 1258182, 1262413, 1263992, 1263462, 1261341, 1258418, 1255992, 1255522, 1257770, 1262497, 1269213, 1278067, 1289715, 1304539, 1322269, 1342179, 1363241, 1384101, 1403291, 1419638, 1432464, 1441547, 1447051, 1449386, 1448955, 1446135, 1441526, 1435856, 1429405, 1421925, 1413482, 1404964, 1397235, 1390061, 1382575, 1374687, 1367422, 1361844, 1358224]
62144A358224j924n25O23J639K818M186N232N664O077P309R371J1542J3335J4792
62130A438363J6094J7444J9131K1150K2981K4307K5660K7738L0274L2351L3698
62119A709191L4885L6235L7396L8109L8625L9074L9156L8829L8769L9601M1022
62108B130892M2133M2476M2376M2360M2600M2886M2972M2867M2796M2939M3280
62097B600577M3747M4338M5008M5605M6060M6587M7548M9255N1884N5342N9096
62086C135047O2452O5185O7603O9780P1130P0987O9261O6249O2326N8282N5478
62075C853780N4946N6500N9107O1809O3780O4052O2103N8514N4337M9986M5501
62064D484415M1534L8962L7528L6022L4015L2391L1715L1036K9010K5514K1481
$$ y = [1358224, 1356300, 1355775, 1356398, 1358037, 1360855, 1365041, 1370273, 1375937, 1382014, 1389323, 1398694, 1410236, 1423571, 1438363, 1454457, 1471901, 1491032, 1512182, 1535163, 1559470, 1585130, 1612868, 1643142, 1675493, 1709191, 1744076, 1780311, 1817707, 1855816, 1894441, 1933515, 1972671, 2011500, 2050269, 2089870, 2130892, 2173025, 2215501, 2257877, 2300237, 2342837, 2385723, 2428695, 2471562, 2514358, 2557297, 2600577, 2644324, 2688662, 2733670, 2779275, 2825335, 2871922, 2919470, 2968725, 3020609, 3075951, 3135047, 3197499, 3262684, 3330287, 3400067, 3471197, 3542184, 3611445, 3677694, 3740020, 3798302, 3853780, 3908726, 3965226, 4024333, 4086142, 4149922, 4213974, 4276077, 4334591, 4388928, 4438914, 4484415, 4525949, 4564911, 4602439, 4638461, 4672476, 4704867, 4736582, 4767618, 4796628, 4822142, 4843623]
62053D843623J7563J3647R376M660k13m641q068j0599j3023j5928j9058k1696
62041D795643k3469k4486k5002k5286k5601k6001k6234k6034k5447k4662k3706
62030D519715k2423k0680j8481j6054j3794j1916j0092p711m571j087K252N292
62018D400450Q073J0636J3185J6082J9417K2759K5499K7354K8463K9253L0281
62007D631452L1904L3839L5217L5271L3800L0898K6496K0371J2455K961p678j8871
61995D868115l0012m0666n0513n9057o5615o9815p2004p3005p3427p3309p2428
61984D188264p0900o9295o8008o6709o4680o1845n9009n6902n5305n3464n1063
61973C511084m8426m5975m3846m1917l9820l7166l4013l0940k8310k5826k3165
$$ y = [4843623, 4861186, 4874833, 4884209, 4888869, 4888656, 4884015, 4875947, 4865348, 4852325, 4836397, 4817339, 4795643, 4772174, 4747688, 4722686, 4697400, 4671799, 4645798, 4619564, 4593530, 4568083, 4543421, 4519715, 4497292, 4476612, 4458131, 4442077, 4428283, 4416367, 4406275, 4398564, 4393993, 4392906, 4395158, 4400450, 4408523, 4419159, 4432344, 4448426, 4467843, 4490602, 4516101, 4543455, 4571918, 4601171, 4631452, 4663356, 4697195, 4732412, 4767683, 4801483, 4832381, 4858877, 4879248, 4891703, 4894664, 4886986, 4868115, 4838103, 4797437, 4746924, 4687867, 4622252, 4552437, 4480433, 4407428, 4334001, 4260692, 4188264, 4117364, 4048069, 3980061, 3913352, 3848672, 3786827, 3727818, 3670916, 3615611, 3562147, 3511084, 3462658, 3416683, 3372837, 3330920, 3291100, 3253934, 3219921, 3188981, 3160671, 3134845, 3111680]
61962C111680k0585j8394j6274j3867j1604j0090q934p170m700k336m21J545L868
61949C002718O257Q687J1573J4776J7401J9079K0500K2250K4029K5576K7447L0138
61937C230431L3214L6088L8977M2328M5970M9650N3816N8971O4840P1108P8533
61926C803926Q8285J00438J14251J29684J47557J68190J91125K16464K45400K78873
61916E484193L16472L57280M01194M48739M99850N53482O08045O61365P09557
61907A0040177P46182P62602P49345O97479O00257M55762K70014N7917j59897
61898A4219838l62800n34788o66189p53622p99439q10150p93809p58032p09705
61889H031304o55099n99062n44259m91874m42832l97887l57078l20049k86775
$$ y = [3111680, 3091095, 3072701, 3056427, 3042560, 3030956, 3020866, 3011932, 3004762, 3000062, 2997726, 2997305, 2998850, 3002718, 3008975, 3017662, 3029235, 3044011, 3061412, 3080491, 3100991, 3123241, 3147270, 3172846, 3200293, 3230431, 3263645, 3299733, 3338710, 3381038, 3427008, 3476658, 3530474, 3589445, 3654285, 3725393, 3803926, 3892211, 3992649, 4106900, 4236584, 4384141, 4552331, 4743456, 4959920, 5205320, 5484193, 5800665, 6157945, 6559139, 7007878, 7507728, 8061210, 8669255, 9330620, 10040177, 10786359, 11548961, 12298306, 12995785, 13596042, 14051804, 14321818, 14379735, 14219838, 13857038, 13322250, 12656061, 11902439, 11103000, 10292850, 9499041, 8741009, 8031304, 7376205, 6777143, 6232884, 5741010, 5298178, 4900291, 4543213, 4223164, 3936389]
61880C936389k57193k30397k05198j81597j60779j43333j28312j14433j01465
61871B413682q9904p9847p0868o2561n4703m7005l9338l2058k5586j9645j3496
61860A878671p010j063L490O909J0227J3968J7578K0209K1616K2094K1861K0896
61848B029446J9227J6953J4041J0528O920L961J892M30l78O3J932M371O385P996
61834B123767R775J1557J2389J1773J0142Q018N381K212j016l779o014p652q119
61821B168434o854m223j242J622M970R645J5748K2662K9690L6429M2638M8147
61809B367666N3070N7994O3844P1275Q0117Q9464R8563J07709J18017J30294J44355
61798C382368J59647J76226J94716K15524K38587K63981K92283L24127L59666
$$ y = [3936389, 3679196, 3448799, 3243601, 3062004, 2901225, 2757892, 2629580, 2515147, 2413682, 2323778, 2243931, 2173063, 2110502, 2055799, 2008794, 1969456, 1937398, 1911812, 1892167, 1878671, 1871661, 1870598, 1874088, 1880997, 1891224, 1905192, 1922770, 1942979, 1964595, 1986689, 2008550, 2029446, 2048673, 2065626, 2079667, 2090195, 2097115, 2101076, 2102968, 2103398, 2103020, 2103083, 2105015, 2109386, 2115771, 2123767, 2133542, 2145099, 2157488, 2169261, 2179403, 2187421, 2192802, 2195014, 2193998, 2190219, 2184205, 2176553, 2168434, 2161580, 2157357, 2156115, 2157737, 2162707, 2172352, 2188100, 2210762, 2240452, 2276881, 2319519, 2367666, 2420736, 2478730, 2542574, 2613849, 2693966, 2783430, 2881993, 2989702, 3107719, 3238013, 3382368, 3542015, 3718241, 3912957, 4128481, 4367068, 4631049, 4923332, 5247459, 5607125]
61789E607125L98777M41563M88521N40433N98351O63425P36336Q16905R04281
61780A1195717R97209J093533J189052J276495J345047J380517J366423J286424
61772B1130417J128036Q87147N72047K04866j81666n51554q73571j126664j301886
61763A9887172j401487j435699j418228j362685j281312j184854j081984r78729
61755I742194q79050p85813p00721o23915n54755m93135m39338l92727l51590
61746D521150l14564k81412k52164k26255k02939j82032j63652j47575j33110
61737B617447j19541j06577r4550q4038p5001o6543n8002m9993m3772l9717l7162
61726A842551l5482l4519l3971l3365l2744l2505l2422l1706l0221k8696k7494
$$ y = [5607125, 6005902, 6447465, 6935986, 7476419, 8074770, 8738195, 9474531, 10291436, 11195717, 12192926, 13286459, 14475511, 15752006, 17097053, 18477570, 19843993, 21130417, 22258453, 23145600, 23717647, 23922513, 23740847, 23189293, 22315722, 21189058, 19887172, 18485685, 17049986, 15631758, 14269073, 12987761, 11802907, 10720923, 9742194, 8863144, 8077331, 7376610, 6752695, 6197940, 5704805, 5265467, 4872740, 4521150, 4206586, 3925174, 3673010, 3446755, 3243816, 3061784, 2898132, 2750557, 2617447, 2497906, 2391329, 2296779, 2212741, 2137740, 2071197, 2013195, 1963202, 1919430, 1879713, 1842551, 1807069, 1772550, 1738579, 1705214, 1672470, 1639965, 1607543, 1575837, 1545616, 1516920, 1489426]
61715A489426k6130k4308k2515k1157k0041j9095j8691j8787j8715j8273j8094
61704A263620j8385j8331j7428j6389j5951j5809j5552j5653j6440j7014j6398
61693A080270j5086j4182j3624j2563j1044r985r728r722r539r140q295o837n380
61680I45145m712m571m040k987k083j448n15O48J083M16m06l54M32J101J180P83
61664I29672J98l29o97j053j545k020k244k328k473k437j902j230j236k115l164
61649I05097l732l809l628l233k721k434k535k658k168p26J470L776N623P043
61635H95365Q621J0709J2958J4798J6072J6872J7125J6661J5401J3165R737N504
61623A052988J480j734m486p079q944r532r354r220q995q140p029o584o860p073
$$ y = [1489426, 1463296, 1438988, 1416473, 1395316, 1375275, 1356180, 1337489, 1318702, 1299987, 1281714, 1263620, 1245235, 1226904, 1209476, 1193087, 1177136, 1161327, 1145775, 1130122, 1113682, 1096668, 1080270, 1065184, 1051002, 1037378, 1024815, 1013771, 1003786, 994058, 984336, 974797, 965657, 957362, 950525, 945145, 940433, 935862, 931822, 928835, 926752, 925304, 924789, 925437, 926520, 926936, 926530, 926176, 926608, 927709, 928889, 929672, 929870, 929541, 928844, 927791, 926246, 924226, 921982, 919654, 917181, 914744, 912842, 911612, 910376, 908261, 905097, 901365, 897556, 893928, 890695, 887974, 885540, 883005, 880347, 878179, 877453, 878923, 882699, 888322, 895365, 903986, 914695, 927653, 942451, 958523, 975395, 992520, 1009181, 1024582, 1037747, 1047484, 1052988, 1054468, 1052734, 1048248, 1041169, 1032225, 1022693, 1013339, 1004119, 995124, 986984, 979955, 973371, 966511, 959438]
61609I59438o959p009p410p755p821p760p599p418p746q818r649r082p600o778
61595H50034o969o879n639l817k109m55J014J607J465K053M270P022Q704R383
61581H59684J0384J2334J4554J6184J7095J7781J8926K0878K3261K5305K6787
61570A063173K8228K9969L1582L2530L2851L2847L2582L2105L1657L1250L0443
61559A409217K8924K6984K5084K3405K2049K1255K1032K1012K0910K0729K0196
61548A660797J8618J5663J1865P913L827p59n771j0573j4456j7056j8451j9014
61536A632603j8987j8289j6948j5486j4299j2930j0647p642m852k562j14L004
61524A512851O563J0294J4248J8317K2358K6941L2936M0082M7022N3178N9485
$$ y = [959438, 952479, 945470, 938060, 930305, 922484, 914724, 907125, 899707, 891961, 883143, 873494, 864412, 856812, 850034, 843065, 836186, 830547, 826730, 824621, 824166, 825180, 826787, 828252, 830305, 834575, 841597, 850301, 859684, 870068, 882402, 896956, 913140, 930235, 948016, 966942, 987820, 1011081, 1036386, 1063173, 1091401, 1121370, 1152952, 1185482, 1218333, 1251180, 1283762, 1315867, 1347524, 1378774, 1409217, 1438141, 1465125, 1490209, 1513614, 1535663, 1556918, 1577950, 1598962, 1619872, 1640601, 1660797, 1679415, 1695078, 1706943, 1714856, 1718683, 1717924, 1712153, 1701580, 1687124, 1670068, 1651617, 1632603, 1613616, 1595327, 1578379, 1562893, 1548594, 1535664, 1525017, 1517375, 1512523, 1509961, 1509847, 1512851, 1519414, 1529708, 1543956, 1562273, 1584631, 1611572, 1644508, 1684590, 1731612, 1784790, 1844275]
61513A844275O6768P4688Q2948R2333J03523J15860J28417J41472J55812J71235
61503B977331J86952K02915K19532K36236K51307K62877K69194K68107K57394
61494E131845K35870K03728J62044J12654N8509L439m8681r4607j32216j60879
61484E471706j81125j93617j98692j97113j90517j80574j68225j54201j39514
61475C868128j24762j09538r3423p7093o1652m7413l4090k1680j0268N81J1187
61464C299977K0834K8489L4231L8951M2921M5600M6803M6938M6132M4074M0969
61453C735919L7758L5224L3530L2717L2942L4035L5510L7242L9592M2774M6521
61442D143764N0449N4295N7762O0576O2682O3881O3403O0294N4279M5828L5472
$$ y = [1844275, 1911043, 1985731, 2068679, 2161012, 2264535, 2380395, 2508812, 2650284, 2806096, 2977331, 3164283, 3367198, 3586730, 3822966, 4074273, 4337150, 4606344, 4874451, 5131845, 5367715, 5571443, 5733487, 5846141, 5904650, 5908089, 5859408, 5764801, 5632585, 5471706, 5290581, 5096964, 4898272, 4701159, 4510642, 4330068, 4161843, 4007642, 3868128, 3743366, 3633828, 3540405, 3463312, 3401660, 3354247, 3320157, 3298477, 3288209, 3288790, 3299977, 3320811, 3349300, 3383531, 3422482, 3465403, 3511003, 3557806, 3604744, 3650876, 3694950, 3735919, 3773677, 3808901, 3842431, 3875148, 3908090, 3942125, 3977635, 4014877, 4054469, 4097243, 4143764, 4194213, 4248508, 4306270, 4366846, 4429528, 4493409, 4556812, 4617106, 4671385, 4717213, 4752685]
61431D752685K3559J0513l173j7130l0834m3300n3576o1384o6811o9665o9838
61420D371046o8001o5082o1164n5691m8735m1233l3826k6289j8362j0418l019
61409C939226L706R897J5564K0520K4459K7029K8063K7705K6067K3015J8724J4161
61397D178136J0426P816O136N759P607J2086J8741K7046L6936M8586O2239P8229
61385D499743R6533J16213J36073J55915J76501J98164K20083K40997K59843K75419
61375F375484K86103K90293K86626K73595K49637K14260J68936J16747O1327O105
61365H329113m6070r3145j33884j67918j95978k19605k39899k56655k69149k77465
61355F429345k82189k83113k79377k71088k59695k46407k31212k13952j95515
$$ y = [4752685, 4776244, 4786757, 4783584, 4766454, 4735620, 4692320, 4638744, 4577360, 4510549, 4440884, 4371046, 4303045, 4237963, 4176799, 4121108, 4072373, 4031140, 3997314, 3971025, 3952663, 3942245, 3939226, 3942932, 3952829, 3968393, 3988913, 4013372, 4040401, 4068464, 4096169, 4122236, 4145251, 4163975, 4178136, 4188562, 4196378, 4202514, 4208273, 4215880, 4227966, 4246707, 4273753, 4310689, 4359275, 4421514, 4499743, 4596276, 4712489, 4848562, 5004477, 5180978, 5379142, 5599225, 5840222, 6100065, 6375484, 6661587, 6951880, 7238506, 7512101, 7761738, 7975998, 8144934, 8261681, 8323008, 8329113, 8283043, 8189898, 8056014, 7888096, 7692118, 7472513, 7232614, 6975959, 6706810, 6429345, 6147156, 5864043, 5584666, 5313578, 5053883, 4807476, 4576264, 4362312, 4166797]
61346D166797j77196j59468j42082j24944j08344r2537p7671o3902n1163l9065
61336C130425k7389j6463o753J694R217J6176K2845K9274L5036L9386M1935M3012
61324C318395M3193M2837M2162M1337M0285L8693L6495L4039L1692K9621K8041
61313C726790K7142K6507K5111K2318J8583J4870J1673Q838N996K853p81m949
61301C884951r665j5173k1746k9116l6444m2959m8365n2699n6240n9559o2915
61290C450070o5503o5985o4045o0658n6578n1417m4771l7338l0114k3151j6040
61279B934470r109l158J626N522Q245R185Q597P537O409M523J275l005p724j2699
61265B951694j7660k1782k4315k5193k4501k1768j6417q675N93J0763K1659L3078
$$ y = [4166797, 3989601, 3830133, 3688051, 3563107, 3454763, 3362226, 3284555, 3220653, 3169490, 3130425, 3103036, 3086573, 3079820, 3081514, 3090731, 3106907, 3129752, 3159026, 3194062, 3233448, 3275383, 3318395, 3361588, 3404425, 3446587, 3487924, 3528209, 3566902, 3603397, 3637436, 3669128, 3698749, 3726790, 3753932, 3780439, 3805550, 3827868, 3846451, 3861321, 3872994, 3881832, 3887828, 3890681, 3889900, 3884951, 3875286, 3860113, 3838367, 3809251, 3772807, 3729848, 3681483, 3628784, 3572544, 3512985, 3450070, 3384567, 3318582, 3254537, 3193879, 3137301, 3085884, 3041113, 3003775, 2973661, 2950510, 2934470, 2925361, 2922203, 2923829, 2929351, 2937596, 2946781, 2955378, 2962915, 2969324, 2973847, 2975122, 2972117, 2964393, 2951694, 2934034, 2912252, 2887937, 2862744, 2838243, 2816475, 2800058, 2791383, 2791976, 2802739, 2824398, 2857476]
61253B857476M4773N6876O9615Q2528R4557J05162J14763J23585J30586J34033
61243C813954J32737J26151J13580R4190O7948L5990Ol8086p5744j09897j38041
61232D022788j59028j72699j79266j79458j74645j66233j55145j42282j28975
61223B565057j16280j04213r2431q1421p2178o4763n8128n1511m5189l9527l4069
61212A805347k8255k2453j7587j3779j0059n533m90L965P248R811J2127J3572
61200A753914J2909R934N944K286q03l573n725o931p779r190j1089j2740j4231
61187A712926j6567k0045k3643k6350k8243k9794l0914l1246l0854l0087k9160
61176A416023k8196k7260k6078k4209k1847j9864j8757j8011j6881j5288j3575
$$ y = [2857476, 2902249, 2959125, 3028740, 3111268, 3205825, 3310987, 3425750, 3549335, 3679921, 3813954, 3946691, 4072842, 4186422, 4280612, 4348560, 4384550, 4384556, 4346470, 4270726, 4160829, 4022788, 3863760, 3691061, 3511795, 3332337, 3157692, 2991459, 2836314, 2694032, 2565057, 2448777, 2344564, 2252133, 2170712, 2098534, 2033771, 1975643, 1924132, 1878943, 1839416, 1805347, 1777092, 1754639, 1737052, 1723273, 1713214, 1707681, 1707191, 1711156, 1718404, 1728215, 1740342, 1753914, 1766823, 1776757, 1782701, 1784987, 1784184, 1780611, 1774886, 1767955, 1760176, 1750986, 1739897, 1727157, 1712926, 1696359, 1676314, 1652671, 1626321, 1598078, 1568284, 1537370, 1506124, 1475270, 1445183, 1416023, 1387827, 1360567, 1334489, 1310280, 1288433, 1268569, 1249812, 1231801, 1214920, 1199632, 1186057]
61165A186057j1935j0545r684r266q678p668o949p420r048j1161j3476j6235j9384
61152A044608k2224k3990k4499k4181k3631k3042k1990j9959j7077j4028j1259
61141H18728q707o339m362k744j111O45K213L536M884N940N735M154K680K797
61127H28049M188N373N696N742O102O729P428Q169Q844R316R682R970R798Q855
61113I33941P469N994M018J021k417n110o929q930j1603j4045j5301j5673j6042
61100H56393j6569j6718j6202j5324j4495j3883j3422j2907j2134j1133j0197
61089G03409r548r136q712p992o840n489m507m182l950k903r10J193K546L024
61075F46003K950K578K107J803J732J668J497J510K016K842L540L866L901L836
$$ y = [1186057, 1174122, 1163577, 1153893, 1144627, 1135949, 1128281, 1121332, 1113912, 1104864, 1093703, 1080227, 1063992, 1044608, 1022384, 998394, 973895, 949714, 926083, 903041, 881051, 861092, 844015, 829987, 818728, 810021, 803682, 799320, 796576, 795465, 796110, 798323, 801859, 806743, 812683, 818418, 822572, 825252, 828049, 832237, 837610, 843306, 849048, 855150, 861879, 869307, 877476, 886320, 895636, 905318, 915288, 925086, 933941, 941410, 947404, 951422, 952443, 950026, 944916, 937987, 929057, 917454, 903409, 888108, 872435, 856393, 839824, 823106, 806904, 791580, 777085, 763202, 749780, 736873, 724739, 713606, 703409, 693861, 684725, 676013, 668021, 661181, 655692, 651185, 647003, 643053, 640150, 639240, 640433, 642979, 646003, 648953, 651531, 653638, 655441, 657173, 658841, 660338, 661848, 663864, 666706, 670246, 674112, 678013, 681849]
61061F81849L896M385N452O791P804Q204Q348Q830R749J0602J0928J0908J1069
61048G88815J1542J1972J2152J2235J2157J1406R736P746O255N371M611L710K791
61035I00499J959J230P83P43Q16O43L68L57N43O80J059K190L859N302O372P668
61019I35071R364J0842J1783J2723J4124J5686J7136J8897K1368K4187K6771K9088
61007A147040L1302L3308L5217L7697M1085M4750M8020N1116N4411N7438N9689
60996A641073O1786O4725O8213P0970P2495P3487P4706P6610Q0073Q6222R5418
60985B465778J07312J21894J39426J59374J80619K02739K25948K50175K75954
60976D129219L06181L44858L93625M51721N19960O02230P02267Q22242R66425
$$ y = [681849, 685745, 690130, 695582, 702373, 710177, 718381, 726729, 735559, 745308, 755910, 766838, 777746, 788815, 800357, 812329, 824481, 836716, 848873, 860279, 870015, 877761, 884016, 889387, 893998, 897708, 900499, 902458, 903688, 904471, 905214, 906030, 906673, 907041, 907398, 907941, 908621, 909680, 911870, 915729, 921031, 927403, 935071, 944435, 955277, 967060, 979783, 993907, 1009593, 1026729, 1045626, 1066994, 1091181, 1117952, 1147040, 1178342, 1211650, 1246867, 1284564, 1325649, 1370399, 1418419, 1469535, 1523946, 1581384, 1641073, 1702859, 1767584, 1835797, 1906767, 1979262, 2052749, 2127455, 2204065, 2284138, 2370360, 2465778, 2573090, 2694984, 2834410, 2993784, 3174403, 3377142, 3603090, 3853265, 4129219, 4435400, 4780258, 5173883, 5625604, 6145564, 6747794, 7450061, 8272303, 9238728]
60967I238728J142606J356355J606208J885366K176651K428899K538877K384407
60959B4758097J911235J203681M61725j08091l95113m03265k04859R5381L58608
60950B7677399M22128J66479l99620j123957j794560k254337k456750k442234
60942A7794548k283999k051076j795112j547243j320394j117703r40584p89727
60934E948710o62860n56083m67051l94620l36448k89438k51791k22387j98786
60925B569246j78033j59102j42514j27982j14349j01485r0073p9727o9424n9849
60915A446708n3107m9768m8059m6404m4808m3243m0631l6471l1945k8308k5330
60904I98634k2235j9169j6736j4940j3371j1825j0112p904n367l266k016j277
$$ y = [9238728, 10381334, 11737689, 13343897, 15229263, 17405914, 19834813, 22373690, 24758097, 26669332, 27873013, 28334738, 28226647, 27831534, 27428269, 27223410, 27318791, 27677399, 28099527, 28266006, 27866386, 26742429, 24947869, 22693532, 20236782, 17794548, 15510549, 13459473, 11664361, 10117118, 8796724, 7679021, 6738437, 5948710, 5285850, 4729767, 4262716, 3868096, 3531648, 3242210, 2990419, 2768032, 2569246, 2391213, 2232111, 2089597, 1961615, 1847266, 1745781, 1655708, 1575981, 1506557, 1446708, 1393601, 1343833, 1295774, 1249370, 1204562, 1161319, 1120688, 1084217, 1052272, 1023964, 998634, 976399, 957230, 940494, 925554, 912183, 900358, 890246, 882342, 876975, 873709, 871693, 870416]
60892H70416p54o33r47j383k089l732o304q811j0604j2021j3276j3811j3464j3215
60878G69372j3788j4458j4117j2837j1446j0215q878p475o239n025l595k105q34
60865F58360J96R12J084J014J493K607L410L524M005N718P812Q973R411J0248
60851G18767J1635J2933J4261J6242J8361J9194J8430J7275J6574J5782J4250
60840H93704J2323J0686R459Q573Q187Q245Q213P753P091O335N010K769J40j994
60826I86494l356m295n140n963o843p930r261j0744j2292j3803j5032j5572j5074
60813H61189j3531j1434r541q305p481o436m797k767q46O48J768K771L677M093
60799H09008L641K624J896J941K322K227J399K32q11j686k629l683m469m428l475
$$ y = [870416, 869662, 869029, 868082, 866699, 864610, 860878, 854574, 845763, 835159, 823138, 809862, 796051, 782587, 769372, 755584, 741126, 727009, 714172, 702726, 692511, 683633, 676158, 669919, 664894, 661299, 659194, 658360, 658556, 659468, 660552, 661566, 663059, 665666, 669076, 672600, 676605, 682323, 690135, 699108, 708519, 718767, 730402, 743335, 757596, 773838, 792199, 811393, 829823, 847098, 863672, 879454, 893704, 906027, 916713, 926172, 934745, 942932, 951177, 959390, 967143, 974234, 980569, 985579, 988348, 988488, 986494, 983138, 978843, 973703, 967740, 960897, 952967, 943706, 932962, 920670, 906867, 891835, 876263, 861189, 847658, 836224, 826683, 818378, 810897, 804461, 799664, 796897, 796051, 796699, 798467, 801238, 804915, 809008, 812649, 815273, 817169, 819110, 821432, 823659, 825058, 825290, 824479, 822793, 820164, 816481, 812012, 807584, 804109]
60784H04109k175j100j81R79K337L532M672O348Q767J1314J3191J3970J3656J2776
60770H92195J2344J2950J3777J3374J1480R245P476N762L712J916J009O97M17
60757I86354J00k50q41j335q23O81J833J893J898K721L234J934n50k437l589n433
60741I85390q364j1095j2697j3505j3833j3370j2340j1813j2282j3012j3253j3043
60729H36783j2435j1092r197p688p041o572n583m367l560l179k857k521k243j908
60715G56540j369n80O18K355M166N199N254N041N111N161M694L840L065K442J569
60700H03106K0k244m704o554p524q260r475j0955j1988j2473j2826j2956j2298
60687F90869j0876r336p854n985l756j940r27k75L55Q09J307K604M707O415O890
$$ y = [804109, 801934, 800834, 800653, 801632, 803969, 807501, 812173, 818521, 827288, 838602, 851793, 865763, 879419, 892195, 904539, 917489, 931266, 944640, 956120, 965365, 972841, 978603, 982315, 984231, 985240, 985937, 986354, 986454, 986204, 985363, 984028, 983205, 983886, 985719, 987612, 989510, 992231, 995465, 997399, 996849, 994412, 990823, 985390, 977026, 965931, 953234, 939729, 925896, 912526, 900186, 888373, 876091, 863079, 849826, 836783, 824348, 813256, 804059, 796371, 789330, 782758, 777175, 772808, 769248, 766069, 763212, 760691, 758448, 756540, 755171, 754591, 755209, 757564, 761730, 766929, 772183, 777224, 782335, 787496, 792190, 796030, 799095, 801537, 803106, 803126, 800882, 796178, 789624, 782100, 773840, 764365, 753410, 741422, 728949, 716123, 703167, 690869, 679993, 670657, 662803, 656818, 653062, 651122, 650195, 649920, 650275, 651084, 652391, 654995, 659702, 666117, 673007]
60672F73007O825P285Q193Q743Q710Q455Q159P893Q046Q764R325Q897P804P182
60658G87288P364P419O539N219M742N733P603R330J0417J0999J1125J0411Q642
60645H92831O332M339L030K235J827J795J847J528Q26J05m90j058j447j430j390
60630I10880k029l285m220m269l934l995m621n529o450p162p604q114q985r757
60616H30926r610q626p758p439p017n958m590l241j563O02K516L533M181N470
60602G91426P580R911J1990J3611J4514J4696J4726J5051J5254J4568J2964J1078
60590I47369R262P231M586J271k361n573p647q656r560j1173j3245j4952j5999
60577H80553j6713j7271j7350j6591j5098j3412j2148j1472j0923r919q452p017
$$ y = [673007, 679832, 687117, 695310, 704053, 712763, 721218, 729377, 737270, 745316, 754080, 763405, 772302, 780106, 787288, 794652, 802071, 808610, 813829, 818571, 824304, 831907, 841237, 851654, 862653, 873778, 884189, 892831, 899163, 903502, 906532, 908767, 910594, 912389, 914236, 915764, 916590, 916695, 916205, 915147, 913700, 912270, 910880, 908851, 905566, 901346, 897077, 893143, 889148, 884527, 878998, 872548, 865386, 857782, 849668, 840683, 830926, 821316, 812690, 804932, 797493, 790476, 784518, 779928, 776687, 775124, 775726, 778242, 781775, 785956, 791426, 799006, 808917, 820907, 834518, 849032, 863728, 878454, 893505, 908759, 923327, 936291, 947369, 956631, 963862, 968448, 969719, 967358, 961785, 954138, 945482, 935922, 924749, 911504, 896552, 880553, 863840, 846569, 829219, 812628, 797530, 784118, 771970, 760498, 749575, 739656, 731204, 724187]
60565G24187n853m778l791l213l001k518j361J24J402K332K906K949K498K039
60551G13922J991K320K875L637M365M652M623M985O030P231Q223R439J1295J3498
60537G99086J5746J8404K1780K5357K8566L1708L5231L8480M0067L9181L5875
60526A129481L0352K2880J4238N530k519r559j5137j8770k0330j9992j8027j5000
60514A083147j1727q492m794m31L656O319P627Q609R864J1176J2202J2809J2974
60501A142939J3126J4314J7293K1566K6043L0489L5588M1774M8859N6719O5503
60490A514213P5088Q5019R5177J05931J17644J30514J44900J61177J79356J99352
60480B808371K21571K46375K72676K97258L15187L20519L07202K70927K11245
$$ y = [724187, 718334, 713556, 709765, 706552, 703551, 701033, 699672, 699796, 701198, 703530, 706436, 709385, 711883, 713922, 715913, 718233, 721108, 724745, 729110, 733762, 738385, 743370, 749400, 756631, 764854, 774293, 785588, 799086, 814832, 833236, 855016, 880373, 908939, 940647, 975878, 1014358, 1054425, 1093606, 1129481, 1159833, 1182713, 1196951, 1202481, 1199962, 1190403, 1175266, 1156496, 1136166, 1116174, 1098147, 1083147, 1071420, 1062928, 1058134, 1057703, 1061359, 1067678, 1075305, 1083914, 1093778, 1104954, 1117156, 1129965, 1142939, 1156065, 1170379, 1187672, 1209238, 1235281, 1265770, 1301358, 1343132, 1391991, 1448710, 1514213, 1589301, 1674320, 1769497, 1875428, 1993072, 2123586, 2268486, 2429663, 2609019, 2808371, 3029942, 3276317, 3548993, 3846251, 4161438, 4481957, 4789159, 5060086, 5271331]
60471E271331J31974L9795n7267j50462k31181k92683l31694l48752l47300l32233
60461C351528l08434k79921k49884k20880j94476j70895j49629j30580j14251
60452A532578j00879q9776p9723o9889o0373n1971m5291m0024l5327l0828k6830
60441I01667k3451k0307j7402j5470j4758j4188j2612j0428q936q426p926o760
60429G41003n308m129l223k373j552p60j0N08O95R43J669K506K706K325K267L014
60413G40281L949M215L676K802K066J667J482J133M30l25o94p16p05o23k72R3
60397G58459J6k64P6J284K599L216L125K802K611K735L245L963M495M663M622
60382G97647M539M387M121L762L279K674K169J979K043K158K339K623K712K298
$$ y = [5271331, 5403305, 5443100, 5385833, 5235371, 5004190, 4711507, 4379813, 4031061, 3683761, 3351528, 3043094, 2763173, 2513289, 2292409, 2097933, 1927038, 1777409, 1646829, 1532578, 1431699, 1341923, 1262200, 1192311, 1131938, 1079967, 1034676, 994652, 959325, 928497, 901667, 878216, 857909, 840507, 825037, 810279, 796091, 783479, 773051, 764115, 755689, 747763, 741003, 735695, 731566, 728343, 725970, 724418, 723658, 723648, 724156, 724851, 725794, 727463, 729969, 732675, 735000, 737267, 740281, 744230, 748445, 752121, 754923, 756989, 758656, 760138, 761271, 761701, 761376, 760682, 759966, 759261, 758638, 758366, 758459, 758475, 758211, 758287, 759571, 762170, 765386, 768511, 771313, 773924, 776659, 779904, 783867, 788362, 793025, 797647, 802186, 806573, 810694, 814456, 817735, 820409, 822578, 824557, 826600, 828758, 831097, 833720, 836432, 838730]
60368H38730J560R96P99Q21R96J316J602J754K036K677L381L781M061M578N148
60353H74236N455N816O773Q061Q935R381J0039J0981J1549J1544J1563J1939J2242
60340I98514J2097J1629J0799R207O902M615K730P81j541l629m730m869m470l644
60326A034391k321p11Q60K152K814K455J249n5j081k179l533m625n091n419o100
60311A012806o696o562o036n951o189n653l827j545J6O07P66Q49P25K73k03l74
60295I73006l94p32j487k178k415k361k316k132j519o27J59Q25J616K455L096
60280I64996L733M842O372P774Q834R842J0847J1517J1911J2659J4048J5519J6492
60267A099386J7189J8280K0125K2663K5590K8464L1014L3538L6576M0064M3402
$$ y = [838730, 840290, 841286, 842085, 842906, 843902, 845218, 846820, 848574, 850610, 853287, 856668, 860449, 864510, 869088, 874236, 879691, 885507, 892280, 900341, 909276, 918657, 928696, 939677, 951226, 962770, 974333, 986272, 998514, 1010611, 1022240, 1033039, 1042246, 1049148, 1053763, 1056493, 1057274, 1055733, 1052104, 1047374, 1042505, 1038035, 1034391, 1032070, 1031359, 1032219, 1034371, 1037185, 1039640, 1040889, 1040834, 1039753, 1037574, 1034041, 1029416, 1024325, 1018906, 1012806, 1006110, 999548, 993512, 987561, 981372, 975719, 971892, 970347, 970363, 970970, 971736, 972585, 973310, 973583, 973380, 973006, 972612, 971880, 970393, 968215, 965800, 963439, 961123, 958991, 957472, 956845, 957004, 957829, 959445, 961900, 964996, 968729, 973571, 979943, 987717, 996551, 1006393, 1017240, 1028757, 1040668, 1053327, 1067375, 1082894, 1099386, 1116575, 1134855, 1154980, 1177643, 1203233, 1231697, 1262711, 1296249, 1332825, 1372889, 1416291]
60256A416291M6520N0059N4258N8419O2120O6174P1563P7920Q3894Q8899R3649
60245B169766R8999J04833J10249J14410J17065J18461J18800J17726J14474J08688
60235C293471J00842R1639Q1235O9373N6108M2038K7815J3744j09j3466k5590
60224C737100l5502m2546m6724m8391m7726m4748l9654l2790k4283j4118k626
60213C357992R543K2017L4855M7990O1015P3730Q6433R9196J11155J20885J27538
60202D152349J31337J32898J32201J28312J20273J08228R3372P6734N8463L8627
60192E172794J8104k020k1585m0934n9537p5972q9326r9815j07745j12684j13941
60181D467339j11148j04149r3102p9040o3528m7375l0317j2312N701K2905L9522
$$ y = [1416291, 1462811, 1512870, 1567128, 1625547, 1687667, 1753841, 1825404, 1903324, 1987218, 2076117, 2169766, 2268765, 2373598, 2483847, 2598257, 2715322, 2833783, 2952583, 3070309, 3184783, 3293471, 3394313, 3485952, 3567187, 3636560, 3692668, 3734706, 3762521, 3776265, 3776156, 3762690, 3737100, 3701598, 3659052, 3612328, 3563937, 3516211, 3471463, 3431809, 3399019, 3374736, 3360618, 3357992, 3367535, 3389552, 3424407, 3472397, 3533412, 3607142, 3693575, 3792771, 3903926, 4024811, 4152349, 4283686, 4416584, 4548785, 4677097, 4797370, 4905598, 4998970, 5075704, 5134167, 5172794, 5190898, 5188878, 5167293, 5126359, 5066822, 4990850, 4901524, 4801709, 4693964, 4581280, 4467339, 4356191, 4252042, 4158940, 4079900, 4016372, 3968997, 3938680, 3926368, 3932069, 3954974, 3994496]
60170C994496N5893P1183Q3988R3716J00502J04041J03513R8681R0256P9094O5572
60159D940935M9877L2385J3766m772k1425l4623m4072n0431n3711n2651m6129
60148D729149l4783k0619n169J1410K9486M8959O9484R1101J13972J37801J62138
60137E332929J87142K13266K40121K66477K91630L15861L39104L60017L77161
60128G923708L90303L99581M04014M01921L92549L76096L52425L21051K82486
60119A1244134K38423J90255J38463Q3643K7098l0003q7038j43055j96237k44705
60109A1220978k87081l21893l47326l62213l66712l61552l47309l24910k96256
60100H205726k63615k28721j92733j56555j20772q5743n2066k0441R057L6830
$$ y = [3994496, 4050389, 4121572, 4205560, 4299276, 4399778, 4503819, 4607332, 4706013, 4796269, 4875363, 4940935, 4990812, 5023197, 5036963, 5032191, 5010766, 4976143, 4932071, 4881640, 4827929, 4775278, 4729149, 4694366, 4673747, 4668578, 4679988, 4709474, 4758433, 4827917, 4919018, 5032990, 5170791, 5332929, 5520071, 5733337, 5973458, 6239935, 6531565, 6847426, 7186530, 7546547, 7923708, 8314011, 8713592, 9117606, 9519527, 9912076, 10288172, 10640597, 10961648, 11244134, 11482557, 11672812, 11811275, 11894918, 11922016, 11892013, 11804975, 11661920, 11465683, 11220978, 10933897, 10612004, 10264678, 9902465, 9535753, 9174201, 8826892, 8501982, 8205726, 7942111, 7713390, 7520657, 7364102, 7243330, 7157587, 7105521, 7085080, 7094137, 7130967]
60090G130967O2558Q4856J02517J15239J22632J23412J16435J02009Q1500N6181
60080H098306K7228l615l4241o3017q9105j12258j32700j50780j66347j78862
60070G194609j88242j94944j98754j98457j93375j84568j73658j61106j46547
60061E554958j30262j13156r5477p6674n6649l6320j6624K392K1309M0475N9652
60050E153624P8180R5413J10897J24075J33877J39091J39226J34625J25546J11783
60040F346337R3434P1502M7191K1130o293l4241o1609q7554j11345j32025j48640
60029E997887j60596j67550j69390j66577j60016j50180j36986j20893j03401
60020D662298q5810o8066m9540l0416j1451P327K6711M7134O8024Q8452J07980
$$ y = [7130967, 7193525, 7278381, 7380898, 7496137, 7618769, 7742181, 7858616, 7960625, 8042125, 8098306, 8125534, 8121919, 8087678, 8024661, 7935556, 7823298, 7690598, 7539818, 7373471, 7194609, 7006367, 6811423, 6612669, 6414212, 6220837, 6036269, 5862611, 5701505, 5554958, 5424696, 5311540, 5216063, 5139389, 5082740, 5046420, 5029796, 5032188, 5053497, 5093972, 5153624, 5231804, 5327217, 5438114, 5562189, 5696066, 5835157, 5974383, 6109008, 6234554, 6346337, 6439771, 6511273, 6558464, 6579594, 6573301, 6539060, 6477451, 6389897, 6278552, 6146527, 5997887, 5837291, 5669741, 5500351, 5333774, 5173758, 5023578, 4886592, 4765699, 4662298, 4576488, 4508422, 4458882, 4428466, 4417015, 4424342, 4451053, 4498187, 4566211, 4654663, 4762643]
60009D762643J26814J45279J63084J79031J91670K00235K04495K03775J96968
60000F373994J83695J64679J40732J12311Q0565M7702J5514j5854m6906p7227
59990F979205j05558j30618j51042j65265j72550j73706j69948j61640j49035
59981E599843j33505j16786r9317q0513o0394l9952j9917l28J8739L6923N4164
59970E158957P0700Q6360J00442J12321J21662J28102J31201J30672J26384J18429
59960F285230J07570R5111Q1799O7427N2015L6797K3287J1955K668m076p308o456
59948F746019j156R288K5167M5499O8975R5458J25426J58362J92951K28761K66346
59937G961096L05597L45113L83226M18505M49028M72218M85658M87190M74051
$$ y = [4762643, 4889457, 5034736, 5197820, 5376851, 5568521, 5768756, 5973251, 6177026, 6373994, 6557689, 6722368, 6863100, 6975411, 7055976, 7103678, 7119192, 7103338, 7056432, 6979205, 6873647, 6743029, 6591987, 6426722, 6254172, 6080466, 5910518, 5748878, 5599843, 5466338, 5349552, 5250235, 5169722, 5109328, 5069376, 5049459, 5049131, 5067870, 5104793, 5158957, 5229657, 5316017, 5416459, 5528780, 5650442, 5778544, 5909745, 6040417, 6166801, 6285230, 6392800, 6487911, 6569710, 6637137, 6689152, 6725949, 6749236, 6761191, 6763859, 6759783, 6752475, 6746019, 6744863, 6754151, 6779318, 6824817, 6893792, 6989250, 7114676, 7273038, 7465989, 7694750, 7961096, 8266693, 8611806, 8995032, 9413537, 9862565, 10334783, 10820441, 11307631, 11781682]
59928A1781682M43097L92479L22774K36446J37195L0087p8503j81881k74156l50963
59918A2458257m09939m50627m73517m79373m69922m48565m19262l84628l45871
59909H576553l04322k61923k20153j79471j39965j01757o4637k8202P463M1743
59899G325329P4255J04919J33325J58674J80255J97190K07834K10224K03079J85693
59889H980777J57270J17601O8468J3293m4740j03278j59621k10309k52430k84520
59879H282511l05979l16662l17508l10658k98368k82247k63710k44314k25348
59870E717717k07713j92327j79941j70341j62515j55695j49546j43324j35974
59861D220341j27329j18161j08690r8022q5606p2276n9242m6905l5313k5019j6631
$$ y = [11781682, 12224779, 12617258, 12940032, 13176478, 13313673, 13343760, 13265257, 13083376, 12809220, 12458257, 12048318, 11597691, 11124174, 10644801, 10174879, 9726314, 9307052, 8922424, 8576553, 8272231, 8010308, 7790155, 7610684, 7470719, 7368962, 7304325, 7276123, 7283586, 7325329, 7399584, 7504503, 7637828, 7796502, 7976757, 8173947, 8381781, 8592005, 8795084, 8980777, 9138047, 9255648, 9324116, 9337409, 9292669, 9189391, 9029770, 8819461, 8567031, 8282511, 7976532, 7659870, 7342362, 7031704, 6733336, 6451089, 6187379, 5943065, 5717717, 5510004, 5317677, 5137736, 4967395, 4804880, 4649185, 4499639, 4356315, 4220341, 4093012, 3974851, 3866161, 3768139, 3682533, 3610257, 3551015, 3504110, 3468797, 3443778, 3427147]
59850C427147j0108n339l118m696j0373j8913k8322l6919m3806m8664n1233n1185
59838C114471m8541m3912l7949l0844k2817j4677p146J58Q154J6853K5301L2973
59826B992024M0325M7799N5177O2101O8390P3551P6767P7691P6690P3996O9252
59815C713763O2216N3402M3784L4213K5155J6653Q688K005j700j111L478J0913
59803C971459K0742L3007M6918O1131P5303R0190J06200J23292J42406J65488
59793D836136J93475K25478K60304K97437L35729L72156M02331M21083M21817
59784G765946L97002L41280K54853J44236K0917j00657k06222k85805l36158l59595
59774G635797l61116l46451l21121k89519k54593k18633j83735j51103j20652
$$ y = [3427147, 3417039, 3411700, 3408582, 3403886, 3393513, 3374600, 3346278, 3309359, 3265553, 3216889, 3165656, 3114471, 3065930, 3022018, 2984069, 2953225, 2930408, 2915731, 2908585, 2908743, 2916897, 2933750, 2959051, 2992024, 3032349, 3080148, 3135325, 3197426, 3265816, 3339367, 3416134, 3493825, 3570515, 3644511, 3713763, 3775979, 3829381, 3873165, 3907378, 3932533, 3949186, 3957874, 3959879, 3958179, 3957068, 3960546, 3971459, 3992201, 4025208, 4072126, 4133257, 4208560, 4298750, 4404950, 4528242, 4670648, 4836136, 5029611, 5255089, 5515393, 5812830, 6148559, 6520715, 6923046, 7344129, 7765946, 8162948, 8504228, 8759081, 8903317, 8924234, 8823577, 8617355, 8331550, 7995392, 7635797, 7274681, 6928230, 6607109, 6317590, 6062997, 5844364, 5660629, 5509526, 5388874]
59765E388874r2085o5938m2900k2620l880J4239L1849M8655O4551P9998R5956
59754E496699J13044J30865J48648J66508J85311K05321K25959K47134K69692
59745G189181K94251L20587L48580L78700M10961M44380M78172N12515N47392
59736A0924719N81295O11774O36382O52575O57612O49664O28657N95633N52204
59727A6490515N01498M48765L99948L59867L32105L19467L23285L42683L75504
59718A9893637M19773M73472N33435N95334O54581P06573P46564P70156P73874
59709B5567399P54798P10342O39520N44635M31305L06984J79675N7207n3369j46179
59699B8992317k16420k60607k77530k68613k36829j85405j17617l6920N3602J51727
$$ y = [5388874, 5296789, 5230851, 5187951, 5165331, 5161451, 5175690, 5207539, 5256194, 5320745, 5400743, 5496699, 5609743, 5740608, 5889256, 6055764, 6241075, 6446396, 6672355, 6919489, 7189181, 7483432, 7804019, 8152599, 8531299, 8942260, 9386640, 9864812, 10377327, 10924719, 11506014, 12117788, 12754170, 13406745, 14064357, 14714021, 15342678, 15938311, 16490515, 16992013, 17440778, 17840726, 18200593, 18532698, 18852165, 19175450, 19518133, 19893637, 20313410, 20786882, 21320317, 21915651, 22570232, 23276805, 24023369, 24793525, 25567399, 26322197, 27032539, 27672059, 28216694, 28647999, 28954983, 29134658, 29191865, 29138496, 28992317, 28775897, 28515290, 28237760, 27969147, 27732318, 27546913, 27429296, 27392376, 27445978, 27597705]
59689B7597705K55668L63777M74986N88797P03901Q17117R24122J020402J100382
59680C3846857J155839J176131J150329J069322R27284P23386M63738J62173j60977
59671D0514082m81855p77040j027347j220085j349465j416173j426688j391893
59663C1423536j325239j241577j156555j085028j037990j019980j028377j054371
59655B2474419j085334j108773j116374j105413j077124j034610r81889r23016
59647A4041886q60870p97186p33859o73184o16443n63316n13306m66789m24116
59638H392817l84824l48388l14838k83906k54636k26669k00919j78085j57428
59629F043124j37936j19768j03549q9107p5998o4609n5583m8807m3937m1421m2002
$$ y = [27597705, 27853373, 28217150, 28692136, 29280933, 29984834, 30801951, 31726073, 32746475, 33846857, 35002696, 36178827, 37329156, 38398478, 39325762, 40049148, 40512886, 40675059, 40514082, 40032227, 39255187, 38227840, 37007755, 35658290, 34242117, 32815429, 31423536, 30098297, 28856720, 27700165, 26615137, 25577147, 24557167, 23528790, 22474419, 21389085, 20280312, 19163938, 18058525, 16981401, 15946791, 14964902, 14041886, 13181016, 12383830, 11649971, 10976787, 10360344, 9797028, 9283722, 8816933, 8392817, 8007993, 7659605, 7344767, 7060861, 6806225, 6579556, 6378637, 6200552, 6043124, 5905188, 5785420, 5681871, 5592764, 5516766, 5452157, 5396574, 5347767, 5303830, 5262409, 5220407]
59618E220407m5726n2141o0830p0950q0932q9557r6726j02457j06037j07012j06081
59607D301958j03877r9851r3477q5683p7749o9510o0143n0035m0378l1355k2274
59596C567626j3186m928K239Q772J4662J9361K2819K5507K7497K8512K8822K9065
59584C756768K9362K9488K9725L0640L2302L4621L8099M3299M9864N7066O4940
59573D196174P3882Q3551R3355J03676J15441J28604J42317J56436J71707J88544
59563E453687K06589K25476K45031K64755K84003L02514L20043L35713L48550
59554G986361L58265L64572L66345L62593L53909L41786L26902L09322K90023
59545A1060078K70725K52290K34581K17920K03445J92018J83774J78427J74874
$$ y = [5220407, 5174681, 5122540, 5061710, 4990760, 4909828, 4820271, 4723545, 4621088, 4515051, 4408039, 4301958, 4198081, 4098230, 4004753, 3919070, 3841321, 3771811, 3711668, 3661633, 3621255, 3589900, 3567626, 3554440, 3549512, 3551751, 3560523, 3575185, 3594546, 3617365, 3642872, 3670369, 3698881, 3727703, 3756768, 3786130, 3815618, 3845343, 3875983, 3908285, 3942906, 3981005, 4024304, 4074168, 4131234, 4196174, 4270056, 4353607, 4446962, 4550638, 4666079, 4794683, 4937000, 5093436, 5265143, 5453687, 5660276, 5885752, 6130783, 6395538, 6679541, 6982055, 7302098, 7637811, 7986361, 8344626, 8709198, 9075543, 9438136, 9792045, 10133831, 10460733, 10770055, 11060078, 11330803, 11583093, 11817674, 12035594, 12239039, 12431057, 12614831, 12793258, 12968132]
59536A2968132J70745J63835J53897J41696J26307J04801P4723L5440j2914p0023
59526A3856639j34288k02419k70847l36654l96797m47714m86526n12106n24673
59517A0544615n25157n15296m97594m74539m48146m20170l92009l64244l36819
59508F570641l09648k82673k55621k28620k02725j78989j57176j36289j16079
59499D702821r7012p9081o1818m5331l0021j5354j59J5762L1567M6988O2696P8963
59487D610021R5243J11443J28318J46162J64274J82166K00305K19040K37704K55199
59477F349875K70751K83542K92243K95295K91269K78761K56561K24046J81239
59468H723582J28762O8440L607o2008j25531j84490k35859k76971l07239l27855
$$ y = [12968132, 13138877, 13302712, 13456609, 13598305, 13724612, 13829413, 13904136, 13939576, 13926662, 13856639, 13722351, 13519932, 13249085, 12912431, 12515634, 12067920, 11581394, 11069288, 10544615, 10019458, 9504162, 9006568, 8532029, 8083883, 7663713, 7271704, 6907460, 6570641, 6260993, 5978320, 5722699, 5494079, 5291354, 5112365, 4955189, 4818900, 4702821, 4605809, 4526728, 4464910, 4419579, 4389558, 4374204, 4374045, 4389807, 4421374, 4468362, 4531058, 4610021, 4705264, 4816707, 4945025, 5091187, 5255461, 5437627, 5637932, 5856972, 6094676, 6349875, 6620626, 6904168, 7196411, 7491706, 7782975, 8061736, 8318297, 8542343, 8723582, 8852344, 8920784, 8924391, 8862383, 8736852, 8552362, 8316503, 8039532, 7732293, 7404438]
59458G404438l39892l43800l40500l31541l18043l00606k80334k58793k37014
59449D653915k15545j95283j76973j60084j43584j27688j13412j00544q7774p4882
59439C258146o3085n2955m3715l4968k7400k1129j4983q201j523M112Q782J2895
59427C015976J6443J9510K2425K5054K7056K9092L2388L6813M0948M4502M9020
59416C359227N5631O3736P2599Q2363R2445J00776J06293J11010J18127J28996
59406D291203J43144J60317J80855K04604K30857K59266K89853L22244L55560
59397F437903L89020M22427M56451M92466N31225N71190O08660O39533O60226
59388A1209101O67327O58274O33157N94745N46189M89830M28563L66531L07304
$$ y = [7404438, 7064546, 6720746, 6380246, 6048705, 5730662, 5430056, 5149722, 4890929, 4653915, 4438370, 4243087, 4066114, 3906030, 3762446, 3634758, 3521346, 3420802, 3333028, 3258146, 3195061, 3142106, 3098391, 3063423, 3036023, 3014894, 2999911, 2991710, 2990187, 2994299, 3003081, 3015976, 3032419, 3051929, 3074354, 3099408, 3126464, 3155556, 3187944, 3224757, 3265705, 3310207, 3359227, 3414858, 3478594, 3551193, 3633556, 3726001, 3826777, 3933070, 4044080, 4162207, 4291203, 4434347, 4594664, 4775519, 4980123, 5210980, 5470246, 5760099, 6082343, 6437903, 6826923, 7249350, 7705801, 8198267, 8729492, 9300682, 9909342, 10548875, 11209101, 11876428, 12534702, 13167859, 13762604, 14308793, 14798623, 15227186, 15593717, 15901021]
59379A5901021K52407K02286J57260J16428P6948L5845q184n5595j07353j64052
59369A6407011k24362k85401l43841l95638m35824m60352m68094m60283m38696
59360A2894520m05579l64831l21820k81771k48670k25111k12144k09334k15576
59351A0409684k29651k49716k72804k95484l14733l28122l34096l32717l25426
59342G726935l13441k96936k76133k52366k27358k02193j77547j54033j31601
59333E695327j09328q6647o4195m2946k3210m955J1756K7268M2301N6668O8826
59322E570865P7470Q2726Q5082Q4048P8847O9656N7245M2025K4300M889j5132
59311F162021l4811n2928o8107p9902q8893r5174r7739r6053r1055q3818p4350
$$ y = [15901021, 16153428, 16355714, 16512974, 16629402, 16706350, 16742195, 16734011, 16678416, 16571063, 16407011, 16182649, 15897248, 15553407, 15157769, 14721945, 14261593, 13793499, 13333216, 12894520, 12488941, 12124110, 11802290, 11520519, 11271849, 11046738, 10834594, 10625260, 10409684, 10180033, 9930317, 9657513, 9362029, 9047296, 8719174, 8385078, 8052361, 7726935, 7413494, 7116558, 6840425, 6588059, 6360701, 6158508, 5980961, 5826928, 5695327, 5585999, 5499352, 5435157, 5392211, 5369001, 5364046, 5375802, 5403070, 5445371, 5502039, 5570865, 5648335, 5731061, 5816143, 5900191, 5979038, 6048694, 6105939, 6147964, 6172264, 6177153, 6162021, 6127210, 6074282, 6006175, 5926273, 5837380, 5742206, 5644467, 5548414, 5457359, 5373541, 5299191]
59300E299191o2664m9794l6493k1963n214J3135L1730N0370O9602Q9104J07897
59289E484901J25787J43247J60206J76060J90532K03389K13517K19397K20318
59280G137354K16292K07100J92368J72474J48577J21992R4066O6216L9385J3926
59270H409750r465k9431m5349n8358p0159q1356r1709j01286j10424j19208j27925
59259G565080j37258j46996j55080j58967j57543j50931j39189j22385j01395
59250F295336p7471n1240k2945O935L8135P1129J06296J43086J80917K20155K61068
59239G171401L02394L41941L77982M08855M31754M43182M40367M21380L84542
59230A0723798L29168K56781J70581P4037k9096j33982k35144l27708m07497m70739
$$ y = [5299191, 5236527, 5186733, 5150240, 5128277, 5123063, 5136198, 5167928, 5218298, 5287900, 5377004, 5484901, 5610688, 5753935, 5914141, 6090201, 6280733, 6484122, 6697639, 6917036, 7137354, 7353646, 7560746, 7753114, 7925588, 8074165, 8196157, 8290223, 8356439, 8395824, 8409750, 8400285, 8370854, 8325505, 8267147, 8196988, 8115632, 8023923, 7922637, 7812213, 7693005, 7565080, 7427822, 7280826, 7125746, 6966779, 6809236, 6658305, 6519116, 6396731, 6295336, 6217865, 6166625, 6143680, 6150615, 6188750, 6259879, 6366175, 6509261, 6690178, 6910333, 7171401, 7473795, 7815736, 8193718, 8602573, 9034327, 9477509, 9917876, 10339256, 10723798, 11052966, 11309747, 11480328, 11554365, 11525269, 11391287, 11156143, 10828435, 10420938, 9950199]
59220I950199n15055n40685n49731n44396n26745m99576m66250m29629l91863
59211E486269l54749l19354k85696k53736k24350j98376j75247j53669j33336
59202C387756j14980r8950q4841p2280o1182n1318m2450l4691k8161k2518j7421
59191B758964j2968r143n411j388K772P146J2291J8057K3303K7639L2373L8598
59179B892233M5435N1416N6623O2101O8115P4390Q1208Q8790R6293J02849J08870
59168C728323J14999J20530J24342J26418J26888J24494J17876J07628R5299Q0939
59158D867736O3627M3808K3103K266j8725l8807n6142p0168q1419q9555r3607
59147D552117r4019r2423q9193q3203p4225o3677n2664m0981k8482j5739k982
$$ y = [9950199, 9435144, 8894459, 8344728, 7800332, 7273587, 6774011, 6307761, 5878132, 5486269, 5131520, 4812166, 4526470, 4272734, 4048384, 3850008, 3674761, 3521092, 3387756, 3272776, 3173826, 3088985, 3016705, 2955523, 2904205, 2861755, 2827064, 2798903, 2776385, 2758964, 2745996, 2736853, 2731442, 2730054, 2732826, 2739972, 2752263, 2770320, 2793623, 2821262, 2853635, 2892233, 2937668, 2989084, 3045707, 3107808, 3175923, 3250313, 3331521, 3420311, 3516604, 3619453, 3728323, 3843322, 3963852, 4088194, 4214612, 4341500, 4465994, 4583870, 4691498, 4786797, 4867736, 4931363, 4975171, 4998274, 5000540, 4981815, 4943008, 4886866, 4816698, 4735279, 4645724, 4552117, 4458098, 4365675, 4276482, 4193279, 4119054, 4055377, 4002713, 3961732, 3933250, 3917511, 3914529]
59136C914529J0210K3783L7135N0329O4043P8262R2454J07015J23012J40461J58455
59125D799688J77003J97047K18529K40222K61735K83838L06425L27817L46498
59116G158802L61816L72482L75956L69884L52664L22384K77134K17288J46037
59107I954447O7118j6544j01336j81916k52995l11335l55628l85784m03156m10247
59097G602624m09221m01403l88414l72557l55364l36913l17099k96546k75844
59088D449263k55072k34654k15516j97854j80907j64494j49560j36625j24953
59079B789628j13925j03991r5452q7484p9380p1708o5238n9539n3695m7809m2815
59068A968592l9136l6314l3684l0894k8037k5633k4205k3708k3648k3727k3846
$$ y = [3914529, 3924739, 3948522, 3985657, 4035986, 4100029, 4178291, 4270745, 4377760, 4500772, 4641233, 4799688, 4976691, 5173738, 5392267, 5632489, 5894224, 6178062, 6484487, 6812304, 7158802, 7520618, 7893100, 8269056, 8638940, 8991604, 9313988, 9591122, 9808410, 9954447, 10021565, 10005021, 9903685, 9721769, 9468774, 9157439, 8801811, 8416027, 8012871, 7602624, 7193403, 6792000, 6403586, 6031029, 5675665, 5338752, 5021653, 4725107, 4449263, 4194191, 3959537, 3744021, 3546167, 3365260, 3200766, 3051206, 2914581, 2789628, 2675703, 2571712, 2476260, 2388776, 2309396, 2237688, 2172450, 2112911, 2059216, 2011407, 1968592, 1929456, 1893142, 1859458, 1828564, 1800527, 1774894, 1750689, 1726981, 1703333, 1679606, 1655760]
59057A655760k3608k2552k0874j9191j7644j6000j4505j3659j3185j2180j0449
59046A471913q758p666o907n916m210j311K772P130J0844J4105J7525K0808K3299
59033A533628K5337K7553K9079K8195K4789K0592J6805J3095R145N551K787P28
59021A737284m17j8J717L648N252P053R300J1539J3674J6050J8217J8983J7967
59008A860249J5795J2657Q216L087j278m495p506j0491j2334j2527j1912j0948
58996A828513r026o214l943k980k223m06K262M971P512R832J1596J2927J4449
58983A867270J6053J6915J7164J8078K0054K1918K2933K4012K6145K9086L2382
58972B112010L6285M0741M4831M8088N1145N4368N7120N8990O0477O1713O2059
$$ y = [1655760, 1632152, 1609600, 1588726, 1569535, 1551891, 1535891, 1521386, 1507727, 1494542, 1482362, 1471913, 1463155, 1455489, 1448582, 1442666, 1438456, 1437145, 1439917, 1447047, 1457891, 1471996, 1489521, 1510329, 1533628, 1558965, 1586518, 1615597, 1643792, 1668581, 1689173, 1705978, 1719073, 1728218, 1733769, 1736556, 1737284, 1736867, 1736849, 1738566, 1742214, 1747466, 1754519, 1763819, 1775358, 1789032, 1805082, 1823299, 1842282, 1860249, 1876044, 1888701, 1896917, 1900004, 1898726, 1894231, 1886725, 1876234, 1863900, 1851373, 1839461, 1828513, 1819487, 1813273, 1809330, 1806350, 1804127, 1803721, 1805983, 1810954, 1818466, 1828298, 1839894, 1852821, 1867270, 1883323, 1900238, 1917402, 1935480, 1955534, 1977452, 2000385, 2024397, 2050542, 2079628, 2112010, 2148295, 2189036, 2233867, 2281955, 2333100, 2387468, 2444588, 2503578, 2564055, 2625768, 2687827]
58961B687827O1578O1414O1976O2392O2547O3965O7585P2418P7530Q3690R1667
58950C454589J00451J08753J17038J26521J37179J48222J59699J72265J86040
58941D710757K00906K17247K35403K55004K75678K97814L21950L48225L76843
58932G239827M08133M41664M76538N12989N52360N94875O38815O82509P25519
58923A2273229P67037Q04597Q35323Q56805Q65687Q56903Q25720P69499O86757
58914A9541557N76446M39817K82067J10877o5613k38834l99766n40976o58327
58905A9047248p49979q15066q54289q70491q67261q47803q15820p75892p31758
58896A1718889o85214o37425n89898n43431m97864m53843m13134l76304l42178
$$ y = [2687827, 2749405, 2810819, 2872795, 2935187, 2997734, 3061699, 3129284, 3201702, 3279232, 3362922, 3454589, 3555040, 3663793, 3780831, 3907352, 4044531, 4192753, 4352452, 4524717, 4710757, 4911663, 5128910, 5364313, 5619317, 5894995, 6192809, 6514759, 6862984, 7239827, 7647960, 8089624, 8566162, 9079151, 9631511, 10226386, 10865201, 11547710, 12273229, 13040266, 13844863, 14680186, 15536991, 16402678, 17259581, 18085301, 18854800, 19541557, 20118003, 20557820, 20839887, 20950764, 20885151, 20646317, 20246551, 19705575, 19047248, 18297269, 17482203, 16627914, 15757423, 14890162, 14042359, 13226539, 12450647, 11718889, 11033675, 10396250, 9806352, 9262921, 8765057, 8311214, 7898080, 7521776, 7179598]
58887G179598l10786k84591k65034k49902k36005k22617k10257j98031j84660
58878E017715j70797j57881j45716j33278j20857j09303r8167q6707p5758o6555
58868C852696n8614n0760m3345l7402l2531k7613k2734j8269j3038n756K459R374
58856C554467J5034K1604L0034L9105M7629N5708O3810P2246Q1517R1733J01970
58845D174857J11502J21226J32409J44760J57196J69852J83657J98669K14541
58836E608669K31928K51607K72839K94487L17212L42592L70644M00232M31577
58827H521787M66171N04348N44866N86842O30209O74117P16443P55025P87838
58818A4187646Q11959Q23575Q18958P94383P45713O69828N66550M38275K88545
$$ y = [7179598, 6868812, 6584221, 6319187, 6069285, 5833280, 5610663, 5400406, 5202375, 5017715, 4846918, 4689037, 4543321, 4410043, 4289186, 4179883, 4081716, 3995009, 3919251, 3852696, 3794082, 3743322, 3699977, 3662575, 3630044, 3602431, 3579697, 3561428, 3548390, 3542634, 3545093, 3554467, 3569501, 3591105, 3621139, 3660244, 3707873, 3763581, 3827391, 3899637, 3981154, 4072887, 4174857, 4286359, 4407585, 4539994, 4684754, 4841950, 5011802, 5195459, 5394128, 5608669, 5840597, 6092204, 6365043, 6659530, 6976742, 7319334, 7689978, 8090210, 8521787, 8987958, 9492306, 10037172, 10624014, 11254223, 11928340, 12644783, 13399808, 14187646, 14999605, 15823180, 16642138, 17436521, 18182234, 18852062, 19418612, 19856887, 20145432]
58809B0145432J22445n2207k25974l90191n37575o61766p58583q27563q70796
58800A5943222q90530q89229q71002q40811q02278p57716p09744o61037o12818
58791H908057n65352n19648m77037m37441l99870l64364l31711l01603k72885
58782E238146k45425k19963j96291j73459j51636j32168j15889j03160r5469r4814
58772C709872j01029j10997j20760j27400j29125j25354j17150j06573r5298q4247
58762B591939p3976o4367n4705m5118l7214l2039k8324k4147j9485j5651j3103
58751B183810j1463j0812j1158j1409j0674r898j0564j2639j5444j9291k4150
58740B036308k7968k8889k8272k8856l0693l1620l1188l1155l2269l3412l4093
$$ y = [20145432, 20267877, 20215670, 19989696, 19599505, 19061930, 18400164, 17641581, 16814018, 15943222, 15052692, 14163463, 13292461, 12451650, 11649372, 10891656, 10181912, 9520875, 8908057, 8342705, 7823057, 7346020, 6908579, 6508709, 6144345, 5812634, 5511031, 5238146, 4992721, 4772758, 4576467, 4403008, 4251372, 4119204, 4003315, 3900155, 3804686, 3709872, 3608843, 3497846, 3377086, 3249686, 3120561, 2995207, 2878057, 2771484, 2676186, 2591939, 2517963, 2453596, 2398891, 2353773, 2316559, 2284520, 2256196, 2232049, 2212564, 2196913, 2183810, 2172347, 2161535, 2150377, 2138968, 2128294, 2118396, 2107832, 2095193, 2079749, 2060458, 2036308, 2008340, 1979451, 1951179, 1922323, 1891630, 1860010, 1828822, 1797667, 1765398, 1731986, 1697893]
58729A697893l5089l6427l7068l6922l6893l6831l5624l3398l1373k9573k6958
58718A321737k3864k1833k0886j9402j6968j4907j3662j2108r916q299p876p968
58706A144048q422r946j2194j3641j3917j4221j5017j5396j5083j4927j4908j3898
58694I82478j1923j0510j0172r566p863n953m624l376j711M6J797L937O272Q231
58680I37063J0230J3061J5930J7149J6795J6494J6661J6261J5510J6189J8840
58669A110183K2169K5715L0612L6993M3072M7568N0452N0447M4441L1008J2732
58658A505392n970k1603l1777l5163l2806k7704k1901j5306p757k72O491J3032
58646A324656J9405K4783K9381L4830M1698M8540N4255N9537O5124P0572P5747
$$ y = [1697893, 1662804, 1626377, 1589309, 1552387, 1515494, 1478663, 1443039, 1409641, 1378268, 1348695, 1321737, 1297873, 1276040, 1255154, 1235752, 1218784, 1203877, 1190215, 1178107, 1168191, 1159892, 1152016, 1144048, 1135626, 1125680, 1113486, 1099845, 1085928, 1071707, 1056690, 1041294, 1026211, 1011284, 996376, 982478, 970555, 960045, 949873, 940307, 932444, 926491, 921867, 918491, 916780, 916826, 918623, 922560, 928832, 937063, 947293, 960354, 976284, 993433, 1010228, 1026722, 1043383, 1059644, 1075154, 1091343, 1110183, 1132352, 1158067, 1188679, 1225672, 1268744, 1316312, 1366764, 1417211, 1461652, 1492660, 1505392, 1499422, 1477819, 1446042, 1410879, 1378073, 1350369, 1328468, 1313162, 1305405, 1305133, 1311624, 1324656, 1344061, 1368844, 1398225, 1433055, 1474753, 1523293, 1577548, 1637085, 1702209, 1772781, 1848528]
58635A848528Q1643Q8681R5922J02948J10939J20913J32542J45435J60001J76231
58625C063783J93102K09905K26572K42181K54578K61826K62313K53331K31750
58616E199341J96788J50468R5210L3205l1602r3491j47857j92426k25513k45738
58606D738385k54086k53775k47142k34792k18155k00162j82593j65200j48285
58597B834195j33464j21069j09447r7890q7638p9060p0682o2116n4998m9724m4215
58586A923892l7481l1517k7803k4779k0871j7384j6065j6047j5551j4656j4240
58575A687498j3848j2716j1373j0460r534q615r161j1899j5496j8969k3445k9729
58563A512253l5980l9809m1150m1256m0242l7509l3302k8262k2501j6381j1028
$$ y = [1848528, 1930171, 2018852, 2114774, 2217722, 2328661, 2449574, 2582116, 2727551, 2887552, 3063783, 3256885, 3466790, 3693362, 3935543, 4190121, 4451947, 4714260, 4967591, 5199341, 5396129, 5546597, 5641807, 5675012, 5643410, 5549919, 5402062, 5209636, 4984123, 4738385, 4484299, 4230524, 3983382, 3748590, 3530435, 3330273, 3147680, 2982480, 2834195, 2700731, 2579662, 2470215, 2372325, 2284687, 2205627, 2134945, 2072829, 2017831, 1968107, 1923892, 1886411, 1854894, 1827091, 1802312, 1781441, 1764057, 1747992, 1731945, 1716394, 1701738, 1687498, 1673650, 1660934, 1649561, 1639101, 1629567, 1620952, 1611791, 1599892, 1584396, 1565427, 1541982, 1512253, 1476273, 1436464, 1395314, 1354058, 1313816, 1276307, 1243005, 1214743, 1192242, 1175861, 1164833]
58552A164833p005l874j852k264n392r732j4107j8573k2391k3637k2068j9990
58540A013948j8910j7554j4725j1722j0158r549q760p974p537o756n452m802n240
58527H84809n407m457l391k808j695L28J955K851M736Q171J0840J0896R566Q616
58513I25010P621N766L856K515O00k453n031n901o130o559n895l472j251p90n77
58498I07309J237L742N244O006O659O168L940J804J314J134m46k433l102l063
58484I35513l853n257o325p341q492q554o938n199m625m425m073m832o911p930
58470H50758o527m800m670m710l161j173j55J205M222P287Q746R900J2011J3207
58456H82140J1902J0344J0962J1819R818O102M029L858L599L334M451O083O285
$$ y = [1164833, 1157828, 1153954, 1152102, 1149838, 1144446, 1134714, 1120607, 1102034, 1079643, 1056006, 1033938, 1013948, 995038, 977484, 962759, 951037, 940879, 931330, 922570, 914596, 907059, 900303, 894851, 890049, 884809, 879402, 874945, 871554, 868746, 867051, 867379, 869334, 872185, 876921, 885092, 895932, 906828, 916394, 925010, 932631, 938397, 942253, 944768, 945368, 942915, 937884, 931983, 925853, 919294, 913399, 909927, 908676, 907886, 907309, 908546, 912288, 917532, 923538, 930197, 936365, 940305, 942109, 943423, 944557, 944111, 941678, 938576, 935513, 931660, 926403, 920078, 912737, 904245, 895691, 888753, 883554, 878929, 874504, 870431, 865599, 858688, 850758, 844231, 839431, 834761, 830051, 826890, 825717, 825562, 826767, 830989, 838276, 847022, 856922, 868933, 882140, 894042, 904386, 915348, 927167, 936985, 943087, 947116, 950974, 954573, 957907, 962358, 968441, 974726]
58443I74726N488N082M024N64m141p674j0196j3037j5162j4820j3208j2664j2569
58430H86413j0882q307p034o578m766j868J14J266L211N654P066P947R941J2571
58416H94748J4111J4717J5611J6302J5769J4875J4497J2798P933J859k102m037
58404A017081o169q375q838p834p091o456m776k882k192j730O4K035K310J973
58390I67120L096M857N250N013N931O998O154M230L322K983J882J322K948M929
58376A026035M614L111K951L304J984K60Q16K813L640L768N151O761O717O853
58362A078778R946J4220J5946J5697J6526J7685J5973J1972R075P384M340L40
58350A217882j860k421l570m520k754O56K535L281N531Q454R083Q191Q944J0910
$$ y = [974726, 980214, 985296, 989320, 989884, 985743, 978069, 967873, 954836, 939674, 924854, 911646, 898982, 886413, 875531, 867224, 860190, 853612, 848846, 846978, 847092, 848358, 851569, 857223, 864289, 872236, 882177, 894748, 908859, 923576, 939187, 955489, 971258, 986133, 1000630, 1013428, 1021361, 1023220, 1021118, 1017081, 1010912, 1002537, 993699, 985865, 978774, 972318, 967542, 964660, 962468, 960738, 960802, 962837, 965147, 967120, 970216, 975073, 980323, 985336, 991267, 998265, 1004419, 1008649, 1011971, 1014954, 1016836, 1018158, 1021106, 1026035, 1030649, 1033760, 1036711, 1040015, 1041999, 1042259, 1043075, 1045888, 1049528, 1053296, 1058447, 1065208, 1071925, 1078778, 1088724, 1102944, 1118890, 1134587, 1151113, 1168798, 1184771, 1196743, 1205818, 1213202, 1217542, 1217882, 1216022, 1213601, 1210031, 1205511, 1202757, 1203413, 1205948, 1209229, 1214760, 1223214, 1232297, 1240488, 1249432, 1260342]
58336A260342J1221J0515J1683J3891J4005J2827J3652J5800J5982J4969J6288
58325A411175J9295K0289J9614K0815K3483K3798K1523J9699J8143J4188R082
58314A621104O575N891L324o8J91L677N764N976P905J1338J2548J2118J4305J8684
58300A729332K0515J9499K0073K2876K4123K3588K5046K8478K9975K9540L0974
58289B004019L4015L4938L4665L7724M3339M6413M6996M9620N3692N4228N1782
58278B491431N1611N3081N0422M4152M0927M1552M0188L6173L5295L8186L8947
58267B961965L6798L7667M2661M6264M7644N2097N9690O4260O5403O9455P6938
58256C560842Q1370Q2165Q5864R2850R6145R5470R8652J06819J12323J13884J19211
$$ y = [1260342, 1271563, 1282078, 1293761, 1307652, 1321657, 1334484, 1348136, 1363936, 1379918, 1394887, 1411175, 1430470, 1450759, 1470373, 1491188, 1514671, 1538469, 1559992, 1579691, 1597834, 1612022, 1621104, 1627679, 1633570, 1636894, 1636826, 1637017, 1640694, 1646458, 1652434, 1660339, 1671677, 1684225, 1696343, 1710648, 1729332, 1749847, 1769346, 1789419, 1812295, 1836418, 1860006, 1885052, 1913530, 1943505, 1973045, 2004019, 2038034, 2072972, 2107637, 2145361, 2188700, 2235113, 2282109, 2331729, 2385421, 2439649, 2491431, 2543042, 2596123, 2646545, 2690697, 2731624, 2773176, 2813364, 2849537, 2884832, 2923018, 2961965, 2998763, 3036430, 3079091, 3125355, 3172999, 3225096, 3284786, 3349046, 3414449, 3483904, 3560842, 3642212, 3724377, 3810241, 3903091, 3999236, 4094706, 4193358, 4300177, 4412500, 4526384, 4645595]
58245D645595J29671J37310J40380J46652J57909J66592J71382J80216J94152
58236F069859K04676K10826K21970K39637K54307K64454K80187L03370L23567
58227H372853L38725L59872L89729M17673M41755M73779N16009N55864N90869
58218A2457128O35033O92802P51717Q09150Q80022R69196J064021J163964J288483
58209B0711516J445395J622529J821208K064048K357462K682243L033656L432103
58201C9170160L883057M373168M921238N581745O380801P309068Q402949R769489
58193H9791675J1506256J3670668J6349225J9647416K3556606K7924030L2521888
58186B34967764L6797420L9276257L7532127K9513580J5421718j753615j7790894
$$ y = [4645595, 4775266, 4912576, 5052956, 5199608, 5357517, 5524109, 5695491, 5875707, 6069859, 6274535, 6485361, 6707331, 6946968, 7201275, 7465729, 7745916, 8049286, 8372853, 8711578, 9071450, 9461179, 9878852, 10320607, 10794386, 11310395, 11866259, 12457128, 13092161, 13784963, 14536680, 15345830, 16225852, 17195048, 18259069, 19423033, 20711516, 22156911, 23779440, 25600648, 27664696, 30022158, 32704401, 35738057, 39170160, 43053217, 47426385, 52347623, 57929368, 64310169, 71619237, 80022186, 89791675, 101297931, 114968599, 131317824, 150965240, 174521846, 202445876, 234967764, 271765184, 311041441, 348573568, 378087148, 393508866, 391755251, 373964357]
58179C73964357k9515150l5917954l7714908l6322508l3138673k9227453k5226835
58172A46900876k1434527j7995105j5003215j2480540j0371384q612998p171966
58165E3831141o005364n044555m238499l570800l020768k547780k125454j753864
58157B5524057j427535j124467q33392n58674k91725p331L08520O55541J042379
58148B3287373J482516J968988K474904K950095L261560L161524K420415J055462
58140D2062837o02667k108025l159427l688523l781557l581227l230727k835074
58132A9075610k443663k073942j742646j462818j229142j029428q62780p31106
58124G500085o24054n29134m47700l85979l39208k98537k64849k42269k26069
$$ y = [373964357, 344449207, 308531253, 270816345, 234493837, 201355164, 172127711, 146900876, 125466349, 107471244, 92468029, 79987489, 69616105, 61003107, 53831141, 47825777, 42781222, 38542723, 34971923, 31951155, 29403375, 27277921, 25524057, 24096522, 22972055, 22138663, 21579989, 21288264, 21280933, 21589453, 22244994, 23287373, 24769889, 26738877, 29213781, 32163876, 35425436, 38586960, 41007375, 42062837, 41460170, 39352145, 36192718, 32504195, 28722638, 25141411, 21910684, 19075610, 16631947, 14558005, 12815359, 11352541, 10123399, 9093971, 8231191, 7500085, 6876031, 6346897, 5899197, 5513218, 5174010, 4875473, 4610624, 4368355, 4142286]
58115D142286k09561j95242j87242j80247j67182j50794j37117j24402j08616
58106B681883r2809q1350p1485n9923n1217n0614n4833n8240o1654o6999p0103
58095A962656o7255o2658o1309o0547n6349n1613n0292m9396m4832l9496l7820
58084A381089l7669l5110l1959l1276l0575k6753k2803k2585k3707k2303k0076
58073A076273k0000j9899j6952j3927j4327j5831j4862j3147j3462j3519j0494
58062I09853p217p404q926q109o589p554r223q485p273q903j1574j1674j0263
58049G96659j0292j0640q823o533o566p248n568l017k759l731k968j108m01J24
58035G27129K387M820N024M308M909N487L975J953J601J351q07k840k262r76j701
$$ y = [4142286, 3932725, 3737483, 3550241, 3369994, 3202812, 3052018, 2914901, 2790499, 2681883, 2589074, 2507724, 2436239, 2376316, 2325099, 2274485, 2219652, 2161412, 2099758, 2032759, 1962656, 1895401, 1832743, 1771434, 1710887, 1654538, 1602925, 1552633, 1503237, 1458405, 1418909, 1381089, 1343420, 1308310, 1276351, 1245075, 1214500, 1187747, 1164944, 1142359, 1118652, 1096349, 1076273, 1056273, 1036374, 1019422, 1005495, 991168, 975337, 960475, 947328, 933866, 920347, 909853, 902636, 895232, 886306, 878197, 871608, 864054, 854831, 846346, 839073, 830170, 818596, 806922, 796659, 786367, 775727, 766904, 760371, 753805, 746557, 740989, 737972, 735213, 731482, 728514, 727406, 727005, 727129, 729516, 734336, 739360, 743668, 748577, 754064, 758039, 759992, 761593, 762944, 762137, 759297, 757035, 756059, 754358]
58020G54358k819j771l22j195k564j395O78L89j029l53J433J154n05o19J86r37
58004G44689l625n444o814r650j2676j3245j2344j2813j4057j3458j1698j1608
57992F17257j3004j3468j3124j3772j4381j2266p892m017r41K871O515P608O737
57979E48123O545P152O667N395N249N747M848L026K384K522J388n58j113n47r01
57964E95927j871j559n36r79k360k202o27K8l03M57K287L118K918L694N471O245
57948F09708N837N891O168M799K272J217J864J558p70l216m496n505o880p977
57934F10470q829j0127j1156j0580r307r619j1473j2664j2524j2379j2314j0765
57922D78733p545m341j886N53K844L934M151M854N892O187O453Q377J1268J2723
$$ y = [754358, 751539, 749768, 749446, 748251, 745687, 744292, 744970, 745359, 744330, 743977, 745410, 746564, 746059, 745440, 745626, 744689, 741064, 735620, 728806, 719156, 706480, 693235, 680891, 668078, 654021, 640563, 628865, 617257, 604253, 590785, 577661, 563889, 549508, 537242, 529350, 525333, 524392, 527263, 533778, 541386, 548123, 554668, 561820, 568487, 573882, 579131, 584878, 589726, 592752, 595136, 597658, 599046, 598488, 597375, 596828, 595927, 594056, 592497, 591961, 590982, 588622, 586420, 585793, 585821, 585518, 585975, 588262, 591380, 594298, 597992, 603463, 609708, 615545, 621436, 627604, 632403, 634675, 635892, 637756, 639314, 638544, 635328, 630832, 625327, 618447, 610470, 601641, 591514, 580358, 569778, 560471, 550852, 539379, 526715, 514191, 501812, 489498, 478733, 471188, 466847, 464961, 465514, 468358, 472292, 476443, 481297, 487189, 493376, 499829, 508206, 519474, 532197]
57908E32197J2511J2602J3430J3418J2347J1745J1591R988O694L851K472J208
57896F44054p08k142k508k919m005m964n445o101o803o589n758n699o394o337
57882E77682n238m335l849k624o38O49R09J456K785L880M403N203O352O922P019
57867F00576P705Q679Q370O690N247M536L309J193n44j249j696k176k071j665
57853F36904k157l485m296m313m486m711l845k235j626k179k147r41J2K5J99J107
57837F01826J829J884J803J286o98l466m920m937n788q341j0524j0740j0179j0458
57823E38577j1176j1293j0836j0030q465o334m847m444m157l412k754k227j067
57810D57535M34Q74K92N55K343L963M207M147M947N975O480P250R136J1498J3349
$$ y = [532197, 544708, 557310, 570740, 584158, 596505, 608250, 619841, 629829, 636523, 640374, 642846, 644054, 643346, 641204, 638696, 635777, 631772, 626808, 621363, 615262, 608459, 601870, 596112, 590413, 584019, 577682, 572444, 568109, 564260, 561636, 560998, 561647, 562556, 564012, 566797, 570677, 575080, 580283, 586635, 593557, 600576, 608281, 616960, 625330, 632020, 637267, 641803, 645112, 646305, 645761, 644512, 642816, 640640, 638569, 636904, 634747, 631262, 626966, 622653, 618167, 613456, 609611, 607376, 605750, 603571, 601424, 600483, 600495, 600520, 600719, 601826, 603655, 605539, 607342, 608628, 607930, 604464, 599544, 594607, 588819, 580478, 569954, 559214, 549035, 538577, 527401, 516108, 505272, 495242, 486777, 480443, 475596, 471152, 466995, 463583, 460829, 458602, 457535, 457969, 458843, 459135, 459690, 462033, 465996, 470203, 474350, 479297, 485272, 491752, 499002, 508138, 519636, 532985]
57795E32985J4736J5906J6545J6627J6774J7013J6684J5916J5465J4644J1494
57784G04789N800q4m260p115r385j0625j0751j0977j1851j2138j0958r290q181
57771F04974p161n702m428l689k546m63J521K601L488M729N428N010M581N018
57757F13361N359M640L875M424N638N874N022M414M846N977P181P975Q161Q252
57743F94999R050J0365J1170J1335J1926J3342J4672J5444J6396J7762J8556J8463
57731H63480J8704K0003K1421K2270K3510K5987K8929L1481L4102L7165L9750
57720A166802M1401M3535M7556N2854N8123O3415O9364P5698Q2145Q9675R9232
57709A889800J10225J21728J34172J48444J64301J81084J98842K17398K35300
$$ y = [532985, 547721, 563627, 580172, 596799, 613573, 630586, 647270, 663186, 678651, 693295, 704789, 710589, 710505, 706245, 699130, 689745, 679120, 668369, 657392, 645541, 633403, 622445, 613155, 604974, 597813, 592111, 587683, 583994, 581448, 580985, 582506, 585107, 588595, 593324, 598752, 603762, 608343, 613361, 618720, 623360, 627235, 631659, 637297, 643171, 648193, 652607, 657453, 663430, 670611, 678586, 686747, 694999, 704049, 714414, 725584, 736919, 748845, 762187, 776859, 792303, 808699, 826461, 845017, 863480, 882184, 902187, 923608, 945878, 969388, 995375, 1024304, 1055785, 1089887, 1127052, 1166802, 1208203, 1251738, 1299294, 1352148, 1410271, 1473686, 1543050, 1618748, 1700893, 1790568, 1889800, 2000025, 2121753, 2255925, 2404369, 2568670, 2749754, 2948596, 3165994, 3401294]
57700C401294K51083K64341K74019K76860K69282K49894K18709J75273J19879
57691E500634N6049j0162p3178j28930j74041k06283k25969k35182k35606k28199
57681D039133k14647j97410j78266j57784j36206j13879r1085o8208m5756k3319
57671B812573Q38K8127N7942Q8474J18234J45098J63842J66180J44555R7038L0211
57660C853112m1953j03614j44145j61487j59760j44853j22147r5937o8819m1734
57650B768663j5474Q634L0101N0248P0570R1036J10948J30458J49966J68881J86229
57639C750260K01588K14138K21611K21507K12588J93972J63954J21633O9280J1586
57629E382117m7103j03400j53606j93988k22752k40556k49049k49810k44436k34425
$$ y = [3401294, 3652377, 3916718, 4190737, 4467597, 4736879, 4986773, 5205482, 5380755, 5500634, 5556683, 5546521, 5473343, 5344413, 5170372, 4964089, 4738120, 4502938, 4267332, 4039133, 3824486, 3627076, 3448810, 3291026, 3154820, 3040941, 2949856, 2881648, 2835892, 2812573, 2813411, 2841538, 2899480, 2987954, 3106188, 3251286, 3415128, 3581308, 3725863, 3822901, 3853112, 3811159, 3707545, 3563400, 3401913, 3242153, 3097300, 2975153, 2879216, 2810397, 2768663, 2753189, 2761823, 2791924, 2842172, 2912742, 3003778, 3114726, 3245184, 3395150, 3564031, 3750260, 3951848, 4165986, 4387597, 4609104, 4821692, 5015664, 5179618, 5301251, 5370531, 5382117, 5335014, 5231614, 5078008, 4884020, 4661268, 4420712, 4171663, 3921853, 3677417, 3442992]
57619C442992k20873k04919j88174j71909j56300j41277j27470j15421j04593
57610B012056r4179q4337p5555o7549n9962n3357m8284m3967l9349l4734l1044
57599A379739k8056k4900k1846j9876j8786j7317j5112j3042j1563j0167q558
57588A190516p121o059n062l961k809j444J68J454K011K557M117O548Q866J0610
57574A200391J1860J2457J2455J2908J4845J7762K0427K2811K5830K9488L2893
57563A414127L5855L9047M2550M5843M9289N4057O0362O7136P3771Q0811Q8655
57552B051503R6927J05620J15586J27255J39767J51954J63430J74319J84383J92561
57542C503305J96757J94188J82696J61811J32101R4127M9167N22m7323r1007j28759
$$ y = [3442992, 3222119, 3017200, 2829026, 2657117, 2500817, 2359540, 2232070, 2116649, 2012056, 1917877, 1833540, 1757985, 1690436, 1630474, 1577117, 1528833, 1484866, 1445517, 1410783, 1379739, 1351683, 1326783, 1304937, 1285061, 1266275, 1248958, 1233846, 1220804, 1209241, 1199074, 1190516, 1183395, 1177336, 1172274, 1168313, 1165504, 1164060, 1164228, 1165682, 1167693, 1170250, 1174367, 1180915, 1189781, 1200391, 1212251, 1224708, 1237163, 1250071, 1264916, 1282678, 1303105, 1325916, 1351746, 1381234, 1414127, 1449982, 1489029, 1531579, 1577422, 1626711, 1680768, 1741130, 1808266, 1882037, 1962848, 2051503, 2148430, 2254050, 2369636, 2496891, 2636658, 2788612, 2952042, 3126361, 3310744, 3503305, 3700062, 3894250, 4076946, 4238757, 4370858, 4464985, 4514152, 4514674, 4467351, 4376344, 4247585]
57531D247585j58957j79907j91327j94755j92001j84272j72955j59902j46312
57522B667197j32336j18236j04978r3150q2261p1679o1572n2395m4168l6742l0142
57511A839538k4179j8244j1980n775k95M211Q002J1537J5179J8980K2800K6851
57499A886625L1726L7516M3458M9072N5043O2236P0356P8687Q7563R7851J09277
57488B609410J20694J31865J43577J55834J67259J76482J82787J85003J80960
57479D053871J68599J46903J15629P5363K8363k1551p0384j14767j51573j78309
57469D052144j94568k02207k03452j99478j91035j79372j65877j51455j36795
57460B427905j22721j09727r7773q6820p7062o8373o0216n2427m5491l9770l5036
$$ y = [4247585, 4088628, 3908721, 3717394, 3522639, 3330638, 3146366, 2973411, 2813509, 2667197, 2534861, 2416625, 2311647, 2218497, 2136236, 2064557, 2002985, 1950590, 1906422, 1869680, 1839538, 1815359, 1797115, 1785135, 1779360, 1779065, 1783276, 1791278, 1802815, 1817994, 1836974, 1859774, 1886625, 1918351, 1955867, 1999325, 2048397, 2103440, 2165676, 2236032, 2314719, 2402282, 2500133, 2609410, 2730104, 2861969, 3005546, 3161380, 3328639, 3505121, 3687908, 3872911, 4053871, 4222470, 4369373, 4485002, 4560365, 4588728, 4567177, 4496793, 4382026, 4230453, 4052144, 3857576, 3655369, 3451917, 3252439, 3061404, 2882032, 2716155, 2564700, 2427905, 2305184, 2195457, 2097684, 2010864, 1933802, 1865429, 1805213, 1752786, 1707295, 1667525, 1632489]
57449A632489l0947k7365k4013k0553j7279j4972j3790j2956j1839j0637r625
57438A438513q529p035n370l932k790j903j357j044o31n2L83N73Q92J674K855
57423A412247M194N470O329O537O337O212O264O369O770P778Q991R622R618R692
57409A512430J0253J0985J1564J1948J1993J1579J1147J1274J1654J1447J0710
57398A636984J0436J1045J1818J2125J2223J2467J2731J2967J3539J4478J5216
57387A776029J5439J5448J5386J4969J4343J4311J5216J6286J6641J6299J5876
57376A946243J5875J6629J8110J9517J9795J8942J8092J8079J8688J9537K0652
57365B150159K1724K1985K1438K1317K2462K4104K5104K5626K6638K8247K9518
$$ y = [1632489, 1601542, 1574177, 1550164, 1529611, 1512332, 1497360, 1483570, 1470614, 1458775, 1448138, 1438513, 1429984, 1422949, 1417579, 1413647, 1410857, 1408954, 1407597, 1406553, 1405922, 1405870, 1406253, 1406826, 1407718, 1409392, 1412247, 1416441, 1421911, 1428240, 1434777, 1441114, 1447326, 1453590, 1459959, 1466729, 1474507, 1483498, 1493120, 1502738, 1512430, 1522683, 1533668, 1545232, 1557180, 1569173, 1580752, 1591899, 1603173, 1614827, 1626274, 1636984, 1647420, 1658465, 1670283, 1682408, 1694631, 1707098, 1719829, 1732796, 1746335, 1760813, 1776029, 1791468, 1806916, 1822302, 1837271, 1851614, 1865925, 1881141, 1897427, 1914068, 1930367, 1946243, 1962118, 1978747, 1996857, 2016374, 2036169, 2055111, 2073203, 2091282, 2109970, 2129507, 2150159, 2171883, 2193868, 2215306, 2236623, 2259085, 2283189, 2308293, 2333919, 2360557, 2388804, 2418322]
57354B418322K9699K8926K7775K6654K5565K4275K2840K1928K2087K2726K2632
57343B693429K1641K0924K1322K2398K3547K4981K6867K8448K9006K9065K9644
57332B971272L0789L1703L2062L2342L3069L4329L5889L7268L7935L7912L7889
57321C352459L8387L9132L9631L9965M0530M1409M2397M3368M4197M4756M5327
57310C811558M6520M8407N0237N1495N2676N4412N6371N7776N8640N9692O1267
57299D409051O3003O4614O6268O8035O9453O9975O9588O8775O7798O6223O3320
57288E146103N9014N4050M8989M3448L6939L0062K4136J9731J6463J4139J3144
57277E506218J3451J4272J5105J6409J8660K1473K4164K6677K9389L2334L5080
$$ y = [2418322, 2448021, 2476947, 2504722, 2531376, 2556941, 2581216, 2604056, 2625984, 2648071, 2670797, 2693429, 2715070, 2735994, 2757316, 2779714, 2803261, 2828242, 2855109, 2883557, 2912563, 2941628, 2971272, 3002061, 3033764, 3065826, 3098168, 3131237, 3165566, 3201455, 3238723, 3276658, 3314570, 3352459, 3390846, 3429978, 3469609, 3509574, 3550104, 3591513, 3633910, 3677278, 3721475, 3766231, 3811558, 3858078, 3906485, 3956722, 4008217, 4060893, 4115305, 4171676, 4229452, 4288092, 4347784, 4409051, 4472054, 4536668, 4602936, 4670971, 4740424, 4810399, 4879987, 4948762, 5016560, 5082783, 5146103, 5205117, 5259167, 5308156, 5351604, 5388543, 5418605, 5442741, 5462472, 5478935, 5493074, 5506218, 5519669, 5533941, 5549046, 5565455, 5584115, 5605588, 5629752, 5656429, 5685818, 5718152, 5753232]
57266E753232L7189L8617L9862M1673M4229M6703M8201M8992N0086N1751N3347
57255F253882N4595N5987N7707N9215O0200O0936O1438O1174O0087N8853N7782
57244F901856N6431N4693N3195N2032N0275M7444M4524M2707M2003M1762M1729
57233G428651M1837M1817M1893M2976M5397M8155N0280N2064N4156N6216N7552
57222G960994N8367N9257N9917N9477N7789N5489N3053N0606M8319M6265M4076
57211H553609M1406L8457L5480L2229K8456K4542K0947J7534J3996J0533P491
57200H824680M806K453R26N98J033J551K091K964M182N588P142Q523R077Q671
57186H884285Q032P711P324O448N488M950M509L682K816K563K776K796K433J922
$$ y = [5753232, 5790421, 5829038, 5868900, 5910573, 5954802, 6001505, 6049706, 6098698, 6148784, 6200535, 6253882, 6308477, 6364464, 6422171, 6481386, 6541586, 6602522, 6663960, 6725134, 6785221, 6844074, 6901856, 6958287, 7012980, 7066175, 7118207, 7168482, 7215926, 7260450, 7303157, 7345160, 7386922, 7428651, 7470488, 7512305, 7554198, 7597174, 7642571, 7690726, 7741006, 7793070, 7847226, 7903442, 7960994, 8019361, 8078618, 8138535, 8198012, 8255801, 8311290, 8364343, 8414949, 8463268, 8509533, 8553609, 8595015, 8633472, 8668952, 8701181, 8729637, 8754179, 8775126, 8792660, 8806656, 8817189, 8824680, 8829486, 8831939, 8832865, 8833463, 8834496, 8836047, 8838138, 8841102, 8845284, 8850872, 8858014, 8866537, 8875614, 8884285, 8892317, 8900028, 8907352, 8913800, 8919288, 8924238, 8928747, 8932429, 8935245, 8937808, 8940584, 8943380, 8945813, 8947735]
57172H947735J247K03j198l031n731r476j3672j7631k1439k5719l0821l6625m2516
57159H741326m7383n0403n2246n4657n8324o1998o4236o5142o5562o5411o3668
57148H092296n9606n3335m5574l7367k9586k2309j5261q968m742l264m145o964
57136G801175j1626j7480k3384k8987l4723m0145m3642m4115m1585l5841k6387
57125G453260j4271k255P631J5185K0426K3054K4328K7126L2836L9973M6903N4039
57113G728235O2282P1483Q1858R5076J12738J35658J65668K05878K58082L22173
57103I239131L99033M91518O01873P31248Q82767J061607J271026J512541J791543
57094A7982287K118291K501115K942154L439758L988252M573203N174223N775935
$$ y = [8947735, 8948982, 8949185, 8947987, 8944956, 8939225, 8929749, 8916077, 8898446, 8877007, 8851288, 8820467, 8783842, 8741326, 8693943, 8643540, 8591294, 8536637, 8478313, 8416315, 8352079, 8286937, 8221375, 8155964, 8092296, 8032690, 7979355, 7933781, 7896414, 7866828, 7844519, 7829258, 7820290, 7815548, 7812284, 7808139, 7801175, 7789549, 7772069, 7748685, 7719698, 7684975, 7644830, 7601188, 7557073, 7515488, 7479647, 7453260, 7438989, 7436734, 7444365, 7459550, 7479976, 7503030, 7527358, 7554484, 7587320, 7627293, 7674196, 7728235, 7790517, 7862000, 7943858, 8038934, 8151672, 8287330, 8452998, 8658876, 8916958, 9239131, 9638164, 10129682, 10731555, 11462803, 12345570, 13407177, 14678203, 16190744, 17982287, 20100578, 22601693, 25543847, 28983605, 32971857, 37545060, 42719283, 48495218]
57086D8495218O370325O949098P506414Q047504Q564041Q974951R108373Q782135
57078A12798059P917655O566293M835132K822080O32707j579668l634742n390592
57070A24966924o776809p775485q395768q669460q648983q393776p959701p400348
57062F0946594o767658o104847n442506m803341m205964l662758l179282k757891
57054B4022347k398374k094724j836385j614667j424850j261875j118779r90888
57046A1281805q77690p78907o91886o14219n45713m86302m34563l89370l50671
57037F112484l17698k88739k63232k41799k23698k06759j90367j75943j63984
57028D040265j53047j42279j32488j24027j15963j07971j00830r4466q7771q0918
$$ y = [48495218, 54865543, 61814641, 69321055, 77368559, 85932600, 94907551, 104015924, 112798059, 120715714, 127282007, 132117139, 134939219, 135571926, 133992258, 130357516, 124966924, 118190115, 110414630, 102018862, 93349402, 84700419, 76306643, 68346942, 60946594, 54178936, 48074089, 42631583, 37828242, 33622278, 29959520, 26780238, 24022347, 21623973, 19529249, 17692864, 16078197, 14653347, 13391472, 12272693, 11281805, 10404115, 9625208, 8933322, 8319103, 7773390, 7287088, 6852525, 6463155, 6112484, 5794786, 5506047, 5242815, 5001016, 4777318, 4570559, 4380192, 4204249, 4040265, 3887218, 3744939, 3612451, 3488424, 3372461, 3264490, 3163660, 3069194, 2981423, 2900505]
57018B900505p5491p1680o7685o2613n7717n3951n0581m7080m4119m1693l8395
57007B289500l3809k9576k6861k4503k0929j6382j1922p518k252M597J3489K4665
56995B158499L7741N2397O9764R1868J19275J50154J80650K03386K05946J75753
56985C445433J10740K4845n9164j23091j60927j76931j79268j74647j66093j54056
56975B386841j39116j23089j07683r3342q0063o8261n8213m9516m1799l5275l0016
56964A560468k5447k1002j6630j2242p430k060L585R359J4945J8781J8420J2595
56952A553342K290j0261k2660l2435l7685l8488l6808l4355l1329k7422k2999
56941A261190j8711j4745j1031p486l756N87N405J0297J5544K1781K8664L4695
$$ y = [2900505, 2825014, 2753334, 2685649, 2623036, 2565319, 2511368, 2460787, 2413707, 2369588, 2327895, 2289500, 2255691, 2226115, 2199254, 2174751, 2153822, 2137440, 2125518, 2118000, 2115748, 2120345, 2133834, 2158499, 2196240, 2248637, 2318401, 2410269, 2529544, 2679698, 2860348, 3063734, 3269680, 3445433, 3556173, 3581018, 3521854, 3398763, 3237836, 3060905, 2881637, 2706990, 2540897, 2386841, 2247725, 2124636, 2016953, 1923611, 1843548, 1775287, 1717074, 1667558, 1625759, 1590484, 1560468, 1535021, 1514019, 1497389, 1485147, 1477717, 1475657, 1479242, 1488601, 1503546, 1522327, 1540747, 1553342, 1555632, 1545371, 1522711, 1490276, 1452591, 1414103, 1377295, 1342940, 1311611, 1284189, 1261190, 1242479, 1227734, 1216703, 1209217, 1205461, 1206048, 1211453, 1221750, 1237294, 1259075, 1287739, 1322434]
56929A322434L8189L7413L0219J5634l774k2621l6567m4547m7441m6421m3104
56918A199414l9389l5955l2028k7369k3195k0421j8345j6050j3862j2462j1563
56907I48775j0488r198p898o487n099m274l974l346k093j025n67J07J649L360
56893H99442M384N189O766R098J1343J3029J4371J5943J8287K0984K1764J7809
56881A058409Q786k248j1635j7823k0977k1495k0013j7730j5324j2236p991l454
56869I16269K35L216O381R963J3707J7870K3027K9203L5994M3079M9821N4597
56857A203362N5079M9058L5310J4897p870k7062l8884m3517m3195l9652l3982
56846A123544k7441k0961j4552q077j897M006J0513J8119K6178L4276M3359N4319
$$ y = [1322434, 1360623, 1398036, 1428255, 1443889, 1440115, 1417494, 1380927, 1336380, 1288939, 1242518, 1199414, 1160025, 1124070, 1092042, 1064673, 1041478, 1021057, 1002712, 986662, 972800, 960338, 948775, 938287, 929089, 921191, 914704, 909605, 905331, 901357, 898011, 895918, 894893, 894326, 894433, 896082, 899442, 903826, 909015, 915781, 924879, 936222, 949251, 963622, 979565, 997852, 1018836, 1040600, 1058409, 1067195, 1064947, 1053312, 1035489, 1014512, 993017, 973004, 955274, 939950, 927714, 919723, 916269, 916504, 919720, 926101, 936064, 949771, 967641, 990668, 1019871, 1055865, 1098944, 1148765, 1203362, 1258441, 1307499, 1342809, 1357706, 1349836, 1322774, 1283890, 1240373, 1197178, 1157526, 1123544, 1096103, 1075142, 1060590, 1052513, 1050616, 1054622, 1065135, 1083254, 1109432, 1143708, 1187067, 1241386]
56834A241386O6329P7501Q5909Q8589Q0837N9232K5828j1777m4908o8156q0436
56823A520334q3680q0923p4604o6097n6456m6849l7827k8972j9988j1420l596
56812A009922M318J3256K2943L2571M2050N1485N9615O3592O0092M6665K3456
56801A429965n228l2077n1178o1276o4404o2553n6993m9528m2217l5695k9229
56790I39587k2531j6311j1099o577k167K497P723J3535J9371K4588K8917L1687
56778A009220L1049K5037J3478j605j7166l0256l8691m1840m0828l7444l3023
56767H37931k8538k4867k2162j9613j6693j4028j2307j1080r593q101p282o953
56755F56714o502o025n924n843n246m546m482m667m029k589j575j800k819l681
$$ y = [1241386, 1307715, 1385216, 1471125, 1559714, 1640551, 1699783, 1725611, 1713834, 1668926, 1600770, 1520334, 1436654, 1355731, 1281127, 1215030, 1158574, 1111725, 1073898, 1044926, 1024938, 1013518, 1009922, 1014240, 1027496, 1050439, 1083010, 1125060, 1176545, 1236160, 1299752, 1359844, 1406509, 1429965, 1424737, 1392660, 1341482, 1280206, 1215802, 1153249, 1096256, 1046728, 1004511, 968816, 939587, 917056, 900745, 889646, 883069, 880902, 883399, 891122, 904657, 924028, 948616, 977533, 1009220, 1040269, 1065306, 1078784, 1077179, 1060013, 1029757, 991066, 949226, 908398, 870954, 837931, 809393, 784526, 762364, 742751, 726058, 712030, 699723, 688643, 679050, 670949, 663667, 656714, 650212, 644187, 638263, 632420, 627174, 622628, 618146, 613479, 609450, 606861, 605286, 603486, 600667, 596986]
56741E96986l763l017k105k041l007l910l770l023k673k774k712k406k134j737
56727E57914j103r10j699k648k533j588j136j512j733j168m01j86m75p24n78j67
56711E39353o9p21j588j529m15M46J29n99o00n7K15K04K49L3o96j193q05k80n77
56692E31500j167r87l66l67q33q03l36k85o24p27q24j531k277k012j190j152j760
56675E14259j691r71j110k466l473l069k075j589j528j465j514j715j642j182
56661D88769q49r68j323j665j802j280j3J068J055L95J6l48j465k746k877j976
56645D73991j305j002j53R68Q84m87j392r21j99k26l95m5K18k14q04q72o43n19
56627D66884l43m9j0k39k86k13n69j119r04J54R83J083J070J204Q05l10j232j410
$$ y = [596986, 593223, 590206, 588101, 586060, 583053, 579143, 575373, 572350, 569677, 566903, 564191, 561785, 559651, 557914, 556811, 555901, 554202, 551554, 549021, 547433, 546297, 544785, 543052, 541884, 541483, 541297, 540822, 540098, 539520, 539353, 539284, 538563, 536975, 535446, 535031, 535477, 535606, 535007, 534407, 534350, 534565, 534769, 535018, 535051, 534355, 533162, 532357, 532077, 531500, 530333, 529346, 528980, 528613, 527780, 526977, 526641, 526356, 525732, 525005, 524181, 522650, 520373, 518361, 517171, 516019, 514259, 512568, 511597, 510487, 508021, 504548, 501479, 499404, 497815, 496287, 494822, 493308, 491593, 489951, 488769, 487920, 486952, 485629, 483964, 482162, 480882, 480869, 481937, 482992, 483387, 483403, 483055, 481590, 478844, 475967, 473991, 472686, 471684, 471531, 472499, 473383, 472896, 471504, 470583, 470384, 470158, 469763, 469718, 469936, 469722, 468918, 468046, 467403, 466884, 466541, 466492, 466482, 466243, 465957, 465744, 465175, 464056, 463152, 463306, 464289, 465372, 466442, 467646, 468451, 468141, 466909, 465499]
56609D65499j366j441j155m30m0k68l18K56P44N60J67J12J87J00k1j72n48p38
56591D61128m4J242K069K265K533K729J858J33p50n0R48J024O16N64P63R16J222
56574D79166J529J176L99N05J833K965K786J987J670J818J967K164K407K298K014
56559E06684K364L298L673L124K615K529J906M80l44L17J294J292Q17P58N19p83
56543E30543k369k755j936j276j663k854m174m966m875m310m013l928l339k348
56529D85737j930k222k257j818j955k984l642l081k086j532j203j003j542k617
56515D55865k825j832j209j803k229j324k17k64p35m00J44k15q56n02N06R18O51
56498D43673L88J1q08j322o67N43J171J235J249Q47k55r23K0J750K511K114J722
$$ y = [465499, 464133, 462692, 461537, 461107, 461067, 460799, 460481, 460737, 461481, 462041, 462208, 462320, 462507, 462607, 462586, 462414, 461866, 461128, 461084, 462326, 464395, 466660, 469193, 471922, 473780, 473913, 473163, 473113, 474061, 475085, 475701, 476265, 477028, 477944, 479166, 480695, 481871, 482270, 482775, 484608, 487573, 490359, 492346, 494016, 495834, 497801, 499965, 502372, 504670, 506684, 509048, 512346, 516019, 519143, 521758, 524287, 526193, 526673, 526329, 526646, 527940, 529232, 530049, 530807, 531326, 530543, 528174, 525419, 523483, 522207, 520544, 517690, 513516, 508550, 503675, 499365, 495352, 491424, 488085, 485737, 483807, 481585, 479328, 477510, 475555, 472571, 468929, 465848, 463762, 462230, 461027, 460024, 458482, 455865, 453040, 451208, 449999, 448196, 445967, 444643, 444426, 444162, 443427, 443027, 443171, 442956, 442100, 441598, 442104, 443022, 443673, 444061, 444072, 443264, 441942, 441275, 441818, 442989, 444224, 445473, 446320, 446065, 445142, 445162, 446912, 449423, 451537, 453259]
56481D53259J743J553R76N68O39J140K071L064L223K390J730K069K566K157J315
56466D80463J094J402J481J342J429J653J836K221K613K130Q30K39J055J799J155
56451E02742O0r7J71j49l45O63J975J931Q95N16R51R87L20l91j283l011m977n754
56433D95204n167m313l804l404l145l275l427l111k627k383j970j086n22r18j463
56418D54589j222p71r71j198m75N81P16J09k57m30r90j483j166n19l12m8R19J697
56400D48769J173O8j79K03P3l94k74J44K6r7Q28K281K932K854L024L277K798J906
56382D69412J475J226N33L8N23J099O54K1M88J288R86L02P96J754J273k61p66
56365D80841o5J36m24k10J151K342K837L333L764L414K882L445M648M957M624
$$ y = [453259, 455002, 456555, 457531, 458099, 458738, 459878, 461949, 465013, 468236, 470626, 472356, 474425, 476991, 479148, 480463, 481557, 482959, 484440, 485782, 487211, 488864, 490700, 492921, 495534, 497664, 498494, 498733, 499788, 501587, 502742, 502802, 502705, 502876, 502727, 502382, 503045, 505020, 506951, 507846, 508362, 509313, 510300, 510620, 510229, 508946, 505935, 500958, 495204, 490037, 485724, 481920, 478516, 475371, 472096, 468669, 465558, 462931, 460548, 458578, 457492, 456970, 456052, 454589, 453367, 452596, 451625, 450427, 449952, 450533, 451249, 451358, 451101, 450671, 449681, 448198, 447032, 446513, 446201, 446153, 447072, 448769, 449942, 450010, 449831, 450034, 450107, 449713, 449439, 449583, 449609, 449512, 450340, 452621, 455553, 458407, 461431, 464708, 467506, 469412, 470887, 472113, 472646, 472684, 473207, 474306, 474960, 474981, 475469, 476757, 477743, 478045, 478841, 480595, 481868, 481607, 480841, 480776, 480912, 480488, 480278, 481429, 483771, 486608, 489941, 493705, 497119, 500001, 503446, 508094, 513051, 517675]
56350E17675N226O544O788N897N748O878P791P863Q171Q979R010P862O731O217
56336F17380N591M607M006L840L373K733K688K765J777O8r35j214j907k899l139
56321F38734l060l957n206m919l253k205k132j543l47j30r48r55K61J083J074
56306F12497J732L391M421M273M416N409N933N493N425O286O923O937P397Q430
56292F88963Q823Q652R583J1753J3211J3317J3819J5663J7546J8619J9893K1873
56280H61715K3465K4352K5834K8375L0818L2922L6038M0439M4670M8400N3076
56269A250104N8907O4154O8507P4165Q2293R1256R9641J08191J17469J26363J34332
56258B275382J42398J50528J56720J59963J61375J61165J57283J48576J36485
$$ y = [517675, 522901, 529445, 536233, 542130, 547878, 554756, 562547, 570410, 578581, 587560, 596570, 604432, 611163, 617380, 622971, 627578, 631584, 635424, 638797, 641530, 644218, 646983, 648760, 648828, 647893, 646679, 644772, 641873, 638734, 635674, 631717, 626511, 621592, 618339, 616134, 614002, 612459, 612112, 611982, 611034, 610079, 610340, 611423, 612497, 614229, 617620, 622041, 626314, 630730, 636139, 642072, 647565, 652990, 659276, 666199, 673136, 680533, 688963, 697786, 706438, 716021, 727774, 740985, 754302, 768121, 783784, 801330, 819949, 839842, 861715, 885180, 909532, 935366, 963741, 994559, 1027481, 1063519, 1103958, 1148628, 1197028, 1250104, 1309011, 1373165, 1441672, 1515837, 1598130, 1689386, 1789027, 1897218, 2014687, 2141050, 2275382, 2417780, 2568308, 2725028, 2884991, 3046366, 3207531, 3364814, 3513390, 3649875]
56249C649875J22187J04841Q4183O2140M0315J8570k422k0226l3932m5587n6504
56238C923440o4932o9388p1559p3735p5755p6715p7523p9616q2920q6944r2083
56227C072270r8282j04177j08924j12987j16085j16517j13803j09730j05671j01151
56217A984943r6006r1330q7087q1526p4282o7453o2258n7285n1338m5294l9860
56206A231224l4312k8794k4923k2795k0331j6896j4394j3431j1820q573n814m787
56194A024354l457l47K563L201K622K452K082Q00j40L0k69k096l850m228m557
56179A019160o052p461p550p310p615p360n878m481l813k541l52Q92P19J341L559
56164I65258N041M695M987P543J0257J1284J2132J4156J5767J5993J7031K0223
$$ y = [3649875, 3772062, 3876903, 3961086, 4023226, 4063541, 4082111, 4079689, 4059463, 4025531, 3979944, 3923440, 3858508, 3789120, 3717561, 3643826, 3568071, 3491356, 3413833, 3334217, 3251297, 3164353, 3072270, 2973988, 2869811, 2760887, 2647900, 2531815, 2415298, 2301495, 2191765, 2086094, 1984943, 1888937, 1797607, 1710520, 1628994, 1554712, 1487259, 1425001, 1367716, 1316378, 1271084, 1231224, 1196912, 1168118, 1143195, 1120400, 1100069, 1083173, 1068779, 1055348, 1043528, 1034955, 1029141, 1024354, 1020897, 1020550, 1023113, 1026314, 1028936, 1031388, 1033470, 1034270, 1034130, 1034160, 1033891, 1031795, 1027945, 1023717, 1019160, 1013108, 1005647, 998097, 990787, 983172, 975812, 969934, 965453, 961640, 959099, 958747, 959639, 960358, 961699, 965258, 970299, 974994, 979981, 987524, 997781, 1009065, 1021197, 1035353, 1051120, 1067113, 1084144, 1104367]
56152A104367K3179K3973K4658K7472L1158L4186L7937M3480M8693N2149N6342
56141A507594O3768P3343Q3918R7525J15401J34529J51805J68042J83881J95408
56131B775214J98155J92282J80079J62048J39705J18689J04162R5476Q8965Q2793
56121D137568P5268O2254M1278J5782q720l0095m8103o1493p1028q1973r8861
56110C931877j20408j42943j65106j85143j97986k00165j94400j84844j71406
56101B369476j53156j33312j15661r9611q3634o9879o0293n2068m2214l2945k7243
56090A499460k2995j7102j1458r124q264n731k974k494k266K79K637J836P14L132
56076A425650O754P310O288P495R642R418Q445J0075J2538J2456J1770J3955J6787
$$ y = [1104367, 1127546, 1151519, 1176177, 1203649, 1234807, 1268993, 1306930, 1350410, 1399103, 1451252, 1507594, 1571362, 1644705, 1728623, 1826148, 1941549, 2076078, 2227883, 2395925, 2579806, 2775214, 2973369, 3165651, 3345730, 3507778, 3647483, 3766172, 3870334, 3965810, 4054775, 4137568, 4212836, 4275090, 4316368, 4332150, 4323430, 4293335, 4245232, 4183739, 4112711, 4030738, 3931877, 3811469, 3668526, 3503420, 3318277, 3120291, 2920126, 2725726, 2540882, 2369476, 2216320, 2083008, 1967347, 1867736, 1784102, 1714223, 1653930, 1601862, 1559648, 1526703, 1499460, 1476465, 1459363, 1447905, 1438781, 1430517, 1424786, 1421812, 1419318, 1417052, 1417331, 1419968, 1421804, 1422518, 1425650, 1432404, 1439714, 1446002, 1453497, 1463139, 1472557, 1481002, 1491077, 1503615, 1516071, 1527841, 1541796, 1558583]
56063A558583J6279J4450J5639J8428J8871J8373K0542K3468K3208K1740K3407
56052A772988K6592K7053K6354K8657L2293L3000L2391L4577L7546L6710L3911
56041B122072L4036L5843L5069L3415L5211L8404L8377L7343M0263M4895M5847
56030B540775M5103M8121N2862N3477N1664N3433N7687N9134N9374O3761P0281
56019C155672P3101P4060P8904Q5464Q7602Q7571R1959R8862J01864J03142J09296
56008D147497J17803J21459J22611J28648J37119J40294J40711J46615J55751
55999E358508J59934J61984J71051J84741J93545J99513K12213K29603K42092
55990G113184K52258K70510K94493L13508L30230L56227L89156M17137M42803
$$ y = [1558583, 1574862, 1589312, 1604951, 1623379, 1642250, 1660623, 1681165, 1704633, 1727841, 1749581, 1772988, 1799580, 1826633, 1852987, 1881644, 1913937, 1946937, 1979328, 2013905, 2051451, 2088161, 2122072, 2156108, 2191951, 2227020, 2260435, 2295646, 2334050, 2372427, 2409770, 2450033, 2494928, 2540775, 2585878, 2633999, 2686861, 2740338, 2792002, 2845435, 2903122, 2962256, 3021630, 3085391, 3155672, 3228773, 3302833, 3381737, 3467201, 3554803, 3642374, 3734333, 3833195, 3935059, 4038201, 4147497, 4265300, 4386759, 4509370, 4638018, 4775137, 4915431, 5056142, 5202757, 5358508, 5518442, 5680426, 5851477, 6036218, 6229763, 6429276, 6641489, 6871092, 7113184, 7365442, 7635952, 7930445, 8243953, 8574183, 8930410, 9319566, 9736703, 10179506]
55981A0179506M79001N23604N63788O02608O54757P18562P80049Q42371R21713
55972A6265959J016568J112475J215078J345311J504180J678079J876530K125567
55964B8139747K425182K754370L116156L533529M005592M520044N106020N816749
55956E9417389O663730P637127Q793797J0253155J2108437J4426485J7321343
55949A36621463K0902348K5134581K9854930L4810770L9264844M1369405L8425181
55942C66383522K8587217J2739962n438508k1509257l2580505l8092351l9078636
55935B71011444l7088378l3534763k9432840k5345181k1513737j8065103j5088673
55928I0942769j2592396j0508773q775874p362432o219885n276144m486390l840461
$$ y = [10179506, 10658507, 11182111, 11745899, 12348507, 13003264, 13721826, 14501875, 15344246, 16265959, 17282527, 18395002, 19610080, 20955391, 22459571, 24137650, 26014180, 28139747, 30564929, 33319299, 36435455, 39968984, 43974576, 48494620, 53600640, 59417389, 66081119, 73718246, 82512043, 92765198, 104873635, 119300120, 136621463, 157523811, 182658392, 212513322, 247324092, 286588936, 327958341, 366383522, 394970739, 407710701, 402272193, 380762936, 348182431, 310090080, 271011444, 233923066, 200388303, 170955463, 145610282, 124096545, 106031442, 90942769, 78350373, 67841600, 59065726, 51703294, 45483409, 40207265, 35720875, 31880414]
55920C1880414l315993k870614k483772k162513j900949j672857j467774j297105
55912A4708837j159853j036265r19557q21917p44723o72635o01344n42866m98964
55903G710713m55969m10143l72973l47148l21107k91531k68380k53544k36342
55894D753576k14259j97383j88295j77483j62447j52022j47903j40603j27793
55885C245388j18637j15917j11191j01624r4834r2944q8173p8458p1691p0296
55875B301623o6764n8641n3132n2561m9706m2039l6705l6810l6000l1231k8023
55864A810011k8574k7090k1539j8166j9739k0702j8297j7390j9970k0820j7921
55853A579803j6795k0149k3135k2856k2843k4462k3524j9308j7563k0833k4772
$$ y = [31880414, 28564421, 25693807, 23210035, 21047522, 19146573, 17473716, 16005942, 14708837, 13548984, 12512719, 11593162, 10771245, 10026522, 9353887, 8752543, 8209677, 7710713, 7254744, 6844601, 6471628, 6124480, 5803373, 5511842, 5243462, 4989918, 4753576, 4539317, 4341934, 4153639, 3976156, 3813709, 3661687, 3513784, 3373181, 3245388, 3126751, 3010834, 2899643, 2798019, 2703185, 2610241, 2522068, 2443610, 2371919, 2301623, 2234859, 2176218, 2123086, 2070525, 2020819, 1978780, 1942075, 1905265, 1869265, 1838034, 1810011, 1781437, 1754347, 1732808, 1714642, 1694903, 1674201, 1655904, 1638514, 1618544, 1597724, 1579803, 1563008, 1542859, 1519724, 1496868, 1474025, 1449563, 1426039, 1406731, 1389168, 1368335, 1343563]
55842A343563k7229l1683l8459m1930m0087l7880l7683l5431k9644k5130k3962
55831I74445k1542j5581j0460q852p268l666j419j910j313J485J657k953p687
55818H94936r382j1205j5325j8334j8010j7552j9064j9723j8116j7515j9135j9096
55806F92479j5752j3184j3652j3505j0496q193r001r547p355n648p074q783q189
55793E62100p772r662j1143r904q433r050r666q448p456p956p258m017j478j722
55779D58135j914K1J241p25l592n061o831j0116j2167j1219j0026j0673j0692
55766C76381q135n686n709o001m448l204m280n492m845m406n845o692n128m021
55752C02489o005q914j0256j1754j4915j6530j3506q367n117l153n4L017L596
$$ y = [1343563, 1316334, 1284651, 1246192, 1204262, 1164175, 1126295, 1088612, 1053181, 1023537, 998407, 974445, 952903, 937322, 926862, 918010, 910742, 907076, 905657, 903747, 902434, 903919, 905576, 902623, 894936, 885554, 874349, 859024, 840690, 822680, 805128, 786064, 766341, 748225, 730710, 711575, 692479, 676727, 663543, 649891, 636386, 625890, 617697, 608696, 599149, 591794, 586146, 579072, 570289, 562100, 554328, 544666, 533523, 523619, 515186, 506136, 496470, 488022, 480566, 472610, 465352, 461335, 459857, 458135, 456221, 456242, 457483, 456758, 453166, 448105, 441274, 431158, 418991, 407772, 397746, 387073, 376381, 368246, 362560, 356851, 350850, 346402, 343198, 338918, 333426, 328581, 324175, 318330, 311638, 306510, 302489, 296484, 287570, 277314, 265560, 250645, 234115, 220609, 212242, 207125, 203972, 203918, 206935, 210531]
55739B10531K777L073L905L436K418K331K186Q06k07O78J793J358Q76K044L139
55724B41144K112M56M53J279J335J661L496N187N042M605N668O754O040M971N363
55709B95566N766M310K496K308K154m13m241o654p778r097r896q921p591p809
55695B50200q402p263n222m331m138l094j940k308l516l909l798m109l790j581
55681A92799J323L124M217N495N914M519K813K327J951M95n12M64J777J345L09
55666B28360O66J499Q99m50j011j632l589n405n202m245m616n311m320k737k868
55651A90038l854l143j062k2l63o09r21k505m464m731l579k942l018k591j919
55636A54315k189k857k484j530j470k025j943j559j828j912o14Q70N60r86j718
$$ y = [210531, 213308, 216381, 220286, 223722, 226140, 228471, 230657, 231463, 231256, 231934, 233727, 235085, 235961, 238005, 241144, 243256, 243712, 244165, 245444, 246779, 248440, 251936, 257123, 262165, 266770, 272438, 279192, 285232, 290203, 295566, 301332, 305642, 308138, 310446, 312600, 312187, 307946, 301292, 293514, 284417, 274521, 265600, 258009, 250200, 241798, 234535, 229313, 224982, 220844, 217750, 215810, 213502, 209986, 206077, 202279, 198170, 194380, 192799, 194122, 197246, 201463, 206958, 212872, 217391, 220204, 222531, 224482, 224977, 224465, 224929, 226706, 228051, 228360, 229026, 230525, 231424, 230974, 229963, 228331, 224742, 219337, 214135, 209890, 205274, 199963, 195643, 192906, 190038, 186184, 183041, 181979, 181957, 181594, 180985, 180064, 177559, 173095, 168364, 164785, 161843, 158825, 156234, 154315, 152126, 149269, 146785, 145255, 143785, 141760, 139817, 138258, 136430, 134518, 133904, 134774, 135334, 134348, 132630]
55621A32630j410j146p22M53J139mj596j506m51n10j194m97J146J453L08l14O
55604A27785j93j157j581j216j031r90k54P03O81N8Q8N20L62J92J072K021J372
55587A28432q3j78R64J296L78l49m03n93p72M2J438K009J667J374J086L39R9J514
55569A38260L508M190L953M499N646N921N617O201P161O506M155J907L17j574
55555A96267l614m537m532m981n750n347l798k691k482k224j838k006k154j158
55541A49155J19k42j899k628j915j375j677j879j920k812m164m236k960k248k816
55526A16503l189k415j385r16o31l26m94j087j433j558j902j997j107K0P9n83
55510I7579p25n72j170j957j529l54j08o85n13L61L90m59o37m4k63j543k244j671
$$ y = [132630, 131220, 130074, 129352, 129805, 130944, 130940, 129344, 127838, 127387, 126877, 125683, 125186, 126332, 127785, 128093, 127779, 127785, 127592, 126435, 124854, 123638, 122607, 121617, 121363, 122066, 122747, 122805, 122893, 123413, 123775, 123967, 125039, 127060, 128432, 128349, 128171, 129135, 130431, 130809, 130460, 130057, 129464, 128692, 128734, 130172, 132181, 133848, 135222, 136308, 136647, 136746, 138260, 141768, 145958, 149911, 154410, 160056, 165977, 171594, 177795, 184956, 191462, 195617, 197524, 197841, 196267, 192653, 188116, 183584, 178603, 172853, 167506, 163708, 161017, 158535, 156311, 154473, 152467, 150313, 149155, 149274, 149032, 147133, 144505, 142590, 141215, 139538, 137659, 135739, 132927, 128763, 124527, 121567, 119319, 116503, 113314, 110899, 109514, 108598, 107967, 107641, 107147, 106060, 104627, 103069, 101167, 99170, 98063, 98083, 98162, 97579, 96854, 96282, 95112, 93155, 91626, 91272, 91164, 90479, 89966, 90327, 90717, 90258, 89621, 89577, 89314, 87771, 85527, 83856]
55492H3856r42p38n58l94p89j148m27N75J81j074j068K41P87O1k56L04K19q99
55474G7931j458r11o74j153q66N01J068qj004n77K33K93K35O58O77l27j345j383
55456G1890q32k83L43P78L80l27QJ142J245j07j174r47m90o04m97L06R21R39J155
55437G3846J530P46j168k024o37J293J753J032M49K97L93J002J935K092J048j54
55421H3433o62q39j010p49j35o3n48l91P95J859K046J941J924J476P00O58J498
55404I1933K029J736J373J121K27r70j015PJ57j172k176j767j232j556j567l12
55388H6816R79J018N00L88J33p08j065k27N15q3j148j325r28q35p66l53m02j413
55370H1096k131j344J07O81L95J54Pm07p01m57k03m09n17j03J45k87o14j78K63
$$ y = [83856, 82914, 82176, 81618, 81224, 80435, 79287, 78860, 79435, 79616, 78542, 77474, 77715, 78502, 78563, 78307, 78611, 78830, 77931, 76473, 75562, 74888, 73735, 72869, 73370, 74438, 74430, 73426, 72849, 73082, 73375, 73610, 74268, 74945, 74618, 73273, 71890, 71058, 70775, 71118, 71896, 72276, 71949, 71957, 73099, 74344, 74237, 73063, 72116, 71626, 71022, 70525, 70831, 71752, 72691, 73846, 75376, 76122, 74954, 72930, 72293, 73586, 75339, 76371, 76820, 77117, 77510, 78512, 80447, 82539, 83587, 83433, 82771, 81932, 80922, 80173, 80038, 79975, 79427, 79036, 79831, 81690, 83736, 85677, 87601, 89077, 89777, 90435, 91933, 93962, 95698, 97071, 98192, 98419, 97449, 96434, 96441, 96598, 95426, 93250, 91483, 90251, 88695, 87128, 86816, 87795, 88813, 89313, 89701, 89834, 89126, 88061, 87834, 88349, 88266, 87118, 85793, 84865, 84030, 83264, 82911, 82509, 81096, 78965, 77621, 77728, 78409, 78804, 78958, 78965, 78558, 77857, 77400, 77197, 76788, 76271, 76168, 76313, 76026, 75412, 75234, 75497]
55351G5497j63r49j205j044q12j78Q43J229M90l09k68o5m44o56J12J052R96L52
55333G4478K74P38Q85N10l0o15j069r02k33l1n69q19k75m6j001k177k228j323
55315F5567l67M52J142J116K44l67P8P79P37L15K19J23m22q60p18o73j200j343
55297F4822l04Q80P57l28r46o61m5N49R01M73o92j365p38K95N55L49N24P73L26
55278F6125m86q19p49p81o43Q6P77N06m21q95n51M2L38K09j07J3R26J763J236
55259F6569k38p39L04J231R15M70R83J495R28K13O42J492J335N02K22L62o4q57
55241G5765j041o13k17J90Q49J083L37m82k37N74P01J53k53n13j016j254o03K95
55223G3718M39J27K09M76K97N5L63O60K07k82J78Q84M99n90q33K8Q73J141J112
$$ y = [75497, 75334, 74385, 73180, 72136, 71324, 71146, 71989, 73218, 73708, 73399, 73131, 73066, 72622, 71966, 72078, 73130, 74126, 74478, 74752, 75490, 76375, 76885, 76855, 76240, 75171, 74269, 74036, 74005, 73436, 72617, 72342, 72296, 71295, 69118, 66890, 65567, 65200, 65652, 66794, 67910, 68154, 67787, 67865, 68644, 69381, 69696, 69915, 70038, 69616, 68756, 68038, 67365, 66165, 64822, 64518, 65398, 66155, 65827, 64881, 64220, 64175, 64724, 65625, 66098, 65406, 64041, 63303, 63598, 64153, 64502, 65026, 65799, 66125, 65639, 64820, 64071, 63290, 62647, 62733, 63510, 64016, 63595, 62700, 62149, 62191, 62529, 62738, 62631, 62644, 63570, 65333, 66569, 66331, 65592, 65896, 67127, 68042, 68512, 69495, 70990, 71918, 72131, 72773, 74265, 75600, 76102, 76324, 76686, 76622, 75765, 74724, 74111, 73894, 74084, 74933, 76016, 76353, 75871, 75634, 76208, 76909, 77062, 76809, 76296, 75280, 74026, 73423, 73718, 74157, 74284, 74493, 74969, 75266, 75321, 75684, 76344, 76551, 76269, 76447, 77331, 77830, 77240, 76407, 76435, 77308, 78449, 79561]
55204G9561O58n36j817k182j788j439j106l77K87L41M95J537K519K005N16k41
55188G8433j01l44j144j298m45L98O15N57K82m83j154p70K12K84q10j773j833
55171G0626j485j050j42J104J841J886J926K018J300l67j767j819q02L41R93R58
55155G5561L37l91p08n47o3P16J522J746J365J250J724J762O50n28m24M32N95
55138H4999N2q9L15M45K21K90N19J69o32j076j095j191j162n34J22p7o49m51K89
55119H0465M30R3M38J365J472M41m15l10O2R5K30Q29J462J721J694J463J084R93
55101I3612J367J401M62m53N6J470J976J169L53K48L04L09P95J551J539P03J95
55084A07057M46N35p9p28q39p42p57p30o83p94o55J73R81P47n2o1O41O95j23n64
$$ y = [79561, 80219, 79683, 77866, 75684, 73896, 72457, 71351, 70974, 71261, 71602, 72097, 73634, 76153, 78158, 78674, 78433, 78332, 77988, 76844, 75546, 75101, 75499, 76114, 76671, 76953, 76470, 75316, 74546, 74758, 75042, 74232, 72459, 70626, 69141, 68091, 67949, 69053, 70894, 72780, 74706, 76724, 78024, 77657, 75890, 74071, 73269, 73610, 74603, 75561, 75898, 75507, 74799, 74252, 74189, 74905, 76427, 78173, 79538, 80788, 82512, 84274, 84924, 84396, 83972, 84404, 84999, 85051, 84962, 85277, 85722, 85943, 86233, 86752, 86921, 86289, 85213, 84118, 82927, 81765, 81231, 81353, 81276, 80627, 80176, 80465, 80895, 80988, 81426, 82791, 84263, 84704, 84289, 83979, 84041, 84136, 84366, 85195, 86657, 88378, 90072, 91535, 92619, 93612, 94979, 96380, 96842, 96389, 96445, 97915, 99891, 101060, 101413, 101661, 101965, 102274, 103069, 104620, 106159, 106862, 107057, 107503, 108038, 107959, 107231, 106392, 105650, 104893, 104163, 103480, 102686, 102031, 102204, 103185, 103932, 103880, 103819, 104460, 105155, 105032, 104468]
55064A04468k12o8m70m13M99J218J080P64P85O34J31L8O37J121J040R61J074O56
55046A13943m52j243j134p73o70l68L07N96R0n60q10q68p09J38J264J303r9j601
55028A08354k082j930j774j401o45q4kJ34M41J07j126k178k187j666j410j347
55012I1204j157r66p47q4Q77J310J037P99Q12M29k74j12J236K329J956P80N7j3
54994I9473K03P00J354J588J366J475K140K487K038J557J622J718J531J856L176
54979A24284M624N289N544O059O650P028P628Q660R476R765J0348J1824J3503
54966B30682J4626J5514J6566J7228J7006J6345J5450J3354R315M129j052o141
54954C63022j1188j5201j7269j8024j8578j8734j7598j5330j3013j1231r831q639
$$ y = [104468, 104256, 104188, 103718, 103305, 103804, 105022, 106102, 106866, 107651, 108285, 108416, 108454, 109091, 110212, 111252, 112213, 113287, 113943, 113491, 112248, 111114, 110341, 109671, 109303, 109610, 110206, 110296, 109736, 108926, 108058, 107349, 107487, 108751, 110054, 109955, 108354, 106272, 104342, 102568, 101167, 100522, 100438, 100436, 100570, 101011, 101118, 99992, 97814, 95627, 93961, 92551, 91204, 90047, 89081, 88334, 88250, 89127, 90437, 91474, 92273, 93085, 93514, 93240, 93128, 94364, 96693, 98649, 99429, 99486, 99473, 99676, 100376, 101730, 103318, 104684, 106159, 108299, 110786, 112824, 114381, 116003, 117721, 119252, 121108, 124284, 128908, 134197, 139741, 145800, 152450, 159478, 167106, 175766, 185242, 195007, 205355, 217179, 230682, 245308, 260822, 277388, 294616, 311622, 327967, 343417, 356771, 366086, 370215, 369163, 363022, 351834, 336633, 319364, 301340, 282762, 264028, 246430, 231100, 218087, 206856, 197025, 188386]
54942A88386p508o199m956m505m765m493l062j495p29J0J781L942N113N368N872
54927A72760O942P974Q933J0355J2032J3127J3559J4153J5218J5922J5176J2595
54915C18746Q618M145j33m364r055j3754j7056j8269j8217j7732j6489j4204j1887
54902A90349j0676j0214r400q099o949o008m833l503k466j743j168j070j717k524
54888A19979k763k647k761k860k313j379r72j295j600j300n27K61P24P73O85P37
54872A02742N79l75j696k029j061k95j050k560l070k119o66L26N37O5m50r6J097
54855H9879J918J662J228J584K138J846J011N82L84l90j467j805j343r91j004
54840I5232p30j8M41K54j09o7M55J170J646J583J367J842L046L828L442K719K730
$$ y = [188386, 180878, 174679, 169723, 165218, 160453, 155960, 152898, 151403, 150674, 150684, 152465, 156407, 161520, 166888, 172760, 179702, 187676, 196609, 206964, 218996, 232123, 245682, 259835, 275053, 290975, 306151, 318746, 327364, 331509, 331376, 327012, 317957, 304203, 287147, 268878, 250661, 232929, 216440, 202236, 190349, 179673, 169459, 160059, 151960, 145011, 139003, 134170, 130667, 128201, 126458, 125290, 124220, 122503, 119979, 117216, 114569, 111808, 108948, 106635, 105256, 104284, 102989, 101389, 100089, 99562, 99823, 100547, 101320, 102005, 102742, 103321, 102946, 101250, 99221, 98160, 97865, 96815, 94255, 91185, 89066, 88400, 88726, 89263, 89328, 88878, 88782, 89879, 91797, 93459, 94687, 96271, 98409, 100255, 101266, 101848, 102232, 101842, 100375, 98570, 97227, 96236, 95232, 94502, 94484, 94925, 95179, 95070, 95003, 95458, 96628, 98274, 99857, 101224, 103066, 106112, 109940, 113382, 116101, 118831]
54823A18831L203L339L381L997M843N254N793P485R889J1517J2084J2756J4136
54810B16508J5525J6371J7037J7681J7571J5912J2647Q191L163j554n317q362
54798C25373j1271j3870j5467j5988j5988j5564j4270j2131r841p918o361n243
54786A81461m699m322l361j715j16Q47J300J651K094K616L151L682M417N603O994
54771A99603Q061Q904J0322J2590J4980J6894J8528J9713J9310J6787J3337J0235
54759C69264O994K506k835p657j1536j4781j6951j7402j6949j7062j7502j6594
54747B39495j4014j1519j0517j0401r935q862p612o426n425m790m436m097l756
54734A37705l489k985k026j218j246j611j228j17N66K64m08p83q43o84l82l68
$$ y = [118831, 122034, 125373, 128754, 132751, 137594, 142848, 148641, 156126, 166015, 177532, 189616, 202372, 216508, 232033, 248404, 265441, 283122, 300693, 316605, 329252, 337443, 340606, 339052, 333735, 325373, 314102, 300232, 284765, 268777, 252789, 237225, 222955, 210824, 200983, 193065, 186704, 181461, 176762, 172440, 169079, 167364, 167248, 168095, 169395, 171046, 173140, 175756, 178907, 182589, 187006, 192609, 199603, 207664, 216568, 226890, 239480, 254460, 271354, 289882, 309595, 328905, 345692, 359029, 369264, 376258, 378764, 375929, 368272, 356736, 341955, 325004, 307602, 290653, 273591, 256089, 239495, 225481, 213962, 203445, 193044, 183109, 174247, 166635, 160209, 154784, 149994, 145558, 141461, 137705, 134216, 131231, 129205, 127987, 126741, 125130, 123902, 123785, 124351, 124615, 124207, 123424, 122581, 121897, 121515, 121147]
54718A21147r71j639j556r43o66p59n66p0J64L12J004J764J395O4o25l8O33M56
54700A19106J10L83P18K93n61r91q47m68N5O84J106J192J280J454J232L63o53
54683A24456j180j068m03O08J384J398J119J636L017M037L875L233L174L732M240
54668A53258M343M089L637L380L849N020O117O431N914M832L496K506K482L245
54654B12599L853L803L554L648L991M351M791N244N251M506L167J381r32l551
54640B55656n848p453q558r352r712r653r468r202q541p429o218n147m146l276
54626A51653k753k493k206j894j644j146j92N22J55p99q63M42K061K964L197L091
54610A50095K634K029J869K232K463K210J839J499P47m64j374j553j554j980k641
$$ y = [121147, 120176, 118537, 116981, 116038, 115372, 114613, 114047, 113977, 114141, 114453, 115457, 117221, 118616, 118680, 118055, 118017, 118650, 119106, 119216, 119599, 120317, 120610, 120049, 119058, 118211, 117743, 117798, 118482, 119588, 120780, 122060, 123514, 124746, 125109, 124456, 123276, 122208, 121805, 122413, 123797, 125195, 126314, 127950, 130967, 135004, 138879, 142112, 145286, 149018, 153258, 157601, 161690, 165327, 168707, 172556, 177576, 183693, 190124, 196038, 200870, 204366, 206872, 209354, 212599, 216452, 220255, 223809, 227457, 231448, 235799, 240590, 245834, 251085, 255591, 258758, 260139, 259207, 255656, 249808, 242355, 233797, 224445, 214733, 205080, 195612, 186410, 177869, 170440, 164222, 159075, 154929, 151653, 148900, 146407, 144201, 142307, 140663, 139517, 139325, 139847, 140002, 139203, 138340, 138782, 140843, 143807, 147004, 150095, 152729, 154758, 156627, 158859, 161322, 163532, 165371, 166870, 167617, 167153, 165779, 164226, 162672, 160692, 158051]
54595A58051l127l456l712l753l663l856m317m500m208l818l378k432j074k35
54581A12522m49j148j575j584j230n25J07N6m37m67L9J85j83m2R17J336J55j634
54563A06043k316j572l06P71J422J474J187J296J839J681J78j496j755o77M76
54548A08245J176J810K429K581K315K239K570K904K966K888K876L073L537L908
54534A45517L416J853O7r87j383j796k418k944l291l661m051m236m028l293k163
54519A16602j373j699k696k900j824p84r87j766j716p57J57P22J283J645J234
54504A05141M32L55J225J994J802R60K59J27O00J414J977J793J067M00l2m80q94
54487A18140q86m55o0N2O9O0j77o15q30n32J28Q27J318J393R67K93j89l04k37
$$ y = [158051, 154924, 151468, 147756, 144003, 140340, 136484, 132167, 127667, 123459, 119641, 116263, 113831, 112757, 112522, 112073, 110925, 109350, 107766, 106536, 106011, 106118, 106174, 105737, 105270, 105309, 105494, 105311, 105269, 106186, 107522, 107677, 106043, 103727, 102155, 101849, 102620, 104042, 105516, 106703, 107999, 109838, 111519, 111697, 110201, 108446, 107769, 108245, 109421, 111231, 113660, 116241, 118556, 120795, 123365, 126269, 129235, 132123, 134999, 138072, 141609, 145517, 148933, 150786, 150853, 149866, 148483, 146687, 144269, 141325, 138034, 134373, 130322, 126086, 122058, 118765, 116602, 115229, 113530, 110834, 107934, 106110, 105326, 104339, 102573, 100857, 100100, 100257, 100979, 102262, 103907, 105141, 105573, 105928, 107153, 109147, 110949, 111909, 112168, 112295, 112895, 114309, 116286, 118079, 119146, 119546, 119514, 119034, 118140, 117254, 116799, 116739, 116791, 116860, 116920, 116743, 116128, 115298, 114766, 114894, 115721, 117039, 118432, 119399, 119692, 119503, 119199, 118962]
54468A18962k38m38p98j025p05J85J077J441J384J298J126N04m51j020o93K05
54452A20814Q36O44k21j115j473j232p56m11l65o20j011j198j000o84o32p97q27
54435A09952o41l85oN38P60J23r50j310n26O47J442J902K181J977J238O71Q45
54418A18458J370J580J497J528J618J432J066Q92R79J146J411J927K595L062L024
54403A43585K393J458R16J295K218K745K589K420K823L541L995L942L324K173
54389A79417Q30k61j169k233l182l395l102l202l681l439k210j330j822k934l398
54374A44889l126k710k227j607j273j429j469j094j077j861k436j802p23n55j041
54359A20459q23L02J226J360J152Q70K71m37n10K61J309K144K603K474J816J489
$$ y = [118962, 118724, 118286, 117488, 116463, 115758, 115943, 117020, 118461, 119845, 121143, 122269, 122773, 122322, 121302, 120609, 120814, 121650, 122294, 122073, 120958, 119485, 118253, 117497, 117086, 116721, 116101, 115090, 113892, 112892, 112208, 111576, 110779, 109952, 109311, 108926, 108920, 109458, 110218, 110341, 109391, 108081, 107555, 108202, 109644, 111546, 113727, 115704, 116942, 117613, 118458, 119828, 121408, 122905, 124433, 126051, 127483, 128549, 129441, 130420, 131566, 132977, 134904, 137499, 140561, 143585, 145978, 147436, 148352, 149647, 151865, 154610, 157199, 159619, 162442, 165983, 169978, 173920, 177244, 179417, 180247, 179986, 178817, 176584, 173402, 170007, 166905, 163703, 160022, 156583, 154373, 153043, 151221, 148287, 144889, 141763, 139053, 136826, 135219, 133946, 132517, 131048, 129954, 128877, 127016, 124580, 122778, 122055, 121500, 120459, 119636, 119938, 121164, 122524, 123676, 124546, 124817, 124380, 123870, 124131, 125440, 127584, 130187, 132661, 134477, 135966]
54343A35966K303L740M481M133L480L150L026K910K739K173Q91o74j736k273k879
54328A61430l577l766l320k797k534k421k561l220m044m254l795l409l439l395
54314A14898k866k131j596j320j262j429j619j574j351j147q60l85j01l59p70
54299I6128p61n35o35q02m01K74K60m46p62k10M27M55K48L15L70q0p92j050n23
54280I1480N03J401J614J119M78J30k16r14j441r77K07Q81N16n5J51J114K149
54263I8140K655K377J489O78N67R46J025M85k72q59j215j276j074j086j669k228
54247I8683j789n08L71K13k53k14J38J69j90o13r41j165j171q94l71L63J119J404
54229I4351R46K72J23M21N11L07L00M51J42o04r22m89r1l20n69o3Q41J103M26
$$ y = [135966, 138269, 142009, 146490, 150623, 154103, 157253, 160279, 163189, 165928, 168101, 168992, 168318, 166582, 164309, 161430, 157853, 154087, 150767, 147970, 145436, 143015, 140454, 137234, 133190, 128936, 125141, 121732, 118293, 114898, 112032, 109901, 108305, 106985, 105723, 104294, 102675, 101101, 99750, 98603, 97743, 97358, 97257, 96898, 96128, 95367, 94832, 94197, 93395, 92994, 93268, 93528, 93082, 92320, 92110, 92537, 92992, 93240, 93555, 93925, 93845, 93053, 92003, 91480, 91983, 93384, 94998, 96117, 96595, 96725, 96509, 95595, 94154, 93177, 93384, 94265, 94781, 94726, 94877, 95991, 98140, 100795, 103172, 104661, 105339, 105906, 106852, 107877, 108362, 108090, 107231, 106016, 104740, 103666, 102580, 100911, 98683, 96894, 96386, 96757, 96970, 96717, 96503, 96641, 96810, 96620, 96007, 95066, 93901, 92730, 91836, 91465, 91828, 92947, 94351, 95297, 95569, 95692, 96113, 96624, 96931, 97231, 97682, 97824, 97220, 96298, 95809, 95718, 95398, 94829, 94766, 95607, 96710, 97136]
54210I7136m44p15l26J63K21j37m69n88q59j504j983j679q90m34m34k59L59J003
54192H8161J310J301Q62j80j429k076j896j357p50QO64O41j3n70o26m11N3J052
54174H4744K269K741K172J382J049Q55L27l26o77o83m28P6M55J34p29j227r48
54157I1186m64k30N3N52P09K29k54j59P9j48n49m61K3L19L23M55R09J464J780
54138I5816J521N04r27j966k088j449m57N54J140R76M87M96R49Q74j2o32j15Q24
54120I6495R60K95k28k35j94m16o55o69n54n23p26j136j383r59M7Q04O56j39q64
54101I0576j181j225j284j624k200k408j691n54j44o23q49j99L91p2r85j095l71
54084G4462K11L48O28J196J401R11K99J98M33M00r0n62l68N89J568J683J006O25
$$ y = [97136, 96692, 95977, 95651, 95814, 96035, 95898, 95429, 94841, 93982, 92478, 90495, 88816, 87926, 87492, 87058, 86799, 87158, 88161, 89471, 90772, 91634, 91454, 90025, 87949, 86053, 84696, 83946, 83954, 84618, 85259, 85246, 84676, 84050, 83639, 83692, 84744, 87013, 89754, 91926, 93308, 94357, 95212, 95539, 95213, 94536, 93853, 93425, 93501, 93956, 94090, 93361, 92134, 91186, 90722, 90492, 90545, 91097, 91806, 92035, 91781, 91622, 91701, 91553, 91004, 90543, 90566, 90885, 91208, 91663, 92572, 94036, 95816, 97337, 97841, 96914, 94948, 92860, 91411, 90954, 91508, 92648, 93624, 94111, 94607, 95556, 96430, 96418, 95786, 95671, 96495, 97455, 97750, 97522, 97287, 97093, 96677, 96022, 95353, 94799, 94276, 93550, 92414, 91031, 90072, 90119, 90923, 91579, 91440, 90576, 89395, 88170, 86886, 85262, 83062, 80654, 78963, 78409, 78265, 77642, 76793, 76594, 76985, 76913, 75928, 74833, 74462, 74673, 75021, 75649, 76845, 78246, 79157, 79456, 79654, 80087, 80487, 80397, 79835, 79467, 80056, 81624, 83307, 84313, 84938]
54066H4938J275K285K368J230j30o72l74j5j51m68k29P29J637J646Q55Q0j62N2
54048I4894N84J365K052K263K186K255K282J811J266J624K785L449L047K549K754
54033A27166L008K516J865K125L207M188M690M946M996M813M797N250N688N452
54019A84707M704M091L897M080M657N232M864L261J599J085J249P05p47k050k621
54004B18713k923l321l556l599l856m377m585m239l872l985m373m549m320l743
53990A63415k925k108j565j301j117j005j144j485j664j439r26l95K3L78P44J011
53974A48497Q52J51o04p73l97j05j41j03K05M59N79J021J857K406K271J994K047
53957A60216K026J542J093J209J474J321J054J151J256R35P64J435K346K444K053
$$ y = [84938, 86213, 88498, 90866, 92096, 91966, 91294, 90920, 90905, 90754, 90286, 90057, 90786, 92423, 94069, 94924, 95004, 94842, 94894, 95478, 96843, 98895, 101158, 103344, 105599, 107881, 109692, 110958, 112582, 115367, 118816, 121863, 124412, 127166, 130174, 132690, 134555, 136680, 139887, 144075, 148765, 153711, 158707, 163520, 168317, 173567, 179255, 184707, 189411, 193502, 197399, 201479, 206136, 211368, 216232, 219493, 221092, 222177, 223426, 224131, 223384, 221334, 218713, 215790, 212469, 208913, 205314, 201458, 197081, 192496, 188257, 184385, 180400, 176027, 171478, 167158, 163415, 160490, 158382, 156817, 155516, 154399, 153394, 152250, 150765, 149101, 147662, 146736, 146341, 146364, 146742, 147486, 148497, 149349, 149500, 148896, 148123, 147726, 147621, 147480, 147377, 147582, 148041, 148620, 149641, 151498, 153904, 156175, 158169, 160216, 162242, 163784, 164877, 166086, 167560, 168881, 169935, 171086, 172342, 173277, 174041, 175476, 177822, 180266, 182319]
53942A82319K423L715M891N480O048O740O799N876M669L808L062K036Q10m41j729
53927B36506k886l538l662l508k956j709j96O07M79K89P52J629K328K702K916
53912B29753L134L523M090M442M251L924M183N003N671N792N554N072M329L688
53898B92409L520L283K039k2j665k335k749l382l614k998k305k507l451m291m646
53883B67286m691m645m771n312o011o179n773n661o317o963o709n847n232m968
53869A88207m583m112l976l993l543k621j983k050k421k616k613k481k012j183
53855A48020n46p16j587k352k389j916j660j915k156j697o11K64K31o02j565k051
53839A26752j801r34R3O98O48K29j45l99o74r15q79n24k03k59n75p11m60j10M5
$$ y = [182319, 184742, 188457, 193348, 198828, 204876, 211616, 218415, 224291, 228960, 232768, 235830, 237866, 238676, 238235, 236506, 233620, 230082, 226420, 222912, 219956, 218247, 218051, 218658, 219137, 219426, 220178, 221807, 224135, 226837, 229753, 232887, 236410, 240500, 244942, 249193, 253117, 257300, 262303, 267974, 273766, 279320, 284392, 288721, 292409, 295929, 299212, 301251, 301229, 299564, 297229, 294480, 291098, 287484, 284486, 282181, 279674, 276223, 271932, 267286, 262595, 257950, 253179, 247867, 241856, 235677, 229904, 224243, 217926, 210963, 204254, 198407, 193175, 188207, 183624, 179512, 175536, 171543, 168000, 165379, 163396, 161346, 158925, 156309, 153696, 151215, 149203, 148020, 147474, 146758, 145171, 142819, 140430, 138514, 136854, 134939, 132783, 131086, 130475, 130739, 130970, 130368, 128803, 126752, 124951, 124017, 124110, 124808, 125456, 125685, 125540, 125141, 124467, 123552, 122673, 122149, 121946, 121687, 121112, 120401, 119941, 119831, 119876]
53820A19876J75O44J332J673J406Q77M91K77K00M56J058J552J539J234J084J113
53804A34987J117J240J863L018M309N301N684N319M544M104M383M925N148N118
53790A91060N099M820L964L003K650K689K326J587J303J640J724J084M28M50O97
53775B24524L08o93j559j939k155k562l149l732m143m237l955l410k777k190j789
53760A86542j739k052k478k626k306j724j343j358j389r66l08j57o67j069q37
53745A65523n35q79j440j169M9J200J479J054M43j23n75p81o66k97J64L77n2j003
53727A62769j763j951k105k704l122k460j051j20q4k70k33j89j57K38P89O44l50
53710A47881j167r72j57M84R09J506K223K568K293J652J225J483K300K901K730
$$ y = [119876, 120051, 120695, 122027, 123700, 125106, 125983, 126474, 126751, 126951, 127407, 128465, 130017, 131556, 132790, 133874, 134987, 136104, 137344, 139207, 142225, 146534, 151835, 157519, 162838, 167382, 171486, 175869, 180794, 185942, 191060, 196159, 200979, 204943, 207946, 210596, 213285, 215611, 217198, 218501, 220141, 221865, 222949, 223377, 223827, 224524, 224832, 224139, 222580, 220641, 218486, 215924, 212775, 209043, 204900, 200663, 196708, 193298, 190521, 188331, 186542, 184803, 182751, 180273, 177647, 175341, 173617, 172274, 170916, 169527, 168561, 168253, 168096, 167429, 166360, 165523, 164988, 164109, 162669, 161500, 161549, 162749, 164228, 165282, 165725, 165602, 165027, 164246, 163580, 163283, 163447, 163824, 163772, 162769, 161006, 159055, 156950, 154246, 151124, 148664, 147613, 147493, 147409, 147139, 146906, 146717, 146560, 146798, 147587, 148231, 147881, 146714, 145742, 145585, 146069, 146978, 148484, 150707, 153275, 155568, 157220, 158445, 159928, 162228, 165129, 167859]
53695A67859K247K310L031L785M203M241L654K391J387J688K773L107K474K323
53681B07473L409M581M614L894L357K979K384J911J956K052J681J266J356J430
53667B44343O97m38q17j71P06J126J030N66j2k00J52L99n3o90n27L61Q17J64r90
53648B46463j625j405q04m61n64o41j54O56Q72J36p66r62o03l83m61n28n95q92
53630B37283j272j374j200r47n01K21P36N50R3L27J427K536K874K419J611R74
53614B45757J041J916K823K752J802J260K007L388M039L521K681K542L261M206
53600B82996M733M641M070L265K578K430K963L832M628N387O332P246P576P194
53586C49871O565O146N940N806N715N672N760O226O976P154O016M225L377M049
$$ y = [167859, 170106, 172416, 175447, 179232, 183435, 187676, 191330, 193721, 195108, 196796, 199569, 202676, 205150, 207473, 210882, 215463, 220077, 223971, 227328, 230307, 232691, 234602, 236558, 238610, 240291, 241557, 242913, 244343, 245040, 244602, 243785, 243614, 244320, 245446, 246476, 247042, 247030, 246830, 246982, 247381, 247328, 246638, 246111, 246472, 247289, 247453, 246463, 244838, 243433, 242629, 242168, 241604, 240963, 240809, 241465, 242337, 242473, 241707, 240745, 240142, 239759, 239298, 238770, 238175, 237283, 236011, 234637, 233437, 232490, 231989, 232210, 232946, 233496, 233589, 233916, 235343, 237879, 240753, 243172, 244783, 245757, 246798, 248714, 251537, 254289, 256091, 257351, 259358, 262746, 266785, 270306, 272987, 275529, 278790, 282996, 287729, 292370, 296440, 299705, 302283, 304713, 307676, 311508, 316136, 321523, 327855, 335101, 342677, 349871, 356436, 362582, 368522, 374328, 380043, 385715, 391475, 397701, 404677, 411831, 417847, 422072, 425449, 429498]
53572D29498N229N927O260O557O484N768M894M337L865L322L191L570L542K539
53558D94983J454J242J271M30q67j308r05r09j624j936j315p18j074k025k788
53543D83911l256l671m001m180m387m572m302l422k372j563r75n88o65j179j558
53528D43220j363p39M4R97K057K763K795K491K509L181M414N923P280P997P961
53513D91530P606P544Q043Q988J0108J1124J1871J2402J2865J3304J3741J4398
53501F23524J5542J7051J8442J9373J9967K0540K1247K2061K2864K3516K3989
53490H48116K4477K5244K6357K7586K8555K8916K8652K8342K8819L0234L1635
53479A156933L1886L0920K9704K9050K8933K8902K8808K8816K8978K9046K8739
$$ y = [429498, 434727, 440654, 446914, 453471, 459955, 465723, 470617, 474954, 478819, 482141, 485332, 488902, 492444, 494983, 496437, 497679, 498950, 499380, 498513, 497205, 496300, 495391, 493767, 491831, 490516, 489798, 488724, 486699, 483911, 480655, 476984, 472983, 468803, 464416, 459844, 455542, 452120, 449748, 448185, 447210, 446622, 445957, 444778, 443220, 441857, 441118, 441162, 442159, 444216, 446979, 449774, 452265, 454774, 457955, 462369, 468292, 475572, 483569, 491530, 499136, 506680, 514723, 523711, 533819, 544943, 556814, 569216, 582081, 595385, 609126, 623524, 639066, 656117, 674559, 693932, 713899, 734439, 755686, 777747, 800611, 824127, 848116, 872593, 897837, 924194, 951780, 980335, 1009251, 1037903, 1066245, 1095064, 1125298, 1156933, 1188819, 1219739, 1249443, 1278493, 1307426, 1336328, 1365136, 1393952, 1422930, 1451976, 1480715]
53468A480715K8098K7477K7063K6583K5674K4436K3199K1831J9881J7510J5590
53457A738057J4493J3481J1798R792Q353P740P676Q077Q807R045P816N244K476
53444A852855L21j390l152n135p305r587j1752j3595j5244j7014j8881k0562k1971
53431A707588k3204k4171k4777k5314k6171k7298k8337k9164k9797k9955k9440
53420A409960k8644k8008k7160k5484k3405k2046k1549k0762j8964j6932j5695
53409A161311j5079j4132j2405j0140p525m539j346J646M089N896P265Q719J0816
53396A134576J3567J6341J8510K0129K1745K3715K5903K7911K9491L0772L2080
53385A394740L3544L5017L6477L8235M0435M2608M4185M5289M6506M8027M9605
$$ y = [1480715, 1508813, 1536290, 1563353, 1589936, 1615610, 1640046, 1663245, 1685076, 1704957, 1722467, 1738057, 1752550, 1766031, 1777829, 1787621, 1795974, 1803714, 1811390, 1819467, 1828274, 1837319, 1845135, 1850379, 1852855, 1853176, 1851786, 1848634, 1843499, 1836194, 1826607, 1814855, 1801260, 1786016, 1769002, 1750121, 1729559, 1707588, 1684384, 1660213, 1635436, 1610122, 1583951, 1556653, 1528316, 1499152, 1469355, 1439400, 1409960, 1381316, 1353308, 1326148, 1300664, 1277259, 1255213, 1233664, 1212902, 1193938, 1177006, 1161311, 1146232, 1132100, 1119695, 1109555, 1102030, 1097491, 1096145, 1097791, 1101880, 1107776, 1115041, 1123760, 1134576, 1148143, 1164484, 1182994, 1203123, 1224868, 1248583, 1274486, 1302397, 1331888, 1362660, 1394740, 1428284, 1463301, 1499778, 1538013, 1578448, 1621056, 1665241, 1710530, 1757036, 1805063, 1854668]
53374A854668N1270N3393N5902N8182N9957O1685O3738O5689O6871O7220O7202
53363B525777O7108O6828O6145O4966O3300O1192N8643N5578N1959M7914M3664
53352C173074L9406L5457L2208K9601K6869K3216J8779J4374J0358O265J601l531
53340C407677q751j3852j8865k4166l0559l8559m7386n5220o0859o4696o7679
53329B977085o9886p0676o9936o8485o7232o6413o5741o4882o3683o2139o0430
53318B247582n8927n7879n7051n5786n3682n1108m8803m6965m5021m2377l9053
53307A690930l5492l2102k9146k6645k4157k1157j7989j5852j5323j5426j4799
53296A442842j3332j1909j0955j0123r217q418p613o396m815l410k420j588p77
$$ y = [1854668, 1905938, 1959331, 2015233, 2073415, 2133372, 2195057, 2258795, 2324484, 2391355, 2458575, 2525777, 2592885, 2659713, 2725858, 2790824, 2854124, 2915316, 2973959, 3029537, 3081496, 3129410, 3173074, 3212480, 3247937, 3280145, 3309746, 3336615, 3359831, 3378610, 3392984, 3403342, 3409607, 3411208, 3407677, 3398926, 3385074, 3366209, 3342043, 3311484, 3272925, 3225539, 3170319, 3109460, 3044764, 2977085, 2907199, 2836523, 2766587, 2698102, 2630870, 2564457, 2498716, 2433834, 2370151, 2308012, 2247582, 2188655, 2130776, 2073725, 2017939, 1964257, 1913149, 1864346, 1817381, 1772360, 1729983, 1690930, 1655438, 1623336, 1594190, 1567545, 1543388, 1522231, 1504242, 1488390, 1473067, 1457641, 1442842, 1429510, 1417601, 1406646, 1396523, 1387306, 1378888, 1371275, 1364879, 1360064, 1356654, 1354234, 1352646, 1351869]
53283A351869n4P77K029L474M642N774P634J0254J2778J4736J6622J8917K1373
53270A470825K3626K5690K7490K8669K9213K9586K9871K9580K8732K8240K8563
53259A780085K8832K8055K6488K4981K3610K1947K0259J9253J8796J7833J5862
53248B026001J3560J1705J0027P679M442R41k263n384q960j2964j6739j9860k2684
53235A985501k5754k8938l1561l3172l3801l3738l3483l3728l4739l5836l6050
53224A624701l5275l4188l3137l1881l0363k9019k8161k7717k7682k8169k8909
53213A290200k9445k9867l0610l1407l1381l0363k9205k8452k7620k6248k4760
53202I70842k3663k2734k1570k0339j9408j8799j8541j8838j9503j9799j9417
$$ y = [1351869, 1351815, 1352592, 1354621, 1358095, 1362737, 1368511, 1376145, 1386399, 1399177, 1413913, 1430535, 1449452, 1470825, 1494451, 1520141, 1547631, 1576300, 1605513, 1635099, 1664970, 1694550, 1723282, 1751522, 1780085, 1808917, 1836972, 1863460, 1888441, 1912051, 1933998, 1954257, 1973510, 1992306, 2010139, 2026001, 2039561, 2051266, 2061293, 2068972, 2073414, 2074355, 2072092, 2066708, 2057748, 2044784, 2028045, 2008185, 1985501, 1959747, 1930809, 1899248, 1866076, 1832275, 1798537, 1765054, 1731326, 1696587, 1660751, 1624701, 1589426, 1555238, 1522101, 1490220, 1459857, 1430838, 1402677, 1374960, 1347278, 1319109, 1290200, 1260755, 1230888, 1200278, 1168871, 1137490, 1107127, 1077922, 1049470, 1021850, 995602, 970842, 947179, 924445, 902875, 882536, 863128, 844329, 825788, 806950, 787447, 767648, 748231]
53191G48231j8868j8503j7987j7210j6811j7003j6874j5708j4215j3451j3217
53180E68384j2670j1885j1603j1907j2247j2494j2887j3170j2919j2478j2512
53169D31612j2774j2341j1045r634q577p733p143p011o872n839m013k549k043
53156C34038j761r51RK87k56j198k192k979l223k969k846l345m171m708m852m996
53140B93887n374n863o253o385o090n369m642m491n034n641n501m483l311k774
53126B22676k847k818k285j664j569j990k415k554k617k828l017k762j925j000
53112A90385p36j234j600r60K18N08o21k017k327j622r76q86q54l69L61O95K15
53095A78180q26j570j366o57n78j393k049j748j191j488k395k722k095j265q81
$$ y = [748231, 729363, 710860, 692873, 675663, 658852, 641849, 624975, 609267, 595052, 581601, 568384, 555714, 543829, 532226, 520319, 508072, 495578, 482691, 469521, 456602, 444124, 431612, 418838, 406497, 395452, 385818, 377241, 369508, 362365, 355354, 348482, 342643, 338630, 336081, 334038, 332277, 331326, 331335, 331622, 331366, 330168, 327976, 324997, 321774, 318805, 315959, 312614, 308443, 303735, 298883, 293887, 288513, 282650, 276397, 270012, 263922, 258553, 253911, 249420, 244386, 238745, 233244, 228761, 225450, 222676, 219829, 217011, 214726, 213062, 211493, 209503, 207088, 204534, 201917, 199089, 196072, 193310, 191385, 190385, 189649, 188415, 186815, 185855, 186073, 186581, 185960, 183943, 181616, 179994, 179018, 178132, 177278, 176909, 177270, 177965, 178180, 177354, 175784, 174418, 173761, 173183, 171790, 169741, 167993, 166802, 165314, 162919, 160197, 158102, 156837, 155956]
53080A55956r15j250j801k038j430m53k11q11j130n49J19m6o36o21O3M45j30j207
53062A43355j759j230m6P86O29j53o97o62m59m85n96m44K7N76Q83P09J40k92r8
53043A40184N45R86R16N40J07k91m25j22K42P0n01o56j41L18J45k23j18L50P10
53024A42636J015J627K389K769K646K393K280K305K504K833K909K447J919K158
53010A74830L208M160M346M093L971L822L154K142J554J651J772J224J33r67j962
52995B07131l083m164m618m287l790l718l886l731l198k773k729k803k717k590
52981A59044k678k858k721k070j276r63j340j853j780j153p81j129j582j223j10
52966A35527P69Q09M71N18J066J657J925J842J527J144R09Q73P97M59N5NL43N93
$$ y = [155956, 155041, 153791, 151990, 149952, 148522, 148069, 147858, 147047, 145917, 145368, 145487, 145441, 144805, 144184, 144247, 144692, 144562, 143355, 141596, 140366, 140320, 141106, 141735, 141582, 140885, 140223, 139764, 139279, 138683, 138239, 138266, 138842, 139725, 140434, 140574, 140282, 140184, 140729, 141715, 142631, 143171, 143278, 142987, 142562, 142440, 142682, 142752, 142251, 141595, 141454, 141772, 141917, 141694, 141576, 141926, 142636, 143651, 145278, 147667, 150436, 153082, 155475, 157755, 160060, 162564, 165397, 168306, 170753, 172672, 174830, 178038, 182198, 186544, 190637, 194608, 198430, 201584, 203726, 205280, 206931, 208703, 209927, 210060, 209093, 207131, 204048, 199884, 195266, 190979, 187189, 183471, 179585, 175854, 172656, 169883, 167154, 164351, 161634, 159044, 156366, 153508, 150787, 148717, 147441, 146478, 145138, 143285, 141505, 140352, 139571, 138442, 136860, 135637, 135527, 136296, 137105, 137576, 138094, 139160, 140817, 142742, 144584, 146111, 147255, 148164, 149037, 149834, 150293, 150348, 150353, 150696, 151289]
52948A51289M06R6K08P55J228J372J513J849J910J204J66j54N96J650K168K178
52932A68434K120K007J567R21N64O06N87J04o03q97m40M47J024Q17K3p12r12n70
52914A75087MM43M32o6o77r39q60p61o42j45P11J297J230Q75O62L25n27j467j485
52895A73497k04J656L049L542L495L518L826M037L673K838K095J826J993K491
52881B11332L218L784L775L410L164K668R97j588l323l099j921j326j319j061
52867B18711p38j209k255k706k230j574j111m61L13N31J65%K06N3o04p60M1P34
52849B07106L51l84j13J182K277K406J909J458J345J506J646J415Q57M56M22L03
52833B24142l07j031j151o33j59k99j000j766k075j791j372j486k182k738k591
$$ y = [151289, 151695, 151791, 151999, 152754, 153982, 155354, 156867, 158716, 160626, 161830, 161996, 161842, 162438, 164088, 166256, 168434, 170554, 172561, 174128, 175049, 175613, 176219, 176806, 176910, 176307, 175410, 174970, 175417, 176441, 177258, 177281, 176569, 175657, 175087, 175091, 175534, 175966, 175900, 175223, 174284, 173424, 172663, 172021, 171876, 172587, 173884, 175114, 175989, 176651, 176976, 176449, 174982, 173497, 173293, 174949, 177998, 181540, 185035, 188553, 192379, 196416, 200089, 202927, 205022, 206848, 208841, 211332, 214550, 218334, 222109, 225519, 228683, 231351, 232348, 230760, 227437, 224338, 222417, 221091, 219772, 218711, 217973, 216764, 214509, 211803, 209573, 207999, 206888, 206427, 206740, 207271, 207436, 207436, 207642, 207695, 207091, 206331, 206372, 207106, 207457, 207073, 206960, 208142, 210419, 212825, 214734, 216192, 217537, 219043, 220689, 222104, 222961, 223417, 223839, 224142, 223835, 222804, 221653, 221020, 220861, 220562, 219562, 217796, 215721, 213930, 212558, 211072, 208890, 206152, 203561]
52818B03561k037j670j618j690j927k388k666k267j377o90m74l78j78j78o38j277
52802A82108j630j595j347j023p13n71n52k88L94Q85L30j151k302k140j133m71
52786A68801n26p34p73r83j412j399n75L98O66K95n2j24j64k44k66l31n81p83
52768A61213o67n05p07j081j100q31q21j177j464j526j657j871j684q79R1P01
52752A46035Q87Q16O00L49K10K07L34O86J151J251P61K66M75J162J587J678J967
52735A60422K433K458J922J339P83k05j460k074j867j827k587l474l759l827m252
52720A44025m572m038k920k110j859j813j859k126k327k021j416j134j346j665
52706A12819j890k140k343k166j552r21o69p62q36o15j89j6m27j177j690j754
$$ y = [203561, 201524, 199854, 198236, 196546, 194619, 192231, 189565, 187298, 185921, 185231, 184757, 184379, 184201, 184023, 183385, 182108, 180478, 178883, 177536, 176513, 175800, 175229, 174677, 174389, 174783, 175668, 175998, 174847, 172545, 170405, 169272, 168801, 168275, 167541, 166768, 165785, 164373, 162974, 162399, 162797, 163463, 163758, 163706, 163582, 163418, 163174, 162908, 162577, 161996, 161213, 160546, 160041, 159334, 158253, 157153, 156322, 155501, 154324, 152860, 151334, 149677, 147806, 146122, 145243, 145334, 146035, 146922, 147738, 148338, 148687, 148897, 149104, 149438, 150124, 151275, 152526, 153287, 153553, 154028, 155190, 156777, 158455, 160422, 162855, 165313, 167235, 168574, 169357, 169152, 167692, 165618, 163751, 161924, 159337, 155863, 152104, 148277, 144025, 139453, 135415, 132495, 130385, 128526, 126713, 124854, 122728, 120401, 118380, 116964, 115830, 114484, 112819, 110929, 108789, 106446, 104280, 102728, 101807, 101138, 100376, 99540, 98925, 98736, 98720, 98293, 97116, 95426, 93672]
52690I3672j578j216n04L44P72P24P48R64O85m14j496j612r92m96k82J35P95J122
52672I1371P91J18m34o59n88m51n39p61o10K7M45J3q18j031l83L92O23L02k12
52653H7596n03k37N27J118R59M12L58R04J153M70n34p29J82J380K001K084K312
52636I9453K938L309K680J237j13q95j456k140k639k512j870j151o19l80n35r34
52620I4373j113q29m60m18n52m64j54Q0J91L58O12Q43R66Q90M65j69n15k80K18
52601I4042N02N54O36Q17R42R21P36M14J45J60L39L43K19L45O23M23l57q71m83
52582A00450L77R99J306J407J045K99J17J103K348K527J747J163J148J046N98
52567A17680L47M57L88J4J4P13J387J310P19K98J70Kk82l67j9O19J142J185P77
$$ y = [93672, 92094, 90878, 90374, 90718, 91490, 92214, 92962, 93926, 94611, 94197, 92701, 91089, 90097, 89601, 89319, 89454, 90249, 91371, 92162, 92280, 91846, 91187, 90599, 90148, 89609, 88848, 88238, 88265, 88710, 88723, 87905, 86874, 86491, 86883, 87506, 87808, 87596, 87093, 86856, 87383, 88501, 89460, 89872, 90230, 91134, 92287, 92757, 92223, 91494, 91676, 93056, 95057, 97141, 99453, 102391, 105700, 108380, 109617, 109504, 108609, 107153, 105013, 102374, 99862, 97992, 96841, 96222, 95842, 95307, 94373, 93260, 92431, 91971, 91553, 91001, 90537, 90383, 90463, 90654, 91012, 91624, 92467, 93433, 94323, 94788, 94619, 94104, 93824, 94042, 94544, 95098, 95734, 96551, 97493, 98414, 99150, 99564, 99709, 99869, 100208, 100551, 100770, 101115, 101738, 102161, 101804, 100933, 100450, 100827, 101826, 103132, 104539, 105584, 105883, 106000, 107103, 109451, 111978, 113725, 114888, 116036, 117082, 117680, 118027, 118484, 118872, 118886, 118900, 119613, 121000, 122310, 123029, 123327, 123497, 123499, 123217, 122850, 122831, 123450, 124592, 125777, 126554]
52548A26554L25J67J91J76K72Q04J613K116J934J204L04m27p72p69p45r36j108
52531A30903q85k95K48L86N8n11q84p43k80M4J86M93P86L60p10j191l68O81N50
52512A28828l98o41J90R55Q31L32K20M72P16Q75J079J403J877K328K244J343J42
52495A42796n41m95j8P78J804K459K191J415J005J092J229J439J990K367J827
52480A61338Q88Q76J772K014Q68m82p78l89l25p38j286k039l016l542l047k011
52464A50103j304j105j097j192j404j413j077q96j281j813j895j688j667j668
52450A30603j239o27n49j027j309r65m08j49r0J51N44O09O9o45p02J34J029R85
52432A26414J19m65j41N10O71L44O7J37M89R20J067N51m13j033r14n55m46k67
$$ y = [126554, 126879, 127046, 127237, 127413, 127685, 128489, 130102, 132218, 134152, 135356, 135660, 135233, 134461, 133692, 132947, 132011, 130903, 130018, 129723, 129971, 130357, 130415, 129904, 129020, 128277, 127997, 128041, 128227, 128720, 129506, 129866, 129156, 127965, 127597, 128278, 128828, 128430, 127789, 127979, 128934, 129765, 130097, 130317, 130789, 131505, 132380, 133459, 134862, 136739, 139067, 141311, 142654, 142796, 142255, 141760, 141742, 142520, 144324, 146783, 148974, 150389, 151394, 152486, 153715, 155154, 157144, 159511, 161338, 162226, 163102, 164874, 166888, 167756, 167274, 166496, 166107, 165782, 165044, 163758, 161719, 158703, 155161, 152114, 150103, 148799, 147694, 146597, 145405, 144001, 142588, 141511, 140615, 139334, 137521, 135626, 133938, 132271, 130603, 129364, 128737, 128188, 127161, 125852, 124887, 124479, 124330, 124240, 124391, 124935, 125544, 125613, 124968, 124266, 124400, 125429, 126414, 126533, 126068, 125927, 126437, 127108, 127452, 127519, 127656, 128145, 129065, 130132, 130683, 130270, 129237, 128323, 127768, 127322, 127055]
52414A27055M09J149J208P50O31J081J439J204O62K53o1m44p06n23M4N90P85N79
52396A36105J20l70o49n64k35n3k83o35m30N68J711K170J967J845K154K387K018
52379A47826J301Q74Q94R29N97jl76r5P60J572J781J550J547K045K566K572K127
52362A68469J633J277J014R12J122J551J784J482P92K80M23J137J985K769L604
52347A90234M253L971K472O64k19%N41R44J458K271L093L692M129M313L923L035
52331B28774K237J958K107K425K694K549J814J035J036J757K245J976J386R48
52317B54941N45R8k2L47P80R64J124J402J554J585J874K346K442K304K911M404
52301B79599N394M870L792L661M358M742M729N236O380P143O979O558O669P282
$$ y = [127055, 127464, 128613, 129821, 130571, 131202, 132283, 133722, 134926, 135588, 135841, 135780, 135336, 134630, 134107, 134151, 134741, 135526, 136105, 136225, 135855, 135206, 134642, 134407, 134354, 134071, 133436, 133006, 133574, 135285, 137455, 139422, 141267, 143421, 145808, 147826, 149127, 150001, 150895, 151824, 152421, 152420, 152044, 151949, 152709, 154281, 156062, 157612, 159159, 161204, 163770, 166342, 168469, 170102, 171379, 172393, 173305, 174427, 175978, 177762, 179244, 180036, 180316, 180739, 181876, 183861, 186630, 190234, 194487, 198458, 200930, 201594, 201375, 201375, 201916, 202860, 204318, 206589, 209682, 213374, 217503, 221816, 225739, 228774, 231011, 232969, 235076, 237501, 240195, 242744, 244558, 245593, 246629, 248386, 250631, 252607, 253993, 254941, 255486, 255584, 255562, 255909, 256689, 257653, 258777, 260179, 261733, 263318, 265192, 267538, 269980, 272284, 275195, 279599, 284993, 289863, 293655, 297316, 301674, 306416, 311145, 316381, 322761, 329904, 336883, 343441, 350110, 357392]
52287C57392P997Q632R133R403R479R484R423R393R764J0723J1810J2473J2838
52274D87944J3284J3576J3192J2342J1813J1932J2354J2814J3312J3556J3183
52263F29302J2545J2460J2976J3274J2989J2717J2779J2446J1080R371Q606R009
52251G69554R550R282Q244P018N956N092M484M294M460M501L837K425R48J37K8
52236H39810P0j06l21k75k3K04L89P52J390K169K945L786M751N664O290O768P523
52219H81786Q609R454R646R587R988J0781J1215J0943J0388R968R604R207R014
52206A010190R065Q901Q202P170O034M644L007J621P44j55j568l061l896m188
52192A046710m665n487o140o436o882p894r153r947r923r438r276r826j0415r907
$$ y = [357392, 365389, 374021, 383154, 392557, 402036, 411520, 420943, 430336, 440100, 450823, 462633, 475106, 487944, 501228, 514804, 527996, 540338, 552151, 564083, 576437, 589251, 602563, 616119, 629302, 641847, 654307, 667283, 680557, 693546, 706263, 719042, 731488, 742568, 751939, 760545, 769554, 779104, 788386, 796630, 803648, 809604, 814696, 819180, 823474, 827934, 832435, 836272, 838697, 839645, 839782, 839810, 839880, 839774, 839453, 839178, 839155, 839359, 839748, 840500, 841890, 844059, 847004, 850790, 855541, 861205, 867495, 874263, 881786, 890395, 899849, 909495, 919082, 929070, 939851, 951066, 962009, 972397, 982365, 991969, 1001176, 1010190, 1019255, 1028156, 1036358, 1043528, 1049562, 1054206, 1057213, 1058834, 1059578, 1059423, 1057855, 1054794, 1050898, 1046710, 1042045, 1036558, 1030418, 1023982, 1017100, 1009206, 1000053, 990106, 980183, 970745, 961469, 951643, 941228, 931321]
52178I31321q245o830o827p599p664o771o084o333o807o445n207l981l627m336
$$ y = [931321, 923076, 916246, 909419, 901820, 894156, 887385, 881301, 874968, 868161, 861716, 856509, 852528, 848901, 844565]
$$ [...]
##END NTUPLES=NMR SPECTRUM
##END=
