##TITLE=NES1055_872015077_9270410_hdJ9xny5Rz
##JCAMPDX= 6.0         $$ Bruker NMR JCAMP-DX V2.0
##DATA TYPE= NMR SPECTRUM
##DATA CLASS= NTUPLES
##ORIGIN= BRUKER
##OWNER= Administrator
$$ 1.72 TOPSPIN		Version 2.1
$$ 2015-07-11 18:39:09.394 -0700  Administrator@X
$$ Compression mode = diff/dup
##.OBSERVE FREQUENCY= 400.02188249412
##.OBSERVE NUCLEUS= ^1H
##.ACQUISITION MODE= SIMULTANEOUS (DQD)
##.ACQUISITION SCHEME= undefined
##.AVERAGES= 8
##.DIGITISER RES= 22
##SPECTROMETER/DATA SYSTEM= spect
##.PULSE SEQUENCE= zg30
##.SOLVENT NAME= COFFEE_meoh
##.SHIFT REFERENCE= INTERNAL, COFFEE_meoh, 1, 14.98509
##AUDIT TRAIL= $$ (NUMBER, WHEN, WHO, WHERE, PROCESS, VERSION, WHAT)
$$ ##TITLE= Audit trail, TOPSPIN		Version 2.1
$$ ##JCAMPDX= 5.01
$$ ##ORIGIN= Bruker BioSpin GmbH
$$ ##OWNER= Administrator
$$ $$ E:\/data/COFFEE/nmr/NES1055_872015077_9270410_hdJ9xny5Rz/10/pdata/1/auditp.txt
$$ ##AUDIT TRAIL=  $$ (NUMBER, WHEN, WHO, WHERE, PROCESS, VERSION, WHAT)
(   1,<2015-07-11 18:39:01.941 -0700>,<Administrator>,<X>,<go>,<TOPSPIN 2.1>,
      <created by zg
	started at 2015-07-11 18:37:56.003 -0700,
	POWCHK enabled, PULCHK disabled,
       configuration hash MD5:
       21 0F 79 D6 B3 7B B4 F6 88 20 88 DB 03 48 BD 9F
       data hash MD5: 64K
       9C 3C 2B F9 37 0A D2 00 5F B8 3A B7 3E AA BD CB>)
(   2,<2015-07-11 18:39:05.269 -0700>,<Administrator>,<X>,<proc1d>,<TOPSPIN 2.1>,
      <Start of raw data processing
       efp LB = 0 FT_mod = 6 PKNL = 1 PHC0 = 0 PHC1 = 0 SI = 32K 
       data hash MD5: 32K
       13 2C A3 7C F0 05 6D 17 88 CA 1A A9 77 7D 2D CA>)
(   3,<2015-07-11 18:39:05.566 -0700>,<Administrator>,<X>,<proc1d>,<TOPSPIN 2.1>,
      <pk PHC0 = 92.47192 PHC1 = 0 
       data hash MD5: 32K
       ED C2 E3 9D EB 7D 63 09 49 98 17 E7 C9 53 81 AE>)
(   4,<2015-07-11 18:39:05.675 -0700>,<Administrator>,<X>,<proc1d>,<TOPSPIN 2.1>,
      <abs ABSG = 1 
       data hash MD5: 32K
       E3 5B 3F 71 BE F3 D3 7E 32 C5 97 39 7A 7E 8A 68>)
(   5,<2015-07-11 18:39:05.738 -0700>,<Administrator>,<X>,<proc1d>,<TOPSPIN 2.1>,
      <abs ABSG = 2 
       data hash MD5: 32K
       D7 E3 C8 5D BD 29 18 69 23 63 EB D2 A0 63 91 9A>)
(   6,<2015-07-11 18:39:05.800 -0700>,<Administrator>,<X>,<proc1d>,<TOPSPIN 2.1>,
      <abs ABSG = 3 
       data hash MD5: 32K
       62 BB 30 54 66 61 EE 49 D8 F2 F0 5E D6 DE 09 86>)
(   7,<2015-07-11 18:39:05.863 -0700>,<Administrator>,<X>,<proc1d>,<TOPSPIN 2.1>,
      <abs ABSG = 4 
       data hash MD5: 32K
       CC 0A D7 76 26 25 6D 23 16 CD 63 DF 57 50 9C 77>)
(   8,<2015-07-11 18:39:05.925 -0700>,<Administrator>,<X>,<proc1d>,<TOPSPIN 2.1>,
      <abs ABSG = 5 
       data hash MD5: 32K
       BF 60 6B EE E7 2C 82 6F EC 57 AF AE 16 DB 06 A7>)
$$ ##END=
$$ 
$$ $$ hash MD5
$$ $$ 42 51 80 1D BD 89 DA 14 2C 3B D7 85 F2 7C 35 32
##$RELAX= 
##$RELAX= 
##$RELAX= 
##$RELAX= 
##$RELAX= 
##$RELAX= 
##$RELAX= 
$$ Bruker specific parameters
$$ --------------------------
##$DU= <E:\>
##$EXPNO= 10
##$NAME= <NES1055_872015077_9270410_hdJ9xny5Rz>
$$ [...]
##$TP= (0..7)
150 150 150 150 150 150 150 150
##$TP07= 0
##$TPNAME0= <>
##$TPNAME1= <>
##$TPNAME2= <>
##$TPNAME3= <>
##$TPNAME4= <>
##$TPNAME5= <>
##$TPNAME6= <>
##$TPNAME7= <>
##$TPOAL= (0..7)
0.5 0.5 0.5 0.5 0.5 0.5 0.5 0.5
##$TPOFFS= (0..7)
0 0 0 0 0 0 0 0
##$TUNHIN= 0
##$TUNHOUT= 0
##$TUNXOUT= 0
##$USERA1= <user>
##$USERA2= <user>
##$USERA3= <user>
##$USERA4= <user>
##$USERA5= <user>
##$V9= 5
##$VALIST= <valist>
##$VCLIST= <CCCCCCCCCCCCCCC>
##$VD= 0
##$VDLIST= <DDDDDDDDDDDDDDD>
##$VPLIST= <PPPPPPPPPPPPPPP>
##$VTLIST= <TTTTTTTTTTTTTTT>
##$WBST= 2048
##$WBSW= 25
##$XGAIN= (0..3)
0 0 0 0
##$XL= 0
##$YL= 0
##$YMAX_a= 628335
##$YMIN_a= -523959
##$ZGOPTNS= <>
##$ZL1= 120
##$ZL2= 120
##$ZL3= 120
##$ZL4= 120
##$ABSF1= 14.98509
##$ABSF2= -5.573092
##$ABSG= 5
##$ABSL= 3
##$ALPHA= 0
##$AQORDER= 0
##$ASSFAC= 0
##$ASSFACI= 0
##$ASSFACX= 0
##$ASSWID= 0
##$AUNMP= <proc_prof1d_extract_pilot.lims>
##$AXLEFT= 0
##$AXNAME= <>
##$AXNUC= <1H>
##$AXRIGHT= 0
##$AXTYPE= 0
##$AXUNIT= <>
##$AZFE= 0.1
##$AZFW= 0.1
##$BCFW= 0
##$BC_mod= 0
##$BYTORDP= 0
##$COROFFS= 0
##$CY= 15
##$DATMOD= 1
##$DC= 0
##$DFILT= <>
##$DTYPP= 0
##$F1P= 0
##$F2P= 0
##$FCOR= 0.5
##$FTSIZE= 32768
##$FT_mod= 6
##$GAMMA= 0
##$GB= 0
##$INTBC= 1
##$INTSCL= 1
##$ISEN= 128
##$LB= 0
##$LEV0= 0
##$LPBIN= 0
##$MAXI= 10000
##$MC2= 0
##$MEAN= 0
##$ME_mod= 0
##$MI= 0
##$NCOEF= 0
##$NC_proc= -8
##$NLEV= 6
##$NOISF1= 0
##$NOISF2= 0
##$NSP= 0
##$NTH_PI= 0
##$NZP= 0
##$OFFSET= 14.98509
##$PC= 1
##$PHC0= 92.47192
##$PHC1= 0
##$PH_mod= 1
##$PKNL= yes
##$PPARMOD= 0
##$PPDIAG= 0
##$PPIPTYP= 0
##$PPMPNUM= 2147483647
##$PPRESOL= 1
##$PSCAL= 4
##$PSIGN= 0
##$PYNMP= <proc.py>
##$REVERSE= no
##$SF= 400.02
##$SI= 32768
##$SIGF1= 0
##$SIGF2= 0
##$SINO= 400
##$SIOLD= 32768
##$SPECTYP= <>
##$SREGLST= <1H.CDCl3>
##$SSB= 0
##$STSI= 32768
##$STSR= 0
##$SW_p= 8223.68421052631
##$SYMM= 0
##$S_DEV= 0
##$TDeff= 65536
##$TDoff= 0
##$TI= <>
##$TILT= no
##$TM1= 0
##$TM2= 0
##$TOPLEV= 0
##$USERP1= <user>
##$USERP2= <user>
##$USERP3= <user>
##$USERP4= <user>
##$USERP5= <user>
##$WDW= 1
##$XDIM= 32768
##$YMAX_p= 444695460
##$YMIN_p= -675992
##$CURPLOT= <Network HP LaserJet P1505>
##$CURPRIN= <$Network HP LaserJet P1505>
##$DFORMAT= <normdp>
##$LAYOUT= <+/1D_H.xwp>
##$LFORMAT= <normlp>
##$PFORMAT= <normpl>
##$SURQMSG= 1
$$ End of Bruker specific parameters
$$ ---------------------------------
##NTUPLES= NMR SPECTRUM
##VAR_NAME=  FREQUENCY,     SPECTRUM/REAL,   SPECTRUM/IMAG
##SYMBOL=    X,             R,               I
##VAR_TYPE=  INDEPENDENT,   DEPENDENT,       DEPENDENT
##VAR_FORM=  AFFN,          ASDF,            ASDF
##VAR_DIM=   32768,         32768,           32768
##UNITS=     HZ,            ARBITRARY UNITS, ARBITRARY UNITS
##FACTOR=    0.250966925370066, 1,           1
##FIRST=     8223.43324360094, -17072,       133784
##LAST=      0,             -26433,          -3291
##MIN=       0,             -675992,         0
##MAX=       8223.43324360094, 444695460,    0
$$ Real data points
##PAGE= N=1
##DATA TABLE= (X++(R..R)), XYDATA
$$ [...]
19485d4436j08596j63717J53908j08518A45293B8354J72036J46178A4356G85i2238
$$ -44436 -153032 -316749 -162841 -271359 145293 28354 200390 346568 14356 785 -92238
19473a42482B1089K91240a53279M5967g036l2021j69475c6706B76125i234H0070
$$ -142482 21089 312329 -153279 -107312 -7036 -39057 -208532 -36706 276125 -9234 80070
19461a4036A48269b3119I633a33635B37876I1643J93299J012b20510j14583I6796
$$ -14036 148269 -23119 9633 -133635 237876 91643 284942 285954 -220510 -335093 96796
19449a21759j38246A80581b23887H5781c94021a24438a7165B70400a07019j52772
$$ -121759 -260005 180581 -223887 85781 -394021 -124438 -17165 270400 -107019 -259791
19439b59791f1239j6890k6628j44755g3090K4211A90525b3566l14501a55191B86689
$$ -259791 -61239 -78129 -104757 -249512 -73090 -48879 190525 -23566 -338067 -155191 286689
19427G4638K97387c10817J12414j12454Q8497m5155A37674R2884a04067B33257
$$ 74638 372025 -310817 -198403 -310857 -222360 -267515 137674 230558 -104067 233257
19416F6436c36471a05386A25817E8853a1079p4633E8257a87157a4456I9546i3986
$$ 66436 -336471 -105386 125817 58853 -11079 -85712 58257 -187157 -14456 99546 -93986
19404C67152i3425G862J35993D8740b80512A04049i7818A9760a60600b0669a650
$$ 367152 -93425 7862 143855 48740 -280512 104049 -97818 19760 -160600 -20669 -1650
19392c64845i8460j28535A3161P1715l1258b46197a20561j30682B8247h0058o6381
$$ -364845 -98460 -226995 13161 84876 53618 -246197 -120561 -251243 28247 -80058 -146439
19381a46439A5817R5448b02385K5177G68J54123a19620k5461E9395a77781C9885
$$ -146439 15817 111265 -202385 -177208 768 154891 -119620 -145081 59395 -177781 39885
19369e34513H0420l4187b58615C0606b61818J23297d2992m2933n1093j34704c576
$$ -534513 80420 46233 -258615 30606 -261818 -138521 -42992 -85925 -137018 -271722 -3576
19357a13866N5703A64920C5214b21370F2995d7236D3884a35461k48010a27023
$$ -113866 -58163 164920 35214 -221370 62995 -47236 43884 -135461 -383471 -127023
19346e6053j65043j8017B34801c61505J30941e242k60167k9322B01851b59770
$$ -56053 -221096 -239113 234801 -361505 -230564 -5242 -265409 -294731 201851 -259770
19335B33293a03910b1741k1402l72746J88207i6990F2775a22250k5192A5211K9312
$$ 233293 -103910 -21741 -43143 -415889 -227682 -96990 62775 -122250 -147442 15211 44523
19324D4523b1190C9370N6048b57906n6650A05072a33234j2411H5250e849F4648
$$ 44523 -21190 39370 95418 -257906 -314556 105072 -133234 -145645 85250 -5849 64648
19312B28485A5868b48247e7266F9707b10704M2801P4984j07821A90071a43243
$$ 228485 15868 -248247 -57266 69707 -210704 -167903 -92919 -200740 190071 -143243
19301b27750P7045A10464a20992i738o7450b4785m1510G4001i3216j25026F7752
$$ -227750 -150705 110464 -120992 -9738 -77188 -24785 -66295 74001 -93216 -218242 67752
19289B9923i0865A44573a60550g7013J9771A22613a69488b9257B4931g9983E1246
$$ 29923 -90865 144573 -160550 -77013 -57242 122613 -169488 -29257 24931 -79983 51246
19277c60042B29345a43257O281n471e8598r6914P581j4192d8876A9051i8923A11073
$$ -360042 229345 -143257 -136976 -142447 -58598 -155512 -147931 -162123 -48876 19051 -98923 111073
19264b6857q1639c13C0140g5281A84488a12426F513a62153j5997K4538k34106
$$ -26857 -108496 -313 30140 -75281 184488 -112426 6513 -162153 -178150 -153612 -387718
19253c87718J76852i938j87076F9148M3638d7975j29225D9992p832e617D32511
$$ -387718 -210866 -9938 -197014 69148 112786 -47975 -177200 49992 42160 -5617 432511
19241a675C2486a9607k52634A6103D27b87757C6683e0407A53981n5092b21458
$$ -1675 32486 -19607 -272241 16103 427 -287757 36683 -50407 153981 98889 -221458
19229B1180d7138j72774m2809B9428g5521g104I166a67521f8917F6225R2298m1747
$$ 21180 -47138 -219912 -262721 29428 -75521 -7104 9166 -167521 -68917 66225 158523 116776
19217A16776i1834o3044A18475K24859l9072a92249G0731c63791a16922j6709
$$ 116776 -91834 -154878 118475 343334 304262 -192249 70731 -363791 -116922 -133631
19207a33631O5435b5912A39779H705J64389C7777b18143E2706c74522J02599f5062
$$ -133631 -68196 -25912 139779 8705 173094 37777 -218143 52706 -374522 -271923 -65062
19195b9687j56152D0333K02120d3637k02997J22704K9434A85510A9568K24580
$$ -29687 -185839 40333 242453 -43637 -246634 -123930 -94496 185510 19568 244148
19185B44148F3228c4333n4969k23126J14146g3739A66379a44150A07399b16763
$$ 244148 63228 -34333 -89302 -312428 -198282 -73739 166379 -144150 107399 -216763
19174c5589I1382h3475j76816H3230c1712j34472g3085F2855a89997H0606a46169
$$ -35589 91382 -83475 -260291 83230 -31712 -166184 -73085 62855 -189997 80606 -146169
19162c5087j28842C9310A5518J21228a80729B54661A11814m8720b01344B33193
$$ -35087 -163929 39310 15518 136746 -180729 254661 111814 63094 -201344 233193
19151g7041A32872b7619E9197a7847A86399f5898m3830A62440l5117c85338I1603
$$ -77041 132872 -27619 59197 -17847 186399 -65898 -109728 162440 127323 -385338 91603
19139A39628n1242a76497A24684b83694g4174A13561c57884I1501B3102i4544
$$ 139628 88386 -176497 124684 -283694 -74174 113561 -357884 91501 23102 -94544
19128A5111b74193f381j01426B9499a7920A32001d31535B752J46219a9283C06200
$$ 15111 -274193 -6381 -107807 29499 -17920 132001 -431535 2752 148971 -19283 306200
19116b0068q1916j69249C9503L8720c6149j08977k85080K07991R2678j05593d6100
$$ -20068 -101984 -271233 39503 78223 -36149 -145126 -430206 -222215 -129537 -235130 -46100
19104b21691n4026f8985l2416q5187N7856O0051j32483A5560N1816J17280J4367
$$ -221691 -275717 -68985 -101401 -186588 -128732 -68681 -201164 15560 67376 184656 199023
19093A99023B2598K7698b43819J8201j51309J87099i3290k22419b6656k62921
$$ 199023 22598 50296 -243819 -225618 -376927 -189828 -93290 -315709 -26656 -289577
19083b89577E2062K0862a35238A18997b16228A23845E7522a36566g097j69102
$$ -289577 52062 72924 -135238 118997 -216228 123845 57522 -136566 -7097 -176199
19073a76199d9222C00364c5363j80403C7766b71210I9253g0509j51019h0109A57660
$$ -176199 -49222 300364 -35363 -215766 37766 -271210 99253 -70509 -221528 -80109 157660
19061i6656H7731O9432C5144H345P3428g6296j13180J2559A554O2025e09500a50013
$$ -96656 87731 157163 35144 8345 81773 -76296 -189476 -176917 1554 63579 -509500 -150013
19048d69546J38514A92719I5126k872m2062b37461a10521M4062D07910d8121p5065
$$ -469546 -331032 192719 95126 92254 50192 -237461 -110521 -66459 407910 -48121 -123186
19037a23186j0609I7085O7927b10473A8007J81693b45585b1354o7203B15522H9827
$$ -123186 -133795 97085 165012 -210473 18007 199700 -245585 -21354 -88557 215522 89827
19025B63937D5527N5772J74481j4374a08960C8403a25988D7569K08631F5740B3274
$$ 263937 45527 101299 275780 261406 -108960 38403 -125988 47569 256200 65740 23274
19013a68041A38426K71385C239O2970P0764b21092B60438j02860b26682o7158
$$ -168041 138426 409811 3239 66209 136973 -221092 260438 157578 -226682 -293840
19003b93840A80432c85895R1338g0395j50174H7436M789b36642e8309r2869B306
$$ -293840 180432 -385895 -294557 -70395 -220569 87436 92225 -236642 -58309 -151178 2306
18991e5944A28482E7895N3036a11841j08657Q0288D9170c7429n4399J3442A55054
$$ -55944 128482 57895 110931 -111841 -220498 -140210 49170 -37429 -91828 -78386 155054
18979a67329g54p6189A08572C7924a81051D5557c5168A82519h0044q3380B638
$$ -167329 -754 -76943 108572 37924 -181051 45557 -35168 182519 -80044 -163424 2638
18967B14844P8967a81555A14802b13848N5813C1481a52138E7759b73526A15323
$$ 214844 293811 -181555 114802 -213848 -158035 31481 -152138 57759 -273526 115323
18956b28040J6950F1996f2062D0632J3776J9621k5240d2662j6641B25477F2914
$$ -228040 -211090 61996 -62062 40632 54408 74029 48789 -42662 -59303 225477 62914
18944A58225h2058A07088c77491e7267j03955B9311R3284b3747D8534a58140D5798
$$ 158225 -82058 107088 -377491 -57267 -161222 29311 122595 -23747 48534 -158140 45798
18932h3615A37416i5486c9203k32271A39946J77571A35755a31138b5339j34502
$$ -83615 137416 -95486 -39203 -271474 139946 317517 135755 -131138 -25339 -159841
18922a59841M7590c0058k82942P9761a14615j65547A40275c4951k36324M946B10647
$$ -159841 -112251 -30058 -313000 -233239 -114615 -280162 140275 -34951 -271275 -266329 210647
18910a41574K9418m6814P6320C27931A50364a2717B44392F2059a62684L6991j7980
$$ -141574 -112156 -158970 -82650 327931 150364 -12717 244392 62059 -162684 -125693 -143673
18899a43673k11645A65435D0760a13205p9980l9040B53844a75705j97443Q5006
$$ -143673 -355318 165435 40760 -113205 -193185 -232225 253844 -175705 -373148 -288142
18889b88142e1600f575p0031A49272E9225d03348j2488J75434k00897A41723a72460
$$ -288142 -51600 -6575 -76606 149272 59225 -403348 -415836 -240402 -441299 141723 -172460
18877b71757a5619j06602C934J88233a35433B0927c57108J30455A77640a87272
$$ -271757 -15619 -122221 3934 192167 -135433 20927 -357108 -226653 177640 -187272
18866f4421C35243F6502l2932k873i6073H9388b27371a10103J5936I8363a64364
$$ -64421 335243 66502 33570 30697 -96073 89388 -227371 -110103 -94167 98363 -164364
18854a35484a416E695i3816A19210L3829h5045j5832k01167F0791J60225g6211
$$ -135484 -1416 5695 -93816 119210 153039 -85045 -100877 -302044 60791 221016 -76211
18842a84109B55249a67533b701q115j00823B04983q1616a95343R0613k80906e8793
$$ -184109 255249 -167533 -2701 -10816 -111639 204983 123367 -195343 -104730 -385636 -58793
18830A19056B953a84640j17811a5972j7335A10090e4986I058K56544n4246l2171
$$ 119056 2953 -184640 -302451 -15972 -33307 110090 -54986 9058 265602 211356 179185
18819A79185J55040b1103I7738a25155k10939A16725b13999B45857J34688e9058
$$ 179185 334225 -21103 97738 -125155 -336094 116725 -213999 245857 380545 -59058
18808a66447A76593C3902a16211C44597a80775K8016A4741f0022A4160m31g0889
$$ -166447 176593 33902 -116211 344597 -180775 -152759 14741 -60022 14160 13729 -70889
18796a02421K1109K7761E9180K7324a72279B24549c8673A00462a49913A39508
$$ -102421 -81312 -53551 59180 86504 -172279 224549 -38673 100462 -149913 139508
18785E1083b03499g4025B7e0771o4750A44099a57944A61349a68404J8357A42830
$$ 51083 -203499 -74025 27 -50771 -115521 144099 -157944 161349 -168404 -150047 142830
18773B7101G34a8282k9464A39038B2096L4879N6636a1033j20920E5305f5617E3516
$$ 27101 734 -18282 -47746 139038 22096 56975 113611 -11033 -131953 55305 -65617 53516
18760G3030C0654N2950a38094K8670o1892e4949A0261c17349H7824a97429r7559
$$ 73030 30654 83604 -138094 -109424 -171316 -54949 10261 -317349 87824 -197429 -294988
18749b94988B33443b81864e247A67842c46765A6248b08002L2880G9972k481a85524
$$ -294988 233443 -281864 -5247 167842 -346765 16248 -208002 -175122 79972 77491 -185524
18737A36501a55354P547A45648b96726G4923J9911e71376f9714k70126A60985
$$ 136501 -155354 -147807 145648 -296726 74923 94834 -571376 -69714 -339840 160985
18726a79574j31098A31618a52919b3711l37397F3621b0954j22085B91588b29769
$$ -179574 -310672 131618 -152919 -23711 -361108 63621 -20954 -143039 291588 -229769
18715d01777J87266K8076j03923B65385G3843i5451e036D8137b60970N4923j1991
$$ -401777 -214511 -186435 -290358 265385 73843 -95451 -5036 48137 -260970 -206047 -218038
18704b18038F8065b35830g6161o873A44235h3724M1175B08418m9253b03672c3783
$$ -218038 68065 -235830 -76161 -83034 144235 -83724 -42549 208418 159165 -203672 -33783
18692I366b85317o449C2795F8a03646q2873O1493c0467j35013B0209R6011a96799
$$ 9366 -285317 -291766 32795 68 -103646 -186519 -125026 -30467 -165480 20209 116220 -196799
18679c28076H0617J0544b87215G2252b69267a3720A26754a6892A80668G0449g3356
$$ -328076 80617 91161 -287215 72252 -269267 -13720 126754 -16892 180668 70449 -73356
18667b5267j78926B6987K48001a62334k36248f7036C0446c12299a6615m9191A01663
$$ -25267 -204193 26987 274988 -162334 -398582 -67036 30446 -312299 -16615 -65806 101663
18655E5424c80349A441K45928b56943n1727c5244j55896j1445A6202e0259j11578
$$ 55424 -380349 1441 247369 -256943 -308670 -35244 -191140 -202585 16202 -50259 -161837
18644a61837M7370A36270h2399j12486Q543Q3971k68584A56254a23339k11278
$$ -161837 -114467 136270 -82399 -194885 -186342 -102371 -370955 156254 -123339 -334617
18634c34617e7445j77129A29616a07697A37384b15992b6363l02901J54030D59184
$$ -334617 -57445 -234574 129616 -107697 137384 -215992 -26363 -329264 -175234 459184
18623b58389d9880k50388J08753J4488O8688A34061b63571h5538j24330c6365
$$ -258389 -49880 -300268 -191515 -177027 -108339 134061 -263571 -85538 -209868 -36365
18612b24620O8038A17627n5366i8988C3975g8136j0759n1674B22482k09c45750
$$ -224620 -156582 117627 62261 -98988 33975 -78136 -88895 -140569 222482 222273 -345750
18600a07802a5472A76657a39048m823k96777a95831I552K24268i0083A93979n4494
$$ -107802 -15472 176657 -139048 -143871 -440648 -195831 9552 233820 -90083 193979 139485
18589A39485b28798f2961I0545C0136a61920g3121J6972k2545K7726l552G3858
$$ 139485 -228798 -62961 90545 30136 -161920 -73121 -56149 -78694 -50968 -54520 73858
18577a21124K7129A97479d5249j69808C39949f8998p8368A43333c3306p9510b793
$$ -121124 -93995 197479 -45249 -215057 339949 -68998 -147366 143333 -33306 -112816 -2793
18565A36240g5075K2631a7536r1251A65457g3608G0163c68434C1130M1981b47677
$$ 136240 -75075 -52444 -17536 -108787 165457 -73608 70163 -368434 31130 73111 -247677
18553e761k60223E5006c58532C3086B719L43203D6433K834A306c92856g0875k3893
$$ -5761 -265984 55006 -358532 33086 2719 345922 46433 49267 1306 -392856 -70875 -94768
18541i4768c9678A77297k2387a2004k33583C39055b57000a761k91033a00995B59962
$$ -94768 -39678 177297 154910 -12004 -245587 339055 -257000 -1761 -292794 -100995 259962
18529I5382b89853F6602a40521A41532K31957a44574C87855A27436m3317J61193
$$ 95382 -289853 66602 -140521 141532 373489 -144574 387855 127436 84119 245312
18519B45312i8376k25490J31454D7933a05923F4809c2119A05474b9178B43193
$$ 245312 -98376 -323866 -192412 47933 -105923 64809 -32119 105474 -29178 243193
18508C31998D5372J61786a79698P7976k67022B69431a5960j23488j55701C8505
$$ 331998 45372 207158 -179698 -101722 -368744 269431 -15960 -139448 -295149 38505
18497e7491B6789J33798c7205A34750a2987A08411A5796N584c8933p3060j44724
$$ -57491 26789 160587 -37205 134750 -12987 108411 15796 21380 -38933 -111993 -256717
18486b56717g9052D04099d37552J71644R7476r8021C8309a91892Q6918j312o7613
$$ -256717 -79052 404099 -437552 -265908 -168432 -266453 38309 -191892 -104974 -106286 -173899
18475a73899K2825J9262k9612d1791J0698A24819c8351N392j27982L8870a0348
$$ -173899 -151074 -131812 -161424 -41791 -31093 124819 -38351 -32959 -160941 -122071 -10348
18463a56686b6887k65603A13561A239J61545c01472G3948h8532C938b29887d843
$$ -156686 -26887 -292490 113561 1239 162784 -301472 73948 -88532 3938 -229887 -4843
18451a65911B45016a97942N9246A16900a49615B55795f8351A36703C4050d11466
$$ -165911 245016 -197942 -138696 116900 -149615 255795 -68351 136703 34050 -411466
18440a49801r1520P4434m8261A23692a93146M4930A24336b32294A37231b73978
$$ -149801 -241321 -166887 -215148 123692 -193146 -148216 124336 -232294 137231 -273978
18429b79019R0849b4873j72373h4464j81086i2428C0199g5803j57120R4280d3978
$$ -279019 -188170 -24873 -197246 -84464 -265550 -92428 30199 -75803 -232923 -138643 -43978
18417f7980I4258E459a17783q4377P510A10530c9003j42499k09378B63488l5685
$$ -67980 94258 5459 -117783 -202160 -194650 110530 -39003 -181502 -390880 263488 227803
18406B27803h0295C08080g4050q9688P8639B47105m3221a56338g4266m0418l26551
$$ 227803 -80295 308080 -74050 -163738 -85099 247105 203884 -156338 -74266 -114684 -441235
18395d41235A07051g3285A80625G2800K1116a93647P4699B56966c37015J59266
$$ -441235 107051 -73285 180625 72800 93916 -193647 -118948 256966 -337015 -177749
18385a77749M6509b7498l01237A00161k9145J59688b35064K841A3033J48644P5635
$$ -177749 -131240 -27498 -328735 100161 71016 230704 -235064 -232223 13033 161677 237312
18374B37312C6381J22725h3215B32864f0171A35144m0546b1141E861a52760O1875
$$ 237312 36381 159106 -83215 232864 -60171 135144 94598 -21141 5861 -152760 -90885
18363i0885m9943l3425j15154H0942d8288E1767e9295B19524a60700p2101O4260
$$ -90885 -140828 -174253 -289407 80942 -48288 51767 -59295 219524 -160700 -232801 -168541
18352a68541K3663A4368c13211F7715a1561G5950a78069J8357M2822e5645r477
$$ -168541 -144878 14368 -313211 67715 -11561 75950 -178069 -159712 -116890 -55645 -65122
18341f5122B46913g7416b7708j4125a4110C44013A63695n6814K1681m6187b2544
$$ -65122 246913 -77416 -27708 -41833 -14110 344013 163695 106881 128562 82375 -22544
18329D0296J23936m4264c9884a2182j31648p6985F4600O5527b28782C7474R0345
$$ 40296 164232 119968 -39884 -12182 -143830 -220815 64600 130127 -228782 37474 127819
18318A27819J37689c25270B30484D4239c43257F0925K9235a39949M9314p7999
$$ 127819 265508 -325270 230484 44239 -343257 60925 90160 -139949 -90635 -168634
18308a68634B8026Q0111j7390N7550h5209H7073m2792J05177p3621c0201A36108
$$ -168634 28026 108137 90747 148297 -85209 87073 44281 149458 75837 -30201 136108
18296C86184A099c32599A51189A0264A952b17642E0919J13624p0382b93804A22777
$$ 386184 1099 -332599 151189 10264 1952 -217642 50919 164543 94161 -293804 122777
18284B13577a51452g3415l2419n3229b7675B1484c19444a1460p2330C34631b61975
$$ 213577 -151452 -73415 -105834 -159063 -27675 21484 -319444 -11460 -83790 334631 -261975
18272A43113a86354l2559j15201C74610a11045k12956h9857J725H8372i8430m24948
$$ 143113 -186354 -218913 -334114 374610 -111045 -324001 -89857 -88132 88372 -98430 -523378
18261e23378a92513B13409i1943B10000e5152a5478q9476J4026H6335J46004a73326
$$ -523378 -192513 213409 -91943 210000 -55152 -15478 -104954 -90928 86335 232339 -173326
18249c19229c1561r0527a8674r6909l348o5944H2199E962M2838J2709b20659g0819
$$ -319229 -31561 -122088 -18674 -115583 -118931 -184875 82199 5962 48800 61509 -220659 -70819
18236D1615b07163A8001a50290I7452f233A58486a3185j18804H169d0438o6303
$$ 41615 -207163 18001 -150290 97452 -6233 158486 -13185 -131989 8169 -40438 -106741
18225a06741A17519e021r4640C9488e9853E45264a45650c6654j08924A6070L0408
$$ -106741 117519 -5021 -99661 39488 -59853 545264 -145650 -36654 -145578 16070 46478
18214D6478B2343a15660C47476A24699D6966J0661a24596B44167f1843B07739
$$ 46478 22343 -115660 347476 124699 46966 57627 -124596 244167 -61843 207739
18203a46558A06900a30127K8260l9199C1966O1740J31524a74088A15847c71638
$$ -146558 106900 -130127 -101867 -141066 31966 93706 225230 -174088 115847 -371638
18192c9623k6433m9896e4920l6856d4280D479a32708A34208a30621A4899a32426
$$ -39623 -66056 -115952 -54920 -91776 -44280 4479 -132708 134208 -130621 14899 -132426
18180A71980m6630d557o2318j82737f1575I3335k2477a33590j10832A65465a55675
$$ 171980 125350 -4557 -66875 -249612 -61575 93335 70858 -133590 -244422 165465 -155675
18168a70077d1813I7620e4403G4172j6368K06715b0012C6298j7199a00697F7230
$$ -170077 -41813 97620 -54403 74172 57804 264519 -20012 36298 19099 -100697 67230
18156C65312j67400a40221E3523J19832b4808j4205B67197B4657b81699E0401
$$ 365312 197912 -140221 53523 173355 -24808 -39013 267197 24657 -281699 50401
18145b68121O9144A7223b24531M2796O4834D460e14974f9545k8983I6308E708
$$ -268121 -198977 17223 -224531 -181735 -116901 4460 -514974 -69545 -98528 96308 5708
18133A61038J6679P3335c64937A83185c25950A63815B3448a66115c3621j13779
$$ 161038 177717 251052 -364937 183185 -325950 163815 23448 -166115 -33621 -147400
18123a47400P989A06793N7254b03328e8176j2074A62792A1401a75404o6517A54679
$$ -147400 -139411 106793 164047 -203328 -58176 -70250 162792 11401 -175404 -241921 154679
18111b24603f7469q7434k0627O9275o6602N2846A51942a59029k8047h0535A19710
$$ -224603 -67469 -154903 -175530 -106255 -172857 -120011 151942 -159029 -187076 -80535 119710
18099A13637b34842k87830G887R1478G469M5903J31419G9597a17346j17722A56027
$$ 113637 -234842 -522672 7887 99365 7469 53372 184791 79597 -117346 -235068 156027
18087e6593A27873J35983M9112j32584C1114c11328J51462A54957a363A08373
$$ -56593 127873 263856 312968 180384 31114 -311328 -159866 154957 -1363 108373
18076F1901b77048E6167d3485m6769r2832F1881M0475a356k4013B6663J29529
$$ 61901 -277048 56167 -43485 -90254 -183086 61881 102356 -1356 -25369 26663 156192
18065A56192p5318a54703r359f7501B88643c30814a5686p1213A54965a12877m0736
$$ 156192 80874 -154703 -164062 -67501 288643 -330814 -15686 -86899 154965 -112877 -153613
18054a53613a4064H0956a13014B68009A05743P517a77035n547A27022a43067h380
$$ -153613 -14064 80956 -113014 268009 105743 113260 -177035 -182582 127022 -143067 -8380
18042B55324E1670J63037q0825d6484m7986j51814L8150O3107H1525f3760C20163
$$ 255324 51670 214707 133882 -46484 -94470 -246284 -208134 -145027 81525 -63760 320163
18030C37873F8194K34084d8251l0989j81647B5316J52761Q3915A11597L37792
$$ 337873 68194 302278 -48251 -79240 -260887 25316 178077 261992 111597 449389
18020D49389H076d7520A1475h6986j9551C22107B8684Q0824h4130j32184a0844
$$ 449389 8076 -47520 11475 -86986 -106537 322107 28684 109508 -84130 -216314 -10844
18008B07186q7859a0525E0717a74275B42661G6168f3883j92715R9915G2485O263
$$ 207186 119327 -10525 50717 -174275 242661 76168 -63883 -256598 -156683 72485 78748
17997G8748a51842j94557f806F5148a96963a5537A63477a0552A84442a74117D7025
$$ 78748 -151842 -346399 -6806 65148 -196963 -15537 163477 -10552 184442 -174117 47025
17985F7252b42496B94390b89951A3760J55933K0681H3869a87731B12869F1772
$$ 67252 -242496 294390 -289951 13760 169693 190374 83869 -187731 212869 61772
17974B04266b9695k9026q3221B64662A2992N5264A2225b7965A38060C6741M4285
$$ 204266 -29695 -58721 -141942 264662 12992 68256 12225 -27965 138060 36741 81026
17963H1026L6h3270r6453J1450j51073C50313A6310Q8335d06347b4123j6641A07546
$$ 81026 81062 -83270 -179723 -168273 -319346 350313 16310 104645 -406347 -24123 -40764 107546
17950B85171k6221B2948J70377a16605H6775K27587e4659k14517C6036b53361
$$ 285171 258950 22948 193325 -116605 86775 314362 -54659 -269176 36036 -253361
17939A27717e2152n7753B54172c5113j36200j74664A21414L5052d3875D5501a44689
$$ 127717 -52152 -109905 254172 -35113 -171313 -345977 121414 156466 -43875 45501 -144689
17927A99216b26819j9643a07878A53679k7894J80689b951k28324B52505a5614
$$ 199216 -226819 -246462 -107878 153679 125785 306474 -2951 -231275 252505 -15614
17916h6320c3838B33965a5949B36405P740I1736D1688c185G7909a28124m030b6676
$$ -86320 -33838 233965 -15949 236405 244145 91736 41688 -3185 77909 -128124 -132154 -26676
17903B12655H5765M0327k7367D8690K1126L6553O3597b5374A0341K3314a31943
$$ 212655 85765 126092 98725 48690 69816 106369 169966 -25374 10341 33655 -131943
17891A76822A3475L2875a25821C44798h0528j11732C15828d80526G6405J4539
$$ 176822 13475 46350 -125821 344798 -80528 -192260 315828 -480526 76405 90944
17881I0944J03331c9056C11564d7696C3255J14788k9138Q4736h683D7165r990
$$ 90944 194275 -39056 311564 -47696 33255 148043 118905 203641 -8683 47165 37175
17870C7175h7156j41641G7474g7599D0175K58217d2992C7864r41P6157e9330E2265
$$ 37175 -87156 -228797 77474 -77599 40175 298392 -42992 37864 36923 113080 -59330 52265
17857C1444c3621r6395C79771b8351A39152P4224C1261J28839C1766J98873l6957
$$ 31444 -33621 -130016 379771 -28351 139152 213376 31261 160100 31766 230639 193682
17846A93682b11813C48814D7947i711l6028A35764D9382j3162J49696k3069n0639
$$ 193682 -211813 348814 47947 -9711 -45739 135764 49382 36220 185916 162847 112208
17835A12208c5813K919H4826J9193O313a25035F4041O0118a49858d3596G6426
$$ 112208 -35813 -32894 84826 104019 110332 -125035 64041 124159 -149858 -43596 76426
17823A58360J62976r430b5206F2712k9221K23324e508j45011L1359G3852e8615
$$ 158360 321336 311906 -25206 62712 33491 256815 -5508 -150519 -119160 73852 -58615
17811a32941k4559A87645K1625g6685C35165A56310a26504A08995J3099D9234
$$ -132941 -157500 187645 209270 -76685 335165 156310 -126504 108995 122094 49234
17800A74130b40808H2429B9473b3198D05693b9974E4867L04332D5644J37042F91
$$ 174130 -240808 82429 29473 -23198 405693 -29974 54867 359199 45644 182686 691
17788a07979B10344E244J51409D0951J18364P3310F4661J86256K2462d1456j62373
$$ -107979 210344 5244 156653 40951 159315 232625 64661 250917 273379 -41456 -203829
17777b03829D396Q8055e954k3407l39359J80259D25081f3258p4267c2421G5977
$$ -203829 4396 92451 -5954 -29361 -368720 -188461 425081 -63258 -137525 -32421 75977
17765A82361a128j46905A5160c054C02616i3767C7776f9618r2909d2179M115D6409
$$ 182361 -1128 -148033 15160 -3054 302616 -93767 37776 -69618 -162527 -42179 -38064 46409
17752f3302A96220b77103E6036a84141Q9243B42779a3608B19748b19874A74545
$$ -63302 196220 -277103 56036 -184141 -94898 242779 -13608 219748 -219874 174545
17741h4464m0345k2216B24007a7542l8552A21804A3590J4347c30833P8809h0845
$$ -84464 -124809 -147025 224007 -17542 -56094 121804 13590 27937 -330833 -252024 -80845
17729A70117K25200j41037j04938c4716D45630E3528J25497L0314C1600P952a79132
$$ 170117 395317 254280 149342 -34716 445630 53528 179025 209339 31600 39552 -179132
17717B02299F6260f1105E5212N712h9015B74864A09434K22969e7843q06E02225
$$ 202299 66260 -61105 55212 60924 -89015 274864 109434 332403 -57843 -58649 502225
17705C0429O5397i2924h581j17721r6421c7952A8478M58862E5859j4072K3156
$$ 30429 95826 -92924 -8581 -126302 -222723 -37952 18478 477340 55859 41787 64943
17694F4943J25734q0934C6421A0519R5648Q7307d9244j79116A15157d4279a3976
$$ 64943 190677 109743 36421 10519 106167 193474 -49244 -228360 115157 -44279 -13976
17682b9236A47619N7098b4556C03242j49848B5165g3932B94299D7855A6805L44078
$$ -29236 147619 204717 -24556 303242 153394 25165 -73932 294299 47855 16805 360883
17671C60883A18449N8835J25676g2203A79272D5859J72940r281j01466a51515
$$ 360883 118449 177284 302960 -72203 179272 45859 218799 209518 108052 -151515
17660C27008L4116h3030k40085B30848f4405a5303A09332C3849P8959M2459m651
$$ 327008 361124 -83030 -323115 230848 -64405 -15303 109332 33849 112808 155267 150616
17649A50616b43921c6294B87437h1464B20117A2706K9243K97637A17153J35495
$$ 150616 -243921 -36294 287437 -81464 220117 12706 41949 339586 117153 252648
17639B52648E1418a06838m47313F9640K2200J06965a21392A55053J10671A26650
$$ 252648 51418 -106838 -554151 69640 91840 198805 -121392 155053 265724 126650
17628F3294Q1018J45189G2737K18284A26040j6328c6059D62463E7279J05458K45653
$$ 63294 144312 289501 72737 291021 126040 109712 -36059 462463 57279 162737 408390
17617D08390a50352B95748O3179c2367B20228k3151f6978B6822M22502G6976L9891
$$ 408390 -150352 295748 358927 -32367 220228 197077 -66978 26822 449324 76976 116867
17606A16867l7156J51136J61338l5346I9475d2995G6015J44473r1543M5743L35106
$$ 116867 79711 230847 392185 356839 99475 -42995 76015 220488 128945 174688 509794
17595E09794b51492D9502I945O2446J53091a73688A53468j0593k536g886A44966
$$ 509794 -251492 49502 9945 72391 225482 -173688 153468 142875 140339 -7886 144966
17583G212J90352F6713R2169m6745a18105C60202o7279j35158b49453A88136m1546
$$ 7212 197564 66713 158882 112137 -118105 360202 292923 157765 -249453 188136 146590
17572A46590P3908j0881N9851q0931c6579j73117b2378I0468J29318q0618a17939
$$ 146590 220498 209617 269468 188537 -36579 -209696 -22378 90468 219786 139168 -117939
17560A2056k068O0427B7757r524J86274L23954A22401c76202D37598A89106e7758
$$ 12056 9988 70415 27757 18233 204507 528461 122401 -376202 437598 189106 -57758
17548a54549B58663j0225A20486c2690E9847j0642J75482A4610i69A77182p9909
$$ -154549 258663 248438 120486 -32690 59847 49205 224687 14610 -969 177182 97273
17537I7273J91457M9420I6277K00183b801B09704o9871J08207n5283K2877J67418
$$ 97273 288730 338150 96277 296460 -2801 209704 139833 248040 192757 215634 383052
17526C83052n2956l9702l2620n1903J286N91866Q7160k93782B87059A14120L59963
$$ 383052 330096 290394 257774 205871 207157 799023 886183 592401 287059 114120 474083
17515D74083o5704G6506H332P8598K24840j15380A0391M83270p5139L57122C55278
$$ 474083 408379 76506 8332 86930 311770 196390 10391 493661 418522 775644 355278
17503H04675C93230j00248J92421A69836aB32627j1830j5050J53084o5547i3032
$$ 804675 393230 292982 485403 169836 -1 232627 220797 205747 358831 293284 -93032
17491D3922b0850A33163q089l5752L09220j76405p170j03389R1692L2629J23730
$$ 43922 -20850 133163 125074 89322 398542 222137 214967 111578 203270 235899 359629
17480C59629A62157Q1730f0629B45724n7361L3175G9508L45937b6054j35354F53184
$$ 359629 162157 243887 -60629 245724 188363 221538 79508 425445 -26054 -161408 653184
17468D17448G7075J79181J45594p9702K7686G2598h5576C35046A02096J53015
$$ 417448 77075 256256 401850 322148 349834 72598 -85576 335046 102096 255111
17458B55111g8352B49362D4589B0010K98199o2463K12590O7543A8448M2205K29951
$$ 255111 -78352 249362 44589 20010 318209 255746 468336 535879 18448 60653 290604
17447B90604j04667b1981B85158j03905J50193C8561M90104B48203J11909r0440
$$ 290604 185937 -21981 285158 181253 331446 38561 528665 248203 360112 269672
17437B69672A1645K26177J87145A51769K5381Q3156P6449J8416A74903J94385
$$ 269672 11645 237822 424967 151769 177150 260306 336755 355171 174903 369288
17427C69288j62568J22683j1101J74820k04631k5531J31075j13824j38150J58399
$$ 369288 206720 329403 318302 493122 288491 262960 394035 280211 142061 300460
17417C00460A25234a5377C79547J67871A92996L4069R989H9020k7990b15808B03872
$$ 300460 125234 -15377 379547 547418 192996 227065 237054 89020 61030 -215808 203872
17405B62862J8684N6831K3659j13737o5156J55440J50362A80040M1623Q4645A50981
$$ 262862 281546 338377 362036 248299 183143 338583 488945 180040 221663 306308 150981
17393C30776a00589B08155J60013G0676J83157o1117h6670B44753o9210J32198
$$ 330776 -100589 208155 368168 70676 253833 192716 -86670 244753 175543 307741
17383C07741b0149A97159p8299K95395A01692K04664J1112B9075j2611O2230J05712
$$ 307741 -20149 197159 118860 414255 101692 306356 317468 29075 16464 78694 184406
17372A84406a1841n0988D15884j24101K52131a84782A08807K04575C8527L64413
$$ 184406 -11841 -62829 415884 291783 543914 -184782 108807 313382 38527 402940
17362D02940l5006j48195j00853E5828K66732A59582P806O2979l2435N4204N7499
$$ 402940 367934 219739 118886 55828 322560 159582 167388 230367 197932 252136 309635
17351C09635R402j44815k5778M1972G6042J29828f5359B22533K08020a9337A18732
$$ 309635 319037 174222 148444 190416 76042 205870 -65359 222533 430553 -19337 118732
17339A89429K68317G8700J04588J79134j63881o142I3387R787a11251B03638K97282
$$ 189429 457746 78700 183288 362422 198541 192399 93387 103174 -111251 203638 500920
17328E00920j4145q1049r3959n9619J47022j76194m8849L96683k24562e1646B86056
$$ 500920 486775 405726 311767 252148 399170 222976 174127 570810 346248 -51646 286056
17316E32225B21838r7749J22377R2263F157J6167L78638K5531l7637j07748B0920
$$ 532225 221838 124089 246466 338729 6157 22324 400962 426493 388856 281108 20920
17304B81508A26773j472K8029K07888J8054j265H5236l0340J03676L34347j30861
$$ 281508 126773 125301 153330 361218 379272 378007 85236 54896 158572 492919 362058
17293C62058j42817K66157p3360n1961L9112r4096O3510d0873E87367k55757q9787
$$ 362058 219241 485398 412038 360077 399189 305093 368603 -40873 587367 331610 241823
17282B41823a06673D4639K06069J68493k4585A57739J81739j6873K2073A61808
$$ 241823 -106673 44639 250708 419201 394616 157739 339478 322605 344678 161808
17271D56956p6359L22198l19585I5001K32454K874O3001J4180r5144M9487E4924
$$ 456956 380597 702795 383210 95001 327455 330329 393330 407510 312366 361853 54924
17259A76323J21478k3848d7764D17755H8211L20616K2055j70859J72044J05486
$$ 176323 297801 273953 -47764 417755 88211 408827 430882 260023 432067 537553
17249E37553F7010k0505K99930M4796O5185k02259J25932A48751R5155J41560
$$ 537553 67010 46505 346435 391231 456416 254157 380089 148751 243906 385466
17239C85466O3934j51471P4029r2173J30901K45540B81376J3942J81601a1358
$$ 385466 449400 297929 371958 279785 410686 656226 281376 295318 476919 -11358
17228C01867L902L7984P8548A80658M13434j47390N7589j00905C3262J18380L3490
$$ 301867 305769 343753 422301 180658 594092 446702 504291 403386 33262 151642 185132
17217A85132J40280N6033j38980J39693J11676A24867O7307M07294j28070A93132
$$ 185132 325412 381445 242465 382158 493834 124867 192174 599468 471398 193132
17206B64161C432e5782A49980J89365J29319K06183k39870j17181K37821k35174
$$ 264161 3432 -55782 149980 339345 468664 674847 434977 317796 555617 320443
17196C20443N9690q2349M82407k06185j09220H9917K85180R1097e8456D01071
$$ 320443 380133 297784 780191 574006 464786 89917 375097 466194 -58456 401071
17185F23273A80271N21898A21701R8208J8675L11323j91171K11143j01750j09469
$$ 623273 180271 702169 121701 219909 238584 549907 358736 569879 468129 358660
17175C58660J22272J37541k61794J12169q3294L06872l09198K14566k02726o9513
$$ 358660 480932 618473 356679 468848 385554 692426 383228 597794 395068 325555
17165C25555j9147J20636j47604p0371N0214K99280j26270K15438B42087J96649
$$ 325555 306408 427044 279440 209069 259283 558563 432293 647731 242087 438736
17155D38736B07048J08011O5303M45661j90210k6039j78570j36522N7584J94041
$$ 438736 207048 315059 380362 826023 635813 609774 431204 294682 352266 546307
17145E46307K0742B59416n8320L91920p8424j09980K95386j26386k00814K48338
$$ 546307 567049 259416 201096 593016 514592 404612 699998 573612 372798 621136
17135F21136M4411j60544L25601l59020j61800M4084K21930j91272L28476q3978
$$ 621136 665547 505003 830604 471584 309784 353868 575798 384526 713002 629024
17125F29024O4629j99348j17755R0680J29423N5920K66514l49317J40423r242
$$ 629024 693653 494305 376550 467230 596653 652573 919087 569770 710193 700951
17115G00951B83237L34047K8010q6290O5442J5186N9624l43823K05468K70243
$$ 700951 283237 617284 645294 559004 624446 639632 699256 355433 560901 831144
17105H31144k34092B52872L41078j4k19420P8632K60350O1045q7855J0991P0020
$$ 831144 597052 252872 593950 593936 374516 453148 713498 774543 686688 697679 767699
17094G67699O9346j052L3172j76765j50604J23476m5845j42522P5128Q6607J81116
$$ 767699 837045 835993 869165 692400 541796 665272 619427 476905 552033 638640 819756
17083H19756J51035r1033J30136k81416j67806J06534N1101Q1806k1249j54035
$$ 819756 970791 879758 1009894 728478 560672 667206 718307 800113 778864 624829
17073F24829J42977L01346n10213L48369J1597k84241Q6695p7426m3370J68067
$$ 624829 767806 1069152 558939 907308 918905 634664 721359 643933 600563 768630
17063G68630K82202j69868J96492m97059O9100M18266r1855l09618j40336L47311
$$ 768630 1050832 880964 1077456 580397 649497 1067763 975908 666290 525954 873265
17053H73265J78332m22450L12983m4999j92007L44173M5638m3719N5020l49588
$$ 873265 1051597 629147 942130 897131 705124 1049297 1094935 1051216 1106236 756648
17043G56648L30634j18336j27936J48190r4414J21597j77945K30858k48009m2557
$$ 756648 1087282 968946 841010 989200 894786 1016383 838438 1069296 821287 778730
17033G78730J50379J17814m9054N7710L8075k34371J96632k12438Q6910K40572
$$ 778730 929109 1046923 997869 1055579 1093654 859283 1055915 843477 930387 1170959
17023A170959j19988J86348l70317J91904J00601K9949P1990k94201J07467J204
$$ 1170959 1050971 1237319 867002 1058906 1159507 1189456 1261446 967245 1074712 1075916
17013A075916O5319J48587n5845J15810Q302k25881J93782j47009K56499j53600
$$ 1075916 1141235 1289822 1233977 1349787 1358089 1132208 1325990 1178981 1435480 1281880
17003A281880k9606K10087l42883K99386j55572K57102p9074j44469j74059L3905
$$ 1281880 1252274 1462361 1119478 1418864 1263292 1520394 1441320 1296851 1122792 1156697
16993A156697J81952k98481N63988k30507r0441L70705r0430L6514j77146J44339
$$ 1156697 1338649 1040168 1604156 1373649 1283208 1653913 1563483 1599997 1422851 1567190
16983A567190J15193K7189m6903q8440J75596l95537K23045L19627j42100r120
$$ 1567190 1682383 1709572 1662669 1574229 1749825 1354288 1577333 1896960 1754860 1745740
16973A745740j09463K70973j50065k27656K89267k13971L23173k61273M6971R4681
$$ 1745740 1636277 1907250 1757185 1529529 1818796 1604825 1927998 1666725 1713696 1808377
16963A808377r7221K5656o6974P5900K72880N5433m07935K68426n7301k0659R4245
$$ 1808377 1711156 1736812 1669838 1745738 2018618 2074051 1666116 1934542 1877241 1856582 1950827
16952A950827K07702j24k47333P9715q4629J32132j10084K63696k7705k54714
$$ 1950827 2158529 2158405 1911072 1990787 1906158 2038290 1928206 2191902 2164197 1909483
16942A909483L34132q471J94831k98714N0470K80755j69630k5681L42867l16031
$$ 1909483 2243615 2235144 2429975 2131261 2181731 2462486 2292856 2267175 2610042 2294011
16932B294011j28880K91645O1328J17695m74031J64785L15694p2255K32044q6469
$$ 2294011 2165131 2456776 2518104 2635799 2161768 2326553 2642247 2569992 2802036 2715567
16922B715567k20872j56979K26464K43379J6994J15706K0684K48436j98106k78127
$$ 2715567 2494695 2337716 2564180 2807559 2824553 2940259 2960943 3209379 3011273 2733146
16912B733146L46238k90358J4982R3499J46771j58089N13892j16117J29408j15256
$$ 2733146 3079384 2789026 2804008 2897507 3044278 2886189 3400081 3283964 3413372 3298116
16902C298116L3614m4633K68293m0206J50229O3860P6647k70708J15757K49487
$$ 3298116 3331730 3287097 3555390 3515184 3665413 3729273 3805920 3535212 3650969 3900456
16892C900456j46368K15094L6437N7856n7480q8020L36582J530O4702l4180K13857
$$ 3900456 3754088 3969182 4005619 4063475 4005995 3917975 4254557 4256087 4320789 4286609 4500466
16881D500466k93838K84310j29211J91280J34278j76325O14787k99626j03082
$$ 4500466 4206628 4490938 4361727 4553007 4687285 4510960 5125747 4826121 4723039
16872D723039K9146L33359O16672m31137m641K00411n74310R20135o2234q9830
$$ 4723039 4752185 5085544 5702216 5271079 5266438 5466849 4892539 5812674 5750440 5660610
16862E660610j76066L35223K61848j19991J22988o8853J36945L84511m12258P07487
$$ 5660610 5484544 5819767 6081615 5961624 6084612 6015759 6152704 6537215 6124957 6832444
16852F832444j8579j00312K30159K93944K63946j62336n1308L61369L09341M4155
$$ 6832444 6813865 6713553 6943712 7237656 7501602 7339266 7287958 7649327 7958668 8002823
16842H002823O5004J38321P9389n7969O14079k76138K24568j13360P42256k01845
$$ 8002823 8067827 8206148 8285537 8227568 8841647 8565509 8790077 8676717 9418973 9217128
16832I217128N16365p4204j35945N75986j27231K88549M72750Q8713M79344k08455
$$ 9217128 9733493 9659289 9523344 10099330 9972099 10260648 10733398 10822111 11301455 11093000
16822A1093000K49097M23824J97566K12643J67291O60666k57090M34497K48363
$$ 11093000 11342097 11765921 11963487 12176130 12343421 13004087 12746997 13181494 13429857
16813A3429857K85748K91377J92694K85481M054O59917O67890L6897M2737P33056
$$ 13429857 13715605 14006982 14199676 14485157 14489211 15149128 15817018 15853915 15896652 16629708
16803A6629708p4L51481P51843J37975O24124M28870O88564J15683R84465q1064
$$ 16629708 16629634 16981115 17732958 17870933 18495057 18923927 19612491 19728174 20712639 20631575
16793B0631575P76327J52573N85885Q64272K83988Q15680N94247N39586R22708
$$ 20631575 21407902 21560475 22146360 23010632 23294620 24110300 24704547 25244133 26166841
16784B6166841M30675O44203J208544M31967P40801O98735R98613P63698Q70413
$$ 26166841 26597516 27241719 28450263 28882230 29623031 30321766 31320379 32084077 32954490
16775C2954490J018326R47478O13602J151789J014555J378533Q73859Q66811J189508
$$ 32954490 33972816 34920294 35533896 36685685 37700240 39078773 39952632 40819443 42008951
16766D2008951J176805J185844J357122J499866J093249J279355J614748J428143
$$ 42008951 43185756 44371600 45728722 47228588 48321837 49601192 51215940 52644083
16758E2644083J281755J263991J745818J232020J761865J409384J898970J638837
$$ 52644083 53925838 55189829 56935647 58167667 59929532 61338916 63237886 64876723
16750F4876723J450117J654896J471118J666111J600447J995720J072616J793185
$$ 64876723 66326840 67981736 69452854 71118965 72719412 74715132 75787748 77580933
16742G7580933J679144J413189J169523J342923R44178J710658Q40875J082857
$$ 77580933 79260077 80673266 81842789 83185712 84129890 85840548 86681423 87764280
16734H7764280R51687Q61895P16201L54669N42372Q37113j68351L33200m07323
$$ 87764280 88715967 89577862 90294063 90648732 91191104 92028217 91859866 92193066 91785743
16725I1785743J4991n42246j82626j028032p29417p70533j123170o83080j352826
$$ 91785743 91800734 91258488 91075862 90047830 89318413 88547880 87424710 86741630 85388804
16716H5388804j196455j091184j183369j279372j714941j638576j321841j441156
$$ 85388804 84192349 83101165 81917796 80638424 78923483 77284907 75963066 74521910
16708G4521910j586915j701847j691654j302713j805254j350475j694272j557774
$$ 74521910 72934995 71233148 69541494 68238781 66433527 65083052 63388780 61831006
16700F1831006j522872j418578j841908j262234j554230j398970j396517j255044
$$ 61831006 60308134 58889556 57047648 55785414 54231184 52832214 51435697 50180653
16692E0180653j111631j373660r81603j453323j050849j185862j038101j368626
$$ 50180653 49069022 47695362 46713759 45260436 44209587 43023725 41985624 40616998
16684D0616998j036231j006244j002457q56949p23867j045969q49739o55731q21651
$$ 40616998 39580767 38574523 37572066 36715117 35991250 34945281 34095542 33439811 32618160
16675C2618160r26349r33991m89892r42867n20641o83003q58646m66034r50196
$$ 32618160 31691811 30757820 30267928 29325061 28804420 28121417 27262771 26796737 25846541
16666B5846541j95185q65010k60702q50186j32345n73577m69495p34167n00160
$$ 25846541 25651356 24786346 24525644 23675458 23543113 22969536 22500041 21765874 21265714
16657B1265714j17872p35027l41929m19559j60648n69184o80016O9934p12209
$$ 21265714 21147842 20412815 20070886 19651327 19490679 18921495 18241479 18311413 17599204
16648A7599204k85218m71875J60759q22987J03225m94568m21136P730k24547m48945
$$ 17599204 17313986 16842111 17002870 16179883 16283108 15788540 15367404 15375134 15150587 14701642
16638A4701642l15006l60002k14826l7197k77881j52919m42381p1948k43573l18062
$$ 14701642 14386636 14026634 13811808 13774611 13496730 13343811 12901430 12829482 12585909 12267847
16628A2267847n2813j53077n9234m19434l76908l1509k48584p0349k01088q8431
$$ 12267847 12215034 12061957 12002723 11583289 11206381 11174872 10926288 10855939 10654851 10566420
16618A0566420j04081k91063m288P6921p76363J37520J32685j48454l82939n7653
$$ 10566420 10462339 10171276 10166988 10243909 9467546 9605066 9737751 9589297 9206358 9148705
16608I148705j02913O5954o79723q5735M2539N02596n44681n44325K56317n32003
$$ 9148705 9045792 9111746 8432023 8346288 8388827 8891423 8346742 7802417 8058734 7526731
16598G526731J65153k2461K05917k31715j44717J07154m29025n4089k55640J00534
$$ 7526731 7691884 7669423 7875340 7643625 7498908 7606062 7177037 7122948 6867308 6967842
16588F967842j56059o1087m50257L74589k15053j15888J12815P7283k42655k74737
$$ 6967842 6811783 6750696 6300439 6675028 6459975 6344087 6456902 6534185 6291530 6016793
16578F016793k5504N2502r2824J79884R217m41008K66532l63608K48837m15345
$$ 6016793 5991289 6043791 5950967 6130851 6140068 5699060 5965592 5601984 5850821 5435476
16568E435476k1069m1406R3703l65199M12164n38557l9432l1191O4089J87706
$$ 5435476 5414407 5373001 5466704 5101505 5513669 4975112 4935680 4904489 4968578 5156284
16558E156284l53220O0702J2777l9983k56082J90870j26972k70724J62649P1662
$$ 5156284 4803064 4863766 4876543 4836560 4580478 4771348 4644376 4373652 4536301 4607963
16548D607963J97657r1805l89618J01248l56962K82185o6965j13217K59049n42949
$$ 4607963 4805620 4713815 4324197 4425445 4068483 4350668 4283703 4170486 4429535 3886586
16538C886586L18916k1907J11983j05161k00512k51045M24132n1755k14089r8943
$$ 3886586 4205502 4183595 4295578 4190417 3989905 3738860 4162992 4111237 3897148 3798205
16528C798205k41750K87909N4696l72099n3914K36382n8156Q115k94619J92503
$$ 3798205 3556455 3844364 3899060 3526961 3473047 3709429 3651273 3659388 3364769 3557272
16518C557272n9144J33656L0538l47596j54743r7885L47714m1130k38749n2328
$$ 3557272 3498128 3631784 3662322 3314726 3159983 3062098 3409812 3368682 3129933 3077605
16508C077605q7351K44708p4001J51428j71892J23587k26781j8151L31607j41027
$$ 3077605 2990254 3234962 3160961 3312389 3140497 3264084 3037303 3019152 3350759 3209732
16498C209732j30555q8302J58768l46206N7894j31481K09529q1824J08625p1564
$$ 3209732 3079177 2990875 3149643 2803437 2861331 2729850 2939379 2857555 2966180 2894616
16488B894616o9213o8942K93622k90994m4621k43049K40897J49918j45829P6506
$$ 2894616 2825403 2756461 3050083 2759089 2714468 2471419 2712316 2862234 2716405 2792911
16478B792911N0797l00724K9496J26202j82283L10321m04985o5315M2453L30375
$$ 2792911 2843708 2542984 2572480 2698682 2516399 2826720 2421735 2356420 2398873 2729248
16468B729248k56283J31849r1385k23695L5965k55805N16890k73481O8833k31613
$$ 2729248 2472965 2604814 2513429 2289734 2325699 2069894 2586784 2313303 2382136 2150523
16458B150523J24790k5314J02515j34232K34440j72825m4976J65821j78923L7503
$$ 2150523 2275313 2249999 2352514 2218282 2452722 2279897 2234921 2400742 2221819 2259322
16448B259322O7923J64934k64602j99994j01789K03730L98124m85077o4924j14794
$$ 2259322 2327245 2492179 2227577 2027583 1925794 2129524 2527648 2042571 1977647 1862853
16438A862853K23930N7006l42008L08356l34455L11835j54849j68274P5329L15125
$$ 1862853 2086783 2143789 1801781 2110137 1775682 2087517 1932668 1764394 1839723 2154848
16428B154848n7038l33150J31603j94323M05457k85197K76251l61779L89495n45891
$$ 2154848 2097810 1764660 1896263 1701940 2107397 1822200 2098451 1736672 2126167 1580276
16418A580276K67893Q1693r154j51636J64835j72294Q5407m2210m1546n8102L27861
$$ 1580276 1848169 1929862 1920708 1769072 1933907 1761613 1847020 1804810 1763264 1705162 2033023
16407B033023m83969K13709R8897j10636M3694k31042j57952K54604K01796l32691
$$ 2033023 1549054 1762763 1861660 1751024 1794718 1563676 1405724 1660328 1862124 1529433
16397A529433K5850J56710J4157l7521O8643m46283L12438k13029k34264K40451
$$ 1529433 1555283 1711993 1726150 1688629 1757272 1310989 1623427 1410398 1176134 1416585
16387A416585L54230k40046p8296j70242J48522K15345k34128j35412J62309K17038
$$ 1416585 1770815 1530769 1452473 1282231 1430753 1646098 1411970 1276558 1438867 1655905
16377A655905m68508R6055K95755m62232R6078J28765J14318J18434k17860n5776
$$ 1655905 1187397 1283452 1579207 1116975 1213053 1341818 1456136 1574570 1356710 1300934
16367A300934J51348q352k6192J35346k04233K05345j88111R7592j28367J06683
$$ 1300934 1452282 1443930 1417738 1553084 1348851 1554196 1366085 1463677 1335310 1441993
16357A441993k05484j05332N37551j94319j59770J6702K11550j26821k00314R2546
$$ 1441993 1236509 1131177 1668728 1474409 1314639 1331341 1542891 1416070 1215756 1308302
16347A308302J26548N8183k64653j08104J91001q2482j91695M34755k49559J21698
$$ 1308302 1434850 1493033 1228380 1120276 1311277 1228795 1037100 1471855 1222296 1343994
16337A343994l4659l66004O32105m24990p6667L91545k14428q4424O007l50108
$$ 1343994 1309335 943331 1575436 1150446 1073779 1465324 1250896 1166472 1172479 822371
16327H22371K65479o1269Q5579K98971p316j62512J46667j60806q5728l72227
$$ 822371 1087850 1026581 1112160 1411131 1403815 1241303 1387970 1227164 1141436 769209
16317G69209L68379k26740L77693n40984Q656M38088L29181n03173K40573o6550
$$ 769209 1137588 910848 1288541 747557 756213 1194301 1523482 1020309 1260882 1194332
16307A194332R1372k60640j1459K88139m06959J18065J50853m4086k43249J25810
$$ 1194332 1285704 1025064 1013605 1301744 894785 1012850 1163703 1119617 876368 1002178
16297A002178j3869K90039l80023l632Q8591k61866L92077j79556m9378K60963
$$ 1002178 988309 1278348 898325 894693 983284 721418 1113495 933939 884561 1145524
16287A145524j26967j76109R6708Q9194j00152J55481j96620j2213j86821J90150
$$ 1145524 1018557 842448 939156 1028350 928198 1083679 887059 874846 688025 878175
16277H78175Q394j71378L37229k32513J01212r1627K13266m13171K78024p4120
$$ 878175 886569 715191 1052420 819907 921119 829492 1042758 629587 907611 833491
16267H33491J1310n764j30614M8578J41937R0678j98899J15969K06525l01995
$$ 833491 844801 839037 708423 757001 898938 989616 790717 906686 1113211 811216
16257H11216L1178J50463j95014j68752L12944k08352J60254K4725l61562L56394
$$ 811216 842394 992857 797843 629091 942035 733683 893937 918662 557100 913494
16247I13494k69007j03832J07019K35903r5214L17594j59725C81336J49910M85834
$$ 913494 644487 540655 647674 883577 788363 1105957 946232 381336 531246 1017080
16237A017080j25745p0567M2837m961k24701J21632k8101K45795l89426K16024
$$ 1017080 891335 820768 863605 858644 633943 755575 727474 973269 583843 799867
16227G99867j21974R7155l71331K40791K79071n9497l27530K85893l03585J6238
$$ 799867 677893 775048 403717 644508 923579 864082 536552 822445 518860 535098
16217E35098K22351k5995N2603j20593j88369L23153k09772j29871K24599j85724
$$ 535098 757449 731454 784057 663464 475095 798248 588476 458605 683204 497480
16207D97480L82716k00475l0606B82690P8257L46953j26493l6670J74619l20773
$$ 497480 880196 679721 649115 282690 360947 707900 581407 544737 719356 398583
16197C98583L30676j90601J97405r661j65985J38250k31971J1643J24040J04398
$$ 398583 729259 538658 736063 726402 560417 698667 466696 478339 602379 706777
16187G06777B82282N75968l32049Q0954o5668J52438O4085o2665j55660A77601
$$ 706777 282282 858250 526201 607155 541487 693925 758010 695345 539685 177601
16176D47451N4386P2184o9512q1631J77307k56389M84845j25386a35664D46000
$$ 447451 501837 574021 504509 422878 600185 343796 828641 703255 -135664 446000
16165A21985O52027l31741J09945j38100M54185D28258B6801M55519J33738A47227
$$ 121985 774012 442271 552216 414116 868301 428258 26801 482320 616058 147227
16154D13998J73679j71716l9939j62674M22017C02121K85669Q6206M0603C43680
$$ 413998 587677 415961 376022 213348 635365 302121 587790 673996 714599 343680
16143D28577L8285N6580J12590I1011B3949P98839A95305J08239J88614j04147
$$ 428577 466862 523442 636032 91011 23949 822788 195305 303544 492158 388011
16133C88011J39991o9490B25750L23394r2468J40741j71901K35040B75928j05738
$$ 388011 528002 458512 225750 549144 456676 597417 425516 660556 275928 170190
16123A70190M03094D4025K64665A21335M13475k43655l5370a0308A76015J73175
$$ 170190 573284 44025 308690 121335 534810 291155 255785 -10308 176015 349190
16113C49190r1408K63165A89106R9572R4993G7537K83217J89324B49991J89997
$$ 349190 257782 520947 189106 288678 383671 77537 360754 550078 249991 439988
16103D39988K14454B67767J6092l4758J88073a36875A62128L65819A45784L10265
$$ 439988 654442 267767 283859 249101 437174 -136875 162128 527947 145784 456049
16093D56049G8577l2632J87079C1090K43593p2759p4479R8005K93332k19552m129
$$ 456049 78577 45945 233024 31090 274683 201924 127445 225450 518782 299230 295101
16082B95101K20399B6388K62364J13267o0481n4193L1422F9362M9528J26667L9075
$$ 295101 515500 26388 288752 402019 341538 287345 318767 69362 118890 245557 284632
16071B84632M4177n9883M7495l9832J43798r0342H3194b5491D00413O0532k27480
$$ 284632 328809 268926 316421 276589 420387 330045 83194 -25491 400413 460945 233465
16060B33465I3605Q7120L12163B17496n2033J74170A48458l9339K03208j07483
$$ 233465 93605 180725 492888 217496 165463 339633 148458 109119 312327 204844
16050B04844M5250A07674J25830M92479B87079J57321B16303k5425a19974E4549
$$ 204844 250094 107674 233504 725983 287079 444400 216303 190878 -119974 54549
16039I4117L87212j39878o5052H8055R027J78999A36656E5718L40913j68847J66757
$$ 94117 481329 341451 276399 88055 97082 276081 136656 55718 396631 227784 394541
16028C94541A28575K60499A20859m3077J1319J4629P0618P2281A13669J26360
$$ 394541 128575 389074 120859 77782 89101 103730 174348 246629 113669 240029
16018B40029J36597K14986A26693l6244p567K85312j6423K6627C7785a12141L5388
$$ 240029 376626 591612 126693 90449 82882 368194 351771 378398 37785 -112141 -76753
16007g6753A78263N6655F1245K15481A35510g7542D23169A29910E5258b12688
$$ -76753 178263 234918 61245 276726 135510 -77542 423169 129910 55258 -212688
15996A1805J92597N6506J93721k11892K82879j30063N9951J03111L47430K82917
$$ 11805 204402 260908 454629 242737 525616 395553 455504 558615 906045 1188962
15986A188962l04844P7869m56964k5451A78276K07722C6491J07350Q8202N7286
$$ 1188962 884118 961987 505023 479572 178276 385998 36491 143841 232043 289329
15976B89329G1585L5740K56592m7251o0532M4244r2324g4902j6811A33328C083
$$ 289329 71585 107325 363917 316666 256134 300378 208054 -74902 -91713 133328 3083
15964B0295a5304C08844q6696H6300g1923f360C41813N3131F6731a20111F7391
$$ 20295 -15304 308844 222148 86300 -71923 -6360 341813 394944 66731 -120111 67391
15952A78703p112a31840E6070c10201a9919r274E6706R6393l7828L3153p0626
$$ 178703 171591 -131840 56070 -310201 -19919 -29193 56706 153099 115271 148424 77798
15941G7798d4893k23867C80713h0913B55156A7402J36737r939i1427A32502J20977
$$ 77798 -44893 -268760 380713 -80913 255156 17402 154139 144200 -91427 132502 253479
15930B53479J22177F673a4777A88959b8526G4038a50018c2799j78634F8102K94534
$$ 253479 375656 6673 -14777 188959 -28526 74038 -150018 -32799 -211433 68102 362636
15919C62636E2299a26000A46501l2127q630M65114A921c8710H2149K27001g5605
$$ 362636 52299 -126000 146501 114374 105744 570858 1921 -38710 82149 309150 -75605
15907i7451A72180b4206A73353D6384J57010K35225A77768c6810F6758n025J58959
$$ -97451 172180 -24206 173353 46384 203394 438619 177768 -36810 66758 61733 220692
15896B20692k89M8653a68673A55481G7404a61797A62643a5081A15127c09015a40788
$$ 220692 220403 269056 -168673 155481 77404 -161797 162643 -15081 115127 -309015 -140788
15884C0032K10500H758L32507c16261h0882a952A9049J72848K00066j29016a02120
$$ 30032 240532 8758 341265 -316261 -80882 -1952 19049 191897 391963 262947 -102120
15872A33964d3896A85178f254A4884a9947B02798E037L30322i3108I304R8395
$$ 133964 -43896 185178 -6254 14884 -19947 202798 5037 335359 -93108 9304 107699
15861A07699M1852a16975L4129r492L0369k15453A22582E2695L04193l4795d0623
$$ 107699 149551 -116975 -82846 -92338 -61969 -277422 122582 52695 356888 322093 -40623
15849D7526c0798l14885B61379a55369E481K22044j04959K9678G0048a11195B45011
$$ 47526 -30798 -345683 261379 -155369 5481 227525 122566 152244 70048 -111195 245011
15837a31313c022A65230e2977n4119p3429F6523e8438A3603K08347a17348I8749
$$ -131313 -3022 165230 -52977 -107096 -180525 66523 -58438 13603 221950 -117348 98749
15825B22143C0509A0317a6804E7002b48183h4118G966g7391L6447j78728Q5321
$$ 222143 30509 10317 -16804 57002 -248183 -84118 7966 -77391 -40944 -219672 -134351
15814a34351E8346K8001b87858J14071d9326j41650q346a308l33396J31395i5539
$$ -134351 58346 86347 -287858 -173787 -49326 -190976 -199322 -1308 -334704 -203309 -95539
15802A95403l4643D5173L14291l8016A37750J22517a8588l52078a54733B1399
$$ 195403 160760 45173 359464 321448 137750 260267 -18588 -370666 -154733 21399
15791A08696K31057a35779C04756M768h4806A66084b6689A12208b4861j34814
$$ 108696 339753 -135779 304756 309524 -84806 166084 -26689 112208 -24861 -159675
15781a59675P2478E1883a51449N6951f192B1775i0082A10771J87663c17408R6712
$$ -159675 -87197 51883 -151449 -94498 -6192 21775 -90082 110771 298434 -317408 -220696
15770b20696j64984H3325i9995H4055h1833j91135a03096J3839G3343k8954K4153
$$ -220696 -385680 83325 -99995 84055 -81833 -272968 -103096 -89257 73343 44389 68542
15759F8542a58856A79530A301K00813o9941a15643C24970A1733K7374L21602j13688
$$ 68542 -158856 179530 1301 202114 132173 -115643 324970 11733 39107 360709 247021
15748B47021M5543A21655f9703C4035M46267A39634c60678D42331a5718o7438
$$ 247021 292564 121655 -69703 34035 480302 139634 -360678 442331 -15718 -83156
15738h3156L0285b6389C79904e7899D629a34133A15518J40250a8611r8067l3104
$$ -83156 -52871 -26389 379904 -57899 4629 -134133 115518 255768 -18611 -116678 -149782
15727a49782O9236A70560d5795F8728d59340A15073c5906o1378J7700a1536k0528
$$ -149782 -80546 170560 -45795 68728 -459340 115073 -35906 -97284 -79584 -11536 -32064
15716c2064G2181f7105B88285a61210j18844A50785a5318H4792k0028R8143o5538
$$ -32064 72181 -67105 288285 -161210 -280054 150785 -15318 84792 64764 162907 97369
15705I7369c14796c6431m01325E7679K04014a56725j9586d4471J6264A91966N3423
$$ 97369 -314796 -36431 -437756 57679 261693 -156725 -176311 -44471 -28207 191966 245389
15694B45389g6827j19006N5473C18432K42144C8132K40071k9409H4620O0046c7453
$$ 245389 -76827 -195833 -140360 318432 560576 38132 278203 248794 84620 144666 -37453
15682A49285o4950e0256A71058a97459h9130j6580c9116J3093I5887A3554J27205
$$ 149285 84335 -50256 171058 -197459 -89130 -105710 -39116 -26023 95887 13554 140759
15671A40759K0362E0504c1823k9426C6126a0487p1361l0032n8279I7670K1527
$$ 140759 161121 50504 -31823 -61249 36126 -10487 -81848 -111880 -170159 97670 119197
15660A19197a39098j18570B7827E766b29115L1263K1397A7677o550f7689C497
$$ 119197 -139098 -257668 27827 5766 -229115 -197852 -176455 17677 11127 -67689 3497
15648A5994a2688B66657j25012J10434a12299A99350J48660f1101j33822Q4154
$$ 15994 -12688 266657 141645 252079 -112299 199350 348010 -61101 -194923 -110769
15638a10769j33899I3852c60849B46633b12975b3467H6133c22931J42179o1788
$$ -110769 -244668 93852 -360849 246633 -212975 -23467 86133 -322931 -180752 -242540
15628b42540I640b55105h862B79479D899K16441f729B5540J04713D208a08234
$$ -242540 9640 -255105 -8862 279479 4899 221340 -6729 25540 130253 4208 -108234
15616B11704g7983H2996a61461c4215F3676J48065C6227K65775F6345L8385b49470
$$ 211704 -77983 82996 -161461 -34215 63676 211741 36227 302002 66345 104730 -249470
15604A3291J60017r836a013B57787b4211j64029A0120M9275b40627o0877c9395
$$ 13291 173308 163472 -1013 257787 -24211 -188240 10120 59395 -240627 -301504 -39395
15592A95478a91296B54852c15774A12737j4502a98441f6702n7112K8009B81245
$$ 195478 -191296 254852 -315774 112737 98235 -198441 -66702 -123814 -95805 281245
15581i9175E0044b29939C7442N9472g2149I2590b93425A00535g3422j9987j03675
$$ -99175 50044 -229939 37442 96914 -72149 92590 -293425 100535 -73422 -93409 -197084
15570a97084A48396p0323R9995j1926q1581B0859b91861B87141M6199A06033R1541
$$ -197084 148396 78073 178068 166142 84561 20859 -291861 287141 333340 106033 197574
15559A97574a94536E8413J48439a46048A48083f6531A21559K84194b29438h3826
$$ 197574 -194536 58413 206852 -146048 148083 -66531 121559 405753 -229438 -83826
15548B4857a17140I7194c36476C31098A04582d52260B5291J78862l2317H3771
$$ 24857 -117140 97194 -336476 331098 104582 -452260 25291 204153 171836 83771
15537D75992F0528a00472B09611p4018b71471A7627a21350k1633M5370J2636H387
$$ 475992 60528 -100472 209611 135593 -271471 17627 -121350 -142983 -97613 -84977 8387
15525h8156m0922D8617K40236c42227a52528I4122a60053A88038f6510p5962C9055
$$ -88156 -129078 48617 288853 -342227 -152528 94122 -160053 188038 -66510 -142472 39055
15513F7315J91408p3579C245J14873a74113A78583B9449e1523l68212A88381E2585
$$ 67315 258723 185144 3245 118118 -174113 178583 29449 -51523 -419735 188381 52585
15501G7439J78594a34738B27078a48142D5951f3424p685j88255d0472E59312A83713
$$ 77439 256033 -134738 227078 -148142 45951 -63424 -71109 -259364 -40472 559312 183713
15489a70041M3277B82469G8293K4509O9749E1952K85923a28803B82469d1879n9045
$$ -170041 -126764 282469 78293 102802 172551 51952 337875 -128803 282469 -41879 -100924
15478a00924C81774A80105K00517J17943c6969B62348p5116d03619B68696N918
$$ -100924 381774 180105 380622 498565 -36969 262348 187232 -403619 268696 274614
15468B74614i5008F8450a73837j63607A20276R4815k8446c94638a29336a2524
$$ 274614 -95008 68450 -173837 -337444 120276 215091 186645 -394638 -129336 -12524
15457b62973B41804p0708F532i6809h821A39624l4923m7622a38729A05692O6804
$$ -262973 241804 171096 6532 -96809 -8821 139624 104701 57079 -138729 105692 172496
15446A72496J01645B3491K79390N6667J45206C6548K69542K5392c55618a38086
$$ 172496 274141 23491 302881 359548 504754 36548 306090 331482 -355618 -138086
15435A05359l0801B1906j0108i7239k53300a04525C3812o13m109j0998J61950
$$ 105359 74558 21906 11798 -97239 -350539 -104525 33812 33199 29090 18092 180042
15424A80042p2271J16343c585k43332j11007b8888a1829j82334K6339k7277B07010
$$ 180042 107771 224114 -3585 -246917 -357924 -28888 -11829 -194163 -167824 -195101 207010
15412A131K80710b8172C1467J59145d9969A26389E8908b35184A64685E5522a03760
$$ 1131 281841 -28172 31467 190612 -49969 126389 58908 -235184 164685 55522 -103760
15400A9283J03018c03422F8512b57563m829C08844a10738c9262A79292a65920
$$ 19283 122301 -303422 68512 -257563 -262392 308844 -110738 -39262 179292 -165920
15389H1246i3726d3848A43087J24504D827J62706a33492B15043B2009a33713L7521
$$ 81246 -93726 -43848 143087 267591 4827 167533 -133492 215043 22009 -133713 -96192
15378i6192b7207m7476a7806A02455P9727J97861A06594g4924B21382m8257b1599
$$ -96192 -27207 -74683 -17806 102455 182182 380043 106594 -74924 221382 173125 -21599
15366a57969A21186J97556A14025K1928P2379q2579C8259P7682j7198J4560l0458
$$ -157969 121186 318742 114025 135953 208332 125753 38259 115941 98743 113303 82845
15355H2845c26175n3699C05375j08382o991P9999b09540I2029C5682a38703M9358
$$ 82845 -326175 -379874 305375 196993 190002 270001 -209540 92029 35682 -138703 -89345
15344h9345B58722J69719M34A50964K3339n206K41337D105L94769I2556a77471
$$ -89345 258722 428441 428875 150964 174303 169097 410434 4105 398874 92556 -177471
15332i0100B80198A27223P4389F2368b56788A12807J93428A0452J06584a12806
$$ -90100 280198 127223 201612 62368 -256788 112807 306235 10452 117036 -112806
15321G9583l316l1600a1669B85638b13883B29028j00256f6513J6180B74659J23540
$$ 79583 76267 44667 -11669 285638 -213883 229028 128772 -66513 -50333 274659 398199
15310C98199a39132B62486J13607G9097C8421f3714A32326b1700E4991J21627
$$ 398199 -139132 262486 376093 79097 38421 -63714 132326 -21700 54991 176618
15300A76618a63746M1205o253c4260j12406B10219c74F9884K16280a62795A8148
$$ 176618 -163746 -122541 -128794 -34260 -146666 210219 -374 69884 286164 -162795 18148
15288A26378J48903a8870A68687b80806A25102R7202J6624c01888c0447A64511
$$ 126378 275281 -18870 168687 -280806 125102 222304 238928 -301888 -30447 164511
15277G5914K56155o8126M2814A08727b7660A15506k066A2186a02395C64022a44718
$$ 75914 332069 263943 306757 108727 -27660 115506 113440 12186 -102395 364022 -144718
15265g982A24323f2482A24030C8658J33377G7041n915a00339C48367j67143a11733
$$ -7982 124323 -62482 124030 38658 172035 77041 71126 -100339 348367 181224 -111733
15253b1937A44688L85063J58940j50838M80461J002988m99963k27915N71017G11508
$$ -21937 144688 529751 688691 537853 1018314 2021302 1521339 1293424 1864441 711508
15242I5440a6594B66573K0946A25644P0567D3313J08037C4785b6020q801k51267
$$ 95440 -16594 266573 287519 125644 196211 43313 151350 34785 -26020 -34821 -286088
15231b86088j8267b9891B7986J25964J65436H2014c402A74479a28313e2745A48452
$$ -286088 -304355 -29891 27986 153950 319386 82014 -3402 174479 -128313 -52745 148452
15219F9955E424L59363j12688c1425H9295l7813b28579A21236D4513J39544d4223
$$ 69955 5424 364787 252099 -31425 89295 51482 -228579 121236 44513 184057 -44223
15207I6766e9148A57411m7534A6277L53346A22701m3795b7721C8710J58027E0877
$$ 96766 -59148 157411 109877 16277 369623 122701 78906 -27721 38710 196737 50877
15195A55100D0528i9564B21742a4215A11591j6340d62619h621l70664A51012N5332
$$ 155100 40528 -99564 221742 -14215 111591 95251 -462619 -8621 -379285 151012 206344
15184B06344a07903m6717C76905H1197J33939b652j52910j06760J22510I0341
$$ 206344 -107903 -154620 376905 81197 215136 -2652 -155562 -262322 -139812 90341
15173A93361c01430E09418c4424B65452A23620j0704K49662H983f7672H8786j1615
$$ 193361 -301430 509418 -34424 265452 123620 112916 362578 8983 -67672 88786 77171
15162G7171b75966A29146M9486h850A74829D703K5837K46646a09739B60999J26644
$$ 77171 -275966 129146 178632 -8850 174829 4703 30540 277186 -109739 260999 387643
15151C87643I1168i2182L8588C23504A36647j7655O6555h2836j35132A99986a07042
$$ 387643 91168 -92182 -53594 323504 136647 118992 185547 -82836 -217968 199986 -107042
15139a26763A48680O1659D3259J44188e0490D32275i9509B8365L29646C5941c6046
$$ -126763 148680 210339 43259 187447 -50490 432275 -99509 28365 358011 35941 -36046
15127F9849i6210G3358R5363L6815C4119L69831A97227J23736O1896A06637a4009
$$ 69849 -96210 73358 168721 205536 34119 403950 197227 320963 382859 106637 -14009
15115A92841b05435d3610A62912p1457e1942B74407A32051K5848N4558H398i3180
$$ 192841 -205435 -43610 162912 91455 -51942 274407 132051 157899 212457 8398 -93180
15103B41912A8350R1824m0198J05131B3739R4675c3497G9360O1368i7327c7774
$$ 241912 18350 110174 69976 175107 23739 118414 -33497 79360 140728 -97327 -37774
15091B31933J36036h4468J5596B8524O3786b1289l41363A6175K62175A18161e1852
$$ 231933 367969 -84468 -68872 28524 92310 -21289 -362652 16175 278350 118161 -51852
15079B49397J0383F8405J06749g7202A14598b02246A46991a85709a704B113a34348
$$ 249397 259780 68405 175154 -77202 114598 -202246 146991 -185709 -1704 2113 -134348
15067h2705l450G2806J78169b0012B09154D5854J30017K22589j41365c2485A79634
$$ -82705 -86155 72806 250975 -20012 209154 45854 175871 398460 257095 -32485 179634
15055C02673a3708A35462J17356a84072B17019J31550M8671j00982r6067J39640
$$ 302673 -13708 135462 252818 -184072 217019 348569 397240 296258 200191 339831
15045C39831K14632A62073L71959j73032A24537J9012L60464A40973L92061k64904
$$ 339831 554463 162073 534032 361000 124537 143549 504013 140973 533034 268130
15035B68130P2152a08490A51051L44212j89032L5933k0174J31792L35177C38209
$$ 268130 340282 -108490 151051 495263 306231 342164 321990 453782 788959 338209
15024G97655B73117J96793A59320J43713j39291J92218r054K25251H9864K55825
$$ 797655 273117 469910 159320 303033 163742 355960 346906 572157 89864 345689
15014C45689J03521J39941k12475m689j83257C8283P5284L02847j77917K5651
$$ 345689 449210 589151 376676 371987 188730 38283 113567 416414 238497 264148
15004B64148J61522K87187A46389K92001A83178l9186L02214N913j66387k8917
$$ 264148 425670 712857 146389 438390 183178 143992 446206 452119 285732 256815
14994B56815J58363J86236B05904a05937j3873D39483p7555n5026J8673J7062
$$ 256815 415178 601414 205904 -105937 -119810 439483 361928 306902 325575 342637
14984C42637A55107M21928B13718J55037L612J52065m4541A06802K49121K76337
$$ 342637 155107 577035 213718 368755 372367 524432 479891 106802 355923 632260
14974F32260p0633k7559q5869j12282O4828A27718D5731P00256l06185j84125
$$ 632260 561627 534068 448199 335917 400745 127718 45731 745987 439802 255677
14964B55677K81860j15172K68115k21215K8402j7944K56095A13789K01441r527
$$ 255677 537537 422365 690480 469265 497667 479723 735818 113789 315230 305703
14954C05703Q9170A87246o1400K51182A60233K61754A70999o5340J80106L38228
$$ 305703 394873 187246 125846 377028 160233 421987 170999 105659 285765 623993
14944F23993j4127B73618L44127j48266A47605L29654j58957R7353M1031j58526
$$ 623993 609866 273618 617745 469479 147605 477259 318302 415655 456686 298160
14934B98160K95796k1392J37311p4902M7232J14108j69175L08395l96383M52834
$$ 298160 593956 572564 709875 634973 682205 796313 627138 935533 539150 991984
14924I91984o8134N2553K3527M3997j51075J93050j44494K39383l24618J79620
$$ 991984 923850 976403 999930 1043927 892852 1085902 941408 1180791 856173 1035793
14914A035793R7454n31641K16165B82426K50927j47140j73564J07896J3389j04784
$$ 1035793 1133247 601606 817771 282426 533353 386213 212649 320545 333934 229150
14904B29150K26292B14880N4594L2226F6196K10717K19325j48890o2653A32083
$$ 229150 455442 214880 269474 301700 66196 276913 496238 347348 284695 132083
14893F69873k99864r4973K33273j07321j38047M7191K51818k13909K4614N3380
$$ 669873 370009 275036 508309 400988 262941 310132 561950 348041 372655 426035
14883D26035j0376j88593J97861L0630j09249K25554q2241J15514j99447K16251
$$ 426035 415659 227066 424927 455557 346308 571862 489621 605135 405688 621939
14873F21939k59045L03386q6828B53472K72327B40295H5151K84449L52040B84577
$$ 621939 362894 666280 579452 253472 525799 240295 85151 369600 721640 284577
14862D19323A73459J73768j60092J45896O081J39064B28382J29019Q6363J70699
$$ 419323 173459 347227 187135 333031 339112 478176 228382 357401 443764 614463
14852F14463B15558p8356M20041j05249J09311q1670J12517K47947j16330O3649
$$ 614463 215558 137202 557243 451994 561305 479635 592152 840099 723769 787418
14842G87418M6130o5549J58106j75332M57668m81432O437l24138Q1047l0437n9082
$$ 787418 833548 767999 926105 750773 1208441 727009 733446 409308 490355 459918 400836
14831D00836K96305j40618j58350K95048j35829j90100L71080B06085L33810M1524
$$ 400836 697141 556523 398173 693221 557392 367292 738372 206085 539895 581419
14821E81419L17400D23756o1232J56993L04530C88203J68390I9478M19346J83653
$$ 581419 898819 423756 362524 519517 824047 388203 556593 99478 518824 702477
14811G02477l9065B65774L46867n7814R4515j8159l1174k54000L10524k56159
$$ 702477 663412 265774 612641 554827 649342 631183 600009 346009 656533 400374
14801D00374J25009K35984j46086B36479J17471L73219n2678k20769L39649C42543
$$ 400374 525383 761367 615281 236479 353950 727169 674491 453722 793371 342543
14790E64237Q3151K32214k45737J44344l56410m6728o1161J46438k16633K41225
$$ 564237 647388 879602 633865 778209 421799 375071 313910 460348 243715 484940
14780D84940K48930q2492N2012L1784Q5988C21496K46865K08180j69958M5014
$$ 484940 733870 651378 703390 735174 821162 321496 568361 776541 606583 651597
14770F51597o1277j87418L03253J15219k81863j01252P0227K58371k72444K76194
$$ 651597 590320 402902 706155 821374 539511 438259 508486 766857 494413 770607
14760G70607B89820J99576q3013N0538k1023J56480B78073L04737Q2803K318L33105
$$ 770607 289820 489396 406383 456921 435898 592378 278073 582810 665613 667931 1001036
14749A001036l13913j11008L1784p1904q7934K45360p1033O4695K0855O3581j14621
$$ 1001036 687123 576115 607899 535995 448061 693421 622388 687083 707938 771519 656898
14738F56898L21345k44807k15770K19477n1599L9931K67690J24027l83646K03413
$$ 656898 978243 733436 517666 737143 685544 725475 993165 1117192 733546 936959
14728I36959k11379J88681O8891r2847K66578l5645K02392j13410p5595M4104
$$ 936959 725580 914261 983152 890305 1156883 1121238 1323630 1210220 1134625 1178729
14718A178729k46151j59482L64114m95922J81087j30997n0165n1310J28514j8038
$$ 1178729 932578 773096 1137210 641288 822375 691378 641213 589903 718417 700379
14708G00379J08729j42391J81556n1933J13042j45555J37809P5160K3365P2824
$$ 700379 809108 666717 848273 796340 909382 763827 901636 976796 1000161 1072985
14698A072985J21727L1500M3457J3710j51709R5065k12697K76955J83349E65170
$$ 1072985 1194712 1226212 1269669 1283379 1131670 1226735 1014038 1290993 1474342 565170
14687I21025k762L5687J21630j24073l9597j28322O4149n1285K31258J71055l64031
$$ 921025 918263 953950 1075580 951507 911910 783588 847737 796452 1027710 1198765 834734
14676H34734K03929k29645L87072k14861j89463K9954Q7154j04082K60853k44550
$$ 834734 1038663 809018 1196090 981229 791766 821720 908874 804792 1065645 821095
14666H21095L2173L23473L8784l7224k00094j43527J25116p8497K2219M9134L9813
$$ 821095 853268 1176741 1215525 1178301 978207 834680 959796 881299 903518 952652 992465
14655I92465j72133M64344l84349R9484r8734K62593k17461J7070L16113m9853
$$ 992465 820332 1284676 900327 999811 901077 1163670 946209 963279 1279392 1229539
14645A229539j08091k12894K63150N8989m2893k11709K68859R2377j24363O6132
$$ 1229539 1121448 908554 1171704 1230693 1187800 976091 1244950 1337327 1212964 1279096
14635A279096O211N3287n5752o4188m9508j33245K82108K9374J43922k15266j74293
$$ 1279096 1285307 1338594 1282842 1218654 1169146 1035901 1318009 1347383 1491305 1276039 1101746
14624A101746J63282o8118L9056o6890j38751P5348K25456l9501R0330J2388L55356
$$ 1101746 1265028 1196910 1235966 1169076 1030325 1105673 1331129 1291628 1381958 1394346 1749702
14613A749702j34447l40377K46924j38455P4881k78568M20267L5731l30467L16691
$$ 1749702 1615255 1274878 1521802 1383347 1458228 1179660 1599927 1635658 1305191 1621882
14603A621882m3180R5865m04745J70275K01212o7754m9085K46872j1479N2948
$$ 1621882 1578702 1674567 1269822 1440097 1641309 1573555 1524470 1771342 1759863 1812811
14593A812811k23604r1677L87078m58815N52741l03389j22853J58251J49086r8899
$$ 1812811 1589207 1497530 1884608 1425793 1978534 1675145 1552292 1710543 1859629 1760730
14583A760730J09693M1849j40241L56848m35252M11175k16036P039M2992K92970
$$ 1760730 1870423 1912272 1772031 2128879 1693627 2104802 1888766 1895805 1938797 2231767
14573B231767l78786K59230K16447l20020O19268n71564M9721n3636K15841M2777
$$ 2231767 1852981 2112211 2328658 2008638 2627906 2056342 2106063 2052427 2268268 2311045
14563B311045L3837Q5067O6828J83171J48912j26855M75097r3940J58472N80743
$$ 2311045 2344882 2429949 2496777 2679948 2828860 2702005 3177102 3083162 3241634 3822377
14553C822377Q2335N96168P86856Q91970J938263M000191Q161801J3863206M510713
$$ 3822377 3904712 4500880 5287736 6179706 8117969 12118160 20279961 34143167 38653880
14544C8653880j6601095A0175858E053115j919179o30082l69035k1519m26073
$$ 38653880 22052785 10175858 5053115 3133936 2503854 2134819 2113300 1687227
14536A687227J13697M4517L75286l47684L1467K81448N5291j27936K5852n9145
$$ 1687227 1800924 1845441 2220727 1873043 1904510 2185958 2241249 2113313 2139165 2080020
14526B080020K61530j0713k22731Q6017J47616K31891k60887K9710j53284K75253
$$ 2080020 2341550 2330837 2108106 2194123 2341739 2573630 2312743 2342453 2189169 2464422
14516B464422j36125K44620q9637J15907r8659K9920K00053L22348k24373o4100
$$ 2464422 2328297 2572917 2483280 2599187 2500528 2530448 2730501 3052849 2828476 2764376
14506B764376K26786k24392J0228k2279m3189Q4197M85090j05711j14871J25304
$$ 2764376 2991162 2766770 2776998 2754719 2711530 2795727 3280817 3175106 3060235 3185539
14496C185539m15617Q63066p62515P36480n09979K0801K40895L57749k17027J68008
$$ 3185539 2769922 3632988 2870473 3606953 3096974 3117775 3358670 3716419 3499392 3667400
14486C667400k48789K83568m28306J76656K62692K95459m22284K45228R0102K2201
$$ 3667400 3418611 3702179 3273873 3450529 3713221 4008680 3586396 3831624 3921726 3943927
14476C943927J68117o5465J3478k11681J21019K15949q0867j27226K87826J42869
$$ 3943927 4112044 4046579 4060057 3848376 3969395 4185344 4104477 3977251 4265077 4407946
14466D407946O0867j75765P8782N7563l4938M33367N3924j8975q774l6264K42005
$$ 4407946 4468813 4293048 4371830 4429393 4394455 4827822 4881746 4862771 4853997 4817733 5059738
14455E059738N9603P0969K85228m61723J78669K08867j49201K27048J9365K01632
$$ 5059738 5119341 5190310 5475538 5013815 5192484 5401351 5252150 5479198 5498563 5700195
14445E700195k80415M64103p7866O0197J25941j07102K79206J46156o3071J0995
$$ 5700195 5419780 5883883 5806017 5866214 5992155 5885053 6164259 6310415 6247344 6258339
14435F258339J32297K63429o8381k32778L26579K97633j73626P501J45556J54478
$$ 6258339 6390636 6654065 6585684 6352906 6679485 6977118 6803492 6810993 6956549 7111027
14425G111027L68347k30851J85694L55620o7016M38314k17129O04327n8129j09232
$$ 7111027 7479374 7248523 7434217 7789837 7722821 8161135 7944006 8548333 8490204 8380972
14415H380972q1636J48391N48858r7394o7369K07878K47709j11049J57521J39929
$$ 8380972 8299336 8447727 8996585 8899191 8831822 9039700 9287409 9176360 9333881 9473810
14405I473810L59925Q4677M20014L05820j19330J85594l14250P76232j72764p8190
$$ 9473810 9833735 9918412 10338426 10644246 10524916 10710510 10396260 11172492 10999728 10921538
14395A0921538O81366M7095J62257O3438N4148M89806O6303L76228R114J16939
$$ 10921538 11602904 11649999 11812256 11875694 11929842 12419648 12485951 12862179 12871293 12988232
14385A2988232Q31075j00796J07507L07135O01557K89672K46906j84068L93185
$$ 12988232 13819307 13718511 13826018 14133153 14734710 15024382 15271288 15087220 15480405
14376A5480405N26011M49367l35047N90817K55303O51154J54256J28514M28015
$$ 15480405 16006416 16455783 16120736 16711553 16966856 17618010 17772266 17900780 18328795
14367A8328795O42406r2300P94954M88687N78259p1029Q63396K38609L76559Q90214
$$ 18328795 18971201 18878901 19673855 20162542 20740801 20669772 21533168 21771777 22148336 23038550
14357B3038550M65162Q04032m7918O81555L91090J017917N97798O28545N29963
$$ 23038550 23503712 24307744 24259826 24941381 25332471 26350388 26948186 27576731 28106694
14348B8106694J014623O43509L00358J082234R78440Q47145O28620J030231R53001
$$ 28106694 29121317 29764826 30065184 31147418 32125858 32973003 33601623 34631854 35584855
14339C5584855P73902J158281R63475J253360P94482J247523J466243J216225
$$ 35584855 36358757 37517038 38480513 39733873 40528355 41775878 43242121 44458346
14331D4458346J385960J603141J029496J893194J589744J500521J305268J692587
$$ 44458346 45844306 47447447 48476943 50370137 51959881 53460402 54765670 56458257
14323E6458257K050672K242927J953887J955443K164828K398459K925602K614101
$$ 56458257 58508929 60751856 62705743 64661186 66826014 69224473 72150075 74764176
14315G4764176K530539K766442L151811L443398L405910L568000L565842M256256
$$ 74764176 77294715 80061157 83212968 86656366 90062276 93630276 97196118 101452374
14307A01452374M073937M558749M769714M918638N117055N849780N748796O622978
$$ 101452374 105526311 110085060 114854774 119773412 124890467 130740247 136489043 143112021
14299A43112021O181789P236982P672793P836577Q211932Q794961R130819R707647
$$ 143112021 149293810 156530792 164203585 172040162 180252094 189047055 198177874 207885521
14291B07885521J0237449J0644574J1423244J2017734J2294103J2720009J3053822
$$ 207885521 218122970 228767544 240190788 252208522 264502625 277222634 290276456
14284B90276456J3854136J4126503J4312692J4213484J4523605J4064037J3771559
$$ 290276456 304130592 318257095 332569787 346783271 361306876 375370913 389142472
14277C89142472J3073606J2117811J0936689Q931942N565211K053855J098050
$$ 389142472 402216078 414333889 425270578 434202520 439767731 441821586 442919636
14270D42919636J193232N82592l829593l399714m297372p945746j0273343j2163098
$$ 442919636 444112868 444695460 440865867 437466153 433168781 425223035 414949692 402786594
14262D02786594j3705195j4597297j4892619j5413924j5123659j5770938j4807111
$$ 402786594 389081399 374484102 359591483 344177559 329053900 313282962 298475851
14255B98475851j4640907j3085946j3200898j2482683j2829768j1631481j0899632
$$ 298475851 283834944 270748998 257548100 245065417 232235649 220604168 209704536
14248B09704536j0715329r631160r542908q556860q053301p524897p635054p302446
$$ 209704536 198989207 189358047 179815139 171258279 163204978 155680081 148045027 140742581
14240A40742581o232769o269521n428892n042520n005280n422563m522822m205416
$$ 140742581 134509812 128240291 122811399 117768879 112763599 107341036 102818214 98612798
14232I8612798l634992l748012l725537l702466l143933l106566l102064k932401
$$ 98612798 94977806 91229794 87504257 83801791 80657858 77551292 74449228 71516827
14224G1516827k359211k707562k249963k353672j792660k264709j928753j900413
$$ 71516827 69157616 66450054 64200091 61846419 60053759 57789050 55860297 53959884
14216E3959884j880094j607363j295073j319272j707215j255084j534192j265086
$$ 53959884 52079790 50472427 49177354 47858082 46150867 44895783 43361591 42096505
14208D2096505j287034q61172p80632j274141j425279p57105j356115p76870n35983
$$ 42096505 40809471 39948299 39167667 37893526 36468247 35711142 34355027 33578157 33042174
14199C3042174n78342j395906p35696o19219q23757m30467q56782j147051m71958
$$ 33042174 32463832 31067926 30332230 29713011 28889254 28458787 27602005 26454954 25982996
14190B5982996l47396r49598k92320o83188m75516p50882k99657m52545o00688
$$ 25982996 25635600 24686002 24393682 23710494 23234978 22484096 22184439 21731894 21131206
14181B1131206m02641n03409n84798p2354n94862k95673k72498l49570n25594
$$ 21131206 20728565 20225156 19640358 19568004 18973142 18677469 18404971 18055401 17529807
14172A7529807k99679l32071k46379m06387q3097n67837j38105k70749n48533
$$ 17529807 17230128 16898057 16651678 16245291 16162194 15594357 15456252 15185503 14636970
14163A4636970m35l73634k37348k86069n73749o2229k07846p852l90296o1946
$$ 14636970 14636535 14262901 14025553 13739484 13165735 13103506 12895660 12887808 12497512 12435566
14153A2435566j08649l42199m11777l4700n5885k76026o1472O8209o59158J77818
$$ 12435566 12326917 11984718 11572941 11538241 11482356 11206330 11144858 11213067 10553909 10731727
14143A0731727l14564j14169k34202k50339M20200m63202j44407j60124o58705
$$ 10731727 10417163 10302994 10068792 9818453 10238653 9775451 9631044 9470920 8812215
14134H812215k62924K90710J11489p37306R4017j9626k59262J18540J26803j6475
$$ 8812215 8549291 8840001 8951490 8214184 8308201 8288575 8029313 8147853 8274656 8258181
14124H258181l27121O0760j83935m45493K23670o82234L04226J33039k24920k74079
$$ 8258181 7931060 7991820 7807885 7362392 7586062 6903828 7208054 7341093 7116173 6842094
14114F842094K12693o06691J91751n4177P0584k49202P1466l47357r2290J84114
$$ 6842094 7054787 6448096 6639847 6585670 6656254 6407052 6478518 6131161 6038871 6222985
14104F222985q1431j21975k6572j51205k59174K59091j37006k33080J94207l48645
$$ 6222985 6141554 6019579 5993007 5841802 5582628 5841719 5704713 5471633 5665840 5317195
14094E317195l4286l4043J22386l79082r9279J51576r2063j7950J09835k24623
$$ 5317195 5282909 5248866 5371252 4992170 4892891 5044467 4952404 4934454 5044289 4819666
14084D819666Q8144k66739q8259J15913J96681k37239p3280j16070P1361l8953
$$ 4819666 4907810 4641071 4552812 4668725 4865406 4628167 4554887 4438817 4510178 4471225
14074D471225K9155j96149N2579m0772n7468J42218m28883J02615K07459j45973
$$ 4471225 4500380 4304231 4356810 4316038 4258570 4400788 3971905 4074520 4281979 4136006
14064D136006L09166j55848l43066j70178M24240P470k29409l95086j46816Q1262
$$ 4136006 4445172 4289324 3946258 3776080 4200320 4207790 3978381 3583295 3436479 3517741
14054C517741K93132k74349k7293P3981j99117M8376N8747m4857l72942K86431
$$ 3517741 3810873 3536524 3509231 3583212 3384095 3432471 3491218 3446361 3073419 3359850
14044C359850k23364K00990J38649k08446j0932o6328r2001l30458L50047p5276
$$ 3359850 3136486 3337476 3476125 3267679 3256747 3190419 3098418 2767960 3118007 3042731
14034C042731k19752N47267m4793l2732r7879m30792m6967K16452M683k55730
$$ 3042731 2822979 3370246 3325453 3292721 3194842 2764050 2717083 2933535 2938218 2682488
14024B682488L1515J57900k60517j73897j38908K55701k77354M24509N2945P2694
$$ 2682488 2714003 2871903 2611386 2437489 2298581 2554282 2276928 2701437 2754382 2827076
14014B827076m29670r5468P4712r8714J18227Q3208j69701K55460j67512Q0809
$$ 2827076 2397406 2301938 2376650 2277936 2396163 2479371 2309670 2565130 2397618 2478427
14004B478427l0271m49347M51775k47364q7692k08945M87123k72690J64464K60188
$$ 2478427 2448156 1998809 2450584 2203220 2115528 1906583 2393706 2121016 2285480 2545668
13994B545668k44494J51196n5507L20581M65331J392151K396528N665403J2416471
$$ 2545668 2301174 2452370 2396863 2717444 3182775 4574926 6971454 12636857 25053328
13985B5053328J3726807j1391413j1896463o252426k909243j363296r26253m40271
$$ 25053328 38780135 27388722 15492259 9239833 6330590 4967294 4041041 3600770
13977C600770l31613r5107k20391o6701j06161j78705J1150j395n56324N42150
$$ 3600770 3269157 3174050 2953659 2886958 2780797 2602092 2613242 2611847 2055523 2597673
13967B597673n83187K97382J38265m07231J68105j80131J30361K08650q6689j42889
$$ 2597673 2014486 2311868 2450133 2042902 2211007 2030876 2161237 2369887 2283198 2140309
13957B140309M597K4578j79653R815l49783L34298j48138k26907l3832K12938
$$ 2140309 2144906 2169484 1989831 1999646 1649863 1984161 1836023 1609116 1575284 1788222
13947A788222n9643Q543K5352q8223K41907m3819j3305l76909O12323m59759L27979
$$ 1788222 1728579 1737122 1762474 1674251 1916158 1872339 1859034 1482125 2094448 1634689 1962668
13936A962668m83315R2344K37626j09799k37304K49089j83562K2779J08999N9671
$$ 1962668 1479353 1571697 1809323 1699524 1462220 1711309 1527747 1550526 1659525 1719196
13926A719196j95153J10595j91497Q1575k7804l197K56415k77009o7501J65105
$$ 1719196 1524043 1634638 1443141 1524716 1496912 1493715 1750130 1473121 1405620 1570725
13916A570725n12093M95930l11435M40865j76519l05864K40639M811N1546j45280
$$ 1570725 1058632 1554562 1243127 1683992 1507473 1201609 1442248 1447059 1498605 1353325
13906A353325J40924k30518J93344p2159J29279m3160j92681K1627n0424L9335
$$ 1353325 1494249 1263731 1457075 1384916 1514195 1471035 1278354 1299981 1249557 1288892
13896A288892k3070j48601j12072L09697j39500N6215J4601n9319J41862l11574
$$ 1288892 1265822 1117221 1005149 1314846 1175346 1231561 1246162 1186843 1328705 1017131
13886A017131N7863k1769K63958n8637N1906j26588k64187K85940l06543L03476
$$ 1017131 1074994 1053225 1317183 1258546 1310452 1183864 919677 1205617 899074 1202550
13876A202550j25161J29034k3883j92937K49013r3789J74871k16594J18914o5553
$$ 1202550 1077389 1206423 1182540 989603 1238616 1144827 1319698 1103104 1222018 1156465
13866A156465j6449J90504l19994K12606J18710J78415o54849K71693k32999P9383
$$ 1156465 1140016 1330520 1010526 1223132 1341842 1520257 865408 1137101 904102 983485
13856I83485J63838m36102K54003l57374M89779k29937L39581k47806J6148L2249
$$ 983485 1147323 711221 965224 607850 1097629 867692 1207273 959467 975615 1007864
13846A007864j9489J45633l40896K17387m2497J09738l18899L36048j57403J39064
$$ 1007864 988375 1134008 793112 1010499 968002 1077740 758841 1094889 937486 1076550
13836A076550n24550L97029J41581J54828l56458j5553l7840N9591N1094j26495
$$ 1076550 552000 949029 1090610 1245438 888980 873427 835587 895178 946272 819777
13826H19777K43345k45954j3842P5929m0139p9101K18120J25352E43664L82997
$$ 819777 1063122 817168 803326 879255 839116 760015 978135 1103487 543664 926661
13816I26661K35048k45297L0902k94138j04090M37565m7937J33585k42500o7408
$$ 926661 1161709 916412 947314 653176 549086 986651 938714 1072299 829799 762391
13806G62391q9538j40047M13543j09820k54266K36120m5121J06880A53688N85876
$$ 762391 672853 532806 946349 836529 582263 818383 773262 880142 153688 739564
13796G39564L19252n7117k45062K24104l98412J46374P2235j09992J45777j28816
$$ 739564 1058816 1001699 756637 980741 582329 728703 800938 690946 836723 707907
13786G07907r128J3453J85170j33672j3866r4021M4849n6738o3904k44370M07245
$$ 707907 698779 712232 897402 763730 749864 655843 700692 643954 580050 335680 742925
13775G42925K20724j84643o0337m6965j06692L593k53987M53968j86428A65412
$$ 742925 963649 779006 718669 671704 565012 568605 314618 768586 582158 165412
13764D50462L61399j25973j05016Q162j29733L25995J62663P5029k72974B18645
$$ 450462 811861 685888 580872 589034 459301 785296 947959 1022988 750014 218645
13753H06671B37635N07537j6697j84268L03842j01688k53161K83779p25o5403
$$ 806671 237635 745172 728475 544207 848049 746361 493200 776979 776254 710851
13743G10851j46141J33631l3983L41035l36201M68181D21134A86290L91649K28897
$$ 710851 564710 698341 664358 1005393 669192 1137373 421134 186290 577939 806836
13733H06836l30262j95109L70946K6395J34584C64810K96885j14895Q7925K59213
$$ 806836 476574 281465 652411 678806 813390 364810 661695 546800 634725 893938
13723H93938j93583j70659k045J81751j58420q6902r2963L2069J28654o0580N4287
$$ 893938 700355 529696 527651 709402 550982 464080 371117 403186 531840 471260 525547
13712E25547j71707L13322j6079J63254m5085J13401k69379A99889K06665p6656
$$ 525547 353840 667162 651083 814337 769252 882653 613274 199889 406554 329898
13702C29898L27973j07667K6274l3975k26106J47827n6517J08617A68540L04736
$$ 329898 657871 550204 576478 542503 316397 464224 407707 516324 168540 473276
13692D73276k2405j31994m9537L1786M29970k73314K44471k70611l3878K9956
$$ 473276 450871 318877 269340 301126 731096 457782 702253 431642 397764 427720
13682D27720J76155o7497o1275K50254j69253j01032p5359j46584J46705J54477
$$ 427720 603875 536378 475103 725357 556104 455072 379713 233129 379834 534311
13672E34311n1191L27953C73958K58944k7926j02432L6572p1841j35326k000M50372
$$ 534311 483120 811073 373958 632902 604976 502544 539116 467275 331949 329949 780321
13661G80321C32630K89221J0921A99764K36169J72685n6404k631A64495L62208
$$ 780321 332630 621851 632772 199764 435933 608618 552214 549583 164495 526703
13651E26703O0525k6568J9182B60834J19777q5222j12946K86016j29769k4367
$$ 526703 587228 560660 579842 260834 380611 295389 182443 468459 338690 314323
13641C14323A2530Q34520C52587K20965q3161j18046P24508m32257J53922A81061
$$ 314323 12530 847050 352587 573552 490391 372345 1096853 664596 818518 181061
13630B31182J58442D1800L21399m7059q6307q6862K80345J35399o2620j58975
$$ 231182 389624 41800 363199 316140 229833 142971 423316 558715 496095 337120
13620C37120k1205k1930n8523K95460A83307F4892M37255N2921A87715J16133
$$ 337120 315915 293985 235462 530922 183307 64892 502147 555068 187715 303848
13610C03848N3004K71449k83005J55505K51989j50973n4306J27450B34802M79681
$$ 303848 356852 628301 345296 500801 752790 601817 547511 674961 234802 714483
13600G14483k66163B20240G4359L29836J00458k00708I6114J27977M9337N0683
$$ 714483 448320 220240 74359 404195 504653 303945 96114 224091 273428 324111
13590C24111j24218F247L61385b14396B48108J36742J27020l8394B30824N9951
$$ 324111 199893 6247 367632 -214396 248108 384850 511870 473476 230824 290775
13580B90775q284p1439K41187O5403j32032J2006c869C36485j8548C8341K87254
$$ 290775 282491 211052 452239 517642 385610 397616 -3869 336485 317937 38341 325595
13569C25595I3179C1900K46181k6867j5382k5993o8922J62824A51592N6536J08831
$$ 325595 93179 31900 278081 251214 235832 209839 140917 303741 151592 208128 316959
13558C16959J8970Q9430j17011M105A37637K43342j51948l9524K20318N8315k29486
$$ 316959 335929 425359 308348 312453 137637 380979 229031 189507 409825 468140 238654
13547B38654J96343q852l8340j5761F9852L63249J63996C3610J98078j05552o1239
$$ 238654 434997 426145 387805 372044 69852 433101 597097 33610 231688 126136 64897
13536F4897K74022H7817L2807J32627B0284K84250A19749J99959J31413H5966
$$ 64897 338919 87817 120624 253251 20284 304534 119749 319708 451121 85966
13525C53640A71375e7884G4885L10089j84448M2535K22175o9140p8894A21577
$$ 353640 171375 -57884 74885 384974 200526 243061 465236 396096 317202 121577
13514A98099g3077D68762J6739A12164j0091J72021K57095j17010L9878j18268
$$ 198099 -73077 468762 485501 112164 102073 274094 531189 414179 454057 335789
13504C35789A65865N9181J94748A70971L85170k26856J20262A66373j1488J16771
$$ 335789 165865 225046 419794 170971 556141 329285 449547 166373 154885 271656
13494B71656l5098l9771J40654p19K28300j87008j60807J75868j63018K12115
$$ 271656 236558 196787 337441 336722 565022 378014 217207 393075 230057 442172
13484D42172A94750J41159j00199I3871J50369a2689A27919M47951n1417k20136
$$ 442172 194750 335909 235710 93871 244240 -12689 127919 575870 524453 304317
13474C04317j30619l6648A9217L22838h0313D19892k3673A49882l5008n001J93754
$$ 304317 173698 137050 19217 342055 -80313 419892 396219 149882 114874 109873 303627
13463C03627m9704J00521j50170j9042J94971K13133A78090L13590B29801G5412
$$ 303627 253923 354444 204274 185232 380203 593336 178090 491680 229801 75412
13452C24146F0985J21974K5296A00762l616L48848B03217F6741K3032J30338L01915
$$ 324146 60985 182959 208255 100762 97146 445994 203217 66741 89773 220111 522026
13441E22026k58277j15242F3908A3961M8622K82508q8539K20442A07125J19545
$$ 522026 263749 148507 63908 13961 62583 345091 256552 476994 107125 226670
13431B26670c4214A52762L135b7452C31058j28976J47018E9852K73374A66111
$$ 226670 -34214 152762 155897 -27452 331058 202082 349100 59852 333226 166111
13420B56986n9209I7691J94008H3500J40931o9194K40142a21342D93201A68358
$$ 256986 197777 97691 291699 83500 224431 155237 395379 -121342 493201 168358
13409B16719q1647d9957E9736O4140n5098K15060N718A08048B66K10220J6739
$$ 216719 135072 -49957 59736 123876 68778 283838 289556 108048 266 210486 227225
13398B27225L01166p1171C5866K64534A48599p2985C0794K34967i0883c6564F9366
$$ 227225 528391 457220 35866 300400 148599 75614 30794 265761 -90883 -36564 69366
13386D05748A85024b7259C5553P5564K60882e724I0610K09347d8180C78980l112
$$ 405748 185024 -27259 35553 111117 371999 -5724 90610 299957 -48180 378980 375868
13375C75868r112A71659n9888e7795C12662P1215A55790G6551R9366L21611k03710
$$ 375868 366756 171659 111771 -57795 312662 383877 155790 76551 175917 497528 293818
13364B93818H4419J30449j02381C5514a24400k9296B00828J90642j11882j31321
$$ 293818 84419 214868 112487 35514 -124400 -153696 200828 391470 279588 148267
13354A48267K66979j49804J705D6277J92734J0175F9773L0096J58906f3420J5321
$$ 148267 415246 265442 267147 46277 239011 249186 69773 99869 258775 -63420 -48099
13343d8099A12324M6791J90624p8514J06803n9179j3107I6503a70938A86567d9203
$$ -48099 112324 159115 349739 271225 378028 318849 305742 96503 -170938 186567 -49203
13331B4952N1281P4096J28572J47127I6306Q1239G5875N6232R9665J72766A7609
$$ 24952 76233 150329 278901 426028 96306 177545 75875 132107 231772 404538 17609
13319e63C27190A28363J37429Q797N8825j49488h8103C23396A6983J70679J0280
$$ -563 327190 128363 265792 274589 333414 183926 -88103 323396 16983 187662 197942
13308A97942Q2145A08448J02149J31967a83838A71939j1986c272j03304A14293
$$ 197942 280087 108448 210597 342564 -183838 171939 159953 -3272 -106576 114293
13297d9536D4067R9481K44256j63901H9823n07j1065J8257B3039I147K97265m7886
$$ -49536 44067 143548 387804 223903 89823 89316 78251 96508 23039 9147 306412 258526
13285B58526C7322j1046P5425M0058M7335J7701Q1220B8899Q8199J20779L08120
$$ 258526 37322 26276 101701 141759 189094 206795 288015 28899 117098 237877 545997
13274E45997B72747j13901E870h8730B31131k9398f2980C23287j18144G795K34001
$$ 545997 272747 158846 5870 -88730 231131 201733 -62980 323287 205143 7795 241796
13263B41796A01526d5850C41832e2423r5956A38321g8238A07639k2423C3658a53609
$$ 241796 101526 -45850 341832 -52423 -148379 138321 -78238 107639 85216 33658 -153609
13251C84002I968R921M21212a11481B58716a3572A14437J40373B8066L72236j08922
$$ 384002 9968 19889 441101 -111481 258716 -13572 114437 254810 28066 400302 291380
13240B91380F637J34573J73351k6152c81936A56953c3029j19145B15370j0211
$$ 291380 6637 141210 314561 288409 -381936 156953 -33029 -152174 215370 205159
13230B05159a50362c0863B94878a86393C42704j65010C407K90345K5720Q0501
$$ 205159 -150362 -30863 294878 -186393 342704 177694 3407 293752 319472 399973
13220C99973A29580J39560D8991d3C15171A29833N4958b52786C16611A14817a74550
$$ 399973 129580 269140 48991 -43 315171 129833 184791 -252786 316611 114817 -174550
13208B34874c823j17369G9421C4383a20551H3189J00720h4970k05508i8435A56154
$$ 234874 -3823 -121192 79421 34383 -120551 83189 183909 -84970 -290478 -98435 156154
13196D50919g1688k4695j31540A42023c4756E6482J6860J46389a96887B24719
$$ 450919 -71688 -96383 -227923 142023 -34756 56482 73342 219731 -196887 224719
13185d7262A54274g6835p5098B25318m7295f5892A92383J19061r9516H1989j1701
$$ -47262 154274 -76835 -151933 225318 178023 -65892 192383 311444 211928 81989 70288
13174G0288J30896a40144j48352E0257A8122f7914a1638B13150M4062m6882j9234
$$ 70288 201184 -140144 -288496 50257 18122 -67914 -11638 213150 257212 210330 191096
13163A91096k4252J06164H2472J22868D2151e3048E39006A0147J12436b0400c044
$$ 191096 166844 273008 82472 205340 42151 -53048 539006 10147 122583 -20400 -3044
13151C68458a43211M296M8173C06362r2488K6945b633k0578l5339I7074M8881
$$ 368458 -143211 -138915 -90742 306362 213874 240819 -2633 -23211 -58550 97074 145955
13140A45955E9190L4157i7747C1968b42346A10851L5957e1334k5331B32056K7307
$$ 145955 59190 93347 -97747 31968 -242346 110851 146808 -51334 -76665 232056 259363
13129B59363F4497K36961A33792a57342a4339A40709C8149J67836I0394J68085
$$ 259363 64497 301458 133792 -157342 -14339 140709 38149 205985 90394 258479
13119B58479d58517E2464c995A15364A093J17626O861Q290N6163n9040K9791G4273
$$ 258479 -458517 52464 -3995 115364 1093 118719 125580 133870 190033 130993 160784 74273
13106B1065K4878a82326A32621K80789a18689d5579A49197K35157F516a41695
$$ 21065 45943 -182326 132621 413410 -118689 -45579 149197 384354 6516 -141695
13095E3076K33135A12128J31090D2667f7031p4365p998A01755L0811J41126p8279
$$ 53076 286211 112128 243218 42667 -67031 -141396 -149394 101755 132566 273692 195413
13084A95413R317r662M0970a92691o0033A25050l624a92494K0841A54055a42339
$$ 195413 204730 195068 236038 -192691 -252724 125050 121426 -192494 -171653 154055 -142339
13072a32116A02644M7810R7445A13604J0507d038A05097R2461o1958a23152r085
$$ -132116 102644 150454 247899 113604 124111 -4038 105097 197558 135600 -123152 -132237
13061a32237A75668e8349C5911J29406K85589A3492f7053I8375a17819B12060
$$ -132237 175668 -58349 35911 165317 450906 13492 -67053 98375 -117819 212060
13050C88801A8249c15869A66889D4734a47400A78321b545B84334L8962A18139
$$ 388801 18249 -315869 166889 44734 -147400 178321 -2545 284334 323296 118139
13039A82356N1346A13931J70037A20952K26573e1661E4537E289e3913B54438e02877
$$ 182356 233702 113931 283968 120952 347525 -51661 54537 5289 -53913 254438 -502877
13027a07892j5886B38912p8751c1543o3084C0363J21765B2780f4550A59628o942
$$ -107892 -123778 238912 160161 -31543 -94627 30363 152128 22780 -64550 159628 152686
13016A52686O7723b5297A12230d7580J2760C25558C1050K26830a5093B28041b74442
$$ 152686 220409 -25297 112230 -47580 -34820 325558 31050 257880 -15093 228041 -274442
13004a4148A47034B6949K80293h7284H3125j5290J72660E7395O7595n135b318
$$ -14148 147034 26949 307242 -87284 83125 67835 240495 57395 124990 119855 -2318
12992d5945b0309H642a53096c3343j92310I7205B5496J69988a57580I2934J24763
$$ -45945 -20309 8642 -153096 -33343 -225653 97205 25496 195484 -157580 92934 217697
12981B17697O10b49277H6432a96196A67110Q3163j23677J43185F513K32955d9812
$$ 217697 218307 -249277 86432 -196196 167110 250273 126596 269781 6513 239468 -49812
12969B3288J81252d9055A56003a15159M7339l2637H1485B7581b62031A97008R4898
$$ 23288 204540 -49055 156003 -115159 -67820 -100457 81485 27581 -262031 197008 291906
12958B91906a29199A09586J05464a0450I8687b1887q5147a7025j84377B99408
$$ 291906 -129199 109586 215050 -10450 98687 -21887 -107034 -17025 -201402 299408
12947f2696j75963F0098M0723J9270a89284o2526c2879B6124a43293J2948H883
$$ -62696 -238659 60098 100821 120091 -189284 -251810 -32879 26124 -143293 -130345 8883
12935B6169i6925c237o84o0747A24069K25359a5763m2450H9826M7455N7869b0183
$$ 26169 -96925 -3237 -3921 -64668 124069 349428 -15763 -58213 89826 137281 195150 -20183
12922a9918m115k6530A54775a21944P372j1642N6978D2241g6719j68920e912j1351
$$ -19918 -24033 -50563 154775 -121944 -114572 -126214 -69236 42241 -76719 -245639 -5912 -17263
12910a7263j60525C23680a51102e6171D6991a15765l65497J93058j43534I1814
$$ -17263 -177788 323680 -151102 -56171 46991 -115765 -481262 -288204 -431738 91814
12899a7020A12264a77876N8180B21191h394j57100B34278c7847o8438K57G8889
$$ -17020 112264 -177876 -119696 221191 -8394 -165494 234278 -37847 -106285 -106028 78889
12887D3210J7702M3404D5625E06N842J58510L5161a40296A7756O8713J56111C866
$$ 43210 60912 104316 45625 506 6348 164858 200019 -140296 17756 86469 242580 3866
12874A0181a85104d3304m4021n3018a0004j1344j1082A79035O1556m5714I2233
$$ 10181 -185104 -43304 -87325 -140343 -10004 -21348 -32430 179035 240591 194877 92233
12862a16502I3769c1976B04785B7505e658C6894J7892a93567C35440h8457K0197
$$ -116502 93769 -31976 204785 27505 -5658 36894 54786 -193567 335440 -88457 -68260
12851f8260j59214F7404e02821C33918d2883A39045f457j24750c8636o1306A14967
$$ -68260 -227474 67404 -502821 333918 -42883 139045 -6457 -131207 -38636 -99942 114967
12839A67749e7403k3117q2336b3600k34689c2837A327a95884A38197j1797b601
$$ 167749 -57403 -80520 -162856 -23600 -258289 -32837 1327 -195884 138197 126400 -2601
12827C08640E4742j3085a65463C74773C0529d0266E5798j856d03722d5467B22321
$$ 308640 54742 41657 -165463 374773 30529 -40266 55798 53942 -403722 -45467 222321
12815D7363l044P496Q1756a28911D6538b52623a17548q246b7742p8694F977b30621
$$ 47363 44319 51815 133571 -128911 46538 -252623 -117548 -125794 -27742 -106436 6977 -230621
12802a99980H8332b54273J01120q7195C55538A47052N2574A9520b24983i0124
$$ -199980 88332 -254273 -153153 -240348 355538 147052 199626 19520 -224983 -90124
12791E0626a29740J968B17363i2494m9497E0192e1916H4521b26360D858a04805
$$ 50626 -129740 -127772 217363 -92494 -141991 50192 -51916 84521 -226360 4858 -104805
12779d4987a21p5083A21702L8807b31444c17k42085C11862F3146h4265K3890m0856
$$ -44987 -121 -75204 121702 160509 -231444 -317 -242402 311862 63146 -84265 -60375 -101231
12767a01231a3451A9630e1177H7783f28B2107M03265B12291b26802B68805g6937
$$ -101231 -13451 19630 -51177 87783 -628 22107 425372 212291 -226802 268805 -76937
12755A63657J13062j16580C3732n75J62406F0689J11077B5948J12138F5043k8461
$$ 163657 276719 160139 33732 33157 195563 60689 171766 25948 138086 65043 36582
12744C6582M0827K2463a90044i79A69658f2832a25j6169B88206a00622A65187
$$ 36582 77409 99872 -190044 -979 169658 -62832 -125 -16294 288206 -100622 165187
12732E4673g0203I7988a53863P6171B88030j25966B85L67698a03361k29604F9069
$$ 54673 -70203 97988 -153863 -77692 288030 162064 285 367983 -103361 -332965 69069
12720a69541E6310J48891D0131a77708e566A23249a45774k50171A27718c7364
$$ -169541 56310 205201 40131 -177708 -5566 123249 -145774 -395945 127718 -37364
12709A41385L4093C7742R2353N7317J14682G0761k5579J65788c21120D9742a83064
$$ 141385 175478 37742 130095 187412 302094 70761 45182 210970 -321120 49742 -183064
12697A41413n0421c31179A07681j7007a1470C36729j28141O4459d4985j02572
$$ 141413 90992 -331179 107681 90674 -11470 336729 208588 273047 -44985 -147557
12687a47557A7472i8039j3894C38566A07269K1942A4835L63180g0505I7480b08975
$$ -147557 17472 -98039 -111933 338566 107269 129211 14835 378015 -70505 97480 -208975
12675b75934C63004o8343a92621b9307B75211c1050Q776o0558I3698J35684j00541
$$ -275934 363004 294661 -192621 -29307 275211 -31050 -22274 -82832 93698 229382 128841
12664A28841a57359N4307D6625L1521k6201a27253e8077j98281A31622q240b3427
$$ 128841 -157359 -103052 46625 78146 51945 -127253 -58077 -256358 131622 123382 -23427
12652E0106K11030A1282L0184A1374J66012J16782A41050J45807b0114A77916
$$ 50106 261136 11282 41466 11374 177386 294168 141050 286857 -20114 177916
12641c2040A08159g0329j57369A00020e8147k23246g8838k5627A95210b00103
$$ -32040 108159 -70329 -227698 100020 -58147 -281393 -78838 -104465 195210 -200103
12630A16820l33e4095H7838c56143B84574a6029A24944l5159J4330A4326b80645
$$ 116820 116487 -54095 87838 -356143 284574 -16029 124944 89785 104115 14326 -280645
12618B79729b60999G6991C994c7226B65892b46140B97957g2369A66153a50633
$$ 279729 -260999 76991 3994 -37226 265892 -246140 297957 -72369 166153 -150633
12607b02866M0922I2006j0727J50809B0856a90883g4947A92732r4063b30600H1219
$$ -202866 -161944 92006 81279 232088 20856 -190883 -74947 192732 98669 -230600 81219
12595d9878m2803k37485B49981a97978B37675r7415a94382I0975i7447H4119l2906
$$ -49878 -92681 -330166 249981 -197978 237675 140260 -194382 90975 -97447 84119 51213
12584E1213h9303A54924d8747j60608I7784a23460e6428A10973o036a45415A14340
$$ 51213 -89303 154924 -48747 -209355 97784 -123460 -56428 110973 104937 -145415 114340
12572a59563O1606J596J0230a2993k84928J18564A84097L2354a88669N9809k32326
$$ -159563 -97957 -96361 -86131 -12993 -297921 -179357 184097 216451 -188669 -128860 -361186
12561c61186D71353c26496A13512j9789a42076M4203H1874a19189B79562a75781
$$ -361186 471353 -326496 113512 93723 -142076 -97873 81874 -119189 279562 -175781
12550F6611b10203A68147f125A53336i067l73769a4450j37406G1038a36513B85362
$$ 66611 -210203 168147 -6125 153336 -9067 -382836 -14450 -151856 71038 -136513 285362
12538a63497C1855b29492d4063D9349f5479l96332C3573a26932n6061O9290A0502
$$ -163497 31855 -229492 -44063 49349 -65479 -461811 33573 -126932 -182993 -113703 10502
12526A51940C4056K26846a06341A55702b73140a12121A093h0874B33135g7267
$$ 151940 34056 260902 -106341 155702 -273140 -112121 1093 -80874 233135 -77267
12515C00126h3191B03042E3205g9507K0475j94546k08628A91030J20590B2123
$$ 300126 -83191 203042 53205 -79507 -59032 -253578 -462206 191030 311620 22123
12504B25643c7678B25276Q2185D0439a76751A69948o4021K9375N8898g0362k743
$$ 225643 -37678 225276 307461 40439 -176751 169948 105927 135302 194200 -70362 -73105
12493g3105B37669a39450D5542K79120j55395J6075K21812a87335m0149J04688
$$ -73105 237669 -139450 45542 324662 169267 185342 407154 -187335 -227484 -122796
12483a22796A68543a80465C8585J96970b39016A40657i8229D32975c55738F6082
$$ -122796 168543 -180465 38585 235555 -239016 140657 -98229 432975 -355738 66082
12472E676b22954F2514g0422K8453A34901E8707L49971A35729a36491b856p0179
$$ 5676 -222954 62514 -70422 -41969 134901 58707 408678 135729 -136491 -2856 -73035
12461g3035j54916B70492b52846F1473h8593a354A53305h9381j62238J04558A85599
$$ -73035 -227951 270492 -252846 61473 -88593 -1354 153305 -89381 -251619 -147061 185599
12449b91023O0425A73038b41646A89246B4722a66396p4906c6932D3603b3255m2322
$$ -291023 -230598 173038 -241646 189246 24722 -166396 -241302 -36932 43603 -23255 -65577
12438f5577G8747J29953c47831C050i1367r941G8067a42161H7622K9386c33943
$$ -65577 78747 208700 -347831 3050 -91367 -101308 78067 -142161 87622 117008 -333943
12426E6079a75764B23381J67719g751m9492A68208b13719B02462b0066n8008j71960
$$ 56079 -175764 223381 391100 -7751 -57243 168208 -213719 202462 -20066 -78074 -250034
12415b50034d4846j0436j21125E393R3591R4364K2576H7549a97022N5332O7399
$$ -250034 -44846 -55282 -176407 5393 98984 193348 215924 87549 -197022 -141690 -74291
12404g4291C75611c7989j12861B23423d10792I8318J28375a16101p3171D2835
$$ -74291 375611 -37989 -150850 223423 -410792 98318 226693 -116101 -189272 42835
12393A05355D067a25808J5769j1513A22542a7274k66644h0845j23607C15193c2459
$$ 105355 4067 -125808 -110039 -121552 122542 -17274 -283918 -80845 -204452 315193 -32459
12381b6414k09674N9570l6570k6819A47918a44539J3864d967o2067B69183c2983
$$ -26414 -236088 -176518 -213088 -239907 147918 -144539 -130675 -4967 -67034 269183 -32983
12369a05505m6969A14559m1444f5405l22417A68222g386F1731b53100a22932I9549
$$ -105505 -152474 114559 73115 -65405 -387822 168222 -7386 61731 -253100 -122932 99549
12357a96883E0213K855a10970q0998B40606a50101j5537G1156c3972j02174A92353
$$ -196883 50213 53068 -110970 -191968 240606 -150101 -165638 71156 -33972 -136146 192353
12345G7691e6669B5371f7698B0531e7771A40236b0109N94p9771N013A31823c63483
$$ 77691 -56669 25371 -67698 20531 -57771 140236 -20109 -19515 -99286 -94273 131823 -363483
12332A53118a64970a0771E4364d0853j35820A65172d5382k3333j26084B48553
$$ 153118 -164970 -10771 54364 -40853 -176673 165172 -45382 -68715 -194799 248553
12321A27936c2904k54053Q4966N7849B35757j02748A4128K2626e52770a37178
$$ 127936 -32904 -286957 -201991 -144142 235757 133009 14128 36754 -552770 -137178
12310e6539r1062B059i1146A07305b82677J40065c0069D4029f2705j203b7932
$$ -56539 -147601 2059 -91146 107305 -282677 -142612 -30069 44029 -62705 -63908 -27932
12298B20052a38064d3873A3117a2800A36660l4281J59667c6056a3652k04042D8836
$$ 220052 -138064 -43873 13117 -12800 136660 102379 262046 -36056 -13652 -217694 48836
12286B91773F3521b29109O7800B46251a59704A29033k8204J54744J08359A01391
$$ 291773 63521 -229109 -161309 246251 -159704 129033 100829 255573 363932 101391
12275i1786D365J29815b38595b1700G1540j7407p948L5483C5365K89070d3075
$$ -91786 4365 134180 -238595 -21700 71540 54133 46185 81668 35365 324435 -43075
12263c1870H8451D2521L96345j84833E696K51715J50328H0063R7719P9217l9502
$$ -31870 88451 42521 438866 254033 5696 257411 407739 80063 177782 256999 217497
12252B17497C980f512j26285C15830h4507q522q6396G3049c99140A84290b6167
$$ 217497 3980 -6512 -132797 315830 -84507 -93029 -179425 73049 -399140 184290 -26167
12240B20724J45443a40463A90273c1816G8681B7855J21918C0328M24301b60627
$$ 220724 366167 -140463 190273 -31816 78681 27855 149773 30328 454629 -260627
12229C74285a91251I2907m2361M43963A96793J84547j045a3144H0616a183F6049
$$ 374285 -191251 92907 50546 494509 196793 381340 380295 -13144 80616 -1183 66049
12217C05674H0931k9932c4521r3442c1076I2592a5704p014B56018M0047b46064
$$ 305674 80931 50999 -34521 -127963 -31076 92592 -15704 -22718 256018 296065 -246064
12205B1638K62579r6632I0598l1603K14216k8549N020I3377K304J14J88003I6695
$$ 21638 284217 187585 90598 58995 273211 244662 249682 93377 95681 95795 283798 96695
12192b6334D14342a36243j2439A82577l2940L00644A00319K2318N963J99101o4471
$$ -26334 414342 -136243 -148682 182577 149637 450281 100319 122637 128600 327701 263230
12181B63230j21785j444K8228l1105A4035J33894o4868J82131D1637a07259L6451
$$ 263230 141445 140001 168229 137124 14035 147929 83061 265192 41637 -107259 -70808
12170g0808D5326J4223a4118A75886G8284L9286a41191A16834J35619a92887g8529
$$ -70808 45326 59549 -14118 175886 78284 117570 -141191 116834 252453 -192887 -78529
12158A17590C2511b96462A6336a634j86512B31242m7871j1028c7430B86831J57332
$$ 117590 32511 -296462 16336 -1634 -188146 231242 183371 172343 -37430 286831 444163
12147D44163B03339a42880A00367A8654J00942J77551G2614D189J99026d9278
$$ 444163 203339 -142880 100367 18654 119596 297147 72614 4189 203215 -49278
12136C4704K35343c426o4141j16060J3320B04263c9667d66B58156F6862b17818
$$ 34704 270047 -3426 -67567 -183627 -170307 204263 -39667 -466 258156 66862 -217818
12124a17780l295C7815a31909N5985b079o1847C9604A4947f7372e44C08177I4030
$$ -117780 -121075 37815 -131909 -75924 -2079 -63926 39604 14947 -67372 -544 308177 94030
12111A75469F5809J03382L4528H4624B3336N3461a32933l9703c0865B08500a6849
$$ 175469 65809 169191 203719 84624 23336 76797 -132933 -172636 -30865 208500 -16849
12099B16616e7845A86801Q3748a54966E9507c2153k12p1945A90160c6956J0233
$$ 216616 -57845 186801 270549 -154966 59507 -32153 -32365 -104310 190160 -36956 -26723
12088b6723R97F8855M3874b22660c7115j14061l32948A15442b4839j14327A79230
$$ -26723 -25726 68855 112729 -222660 -37115 -151176 -484124 115442 -24839 -139166 179230
12076H9669A8578K09903b41922E0343b12461A33165J9460K00098b7799E376M688
$$ 89669 18578 228481 -241922 50343 -212461 133165 152625 352723 -27799 5376 10064
12065A0064J21366J79582J04811l0941L34581A20538b0317j26331o318A86876
$$ 10064 131430 311012 415823 384882 719463 120538 -20317 -146648 -152966 186876
12054i0821d0440k398r7446j42614b8619q5692A95708a714k4691A92246L28460
$$ -90821 -40440 -42838 -140284 -282898 -28619 -114311 195708 -1714 -26405 192246 520706
12043E20706A82190b40413e0838K3019r639A12453N958f7296B8341g6421L2323
$$ 520706 182190 -240413 -50838 -27819 -37458 112453 118411 -67296 28341 -76421 -44098
12032d4098B30646r6283m990h0624H190a78664n3806K7515R0287B2924J91959
$$ -44098 230646 134363 129373 -80624 8190 -178664 -232470 -204955 -114668 22924 214883
12021B14883B3519a38170c2145B60906F3805d042l97289F8910g2778j00011C69337
$$ 214883 23519 -138170 -32145 260906 63805 -4042 -401331 68910 -72778 -172789 369337
12009A00442b74046O6719F1258d5022A10221h2596A77486b6966j75980N9434K3220
$$ 100442 -274046 -207327 61258 -45022 110221 -82596 177486 -26966 -202946 -143512 -120292
11998a20292k5282A66086a72877Q3792L1750B9615b02757B15363c8363k32195
$$ -120292 -145574 166086 -172877 -89085 -57335 29615 -202757 215363 -38363 -270558
11988b70558A41276L07732c585j47137B26630a32206N5265k85531A99624c59956
$$ -270558 141276 449008 -3585 -150722 226630 -132206 -76941 -362472 199624 -359956
11977B15291b07183A50634g799A49686b02999b1974k65745g6133B27942b54339
$$ 215291 -207183 150634 -7799 149686 -202999 -21974 -287719 -76133 227942 -254339
11966a1410B1629i2470A00776a30001k79786a88515o6252a3157F8780b09349C2646
$$ -11410 21629 -92470 100776 -130001 -409787 -188515 -254767 -13157 68780 -209349 32646
11954I396a16125K1344F9704J9487K551C4962K09028j21425L8075b87380h9946
$$ 9396 -116125 -94781 69704 89191 91742 34962 243990 122565 160640 -287380 -89946
11942A46204C4243a99407Q8707A59298b121j77791E2698d9349A10550a00729G8643
$$ 146204 34243 -199407 -110700 159298 -2121 -179912 52698 -49349 110550 -100729 78643
11930c6400I3062b37873J5800I3218b00931G0341J970J83349b03885N0905l4088
$$ -36400 93062 -237873 -222073 93218 -200931 70341 72311 255660 -203885 -152980 -187068
11919a87068C5565a0756j22029l0333n1254j05092A1960P6371a96771F9291K13169
$$ -187068 35565 -10756 -132785 -163118 -214372 -319464 11960 88331 -196771 69291 282460
11908B82460h7229B32650L6779n7850c65103H2321i1704E2094a50292j2967N8432
$$ 282460 -87229 232650 269429 211579 -365103 82321 -91704 52094 -150292 -163259 -104827
11897a04827B3561N3168b82614c2897j17693A51128M7462A6292K05672a40783
$$ -104827 23561 76729 -282614 -32897 -150590 151128 198590 16292 221964 -140783
11886a19119A93475c02399H2730a24134N8532k05411R1996G117H65b68515O8511
$$ -119119 193475 -302399 82730 -124134 -65602 -271013 -179017 7117 865 -268515 -200004
11875b00004h3939k11369B13604M5092a02445A8201K81072b16451c3936j7475
$$ -200004 -83939 -295308 213604 258696 -102445 18201 299273 -216451 -33936 -51411
11865e1411A34689c82652a347j17203M8975A46132b31528C7706a13119A71305
$$ -51411 134689 -382652 -1347 -118550 -69575 146132 -231528 37706 -113119 171305
11854b76668N0968A31675c28589a59473B6416c17061B87719o1201j12020c40228
$$ -276668 -225700 131675 -328589 -159473 26416 -317061 287719 226518 114498 -340228
11843E9254j3900a24750A34909b1381k41796a4096F9999a84979b0985A1587J37675
$$ 59254 45354 -124750 134909 -21381 -263177 -14096 69999 -184979 -20985 11587 149262
11832A49262c80460A53051B2833b95896B10974j9060a04106B8315K72424h3566
$$ 149262 -380460 153051 22833 -295896 210974 191914 -104106 28315 300739 -83566
11821H4980J52035a6170j79656A18003H774a29337G4571b70796R8691a1599M127
$$ 84980 237015 -16170 -195826 118003 8774 -129337 74571 -270796 -172105 -11599 -7472
11810g472A72614h5990J4949K3745j82722e8440j7125A11428E5253e0101B4752
$$ -7472 172614 -85990 -71041 -47296 -230018 -58440 -75565 111428 55253 -50101 24752
11798F2910c02570q2981D5777b49639I5443J10741f8783B06574b27336M8286A44014
$$ 62910 -302570 -385551 45777 -249639 95443 206184 -68783 206574 -227336 -179050 144014
11786B71176a97993E7853J07262p2993b92281A64340c50047m2287h226j27330
$$ 271176 -197993 57853 165115 92122 -292281 164340 -350047 -392334 -8226 -135556
11776a35556D003f3376G6520R1228a94637M7418g2664k08160h5751G2295c85273
$$ -135556 4003 -63376 76520 167748 -194637 -147219 -72664 -280824 -85751 72295 -385273
11764g5015B0663c5456R885A72799n5154l5682c4802B1114d5785m57111b3119
$$ -75015 20663 -35456 -25571 172799 117645 81963 -34802 21114 -45785 -502896 -23119
11752d6131j61711A06928R3565O3313k0669p342a654B576g0306K287G9256a13313
$$ -46131 -207842 106928 200493 263806 243137 235795 -1654 2576 -70306 -68019 79256 -113313
11739e6596n6865J9759A10967c89520A08754d2742B44755b41697J18776C49246
$$ -56596 -113461 -93702 110967 -389520 108754 -42742 244755 -241697 -122921 349246
11728a3121l4919I9880a19948C4815N7681e1407B01067R5171A5836b8307F3155
$$ -13121 -48040 99880 -119948 34815 92496 -51407 201067 296238 15836 -28307 63155
11716A45589h8997C44211a11062C02507A32673d32178C0429i0833C6695a58538
$$ 145589 -88997 344211 -111062 302507 132673 -432178 30429 -90833 36695 -158538
11705a04783l5538j4804f8793C3268A3549e9820m0867k09783a05646C15525I4705
$$ -104783 -140321 -155125 -68793 33268 13549 -59820 -100687 -310470 -105646 315525 94705
11693a46819j324D34353j74451c7584A25154k7666P6463C1190b71107B47410a28335
$$ -146819 -148143 434353 259902 -37584 125154 97488 173951 31190 -271107 247410 -128335
11681H3522c45148B0419O2584b8074l46304A1999J24732a78871B16466H6133a92782
$$ 83522 -345148 20419 83003 -28074 -374378 11999 136731 -178871 216466 86133 -192782
11669a2977A26651a89970K5205A94763b18416A79060m2901g0293A78376N137k1103
$$ -12977 126651 -189970 -164765 194763 -218416 179060 136159 -70293 178376 183513 162410
11658A62410G3348b29102h4896p9525Q0706k1902I4758h9141C8477J50163r2804
$$ 162410 73348 -229102 -84896 -164421 -83715 -105617 94758 -89141 38477 188640 95836
11647I5836a62661A28264h5967b9847q9019d7725B10086b74639A20549a16957
$$ 95836 -162661 128264 -85967 -29847 -118866 -47725 210086 -274639 120549 -116957
11636b03867C7432f5756E8737J49365a78285A33887a50787A26910B2621J35801
$$ -203867 37432 -65756 58737 208102 -178285 133887 -150787 126910 22621 158422
11626A58422b61165J3237D9054K58673b53373C2704a6734G2971i8751j70341a29363
$$ 158422 -261165 -247928 49054 307727 -253373 32704 -16734 72971 -98751 -269092 -129363
11614C05628a6575l1838G5584f526j95735A68784a35639p3961A19404b0332A13051
$$ 305628 -16575 -48413 75584 -6526 -202261 168784 -135639 -209600 119404 -20332 113051
11602a14256e5043l2996j66353N9682A21228A3018Q7945L8076n1088J08805b06923
$$ -114256 -55043 -88039 -254392 -194710 121228 13018 100963 139039 87951 196756 -206923
11590c73201O1311e7215A61824a60624A88980G2979l4612L78143h1661j32455
$$ -373201 -311890 -57215 161824 -160624 188980 72979 38367 416510 -81661 -214116
11580b14116C3376J50851M0871B8662e1559G0835a93105B53064l9611p2267a81512
$$ -214116 33376 184227 225098 28662 -51559 70835 -193105 253064 213453 141186 -181512
11568A07763R3293a11450a0779H1719c6665E2022J03092i0403m3050A37682a44277
$$ 107763 201056 -111450 -10779 81719 -36665 52022 155114 -90403 -133453 137682 -144277
11556D60667G9885K28408j18820F1814J74466c15758C22685e3564a7472B23002
$$ 460667 79885 308293 189473 61814 236280 -315758 322685 -53564 -17472 223002
11545C65512A7308O7537e9337a6068m4397C03472f3860A4753J7513n074K92505
$$ 365512 17308 84845 -59337 -16068 -60465 303472 -63860 14753 32266 27192 319697
11534C19697b1742j77165A47563A1206J01587d4782H4732l6929J38470q8928B3933
$$ 319697 -21742 -198907 147563 11206 112793 -44782 84732 47803 186273 97345 23933
11522i5478C3779K26918c74j19814A65087F0480b74453B59313c2225B69702i6435
$$ -95478 33779 260697 -374 -120188 165087 60480 -274453 259313 -32225 269702 -96435
11510b04771j14537B79881G0009P5326b45504A95493J25593c9749A07426h1770
$$ -204771 -319308 279881 70009 145335 -245504 195493 321086 -39749 107426 -81770
11499a01804B37665c5551j05186H4552J38621J852e3486A69918b25864o8442A47827
$$ -101804 237665 -35551 -140737 84552 223173 225025 -53486 169918 -225864 -294306 147827
11487G3171a90452A75685a07922m5903F2773K43638A38735d978A15361b00345
$$ 73171 -190452 175685 -107922 -153825 62773 306411 138735 -4978 115361 -200345
11476a2344C6699l136J4220O9379c739j11789A80857o3999c26375H2389M0990
$$ -12344 36699 33563 47783 117162 -3739 -115528 180857 116858 -326375 82389 123379
11465A23379K90758A27042D6267g3580G2040a68583A32084R651J32423J3134j16390
$$ 123379 414137 127042 46267 -73580 72040 -168583 132084 141735 274158 287292 170902
11454A70902i7062B01274a06138A95884r1495d1620B58141O5065A896J51486a60344
$$ 170902 -97062 201274 -106138 195884 104389 -41620 258141 323206 1896 153382 -160344
11442i0712o4205c1094D644J85429d0090k6953j04101P4056Q969E5153K0897b25268
$$ -90712 -154917 -31094 4644 190073 -40090 -67043 -171144 -97088 -88119 55153 76050 -225268
11429a34870l86140A19649d6017B33033c75837B52268b6092B29489j13414g001
$$ -134870 -521010 119649 -46017 233033 -375837 252268 -26092 229489 116075 -7001
11418A39697a43981B33428l7481J9989l0407F5022a13460o0184j4178o5980B14081
$$ 139697 -143981 233428 195947 215936 185529 65022 -113460 -173644 -187822 -253802 214081
11406b2942j27910K2815J2203e7807j0450A7830J41311e4348k8826h74l953j27532
$$ -22942 -150852 -128037 -115834 -57807 -68257 17830 159141 -54348 -83174 -874 -4827 -132359
11394a32359A42529N5538d0548j16959A08904b27390O8672E7178a47877A23093
$$ -132359 142529 198067 -40548 -157507 108904 -227390 -158718 57178 -147877 123093
11383A48131O6500a78209C00557C5312f0712r1276A77559a68374C8330P5740l2337
$$ 148131 214631 -178209 300557 35312 -60712 -151988 177559 -168374 38330 114070 81733
11372H1733c23875a46545C3594N3147a10509l5533g1137k96619d45k95198d5912
$$ 81733 -323875 -146545 33594 86741 -110509 -146042 -71137 -367756 -445 -295643 -45912
11360G4792P6220B3864K33409A05977g0911f408A39441m1074a05761A28915m6318
$$ 74792 151012 23864 257273 105977 -70911 -6408 139441 98367 -105761 128915 82597
11349H2597J15399A8170E043f5157C4725a42088b6296j31455g8069l7472j2167
$$ 82597 197996 18170 5043 -65157 34725 -142088 -26296 -157751 -78069 -115541 -127708
11338a27708A07261a31816p6548D9433R6172o7894A9873e2476k55971A42824K04651
$$ -127708 107261 -131816 -208364 49433 145605 77711 19873 -52476 -308447 142824 347475
11327C47475I5857H559J4817f2125c0319N510k45265A1798f4662D69a54003b9884
$$ 347475 95857 8559 23376 -62125 -30319 -24809 -270074 11798 -64662 469 -154003 -29884
11314b46574A16674b07364b3125A61110g6530b4507m8219D00694g9058D2736a90546
$$ -246574 116674 -207364 -23125 161110 -76530 -24507 -72726 400694 -79058 42736 -190546
11302b42326O9383A35308a49299B75786a00590c7087o901G4525a84033K3935P7453
$$ -242326 -172943 135308 -149299 275786 -100590 -37087 -43988 74525 -184033 -160098 -82645
11291h2645a0748l7456j60532C40245A60736m4010a27400j69676c4886q4565k5168
$$ -82645 -10748 -48204 -208736 340245 160736 116726 -127400 -297076 -34886 -119451 -144619
11280a44619l4216A81039F3819N5993O1455b53037a20392I9524b73407J05799
$$ -144619 -178835 181039 63819 119812 181267 -253037 -120392 99524 -273407 -167608
11270a67608J446b3021m031l1023B83494n5954b28335I9114l3108g4274m18430
$$ -167608 -166162 -23021 -27052 -58075 283494 227540 -228335 99114 66006 -74274 -492704
11259d92704a88904e2166A27089a95518D60O8006K01736a13509E3440N9446c35740
$$ -492704 -188904 -52166 127089 -195518 460 68466 270202 -113509 53440 112886 -335740
11247a99467P9208B38429A03942A3424a95306I8633f7667m5460A53901a05878
$$ -199467 -120259 238429 103942 13424 -195306 98633 -67667 -113127 153901 -105878
11236a88504B86195b29543c4881j36534J9538o3436K5929D19721a95780m9736
$$ -188504 286195 -229543 -34881 -171415 -151877 -215313 -189384 419721 -195780 -245516
11226b45516a03109L5879m2530b7479E2502h5374A53371L73452G5019a141k43888
$$ -245516 -103109 -67230 -109760 -27479 52502 -85374 153371 526823 75019 -1141 -245029
11215b45029A00034b4488J0072D61a63410A5793c5286j52057K912A1331J70303
$$ -245029 100034 -24488 -14416 461 -163410 15793 -35286 -187343 -184431 11331 181634
11204A81634a63461a8655A60814o3821b20608A5180K06818b06364A02757g489
$$ 181634 -163461 -18655 160814 96993 -220608 15180 221998 -206364 102757 -7489
11193h6409j51525F2986f0212m6359j87810R8364P8762A34686h1693b7174p33
$$ -86409 -237934 62986 -60212 -106571 -294381 -196017 -117255 134686 -81693 -27174 -27907
11182b7907p8618k63210i395A93735a69579D8788k180A8501a56588A19162a02631
$$ -27907 -106525 -369735 -9395 193735 -169579 48788 46608 18501 -156588 119162 -102631
11170a2919A00921g3667B23341h9677E1673K91829A16464d7679A67311c11025
$$ -12919 100921 -73667 223341 -89677 51673 343502 116464 -47679 167311 -311025
11159a75062P3631C5627a72507q4288A99957b63977c3374E7831J96808A2662a00891
$$ -175062 -101431 35627 -172507 -256795 199957 -263977 -33374 57831 254639 12662 -100891
11147b21593d8774j43669A618K68550a85998g9581j49998P9226A66168a01507
$$ -221593 -48774 -192443 1618 270168 -185998 -79581 -229579 -150353 166168 -101507
11136A5425J36359B8322b12348A15783R7168c3746a0562H513b53652A74648L9399
$$ 15425 151784 28322 -212348 115783 212951 -33746 -10562 8513 -253652 174648 214047
11125B14047i0267j50862F3367a1399r9447j46329B57113a42539J6629e0352O934
$$ 214047 -90267 -241129 63367 -11399 -110846 -257175 257113 -142539 -125910 -50352 -43418
11114d3418B47084A09084m0390J48150B5319K57158J00340j06031F9692c31428
$$ -43418 247084 109084 68694 216844 25319 282477 382817 276786 69692 -331428
11103F797Q9831c5981E3075M1913N5923i8498B04610i048k3981G2543C4045A4938
$$ 6797 96628 -35981 53075 94988 150911 -98498 204610 -9048 -33029 72543 34045 14938
11090G7084L10485a62890A06188k7409L5135K87247j09776C1283M70178B16116
$$ 77084 387569 -162890 106188 78779 113914 401161 291385 31283 501461 216116
11079E9326f8131b4817E39597e2789r2396D39740m3767A68714b00600D10336j14986
$$ 59326 -68131 -24817 539597 -52789 -145185 439740 395973 168714 -200600 410336 295350
11068B95350a04575B16213q8171J60897j34064L0204J2326H9996J33721B4872
$$ 295350 -104575 216213 128042 288939 154875 185079 197405 89996 223717 24872
11057B34699J18832J52172D5030M23661J15033r2571K01199C24288J07736O9892
$$ 234699 353531 505703 45030 468691 583724 491153 692352 324288 432024 501916
11047E01916N7031n9374j84686J5618K21489j53774J88228j32097P8221J09853
$$ 501916 558947 499573 314887 330505 551994 398220 586448 454351 532572 642425
11037F42425k20363J31998Q9554j54867L77972j82910l36714o9618K13732A3471
$$ 642425 422062 554060 643614 488747 866719 683809 347095 277477 491209 13471
11026C47970J31936j11510H1910N27623J49171B28284L19731q5016P6055k26558
$$ 347970 479906 368396 81910 609533 758704 228284 548015 462999 539054 312496
11016C12496J76167j84808N6069M7482J10318B49344M03677j87385j3563o6652
$$ 312496 488663 303855 359924 407406 517724 249344 653021 465636 452073 385421
11006C85421J05773j2301q082l4441L5841j46359O0878M5094Q8098k39919O4972
$$ 385421 491194 478893 470811 436370 472211 325852 386730 431824 519922 280003 344975
10995C44975j07690J2669J32885m9379L14320A95273L79887I9103L50245J06804
$$ 344975 237285 249954 382839 333460 647780 195273 575160 99103 449348 556152
10985E56152q6764K34340A64562K44934R1440k13706P89439l14526J79726J21285
$$ 556152 469388 703728 164562 409496 500936 287230 1076669 762143 941869 1063154
10975A063154k77912J83421J69331j2772J49769j03498L25607j90885K30326K5850
$$ 1063154 785242 968663 1137994 1125222 1274991 1171493 1497100 1306215 1536541 1562391
10965A562391j63313M17505k02549k51367J35415n8281l30312l45414m7758M76523
$$ 1562391 1399078 1816583 1614034 1362667 1498082 1439801 1109489 764075 716317 1192840
10955A192840m05360N76259j1436j07046L25039n44384P6316k15240J01898m16807
$$ 1192840 787480 1363739 1352303 1245257 1570296 1025912 1102228 886988 988886 572079
10945E72079L8088B77371J17537J14754j61909O3393A18755L1637P5080a22821
$$ 572079 610167 277371 394908 509662 347753 411146 118755 150392 225472 -122821
10934C1914j3410L2506a06135A53090N7219A1287K38383n1440C0062b31497F8517
$$ 31914 18504 51010 -106135 153090 210309 11287 249670 198230 30062 -231497 68517
10922I8849O5245c81827A33112C1920O1153K53014A56581A2516b1414n1121H016
$$ 98849 164094 -381827 133112 31920 93073 346087 156581 12516 -21414 -72535 8016
10910G1271a06933j22276g1733k40899A16481b48246r8632a61267r943C9443d177
$$ 71271 -106933 -229209 -71733 -312632 116481 -248246 -346878 -161267 -171210 39443 -4177
10898A50027J5847C2426c25646a1002A00664c00500f3305A24956A3122e4023H1546
$$ 150027 165874 32426 -325646 -11002 100664 -300500 -63305 124956 13122 -54023 81546
10886A26299P6995F9865b0468l9510l7883A06342c16239d1078H8454k2872b95385
$$ 126299 203294 69865 -20468 -59978 -97861 106342 -316239 -41078 88454 65582 -295385
10874c99002C33346j63499a48454f4181M690H9844d6901j26801k1531b9986k11841
$$ -399002 333346 169847 -148454 -64181 -59491 89844 -46901 -173702 -195233 -29986 -241827
10863b41827C7171h7748N244A98170e2346r0038B47005B9082b43493R4923D7334
$$ -241827 37171 -87748 -82504 198170 -52346 -142384 247005 29082 -243493 -148570 47334
10851a57556b1844m28292J10028A22845a83868C71469I1477B0531N0735f9964
$$ -157556 -21844 -450136 -340108 122845 -183868 371469 91477 20531 71266 -69964
10840B92757d00806a85110F7521J68348C7559a65899C56507o3254j36164f5453
$$ 292757 -400806 -185110 67521 235869 37559 -165899 356507 293253 157089 -65453
10829c7995G3840C5207K98731A40343c80065L298C5782J11696H869a30936e0676
$$ -37995 73840 35207 333938 140343 -380065 -376767 35782 147478 8869 -130936 -50676
10817a44503e9300A52222a39388f8366H4065j2487a02583A9956I880i4562j89336
$$ -144503 -59300 152222 -139388 -68366 84065 71578 -102583 19956 9880 -94562 -283898
10806b83898l3986H9466N6650a61390G4997B4813b28676C02535N1820l3492M0118
$$ -283898 -317884 89466 146116 -161390 74997 24813 -228676 302535 354355 320863 360981
10795C60981C9341J4366a14788A06411c09713g3003I7624j6656a79736B1352K79903
$$ 360981 39341 53707 -114788 106411 -309713 -73003 97624 80968 -179736 21352 301255
10784C01255a06507o1376c1586B8501b7404m5982A24616a53930A5036N4736a66473
$$ 301255 -106507 -167883 -31586 28501 -27404 -73386 124616 -153930 15036 69772 -166473
10772E2670J7164a78295A70559e4650I5923B3275b37156n2288J34740B30321b24921
$$ 52670 69834 -178295 170559 -54650 95923 23275 -237156 -289444 -154704 230321 -224921
10760d776k9716o6508n9618q5670d4628l01314d3244C62330g5578J8757A2484
$$ -4776 -34492 -101000 -160618 -246288 -44628 -345942 -43244 362330 -75578 -56821 12484
10748D5558b18162o5949a15162F8977b07863e4942j3601G5829K31385B3072d46204
$$ 45558 -218162 -284111 -115162 68977 -207863 -54942 -68543 75829 307214 23072 -446204
10736c19010C1844b14703A88373o6058l3283a38368B69584j19855a76041e1193
$$ -319010 31844 -214703 188373 122315 89032 -138368 269584 149729 -176041 -51193
10725a46764A15834h7520H6028d0299A63664C7973b41900A29823l9094C1360a98892
$$ -146764 115834 -87520 86028 -40299 163664 37973 -241900 129823 90729 31360 -198892
10713A99751k9119N001A5901J2910a0395j02692q1030h0874A73820f4586o1463
$$ 199751 170632 175633 15901 28811 -10395 -113087 -194117 -80874 173820 -64586 -126049
10702a26049j30857I6611b42799A08386k0796b65934I7815f2767A74463a60873
$$ -126049 -256906 96611 -242799 108386 87590 -265934 97815 -62767 174463 -160873
10691a13396C07711F6353d03844a2130r4663D908a417H4210c5081j48634C7319
$$ -113396 307711 66353 -403844 -12130 -106793 4908 -1417 84210 -35081 -183715 37319
10679A88427J39784a4035O06F9323R2214n3850a52065l2330j60595P8601B44083
$$ 188427 328211 -14035 -13429 69323 161537 107687 -152065 -184395 -344990 -266389 244083
10667c2426j30746b1694l98C7709e6054j54838N1236b5076I4696a1179B03659
$$ -32426 -163172 -21694 -22092 37709 -56054 -210892 -159656 -25076 94696 -11179 203659
10655c36830a23597i997l2798F5492a2212A49489b14005b7180A50666F1235a11789
$$ -336830 -123597 -9997 -42795 65492 -12212 149489 -214005 -27180 150666 61235 -111789
10643a83976K2981A5712d0941j27008J4981I1414a37853k23381a35504E705K98316
$$ -183976 -160995 15712 -40941 -167949 -152968 91414 -137853 -361234 -135504 5705 304021
10632C04021A09205E0464R3089a39529r5547A05321d30C4776b30007A46230l8764
$$ 304021 109205 50464 143553 -139529 -235076 105321 -430 34776 -230007 146230 107466
10621A07466b57861a15123m503j55243b0881k28714f7147a5357B93192a2059j51989
$$ 107466 -257861 -115123 -119626 -274869 -20881 -249595 -67147 -15357 293192 -12059 -164048
10610a64048a2530C01094a45384R317O6043p0486N056B15431a48235O9867j06140
$$ -164048 -12530 301094 -145384 -136067 -70024 -140510 -135454 215431 -148235 -78368 -184508
10599a84508G2853c404l26238a5485A15008j3354j8891R4733M5905e7414E4325
$$ -184508 72853 -3404 -329642 -15485 115008 101654 82763 177496 223401 -57414 54325
10587a61279c3880J3986O635j49295A28974C5303a58122q054D5968c93601a58135
$$ -161279 -33880 -19894 -13259 -162554 128974 35303 -158122 -166176 45968 -393601 -158135
10575a79048n6937o9280J8645J36299j2515f2080k33792a07246A27367n0677c22100
$$ -179048 -235985 -305265 -286620 -150321 -162836 -62080 -295872 -107246 127367 76690 -322100
10563A99650H8579f2979K9828E1969K64093b29006o0357B17132c00384Q031I6288
$$ 199650 88579 -62979 -33151 51969 316062 -229006 -289363 217132 -300384 -292353 96288
10551b7983A17653J95805a80425r9610A6009K07283a38423A99217b54814O5122
$$ -27983 117653 313458 -180425 -280035 16009 223292 -138423 199217 -254814 -189692
10541a89692A12991d57367B04258G129f5694m22744i7824j9294r1667i2778A29077
$$ -189692 112991 -457367 204258 7129 -65694 -488438 -97824 -117118 -208785 -92778 129077
10529B48607O0877a40535C3314b38860C728M0409e024A8456e0858j09000A42429
$$ 248607 309484 -140535 33314 -238860 3728 44137 -5024 18456 -50858 -159858 142429
10517c44140a06185j50575d130D18J81877g9682A33754p436B1653d541E3774M4927
$$ -344140 -106185 -256760 -4130 418 182295 -79682 133754 126318 21653 -4541 53774 98701
10505I8701P6614i7162n7458A08719K55639a390C318M9100c13006a08577L1367
$$ 98701 175315 -97162 -154620 108719 364358 -1390 3318 52418 -313006 -108577 -77210
10494g7210C6030a72199H8039b88074k7208E1110K2057J47972E6072g1429H9781
$$ -77210 36030 -172199 88039 -288074 -315282 51110 73167 221139 56072 -71429 89781
10482a75362n5513B05189b5004a0201B52431N1737A07947K87457j243i0417A70557
$$ -175362 -230875 205189 -25004 -10201 252431 304168 107947 395404 394161 -90417 170557
10470C02994A42534K6223J8429a02966F1777A2003N2108a92488j5816A9559N7696
$$ 302994 142534 168757 187186 -102966 61777 12003 64111 -192488 -208304 19559 77255
10459G7255e9963E0495a58180E2310d38300B26851a14398m8203e4969J4313A91778
$$ 77255 -59963 50495 -158180 52310 -438300 226851 -114398 -162601 -54969 -40656 191778
10447C7132b94323B8989d5690j78329a03401c0198l89613A12471d33897A75788
$$ 37132 -294323 28989 -45690 -224019 -103401 -30198 -419811 112471 -433897 175788
10436e2480A8474J2890J02550b23785I7679m4377c5326F819b71538a28133M0555
$$ -52480 18474 31364 133914 -223785 97679 53302 -35326 6819 -271538 -128133 -87578
10425h7578A28634b36961Q2300B31834b5772m18346a32256p0509c2032m9456j73570
$$ -87578 128634 -236961 -154661 231834 -25772 -444118 -132256 -202765 -32032 -81488 -255058
10414b55058J01986M7980B93497a406k23184D4593c62404J8860a15485A38283
$$ -255058 -153072 -105092 293497 -1406 -224590 44593 -362404 -343544 -115485 138283
10403E9892B6712c9842j54420P1334F2069b69628F4836h4144A33843a87095C75195
$$ 59892 26712 -39842 -194262 -122928 62069 -269628 64836 -84144 133843 -187095 375195
10391a57616D7691J56852i4590j26536B58066c9709B41936q2111K10976j23318
$$ -157616 47691 204543 -94590 -221126 258066 -39709 241936 159825 370801 247483
10381B47483E2311L4073K89282b7726h469D9384K5527c2630F4164i3182M5472
$$ 247483 52311 86384 375666 -27726 -8469 49384 74911 -32630 64164 -93182 -47710
10370d7710I2340B0635h0106J0472A63130a490A64994E5323L18585r1486K42396
$$ -47710 92340 20635 -80106 -69634 163130 -1490 164994 55323 373908 282422 524818
10359E24818a6380A89071j8421J08620g4531B73501c27186a16935e709B35348
$$ 524818 -16380 189071 170650 279270 -74531 273501 -327186 -116935 -5709 235348
10348C16870G9225C9415L37303H1746J55955I9931J355J28623J53754B0418M38392
$$ 316870 79225 39415 376718 81746 237701 99931 101286 229909 383663 20418 458810
10337D58810j00243G1929J43710A6761M13361k09922G9285a73134A63615b5979
$$ 458810 358567 71929 215639 16761 430122 220200 79285 -173134 163615 -25979
10326b3663j52709G573P0277f6959b5151A88555p1432R5555R194j7993m5980a98001
$$ -23663 -176372 7573 77850 -66959 -25151 188555 117123 212678 221872 203879 157899 -198001
10313H7241J96734r4402k1026n4523J2157b7690j3111I6992h7656j26615A98991
$$ 87241 283975 189573 168547 114024 126181 -27690 -40801 96992 -87656 -214271 198991
10301a10615C23840a82889B3126b39893R1662j17211A17265J52104b26456g0787
$$ -110615 323840 -182889 23126 -239893 -148231 -265442 117265 269369 -226456 -70787
10290a05051M376G2121J0556b76963c1622k61125E3570O3664f5610k14450a05479
$$ -105051 -100675 72121 82677 -276963 -31622 -292747 53570 117234 -65610 -280060 -105479
10278b84193O1194b9730l16126A23038c9475C2717b63847i5199n8649B51192B0127
$$ -284193 -222999 -29730 -345856 123038 -39475 32717 -263847 -95199 -153848 251192 20127
10266F9651A4491K2349c69656J72552C0404g953k12325J4229C7981J43200d1223
$$ 69651 14491 36840 -369656 -197104 30404 -7953 -220278 -206049 37981 181181 -41223
10254E7474M01739A58692b0189C88967A82239J33222b29245B90022j8445a61642
$$ 57474 459213 158692 -20189 388967 182239 315461 -229245 290022 271577 -161642
10243b47363M1837B85084d996j01693A78996c56730A77685m0857l280a78118J2848
$$ -247363 -205526 285084 -4996 -106689 178996 -356730 177685 136828 133548 -178118 -165270
10232a65270M834B03459a28329H156J00621L9643a09230K4916j47810j80864d0677
$$ -165270 -160436 203459 -128329 8156 108777 148420 -109230 -84314 -232124 -412988 -40677
10220c09569g7888k33952M8240A80100D5759J94081c6416B3810J38210a33086
$$ -309569 -77888 -311840 -263600 180100 45759 239840 -36416 23810 162020 -133086
10209A42541a04375H6272e0212A22233j5875b62616L6981A47114c09253a40879
$$ 142541 -104375 86272 -50212 122233 106358 -262616 -225635 147114 -309253 -140879
10198a79463n5736a04020e0162j50256O1423k01937J48764A28880a17080m0939
$$ -179463 -235199 -104020 -50162 -200418 -138995 -340932 -192168 128880 -117080 -158019
10188a58019a9182l10190a5515j13158j7853f538j50998E0983b2971j77984N7797
$$ -158019 -19182 -329372 -15515 -128673 -146526 -6538 -157536 50983 -22971 -200955 -143158
10177a43158r9908E9699d6559j06131f6228a5535A59703b66616e9577l17857a82633
$$ -143158 -243066 59699 -46559 -152690 -66228 -15535 159703 -266616 -59577 -377434 -182633
10165h1272o2756A68056E1217a52635k05803D1698k873a24847J2389A8524K44144
$$ -81272 -144028 168056 51217 -152635 -358438 41698 38825 -124847 -112458 18524 262668
10154B62668a0474p6507C1987j4651h7696j22212e4618k4917k4279k67091J69997
$$ 262668 -10474 -86981 31987 17336 -87696 -209908 -54618 -79535 -103814 -370905 -200908
10143b00908B1326a63171M516B78420E4028K7221N3782k4393m1842J75976B2453
$$ -200908 21326 -163171 -158655 278420 54028 81249 135031 110638 68796 244772 22453
10131d1046k13506Q761R8126M7251q0181D2738g2186A83148b82632A36080J7258
$$ -41046 -254552 -245791 -147665 -100414 -180595 42738 -72186 183148 -282632 136080 153338
10120A53338i7432B06528d8042A18269J47719a54985D8526f9713C5832b3731H5563
$$ 153338 -97432 206528 -48042 118269 265988 -154985 48526 -69713 35832 -23731 85563
10108a22317p5591a6187B21507a04679I2275a41021j6830C1883a40127j57232
$$ -122317 -197908 -16187 221507 -104679 92275 -141021 -157851 31883 -140127 -297359
10098b97359a09367A05927c83304J87854A06656f6363j02017b6256F4235c88383
$$ -297359 -109367 105927 -383304 -195450 106656 -66363 -168380 -26256 64235 -388383
10087b6145A00111h027H3591K08046a15417B77725D195M5439b10833B23544b2466
$$ -26145 100111 -8027 83591 291637 -115417 277725 4195 49634 -210833 223544 -22466
10075A11130c19662I4563c7471A57744D389L5277c3179k13892I3693O1973l1003
$$ 111130 -319662 94563 -37471 157744 4389 39666 -33179 -247071 93693 155666 124663
10064A24663a71924A22539b02020n0927a25547o451l9118H195J2748a51470N3561
$$ 124663 -171924 122539 -202020 -252947 -125547 -131998 -171116 8195 20943 -151470 -97909
10053i7909I4790b46072P3041L781c6684j49314H5101J15296b69412B56566b1728
$$ -97909 94790 -246072 -173031 -169250 -36684 -185998 85101 200397 -269412 256566 -21728
10041c37429N0818J10734E3995c0555l56615h3454K4970I3753b08413K4753D1577
$$ -337429 -286611 -175877 53995 -30555 -387170 -83454 -58484 93753 -208413 -183660 41577
10029C0276O8102a95100f8199j82892A45457c9607o5092j21341l3409D4357L54869
$$ 30276 98378 -195100 -68199 -251091 145457 -39607 -104699 -226040 -259449 44357 399226
10018C99226A87033b70751H7890d6983F9744a30277G5240a04079n9252j38102
$$ 399226 187033 -270751 87890 -46983 69744 -130277 75240 -104079 -163331 -301433
10008c01433m0210a19179m5352l93318g5015j31554R3182F6312b56458j63811
$$ -301433 -341643 -119179 -164531 -557849 -75015 -206569 -113387 66312 -256458 -420269
9998d20269i5708j42169j5398R2562A7546a0852A35311J702f5845k01068A46303
$$ -420269 -95708 -237877 -253275 -160713 17546 -10852 135311 137013 -65845 -266913 146303
9986a74876b0891j9860j27865E0084J59219e2587q6527I8637a21702A01611d6567
$$ -174876 -20891 -40751 -168616 50084 209303 -52587 -139114 98637 -121702 101611 -46567
9974A19291d0231q3933E8470J79893i3341F3996c840j79998C9670A5612b40726
$$ 119291 -40231 -124164 58470 238363 -93341 63996 -3840 -183838 39670 15612 -240726
9962a71922o701f6751j64403C8295j6646b78518B34798b1951H6428b866H1311
$$ -171922 -178623 -66751 -231154 38295 21649 -278518 234798 -21951 86428 -2866 81311
9950b0896j31758M3130A85685e8260m8851j05882j08521A6153h8830a9520k1486
$$ -20896 -152654 -109524 185685 -58260 -107111 -212993 -321514 16153 -88830 -19520 -41006
9939d1006B07975q9276m3224e89188A98274a12467J3267d7043p9321A901J59533
$$ -41006 207975 118699 75475 -589188 198274 -112467 -99200 -47043 -126364 1901 161434
9928A61434n4586J07912d05813B2347f5028G9257L2532c8563F8057a96973C41663
$$ 161434 106848 214760 -405813 22347 -65028 79257 111789 -38563 68057 -196973 341663
9916a19883d0670m26173a33934l1577J4973e5006j46393A108f3592E8439J8961
$$ -119883 -40670 -466843 -133934 -165511 -150538 -55006 -201399 1108 -63592 58439 77400
9905G7400g9867H0634Q8440a71013P7412B16025H7362C0793b38599N1385C82112
$$ 77400 -79867 80634 169074 -171013 -93601 216025 87362 30793 -238599 -187214 382112
9893a18124m6592E4918f6292q2378A70846J72163b32885g8718C6486K94063A7319
$$ -118124 -164716 54918 -66292 -148670 170846 343009 -232885 -78718 36486 330549 17319
9881F3289L1072a62795K4718A6628c1491m36694i0529B42103c09659h8080A14040
$$ 63289 94361 -162795 -138077 16628 -31491 -468185 -90529 242103 -309659 -88080 114040
9869A44156h870B7265c8908B436N4997c87602f4565q2190B03309i7268D7156c62700
$$ 144156 -8870 27265 -38908 2436 57433 -387602 -64565 -146755 203309 -97268 47156 -362700
9856a02279j20833B39778h4677j97946e5717D1440a38252A06050a80873j00777
$$ -102279 -223112 239778 -84677 -282623 -55717 41440 -138252 106050 -180873 -281650
9846b81650K5218A3699J7911M6263c59364h8027k14783F2669b73724Q9312C6453
$$ -281650 -256432 13699 31610 77873 -359364 -88027 -302810 62669 -273724 -184412 36453
9834A04443M7845f2373E0591d095A12632i6424l2152d5762A91014b39034a12132
$$ 104443 152288 -62373 50591 -4095 112632 -96424 -128576 -45762 191014 -239034 -112132
9822c99707B94706h2438K8959A62011b56102R1039r7519B840J31712i7449A57965
$$ -399707 294706 -82438 -53479 162011 -256102 -165063 -262582 2840 134552 -97449 157965
9810B8660O4273m986D1656g9117A21761j3116J29216b22604o515g0539A39456
$$ 28660 92933 87947 41656 -79117 121761 108645 237861 -222604 -229119 -70539 139456
9798A69101a47667j98706J33966l1797B24106d1526f839C5276M5225a68859c1377
$$ 169101 -147667 -346373 -212407 -244204 224106 -41526 -6839 35276 80501 -168859 -31377
9786a33047j77895a39350o548m0955P7433b6722j46356I1663f303j4011l19165
$$ -133047 -310942 -139350 -145898 -186853 -109420 -26722 -173078 91663 -6303 -20314 -339479
9775c39479a16797A48540J05909i4000q151k4400j40688N8142A93816C2102a14557
$$ -339479 -116797 148540 254449 -94000 -102151 -126551 -267239 -209097 193816 32102 -114557
9763i3512B40190j11340a79163j33887J22380q9812C19882a09402p6485q4820
$$ -93512 240190 128850 -179163 -313050 -190670 -280482 319882 -109402 -185887 -270707
9753b70707R1880C07667b7023A08049h0728k04980A31293p217a8800k90495B2435
$$ -270707 -178827 307667 -27023 108049 -80728 -285708 131293 124076 -18800 -309295 22435
9741a60828P3804M300k9890A35163b66943F3312g3223A007K05936a27530j43883
$$ -160828 -87024 -82724 -112614 135163 -266943 63312 -73223 1007 206943 -127530 -271413
9730b71413Q5964c1259q0113j69651a27147N8251n2085B27271a54057k9321C14122
$$ -271413 -185449 -31259 -111372 -281023 -127147 -68896 -120981 227271 -154057 -183378 314122
9718c58111K8149J43208c0039j79985j32235J68860H2810B3056a26154A11013
$$ -358111 -329962 -186754 -30039 -210024 -342259 -173399 82810 23056 -126154 111013
9707b28556N9785P2696I5800j933k6064M3456a38996F2202i1185B23608b00022
$$ -228556 -168771 -96075 95800 93867 67803 111259 -138996 62202 -91185 223608 -200022
9695a83110l0595l8056c789j10002l0961C2246K84808a27088m94480a09153a4723
$$ -183110 -213705 -251761 -3789 -113791 -144752 32246 317054 -127088 -621568 -109153 -14723
9683A30432h6775j56988d5771f545A30543M2868a33887n796a0649n7275E9067
$$ 130432 -86775 -243763 -45771 -6545 130543 173411 -133887 -139683 -10649 -67924 59067
9671B8748P9198k2617a73147A28486O6054c89277A34697g1147F7635a88280A5705
$$ 28748 107946 85329 -173147 128486 194540 -389277 134697 -71147 67635 -188280 15705
9659a23457E577i9688q7454H3146f1662D0125a04962a450l22049H7852a25031
$$ -123457 5577 -99688 -187142 83146 -61662 40125 -104962 -1450 -323499 87852 -125031
9647I8897e0518l85872B78127q3804D1422b59655D658b06547j16800A83513B28
$$ 98897 -50518 -436390 278127 194323 41422 -259655 4658 -206547 -323347 183513 228
9635a54660l805A53620b59511B15184c07978D9079a79626D3314a5067j167A11081
$$ -154660 -158465 153620 -259511 215184 -307978 49079 -179626 43314 -15067 -16234 111081
9623e6852o0430b4577r028A15659c76588b5502j41799f0576H036P436a07135j1500
$$ -56852 -117282 -24577 -33605 115659 -376588 -25502 -167301 -60576 8036 15472 -107135 -118635
9611a18635j42957g4954E1328b98A6890a16838j24792A13675b9509E35365a44288
$$ -118635 -261592 -74954 51328 -298 16890 -116838 -241630 113675 -29509 535365 -144288
9599i8517m9681D1104a99256C95367a85419o0077d7461C29969A63334c134k70057
$$ -98517 -148198 41104 -199256 395367 -185419 -245496 -47461 329969 163334 -3134 -273191
9588b73191a16766L1053A7892R4302a36179j22018a17296l33462a41519j06917
$$ -273191 -116766 -85713 17892 112194 -136179 -258197 -117296 -450758 -141519 -248436
9578b48436R769A20861N1462o5011B0037d21577a40888j8449K5822A02203a3341
$$ -248436 -238667 120861 172323 107312 20037 -421577 -140888 -159337 -133515 102203 -13341
9566B11251a84847e1264n042k18427E7902a49692e0570F8388r13b14600b7292
$$ 211251 -184847 -51264 -56306 -274733 57902 -149692 -50570 68388 67475 -214600 -27292
9554a31380A49409a39226E9004a4261k6765C3798a65412c3169B41709F5572j142
$$ -131380 149409 -139226 59004 -14261 -41026 33798 -165412 -33169 241709 65572 64430
9543F4430N9627a74551j38407J49109a3542j58855j49458b3870p6788q8026h5580
$$ 64430 124057 -174551 -312958 -163849 -13542 -172397 -321855 -23870 -100658 -188684 -85580
9531A85082C8524P328K16906n6079H4495b48373J21833B650K18514a28703c7751
$$ 185082 38524 45852 262758 206679 84495 -248373 -126540 2650 221164 -128703 -37751
9519G6577a102B6800a31591A5928N8109b56807B06940a23277A70685a4425E8526
$$ 76577 -1102 26800 -131591 15928 74037 -256807 206940 -123277 170685 -14425 58526
9507a8093B877b28150C3512i8634j08761H5227J48750f8448a2248A3287K64286
$$ -18093 2877 -228150 33512 -98634 -207395 85227 233977 -68448 -12248 13287 277573
9496B77573j37244d70969J46015N8582B32450c3905j93202c9532r5261o5674A00578
$$ 277573 140329 -470969 -324954 -266372 232450 -33905 -227107 -39532 -134793 -200467 100578
9484F7744d28139h0320j85397F3242d0569j73377M2461A85313a8511m97829a22830
$$ 67744 -428139 -80320 -265717 63242 -40569 -213946 -171485 185313 -18511 -516340 -122830
9472F2988f4282j61149P4088p1110B8228i7700B74930F5635M3324b60224a00001
$$ 62988 -64282 -225431 -151343 -222453 28228 -97700 274930 65635 108959 -260224 -100001
9460a71554B21879b05399f8186A84460G1024c76857a48728n2398K0213q040C5782
$$ -171554 221879 -205399 -68186 184460 71024 -376857 -148728 -201126 -180913 -188953 35782
9448b06429G6825i703l55956M0659J49684A20447a01652k3200C09781b08541k05162
$$ -206429 76825 -9703 -365659 -325000 -175316 120447 -101652 -124852 309781 -208541 -413703
9437d13703F7345c77170F1250b13206l7878I9675a01630b8683m9785A71155a86693
$$ -413703 67345 -377170 61250 -213206 -251084 99675 -101630 -28683 -78468 171155 -186693
9425a58906B95691B1543J24637n9790K19575a10056l34092a83582A84148m2668
$$ -158906 295691 21543 146180 86390 305965 -110056 -444148 -183582 184148 141480
9415A41480e9763B29134E7206d719F8402d4959e272q6234A09680a12900j19169
$$ 141480 -59763 229134 57206 -4719 68402 -44959 -5272 -91506 109680 -112900 -232069
9404b32069h2998k6630k3988A74382b01308h9194q9201c8921j10388A06019K8175
$$ -232069 -82998 -109628 -133616 174382 -201308 -89194 -178395 -38921 -149309 106019 134194
9393A34194d5160o432B5957a47012j3603d7152B53858c48269i273l07161A32862
$$ 134194 -45160 -51592 25957 -147012 -160615 -47152 253858 -348269 -9273 -316434 132862
9381b79751R3763G4181l6035a97283B00937D5391e4416o7577I452g9570b4856
$$ -279751 -185988 74181 38146 -197283 200937 45391 -54416 -121993 9452 -79570 -24856
9369c48926I5515a66380j6331k1428B40849B9277a91458B40637C4890J27342d58397
$$ -348926 95515 -166380 -182711 -204139 240849 29277 -191458 240637 34890 162232 -458397
9357b09518R2376j57959F4184N0678i844r0591A31376a19768j03275i2840G5594
$$ -209518 -117142 -275101 64184 114862 -9844 -100435 131376 -119768 -223043 -92840 75594
9345c21283a4172r9251c4759A14696A2068a49539k42137b4618n2629P848A06644
$$ -321283 -14172 -113423 -34759 114696 12068 -149539 -391676 -24618 -77247 -69399 106644
9333b26061o6732J34687G5319C0799J97208a47969L35d6822B03522j8399a98264
$$ -226061 -292793 -158106 75319 30799 228007 -147969 -147634 -46822 203522 185123 -198264
9321A70396b82796h4583M0525j56307R2450B0394i0467J3580C6671J40554m6914
$$ 170396 -282796 -84583 -44058 -200365 -107915 20394 -90467 -76887 36671 177225 130311
9310A30311K65327a35299B11080g5037j15636h6985J4515E4881a20937C12423
$$ 130311 395638 -135299 211080 -75037 -190673 -86985 -72470 54881 -120937 312423
9299f9219O401j11264K0799n7148C5943J54852b0253p1193j6645E1749a60108
$$ -69219 -62818 -174082 -153283 -210431 35943 190795 -20253 -91446 -108091 51749 -160108
9287b063B09112b41118A02819C5743a01219n2394A644a26320B98690A10826b40028
$$ -2063 209112 -241118 102819 35743 -101219 -153613 1644 -126320 298690 110826 -240028
9275A4878c7394A6962J90114a92507I7768c13511A31185d79526c4044k49865G1276
$$ 14878 -37394 16962 207076 -192507 97768 -313511 131185 -479526 -34044 -283909 71276
9263b0948B9257J57644E1960J91187a72657d3464j20372O1102h219p3613k30073
$$ -20948 29257 186901 51960 243147 -172657 -43464 -163836 -102734 -8219 -81832 -311905
9252c11905R2842C2414B10b14443i0862G1151h534p7453A24268a08253r2581E7208
$$ -311905 -219063 32414 210 -214443 -90862 71151 -8534 -85987 124268 -108253 -200834 57208
9239I1920a51346C183a08429A72259F9189b05235K6543N620H764O2374d01442
$$ 91920 -151346 3183 -108429 172259 69189 -205235 -178692 -173072 8764 71138 -401442
9227a17448d3503j45232m512C07319F2309a98395C49466A37921b23661j6210a01139
$$ -117448 -43503 -188735 -193247 307319 62309 -198395 349466 137921 -223661 -239871 -101139
9215A05O2620a16837P142n7557A77631M0361b7982m0025m3508j3061n4099r6955
$$ 105 62725 -116837 -109695 -167252 177631 217992 -27982 -68007 -111515 -124576 -178675 -275630
9203b75630b7429D0755b44775O320j51211d2841k85231c7461B3058f5277m9413
$$ -275630 -27429 40755 -244775 -238455 -389666 -42841 -328072 -37461 23058 -65277 -114690
9192a14690r9940k42543j08716b39293N1723k32954e6569d078l12472M532g5014
$$ -114690 -214630 -457173 -565889 -239293 -187570 -420524 -56569 -4078 -316550 -312018 -75014
9180h2394K9043A39505b14874f9796P823i108j20962L6659D8110c32925R7086
$$ -82394 -53351 139505 -214874 -69796 -61973 -9108 -130070 -93411 48110 -332925 -235839
9169b35839j2441D7595K7675B2703a22347l6803B7288N5612J22149b44716J01255
$$ -235839 -248280 47595 75270 22703 -122347 -159150 27288 82900 205049 -244716 -143461
9158a43461B2065m117K3772c3557a2243k69769J9225H6060e9325r7715r0185A07311
$$ -143461 22065 17948 41720 -33557 -12243 -282012 -262787 86060 -59325 -157040 -247225 107311
9145A53440a27593r7335Q1106A27629d0712j02843J469k02183L0228C10259a20229
$$ 153440 -127593 -224928 -143822 127629 -40712 -143555 -142086 -344269 -314041 310259 -120229
9133G7798g9712B66007c61878f7622j34499B05687d9106a0280D7077J6917i7758
$$ 77798 -79712 266007 -361878 -67622 -202121 205687 -49106 -10280 47077 63994 -97758
9121A52761h5006A73677c24174J17514i7388D2463a85325C7285b25955l8205a935
$$ 152761 -85006 173677 -324174 -206660 -97388 42463 -185325 37285 -225955 -264160 -1935
9109a5984F6193e4636p5769O360k56771h6509b0408A16637O5277a32685B26041
$$ -15984 66193 -54636 -130405 -124045 -380816 -86509 -20408 116637 181914 -132685 226041
9097A52879a63695B82594g6923j01434g1135m7021A66347b7946A29832A6116N0782
$$ 152879 -163695 282594 -76923 -178357 -71135 -118156 166347 -27946 129832 16116 66898
9086F6898b55673j6749f7723j9050B72317q341H9194K5598c82858a67947r8045
$$ 66898 -255673 -272422 -67723 -86773 272317 263976 89194 114792 -382858 -167947 -265992
9075b65992m4971e6629J4812j49345H6662a94170d7354B88179f343k82534A74524
$$ -265992 -310963 -56629 -41817 -191162 86662 -194170 -47354 288179 -6343 -288877 174524
9063b13706B61713j30009e0697A23136b5399A84662e9934A98672c8235j07150
$$ -213706 261713 131704 -50697 123136 -25399 184662 -59934 198672 -38235 -145385
9053a45385n9534D3262A051a93101i5594c0298a4895j47952e9356o2461B79413
$$ -145385 -204919 43262 1051 -193101 -95594 -30298 -14895 -162847 -59356 -121817 279413
9041a62469M2545k52746D729J25254b68458J04018M5696j31800A63576c73813
$$ -162469 -119924 -372670 4729 129983 -268458 -164440 -118744 -250544 163576 -373813
9030F3840b64901b9918k4526j5463B19551a98010l6659N2497c1210o2574k73749
$$ 63840 -264901 -29918 -54444 -69907 219551 -198010 -234669 -182172 -31210 -93784 -367533
9019c67533J49549N4126A55337p3879b47547g1989J482A0850N708a7481j31036
$$ -367533 -217984 -163858 155337 81458 -247547 -71989 -70507 10850 16558 -17481 -148517
9008a48517j30478B10738i9257A28861b9772k66190J02647R3008d7294C3276a59615
$$ -148517 -278995 210738 -99257 128861 -29772 -295962 -193315 -100307 -47294 33276 -159615
8996E8701a82106H2325b62091i9081A5015b6312k65084n8326a60893e3738C2316
$$ 58701 -182106 82325 -262091 -99081 15015 -26312 -291396 -349722 -160893 -53738 32316
8984b61396a24367b3266A07977c33279A2218b73255A26124C8355a35777B4226
$$ -261396 -124367 -23266 107977 -333279 12218 -273255 126124 38355 -135777 24226
8973F5031A4614a386q6657p4635B22587a83247A27177D4037A0812K04765c85r3422
$$ 65031 14614 -1386 -88043 -162678 222587 -183247 127177 44037 10812 215577 -385 -93807
8961i3807H5429a31897A6982E032O6311a21772F2253a96335Q1010A75550a47543
$$ -93807 85429 -131897 16982 5032 71343 -121772 62253 -196335 -115325 175550 -147543
8949C29640a37974N4413B3780K29392j04742D5530J24679a57316n735p6918J9041
$$ 329640 -137974 -83561 23780 253172 148430 45530 170209 -157316 -163051 -239969 -220928
8938b20928f6047G1431A936K74659a48283B3292a93927c8200p0935n9172d5826
$$ -220928 -66047 71431 1936 276595 -148283 23292 -193927 -38200 -109135 -168307 -45826
8926a79087B8575b0748o8066A04669a28075A01187a0117A00258R47122B48703
$$ -179087 28575 -20748 -88814 104669 -128075 101187 -10117 100258 1047380 248703
8915c14832c3589m2149j73156I0797d45199H4976e6616I718K20366H05c6370j755
$$ -314832 -33589 -75738 -248894 90797 -445199 84976 -56616 9718 230084 805 -36370 -38125
8903c8125j29010H5297a21713k4228A82695a64856P5176D5537a37811O1630o1384
$$ -38125 -167135 85297 -121713 -145941 182695 -164856 -89680 45537 -137811 -76181 -137565
8892a37565D0989J91280I6652G441d2024k5050A60479a30565C55032G6137b67136
$$ -137565 40989 232269 96652 7441 -42024 -67074 160479 -130565 355032 76137 -267136
8880e2521e133o6097A4388a90654c2327B1855d2959j06439P2519j7639I0326D2064
$$ -52521 -5133 -71230 14388 -190654 -32327 21855 -42959 -149398 -76879 -94518 90326 42064
8867A10707a74827A0092L4131M3429K3938a7646n253B78198A1268J2979d3511
$$ 110707 -174827 10092 44223 87652 111590 -17646 -22899 278198 11268 24247 -43511
8855a29904k17770b1374f831j13704A40922a15193K4197a8296C6116J03000b12156
$$ -129904 -347674 -21374 -6831 -120535 140922 -115193 -90996 -18296 36116 139116 -212156
8843A68780N7321a80313j00155E2861a68148l19319i5468k28294M9090C9245a82817
$$ 168780 226101 -180313 -280468 52861 -168148 -487467 -95468 -323762 -274672 39245 -182817
$$ [...]
##END NTUPLES=NMR SPECTRUM
##END=
