##TITLE=NES1055_872015077_9270410_hdJ9xny5Rz
##JCAMPDX= 6.0         $$ Bruker NMR JCAMP-DX V2.0
##DATA TYPE= NMR SPECTRUM
##DATA CLASS= NTUPLES
##ORIGIN= BRUKER
##OWNER= Administrator
$$ 1.72 TOPSPIN		Version 2.1
$$ 2015-07-11 18:52:13.613 -0700  Administrator@X
$$ Compression mode = diff/dup
##.OBSERVE FREQUENCY= 400.02188249412
##.OBSERVE NUCLEUS= ^1H
##.ACQUISITION MODE= SIMULTANEOUS (DQD)
##.ACQUISITION SCHEME= undefined
##.AVERAGES= 64
##.DIGITISER RES= 22
##SPECTROMETER/DATA SYSTEM= spect
##.PULSE SEQUENCE= noesygpps1d.comp
##.SOLVENT NAME= COFFEE_meoh
##.SHIFT REFERENCE= INTERNAL, COFFEE_meoh, 1, 14.963
##AUDIT TRAIL= $$ (NUMBER, WHEN, WHO, WHERE, PROCESS, VERSION, WHAT)
$$ ##TITLE= Audit trail, TOPSPIN		Version 2.1
$$ ##JCAMPDX= 5.01
$$ ##ORIGIN= Bruker BioSpin GmbH
$$ ##OWNER= Administrator
$$ $$ E:\/data/COFFEE/nmr/NES1055_872015077_9270410_hdJ9xny5Rz/12/pdata/1/auditp.txt
$$ ##AUDIT TRAIL=  $$ (NUMBER, WHEN, WHO, WHERE, PROCESS, VERSION, WHAT)
(   1,<2015-07-11 18:52:08.113 -0700>,<Administrator>,<X>,<go>,<TOPSPIN 2.1>,
      <created by zg
	started at 2015-07-11 18:40:38.363 -0700,
	POWCHK enabled, PULCHK disabled,
       configuration hash MD5:
       21 0F 79 D6 B3 7B B4 F6 88 20 88 DB 03 48 BD 9F
       data hash MD5: 64K
       52 7B 45 C5 BA 2B 66 60 AC DB 74 DA 80 B8 95 31>)
(   2,<2015-07-11 18:52:11.488 -0700>,<Administrator>,<X>,<proc1d>,<TOPSPIN 2.1>,
      <Start of raw data processing
       efp LB = 0.3 FT_mod = 6 PKNL = 1 PHC0 = 0 PHC1 = 0 SI = 128K 
       data hash MD5: 128K
       6F 08 31 D0 A9 C4 1B 4D 81 B9 74 32 96 64 95 DF>)
(   3,<2015-07-11 18:52:12.378 -0700>,<Administrator>,<X>,<proc1d>,<TOPSPIN 2.1>,
      <pk PHC0 = -85.39673 PHC1 = 0 
       data hash MD5: 128K
       2B 99 4C 08 3C 28 08 54 2B 6D 74 53 03 8A 02 B5>)
(   4,<2015-07-11 18:52:12.785 -0700>,<Administrator>,<X>,<proc1d>,<TOPSPIN 2.1>,
      <abs ABSG = 1 
       data hash MD5: 128K
       95 F6 E6 AA 83 8D EC 80 64 6C 2C C9 85 35 2D 0F>)
(   5,<2015-07-11 18:52:12.878 -0700>,<Administrator>,<X>,<proc1d>,<TOPSPIN 2.1>,
      <abs ABSG = 2 
       data hash MD5: 128K
       C1 53 12 6E 05 A6 52 F2 9E 65 47 A7 65 EA 1A 69>)
(   6,<2015-07-11 18:52:12.956 -0700>,<Administrator>,<X>,<proc1d>,<TOPSPIN 2.1>,
      <abs ABSG = 3 
       data hash MD5: 128K
       17 0E 8D 0D 30 4C 81 0B 5D 86 D9 73 A3 C4 4A EA>)
(   7,<2015-07-11 18:52:13.050 -0700>,<Administrator>,<X>,<proc1d>,<TOPSPIN 2.1>,
      <abs ABSG = 4 
       data hash MD5: 128K
       55 74 55 DA 62 4D 9B 87 3C 36 38 A6 CC 05 8A E2>)
(   8,<2015-07-11 18:52:13.175 -0700>,<Administrator>,<X>,<proc1d>,<TOPSPIN 2.1>,
      <abs ABSG = 5 
       data hash MD5: 128K
       76 72 89 8C B8 50 98 FC 5B 64 94 5F F0 64 79 55>)
$$ ##END=
$$ 
$$ $$ hash MD5
$$ $$ 44 B0 34 C6 6F BE FF FD 15 DF 06 09 06 11 F0 AD
##$RELAX= 
##$RELAX= 
##$RELAX= 
##$RELAX= 
##$RELAX= 
##$RELAX= 
##$RELAX= 
##$RELAX= 
$$ Bruker specific parameters
$$ --------------------------
##$DU= <E:\>
##$EXPNO= 12
$$ [...]
150 150 150 150 150 150 150 150
##$TP07= 0
##$TPNAME0= <>
##$TPNAME1= <>
##$TPNAME2= <>
##$TPNAME3= <>
##$TPNAME4= <>
##$TPNAME5= <>
##$TPNAME6= <>
##$TPNAME7= <>
##$TPOAL= (0..7)
0.5 0.5 0.5 0.5 0.5 0.5 0.5 0.5
##$TPOFFS= (0..7)
0 0 0 0 0 0 0 0
##$TUNHIN= 0
##$TUNHOUT= 0
##$TUNXOUT= 0
##$USERA1= <user>
##$USERA2= <user>
##$USERA3= <user>
##$USERA4= <user>
##$USERA5= <user>
##$V9= 5
##$VALIST= <valist>
##$VCLIST= <CCCCCCCCCCCCCCC>
##$VD= 0
##$VDLIST= <DDDDDDDDDDDDDDD>
##$VPLIST= <PPPPPPPPPPPPPPP>
##$VTLIST= <TTTTTTTTTTTTTTT>
##$WBST= 2048
##$WBSW= 25
##$XGAIN= (0..3)
0 0 0 0
##$XL= 0
##$YL= 0
##$YMAX_a= 6662068
##$YMIN_a= -12873937
##$ZGOPTNS= <>
##$ZL1= 120
##$ZL2= 120
##$ZL3= 120
##$ZL4= 120
##$ABSF1= 14.963
##$ABSF2= -5.595181
##$ABSG= 5
##$ABSL= 3
##$ALPHA= 0
##$AQORDER= 0
##$ASSFAC= 0
##$ASSFACI= 0
##$ASSFACX= 0
##$ASSWID= 0
##$AUNMP= <proc_prof1d_extract.lims>
##$AXLEFT= 0
##$AXNAME= <>
##$AXNUC= <1H>
##$AXRIGHT= 0
##$AXTYPE= 0
##$AXUNIT= <>
##$AZFE= 0.1
##$AZFW= 0.1
##$BCFW= 0
##$BC_mod= 0
##$BYTORDP= 0
##$COROFFS= 0
##$CY= 15
##$DATMOD= 1
##$DC= 0
##$DFILT= <>
##$DTYPP= 0
##$F1P= 0
##$F2P= 0
##$FCOR= 0.5
##$FTSIZE= 131072
##$FT_mod= 6
##$GAMMA= 0
##$GB= 0
##$INTBC= 1
##$INTSCL= 1
##$ISEN= 128
##$LB= 0.3
##$LEV0= 0
##$LPBIN= 0
##$MAXI= 10000
##$MC2= 0
##$MEAN= 0
##$ME_mod= 0
##$MI= 0
##$NCOEF= 0
##$NC_proc= -2
##$NLEV= 6
##$NOISF1= 0
##$NOISF2= 0
##$NSP= 0
##$NTH_PI= 0
##$NZP= 0
##$OFFSET= 14.963
##$PC= 1
##$PHC0= -85.39673
##$PHC1= 0
##$PH_mod= 1
##$PKNL= yes
##$PPARMOD= 0
##$PPDIAG= 0
##$PPIPTYP= 0
##$PPMPNUM= 2147483647
##$PPRESOL= 1
##$PSCAL= 4
##$PSIGN= 0
##$PYNMP= <proc.py>
##$REVERSE= no
##$SF= 400.020008835797
##$SI= 131072
##$SIGF1= 0
##$SIGF2= 0
##$SINO= 400
##$SIOLD= 131072
##$SPECTYP= <>
##$SREGLST= <1H.CDCl3>
##$SSB= 0
##$STSI= 131072
##$STSR= 0
##$SW_p= 8223.68421052631
##$SYMM= 0
##$S_DEV= 0
##$TDeff= 65536
##$TDoff= 0
##$TI= <>
##$TILT= no
##$TM1= 0
##$TM2= 0
##$TOPLEV= 0
##$USERP1= <user>
##$USERP2= <user>
##$USERP3= <user>
##$USERP4= <user>
##$USERP5= <user>
##$WDW= 1
##$XDIM= 131072
##$YMAX_p= 397241132
##$YMIN_p= -12526
##$CURPLOT= <Network HP LaserJet P1505>
##$CURPRIN= <$Network HP LaserJet P1505>
##$DFORMAT= <normdp>
##$LAYOUT= <+/1D_H.xwp>
##$LFORMAT= <normlp>
##$PFORMAT= <normpl>
##$SURQMSG= 1
$$ End of Bruker specific parameters
$$ ---------------------------------
##NTUPLES= NMR SPECTRUM
##VAR_NAME=  FREQUENCY,     SPECTRUM/REAL,   SPECTRUM/IMAG
##SYMBOL=    X,             R,               I
##VAR_TYPE=  INDEPENDENT,   DEPENDENT,       DEPENDENT
##VAR_FORM=  AFFN,          ASDF,            ASDF
##VAR_DIM=   131072,        131072,          131072
##UNITS=     HZ,            ARBITRARY UNITS, ARBITRARY UNITS
##FACTOR=    0.0627417313425164, 1,          1
##FIRST=     8223.62146879497, 1716,         -42799
##LAST=      0,             2962,            -42404
##MIN=       0,             -12526,          0
##MAX=       8223.62146879497, 397241132,    0
$$ Real data points
##PAGE= N=1
##DATA TABLE= (X++(R..R)), XYDATA
$$ [...]
$$ plain form
63397 319606 321669 324596 328854 334202 340333 347596 356665 367588 379558 391707 403817 416142 428761
63384 428761 441378 453631 465363 476614 487505 498164 508515 518049 525876 531195 533776 534047 532699
63371 532699 530209 526649 521952 516303 510278 504619 499953 496628 494640 493516 492393 490396 487057 482296
63357 482296 476080 468190 458403 446854 434219 421564 409894 399665 390695 382571 375165 368673 363233
63344 363233 358605 354285 349862 345264 340686 336323 332142 327923 323525 319029 314663 310678 307263 304430
63330 304430 301927 299488 297273 295809 295248 294934 294078 292763 291892 292229 293890 296830 301243 307175 314012
63315 314012 320718 326443 330730 333341 334183 333368 331125 327667 323253 318283 313160 308116 303279 298775 294564
63300 294564 290351 285911 281456 277474 274209 271538 269317 267548 266106 264629 262958 261522 260967 261362 261990
$$ packed form
63397C19606K063K927M258N348O131P263R069J0923J1970J2149J2110J2325J2619
63384D28761J2617J2253J1732J1251J0891J0659J0351R534P827N319K581K71j348
63371E32699k490l560m697n649o025n659m666l325j988j124j123j997l339m761
63357D82296o216p890r787j1549j2635j2655j1670j0229q970q124p406o492n440
63344C63233m628m320m423m598m578m363m181m219m398m496m366l985l415k833
63330C04430k503k439k215j464n61l14q56j315q71L37J661K940M413N932O837
63315C14012O706N725M287K611Q42q15k243l458m414m970n123n044m837m504m211
63300B94564m213m440m455l982l265k671k221j769j442j477j671j436n55L95O28
$$ plain form
63285 261990 262068 261534 260965 260773 260710 260275 259407 258555 258110 257964 257682 256992 256034 255238 255004 255375 255956 256289 256437
63266 256437 257078 258879 261756 264950 267847 270594 273777 277603 281654 285472 289105 292836 296593 300025
63252 300025 303164 306545 310496 314755 319098 323920 329694 336200 342935 350145 358663 368643 379232 389816
63238 389816 400920 413431 427412 442251 457582 473481 489954 506821 524000 541448 558843
63227 558843 575874 592804 610279 628486 646904 665027 682924 700942 719180 737561 756214
63216 756214 775477 795527 816104 836547 855983 873497 888224 899315 905955 907484 903539 894101
63204 894101 879604 861085 840054 817894 795401 772990 751223 730819 712159 695147 679666
63193 679666 666041 654925 646846 641975 640180 641205 644790 650753 658998 669452 681983 696290 711947
$$ packed form
63285B61990P8n34n69j92o3m35q68q52m45j46k82o90r58p96k34L71N81L33J48
63266B56437O41J801K877L194K897K747L183L826M051L818L633L731L757L432
63252C00025L139L381L951M259M343M822N774O506O735P210Q518R980J0589J0584
63238C89816J1104J2511J3981J4839J5331J5899J6473J6867J7179J7448J7395
63227E58843J7031J6930J7475J8207J8418J8123J7897J8018J8238J8381J8653
63216G56214J9263K0050K0577K0443J9436J7514J4727J1091O640J529l945r438
63204H94101j4497j8519k1031k2160k2493k2411k1767k0404j8660j7012j5481
63193F79666j3625j1116q079m871j795J025L585N963Q245J0454J2531J4307J5657
$$ plain form
63180 711947 728626 746296 764947 784116 802986 821174 839197 857815 877071 896287 914914
63169 914914 932969 950605 967650 983748 998653 1012115 1023576 1032202 1037256 1038391 1035623 1029093
63157 1029093 1018874 1005018 987839 968165 947227 926176 905522 884992 864113 843161 823432
63146 823432 806279 791974 779890 769756 762112 757277 754468 752424 750441 748303 745560 741642 736504
63133 736504 730481 723624 715837 707628 699951 693131 686655 680245 674460 669842 666062 662413 658776 655654
63119 655654 653531 652594 652832 653964 655414 656714 657864 659080 660351 661485 662442 663321 664116 664714 665044 665070
63103 665070 664794 664449 664489 665142 666188 667406 669014 671269 673750 675521 676133 676179 676733 678403 681053 684275
63087 684275 687878 691853 696015 699927 703366 706686 710468 714795 719200 723379 727605 732265 737305 742414
$$ packed form
63180G11947J6679J7670J8651J9169J8870J8188J8023J8618J9256J9216J8627
63169I14914J8055J7636J7045J6098J4905J3462J1461Q626N054J135k768o530
63157A029093j0219j3856j7179j9674k0938k1051k0654k0530k0879k0952j9729
63146H23432j7153j4305j2084j0134p644m835k809k044j983k138k743l918n138
63133G36504o023o857p787q209p677o820o476o410n785m618l780l649l637l122
63119F55654k123r37K38J132J450J300J150J216J271J134R57Q79P95N98L30K6
63103F65070k76l45M0O53J046J218J608K255K481J771O12M6N54J670K650L222
63087F84275L603L975M162L912L439L320L782M327M405M179M226M660N040N109
$$ plain form
63073 742414 747538 752907 758683 764862 771393 778121 784749 791252 798297 806875 817354 829153 841516
63060 841516 854490 868921 885535 904226 924343 945575 968306 993030 1019688 1047861 1077489
63049 1077489 1108943 1142304 1176967 1212154 1247539 1283115 1318736 1354097 1389002 1423295 1456632
63038 1456632 1488680 1519523 1549657 1579540 1609285 1638727 1667506 1695108 1720973 1744600 1765352
63027 1765352 1782126 1793387 1797629 1793852 1781811 1762019 1735469 1703048 1665096 1621691 1573472 1522172
63015 1522172 1470233 1419852 1372351 1328328 1288213 1252512 1221582 1195499 1174311 1158174 1146978
63004 1146978 1140088 1136996 1138197 1144841 1157244 1174174 1193968 1216020 1240728 1268186 1297494 1327459
62992 1327459 1357567 1388051 1419142 1450505 1481445 1511495 1540549 1568324 1594005 1616785 1636527
$$ packed form
63073G42414N124N369N776O179O531O728O628O503P045Q578J0479J1799J2363
63060H41516J2974J4431J6614J8691K0117K1232K2731K4724K6658K8173K9628
63049A077489L1454L3361L4663L5187L5385L5576L5621L5361L4905L4293L3337
63038A456632L2048L0843L0134K9883K9745K9442K8779K7602K5865K3627K0752
63027A765352J6774J1261M242l777j2041j9792k6550l2421l7952m3405m8219n1300
63015A522172n1939n0381m7501m4023m0115l5701l0930k6083k1188j6137j1196
63004A146978o890l092J201O644J2403J6930J9794K2052K4708K7458K9308K9965
62992A327459L0108L0484L1091L1363L0940L0050K9054K7775K5681K2780J9742
$$ plain form
62981 1636527 1653404 1666828 1675247 1677131 1671708 1658648 1637641 1608686 1572307 1529068 1479313 1423898
62969 1423898 1364727 1303932 1242735 1181670 1121638 1063996 1009675 958856 911567 868015 828190
62958 828190 791628 757754 726184 696727 669504 645027 623663 604968 588003 572301 557948
62947 557948 544716 531847 519036 507009 496666 488074 480692 474185 468459 463151 457688 451856 445950
62934 445950 440337 435130 430283 425717 421287 416829 412280 407633 402801 397692 392427 387353 382775 378777
62920 378777 375326 372396 369853 367212 363779 359301 354521 350812 349015 348722 348830 348659 348292 348011 347807 347547
62904 347547 347244 346950 346534 345767 344554 342964 341128 339157 337069 334775 332250 329779 327906 326985 326812 326800
62888 326800 326504 325974 325591 325591 325771 325676 325041 323948 322656 321489 320905 321372 322900 324865 326467 327315 327457 327107
$$ packed form
62981A636527J6877J3424Q419J884n423j3060k1007k8955l6379m3239m9755n5415
62969A423898n9171o0795o1197o1065o0032n7642n4321n0819m7289m3552l9825
62958H28190l6562l3874l1570k9457k7223k4477k1364j8695j6965j5702j4353
62947E57948j3232j2869j2811j2027j0343q592p382o507n726n308n463n832n906
62934D45950n613n207m847m566m430m458m549m647m832n109n265n074m578l998
62920C78777l451k930k543k641l433m478m780l709j797k93J08j71l67k81k04k60
62904C47547l03k94m16p67j213j590j836j971k088k294k525k471j873r21j73j2
62888C26800k96n30l83%J80r5o35j093j292j167n84M67J528J965J602Q48J42l50
$$ plain form
62870 327107 326597 326379 326677 327220 327571 327665 327756 327908 327898 327596 327181 326940 327068 327612 328337 328658 327978 326167 323582
62851 323582 320717 317972 315616 313716 312153 310870 309950 309338 308799 308414 308661 309645 310744 311594 312889 315286
62835 315286 317884 318963 318249 317299 317425 318316 319165 319975 321001 321813 321997 322184 323356 325411 327387 328980
62819 328980 330889 333569 336482 338869 340726 342637 345015 347835 350962 354481 358715 363942 370075 376646
62805 376646 383131 389243 395004 400738 407051 414545 423422 433595 445173 458432 473258 489099 505852
62792 505852 524330 545490 569554 596341 626048 659127 695676 735618 779325 827343 879404
62781 879404 934358 991258 1049987 1110538 1172083 1233056 1291911 1347495 1398792 1444502 1482892
62770 1482892 1512081 1530681 1538290 1535290 1522198 1499351 1467205 1426742 1379471 1327137 1271348 1213276
$$ packed form
62870C27107n10k18K98N43L51R4R1J52j0l02m15k41J28N44P25L21o80j811k585
62851C23582k865k745k356j900j563j283r20o12n39l85K47R84J099Q50J295K397
62835C15286K598J079p14r50J26Q91Q49Q10J026Q12J84J87J172K055J976J593
62819C28980J909K680K913K387J857J911K378K820L127L519M234N227O133O571
62805C76646O485O112N761N734O313P494Q877J0173J1578J3259J4826J5841J6753
62792E05852J8478K1160K4064K6787K9707L3079L6549L9942M3707M8018N2061
62781H79404N4954N6900N8729O0551O1545O0973N8855N5584N1297M5710L8390
62770A482892K9189J8600P609l000j3092k2847l2146m0463m7271n2334n5789n8072
$$ plain form
62758 1213276 1153683 1093401 1033802 976521 922500 871463 822600 775781 731946 692187 656628
62747 656628 624364 594429 566532 540821 517338 496038 477093 460679 446470 433774 422264
62736 422264 412179 403692 396430 389799 383553 377876 373215 370112 368860 369127 370151 371455 373120 375349
62722 375349 378228 382032 387220 393837 401433 409871 419720 431380 444381 458152 473117 490380 510590
62709 510590 533729 559780 588937 621254 656707 695544 738003 783800 832481 884238 939764
62698 939764 999222 1061798 1126147 1190656 1253241 1311608 1364026 1409488 1447057 1475507 1493721
62687 1493721 1501004 1496960 1481554 1455436 1419810 1375928 1325168 1269514 1211227 1151740 1091457 1030843
62675 1030843 971198 914043 860309 810444 764753 723100 684777 649231 616664 587431 561201
$$ packed form
62758A213276n9593o0282n9599n7281n4021n1037m8863m6819m3835l9759l5559
62747F56628l2264k9935k7897k5711k3483k1300j8945j6414j4209j2696j1510
62736D22264j0085q487p262o631o246n677m661l103j252K67J024J304J665K229
62722C75349K879L804N188O617P596Q438R849J1660J3001J3771J4965J7263K0210
62709E10590K3139K6051K9157L2317L5453L8837M2459M5797M8681N1757N5526
62698I39764N9458O2576O4349O4509O2585N8367N2418M5462L7569K8450J8214
62687A493721P283m044j5406k6118l5626m3882n0760n5654n8287n9487o0283o0614
62675A030843n9645n7155n3734m9865m5691m1653l8323l5546l2567k9233k6230
$$ plain form
62664 561201 537292 515599 496579 480283 465927 452459 439145 425624 411874 398354 385811
62653 385811 374663 364725 355709 347761 341209 335849 330784 325169 318965 312830 307367 302710 298747 295386
62639 295386 292466 289743 287194 285072 283428 281880 280219 278938 278576 278742 278442 277396 276344 275848 275490
62624 275490 274701 273836 273875 275293 277699 280454 283161 285616 287711 289616 291870 295103 299598 305119 311177
62609 311177 317559 324581 332788 342481 353728 366641 381344 397706 415539 435155 457294 482320
62597 482320 509738 538742 568935 600274 632551 665183 697323 727877 755505 778895 797166
62586 797166 810010 817533 819959 817331 809428 796159 778069 756286 731981 706084 679473 652980
62574 652980 627013 601508 576421 552042 528694 506515 485778 467087 450911 437064 424845
$$ packed form
62664E61201k3909k1693j9020j6296j4356j3468j3314j3521j3750j3520j2543
62653C85811j1148r938r016p948o552n360n065n615o204o135n463m657l963l361
62639B95386k920k723k549k122j644j548j661j281l62J66l00j046j052m96l58
62624B75490p89q65L9J418K406K755K707K455K095J905K254L233M495N521O058
62609C11177O382P022Q207R693J1247J2913J4703J6362J7833J9616K2139K5026
62597D82320K7418K9004L0193L1339L2277L2632L2140L0554K7628K3390J8271
62586G97166J2844P523K426k628p903j3269j8090k1783k4305k5897k6611k6493
62574F52980k5967k5505k5087k4379k3348k2179k0737j8691j6176j3847j2219
$$ plain form
62563 424845 413549 402710 392186 382275 373456 365725 358421 351002 343721 337229 331747 327035 322906
62550 322906 319244 315654 311676 307474 303827 301274 299579 298248 297312 297328 298697 301142 303898 306339 308478
62535 308478 310875 314166 318720 324670 332099 341120 351883 364498 378854 394561 411330 429430 449497
62522 449497 471831 496187 522357 550611 581333 614460 649529 686108 723996 763175 803599
62511 803599 844645 884598 921021 951983 976726 995081 1006728 1011378 1009121 999978 983490 959492
62499 959492 929184 894802 858201 820258 781580 743128 705928 670594 637314 605994 576431
62488 576431 548726 523573 501678 482853 466143 451028 437952 427416 418964 411462 404175 397172
62476 397172 390867 385525 381197 377777 375011 372557 370191 367979 366248 365296 365130 365622 366968 369766 374374
$$ packed form
62563D24845j1296j0839j0524r911q819p731p304p419p281o492n482m712m129
62550C22906l662l590l978m202l647k553j695j331r36J6J369K445K756K441K139
62535C08478K397L291M554N950P429R021J0763J2615J4356J5707J6769J8100K0067
62522D49497K2334K4356K6170K8254L0722L3127L5069L6579L7888L9179M0424
62511H03599M1046L9953L6423L0962K4743J8355J1647M650k257r143j6488k3998
62499I59492l0308l4382l6601l7943l8678l8452l7200l5334l3280l1320k9563
62488E76431k7705k5153k1895j8825j6710j5115j3076j0536q452p502p287p003
62476C97172o305n342m328l420k766k454k366k212j731r52j66M92J346K798M608
$$ plain form
62461 374374 380317 386669 392935 399254 405731 412028 417759 422984 428091 433361 438738 443757 447553 449207
62447 449207 448397 445648 441766 437082 431319 424107 415460 405828 395831 385956 376523 367878 360476 354547
62433 354547 349742 345406 341322 337964 335817 334632 333618 332375 331407 331643 333543 336825 340973 345826 351498
62418 351498 357857 364342 370432 376152 381992 388436 395638 403416 411361 419037 426268 433249 440268 447384
62404 447384 454434 461195 467416 472854 477490 481544 485133 488032 490037 491369 492427 493270 493722 493900 494290
62389 494290 495313 497153 499968 503906 508900 514895 522343 532048 544302 558567 574177 591086 609678
62376 609678 630161 652483 676669 702930 731484 762393 795449 830056 865266 899983 933028
62365 933028 963073 988863 1009822 1026249 1038744 1047500 1052298 1053030 1049997 1043695 1034425 1022105 1006365
$$ packed form
62461C74374N943O352O266O319O477O297N731N225N107N270N377N019L796J654
62447D49207q10k749l882m684n763p212q647r632r997r875r433q645p402n929
62433C54547m805m336m084l358k147j185j014j243r68K36J900L282M148M853N672
62418C51498O359O485O090N720N840O444P202P778P945P676P231O981P019P116
62404D47384P050O761O221N438M636M054L589K899K005J332J058Q43M52J78L90
62389D94290J023J840K815L938M994N995P448R705J2254J4265J5610J6909J8592
62376F09678K0483K2322K4186K6261K8554L0909L3056L4607L5210L4717L3045
62365I33028L0045K5790K0959J6427J2495Q756M798P32l033o302r270j2320j5740
$$ plain form
62352 1006365 986913 963938 938204 910777 882665 854584 826911 799867 773891 749711 727859
62341 727859 708176 690110 673439 658353 644792 632138 619795 607770 596501 586375 577624 570387
62329 570387 564573 559794 555736 552507 550468 549814 550395 551796 553423 554767 555789 556964 558742 561064 563467
62314 563467 565527 567104 568417 570005 572333 575207 577831 579664 580981 582410 584217 586363 588928 591971
62300 591971 595140 597941 600395 603012 606080 609366 612551 615562 618338 620615 622229 623491 625034 627291
62286 627291 630159 633206 636291 639985 645211 652323 660844 670287 680933 693359 707505 722826 739338
62273 739338 757873 779113 802949 829033 857396 888018 920100 952258 983297 1012463 1039133
62262 1039133 1062743 1083002 1099745 1112529 1120806 1124641 1124911 1122476 1117305 1108714 1096397 1080965 1063433
$$ packed form
62352A006365j9452k2975k5734k7427k8112k8081k7673k7044k5976k4180k1852
62341G27859j9683j8066j6671j5086j3561j2654j2343j2025j1269j0126q751p237
62329E70387n814m779m058l229k039o54N81J401J627J344J022J175J778K322K403
62314E63467K060J577J313J588K328K874K624J833J317J429J807K146K565L043
62300E91971L169K801K454K617L068L286L185L011K776K277J614J262J543K257
62286F27291K868L047L085L694N226P112Q521R443J0646J2426J4146J5321J6512
62273G39338J8535K1240K3836K6084K8363L0622L2082L2158L1039K9166K6670
62262A039133K3610K0259J6743J2784Q277L835K70k435n171q591j2317j5432j7532
$$ plain form
62249 1063433 1044406 1023908 1001924 978944 956026 934445 915211 898717 884667 872394 861377
62238 861377 851527 843060 836220 831138 827732 825552 823876 822221 820800 820223 820700 821733 822603 822942 822686
62223 822686 821772 820177 818196 816361 814949 813673 811973 809563 806684 803893 801645 800050 798951 798179 797714
62208 797714 797715 798501 800536 804241 809644 816208 823177 830180 837443 845420 854279 863885 874201 885515 898114
62193 898114 911776 925735 939237 952083 964599 977165 989943 1003063 1016849 1031690 1047740
62182 1047740 1064921 1083224 1102876 1124214 1147468 1172633 1199265 1226299 1252318 1276223 1297552
62171 1297552 1315961 1330666 1340922 1347069 1350629 1353060 1354661 1354801 1352883 1348758 1342604 1334881 1326273
62158 1326273 1317113 1306935 1295101 1282020 1269237 1258113 1248770 1240545 1233069 1226520 1221032 1216311 1211826
$$ packed form
62249A063433j9027k0498k1984k2980k2918k1581j9234j6494j4050j2273j1017
62238H61377r850q467o840n082l406k180j676j655j421n77M77J033Q70L39k56
62223H22686r14j595j981j835j412j276j700k410k879k791k248j595j099p72m65
62208G97714JP86K035L705N403O564O969P003P263P977Q859R606J0316J1314J2599
62193H98114J3662J3959J3502J2846J2516J2566J2778J3120J3786J4841J6050
62182A047740J7181J8303J9652K1338K3254K5165K6632K7034K6019K3905K1329
62171A297552J8409J4705J0256O147L560K431J601J40j918m125o154p723q608
62158A326273r160j0178j1834j3081j2783j1124r343q225p476o549n488m721m485
$$ plain form
62145 1211826 1207133 1202069 1196811 1191745 1187091 1182686 1178215 1173573 1168933 1164618 1160985 1158194 1155920 1153496
62131 1153496 1150620 1147711 1145333 1143524 1142108 1141441 1142300 1145036 1149303 1154756 1161507 1169752 1179355 1190071
62117 1190071 1201737 1213791 1224701 1232329 1235100 1232973 1227551 1221349 1216575 1214152 1213640 1213919 1213686 1211449
62103 1211449 1205757 1196023 1182965 1167964 1152233 1136906 1123450 1113017 1105312 1098846 1092681 1087406
62091 1087406 1084036 1082547 1082157 1082737 1085069 1089540 1095239 1100732 1105469 1110094 1115557 1122264 1130030 1138497
62077 1138497 1147460 1156893 1166723 1176460 1184938 1190611 1192406 1190434 1185811 1179679 1172412 1163759 1153532 1141860
62063 1141860 1128853 1114441 1098751 1082316 1065511 1047903 1028626 1007531 985640 964320 944300
62052 944300 925672 908521 893067 879273 866695 854859 843519 832468 821358 809944 798425
$$ packed form
62145A211826m693n064n258n066m654m405m471m642m640m315l633k791k274k424
62131A153496k876k909k378j809j416o67Q59K736M267N453O751Q245R603J0716
62117A190071J1666J2054J0910P628K771k127n422o202m774k423n12K79k33k237
62103A211449n692r734j3058j5001j5731j5327j3456j0433p705o466o165n275
62091A087406l370j489l90N80K332M471N699N493M737M625N463O707P766Q467
62077A138497Q963R433R830R737Q478N673J795j972m623o132p267q653j0227j1672
62063A141860j3007j4412j5690j6435j6805j7608j9277k1095k1891k1320k0020
62052I44300j8628j7151j5454j3794j2578j1836j1340j1051j1110j1414j1519
$$ plain form
62041 798425 787320 776955 767235 757922 749097 741192 734520 728802 723305 717507 711476 705450 699162 691901
62027 691901 683336 674019 664856 656238 647987 640068 632946 627034 622099 617551 613162 609129 605502 602015
62013 602015 598695 596157 594843 594212 593214 591508 589678 588126 586362 583733 580428 577199 574271 571012 566729
61998 566729 561419 555640 549935 544550 539518 534864 530733 527322 524640 522400 520231 517958 515649 513564
61984 513564 512137 511817 512722 514607 517343 521144 525996 531177 535877 540183 544851 550145 555568 560894 566751
61969 566751 573741 581546 589454 597419 606000 615452 625454 635702 646195 656905 667648 678527 690096
61956 690096 702846 716698 731284 746578 763027 781078 800756 821744 843770 866854 891261
61945 891261 917270 944935 973977 1003899 1034326 1065331 1097394 1130990 1166264 1203106 1241432
$$ packed form
62041G98425j1105j0365r720r313q825p905o672n718n497n798o031o026o288p261
62027F91901q565r317r163q618q251p919p122n912m935m548m389m033l627l487
62013F02015l320k538j314o31r98j706j830j552j764k629l305l229k928l259m283
61998E66729n310n779n705n385n032m654m131l411k682k240k169k273k309k085
61984E13564j427l20R05J885K736L801M852N181M700M306M668N294N423N326N857
61969E66751O990P805P908P965Q581R452J0002J0248J0493J0710J0743J0879J1569
61956F90096J2750J3852J4586J5294J6449J8051J9678K0988K2026K3084K4407
61945H91261K6009K7665K9042K9922L0427L1005L2063L3596L5274L6842L8326
$$ plain form
61934 1241432 1281289 1322854 1366478 1412702 1462118 1515357 1573358 1637436 1708851 1788401 1876714
61923 1876714 1974799 2083963 2205293 2339532 2487365 2649291 2825227 3014709 3217612 3434149
61913 3434149 3663877 3904907 4153975 4406678 4657328 4898921 5123464 5322054 5484932
61904 5484932 5602655 5668243 5678457 5633320 5535424 5390162 5205653 4991230 4755747 4507279
61894 4507279 4253385 4000534 3753458 3515656 3290135 3078885 2882183 2699554 2531366
61885 2531366 2378448 2240312 2114922 2000518 1896685 1803390 1719932 1645271 1578488 1518422
61875 1518422 1463674 1413651 1369002 1330333 1296952 1267479 1241232 1218355 1198928 1182686 1169454
61864 1169454 1159272 1152090 1147760 1146291 1147723 1151798 1158019 1165923 1175112 1185212 1196049 1207579 1219337
$$ packed form
61934A241432L9857M1565M3624M6224M9416N3239N8001O4078P1415P9550Q8313
61923A876714R8085J09164J21330J34239J47833J61926J75936J89482K02903K16537
61913C434149K29728K41030K49068K52703K50650K41593K24543J98590J62878
61904E484932J17723O5588J0214m5137r7896j45262j84509k14423k35483k48468
61894D507279k53894k52851k47076k37802k25521k11250j96702j82629j68188
61885B531366j52918j38136j25390j14404j03833r3295q3458p4661o6783o0066
61875A518422n4748n0023m4649l8669l3381k9473k6247k2877j9427j6242j3232
61864A169454j0182p182m330j469J432M075O221P904R189J0100J0837J1530J1758
$$ plain form
61851 1219337 1230193 1239115 1246087 1252012 1257872 1264288 1271543 1279543 1287767 1295662 1303135 1310476 1317875 1325213
61837 1325213 1332107 1337875 1341728 1343445 1343716 1343429 1342711 1341095 1338521 1335616 1332951 1330535 1328264 1326502 1325895
61822 1325895 1326810 1329189 1332917 1338210 1345663 1355930 1369330 1385798 1405165 1427356 1452323 1480126
61810 1480126 1511241 1546432 1586045 1629769 1677492 1730018 1788383 1852699 1922405 1997628 2079552
61799 2079552 2169308 2267244 2373701 2489961 2617884 2758949 2914176 3084819 3272636 3479418
61789 3479418 3706625 3955590 4227797 4524715 4847242 5195295 5567850 5963204 6378823
61780 6378823 6810511 7251512 7692312 8120990 8523510 8883964 9185543 9412413 9551764
61771 9551764 9595407 9540788 9391312 9155680 8846551 8479176 8070074 7635363 7189078 6742461
$$ packed form
61851A219337J0856Q922O972N925N860O416P255Q000Q224P895P473P341P399P338
61837A325213O894N768L853J717K71k87p18j616k574k905k665k416k271j762o07
61822A325895R15K379L728N293P453J0267J3400J6468J9367K2191K4967K7803
61810A480126L1115L5191L9613M3724M7723N2526N8365O4316O9706P5223Q1924
61799B079552Q9756R7936J06457J16260J27923J41065J55227J70643J87817K06782
61789C479418K27207K48965K72207K96918L22527L48053L72555L95354M15619
61780F378823M31688M41001M40800M28678M02520L60454L01579K26870J39351
61771I551764M3643n4619j49476k35632l09129l67375m09102m34711m46285m46617
$$ plain form
61761 6742461 6304337 5881542 5478956 5099717 4745811 4418235 4116624 3839437 3585154
61752 3585154 3353095 3142745 2952604 2780243 2623350 2480284 2349815 2230869 2122598
61743 2122598 2024272 1934945 1853453 1778765 1710152 1647055 1589073 1535997 1487517 1442839 1400898
61732 1400898 1361064 1323505 1288854 1257606 1229686 1204298 1180197 1156447 1133012 1110558 1089722
61721 1089722 1070661 1053108 1036549 1020452 1004671 989572 975502 962226 949205 936260 923551
61710 923551 911013 898414 885973 874336 863759 853797 843973 834279 824875 815897 807770 801140 796058
61697 796058 791790 787856 784785 783290 783124 783407 783742 784337 785218 786003 786325 785769 783445 778366 770441 760539
61681 760539 749487 737562 725064 712692 700948 689663 678531 667820 658135 649727 642408 635999
$$ packed form
61761F742461m38124m22795m02586l79239l53906l27576l01611k77187k54283
61752C585154k32059k10350j90141j72361j56893j43066j30469j18946j08271
61743B122598r8326q9327q1492p4688o8613o3097n7982n3076m8480m4678m1941
61732A400898l9834l7559l4651l1248k7920k5388k4101k3750k3435k2454k0836
61721A089722j9061j7553j6559j6097j5781j5099j4070j3276j3021j2945j2709
61710I23551j2538j2599j2441j1637j0577r962r824r694r404q978q127o630n082
61697G96058m268l934l071j495j66K83L35N95Q81P85L22n56k324n079p925r902
61681G60539j1052j1925j2498j2372j1744j1285j1132j0711r685q408p319o409
$$ plain form
61669 635999 630598 626429 623616 621996 621007 619800 617561 613784 608375 601725 594537 587247 579612 571266
61655 571266 562643 554851 548486 543094 538034 533317 529203 525438 521514 517480 513915 511162 508989 507031
61641 507031 505192 503577 502299 501355 500494 499303 497644 495918 494650 493942 493638 493849 494865 496504 497992
61626 497992 498625 498322 497438 496291 495038 493801 492662 491567 490310 488707 486789 484816 482997 481204 479143
61611 479143 476864 474815 473281 472055 470921 470125 469982 470297 470631 470992 471686 472615 473345 473955 475193 477523
61595 477523 480569 483829 487484 492043 497481 503221 508903 514761 521201 528285 535760 543492 551782 561176
61581 561176 571834 583205 594579 606029 618511 632938 649450 667808 688130 710739 735494
61570 735494 761794 789370 818607 849754 881991 913596 942960 969214 991874 1010324 1023996
$$ packed form
61669F35999n401m169k813j620r89j207k239l777n409o650p188p290p635q346
61655E71266q623p792o365n392n060m717m114l765l924m034l565k753k173j958
61641E07031j839j615j278r44q61j191j659j726j268p08l04K11J016J639J488
61626D97992O33l03q84j147j253j237j139j095j257j603j918j973j819j793k061
61611D79143k279k049j534j226j134p96j43L15L34L61O94R29P30O10J238K330
61595D77523L046L260L655M559N438N740N682N858O440P084P475P732Q290R394
61581E61176J0658J1371J1374J1450J2482J4427J6512J8358K0322K2609K4755
61570G35494K6300K7576K9237L1147L2237L1605K9364K6254K2660J8450J3672
$$ plain form
61559 1023996 1032925 1037716 1038956 1037038 1032765 1027675 1023280 1020077 1017725 1016073 1015588 1016705 1019252 1022678
61545 1022678 1026434 1029894 1032376 1033699 1034474 1035337 1035923 1035044 1031993 1027302 1022013 1016499 1010361 1003401 996296
61530 996296 990163 985708 983016 981972 982564 984846 988980 995428 1004698 1016764 1031123 1047673 1067133
61517 1067133 1090221 1116825 1146524 1179648 1217073 1259116 1305340 1355536 1410161 1469648 1534072
61506 1534072 1603899 1680374 1764541 1856319 1955164 2061275 2175357 2297111 2424421 2554116
61496 2554116 2683171 2809214 2930247 3044169 3148435 3240147 3316655 3376278 3418612 3444333
61486 3444333 3454812 3451848 3437690 3415215 3387725 3358097 3327975 3297963 3268449 3239776 3211582
61475 3211582 3182553 3151090 3115830 3075383 3028193 2973244 2910644 2841324 2766755 2689409 2612796
$$ packed form
61559A023996Q929M791J240j918m273n090m395l203k352j652m85J117K547L426
61545A022678L756L460K482J323P75Q63N86q79l051m691n289n514o138o960p105
61530I96296o133m455k692j044N92K282M134O448R270J2066J4359J6550J9460
61517A067133K3088K6604K9699L3124L7425M2043M6224N0196N4625N9487O4424
61506A534072O9827P6475Q4167R1778R8845J06111J14082J21754J27310J29695
61496B554116J29055J26043J21033J13922J04266R1712P6508N9623M2334K5721
61486C444333J0479k964j4158k2475k7490k9628l0122l0012k9514k8673k8194
61475C211582k9029l1463l5260m0447m7190n4949o2600o9320p4569p7346p6613
$$ plain form
61464 2612796 2540086 2472801 2411375 2356587 2309568 2270558 2238692 2213207 2194033 2180990 2173219
61453 2173219 2169888 2170864 2176229 2185674 2198875 2216128 2238026 2264666 2295647 2330735 2370229 2414722
61441 2414722 2464754 2520487 2581225 2645021 2708730 2768369 2819589 2858595 2883446 2894790 2895153 2887449
61429 2887449 2874202 2857753 2840351 2823583 2807939 2793374 2780302 2769794 2762850 2759860 2761028 2766985
61417 2766985 2778304 2794052 2810979 2824364 2829697 2823728 2804676 2772465 2729170 2678793 2625866 2573810
61405 2573810 2524336 2478088 2435613 2397715 2365033 2337422 2313856 2293023 2274116 2257123 2242518
61394 2242518 2230774 2222102 2216494 2213986 2215026 2220621 2232023 2250174 2275398 2307554 2346494 2392481
61382 2392481 2446293 2508846 2580601 2661362 2750623 2847893 2952531 3063464 3179333 3298794
$$ packed form
61464B612796p2710o7285o1426n4788m7019l9010l1866k5485j9174j3043p771
61453B173219l331R76N365R445J3201J7253K1898K6640L0981L5088L9494M4493
61441B414722N0032N5733O0738O3796O3709N9639N1220L9006K4851J1344L63p704
61429B887449j3247j6449j7402j6768j5644j4565j3072j0508o944k990J168N957
61417B766985J1319J5748J6927J3385N333n969j9052l2211m3295n0377n2927n2056
61405B573810m9474m6248m2475l7898l2682k7611k3566k0833j8907j6993j4605
61394B242518j1744q672n608k508J040N595J1402J8151K5224L2156L8940M5987
61382B392481N3812O2553P1755Q0761Q9261R7270J04638J10933J15869J19461
$$ plain form
61372 3298794 3420323 3541622 3659415 3769844 3868970 3952997 4018454 4062553 4083631 4081571 4058013
61361 4058013 4015954 3958593 3888188 3805943 3712841 3610375 3500531 3385401 3266923 3146747
61351 3146747 3026292 2907055 2790900 2679712 2574630 2475773 2382881 2296096 2216080 2143501
61341 2143501 2078498 2020511 1968677 1922619 1882853 1850199 1824710 1805507 1791704 1783171 1780146 1782519
61329 1782519 1789895 1802153 1819430 1841435 1867051 1894719 1923012 1950750 1976734 1999666 2018574
61318 2018574 2033460 2045443 2056026 2066066 2075528 2084173 2092239 2100303 2108791 2117925 2127908 2138728 2149843
61305 2149843 2160498 2170577 2180847 2192163 2204558 2217247 2229334 2240214 2249395 2256317 2260588 2262283
61293 2262283 2261727 2258969 2253653 2245540 2234978 2222588 2208522 2192505 2174873 2157334 2142150 2130497
$$ packed form
61372C298794J21529J21299J17793J10429R9126Q4027O5457M4099K1078k060k3558
61361D058013m2059n7361p0405q2245r3102j02466j09844j15130j18478j20176
61351C146747j20455j19237j16155j11188j05082r8857r2892q6785q0016p2579
61341B143501o5003n7987n1834m6058l9766l2654k5489j9203j3803q533l025K373
61329A782519P376J2258J7277K2005K5616K7668K8293K7738K5984K2932J8908
61318B018574J4886J1983J0583J0040R462Q645Q066Q064Q488R134R983J0820J1115
61305B149843J0655J0079J0270J1316J2395J2689J2087J0880R181O922M271J695
61293B262283n56k758n316q113j0562j2390j4066j6017j7632j7539j5184j1653
$$ plain form
61281 2130497 2121936 2115577 2111226 2108959 2107970 2106522 2103098 2097038 2088000 2075550 2059827 2042136 2024190
61268 2024190 2006872 1990160 1974046 1958845 1944716 1931634 1920069 1911114 1905688 1904079 1906397 1912860
61256 1912860 1923311 1937111 1954063 1975025 2001166 2033096 2071315 2116909 2170916 2233290 2303328
61245 2303328 2380890 2466181 2558282 2654752 2752619 2848400 2936618 3009509 3059701 3083400 3080889
61234 3080889 3054707 3008255 2945773 2872248 2792452 2710061 2627767 2547979 2473235 2406010 2348282
61223 2348282 2301299 2265783 2242202 2230491 2229239 2235214 2243756 2249677 2248150 2235642 2210820 2174713
61211 2174713 2129799 2078848 2024477 1969214 1915346 1864594 1818087 1776565 1740332 1709012 1681668
61200 1681668 1657234 1634823 1613709 1593331 1573290 1553209 1532653 1511403 1489811 1468603 1448242
$$ packed form
61281B130497q561o359m351k267r89j448l424o060r038j2450j5723j7691j7946
61268B024190j7318j6712j6114j5201j4129j3082j1565q955n426j609K318O463
61256A912860J0451J3800J6952K0962K6141L1930L8219M5594N4007O2374P0038
61245B303328P7562Q5291R2101R6470R7867R5781Q8218P2891N0192K3699k511
61234C080889k6182m6452o2482p3525p9796q2391q2294p9788p4744o7225n7728
61223B348282m6983l5516k3581j1711j252N975Q542N921j527j2508k4822l6107
61211B174713m4914n0951n4371n5263n3868n0752m6507m1522l6233l1320k7344
61200A681668k4434k2411k1114k0378k0041k0081k0556k1250k1592k1208k0361
$$ plain form
61189 1448242 1428603 1409303 1390131 1371094 1352250 1333674 1315547 1298177 1281936 1267179 1254044
61178 1254044 1242258 1231256 1220674 1210721 1201979 1194924 1189749 1186502 1185099 1185003 1185088 1183890 1179912 1171680
61164 1171680 1157959 1138411 1113995 1086429 1057256 1027708 999133 972729 948610 925709 903080
61153 903080 880894 859827 840033 821375 804210 789001 775215 761575 747671 734593 723525
61142 723525 714280 705726 697271 689354 682663 677443 673640 671252 670273 670482 671601 673763 677677 684109 693093
61127 693093 703755 715010 726265 737416 748379 758927 768694 776994 782791 785386 785204 783485 781103
61114 781103 778054 774171 769935 766330 764122 763420 763733 764321 764709 764952 765298 765634 765506 764593 762859 760281
61098 760281 756844 752799 748506 743976 739010 733822 728949 724436 719742 714756 710287 707026 704447 701353
$$ packed form
61189A448242j9639j9300j9172j9037j8844j8576j8127j7370j6241j4757j3135
61178A254044j1786j1002j0582r953q742p055n175l247j403r6Q5j198l978q232
61164A171680j3721j9548k4416k7566k9173k9548k8575k6404k4119k2901k2629
61153I03080k2186k1067j9794j8658j7165j5209j3786j3640j3904j3078j1068
61142G23525r245q554q455p917o691n220l803k388r79K09J119K162L914O432Q984
61127F93093J0662J1255J1255J1151J0963J0548R767Q300N797K595j82j719k382
61114G81103l049l883m236l605k208p02L13N88L88K43L46L36j28r13j734k578
61098G60281l437m045m293m530m966n188m873m513m694m986m469l261k579l094
$$ plain form
61084 701353 697332 693173 689860 687590 685890 684486 683858 684842 687638 691456 695406 699557 704671 710956 717636
61069 717636 723850 729477 734986 741006 748204 756976 766964 777352 787867 798904 810351 821054 829984
61056 829984 837427 844434 851548 858691 865911 873485 881463 889769 898686 908739 920118 932688 946521
61043 946521 962020 979522 999056 1020443 1043404 1067731 1093597 1121618 1152463 1186628 1224657
61032 1224657 1267187 1314514 1366440 1422771 1483560 1548550 1616733 1686830 1758076 1830673 1906093
61021 1906093 1987241 2077653 2180070 2296063 2426918 2573908 2737491 2917604 3116020 3338346
61011 3338346 3593652 3893087 4249052 4674057 5179199 5774985 6475270 7300250 8275819
61002 8275819 9433184 10813052 12470708 14472126 16871652 19665263 22726481 25763467
$$ packed form
61084G01353m021m159l313k270j700j404o28R84K796L818L950M151N114O285O680
61069G17636O214N627N509O020P198Q772R988J0388J0515J1037J1447J0703Q930
61056H29984P443P007P114P143P220P574P978Q306Q917J0053J1379J2570J3833
61043I46521J5499J7502J9534K1387K2961K4327K5866K8021L0845L4165L8029
61032A224657M2530M7327N1926N6331O0789O4990O8183P0097P1246P2597P5420
61021A906093Q1148R0412J02417J15993J30855J46990J63583J80113J98416K22326
61011C338346K55306K99435L55965M25005N05142N95786P00285Q24980R75569
61002H275819J157365J379868J657656K001418K399526K793611L061218L036986
$$ plain form
60994 25763467 28359347 30121846 30873240 30748523 30125811 29447142 29059180 29141335 29685730
60985 29685730 30481694 31134404 31182468 30297858 28443415 25869540 22961002 20059671 17376047
60976 17376047 14999506 12945826 11193616 9705462 8443670 7378745 6486983 5744636
60968 5744636 5127695 4615292 4189901 3834732 3533474 3272885 3044190 2841884 2662107
60959 2662107 2501757 2357847 2227413 2108404 2000184 1902506 1814424 1734738 1662702 1597277
60949 1597277 1536215 1477016 1418726 1362111 1308418 1258728 1214143 1175521 1142859 1115459 1092528
60938 1092528 1073094 1055678 1038889 1022302 1006277 991115 976919 963940 952315 941582 931111
60927 931111 920924 911510 902958 894804 886629 878251 869495 860322 851095 842233 833665 824940 815703 805765
$$ packed form
60994B5763467K595880J762499P51394j24717o22712o78669l87962Q2155N44395
60985B9685730P95964O52710M8064q84610j854443k573875k908538k901331k683624
60976A7376047k376541k053680j752210j488154j261792j064925q91762p42347
60968E744636o16941n12403m25391l55169l01258k60589k28695k02306j79777
60959B662107j60350j43910j30434j19009j08220r7678q8082p9686p2036o5425
60949A597277o1062n9199n8290n6615n3693m9690m4585l8622l2662k7400k2931
60938A092528j9434j7416j6789j6587j6025j5162j4196j2979j1625j0733j0471
60927I31111j0187r414q552q154q175q378q756r173r227q862q568q725r237r938
$$ plain form
60913 805765 795140 784433 774681 766209 758098 749499 740983 733736 727744 721738 714756 706833 698370 689855
60899 689855 682204 676249 671588 666740 660766 654149 647942 642811 639084 636890 635848 635180 634489 634037 634124
60884 634124 634699 635746 637416 639574 641723 643609 645353 646812 647440 647054 646139 645069 643616 641636 639749
60869 639749 638877 639402 641125 643707 646821 650260 654258 659359 665577 671926 677036 680042 680751 679490 677172
60854 677172 675069 673999 673853 674208 674946 675705 675046 670959 662423 650134 635704 620578 605780 592121
60840 592121 580153 569980 561390 554210 548425 543946 540478 537756 535805 534641 533720 532064 529252 526096
60826 526096 523899 523093 522919 522486 521752 521348 521745 522813 524049 525063 525828 526508 527048 527125 526623 526056 526263 527792
60808 527792 530699 534629 538738 541850 543320 543741 544268 545207 545803 545384 544154 542775 541790 541644 542501 543629
$$ packed form
60913H05765j0625j0707r752q472q111q599q516p247n992o006o982p923q463q515
60899F89855p651n955m661m848n974o617o207n131l727k194j042o68o91m52Q7
60884F34124N75J047J670K158K149J886J744J459O28l86r15j070j453j980j887
60869F39749q72N25J723K582L114L439L998N101O218O349N110L006P09j261k318
60854F77172k103j070j46L55P38P59o59m087q536j2289j4430j5126j4798j3659
60840E92121j1968j0173q590p180n785m479l468k722j951j164r21j656k812l156
60826E26096k197q06j74m33p34m04L97J068J236J014P65O80N40P7n02n67K07J529
60808E27792K907L930M109L112J470M21N27R39N96m19j230j379r85j46Q57J128
$$ plain form
60792 543629 543607 541716 538737 535822 532998 529448 524998 520546 516972 514270 511940 509733 507649 505518 503040
60777 503040 500254 497713 495985 495055 494393 493648 493086 493150 493773 494386 494531 494160 493415 492530 491991 492348 493681 495559
60759 495559 497628 499840 502015 503681 504670 505464 506561 507819 508827 509573 510259 510639 510116 508501 506222 503750
60743 503750 501170 498382 495425 492506 489867 487716 486136 485034 484220 483478 482565 481338 479978 478805 477678
60728 477678 475887 472936 469205 465472 461973 458353 454389 450297 446336 442511 438708 434766 430429 425675
60714 425675 421083 417454 414908 412772 410519 408400 406910 406063 405567 405472 406172 407778 409795 411502 412569
60699 412569 413276 414154 415342 416360 416681 416546 416847 418130 420106 422371 425128 428693 432565 435724 437877
60684 437877 439767 442103 444754 447332 450042 453403 457387 461369 464876 467936 470701 473143 475180 476757
$$ packed form
60792E43629k2j891k979k915k824l550m450m452l574k702k330k207k084k131k478
60777E03040k786k541j728r30o62p45n62O4O23O13J45l71p45q85n39L57J333J878
60759D95559K069K212K175J666R89P94J097J258J008P46O86L80n23j615k279k472
60743E03750k580k788k957k919k639k151j580j102q14p42r13j227j360j173j127
60728D77678j791k951l731l733l499l620l964m092l961l825l803l942m337m754
60714D25675m592l629k546k136k253k119j490q47m96r5P00J606K017J707J067
60699D12569P07Q78J188J018L21j35L01J283J976K265K757L565L872L159K153
60684D37877J890K336K651K578K710L361L984L982L507L060K765K442K037J577
$$ plain form
60670 476757 477744 478080 478175 478850 480677 483485 486584 489296 491270 492632 494010 496116 499018 502017 504427
60655 504427 506275 508034 509833 511205 511483 510203 507260 502969 497935 492714 487614 482823 478445 474275
60641 474275 469971 465706 462207 459679 457133 453477 449015 445071 442270 440023 437763 435705 434047 432253
60627 432253 429736 426677 423607 420665 417856 415594 414275 413533 412598 411310 410187 409509 408850 407658 405917
60612 405917 404176 403233 403758 405797 408580 411105 413013 414641 416246 417615 418497 419031 419479 419872 420179 420609
60596 420609 421401 422359 422920 422755 422141 421631 421450 421338 421013 420613 420467 420487 420167 419396 419014 420107 422739 425780
60578 425780 428117 429714 431270 433133 434959 436365 437540 439072 441424 444689 448628 452671 456003 457981
60564 457981 458589 458378 457942 457650 457800 458700 460372 462457 464776 467828 472346 478404 485303 492412 499779 507848
$$ packed form
60670D76757R87L36R5O75J827K808L099K712J974J362J378K106K902K999K410
60655E04427J848J759J799J372K78j280k943m291n034n221n100m791m378m170
60641D74275m304m265l499k528k546l656m462l944k801k247k260k058j658j794
60627D32253k517l059l070k942k809k262j319p42r35j288j123o78o59j192j741
60612D05917j741r43N25K039K783K525J908J628J605J369Q82N34M48L93L07M30
60596D20609P92R58N61j65o14n10j81j12l25m00j46K0l20p71l82J093K632L041
60578D25780K337J597J556J863J826J406J175J532K352L265L939M043L332J978
60564D57981O08k11m36k92J50R00J672K085K319L052M518O058O899P109P367Q069
$$ plain form
60548 507848 516989 527580 540268 555728 574242 595738 620255 648200 680208 716928 758935 806582
60536 806582 859811 917947 979468 1041755 1101146 1153426 1194479 1220784 1229910 1221173 1196068 1157907
60524 1157907 1110803 1058788 1005487 954014 906646 864418 827182 794338 765684 741673 722962
60513 722962 709814 701847 698149 697629 699639 704530 713382 726931 744928 766885 793182 824951 862970
60500 862970 907211 957379 1013023 1072623 1133022 1190215 1240453 1280505 1307664 1320444 1319369 1306760
60488 1306760 1285917 1260789 1235923 1215693 1203184 1200026 1207287 1226003 1256760 1299215 1352274 1414358
60476 1414358 1483041 1554395 1622853 1681836 1724819 1746431 1743261 1714282 1661053 1587710 1500353
60465 1500353 1405607 1309046 1214567 1124792 1041677 966639 900310 842340 791591 746796 707313
$$ packed form
60548E07848R141J0591J2688J5460J8514K1496K4517K7945L2008L6720M2007M7647
60536H06582N3229N8136O1521O2287N9391N2280M1053K6305R126q737k5105l8161
60524A157907m7104n2015n3301n1473m7368m2228l7236l2844k8654k4011j8711
60513G22962j3148p967l698n20K010M891Q852J3549J7997K1957K6297L1769L8019
60500H62970M4241N0168N5644N9600O0399N7193N0238M0052K7159J2780j075j2609
60488A306760k0843k5128k4866k0230j2509l158P261J8716L0757M2455N3059O2084
60476A414358O8683P1354O8458N8983M2983K1612l170k8979n3229p3343q7357
60465A500353r4746r6561r4479q9775q3115p5038o6329n7970n0749m4795l9483
$$ plain form
60454 707313 673213 644506 620412 599597 581021 564369 549718 537117 526484 517702 510747 505766
60442 505766 502862 501632 501108 500489 499812 499580 499857 500224 500558 501271 502583 504033 504981 505267 505059 504368 503096
60425 503096 501429 499790 498360 496867 495002 492950 491398 490947 491481 492358 493322 495073 498595 504034 510567
60410 510567 517379 524381 531889 540031 548667 557705 567289 577843 589951 603927 619403 635598 652047
60397 652047 668714 685392 701538 716881 731573 745342 757053 765785 771991 776934 781209 784528
60385 784528 786874 788987 791492 794158 796412 798101 799383 800117 799784 797973 794800 790994 787582 785275 783982
60370 783982 783049 781972 780694 779287 777783 776414 775589 775408 775506 775530 775387 774812 773238 770525 767436 764841
60354 764841 762787 760912 759473 759149 759858 760510 760050 758121 754642 749519 743119 736309 729566 722535 714948
$$ packed form
60454G07313l4100k8707k4094k0815j8576j6652j4651j2601j0633q782o955m981
60442E05766k904j230n24o19o77k32K77L67L34P13J312J450R48K86k08o91j272
60425E03096j667j639j430j493j865k052j552m51N34Q77R64J751L522N439O533
60410E10567O812P002P508Q142Q636R038R584J0554J2108J3976J5476J6195J6449
60397F52047J6667J6678J6146J5343J4692J3769J1711Q732O206M943M275L319
60385G84528K346K113K505K666K254J689J282P34l33j811l173l806l412k307j293
60370G83982r33j077j278j407j504j369q25j81R8K4j43n75j574k713l089k595
60354G64841k054j875j439l24P09O52m60j929l479n123o400o810o743p031p587
$$ plain form
60339 714948 707409 700717 694883 689496 684679 680869 677853 674828 671400 667793 664037 659702 654660 649400
60325 649400 644308 639196 633870 628580 623566 618671 613805 609274 605151 600808 595708 590357 585800 582413
60311 582413 579862 578174 578075 580043 583524 587352 590689 593495 596478 600764 607240 615977 626360 637751
60297 637751 649638 661069 670496 676565 678901 677796 673426 665855 655792 644863 634826 626640 620388
60284 620388 615881 613041 611723 611517 611999 613083 614944 617643 621046 625081 629792 635056 640600 646434 653010
60269 653010 660695 669306 678476 688255 698930 710421 722379 734886 748516 763553 779616 796325
60257 796325 813819 832142 850383 867049 881385 893960 905886 917798 929753 941793 954203
60246 954203 967273 981145 996084 1012701 1031635 1053044 1076643 1102301 1130447 1161781 1196764
$$ packed form
60339G14948p539o692n834n387m817l810l016l025l428l607l756m335n042n260
60325F49400n092n112n326n290n014m895m866m531m123m343n100n351m557l387
60311E82413k551j688r9J968L481L828L337K806K983M286O476Q737J0383J1391
60297F37751J1887J1431R427O069K336j105m370p571j0063j0929j0037q186o252
60284F20388m507k840j318k06M82J084J861K699L403M035M711N264N544N834O576
60269F53010P685Q611R170R779J0675J1491J1958J2507J3630J5037J6063J6709
60257G96325J7494J8323J8241J6666J4336J2575J1926J1912J1955J2040J2410
60246I54203J3070J3872J4939J6617J8934K1409K3599K5658K8146L1334L4983
$$ plain form
60235 1196764 1235508 1278023 1324339 1374484 1428568 1486871 1549667 1616976 1688606 1764288 1843518
60224 1843518 1925266 2008136 2090835 2172250 2251116 2325951 2395481 2458871 2515456 2564570 2605867
60213 2605867 2639500 2665750 2684658 2696292 2701142 2699836 2692658 2679845 2662463 2642514 2621935 2601742
60201 2601742 2582356 2564478 2549292 2537929 2531198 2529927 2535216 2548103 2569154 2598590 2636668 2683607
60189 2683607 2739124 2802356 2872238 2947527 3026175 3105005 3180564 3250392 3313281 3368334 3414165
60178 3414165 3449130 3471965 3481982 3478858 3462542 3433268 3391363 3337121 3271203 3195288 3112143
60167 3112143 3024918 2936426 2849062 2765084 2686640 2615519 2553062 2500347 2458299 2427509 2408034
60156 2408034 2399442 2401017 2411851 2430771 2456275 2486519 2519386 2552656 2584197 2612023 2634255 2649338
$$ packed form
60235A196764L8744M2515M6316N0145N4084N8303O2796O7309P1630P5682P9230
60224A843518Q1748Q2870Q2699Q1415P8866P4835O9530O3390N6585M9114M1297
60213B605867L3633K6250J8908J1634M850j306p178j2813j7382j9949k0579k0193
60201B601742j9386j7878j5186j1363o731j271N289J2887K1051K9436L8078M6939
60189B683607N5517O3232O9882P5289P8648P8830P5559O9828O2889N5053M5831
60178C414165L4965K2835J0017l124j6316k9274m1905n4242o5918p5915q3145
60167C112143q7225q8492q7364q3978p8444p1121o2457n2715m2048l0790j9475
60156B408034q592J575J0834J8920K5504L0244L2867L3270L1541K7826K2232J5083
$$ plain form
60144 2649338 2656563 2656320 2649544 2636821 2618165 2593712 2564470 2532300 2499309 2467295 2437619 2411369
60132 2411369 2389589 2373349 2363640 2361359 2367453 2382923 2408463 2444299 2490737 2548817 2619950 2704872
60120 2704872 2803366 2915140 3040409 3179318 3331300 3495368 3670531 3855225 4046611 4241142
60110 4241142 4435768 4627960 4814534 4991153 5153300 5297410 5420960 5521942 5598623 5649608
60100 5649608 5673905 5671034 5641255 5585579 5505672 5403981 5283856 5148984 5002474 4846806
60090 4846806 4684899 4520748 4358570 4201519 4051591 3910659 3781102 3665304 3564810
60081 3564810 3480159 3411443 3358832 3322520 3302331 3297577 3307337 3330629 3366094 3411685 3464936 3523404
60069 3523404 3584507 3645008 3701204 3749867 3788818 3816617 3832112 3834449 3823185 3798208 3759898
$$ packed form
60144B649338P225k43o776j2723j8656k4453k9242l2170l2991l2014k9676k6250
60132B411369k1780j6240r709k281O094J5470K5540L5836M6438N8080P1133Q4922
60120B704872R8494J11774J25269J38909J51982J64068J75163J84694J91386J94531
60110D241142J94626J92192J86574J76619J62147J44110J23550J00982P6681N0985
60100E649608K4297k871k9779n5676p9907j01691j20125j34872j46510j55668
60090D846806j61907j64151j62178j57051j49928j40932j29557j15798j00494
60081C564810q4651o8716n2611l6312k0189m754R760K3292L5465M5591N3251N8468
60069C523404O1103O0501N6196M8663L8951K7799J5495K337j1264k4977l8310
$$ plain form
60058 3759898 3709489 3648796 3579228 3501468 3416483 3326393 3233733 3140186 3046680 2954603 2866165
60047 2866165 2783533 2708285 2641791 2585313 2539328 2503472 2477727 2463186 2460979 2470801 2491327 2522002
60035 2522002 2563527 2616364 2679471 2750881 2828866 2911775 2997022 3081033 3160414 3232852 3296823
60024 3296823 3350834 3393153 3422132 3436721 3436796 3423021 3396213 3356819 3305182 3242282 3170030 3090884
60012 3090884 3007447 2922371 2838161 2756850 2680073 2609533 2547040 2493939 2450744 2417510 2394275
60001 2394275 2381105 2378151 2385929 2405117 2435731 2476896 2527823 2588718 2660328 2742875 2835783 2938062
59989 2938062 3048282 3164233 3283072 3401713 3516738 3624314 3720893 3803953 3871797 3923047
59979 3923047 3957072 3974492 3976198 3961785 3929897 3880274 3814697 3735905 3646699 3550503 3451546
$$ packed form
60058C759898n0409o0693o9568p7760q4985r0090r2660r3547r3506r2077q8438
60047B866165q2632p5248o6494n6478m5985l5856k5745j4541k207R822K0526L0675
60035B522002M1525N2837O3107P1410P7985Q2909Q5247Q4011P9381P2438O3971
60024C296823N4011M2319K8979J4589P5j3775k6808l9394n1637o2900p2252p9146
60012C090884q3437q5076q4210q1311p6777p0540o2493n3101m3195l3234k3235
60001B394275j3170k954P778J9188L0614M1165N0927O0895P1610Q2547R2908J02279
59989B938062J10220J15951J18839J18641J15025J07576R6579Q3060O7844N1250
59979C923047L4025J7420J706j4413l1888m9623o5577p8792q9206r6196r8957
$$ plain form
59968 3451546 3353512 3258587 3168618 3086612 3016012 2958630 2914098 2881341 2859931 2850051 2851900 2865465
59956 2865465 2890533 2926617 2972958 3028631 3092516 3163131 3238636 3316957 3395873 3473149 3546732
59945 3546732 3614807 3675808 3728771 3773776 3811590 3842528 3865917 3880933 3887678 3887247 3881209 3871532
59933 3871532 3860704 3851290 3845395 3844960 3852416 3870413 3900851 3944699 4002968 4077341 4169498 4280095
59921 4280095 4408751 4554925 4718315 4898174 5092282 5296676 5506262 5715494 5918427
59912 5918427 6108480 6278563 6421605 6531129 6601913 6630927 6617964 6565149 6475883 6354645
59902 6354645 6207708 6043163 5869433 5693616 5521140 5356266 5202310 5061621 4935917
59893 4935917 4826704 4735205 4662215 4608403 4574584 4561289 4568334 4595238 4641904 4708337 4793754
$$ packed form
59968C451546r8034r4925q9969q2006p0600n7382m4532l2757k1410r880J849J3565
59956B865465K5068L6084M6341N5673O3885P0615P5505P8321P8916P7276P3583
59945C546732O8075O1001N2963M5005L7814L0938K3389J5016O745m31o038r677
59933C871532j0828r414n895m35P456J7997L0438M3848N8269P4373R2157J10597
59921D280095J28656J46174J63390J79859J94108K04394K09586K09232K02933
59912E918427J90053J70083J43042J09524P0784K9014j2963n2815q9266j21238
59902F354645j46937j64545j73730j75817j72476j64874j53956j40689j25704
59893D935917j09213r1499p2990n3812l3819j3295P045K6904M6666O6433Q5417
$$ plain form
59882 4793754 4896536 5015138 5148337 5293987 5447486 5601531 5747370 5876556 5982192
59873 5982192 6059325 6104836 6117409 6097750 6048448 5973105 5875306 5758263 5625165 5479467 5324810
59862 5324810 5164812 5002959 4842554 4686637 4537927 4398854 4271696 4158653 4061597 3981521
59852 3981521 3918428 3872089 3842785 3830825 3835328 3854044 3884558 3925209 3974648 4031173 4093057
59841 4093057 4159286 4229524 4303455 4380126 4457264 4530609 4594217 4642015 4669310 4673276 4653230
59830 4653230 4611356 4552624 4482925 4406985 4328089 4248857 4171026 4094593 4018285 3941326 3864217
59819 3864217 3787787 3712252 3637549 3564093 3492895 3425231 3362305 3304792 3252430 3204252 3159211
59808 3159211 3116371 3074772 3033711 2993241 2953852 2915607 2878163 2841903 2808548 2780250 2758334
$$ packed form
59882D793754J02782J18602J33199J45650J53499J54045J45839J29186J05636
59873E982192P7133M5511J2573j9659m9302p5343r7799j17043j33098j45698j54657
59862E324810j59998j61853j60405j55917j48710j39073j27158j13043r7056q0076
59852C981521o3093m6339k9304j1960M503J8716L0514M0651M9439N6525O1884
59841D093057O6229P0238P3931P6671P7138P3345O3608M7798K7295L966k0046
59830D653230m1874n8732o9699p5940p8896p9232p7831p6433p6308p6959p7109
59819C864217p6430p5535p4703p3456p1198o7664o2926n7513n2362m8178m5041
59808C159211m2840m1599m1061m0470l9389l8245l7444l6260l3355k8298k1916
$$ plain form
59797 2758334 2743140 2734863 2734315 2743015 2762711 2794809 2840284 2900224 2976232 3069996 3182631 3314760
59785 3314760 3467021 3639812 3832174 4040771 4259274 4477642 4681698 4854360 4978850
59776 4978850 5042560 5040018 4974137 4855301 4698342 4518863 4330634 4144475 3967874 3805159
59766 3805159 3658567 3529443 3418468 3325236 3248506 3187032 3139735 3105168 3081569 3067615 3062606
59755 3062606 3065917 3076853 3095035 3120145 3151189 3186963 3227582 3274718 3329805 3392719 3462766
59744 3462766 3540263 3626387 3722015 3827583 3943885 4072233 4213857 4369737 4540969 4728775
59734 4728775 4934052 5157255 5398770 5659063 5938297 6235767 6549486 6876017 7210673
59725 7210673 7547915 7881473 8204388 8509654 8791592 9046934 9275074 9478014 9660321
$$ packed form
59797B758334j5194q277n48Q700J9696L2098M5475N9940P6008R3764J12635J32129
59785C314760J52261J72791J92362K08597K18503K18368K04056J72662J24490
59776D978850O3710k542o5881j18836j56959j79479j88229j86159j76601j62715
59766C805159j46592j29124j10975r3232p6730o1474m7297l4567k3599j3954n009
59755C062606L311J0936J8182K5110L1044L5774M0619M7136N5087O2914P0047
59744C462766P7497Q6124R5628J05568J16302J28348J41624J55880J71232J87806
59734D728775K05277K23203K41515K60293K79234K97470L13719L26531L34656
59725G210673L37242L33558L22915L05266K81938K55342K28140K02940J82307
$$ plain form
59716 9660321 9828411 9989019 10147998 10310189 10479516 10658301 10846480 11041827 11240992
59707 11240992 11440126 11634830 11820119 11990912 12142848 12272967 12379764 12462617 12521365 12556812
59697 12556812 12571504 12569465 12555059 12532628 12507317 12485415 12473307 12476425 12499549 12547531 12625027
59686 12625027 12735817 12882901 13068935 13295773 13563421 13869801 14211514 14584428 14983502
59677 14983502 15402200 15831825 16260858 16674837 17057243 17390981 17659666 17848666 17946329
59668 17946329 17945273 17843314 17643872 17355797 16992333 16569435 16104314 15614525 15116792 14625150
59658 14625150 14149313 13693973 13258370 12835687 12413604 11977521 11515522 11022437 10501183
59649 10501183 9961413 9416391 8879340 8360779 7867707 7404086 6971655 6570778 6201204
$$ packed form
59716I660321J68090J60608J58979J62191J69327J78785J88179J95347J99165
59707A1240992J99134J94704J85289J70793J51936J30119J06797Q2853N8748L5447
59697A2556812J4692k039j4406k2431k5311k1902j2108L118K3124M7982P7496
59686A2625027J10790J47084J86034K26838K67648L06380L41713L72914L99074
59677A4983502M18698M29625M29033M13979L82406L33738K68685J89000R7663
59668A7946329j056j01959j99442k88075l63464m22898m65121m89789m97733m91642
59658A4625150m75837m55340m35603m22683m22083m36083m61999m93085n21254
59649A0501183n39770n45022n37051n18561m93072m63621m32431m00877l69574
$$ plain form
59640 6201204 5862211 5552204 5268807 5009904 4774377 4561489 4369875 4197672 4043323
59631 4043323 3905713 3783610 3675591 3580521 3497636 3426038 3364402 3311209 3264957 3224185 3187562
59620 3187562 3153944 3122212 3091330 3060882 3031269 3002888 2975225 2947116 2917688 2886508 2853005
59609 2853005 2816519 2777152 2736087 2694777 2654033 2613971 2574504 2535784 2498495 2463819 2432788
59598 2432788 2405389 2380400 2356262 2332131 2308211 2285356 2264493 2246249 2230909 2218500 2208820
59587 2208820 2201526 2196575 2194587 2196386 2202046 2210730 2221662 2234808 2250365 2268170 2288065 2310401
59575 2310401 2335614 2363628 2394319 2428238 2466193 2508324 2554290 2604256 2658964 2718893 2784053
59564 2784053 2854583 2930796 3012495 3099053 3190416 3287377 3390540 3499586 3613909 3733389
$$ packed form
59640F201204l38993l10007k83397k58903k35527k12888j91614j72203j54349
59631D043323j37610j22103j08019r5070q2885p1598o1636n3193m6252m0772l6623
59620C187562l3618l1732l0882l0448k9613k8381k7663k8109k9428l1180l3503
59609B853005l6486l9367m1065m1310m0744m0062l9467l8720l7289l4676l1031
59598B432788k7399k4989k4138k4131k3920k2855k0863j8244j5340j2409r680
59587B208820p294m951j988J799N660Q684J0932J3146J5557J7805J9895K2336
59575B310401K5213K8014L0691L3919L7955M2131M5966M9966N4708N9929O5160
59564B784053P0530P6213Q1699Q6558R1363R6961J03163J09046J14323J19480
$$ plain form
59554 3733389 3858076 3987387 4120069 4254742 4390240 4525524 4659259 4788947 4910128
59545 4910128 5016838 5103507 5166838 5206326 5223616 5221463 5202602 5168827 5120972 5059806 4986714
59534 4986714 4903441 4811636 4713133 4610534 4507111 4406034 4309840 4220638 4140645 4072349 4018112
59523 4018112 3979622 3957868 3953729 3968421 4003204 4058823 4135519 4233342 4351896 4489614 4643541
59512 4643541 4809809 4983821 5159748 5330208 5486885 5621594 5727023 5797159 5827762 5816858
59502 5816858 5764964 5674911 5551255 5399375 5224888 5033810 4832996 4629877 4431401 4242948
59492 4242948 4067915 3907995 3764072 3637234 3528979 3440288 3370762 3319154 3284564 3266626
59482 3266626 3264779 3278143 3306217 3348854 3405189 3473154 3550383 3634938 3724703 3816707 3907736
$$ packed form
59554C733389J24687J29311J32682J34673J35498J35284J33735J29688J21181
59545D910128J06710Q6669O3331L9488J7290k153j8861l3775m7855o1166p3092
59534D986714q3273r1805r8503j02599j03423j01077r6194q9202p9993o8296n4237
59523D018112l8490k1754m139J4692L4783N5619P6696R7823J18554J37718J53927
59512D643541J66268J74012J75927J70460J56677J34709J05429P0136L0603j0904
59502E816858n1894r0053j23656j51880j74487j91078k00814k03119j98476j88453
59492D242948j75033j59920j43923j26838j08255q8691o9526n1608l4590j7938
59482C266626j847J3364K8074M2637N6335O7965P7229Q4555Q9765R2004R1029
$$ plain form
59471 3907736 3995238 4076780 4148790 4206638 4246207 4265003 4261851 4236310 4188850 4121103 4035308
59460 4035308 3933508 3817707 3690709 3556241 3417879 3278114 3138800 3002128 2870463
59451 2870463 2745202 2626470 2514234 2409157 2311907 2222206 2139211 2062543 1992281 1928262
59441 1928262 1870121 1817908 1771867 1731624 1696396 1665998 1640802 1620476 1603732 1589769 1579244
59430 1579244 1573223 1571735 1573948 1579275 1587707 1599440 1614688 1633350 1653924 1672922 1686257 1691737
59418 1691737 1690205 1684572 1678212 1674001 1673897 1678772 1688611 1703017 1721427 1742777 1765104 1785705 1802199
59405 1802199 1814062 1823422 1833994 1848791 1868773 1893574 1923003 1957442 1997230 2042328 2092671
59394 2092671 2148441 2209923 2277396 2351250 2432012 2520199 2616202 2720210 2832036 2951134 3076936
$$ packed form
59471C907736Q7502Q1542P2010N7848L9569J8796l152k5541m7460o7747q5795
59460D035308j01800j15801j26998j34468j38362j39765j39314j36672j31665
59451B870463j25261j18732j12236j05077r7250q9701q2995p6668p0262o4019
59441A928262n8141n2213m6041m0243l5228l0398k5196k0326j6744j3963j0525
59430A579244o021j488K213N327Q432J1733J5248J8662K0574J8998J3335N480
59418A691737j532n633o360m211j04M875R839J4406J8410K1350K2327K0601J6494
59405A802199J1863R360J0572J4797J9982K4801K9429L4439L9788M5098N0343
59394B092671N5770O1482O7473P3854Q0762Q8187R6003J04008J11826J19098J25802
$$ plain form
59383 3076936 3209076 3347124 3490338 3638136 3790894 3950206 4118514 4298738 4494111
59374 4494111 4707776 4942189 5198769 5477956 5779182 6100534 6438385 6787353 7140675
59365 7140675 7490940 7831003 8154752 8457474 8735940 8988333 9213937 9412620 9584412
59356 9584412 9729292 9846820 9935523 9992656 10014636 9997684 9938087 9832377 9677953 9473915
59346 9473915 9221493 8924040 8587055 8218256 7827236 7424577 7020743 6625051 6244944
59337 6244944 5885775 5551076 5242737 4960846 4703715 4468712 4253325 4055481 3873013
59328 3873013 3703443 3544691 3395954 3257629 3130255 3013625 2906913 2809343 2720340 2639031
59318 2639031 2564089 2494476 2430130 2371528 2318679 2270977 2227979 2189688 2155914 2125986 2099556
$$ packed form
59383C076936J32140J38048J43214J47798J52758J59312J68308J80224J95373
59374D494111K13665K34413K56580K79187L01226L21352L37851L48968L53322
59365G140675L50265L40063L23749L02722K78466K52393K25604J98683J71792
59356I584412J44880J17528Q8703N7133K1980j6952n9597j05710j54424k04038
59346I473915k52422k97453l36985l68799l91020m02659m03834l95692l80107
59337F244944l59169l34699l08339k81891k57131k35003k15387j97844j82468
59328C873013j69570j58752j48737j38325j27374j16630j06712r7570q9003q1309
59318B639031p4942o9613o4346n8602n2849m7702m2998l8291l3774k9928k6430
$$ plain form
59307 2099556 2077308 2060271 2048623 2041689 2039086 2041374 2049500 2064085 2085390 2113415 2147297 2184366
59295 2184366 2220210 2250311 2272403 2287741 2300242 2314197 2332438 2356122 2385568 2420906 2462061
59284 2462061 2508504 2559236 2612918 2667939 2722366 2773932 2820236 2859180 2889236 2909222 2917855
59273 2917855 2913873 2896811 2867479 2827473 2778277 2721053 2657199 2588714 2517762 2446023 2374639
59262 2374639 2304666 2237208 2172979 2111920 2053533 1997592 1944406 1894552 1848690 1807532 1771540
59251 1771540 1740471 1713633 1690858 1672851 1660231 1652583 1648889 1648579 1651662 1658070 1667564 1680272 1696704
59238 1696704 1717087 1741176 1768777 1800016 1835068 1874162 1917994 1967597 2023544 2085709 2154077
59227 2154077 2229503 2313477 2407424 2512323 2628695 2756864 2897500 3051902 3221319 3406008
$$ packed form
59307B099556k2248j7037j1648o934k603K288Q126J4585K1305K8025L3882L7069
59295B184366L5844L0101K2092J5338J2501J3955J8241K3684K9446L5338M1155
59284B462061M6443N0732N3682N5021N4427N1566M6304L8944L0056J9986Q633
59273B917855l982j7062k9332m0006m9196n7224o3854o8485p0952p1739p1384
59262B374639o9973o7458o4229o1059n8387n5941n3186m9854m5862m1158l5992
59251A771540l1069k6838k2775j8007j2620p648l694l10L083O408R494J2708J6432
59238A696704K0383K4089K7601L1239L5052L9094M3832M9603N5947O2165O8368
59227B154077P5426Q3974R3947J04899J16372J28169J40636J54402J69417J84689
$$ plain form
59217 3406008 3605375 3818796 4045338 4282263 4524452 4765534 4998883 5217200 5412150
59208 5412150 5575562 5700949 5783497 5819153 5804795 5739662 5626435 5470965 5281092 5065313
59198 5065313 4831901 4588789 4343689 4103581 3873732 3657486 3456967 3273516 3107505
59189 3107505 2958619 2826788 2712163 2613891 2529732 2457584 2396868 2347904 2310532 2283963 2267235
59178 2267235 2259003 2257466 2261315 2270226 2283450 2298364 2311521 2320815 2325512 2324387 2315226 2296462 2268310
59165 2268310 2231923 2188297 2138428 2083848 2026406 1967724 1909025 1851187 1794892 1741004 1690707
59154 1690707 1644897 1603529 1565990 1531981 1501614 1474864 1451483 1431266 1413888 1398761 1385752
59143 1385752 1375791 1369918 1367890 1368498 1371086 1375790 1382415 1390180 1398689 1408093 1418063 1427692 1436757 1446009
$$ packed form
59217C406008J99367K13421K26542K36925K42189K41082K33349K18317J94950
59208E412150J63412J25387Q2548L5656j4358o5133j13227j55470j89873k15779
59198E065313k33412k43112k45100k40108k29849k16246k00519j83451j66011
59189C107505j48886j31831j14625r8272q4159p2148o0716m8964l7372k6569j6728
59178B267235q232j537L849Q911J3224J4914J3157R294M697j125r161j8764k8152
59165B268310l6387m3626m9869n4580n7442n8682n8699n7838n6295n3888n0297
59154A690707m5810m1368l7539l4009l0367k6750k3381k0217j7378j5127j3009
59143A385752r961n873k028O08K588M704O625P765Q509R404R970R629R065R252
$$ plain form
59129 1446009 1455713 1464897 1472705 1479636 1486721 1494105 1501216 1507826 1514281 1521111 1528968 1538499 1549700 1561756
59115 1561756 1574048 1586945 1601197 1616989 1634038 1652049 1670453 1688231 1704845 1721052 1738080
59104 1738080 1756153 1774500 1792668 1811110 1830498 1851093 1872970 1896500 1922472 1951871 1985285
59093 1985285 2022317 2061880 2103421 2147513 2194722 2244267 2294370 2343639 2391318 2436314 2476821
59082 2476821 2511075 2537780 2555595 2562868 2558421 2542302 2515414 2478698 2433025 2379689 2320606 2257919
59070 2257919 2193444 2128417 2063640 1999868 1938028 1878934 1822827 1769404 1718425 1670163 1625140
59059 1625140 1583557 1545059 1509037 1475006 1442738 1412217 1383615 1357388 1334233 1314675 1298508
59048 1298508 1284651 1271671 1258530 1244935 1231184 1217828 1205394 1194134 1183794 1173673 1163136
$$ packed form
59129A446009R704R184P808O931P085P384P111O610O455O830P857R531J1201J2056
59115A561756J2292J2897J4252J5792J7049J8011J8404J7778J6614J6207J7028
59104A738080J8073J8347J8168J8442J9388K0595K1877K3530K5972K9399L3414
59093A985285L7032L9563M1541M4092M7209M9545N0103M9269M7679M4996M0507
59082B476821L4254K6705J7815P273m447j6119k6888l6716m5673n3336n9083o2687
59070B257919o4475o5027o4777o3772o1840n9094n6107n3423n0979m8262m5023
59059A625140m1583l8498l6022l4031l2268l0521k8602k6227k3155j9558j6167
59048A298508j3857j2980j3141j3595j3751j3356j2434j1260j0340j0121j0537
$$ plain form
59037 1163136 1152244 1141798 1132595 1124744 1117985 1112579 1109346 1108582 1109397 1110665 1112397 1115641 1121089 1128313
59023 1128313 1136379 1144632 1152766 1160721 1168926 1178272 1189466 1202524 1217059 1232774 1249440 1266781
59011 1266781 1284837 1304347 1326343 1351338 1379170 1409616 1442904 1479490 1519556 1562881 1609178
59000 1609178 1658335 1710195 1764203 1819398 1874649 1928487 1978586 2021963 2056225 2080485 2094754
58989 2094754 2098815 2092409 2076362 2052726 2023599 1990414 1954444 1917195 1879789 1842463 1805142 1768130
58977 1768130 1731905 1696702 1662814 1630914 1601653 1575244 1551930 1532430 1517320 1506273 1498605
58966 1498605 1494346 1494023 1497496 1503885 1512743 1524361 1538527 1553724 1568165 1581174 1592986 1603661
58954 1603661 1613013 1621469 1630159 1639967 1651055 1663501 1677796 1694346 1712984 1733521 1756436 1782400
$$ packed form
59037A163136j0892j0446r203p851o759n406l233p64Q15J268J732L244N448P224
59023A128313Q066Q253Q134P955Q205R346J1194J3058J4535J5715J6666J7341
59011A266781J8056J9510K1996K4995K7832L0446L3288L6586M0066M3325M6297
59000A609178M9157N1860N4008N5195N5251N3838N0099M3377L4262K4260J4269
58989B094754M061o406j6047k3636k9127l3185l5970l7249l7406l7326l7321l7012
58977A768130l6225l5203l3888l1900k9261k6409k3314j9500j5110j1047p668
58966A498605m259l23L473O389Q858J1618J4166J5197J4441J3009J1812J0675
58954A603661R352Q456Q690R808J1088J2446J4295J6550J8638K0537K2915K5964
$$ plain form
58942 1782400 1811389 1842965 1877459 1916162 1960225 2010027 2065746 2127811 2196330 2270716 2350221
58931 2350221 2433961 2519621 2602758 2678555 2744289 2799677 2845583 2883661 2917030 2949774 2985170
58920 2985170 3025096 3071148 3125127 3187887 3258758 3336954 3422982 3518136 3623266 3738803 3865426
58909 3865426 4003881 4154407 4317016 4492166 4680569 4882531 5098023 5327162 5569883
58900 5569883 5824871 6089115 6358592 6629360 6898350 7163765 7424887 7681350 7932230
58891 7932230 8175250 8406084 8618106 8803345 8954411 9066056 9135534 9162340 9147774 9094036
58881 9094036 9003135 8876784 8717346 8528380 8314056 8078568 7826278 7561652 7288526 7009951
58871 7009951 6729204 6450233 6176480 5909784 5650996 5401181 5161588 4933033 4716127
$$ packed form
58942A782400K8989L1576L4494L8703M4063M9802N5719O2065O8519P4386P9505
58931B350221Q3740Q5660Q3137P5797O5734N5388M5906L8078L3369L2744L5396
58920B985170L9926M6052N3979O2760P0871P8196Q6028R5154J05130J15537J26623
58909C865426J38455J50526J62609J75150J88403K01962K15492K29139K42721
58900E569883K54988K64244K69477K70768K68990K65415K61122K56463K50880
58891G932230K43020K30834K12022J85239J51066J11645O9478K6806j4566n3738
58881I094036r0901j26351j59438j88966k14324k35488k52290k64626k73126k78575
58871G009951k80747k78971k73753k66696k58788k49815k39593k28555k16906
$$ plain form
58862 4716127 4511695 4320190 4141004 3973167 3816336 3670445 3534851 3408836 3292551
58853 3292551 3186404 3089723 3001177 2920368 2847809 2783220 2725137 2672618 2626237 2586777 2553767
58842 2553767 2525897 2502267 2482699 2467383 2456714 2450986 2449808 2452195 2457641 2466688 2480154 2498259
58830 2498259 2520878 2548154 2580377 2617557 2659566 2706437 2758134 2814225 2874054 2936970 3002150
58819 3002150 3068591 3135740 3204063 3274740 3349012 3428049 3513164 3605790 3707303 3818977 3941905
58808 3941905 4076820 4224232 4384964 4560223 4750900 4956996 5177932 5413049 5661404
58799 5661404 5921316 6190478 6466387 6746254 7026503 7302568 7569175 7820713 8051640
58790 8051640 8256959 8432467 8574631 8680628 8748980 8780275 8777143 8743646 8684678 8605293 8509466
$$ packed form
58862D716127k04432j91505j79186j67837j56831j45891j35594j26015j16285
58853C292551j06147r6681q8546q0809p2559o4589n8083n2519m6381l9460l3010
58842B553767k7870k3630j9568j5316j0669n728j178K387N446R047J3466J8105
58830B498259K2619K7276L2223L7180M2009M6871N1697N6091N9829O2916O5180
58819C002150O6441O7149O8323P0677P4272P9037Q5115R2626J01513J11674J22928
58808C941905J34915J47412J60732J75259J90677K06096K20936K35117K48355
58799E661404K59912K69162K75909K79867K80249K76065K66607K51538K30927
58790H051640K05319J75508J42164J05997O8352L1295l132l3497n8968p9385r5827
$$ plain form
58779 8509466 8398393 8269279 8115332 7927364 7697039 7420999 7103643 6756485 6394376
58770 6394376 6031307 5678184 5342558 5028930 4739013 4472449 4228085 4004917 3801984
58761 3801984 3617834 3450607 3298674 3160869 3036052 2922857 2820128 2727289 2643999 2569620
58751 2569620 2503325 2444498 2392709 2347431 2308247 2275236 2248665 2228146 2212484 2200535 2191956
58740 2191956 2187016 2185974 2188865 2195669 2206405 2221008 2238887 2258236 2275681 2287066 2289055 2280045
58728 2280045 2259713 2228343 2187141 2138924 2087590 2036298 1986095 1936312 1886081 1835306 1784433
58717 1784433 1733831 1683795 1635139 1589442 1548401 1512894 1482780 1457664 1437776 1424020 1417232
58706 1417232 1417459 1423934 1435504 1450718 1467254 1481485 1489107 1486659 1472695 1447799 1413916 1373759
$$ packed form
58779H509466j11073j29114j53947j87968k30325k76040l17356l47158l62109
58770F394376l63069l53123l35626l13628k89917k66564k44364k23168k02933
58761C801984j84150j67227j51933j37805j24817j13195j02729r2839q3290p4379
58751B569620o6295n8827n1789m5278l9184l3011k6571k0519j5662j1949q579
58740B191956m940j042K891O804J0736J4603J7879J9349J7445J1385J989r010
58728B280045k0332l1370m1202m8217n1334n1292n0203m9783n0231n0775n0873
58717A784433n0602n0036m8656m5697m1041l5507l0114k5116j9888j3756o788
58706A417232K27O475J1570J5214J6536J4231P622k448j3964k4896l3883m0157
$$ plain form
58694 1373759 1330425 1286936 1245733 1208412 1175754 1147997 1125301 1108125 1097033 1092119 1092931 1099149
58682 1099149 1111040 1128965 1152630 1181100 1213389 1248780 1286864 1327800 1372608 1422949 1480640
58671 1480640 1547545 1625585 1716137 1818951 1931279 2047103 2156133 2243922 2295125 2299288 2255171
58660 2255171 2170369 2057271 1928917 1796701 1669352 1552255 1447469 1354816 1273344 1202199
58650 1202199 1140789 1088710 1045547 1010459 981990 958679 939943 925952 916408 909882 904781 900650
58638 900650 897979 896916 896830 897095 897565 898161 898658 899303 901036 904592 909696 915504 921596 928276 936257 946354
58622 946354 959010 973791 989714 1006450 1024774 1045492 1068514 1093535 1120966 1151360 1184408
58611 1184408 1219518 1257166 1298616 1344293 1393504 1446015 1502934 1565517 1633752 1706606 1783093
$$ packed form
58694A373759m3334m3489m1203l7321l2658k7757k2696j7176j1092m914Q12O218
58682A099149J1891J7925K3665K8470L2289L5391L8084M0936M4808N0341N7691
58671A480640O6905P8040R0552J02814J12328J15824J09030Q7789N1203M163m4117
58660B255171q4802j13098j28354j32216j27349j17097j04786r2653q1472p1145
58650A202199o1410n2079m3163l5088k8469k3311j8736j3991r544o526n101m131
58638I00650k671j063q6K65M70N96M97O45J733L556N104N808O092O680P981J0097
58622I46354J2656J4781J5923J6736J8324K0718K3022K5021K7431L0394L3048
58611A184408L5110L7648M1450M5677M9211N2511N6919O2583O8235P2854P6487
$$ plain form
58600 1783093 1862460 1943583 2024744 2104003 2179465 2249099 2310505 2361061 2398561 2421877 2430843
58589 2430843 2425431 2405444 2371458 2325758 2271720 2212313 2149729 2086268 2024604 1966666 1912796
58578 1912796 1862470 1815649 1773046 1735282 1702171 1672884 1646698 1623543 1603847 1587874 1575337
58567 1575337 1565654 1558298 1552630 1547582 1541939 1535007 1526919 1518396 1510411 1503941 1499790 1498526 1500353 1504409
58553 1504409 1507933 1506637 1496450 1474890 1441047 1395508 1341097 1282777 1225342 1171023 1119881 1071977
58541 1071977 1028029 988292 952276 919875 891596 867219 845223 824149 803913 785351 769127
58530 769127 755485 744409 735435 727628 720189 712924 706006 699703 694396 690361 687369 684941 683103 682353
58516 682353 682853 684263 686516 690011 694801 700359 706569 714278 724360 736673 750348 764670 779276
$$ packed form
58600A783093P9367Q1123Q1161P9259P5462O9634O1406N0556L7500K3316Q966
58589B430843n412j9987l3986m5700n4038n9407o2584o3461o1664n7938n3870
58578A912796n0326m6821m2603l7764l3111k9287k6186k3155j9696j5973j2537
58567A575337r683p356n668n048n643o932q088q523p985o470m151j264J827M056
58553A504409L524j296j0187k1560l3843m5539n4411n8320n7435n4319n1142m7904
58541A071977m3948l9737l6016l2401k8279k4377k1996k1074k0236j8562j6224
58530G69127j3642j1076q974p807p439p265o918o303n307m035k992k428j838p50
58516F82353N00J410K253L495M790N558O210P709J0082J2313J3675J4322J4606
$$ plain form
58503 779276 793933 808482 822610 835339 845183 851203 853666 853432 851098 846969 841347 834475 826582
58490 826582 818353 810913 804910 799861 794731 788932 782530 775811 768974 762052 754847 747107 738897 730609
58476 730609 722521 714620 706910 699577 692806 686655 681006 675347 668845 661238 653500 646975 641941 637760
58462 637760 634329 632375 632184 632983 634037 635539 637974 641216 644763 648366 652078 656134 660960 666705 672538
58447 672538 677033 679561 680702 681112 680757 679559 678038 676843 676204 676214 677057 678672 680756 683385 686926 691056
58431 691056 694584 696649 697493 697844 698260 699319 701579 704920 708671 712674 717359 722529 727126 730687 734055
58416 734055 738022 742285 746377 750613 755386 760465 765807 772084 779496 786845 792818 797526 801927 806354
58402 806354 810540 814530 818635 822895 827271 831923 836676 840914 844614 848773 854017 859533 864203 868146
$$ packed form
58503G79276J4657J4549J4128J2729R844O020K463k34k334m129n622o872p893
58490H26582q229p440o003n049n130n799o402o719o837o922p205p740q210q288
58476G30609q088p901p710p333o771o151n649n659o502p607p738o525n034m181
58462F37760l431j954j91P99J054J502K435L242L547L603L712M056M826N745N833
58447F72538M495K528J141M10l55j198j521j195o39J0Q43J615K084K629L541M130
58431F91056L528K065Q44L51M16J059K260L341L751M003M685N170M597L561L368
58416G34055L967M263M092M236M773N079N342O277P412P349N973M708M401M427
58402H06354M186L990M105M260M376M652M753M238L700M159N244N516M670L943
$$ plain form
58388 868146 872322 877261 882963 889371 896083 902272 907726 913299 919530 925578 930408 934253 937936 941552
58374 941552 944884 948442 952927 958207 963768 969592 975727 981733 987533 993922 1001155 1008041 1013773 1019677
58360 1019677 1027481 1036500 1044371 1050252 1055615 1062045 1069785 1078471 1087811 1097315 1106471 1115319 1124059 1132361
58346 1132361 1139998 1147735 1156519 1166183 1176088 1186575 1198463 1211480 1224581 1237577 1251119 1265252
58334 1265252 1279344 1293392 1308155 1324030 1340875 1358799 1377998 1398014 1418286 1439242 1461764
58323 1461764 1485905 1511248 1538054 1566653 1596030 1624440 1651189 1676484 1699837 1720180 1737468
58312 1737468 1752705 1766364 1778112 1788044 1796890 1805071 1812834 1821195 1831425 1843680 1857311 1872326
58300 1872326 1889350 1908468 1929387 1952310 1977236 2002968 2028490 2054883 2084071 2116016 2149061
$$ packed form
58388H68146M176M939N702O408O712O189N454N573O231O048M830L845L683L616
58374I41552L332L558M485N280N561N824O135O006N800O389P233O886N732N904
58360A019677P804R019P871N881N363O430P740Q686R340R504R156Q848Q740Q302
58346A132361P637P737Q784R664R905J0487J1888J3017J3101J2996J3542J4133
58334A265252J4092J4048J4763J5875J6845J7924J9199K0016K0272K0956K2522
58323A461764K4141K5343K6806K8599K9377K8410K6749K5295K3353K0343J7288
58312A737468J5237J3659J1748R932Q846Q181P763Q361J0230J2255J3631J5015
58300A872326J7024J9118K0919K2923K4926K5732K5522K6393K9188L1945L3045
$$ plain form
58289 2149061 2182781 2218373 2256243 2295333 2335151 2376476 2419651 2464018 2509545 2557333 2607984
58278 2607984 2660879 2715382 2771308 2827905 2883850 2938687 2993013 3047065 3100266 3152224 3203052
58267 3203052 3252976 3302915 3354970 3410750 3469577 3529903 3591967 3657272 3726119 3797832 3872951
58256 3872951 3952878 4037585 4125913 4217890 4314478 4415426 4519922 4629098 4745231 4868495
58246 4868495 4997164 5130958 5271488 5419468 5574344 5736738 5908334 6089204 6278211
58237 6278211 6476189 6685653 6907254 7139741 7383721 7642067 7916234 8205654 8511348
58228 8511348 8836611 9183479 9552034 9943997 10363545 10813795 11295987 11812916 12369728
58219 12369728 12970801 13619566 14321929 15086058 15918581 16825460 17817275 18909276 20116101
$$ packed form
58289B149061L3720L5592L7870L9090L9818M1325M3175M4367M5527M7788N0651
58278B607984N2895N4503N5926N6597N5945N4837N4326N4052N3201N1958N0828
58267C203052M9924M9939N2055N5780N8827O0326O2064O5305O8847P1713P5119
58256C872951P9927Q4707Q8328R1977R6588J00948J04496J09176J16133J23264
58246D868495J28669J33794J40530J47980J54876J62394J71596J80870J89007
58237F278211J97978K09464K21601K32487K43980K58346K74167K89420L05694
58228H511348L25263L46868L68555L91963M19548M50250M82192N16929N56812
58219A2369728O01073O48765P02363P64129Q32523R06879R91815J092001J206825
$$ plain form
58210 20116101 21451946 22936985 24598799 26467466 28576151 30968813 33702443 36841641
58202 36841641 40458835 44642826 49501732 55156998 61742483 69412246 78344262 88740088
58194 88740088 100835765 114919584 131332402 150451081 172677457 198405638 227870740
58187 227870740 260811403 296021066 331019657 362151505 385321651 397241132 396588223
58180 396588223 384349659 363112096 335871761 305210215 273159747 241394558 211284620
58173 211284620 183768909 159291948 137912921 119469887 103685871 90231201 78780248
58166 78780248 69044932 60770709 53726509 47712069 42564145 38146502 34340615 31048871
58158 31048871 28195026 25713194 23541132 21626568 19931514 18424934 17076297 15859353
$$ packed form
58210B0116101J335845J485039J661814J868667K108685K392662K733630L139198
58202C6841641L617194M183991M858906N655266O585485P669763Q932016J0395826
58194H8740088J2095677J4083819J6412818J9118679K2226376K5728181K9465102
58187B27870740L2940663L5209663L4998591L1131848K3170146J1919481o52909
58180C96588223j2238564k1237563k7240335l0661546l2050468l1765189l0109938
58173B11284620k7515711k4476961k1379027j8443034j5784016j3454670j1450953
58166G8780248r735316q274223p044200o014440n147924m417643l805887l291744
58158C1048871k853845k481832k172062j914564j695054j506580j348637j216944
$$ plain form
58150 15859353 14756124 13753273 12838878 12004932 11247609 10561625 9937944 9368728 8850126
58141 8850126 8378330 7947374 7552952 7194086 6868535 6570013 6291824 6029766 5779924
58132 5779924 5537584 5300789 5072023 4854354 4648408 4454219 4272785 4104051 3946120
58123 3946120 3797951 3660236 3532456 3411938 3297121 3188950 3087750 2991555 2898937 2810736
58113 2810736 2727526 2648027 2571504 2499200 2431914 2368563 2308582 2253243 2203071 2156286 2111367
58102 2111367 2068973 2029882 1993238 1958288 1925609 1894985 1864222 1831685 1798045 1763997 1728420
58091 1728420 1690628 1652436 1615987 1581088 1546527 1512511 1479963 1448746 1418345 1389136 1361367
58080 1361367 1333986 1305958 1277723 1250128 1223137 1196826 1172180 1149440 1126925 1103118 1078873
$$ packed form
58150A5859353j103229j002851r14395q33946p57323o85984o23681n69216n18602
58141H850126m71796m30956l94422l58866l25551k98522k78189k62058k49842
58132E779924k42340k36795k28766k17669k05946j94189j81434j68734j57931
58123C946120j48169j37715j27780j20518j14817j08171j01200r6195r2618q8201
58113B810736q3210p9499p6523p2304o7286o3351n9981n5339n0172m6785m4919
58102B111367m2394l9091l6644l4950l2679l0624l0763l2537l3640l4048l5577
58091A728420l7792l8192l6449l4899l4561l4016l2548l1217l0401k9209k7769
58080A361367k7381k8028k8235k7595k6991k6311k4646k2740k2515k3807k4245
$$ plain form
58069 1078873 1056116 1035418 1016239 998468 982137 966542 951187 936892 924639 913992 903839
58058 903839 893930 884491 875124 865255 854970 844363 832929 820638 808704 798163 788620 779481 771306
58045 771306 764638 758526 751776 744831 738823 733511 727774 721585 715848 710637 705272 699983 695983 693742
58031 693742 692368 690798 688615 685784 682547 679555 677292 675460 673639 672257 672105 673242 675217 678006
58017 678006 681801 686197 690611 695388 701497 709214 717980 727462 737936 749626 762505 776772 792923
58004 792923 811360 832469 856910 885074 916237 948918 982163 1016151 1051615 1089084 1128559
57993 1128559 1169509 1211201 1253225 1295522 1337844 1379637 1420573 1460556 1498928 1534463 1566679
57982 1566679 1596526 1625237 1653206 1680477 1707323 1733210 1755678 1771185 1776701 1769954 1749015 1713120
$$ packed form
58069A078873k2757k0698j9179j7771j6331j5595j5355j4295j2253j0647j0153
58058I03839r909r439r367r869j0285j0607j1434j2291j1934j0541r543r139q175
58045G71306o668o112o750o945o008n312n737o189n737n211n365n289m000k241
58031F93742j374j570k183k831l237k992k263j832j821j382j52J137J975K789
58017F78006L795M396M414M777O109P717Q766R482J0474J1690J2879J4267J6151
58004G92923J8437K1109K4441K8164L1163L2681L3245L3988L5464L7469L9475
57993A128559M0950M1692M2024M2297M2322M1793M0936L9983L8372L5535L2216
57982A566679K9847K8711K7969K7271K6846K5887K2468J5507N516o747k0939l5895
$$ plain form
57970 1713120 1663795 1604255 1537834 1467651 1397177 1329740 1267305 1210489 1159680 1115326 1077372
57959 1077372 1045361 1019062 998237 981973 969200 959817 954334 952286 951974 951952 952022 952460 953043 953182 952521
57944 952521 951055 948965 946514 943946 941561 940156 941037 945160 952480 962698 976307 994224 1016568
57931 1016568 1042468 1070859 1100631 1130100 1157143 1179925 1196819 1205824 1205089 1194187 1174104 1145878
57919 1145878 1110245 1068900 1025032 981742 940383 900944 863626 829456 799608 774625 754216
57908 754216 737462 723293 710946 699983 689923 680155 670268 660239 650178 640037 629599 618600
57896 618600 606931 594910 583216 572305 562063 552334 543516 536168 530283 525553 522193 520837 521594
57883 521594 523938 527594 532856 539852 548137 557268 567117 577339 587246 596675 606370 616859 627407
$$ packed form
57970A713120m9325n9540o6421p0183p0474o7437o2435n6816n0809m4354l7954
57959A077372l2011k6299k0825j6264j2773r383n483k048l12k2P0M38N83J39o61
57944I52521j466k090k451k568k385j405Q81M123P320J0218J3609J7917K2344
57931A016568K5900K8391K9772K9469K7043K2782J6894R005p35j0902k0083k8226
57919A145878l5633m1345m3868m3290m1359l9439l7318l4170k9848k4983k0409
57908G54216j6754j4169j2347j0963j0060r768r887j0029j0061j0141j0438j0999
57896F18600j1669j2021j1694j0911j0242r729q818p348n885m730l360j356P57
57883E21594K344L656N262O996Q285R131R849J0222R907R429R695J0489J0548
$$ plain form
57870 627407 636683 644133 649950 653962 655461 654302 651429 647899 643790 638452 631520 623242 614065 604432
57856 604432 595036 586766 580110 574877 570704 567583 565602 564436 563582 562999 563110 564178 566091 568750 572144
57841 572144 575916 579364 582116 584344 586168 587346 587824 588024 588105 587449 585462 582524 579577 577060 574929
57826 574929 573498 573526 575446 579091 584265 591098 599783 610318 622618 636668 652592 670782 691557
57813 691557 714184 736498 756340 773509 789833 807306 826831 848861 874431 904834 940512
57802 940512 980652 1023757 1068198 1112165 1153264 1188330 1213879 1227107 1226781 1213400 1188741 1155230
57790 1155230 1115343 1071104 1024012 975407 926678 879049 833461 790811 751857 716559 684014
57779 684014 653583 625756 601350 580222 561462 544589 529774 517062 506259 497595 491573 487923
$$ packed form
57870F27407R276P450N817M012J499j159k873l530m109n338o932q278r177r633
57856F04432r396q270o656n233m173l121j981j166q54n83J11J068J913K659L394
57841E72144L772L448K752K228J824J178M78K00Q1o56j987k938k947k517k131
57826E74929j431K8J920L645N174O833Q685J0535J2300J4050J5924J8190K0775
57813F91557K2627K2314J9842J7169J6324J7473J9525K2030K5570L0403L5678
57802I40512M0140M3105M4441M3967M1099L5066K5549J3228l26j3381k4659l3511
57790A155230l9887m4239m7092m8605m8729m7629m5588m2650l8954l5298l2545
57779F84014l0431k7827k4406k1128j8760j6873j4815j2712j0803q664o022l650
$$ plain form
57767 487923 485421 483037 480682 478609 476754 475013 473645 472988 473188 474375 476614 479421 481937 483951 486329
57752 486329 490076 495430 502153 510147 519274 529040 538978 549083 559469 569936 580318 590832 601480
57739 601480 611401 619413 625058 628554 629945 629072 626370 623035 620148 618071 616750 616056 615669 615210 614912
57724 614912 615764 618530 622835 627642 632501 637842 644108 651101 658370 665796 673400 680857 687739 694381
57710 694381 702101 712268 725204 740113 756011 772561 790109 809132 829716 851492 874005 897093
57698 897093 920891 945645 971783 1000186 1032035 1068147 1108591 1153104 1201738 1254942 1313197
57687 1313197 1376833 1446120 1521302 1602511 1689751 1782756 1880739 1982398 2086370 2191547 2296791
57676 2296791 2400627 2501591 2598896 2692739 2784350 2876096 2971109 3071526 3175538 3274640
$$ packed form
57767D87923k502k384k355k073j855j741j368o57K00J187K239K807K516K014K378
57752D86329L747N354O723P994R127R766R938J0105J0386J0467J0382J0514J0648
57739F01480R921Q012N645L496J391q73k702l335k887k077j321o94l87m59k98
57724F14912Q52K766M305M807M859N341O266O993P269P426P604P457O882O642
57710F94381P720J0167J2936J4909J5898J6550J7548J9023K0584K1776K2513K3088
57698H97093K3798K4754K6138K8403L1849L6112M0444M4513M8634N3204N8255
57687A313197O3636O9287P5182Q1209Q7240R3005R7983J01659J03972J05177J05244
57676B296791J03836J00964R7305R3843R1611R1746R5013J00417J04012R9102
$$ plain form
57666 3274640 3352913 3389974 3367957 3279699 3132798 2946299 2742525 2539844 2349847 2178085
57656 2178085 2026061 1893124 1777749 1678117 1592496 1519720 1459107 1409458 1368439 1333672 1304297
57645 1304297 1280729 1262917 1249711 1240146 1234492 1233526 1237285 1244996 1255839 1269430 1285902 1305814
57633 1305814 1329774 1357863 1389593 1424488 1462471 1503700 1548499 1597513 1651396 1710098 1772804
57622 1772804 1838675 1907125 1977188 2047078 2114659 2177931 2234867 2283313 2321436 2347940 2361662
57611 2361662 2361463 2346976 2319143 2279775 2230792 2174049 2111300 2044015 1973619 1902174 1832278 1765781
57599 1765781 1702897 1642913 1585439 1530774 1479584 1432665 1390542 1352862 1318549 1286964 1258398
57588 1258398 1233021 1210012 1188451 1168554 1151160 1136255 1122891 1110423 1099039 1089063 1080515 1073442
$$ packed form
57666C274640P8273L7061k2017q8258j46901j86499k03774k02681j89997j71762
57656B178085j52024j32937j15375r9632q5621p2776o0613m9649m1019l4767k9375
57645A304297k3568j7812j3206r565n654r66L759P711J0843J3591J6472J9912
57633A305814K3960K8089L1730L4895L7983M1229M4799M9014N3883N8702O2706
57622A772804O5871O8450P0063O9890O7581O3272N6936M8446L8123K6504J3722
57611B361662j99j4487k7833l9368m8983n6743o2749o7285p0396p1445o9896o6497
57599A765781o2884n9984n7474n4665n1190m6919m2123l7680l4313l1585k8566
57588A258398k5377k3009k1561j9897j7394j4905j3364j2468j1384r976q548p073
$$ plain form
57576 1073442 1068074 1064392 1061980 1060374 1059248 1058313 1057454 1056945 1057167 1058182 1059976 1062916 1067435 1073325 1079846
57561 1079846 1086545 1093427 1100426 1107362 1114526 1122652 1132043 1142169 1152350 1162482 1172881 1183828 1195583
57548 1195583 1208511 1222911 1238778 1255866 1273881 1292614 1312167 1333141 1356385 1382459 1411427
57537 1411427 1443153 1477560 1514692 1554787 1598297 1645513 1696163 1749597 1805350 1863218 1922824
57526 1922824 1983462 2044334 2104555 2162832 2217489 2266892 2309568 2343892 2368155 2381191 2382705
57515 2382705 2372965 2352676 2323338 2287270 2246734 2203141 2157350 2110483 2064060 2019356 1976992
57504 1976992 1937195 1900202 1866315 1835806 1808933 1786011 1767210 1752187 1740042 1729837 1721243
57493 1721243 1714578 1710258 1708391 1708936 1711914 1717269 1724716 1733992 1745128 1758299 1773541 1790847 1810336
$$ packed form
57576A073442n368l682k412j606j126r35q59n09K22J015J794K940M519N890O521
57561A079846O699O882O999O936P164Q126R391J0126J0181J0132J0399J0947J1755
57548A195583J2928J4400J5867J7088J8015J8733J9553K0974K3244K6074K8968
57537A411427L1726L4407L7132M0095M3510M7216N0650N3434N5753N7868N9606
57526A922824O0638O0872O0221N8277N4657M9403M2676L4324K4263J3036J514
57515B382705r740k0289k9338l6068m0536m3593m5791m6867m6423m4704m2364
57504A976992l9797l6993l3887l0509k6873k2922j8801j5023j2145j0205q594
57493A721243o665m320j867N45K978N355P447R276J1136J3171J5242J7306J9489
$$ plain form
57480 1810336 1832054 1855755 1881184 1908481 1937997 1969878 2004136 2041043 2081088 2124570 2171520
57469 2171520 2221897 2275477 2331622 2389562 2448791 2508728 2568023 2624678 2676847 2723130 2762130
57458 2762130 2792402 2813018 2823682 2824096 2813767 2792782 2762448 2724894 2682301 2636659 2589745 2542853
57446 2542853 2496731 2452080 2409976 2371531 2337249 2306884 2279824 2255569 2234076 2215689 2200571
57435 2200571 2188197 2177770 2169058 2162334 2157415 2153440 2149915 2147383 2146576 2147415 2149424 2152760 2158094 2165558
57421 2165558 2174420 2183796 2193253 2202714 2212307 2222416 2233521 2245795 2258963 2272476 2285682 2298066
57409 2298066 2309745 2321664 2334879 2349623 2365357 2381626 2398349 2415310 2431976 2448191 2464600
57398 2464600 2481965 2500244 2518708 2536891 2555094 2573936 2593640 2613910 2634440 2655363 2677076
$$ packed form
57480A810336K1718K3701K5429K7297K9516L1881L4258L6907M0045M3482M6950
57469B171520N0377N3580N6145N7940N9229N9937N9295N6655N2169M6283L9000
57458B762130L0272K0616J0664M14j0329k0985l0334l7554m2593m5642m6914m6892
57446B542853m6122m4651m2104l8445l4282l0365k7060k4255k1493j8387j5118
57435B200571j2374j0427q712o724m919l975l525k532q07Q39K009L336N334P464
57421B165558Q862R376R457R461R593J0109J1105J2274J3168J3513J3206J2384
57409B298066J1679J1919J3215J4744J5734J6269J6723J6961J6666J6215J6409
57398B464600J7365J8279J8464J8183J8203J8842J9704K0270K0530K0923K1713
$$ plain form
57387 2677076 2699571 2722126 2743885 2764739 2785402 2806598 2828363 2850191 2871606 2892410 2912593
57376 2912593 2932309 2951909 2971746 2991929 3012412 3033234 3054509 3076159 3097946 3119808 3141993
57365 3141993 3164753 3188097 3211968 3236429 3261498 3286993 3312793 3339081 3366034 3393402 3420834
57354 3420834 3448519 3476939 3505918 3534495 3562109 3589445 3617618 3646788 3676105 3704833 3733029
57343 3733029 3761178 3789682 3818768 3848486 3878655 3909067 3939732 3970678 4001651 4032455 4063559
57332 4063559 4095785 4129252 4163133 4196685 4230112 4264128 4299008 4334441 4370021 4405493 4440720
57321 4440720 4475723 4510730 4545959 4581399 4616931 4652497 4688068 4723634 4759392 4795736 4832888
57310 4832888 4870706 4908960 4947558 4986424 5025460 5064849 5105046 5146190 5187798 5229352 5270989
$$ packed form
57387B677076K2495K2555K1759K0854K0663K1196K1765K1828K1415K0804K0183
57376B912593J9716J9600J9837K0183K0483K0822K1275K1650K1787K1862K2185
57365C141993K2760K3344K3871K4461K5069K5495K5800K6288K6953K7368K7432
57354C420834K7685K8420K8979K8577K7614K7336K8173K9170K9317K8728K8196
57343C733029K8149K8504K9086K9718L0169L0412L0665L0946L0973L0804L1104
57332D063559L2226L3467L3881L3552L3427L4016L4880L5433L5580L5472L5227
57321D440720L5003L5007L5229L5440L5532L5566L5571L5566L5758L6344L7152
57310D832888L7818L8254L8598L8866L9036L9389M0197M1144M1608M1554M1637
$$ plain form
57299 5270989 5313225 5356163 5399251 5441636 5482416 5520709 5555916 5587913 5616773 5642443 5665048
57288 5665048 5685366 5704504 5723039 5740714 5757000 5771765 5785451 5798821 5812501 5826587 5840849
57277 5840849 5855502 5871399 5889069 5907862 5926684 5945445 5965095 5986199 6008191 6030269 6052315
57266 6052315 6074558 6096910 6119238 6141888 6165274 6189091 6212501 6235108 6257220 6279092 6300361
57255 6300361 6320547 6339772 6358593 6377160 6394886 6411117 6425971 6440263 6454647 6469037 6482956
57244 6482956 6496183 6508803 6520833 6532127 6542649 6552519 6561842 6570836 6580177 6590734 6602641 6614911
57232 6614911 6626296 6636387 6645596 6654250 6662136 6668970 6674952 6680631 6686334 6691787 6696255 6698999 6699744 6698724
57218 6698724 6696221 6692092 6685906 6677586 6667753 6657298 6646699 6635790 6624102 6611234 6596948 6581145
$$ packed form
57299E270989M2236M2938M3088M2385M0780L8293L5207L1997K8860K5670K2605
57288E665048K0318J9138J8535J7675J6286J4765J3686J3370J3680J4086J4262
57277E840849J4653J5897J7670J8793J8822J8761J9650K1104K1992K2078K2046
57266F052315K2243K2352K2328K2650K3386K3817K3410K2607K2112K1872K1269
57255F300361K0186J9225J8821J8567J7726J6231J4854J4292J4384J4390J3919
57244F482956J3227J2620J2030J1294J0522R870R323Q994R341J0557J1907J2270
57232F614911J1385J0091R209Q654P886O834N982N679N703N453M468K744P45j020
57218F698724k503m129o186q320r833j0455j0599j0909j1688j2868j4286j5803
$$ plain form
57206 6581145 6563940 6545727 6526999 6508032 6488849 6469516 6450429 6432165 6415023 6398747 6382746
57195 6382746 6366546 6350021 6333251 6316242 6298866 6281079 6263106 6245322 6227965 6211046 6194456
57184 6194456 6177993 6161234 6143710 6125535 6107818 6092035 6078707 6066770 6054462 6040802 6026121
57173 6026121 6011311 5996884 5982857 5969229 5956224 5944062 5932732 5922002 5911475 5900667 5889271
57162 5889271 5877398 5865247 5852399 5837786 5820671 5801382 5780710 5758878 5735665 5711299 5686318
57151 5686318 5660311 5631555 5598494 5561155 5520664 5477795 5432644 5385461 5337075 5288482 5240663
57140 5240663 5194937 5152987 5116226 5085363 5060472 5040935 5025130 5010738 4995889 4979922 4962926
57129 4962926 4944902 4925528 4904318 4880530 4853204 4821926 4787615 4752159 4717220 4683709 4652437
$$ packed form
57206F581145j7205j8213j8728j8967j9183j9333j9087j8264j7142j6276j6001
57195F382746j6200j6525j6770j7009j7376j7787j7973j7784j7357j6919j6590
57184F194456j6463j6759j7524j8175j7717j5783j3328j1937j2308j3660j4681
57173F026121j4810j4427j4027j3628j3005j2162j1330j0730j0527j0808j1396
57162E889271j1873j2151j2848j4613j7115j9289k0672k1832k3213k4366k4981
57151E686318k6007k8756l3061l7339m0491m2869m5151m7183m8386m8593m7819
57140E240663m5726m1950l6761l0863k4891j9537j5805j4392j4849j5967j6996
57129D962926j8024j9374k1210k3788k7326l1278l4311l5456l4939l3511l1272
$$ plain form
57118 4652437 4624719 4601996 4585067 4573964 4568444 4568317 4573458 4583947 4600481 4624528 4657995 4702906
57106 4702906 4761650 4837520 4934892 5058790 5214399 5407216 5643910 5933220 6286071 6714575
57096 6714575 7230522 7844350 8564992 9400030 10355292 11433880 12635254 13954702 15382751
57087 15382751 16904055 18495861 20126861 21757630 23343858 24842191 26215953 27436726
57079 27436726 28480294 29320348 29925856 30265259 30315130 30067757 29533407 28737166 27713237
57070 27713237 26499852 25136064 23659931 22107508 20512547 18906802 17320190 15780100
57062 15780100 14309981 12928012 11646519 10472198 9406910 8448623 7592300 6830768
57054 6830768 6155775 5558984 5032449 4568579 4160086 3800222 3482951 3202790 2954689
$$ packed form
57118D652437k7718k2723j6929j1103n520j27N141J0489J6534K4047L3467M4911
57106D702906N8744P5870R7372J23898J55609J92817K36694K89310L52851M28504
57096F714575N15947O13828P20642Q35038R55262J078588J201374J319448J428049
57087A5382751J521304J591806J631000J630769J586228J498333J373762J220773
57079B7436726J043568Q40054O05508L39403M9871k47373n34350p96241j023929
57070B7713237j213385j363788j476133j552423j594961j605745j586612j540090
57062A5780100j470119j381969j281493j174321j065288r58287q56323p61532
57054F830768o74993n96791n26535m63870m08493l59864l17271k80161k48101
$$ plain form
57045 2954689 2734210 2537708 2362162 2204908 2063569 1936122 1820911 1716697 1622750 1538623
57035 1538623 1463653 1396830 1337360 1285255 1241199 1205948 1180007 1163723 1157486 1161969 1178479 1209125
57023 1209125 1256233 1320507 1397950 1477108 1539750 1567054 1548388 1486212 1393285 1285280 1174853
57012 1174853 1069839 974050 888659 813582 748429 692558 644831 604023 569396 540407 516049
57001 516049 495230 477736 463987 453668 445347 437744 430788 425140 421259 419271 419175 420716 423440 427245
56987 427245 432516 439444 447605 456455 465727 474872 482578 487446 488964 487400 482988 475668 465468 452767
56973 452767 438280 423144 408844 396581 386681 378744 372242 366800 362238 358795 357248 358410 362424
56960 362424 368735 376742 386324 397777 411206 425690 438894 447761 450047 445344 434852 420568 404650
$$ packed form
57045B954689k20479j96502j75546j57254j41339j27447j15211j04214r3947q4127
57035A538623p4970o6823n9470n2105m4056l5251k5941j6284o237M483J6510L0646
57023A209125M7108O4274P7443P9158O2642K7304j8666o2176r2927j08005j10427
57012A174853j05014r5789q5391p5077o5153n5871m7727m0808l4627k8989k4358
57001E16049k0819j7494j3749j0319q321p603o956n648l881j988r6J541K724L805
56987D27245N271O928Q161Q850R272R145P706M868J518j564m412p320j0200j2701
56973D52767j4487j5136j4300j2263r900p937o502n442m562l443j547J162M014
56960C62424O311Q007R582J1453J3429J4484J3204Q867K286m703j0492j4284j5918
$$ plain form
56947 404650 388885 374150 360501 348052 337528 329650 324367 321130 319695 320239 322895 327696 334933
56934 334933 345067 358202 373955 391768 410939 430249 447756 461110 468126 467423 459000 444298
56922 444298 425548 404897 383953 363708 344602 326823 310744 296874 285332 275723 267718 261296
56910 261296 256176 251529 246750 242063 237847 233799 229439 225104 221642 219292 217650 216667 216863 218468 221048
56895 221048 224110 227515 231209 235255 240307 247400 256926 268268 280604 293524 306692 319466 331153
56882 331153 341054 347970 350322 347396 340194 330716 320760 311656 304497 299817 297267 296235 296793 299591
56868 299591 304991 312821 322980 335735 351345 369866 391490 416680 445611 477511 510566 542114
56856 542114 568793 586998 594130 589971 576842 558117 536482 513491 490445 469117 451395 438464
$$ packed form
56947D04650j5765j4735j3649j2449j0524p878n283l237j435N44K656M801P237
56934C34933J0134J3135J5753J7813J9171J9310J7507J3354P016p03q423j4702
56922D44298j8750k0651k0944k0245j9106j7779j6079j3870j1542r609q005o422
56910B61296n120m647m779m687m216m048m360m335l462k350j642r83J96J605K580
56895B21048L062L405L694M046N052P093R526J1342J2336J2920J3168J2774J1687
56882C31153R901O916K352k926p202r478r956r104p159m680k550j032N58K798
56868B99591N400P830J0159J2755J5610J8521K1624K5190K8931L1900L3055L1548
56856E42114K6679J8205P132m159j3129j8725k1635k2991k3046k1328j7722j2931
$$ plain form
56844 438464 430538 427279 428336 433697 443760 459105 480110 506977 540152 580317 627537 680366
56832 680366 735686 788844 833690 863421 872922 861112 831123 788450 739075 688450 640577 597217
56820 597217 558412 524155 495258 472568 456127 445568 440831 441964 448668 460715 478640 503425
56808 503425 535382 573446 615169 656701 692771 717502 726292 717639 693593 658566 617457 574386
56796 574386 532503 494149 460665 432239 408451 389139 374511 364550 358832 357037 359228 365419
56784 365419 375270 388446 404990 424967 447622 470843 491293 505403 510794 507006 494813 475290
56772 475290 450085 422129 394748 369644 346422 324376 303869 285602 269507 255142 242543
56761 242543 231877 222778 214846 208331 203498 199702 196015 192578 190379 189763 189958 190064 189741 188923 187716
$$ packed form
56844D38464p926l259J057N361J0063J5345K1005K6867L3175M0165M7220N2829
56832F80366N5320N3158M4846K9731R501j1810k9989m2673m9375n0625m7873m3360
56820E97217l8805l4257k8897k2690j6441j0559m737J133O704J2047J7925K4785
56808E03425L1957L8064M1723M1532L6070K4731Q790q653k4046l5027m1109m3071
56796E74386m1883l8354l3484k8426k3788j9312j4628r961n718j795K191O191
56784C65419R851J3176J6544J9977K2655K3221K0450J4110N391l788j2193j9523
56772D75290k5205k7956k7381k5104k3222k2046k0507j8267j6095j4365j2599
56761B42543j0666r099p932o515m833l796l687l437k199o16J95J06l23q18j207
$$ plain form
56746 187716 186707 186610 187349 188066 188259 188271 188460 188520 188015 187019 185841 184576 183308 182415 182201 182477 182802 182987
56728 182987 183052 182946 182627 182259 182043 181948 181861 181893 182296 183144 184230 185264 186025 186431 186625 186984 187923 189601 191820
56709 191820 194188 196517 199081 202344 206314 210415 214245 218266 223243 229065 234654 239193 242900 246289
56695 246289 249156 250831 251245 251189 251467 252135 252719 252869 252664 252482 252805 254010 256108 258589 260691 262011 262854
56678 262854 263880 265390 267032 268197 268545 268101 267072 265772 264619 263900 263448 262728 261326 259242 256648
56663 256648 253538 249827 245768 242004 239010 236557 233995 231093 228357 226288 224559 222281 219028 215282
56649 215282 211896 209449 208117 207691 207585 207239 206755 206815 207772 209229 210745 212408 214299 215864 216488 216383
56633 216383 216237 216180 215772 214979 214426 214519 214945 215255 215413 215480 215141 213971 211952 209495 207112 205186 203874 203032
$$ packed form
56746A87716j009r7P39P17J93J2J89O0n05r96j178j265j268q93k14K76L25J85
56728A82987O5j06l19l68k16r5q7L2M03Q48J086J034P61M06J94L59R39J678K219
56709A91820K368K329K564L263L970M101L830M021M977N822N589M539L707L389
56695B46289K867J675M14n6K78O68N84J50k05j82L23J205K098K481K102J320Q43
56678B62854J026J510J642J165L48m44j029j300j153p19m52p20j402k084k594
56663B56648l110l711m059l764k994k453k562k902k736k069j729k278l253l746
56649B15282l386k447j332m26j06l46m84O0R57J457J516J663J891J565O24j05
56633B16383j46n7m08p93n53R3M26L10J58O7l39j170k019k457k383j926j312q42
$$ plain form
56615 203032 202360 201693 201077 200629 200598 201458 203560 206538 209430 211597 213278 215075 217073 218684 219287 218920
56599 218920 218442 218942 220826 223503 226112 228401 230564 232456 233599 234056 234687 236156 238092 239568 240106
56584 240106 239910 239364 238734 238240 238081 238340 238969 239777 240459 240874 241379 242587 244624 246950 249079 251113 253307
56567 253307 255503 257461 259460 261973 264831 267235 268638 269164 269087 268328 266677 264194 261122 257627 253865
56552 253865 250189 246993 244325 241782 238900 235616 232313 229380 226694 223672 219865 215466 211143 207405
56538 207405 204296 201660 199477 197752 196197 194283 191758 189013 186749 185232 184033 182607 181023 179918
56524 179918 179772 180435 181333 181945 182000 181522 180860 180520 180656 180761 180165 178902 177850 177771 178357 178476 177370 175397
56506 175397 173506 172237 171461 170972 170908 171460 172473 173553 174470 175238 175846 176177 176222 176271 176836 178362 180938 184170
$$ packed form
56615B03032o72o67o16m48l1Q60K102K978K892K167J681J797J998J611O03l67
56599B18920m78N00J884K677K609K289K163J892J143M57O31J469J936J476N38
56584B40106j96n46o30m94j59K59O29Q08O82M15N05J208K037K326K129K034K194
56567B53307K196J958J999K513K858K404J403N26p7p59j651k483l072l495l762
56552B53865l676l196k668k543k882l284l303k933k686l022l807m399m323l738
56538B07405l109k636k183j725j555j914k525k745k264j517j199j426j584j105
56524A79918j46O63Q98O12N5m78o62l40J36J05n96j263j052p9N86J19j106j973
56506A75397j891j269p76m89o4N52J013J080R17P68O08L31M5M9N65J526K576L232
$$ plain form
56488 184170 187368 189990 191916 193292 194233 194812 195246 195897 196992 198444 199972 201397 202774 204234 205759
56473 205759 207230 208688 210289 211835 212651 212255 210995 209512 207784 205324 202385 200158 199473 199963 200894
56458 200894 202091 203462 204349 204274 203906 204245 205027 204988 203738 202366 201889 201963 201640 200733 199828 199337 199101 198789
56440 198789 198274 197624 196885 195881 194309 192235 190437 189810 190353 191115 191284 190934 190557 190243 189697 188868 188240
56423 188240 188473 189860 192085 194473 196453 197752 198243 198001 197650 198166 199885 202068 203988 206071 209205
56408 209205 213148 216557 218674 220118 221755 223568 225052 226021 226568 226683 226409 226046 225860 225797 225688 225436 224875
56391 224875 223855 222604 221626 221117 220874 220891 221446 222424 223145 223199 222915 222755 222728 222700 222757 222893 222849 222592 222529 222940
56371 222940 223705 224859 226783 229449 232032 233798 234906 235871 236782 237590 238644 240304 242377 244518 246823
$$ packed form
56488A84170L198K622J926J376R41N79M34O51J095J452J528J425J377J460J525
56473B05759J471J458J601J546Q16l96j260j483j728k460k939k227o85M90R31
56458B00894J197J371Q87p5l68L39P82l9j250j372m77P4l23r07r05m91k36l12
56440A98789n15o50p39j004j572k074j798o27N43P62J69l50l77l14n46q29o28
56423A88240K33J387K225K388J980J299M91k42l51N16J719K183J920K083L134
56408B09205L943L409K117J444J637J813J484R69N47J15k74l63j86o3j09k52n61
56391B24875j020j251r78n09k43J7N55R78P21N4k84j60k7k8N7J36m4k57o3M11
56371B22940P65J154J924K666K583J766J108R65R11Q08J054J660K073K141K305
$$ plain form
56356 246823 249505 252364 255152 258084 261361 264499 266792 268188 269177 270094 271110 272550 274558 276619 278118
56341 278118 279224 280625 282526 284514 286353 288387 291225 295429 301291 308340 315213 320614 324396 327339
56327 327339 330137 333108 336653 341224 346737 352505 357841 362393 366072 369082 372001 375350 379090 382786
56313 382786 386117 388903 390878 391881 392127 391930 391384 390645 390168 390255 390760 391695 393630 396781 400209 402793
56297 402793 404735 407263 411064 415871 421433 427826 434733 441433 447849 454892 463413 473298 483838 494522
56283 494522 505360 516855 529783 544629 561214 579168 598544 619538 641970 665872 692386
56272 692386 723163 758837 798921 843201 892236 946281 1004819 1067675 1135773 1210146 1290739
56261 1290739 1376741 1467508 1562426 1660172 1758842 1856775 1952766 2045388 2132489 2211578 2280646
$$ packed form
56356B46823K682K859K788K932L277L138K293J396R89R17J016J440K008K061J499
56341B78118J106J401J901J988J839K034K838M204N862P049O873N401L782K943
56327C27339K798K971L545M571N513N768N336M552L679L010K919L349L740L696
56313C82786L331K786J975J003K46j97n46p39m77Q7N05R35J935L151L428K584
56297D02793J942K528L801M807N562O393O907O700O416P043Q521R885J0540J0684
56283D94522J0838J1495J2928J4846J6585J7954J9376K0994K2432K3902K6514
56272F92386L0777L5674M0084M4280M9035N4045N8538O2856O8098P4373Q0593
56261A290739Q6002R0767R4918R7746R8670R7933R5991R2622Q7101P9089O9068
$$ plain form
56250 2280646 2338498 2384340 2417376 2437225 2444726 2441701 2429575 2408566 2378522 2340067 2294377 2242282
56238 2242282 2184239 2120933 2053277 1982018 1907911 1831928 1754763 1676546 1597796 1520111 1444980
56227 1444980 1372383 1301752 1233917 1170644 1112341 1057831 1006682 960197 919446 883654 851356
56216 851356 822092 796015 772758 751753 733127 717341 704254 693158 683442 674641 666303 658353
56204 658353 651227 645115 639487 633851 628585 624395 621314 618807 616617 614987 614225 614549 616126 618819 621991
56189 621991 625017 627901 631113 634949 639415 644571 650617 657553 665066 672897 681318 691094 702799 716151
56175 716151 730237 744489 759129 774440 790124 805811 821845 838945 857300 876501 896074
56164 896074 915546 934531 953621 974812 1000082 1029888 1064073 1103926 1151931 1209624 1277313
$$ packed form
56250B280646N7852M5842L3036J9849P501l025j2126k1009l0044l8455m5690n2095
56238B242282n8043o3306o7656p1259p4107p5983p7165p8217p8750p7685p5131
56227A444980p2597p0631o7835o3273n8303n4510n1149m6485m0751l5792l2298
56216H51356k9264k6077k3257k1005j8626j5786j3087j1096r716q801q338p950
56204F58353p126o112n628n636n266m190l081k507k190j630p62L24J577K693L172
56189F21991L026K884L212L836M466N156O046O936P513P831Q421R776J1705J3352
56175G16151J4086J4252J4640J5311J5684J5687J6034J7100J8355J9201J9573
56164H96074J9472J8985J9090K1191K5270K9806L4185L9853M8005N7693O7689
$$ plain form
56153 1277313 1356251 1449635 1560816 1691598 1842612 2013593 2201797 2400574 2600235 2790154
56143 2790154 2960580 3104773 3221535 3315735 3395459 3468204 3538576 3606991 3668755 3715398 3739187
56132 3739187 3737580 3713915 3674929 3627950 3578588 3528329 3473198 3405156 3315520 3198191 3051755
56121 3051755 2880398 2693002 2500360 2312291 2136281 1977195 1837250 1716666 1614935
56112 1614935 1531277 1463894 1409881 1366644 1332860 1307521 1288886 1275109 1265245 1258881 1255381 1254228
56100 1254228 1255417 1258599 1262355 1265172 1266700 1267262 1266694 1264637 1261602 1258668 1256242 1253876 1251176 1248257
56086 1248257 1245544 1243802 1244147 1247235 1252499 1258688 1265065 1271713 1278981 1287172 1296506 1306907 1318037 1329867
56072 1329867 1342879 1357369 1372955 1389196 1406233 1424400 1443622 1463572 1484029 1504720 1525285
$$ packed form
56153A277313P8938R3384J11181J30782J51014J70981J88204J98777J99661J89919
56143B790154J70426J44193J16762R4200P9724P2745P0372O8415O1764M6643K3789
56132C739187j607k3665l8986m6979m9362n0259n5131o8042q9636j17329j46436
56121C051755j71357j87396j92642j88069j76010j59086j39945j20584j01731
56112A614935q3658o7383n4013m3237l3784k5339j8635j3777r864o364l500j153
56100A254228J189L182L756K817J528N62n68k057l035k934k426k366k700k919
56086A248257k713j742L45L088N264O189O377O648P268Q191R334J0401J1130J1830
56072A329867J3012J4490J5586J6241J7037J8167J9222J9950K0457K0691K0565
$$ plain form
56061 1525285 1545765 1566681 1588333 1610502 1633053 1656224 1680157 1704849 1730709 1758256 1787018
56050 1787018 1815742 1844051 1872918 1903142 1934406 1966230 1998681 2031650 2064746 2098530 2134522
56039 2134522 2173144 2212923 2252610 2292854 2334824 2378428 2423020 2468746 2516103 2565209 2616532
56028 2616532 2671250 2729814 2791170 2854374 2919827 2987977 3058137 3129730 3203373 3279522 3357352
56017 3357352 3436212 3516757 3599356 3682965 3767184 3853949 3945453 4041767 4142192 4247435 4358499
56006 4358499 4474784 4595434 4721446 4854417 4994229 5139987 5292262 5452514 5621325
55997 5621325 5798985 5986674 6185244 6394141 6613353 6844915 7090557 7349711 7622155
55988 7622155 7910766 8218952 8547066 8894276 9262424 9655056 10074201 10521394 11000634
$$ packed form
56061A525285K0480K0916K1652K2169K2551K3171K3933K4692K5860K7547K8762
56050A787018K8724K8309K8867L0224L1264L1824L2451L2969L3096L3784L5992
56039B134522L8622L9779L9687M0244M1970M3604M4592M5726M7357M9106N1323
56028B616532N4718N8564O1356O3204O5453O8150P0160P1593P3643P6149P7830
56017C357352P8860Q0545Q2599Q3609Q4219Q6765R1504R6314J00425J05243J11064
56006D358499J16285J20650J26012J32971J39812J45758J52275J60252J68811
55997E621325J77660J87689J98570K08897K19212K31562K45642K59154K72444
55988G622155K88611L08186L28114L47210L68148L92632M19145M47193M79240
$$ plain form
55979 11000634 11517113 12074287 12675331 13326241 14034390 14805748 15647089 16569494 17586252
55970 17586252 18709298 19952051 21334473 22881765 24620714 26582958 28811415 31360319
55962 31360319 34292501 37683405 41627030 46232912 51618954 57912392 65255668 73807629
55954 73807629 83747508 95292448 108714399 124335895 142515770 163644066 188109299
55947 188109299 216146497 247506234 281001618 314139153 343157365 363749606 372391872
55940 372391872 367672125 350815681 325063250 294349968 262117513 230768531 201691158
55933 201691158 175518066 152396801 132211819 114738014 99711952 86851673 75873642
55926 75873642 66514602 58538664 51732437 45907452 40907572 36605290 32890447 29667564
$$ packed form
55979A1000634N16479N57174O01044O50910P08149P71358Q41341R22405J016758
55970A7586252J123046J242753J382422J547292J738949J962244K228457K548904
55962C1360319K932182L390904L943625M605882N386042O293438P343276Q551961
55954G3807629R939879J1544940J3421951J5621496J8179875K1128296K4465233
55947A88109299K8037198L1359737L3495384L3137535K9018212K0592241Q642266
55940C72391872m719747j6856444k5752431l0713282l2232455l1348982k9077373
55933B01691158k6173092k3121265k0184982j7473805j5026062j2860279j0978031
55926G5873642r359040p975938o806227n824985m999880m302282l714843l222883
$$ plain form
55918 29667564 26860158 24408167 22259596 20368428 18697897 17218774 15903934 14728533
55910 14728533 13674088 12727292 11874897 11103301 10402090 9763950 9181581 8647966 8158790
55901 8158790 7711095 7300105 6920279 6568623 6243886 5943372 5663449 5402413 5159914
55892 5159914 4934266 4723146 4526215 4344223 4176038 4019284 3873342 3739027 3615623
55883 3615623 3500842 3393499 3293890 3201677 3115570 3034751 2958199 2882690 2803742 2719003 2629376
55872 2629376 2537179 2444882 2355228 2270423 2190875 2115909 2045488 1979971 1918776 1860901 1806439
55861 1806439 1756017 1709087 1664302 1621262 1580428 1541561 1503674 1466287 1429517 1393351 1358044
55850 1358044 1324752 1294471 1266784 1240813 1216724 1195006 1175078 1156102 1138540 1123361 1110322
$$ packed form
55918B9667564k807406k451991k148571j891168j670531j479123j314840j175401
55910A4728533j054445r46796q52395p71596p01211o38140n82369n33615m89176
55901H158790m47695m10990l79826l51656l24737l00514k79923k61036k42499
55892E159914k25648k11120j96931j81992j68185j56754j45942j34315j23404
55883C615623j14781j07343r9609r2213q6107q0819p6552p5509p8948q4739q9627
55872B629376r2197r2297q9654q4805p9548p4966p0421o5517o1195n7875n4462
55861A806439n0422m6930m4785m3040m0834l8867l7887l7387l6770l6166l5307
55850A358044l3292l0281k7687k5971k4089k1718j9928j8976j7562j5179j3039
$$ plain form
55839 1110322 1098556 1088128 1079387 1071438 1063023 1054285 1045814 1036509 1024437 1009566 993770 978323
55827 978323 963242 948779 935468 922648 908924 894283 879886 865637 849989 832519 814789
55816 814789 798025 781690 765059 748643 733290 719211 706663 696365 688482 682173 676760 672379
55804 672379 669004 665902 662633 659694 657538 655744 653603 650814 647294 643079 638771 635223 632292 628484
55790 628484 622143 612565 600075 585953 572396 561524 553938 548834 545625 544679 546340 550075 554831
55777 554831 559495 562898 564144 563159 560173 554670 545682 533127 517953 500948 482529 463753 446246
55764 446246 430644 416145 402085 388904 377059 365979 354821 343500 332280 321030 309548
55753 309548 298084 286920 275893 264780 253742 243026 232794 223652 216733 212651 210748 209786 209029
$$ packed form
55839A110322j1766j0428q741p949q415q738q471r305j2072j4871j5796j5447
55827I78323j5081j4463j3311j2820j3724j4641j4397j4249j5648j7470j7730
55816H14789j6764j6335j6631j6416j5353j4079j2548j0298p883o309n413m381
55804F72379l375l102l269k939k156j794k141k789l520m215m308l548k931l808
55790F28484o341r578j2490j4122j3557j0872p586n104l209r46J661L735M756
55777E54831M664L403J246r85k986n503q988j2555j5174j7005j8419j8776j7507
55764D46246j5602j4499j4060j3181j1845j1080j1158j1321j1220j1250j1482
55753C09548j1464j1164j1027j1113j1038j0716j0232r142o919m082j903r62p57
$$ plain form
55740 209029 208344 207725 207263 207320 208258 210109 212692 215851 219335 222622 225084 226275 226213 225491 224893 224551 223758
55723 223758 221978 219702 217725 216025 214161 212432 211591 211570 211654 211964 213610 217012 221164 225039 228836 233318
55707 233318 238706 244787 251419 258468 265733 273268 281129 288582 294378 298262 301433 305018 308853 312300
55693 312300 315431 318610 321566 323796 325491 327235 328932 329729 328953 326621 323136 318865 314005 308606 302804
55678 302804 297030 291687 286541 280949 274843 268993 264011 259695 255678 252199 249849 249049 250247 254090
55664 254090 260746 269390 278911 289000 300076 312382 325593 339170 352707 365973 378874 391244
55652 391244 402470 411528 417594 420535 420726 418627 414633 409052 402140 394410 386819 380211 374585 369486
55638 369486 365134 362460 361907 362867 364589 366771 368784 369049 365919 358892 348502 335474 320469 304205
$$ packed form
55740B09029o85o19m62N7R38J851K583L159L484L287K462J191o2p22n98l42p93
55723B23758j780k276j977j700j864j729q41k1Q4L10J646L402M152L875L797M482
55707B33318N388O081O632P049P265P535P861P453N796L884L171L585L835L447
55693C12300L131L179K956K230J695J744J697P97p76k332l485m271m860n399n802
55678C02804n774n343n146n592o106n850m982m316m017l479k350q00J198L843
55664B54090O656Q644R521J0089J1076J2306J3211J3577J3537J3266J2901J2370
55652C91244J1226R058O066K941J91k099l994n581o912p730p591o608n626n099
55638C69486m352k674n53R60J722K182K013K65l130p027j0390j3028j5005j6264
$$ plain form
55624 304205 287269 269967 252728 236277 221086 207065 194125 182564 172506 163457 154967 147284
55612 147284 140866 135637 131192 127279 123593 119656 115476 111868 109424 107627 105655 103544 101707 99784
55598 99784 97000 93506 90352 88209 86981 86636 87429 89083 90644 91483 91849 92165 92400 92449 92596 93250 94518
55581 94518 96277 98332 100420 102442 104792 108040 112156 116473 120526 124477 128559 132611 136460 140321
55567 140321 144409 148450 151941 154718 156892 158390 158972 158719 158231 158145 158473 158474 157243 154532 150979 147474
55551 147474 144345 141263 137858 134173 130458 126785 123027 119131 115229 111480 107906 104442 101192 98527
55537 98527 96780 95803 94960 93682 91937 90160 88874 88466 89106 90656 92726 95018 97557 100571 104291
55522 104291 108966 114803 121664 129023 136534 144506 153463 163300 173244 182724 191983 201659 211841 221637
$$ packed form
55624C04205j6936j7302j7239j6451j5191j4021j2940j1561j0058r049q490p683
55612A47284o418n229m445l913l686l937m180l608k444j797j972k111j837j923
55598I9784k784l494l154k143j228l45P93J654J561Q39L66L16K35M9J47O54J268
55581I4518J759K055K088K022K350L248M116M317M053L951M082M052L849L861
55567A40321M088M041L491K777K174J498N82k53m88q6L28Jj231k711l553l505
55551A47474l129l082l405l685l715l673l758l896l902l749l574l464l250k665
55537I8527j747r77q43j278j745j777j286m08O40J550K070K292K539L014L720
55522A04291M675N837O861P359P511P972Q957R837R944R480R259R676J0182R796
$$ plain form
55508 221637 229528 234167 234955 232035 225879 217022 206158 194175 181816 169435 157252 145738 135417
55495 135417 126231 117456 108448 99372 91009 83878 77781 72268 67292 63110 59645 56452 53491 51486
55481 51486 51007 51452 51454 50276 48349 46437 44833 43503 42509 41950 41799 41943 42137 41875 40782 39211 37944
55464 37944 37140 36083 34266 32111 30284 28880 27772 27204 27367 27806 27923 27762 27654 27438 26776 26037 25951
55447 25951 26416 26457 25523 24180 23329 23326 24044 25239 26535 27499 27990 28174 28164 28031 28156 29004 30304 31092 30904
55428 30904 30487 30853 31949 32739 32395 30974 29064 27231 25889 25325 25584 26413 27405 28248 28862 29339 29734
55411 29734 29960 29902 29610 29241 28867 28478 28129 27895 27658 27163 26333 25368 24487 23747 23228 23176 23779 24801 25592
55392 25592 25557 24675 23557 22913 22899 23100 23194 23406 24024 24653 24374 22864 21048 20326 21147 22495 22860 21700
$$ packed form
55508B21637P891M639P88k920o156q857j0864j1983j2359j2381j2183j1514j0321
55495A35417r186q775r008r076q363p131o097n513m976m182l465l193k961k005
55481E1486m79M45Kj178j927j912j604j330r94n59j51J44J94k62j093j571j267
55464C7944q04j057j817k155j827j404j108n68J63M39J17j61j08k16o62p39q6
55447B5951M65M1r34j343q51lP18J195J296R64M91J84j0j33J25Q48J300P88j88
55428C0904m17L66J096P90l44j421j910j833j342n64K59Q29R92Q43O14M77L95
55411B9734K26n8k92l69l74l89l49k34k37m95q30r65q81p40n19n2O03J022P91
55392B5592l5q82j118o44j4K01R4K12O18O29k79j510j816p22Q21J348L65j160
$$ plain form
55374 21700 19934 18961 19239 19920 19911 19100 18336 18326 18894 19435 19862 20682 22078 23234 23005 21296 19364 18442
55356 18442 18371 18088 17259 16760 17352 18563 19320 19287 19049 19176 19599 19881 19725 19160 18439 17743 16923 15761 14587
55337 14587 14241 15083 16374 17109 17208 17360 17856 18213 17994 17428 17044 17056 17348 17843 18720 20285 22491 24444
55319 24444 24766 22935 20152 18315 18154 18821 19273 19418 19729 20377 21105 21614 21721 21391 20830 20391 20201 20079
55301 20079 19898 19792 19896 20176 20593 21109 21448 21223 20518 19997 20151 20711 21032 20901 20696 20943 21891 23318 24572
55282 24572 24989 24421 23211 21621 19635 17503 16025 15879 16822 17924 18469 18389 18028 17840 18206 19136 20162
55265 20162 20825 21258 21935 22800 23058 22050 20102 18219 17040 16382 15831 15484 15811 16876 18028 18542 18373
55248 18373 18074 18091 18394 18712 18821 18571 17966 17358 17314 18039 19059 19624 19395 18706 18268 18604 19561 20311 20035
$$ packed form
55374B1700j766r73K78O81rq11p64j0N68N41M27Q20J396J156k29j709j932r22
55356A8442p1k83q29m99N92J211P57l3k38J27M23K82j56n65p21o96q20j162j174
55337A4587l46Q42J291P35R9J52M96L57k19n66l84J2K92M95Q77J565K206J953
55319B4444L22j831k783j837j61O67M52J45L11O48P28N09J07l30n61m39j90j22
55301B0079j81j06J04K80M17N16L39k25p05n21J54N60L21j31k05K47R48J427J254
55282B4572M17n68j210j590j986k132j478j46R43J102N45q0l61j88L66R30J026
55265B0162O63M33O77Q65K58j008j948j883j179o58n51l47L27J065J152N14j69
55248A8373k99J7L03L18J09k50o05o08m4P25J020N65k29o89m38L36R57P50k76
$$ plain form
55229 20035 18745 17290 16450 16264 16302 16315 16295 16113 15485 14386 13200 12398 12142 12278 12587 12975 13473 14154 15076
55210 15076 16244 17523 18604 19230 19549 20101 21220 22559 23415 23497 23113 22640 22207 21956 22198 22994 23785 23826
55192 23826 22965 21816 21174 21374 22171 23050 23613 23739 23465 22875 22195 21815 21946 22246 22128 21561 21280 22000 23601
55173 23601 25241 26094 25860 24832 23767 23519 24378 25690 26368 25921 24889 24233 24398 25055 25675 26160 26742
55156 26742 27305 27184 25888 23841 22011 20923 20423 20357 20867 21840 22665 22921 22832 22571 21639 19655 17453 16523
55138 16523 17294 18686 19545 19867 20311 21121 22071 23036 23984 24577 24339 23321 22287 22139 23348 25830 29034
55121 29034 32127 34442 35939 37051 38053 38834 39340 39838 40434 40635 39831 38155 36430 35257 34492 33783
55105 33783 33174 32904 32861 32654 32208 31948 32271 33053 33816 34247 34357 34179 33577 32591 31818 32058 33338 34579 34633
$$ packed form
55229B0035j290j455q40j86L8J3k0j82o28j099j186q02k56J36L09L88M98O81R22
55210A5076J168J279J081O26L19N52J119J339Q56Q2l84m73m33k51K42P96P91M1
55192B3826q61j149o42K00P97Q79N63J26k74n90o80l80J31L00j18n67k81P20J601
55173B3601J640Q53k34j028j065k48Q59J312O78m47j032o56J65O57O20M85N82
55156B6742N63j21j296k047j830j088n00o6N10R73Q25K56q9k61r32j984k202r30
55138A6523P71J392Q59L22M44Q10R50R65R48N93k38j018j034j48J209K482L204
55121B9034L093K315J497J112J002P81N06M98N96K01q04j676j725j173p65p09
55105C3783o09k70m3k07m46k60L23P82P63M31J10j78o02r86p73K40J280J241N4
$$ plain form
55086 34633 33560 32483 32218 32549 32951 33364 33869 34088 33596 32690 32120 32073 32007 31593 31256 31556 32427 33310 33806
55067 33806 33940 33960 34100 34409 34664 34555 34045 33468 33215 33388 33775 33988 33656 32721 31644 31086 31291 31892 32384
55048 32384 32578 32532 32295 31940 31757 32187 33445 35254 37046 38510 39937 41824 44095 46013 47024 47409
55032 47409 47794 48380 49051 49950 51247 52462 52805 52314 51956 52319 52881 52953 52698 52637 52582 51806 50080 47898 45761
55013 45761 43758 41942 40580 39820 39403 38926 38269 37676 37480 37753 38219 38519 38581 38598 38661 38647 38574 38756 39351 39988
54993 39988 40200 40124 40397 41328 42470 43105 43009 42606 42483 42891 43724 44908 46602 48857 51192 52849 53593 54037
54975 54037 55045 56942 59401 61940 64413 67179 70855 75815 81820 88296 94944 101886 109286 117241
54961 117241 126159 136750 149318 163263 177542 191391 204353 215874 225181 231408 233645 231176
$$ packed form
55086C4633j073j077k65L31M02M13N05K19m92r06n70m7o6m14l37L00Q71Q83M96
55067C3806J34K0J40L09K55j09n10n77k53J73L87K13l32r35j077n58K05O01M92
55048C2384J94m6k37l55j83M30J258J809J792J464J427J887K271J918J011L85
55032D7409L85N86O71Q99J297J215L43m91l58L63N62P2k55o1n5p76j726k182k137
55013D5761k003j816j362p60m17m77o57n93j96K73M66L00O2J7O3j4p3J82N95O37
54993C9988K12p6K73R31J142O35r6m03j23M08Q33J184J694K255K335J657P44M44
54975E4037J008J897K459K539K473K766L676M960O005O476O648O942P400P955
54961A17241Q918J0591J2568J3945J4279J3849J2962J1521R307O227K237k469
$$ plain form
54949 231176 224033 213188 199900 185074 169485 154241 140438 128406 117772 108283 100192 93789
54937 93789 88917 85085 81811 78781 75955 73584 71985 71227 71161 71746 73112 75252 77805 80270 82492
54922 82492 84985 88755 94578 102273 110862 119670 129112 140169 153129 167051 180330 191556 199861
54909 199861 204788 206071 203607 197636 188856 178158 166199 153384 140208 127306 115142 104016
54897 104016 94410 86833 81093 76230 71572 67417 64284 61953 59872 58061 56898 56176 55243 54038 53210
54882 53210 53090 53279 53466 53975 55080 56308 56871 56472 55308 53580 51410 49122 47171 45721 44464 42909
54866 42909 40828 38458 36343 34954 34455 34786 35752 36942 37812 38129 38159 38116 37669 36479 35076 34550 35214
54849 35214 36114 36130 35104 33615 32093 30583 29101 27721 26445 25394 25110 26245 28787 31776 34015
$$ packed form
54949B31176p143j0845j3288j4826j5589j5244j3803j2032j0634r489q091o403
54937I3789m872l832l274l030k826k371j599p58o6N85J366K140K553K465K222
54922H2492K493L770N823P695Q589Q808R442J1057J2960J3922J3279J1226Q305
54909A99861M927J283k464n971q780j0698j1959j2815j3176j2902j2164j1126
54897A04016r606p577n740m863m658m155l133k331k081j811j163p22r33j205q28
54882E3210j20J89J87N09J105J228N63l99j164j728k170k288j951j450j257j555
54866D2909k081k370k115j389m99L31R66J190Q70L17L0m3m47j190j403n26O64
54849C5214R00J6j026j489j522j510j482j380j276j051k84J135K542K989K239
$$ plain form
54834 34015 34993 35115 35124 35420 35922 36429 37022 38044 39749 41974 44162 45828 47054 48442 50418 52689 54624
54817 54624 56101 57627 59641 62152 65182 69075 74064 79932 86495 94064 103047 113408 124845 137188
54803 137188 150120 162853 174648 185386 195023 202742 207389 208616 206841 202181 194404 184122 173147
54790 173147 163115 154263 145948 137802 129906 122299 114990 108353 103034 99368 97051 95430 94126 93437
54776 93437 94035 96067 98803 101473 104291 108109 113178 118900 124874 131537 139538 148986 159526 170620
54762 170620 181553 191766 201528 211716 222495 232582 240183 244271 244620 241131 233833 223301 210546
54749 210546 196498 181835 167129 152829 139280 126955 116404 107664 99976 92423 84702 77139
54737 77139 70238 64488 60242 57355 55125 52918 50713 48827 47380 46298 45604 45373 45536 45957 46400 46382
$$ packed form
54834C4015R78J22RK96N02N07N93J022J705K225K188J666J226J388J976K271J935
54817E4624J477J526K014K511L030L893M989N868O563P569Q983J0361J1437J2343
54803A37188J2932J2733J1795J0738R637P719M647J227j775m660p777j0282j0975
54790A73147j0032q852q315q146p896p607p309o637n319l666k317j621j304o89
54776I3437N98K032K736K670K818L818N069N722N974O663Q001R448J0540J1094
54762A70620J0933J0213R762J0188J0779J0087P601M088L49l489p298j0532j2755
54749B10546j4048j4663j4706j4300j3549j2325j0551q740p688p553p721p563
54737G7139o901n750m246k887k230k207k205j886j447j082o94k31J63M21M43j8
$$ plain form
54721 46382 45430 43765 42303 41671 41636 41824 42438 43727 45200 46021 45956 45431 44910 44742 45295 46602 48027 48865
54703 48865 49145 49355 49598 49603 49396 49355 49646 50083 50430 50454 49967 49399 49928 52249 55456 58001 59569 60993 62425
54684 62425 62916 62116 61219 61468 62585 63494 63948 64639 66019 67847 69771 71739 73815 75973 78078 79880
54668 79880 81183 82232 83677 85919 88697 91602 94728 98498 103094 108468 114736 122139 130612 139767
54654 139767 149293 159106 168975 178166 185526 189996 191130 189212 184853 178616 171132 163302 155797 148330
54640 148330 140015 130775 121854 114499 108546 102869 96932 91226 86314 82196 78785 76338 74979 74165
54626 74165 73118 71629 70124 69028 68424 68245 68417 68646 68452 67717 67017 66983 67338 67002 65345 62992 61034
54609 61034 59717 58362 56491 54554 53390 53328 53994 54721 54967 54597 53966 53614 53700 53843 53596 52930 52155 51558
$$ packed form
54721D6382r52j665j462o32l5J88O14J289J473Q21o5n25n21j68N53J307J425Q38
54703D8865K80K10K43Nk07m1K91M37L47K4m87n68N29K321L207K545J568J424J432
54684F2425M91q00q97K49J117R09M54O91J380J828J924J968K076K158K105J802
54668G9880J303J049J445K242K778K905L126L770M596N374O268P403Q473R155
54654A39767R526R813R869R191P360M470J134j918m359o237p484p830p505p467
54640A48330q315r240q921p355n953n677n937n706m912m118l411k447j359q14
54626G4165j047j489j505j096o04j79J72K29j94p35p00l4L55l36j657k353j958
54609F1034j317j355j871j937j164o2O66P27K46l70o31l52Q6J43k47o66p75n97
$$ plain form
54591 51558 51255 51227 51453 52100 53509 55635 57557 58097 57151 55882 55258 54903 53944 52522 51658 51801 52342 52637
54573 52637 52755 52995 53309 53562 53904 54475 55074 55471 55729 55935 55964 55881 56217 57331 58700 59413 59322 59217 59833
54554 59833 61113 62511 63610 64327 64950 66187 68831 73021 77991 82739 86782 90175 93096 95745 98443
54539 98443 101393 104232 106040 105983 104009 100916 97666 94532 91002 86732 82421 79276 77553 76215 74259
54524 74259 71831 69599 67610 65536 63642 62556 62109 61308 59728 58138 57411 57501 57896 58472 59288 59990 60103
54507 60103 59697 59214 58820 58401 58022 57868 57806 57516 57013 56605 56338 55970 55530 55466 56043 56905 57422 57326 56966 57037
54487 57037 57973 59418 60441 60498 59986 59528 58987 57785 56084 54969 55261 56658 58228 59293 59633 59308 58685
54470 58685 58283 58292 58428 58419 58279 57986 57418 56909 57286 58766 60280 60518 59458 58227 57650 57663 58018 58721 59558
$$ packed form
54591E1558l03k8K26O47J409K126J922N40r46j269o24l55r59j422q64J43N41K95
54573E2637J18K40L14K53L42N71N99L97K58K06K9q3L36J114J369P13r1j05O16
54554E9833J280J398J099P17O23J237K644M190M970M748M043L393K921K649K698
54539I8443K950K839J808n7j974l093l250l134l530m270m311l145j723j338j956
54524G4259k428k232j989k074j894j086m47q01j580j590p27R0L95N76Q16P02J13
54507F0103m06m83l94m19l79j54o2k90n03m08k67l68m40o4N77Q62N17r6l60P1
54487E7037R36J445J023N7n12m58n41j202j701j115K92J397J570J065L40l25o23
54470E8685m02RJ36rj40k93n68n09L77J480J514K38j060j231n77J3L55P03Q37
$$ plain form
54451 59558 59975 59777 59427 59256 58942 58218 57609 57810 58633 59245 59379 59644 60579 61985 63407 64727 65978 66883
54433 66883 67042 66400 65303 64193 63400 63045 62946 62735 62288 61881 61773 61915 62298 63249 64939 66864 68352 69509
54415 69509 71039 73108 75036 76324 77370 78754 80339 81588 82445 83305 84262 84954 85157 85095 85024 84780 83934
54398 83934 82309 80328 78848 78458 78863 79153 78834 78295 78032 77840 77211 76308 75893 76312 77036 77316 76899 75974
54380 75974 74804 73547 72212 70692 69023 67563 66604 65878 64853 63513 62383 61726 61266 60926 61285 62846
54364 62846 65161 67157 68191 68456 68500 68700 69185 69933 70850 71875 72997 74117 75003 75488 75643 75669 75756 76135
54346 76135 77027 78322 79404 79549 78532 76754 74908 73593 73029 72873 72379 71065 69254 67704 66641 65389
54330 65389 63218 60431 58270 57595 57870 57712 56412 54589 53297 52818 52617 52200 51550 50765 49730 48332
$$ packed form
54451E9558M17j98l50j71l14p24o09K01Q23O12J34K65R35J406J422J320J251R05
54433F6883J59o42j097j110p93l55r9k11m47m07j08J42L83R51J690J925J488J157
54415F9509J530K069J928J288J046J384J585J249Q57Q60R57O92K03o2p1k44q46
54398H3934j625j981j480l90M05K90l19n39k63j92o29r03m15M19P24K80m17r25
54380G5974j170j257j335j520j669j460r59p26j025j340j130o57m60l40L59J561
54364F2846K315J996J034K65M4K00M85P48R17J025J122J120Q86M85J55K6Q7L79
54346G6135Q92J295J082J45j017j778j846j315n64j56m94j314j811j550j063j252
54330F5389k171k787k161o75K75j58j300j823j292m79k01m17o50p85j035j398
$$ plain form
54314 48332 46817 45678 45244 45390 45603 45403 44866 44639 45275 46574 47821 48548 48803 48821 48804 49024 49687 50558
54296 50558 51078 51006 50669 50489 50591 50984 51742 52764 53676 54210 54449 54569 54609 54695 55097 55825 56485 56829 57188 57992
54276 57992 59129 60113 60686 60947 61100 61404 62168 63338 64204 63991 62775 61485 60914 60999 61136 60901 60343 59708
54258 59708 59109 58545 58191 58441 59425 60542 60876 60158 59080 58497 58630 59138 59586 59622 59078 58254 57786 57904 58090
54239 58090 57828 57356 57259 57579 57832 57745 57506 57384 57549 58075 58724 58894 58272 57395 57027 57147 57157 57015 57417 58756
54219 58756 60499 61832 62386 62173 61348 60300 59508 59046 58620 58248 58368 59039 59609 59626 59537 59936 60557 60683 60304
54200 60304 60143 60520 60892 60678 60047 59545 59318 58994 58184 56820 55091 53324 51884 51036 50785 50935 51286 51690
54182 51690 51909 51657 50935 50178 49789 49554 48852 47550 46347 45996 46448 47074 47464 47631 47555 47102 46451 46170 46622
$$ packed form
54314D8332j515j139m34J46K13k00n37k27O36J299J247P27K55J8j7K20O63Q71
54296E0558N20p2l37j80J02L93P58J022R12N34K39J20M0Q6M02P28O60L44L59Q04
54276E7992J137R84N73K61J53L04P64J170Q66k13j216j290n71Q5J37k35n58o35
54258E9708n99n64l54K50R84J117L34p18j078n83J33N08M48L6n44q24m68J18J86
54239E8090k62m72r7L20K53q7k39j22J65N26O49J70o22q77l68J20J0j42M02J339
54219E8756J743J333N54k13q25j048p92m62m26l72J20O71N70J7q9L99O21J26l79
54200F0304j61L77L72k14o31n02k27l24q10j364j729j767j440q48k51J50L51M04
54182E1690K19k52p22p57l89k35p02j302j203l51M52O26L90J67p6m53o51k81M52
$$ plain form
54163 46622 47533 48299 48532 48181 47366 46263 45097 44139 43705 44047 45060 46194 46916 47209 47334 47258 46742 46005
54145 46005 45725 46180 46855 47212 47465 48168 49287 50131 50111 49251 48033 47034 46634 46766 46893 46472 45484 44420
54127 44420 43762 43614 43784 44040 44309 44695 45359 46321 47420 48449 49238 49618 49521 49175 48999 49150 49324 49125 48508
54108 48508 47717 46947 46261 45736 45543 45875 46860 48374 49911 50841 50956 50652 50490 50732 51379 52357 53478 54411
54090 54411 54972 55259 55339 55114 54748 54885 55948 57371 58096 57823 57289 57252 57632 57839 57527 56806 56021 55574 55748
54071 55748 56442 57176 57617 58014 58923 60526 62360 63747 64469 64994 65999 67599 69147 69958 70141 70455 71371
54054 71371 72590 73542 74001 74051 73828 73608 73884 74904 76280 77431 78395 79840 82223 85307 88570 91762
54038 91762 94857 97819 100723 103898 107674 111984 116480 120949 125386 129701 133630 136979 139777 142179
$$ packed form
54163D6622R11P66K33l51q15j103j166r58m34L42J013J134P22K93J25p6n16p37
54145D6005k80M55O75L57K53P03J119Q44k0q60j218r99m00J32J27m21r88j064
54127D4420o58j48J70K56K69L86O64R62J099J029P89L80r7l46j76J51J74j99o17
54108D8508p91p70o86n25j93L32R85J514J537R30J15l04j62K42O47R78J121R33
54090E4411N61K87Q0k25l66J37J063J423P25k73n34l7L80K07l12p21p85m47J74
54071E5748O94P34M41L97R09J603J834J387P22N25J005J600J548Q11J83L14R16
54054G1371J219R52M59N0k23k20K76J020J376J151R64J445K383L084L263L192
54038I1762L095K962K904L175L776M310M496M469M437M315L929L349K798K402
$$ plain form
54024 142179 144426 146857 149654 152478 154611 155626 155676 155054 153751 151761 149551 147753 146466 145245 143766
54009 143766 142107 140302 138029 135021 131506 127924 124390 120730 117018 113701 111088 108908 106593 103957
53995 103957 101435 99543 98193 96697 94530 91932 89667 88256 87574 87087 86316 85129 83837 82990 82829
53980 82829 82919 82541 81566 80695 80763 81939 83752 85613 87116 88005 88197 87888 87492 87371 87596 87862 87680 86823
53962 86823 85623 84688 84252 84058 83879 83836 84014 84175 84212 84611 86016 88390 91071 93636 96325 99553 103334
53945 103334 107389 111577 116074 121207 127157 133663 140083 145981 151689 157975 165066 172177 178079 181978
53931 181978 183808 183991 183134 181781 180259 178762 177579 177032 177112 177469 177950 178886 180626 182981 185490 188080
53915 188080 191097 194739 198824 203183 207893 212938 217937 222509 226695 230725 234387 236979 238000 237714
$$ packed form
54024A42179K247K431K797K824K133J015N0o22j303j990k210j798j287j221j479
54009A43766j659j805k273l008l515l582l534l660l712l317k613k180k315k636
53995A03957k522j892j350j496k167k598k265j411o82m87p71j187j292q47j61
53980H2829R0l78r75q71O8J176J813J861J503Q89J92l09l96j21K25K66j82q57
53962H6823j200r35m36j94j79m3J78J61L7L99J405K374K681K565K689L228L781
53945A03334M055M188M497N133N950O506O420N898N708O286P091P111N902L899
53931A81978J830J83q57j353j522j497j183n47Q0L57M81R36J740K355K509K590
53915A88080L017L642M085M359M710N045M999M572M186M030L662K592J021k86
$$ plain form
53901 237714 236886 236055 235189 233984 232335 230424 228407 226182 223448 219955 215603 210359 204232 197413 190309
53886 190309 183318 176616 170291 164606 159862 155949 152303 148525 144878 141875 139485 137078 134219 131151
53872 131151 128327 125729 122976 119992 117221 115094 113460 111646 109047 105588 101718 98006 94771 92039
53858 92039 89738 87813 86221 84962 84159 83922 84034 83960 83317 82230 81086 80055 79040 77961 76893 75941
53842 75941 75223 74946 75240 75897 76516 76972 77526 78388 79415 80403 81422 82632 83873 84754 85155 85479 86232 87409
53824 87409 88357 88285 87038 85364 84406 84841 86523 88840 91221 93292 94839 95876 96657 97437 98235 98986 99842
53807 99842 101078 102728 104572 106559 109045 112446 116733 121412 125951 130150 134114 137958 141530 144440
53793 144440 146406 147545 148309 149145 150340 152107 154504 157103 158987 159437 158595 157213 155752 154021 151716
$$ packed form
53901B37714q28q31q66j205j649j911k017k225k734l493m352n244o127o819p104
53886A90309o991o702o325n685m744l913l646l778l647l003k390k407k859l068
53872A31151k824k598k753k984k771k127j634j814k599l459l870l712l235k732
53858I2039k301j925j592j259q03k37J12p4o43j087j144j031j015j079j068r52
53842G5941p18k77K94O57O19M56N54Q62J027R88J019J210J241Q81M01L24P53J177
53824H7409R48p2j247j674r58M35J682K317K381K071J547J037P81P80P98P51Q56
53807I9842J236J650J844J987K486L401M287M679M539M199L964L844L572K910
53793A44440J966J139P64Q36J195J767K397K599J884M50q42j382j461j731k305
$$ plain form
53778 151716 148987 146215 143424 140245 136487 132520 128929 125866 122853 119330 115415 111988 109820 108678
53764 108678 107497 105507 102941 100533 98607 96940 95302 93725 92297 91005 89809 88612 87177 85435
53750 85435 83823 82905 82516 81813 80441 79221 79165 80091 80807 80597 79873 79252 78633 77614 76404 75718 75820 76172
53732 76172 76139 75676 75104 74571 74055 73741 73990 74895 76124 77270 78110 78461 78136 77261 76386 75964 75870 75731 75496
53713 75496 75322 75015 74192 73045 72430 72906 74090 75270 76325 77664 79514 81654 83661 85059 85376 84557
53697 84557 83375 83018 84137 86493 89562 93109 97004 100715 103343 104246 103604 102350 101490 101373 101584 101489
53681 101489 100886 100121 99794 100382 101889 103683 104942 105558 106439 108565 111853 115218 117650 118890 119230 119152
53665 119152 119173 119487 119666 119160 118231 117838 118354 118936 118618 117594 116876 116951 117404 117715 117853 117986 118150 118353 118654
$$ packed form
53778A51716k729k772k791l179l758l967l591l063l013l523l915l427k168j142
53764A08678j181j990k566k408j926j667j638j577j428j292j196j197j435j742
53750H5435j612r18l89p03j372j220n6R26P16k10p24o21o19j019j210o86J02L52
53732G6172l3m63n72n33n16l14K49R05J229J146Q40L51l25q75q75m22r4j39k35
53713G5496j74l07q23j147o15M76J184J180J055J339J850K140K007J398L17q19
53697H4557j182l57J119K356L069L547L895L711K628R03o42j254q60j17K11r5
53681A01489o03p65l27N88J507J794J259O16Q81K126L288L365K432J240L40p8
53665A19152K1L14J79n06r29l93N16N82l18j024p18P5M53L11J38J33J64K03L01
$$ plain form
53646 118654 118950 118939 118442 117590 116624 115732 115152 115159 115817 116968 118550 120556 122507 123410 122776 121474 121007 121834
53628 121834 122922 123080 122307 121485 121211 121464 122189 123524 125288 126762 127347 127249 127190 127613 128329 128894 129116 129249
53610 129249 129816 131134 132911 134453 135424 136211 137401 139058 140789 142325 143704 145016 146390 148169 150659
53595 150659 153612 156345 158555 160674 163298 166496 169854 172931 175491 177523 179245 180934 182613 184073
53581 184073 185228 186230 187145 187865 188448 189183 190106 190864 191325 191935 193080 194429 195388 195894 196223 196223 195357 193518
53563 193518 191266 189262 187942 187692 188667 190260 191305 191138 190117 188929 187781 186535 185156 183750 182466
53548 182466 181696 181975 183254 184551 184805 184020 183208 183285 184333 185833 187204 188104 188549 188858 189318 189917 190492
53531 190492 191030 191584 192053 192307 192427 192572 192733 192949 193613 195104 197188 199276 201335 204019 207738 212082
$$ packed form
53646A18654K96j1m97q52r66q92n80PO58J151J582K006J951R03o34j302m67Q27
53628A21834J088J58p73q22k74K53P25J335J764J474N85r8n9M23P16N65K22J33
53610A29249N67J318J777J542R71P87J190J657J731J536J379J312J374J779K490
53595A50659K953K733K210K119K624L198L358L077K560K032J722J689J679J460
53581A84073J155J002R15P20N83P35R23P58M61O10J145J349R59N06L29%q66j839
53563A93518k252k004j320k50R75J593J045j67j021j188j148j246j379j406j284
53548A82466p70K79J279J297K54p85q12P7J048J500J371R00M45L09M60N99N75
53531A90492N38N54M69K54J20J45J61K16O64J491K084K088K059K684L719M344
$$ plain form
53515 212082 216435 220746 225353 230375 235614 240847 245923 250821 255911 261832 268754 276053 283127 290241
53501 290241 298050 306537 315126 323812 333465 344824 357772 371728 386190 400643 414530 427763
53489 427763 440885 454438 468502 483060 498243 513744 528638 542444 555941 570176 585023
53478 585023 599618 613930 628811 644413 659733 674141 688296 702859 717177 730227 742295
53467 742295 754608 767488 779937 791146 801504 811784 822054 831940 841467 851089 860976 870655
53455 870655 879340 886489 892205 897183 902089 906782 910276 911582 910417 907037 901737 894858 887031 878932
53441 878932 870750 862221 853244 844223 835664 827586 819442 810473 800152 788467 775933 763211 750626
53428 750626 738127 725711 713678 702279 691300 680321 669392 659224 650553 643528 637826 633207
$$ packed form
53515B12082M353M311M607N022N239N233N076M898N090N921O922P299P074P114
53501B90241P809Q487Q589Q686R653J1359J2948J3956J4462J4453J3887J3233
53489D27763J3122J3553J4064J4558J5183J5501J4894J3806J3497J4235J4847
53478E85023J4595J4312J4881J5602J5320J4408J4155J4563J4318J3050J2068
53467G42295J2313J2880J2449J1209J0358J0280J0270R886R527R622R887R679
53455H70655Q685P149N716M978M906M693L494J306j165l380n300o879p827q099
53441H78932q182q529q977r021q559q078q144q969j0321j1685j2534j2722j2585
53428G50626j2499j2416j2033j1399j0979j0979j0929j0168q671p025n702m619
$$ plain form
53416 633207 629686 627232 625622 624679 624407 624738 625338 625886 626514 627784 630289 634334 639878 646533 653660 660744
53400 660744 667795 675280 683720 693502 704880 717742 731345 744818 758164 772430 788574 806521
53388 806521 825641 845669 866602 888062 909666 931988 956343 983283 1011922 1041041 1070234
53377 1070234 1099632 1129194 1158973 1189612 1221734 1254979 1288328 1321304 1354152 1386875 1418910
53366 1418910 1449900 1480054 1509374 1537139 1562672 1586163 1608265 1629254 1649067 1667801 1685555
53355 1685555 1701979 1716535 1729090 1739630 1747424 1751156 1750111 1744793 1736139 1724514 1709684 1691371
53343 1691371 1669517 1644320 1616382 1586711 1556270 1525570 1494816 1464215 1433916 1403829 1373851
53332 1373851 1344239 1315571 1288393 1263009 1239370 1216867 1194369 1170890 1146328 1121297 1096261
$$ packed form
53416F33207l521k454j610r43k72L31O00N48O28J270K505M045N544O655P127P084
53400F60744P051P485Q440R782J1378J2862J3603J3473J3346J4266J6144J7947
53388H06521J9120K0028K0933K1460K1604K2322K4355K6940K8639K9119K9193
53377A070234K9398K9562K9779L0639L2122L3245L3349L2976L2848L2723L2035
53366A418910L0990L0154K9320K7765K5533K3491K2102K0989J9813J8734J7754
53355A685555J6424J4556J2555J0540P794L732j045n318q654j1625j4830j8313
53343A691371k1854k5197k7938k9671l0441l0700l0754l0601l0299l0087k9978
53332A373851k9612k8668k7178k5384k3639k2503k2498k3479k4562k5031k5036
$$ plain form
53321 1096261 1071200 1046161 1021750 998760 977498 957738 939192 921838 905850 891378 878352
53310 878352 866387 855049 844338 834726 826406 818647 810247 800683 790540 780771 771857 763753 756262
53297 756262 749168 742250 735527 729345 723907 718913 714099 710021 707760 707655 708789 710036 711285 713273
53283 713273 716525 720932 726277 732598 739901 747969 756723 766492 777608 789844 802568 815378 828324
53270 828324 841501 854678 867471 879725 891531 903008 914220 925281 936277 946992 956889 965555
53258 965555 973051 979634 985135 988875 990344 989735 987669 984478 979958 973784 965908 956473 945500 932810
53244 932810 918288 902197 885211 868066 851086 834075 816753 799211 781828 764772 747830
53233 747830 730816 714025 698132 683669 670660 658688 647200 635744 624018 611789 598865
$$ packed form
53321A096261k5061k5039k4411k2990k1262j9760j8546j7354j5988j4472j3026
53310H78352j1965j1338j0711r612q320p759q400r564j0143r769q914q104p491
53297G56262p094o918o723o182n438m994m814m078k261j05J134J247J249J988
53283G13273L252M407N345O321P303Q068Q754R769J1116J2236J2724J2810J2946
53270H28324J3177J3177J2793J2254J1806J1477J1212J1061J0996J0715R897Q666
53258I65555P496O583N501L740J469o09k066l191m520o174p876r435j0973j2690
53244I32810j4522j6091j6986j7145j6980j7011j7322j7542j7383j7056j6942
53233G47830j7014j6791j5893j4463j3009j1972j1488j1456j1726j2229j2924
$$ plain form
53222 598865 585210 571093 557053 543601 530883 518606 506304 493845 481703 470729 461526 454087
53210 454087 447994 442836 438262 433786 428850 423240 417206 411075 404829 398183 390946 383087 374503 364995
53196 364995 354609 343885 333560 323957 314807 305718 296732 288269 280631 273732 267341 261334 255623
53183 255623 250107 244862 240165 236072 232081 227553 222430 217246 212433 207898 203357 198727 194025 189114
53169 189114 183871 178521 173559 169284 165499 161744 157845 154244 151706 150565 150336 150185 149699 148963 148009
53154 148009 146639 144890 143222 141910 140582 138775 136747 135249 134520 133983 133090 132029 131324 131023 130687 130094
53138 130094 129550 129407 129582 129758 129872 130135 130638 131154 131347 131028 130238 129273 128558 128231 127850 126866 125436 124325
53120 124325 123829 123340 122322 121227 120833 121013 120857 119925 118681 117724 117238 117287 117905 118689 118907 118303 117321 116359
$$ packed form
53222E98865j3655j4117j4040j3452j2718j2277j2302j2459j2142j0974r203p439
53210D54087o093n158m574m476m936n610o034o131o246o646p237p859q584r508
53196C64995j0386j0724j0325r603r150r089q986q463p638o899o391o007n711
53183B55623n516n245m697m093l991m528n123n184m813m535m541m630m702m911
53169A89114n243n350m962m275l785l755l899l601k538j141k29j51m86p36r54
53154A48009j370j749j668j312j328j807k028j498p29n37q93j061p05l01l36n93
53138A30094n44j43J75J76J14K63N03N16J93l19p90r65p15l27l81r84j430j111
53120A24325m96m89j018j095l94J80j56r32j244r57m86M9O18P84K18o04r82r62
$$ plain form
53102 116359 115404 114631 114602 115448 116450 116916 116908 116626 115803 114415 113331 113250 113397 112338 110012 107923 107298 107921
53084 107921 108934 109854 110508 110702 110460 110119 109929 109964 110560 112163 114496 116473 117322 117255 116675 115444 113569
53067 113569 112065 112272 114447 117651 120905 123801 126008 127005 126668 125715 125143 125299 125737 125839 125402 124680 124071
53050 124071 123863 124149 124773 125312 125295 124708 124201 124544 125782 127086 127565 127057 126044 124965 123812 122364 120644
53033 120644 119085 118223 118248 118900 119809 120743 121513 121912 122031 122373 123227 124082 124153 123477 122952 123119 123474 123299 122745
53014 122745 122652 123526 125072 126594 127562 127927 128160 128904 130406 132309 134059 135366 136204 136686 137112 137849 138889
52997 138889 139724 139973 139964 140433 141708 143378 144637 144878 144192 143479 143778 145240 146963 148038 148462 148747 149059
52980 149059 149266 149595 150609 152504 154842 156976 158429 158999 158948 159078 160134 161998 163793 164833 165208 165462
$$ packed form
53102A16359r55p73k9Q46J002M66qk82q23j388j084q1J47j059k326k089o25O23
53084A07921J013R20O54J94k42l41j90L5N96J603K333J977Q49o7n80j231j875
53067A13569j504K07K175L204L254K896K207R97l37r53n72J56M38J02m37p22o09
53050A24071k08K86O24N39j7n87n07L43J238J304M79n08j013j079j153j448j720
53033A20644j559q62K5O52R09R34P70L99J19L42Q54Q55P1o76n25J67L55j75n54
53014A22745r3Q74J546J522R68L65K33P44J502J903J750J307Q38M82M26P37J040
52997A38889Q35K49rM69J275J670J259K41o86p13K99J462J723J075M24K85L12
52980A49059K07L29J014J895K338K134J453N70n1J30J056J864J795J040L75K54
$$ plain form
52964 165462 166029 167047 168380 169714 170840 171839 172804 173498 173660 173508 173535 173849 174175 174466 174957 175520 175571 174840
52946 174840 173730 172673 171682 170860 170792 171843 173344 174069 173445 171922 170324 169262 169026 169551 170395 171070 171469
52929 171469 171758 171939 171822 171485 171443 172162 173541 174935 175691 175712 175601 176140 177480 178905 179575 179462 179345 179909
52911 179909 181074 182229 182911 183119 183067 182833 182290 181371 180327 179528 178995 178310 177144 175717 174518 173645 172694
52894 172694 171250 169242 166800 164085 161433 159357 158142 157492 156798 155776 154703 154060 154043 154474 155021 155398
52878 155398 155399 154926 154138 153566 153887 155380 157593 159695 161207 162291 163237 163894 163846 163102 162189 161391 160133 157538
52860 157538 153572 149304 145880 143470 141381 139008 136409 134083 132441 131532 131022 130453 129620 128675 127727 126493
52844 126493 124652 122489 120758 119832 119327 118760 118173 117764 117219 115912 113749 111365 109391 107799 106159 104291
$$ packed form
52964A65462N67J018J333J334J126R99R65O94J62j52K7L14L26K91M91N63N1p31
52946A74840j110j057r91q22o8J051J501P25o24j523j598j062k36N25Q44O75L99
52929A71469K89J81j17l37m2P19J379J394P56K1j11N39J340J425O70j13j17N64
52911A79909J165J155O82K08n2k34n43r19j044p99n33o85j166j427j199q73r51
52894A72694j444k008k442k715k652k076j215o50o94j022j073o43j7M31N47L77
52878A55398Jm73p88n72L21J493K213K102J512J084R46O57m8p44r13p98j258k595
52860A57538l966m268l424k410k089k373k599k326j642r09n10n69q33r45r48j234
52844A26493j841k163j731r26n05n67n87m09n45j307k163k384j974j592j640j868
$$ plain form
52828 104291 102499 101226 100664 100718 101235 102148 103342 104482 105127 105102 104648 104177 103999 104272 104997 105931 106730 107318
52810 107318 107957 108785 109540 109976 110295 110845 111614 112444 113530 115118 116809 117840 118242 119039 120981 123618 126092
52793 126092 128324 130775 133364 135338 136269 136564 136836 137236 137552 137632 137428 136881 135951 134705 133307 132051 131346
52776 131346 131364 131647 131362 130138 128490 127289 126951 127225 127596 127716 127607 127618 128066 128799 129259 129055 128374 127662
52758 127662 127091 126571 126108 125856 125780 125561 124961 124162 123654 123782 124438 125268 126199 127647 129886 132217 133204 132085
52740 132085 129704 127686 126765 126288 125297 123698 122288 121928 122790 124243 125453 126339 127757 130424 133709 136139
52724 136139 137181 137911 139565 142057 144438 146311 148021 149733 151189 152421 153875 155576 156798 157026 156758
52709 156758 156841 157291 157320 156435 155036 153860 153171 152709 152224 151858 152000 152764 153716 154262 154369 154684 155757 157251
$$ packed form
52828A04291j792j273n62N4N17R13J194J140O45k5m54m71j78K73P25R34P99N88
52810A07318O39Q28P55M36L19N50P69Q30J086J588J691J031M02P97J942K637K474
52793A26092K232K451K589J974R31K95K72M00L16Q0k04n47r30j246j398j256p05
52776A31346J8K83k85j224j648j201l38K74L71J20j09J1M48P33M60k04o81p12
52758A27662n71n20m63k52p6k19o00p99n08J28O56Q30R31J448K239K331R87j119
52740A32085k381k018r21m77r91j599j410l60Q62J453J210Q86J418K667L285K430
52724A36139J042P30J654K492K381J873J710J712J456J232J454J701J222K28k68
52709A56758Q3M50K9q85j399j176o89m62m85l66J42P64R52N46J07L15J073J494
$$ plain form
52691 157251 158282 158538 158766 159983 162407 165364 168096 170340 172032 172803 172131 170054 167492 165587 164761
52676 164761 164478 163915 162638 160675 158225 155505 152715 149924 147109 144497 142670 142010 142073 141903 141059 140003
52660 140003 139318 138924 138334 137444 136649 136303 136407 136834 137515 138322 139036 139569 140088 140862 142161 144229 147096 150221
52642 150221 152630 153630 153319 152294 151064 149904 149082 148822 149048 149395 149542 149378 148846 147871 146558 145319
52626 145319 144618 144589 144962 145285 145225 144651 143530 141821 139616 137344 135641 134826 134600 134422 134150 134088 134459 135068
52608 135068 135507 135494 134942 133963 132898 132116 131637 131160 130657 130680 131745 133522 135049 135746 135876 135914 135819 135280 134390
52589 134390 133675 133413 133311 133020 132654 132479 132266 131363 129536 127385 125727 124797 124300 124065 124168 124435 124268 123252
52571 123252 121725 120430 119708 119269 118704 118010 117548 117639 118249 118945 119163 118680 117910 117569 117899 118329 118108 117291
$$ packed form
52691A57251J031K56K28J217K424K957K732K244J692P71o72k077k562j905q26
52676A64761k83n63j277j963k450k720k790k791k815k612j827o60O3j70q44j056
52660A40003o85l94n90q90p95l46J04M27O81Q07P14N33N19P74J299K068K867L125
52642A50221K409J000l11j025j230j160q22k60K26L47J47j64n32r75j313j239
52626A45319p01k9L73L23o0n74j121j709k205k272j703q15k26j78k72o2L71O09
52608A35068M39j3n52r79j065p82m79m77n03K3J065J777J527O97J30L8r5n39q90
52589A34390p15k62j02k91l66j75k13r03j827k151j658r30m97k35J03K67j67j016
52571A23252j527j295p22m39n65o94m62R1O10O96K18m83p70l41L30M30k21q17
$$ plain form
52553 117291 116769 117198 118131 118468 117657 116085 114318 112413 110245 108199 107128 107597 109305 111211 112184 111758
52537 111758 110505 109544 109469 109850 109905 109373 108511 107545 106601 105903 105483 104831 103513 102072 101625 102450 103666 104459
52519 104459 104891 105175 105015 104242 103431 103172 103243 103252 103603 104865 106404 106728 105292 103163 101700 101273 101462 101752
52501 101752 101674 100912 99787 99261 99949 101351 102380 102424 101634 100424 99144 98148 97798 98273 99407 100682 101416
52484 101416 101141 99935 98297 96707 95460 94808 94843 95154 95108 94722 94859 96164 98064 99279 99192 98328 97563
52467 97563 97336 97641 98309 99025 99350 99061 98409 97829 97443 97028 96510 96205 96407 96873 96988 96493 95797 95463 95593
52448 95593 95910 96242 96649 97136 97565 97851 97998 97969 97696 97285 96931 96679 96481 96489 96979 97909 98857 99534 100101 100855
52428 100855 101842 102911 103927 104754 105211 105230 104973 104699 104642 105007 105846 106894 107742 108271 108679 109045 109219 109248 109469
$$ packed form
52553A17291n22M29R33L37q11j572j767j905k168k046j071M69J708J906R73m26
52537A11758j253r61p5L81N5n32q62r66r44o98m20o52j318j441m47Q25J216P93
52519A04459M32K84j60p73q11k59P1RL51J262J539L24j436k129j463m27J89K90
52501A01752p8p62j125n26O88J402J029M4p90j210j280r96l50M75J134J275P34
52484A01416k75j206j638j590j247o52L5L11m6l86J37J305J900J215q7q64p65
52467I7563k27L05O68P16L25k89o52n80l86m15n18l05K02M66J15m95o96l34J30
52448I5593L17L32M07M87M29K86J47k9k73m11l54k52j98QM90R30R48O77N67P54
52428A00855R87J069J016Q27M57J9k57k74n7L65Q39J048Q48N29M08L66J74K9K21
$$ plain form
52409 109469 109936 110121 109536 108398 107359 106772 106552 106556 106698 106786 106596 106137 105627 105270 105212 105566 106281 107121 107994
52390 107994 109074 110406 111651 112539 113275 114113 114785 114876 114539 114296 114197 113869 113365 113267 113721 114036 113619 112806 112308
52371 112308 112283 112492 113085 114578 116991 119562 121507 122807 124062 125757 127848 129976 131838 133311 134334
52356 134334 134899 135248 135913 137281 139080 140490 140943 140715 140577 140944 141615 142341 143342 144936 146806 148037
52340 148037 148127 147609 147335 147362 147109 146595 146822 148490 150876 152679 153724 155118 157624 160615 162974 164509
52324 164509 166015 168219 171156 174495 177997 181552 185089 188647 192384 196452 200922 205916 211643 218213
52310 218213 225443 232977 240550 248068 255481 262753 270008 277489 285229 292823 299750 305924 311824 318108
52296 318108 325236 333442 342775 353047 363850 374793 385676 396444 407129 417835 428604 439246
$$ packed form
52409A09469M67J85n85j138j039n87k20MJ42Q8j90m59n10l57n8L54P15Q40Q73
52390A07994J080J332J245Q88P36Q38O72R1l37k43r9l28n04r8M54L15m17q13m98
52371A12308k5K09N93J493K413K571J945J300J255J695K091K128J862J473J023
52356A34334N65L49O65J368J799J410M53k28j38L67O71P26J001J594J870J231
52340A48037R0n18k74K7k53n14K27J668K386J803J045J394K506K991K359J535
52324A64509J506K204K937L339L502L555L537L558L737M068M470M994N727O570
52310B18213P230P534P573P518P413P272P255P481P740P594O927O174N900O284
52296C18108P128Q206R333J0272J0803J0943J0883J0768J0685J0706J0769J0642
$$ plain form
52284 439246 449546 459734 470429 481866 493380 503952 513230 521835 530736 540427 550561 560209
52272 560209 568640 575987 582942 589669 595354 599188 601544 603790 607041 611397 616215 620658 624043 626155
52258 626155 627368 628267 629178 630226 631532 632945 633874 634033 634200 635492 637837 639989 641287 642615 645203
52243 645203 649167 653816 658867 664559 670933 677780 685287 694005 704057 714842 725658 736241 746536
52230 746536 756377 765668 774666 783777 793101 802332 811118 819397 827353 835088 842372 848796 854140 858543
52216 858543 862320 865695 868695 871187 872921 873597 873020 871304 868942 866498 863943 860312 854461 846448 837783
52201 837783 829900 822709 815173 806994 798902 791378 784073 776786 770137 764723 760247 756080 752118 748464
52187 748464 744762 740662 736623 733402 730863 728027 724342 720197 716087 711989 707815 703923 700766 698310
$$ packed form
52284D39246J0300J0188J0695J1437J1514J0572R278Q605Q901R691J0134R648
52272E60209Q431P347O955O727N685L834K356K246L251M356M818M443L385K112
52258F26155J213Q99R11J048J306J413R29J59J67J292K345K152J298J328K588
52243F45203L964M649N051N692O374O847P507Q718J0052J0785J0816J0583J0295
52230G46536R841R291Q998R111R324R231Q786Q279P956P735P284O424N344M403
52216H58543L777L375L000K492J734O76n77j716k362k444k555l631n851q013q665
52201H37783p883p191p536q179q092p524p305p287o649n414m476m167l962l654
52187G48464l702m100m039l221k539k836l685m145m110m098m174l892l157k456
$$ plain form
52173 698310 696056 693515 690535 687317 684172 681145 677992 674623 671323 668221 664889 660982 657023 653840
52159 653840 651375 648859 646165 644058 642850 641772 640176 638454 637028 635202 631982 627636 623446 620135
52145 620135 617453 615184 613489 612110 610211 607473 604581 602141 599715 596532 592718 589147 586360 584248
52131 584248 582613 581339 579992 577920 575000 571878 569217 567047 565036 563089 561313 559650 557945 556277
52117 556277 554939 554066 553589 553534 554105 555442 557552 560561 564707 569948 575830 581933 588254 594950 601935
52102 601935 609036 616439 624620 633828 643948 654810 666330 678344 690763 704026 718931 735681
52090 735681 753387 770871 787758 804431 821094 837392 852897 867528 881343 894299 906325
52079 906325 917385 927373 936246 944358 952315 960228 967381 972867 976388 978310 979226 979696 980024 979870 978300
$$ packed form
52173F98310k254k541k980l218l145l027l153l369l300l102l332l907l959l183
52159F53840k465k516k694k107j208j078j596j722j426j826l220m346m190l311
52145F20135k682k269j695j379j899k738k892k440k426l183l814l571k787k112
52131E84248j635j274j347k072k920l122k661k170k011j947j776j663j705j668
52117E56277j338q73m77n5N71J337K110L009M146N241N882O103O321O696O985
52102F01935P101P403Q181R208J0120J0862J1520J2014J2419J3263J4905J6750
52090G35681J7706J7484J6887J6673J6663J6298J5505J4631J3815J2956J2026
52079I06325J1060R988Q873Q112P957P913P153N486L521J922R16M70L28j54j570
$$ plain form
52064 978300 974714 969608 964053 958576 953060 947581 942627 938345 934199 929642 924665 919426 913832 907870
52050 907870 901958 896486 891319 886196 881349 877263 873990 871179 868717 866922 866123 866392 867602 869357 871012
$$ packed form
52064I78300l586n106n555n477n516n479m954m282m146m557m977n239n594n962
52050I07870n912n472n167n123m847m086l273k811k462j795p99K69J210J755J655
$$ [...]
##END NTUPLES=NMR SPECTRUM
##END=
