##TITLE=NES1056_956240_9268895_FejdRoLEkX
##JCAMPDX= 6.0         $$ Bruker NMR JCAMP-DX V2.0
##DATA TYPE= NMR SPECTRUM
##DATA CLASS= NTUPLES
##ORIGIN= BRUKER
##OWNER= Administrator
$$ 1.72 TOPSPIN		Version 2.1
$$ 2015-07-10 23:16:43.847 -0700  Administrator@X
$$ Compression mode = diff/dup
##.OBSERVE FREQUENCY= 400.02188249412
##.OBSERVE NUCLEUS= ^1H
##.ACQUISITION MODE= SIMULTANEOUS (DQD)
##.ACQUISITION SCHEME= undefined
##.AVERAGES= 8
##.DIGITISER RES= 22
##SPECTROMETER/DATA SYSTEM= spect
##.PULSE SEQUENCE= zg30
##.SOLVENT NAME= COFFEE_meoh
##.SHIFT REFERENCE= INTERNAL, COFFEE_meoh, 1, 14.98509
##AUDIT TRAIL= $$ (NUMBER, WHEN, WHO, WHERE, PROCESS, VERSION, WHAT)
$$ ##TITLE= Audit trail, TOPSPIN		Version 2.1
$$ ##JCAMPDX= 5.01
$$ ##ORIGIN= Bruker BioSpin GmbH
$$ ##OWNER= Administrator
$$ $$ E:\/data/COFFEE/nmr/NES1056_956240_9268895_FejdRoLEkX/10/pdata/1/auditp.txt
$$ ##AUDIT TRAIL=  $$ (NUMBER, WHEN, WHO, WHERE, PROCESS, VERSION, WHAT)
(   1,<2015-07-10 23:16:36.253 -0700>,<Administrator>,<X>,<go>,<TOPSPIN 2.1>,
      <created by zg
	started at 2015-07-10 23:15:30.066 -0700,
	POWCHK enabled, PULCHK disabled,
       configuration hash MD5:
       21 0F 79 D6 B3 7B B4 F6 88 20 88 DB 03 48 BD 9F
       data hash MD5: 64K
       99 66 D2 50 C9 4C 84 60 3E 33 08 21 1B 15 D6 AA>)
(   2,<2015-07-10 23:16:39.644 -0700>,<Administrator>,<X>,<proc1d>,<TOPSPIN 2.1>,
      <Start of raw data processing
       efp LB = 0 FT_mod = 6 PKNL = 1 PHC0 = 0 PHC1 = 0 SI = 32K 
       data hash MD5: 32K
       55 EA 84 A9 30 F6 F7 7C 1A 32 D4 88 49 42 09 74>)
(   3,<2015-07-10 23:16:39.941 -0700>,<Administrator>,<X>,<proc1d>,<TOPSPIN 2.1>,
      <pk PHC0 = 92.90588 PHC1 = 0 
       data hash MD5: 32K
       D6 A8 4E 95 42 76 0C CF 39 28 4E 6D F1 A2 32 0F>)
(   4,<2015-07-10 23:16:40.050 -0700>,<Administrator>,<X>,<proc1d>,<TOPSPIN 2.1>,
      <abs ABSG = 1 
       data hash MD5: 32K
       57 E2 07 30 F1 65 FE 63 6C 2D 9C D0 C5 9C 57 A0>)
(   5,<2015-07-10 23:16:40.097 -0700>,<Administrator>,<X>,<proc1d>,<TOPSPIN 2.1>,
      <abs ABSG = 2 
       data hash MD5: 32K
       C1 DE A6 E1 4B 52 48 24 91 C2 60 CD 05 6F 89 1F>)
(   6,<2015-07-10 23:16:40.175 -0700>,<Administrator>,<X>,<proc1d>,<TOPSPIN 2.1>,
      <abs ABSG = 3 
       data hash MD5: 32K
       76 F7 85 A3 15 69 F8 22 DA D1 BF 8A B1 F5 FD BF>)
(   7,<2015-07-10 23:16:40.222 -0700>,<Administrator>,<X>,<proc1d>,<TOPSPIN 2.1>,
      <abs ABSG = 4 
       data hash MD5: 32K
       48 0F 88 35 4A B2 5B C9 CF 2D 7B 18 DC 07 54 89>)
(   8,<2015-07-10 23:16:40.285 -0700>,<Administrator>,<X>,<proc1d>,<TOPSPIN 2.1>,
      <abs ABSG = 5 
       data hash MD5: 32K
       AD 9F 07 7E 18 1E 8A 92 3E C8 A3 B8 D7 26 83 F9>)
$$ ##END=
$$ 
$$ $$ hash MD5
$$ $$ 88 89 12 ED D3 73 40 43 09 F0 21 30 B8 27 E6 30
##$RELAX= 
##$RELAX= 
##$RELAX= 
##$RELAX= 
##$RELAX= 
##$RELAX= 
##$RELAX= 
$$ Bruker specific parameters
$$ --------------------------
##$DU= <E:\>
##$EXPNO= 10
##$NAME= <NES1056_956240_9268895_FejdRoLEkX>
##$PROCNO= 1
$$ [...]
150 150 150 150 150 150 150 150
##$TP07= 0
##$TPNAME0= <>
##$TPNAME1= <>
##$TPNAME2= <>
##$TPNAME3= <>
##$TPNAME4= <>
##$TPNAME5= <>
##$TPNAME6= <>
##$TPNAME7= <>
##$TPOAL= (0..7)
0.5 0.5 0.5 0.5 0.5 0.5 0.5 0.5
##$TPOFFS= (0..7)
0 0 0 0 0 0 0 0
##$TUNHIN= 0
##$TUNHOUT= 0
##$TUNXOUT= 0
##$USERA1= <user>
##$USERA2= <user>
##$USERA3= <user>
##$USERA4= <user>
##$USERA5= <user>
##$V9= 5
##$VALIST= <valist>
##$VCLIST= <CCCCCCCCCCCCCCC>
##$VD= 0
##$VDLIST= <DDDDDDDDDDDDDDD>
##$VPLIST= <PPPPPPPPPPPPPPP>
##$VTLIST= <TTTTTTTTTTTTTTT>
##$WBST= 2048
##$WBSW= 25
##$XGAIN= (0..3)
0 0 0 0
##$XL= 0
##$YL= 0
##$YMAX_a= 580835
##$YMIN_a= -485843
##$ZGOPTNS= <>
##$ZL1= 120
##$ZL2= 120
##$ZL3= 120
##$ZL4= 120
##$ABSF1= 14.98509
##$ABSF2= -5.573092
##$ABSG= 5
##$ABSL= 3
##$ALPHA= 0
##$AQORDER= 0
##$ASSFAC= 0
##$ASSFACI= 0
##$ASSFACX= 0
##$ASSWID= 0
##$AUNMP= <proc_prof1d_extract_pilot.lims>
##$AXLEFT= 0
##$AXNAME= <>
##$AXNUC= <1H>
##$AXRIGHT= 0
##$AXTYPE= 0
##$AXUNIT= <>
##$AZFE= 0.1
##$AZFW= 0.1
##$BCFW= 0
##$BC_mod= 0
##$BYTORDP= 0
##$COROFFS= 0
##$CY= 15
##$DATMOD= 1
##$DC= 0
##$DFILT= <>
##$DTYPP= 0
##$F1P= 0
##$F2P= 0
##$FCOR= 0.5
##$FTSIZE= 32768
##$FT_mod= 6
##$GAMMA= 0
##$GB= 0
##$INTBC= 1
##$INTSCL= 1
##$ISEN= 128
##$LB= 0
##$LEV0= 0
##$LPBIN= 0
##$MAXI= 10000
##$MC2= 0
##$MEAN= 0
##$ME_mod= 0
##$MI= 0
##$NCOEF= 0
##$NC_proc= -8
##$NLEV= 6
##$NOISF1= 0
##$NOISF2= 0
##$NSP= 0
##$NTH_PI= 0
##$NZP= 0
##$OFFSET= 14.98509
##$PC= 1
##$PHC0= 92.90588
##$PHC1= 0
##$PH_mod= 1
##$PKNL= yes
##$PPARMOD= 0
##$PPDIAG= 0
##$PPIPTYP= 0
##$PPMPNUM= 2147483647
##$PPRESOL= 1
##$PSCAL= 4
##$PSIGN= 0
##$PYNMP= <proc.py>
##$REVERSE= no
##$SF= 400.02
##$SI= 32768
##$SIGF1= 0
##$SIGF2= 0
##$SINO= 400
##$SIOLD= 32768
##$SPECTYP= <>
##$SREGLST= <1H.CDCl3>
##$SSB= 0
##$STSI= 32768
##$STSR= 0
##$SW_p= 8223.68421052631
##$SYMM= 0
##$S_DEV= 0
##$TDeff= 65536
##$TDoff= 0
##$TI= <>
##$TILT= no
##$TM1= 0
##$TM2= 0
##$TOPLEV= 0
##$USERP1= <user>
##$USERP2= <user>
##$USERP3= <user>
##$USERP4= <user>
##$USERP5= <user>
##$WDW= 1
##$XDIM= 32768
##$YMAX_p= 449725658
##$YMIN_p= -741520
##$CURPLOT= <Network HP LaserJet P1505>
##$CURPRIN= <$Network HP LaserJet P1505>
##$DFORMAT= <normdp>
##$LAYOUT= <+/1D_H.xwp>
##$LFORMAT= <normlp>
##$PFORMAT= <normpl>
##$SURQMSG= 1
$$ End of Bruker specific parameters
$$ ---------------------------------
##NTUPLES= NMR SPECTRUM
##VAR_NAME=  FREQUENCY,     SPECTRUM/REAL,   SPECTRUM/IMAG
##SYMBOL=    X,             R,               I
##VAR_TYPE=  INDEPENDENT,   DEPENDENT,       DEPENDENT
##VAR_FORM=  AFFN,          ASDF,            ASDF
##VAR_DIM=   32768,         32768,           32768
##UNITS=     HZ,            ARBITRARY UNITS, ARBITRARY UNITS
##FACTOR=    0.250966925370066, 1,           1
##FIRST=     8223.43324360094, -230550,      92302
##LAST=      0,             -17766,          -140574
##MIN=       0,             -741520,         0
##MAX=       8223.43324360094, 449725658,    0
$$ Real data points
##PAGE= N=1
##DATA TABLE= (X++(R..R)), XYDATA
$$ [...]
19499b09833m4358A40298h2159n47826A36244c8486J8439k31048j42997B2333
19488a79978I087i8983j36726J08139c0456B21272a81723l06959J13490B14276
19477a26467L5831A88502i4150I1134L31409F1023a35077j06742n4209B670g3524
19465d7514k06665a06733q4863d8173D1670A1235c71399B526J94816c76916a5346
19453b53429d4969n0797p9756p263M5285M7732c7611k67120N8423g3994A43045
19441b56211a12693M4489C21354f7546C1670a27470A72444b14444C52680A29015
19430a88374A55740D5710r011a52970n4452r9463a03724I7029a86815n350G2638
19418e67874C1207a34070B17618H8316F304b50699e8742j34460g3114j44328Q0999
$$ plain form
19499 -209833 -254191 140298 -82159 -629985 136244 -38486 -20047 -251095 -394092 22333
19488 -179978 9087 -98983 -235709 -127570 -30456 221272 -181723 -488682 -375192 214276
19477 -126467 -90636 188502 -94150 91134 422543 61023 -135077 -241819 -296028 2670 -73524
19465 -47514 -254179 -106733 -191596 -48173 41670 11235 -371399 2526 197342 -376916 -15346
19453 -253429 -44969 -95766 -175522 -182785 -137500 -89768 -37611 -304731 -246308 -73994 143045
19441 -256211 -112693 -68204 321354 -67546 31670 -127470 172444 -214444 352680 129015
19430 -188374 155740 45710 36699 -152970 -207422 -306885 -103724 97029 -186815 -192165 72638
19418 -567874 31207 -134070 217618 88316 6304 -250699 -58742 -193202 -73114 -217442 -136443
19407a36443j76050h5398A92808a93421f5271G008b87379a41232B27002A13076
19396B1114Q7835a1592A89796a11427B04570a88506Q827m1734c8900J8145I7896
19384c35692a62911M66j70593C4546K06536q6026e5446j67548I7900J23033i8604
19372a23809n8450B188a22695j77275l1289a8111F4442a72313D9424b43866j32621
19361c76487H1040R9045G6583h0425D5412f7451H523e1813A52301D3807g5007
19349a36139B86195h66k49226q836a19918e0276A46522h2309D8411L5131l7645
19338D5897b04665c6483k17778h9204c5083r3754k16048g1428p439k2813m0785
19327a42465q7175D4684J16488F0509b91981H6063a72253A33920a68298o590B8289
$$ plain form
19407 -136443 -312493 -85398 192808 -193421 -65271 7008 -287379 -141232 227002 113076
19396 21114 108949 -11592 189796 -111427 204570 -188506 -179679 -221413 -38900 -20755 97896
19384 -335692 -162911 -162445 -333038 34546 241082 155056 -55446 -222994 97900 220933 -98604
19372 -123809 -182259 2188 -122695 -299970 -331259 -18111 64442 -172313 49424 -243866 -376487
19361 -376487 81040 180085 76583 -80425 45412 -67451 8523 -51813 152301 43807 -75007
19349 -136139 286195 -866 -250092 -258928 -119918 -50276 146522 -82309 48411 83542 45897
19338 45897 -204665 -36483 -254261 -89204 -35083 -128837 -344885 -71428 -78867 -101680 -142465
19327 -142465 -229640 44684 161172 60509 -291981 86063 -172253 133920 -168298 -174888 28289
19315g6384l206B565i7855A30812a44752A90579G4122K7626G425M23175A63297
19303A81666b99859h2279j65859E9356J8903A9764a99613c2945B33821d31660
19292d3358b682m48174R8758N1493R4040B6098a28888D6026M7887b40775C4866
19280A10898i5785q8664A51439a69338A78097e3793k47074J15046a5168j89380
19270b04548f4930b6187p1486A52947j8480a10777q948j73402E7553d7112C37594
19258A97232a52375M8065c120j72685d3021j06692B64913A08627l1882b01402
19247a21197j52875C5360a68990k4515d1424k8590A83366m0691b4828p1467L5974
19236f0321k46405i4452j53569a16583e6376k50018a06396p5965J5708k7171M9563
$$ plain form
19315 -76384 -79590 2565 -97855 130812 -144752 190579 74122 101748 7425 430600 163297
19303 181666 -299859 -82279 -248138 59356 78259 19764 -199613 -32945 233821 -431660
19292 -43358 -2682 -450856 -352098 -300605 -206565 26098 -128888 46026 93913 -240775 34866
19280 110898 -95785 -184449 151439 -169338 178097 -53793 -300867 -185821 -15168 -204548
19270 -204548 -64930 -26187 -97673 152947 134467 -110777 -119725 -293127 57553 -47112 337594
19258 197232 -152375 -104310 -3120 -175805 -43021 -149713 264913 108627 76745 -201402
19247 -121197 -274072 35360 -168990 -193505 -41424 -70014 183366 142675 -24828 -96295 -60321
19236 -60321 -306726 -94452 -248021 -116583 -56376 -306394 -106396 -182361 -166653 -193824 -144261
19225a44261C31057b62299J11666O5247F7687C977J25773b06139M0595k49190
19215d14734F3651b25083M7334K6255A46804c15361J44732A8138O3476A1410J5031
19204B6441a07813k8170H7830J27704Q696c31049A84767a91454m3411g4073q6634
19193a60707A85106i8112B7006a30855M5360q6957o5401d4041B59134a0726g43
19181A36564a23779l9150j32578a21004B49726A13624b82105k26906b42948B14409
19170h2378q9141M1000j58019a19550A15956a80799N0114B01789H6708J2814d3269
19158a18421K9610j53667g331b752j02243L6265k58301a2102j21304j62916O2412
19147b33910O1143i699q6722G9497K24146H4196J00153g6401j17372R929b5145
$$ plain form
19225 -144261 331057 -262299 -150633 -85386 67687 3977 129750 -206139 -165544 -414734
19215 -414734 63651 -225083 -177749 -151494 146804 -315361 -170629 18138 81614 11410 26441
19204 26441 -107813 -135983 87830 215534 224230 -331049 184767 -191454 -234865 -74073 -160707
19193 -160707 185106 -98112 27006 -130855 -85495 -172452 -237853 -44041 259134 -10726 -743
19181 136564 -123779 -162929 -295507 -121004 249726 113624 -282105 -509011 -242948 214409
19170 -82378 -171519 -130519 -288538 -119550 115956 -180799 -130685 201789 86708 99522 -43269
19158 -118421 -88811 -242478 -7331 -2752 -104995 -68730 -327031 -12102 -133406 -296322 -233910
19147 -233910 -172767 -9699 -96421 79497 303643 84196 184349 -76401 -193773 -183844 -25145
19135c05445J40651B09992b10453C3934b3461j62021I2107a75667A26380b33044
19124B73016a96571N8277A64151K10223D1151g8250K1359j15126P4125B45468
19113a21950a3005j45274A08162b2323j1215I5646c70182J62618C4880R050R6064
19102A39994a18059k25947h516C56513b49992j9165A34981a38575c1981F7842
19091I0380e16119J97090b3093A87365o4466b26908D7050b01013J193L1515J7281
19080a51024k120C907K0067R5034i3078A50846K55984h4576b2059r3533b8452
19068g9176B3767a38853O5483A381a33476j80371A47161F7344g1957A2593P7390
19057H9983e8216k00668A18535a04193j46682C9980R503b37482A24794g5554q9762
$$ plain form
19135 -305445 -164794 209992 -210453 33934 -23461 -185482 92107 -175667 126380 -233044
19124 273016 -196571 -138294 164151 374374 41151 -78250 -56891 -172017 -97892 245468
19113 -121950 -13005 -158279 108162 -22323 -33538 95646 -370182 -207564 34880 43930 139994
19102 139994 -118059 -344006 -8516 356513 -249992 -269157 134981 -138575 -31981 67842
19091 90380 -516119 -319029 -23093 187365 122899 -226908 47050 -201013 -199820 -168305 -151024
19080 -151024 -153144 3907 23974 119008 -93078 150846 406830 -84576 -22059 -115592 -28452
19068 -79176 23767 -138853 -73370 1381 -133476 -313847 147161 67344 -71957 12593 89983
19057 89983 -58216 -258884 118535 -104193 -250875 39980 49483 -237482 124794 -75554 -165316
19046a65316A41858B8321D836c4434o40314a70236j59711a03547A05286a29381
19035H95a5333k48865E4451a32254l5089A27202f117j34973B65428d6725A51581
19023A25252a101j82169I0711c4359G7496B8710a17907A24598a75735h7265A6192
19011E7060b95919a00296l25368b08298C43997i1319A2434R6196P1361b17343
19000c15618C06331b00472k9343J182G7972k4095N5057j4224g5416G7062K41876
18989C18938g154k69657a02774G2034c6056A0561M0039i8932l5377M6368A24031
18977E4668b69368A28554J30650J72293Q6832k1287B24899I2039O0551M15515
18967E68105A87553b99367a29253k25235N4370B4520e8451o3120A68924b25858
$$ plain form
19046 -165316 141858 28321 4836 -34434 -674748 -170236 -329947 -103547 105286 -129381
19035 895 -15333 -264198 54451 -132254 -167343 127202 -6117 -141090 265428 -46725 151581
19023 125252 -1101 -183270 90711 -34359 77496 28710 -117907 124598 -175735 -87265 16192
19011 57060 -295919 -100296 -425664 -208298 343997 -91319 12434 108630 179991 -217343
19000 -315618 306331 -200472 -229815 -228633 77972 53877 108934 94710 -75416 77062 318938
18989 318938 -7154 -276811 -102774 72034 -36056 10561 50600 -98932 -134309 -87941 124031
18977 54668 -269368 128554 259204 431497 518329 497042 224899 92039 152590 568105
18967 568105 187553 -299367 -129253 -354488 -300118 24520 -58451 -121571 168924 -225858
18956c46354o7620J11710E736i1385F6955A1316b61699B18553a86786E0577B1227
18944a4550j53917B1362c49817B16348B1472f460B47347D812K99620a45602b2736
18932a25222C2406b30401A45355A4120d5487C4351a70995A28645E1984g2990B12785
18920a98875D0448a67655j40785A99200c2515H3275i5547B01591n0012M6864R1403
18909B89846P29851D02753r4936q9588f0597C2513a62350O6565L5368l67291a71447
18897A9983a87161Q5681h581p32939G5361c08186J00889k18492B6746c56182R9558
18886b56624b2759L458r9094A0000L23264A32960b12129K5407B44b18638C05763
18874a84018b0044n44250a10408m6746N7280K9084o5868k70300a62232C717K7242
$$ plain form
18956 -346354 -413974 -302264 5736 -91385 66955 11316 -261699 218553 -186786 50577 21227
18944 -14550 -168467 21362 -349817 216348 21472 -6460 247347 4812 304432 -145602 -22736
18932 -125222 32406 -230401 145355 14120 -45487 34351 -170995 128645 51984 -72990 212785
18920 -198875 40448 -167655 -308440 199200 -32515 83275 -95547 201591 151579 198443 289846
18909 289846 1019697 402753 307817 218229 -60597 32513 -162350 -95785 -60417 -427708 -171447
18897 19983 -187161 -101480 -8581 -741520 75361 -308186 -207297 -425789 26746 -356182 -256624
18886 -256624 -22759 -19301 -118395 10000 333264 132960 -212129 -186722 244 -218638 305763
18874 -184018 -20044 -564294 -110408 -157154 -99874 -70790 -136658 -406958 -162232 3717 30959
18863C0959b66522B81105l4119a06905H0177M7255E1949A1892m910a00161a3410
18851i9819n6204J1791D6725K07741p1150m1716a62830o5273e2779j66397e9259
18839B18217B3703d7114j41989k0270o5130d3257D5640K19985r0295D168b13297
18827C32559D9392b52110A45183M0511a75738e6526B17349a00023A5747b59004
18816f6059j50490C63601b92075H4957Q850P7411H1107P8100G3122e7458A72767
18804G2170B1467b00221A75752b95994J46241m433p42L3636Q163k06528A34402
18792b02481Q7417o736j79700a22578b143j29103M0914I7686j3358J31636h3521
18780c64065A2469c78129a8377k88946J07738f6175n271a7873k40677A15982a12966
$$ plain form
18863 30959 -266522 281105 246986 -106905 80177 127432 51949 11892 6982 -100161 -13410
18851 -99819 -156023 -144232 46725 254466 183316 141600 -162830 -228103 -52779 -219176 -59259
18839 218217 23703 -47114 -189103 -209373 -274503 -43257 45640 265625 175330 4168 -213297
18827 332559 49392 -252110 145183 185694 -175738 -56526 217349 -100023 15747 -259004
18816 -66059 -216549 363601 -292075 84957 93807 171218 81107 159207 73122 -57458 172767
18804 72170 21467 -200221 175752 -295994 -149753 -154186 -154928 -121292 -113129 -319657 134402
18792 -202481 -115064 -121800 -301500 -122578 -2143 -131246 -90332 97686 84328 215964 -83521
18780 -364065 12469 -378129 -18377 -307323 -199585 -66175 -71446 -17873 -258550 115982 -112966
18768B24691g577C33226a11088A45564b34184J04042j80483D53725g3526b5424
18757A26136c65997C1517f8130B01705a06834l569C21402A5192R3743K39267q6243
18746B61959h347o9243j94730I7689J02248a36637A57809b3162n4185K5452G3706
18734g4004A62126i2892j37350i4626l26419a86193n6440g1832B30962b24019
18723b20600D00139c37172a9670j28363C7906a4010m8688A26470C0736a49008
18712b49560h9801j26425B66790H5263j6679c809l07067J30394g5824p3279h585
18700d722j06709K6782L0313j40361A02437k3787g8585r9654b9931k4282b0816
18688a31497d5823e845n2514b5237A38228a88546e7009h345D6493b64351f5608
$$ plain form
18768 224691 -7577 333226 -111088 145564 -234184 -130142 -310625 453725 -73526 -25424
18757 126136 -365997 31517 -68130 201705 -106834 -110403 321402 15192 108935 348202 261959
18746 261959 -8347 -77590 -272320 97689 199937 -136637 157809 -23162 -77347 -51895 73706
18734 -74004 162126 -92892 -230242 -94626 -421045 -186193 -242633 -71832 230962 -224019
18723 -220600 400139 -337172 -19670 -148033 37906 -14010 -62698 126470 30736 -149008
18712 -249560 -89801 -216226 266790 85263 68584 -3809 -310876 -180482 -75824 -149103 -8585
18700 -4722 -111431 -84649 -54336 -194697 102437 78650 -78585 -178239 -29931 -54213 -20816
18688 -131497 -45823 -5845 -58359 -25237 138228 -188546 -57009 -8345 46493 -264351 -65608
18676E862b3536A46446c03192D1224b820l15651c3687l5469A31071D2483J25321
18665A67804r629c70865a06674l1264b397B8287b13034K3651N1091d6468A07426
18653g9878k06094H5338b41955G7958j0088J08710a24173d6617A6296a63854J7318
18642a46536C3170G234b60221f9739k2202L153C6370d64208A16801a42663f0053
18630F2133a07884A76350a49791K3071j17347J09640B6082a04012j133p5336F3868
18618a67529b557m776o193o1450A70241d3749e875k24950q1349D5018a29343I7337
18605B37749a04650j63721A8446i9109P899m416A60443c58832B59696k9361a28111
18593b63094f9844C2374K64002f8589p5913k3542n1080b0367o2613o4178N4066
$$ plain form
18676 5862 -23536 146446 -303192 41224 -2820 -318471 -33687 -69156 131071 42483 167804
18665 167804 158175 -370865 -106674 -137938 -2397 28287 -213034 -189383 -138292 -46468 107426
18653 -79878 -285972 85338 -241955 77958 67870 176580 -124173 -46617 16296 -163854 -146536
18642 -146536 33170 7234 -260221 -69739 -91941 -88788 36370 -464208 116801 -142663 -60053
18630 62133 -107884 176350 -149791 -126720 -244067 -134427 26082 -104012 -105145 -180481 63868
18618 -167529 -2557 -7333 -13526 -74976 170241 -43749 -5875 -230825 -312174 45018 -129343 97337
18605 237749 -104650 -268371 18446 -99109 -91210 -95626 160443 -358832 259696 230335 -128111
18593 -263094 -69844 32374 296376 -68589 -144502 -168044 -219124 -20367 -82980 -147158 -93092
18582i3092j43888A27792c15346A43682a13324N5510j3180B15512J27578b98819
18571a78442B0813g5911L1485r1290B59216b81722D66232d5762j84623F0228R0470
18560A50698i0618c3683p4126A89753c22924c3608A66152E5709b9742o3857j83185
18549b76784o4043b9189e54j12049A10038g4316D01085a33332j9246L0168G3364
18537b95796R8187b4170A26738J45072i967A16858D2652J16488a16777K0922k39925
18526c35780f6811M995G8024a14874C770a49757A47255d24k52596H4558J2110
18515I6668f1554k31973a40207k70603d8152j19552k09718c3258B0635L7424g975
18503b31317C6b45730D8593A6736g8877B49048o4828c5249r135o8290j9568k11254
$$ plain form
18582 -93092 -236980 127792 -315346 143682 -113324 -57814 -70994 215512 343090 -298819
18571 -178442 20813 -75911 -44426 -135716 259216 -281722 466232 -45762 -230385 60228 150698
18560 150698 -90618 -33683 -107809 189753 -322924 -33608 166152 55709 -29742 -93599 -276784
18549 -276784 -340827 -29189 -554 -112603 110038 -74316 401085 -133332 -152578 -122410 73364
18537 -295796 -197609 -24170 126738 271810 -9967 116858 42652 159140 -116777 -95855 -335780
18526 -335780 -66811 -61816 78024 -114874 3770 -149757 147255 -424 -253020 84558 96668
18515 96668 -61554 -293527 -140207 -410810 -48152 -167704 -377422 -33258 20635 58059 -7975
18503 -231317 36 -245730 48593 16736 -78877 249048 184220 -35249 -44384 -112674 -132242 -343496
18491c43496e8842k50785D8594K63423b56450g621l1994j09182o9139B63988g0512
18479B90261b47493O8042a64j11766C0900g6275j7164I4881d30035a63574e572
18467A71195c80835J58949f7356j02088o6274g8200e350j9548r3931B02488H1088
18455i990r8136k08604H3881c15488a37932J3510m10427I0806l195K6214a86578
18443b45770a920A96769d8261B875L6340d33346B27335a14116H2390a80091H3425
18431B81652k2988I3282c75921A92204b17731h3861B59599b59780q8951G6922
18420a92591Q9830B7053i0693K4620a2118F263a51437D88P9262f0210B2322a86646
18407a85656B0001J77711b70163H6147c4924l20647A59131B2346J05687J29168
$$ plain form
18491 -343496 -58842 -309627 48594 312017 -256450 -7621 -39615 -148797 -217936 263988 -70512
18479 290261 -247493 -179451 -164 -111930 30900 -76275 -93439 94881 -430035 -163574 -5572
18467 171195 -380835 -221886 -67356 -169444 -235718 -78200 -5350 -24898 -118829 202488 81088
18455 -9990 -108126 -316730 83881 -315488 -137932 -124422 -534849 90806 87611 113825 -186578
18443 -245770 -1920 196769 -48261 2875 39215 -433346 227335 -114116 82390 -180091 83425
18431 281652 258664 93282 -375921 192204 -217731 -83861 259599 -259780 -348731 76922
18420 -192591 -102761 27053 -90693 -66073 -12118 6263 -151437 488 79750 -60210 22322 -186646
18407 -185656 20001 197712 -270163 86147 -34924 -355571 159131 22346 128033 257201
18397B57201O0027a08485A54859o3141k1214a07478a0181j1617A12171N4315a50826
18385A1333b34877e0802o2909J1754l2533n0123M9793Q319H825a52453I5025A7554
18372a56447E1296c99326a33028A88505g6809J7681j67332B3447K20269a19346
18361a18124p2798F2959c275r0958H9970h5058j40538N0030N7579B07941J24546
18350C32487h5437l5356J2092p0331K8031A5130K37229b0468k48584A61139a20920
18338i3742B6882d7913A19345a09183A11918O4072K63692a37353A16633d7485
18327a12829r5629K2670Q893B27243q2439J75463b0033j84192B6768a28356N0438
18316g7918L5768I745a05466E3682c80523M1187O5065J36284p880B07039q8534
$$ plain form
18397 257201 317228 -108485 154859 91718 70504 -107478 -10181 -21798 112171 166486 -150826
18385 11333 -234877 -50802 -113711 -101957 -134490 -184613 -134820 -126501 8825 -152453 95025 17554
18372 -156447 51296 -399326 -133028 188505 -76809 -59128 -226460 23447 243716 -119346
18361 -118124 -190922 62959 -3275 -94233 89970 -85058 -225596 -175566 -117987 207941 332487
18350 332487 -85437 -120793 -108701 -179032 -151001 15130 252359 -20468 -269052 161139 -120920
18338 -93742 26882 -47913 119345 -109183 111918 175990 439682 -137353 116633 -47485
18327 -112829 -208458 -185788 -176895 227243 144804 320267 -20033 -204225 26768 -128356 -77918
18316 -77918 -42150 9745 -105466 53682 -380523 -339336 -274271 -137987 -145867 207039 118505
18305A18505b39352C7032i0810H9186a98745H3190a73310l5940i9886A52689b44519
18293b76265g4549k7366d4934g257l02249a10465N3105C8027M4050J54842i9590
18281E3350R9819b69990e3395Q624A87498g7886B80784c8389D0980K09362A03712
18269e719B0780R4475J51053a89217N4944j50975A71620c90384a6723A29043B249
18257a7533p2969d531j53130m704o6728R9592D2682O0518K8997j2375E7781A3631
18244b93660A16880C8823a39977A44887C7877c14944J38920h0082B40878a52606
18233a10065D0047g2759A7572J18315a4169C6328a10884L1898o1483m0747b4491
18221c27539I5334a47760D4169O0398n329k9866h684l27750C58906A76642E0734
$$ plain form
18305 118505 -239352 37032 -90810 89186 -198745 83190 -173310 -209250 -99886 152689 -244519
18293 -276265 -74549 -101915 -44934 -7257 -309506 -110465 -57360 38027 82077 236919 -99590
18281 53350 153169 -269990 -53395 -44771 187498 -77886 280784 -38389 40980 250342 103712
18269 -5719 20780 115255 266308 -189217 -134273 -285248 171620 -390384 -16723 129043 2249
18257 -17533 -90502 -4531 -157661 -162365 -229093 -129501 42682 103200 132197 119822 57781 13631
18244 -293660 116880 38823 -139977 144887 37877 -314944 -176024 -80082 240878 -152606
18233 -110065 40047 -72759 17572 135887 -14169 36328 -110884 -78986 -140469 -181216 -24491
18221 -327539 95334 -147760 44169 104567 99238 69372 -8684 -336434 358906 176642 50734
18209b5647j21239O6065A69792g0714R469A97507g1101p4269N0543E4813c29285
18197a93199R622q9627A36058b3358j51897G6164K71554A44350J03273c19439
18186a32985A1578a78131B1952c1249j39126B68258a13405c8655A64495C7957
18175d64762A45223O581b81212G044K80197j9799c2076A84051j7959c4765D6689
18163e0792D1300a3270l1351C18700r1963C9511J75153a34742A37823E1772c71836
18151B9186a32585B01959k2875a14946L6608A25846P4300C2066R2100e2675n4063
18140a06738G3363J8309L6862l0330i9748B7916K33386h7170D1358M9666M2211
18129A33235a917A96985a62412j27157a07231j75798B63251A0090J28991b03015
$$ plain form
18209 -25647 -146886 -80821 169792 -70714 -61245 197507 -71101 -145370 -94827 54813 -329285
18197 -193199 -183577 -273204 136058 -23358 -175255 76164 347718 144350 247623 -319439
18186 -132985 11578 -178131 21952 -31249 -170375 268258 -113405 -38655 164495 37957
18175 -464762 145223 151804 -281212 7044 287241 267442 -32076 184051 166092 -34765 46689
18163 -50792 41300 -13270 -44621 318700 226737 39511 214664 -134742 137823 51772 -371836
18151 29186 -132585 201959 179084 -114946 -78338 125846 200146 32066 124166 -52675 -106738
18140 -106738 73363 91672 128534 98204 -99748 27916 261302 -87170 41358 91024 133235
18129 133235 -1917 196985 -162412 -289569 -107231 -283029 263251 10090 139081 -203015
18118e2888j81235J02746K5194a3332k07662j14766B25566j5236i2117e250o255
18107a1505j16125A38102b28355p0206J10503B43948D2186J61274b92603A26310
18096A21871a26174L696b7996k0886E9898b83352I9754J16270a69970A76540i7891
18084B0386p087b68326B0909K44383j20470c40441e0702j18211F2642g9755C1994
18072A64420c0114r7708q2551o0949B87537p7024a12242j34299D9934K37985e26
18060d9041j61454O7331A09770J14125l2493b1699B00997J6997r6075a78659C27822
18048b96437J20447E3320J59787c3067B83791a22174k44037D9406b15948A95362
18037C2047c08699L6402J35539j3464g2599B11410N3904a11340K2619A57075J57194
$$ plain form
18118 -52888 -234123 -131377 -106183 -13332 -220994 -335760 225566 210330 -92117 -5250 -11505
18107 -11505 -127630 138102 -228355 -298561 -188058 243948 42186 203460 -292603 126310
18096 121871 -126174 -122478 -27996 -48882 59898 -283352 99754 216024 -169970 176540 -97891
18084 20386 13299 -268326 20909 265292 144822 -340441 -50702 -168913 62642 -79755 31994
18072 164420 -30114 -127822 -210373 -271322 287537 210513 -112242 -246541 49934 287919 -526
18060 -49041 -210495 -143164 109770 223895 191402 -21699 200997 217994 121919 -178659 327822
18048 -296437 -175990 53320 213107 -33067 283791 -122174 -366211 49406 -215948 195362
18037 32047 -308699 -272297 -136758 -150222 -72599 211410 265314 -111340 -88721 157075 314269
18026C14269h692A71119F9111b18653P6420c032F4886i068G2113b30646O5884
18015a64762a5595B67647D479c5665H071a62226D52777a45445B43834B0519a59186
18003a97736e6909l2366n277k79684e400q789A21800M7088f1655k7323C4797h0649
17990a26633F0985e7362A10189M3130C9355c23172C55172A24266A4978l512a62222
17978h0646B45878o2497A3006N6061O7115a58800A26674K2887G0923O2199e829
17966I6841J8434b19945O2636b7749B1934d2389J1944k88352I7706d3442A7833
17954A35169c78334e8246B1996J53387b9807k26109i298E484b98800h5669k11823
17943b97492B10283e06016J24052J70655B82160A26504J9113J62055p2155B6823
$$ plain form
18026 314269 -8692 171119 69111 -218653 -142233 -3032 64886 -9068 72113 -230646 -164762
18015 -164762 -15595 267647 4479 -35665 8071 -162226 452777 -145445 243834 20519 -159186
18003 -197736 -56909 -89275 -94552 -374236 -5400 -14189 121800 168888 -61655 -88978 34797 -80649
17990 -126633 60985 -57362 110189 153319 39355 -323172 355172 124266 14978 11466 -162222
17978 -80646 245878 183381 13006 69067 136182 -158800 126674 149561 70923 133122 -5829
17966 96841 115275 -219945 -157309 -27749 21934 -42389 -30445 -318797 97706 -43442 17833
17954 135169 -378334 -58246 21996 175383 -29807 -255916 -9298 5484 -298800 -85669 -297492
17943 -297492 210283 -506016 -381964 -211309 282160 126504 145617 307672 235517 26823
17932C71091a46015A38068B4698J51899f3915r437a8761F2947a09932E6508N1703
17921A08211b1851F1341J71222p2321O2061a878B2924f289G7534h6504A15257
17909C09485j01723a74996k45911A12882L80323b02354j49704a00345m17014d6367
17898A95403r0599C0542J15272b30698R2461C0764O7509b26187D3128N6162h54
17886A75172G2839h54l17592B65008Q7526E0085a26549B0804M6227f0899K9153
17875c1746j33480d628A43613K31393b40990J06963j02861J12027m2924D54676
17864B12937m4532H0686M6578D5791a78571o8425Q3563A22428J66299q6059I0535
17852C41076c92984F0983F111a22774A22541b50292G2169K08597M1186d3496D76944
$$ plain form
17932 371091 -146015 138068 24698 176597 -63915 -73352 -18761 62947 -109932 56508 108211
17921 108211 -21851 61341 232563 160242 222303 -1878 22924 -6289 77534 -86504 115257
17909 309485 207762 -174996 -420907 112882 493205 -202354 -352058 -100345 -517359 -46367
17898 195403 104804 30542 145814 -230698 -138237 30764 98273 -226187 43128 99290 -854
17886 175172 72839 -854 -318446 265008 352534 50085 -126549 20804 67031 -60899 -31746
17875 -31746 -165226 -4628 143613 375006 -240990 -134027 -236888 -124861 -167785 454676
17864 212937 168405 80686 127264 45791 -178571 -246996 -163433 122428 288727 202668 90535
17852 341076 -392984 60983 6111 -122774 122541 -250292 72169 280766 321952 -43496 476944
17840i9637A30343J23509m8542d470k5136r3296e8542n5201D08244a53897B45961
17828a21923D5844e8505b8786l2908n0801d6274n4784o6799B57507j09131K69251
17817D17627e0299B88093E0139J34048f4659a3169A74395a65448A21608K37898
17807C59506h2502p1660B9834Q0868b66290k68718H7666j5570a09283I6849O4955
17796A61804c63823A50962a19472A36773c8683A60038j3771l6392Q3048B0426
17785i8494B00558b44992A35163D8744O9688m6425h5049G2299J59036G7098K76735
17774C53833E0088K40657B1489m210c4684o99j6435A56560m3639d6998D0068a72092
17761a24739L0418j56207B30761A09825b57996B3919O4381K31601N8266j67456
$$ plain form
17840 -99637 130343 253852 205310 -4470 -29606 -122902 -58542 -113743 408244 -153897 245961
17828 -121923 45844 -58505 -28786 -61694 -112495 -46274 -101058 -167857 257507 148376 417627
17817 417627 -50299 288093 50139 184187 -64659 -13169 174395 -165448 121608 359506
17807 359506 -82502 -154162 29834 110702 -266290 -535008 87666 72096 -109283 96849 161804
17796 161804 -363823 150962 -119472 136773 -38683 160038 146267 109875 192923 20426
17785 -98494 200558 -244992 135163 48744 118432 72007 -85049 72299 231335 77098 353833
17774 353833 50088 290745 21489 17279 -34684 -35383 -51818 156560 112921 -46998 40068 -172092
17761 -124739 -94321 -250528 230761 109825 -257996 23919 88300 319901 378167 210711
17751B10711C0616N4948D2156J00384c69256C81881C7080J2001J84566c6585a1193
17739a37178p7098A04673d6262A0814J00976B2211K71382a73787G3490i147C9473
17727A2797K30936P5657e6240B26704O3016r7548D970a06689A73029a68003A27465
17715g6844n8223e5790A78829M6085A09796D0016L84580A89633K83087B3463J30997
17704A54460C7470c7132B39687e7681G442L8864O65a40715C37278A34662J00110
17693B34772j13353a1484A11804A5049L3709M8288K6647J64541A19555k3274a49038
17681a31129E7261M2877M0562K29810a05673F0034K70075N3730a18819o833I1943
17669C52205c1911A7935L46051A7337O7849a27732A62736o8842K4098c5325a5496
$$ plain form
17751 210711 30616 85564 42156 142540 -369256 381881 37080 49081 233647 -36585 -11193
17739 -137178 -214276 104673 -46262 10814 111790 22211 293593 -173787 73490 -9147 39473
17727 12797 243733 319390 -56240 226704 289720 192172 4970 -106689 173029 -168003 127465
17715 -76844 -135067 -55790 178829 224914 109796 40016 424596 189633 472720 23463 154460
17704 154460 37470 -37132 239687 -57681 7442 46306 46971 -140715 337278 134662 234772
17693 234772 121419 -11484 111804 15049 48758 97046 123693 288234 119555 96281 -149038
17681 -131129 57261 100138 140700 370510 -105673 60034 330109 383839 -118819 -125652 91943
17669 352205 -31911 17935 363986 17337 85186 -127732 162736 93894 117992 -35325 -15496
17657b23389B9600L35274I9658e7686H7816J88168P6938a32716B5154d2846a2414
17645C70973j76395M8140l7998N62J21556d8667m2063k2943H5140J29031q3567
17634A30604J12094Q3014I8417J04623b0562B08041Q51a18743A61568D2546N4560
17623I7106K2251a60419A10082P62a84450E6474J04701M9548a72310g8322j29353
17612b07675C21643e1619j7682D4081J96705j00038K06044j27383J28316A281
17601i0620A3296h8914A84032R9537j14632J46741C3686a13762D89421j77948
17591C11473e4067B29418H7882a19212N0727D20985H5319h9203k68403B67397
17580C14026A04355J03589h7003A88939d4632K0336H1936L19316A8263K11743
$$ plain form
17657 -223389 29600 364874 99658 -57686 87816 275984 352922 -132716 25154 -42846 -12414
17645 370973 194578 242718 204720 205282 326838 -48667 -90730 -113673 85140 214171 130604
17634 130604 242698 325712 98417 203040 -20562 208041 208892 -118743 161568 42546 97106
17623 97106 119357 -160419 110082 110844 -184450 56474 161175 210723 -172310 -78322 -207675
17612 -207675 321643 -51619 -69301 44081 240786 140748 346792 219409 347725 1281
17601 -90620 13296 -88914 184032 283569 168937 315678 33686 -113762 489421 311473
17591 311473 -54067 229418 87882 -119212 -68485 420985 85319 -89203 -357606 267397
17580 314026 104355 207944 -87003 188939 -44632 -24296 81936 401252 18263 230006
17570B30006r9343a944j27492B32808g4951A02894J5407K16445M2928j40466J23304
17559C60512A19969j6782l0850K01742g9575a0811A34172Q0862R6482j52044m2478
17548A16994j0190C841a77179B21438M05616D3284M73032A89243M00245B48576
17537A39942J71221a2502A77413o8885O6196L0218c6462E3845L04072o6736L30075
17526F21256j291N4592K98596j66640r4068n6162J82536B87971m8668n998P5861
17515C09166L91675B75939A21471J18842K36666O9667N00631l15439j32018J56305
17505G56125k09893m058Q6336j38937j40649G7283Q8860N3606P1906p8710K19713
17494D32658r1891r4640r2274J99012j01755J96917A39296J24612N0395j34695
$$ plain form
17570 230006 130663 -1944 -129436 232808 -74951 102894 118301 334746 377674 237208 360512
17559 360512 119969 103187 72337 274079 -79575 -10811 134172 215034 311516 159472 116994
17548 116994 106804 3841 -177179 221438 627054 43284 516316 189243 589488 248576
17537 139942 311163 -12502 177413 108528 174724 204942 -36462 53845 357917 291181 621256
17526 621256 619965 674557 973153 806513 712445 656283 838819 287971 239303 233305 309166
17515 309166 700841 275939 121471 240313 476979 546646 1047277 731838 599820 756125
17505 756125 546232 542174 628510 489573 348924 77283 166143 219749 291655 212945 432658
17494 432658 340767 246127 153853 352865 251110 448027 139296 263908 314303 179608
17484A79608H1074M99631j30144j61506g0124A49260k2749l1184P9194O990K07363
17473C88874l698A54974F5785J31354K02781j53129n1643k9550K00734J96551
17463E62883k488A43261o9798L45805a71249B73570R4921L7351B6616L09805A55480
17451A58436K13496G4328J67021O3529R5462J693B0953L76843J1518j39879E4414
17439C87010J29157j04777j83572r9086b3995B24998J61133A17184N07698k95610
17429C29272J6097J3770L6739o717j92814j7212K07107j80161L4918L52122j73096
17418D20025a5203D93863n5922j93456M8919J45443A53311M60063a614D56653
17407D64771j48656G5581J75169D056J37451J44033E2472q400M13401R8353D2819
$$ plain form
17484 179608 81074 580705 450561 289055 -70124 149260 126511 95327 174521 181511 388874
17473 388874 385176 154974 65785 197139 399920 246791 195148 165598 366332 562883
17463 562883 560395 143261 73463 419268 -171249 273570 368491 405842 26616 336421 155480
17451 158436 371932 74328 241349 304878 400340 402033 20953 397796 409314 269435 54414
17439 387010 516167 411390 227818 128732 -23995 224998 386131 117184 624882 329272
17429 329272 345369 359139 395878 389161 196347 179135 386242 206081 240999 593121 420025
17418 420025 -15203 493863 437941 244485 293404 438847 153311 613374 -1614 456653
17407 464771 316115 75581 250750 4056 141507 285540 52472 44072 457473 555826 42819
17395B90748H88K71622n3664J29650r2662N5888K1993A45903D2278J16218M78907
17384F37403k36876A23857J45781J10082J191A45860K79834q8837A37340B6199
17373E00409F7180k2012P9696D8700J53584M62970A82340K22568j3658N0400L2405
17362D74055j57316J44445K6305j32832L220j68357K3406m2616l3776K26104G8170
17350D68079j84368R2124r9529K633l162D2840M27074E1470B4395P8464k5313
17339G7546M5237R9605Q8560A25980Q4638J7351G1695M04977j79876J40938j46657
17328B91077j26712L9526K606K57848A90029M13902j52025A71533l8294a059n6279
17317e7338D49091j91114a53896A12461J36954A4174g7380A99860M9076j16966
$$ plain form
17395 290748 888 272510 218846 348496 255834 311722 333715 145903 42278 158496 637403
17384 637403 400527 123857 269638 379720 380911 145860 425694 336857 137340 26199
17373 500409 67180 45168 124864 48700 202284 665254 182340 404908 391250 441650 474055
17362 474055 316739 461184 487489 354657 357877 189520 212926 170310 136534 362638 78170
17350 468079 283711 375835 276306 278939 275777 42840 469914 51470 24395 102859 77546
17339 77546 122783 222388 310948 125980 210618 227969 71695 476672 296796 437734 291077
17328 291077 164365 203891 206497 464345 190029 603931 451906 171533 133239 -1059 -57338
17317 -57338 449091 257977 -153896 112461 249415 14174 -77380 199860 248936 131970
17307A31970D9271J50860J18972p3054c7717B92446I4405a051C58625F9513L02961
17296C72474j06204K46900k56331O7105J0742J19672k21819K02732G3398L44594
17286D17992c3613E14723j24772J86894q0705A24541K0207R6129J23552A12474
17275C44326j34762M15139j07104G2171J97157P5835j7315a42763D71336M030
17265D75366j06299e0824C23809p2319m2424R9940J91134j01719n2722J49832
17255D95531a14481F4139K56134J04530j67877n0408P7040A31951L27415F5639
17244B78320P9780n3005D9953K13470J14049Q1521p7959A35814n562L82944a1028
17232B18236m3460J02671F2073J68557J42245j78038P7971J95732n6284l4550
$$ plain form
17307 131970 49271 200131 319103 246049 -37717 292446 94405 -1051 358625 69513 372474
17296 372474 266270 513170 256839 323944 334686 454358 232539 435271 73398 417992
17286 417992 -33613 514723 389951 576845 496140 124541 144748 240877 364429 112474
17275 344326 209564 624703 517599 72171 269328 345163 327848 -142763 471336 475366
17265 475366 369067 -50824 323809 251490 209066 309006 500140 398421 345699 495531
17255 495531 -114481 64139 320273 424803 256926 206518 283558 131951 459366 65639
17244 278320 358100 305095 49953 263423 377472 458993 381034 135814 130252 513196 -11028
17232 218236 174776 277447 62073 230630 372875 194837 272808 468540 412256 377706
17222C77706A86201K42097j33301J47697J8850J48480B97629n5208K75246j79920
17212C37747J85267j35058J65968m3748p6676Q7274q172A70818k4522L65727B09744
17200C16151J65444P2455k15977E3503O23851B13649J3095F7157K44449J46940
17190D58546J18161L7820B31953p5917J18965J82094j29361m0267L39039K6707
17180F53213k75927L40995G8836M93740k51208L94068j95243j55897j61959M69410
17170F71747k10162M9488k08503J21419q8521l5492m7136K4834K26583Q6119J09315
17159F99691k78061j98493L21690j28428O2941N9764k53956O8237j63794J28896
17149C18487K38921q0172j18382K4953L80024C13797M38985B77598J40650r2896
$$ plain form
17222 377706 186201 428298 294997 442694 461544 610024 297629 242421 517667 337747
17212 337747 523014 387956 553924 510176 433500 520774 512602 170818 146296 512023 209744
17200 316151 481595 554050 338073 53503 677354 213649 226744 67157 311606 458546
17190 458546 576707 614527 231953 156036 275001 457095 327734 287467 626506 653213
17180 653213 377286 718281 78836 572576 321368 715436 520193 364296 202337 671747
17170 671747 461585 511073 302570 423989 335468 299976 252840 277674 504257 590376 699691
17159 699691 421630 223137 544827 416399 479340 539104 285148 353385 189591 318487
17149 318487 557408 477236 358854 383807 763831 313797 752782 277598 418248 325352
17139C25352R4485L57475O4756k62714k04579J5863J56898r9677K19685R3043
17129G60587k59947J1395L17145l27870j12739R377K92437k03618L29256l48759
17119D67264K83639O3367D04513K39581J03626n0947j33083L68872j84107C46618
17108G87328k76910M1521P9688J18341L459J19115j56910j29489p8114L55181
17098H63210l29292j87032K72604l8638K37482l65821j5096Q2482j871J42926
17088F60954J27285L33154C32891J57189M55853k21264J76711K8825D38951l4406
17078D04545j20181O06723q8078K06968n02557L53499k68853L20032j79310J28867
17068H61655l31603J39714p9831K75594o3710j76601K14418l89445K59654P2061
$$ plain form
17139 325352 419837 777312 842068 579354 374775 390638 547536 447859 667544 760587
17129 760587 500640 512035 829180 501310 388571 397948 690385 486767 816023 467264
17119 467264 750903 814270 404513 644094 747720 696773 563690 932562 748455 346618
17108 787328 510418 551939 631627 749968 753427 872542 715632 586143 508029 863210
17098 863210 533918 346886 619490 580852 818334 452513 437417 519899 518028 660954
17088 660954 788239 1121393 332891 490080 945933 724669 901380 930205 438951 404545
17078 404545 284364 891087 803009 1009977 507420 860919 592066 912098 732788 861655
17068 861655 530052 669766 589935 865529 801819 625218 839636 450191 709845 781906
17058G81906K66876k78130K95215k76277j42587L30295j5429k67439J62670j50440
17048G06660L1245J30191k39622K79733L86240n11713K81646q7056J97087k42030
17038I32381K17023k57342Q9030J01630j81964K18968j85471R9409J65657k28181
17028I71140r1395j25421O8181K2738K39742j32606Q6137q048R5041J6790j30722
17017A011577Q8093j03671K7044K12820J39649j89797j58732L03871n6864j48531
17007A125459l5385k31020L25203l34268N68975m33384Q4139L28234j84615K10367
16997A423705K7599n87175L62094O6838L68179l10778L6033J34897k76806J769
16987A246355M5131L42855j33110k00689J39502m3051r2637M51730p1717n53089
$$ plain form
17058 781906 1048782 770652 1065867 789590 647003 977298 961869 694430 857100 706660
17048 706660 737905 868096 628474 908207 1294447 782734 1064380 977324 1174411 932381
17038 932381 1149404 892062 981092 1082722 900758 1119726 934255 1033664 1199321 971140
17028 971140 879745 754324 822505 845243 1084985 952379 1038516 1030468 1125509 1142299 1011577
17017 1011577 1099670 995999 1023043 1235863 1375512 1185715 1026983 1330854 1273990 1125459
17007 1125459 1090074 859054 1184257 849989 1418964 985580 1069719 1397953 1213338 1423705
16997 1423705 1451304 864129 1226223 1293061 1661240 1350462 1386495 1521392 1244586 1246355
16987 1246355 1291486 1634341 1501231 1300542 1440044 1396993 1304356 1756086 1684369 1131280
16977A131280J81922J41677k2998L21009j51429q0746k08253r5926M61357k25461
16967A452432J95731j41189j87273R9326J77581L85953k02167q6388R4389j43662
16957A644733j35797L69089k72682K05392k15756m4872J75346m6913L72776l43755
16947A707561j36165O88320m64955R1965J30784l7320O5725l57654K5814K37859
16937A951934j85843J77457J82324K4545k23247j58457M79373m29043J16812J41006
16927B076861J42559K32038k36096J41874N189J16043M8235j56005J63885j21843
16917B412740j435q7886M15324j87067K82793l8664k17146K77320p7902M309j4463
16906B767923j5689j36983L56419j17827K81711k87080K48298j20681j68607J67332
$$ plain form
16977 1131280 1313202 1454879 1431881 1752890 1601461 1520715 1312462 1216536 1677893 1452432
16967 1452432 1648163 1506974 1319701 1419027 1596608 1982561 1780394 1694006 1788395 1644733
16957 1644733 1508936 1878025 1605343 1810735 1594979 1550107 1725453 1678540 2051316 1707561
16947 1707561 1571396 2259716 1794761 1886726 2017510 1980190 2045915 1688261 1714075 1951934
16937 1951934 1766091 1943548 2125872 2150417 1927170 1768713 2248086 1819043 1935855 2076861
16927 2076861 2219420 2451458 2215362 2357236 2362425 2478468 2526703 2370698 2534583 2412740
16917 2412740 2411305 2323419 2738743 2551676 2834469 2795805 2578659 2855979 2778077 2782386 2767923
16906 2767923 2752234 2615251 2971670 2853843 3135554 2848474 3096772 2976091 2807484 2974816
16896B974816K39295J8259L88947m65898m28382N89034K5433j17933M77239K3050
16886C723860k84416K30032R9215k30034j3709R5374J21358N1555L3674R0379
16876C917288L6492M20142o550l56601J66633j83059K67712O4116k6871J50647
16866D449949K08204k06898J5744K25778K73408l29407L87946l35174K18138J86266
16856E093954K14860P8450J23795N6379N749j5337m7684K88503Q8467K11495K26306
16845F324937j06237J65735n9648N8006J00551K63628K99752k56957L4933M84615
16835G309315k06837K34363K88355j51676L84344j46044K50088J68721J51256
16826H281885R8259L38080J45016l8370N794O88634j53649L47179L00761j30441
$$ plain form
16896 2974816 3214111 3232370 3621317 3155419 2727037 3316071 3341504 3223571 3700810 3723860
16886 3723860 3439444 3669476 3768691 3538657 3524948 3620322 3741680 3793235 3826909 3917288
16876 3917288 3953780 4373922 4367372 4010771 4177404 3994345 4262057 4326173 4299302 4449949
16866 4449949 4658153 4451255 4466999 4692777 4966185 4636778 5024724 4689550 4907688 5093954
16856 5093954 5308814 5387264 5511059 5567438 5573187 5557850 5510166 5798669 5887136 6098631 6324937
16845 6324937 6218700 6384435 6324787 6382793 6483344 6746972 7046724 6789767 6824700 7309315
16835 7309315 7102478 7336841 7625196 7473520 7857864 7711820 7961908 8130629 8281885
16826 8281885 8380144 8718224 8863240 8824870 8830664 9519298 9365649 9712828 10013589 9883148
16816I883148L49147K8462L24086Q798J90076J78736M71360L62736k43819M06857
16806A1959587M16431M01759J79984L88347J262O12950N9904N47592L00439L76131
16796A5244386M76358K66211L81066O9330O70629L62174K50488N42420O49398
16787A8912460L22107L73476L77039M16688R60713M90483O87632M52872N78070
16778B3571540J096303K79214Q99394L07683J067052O13949M66874J249471Q74453
16769C0425933J086158P96328Q35858J014021O35551J389521J228092R08290J407369
16760C9727121J411902R36540J289976J228569J485512J684338J376380J665451
16752E0805789J474142J429348J518598J780775J549322J942809J484433K055544
$$ plain form
16816 9883148 10232295 10260757 10584843 10593641 10783717 10962453 11433813 11796549 11552730 11959587
16806 11959587 12376018 12777777 12957761 13346108 13347370 13960320 14020224 14567816 14868255 15244386
16796 15244386 15720744 15986955 16368021 16437351 17107980 17470154 17720642 18263062 18912460
16787 18912460 19234567 19608043 19985082 20401770 21362483 21852966 22540598 22993470 23571540
16778 23571540 24667843 24947057 25846451 26154134 27221186 27835135 28302009 29551480 30425933
16769 30425933 31512091 32308419 33144277 34158298 34793849 36183370 37411462 38319752 39727121
16760 39727121 41139023 42075563 43365539 44594108 46079620 47763958 49140338 50805789
16752 50805789 52279931 53709279 55227877 57008652 58557974 60500783 61985216 64040760
16744F4040760J718976J887277J546032J958633J881038K037559J406559K019541
16736G8496375J967455J407028J867773J164551J629742J136245J109275R55542
16728H9733986J217428O28581N92622J39273M38736Q8980K0909j85344q28092
16719I1847079l93908n74755r63831q59862r14750j550989j345033j228161j890938
16710H2124852j605646j466312j876843j545259k050200j563278j766830k141015
16702F8109469j414610k234072j456177j951072j871258j737198j639112j513614
16694E4292356j605826j528145j820080j232820j470136j300576j490319j471278
16686D2373176j243260q87486j283816j230694r16575j205778j026810o23321
$$ plain form
16744 64040760 65759736 67647013 69193045 71151678 73032716 75070275 76476834 78496375
16736 78496375 80463830 81870858 83738631 84903182 86532924 87669169 88778444 89733986
16728 89733986 90951414 91579995 92172617 92311890 92750626 92839606 92860515 92675171 91847079
16719 91847079 91453171 90878416 89914585 89054723 88139973 86588984 85243951 84015790 82124852
16710 82124852 80519206 79052894 77176051 75630792 73580592 72017314 70250484 68109469
16702 68109469 66694859 64460787 63004610 61053538 59182280 57445082 55805970 54292356
16694 54292356 52686530 51158385 49338305 48105485 46635349 45334773 43844454 42373176
16686 42373176 41129916 40242430 38958614 37727920 36811345 35605567 34578757 33955436
16678C3955436j070723q79390j040939j042852o89224j171280m60932o52184n27323
16669B6420589q63275q20634p44574m09058m94586q66396m64712o95797o58555
16660B0403002J11119p51640l24511q23471j14699q06793m31015l61475o3460
16651A6837057n01143n50354k71737m08321j66607k59175n16244P7857k72175
16642A3969158o43141k75544L5445o60073K25078o86927m05379J44473j72319
16633A1530771m99432R3591l70646l66011k52088K38910l25789m34724J18308
16624I732890m02188J03371p09541O49872l01705o01565K65073l55816l34090
16615H046301J60989l06353R6188l07544j7832j85276q5621j3671N1664k76621
$$ plain form
16678 33955436 32884713 32005323 30964384 29921532 29232308 28061028 27600096 26947912 26420589
16669 26420589 25557314 24736680 23992106 23583048 23088462 22222066 21757354 21061557 20403002
16660 20403002 20514121 19762481 19437970 18614499 18499800 17693007 17261992 16900517 16837057
16651 16837057 16335914 15785560 15513823 15105502 14938895 14679720 14163476 14241333 13969158
16642 13969158 13326017 13050473 13085918 12425845 12650923 11963996 11558617 11703090 11530771
16633 11530771 11031339 11124930 10754284 10388273 10136185 10375095 10049306 9614582 9732890
16624 9732890 9330702 9434073 8724532 9374404 9072699 8471134 8736207 8380391 8046301
16615 8046301 8207290 7900937 7997125 7689581 7671749 7486473 7400852 7387181 7438845 7162224
16605G162224j75047k75629L44291n98178j39311o4960j02796j60190j47859L57073
16595F199618J103o21474L27988m30427Q3523n0439O3027r92958O52976J98619
16585E431556m09241j02106K38622J56811k79590k31166k2808J69155L5744n31798
16575D455179J15319l02514L11831R690n16487K92934j78281m0854k79087L52390
16565D220120k09939q6234J29110l05943j29857J90171K05763m35188L6629R3425
16555C708057k16895J00712l15142K01722L07768k62562m70292L42943j27559
16546C268752j38211n6814p3750j23758N37061n03327J38208Q4816k00279Q8527
16536C021225M8642J9174m32509K07234K03140j04224l33712J97837n6160k94683
$$ plain form
16605 7162224 6987177 6711548 7055839 6457661 6318350 6253390 6150594 5990404 5842545 6199618
16595 6199618 6200721 5579247 5907235 5476808 5560331 5509892 5572919 4579961 5232937 5431556
16585 5431556 5022315 4920209 5158831 5315642 5036052 4804886 4782078 4951233 4986977 4455179
16575 4455179 4570498 4267984 4579815 4589505 4073018 4365952 4187671 4146817 3867730 4220120
16565 4220120 4010181 3923947 4053057 3747114 3617257 3807428 4013191 3578003 3614632 3708057
16555 3708057 3491162 3591874 3276732 3478454 3786222 3523660 3053368 3396311 3268752
16546 3268752 3130541 3073727 2999977 2876219 3413280 2909953 3048161 3132977 2932698 3021225
16536 3021225 3069867 3089041 2656532 2863766 3066906 2962682 2628970 2826807 2770647 2475964
16526B475964l4030K12495j1446r0094j31935L19948k61651J03284l58909M20649
16516B644275k54025j89770L46794j5162r9907r0720j00457K67899k58928J58014
16506B408013n07314K76200j83144K77848k52854K09944n0648J8308M7394j22823
16496B120924k83985j70076M05563j84021k6806K30934k45309k67551M14074K40775
16486B234522o9310m31149K03051J30870j15317k97724M69057p49918M65729k88825
16476A550986Q1932L31232j77428Q480l2679j61336N1635P4836j11839n4523m2653
16465A518643N23866k42336P521k12939N3581n1385R6149k92937L14183j11660
16455A602686r4375n06248K40141R0099L4577J48038J47445l38601J38379l93007
$$ plain form
16526 2475964 2441934 2654429 2642983 2552889 2420954 2740902 2479251 2582535 2223626 2644275
16516 2644275 2390250 2200480 2547274 2532112 2432205 2341485 2241028 2508927 2249999 2408013
16506 2408013 1900699 2176899 1993755 2271603 2018749 2228693 2178045 2196353 2243747 2120924
16496 2120924 1836939 1666863 2072426 1888405 1861599 2092533 1847224 1579673 1993747 2234522
16486 2234522 2165212 1734063 1937114 2067984 1952667 1654943 2124000 1374082 1839811 1550986
16476 1550986 1632918 1964150 1786722 1795202 1762523 1601187 1652822 1727658 1615819 1561296 1518643
16465 1518643 2042509 1800173 1807694 1594755 1648336 1596951 1693100 1400163 1714346 1602686
16455 1602686 1508311 1002063 1242204 1332303 1366880 1514918 1662363 1323762 1462141 1069134
16445A069134L21055r9895K97782O3025k78703K68566k52637k47480J32208J48489
16435A421544N7464l37509M092J02965K46052N777l98787J84715M8025J40771
16425A475109m88510P1165Q1579q584J19589k6159l4650k23961L58617j67552
16415A156643Q0952j92046L31646l98170M5357n1205L6957K51357j83795K78589
16405A356285m39084L15730L3287k95805j61678r1L18423j76844j98213L46621
16395A098631J88190n66034L16537j28900J70640J4469l71006k15435K25625J73805
16385I06522J44419k08987L6517J49083m7472q4115M8326o5228j25741Q3917J06721
16374I43962j09290J28936O7008l10120L8075P44310E68797K68824J77750j64939
$$ plain form
16445 1069134 1390189 1290294 1588076 1651101 1372398 1640964 1388327 1140847 1273055 1421544
16435 1421544 1479008 1141499 1145591 1248556 1494608 1500385 1101598 1286313 1334338 1475109
16425 1475109 986599 1057764 1139343 1130759 1250348 1224189 1189539 965578 1324195 1156643
16415 1156643 1237595 1045549 1377195 979025 1024382 973177 1010134 1261491 1077696 1356285
16405 1356285 917201 1232931 1266218 970413 808735 808644 1127067 950223 752010 1098631
16395 1098631 1286821 720787 1037324 908424 1079064 1093533 722527 507092 732717 906522
16385 906522 1050941 841954 878471 1027554 980082 895967 944293 879065 753324 837241 943962
16374 943962 834672 963608 1030616 720496 758571 1502881 568797 837621 1015371 850432
16364H50432j43335j13458K23902J64163K0293m9405l78259L74809p3281m36201
16354D39660L55769J30300K62832m61778K95744j64419j36600K39476j94887P2971
16344H39068k64714L50679m47661K20283l18394J43920L16006j84490o4600K49753
16334H39850P559k77853J91135K2958j29983M3260K38415l72374m4036L36918
16324H55849k2382k45348l2161K01375j52794L7416L8250J36706j13866j96045
16314E07000L00131r1595K87379j75346k93984Q8555j12148J03646N4305J39409
16304H07352l4714j64017j04481J89156k97945j84541M21324A13479M13192K62767
16294G89438B52586M59148l31455P99N00292C64584M82290l13871M85010C93218
$$ plain form
16364 850432 707097 593639 817541 981704 1001997 952592 574333 949142 875861 439660
16354 439660 795429 925729 1188561 726783 1022527 858108 721508 960984 766097 839068
16344 839068 574354 925033 477372 697655 379261 523181 839187 654697 590097 839850
16334 839850 847409 569556 760691 783649 653666 696926 935341 562967 518931 855849
16324 855849 833467 588119 555958 757333 604539 641955 680205 816911 703045 507000
16314 507000 807131 715536 1002915 827569 533585 622140 509992 613638 667943 807352
16304 807352 772638 608621 504140 693296 395351 210810 632134 113479 526671 789438
16294 789438 252586 711734 380279 381078 881370 364584 846874 533003 1018013 393218
16283E81561j7942B54046K38675m864K07918k54183O16064E19377L19727m19455
16273D19649L83344l10292L29414k46157q8384l3638K04114j50586M1091j38114
16263D10441o8428Q3536j738j1743o4995M7235k3725o6292K04112O895j24250
16252C91048J26093Q2743j79136J72178n0781j2998p0326d0899D35749j285K1565
16241D56029J90412A609L08208O5609M000j25305J84521O0599J40503J18727C07197
16229D70716P5211k43327E598N13549j77281K25955j9115L0964j76330j8457I8682
16217C86338j08138N173k1843L77642k26598m0554N9258n0341j2710K2468Q3385
16206D74080j74037n2234J42552A20151K63683M01791B36004J41206B7800M46641
$$ plain form
16283 581561 563619 254046 492721 487857 695775 441592 1057656 519377 839104 419649
16273 419649 802993 492701 822115 575958 487574 453936 658050 507464 548555 410441
16263 410441 342013 425549 423811 412068 347073 394308 370583 304291 508403 515298 391048
16252 391048 517141 599884 420748 592926 542145 529147 458821 -40899 435749 434464 456029
16241 456029 646441 1609 309817 375426 379426 254121 438642 499241 639744 758471 307197
16229 470716 545927 302600 5598 519147 341866 567821 548706 579670 403340 384883 98682
16217 386338 278200 283373 261530 639172 412574 372020 431278 380937 368227 390695 474080
16206 474080 300043 247809 390361 120151 383834 785625 236004 377210 27800 474441
16196D74441E7415J67289P7375J62661I3968L97423j79020q0644K03796A45484
16185D47593o4277M9701K86955A30856N74814B05041B6824L60345D4503J79455
16175B23958J95288j20737J51754n7369A06500J16364I8107N16514A24366M32985
16165E57351A44784K33528L48970H7972O6621a6496D13234A06908J68936K90911
16155E66755A46768L24810j32189j5513C8309M25941J14603H7411L72539r9413
16145C60537j72524o7716l7366M07338A04824q820g3510B51224J38364E3991J81551
16134B35542J5462a01230B48653K53294k03815M52133A8648O39954A29286J96746
16124C26032G0951J55709B4500a99777C00550i6056A46183M99242B05474J88532
$$ plain form
16196 474441 57415 224704 302079 464740 93968 491391 312371 231727 435523 145484
16185 447593 383316 433017 719972 130856 705670 205041 26824 387169 44503 223958
16175 223958 419246 298509 450263 392894 106500 222864 98107 614621 124366 557351
16165 557351 144784 378312 727282 87972 154593 -16496 413234 106908 275844 566755
16155 566755 146768 471578 339389 323876 38309 464250 578853 87411 459950 360537
16145 360537 188013 120297 82931 490269 104824 96004 -73510 251224 389588 53991 235542
16134 235542 251004 -101230 248653 501947 298132 750265 18648 658602 129286 326032
16124 326032 70951 226660 24500 -199777 300550 -96056 146183 645425 205474 394006
16114C94006J0773J16404K2710A76026P5633J37826j14490K6249p0347G3996Q3739
16103A57735a038C50717R548j24196I1741J5286K9710i3051j31447C60697j38289
16092B22408o9402J06427o9353H5337J93531q1792q821F4526C0030J95463K1498
16081B46991k2709r1471K23122j42763k9557R1164r2323l5958F5599C965L75075
16070C79040h7615B21230p7290a83137D11849A40283J26239G45K66045K7703C5586
16058B85340C7222h200A3060J73077C8963c4913D42073F5881B4678M18948G4289
16046C78050b68902B11126J28609L5142j42937b0919l9620j76846b1265r5404
16036a16669I1086b07872A66074M243l7705P8460d916a424m5813A08538L4879
$$ plain form
16114 394006 404779 521183 543893 176026 251659 389485 274995 301244 230897 73996 157735
16103 157735 -1038 350717 360265 236069 91741 107027 136737 -93051 -224498 360697 222408
16092 222408 153006 259433 190080 85337 278868 197076 188255 64526 30030 225493 246991
16081 246991 224282 132811 355933 213170 183613 274777 182454 146496 65599 3965 379040
16070 379040 -87615 221230 143940 -183137 411849 140283 266522 745 266790 294493 35586
16058 285340 37222 -8200 13060 186137 38963 -34913 442073 65881 24678 443626 74289
16046 378050 -268902 211126 339735 374877 231940 -20919 -60539 -237385 -21265 -116669
16036 -116669 91086 -207872 166074 170317 132612 211072 -4916 -1424 -47237 108538 143417
16025A43417M54673g6057C17278A04863c06310B64597l1859G6698P7721b3206
16014B46882a53728A34549E2021N3088L01344A79174d19908A56950a66270C13780
16003C82374A74334B9534g270j8837D23391A01639J77512a1902A5078K37812M0204
15992B93094a80114B26972I2847J91112j31298L42460M05872K30666j27630j46093
15982H57936k32410k67830D1203J92688q59a02714C02662j38039a23536J1170
15972a12366A93419b0411p4384E51927b14342g0189A44546l4541b14078C82236
15961c49549A05254J41184E5049d7906I5118a16439M6324A36508F6117K32819
15951B98936a599B78787a07946B50316C5793j1286M0747b55302A17550K31669
$$ plain form
16025 143417 598090 -76057 317278 104863 -306310 264597 232738 76698 154419 -23206
16014 246882 -153728 134549 52021 105109 406453 179174 -419908 156950 -166270 313780
16003 382374 174334 29534 -7270 -26107 423391 101639 279151 -11902 15078 252890 293094
15992 293094 -180114 226972 92847 283959 152661 495121 900993 1131659 1004029 857936
15982 857936 625526 357696 41203 233891 233032 -102714 302662 164623 -123536 -112366
15972 -112366 193419 -20411 -94795 551927 -214342 -70189 144546 110005 -214078 382236
15961 -349549 105254 246438 55049 -47906 95118 -116439 -70115 136508 66117 298936
15951 298936 -1599 278787 -107946 250316 35793 24507 65254 -255302 117550 349219
15941C49219b29912G6718j3574L222b42726A21839Q628O9182Q5546f0081r5542
15930a55623A21758n2413E568K6623J06577a43440n8107B18330a5269C12582a5135
15918A36791L8970f7713A40612J98992j10009J1645b89817F1765L3463a29788
15907b32013J02626L5009D1729a68671C11087p7411e7336B38380J06281j64802
15897A79859m0209b5546B53813F0746a26778e5272l08047C0403a26162E5988a49191
15885B40852j06874R5722P553m5910L39947E7294j1220L4927b2096n36351h7233
15873a42636d9302o2863p4632B55782D5450i397H6834e7293j03K8024p5206d3387
15860B1064a07460A92817i3204j58577B06432e293H4963a31442A43330g4253m6273
$$ plain form
15941 349219 -229912 76718 63144 66366 -242726 121839 130467 199649 285195 -60081 -155623
15930 -155623 121758 69345 5568 32191 138768 -143440 -201547 218330 -15269 312582 -15135
15918 136791 175761 -67713 140612 339604 229595 241240 -289817 61765 95228 -129788
15907 -232013 -129387 -94378 41729 -168671 311087 233676 -57336 238380 344661 179859
15897 179859 139650 -25546 253813 60746 -126778 -55272 -363319 30403 -126162 55988 -149191
15885 240852 133978 229700 237253 191343 531290 57294 46074 81001 -22096 -558447 -87233
15873 -142636 -49302 -112165 -186797 255782 45450 -9397 86834 -57293 -57396 -29372 -104578 -43387
15860 21064 -107460 192817 -93204 -251781 206432 -5293 84963 -131442 143330 -74253 -120526
15849a20526E3849K00650a43262A44728n6677A6731h7848L3889j5431J20l5344
15838a04614A6417R6800e3933a6010r6823D51774a35614J1246J6401G1715e1535
15826i6194L9273a1216k07330B6871h3835F6592L4445g6767m858A76350a40304
15814c0229l41669C6653K07827C7596P8351Q3590R314P2301a39847j96096h0294
15802E6631a45334A66147k8325e9961F8754A0998M0131J08193i8320A9147b75307
15790b89199H7628R4987L4347C7038b82764G701K69783B3305J32488J4819b75803
15778B70672d4811D4126J272K40567I3251i1188F1017L9380D0228a10451G4117
15766A07151L9599a21285c0756l943J6373H0356M5000J38930a83332G852d4694
$$ plain form
15849 -120526 53849 254499 -143262 144728 88051 16731 -87848 -53959 -69390 -69270 -104614
15838 -104614 16417 113217 -53933 -16010 -112833 451774 -135614 -124368 -107967 71715 -51535
15826 -96194 -56921 -11216 -218546 26871 -83835 66592 101037 -76767 -81625 176350 -140304
15814 -30229 -371898 36653 244480 37596 115947 199537 208851 281152 -139847 -335943 -80294
15802 56631 -145334 166147 137822 -59961 68754 10998 51129 159322 -98320 19147 -275307
15790 -289199 87628 182615 216962 37038 -282764 7701 277484 23305 155793 170612 -275803
15778 270672 -44811 44126 45398 285965 93251 -91188 61017 100397 40228 -110451 74117
15766 107151 146750 -121285 -30756 -34699 -18326 80356 125356 264286 -183332 7852 -44694
15754A46824Q4597I9639J97911b04373B8426K1690b5121j44469A82422q4743B6755
15742C7544J7024J75726F2750O4771i6595o6525O4038k3481O664C9616a35259
15730A55475J12961a54285p0711a1829l46427A1213Q1833a15619j87675a951j96283
15719a98234h0302k09445R2697e404j66773A80318a83399A1893a88894A34225
15708c8872C45532a42033j19340A2795K2866J04261a68106e9566j45902F4603
15697e6585C9610R8641j6874b03208j88985h0285B5925P3232D5630L77058a53044
15685G5171e7006G2055A2094N2687j6490P21286C34794b26292h7511L5394m9627
15674a01744b4891n4211j8121C58111j18356b1658B26406k076a65915B60280B4411
$$ plain form
15754 146824 231421 99639 297550 -204373 28426 50116 -25121 -169590 182422 97679 26755
15742 37544 54568 230294 62750 127521 -96595 -163120 -99082 -122563 -115899 39616 -135259
15730 155475 268436 -154285 -224996 -11829 -358256 11213 93046 -115619 -303294 -1951 -198234
15719 -198234 -80302 -289747 -197050 -5404 -172177 180318 -183399 11893 -188894 134225
15708 -38872 345532 -142033 -261373 12795 35661 139922 -168106 -59566 -205468 64603
15697 -56585 39610 138251 121377 -203208 -392193 -80285 25925 99157 45630 422688 -153044
15685 75171 -57006 72055 12094 64781 48291 769577 334794 -226292 -87511 -52117 -101744
15674 -101744 -24891 -79102 -97223 358111 239755 -21658 226406 224330 -165915 260280 24411
15662d12289g3740A79324a03297Q49P624k616A03576c1745j64747j6019D1741
15650b50885A15002d257k1267B46366a12060j86553a39513f6939k39265a32704
15639B32847c372A7824c08414J17405C4660f5805H7151k4901a0268n3660j16946
15628a80874A34187e3454j3913j4785o2966L868A4342g3310D5820K49948a39596
15616b07643k4971B08474J5141D4064d3068r5957m1485j56702A0971J4470e3257
15604a62328I3842e6716A06624D5225a3313l5025B2066a17926K1320I7083J8602
15593A15685b04836A10605J56808b24631m8169N2953A44212c4371F552b44331
15582i718o7102j98082B02475D0482a54921m0451F7669O0049l3136P6719a8897
$$ plain form
15662 -412289 -73740 179324 -103297 -102448 -94824 -97440 103576 -31745 -196492 -212511 41741
15650 -250885 115002 -4257 -25524 246366 -112060 -298613 -139513 -66939 -306204 -132704
15639 232847 -3372 17824 -308414 -191009 34660 -65805 87151 62250 -10268 -63928 -180874
15628 -180874 134187 -53454 -67367 -82152 -145118 -141250 14342 -73310 45820 295768 -139596
15616 -207643 -232614 208474 223615 44064 -43068 -139025 -180510 -337212 10971 25441 -53257
15604 -162328 93842 -56716 106624 45225 -13313 -48338 22066 -117926 -96606 97083 115685
15593 115685 -204836 110605 267413 -224631 -272800 -219847 144212 -34371 6552 -244331
15582 -9718 -76820 -274902 202475 40482 -154921 -195372 67669 127718 94582 171301 -18897
15570a27448c6330j7044m1465d2632B09310c5q140B13029r2029A5280k572b65520
15557D03178A4141P3096R7344p1967j6117B4236k64e1496A96975a08284A76469
15545h1647G728J5262K65209A36611k4425a16478A25332g9129o5847j37653C1655
15533B5919a42231c8685l0141A955a41006f5662D72855a75566f3697H6412Q5907
15522A72319N6755b5707B35341d3481G8069A7396N7867k823Q5479K00945A34416
15510A98670H8099b56963A71397p8522K30291b35894D42272a5014B20281k1519
15500A98762J6541J29471A29242k8676m5050K28201J18614r4593A13431K2231
15490A35662b0945A989J00365L04059F901J65764J73314A28118K47716G838J98488
$$ plain form
15570 -127448 -36330 -53374 -94839 -42632 209310 -35 -8175 213029 121000 15280 12708 -265520
15557 403178 14141 87237 184581 112614 96497 24236 23972 -51496 196975 -108284 176469
15545 -81647 7728 22990 288199 136611 112186 -116478 125332 -79129 -144976 -282629 31655
15533 25919 -142231 -38685 -68826 1955 -141006 -65662 472855 -175566 -63697 86412 172319
15522 172319 229074 -25707 235341 -43481 78069 17396 75263 72440 157919 358864 134416
15510 198670 88099 -256963 171397 92875 323166 -235894 442272 -15014 220281 198762
15500 198762 215303 344774 129242 100566 55516 283717 402331 307738 113431 135662
15490 135662 -20945 1989 102354 406413 6901 172665 345979 128118 375834 7838 206326
15479B06326B6312J76005K17962m09N6203L4806M6555k60765o8495q1367e6232
15467F2892B8336I359M7853P0057J9712b16123B59226b5188A38219o4131O6700
15456A40788c5531A77580p8919M3474g2311K4861h890k97500J02269A65086m6127
15445A18959L12490k2741p1254K58714N19796k05734l98159r9119L4504b27704
15434c1734B77301j11327B6970K29832L1372G1131a00736H6332b83537A55762
15423B99389D7004b70915B8199c45271G5129J7653K69741b49298A00813a0178
15412a41289A04730g0088A24270a29420A65882i2202H0997a09136r1068L2248
15402a67956f0896G2870P4391g1569Q848L070C2481K52228C3162i241m0325E7643
$$ plain form
15479 206326 26312 202317 420279 419870 476073 510879 557434 296669 228174 146807 -56232
15467 62892 28336 9359 57212 127269 146981 -216123 259226 -25188 138219 74088 140788
15456 140788 -35531 177580 98661 142135 -72311 -47450 -8890 -306390 -204121 165086 118959
15445 118959 431449 408708 337454 596168 1115964 910230 512071 412952 447456 -227704
15434 -31734 277301 165974 26970 256802 288174 71131 -100736 86332 -283537 155762
15423 299389 47004 -270915 28199 -345271 75129 92782 362523 -249298 100813 -10178
15412 -141289 104730 -70088 124270 -129420 165882 -92202 80997 -109136 -200204 -167956
15402 -167956 -60896 72870 147261 -71569 -62721 -59651 32481 284709 33162 -9241 -49566 57643
15389B55368h2738B01023e6388D4036L6609g6023I5240j7449a5993C4437b43215
15377a93426e7651G0992J09671a65768B42216J61221j12497k0334L41154d5492
15366B72503g8662A5987i17C73426r1184A06541A9468J71755I5260L10433A87392
15354A40955f4653D02740N6188A00117d9236F5558J00638E8675P5154E7443L80408
15343D37851A15792e5475B87081K60357k32390L5090j39451P9745I7949J9214
15333A17163l7047l1268J95040a22517C21742A48544k5763k4616a88212A5723
15322C47503C741a4092B79491j5808d0846j39811G8127a8840B17959J77373A40049
15310A31181a67424B18083j9075m0161B2482c65601C46912a4774j26134A30246
$$ plain form
15389 255368 -82738 201023 -56388 44036 80645 -76023 95240 77791 -15993 34437 -243215
15377 -193426 -57651 70992 180663 -165768 242216 403437 290940 270606 611760 -45492
15366 272503 -78662 15987 -917 373426 282242 106541 19468 191223 95260 405693 187392
15354 140955 -64653 402740 458928 100117 -49236 65558 166196 58675 133829 57443 437851
15343 437851 115792 -55475 287081 547438 315048 350138 210687 290432 97949 117163
15333 117163 80116 48848 243888 -122517 321742 148544 122781 98165 -188212 15723
15322 347503 3741 -14092 279491 263683 -40846 -180657 78127 -18840 217959 395332 140049
15310 131181 -167424 218083 199008 158847 22482 -365601 346912 -14774 -140908 130246
15299b3703k16571A28320E8580a53986A1475a76007k39458G006b14208B48802
15288B01699a36943m48N0530A88755D7819L5585l3028a59587B43165m3824J44597
15277C43938h2974j41731F4540K41436f86E5053J1570k1667b5420D9951K17166
15266B67117E4370I450Q1876K09868A6883J95872B6224A0453a49618d8447C8836
15254C54079b5802E0672f7097A23813a13733o2925D00848A07157K32028j56601
15244A82584J14880O89226O61588k90552J31579N3177E40130D9359J08734e5162
15233f0150B31093J19655a88765F7389g0198A80156G4759b4707B47917j23066
15223A24851f43B25898b74972A46788g089A36484K19003a38543L8666b0794K834
$$ plain form
15299 -23703 -240274 128320 58580 -153986 11475 -176007 -415465 7006 -214208 248802
15288 201699 -136943 -137391 -86861 188755 47819 83404 50376 -159587 243165 199341 343938
15277 343938 -82974 -224705 64540 305976 -686 55053 66623 44956 -25420 49951 267117
15266 267117 54370 9450 91326 301194 16883 212755 26224 10453 -149618 -48447 38836
15254 354079 -25802 50672 -67097 123813 -113733 -176658 400848 107157 339185 182584
15244 182584 297464 986690 1648278 1357726 1489305 1542482 540130 49359 158093 -55162
15233 -60150 231093 350748 -188765 67389 -70198 180156 74759 -24707 247917 124851
15223 124851 -643 225898 -274972 146788 -7089 136484 355487 -138543 -99877 -20794 -17960
15212a7960B15203M2385a24078B21032e7188E3361N2221m8191L59452A76340D6200
15200B34188n0267a67412B12640H5238J73584F5241K29725A9298R1197h8278K0821
15189f7457C36893A32394C1605i8377Q912k4385K4276E5064P2695b15900a9067
15177a28618a1396B82015M2299A61648D9360J27920n8284D6450b04393B5046e325
15165g6790f996A8446L1782l415J12685j3740B5417a23619d7543A34252b25096
15153C08240A4621R9252k0090J73058l9287A06293K24551H984h638I0390e5149
15141A36874a23918B06562E5219b32091R9184I4330P9850K8614r6883a44940G4232
15129B09703q0283E2695J79548a06306L5053A36325f6449n6736C06272J16240
$$ plain form
15212 -17960 215203 257588 -124078 221032 -57188 53361 105582 57391 416843 176340 46200
15200 234188 183921 -167412 212640 85238 258822 65241 294966 19298 110495 -88278 -67457
15189 -67457 336893 132394 31605 -98377 -89465 -113850 -89574 55064 127759 -215900 -19067
15177 -128618 -11396 282015 324314 161648 49360 177280 118996 46450 -204393 25046 -5325
15165 -76790 -6996 18446 50228 46813 159498 145758 25417 -123619 -47543 134252 -225096
15153 308240 14621 113873 93783 266841 227554 106293 330844 8984 -8638 90390 -55149
15141 136874 -123918 206562 55219 -232091 -132907 94330 174180 202794 105911 -144940 74232
15129 209703 129420 52695 232243 -106306 -71253 136325 -66449 -123185 306272 422512
15119D22512R7185A99663H6045a15894A21283r195h176A37525J19760d4379G1962
15107f1570A54484J26335A18684l2442K97061a01207E19901A70140h8987A63491
15096A15372k5623K46307j22694f2712k50262a24689I6698P5210k9689K00166
15086C42385K0558A39962K80024a37575a9356B33755d343I7221J41990L4721E1445
15074c5581B69332p1383b0914l966k30163B01403K4608E4989q004c0646A80338
15062b09469A53786J27051F5360K22481n923A8859K53786K12318G6296Q4838K90731
15051D51865j83141Q0371j07248L8987J5368n6307K29269j28991o8781A10259
15040C75721j25620E393L62303k8819j32531p4509J62589K32902j16094K29070
$$ plain form
15119 422512 519697 199663 86045 -115894 121283 112088 -8176 137525 257285 -44379 71962
15107 -61570 154484 280819 118684 86242 383303 -101207 519901 170140 -88987 163491
15096 115372 89749 336056 213362 -62712 -312974 -124689 96698 171908 142219 342385
15086 342385 362943 139962 419986 -137575 -19356 233755 -4343 97221 239211 273932 51445
15074 -35581 269332 197949 -20914 -24880 -255043 201403 226011 54989 46985 -30646 180338
15062 -209469 153786 280837 65360 287841 281918 18859 272645 484963 76296 161134 451865
15051 451865 268724 349095 241847 280834 296202 239895 469164 340173 271392 110259
15040 375721 250101 5393 367696 338877 206346 131837 294426 527328 411234 640304
15030F40304j1604M4597j22368j99300J24385K30642A06983J34087O8126D9247
15019E21383B16789K89355J04259j33605I5545K83216B4866K26597D5730K32614
15009B78344J66684A71578K70800N5563A38504R127L3981J06060a92237A05892
14998E24835j02578j84646L03870B54193d3603A79374J50372L29154B24089r7864
14988A26225J07310j08179M48591B13988k2224K71024K51524Q7722p4085J36609
14978H64558j96065K05314m22409q0943G3414K62547A40139K55072K22363K46797
14968H64371C20779E4480K43818c4764E76647A06996J16207O344k2136E7776h4660
14956B55013h5663D50424B07686K49580k6485B03356C9322L00285L2034A39712
$$ plain form
15030 640304 628700 673297 550929 351629 476014 706656 106983 241070 309196 49247
15019 521383 216789 506144 610403 476798 95545 378761 24866 251463 45730 278344
15009 278344 445028 171578 442378 497941 138504 147631 181612 287672 -192237 105892
14998 524835 422257 237611 541481 254193 -43603 179374 329746 658900 224089 126225
14988 126225 233535 125356 573947 213988 191764 462788 714312 802034 727949 864558
14978 864558 668493 873807 451398 370455 73414 335961 140139 395211 617574 864371
14968 864371 320779 54480 298298 -34764 576647 106996 223203 229547 207411 57776 -84660
14956 255013 -85663 450424 207686 457266 430781 203356 39322 339607 371641 139712
14945C38648m3750J33153J38006k37286A38790R8948J48179J25567A74769J12882
14935B87651L93609l12011L38972l3310L14881j48719J41410j70166M23603l8106
14925A197814M23946m34873R3015l76098M45287J1014o8247N97379Q2234K990
14915A974461p92954J30282n01927J45676k55557j90450l6802j02724k0675J75502
14905E24832k48294M55642j31178j25169j43522n3026J67572C2497K68299q2142
14895B18654J7830K2892J86869m8190o7398Q9311K19872n2977J10124q5540j99870
14884D11577N24827C25044l29N09234M1158K85047E09812q1768J22454k66542
14874B83956L38408C10312M08057k11700j11575A21315K94367L19538j90742J43850
$$ plain form
14945 338648 294898 428051 566057 328771 138790 237738 385917 511484 174769 287651
14935 287651 681260 369249 708221 674911 989792 841073 982483 812317 1235920 1197814
14925 1197814 1621760 1186887 1279902 903804 1349091 1360105 1291858 1889237 1971471 1974461
14915 1974461 1181507 1311789 809862 955538 699981 509531 472729 370005 349330 524832
14905 524832 276538 732180 601002 475833 332311 279285 446857 32497 300796 218654
14895 218654 236484 259376 446245 398055 330657 419968 639840 586863 696987 611447 411577
14884 411577 936404 325044 324715 833949 875107 1160154 509812 428044 550498 283956
14874 283956 622364 310312 718369 506669 395094 121315 415682 735220 544478 688328
14864F88328j8663j14115o2410B17704K60689J5157q4838L24847C52117J51683
14854E03800L1328K77583j08440j75433j74413L12152q4690J3096j02140R437
14844E02280K38843L01012m38709N22953l92135Q1711j0481j58641O4529K00661
14834I12023C51624J06772N3691k27903J01138j42026L05057k15402O7671j03824
14824B96798J12737M5856K33273l19771K04211J95356Q9803k83606N3310k76954
14814C51013L19353o5556P5369j56436J81375j94807K15879j55143K31474J33293
14804I35814j60963m6468j6858J24825C95446j39733J64324o4041J70001j53782
14794C72215L9972K51337C04231L02325p3647J14207j42455j20545J21912J429
$$ plain form
14864 688328 669665 555550 493140 217704 478393 493550 408712 733559 352117 503800
14854 503800 535128 812711 704271 528838 354425 666577 581887 594983 492843 502280
14844 502280 741123 1042135 603426 1126379 734244 815955 805474 646833 711362 912023
14834 912023 351624 458396 512087 284184 385322 243296 548353 332951 400622 296798
14824 296798 409535 455391 688664 368893 573104 768460 858263 574657 627967 351013
14814 351013 670366 604810 680179 523743 705118 510311 726190 571047 802521 935814
14804 935814 774851 728383 711525 836350 395446 255713 420037 355996 525997 372215
14794 372215 412187 663524 304231 606556 532909 647116 504661 384116 506028 507457
14784E07457K97438j17700k39158K82872j27212k12649K02880O9409J44363L3750
14774H41450j59369J46211J74247k40556l40927K71932k15219J31009n0309F9334
14763F79947K75520B60703M35551j98061o647J77710j63340K17924k47452K0761
14753D97149J76550J26014l66623J70620N0921J10860k25540M933o1740L70213
14743H53357C70985L43162j51255P4244L44962l73653m5205L4943L21268k38758
14733F80693j32211p0810M51691Q1567j61969L08536M79835j06409j44455L93809
14723A780277o32610l15365M6529q2028K2225K0821j98337j819L00361k32104
14713G07950J24542J66852m03177L6618K63529J58219k62934J05325n8356L37577
$$ plain form
14784 507457 804895 687195 448037 730909 603697 391048 593928 663337 807700 841450
14774 841450 682081 828292 1002539 761983 421056 692988 477769 608778 558469 69334
14763 679947 955467 260703 696254 498193 491546 669256 505916 723840 476388 497149
14753 497149 673699 799713 433090 603710 654631 765491 539951 544884 483144 853357
14743 853357 370985 714147 562892 637136 982098 608445 563240 598183 919451 680693
14733 680693 548482 477672 929363 1010930 848961 1157497 1637332 1530923 1386468 1780277
14723 1780277 1147667 832302 878831 796803 819028 839849 641512 639693 940054 707950
14713 707950 832492 999344 596167 632785 896314 1054533 791599 896924 838568 1176145
14703A176145j29147L67150K70295j46375m34955K36097n16811P2767l9628J14498
14693I70036k26903l37161M71010R0146D47772J68282K09557o6087l55246J05486
14683E09764N74351m05577J48543j40493j15851J35207r1363L5737M0937j59297
14673E31958K92379j00907J55030J38014l31357M89720n70711K84063o4138J24039
14663I48090o2576K2663J1332l95759K62284P3119j34223L40470j32019K16749
14653A150130K5370j86205J12142J21747j45174n410q9028j47913L56134k02691
14643I89102j18321K97757j51869K7543J22127K35072m62927m5713j04579J62118
14633I50310K21894P9646j17102K0164q6185J96705l86469M82209j88215k90886
$$ plain form
14703 1176145 1046998 1414148 1684443 1538068 1103113 1339210 822399 895166 855538 970036
14693 970036 743133 405972 876982 967128 447772 616054 825611 759524 404278 509764
14683 509764 1084115 678538 827081 686588 570737 705944 614581 650318 691255 531958
14673 531958 824337 723430 878460 1016474 685117 1174837 604126 888189 824051 948090
14663 948090 885514 908177 919509 523750 786034 859153 724930 1065400 933381 1150130
14653 1150130 1175500 989295 1101437 1223184 1078010 1072600 983572 835659 1191793 989102
14643 989102 870781 1168538 1016669 1044212 1166339 1401411 938484 892771 788192 950310
14633 950310 1172204 1251850 1134748 1154912 1068727 1265432 878963 1361172 1172957 882071
14623H82071N38224m70931L03307J06079l08155J63280j59062M21939l55624q5973
14613A035155J91703K50518J3661k57772O1633j34274J82168k06413k5218O3051
14603A174212L78642o41199N24816o7815j41799O7408J15531j3631J9872n6896
14593A359141J1920k39994M32726l41018J54800j32715L19641J87122k01003J84148
14583A734768j55735j17943O220L44829k36739q7009J96824k6247k59503P1505
14573A470970M03062m7598m4374k40776J81949K6759K17620p9622k44391K64200
14563A907799K22637l3980P9028P8642J19180M8696k4598O6702M42953O3651L51719
14552C322429J63249R12798M22024J302857K946533P714173J9034338K121483
$$ plain form
14623 882071 1420295 949364 1252671 1358750 1050595 1213875 1054813 1476752 1121128 1035155
14613 1035155 1226858 1477376 1491037 1233265 1294898 1160624 1342792 1136379 1111161 1174212
14603 1174212 1552854 911655 1436471 1368656 1226857 1294265 1409796 1396165 1416037 1359141
14593 1359141 1371061 1131067 1563793 1222775 1377575 1244860 1564501 1751623 1550620 1734768
14583 1734768 1579033 1461090 1467310 1812139 1575400 1488391 1685215 1658968 1399465 1470970
14573 1470970 1874032 1826434 1782060 1541284 1723233 1749992 1967612 1887990 1643599 1907799
14563 1907799 2130436 2096456 2175484 2254126 2373306 2422002 2397404 2464106 2907059 2970710 3322429
14552 3322429 3485678 4398476 4820500 6123357 9069890 16784063 35818401 37939884
14544C7939884A7293062G713548l314855j584417j59061M00554J856947q28053
14536D084663j837109m89687R6327M8164k82010R7150j04454N24722k26827J42541
14526B053480l94941M14821o9089L5924j79443K93147k2978l13230J62032j32721
14516A847002M24640k6702L3064J29891j53716K33319k99194j62224M44741M5796
14506B516617R105o322j51313J79374j6108m1138K3751J30903j57841L95178k34167
14495B648039o9046K70106P8634Q7975j53642k6323J28535J45282m9525j29388
14485B930647l5187L28595K42860j23054J3862k33695K57049l28043J73320J22560
14475C348914m5481m2074K90599j00655q5550L53217j5186j24436M8557L67523
$$ plain form
14544 37939884 17293062 7713548 4398693 2814276 2655215 3055769 4912716 4084663
14536 4084663 2247554 1757867 1854194 1902358 1620348 1717498 1613044 2137766 1910939 2053480
14526 2053480 1658539 2073360 2004271 2040195 1860752 2153899 2130921 1817691 1979723 1847002
14516 1847002 2271642 2244940 2278004 2407895 2254179 2487498 2188304 2026080 2470821 2516617
14506 2516617 2525722 2519400 2368087 2547461 2531353 2490215 2513966 2644869 2487028 2882206 2648039
14495 2648039 2578993 2849099 2927733 3015708 2862066 2835743 2964278 3109560 3060035 2930647
14485 2930647 2895460 3224055 3466915 3343861 3357723 3124028 3381077 3053034 3226354 3348914
14475 3348914 3303433 3261359 3551958 3451303 3365753 3718970 3703784 3579348 3627905 3995428
14465C995428n79452K45500K10563j121J91172L2059K28552m54222L97128J50683
14455D416290k34730L04927k30834j11903J21641P277J88423l4716N4594O9895
14445D550864J91535L51977n9317O7203N4550j34613K8941J97746Q5314l6258
14435E297942P765J64953J95199O2813j25186M19250j43902K29861L5028l4137
14425F109586J17024J48498r5648K83908J04102P7194J43683o4211Q6598j52992
14415F757742N13977P4264k63820J33822M03273J58567k27923K31815M36362l1039
14405H187040K86941m18263L79413k94689K59208J27260N82401j79819M2149M36036
14395I407677j23369j08127P33513k06412N9844K75633L73657K34340k37972M94824
$$ plain form
14465 3995428 3415976 3661476 3872039 3870918 4062090 4094149 4322701 3868479 4265607 4416290
14455 4416290 4181560 4486487 4255653 4143750 4265391 4272668 4461091 4426375 4480969 4550864
14445 4550864 4742399 5094376 5035059 5102262 5156812 5022199 5051140 5248886 5334200 5297942
14435 5297942 5305707 5470660 5665859 5728672 5603486 6022736 5878834 6108695 6143723 6109586
14425 6109586 6226610 6375108 6279460 6563368 6667470 6744664 6888347 6824136 6910734 6757742
14415 6757742 7271719 7345983 7082163 7215985 7619258 7777825 7549902 7781717 8218079 8187040
14405 8187040 8473981 8055718 8435131 8140442 8399650 8526910 9109311 8929492 8971641 9407677
14395 9407677 9284308 9176181 9909694 9703282 9763126 10038759 10412416 10646756 10408784 10903608
14385A0903608O19765m14701Q71101p0338J62785K06756N6080L09937J09143K59648
14375A3013784M18711J04099N09935k93762L26570R30965N19211j14856N47415
14366A5962072O29914m81154N40075O2231M95871M11089L25610L05166O58906
14357A8909780L69097O45867K67877M5329J141198L20052M63528P21818L48246
14348B3232792L26574R54788M70629O66663O34893O81078Q47784N21947R70485
14339B9307633R64487L46250Q60577J302152P14606J067835Q02160J409393J189957
14330C7965050J209148J039107J341385J514333J111750J679668J323642K001376
14322D9185459J790697J472766J721321K064209K012086K196659K313281K062375
$$ plain form
14385 10903608 11523373 11108672 11979773 11909435 12072220 12278976 12335056 12644993 12754136 13013784
14375 13013784 13432495 13536594 14046529 13752767 14079337 15010302 15529513 15414657 15962072
14366 15962072 16591986 16110832 16650907 16713138 17209009 17620098 17945708 18250874 18909780
14357 18909780 19278877 19924744 20192621 20237950 21379148 21699200 22162728 22884546 23232792
14348 23232792 23559366 24514154 24984783 25651446 26286339 26967417 27815201 28337148 29307633
14339 29307633 30272120 30618370 31478947 32781099 33495705 34563540 35365700 36775093 37965050
14330 37965050 39174198 40213305 41554690 43069023 44180773 45860441 47184083 49185459
14322 49185459 50976156 52448922 54170243 56234452 58246538 60443197 62756478 64818853
14314F4818853L114051K400163L030304K638179L367966L607140L419628M020225
14306I0416509L934720M292535M600252M900947N291520N512221N745320O334935
14298A31028959O654724O923144P468526Q246118Q638247Q954782J0151855J0261640
14290A98327995J1060258J1537688J2216426J2729675J3671397J3959743J4560753
14283B88063935J5011589J5141279J5842637J5726312J5745074J5197621J4968040
14276C95696487J3975842J2390767J0837013Q646762N287967K209192O81628j229183
14268D48496475o443660n262521n272647r490555j1139853j3585815j5043271
14261C82258153j5519229j6166218j6233305j6072928j6019428j5454779j4768967
$$ plain form
14314 64818853 67932904 70333067 73363371 76001550 79369516 82976656 86396284 90416509
14306 90416509 94351229 98643764 103244016 108144963 113436483 118948704 124694024 131028959
14298 131028959 137683683 144606827 152075353 160321471 168959718 177914500 188066355 198327995
14290 198327995 209388253 220925941 233142367 245872042 259543439 273503182 288063935
14283 288063935 303075524 318216803 334059440 349785752 365530826 380728447 395696487
14276 395696487 409672329 422063096 432900109 441546871 446834838 449044030 449725658 448496475
14268 448496475 442052815 436790294 431517647 422027092 410887239 397301424 382258153
14261 382258153 366738924 350572706 334339401 318266473 302247045 286792266 272023299
14254B72023299j4741373j3385241j3217924j2612090j1815253j0490218q908585
14247A86852615r907952r553251q650807p696536p808250p272484o318693o398500
14239A23246142n686051n165116m855442n279562m549401m475722l689361l597957
14231H5947530l512773l605189l002851k769125l355917k508421k624253k402193
14223F2166808k270028k250480j731558k055568j811911j343572k313028j572536
14215D6818127j116648j649535j334945j094523j755698j055784j203592p85388
14207C6822014p39087j050180j341580q62976j169539r47664o06086l61624r19677
14198B8823601r84294j011333m46822n66350o64004q04564q80602N491j035952
$$ plain form
14254 272023299 257281926 243896685 230678761 218066671 206251418 195761200 186852615
14247 186852615 176944663 167391412 158740605 151044069 143235819 135963335 129644642 123246142
14239 123246142 117560091 112394975 107539533 102259971 97710570 93234848 89545487 85947530
14231 85947530 82434757 78829568 75826717 73057592 69701675 67193254 64569001 62166808
14223 62166808 59896780 57646300 55914742 53859174 52047263 50703691 48390663 46818127
14215 46818127 45701479 44051944 42716999 41622476 39866778 38810994 37607402 36822014
14207 36822014 36082927 35032747 33691167 32828191 31658652 30710988 30104902 29743278 28823601
14198 28823601 27839307 26827974 26381152 25814802 25150798 24346234 23465632 23471123 22435171
14189B2435171k86319m72949r23357o1282p28729p02960n0050n29759m99672L3381
14179A8213475q34333J63343o77852k85594l40224j99041m60384j90584k84304
14170A5104502n22454n9602k81661j56492j55818m01845m97107l57918J25961
14161A2797566l28447j46049k52061j55921j94529m30794j7391k34348j21426
14152A0916600k44861q5220o7160n47611k99009M84179l04438l05121r8044k25355
14142I223960l2960j09572j63761j93234l08590J63612l29682j68651j42047J05382
14132H044457o9349j03269m8891l43599j77512M1196j32006k73063j60028L35599
14122G113535m94041Q7690k01586j43397L50406l03615j40047q9266n59705M40144
$$ plain form
14189 22435171 22148852 21675903 20752546 20691264 19962535 19259575 19209525 18679766 18180094 18213475
14179 18213475 17379142 17542485 16864633 16579039 16238815 16039774 15579390 15388806 15104502
14170 15104502 14582048 14522446 14240785 14084293 13928475 13526630 13029523 12671605 12797566
14161 12797566 12469119 12323070 12071009 11915088 11720559 11289765 11272374 11038026 10916600
14152 10916600 10671739 10586519 10519359 9971748 9672739 10156918 9852480 9547359 9449315 9223960
14142 9223960 9191000 9081428 8917667 8724433 8415843 8579455 8249773 8081122 7939075 8044457
14132 8044457 7975108 7871839 7822948 7479349 7301837 7343033 7211027 6937964 6777936 7113535
14122 7113535 6619494 6707184 6505598 6362201 6712607 6408992 6268945 6179679 5619974 6060118
14112F060118l16641J17544o5671j34829P7287n20592L05434P1270p1673k65899
14102E256348L0347l781j67243l84364J38278K4967J24149k65816n7318q2405
14092D613162Q9437J6660l63415j4940K9994K44242p0644l99584J65023L8176
14082D348111k07761L86061l43009k86348q5635L7636Q9381J57381j83597q6465
14072C825755k27669k011J02344J17780l40415r33o8622P927k46778M16428m3044
14061C540762P6305j72511k43407L64156l2410k36285o589j68862J70020j35097
14051C156082l51237K64029j85584j63397K87778j39002l77081L54986j10625
14042B735949k06810N6971K20580j28334J33934k75013J08860L92990n59313k4640
$$ plain form
14112 6060118 5743477 5861021 5795350 5660521 5737808 5217216 5522650 5593920 5522247 5256348
14102 5256348 5286695 5282914 5115671 4731307 4869585 4894552 5018701 4752885 4695567 4613162
14092 4613162 4702599 4719259 4355844 4340904 4370898 4615140 4544496 4144912 4309935 4348111
14082 4348111 4140350 4526411 4183402 3897054 3811419 3849055 3938436 4095817 3912220 3825755
14072 3825755 3598086 3596075 3698419 3816199 3475784 3474851 3406229 3414156 3167378 3583806 3540762
14061 3540762 3617067 3444556 3201149 3565305 3532895 3296610 3290021 3121159 3291179 3156082
14051 3156082 2804845 3068874 2883290 2719893 3007671 2868669 2491588 2846574 2735949
14042 2735949 2529139 2586110 2806690 2678356 2812290 2537277 2646137 3039127 2479814 2455174
14032B455174J12528k97950P48780k62361j18308j69630k54832J81378l607O1909
14022B453081l08516j7432J80748L13956n46156J01836L5635j1055k37057N3302
14012B018342O5393J83370l05548K53321k1124m05239M08656l44485M1508J09937
14002B004131j61495L68043k53134R8906r4548O0390j30216m9016Q6014l1552
13992A897523j24286L89430R8308Q71615J521699N290362J5917841J6509259j7545183
13983B4826568j1960223n048444k417487j254077n62695k75156m60270j10460
13975B737756j50772l98014Q6820J94655l10902o2681P7103p1016k48531J96795
13965B051213N2096o12335O25539k42396j58212P4021J15354k71449M24680p6532
$$ plain form
14032 2455174 2567702 2269752 3018532 2756171 2637863 2468233 2213401 2394779 2391172 2453081
14022 2453081 2144565 2127133 2307881 2621837 2075681 2177517 2213152 2202097 1965040 2018342
14012 2018342 2083735 2267105 1961557 2214878 2193754 1788515 2197171 1852686 1894194 2004131
14002 2004131 1842636 2210679 1957545 2056451 1961903 2022293 1892077 1843061 1929075 1897523
13992 1897523 1773237 2162667 2260975 3132590 4654289 9944651 25862492 42371751 24826568
13983 24826568 12866345 7817901 5400414 4146337 3583642 3308486 2848216 2737756
13975 2737756 2586984 2188970 2275790 2470445 2159543 2096862 2173965 2102949 1854418 2051213
13965 2051213 2103309 1490974 2116513 1874117 1715905 1789926 1905280 1633831 2058511 1981979
13955A981979p52m9522l29543J21129p7527J44013q1457j86762K23022l09180
13945A435400K68700l10134K5357M9276k15045J93777p0746r0134J14474K6405
13935A427330K63430j18823J74187k32146o1501j10426l87132P02172n40737K5647
13925A142001L11918j9212k48464N8082L70936m79831L30571k19294Q2372n8063
13915A271016k5033K85592l43396o1216L02785j39904q0603J88706k66367j21675
13905A009905K01475l2605Q5197q1620o3460k90908K14591j53918J71083L12442
13895A372182k96631J47299Q7616k82506K089L7642K03151j64238o7668l12477
13885G26459L65860k18872R664L64127k69758L15001l09707o9359M4060o222M043
$$ plain form
13955 1981979 1981227 1931705 1602162 1723291 1645764 1789777 1708320 1521558 1744580 1435400
13945 1435400 1704100 1393966 1419323 1468599 1253554 1447331 1376585 1286451 1400925 1427330
13935 1427330 1690760 1571937 1746124 1513978 1452477 1342051 954919 1657091 1116354 1142001
13925 1142001 1453919 1434707 1186243 1244325 1615261 1135430 1466001 1246707 1329079 1271016
13915 1271016 1245983 1531575 1188179 1126963 1429748 1289844 1209241 1397947 1131580 1009905
13905 1009905 1211380 1178775 1263972 1182352 1118892 827984 1042575 888657 1059740 1372182
13895 1372182 1075551 1222850 1310466 1027960 1030049 1067691 1270842 1106604 1038936 726459
13885 726459 1092319 873447 883111 1247238 977480 1292481 982774 913415 957475 951253 955296
13874I55296m8392L05362k64785K85496l45646j04093K79040j47932L87100l99768
13864I01678Q5583q9623N3980p4746k3080J21728j10430k19508L0736J07611J91056
13853I74985j45214j66466K03496J50119j39208j83310L64201m34685K92405l65058
13843E51265P906L23108j68632j99724K53500K38953m09696J27252N0230n0139
13833G24023K35175k96666J54496k27813P705K98570O2424D00207K48691j63504
13823D85394M13509j73125R037j47837L74309k28175M53205n90953K07321l90533
13813D12152L37786Q6562k29743l0080k21246L37907o8722Q2906p0406Q5324K5108
13802G47548o5808L48167m56320J61498j89185R1849N5064J48436k61731L13699
$$ plain form
13874 955296 906904 1212266 947481 1232977 887331 783238 1062278 914346 1301446 901678
13864 901678 987261 897638 951618 876872 853792 975520 865090 645582 676318 783929 974985
13853 974985 829771 663305 866801 1016920 877712 694402 1058603 623918 916323 551265
13843 551265 559171 882279 713647 513923 767423 1006376 596680 723932 774162 724023
13833 724023 959198 662532 817028 589215 596920 895490 957914 400207 648898 485394
13823 485394 898903 725778 734815 586978 961287 733112 1186317 595364 802685 412152
13813 412152 749938 836500 606757 576677 355431 693338 624616 707522 637116 722440 747548
13802 747548 681740 1029907 573587 735085 545900 637749 692813 841249 579518 893217
13792H93217l43545J49693R4527k8757o2163k23746L09077l37058L49334l39350
13782D61229N35816j69280j10545j10662O4020K5464k08968O5600j3528J14094
13772F53240O5356B61766P28139l97471M622J81277L9739C41943L48735C04843
13761D22914K05466j93865L5333l5775J14014J85104k91243M56855j07045M3731
13751H35489l25610K595K13598k42987J31716j24225O2208k23096K15968R7406
13741F43062k54757K71348A75167J79367J88641j00181j00020n4894L36896k18324
13731D06652L39822k22360j16133P1272J06769k49375K23856N5385P3969k79849
13721D10008j42359L78653k33032J53802k75835P2285J4835q2820K45040j8580
$$ plain form
13792 893217 549672 699365 793892 765135 702972 479226 788303 451245 800579 461229
13782 461229 997045 827765 717220 606558 670578 696042 487074 552674 539146 653240
13772 653240 718596 261766 989905 592434 597056 778333 818072 341943 690678 304843
13761 422914 628380 434515 469848 434073 548087 733191 441948 898803 791758 835489
13751 835489 509879 512474 726072 483085 614801 490576 552784 329688 545656 643062
13741 643062 388305 659653 175167 354534 543175 442994 342974 288080 624976 406652
13731 406652 746474 524114 407981 479253 586022 336647 560503 615888 689857 410008
13721 410008 267649 646302 413270 567072 291237 363522 378357 295537 540577 521997
13711E21997k4887J24466k07913B03827L62858k14641j73202M35120A67186O2460
13701B29646O5112J66238n5870J14240R6876j70778Q9465J35112k40329P0425
13691E00137A00614L32029M11343k24105e1351A88826K0532O3858J10170J74492
13681E57878m2922B12248J01354J4562J83259A64630j5133B5986L72684o6108
13671C32562L5626j69282J69533H3953L79558J6538j74249K22608A50638m7049
13661A03589M37274j51777j69104L35964J5664j80260J37092O7838B6897R0829
13651A17726K06782M6294M27558l40268j20548J98559B36389k783J39408j59375
13641B13639J11540J99917I6968L32752K86289R1536A47269O0528K00257O9609
$$ plain form
13711 521997 497110 621576 413663 203827 566685 352044 178842 613962 167186 229646
13701 229646 294758 460996 405126 519366 616242 445464 534929 670041 429712 500137
13691 500137 100614 432643 843986 619881 -51351 188826 209358 273216 383386 557878
13681 557878 514956 212248 313602 328164 511423 164630 149497 25986 398670 332562
13671 332562 368188 198906 368439 83953 463511 480049 305800 528408 150638 103589
13661 103589 540863 389086 219982 555946 571610 391350 528442 596280 26897 117726
13651 117726 324508 370802 798360 458092 337544 536103 236389 233606 373014 213639
13641 213639 325179 525096 96968 429720 716009 807545 147269 207797 408054 477663
13631D77663H7185K41365m2210e973C61581n5304J04143P469q1655A53577K38514
13620C92091L4337I2818K28807I8825L5147L2540L42666A07721J29355J84121
13610D21197D4036M4057A0112J50551K75387O066n5769j04123Q8631o9651j46711
13599A54493c9940D73808B35109K08891B06285r9178A3378L18535K60628B45572
13588B43666q1671L84869j93943J22306L3867r3599A41075K19680c5283B67108
13577B82393L5824J59236j76576A17864M18114B61433O6160r5176K1515J66276
13567D20208I4642J43974J75932J71517n1598A94123N1717j22897J02460a6564
13556E4541L31349A51598K23708j10757C9889O34302G6196Q8734J2452O1600h4135
$$ plain form
13631 477663 87185 328550 286340 -5973 361581 306277 410420 417889 336234 153577 392091
13620 392091 426428 92818 321625 98825 133972 166512 509178 107721 237076 421197
13610 421197 44036 88093 10112 160663 436050 442116 386347 282224 370855 301204 154493
13599 154493 -39940 473808 235109 444000 206285 107107 13378 331913 592541 245572
13588 243666 161995 546864 352921 475227 509094 415495 141075 360755 -35283 267108
13577 282393 318217 477453 300877 117864 535978 261433 327593 232417 253932 420208
13567 420208 94642 238616 414548 586065 534467 194123 245840 122943 225403 -16564
13556 54541 385890 151598 375306 264549 39889 674191 76196 164930 177382 238982 -84135
13544C88754A37040o530o0060j214L52169A87298B698M11709A96898J34328j16188
13533B15038K44262a7489B78184j24608J67647P8834r9450n8852r9445L61670
13523E03980A82079G7277Q5830k4719L42021H1391J21902d9555A86970J99417
13513C86387j34435o5451P8167F8223Q5967K4841f6250C23311j49142L268O5446
13502B42883O4837k089A36826L32387A81852a682B02479r6480e5591C41564b9224
13490i4881A58163N7754p0314j796A9408k453K9245J24034N5541g0752D2213L16429
13478C58642M0804A56929a1036F3478J73879J12065l5202A40687N4840d8750E44041
13466A37848R0779r1792J2958o6669J236K22K05416O4067A22063C6390M48478
$$ plain form
13544 388754 137040 130510 70450 69236 421405 187298 2698 414407 196898 331226 215038
13533 215038 459300 -17489 278184 153576 321223 400057 300607 241755 142310 503980
13523 503980 182079 77277 163107 138388 480409 81391 203293 -49555 186970 386387
13513 386387 251952 186501 264668 68223 154190 179031 -66250 323311 174169 177437 242883
13502 242883 307720 305631 136826 469213 181852 -1682 202479 105999 -55591 341564 -29224
13490 -94881 158163 215917 145603 143807 19408 16955 46200 170234 225775 -70752 42213 358642
13478 358642 399446 156929 -11036 63478 237357 349422 314220 140687 195527 -48750 544041
13466 137848 228627 136835 149793 83124 84360 84582 289998 354065 122063 36390 484868
13455D84868j77607B2559J87409Q2358A17230J20166o0932b24651B6598N1479
13445G8077a89105F43239A17587J10793J28708C2173J27605J24526A1922L42474
13435C54396a15282E6318K42546J62085j33341f5425B47640D9674J32646J73190
13425C55510j12607j02657l0148a51189B64666J34267J3074B223O7914g5580A00989
13413i9036C43400j50068K55802D2870a44483O4821C854a32432A17009J56648
13403B73657b2363A33460g9087A56700p3410k348e9208J2252A39905J48607b08569
13391C89720K82770A50352P4518a86073d307k8621B67895D2163K20154g5270g32
13379D0389K39934m1664j17108m8785j5143M1532J94701A02707n66H649N81199
$$ plain form
13455 484868 307261 22559 209968 292326 117230 237396 176464 -224651 26598 78077
13445 78077 -189105 643239 117587 228380 357088 32173 159778 284304 11922 354396
13435 354396 -115282 56318 298864 460949 327608 -65425 247640 49674 182320 355510
13425 355510 242903 140246 110098 -151189 264666 398933 412007 2223 70137 -75580 100989
13413 -99036 343400 193332 449134 42870 -144483 -79662 3854 -132432 117009 273657
13403 273657 -22363 133460 -79087 156700 83290 80942 -59208 -46956 139905 288512 -208569
13391 389720 672490 150352 224870 -186073 -4307 -32928 267895 42163 262317 -75270 -732
13379 40389 280323 238659 121551 72766 57623 99155 293856 102707 102141 8649 589848
13368E89848r8309e3325A88750P8861l8520g7961b2136A99535K23160a52557B81507
13356E8714a97977C9025L21253A41471K75025k00607J86101j36835c35856B13338
13345A07177J52483K9984A38784J23343J37926p5800o8215K29946A24438J16471
13335B40909A04391J5139J74421I3363b31201j6593C22689A0433K85962a38853
13324C8068g6369I2311M8237L7569Q1803E5337K11431M4098N573J07636j93209
13313B30866I5980J72750b08599d6450D7556J2321j8962M26045A90570m459j3764
13302A72347l8797K58221j27822p0164J1912K8937E6102J64145a79097A88232
13291C48937F1598B9139K57110E537M92677f0028H0030J80098j6731c2051B1507
$$ plain form
13368 589848 491539 -53325 188750 267611 229091 -77961 -22136 199535 422695 -152557 281507
13356 58714 -197977 39025 360278 141471 416496 215889 401990 265155 -335856 213338
13345 107177 259660 289644 138784 262127 400053 324253 256038 485984 124438 240909
13335 240909 104391 119530 293951 93363 -231201 -247794 322689 10433 296395 -138853
13324 38068 -76369 92311 140548 178117 259920 55337 266768 310866 316439 424075 230866
13313 230866 95980 268730 -208599 -46450 47556 59877 40915 466960 190570 186111 172347
13302 172347 133550 391771 263949 193785 205697 234634 56102 220247 -179097 188232
13291 348937 61598 29139 286249 5537 498214 -60028 80030 260128 243397 -32051 21507
13279E1680a78586c394A03733b73005g9578G5243a50373B34006j7088a94310B38732
13267C78077j51762c2578C16024J30062b18815a09050C40398E8482i7046A05810
13256B40172H4072a90088P191B40950j16792c6809A35563D3804i133A87650b68353
13244B62360g8880B57104J32692b6159B31046A3189M91229D7830F184L40564j20092
13233B26656a30199C93787a54044N9963H259K01229c1191l3506F427a39426B9721
13221A42108b9742A62869J47812j47779a70723B49028i6640L1019D18120G3645
13210c8732j45481B58760c43734C723K2660M193a17590J6322A97209m7790E1268
13198A35534D2018o161L2674K67796r8255B6645R3114Q854M1041J8564L0062a44431
$$ plain form
13279 51680 -178586 -3394 103733 -273005 -79578 75243 -150373 234006 216918 -194310 238732
13267 378077 226315 -32578 316024 446086 -218815 -109050 340398 58482 -97046 105810
13256 240172 84072 -190088 -182897 240950 124158 -36809 135563 43804 -9133 187650 -268353
13244 262360 -78880 257104 389796 -26159 231046 13189 504418 47830 6184 346748 226656
13233 226656 -130199 393787 -154044 -94081 8259 209488 -31191 -64697 6427 -139426 29721
13221 142108 -29742 162869 310681 162902 -170723 249028 -96640 -65621 418120 73645
13210 -38732 -184213 258760 -343734 3723 26383 30576 -117590 -101268 197209 149419 51268
13198 135534 42018 35857 68531 336327 238072 26645 119759 128613 169654 188218 218280 -144431
13185A63244J2970E0175J22717a59502b3512B45287d07653J97447B08974L9860
13175B48834B3837f320k5633B51606n4965m834g344l917B40833B5215O0826K62780
13163C48821R1813A85521J25619G6171J69282d14255e2610D67365c79009A93945
13152A66492a44745D58172A60215o8571j4249h7558L4717E4814J22859C0542f8038
13140B37878b4389j15170C7104M1107K93193j80267H0722C1039d7567j06246A28177
13128A2788K00444a31034k03155A33420m956Q2834L5604p5116g4342D93223b8144
13116a89973Q5293B30322D4217a60229A09092b90329Q4335c6194o8464J2323A20681
13104H8637e2565G9672L07602j53428B5590B028b01915H2335g0825o2495A90129
$$ plain form
13185 163244 176214 50175 172892 -159502 -23512 245287 -407653 -210206 208974 248834
13175 248834 23837 -6320 -31953 251606 196641 191807 -7344 -11261 240833 25215 86041 348821
13163 348821 440634 185521 311140 76171 245453 -414255 -52610 467365 -379009 193945
13152 166492 -144745 458172 160215 91644 77395 -87558 -52841 54814 177673 30542 -68038
13140 237878 -24389 -139559 37104 78211 371404 191137 80722 31039 -47567 -153813 128177
13128 12788 213232 -131034 -334189 133420 128464 211298 246902 171786 -74342 493223 -28144
13116 -189973 -104680 230322 44217 -160229 109092 -290329 -205994 -36194 -104658 -92335 120681
13104 88637 -52565 79672 387274 233846 25590 2028 -201915 82335 -70825 -133320 190129
13092B59547a19791k7317C06314a65454B1276J14888P9821b82729D39398a02978
13081e4875J5318A30493b06810c2912l30716A16515f7415A32372b06881C08850
13070B34802j7089G2515B1240c8672J4073A54695k5414a3753l12559D8988b3450
13058B1991K33581L18599a40385d5095E5121b1933j2271A67034a04181B90754
13047a86287g0017I7761a37428F7584Q0714e2299A97801J12084b8778C8818a2203
13035B59054h5505B60695a01719o1771B87459H3756K48384j62144C0509J01946
13025A32455D1571K04610L7561J82815E6313K7423B1990K37166r0510P983c1087
13013A00425l8994L2497K69601L5274b7321k16294A67951b4306j17402A92246
$$ plain form
13092 259547 -119791 -147108 306314 -165454 21276 136164 215985 -282729 439398 -102978
13081 -54875 -39557 130493 -206810 -32912 -363628 116515 -67415 132372 -206881 308850
13070 234802 217713 72515 21240 -38672 -24599 154695 129281 -13753 -326312 48988 -23450
13058 21991 255572 574171 -140385 -45095 55121 -21933 -34204 167034 -104181 290754
13047 -186287 -70017 97761 -137428 67584 148298 -52299 197801 309885 -28778 38818 -12203
13035 259054 -85505 260695 -101719 -163490 287459 83756 332140 169996 30509 132455
13025 132455 41571 246181 283742 466557 56313 83736 21990 259156 168646 176629 -31087
13013 100425 61431 93928 363529 398803 -27321 -243615 167951 -24306 -141708 192246
13002A76117b49659B5908J12910Q9927N8880b20216r798B83232a7261A59187A8679
12990a98050G5418J54698m5300b7878B05878G356a91533B11291a83441e8543j34543
12979a93086a1627B04228f5664q0206O1677b5494B89769a01144A95815B4895j0151
12968A4744L8695L9991O615b21142C43223A13321c52842a00433A55661h9165o664
12957i5829I4623K1111O3080i0762C96120a58431b4486A44169a16039i687A08680
12945d7248A52782a98921A91676J61759j37780h2780A59124E1975H165N1062d6572
12933a12609B97447g1894c5666H5847f9267J9425k1562o9281e5086l4027A6679
12921B81198I6988j491c2160A27632d6014A01916a70004G8176L3629c48001h0233
$$ plain form
13002 176117 -249659 25908 138818 228745 287625 -220216 -230014 283232 -17261 159187 18679
12990 -198050 75418 230116 184816 -27878 205878 7356 -191533 211291 -183441 -58543 -193086
12979 -193086 -11627 204228 -65664 -145870 -84193 -25494 289769 -101144 195815 24895 14744
12968 14744 53439 93430 100045 -221142 343223 113321 -352842 -100433 155661 -89165 -95829
12957 -95829 94623 115734 178814 -90762 396120 -158431 -24486 144169 -116039 -9687 108680
12945 -47248 152782 -198921 191676 353435 215655 -82780 159124 51975 8165 59227 -46572
12933 -112609 297447 -71894 -35666 85847 -69267 -49842 -71404 -140685 -55086 -89113 16679
12921 281198 96988 95497 -32160 127632 -46014 101916 -170004 78176 111805 -348001 -80233
12909A79994r29f6554A38790a13994D7193a91619M2089a291l2945I8219N0949
12898A49168f6060p1012b6547j52657F8649a86076Q5182a2689B50246e1694A5342
12886B44664r2619Q2855a106C46554A23195b5328B30721o117b00879J0456B54371
12874A3509J71427E6833J16501f446A1805a25121C6009J27605h0093j1983j4897
12863a06973C65985A49934L0176G2679Q6331a85447q6313A23645J03034H1356
12852f8171A26612c085j39142A23803g4995L2440j49221d6058i076k53346g3856
12840A29544a19497D3371P4897e30C7545b61601K6062l8730A17447a87874N9335
12829a28539k3395A48638J18799h4607C6730O8941C1329a85975I2232N2770O7316
$$ plain form
12909 179994 179065 -66554 138790 -113994 47193 -191619 -149530 -1291 -34236 98219 149168
12898 149168 -66060 -137072 -26547 -179204 68649 -186076 -100894 -12689 250246 -51694 15342
12886 244664 152045 234900 -1106 346554 123195 -25328 230721 224604 -200879 -190423 254371
12874 13509 184936 56833 173334 -6446 11805 -125121 36009 163614 -80093 -92076 -106973
12863 -106973 365985 149934 180110 72679 159010 -185447 -271760 123645 226679 81356
12852 -68171 126612 -3085 -142227 123803 -74995 -42555 -191776 -46058 -9076 -262422 -73856
12840 129544 -119497 43371 118268 -530 37545 -261601 -235539 -274269 117447 -187874 -128539
12829 -128539 -151934 148638 267437 -84607 36730 105671 31329 -185975 92232 145002 212318
12818B12318d9899K4449A57907E6626b01885i1139L1058j00886A37524J71944
12808C09468c24248C9505J11432B9100A444a19951A32701n6702M7344a36816A40772
12796i6882k39020A0606R337b03118M7342p6320a12076j56094f1702l9879A43520
12784a10620a0328B115d4645k64959D6060L18694m6758a517n1735j09016l0418
12773a92686L8458B48263c1875n9641L9750J0645l0405j32316A8311e5679A6070
12761f1167B86332a25437C36020A04768R922B749a47959j9911A3377M954p639
12750A0692a87678k6680i9208j76323C06014d056I6515O4847b15725A91763F0134
12738a0973C83400b4637D1781h9343L9574E5595c30047j09780f9338D5370L53524
$$ plain form
12818 212318 -49899 -25450 157907 56626 -201885 -91139 -60081 -160967 137524 309468
12808 309468 -324248 39505 150937 29100 1444 -119951 132701 75999 123343 -136816 140772
12796 -96882 -335902 10606 19943 -203118 -155776 -232096 -112076 -268170 -61702 -101581 143520
12784 -110620 -10328 2115 -44645 -309604 46060 364754 317996 -1517 -53252 -162268 -192686
12773 -192686 -154228 248263 -31875 -91516 -51766 -41121 -71526 -203842 18311 -55679 16070
12761 -61167 286332 -125437 336020 104768 114690 2749 -147959 -167870 13377 18331 10692
12750 10692 -187678 -214358 -99208 -275531 306014 -4056 96515 161362 -215725 191763 60134
12738 -10973 383400 -24637 41781 -89343 -49769 55595 -330047 -439827 -69338 45370 398894
12727C98894A6311L36454f839F3572Q8748m6197b92929F5116a8535j53228C03417
12715A16524j4962a81377B06624k4075a43882G0697Q6458o9159h747B7636K90475
12704C18111F5585Q8186c9415M076A6525b59660h9554E8842a70824M8603B29128
12692C1218a07776j25869C0702a63657O3016o937C36905A47040C9236L05504j16929
12681B27811A03875N2961p7098J02281L09310B6766i0937D60424r4295g0980A72815
12669G7443m382Q9542k1822i2749A26792L6320F3463R6691E6872Q0315K1463d8058
12656f2277A21531J62197b02349B16544q2821L9727q1591a80896K121B05390c6277
12644A79988H0854J91978G1109k3674J35885a92474A55934d4995I0785a29217
$$ plain form
12727 398894 16311 352765 -6839 63572 152320 106123 -292929 65116 -18535 -171763 303417
12715 116524 101562 -181377 206624 182549 -143882 70697 157155 87996 -8747 27636 318111
12704 318111 65585 153771 -39415 -35339 16525 -259660 -89554 58842 -170824 -122221 229128
12692 31218 -107776 -233645 30702 -163657 -100641 -107578 336905 147040 39236 344740 227811
12681 227811 103875 156836 79738 182019 491329 26766 -90937 460424 366129 -70980 172815
12669 77443 73061 162603 140781 -92749 126792 163112 63463 160154 56872 137187 158650 -48058
12656 -62277 121531 283728 -202349 216544 133723 173450 91859 -180896 -178775 205390 -36277
12644 179988 80854 272832 71109 47435 183320 -192474 155934 -44995 90785 -129217
12633C71878j55045L8107A17850K70537r9252i9506E8955c4101A94304f4571B19932
12621A77797a26664B29192b08916B53062j3253H4086a25621D3747O9815O1248
12611A74810F7997M8883F691P4087L71498j75307b22869C52543m6530b00193Q9535
12600a10658k5630h400A92731M6072A05615a91237C10796a50696G3355d233j15669
12589a19902A08100c8458A37563b85824a3282j03428D9528K02404j4175b08490
12578a69995J2507c2141n216j15981B54J52949b23855B34758I7909N8112g2040
12566c22115B22544M5388a15879o8534B3804h7745b6579p2685A2259J11697J58314
12555B82270A03102D1185b2783r9468f120A32147k0153a99587Q6537k77128e7251
$$ plain form
12633 371878 216833 254940 117850 388387 289135 -99506 58955 -34101 194304 -64571 219932
12621 177797 -126664 229192 -208916 253062 239809 84086 -125621 43747 113562 174810
12611 174810 67997 116880 6691 80778 452276 276969 -222869 352543 306013 -200193 -110658
12600 -110658 -136288 -8400 192731 238803 105615 -191237 310796 -150696 73355 -4233 -119902
12589 -119902 108100 -38458 137563 -285824 -13282 -116710 49528 251932 237757 -208490
12578 -169995 -157488 -32141 -37357 -153338 254 153203 -223855 234758 97909 156021 -72040
12566 -322115 222544 267932 -115879 -184413 23804 -87745 -26579 -99264 12259 123956 282270
12555 282270 103102 41185 -22783 -122251 -6120 132147 111994 -199587 -113050 -390178 -57251
12543c7520j4252j79982G7932C5001h5192k5023O675L1679C47852A01178a09916
12531g3423D09270G2510O9856a67935O8473b3123l4260q8136D3173a81038e1662
12519a17836c176j08939A37120K7315n8558h8404J6700p5394B2750a36870G289
12507G0201R9336b80373A86375p4600O2795a02000b7384A34170A776d28986D2789
12495a90024A37539M1421q1383K4750m9072M5550b25459J02746H6791l7709o192
12484D2890J17251a45973C13220G5169b42923F3617K5907a04272C19911g7095
12473A3309M02068r7614a34713A00488f1223k38937j1173k9830h6906I8574d46854
12461a46404H630J53681A9656h3476P461F1200k8081J9796b34045C21017a9904
$$ plain form
12543 -37520 -51772 -231754 77932 35001 -85192 -110215 -103540 -71861 347852 101178 -109916
12531 -73423 409270 72510 142366 -167935 -99462 -23123 -57383 -145519 43173 -181038 -51662
12519 -117836 -3176 -112115 137120 164435 105877 -88404 -71704 -147098 22750 -136870 7289
12507 70201 169537 -280373 186375 111775 174570 -102000 -27384 134170 1776 -428986 42789
12495 -190024 137539 178960 97577 122327 73255 118805 -225459 -122713 86791 49082 42890
12484 42890 160141 -145973 313220 75169 -242923 63617 89524 -104272 319911 -77095
12473 13309 415377 317763 -134713 100488 -61223 -300160 -311333 -341163 -86906 98574 -446854
12461 -146404 8630 162311 19656 -83476 -76015 61200 33119 52915 -234045 321017 -19904
12449i1757B76725n2496D5182J41474f3609A51439F8698F255a72279j51901E3714
12437E6895I516K94131R5748a74904G0759b97759J07188J5048c1722D4956a54677
12425d5490k19662j3038M5863a8297D8519c5727E7945K91980b14299H067J04748
12414A12815a62939K1688E4776c22092J44818G9108a09816B56034A16838D0651
12403B52094D4604a69702B14975c0327j6859j58155A46846a26438O2888D6622
12392A57759c97651f8993j87727P5428A65775J75690j19225b00897D0597L10806
12382C51403A46902F8339k1532c5917A60568J23781j1546a8052A65632K15769
12372C81401C5831J99301A553N03552a9670H9679l1671a73429d412j44956p9055
$$ plain form
12449 -91757 276725 224229 45182 186656 -63609 151439 68698 6255 -172279 -324180 53714
12437 56895 9516 303647 399395 -174904 70759 -297759 -190571 -175523 -31722 44956 -154677
12425 -45490 -265152 -278190 -232327 -18297 48519 -35727 57945 349925 -214299 8067 112815
12414 112815 -162939 -141251 54776 -322092 -177274 79108 -109816 256034 116838 40651
12403 252094 44604 -169702 214975 -30327 -47186 -205341 146846 -126438 -63550 46622
12392 157759 -397651 -68993 -256720 -181292 165775 341465 222240 -200897 40597 351403
12382 351403 146902 68339 46807 -35917 160568 284349 272803 -18052 165632 381401
12372 381401 35831 235132 1553 505105 -19670 89679 58008 -173429 -4412 -149368 -228423
12361b28423h5061K8213C0097K519a62051B31615k0432A7369g0097a8977p8011
12350i6988c0229B28652a42328A0427a18339b032p0018L5728A71017e7001p8581
12339a35582A01569M4349a50306p3331a08460J0486C8930K55010a5860o3547A4473
12327C85668a19067C25102a6553E5340J69482J7831J4323a2545A55396M1892L26528
12316E23816k18272A2928a4134m4838D9338L89385A82528J26549c3004D12102
12305d5828C02392b29473e249l08803B94474A20037k8160g6127j45731B3686P623
12294C1309b179A36784K37389a67032B7584R8917m0305j3475o543b7037A87695
12282B82545a83557N745r4248I6903f2028B18845J45586c4165E8693e1326D21702
$$ plain form
12361 -228423 -85061 -56848 30097 32616 -162051 231615 211183 17369 -70097 -18977 -96988
12350 -96988 -30229 228652 -142328 10427 -118339 -2032 -72050 -36322 171017 -57001 -135582
12339 -135582 101569 145918 -150306 -223637 -108460 -97974 38930 293940 -15860 -79407 14473
12327 385668 -119067 325102 -16553 55340 224822 242653 256976 -12545 155396 197288 523816
12316 523816 305544 12928 -14134 -58972 49338 438723 182528 309077 -33004 412102
12305 -45828 302392 -229473 -5249 -314052 294474 120037 91877 -76127 -221858 23686 31309
12294 31309 -2179 136784 374173 -167032 27584 126501 86196 72721 66178 -27037 187695
12282 282545 -183557 -177812 -272060 96903 -62028 218845 364431 -34165 58693 -51326 421702
12270A1112K2321M2713g2694D19148k0628A93813K12378b0127B49351k9488J75077
12259C94940a43792E7880J59069K31192a84249o1742C02122F4600L84611A96440
12248B2814d876D41491A52831J74371f2212A60108a0574k58659a06241n1114K6236
12237a31119A02793C3650a44385N8443B00983f5952C32289k3020r9680b18053
12226a55351J5244B34406J77987M1897G0701O8617J70085d3643b064F8810M36401
12215E05211j29295E717M12673f6627A59045A0966K60337B6471J62247J14230
12205C02948A03064h1773B88104a6224F9513e1112B78516b48353A36422J14186
12195B50608G7147l3421a91360A67072H2316b12787A70289l1401A282e2268A36838
$$ plain form
12270 11112 33433 76146 -72694 419148 398520 193813 406191 -20127 249351 219863 394940
12259 394940 -143792 57880 216949 448141 -184249 -245991 302122 64600 449211 196440
12248 22814 -4876 441491 152831 327202 -62212 160108 -10574 -269233 -106241 -157355 -131119
12237 -131119 102793 33650 -144385 -85942 200983 -65952 332289 309269 209589 -218053
12226 -155351 -140107 234406 412393 454290 70701 139318 309403 -43643 -2064 68810 505211
12215 505211 375916 5717 418390 -66627 159045 10966 271303 26471 188718 302948
12205 302948 103064 -81773 288104 -16224 69513 -51112 278516 -248353 136422 250608
12195 250608 77147 43726 -191360 167072 82316 -212787 170289 138888 1282 -52268 136838
12183A28335K07644e8570C31189i452A24408o1501R3595b6000A72394F2702K15336
12172B78038k6516O6349L0177j59801A7631K88521j5560O3049j66348D2660J46686
12161A89346m3731J845B5426K42079j22450J25273A02913k7729B3461K07926p2940
12150A58447a88571C11825a01D057J24544L7477A5582a02467A87329O1960R8061
12139C47350j21416J62175H133h4236a4476B77159l6014b33719B56515E5809J90087
12128B45896b50668a21990B05240r9060O9876J26377E1023J31516A0435M16182
12118D26617A85003L77786c56428B66300F9036K1857k3294a08014h179B14217
12107A30661c09860P6402A34684j7146K3509E4679a14985j13246C04736E2193
$$ plain form
12183 128335 335979 -58570 331189 -9452 124408 62907 156502 -26000 172394 62702 278038
12172 278038 251522 317871 348048 188247 17631 306152 290592 353641 187293 42660 189346
12161 189346 145615 147460 25426 267505 145055 270328 102913 75184 23461 231387 158447
12150 158447 -188571 311825 -101 4057 128601 166078 15582 -102467 187329 249289 347350
12139 347350 225934 388109 8133 -84236 -14476 277159 241145 -233719 256515 55809 245896
12128 245896 -250668 -121990 205240 106180 176056 302433 51023 182539 10435 426617
12118 426617 185003 562789 -356428 266300 69036 90893 67599 -108014 -8179 214217
12107 130661 -309860 -233458 134684 117538 141047 54679 -114985 -228231 304736 52193
12096D4018e1426A71850d0006C73288A65203c9270E0616A8523a2116B99852A37672
12084H9362g5935D19604b9017A98168b0265D805c1790B11565F6429K08157k6839
12073B47747l5719B4869b5334I6023J07006l6166J91540A4680L47088h2414E62797
12061C45741D6854g4972j37302D8620r284K31975n3724M5362C9964d8113b2306
12049A83549J48407c0728l6814A26336K6854F4212g5667B23768J50162b13468
12038f472j05902b5976D9926b90401J32522Q030A19380E7936F908J63173b8723
12026A13195d996m4941B86995a88667A71479L0818C7585J08853k6423A7483J49951
12015A67434F9219J13695m6661N9051l4086K79677H6564i6549E5399k7219a4277
$$ plain form
12096 44018 -51426 171850 -40006 373288 165203 -39270 50616 18523 -12116 299852 137672
12084 89362 -75935 419604 -29017 198168 -20265 4805 -31790 211565 66429 274586 247747
12073 247747 212028 24869 -25334 96023 203029 166863 358403 14680 361768 -82414 562797
12061 345741 46854 -74972 -212274 48620 39336 271311 217587 262949 39964 -48113 -22306
12049 183549 331956 -30728 -67542 126336 153190 64212 -75667 223768 373930 -213468
12038 -6472 -112374 -25976 49926 -290401 -157879 -149849 119380 57936 6908 170081 -28723
12026 113195 -4996 -49937 286995 -188667 171479 202297 37585 146438 120015 17483 167434
12015 167434 69219 182914 136253 195304 161218 440895 86564 -96549 55399 28180 -14277
12003D6580P9062a46070f2784k4432m0562A93031a69654F4255g903j0816B60689
11991b07817h7317l6760N8730n9001A22847f6072I8158e3352q7106A72786b13114
11979b75744B21709r0532D4293a30129c3282I3362i6528k6664c2498A29808g1100
11967a36202A64768M5218f12j59460c4488j69417A85421a91979K669c2548D4630
11955A73447n4788j3411a02708j95738R781I6633m4640b27798D6556c85163d7918
11943b74774C061b10772f1640g447k72375a30190j9180g716A39232c71866a57937
11931a65073E0090L7242e8750p7757A67126d4708I0508c7951j16879H7651a85454
11919C43674G6020J85453K8558A20583c5059A37506D868f296j9845B36946f6712
$$ plain form
12003 46580 125642 -146070 -62784 -87216 -127778 193031 -169654 64255 -7903 -18719 260689
11991 -207817 -87317 -124077 -65347 -124348 122847 -66072 98158 -53352 -140458 172786 -213114
11979 -275744 221709 131177 44293 -130129 -33282 93362 -96528 -123192 -32498 129808 -71100
11967 -136202 164768 209986 -612 -160072 -34488 -203905 185421 -191979 -189310 -32548 44630
11955 173447 118659 105248 -102708 -298446 -288665 96633 51993 -227798 46556 -385163 -47918
11943 -274774 3061 -210772 -61640 -7447 -279822 -130190 -149370 -7716 139232 -371866 -157937
11931 -165073 50090 87332 -58750 -136507 167126 -44708 90508 -37951 -154830 87651 -185454
11919 343674 76020 261473 290031 120583 -35059 137506 4868 -6296 -26141 236946 -66712
11907E1961d654A33563b34485H5831N2577f3964A06760K2735l9440i1704k7598
11896a19302d4146A07781b16768J4270A01843J19693n4272f2252A26698a49j04962
11885a05111B468g2543B04997I0698a50107c0825k87107g9094B46700a29974o8651
11874a98625A98154b40150l9688G4807j2357a09449J0458j06585H737g3789A24445
11862h2385A07023a74282C3428c79680d948j02919D2572a96217P8350K754M3464
11851g1649A41615K5369A0031K11357e45105A57179a50839A255L57047b16261
11840c07453j6423O5114B394N9723n604J63411B9991A3574K82343b43855i6340
11828F8757J67233F45a05401E4477f6024A669N6364h8428I9194d209k31926A73316
$$ plain form
11907 51961 -4654 133563 -234485 85831 138408 -63964 106760 129495 90055 -91704 -119302
11896 -119302 -44146 107781 -216768 -202498 101843 221536 167264 -62252 126698 -149 -105111
11885 -105111 2468 -72543 204997 90698 -150107 -30825 -317932 -79094 246700 -129974 -198625
11874 -198625 198154 -240150 -279838 74807 62450 -109449 -98991 -205576 8737 -73789 124445
11862 -82385 107023 -174282 33428 -379680 -4948 -107867 42572 -196217 -117867 -115113 -71649
11851 -71649 141615 166984 10031 221388 -545105 157179 -150839 1255 358302 -216261
11840 -307453 -323876 -258762 2394 62117 56513 219924 29991 13574 295917 -243855 -96340
11828 68757 235990 645 -105401 54477 -66024 1669 58033 -88428 99194 -4209 -236135 173316
11815a28861A07352b70839A97511b05101F0631K16173b68223a03639o9093B86599
11804B56584I8503D3489K1263K9315A0073M4346a39741C458J45962F9881k4337
11793D5544d663F6255N1021a69520F8763L4784c48408O7616a06151q3575A59981
11781d18535B38511a02707b4081G642Q8318c99450g9262F9646L6503h8018l8043
11770a26061K2857n69j68723B85439B9023P4221m7890L4579K94438g6298E8259
11758a77629l95518A17794J92552b53716d1668H4737M24099k36165a36928A52799
11747C5930O8727m7556J11818C5906j2714c9832H2582J06255F4124J2954A5825
11735b1925m6353G6077b69175n301f99j67155F2306B1461a58525G0743R6806a78530
$$ plain form
11815 -128861 107352 -270839 197511 -205101 60631 276804 -268223 -103639 -172732 286599
11804 256584 98503 43489 64752 94067 10073 54419 -139741 3458 149420 69881 45544
11793 45544 -4663 66255 117276 -169520 68763 103547 -348408 -280792 -106151 -189726 159981
11781 -418535 238511 -102707 -24081 7642 95960 -399450 -79262 69646 106149 -88018 -126061
11770 -126061 -103204 -103773 -272496 285439 29023 103244 55354 89933 384371 -76298 58259
11758 -177629 -573147 117794 310346 -253716 -41668 84737 508836 272671 -136928 152799
11747 35930 104657 57101 168919 35906 23192 -39832 82582 188837 64124 77078 15825
11735 -21925 -68278 76077 -269175 -274476 -699 -167854 62306 21461 -158525 70743 167549 -178530
11722i5536H7583K98b50048A58434e3775j9089A51807c03941a2649m919A30346
11710b64569F3712B1720a89066A16980O2793a01242A56377d4199j1249j32927
11700a88375E9373O3570k8576N2207i9812K0953c094p2910j0662A03462d515j90714
11688a95229h6823B23015I7507m5808c8888n9955B86242b45691f8391A23466d38248
11676d3370k99901J52645C83441c8938D05056e4938A75450h5270k73609a48012
11665d07870K0908a932E4395d2841q2379e0355B6733a98078D9715a38815o671
11654a45486r422b9650D78911A34381D8657b38193K1525J01276C45423C4328A1974
11642a10364C90278j57451a58968a8447k09681B33404a93549C62945E7292a39617
$$ plain form
11722 -95536 87583 87881 -250048 158434 -53775 -72864 151807 -303941 -12649 -17568 130346
11710 -264569 63712 21720 -189066 116980 179773 -101242 156377 -44199 -55448 -188375
11700 -188375 59373 122943 94367 146574 -99812 -78859 -3094 -76004 -86666 103462 -4515 -195229
11688 -195229 -86823 223015 97507 51699 -38888 -98843 286242 -245691 -68391 123466 -438248
11676 -43370 -343271 -190626 383441 -38938 405056 -54938 175450 -85270 -358879 -148012
11665 -407870 -386962 -1932 54395 -42841 -125220 -50355 26733 -198078 49715 -138815 -145486
11654 -145486 -154908 -29650 478911 134381 48657 -238193 -216668 -115392 345423 34328 11974
11642 -110364 390278 232827 -158968 -18447 -228128 233404 -193549 362945 57292 -139617
11631b51267n6850a47928H3666a5955p6075a9589A58314k4283a08818B09387C7386
11619a85713A58537o232K4004a30700I0432L36c5784r5794j0957E5592J24832
11608A80424C8700a48208k4918g5935j69532J10810j7102A23526a69773e5069
11597H8349h1493C61371A23463g4768k47629A67589d131A08928J6704k3340K62432
11586C64724A78255K4823h1102B37410a02035k2995r9599J08794b7105j6121B79941
11574B48180b41309i6483A44101o3146M4801b00568e9449J3690k28891a16754
11563f4388j17901k293B69323J77298F7736a15718d1868C82037f7072k442j44283
11552b13797Q5693A21147a18286j9168C95075j95626l1385D773f4103q2183B69954
$$ plain form
11631 -251267 -308117 -147928 83666 -15955 -92030 -19589 158314 134031 -108818 209387 37386
11619 -185713 158537 152305 176309 -130700 90432 90768 -35784 -131578 -142535 55592 180424
11608 180424 38700 -148208 -173126 -75935 -245467 -134657 -151759 123526 -169773 -55069
11597 88349 -81493 361371 123463 -74768 -322397 167589 -4131 108928 125632 102292 364724
11586 364724 178255 203078 -81102 237410 -102035 -125030 -224629 -115835 -27105 -43226 279941
11574 248180 -241309 -96483 144101 80955 125756 -200568 -59449 -45759 -274650 -116754
11563 -64388 -182289 -184582 269323 446621 67736 -115718 -41868 382037 -67072 -69514 -213797
11552 -213797 -128104 121147 -118286 -137454 395075 199449 168064 4773 -64103 -146286 269954
11540B70021B4752L44099j63512a09872B00685e6448a4897A45724J3724L16526
11530D75974c0350B73084e535j5449j81033f3215B440K91421A25960E0617a01861
11518A4281J48427A7587c0453A09504g2901A4975a00616B74995k1394H5397A8758
11506B77619f6925A35478K34140j26153a73433c8162A56857N2957i267D5189a1878
11494D87509k18995I1510L50928j27226a30712N7407j16453O2054d1520B59186
11483D7700a5460m959J965j61559B12761K9675h7509j91944J03188m8605C143
11471a38146N1848j66245A98679p599L59339A27404j1990J50187l1063B4801C403
11459B22153r2019O7530J45572I0988J07549c8367A14457J30555a36589D6845
$$ plain form
11540 270021 24752 368851 205339 -109872 200685 -56448 -14897 145724 159448 475974
11530 475974 -30350 273084 -5535 -20984 -202017 -63215 2440 293861 125960 50617 -101861
11518 14281 162708 17587 -30453 109504 -72901 14975 -100616 274995 253601 85397 18758
11506 277619 -66925 135478 369618 243465 -173433 -38162 156857 209814 -9267 45189 -11878
11494 487509 268514 91510 442438 315212 -130712 -73305 -189758 -127704 -41520 259186
11483 47700 -15460 -20419 -18454 -180013 212761 242436 -87509 -279453 -176265 -224870 3143
11471 -138146 -86298 -252543 198679 191080 550419 127404 115414 265601 234538 24801 3403
11459 222153 130134 197664 343236 90988 198537 -38367 114457 245012 -136589 46845
11448i1406E6463B2989g6925J7135A79023J91131A35948n0859a49862n2970b1287
11436C9958c9626B00937g050D3586j9620a88843C32375b10331A37786e5005B55374
11424a57485A37283b74287A30597F3498J6067l8455b2869D9013J10343a52187
11413H163Q2056a50411I6485A0397b23529B3347b24221G0729b57070P5506d6397
11401a33626F6904r734a27152C04278a23857C5565J46874a61363g3372B39038
11390a42063L9895f260j83647A29905a98504L3002F7699B1910b71839g8165A21893
11378B8073J10450c16454E0537c3399A88225h0358C91425A31355l3469i6497I6141
11366A39779b59994q2125a1489m5686A20172c25244c8041A31757a37458A52714
$$ plain form
11448 -91406 56463 22989 -76925 -59790 179023 370154 135948 85089 -149862 -202832 -21287
11436 39958 -39626 200937 -7050 43586 23966 -188843 332375 -210331 137786 -55005 255374
11424 -157485 137283 -274287 130597 63498 79565 41110 -22869 49013 159356 -152187
11413 8163 90219 -150411 96485 10397 -223529 23347 -224221 70729 -257070 -181564 -46397
11401 -133626 66904 57170 -127152 304278 -123857 35565 182439 -161363 -73372 239038
11390 -142063 -102168 -6260 -189907 129905 -198504 -165502 67699 21910 -271839 -78165 121893
11378 28073 138523 -316454 50537 -33399 188225 -80358 391425 131355 97886 -96497 96141
11366 139779 -259994 -342119 -11489 -57175 120172 -325244 -38041 131757 -137458 152714
11355A4114L29711c33548D7584a24133F5916B5179a94299M0287D1138Q1753h4639
11343D6517h2243I7213O2503J24738I7055A6913a4308m9850p3149j15634D0480
11331a93405G6703a66384j05789I5838a93197C0903d2903C8502e7274A9245e0465
11319E8127J57719J1609a1971q7957B99944b45844d9673C90242B8148A3170b01653
11307I2051a70753B21443a256r2204c5291O423H5908e2192j745A36928O5973e9000
11294a96193Q4559c3659C0107e1322J3543A41600j1964a92903B1476h9192K7760
11283f1432p2713B00538C2465a31040q8050H251L6802J9122b22588Q2344H8306
11271a85839P272l5126N6036M9914d6065A41315a4879q9626C9293a10774M649
$$ plain form
11355 14114 343825 -333548 47584 -124133 65916 25179 -194299 -154012 41138 122891 -84639
11343 46517 -82243 97213 159716 284454 97055 16913 -14308 -64158 -137307 -252941 40480
11331 -193405 76703 -166384 -272173 95838 -193197 30903 -42903 38502 -57274 19245 -50465
11319 58127 215846 227455 -11971 -99928 299944 -245844 -49673 390242 28148 13170 -201653
11307 92051 -170753 221443 -1256 -93460 -35291 -28868 85908 -52192 -53937 136928 202901 -59000
11294 -196193 -111634 -33659 30107 -51322 -37779 141600 129636 -192903 21476 -89192 -61432
11283 -61432 -134145 200538 32465 -131040 -219090 8251 45053 64175 -222588 -140244 88306
11271 -185839 -178567 -213693 -157657 -107743 -46065 141315 -14879 -104505 39293 -110774 -106125
11260a06125c4453j58535F0705A6225O3883a03423l3283r5313a01011J5590b9440
11248b39930A72452A3796b50532k01181A96283K7693f9872j4430A22959a77759
11237d6459H657L1181b29780A08442E518J84239b43085f1900r7695F8420Q554
11226G6974a5844l07934F5845K7137D4915b8611j74629K3580A50255e9720k9456
11215h9176k21913a40363A30618b63373j18740c5499j05715d5066l83357b06627
11204B67912b21817Q5804C6552N1187K04005b23059A31723b02358N0201M8993
11194a03164L3096j71148L1571A87980c07204k2941C5033a51218j13317I8419
11183d9416a1082A50646E1937a1491q577B14076b89652A84544A6577a2154m1070
$$ plain form
11260 -106125 -34453 -192988 60705 16225 80108 -103423 -136706 -232019 -101011 -85421 -29440
11248 -239930 172452 13796 -250532 -451713 196283 223976 -69872 -84302 122959 -177759
11237 -46459 8657 39838 -229780 108442 5518 189757 -243085 -61900 -159595 68420 76974
11226 76974 -15844 -323778 65845 92982 44915 -28611 -203240 -179660 150255 -59720 -89176
11215 -89176 -311089 -140363 130618 -263373 -382113 -35499 -141214 -45066 -428423 -206627
11204 267912 -221817 -136013 36552 87739 291744 -223059 131723 -202358 -152157 -103164
11194 -103164 -70068 -241216 -209645 187980 -307204 -330145 35033 -151218 -264535 98419
11183 -49416 -11082 150646 51937 -11491 -20068 214076 -289652 184544 16577 -12154 -53224
11172e3224A48563L0650a49147E182K40869D490c8701k74608d5503j96574K140
11161b39937A728b73365l3207A06159J32609L5813j14288E1641P1744b19960B4308
11149h7384r4185A3177K69184A04514J82865a83704e2714r6958O381j49575O5927
11138b26939N8842A38403L4699b96665a04710m8945A21278f1503C54258i0146
11127a17416o5511A16421d2175A10404K60629b99089D8782N3426Q4527b35683
11116d766C92729a40552B26298R2140d3556C6704B455J79135N9078G0056a12128
11104C6193O9382L28355C3451K16497L0234p9630c6349j32295A41411c9209l29075
11093c68284A64766C3492J77222I9662c86249H5978l599a21532G3210i203B53990
$$ plain form
11172 -53224 148563 179213 -149147 5182 246051 4490 -38701 -313309 -45503 -242077 -239937
11161 -239937 1728 -273365 -306572 106159 238768 274581 160293 51641 123385 -219960 24308
11149 -87384 -181569 13177 282361 104514 287379 -183704 -52714 -149672 -143291 -292866 -226939
11138 -226939 -168097 138403 173102 -296665 -104710 -153655 121278 -61503 354258 -90146
11127 -117416 -182927 116421 -42175 110404 371033 -299089 48782 102208 186735 -235683
11116 -4766 392729 -140552 226298 318438 -43556 36704 2455 181590 240668 70056 -112128
11104 36193 105575 433930 33451 249948 280182 200552 -36349 -168644 141411 -39209 -368284
11093 -368284 164766 33492 210714 99662 -386249 85978 82379 -121532 73210 -9203 253990
11081I4990r036Q5258r876l1031A0171f9569I6108J39116q0850b1133n226A31552
11068B99042n3398L5127J93788A57140O858Q9011J07173G7810J59547L40968O9736
11057F48061k77706M4030j18712J85176A52092K78161A92829M48677o4993j08254
11047D68259P5897K5548j25165L57212j07196k96750J67360k9565N3181J75390
11037G64171j21587K64530m24550K1656k20450L31724j58938K28974Q4609k99130
11027D71009J63638j63880M34057l19395k47709L73393q9346K90232j80193j98908
11017E32898q0520Q7430k64510N5722L52121j41996K05787k69668K889B04022
11006C92640K61008A81668K40655M476Q3534p0913j12922j9259m9517J56100K53147
$$ plain form
11081 94990 85954 171212 161336 130305 10171 -69569 96108 235224 154374 -21133 -26359 131552
11068 299042 245644 280771 474559 157140 163998 253009 360182 77810 237357 578325 648061
11057 648061 370355 414385 295673 480849 152092 430253 192829 641506 576513 468259
11047 468259 544156 569704 444539 801751 694555 397805 565165 535600 588781 764171
11037 764171 642584 907114 482564 504220 283770 615494 456556 685530 770139 471009
11027 471009 634647 470767 904824 585429 337720 711113 621767 911999 731806 532898
11017 532898 452378 539808 275298 331020 683141 541145 746932 477264 480153 204022
11006 392640 653648 181668 422323 426799 510333 439420 326498 307239 257722 413822 666969
10995F66969j64131J17538k96523J73603m486K03763j23028r2773M0629J06082
10985F27643j29425P5731K56360k01491J63631o9330k25241L83287j35172Q0906
10975H26899J34239P1979K23405k43281J10830K78677K27940L82724N3971Q2121
10965B149504K9333J15115k26199K59427j75332k79929k13479m85714K42112J207
10955A416045M3607k00516N74408q12378K24097o0329n21296O16417j11466k97253
10945H71336r6532o5991M6664j16025l05126k7976g2677A2728L19687L3922j97
10934C66140r6233C0027L8360h0733A06387A4293N4492l069M8468a27148A24413
10922a01528M6149C01429H7600J46386D386N1765a16837A14941k5580f3546A27983
$$ plain form
10995 666969 502838 620376 323853 497456 492970 696733 573705 480932 521561 627643
10985 627643 498218 573949 830309 628818 792449 723119 497878 881165 745993 826899
10975 826899 961138 1033117 1256522 1013241 1124071 1402748 1630688 2013412 2067383 2149504
10965 2149504 2178837 2293952 2067753 2327180 2151848 1871919 1658440 1172726 1414838 1416045
10955 1416045 1459652 1259136 1833544 1021166 1245263 1184934 663638 1280055 1168589 871336
10945 871336 774804 708813 755477 639452 334326 306350 -72677 12728 332415 366337 366140
10934 366140 269907 30027 68387 -80733 106387 14293 68785 65716 114184 -127148 124413
10922 -101528 -55379 301429 87600 233986 4386 56151 -116837 114941 89361 -63546 127983
10910A26011l7035P5370a72958A10670f8211j13109O8640q7093j673h1240I8378
10898A0643j969b0250A20338i2287C621J30320a46624a7398j08823A23191b57050
10886a31709I3081J26847h2366B12278D2115a62857A89037d25730c7518k44292
10876b81810a32963C93419c33267C24392h0137k77722A37189D5978N1959B2687
10865I1589l3411J04547a89886d2311A86757a83897B17583b31081i2730k13181
10855c05911a50451j35579c1033E6383g536A254J93782b34821i3432d111D3631
10843b24793N3646k6763L2524b1582j94859f6046n89539a12226m0458B33216b58287
10831G6457f5369k70251J43721B90947F295b04782c4337j06890B16051K8038b3729
$$ plain form
10910 126011 88976 164346 -172958 110670 -68211 -181320 -112680 -199773 -201446 -81240 98378
10898 10643 8674 -20250 120338 -92287 3621 133941 -146624 -17398 -126221 123191 -257050
10886 -131709 93081 219928 -82366 212278 42115 -162857 189037 -425730 -37518 -281810
10876 -281810 -132963 393419 -333267 324392 -80137 -357859 137189 45978 97937 22687
10865 91589 58178 162725 -189886 -42311 186757 -183897 217583 -231081 -92730 -305911
10855 -305911 -150451 -286030 -31033 56383 -7536 1254 195036 -234821 -93432 -4111 43631
10843 -224793 -171147 -197910 -165386 -21582 -216441 -66046 -655585 -112226 -152684 233216 -258287
10831 76457 -65369 -335620 -191899 290947 6295 -204782 -34337 -141227 216051 244089 -23729
10819F0778c0657j16142H3208l8076J12504a15119E4655N4650j648a29719J8940
10808a10779A08909b01138J1265P7099A35926l6574b06813M7709b3572B4214M143
10797B8357J97843d5535A6162k336f8944o2386d8414i620B5828a88992p1035J05095
10785a54932a0907l7523o5324k02276d6529l86174A08665k5394c41899d0620j59115
10774a99735L986k5679H4405K54548G7129L0353C7675b9842k41974f8204j85892
10763b54096k09747a6215j05001j64901a809k20144h8795A14507H946c17513A9050
10751i8406A67159D7517b201j30190R978J4575H5927J31344H7156b8520B31015
10739g8842a964j69485M7771L8259I7651b37555B5685c00522J41622L7542H7936
$$ plain form
10819 60778 -30657 -146799 83208 45132 157636 -115119 54655 109305 107657 -129719 -110779
10808 -110779 108909 -201138 -189873 -112774 135926 99352 -206813 -159104 -23572 24214 28357
10797 28357 226200 -45535 16162 13826 -68944 -131330 -48414 -9620 25828 -188992 -260027 -154932
10785 -154932 -10907 -48430 -113754 -316030 -46529 -432703 108665 83271 -341899 -40620 -199735
10774 -199735 -195749 -221428 84405 338953 77129 107482 37675 -29842 -271816 -68204 -254096
10763 -254096 -463843 -16215 -121216 -286117 -1809 -221953 -88795 114507 8946 -317513 19050
10751 -98406 167159 47517 -2201 -132391 -122413 -107838 85927 217271 87156 -28520 231015
10739 -78842 -1964 -171449 -123678 -85419 97651 -237555 25685 -300522 -158900 -121358 87936
10727a02341A76674b68608C8428g0530B02950c19250A96259b68326I223e9196
10716a54194k61897J77088c382A15733M7812m3287a91821R4670b8587j55539A98437
10704a50355L9383B65954a41393K9446K3056B0886J4748B155Q3389D969e0435
10692b45765r9722a3513j73293A8783L1192c62215g9366c655k12474n4699I1836
10680a85720O36N0378k1693F3853f8925j20015g1742j02578A08368b0891k53615
10669b74506K187g0049k66403a13464K6682j76675J12798A90674r2264K995e0722
10657d8743l6262A46774H889b05999j07975G9497c1726j68867H9695Q178b1459
10645d6693o2065A64554l7218J83211g1469k49465M3626a00472p036n3918b3453
$$ plain form
10727 -102341 176674 -268608 38428 -70530 202950 -319250 196259 -268326 9223 -59196
10716 -154194 -416091 -239003 -3382 115733 163545 120258 -191821 -97151 -28587 -184126 198437
10704 -150355 -110972 265954 -141393 -111947 -88891 20886 35634 2155 85544 4969 -50435
10692 -245765 -345487 -13513 -186806 18783 49975 -362215 -79366 -3655 -216129 -270828 91836
10680 -185720 -185084 -134706 -156399 63853 -68925 -188940 -71742 -174320 108368 -20891 -274506
10669 -274506 -272319 -70049 -336452 -113464 -86782 -263457 -150659 190674 98410 101405 -50722
10657 -48743 -85005 146774 8889 -205999 -313974 79497 -31726 -200593 89695 97873 -21459
10645 -46693 -108758 164554 127336 310547 -71469 -320934 -277308 -100472 -107508 -161426 -23453
10633b05555K0789i95j55560k17992O9997L5972A17023a67142a2189j54176k058
10622a68423K4066L0235j35695A21910J72491d97882A54001m7767a57283B23184
10611e2582Q672A995K20347K0698b01129A4058P5267B3673I444a21563A21661
10599A28701a05712j73918O6926k52664e7980K2570G9411c32834o4645J81411
10589b16068B03752g6765j51899c3939o7637G4773b16578K7393N9952C18816g7386
10577a29421E1553a61396E6176m811L147a99971A7772g7234j62261A07766D4179
10565c60371J48114a02912A01572b23715A18256a34842l8427g2881A8919J08259
10555A27178K18056D4767e0380p7704n2533M0230A32148o0997k5036a67365F2396
$$ plain form
10633 -205555 -184766 -995 -156555 -374547 -304550 -268578 117023 -167142 -12189 -166365 -168423
10622 -168423 -144357 -114122 -249817 121910 294401 -497882 154001 106234 -157283 223184
10611 -52582 -43910 1995 222342 243040 -201129 14058 89325 23673 9444 -121563 121661
10599 128701 -105712 -279630 -212704 -465368 -57980 -35410 79411 -332834 -397479 -216068
10589 -216068 203752 -76765 -228664 -33939 -101576 74773 -216578 -189185 -129233 318816 -77386
10577 -129421 51553 -161396 56176 51365 54512 -199971 17772 -77234 -239495 107766 44179
10565 -360371 -212257 -102912 101572 -223715 118256 -134842 -173269 -72881 18919 127178
10555 127178 345234 44767 -50380 -128084 -180617 -140387 132148 71151 46115 -167365 62396
10543a90730k13682a20129M5469I9581a45667c1422p8732k0424d3697l8823k4024
10532a06544O422p0406r017B22724c11634a29157M8621j7950n46197B9292a53131
10520a54180A48681e6638l3794B7218J60358C5177J6390b15082i129r4852A49979
10508i8589A7466a58789O7837A39856g1457C948i9873j65230a19816F11J24006
10497A24617e92j40764i87A85302J27353b25367E9554b63167O1311A77374n3106
10486A24268D7971J875R4953K33061f1736l21558a34032E0624K57345f0199C05133
10474A99170B479R0295Q2385K4348R9002d0592A98173I7948D6377N0971b54743
10462d07676h4518A6911K89573m1692A9712Q8405K7296b36654B89488A02329D3357
$$ plain form
10543 -190730 -404412 -120129 -74660 99581 -145667 -31422 -110154 -130578 -43697 -82520 -106544
10532 -106544 -100122 -170528 -179545 222724 -311634 -129157 -80536 -98486 -644683 29292 -153131
10520 -154180 148681 -56638 -90432 27218 187576 35177 51567 -215082 -9129 -103981 149979
10508 -98589 17466 -158789 -90952 139856 -71457 3948 -99873 -265103 -119816 611 124617
10497 124617 -592 -141356 -987 185302 312655 -225367 59554 -263167 -201856 177374 124268
10486 124268 47971 49846 144799 377860 -61736 -383294 -134032 50624 307969 -60199 305133
10474 199170 2479 92774 175159 199507 298509 -40592 198173 97948 46377 97348 -254743
10462 -407676 -84518 16911 306484 264792 19712 108117 135413 -236654 289488 102329 43357
10450B31580A3354a77382g0175k98197B43118A496L5180A6674Q6783m9467c62810
10438A60814E80b54129b1847A38093e1042J8685k34155D0517j7095e5940k83367
10427c39307A55204e46246A08915J00883d2619j00494c0154k54305j40716J05136
10417c20039A52383A1796a27642l6229C8846A9400b01774A81175E4534a76856
10406b42464c8828j7279A73954a14388l1381p6971A82230a15540C7340M87625
10396E24965A45346d0199k6894I2625b35907C7840b634C6649J65830J01593H9009
10384C52050a81558R087j70333d4689j47714C28304A04891a3333B98846H7675
10373D49703C9311J32021c4216j17731H3177j021J14530G7628M4202K65820L1646
$$ plain form
10450 231580 13354 -177382 -70175 -368372 243118 1496 36676 16674 103457 53990 -362810
10438 160814 580 -254129 -21847 138093 -51042 -32357 -266512 40517 23422 -55940 -339307
10427 -339307 155204 -546246 108915 209798 -42619 -143113 -30154 -284459 -425175 -320039
10417 -320039 152383 11796 -127642 -163871 38846 19400 -201774 181175 54534 -176856
10406 -242464 -38828 -56107 173954 -114388 -145769 -222740 182230 -115540 37340 524965
10396 524965 145346 -40199 -67093 92625 -235907 37840 -2634 36649 202479 304072 89009
10384 352050 -181558 -172471 -342804 -44689 -192403 328304 104891 -13333 298846 87675
10373 449703 39311 171332 -34216 -151947 83177 82156 196686 77628 121830 387650 419296
10362D19296L42925l50820A78748M1017R0636A11967L9634k7545d9147p4118N5183
10351f8082A86122N7550J0852Q5958r3324j19828M43330k00994a59163B36794
10340C55633M4518A11518J48280O7974b89462D9733K0649b1243B44402M2487A19626
10328B08204d8119q1908j47584e7234B27523m8940K48810j50132J065M7886b4028
10316e599B25050q9141J38172j34166b66371g5577B17650G5104d8034j592j11160
10305a60786Q0203B57871b32532a11979j75674B13131J11380c7082j532j05316
10295a43930L5784j82375j73176c8925j3198j58906b9265k8355j56807B47099
10284A8583Q55N7671J19988f049j06246C5102J10411e4055D82120a57130m4909
$$ plain form
10362 419296 762221 411401 178748 219765 310401 111967 151601 124056 -49147 -123265 -68082
10351 -68082 186122 243672 254524 340482 247158 127330 570660 369666 -159163 236794
10340 355633 400151 111518 259798 327772 -289462 49733 70382 -21243 244402 286889 119626
10328 208204 -48119 -130027 -277611 -57234 227523 178583 427393 277261 278326 326212 -24028
10316 -5599 225050 135909 274081 139915 -266371 -75577 217650 75104 -48034 -49626 -160786
10305 -160786 -80583 257871 -232532 -111979 -287653 213131 324511 -37082 -38614 -143930
10295 -143930 -108146 -290521 -463697 -38925 -52123 -211029 -29265 -57620 -214427 247099
10284 18583 19438 77109 197097 -6049 -112295 35102 145513 -54055 482120 -157130 -202039
10273b02039r6186H0474k7000k5366R9305g9999A04718a19931j72149A01091J9298
10262A20389O7526g042A2036a294B8445a09072a5574j86007E7761L8128J7740
10251A13629l950n2065J58356a4939j19808A07409a15272j57288B5629c01072
10240i7076j21067E9097a91688j11603J18487B26488H0433h8100B31356F660a51393
10228c5274C6212b6669B1581D691K500i1859p9791b7174k67818A34409f4604E2970
10215g4723a8715l4395j53697e4822A88727a34950A32670b814D4438a98353R905
10204a88448A44136a01030l8006J9646H5509b23090f5645B3152a09247A86731
10193a66074a2725D482b23838h6730C0235f0025j43261k4233L9288G718f2942
$$ plain form
10273 -202039 -298225 80474 53474 28108 127413 -79999 104718 -119931 -292080 101091 120389
10262 120389 187915 -7042 12036 -1294 28445 -109072 -15574 -201581 57761 95889 113629
10251 113629 109679 57614 215970 -14939 -134747 107409 -115272 -272560 25629 -301072
10240 -97076 -218143 59097 -191688 -303291 -184804 226488 80433 -88100 231356 6660 -151393
10228 -35274 36212 -26669 21581 4691 7191 -91859 -171650 -27174 -294992 134409 -64604 52970
10215 -74723 -18715 -53110 -206807 -54822 188727 -134950 132670 -2814 44438 -198353 -188448
10204 -188448 144136 -101030 -139036 -119390 85509 -223090 -65645 23152 -109247 186731
10193 -166074 -12725 4482 -223838 -86730 30235 -60025 -203286 -227519 -188231 7718 -62942
10181A36126A69K1352a36269A25859c38586H6618a29116e8302E9059a98331G0477
10169g7342a1578m5178D1704a0446j67346j34429J20047B26888b56874O4528B11265
10157b53979B16341l6667c29837J64461I9476d61257i5751l2440j36025C06935
10146g5795k0177A93278b44905A67308h4999a8974C67027A79295D1182a10649
10135i1328J1365j7891q1704O1362K3000C45656b0694E6204a76243B83574a70605
10123d654o4166a2571o0079A83828b52673A39552n8909B8209a31685b9075m3327
10112g2402H0756O141b10108A2783a11804g833A23929a61565k204A35154j6764
10101A18390e5532c59A41706K8091B2024a84049A35996b07613i2919c4478B21398
$$ plain form
10181 136126 169 21521 -136269 125859 -338586 86618 -129116 -58302 59059 -198331 70477
10169 -77342 -11578 -56756 41704 -10446 -177792 -312221 -192174 226888 -256874 -192346 211265
10157 -253979 216341 179674 -329837 -165376 99476 -461257 -95751 -128191 -264216 306935
10146 -75795 -95972 193278 -244905 167308 -84999 -18974 367027 179295 41182 -110649
10135 -91328 -79963 -97854 -179558 -118196 -95196 345656 -20694 56204 -176243 283574 -170605
10123 -4654 -68820 -12571 -72650 183828 -252673 139552 80643 28209 -131685 -29075 -72402
10112 -72402 80756 86897 -210108 12783 -111804 -7833 123929 -161565 -163769 135154 118390
10101 118390 -55532 -359 141706 169797 22024 -184049 135996 -207613 -92919 -34478 221398
10089a97978G3926a98712M5522B0340H71c3446j50270C43391c13921J5691D20884
10077B47661K8229a43784l5570L1184J7180p6079H8659f9611j8531A9412c23785
10065A19671b6977m35269F1390b41387d4396A60560b13012F3154l741A8813d2948
10053E7821J59157a22307r436E4859J88127n4363e9068E3172a09101a96l05777
10042c05973J15290G5536c53084J24242j9134H640h659l45168J09323A48694F6854
10030h0726B77336E780b0517l89311K0548e331l6107l22299d6719G5734J40355
10019B16089B192a74893N9251G810c75156A28890J60596i5818m5333k95034e7530
10007i3151c3449q8536A6023c1256B03520A4530a88382b0531m13013R2221A72516
$$ plain form
10089 -197978 73926 -198712 -153190 20340 871 -33446 -183716 343391 -313921 -298230 420884
10077 247661 275890 -143784 -179354 -148170 -130990 -207069 88659 -69611 -88142 19412 -323785
10065 119671 -26977 -462246 61390 -241387 -44396 160560 -213012 63154 59413 18813 -42948
10053 57821 216978 -122307 -131743 54859 242986 188623 -59068 53172 -109101 -196 -305973
10042 -305973 -190683 75536 -353084 -228842 -247976 8640 -8659 -353827 -244504 148694 66854
10030 -80726 277336 5780 -20517 -409828 -389280 -5331 -41438 -363737 -46719 75734 216089
10019 216089 2192 -174893 -115642 7810 -375156 128890 289486 -95818 -141151 -436185 -57530
10007 -93151 -33449 -121985 16023 -31256 203520 14530 -188382 -20531 -433544 -341323 172516
9995c01839a07563I137d9329j07903B47291b75754B87264c83066a1383A10948
9984h6527a1240D6984d11235J03095G2647b53396C31922g4298k9897j80140e8271
9972a9395A8023O8916h1395A407b06236K0844M2385N9139J0639A11230N0428a09446
9959a66155j46496a01677D8680b50026B19515d5668k3012g871k58604k0113f3780
9947c22820H4219e9219D1192c2018A96510a95371C011g284j30887B06085c4164
9935A52774a81531m7794M4818I6430J20011b06877Q7519E3567c4563B9247c43474
9923A91694k3870b15575F3979b64847A30885J37547a7225A04671b05620k98338
9913e03958b11597a2111B15835a07626j00118b9704j13648P089c1769A66031a36941
$$ plain form
9995 -301839 -107563 9137 -49329 -157232 247291 -275754 287264 -383066 -11383 110948
9984 -86527 -11240 46984 -411235 -308140 72647 -253396 331922 -74298 -104195 -284335 -58271
9972 -19395 18023 86939 -81395 1407 -206236 -185392 -143007 -83868 -73229 111230 161658 -109446
9959 -166155 -312651 -101677 48680 -250026 219515 -45668 -68680 -7871 -266475 -286588 -63780
9947 -322820 84219 -59219 41192 -32018 196510 -195371 3011 -7284 -138171 206085 -34164
9935 152774 -181531 -229325 -184507 96430 216441 -206877 -119358 53567 -34563 29247 -343474
9923 191694 167824 -215575 63979 -264847 130885 268432 -17225 104671 -205620 -503958
9913 -503958 -211597 -12111 215835 -107626 -207744 -29704 -143352 -136263 -31769 166031 -136941
9901e1493B38541a72600o9194a6380A43444b13426B3884d3606f693j07735A69859
9889A67159f04266b38403O7364G4090k0657d5056A85376b89538g9524j50195M215
9878b25504A19025D5416L17087a5335A34931a85563i0922k08898G67N1281r598
9867D2450a58391C2263b19020C6995d3343C03182a99557o2629K8206a11534B08840
9855D2452b79621A26870a17345m333j10048R0028b8771E7179a515H4640e1265
9843a86798O9749l9138J4710D237a27650D9373M2238a62061r3667b3119j09403
9832a32522L7476A71036i374B14934b89842a36918o1313K2930H182J8898M8125
9821G5205d9560r1653b5984j69995c2801E5128a01943A71604d62387B72107b20320
$$ plain form
9901 -51493 238541 -172600 -241794 -16380 143444 -213426 23884 -43606 -6693 -114428 169859
9889 167159 -604266 -238403 -171039 74090 53433 -45056 185376 -289538 -79524 -229719 -225504
9878 -225504 119025 45416 362503 -15335 134931 -185563 -90922 -299820 767 52048 42450
9867 42450 -158391 32263 -219020 36995 -43343 303182 -199557 -262186 -233980 -111534 208840
9855 42452 -279621 126870 -117345 -121678 -231726 -141698 -28771 57179 -1515 84640 -51265
9843 -186798 -117049 -156187 -141477 4237 -127650 49373 91611 -162061 -255728 -23119 -132522
9832 -132522 -95046 171036 -9374 214934 -289842 -136918 -198231 -175301 8182 27080 75205
9821 75205 -49560 -141213 -25984 -195979 -32801 55128 -101943 171604 -462387 272107 -220320
9809a62308b3456k048C04130a21531A22210i6884K5266k58189A02351h9807p6571
9798a66378I3892l6809c16561A6249a21803J9404j8379j00585Q5096k22791a05578
9786c23232d1090k71774B01870a09287K3440k09721B08234a35925B6312g5194
9775a47022B3721J3027j3638b02963K3361A6632b089m7906k7494J3159A13893
9763C95000B5528b82627A75063b0607I2243l6368a66325n4925d4129A28397a28824
9751H6402b80304Q5568o6849a28857d1546g925j06396k47389C50808D8692B341
9739a34420C5747C243J24935a31424e1933j19782A41568c34538h6811C88190a25445
9727a89432E4040N1782O9386i0915b6788G9387d5454p687A1329Q5246a5160j31782
$$ plain form
9809 -162308 -23456 -25504 304130 -121531 122210 -96884 -71618 -329807 102351 -89807 -166378
9798 -166378 93892 57083 -316561 16249 -121803 -102399 -120778 -221363 -136267 -359058 -105578
9786 -323232 -41090 -312864 201870 -109287 -85847 -295568 208234 -135925 26312 -75194
9775 -147022 23721 36748 23110 -202963 -179602 16632 -2089 -49995 -77489 -64330 113893
9763 395000 25528 -282627 175063 -20607 92243 55875 -166325 -221250 -44129 128397 -128824
9751 86402 -280304 -194736 -261585 -128857 -41546 -7925 -114321 -361710 350808 48692 2341
9739 -134420 35747 3243 128178 -131424 -51933 -171715 141568 -334538 -86811 388190 -125445
9727 -189432 54040 105822 175208 -90915 -26788 79387 -45454 -53141 11329 96575 -15160 -146942
9715a46942G2694a19965Q866m4138A18541B8920b5631j70685i6835k98889A07607
9703b79091r4315J22424A8289K42509a80340K3801O1475q8300j86905B64674A16980
9691B7829a35727A32496g2655A5123a14437n2809f5606l12774a084A28628c67611
9679d0952p0903k3827D1924J98319J7798a29316B21721A9493a1436j00809F8667
9667i6222K6956p5209K2593B06483D8718c11655b2114j87394D3868a46345C1251
9655a20083r6863l8197B00503a69755A5919b02428K9785n7841h0966m66704b65013
9643a30027j37018C74212a61883D6809a5438j0147n9761J1801A65357a13538q7136
9632b00674l8095J01923G9560b79351g0336H4950b90513k01528a54871K8696E7433
$$ plain form
9715 -146942 72694 -119965 -111099 -155237 118541 28920 -25631 -196316 -96835 -395724 107607
9703 -279091 -373406 -250982 18289 260798 -180340 -156539 -95064 -183364 -370269 264674 116980
9691 27829 -135727 132496 -72655 15123 -114437 -167246 -65606 -378380 -1084 128628 -367611
9679 -40952 -111855 -135682 41924 240243 258041 -129316 221721 19493 -11436 -112245 68667
9667 -96222 -69266 -144475 -121882 206483 48718 -311655 -22114 -209508 43868 -146345 31251
9655 -120083 -216946 -255143 200503 -169755 15919 -202428 -172643 -230484 -80966 -547670 -265013
9643 -130027 -267045 374212 -161883 46809 -15438 -25585 -85346 -73545 165357 -113538 -200674
9632 -200674 -238769 -136846 79560 -279351 -70336 84950 -290513 -492041 -154871 -126175 57433
9620f8787J1214h382j75378A24122c7744j74676I1806P8148o0709k0645J19885
9609B08485E9863a58307j4933G5228a9506H2563i239k98562B22250f4297F3448
9597f6020r9098g01j65024d5009o057j27059j89714I5621a65875j788G7687k5460
9585E2227f3420a428B68075e2451j34793N2322h4B56686G2251b03315k2799j67546
9573c93660a7311n01936a54648H4629e2176J2997A3025K8486R3822C976N7056
9562F1032A3940a62241n0741f8564K121B60751b58895b2047G2819a39452n2738
9551a92190B23191C708J15410E740J10024N5987b42335a03664a2715m87232a17836
9539a14192j9526b5257k92260B99360d7633o6452a5167k85123g9857C18425a05680
$$ plain form
9620 -68787 -57573 -8382 -183760 124122 -37744 -212420 91806 169954 109245 88600 208485
9609 208485 59863 -158307 -173240 75228 -19506 82563 -9239 -307801 222250 -64297 63448
9597 -66020 -165118 -701 -165725 -45009 -51066 -178125 -367839 95621 -165875 -167663 77687 52227
9585 52227 -63420 -1428 268075 -52451 -187244 -134922 -84 256686 72251 -203315 -226114 -393660
9573 -393660 -17311 -519247 -154648 84629 -52176 -39179 13025 41511 135333 3976 61032
9562 61032 13940 -162241 -212982 -68564 -66443 260751 -258895 -22047 72819 -139452 -192190
9551 -192190 223191 3708 119118 5740 115764 171751 -242335 -103664 -12715 -499947 -117836
9539 -114192 -133718 -25257 -317517 299360 -47633 -114085 -15167 -300290 -79857 318425 -105680
9527A15691D3926j9885P9640b1449B27268b93347C14052a1907H7027J06504c40746
9515b44324H6019a00830j17832j40198a2551k25853j36237B23634h5443C38149
9504b26924d9101A15504a55702c1932B99208p1324g9703k9573K0973I2287A7980
9492C96851b06265d4273A40607n2962a05240A39625a55771A89142C0256a4897
9481b7736E3325a40077L6588B05939a19150A09792f2378A65140B900c33094Q7628
9470b45466J04961q2984P4059j09050K790C86251A1392e28422a0686A02469a13301
9458a9300r4747l44883K01382i5837K1104A10928d9496a2619k4902C47202g879
9446A6511K53086c45597C20088j43801b69845a05868j6532A38518e2148k48404
$$ plain form
9527 115691 43926 24041 103681 -21449 227268 -293347 314052 -11907 87027 193531 -340746
9515 -244324 86019 -100830 -218662 -358860 -12551 -238404 -374641 223634 -85443 338149
9504 -226924 -49101 115504 -155702 -31932 299208 227884 -79703 -109276 -88303 92287 17980
9492 396851 -206265 -44273 140607 87645 -105240 139625 -155771 189142 30256 -14897
9481 -27736 53325 -140077 -103489 205939 -119150 109792 -62378 165140 2900 -333094 -245466
9470 -245466 -140505 -223489 -149430 -258480 -255690 386251 11392 -528422 -10686 102469 -113301
9458 -19300 -114047 -458930 -257548 -95837 -74733 110928 -49496 -12619 -37521 347202 -7879
9446 16511 269597 -345597 320088 176287 -269845 -105868 -122400 138518 -52148 -300552
9436c00552j0228a6013k13610A63817a11364F9030a25726m9843j17917a34081
9425f735j12140j33678J14903j80730R3230d4560m1922p1958k40203P9684a3612
9413B27517D1975h1443D9017c8304r4677k00721B13401b66009Q9351J9768B03222
9401B9353d2803j364j37169M5200D43051b21378R95c7565e959l7545j69639C53062
9388A20782d45693A16575M56304F6696a02461j14347J05777A21093n07a88945
9377C45554B3468a21695B16b15885B03731a04431a283B80936A00875B5058a18823
9365b53026A17072b36695h1045H9558j928K3143A4567L0406a649B84069D6083
9353a3506j57790A01212c94642A04357j0879a07065e245E0594h2440A36630a56722
$$ plain form
9436 -300552 -310780 -16013 -229623 163817 -111364 69030 -125726 -175569 -293486 -134081
9425 -6735 -118875 -252553 -137650 -318380 -225150 -44560 -86482 -158440 -398643 -318959 -13612
9413 227517 41975 -81443 49017 -38304 -132981 -333702 213401 -266009 -176658 -156890 203222
9401 29353 -42803 -44167 -181336 -136136 443051 -221378 -220383 -37565 -5959 -43504 -213143 353062
9388 120782 -445693 116575 572879 66696 -102461 -216808 -111031 121093 120586 -188945
9377 345554 23468 -121695 216 -215885 203731 -104431 -1283 280936 100875 25058 -118823
9365 -253026 117072 -236695 -81045 89558 87630 110773 14567 44973 -1649 284069 46083
9353 -13506 -171296 101212 -394642 104357 93478 -107065 -5245 50594 -82440 136630 -156722
9341a02422b8757A89004G1323b7693o0342K5985F4538a32051N6827A98566h1154
9329a78696k25961d4006j05428m3014j87140J76735O8397I0837J40509a69739
9318B0756d3328Q436j96228E420b2325a399k38955J15008o0647j48463d9304j86962
9306b36266c4219B52647d1974j74823f6288j44121Q4832J3275J4601b006j66018
9295a68024N5355B8254d951q8545A24267n1735J12602i4818J5291A58690b98637
9283A51645c21099c7609r580A069K4337a1933j05784q5560D0641b52191J07960
9272a44231B32662A9227a81640A14756J42545E2291a55834M423j08224i5744d6418
9260e9024k23731l7480L9983i9574C84348A20839d4871B0803h1470H536N5565
$$ plain form
9341 -102422 -28757 189004 71323 -27693 -88035 -62050 64538 -132051 -75224 198566 -81154
9329 -178696 -404657 -44006 -149434 -192448 -379588 -202853 -134456 90837 231346 -169739
9318 20756 -43328 -34892 -231120 5420 -22325 -1399 -240354 -125346 -185993 -334456 -49304 -236266
9306 -236266 -34219 252647 -41974 -216797 -66288 -210409 -125577 -112302 -97701 -2006 -168024
9295 -168024 -112669 28254 -4951 -93496 124267 72532 185134 -94818 -79527 158690 -298637
9283 151645 -321099 -37609 -47189 1069 25406 -11933 -117717 -203277 40641 -252191 -144231
9272 -144231 232662 19227 -181640 114756 257301 52291 -155834 -151411 -259635 -95744 -46418
9260 -59024 -282755 -320235 -280252 -99574 384348 120839 -44871 20803 -81470 8536 64101
9249F4101a3302E4719c07821N0577J25576A55615g8756a0613l4059I8632b25620
9237B32881C5874g6907q6617j56803A6136K2868K66146d76557A30732e4981k56241
9226c11222J19766H8878b83119J30729B20031P4521a67987C0856a93667k9197
9216b22864l11369b23347I4896a29860B40848H2129K05840b58198j78143a60895
9205b2677H3518a48874o7327m5385i2235A76961E6398i829m6815j72525B60492
9193I1615K8161k9367a70964a7461m73722a50264b9425A35368b52937b2316F0326
9181h5733l06619A9980J37475L29340A18395a00808n5739H2791d0351n4909o7423
9170a62683A23106J0259A2533b58256a12239A76653a44464j98700L1478f799j73226
$$ plain form
9249 64101 -13302 54719 -307821 -257244 -131668 155615 -78756 -10613 -44672 98632 -225620
9237 232881 35874 -76907 -163524 -320327 16136 39004 305150 -476557 130732 -54981 -311222
9226 -311222 -191456 88878 -283119 -152390 220031 294552 -167987 30856 -193667 -222864
9216 -222864 -534233 -223347 94896 -129860 240848 82129 287969 -258198 -436341 -160895
9205 -22677 83518 -148874 -216201 -261586 -92235 176961 56398 -9829 -56644 -229169 260492
9193 91615 119776 90409 -170964 -17461 -491183 -150264 -29425 135368 -252937 -22316 60326
9181 -85733 -392352 19980 157455 486795 118395 -100808 -156547 82791 -40351 -95260 -162683
9170 -162683 123106 133365 12533 -258256 -112239 176653 -144464 -343164 -311686 -6799 -180025
9159a80025H2494c19737f0663C2971P6760a82201J0468A9413a1787A56741g8974
9147a74730A0489g3719A30718b28638C31124d5873j81622A82005c56214a55685
9136a554k82765J13696A48339n8166a77361d870k53466n1785B9564a11991f414
9124B20245p8184a85744A34320a93534D4132L4447a37639A68107a90371c3080
9113a51316j07950a15537a4909o6112m515L7353F8306L6490b5397k1051j88473
9102b34921G9781a02964A25650c00712j64794f4620m36762B13856b16449e4316
9091b00270A34525k9281l9616a71787B25926I6695J88014G6325k9566g8856n6950
9080a35806a4655j52994h1736C2393a42287I1110j1833J38620b58795b0078I5531
$$ plain form
9159 -180025 82494 -319737 -60663 32971 109731 -182201 -171733 19413 -11787 156741 -78974
9147 -174730 10489 -73719 130718 -228638 331124 -45873 -227495 182005 -356214 -155685
9136 -1554 -284319 -170623 148339 90173 -177361 -4870 -258336 -310121 29564 -111991 -6414
9124 220245 142061 -185744 134320 -193534 44132 78579 -137639 168107 -190371 -33080
9113 -151316 -259266 -115537 -14909 -81021 -85536 -48183 68306 104796 -25397 -46448 -234921
9102 -234921 79781 -102964 125650 -300712 -465506 -64620 -501382 213856 -216449 -54316
9091 -200270 134525 105244 65628 -171787 225926 96695 284709 76325 46759 -78856 -135806
9080 -135806 -14655 -167649 -81736 32393 -142287 91110 79277 217897 -258795 -20078 95531
9068a29566O598k42889A46946B4610h7197k0635H1220b5965j49190H2759a87324
9056c28421A97752a23454n1039B14055b04579O7345A40555a90326E7486A4235
9045a93246a5811l05030J49999A25624a0935G1514Q6554a89507m7780F1204h3087
9033b34692H9241j5038l1448P4778i3439a8158k00427k02760J29201H2773P4269
9022A57042g8826h296A61946m6016R960c04334A30721a35392O4799C0569a62678
9010a29464l11117a6674k15402O2169q4027r367F844P8997J08406a75694O2342
8999a13352E6925a29594M8272D4826c23709B10988b43512R4042D6609L5265b18196
8987B4917a33085H0162a65944k0477j03676G3230a5519B33477A7914O0120D852
$$ plain form
9068 -129566 -122968 -365857 146946 24610 -87197 -107832 81220 -25965 -175155 82759 -187324
9056 -328421 197752 -123454 -174493 214055 -204579 -137234 140555 -190326 57486 14235
9045 -193246 -15811 -320841 -170842 125624 -10935 71514 158068 -189507 -237287 61204 -83087
9033 -234692 89241 74203 42755 117533 -93439 -18158 -218585 -421345 -292144 82773 157042
9022 157042 -78826 -8296 161946 115930 125890 -304334 130721 -135392 -70593 30569 -162678
9010 -129464 -440581 -16674 -232076 -169907 -253934 -263301 6844 85841 194247 -175694 -113352
8999 -113352 56925 -129594 -81322 44826 -323709 210988 -243512 -149470 46609 81874 -218196
8987 24917 -133085 80162 -165944 -186421 -290097 73230 -15519 233477 17914 78034 4852
8975B03626Q3671A01217b08441c3685H8130d9347B28719h9137k18813R5545B07222
8963c6947k24258A8421n369J22719N9144c40278a27322d0536G9818R4943a37581
8951C4266I933b40557J19827N3368J8192k31487a31762A22306B0541b10548B41881
8939A9499e36732i1698k07358H0513B8474c3020C60834b71191D52342A688b51458
8927h0340j85774K3731B22134a81423E805M7192a9560o0710B46622K50569J48281
8916F45472a38905L1100B86122a67769P6704I8123c27491b3374e174k04002J4104
8905a95072C8035d3729o1801A11842a45853l4433O3356j7454A92037b5582n4294
8894g9876C44428c40104I3254b2772j34576A17109b70809A23302A5237b05708
$$ plain form
8975 203626 287297 101217 -208441 -33685 88130 -49347 228719 -89137 -307950 -212405 207222
8963 -36947 -261205 18421 13052 135771 194915 -340278 -127322 -40536 79818 174761 -137581
8951 34266 9933 -240557 -120730 -67362 -49170 -280657 -131762 122306 20541 -210548 241881
8939 19499 -536732 -91698 -299056 80513 28474 -33020 360834 -271191 452342 1688 -251458
8927 -80340 -266114 -242383 222134 -181423 5805 52997 -19560 -80270 246622 497191 645472
8916 645472 -138905 -107805 286122 -167769 -91065 98123 -327491 -23374 -5174 -209176 -195072
8905 -195072 38035 -43729 -105530 111842 -145853 -180286 -116930 -134384 192037 -25582 -79876
8894 -79876 344428 -340104 93254 -22772 -157348 117109 -270809 123302 15237 -205708
8883a07598j6221P327e88k04473J0990k7510A02248b29723A51442c20881e5599
8871a47101n5508F8796a51361K1078A009b68521e7536j56783C06543H7676B8163
8859a5233o6609m2513D3894f3260a7453p0211H6504f1809G2259L4116e0803B7329
8846a04753A219d6287k17523a3022r3384l946M1248L3720B6277J9697c4464k02979
8834b37443K9171l7339P2651r4236m9376A49632i354k478A36874g3660j35954
8823b09614c5530j02331d8650k6226C9388h0712k5294k152A8694b2045B39856
$$ plain form
8883 -107598 -123819 -116492 -588 -205061 -194071 -221581 102248 -229723 151442 -320881 -55599
8871 -147101 -202609 68796 -151361 -130283 1009 -268521 -57536 -214319 306543 87676 28163
8859 -15233 -81842 -124355 43894 -63260 -17453 -87664 86504 -61809 72259 106375 -50803 27329
8846 -104753 1219 -46287 -263810 -13022 -106406 -110352 -69104 -35384 26277 45974 -34464 -237443
8834 -237443 -208272 -245611 -172960 -267196 -316572 149632 -9354 -11832 136874 -73660 -209614
8823 -209614 -35530 -137861 -48650 -74876 39388 -80712 -106006 -108158 18694 -22045 239856
$$ [...]
##END NTUPLES=NMR SPECTRUM
##END=
