##TITLE=NES1056_956240_9268895_FejdRoLEkX
##JCAMPDX= 6.0         $$ Bruker NMR JCAMP-DX V2.0
##DATA TYPE= NMR SPECTRUM
##DATA CLASS= NTUPLES
##ORIGIN= BRUKER
##OWNER= Administrator
$$ 1.72 TOPSPIN		Version 2.1
$$ 2015-07-10 23:29:47.691 -0700  Administrator@X
$$ Compression mode = diff/dup
##.OBSERVE FREQUENCY= 400.02188249412
##.OBSERVE NUCLEUS= ^1H
##.ACQUISITION MODE= SIMULTANEOUS (DQD)
##.ACQUISITION SCHEME= undefined
##.AVERAGES= 64
##.DIGITISER RES= 22
##SPECTROMETER/DATA SYSTEM= spect
##.PULSE SEQUENCE= noesygpps1d.comp
##.SOLVENT NAME= COFFEE_meoh
##.SHIFT REFERENCE= INTERNAL, COFFEE_meoh, 1, 14.96305
##AUDIT TRAIL= $$ (NUMBER, WHEN, WHO, WHERE, PROCESS, VERSION, WHAT)
$$ ##TITLE= Audit trail, TOPSPIN		Version 2.1
$$ ##JCAMPDX= 5.01
$$ ##ORIGIN= Bruker BioSpin GmbH
$$ ##OWNER= Administrator
$$ $$ E:\/data/COFFEE/nmr/NES1056_956240_9268895_FejdRoLEkX/12/pdata/1/auditp.txt
$$ ##AUDIT TRAIL=  $$ (NUMBER, WHEN, WHO, WHERE, PROCESS, VERSION, WHAT)
(   1,<2015-07-10 23:29:42.363 -0700>,<Administrator>,<X>,<go>,<TOPSPIN 2.1>,
      <created by zg
	started at 2015-07-10 23:18:12.691 -0700,
	POWCHK enabled, PULCHK disabled,
       configuration hash MD5:
       21 0F 79 D6 B3 7B B4 F6 88 20 88 DB 03 48 BD 9F
       data hash MD5: 64K
       4E C6 0D C6 61 08 63 BE 29 C8 F0 E2 63 ED C4 25>)
(   2,<2015-07-10 23:29:45.597 -0700>,<Administrator>,<X>,<proc1d>,<TOPSPIN 2.1>,
      <Start of raw data processing
       efp LB = 0.3 FT_mod = 6 PKNL = 1 PHC0 = 0 PHC1 = 0 SI = 128K 
       data hash MD5: 128K
       4F 37 AB 15 FF C7 BF 1B 0F D0 16 67 47 56 B2 E9>)
(   3,<2015-07-10 23:29:46.472 -0700>,<Administrator>,<X>,<proc1d>,<TOPSPIN 2.1>,
      <pk PHC0 = -85.0177 PHC1 = 0 
       data hash MD5: 128K
       FD CB 1B 90 ED 00 9F 0F 22 AC 5D 8C 6B DE BA BE>)
(   4,<2015-07-10 23:29:46.878 -0700>,<Administrator>,<X>,<proc1d>,<TOPSPIN 2.1>,
      <abs ABSG = 1 
       data hash MD5: 128K
       D3 43 90 4C 5A 92 30 8A CD 5D EA B6 4C 8E C0 C7>)
(   5,<2015-07-10 23:29:46.956 -0700>,<Administrator>,<X>,<proc1d>,<TOPSPIN 2.1>,
      <abs ABSG = 2 
       data hash MD5: 128K
       C0 D7 F6 E9 9C D3 2C 77 61 57 E2 31 69 EA 95 A6>)
(   6,<2015-07-10 23:29:47.050 -0700>,<Administrator>,<X>,<proc1d>,<TOPSPIN 2.1>,
      <abs ABSG = 3 
       data hash MD5: 128K
       03 D9 62 71 AB BA B9 32 CA 79 3A 97 5F 44 77 A0>)
(   7,<2015-07-10 23:29:47.144 -0700>,<Administrator>,<X>,<proc1d>,<TOPSPIN 2.1>,
      <abs ABSG = 4 
       data hash MD5: 128K
       45 A6 69 D8 98 12 D0 54 FC 36 33 01 90 99 51 28>)
(   8,<2015-07-10 23:29:47.222 -0700>,<Administrator>,<X>,<proc1d>,<TOPSPIN 2.1>,
      <abs ABSG = 5 
       data hash MD5: 128K
       88 2E CC 8E 40 ED D4 80 45 B6 C5 59 2E 4A 40 98>)
$$ ##END=
$$ 
$$ $$ hash MD5
$$ $$ A4 68 E5 FD 28 5F AF F3 AC C1 CC F5 07 7F F0 E9
##$RELAX= 
##$RELAX= 
##$RELAX= 
##$RELAX= 
##$RELAX= 
##$RELAX= 
##$RELAX= 
##$RELAX= 
$$ Bruker specific parameters
$$ --------------------------
##$DU= <E:\>
##$EXPNO= 12
$$ [...]
150 150 150 150 150 150 150 150
##$TP07= 0
##$TPNAME0= <>
##$TPNAME1= <>
##$TPNAME2= <>
##$TPNAME3= <>
##$TPNAME4= <>
##$TPNAME5= <>
##$TPNAME6= <>
##$TPNAME7= <>
##$TPOAL= (0..7)
0.5 0.5 0.5 0.5 0.5 0.5 0.5 0.5
##$TPOFFS= (0..7)
0 0 0 0 0 0 0 0
##$TUNHIN= 0
##$TUNHOUT= 0
##$TUNXOUT= 0
##$USERA1= <user>
##$USERA2= <user>
##$USERA3= <user>
##$USERA4= <user>
##$USERA5= <user>
##$V9= 5
##$VALIST= <valist>
##$VCLIST= <CCCCCCCCCCCCCCC>
##$VD= 0
##$VDLIST= <DDDDDDDDDDDDDDD>
##$VPLIST= <PPPPPPPPPPPPPPP>
##$VTLIST= <TTTTTTTTTTTTTTT>
##$WBST= 2048
##$WBSW= 25
##$XGAIN= (0..3)
0 0 0 0
##$XL= 0
##$YL= 0
##$YMAX_a= 6749891
##$YMIN_a= -14626304
##$ZGOPTNS= <>
##$ZL1= 120
##$ZL2= 120
##$ZL3= 120
##$ZL4= 120
##$ABSF1= 14.96305
##$ABSF2= -5.595132
##$ABSG= 5
##$ABSL= 3
##$ALPHA= 0
##$AQORDER= 0
##$ASSFAC= 0
##$ASSFACI= 0
##$ASSFACX= 0
##$ASSWID= 0
##$AUNMP= <proc_prof1d_extract.lims>
##$AXLEFT= 0
##$AXNAME= <>
##$AXNUC= <1H>
##$AXRIGHT= 0
##$AXTYPE= 0
##$AXUNIT= <>
##$AZFE= 0.1
##$AZFW= 0.1
##$BCFW= 0
##$BC_mod= 0
##$BYTORDP= 0
##$COROFFS= 0
##$CY= 15
##$DATMOD= 1
##$DC= 0
##$DFILT= <>
##$DTYPP= 0
##$F1P= 0
##$F2P= 0
##$FCOR= 0.5
##$FTSIZE= 131072
##$FT_mod= 6
##$GAMMA= 0
##$GB= 0
##$INTBC= 1
##$INTSCL= 1
##$ISEN= 128
##$LB= 0.3
##$LEV0= 0
##$LPBIN= 0
##$MAXI= 10000
##$MC2= 0
##$MEAN= 0
##$ME_mod= 0
##$MI= 0
##$NCOEF= 0
##$NC_proc= -2
##$NLEV= 6
##$NOISF1= 0
##$NOISF2= 0
##$NSP= 0
##$NTH_PI= 0
##$NZP= 0
##$OFFSET= 14.96305
##$PC= 1
##$PHC0= -85.0177
##$PHC1= 0
##$PH_mod= 1
##$PKNL= yes
##$PPARMOD= 0
##$PPDIAG= 0
##$PPIPTYP= 0
##$PPMPNUM= 2147483647
##$PPRESOL= 1
##$PSCAL= 4
##$PSIGN= 0
##$PYNMP= <proc.py>
##$REVERSE= no
##$SF= 400.0200088157
##$SI= 131072
##$SIGF1= 0
##$SIGF2= 0
##$SINO= 400
##$SIOLD= 131072
##$SPECTYP= <>
##$SREGLST= <1H.CDCl3>
##$SSB= 0
##$STSI= 131072
##$STSR= 0
##$SW_p= 8223.68421052631
##$SYMM= 0
##$S_DEV= 0
##$TDeff= 65536
##$TDoff= 0
##$TI= <>
##$TILT= no
##$TM1= 0
##$TM2= 0
##$TOPLEV= 0
##$USERP1= <user>
##$USERP2= <user>
##$USERP3= <user>
##$USERP4= <user>
##$USERP5= <user>
##$WDW= 1
##$XDIM= 131072
##$YMAX_p= 381818941
##$YMIN_p= -12591
##$CURPLOT= <Network HP LaserJet P1505>
##$CURPRIN= <$Network HP LaserJet P1505>
##$DFORMAT= <normdp>
##$LAYOUT= <+/1D_H.xwp>
##$LFORMAT= <normlp>
##$PFORMAT= <normpl>
##$SURQMSG= 1
$$ End of Bruker specific parameters
$$ ---------------------------------
##NTUPLES= NMR SPECTRUM
##VAR_NAME=  FREQUENCY,     SPECTRUM/REAL,   SPECTRUM/IMAG
##SYMBOL=    X,             R,               I
##VAR_TYPE=  INDEPENDENT,   DEPENDENT,       DEPENDENT
##VAR_FORM=  AFFN,          ASDF,            ASDF
##VAR_DIM=   131072,        131072,          131072
##UNITS=     HZ,            ARBITRARY UNITS, ARBITRARY UNITS
##FACTOR=    0.0627417313425164, 1,          1
##FIRST=     8223.62146879497, -327,         -50397
##LAST=      0,             1734,            -51113
##MIN=       0,             -12591,          0
##MAX=       8223.62146879497, 381818941,    0
$$ Real data points
##PAGE= N=1
##DATA TABLE= (X++(R..R)), XYDATA
$$ [...]
63280B57487J366J341J660J446M79m93o26J35J072J479J338J190J425J880K238
$$ 257487 258853 260194 261854 263300 263779 263286 262660 262795 263867 265346 266684 267874 269299 271179 273417
63265B73417K528K940L312L263K805K402K377K632K983L379L670L640L369L228
$$ 273417 275945 278885 282197 285460 288265 290667 293044 295676 298659 302038 305708 309348 312717 315945
63251C15945L364L600L945M663N690O444O502O047N400M681M205M596O033P812
$$ 315945 319309 322909 326854 331517 337207 343651 350153 356200 361600 366281 370486 375082 381115 388927
63237C88927R223J0409J1863J3490J4773J5604J6334J7182J8113J9082J9873K0011
$$ 388927 398150 408559 420422 433912 448685 464289 480623 497805 515918 535000 554873 574884
63225E74884J9363J8558J8188J7898J6984J5712J5161J5736J6725J7404J7866
$$ 574884 594247 612805 630993 648891 665875 681587 696748 712484 729209 746613 764479
63214G64479J8372J8672J8381J7630J6798J5854J4307J1717Q001L390j745o993
$$ 764479 782851 801523 819904 837534 854332 870186 884493 896210 904211 907601 905856 898863
63202H98863j1939j6138j9320k1657k3581k5098k5605k4741k3118k1613k0152
$$ 898863 886924 870786 851466 829809 806228 781130 755525 730784 707666 686053 665901
63191F65901j7882j4523j0913q072o254n008l707j847O91L466N880P836R687J1493
$$ 665901 648019 633496 622583 614511 608257 603249 599542 597695 598386 601852 607732 615568 625255 636748
63177F36748J2868J3630J4110J4566J4826J4728J4543J4582J4815J5163J5786
$$ 636748 649616 663246 677356 691922 706748 721476 736019 750601 765416 780579 796365
63166G96365J6690J7280J6782J5053J2736J0597Q814O838L874l13n028r198j2382
$$ 796365 813055 830335 847117 862170 874906 885503 894317 901155 905029 904716 899688 890490 878108
63153H78108j4988j7467j9681k1155k1713k1539k0859j9806j8576j7439j6572
$$ 878108 863120 845653 825972 804817 783104 761565 740706 720900 702324 684885 668313
63142F68313j5838j4827j3203j1201r564q817q732q691q403p883p017n681m240
$$ 668313 652475 637648 624445 613244 603680 594863 586131 577440 569037 561154 554137 548456 544216
63129E44216l336l063k931k682k598k812k872k340j419o15j36J84O23J496K874
$$ 544216 540880 537817 534886 532204 529606 526794 523922 521582 520163 519548 519412 519596 520219 521715 524589
63114E24589M178M487L698K874L050M007M749M876M859N122N478N587N433N185
$$ 524589 528767 533254 536952 539826 542876 546883 551632 556508 561367 566489 571967 577554 582987 588172
63100E88172M892M531M191M017M046M103L943L561L309L529L993L997L185K074
$$ 588172 593064 597595 601786 605803 609849 613952 617895 621456 624765 628294 632287 636284 639469 641543
63086F41543J531J876K653L190L153K675K160J979K169K447K521K384K258K304
$$ 641543 643074 644950 647603 650793 653946 656621 658781 660760 662929 665376 667897 670281 672539 674843
63072F74843K439K447K300K384L180M541N589N720N534O189P910R768J1017J1981
$$ 674843 677282 679729 682029 684413 687593 692134 697723 703443 708977 715166 723076 732844 743861 755842
63058G55842J3283J4937J6668J8679K1368K4553K7507K9775L1500L3105L4967
$$ 755842 769125 784062 800730 819409 840777 865330 892837 922612 954112 987217 1022184
63047A022184L7298L9976M2514M4486M5869M6780M7155M7010M6735M6636M6380
$$ 1022184 1059482 1099458 1141972 1186458 1232327 1279107 1326262 1373272 1420007 1466643 1513023
63036A513023M5451M4012M2749M1919M1180M0436M0070L9994L9074L6159L1366
$$ 1513023 1558474 1602486 1645235 1687154 1728334 1768770 1808840 1848834 1887908 1924067 1955433
63025A955433K5731J9691J2532L564o674j6870k6274l5067m3286n0069n4452n6597
$$ 1955433 1981164 2000855 2013387 2016951 2010277 1993407 1967133 1932066 1888780 1838711 1784259 1727662
63013A727662n7626n8197n7851n5956n2633m8375m3255l7222l0890k5214k0306
$$ 1727662 1670036 1611839 1553988 1498032 1445399 1397024 1353769 1316547 1285657 1260443 1240137
63002A240137j5268r479l445K027O981J1963J6856K0808K3438K5486K7847L0468
$$ 1240137 1224869 1215390 1211945 1213972 1220953 1232916 1249772 1270580 1294018 1319504 1347351 1377819
62990A377819L2606L3920L4749L5334L5412L4737L3634L2610L1571K9778K6601
$$ 1377819 1410425 1444345 1479094 1514428 1549840 1584577 1618211 1650821 1682392 1712170 1738771
62979A738771K2107J6884J1354N313j758r880j8191k5694l2309l8783m5472n1666
$$ 1738771 1760878 1777762 1789116 1794429 1792671 1782791 1764600 1738906 1706597 1667814 1622342 1570676
62967A570676n6338n9067n9955n9241n7422n5298n3162n0312m6116m1282l7219
$$ 1570676 1514338 1455271 1395316 1336075 1278653 1223355 1170193 1119881 1073765 1032483 995264
62956I95264l4318l1733k8900k6259k4243k2494k0514j8403j6485j4720j3033
$$ 995264 960946 929213 900313 874054 849811 827317 806803 788400 771915 757195 744162
62945G44162j1665j0805j0213r657r255r066q698p813o583n393m431l934m225
$$ 744162 732497 721692 711479 701822 692567 683501 674803 666990 660407 655014 650583 646649 642424
62932F42424n110n692n415m827m702m830m453l625l234l724m525m895m736m411
$$ 642424 637314 631622 626207 621380 616678 611848 607395 603770 600536 596812 592287 587392 582656 578245
62918E78245m228m300m617n078n584o080o357o067n212m425m217m190l497k112
$$ 578245 574017 569717 565100 560022 554438 548358 542001 535934 530722 526297 522080 517890 514393 512281
62904E12281j008r13j405j621j453j620k584l819m361l972l446l611m302m667
$$ 512281 511273 510360 508955 507334 505881 504261 501677 497858 493497 489525 486079 482468 478166 473499
62890D73499m425m171m349m518m042l097k424k365k654k931k961k459j366j99
$$ 473499 469074 464903 460554 456036 451994 448897 446473 444108 441454 438523 435562 433103 431737 431538
62876D31538L29J65q9k6J51J84K09M38P37Q21O73N42O50J039J575K011K114J902
$$ 431538 431867 432032 431943 431917 432068 432252 432461 432899 433636 434457 435130 435672 436322 437361 438936 440947 443061 444963
62858D44963J654J618J668J426P40K0j68J37K19l47j007r53l68k71j098k144k673
$$ 444963 446617 448235 449903 451329 452069 452089 451921 452058 452277 451930 450923 449970 449602 449331 448233 446089 443416
62841D43416k895l337l824l700k815j738j079r97j274j541j606j720k242k894
$$ 443416 440521 437184 433360 429660 426845 425107 424028 423031 421757 420216 418610 416890 414648 411754
62827D11754k926k245j775k192k887k900k283j762j467j008n65q54j880k642k331
$$ 411754 408828 406583 404808 402616 399729 396829 394546 392784 391317 390309 389744 388890 387010 384368 382037
62812C82037j175O2Q99J232J163R33P80P80J119K209M037N661O085N590N448O306
$$ 382037 380862 380924 381823 383055 384218 385151 385931 386711 387830 390039 394076 399737 405822 411412 416860 423166
62796D23166P590Q539R114R601J0075J0583J1408J2764J4576J6646J8736K0545
$$ 423166 430756 439295 448409 458010 468085 478668 490076 502840 517416 534062 552798 573343
62784E73343K2096K4061K7100L0870L4388L7365M0426M3897M7369N0737N4739
$$ 573343 595439 619500 646600 677470 711858 749223 789649 833546 880915 931652 986391
62773I86391N9773O4893O8707P0795P1617P1421O9907O6707O1647N4575M5471
$$ 986391 1046164 1111057 1179764 1250559 1322176 1393597 1463504 1530211 1591858 1646433 1691904
62762A691904L4702K2860J0419k247j4638k6207l6583m5590n3125n9072o3309
$$ 1691904 1726606 1749466 1759885 1757638 1743000 1716793 1680210 1634620 1581495 1522423 1459114
62751A459114o5808o6878o7071o6638o5262o2779n9789n6965n4003n0147m5575
$$ 1459114 1393306 1326428 1259357 1192719 1127457 1064678 1004889 947924 893921 843774 798199
62740G98199m1315l7739l4275l0825k8219k6664k4974k2204j9134j7052j5829
$$ 798199 756884 719145 684870 654045 625826 599162 574188 551984 532850 515798 499969
62729D99969j4421j2683j1404j0756r996q770p574o704n731m369l042k155j413
$$ 499969 485548 472865 461461 450705 440709 431939 424365 417661 411930 407561 404519 402364 400951
62716D00951l82P42J455J865K740M570O840Q476R005R167J0152J2257J4610J6326
$$ 400951 400569 401311 402766 404631 407371 411941 418781 427257 436262 445429 455581 467838 482448 498774
62702D98774J7522J8946K0961K3383K6081K9270L3180L7730M2483M6769N0066
$$ 498774 516296 535242 556203 579586 605667 634937 668117 705847 748330 795099 845165
62691H45165N2520N4893N7584N9882O0538N8941N5326N0084M3347L5242K6025
$$ 845165 897685 952578 1010162 1070044 1130582 1189523 1244849 1294933 1338280 1373522 1399547
62680A399547J5835M791o568j7279k6571l4379m1112m7079n2122n5678n7285n7135
$$ 1399547 1415382 1420173 1413605 1396326 1369755 1335376 1294264 1247185 1195063 1139385 1082100 1024965
62668A024965n6038n4631n2785n0057m6561m2957l9658l6488l3228l0115k7531
$$ 1024965 968927 914296 861511 811454 764893 721936 682278 645790 612562 582447 554916
62657E54916k5450k3452k1224j8967j7195j6166j5516j4565j3014j1246r887r189
$$ 554916 529466 506014 484790 465823 448628 432462 416946 402381 389367 378121 368234 359045
62645C59045q883q472p650o626o029o154o445o090n185m615m661m478l480k424
$$ 359045 350162 341690 334040 327414 321385 315231 308786 302696 297511 292896 288235 283757 280277 277853
62631B77853k352l005l261k834k448k441k259j632j189j387j644j128R8J292K027
$$ 277853 275501 272496 269235 266401 263953 261512 259253 257621 256432 255045 253401 252273 252371 253663 255690
62616B55690K317K103J297L25PO82J816K658L100L573M303N002N424N885O906
$$ 255690 258007 260110 261407 261732 261739 262421 264237 266895 269995 273568 277871 282873 288297 294182 301088
62601C01088Q389R639J0352J1154J2775J4947J6723J7813J9102K1617K5321K9216
$$ 301088 309477 319116 329468 340622 353397 368344 385067 402880 421982 443599 468920 498136
62589D98136L2373L4634L6365L7770L8547L8207L6621L4105L0959K7097K2258
$$ 498136 530509 565143 601508 639278 677825 716032 752653 786758 817717 844814 867072
62578H67072J6459J0026L335l331r718j5562k0603k4621k7591k9814l1619l2818
$$ 867072 883531 893557 896892 893561 883843 868281 847678 823057 795466 765652 734033 701215
62566G01215l2752l1108k8408k5554k3213k1752k1176k0771j9436j7011j4774
$$ 701215 668463 637355 608947 583393 560180 538428 517252 496481 477045 460034 445260
62555D45260j3878j3816j3326j2353j1915j2182j2063j0918r453q413p556o570
$$ 445260 431382 417566 404240 391887 379972 367790 355727 344809 335356 326943 319387 312817
62543C12817n953o055o073n152l869l457l851l676k216k92R99J553J866K096K151
$$ 312817 306864 300809 294736 289584 285715 282258 278407 274731 272515 272223 273222 274775 276641 278737 280888
62528B80888K267K899M072N249N892O020O099O521P283Q191R272J0738J2543J4239
$$ 280888 283155 286054 290126 295375 301267 307287 313386 319907 327190 335381 344653 355391 367934 382173
62514C82173J5515J6666J8269K0458K2800K4904K6874K9051L1434L3434L4292
$$ 382173 397688 414354 432623 453081 475881 500785 527659 556710 588144 621578 655870
62503F55870L3717L2073K9787K6746K2516J7149J1318N518m04o651j2703j7684
$$ 655870 689587 721660 751447 778193 800709 817858 829176 834694 834290 827639 814936 797252
62491G97252k1249k3762k5682k7153k8108k8410k7914k6679k5017k3169k1037
$$ 797252 776003 752241 726559 699406 671298 642888 614974 588295 563278 540109 519072
62480E19072j8604j6333j4670j3294j1475r249p604p248p654p627o537m700k860
$$ 519072 500468 484135 469465 456171 444696 435447 427843 420595 412941 405314 398777 394077 391217
62467C91217j594j019q04m58K27J034J668K103K572L317M374N440O071O166O122
$$ 391217 389623 388604 387800 387342 387569 388603 390271 392374 394946 398263 402637 408077 414148 420314 426436
62452D26436O305O539O455O123N759N025L378J107q96k496m548p250r372r907
$$ 426436 432741 439280 445735 451858 457617 462642 466020 467127 466231 463735 459187 451937 442565 432658
62438D32658r664j0135j1402j2303j2348j2112j1843j0936r162p305o073n181
$$ 432658 422994 412859 401457 389154 376806 364694 352851 341915 332753 325448 319375 314194
62426C14194m088k870j851r13J76J217J892K328K885L651M543N583O742P710Q205
$$ 314194 310106 307236 305385 304472 304648 305865 307757 310085 312970 316621 321164 326747 333489 341199 349404
62411C49404Q248P901P174O395O198O672O970O331N014L691K377P36r29j937k366
$$ 349404 357652 365553 372727 379122 385320 391992 398962 405293 410307 413998 416375 417111 416182 414245 411879
62396D11879l010m105m892m721l890l117k748k788l191l736l956l544k587j267
$$ 411879 408869 404764 399872 395151 391261 388144 385396 382608 379417 375681 371725 368181 365594 364327
62382C64327L52K123L768N261O888Q715J0409J1860J3601J6163J9260K2039K4104
$$ 364327 364679 366802 370570 375831 382719 391434 401843 413703 427304 443467 462727 484766 508870
62369E08870K5867K7915L0316L2634L4439L5630L6371L6786L6760L5955L3948
$$ 508870 534737 562652 592968 625602 660041 695671 732042 768828 805588 841543 875491
62358H75491L0372K5154J8768J2070N702k22n670j0269j3669j6187j8522k0861
$$ 875491 905863 931017 949785 961855 967557 967335 961665 951396 937727 921540 903018 882157
62346H82157k2713k3750k4292k4843k5468k5927k6113k6034k5560k4410k2416
$$ 882157 859444 835694 811402 786559 761091 735164 709051 683017 657457 633047 610631
62335F10631j9728j6881j4540j3008j1975j0991j0065r477r146q593p547o245
$$ 610631 590903 574022 559482 546474 534499 523508 513443 503966 494820 486227 478680 472435
62323D72435n087m335m091m162m042l437k771k602k727k577k428l227n017o494
$$ 472435 467348 463013 458922 454760 450718 447281 444510 441908 439181 436604 434176 430949 425932 419438
62309D19438o645o005n654n680n414m639l729k918k232j890k056k255j721l74
$$ 419438 412793 406788 401134 395454 390040 385401 381672 378754 376522 374632 372576 370321 368600 368226
62295C68226J078K007K388K564K860L517M578N785O770P345P539P529P599P905
$$ 368226 369304 371311 373699 376263 379123 382640 387218 393003 399773 407118 414657 422186 429785 437690
62281D37690Q170Q001P632P777Q562R281R571J0069J1262J2411J2594J2278J2821
$$ 437690 445860 453861 461493 469270 477832 487113 496684 506753 518015 530426 543020 555298 568119
62268E68119J4721J7324K0093K3050K5992K8354L0095L1835L3765L5190L5454
$$ 568119 582840 600164 620257 643307 669299 697653 727748 759583 793348 828538 863992
62257H63992L4591L2724K9502K4623J8463J1781N114j200o813j1560j5637j9322
$$ 863992 898583 931307 960809 985432 1003895 1015676 1020790 1019590 1012777 1001217 985580 966258
62245I66258k2703k5770k8536l0862l2369l2667l1573k9271k6464k4113k2590
$$ 966258 943555 917785 889249 858387 826018 793351 761778 732507 706043 681930 659340
62234F59340k1196j9004j6115j3491j1651j0209q743p366o254n226m225l552l392
$$ 659340 638144 619140 603025 589534 577883 567674 558931 551565 545311 540085 535860 532308 528916
62221E28916l478l552l679l819l624k982k283j768j086J16J564K748L533M021
$$ 528916 525438 521886 518207 514388 510764 507782 505499 503731 502645 502761 504325 507073 510606 514627
62207E14627M169M082M255N017O018O783P568R061J1290J3497J5059J6125J7258
$$ 514627 518796 522878 527133 532150 538168 544951 552519 561580 572870 586367 601426 617551 634809
62194F34809J8819K0824K2998K4835K5798K5603K4237K1739J8187J3946R686O029
$$ 634809 653628 674452 697450 722285 748083 773686 797923 819662 837849 851795 861481 867510
62182H67510L292J512O44N73J048J812K861M518P061J0323J3824J7283K0664K3629
$$ 867510 870802 872314 872958 873531 874579 876391 879252 883770 890831 901154 914978 932261 952925 976554
62168I76554K5382K5416K4129K2204J9725J6460J2815R711P432N371L082Q55j099
$$ 976554 1001936 1027352 1051481 1073685 1093410 1109870 1122685 1132396 1139828 1145199 1148281 1149136 1148037
62155A148037l240n976q908j1357j3214j4625j5311j4900j3764j2774j2305j2007
$$ 1148037 1144797 1138821 1129913 1118556 1105342 1090717 1075406 1060506 1046742 1033968 1021663 1009656
62143A009656j1525j0908j0301r777r538r734j0012r674q534p188o235n571m743
$$ 1009656 998131 987223 976922 967145 957607 947873 937861 928187 919653 912465 906230 900659 895916
62130H95916l689k803k332k023j357l1J777L540M767N398N754O146O668P391Q581
$$ 895916 892227 889424 887092 885069 883712 883681 885458 888998 893765 899163 904917 911063 917731 925122 933703
62115I33703J0425J2597J4369J5221J5232J4858J4553J4737J5765J7557J9408
$$ 933703 944128 956725 971094 986315 1001547 1016405 1030958 1045695 1061460 1079017 1098425
62104A098425K0593K1245K2240K4144K6650K9174L1484L3585L5486L7472M0117
$$ 1098425 1119018 1140263 1162503 1186647 1213297 1242471 1273955 1307540 1343026 1380498 1420615
62093A420615M3408M6236M7380M6828M5589M4496M3913M4286M5995M8575N0917
$$ 1420615 1464023 1510259 1557639 1604467 1650056 1694552 1738465 1782751 1828746 1877321 1928238
62082A928238N2281N2364N0427M5685L8952L2763K8992K7185K5980K5259K5754
$$ 1928238 1980519 2032883 2083310 2128995 2167947 2200710 2229702 2256887 2282867 2308126 2333880
62071B333880K7217K8341K8456K8078K7683K6937K5375K3112K0455J7527J4593
$$ 2333880 2361097 2389438 2417894 2445972 2473655 2500592 2525967 2549079 2569534 2587061 2601654
62060B601654J2233J0838J0296J0350J0835J1350J1294J0551R802R726J0244J0860
$$ 2601654 2613887 2624725 2635021 2645371 2656206 2667556 2678850 2689401 2699203 2708929 2719173 2730033
62048B730033J1426J2187J3294J4729J6565J8780K0943K2509K3521K4516K5693
$$ 2730033 2741459 2753646 2766940 2781669 2798234 2817014 2837957 2860466 2883987 2908503 2934196
62037B934196K6563K6616K5978K5114K4172K3036K1780K0643J9494J7785J5228
$$ 2934196 2960759 2987375 3013353 3038467 3062639 3085675 3107455 3128098 3147592 3165377 3180605
62026C180605J2229R466P145M939K596L61j286k239k946l929n146o034o227n999
$$ 3180605 3192834 3202300 3209445 3214384 3216980 3217341 3216055 3213816 3210870 3206941 3201795 3195761 3189534 3183535
62012C183535n785n530m858l710k265l22K590O306R819J2307J3797J4553J4396
$$ 3183535 3177750 3172220 3167362 3163652 3161387 3161065 3163655 3169961 3179780 3192087 3205884 3220437 3234833
61999C234833J3121J1076Q660N693J925k138n557p895r174r309q319o858n701
$$ 3234833 3247954 3259030 3267690 3273383 3275308 3273170 3267613 3259718 3250544 3241235 3232916 3226058 3220357
61986C220357m787l595k248j375r75n11j23o41k155l696m680n591o819p936q814
$$ 3220357 3215570 3211975 3209727 3208352 3207377 3206866 3206743 3206102 3203947 3200251 3195571 3189980 3183161 3175225 3166411
61971C166411j0293j2829j5417j6925j7802j9259k1311k2799k3193k3154k3349
$$ 3166411 3156118 3143289 3127872 3110947 3093145 3073886 3052575 3029776 3006583 2983429 2960080
61960B960080k3673k3853k3932k3942k3731k3348k3063k2797k2011k0377j8186
$$ 2960080 2936407 2912554 2888622 2864680 2840949 2817601 2794538 2771741 2749730 2729353 2711167
61949B711167j5927j3749j1471q960o357m025k162m53J703M427P141R372J1422
$$ 2711167 2695240 2681491 2670020 2661060 2654703 2650678 2648516 2648063 2649766 2654193 2661334 2670706 2682128
61936B682128J3891J6779J9601K2081K4265K6141K7674K9184L1096L3409L5974
$$ 2682128 2696019 2712798 2732399 2754480 2778745 2804886 2832560 2861744 2892840 2926249 2962223
61925B962223L9204M3890N0227N7663O5901P5535Q7347J01445J17492J35488J55900
$$ 2962223 3001427 3045317 3095544 3153207 3219108 3294643 3381990 3483435 3600927 3736415 3892315
61914C892315J79152K05360K34695K67740L05254L47568L94245M44270M96209
$$ 3892315 4071467 4276827 4511522 4779262 5084516 5432084 5826329 6270599 6766808
61905F766808N47770N94984O31890O51021O44288O04150N25553M08333K58701
$$ 6766808 7314578 7909562 8541452 9192473 9836761 10440911 10966464 11374797 11633498
61896A1633498Q8627q6580k51457l93397n04567n82096o27064o43437o37247o15182
$$ 11633498 11722125 11635545 11384088 10990691 10486124 9904028 9276964 8633527 7996280 7381098
61886G381098n82806n43899n01284m57566m14744l73824l35435l00391k69158
$$ 7381098 6798292 6254393 5753109 5295543 4880799 4506975 4171540 3871149 3601991
61877C601991k41227k15739j92493j71834j53811j37935j23625j10447r8130q6857
$$ 3601991 3360764 3145025 2952532 2780698 2626887 2488952 2365327 2254880 2156750 2069893
61867B069893p7136o8998o1680n4541m7881m2228l7228l2022k6471k1204j6669
$$ 2069893 1992757 1923759 1862079 1807538 1759657 1717429 1680201 1648179 1621708 1600504 1583835
61856A583835j2818r545o684l802o82K113L876M688M940M292K188p28k937l895
$$ 1583835 1571017 1561472 1554788 1550986 1550304 1552417 1556293 1560981 1565921 1570213 1572401 1571673 1568736 1564841
61842A564841m424n038n053l945k400j293l63J212L428N399O397O340N481M181
$$ 1564841 1560417 1555379 1550326 1546381 1543981 1542688 1542325 1543537 1546965 1552364 1558761 1565101 1570582 1574763
61828A574763K815J530J24j563l363n022o477p638q122p470n534k622N98L433
$$ 1574763 1577578 1579108 1579232 1577669 1574306 1569284 1562807 1555169 1547047 1539577 1534043 1531421 1532019 1535452
61814A535452N721Q038J0969J4321J7508K0540K3959K7893L1990L6369M1663M7830
$$ 1535452 1541173 1549211 1560180 1574501 1592009 1612549 1636508 1664401 1696391 1732760 1774423 1822253
61802A822253N3805N8975O4097P0172P7050Q4032R1238R9603J09718J21469J34584
$$ 1822253 1876058 1935033 1999130 2069302 2146352 2230384 2321622 2421225 2530943 2652412 2786996
61791B786996J48892J64278J81047K00289K23211K50168K80902L15595L55137
$$ 2786996 2935888 3100166 3281213 3481502 3704713 3954881 4235783 4551378 4906515
61782D906515M00425M52114N11011N77972O53086P35369Q23296R14788J005983
$$ 4906515 5306940 5759054 6270065 6848037 7501123 8236492 9059788 9974576 10980559
61773A0980559J089848J156108J192137J184138J118885R86850P86257N26074
$$ 10980559 12070407 13226515 14418652 15602790 16721675 17708525 18494782 19020856
61765A9020856K26003q7186l85600o46039q53360j001014j089848j126322j120303
$$ 19020856 19246859 19159673 18774073 18128034 17274674 16273660 15183812 14057490 12937187
61756A2937187j082565j022881r49525q69623p89025p11560o38947n71892n11141
$$ 12937187 11854622 10831741 9882216 9012593 8223568 7512008 6873061 6301169 5790028
61747E790028m57185m09461l66655l27991k93649k63779k37677k14337j93325
$$ 5790028 5332843 4923382 4556727 4228736 3935087 3671308 3433631 3219294 3025969
61738C025969j74617j57882j42546j28429j15777j04629r4547q5054p6071o7838
$$ 3025969 2851352 2693470 2550924 2422495 2306718 2202089 2107542 2022488 1946417 1878579
61728A878579o0663n4737n0007m6211m3102m0537l8295l6047l3753l1742l0152
$$ 1878579 1817916 1763179 1713172 1666961 1623859 1583322 1545027 1508980 1475227 1443485 1413333
61717A413333k8532k6431k4053k1923k0069j8056j5719j3288j0964q893p496p226
$$ 1413333 1384801 1358370 1334317 1312394 1292325 1274269 1258550 1245262 1234298 1225405 1217909 1210683
61705A210683p930q867r504r851j0046j0090r969r724r355r096r546j0983j2606
$$ 1210683 1202753 1193886 1184382 1174531 1164485 1154395 1144426 1134702 1125347 1116251 1106705 1095722 1083116
61692A083116j3214j2675j2087j2320j3003j3244j2774j2100j1819j2061j2343
$$ 1083116 1069902 1057227 1045140 1032820 1019817 1006573 993799 981699 969880 957819 945476
61681I45476j1969j0837r720r319r282q769p742o882o265n249l761k603k039j200
$$ 945476 933507 922670 912950 903631 894349 885580 877838 870956 864691 859442 855681 853078 851039 849839
61667H49839M09J815J882J033O61J319K397L284L885M163M065L935M254M841M923
$$ 849839 850248 852063 853945 854978 855639 856958 859355 862639 866524 870687 874752 878687 882941 887782 892705
61652H92705M147L030K215J707J020j97j858l556m844n493n592n398n129m886
$$ 892705 896852 899882 902097 903804 904824 904627 902769 899213 894369 888876 883284 877886 872757 867871
61638H67871m664m315l661k677j506k53J093K525L930N091N679N476M825M515
$$ 867871 863207 858892 855231 852554 851048 850795 851888 854413 858343 863434 869113 874589 879414 883929
61624H83929M813M844L681J781M87J68j47j006j512p18Q21J735J521P82J11m06
$$ 883929 888742 893586 897267 899048 899535 899703 899556 898550 897038 896320 897141 898876 900397 901179 901290 900884
61608I00884q06j036j161j315j481j642j962k491k994l390m065n267o506p127
$$ 900884 900078 899042 897881 896566 895085 893443 891481 888990 885996 882606 878541 873274 866768 859641
61594H59641p234p420p829p998p686p155o612n885m890l972l482l206k564j314
$$ 859641 852407 844987 837158 829160 821474 814319 807707 801822 796932 792960 789478 786272 783708 782394
61580G82394J02J104J788K986N255Q033J0155J1180J1830J3019J4893J6966J8846
$$ 782394 782496 783600 785388 788374 793629 801662 811817 822997 834827 847846 862739 879705 898551
61567H98551K0580K2465K4608K6508K7278K6698K5836K5928K6715K6750K5489
$$ 898551 919131 941596 966204 992712 1019990 1046688 1072524 1098452 1125167 1151917 1177406
61556A177406K4013K3341K3040K2301K1406K1113K1169K0545J8952J7104J5473
$$ 1177406 1201419 1224760 1247800 1270101 1291507 1312620 1333789 1354334 1373286 1390390 1405863
61545A405863J3578J0756P051L150l84l620p102j1011j4620j6972j8076j8783
$$ 1405863 1419441 1430197 1437248 1440398 1440014 1436394 1429292 1418281 1403661 1386689 1368613 1349830
61533A349830j9367j9119j7720j6086j5077j4225j2611j0352q165o002l346m47
$$ 1349830 1330463 1311344 1293624 1277538 1262461 1248236 1235625 1225273 1217108 1211106 1207760 1207313
61521A207313J942L938O443R619J2688J5528J9276K4813L1478L7946M3807M9685
$$ 1207313 1209255 1213193 1219636 1229255 1241943 1257471 1276747 1301560 1333038 1370984 1414791 1464476
61509A464476N6202O3443P1367Q0240R0535J02466J15722J29766J44431J59940
$$ 1464476 1520678 1584121 1655488 1735728 1826263 1928729 2044451 2174217 2318648 2478588
61499B478588J76184J92315K07212K19884K28926K32024K26716K11577J86439
$$ 2478588 2654772 2847087 3054299 3274183 3503109 3735133 3961849 4173426 4359865
61490D359865J52009J10167O4320J8487k4322o2570r5380j21986j41918j55084
$$ 4359865 4511874 4622041 4686361 4704848 4680526 4617956 4522576 4400590 4258672 4103588
61480D103588j61646j62371j58875j52718j44318j33484j20942j08355r6691q5413
$$ 4103588 3941942 3779571 3620696 3467978 3323660 3190176 3069234 2960879 2864188 2778775
61470B778775p3638o1374m9245l7628k6590j6285o940J431R056J6214K2967K8940
$$ 2778775 2705137 2643763 2594518 2556890 2530300 2514015 2507075 2508506 2517562 2533776 2556743 2585683
61458B585683L3578L6859L9416M1499M2353M1339L9259L7533L6292L4547L2298
$$ 2585683 2619261 2656120 2695536 2737035 2779388 2820727 2859986 2897519 2933811 2968358 3000656
61447C000656L1069L1768L3240L3862L3706L4229L6341L9669M3314M6452M8420
$$ 3000656 3031725 3063493 3096733 3130595 3164301 3198530 3234871 3274540 3317854 3364306 3412726
61436C412726M9019M8754M8151M6827M3689L8134L0650K2156J3128L513o628j6623
$$ 3412726 3461745 3510499 3558650 3605477 3649166 3687300 3717950 3740106 3753234 3756747 3750119 3733496
61424C733496k5459l2602l8373m3309m7237m9438m9643m8391m6193m2900l8255
$$ 3733496 3708037 3675435 3637062 3593753 3546516 3497078 3447435 3399044 3352851 3309951 3271696
61413C271696l2645k6909k1539j6464j1489o631k077J933N233P827R803J0994
$$ 3271696 3239051 3212142 3190603 3174139 3162650 3156019 3153942 3155875 3161108 3168935 3178738 3189732
61401C189732J0960R443O732L363l78m379q200j0948j1868j0956q734n346q7P901
$$ 3189732 3200692 3210135 3216867 3220230 3219852 3215473 3207273 3196325 3184457 3173501 3164767 3159421 3159334 3167235
61387C167235J8470L0318M2197N4072O7019Q2144R9725J19086J39064J58797J78182
$$ 3167235 3185705 3216023 3258220 3312292 3379311 3461455 3561180 3680266 3819330 3978127 4156309
61376D156309J97412K15926K32164K44456K51573K52124K44166K26139J98097
$$ 4156309 4353721 4569647 4801811 5046267 5297840 5549964 5794130 6020269 6218366
61367F218366J61582J18864P2800K6791j6360n5549r0743j21528j47255j68329
$$ 6218366 6379948 6498812 6571612 6598403 6582043 6526494 6435751 6314223 6166968 5998639
61357E998639j86136k01434k13722k22369k27363k28707k26179k20155k11804
$$ 5998639 5812503 5611069 5397347 5174978 4947615 4718908 4492729 4272574 4060770
61348D060770k01847j89982j76073j61172j46559j32473j18627j05320r3122q1728
$$ 4060770 3858923 3668941 3492868 3331696 3185137 3052664 2934037 2828717 2735595 2653867
61338B653867p0223n8420m7123l6958k7709j8966j0751l181L956J0859J7244K2631
$$ 2653867 2583644 2525224 2478101 2441143 2413434 2394468 2383717 2380536 2384492 2395351 2412595 2435226
61326B435226K7030L0965L4825L8387M1042M2349M2277M1125L9361L7440L5548
$$ 2435226 2462256 2493221 2528046 2566433 2607475 2649824 2692101 2733226 2772587 2810027 2845575
61315B845575L3461L0889K7969K5173K2678K0131J7188J4034J1142Q722O593M390
$$ 2845575 2879036 2909925 2937894 2963067 2985745 3005876 3023064 3037098 3048240 3056962 3063555 3067945
61303C067945J823j002l503n349p298j0594j5251j9808k3399k7140l2410l8431
$$ 3067945 3069768 3068766 3065263 3059914 3052616 3042022 3026771 3006963 2983564 2956424 2924014 2885583
61291B885583m2938m5033m5933m6799m7190m6213m4015m1273l7944l3470k7956
$$ 2885583 2842645 2797612 2751679 2704880 2657690 2611477 2567462 2526189 2488245 2454775 2426819
61280B426819k2409j7803j4264j1186p986m716k014l93K47K48l90j911m385p725
$$ 2426819 2404410 2386607 2372343 2361157 2353171 2348455 2346441 2346048 2346295 2346543 2346153 2344242 2339857 2332132
61266B332132j1887j6552k0897k4184k6319k7342k6717k3925j9433j4209q429
$$ 2332132 2320245 2303693 2282796 2258612 2232293 2204951 2178234 2154309 2134876 2120667 2112238
61255B112238j475O882J6205K6154L6552M6872N6708O6785P8220R0568J01763
$$ 2112238 2110763 2117645 2133850 2160004 2196556 2243428 2300136 2366921 2445141 2535709 2637472
61244B637472J10263J16093J19404J19236J14340J04211Q8605O7103M0047R279
$$ 2637472 2747735 2863828 2983232 3102468 3216808 3321019 3409624 3476727 3516774 3526053
61234C526053k2781n4210q3302j08112j27103j39789j46187j46344j41068j32391
$$ 3526053 3503272 3449062 3365760 3257648 3130545 2990756 2844569 2698225 2557157 2424766
61224B424766j22410j12100j01750r1973q3412p5947o8902o1899n4962m8257m2157
$$ 2424766 2302356 2190256 2088506 1996533 1913121 1837174 1768272 1706373 1651411 1603154 1560997
61213A560997l7127l2950k8585k3358j7839j2964q769m635l26L834P469J0210
$$ 1560997 1523870 1490920 1462335 1438977 1421138 1408174 1399405 1394770 1394444 1398278 1405747 1415957
61201A415957J1651J1917J1812J1854J1539J0274Q531P245O442N378L845K427
$$ 1415957 1427608 1439525 1451337 1463191 1474730 1485004 1493535 1500780 1507222 1512600 1516445 1518872
61189A518872J347n5k460n724r212j2535j5676j8583k1026k2903k4500k6175k7701
$$ 1518872 1520219 1520164 1517704 1511980 1502768 1490233 1474557 1455974 1434948 1412045 1387545 1361370 1333669
61176A333669k8320k7715k6527k5463k4339k2741k1155k0369j9958j8679j6450
$$ 1333669 1305349 1277634 1251107 1225644 1201305 1178564 1157409 1137040 1117082 1098403 1081953
61165A081953j4634j4023j3877j3382j2762j2265j1448j0369j0299j2072j4718
$$ 1081953 1067319 1053296 1039419 1026037 1013275 1001010 989562 979193 968894 956822 942104
61154I42104j6772j8157j9609k1084k2030k2533k2960k2868k1566j9416j7403
$$ 942104 925332 907175 887566 866482 844452 821919 798959 776091 754525 735109 717706
61143G17706j5713j3738j1272q725o365m262k697j783j003O2R75J303J682L017
$$ 717706 701993 688255 676983 668258 661893 657631 654934 653151 652148 652210 653185 654488 656170 659187
61129F59187N037O737P880Q955R980J0515J0689J1054J1598J1896J2109J2708
$$ 659187 664224 670961 678841 687796 697776 708291 718980 730034 741632 753528 765637 778345
61117G78345J3412J3482J2934J2377J1792J0592Q827P090N324K881j51k849m753
$$ 778345 791757 805239 818173 830550 842342 852934 861761 868851 874175 877056 876905 874056 869303
61104H69303o214p327p685p321o854o559o282o349p291q555q827q020p699q928
$$ 869303 863089 855762 848077 840756 833902 827343 821061 814712 807421 798866 790039 782019 774320 765392
61090G65392j0859j2106j2473j2561j2539j2217j1723j1362j1137j0951j0864
$$ 765392 754533 742427 729954 717393 704854 692637 680914 669552 658415 647464 636600
61079F36600j0751j0125q751p079n671m573l497k319j108m7N33M44O3J05Q07J813
$$ 636600 625849 615724 606973 599894 594223 589650 586153 583834 582726 582679 583212 583656 583719 583824 584631 586444
61063E86444K838L922M900N274M900M379M418N059N804O196O210O162O289O375
$$ 586444 589282 593204 598104 603378 608278 612657 617075 622134 627938 634134 640344 646506 652795 659170
61049F59170N990N209M666M693M918N156N931P496Q973R437R260R401R868J0053
$$ 659170 665160 670369 675035 679728 684646 689802 695733 703229 712202 721639 730899 740300 750168 760221
61035G60221J0147J0841J1806J1914J1022J0171R885R613R075Q826R036Q971Q295
$$ 760221 770368 781209 793015 804929 815951 826122 836007 845620 854695 863521 872557 881528 889823
61022H89823P795Q183R035R555R693R921J0561J1777J3655J5971J8321K0659K3232
$$ 889823 897618 905801 914836 924391 934084 944005 954566 966343 979998 995969 1014290 1034949 1058181
61009A058181K5958K8558L1246L4616L8871M3808M9220N4515N8428O0361O1758
$$ 1058181 1084139 1112697 1143943 1178559 1217430 1261238 1310458 1364973 1423401 1483762 1545520
60998A545520O4825P0187P7207Q6069R7534J10737J23463J34932J46293J58280
$$ 1545520 1610345 1680532 1757739 1843808 1941342 2052079 2175542 2310474 2456767 2615047
60988B615047J70942J86240K08146K39035K78817L28811L93367M75951N77591
$$ 2615047 2785989 2972229 3180375 3419410 3698227 4027038 4420405 4896356 5473947
60979E473947P02271Q60013J060352J306590J601120J945865K314601K614736
$$ 5473947 6176218 7036231 8096583 9403173 11004293 12950158 15264759 17879495
60971A7879495K696983K440249J852476J090694L74745j26173l41377k76913O677
$$ 17879495 20576478 23016727 24869203 25959897 26334642 26208469 25867092 25590179 25596856
60962B5596856L81779O54755O36315K50150m16230j167557j811281k234343k412985
$$ 25596856 25978635 26633390 27269705 27519855 27103625 25936068 24124787 21890444 19477459
60953A9477459k384413k214945j973960j714150j464497j237223j037664q67522
$$ 19477459 17093046 14878101 12904141 11189991 9725494 8488271 7450607 6583085
60945F583085p24581o04890n05763m25561l61869l11707k72712k42697k18781
$$ 6583085 5858504 5253614 4747851 4322290 3960421 3648714 3376002 3133305 2914524
60936B914524j98335j80311j64618j50620j37231j24034j11414r9779q9362q0516
$$ 2914524 2716189 2535878 2371260 2220640 2083409 1959375 1847961 1748182 1658820 1578304
60926A578304p3576o8530o5077o2779o0905n8604n5529n1931m8024m3831l9804
$$ 1578304 1504728 1436198 1371121 1308342 1247437 1188833 1133304 1081373 1033349 989518 949714
60915I49714l6688l4366l1685k8078k4534k2177k0534j8352j5667j3804j3286
$$ 949714 913026 878660 846975 818897 794363 772186 751652 733300 717633 703829 690543
60904F90543j2979j1741r954q764q420q223p729p225o962o640n860m611l030j106
$$ 690543 677564 665823 655869 647105 638685 630462 622733 615508 608546 601906 596046 591435 588405 587299
60890E87299R94K702L628M134M781N462N663N477N628O362P032P026O509N960
$$ 587299 588293 590995 594623 598757 603538 609000 614663 620140 625768 632130 639162 646188 652697 658657
60876F58657N506N017M368L298J571m00j733k315l192n098p259q384q333q010
$$ 658657 664163 669180 673548 676846 678417 678017 676284 673969 670777 665679 658420 650036 641703 633693
60862F33693p904p784p527p321p024o169m798l538k684j842n98R70K602M153N429
$$ 633693 625789 618005 610478 603157 596133 589964 585166 581628 578944 577102 576504 577474 580076 584229 589658
60847E89658O272O980Q178J0065J2064J3436J3943J3820J3392J2929J2564J2204
$$ 589658 595930 602910 611088 621153 633217 646653 660596 674416 687808 700737 713301 725505
60835G25505J1699J1168J0961J1274J1898J2389J2328J1514J0027Q190O290M471
$$ 725505 737204 748372 759333 770607 782505 794894 807222 818736 828763 836953 843243 847714
60823H47714K912J908J567J658J902K209K455K297J555M95n00j401k373l470m739
$$ 847714 850626 852534 854101 855759 857661 859870 862325 864622 866177 866672 866172 864771 862398 858928 854189
60808H54189o379q417j0434j1947j2858j3300j3401j3420j3695j4040j3606j1911
$$ 854189 847810 839393 828959 817012 804154 790854 777453 764033 750338 736298 722692 710781
60796G10781r582p593o112m694l221j941q59K23J187J806K255K794L146K923K419
$$ 710781 701199 693606 687494 682800 679579 677638 676779 677002 678189 679995 682250 685044 688190 691113 693532
60781F93532K230K198J668O83Lj35k91n70j58J434L387M505M584M328M319M673
$$ 693532 695762 697960 699628 700311 700314 700179 699888 699318 699160 700594 703981 708486 713070 717398 721717 726390
60765G26390N434O652Q013Q889Q951Q565Q426Q813R360R646R819J0308J0998J1224
$$ 726390 731824 738476 746489 755378 764329 772894 781320 790133 799493 809139 818958 829266 840264 851488
60751H51488J0705J0003R688R564R178Q595Q026P123N436L335J747J052R45J151
$$ 851488 862193 872196 881884 891448 900626 909221 917247 924370 929806 933141 934888 935940 936885 938036
60737I38036J581J780J124l22j798k879l931n416p312r306j1033j2173j2787j3500
$$ 938036 939617 941397 942521 942199 940401 937522 933591 928175 920863 911557 900524 888351 875564 862064
60723H62064j4722j5791j5723j4732j4109j4445j4925j4700j4000j3491j3248
$$ 862064 847342 831551 815828 801096 786987 772542 757617 742917 728917 715426 702178
60712G02178j2967j2525j1802j0529q871p567o941o229m533k025L95K356M206
$$ 702178 689211 676686 664884 654355 645484 637917 630976 624747 620214 618189 618584 620940 625146
60699F25146O177P942R077R575R863J0509J1644J2488J1768R080N558K768J028
$$ 625146 631323 639265 648342 657917 667780 678289 689933 702421 714189 723269 728827 731595 732623
60686G32623o38l045n908q507j0637j2505j3971j4474j3861j2820j2196j2014
$$ 732623 731985 728940 723032 714525 703888 691383 677412 662938 649077 636257 624061 612047
60674F12047j1564j0443r023p760o544n064l531k364j452k66J269K582L187L167
$$ 612047 600483 590040 581017 573257 566713 561649 558118 555754 554302 554036 555305 557887 561074 564241
60660E64241K821K307J802J573J638J649J372J070J294K357M029N538N972N010
$$ 564241 567062 569369 571171 572744 574382 576031 577403 578473 579767 582124 586153 591691 597663 602673
60646F02673L281J846J276J437J931K410K609K586K894M018N649O984P721Q231
$$ 602673 605954 607800 609076 610513 612444 614854 617463 620049 622943 626961 632610 639594 647315 655546
60632F55546Q790R248R565R973J0408J0399R849R359R343R419R092Q588Q447Q590
$$ 655546 664336 673584 683149 693122 703530 713929 723778 733137 742480 751899 760991 769579 778026 786616
60618G86616Q507Q087P661P228O285M670K991J906J212J94j272k474k931l188
$$ 786616 795123 803210 810871 818099 824384 829054 832045 833951 835163 835357 834085 831611 828680 825492
60604H25492l993n041n311m676m291n011o226o908p130p674q591r139r041q751
$$ 825492 821499 816458 811147 806471 802180 797169 790943 784035 776905 769231 760640 751501 742460 733709
60590G33709q402p419n443k983q43N84J254J265J011J034J521K156K483K148R52
$$ 733709 725307 717888 712445 709462 708619 709203 710457 711722 712733 713767 715288 717444 719927 722075 723027
60575G23027p64j960j896j236j381k659m023m660m946n442n935o012n817n637
$$ 723027 722263 720303 718407 717171 715790 713131 709108 704448 699502 694060 688125 682113 676296 670659
60561F70659n365m968m873n242n376m584l202k103j514q75K86K030M270O759Q910
$$ 670659 665294 660326 655453 650211 644835 640251 637049 634946 633432 632557 632843 634873 639143 645902 654812
60546F54812J0258J1109J2302J4383J7328K0997K5395L0383L5531M0390M4639
$$ 654812 665070 676179 688481 702864 720192 741189 766584 796967 832498 872888 917527
60535I17527M7813M8994M7045M1434L2716K2029J0133k650j5390k6098l2953l5735
$$ 917527 965340 1014334 1061379 1102813 1135529 1157558 1167691 1165041 1149651 1123553 1090600 1054865
60523A054865l5450l2905k8488k3004j7561j2419p052j537L113O333Q716J0765
$$ 1054865 1019415 986510 958022 935018 917457 905038 897986 896449 899562 905895 914611 925376
60511I25376J1956J1777J0834J0054R579R317R955J2355J6320K1012K6335L3010
$$ 925376 937332 949109 959943 969997 979576 988893 998848 1011203 1027523 1048535 1074870 1107880
60499A107880M1343N0937O1589P3647Q7342J02410J18579J35889J54443J74210
$$ 1107880 1149223 1200160 1261749 1335396 1422738 1525148 1643727 1779616 1934059 2108269
60489B108269J95223K17629K41495K66635K92000L14389L27784L24874L00040
$$ 2108269 2303492 2521121 2762616 3029251 3321251 3635640 3963424 4288298 4588338
60480D588338K51418J80912R3306m266j02721j92141k63840l12633l37999l43152
$$ 4588338 4839756 5020668 5113974 5109708 5006987 4814846 4551006 4238373 3900374 3557222
60470C557222l32864l11894k84716k55326k26393j98919j73304j50410j31056
$$ 3557222 3224358 2912464 2627748 2372422 2146029 1947110 1773806 1623396 1492340
60461A492340j14939j00817q7766p5740o5126n6335m9566m4370l9607l4577l0043
$$ 1492340 1377401 1276584 1188818 1113078 1047952 991617 942051 897681 858074 823497 793454
60450G93454k7264k6064k4785k2404j9657j7717j6508j5192j3631j2475j1911
$$ 793454 766190 740126 715341 692937 673280 655563 639055 623863 610232 597757 585846
60439E85846j1236r871q246p237p047p005o465n541m809m501m276l713k766j663
$$ 585846 574610 564739 556493 549256 542209 535204 528739 523198 518389 513888 509612 505899 503133 501470
60425E01470o07J74L76j14r07j313r59l7J006J926K759L549M130M266L939L370
$$ 501470 500863 501037 501413 501299 500392 499079 498120 498083 499089 501015 503774 507323 511453 515719 519658 523028
60409E23028K767K246K085K609L588M106L615K869L138M533N805N954N288M622
$$ 523028 525795 528041 530126 532735 536323 540429 544044 546913 550051 554584 560389 566343 571631 576253
60395E76253M163L741L526L759M070L759K742J692J245J377J604J488R61L44L0
$$ 576253 580416 584157 587683 591442 595512 599271 602013 603705 604950 606327 607931 609419 610380 610724 610754
60380F10754K3o1n27j201j754k153k590l059l154k382p18J089K040J938J677K036
$$ 610754 610777 610716 610189 608988 607234 605081 602491 599432 596278 593896 593178 594267 596307 598245 599922 601958
60364F01958K567K408J852K080L208L888L279K347K421L409M347M996N795O693
$$ 601958 604525 606933 608785 610865 614073 617961 621240 623587 626008 629417 633764 638760 644555 651248
60350F51248P116P003O900P017O997O565N788M674L153J457o2j423k791l824l889
$$ 651248 658364 665367 672267 679284 686281 692846 698634 703308 706461 707918 707856 706433 703642 699818 695929
60335F95929k994j880j123o03k8N86J145J808K795M017M986N079M067K482J219
$$ 695929 692935 691055 689932 689329 689301 689887 691032 692840 695635 699652 704638 709717 713784 716266 717485
60320G17485N59j42j495l189m444m924m738l919k588j397j065j494j978k098j903
$$ 717485 718044 717902 716407 713218 708774 703850 699112 695193 692605 691208 690143 688649 686671 684573 682670
60305F82670j364m98J03k09r53p79P49K445L020K597K135J908J413M69m32q76
$$ 682670 681306 680808 680911 680702 679749 678970 679719 682164 685184 687781 689916 691824 693237 693706 693274 692398
60289F92398r96r84p11j84Q0l24r11p21L85J437J676J587K048K929L393L364L671
$$ 692398 691402 690418 689707 689523 689603 689279 688368 687647 688032 689469 691145 692732 694780 697709 701102 704466 708137
60272G08137M621N407N435N368O164P683Q974R513R568R671J0365J2097J4735
$$ 708137 712758 718165 723600 728968 735132 742815 751789 761302 770870 780541 790906 803003 817738
60259H17738J7413J9421K0981K2638K4338K5740K7107K9112L1968L5376L9170
$$ 817738 835151 854572 875553 898191 922529 948269 975376 1004488 1036456 1071832 1111002
60248A111002M3304M7518N1649N6090O1262O6867P2390P8021Q4238R0690R6439
$$ 1111002 1154306 1201824 1253473 1309563 1370825 1437692 1510082 1588103 1672341 1763031 1859470
60237A859470J01155J05031J07574J07597J04726R9970R4349Q7748P9525O9513
$$ 1859470 1960625 2065656 2173230 2280827 2385553 2485523 2579872 2667620 2747145 2816658
60227B816658N8046M5533L2426J9205O094o820j9072k9855l8564m4881m8388m8849
$$ 2816658 2874704 2920237 2952663 2971868 2977962 2971142 2952070 2922215 2883651 2838770 2790382 2741533
60215B741533m6895m3531l8865l2142k3298j3411l281P466J9166L1023M2145N2973
$$ 2741533 2694638 2651107 2612242 2580100 2556802 2543391 2540110 2547576 2566742 2597765 2639910 2692883
60203B692883O4552P6752Q8183R7793J05531J11438J14935J15373J12700J07242
$$ 2692883 2757435 2834187 2922370 3020163 3125694 3237132 3352067 3467440 3580140 3687382
60193C687382R9066Q7961P3946N7655M0174K2414M690j3047l0539m7046o1801
$$ 3687382 3786448 3874409 3948355 4006010 4046184 4068598 4073288 4060241 4029702 3982656 3920855
60182C920855p4337q4238r0984r4257r4189r1017q4799p5706o4304n1177l6536
$$ 3920855 3846518 3762280 3671296 3577039 3482850 3391833 3307034 3231328 3167024 3115847 3079311
60171C079311k0643m368J1245K5976M0351N4449O7203P7176Q3596Q6329Q5237
$$ 3079311 3058668 3054300 3065545 3091521 3131872 3186321 3253524 3330700 3414296 3500625 3585862
60160C585862Q0181P1571O0323M7209L2729J7762L682q602j9321k8958l7030m2458
$$ 3585862 3666043 3737614 3797937 3845146 3877875 3895637 3899319 3890717 3871396 3842438 3805408 3762950
60148C762950m4918m4954m2645l7197k8282j7033m971P602K1460L7036N3949P1800
$$ 3762950 3718032 3673078 3630433 3593236 3564954 3547921 3542950 3550552 3572012 3609048 3662997 3734797
60136C734797R0741J11027J32494J54671J77325K00643K24853K49554K73515K95439
$$ 3734797 3825538 3936565 4069059 4223730 4401055 4601698 4826551 5076105 5349620 5645059
60126E645059L14755L31252L43984L51379L52660L48352L38843L23234L00424
$$ 5645059 5959814 6291066 6635050 6986429 7339089 7687441 8026284 8349518 8649942
60117H649942K70762K35807J96757J53958J07737N8802P939m3978r5615j45291
$$ 8649942 8920704 9156511 9353268 9507226 9614963 9673765 9681704 9637726 9542111 9396820
60107I396820j91346k32007k65318k89991l06065l14090l13956l05371k89195
$$ 9396820 9205474 8973467 8708149 8418158 8112093 7798003 7484047 7178676 6889481
60098F889481k67368k41497k12353j80716j47800j14746q2408n1633k3008L621
$$ 6889481 6622113 6380616 6168263 5987547 5839747 5725001 5642593 5590960 5567952 5571573
60088E571573K8599N1466P1173Q7134R9086J06167J07312J02649R3306P9747O1587
$$ 5571573 5600172 5651638 5722811 5809945 5909031 6015198 6122510 6225159 6318465 6398212 6459799
60077F459799L9460J5738p345k9272n0265o9853q7323j02863j17207j30518j42387
$$ 6459799 6499259 6514997 6507652 6478380 6428115 6358262 6270939 6168076 6050869 5920351 5777964
60066E777964j52468j60377j65289j66433j63848j58240j50271j40350j28840
$$ 5777964 5625496 5465119 5299830 5133397 4969549 4811309 4661038 4520688 4391848
60057D391848j16021j02073q7327p2163n6494l9877k2429m995J2016K9201M6996
$$ 4391848 4275827 4173754 4086427 4014264 3957770 3917893 3895464 3890469 3902485 3931686 3978682
60046C978682O4535Q0423R4236J06281J16172J22561J24433J21914J15582J05504
$$ 3978682 4043217 4123640 4217876 4324157 4440329 4562890 4687323 4809237 4924819 5030323
60036E030323R1350P3191N1967K9133N883j7327m0450o3026q3853j01653j15869
$$ 5030323 5121673 5194864 5246831 5275964 5281847 5264520 5224070 5161044 5077191 4975538 4859669
60025D859669j26592j33796j36946j35554j30067j21959j12733j02744r1378p8351
$$ 4859669 4733077 4599281 4462335 4326781 4196714 4074755 3962022 3859278 3767900 3689549
60015C689549o4387n0296l5939k0723m779J1136K6834M2955N9971P7567R5201
$$ 3689549 3625162 3574866 3538927 3518204 3513425 3524561 3551395 3594350 3654321 3731888 3827089
60004C827089J12681J29856J46132J60425J71364J77546J78070J72877J62341
$$ 3827089 3939770 4069626 4215758 4376183 4547547 4725093 4903163 5076040 5238381
59995E238381J46854J27160J04654Q0482N4650K6804k335l1310n9450q6720j12012
$$ 5238381 5385235 5512395 5617049 5697531 5752181 5778985 5776650 5745340 5685890 5599170 5487158
59984E487158j32997j48077j57317j61026j58799j50673j38115j22837j05545
$$ 5487158 5354161 5206084 5048767 4887741 4728942 4578269 4440154 4317317 4211772
59975D211772q6637o7172m8175k9664j1472N642K0869L4783M8769O3091P6565
$$ 4211772 4125135 4057963 4009788 3980124 3968652 3974294 3995163 4029946 4078715 4141806 4218371
59964D218371Q8054R7350J04528J09266J11016J09379J04263R6110Q5959P4835
$$ 4218371 4306425 4403775 4508303 4617569 4728585 4837964 4942227 5038337 5124296 5199131
59954E199131O3046N0434L7186K4043J1790R83p781j3682j5956j4273q839j5J2309
$$ 5199131 5262177 5312611 5349797 5373840 5385630 5386613 5378832 5365150 5349194 5334921 5326082 5326067 5338376
59941E338376K8900N0341P6082J04740J35421J68206K03247K39939K77188L13848
$$ 5338376 5367276 5417617 5493699 5598439 5733860 5902066 6105313 6345252 6622440 6936288
59931F936288L48515L79297M04088M20636M26198M17727L92963L51222K93200
$$ 6936288 7284803 7664100 8068188 8488824 8915022 9332749 9725712 10076934 10370134
59922A0370134K20726J37029M6614m5481j34173k14302k81278l32514l67840l88309
$$ 10370134 10590860 10727889 10774503 10729022 10594849 10380547 10099269 9766755 9398915 9010606
59912I010606l95224l90392l76275l55113l28447k97864k65387k32414j98947
$$ 9010606 8615382 8224990 7848715 7493602 7165155 6867291 6601904 6369490 6170543
59903F170543j64609j29905r5914o3215l1852j806K7096N5377Q3344J10513J35907
$$ 6170543 6005934 5876029 5780115 5716900 5685048 5683242 5710338 5765715 5849059 5959572 6095479
59892F095479J58365J76200J87353J90535J85612J72346J49511J16241P3778K5098
$$ 6095479 6253844 6430044 6617397 6807932 6993544 7165890 7315401 7431642 7505420 7530518
59882G530518k6717p8964j28725j73045k09826k38038k57197k67306k69125k63979
$$ 7530518 7503801 7424837 7296112 7123067 6913241 6675203 6418006 6150700 5881575 5617596
59872E617596k53222k38159k20159k00617j80989j62897j47542j34818j23816
$$ 5617596 5364374 5126215 4906056 4705439 4524450 4361553 4214011 4079193 3955377
59863C955377j14450j07626j03480j00552r7374r3696q9408q3543p5586o6709
$$ 3955377 3840927 3733301 3629821 3529269 3431895 3338199 3248791 3165248 3089662 3022953
59853C022953n8215m9539l9396k8364j8677j1698p132m645m774p910j3579k0966
$$ 3022953 2964738 2915199 2875803 2847439 2828762 2817064 2809932 2805287 2800513 2792603 2779024 2758058
59841B758058k9194l7039m3300m7631n0282n1112m9747m6551m2440l7698l1926
$$ 2758058 2728864 2691825 2648525 2600894 2550612 2499500 2449753 2403202 2360762 2323064 2291138
59830B291138k5194j8306j1790n436J150Q268J6336K5412L4421M1741M6779N0270
$$ 2291138 2265944 2247638 2235848 2230412 2231562 2239830 2256166 2281578 2315999 2357740 2404519 2454789
59818B454789N3036N5263N7097N8968O0928O2162O1397N7449M9639L8398K5507
$$ 2454789 2507825 2563088 2620185 2679153 2740081 2802243 2863640 2921089 2970728 3009126 3034633
59807C034633J3093K362o371j2818j6689j8193j7651j4747r048j137P792J7425
$$ 3034633 3047726 3050088 3043717 3030899 3014210 2996017 2978366 2963619 2954571 2953434 2961226 2978651
59795B978651K8460M1255N5349P0507Q7269J06276J27879J52545J80757K12297
$$ 2978651 3007111 3048366 3103715 3174222 3261491 3367767 3495646 3648191 3828948 4041245
59785D041245K46349K82352L19500L54838L82415L94718L84665L46953K79702
$$ 4041245 4287594 4569946 4889446 5244284 5626699 6021417 6406082 6753035 7032737
59776G032737J86670P7857l3088j33089k12856k68061k98886l08597l01833k83544
$$ 7032737 7219407 7297264 7264176 7131087 6918231 6650170 6351284 6042687 5740854 5457310
59766E457310k58365k29937k00483j71317j43657j18511r6050p5765n7359m0907
$$ 5457310 5198945 4969008 4768525 4597208 4453551 4335040 4238990 4163225 4105866 4064959
59756D064959k6204j2477J061J4734K8368M1565N4173O6797Q0447R5305J10436
$$ 4064959 4038755 4026278 4027339 4042073 4070441 4112006 4166179 4232976 4313423 4408728 4519164
59745D519164J25193J40280J56678J74314J92792K12780K35386K60531K87264
$$ 4519164 4644357 4784637 4941315 5115629 5308421 5521201 5756587 6017118 6304382
59736F304382L15493L46009L78921M13242M48008M82421N14761N42321N62656
$$ 6304382 6619875 6965884 7344805 7758047 8206055 8688476 9203237 9745558 10308214
59727A0308214N73915N74107N61543N36477N01311M59214M13783L70026L33799
$$ 10308214 10882129 11456236 12017779 12554256 13055567 13514781 13928564 14298590 14632389
59718A4632389L09296K97939K99982L15744L44540L83617M29023M76692N22204
$$ 14632389 14941685 15239624 15539606 15855350 16199890 16583507 17012530 17489222 18011426
59709A8011426N60742N88154O01399N97395N72751N25761M58098L73795K77392
$$ 18011426 18572168 19160322 19761721 20359116 20931867 21457628 21915726 22289521 22566913
59700B2566913J73925O9777k7987j13342j82054k31419k60265k68995k58965k31726
$$ 22566913 22740838 22810615 22782628 22669286 22487232 22255813 21995548 21726553 21467588 21235862
59690B1235862j89116j33506o7362P402Q9313J77011K69426L65999M66284N69243
$$ 21235862 21046746 20913240 20845878 20853280 20942593 21119604 21389030 21755029 22221313 22790556
59680B2790556O72846P73705Q66687R45048J001089J026597J013104R52900Q40906
$$ 22790556 23463402 24237107 25103794 26048842 27049931 28076528 29089632 30042532 30883438
59671C0883438O76398M64183K15366n3203l21757n71375p86301r54742j070019
$$ 30883438 31559836 32024019 32239385 32186182 31864425 31293050 30506749 29552007 28481988
59662B8481988j131858j145569j119187j061557r82791q95088q11999p46536p08728
$$ 28481988 27350130 26204561 25085374 24023817 23041026 22145938 21333939 20587403 19878675
59653A9878675p02651p24492p64018q08807q47819q72709q78597q64965q35031
$$ 19878675 19176024 18451532 17687514 16878707 16030888 15158179 14279582 13414617 12579586
59644A2579586p93397p44329o91626o38332n85835n34343m84710m38741l97333
$$ 12579586 11786189 11041860 10350234 9711902 9126067 8591724 8107014 7668273 7270940
59635G270940l59672l24875k93165k64712k38664k14236j91656j71114j51844
$$ 7270940 6911268 6586393 6293228 6028516 5789852 5575616 5383960 5212846 5061002
59626E061002j33286j16069j00850q7119p4251o2777n3504m6200m0405l6711l5955
$$ 5061002 4927716 4811647 4710797 4623678 4549427 4486650 4433146 4386946 4346541 4309830 4273875
59615D273875l7815m1437m6850n4383o3147p1459p8585q4830r0049r3270r3947
$$ 4273875 4236060 4194623 4147773 4093390 4030243 3958784 3880199 3795369 3705320 3612050 3518103
59604C518103r2665r0367q7449q3565p7981p0349o1486n3029m5820l9219l2421
$$ 3518103 3425438 3335071 3247622 3164057 3086076 3015727 2954241 2901212 2855392 2816173 2783752
59593B783752k5614j9209j2864o233L5N175R588J4045J8165K0908K2239K3002
$$ 2783752 2758138 2738929 2726065 2719832 2719867 2725042 2734630 2748675 2766840 2787748 2809987 2832989
59581B832989K3326K2481K0386J8122J6770J6622J7706K0170K3919K8548L3802
$$ 2832989 2856315 2878796 2899182 2917304 2934074 2950696 2968402 2988572 3012491 3041039 3074841
59570C074841L9647M5980N2747O0273O8863P8206Q7735R7502J08146J20204J33843
$$ 3074841 3114488 3160468 3213215 3273488 3342351 3420557 3508292 3605794 3713940 3834144 3967987
59559C967987J49023J65233J81499J97223K12717K28178K42622K54627K63775
$$ 3967987 4117010 4282243 4463742 4660965 4873682 5101860 5344482 5599109 5862884
59550E862884K70357K73936K73306K67922K58359K45357K29348K11134J92090
$$ 5862884 6133241 6407177 6680483 6948405 7206764 7452121 7681469 7892603 8084693
59541H084693J73199J54309J34487J12764Q8742O3313L8963J8724M582k898l605
$$ 8084693 8257892 8412201 8546688 8659452 8748194 8811507 8850470 8869194 8873776 8870878 8867273
59530H867273K657J5719L4664N8052Q4006J10018J33123J50407J59099J56548
$$ 8867273 8869930 8885649 8920313 8978365 9062371 9172389 9305512 9455919 9615018 9771566
59520I771566J40996J12601P3174K4806l0780r1471j54079k14860k70435l18200
$$ 9771566 9912562 10025163 10098337 10123143 10092363 10000892 9846813 9631953 9361518 9043318
59510I043318l56349l83959m00938m07631m04637l93059l74745l51900l26295
$$ 9043318 8686969 8303010 7902072 7494441 7089804 6696745 6322000 5970100 5643805
59501E643805k98854k70150k41240k13735j88729j65948j44404j23768j04499
$$ 5643805 5344951 5074801 4833561 4619826 4431097 4265149 4120745 3996977 3892478
59492C892478q6716o9772n3147l7029k1630o604Q448K3534L8759N4671P1523Q8716
$$ 3892478 3805762 3735990 3682843 3645814 3624184 3617580 3626028 3649562 3688321 3742992 3814515 3903231
59480C903231J05527J21983J38575J55520J72766J90205K07373K23243K36618
$$ 3903231 4008758 4130741 4269316 4424836 4597602 4787807 4995180 5218423 5455041
59471E455041K46210K50193K46555K34443K14345J86488J50116J05245N4257O51
$$ 5455041 5701251 5951444 6197999 6432442 6646787 6833275 6983391 7088636 7142893 7143544
59461G143544n3019j04924j52548j93100k25184k48974k64972k73683k76162k73594
$$ 7143544 7090525 6985601 6833053 6639953 6414769 6165795 5900823 5627140 5350978 5077384
59451E077384k66415k54950k40778k26127k11823j96995j81031j64701j49106
$$ 5077384 4810969 4556019 4315241 4089114 3877291 3680296 3499265 3334564 3185458
59442C185458j34586j21081j08701r7394q6786p6769o7641n9381n1427m3586l6495
$$ 3185458 3050872 2929791 2821090 2723696 2636910 2560141 2492500 2433119 2381692 2338106 2301611
59431B301611l0701k5734k0612j5032r573m845p86L062O772R794J1671J2758J3975
$$ 2301611 2270910 2245176 2224564 2209532 2199959 2195114 2194328 2197390 2204162 2213956 2225627 2238385 2252360
59418B252360J5921J8757K2631K7326L1213L1858K8577K3684K0319J9653K1056
$$ 2252360 2268281 2287038 2309669 2336995 2368208 2400066 2428643 2452327 2472646 2492299 2513355
59407B513355K4191K9522L7084M6193N6430O7631P8620Q7188R2075R4475R7121
$$ 2513355 2537546 2567068 2604152 2650345 2706775 2774406 2853026 2940214 3032289 3126764 3223885
59396C223885J02360J11270J24005J40426J60456J83988K10558K39390K70091
$$ 3223885 3326245 3437515 3561520 3701946 3862402 4046390 4256948 4496338 4766429
59387D766429L03103L38976L77370M16941M55921M92181N23023N45587N57595
$$ 4766429 5069532 5408508 5785878 6202819 6658740 7150921 7673944 8219531 8777126
59378H777126N57562N44754N19696M84646M42949L97764L51579L06573K64718
$$ 8777126 9334688 9879442 10399138 10883784 11326733 11724497 12076076 12382649 12647367
59369A2647367K27294J94467J65193J37444J08917P8015M3998O287l5739q1893
$$ 12647367 12874661 13069128 13234321 13371765 13480682 13558697 13602695 13608982 13573243 13491350
59359A3491350j30594j79464k25984k67402l01056l25766l42478l53127l59448
$$ 13491350 13360756 13181292 12955308 12687906 12386850 12061084 11718606 11365479 11006031
59350A1006031l63283l66825l71433l76732l81805l86549l90871l93337l91880
$$ 11006031 10642748 10275923 9904490 9527758 9145953 8759404 8368533 7975196 7583316
59341G583316l85607l74866l60124l41910l21449l00042k77977k55053k31893
$$ 7583316 7197709 6822843 6462719 6120809 5799360 5499318 5221341 4966288 4734395
59332D734395k09608j88468j68066j48614j30837j14683r9367q4703p1396n9874
$$ 4734395 4524787 4336319 4168253 4019639 3888802 3774119 3674752 3590049 3518653 3458779
59322C458779m9781m0592l1912k3243j4303n514K649J0542J8818K7385L5758M4100
$$ 3458779 3408998 3368406 3336494 3313251 3298948 3293434 3296083 3306625 3325443 3352828 3388586 3432686
59310C432686N2744O1122O8271P4223P9704Q4650Q8159Q9721Q9385Q6876Q1736
$$ 3432686 3485430 3546552 3614823 3689046 3768750 3853400 3941559 4031280 4120665 4207541 4289277
59299D289277P4216O4967N4142M2046L0324K0988J4259Q807M177J558K053N596
$$ 4289277 4363493 4428460 4482602 4524648 4554972 4575960 4590219 4599026 4603203 4604761 4606814 4612410
59287D612410J1809K0652L1850M4648N8337P2186Q4943R5425J03411J08863J10714
$$ 4612410 4624219 4644871 4676721 4721369 4779706 4851892 4936835 5032260 5135671 5244534 5355248
59276E355248J07773J00518R0345P7207N9711L7558J2179j4995m2942o9448r1139
$$ 5355248 5463021 5563539 5653884 5731091 5790802 5828360 5840539 5825544 5782602 5713154 5622015
59265E622015j05904j13863j15648j11492j02554r1207p9028o5878n1699l7685
$$ 5622015 5516111 5402248 5286600 5175108 5072554 4981347 4902319 4836441 4784742 4747057
59255D747057k4891j3172k341O901J4036J9387K2913K3725K1684J8273J4939J1764
$$ 4747057 4722166 4708994 4706653 4713554 4727590 4746977 4769890 4793615 4815299 4833572 4848511 4860275
59243D860275Q613O359O093Q198J3061K1525L3818M9261O7849R0765J18403J49231
$$ 4860275 4868888 4875247 4881340 4889538 4902599 4924124 4957942 5007203 5075052 5165817 5284220 5433451
59231E433451J81696K15809K51498K86545L17667L42621L59732L66312L59260
$$ 5433451 5615147 5830956 6082454 6368999 6686666 7029287 7389019 7755331 8114591
59222H114591L36958K99416K47143J81233J04255J9876o8077j55387k36915l07718
$$ 8114591 8451549 8750965 8998108 9179341 9283596 9303472 9235395 9080008 8843093 8535375
59212H535375l64685m06576m33105m45023m44495m34157m15808l90824l61412
$$ 8535375 8170690 7764114 7331009 6885986 6441491 6007334 5591526 5200702 4839290
59203D839290l30386k99751k70305k42500k16879j93692j72787j53917j36878
$$ 4839290 4508904 4209153 3938848 3696348 3479469 3285777 3112990 2959073 2822195
59194B822195j21445j07584r5557q5487p7118p0103o4194n8990n3938m8798m3709
$$ 2822195 2700750 2593166 2497609 2412122 2335004 2264901 2200707 2141717 2087779 2038981 1995272
59183A995272l8689l3630k8771k4522k0804j7329j4357j2209j0016o361j340L353
$$ 1995272 1956583 1922953 1894182 1869660 1848856 1831527 1817170 1804961 1794945 1788584 1787244 1790597
59171A790597O821R950J3509J6810J9245K1671K5059K8837L1908L4413L7329M1011
$$ 1790597 1797418 1807368 1820877 1837687 1856932 1878603 1903662 1932499 1964407 1998820 2036149 2077160
59159B077160M5211M9867N4866N9655O4039O8716P4098P9377Q3698Q7443R1182
$$ 2077160 2122371 2172238 2227104 2286759 2350798 2419514 2493612 2572989 2656687 2744130 2835312
59148B835312R4036R4483R2330Q8627Q3817P7217O8312N7525M5564L2793J9432
$$ 2835312 2929348 3023831 3116161 3204788 3288605 3365822 3434134 3491659 3537223 3570016 3589448
59137C589448N971o797j7873k6487l2611l6702l8788l8231l4631k8457k0592j1743
$$ 3589448 3595419 3588622 3570749 3544262 3511651 3474949 3436161 3397930 3363299 3334842 3314250 3302507
59125C302507k300P897J9673L3434M8049O1937P5310Q9897J06188J22577J37822
$$ 3302507 3300207 3308104 3327777 3361211 3409260 3471197 3546507 3636404 3742592 3865169 4002991
59114D002991J52647J67911J82857J96300K08187K18524K25965K28858K26767
$$ 4002991 4155638 4323549 4506406 4702706 4910893 5129417 5355382 5584240 5811007
59105E811007K19534K05833J84119J54513J18570P8029L4975p572m6779q1397
$$ 5811007 6030541 6236374 6420493 6575006 6693576 6771605 6806580 6799008 6752229 6670832
59095F670832j11105j35269j53597j67298j78119j86646j92601j96341j98771
$$ 6670832 6559727 6424458 6270861 6103563 5925444 5738798 5546197 5349856 5151085
59086E151085k00248k00624j99978j98331j95285j90845j85914j80956j75051
$$ 5151085 4950837 4750213 4550235 4351904 4156619 3965774 3779860 3598904 3423853
59077C423853j67490j59300j51808j44459j35795j25917j16240j07289r8504r0063
$$ 3423853 3256363 3097063 2945255 2800796 2665001 2539084 2422844 2315555 2217051 2126988
59067B126988q2908p6961p0913o4200n7716n2210m7252m2277l7564l3616l0397
$$ 2126988 2044080 1967119 1896206 1832006 1774290 1722080 1674828 1632551 1594987 1561371 1530974
59056A530974k7691k5652k4564k4340k4424k4101k3069k1868k1299k1236k0686
$$ 1530974 1503283 1477631 1453067 1428727 1404303 1380202 1357133 1335265 1313966 1292730 1272044
59045A272044j9284j7875j7011j5903j3676j0891q675p039n083k427O60M055P735
$$ 1272044 1252760 1234885 1217874 1201971 1188295 1177404 1168729 1161690 1156607 1154180 1154840 1158895 1166630
59032A166630J1213J3919J5874J7283J7878J7181J5095J1741P443L242M73p67
$$ 1166630 1177843 1191762 1207636 1224919 1242797 1259978 1275073 1286814 1294257 1297499 1297972 1297205
59020A297205j735l035l684k897j411n7J606L953N989O845P347Q529R674R447
$$ 1297205 1295470 1292435 1288751 1285854 1284443 1284386 1285992 1289945 1295934 1302779 1310126 1318655 1328329 1337776
59006A337776P917N901L381K41k484l990n277p454r457r555q247p409p269o495
$$ 1337776 1345693 1351594 1354975 1355216 1352732 1348742 1343465 1336011 1326554 1316999 1308752 1301343 1294074 1287579
58992A287579m787l085j516N47K598L378L131L393M673O211P824R881J1648J1910
$$ 1287579 1282792 1279707 1278191 1278738 1281336 1284714 1287845 1291238 1295911 1302122 1309946 1319827 1331475 1343385
58978A343385J1253J1501J2873J3877J4119J4808J6226J7206J7654J9222K2560
$$ 1343385 1354638 1366139 1379012 1392889 1407008 1421816 1438042 1455248 1472902 1492124 1514684
58967A514684K6029K8118K9298L0601L2005L3172L4263L5122L5016L3975L3063
$$ 1514684 1540713 1568831 1598129 1628730 1660735 1693907 1728170 1763292 1798308 1832283 1865346
58956A865346L2779L2530L2203L2803L4880L7795M1107M5264N0271N5139N9419
$$ 1865346 1898125 1930655 1962858 1995661 2030541 2068336 2109443 2154707 2204978 2260117 2319536
58945B319536O3937O9297P4936Q0429Q6381R3240J00392J07321J14595J22960
$$ 2319536 2383473 2452770 2527706 2608135 2694516 2787756 2888148 2995469 3110064 3233024
58935C233024J32464J43131J55574J70160J86329K03350K21138K40061K60721
$$ 3233024 3365488 3508619 3664193 3834353 4020682 4224032 4445170 4685231 4945952
58926D945952K84077L10797L40346L71576M04399M39724M77748N17504N58166
$$ 4945952 5230029 5540826 5881172 6252748 6657147 7096871 7574619 8092123 8650289
58917H650289N99357O39771O76741P07391P28993P37994P30194P02393O52853
$$ 8650289 9249646 9889417 10566158 11273549 12002542 12740536 13470730 14173123 14825976
58908A4825976N80175M83637L65479K31589Q9208n5062j94946l24030m36927n30284
$$ 14825976 15406151 15889788 16255267 16486856 16576064 16521002 16326056 16002026 15565099 15034815
58898A5034815o02378o52732o82535o94330o90724o74086o47346o13709n75351
$$ 15034815 14432437 13779705 13097170 12402840 11712116 11038030 10390684 9776975 9201624
58889I201624n33634m90810m50026m13226l80273l50395l23295k98651k76111
$$ 9201624 8667990 8177180 7727154 7313928 6933655 6583260 6259965 5961314 5685203
58880E685203k56103k39248k24620k10145j95134j80911j68522j57376j46603
$$ 5685203 5429100 5189852 4965232 4755087 4559953 4379042 4210520 4053144 3906541
58871C906541j36122j25772j15002j04144r4445q6221p8402p0462o3225n7138
$$ 3906541 3770419 3644647 3529645 3425501 3331056 3244835 3166433 3095971 3032746 2975608
58861B975608n1369m5390l9873l5119l0249k4781j9548j5060j0472n088N16N938
$$ 2975608 2924239 2878849 2838976 2803857 2773608 2748827 2729279 2714219 2703747 2698659 2699175 2705113
58849B705113J1967J9112K6385L2698L8305M3896M9482N5139O1511O8589P5276
$$ 2705113 2717080 2736192 2762577 2795275 2833580 2877476 2926958 2982097 3043608 3112197 3187473
58838C187473Q1261Q8023R6815J06871J16821J26757J37619J49581J62374J76397
$$ 3187473 3268734 3356757 3453572 3560443 3677264 3804021 3941640 4091221 4253595 4429992
58828D429992J92214K09574K28006K47890K70152K95432L24061L56086L90711
$$ 4429992 4622206 4831780 5059786 5307676 5577828 5873260 6197321 6553407 6944118
58819F944118M26617M63473N02206N43099N84461O23571O57862O84645P00781
$$ 6944118 7370735 7834208 8336414 8879513 9463974 10087545 10745407 11430052 12130833
58810A2130833P03224O89004O54568N96665N14630M10801K88706J52603Q970j33815
$$ 12130833 12834057 13523061 14177629 14774294 15288924 15699725 15988431 16141034 16150004 16016189
58800A6016189k68542l90465m95245n78226o37344o74832o94380o98072o87492
$$ 16016189 15747647 15357182 14861937 14283711 13646367 12971535 12277155 11579083 10891591
58791A0891591o65972o37531o04640n68624n31169m93774m56703m20085l85127
$$ 10891591 10225619 9588088 8983448 8414824 7883655 7389881 6933178 6513093 6127966
58782F127966l52734l21970k91529k61925k34714k10426j88897j71079j58710
$$ 6127966 5775232 5453262 5161733 4899808 4665094 4454668 4265771 4094692 3935982
58773C935982j52344j50721j51683j52783j51747j47656j41270j33557j24552
$$ 3935982 3783638 3632917 3481234 3328451 3176704 3029048 2887778 2754221 2629669
58764B629669j14368j04166r4976q6485p8065p0131o3311n7145n0853m4700l9451
$$ 2629669 2515301 2411135 2316159 2229674 2151609 2081478 2018167 1961022 1910169 1865469 1826018
58753A826018l5138l1317k7878k4819k1835j8992j6920j5691j4482j3015j2160
$$ 1826018 1790880 1759563 1731685 1706866 1685031 1666039 1649119 1633428 1618946 1605931 1593771
58742A593771j2359j2723j2619j2788j3871j5170j5916j6387j6701j5997j4220
$$ 1593771 1581412 1568689 1556070 1543282 1529411 1514241 1498325 1481938 1465237 1449240 1435020
58731A435020j3227j4489j6968j8818j9981k1493k3331k4749k5830k7057k8043
$$ 1435020 1421793 1407304 1390336 1371518 1351537 1330044 1306713 1281964 1256134 1229077 1201034
58720A201034k8194k7864k7567k6885k5467k4104k3430k2606k0724j8514j7168
$$ 1201034 1172840 1144976 1117409 1090524 1065057 1040953 1017523 994917 974193 955679 938511
58709I38511j6440j5435j4280j3450j2416j0647q981q402q240p343o155n906o456
$$ 938511 922071 906636 892356 878906 866490 855843 846862 838460 830220 822877 816722 810816 804360
58696H04360o609o014n179m224l058k228k126k063j464j152k019l284l616l166
$$ 804360 797751 791737 786558 782334 779276 777048 774922 772859 771395 770243 768224 764940 761324 758158
58682G58158l024l348l503l248k424l71K841N495O150N607N561O313P364R169
$$ 758158 755134 751786 748283 745035 742611 742240 745081 750576 756726 762333 767894 774207 781571 790740
58668G90740J2445J6663K0918K5328K9803L2337L0538K4211J4914L911p647j7581
$$ 790740 803185 819848 840766 866094 895897 928234 958772 982983 997897 1001808 994161 976580
58656I76580k3867k6454k6358k3927j9569j4939j1353q039l959o4K358M309P453
$$ 976580 952713 926259 899901 875974 856405 841466 830113 822074 818115 818051 820409 824718 832171
58643H32171J1026J3115J4163J6218J9298K1539K2798K5089K9259L3892L7901
$$ 832171 843197 856312 870475 886693 905991 927530 950328 975417 1004676 1038568 1076469
58632A076469M1845M6230N0702N5368O1048O7875P5316Q3671R3870J05829J18647
$$ 1076469 1118314 1164544 1215246 1270614 1331662 1399537 1474853 1558524 1652394 1758223 1876870
58621A876870J32227J47076J62764J78317J93617K08409K20426K26555K25483
$$ 1876870 2009097 2156173 2318937 2497254 2690871 2899280 3119706 3346261 3571744
58612C571744K17065J99728J71265J32352Q6758L7973j2041o0692j04096j39520
$$ 3571744 3788809 3988537 4159802 4292154 4378912 4416885 4404844 4344152 4240056 4100536
58602D100536j66483j84938j94325j95181j89943j81325j71009j60075j49324
$$ 4100536 3934053 3749115 3554790 3359609 3169666 2988341 2817332 2657257 2507933
58593B507933j38799j28252j18036j08511r8947q8517p7971o8696o0583n2477
$$ 2507933 2369134 2240882 2122846 2014335 1915388 1826871 1748900 1680204 1619621 1567144
58583A567144m4369l7281l1407k6225k2071j9615j8171j6556j5243j5583j7207
$$ 1567144 1522775 1485494 1454087 1427862 1405791 1386176 1368005 1351449 1336206 1320623 1303416
58572A303416j8345j8507j8641j8919j8573j7746j7308j7047j6313j6064j7767
$$ 1303416 1285071 1266564 1247923 1229004 1210431 1192685 1175377 1158330 1142017 1125953 1108186
58561A108186k0462k1633k0935k0344k0401j9260j5997j2142r059o281l404j465
$$ 1108186 1087724 1066091 1045156 1024812 1004411 985151 969154 957012 947953 941672 938268 936803
58549I36803j332k552m532p288j0285j2253j2738j2524j2175j1576j0958j0817
$$ 936803 935471 932919 928387 921099 910814 898561 885823 873299 861124 849548 838590 827773
58537H27773j0765j0099r359r666j0761j1484j1826j2550j3175j2633j1575j1713
$$ 827773 817008 806909 797550 787884 777123 765639 753813 741263 728088 715455 703880 692167
58525F92167j2918j3395j2601j1634j0774r234p351o504o649o345n355m736m316
$$ 692167 679249 665854 653253 641619 630845 621611 614260 607756 601107 594762 589407 584671 580355
58512E80355k754k89J181J121R20J138Q27o4k40N45J075J043J450K339K686K705
$$ 580355 577601 577312 578493 579614 580534 581672 582499 582435 582195 582740 583815 584858 586308 588647 591333 594038
58496E94038L691N314N818N164N138O002O010M742L930M297M481L880L670M271
$$ 594038 597729 603043 608861 614025 619163 625165 631175 635917 639847 644144 648625 652505 656175 660446
58482F60446M509M137M445N656O322N979N698N428L713O57j803l240n293q209
$$ 660446 664955 669092 673537 679193 685515 691494 697192 702620 706333 706990 705187 701947 696654 688445
58468F88445j0058j0290j0749j2028j2144j0200q151p432o839n357m165m204m406
$$ 688445 678387 668097 657348 645320 633176 622976 614825 607393 600554 595197 591032 586828 582422
58455E82422l913l592l942l963l353l253l702l001p36J298K279L655O104Q112
$$ 582422 578509 574917 570975 567012 563659 560406 556704 553703 552967 554265 556544 560199 566303 574415
58441E74415Q814R345J0075R495P197N002L736J941q61k725k666k375k979l113
$$ 574415 583229 592574 602649 612144 619341 624343 628079 630020 629159 626434 623768 621393 618414 615301
58427F15301j884o76k52Q59L297N208N498N784P279Q669Q961R422J0727J1110
$$ 615301 613417 612741 612489 613348 616645 621853 627351 633135 640414 649083 658044 667466 678193 689303
58413F89303R496P655P146O811N309L469K159M78k068m066m717n258o403p008
$$ 689303 698799 706454 713600 720411 725720 729189 731348 731826 729758 725692 720975 715717 709314 702306
58399G02306o673o753p420o959n275m698n685n476k755rP20P01J139R22O7J394
$$ 702306 695633 688880 681460 674501 669226 664528 658843 653367 650612 650603 651323 652024 653163 654085 654152 655546
58383F55546O065J1046J3640J4906J6101J5651J2633R516Q268P214M793K951L518
$$ 655546 661611 672657 686297 701203 717304 732955 745588 755104 763372 770586 775379 778330 781848
58370G81848M686M385L899M858N807N078M028M205M405L588L571N649P656P515
$$ 781848 786534 790919 794818 799676 805483 810561 814589 818794 823199 826787 830358 836007 843663 851178
58356H51178O625O733O732N547M820N601N811M106K629K885K661L60j484o01J022
$$ 851178 857803 864536 871268 876815 881635 887236 893047 897153 899782 902667 905328 905688 904204 903603 904625
58341I04625J144J393L496N386N080M640O259Q108Q131Q113R832J1171J0224R319
$$ 904625 905769 907162 910658 916044 921124 925764 932023 940131 948262 956375 966207 977378 987602 996921
58327I96921J0585J1644J0265R046J0674J2721J2303J1662J3782J6412J6076J4261
$$ 996921 1007506 1019150 1029415 1038461 1049135 1061856 1074159 1085821 1099603 1116015 1132091 1146352
58315A146352J4022J4057J1857R199Q792Q868O804M678N474P281P051O588Q830
$$ 1146352 1160374 1174431 1186288 1195487 1204279 1213147 1219951 1224629 1230103 1237384 1244435 1251023 1259853
58302A259853J1769J2145J1779J3911J6646J6467J5043J6077J8454J8876J8236
$$ 1259853 1271622 1283767 1295546 1309457 1326103 1342570 1357613 1373690 1392144 1411020 1429256
58291A429256J9146K0280J9422J8843K1358K4475K4764K4389K6777K9771K9912
$$ 1429256 1448402 1468682 1488104 1506947 1528305 1552780 1577544 1601933 1628710 1658481 1688393
58280A688393K9519L2276L5797L6023L5019L6731L8970L7536L4503L4192L4886
$$ 1688393 1717912 1750188 1785985 1822008 1857027 1893758 1932728 1970264 2004767 2038959 2073845
58269B073845L2807L0424L2195L5846L6577L6022L8364M1588M1756M1787M6420
$$ 2073845 2106652 2137076 2169271 2205117 2241694 2277716 2316080 2357668 2399424 2441211 2487631
58258B487631N2655N4926N5626O0248O6363O8064O7334P0045P4656P6014P6376
$$ 2487631 2540286 2595212 2650838 2711086 2777449 2845513 2912847 2982892 3057548 3133562 3209938
58247C209938Q1213Q8012R0916R2354R8184J05743J09102J11604J20003J30966
$$ 3209938 3291151 3379163 3470079 3562433 3660617 3766360 3875462 3987066 4107069 4238035
58237D238035J37082J41398J51500J64134J71141J75786J87071K02430K13055
$$ 4238035 4375117 4516515 4668015 4832149 5003290 5179076 5366147 5568577 5781632
58228E781632K21754K37820K58510K74200K87694L09126L35956L58291L79780
$$ 5781632 6003386 6241206 6499716 6773916 7061610 7370736 7706692 8064983 8444763
58219H444763M11921M51923M88578N25745N76093O36195O93409P52969Q30897
$$ 8444763 8856684 9308607 9797185 10322930 10899023 11535218 12228627 12981596 13812493
58210A3812493R24585J019949J123199J253745J410471J580217J775109K023048
$$ 13812493 14737078 15757027 16880226 18133971 19544442 21124659 22899768 24922816
58202B4922816K326230K672674L085155L611499M272234N074666O075946P369362
$$ 24922816 27249046 29921720 33006875 36618374 40890608 45965274 52041220 59410582
58194E9410582R015087J1065106J3651100J6939496K0985121K5733881L1101061
$$ 59410582 68425669 79490775 93141875 110081371 131066492 156800373 187901434
58187A87901434L6679854M1104066M1963145L6975268K5697233J0175408o101258
$$ 187901434 224581288 265685354 307648499 344623767 370321000 380496408 374395150
58180C74395150j9947307k9563363l4601676l5725742l4107358l0959026k7193215
$$ 374395150 354447843 324884480 290282804 254557062 220449704 189490678 162297463
58173A62297463k3351315j9736870j6523710j3765821j1424177r447107p803838
$$ 162297463 138946148 119209278 102685568 88919747 77495570 68048463 60244625
58166F0244625o445472n293063m286372l403968k618396j871844j118481l53510
$$ 60244625 53799153 48506090 44219718 40815750 38197354 36325510 35207029 34853519
58158C4853519M28401J263442K142841K894860L192053K741632J515295j87324
$$ 34853519 35281920 36545362 38688203 41583063 44775116 47516748 49032043 48844719
58150D8844719j901108l241641m042821m330134m224112l871801l411133k939653
$$ 48844719 46943611 43701970 39659149 35329015 31104903 27233102 23821969 20882316
58142B0882316k500706k106138j765625j486147j258825j067536r06769p77374
$$ 20882316 18381610 16275472 14509847 13023700 11764875 10697339 9790570 9013196
58134I013196o71637n78315m97598m36071l90537l51055l16426k92391k77100
$$ 9013196 8341559 7763244 7265646 6829575 6439038 6087983 5771557 5479166 5202066
58125E202066k62063k45653k32682k22097k07735j90072j75164j62815j47303
$$ 5202066 4940003 4694350 4461668 4239571 4031836 3841764 3666600 3503785 3356482
58116C356482j29051j14335j04049r3731q4065q0574q2876q4557q3734q3948q4849
$$ 3356482 3227431 3113096 3009047 2915316 2831251 2750677 2667801 2583244 2499510 2415562 2330713
58105B330713q1877p5452p0786o8291o3331n5907n1355n0815m9813m7038m5985
$$ 2330713 2248836 2173384 2102598 2034307 1970976 1915069 1863714 1812899 1763086 1716048 1670063
58094A670063m7063m6374m3298m1476m1403l9646l6027l4071l3759l1335k6970
$$ 1670063 1623000 1576626 1533328 1491852 1450449 1410803 1374776 1340705 1306946 1275611 1248641
58083A248641k5081k6295k6498k4657k4209k5729k5552k2869k1160k1313k0161
$$ 1248641 1223560 1197265 1170767 1146110 1121901 1096172 1070620 1047751 1026591 1005278 985117
58072I85117j7158j5701j6488j6103j3580j2047j2397j1666r179q049q992q736
$$ 985117 967959 952258 935770 919667 906087 894040 881643 869977 860798 852749 843757 835021
58060H35021o288m905o029o959o306o317p938q840q107p898q829q665o987o244
$$ 835021 828733 823828 817799 810840 804534 798217 790279 781439 773332 765434 756605 747940 740953 734709
58046G34709o808n911k976j039j404j735p89l13p95k01J683K308J248J284L190
$$ 734709 727901 721990 719014 717975 716571 714836 714047 713734 712939 712738 714421 716729 717977 719261 722451
58031G22451M104K592P29k70j917m469n757n490o196q390r355q296p988r580j0457
$$ 722451 726555 729147 729876 729606 727689 723220 717463 711973 705777 697387 688032 679736 671748 662168 651711
58016F51711r187p976q200p958o295n423o452p009n497l839l727l895l282l176
$$ 651711 642524 634548 626348 618390 612095 606672 600220 593211 587714 583875 580148 576253 572971 569795
58002E69795m108m283l266l509n999q025p547o207n835n463m136l165l099j743
$$ 569795 565687 561404 558138 554629 548630 540605 533058 526851 521016 515553 511417 508252 505153 503410
57988E03410K288P016J0284J2570J4456J4579J2326R677Q012O061L052Q64P03
$$ 503410 505698 512714 522998 535568 550024 564603 576929 586606 594618 600679 603731 604595 605298
57975F05298O56j000k871l315l409m541n650n493n280o467q027q349p863p596
$$ 605298 605954 604954 602083 598768 595359 590818 585168 579675 574395 567928 559901 551552 543689 536093
57961E36093p052n673m474m246m016l055k430k879l171k317j329j091o91O00J826
$$ 536093 529041 523368 518894 514648 510632 507577 505147 502268 499097 496780 495451 494360 493669 494269 496095
57946D96095K355L126M344M411K676Q72J67o33k394l856m370n467p693q810p469
$$ 496095 498450 501576 505920 510331 513007 513879 514046 513413 511019 507163 502793 497326 489633 480823 473354
57931D73354n912o429p728p582o659o707o965n482k540N0J746L059L770L630L474
$$ 473354 467442 461013 453285 445703 439044 432337 425372 419890 417350 417400 419146 422205 425975 429605 433079
57916D33079L798L633K610K378M018N937O425O401P361Q464Q096O707N717N005
$$ 433079 436877 440510 443120 445498 449516 455453 461878 468279 475640 484104 492200 498907 504624 509629
57902E09629L784K493J619J52k560m900n257m680n036n981o202o096o735p441
$$ 509629 513413 515906 517525 517677 515117 510217 504960 500280 495244 489263 483061 476965 470230 462789
57888D62789p037o317o720p550p087n544m444l846k650r64J29N88J162J746J956
$$ 462789 455752 449435 442715 435165 428078 422534 418090 414244 411594 410630 410759 411347 412509 414255 416211
57873D16211K558M321O259P021P087P635Q239P841P053P085P300O211M243L074
$$ 416211 418769 423090 429349 436370 443457 451092 459331 467172 474225 481310 488610 494821 499064 502138
57859E02138K742J825J97q54j156k031m014o062p256p708p797p791q091q570q188
$$ 502138 504880 506705 506902 506048 504892 502861 498847 492785 485529 477821 470024 462233 454142 445572 437384
57844D37384o466m642m020m054l613l095l455m025l571k679k918m029m326l612
$$ 437384 430918 426276 422256 418202 414589 411494 408039 404014 400443 397764 394846 390817 386491 382879
57830C82879l436m417n479n930o376p152p596p306o782o522o494o588o596n962
$$ 382879 379443 375026 369547 363617 357241 350089 342493 335187 328405 321883 315389 308801 302205 296243
57816B96243m556l348l164l330k757j745j284j196o28Q8p0p43m48J146K806L728
$$ 296243 291687 288339 285175 281845 279088 277343 276059 274863 274235 274323 274253 273510 273062 274208 277014 280742
57800B80742M407N471O954Q833J0989J2509J2277J0345P826N484L425J883J158
$$ 280742 285149 290620 297574 306407 317396 329905 342182 352527 360353 365837 369262 371145 372303
57787C72303R03M59k31r10j723k721l266l036k998m173n950o964p088p167p304
$$ 372303 373206 373665 373434 372524 370801 368080 364814 361778 358780 354607 348657 341693 334605 327438 320134
57772C20134o866n896n064m475l737k895k199j310J7J070J200J085J664K520K777
$$ 320134 313268 307372 302308 297833 294096 291201 289002 287692 287709 288779 289979 291064 292728 295248 298025
57757B98025K840L558M337L975K921K715L537M212M374M651M860M097K762K446
$$ 298025 300865 304423 308760 312735 315656 318371 321908 326120 330494 335145 340005 344102 346864 349310
57743C49310L526M662M942M812M541L682K541K456L823N282N671N496N791O538
$$ 349310 352836 357498 362440 367252 371793 375475 378016 380472 384295 389577 395248 400744 406535 413073
57729D13073P031P004O864P276Q763J1095J3129J3919J3874J4097J4921J5945
$$ 413073 420104 427108 433972 441248 450011 461106 474235 488154 502028 516125 531046 546991
57717E46991J7124J8686K0279K1378K2281K3645K5346K6965K8993L2208L6256
$$ 546991 564115 582801 603080 624458 646739 670384 695730 722695 751688 783896 820152
57706H20152M0256M4463M9817N6170O2597O9253P7244Q6768R7093J08305J21316
$$ 820152 860408 904871 954688 1010858 1073455 1142708 1219952 1306720 1403813 1512118 1633434
57695A633434J36097J51635J67657J84566K01513K16253K27131K33236K32390
$$ 1633434 1769531 1921166 2088823 2273389 2474902 2691155 2918286 3151522 3383912
57686C383912K21155J97789J63693J21402P3019K1369k9074p3874j10362j37197
$$ 3383912 3605067 3802856 3966549 4087951 4160970 4182339 4153265 4079391 3969029 3831832
57676C831832j53544j59532j56434j45573j27828j04531p7558m8330j8439P719
$$ 3831832 3678288 3518756 3362322 3216749 3088921 2984390 2906832 2858502 2840063 2847782
57666B847782K2488J8929m413m2354q5350j23011j47788j57587j55188j44866
$$ 2847782 2870270 2889199 2884786 2842432 2757082 2634071 2486283 2328696 2173508 2028642
57656B028642j29903j12750r5693q0111o5962n2676m0127k8467j7871q655q66
$$ 2028642 1898739 1785989 1690296 1610185 1544223 1491547 1451420 1422953 1405082 1396427 1395561
57645A395561O367J4091K2162K9787L7358M6266N6736O7543P8294R0249J04232
$$ 1395561 1401928 1416019 1438181 1467968 1505326 1551592 1608328 1675871 1754165 1844414 1948646
57634A948646J19311J34400J49610J64924J78925J89868J96822J98655J93160
$$ 1948646 2067957 2202357 2351967 2516891 2695816 2885684 3082506 3281161 3474321
57625C474321J78319J53705J19892P7872L0154j8828o4879j05979j41138j68566
$$ 3474321 3652640 3806345 3926237 4004109 4034263 4015435 3950556 3844577 3703439 3534873
57615C534873j86499j95243j96939j93645j86647j77161j66395j54961j42977
$$ 3534873 3348374 3153131 2956192 2762547 2575900 2398739 2232344 2077383 1934406
57606A934406j30656j18322j06274r5134q5701p7897p0593o3144n6329n1005m6651
$$ 1934406 1803750 1685428 1579154 1484020 1398319 1320422 1249829 1186685 1130356 1079351 1032700
57595A032700m2183l7614l3848l1240k9338k7701k6161k4476k2446k0224j8093
$$ 1032700 990517 952903 919055 887815 858477 830776 804615 780139 757693 737469 719376
57584G19376j6155j4545j3478j2679j1477r768q238p221o177m815l826l703l701
$$ 719376 703221 688676 675198 662519 651042 641274 633036 625815 619638 614823 610997 607294 603593
57571F03593k846j389k98K09Q19K167M314O782Q654R279R278J0150J2289J4411
$$ 603593 600747 599358 599060 599269 600088 602255 606569 613351 622005 631284 640562 650712 663001 677412
57557F77412J5531J6406J8163K0525K2603K4584K7304L0804L4578L8785M3919
$$ 677412 692943 709349 727512 748037 770640 795224 822528 853332 887910 926695 970614
57546I70614M9675N5459O1668O9220P7994Q7084R6462J07036J18941J30926J41791
$$ 970614 1020289 1075748 1137416 1206636 1284630 1371714 1468176 1575212 1694153 1825079 1966870
57535A966870J51261J59018J63668J63149J55712J40427J17303Q7363N2294J4007
$$ 1966870 2118131 2277149 2440817 2603966 2759678 2900105 3017408 3104771 3157065 3171072
57525C171072k5208o2410r4639j20060j38213j49357j54094j53511j49049j41937
$$ 3171072 3145864 3083454 2988815 2868755 2730542 2581185 2427091 2273580 2124531 1982594
57515A982594j32962j22681j11613j00303q9432p9574p0679o2183n3929m6540
$$ 1982594 1849632 1726951 1615338 1515035 1425603 1346029 1275350 1213167 1159238 1112698
57505A112698m0485l5267l0163k5288k1225j7903j4585j0823o813k879Q40M270
$$ 1112698 1072213 1036946 1006783 981495 960270 942367 927782 916959 910146 907267 908107 912377
57493I12377P426J0535J3837J7367K1173K5427L0125L5088M0501M6891N4199O1622
$$ 912377 919803 930338 944175 961542 982715 1008142 1038267 1073355 1113856 1160747 1214946 1276568
57481A276568O8879P6943Q6832R8206J09991J21696J33139J43345J50728J54116
$$ 1276568 1345447 1422390 1509222 1607428 1717419 1839115 1972254 2115599 2266327 2420443
57471B420443J52557J44466J28181J03522P1992L5566l785m3445q0264j11690
$$ 2420443 2573000 2717466 2845647 2949169 3021161 3056727 3052942 3009497 2929233 2817543
57461B817543j36253j53048j61851j63928j61584j56337j48292j37746j26385
$$ 2817543 2681290 2528242 2366391 2202463 2040879 1884542 1736250 1598504 1472119
57452A472119j16009j06614r6851q6264p6127o7820o1191n5118m9218m4194m0479
$$ 1472119 1356110 1249496 1152645 1066381 990254 922434 861243 806125 756907 712713 672234
57441F72234l7373l4038l0679k8012k5907k3560k0877j8663j7175j5620j3545
$$ 672234 634861 600823 570144 542132 516225 492665 471788 453125 435950 420330 406785
57430D06785j1782j1201j1340j1124j0365r646r189q677q021p451p071o878p009
$$ 406785 395003 383802 372462 361338 350973 341327 332138 323461 315440 307989 300918 294040 287031
57417B87031p316p082n911m575m084m214l848k679j629j476j901k200k229k300
$$ 287031 279715 272633 266722 262147 258063 253849 250001 247322 245693 244217 242316 240116 237887 235587
57403B35587k567k805k651j969j061m31k01q8l1l18q23p63J92J171J177M03k96
$$ 235587 233020 230215 227564 225595 224534 224103 223902 223814 223783 223465 222642 221879 222071 223242 224419 224822 224526
57386B24526o92j024r98j35J074J508R67L51J90M2m26p24l85K04L00l07j212j788
$$ 224526 223834 222810 221812 221677 222751 224259 225226 225577 225767 225809 225383 224659 224274 224478 224778 224471 223259 221471
57368B21471j544n22N22P69K10n23j112j729k299k350j760j014m84l2M14N21J88
$$ 221471 219927 219405 219927 220696 220906 220383 219271 217542 215243 212893 211133 210119 209635 209603 210017 210538 210726
57351B10726m5L55J067J228N31l53m89K48R97R43L28R5N47R71Q52P13J260K231
$$ 210726 210681 211036 212103 213331 213862 213509 213020 213268 214265 215208 215536 215631 216178 217149 218001 218714 219974 222205
57333B22205K785K665K209J546O06k77n67k45K34O79J206J777K285K946L927M846
$$ 222205 224990 227655 229864 231410 232016 231739 231172 230927 231161 231840 233046 234823 237108 240054 243981 248827
57317B48827N305N626O318P107P362P188P142P084O536N972O459P949R182R656
$$ 248827 254132 259758 266076 273183 280545 287733 294875 301959 308495 314467 320926 328875 338057 347713
57303C47713J0312J1853J3587J4685J5477J6681J8156J9388K0482K1849K3241
$$ 347713 358025 369878 383465 398150 413627 430308 448464 467852 488334 510183 533424
57292E33424K4082K4457K4930K5509K5446K4208K2103J9792J7414J4465J0451
$$ 533424 557506 581963 606893 632402 657848 682056 704159 723951 741365 755830 766281
57281G66281N545L54m954j0812j7264k3223k7337k9413l0322l0661l0236k8867
$$ 766281 771826 772180 767226 756414 739150 715927 688590 659177 628855 598194 567958 539091
57269E39091k6918k4818k2649k0468j8472j6683j4888j3015j1174r383p723o649
$$ 539091 512173 487355 464706 444238 425766 409083 394195 381180 370006 360623 352900 346251
57257C46251o498o720o337n168l914l010k200j396j069j398j815j764j361r36
$$ 346251 339753 333033 326696 321528 317614 314604 312404 311008 309939 308541 306726 304962 303601 302665
57243C02665n06n8J71Q4k2J41M55O47N59J22n26r03o21O6N87Q14R61R39N55J94
$$ 302665 302159 302101 302272 302356 302334 302475 302930 303577 304136 304258 303732 302829 302208 302274 302861 303675 304636 305575 306130 306324
57223C06324M02R36J055P86Q69J428J778J698J800K376K930L221L702M508N022
$$ 306324 306726 307662 308717 309503 310372 311800 313578 315276 317076 319452 322382 325603 329305 333813 338835
57208C38835M962M902N179N244M726M246M483N106N330M968M349L783L582M008
$$ 338835 343797 348699 353878 359122 363848 368094 372577 377683 383013 387981 392330 396113 399695 403703
57194D03703M821N418N734O332P407Q446R164R923J0845J1537J2020J2952J4479
$$ 403703 408524 413942 419676 426008 433415 441861 451025 460948 471793 483330 495350 508302 522781
57181E22781J5852J6740J7831J9601K1458K2776K3674K4197K3857K2809K2387
$$ 522781 538633 555373 573204 592805 614263 637039 660713 684910 708767 731576 753963
57170G53963K3455K5205K6502K7403K8385K9031K8797K8261K8377K9036K9470
$$ 753963 777418 802623 829125 856528 884913 913944 942741 971002 999379 1028415 1057885
57159A057885K9584K9811L0216L0688L1608L3304L5265L6849L8347M0521M3484
$$ 1057885 1087469 1117280 1147496 1178184 1209792 1243096 1278361 1315210 1353557 1394078 1437562
57148A437562M6786N0178N3465N6077N7581N8268N8744N9467O1122O4518O9347
$$ 1437562 1484348 1534526 1587991 1644068 1701649 1759917 1818661 1878128 1939250 2003768 2073115
57137B073115P3798P6093P5615P2028O4675N4026M2699L3608K7635K4058K2404
$$ 2073115 2146913 2223006 2298621 2370649 2435324 2489350 2532049 2565657 2593292 2617350 2639754
57126B639754K2581K3996K5831K7920L0345L2728L4801L7028L9777M2641M5417
$$ 2639754 2662335 2686331 2712162 2740082 2770427 2803155 2837956 2874984 2914761 2957402 3002819
57115C002819M8924N3886N9887O6331P3516Q1833R0970J00858J12318J25797J40808
$$ 3002819 3051743 3105629 3165516 3231847 3305363 3387196 3478166 3579024 3691342 3817139 3957947
57104C957947J57589J77887K03046K32881K67722L09817L61504M23867M98704
$$ 3957947 4115536 4293423 4496469 4729350 4997072 5306889 5668393 6092260 6590964
57095F590964N89703P00105Q31185R84347J161652J362039J579528J806654K036036
$$ 6590964 7180667 7880772 8711957 9696304 10857956 12219995 13799523 15606177 17642213
57086A7642213K256851K455204K621131K749518K831705K858129K838700K805188
$$ 17642213 19899064 22354268 24975399 27724917 30556622 33414751 36253451 39058639
57078C9058639K765949K654776K350832J773058R56578L3578q51907j608018k200219
$$ 39058639 41824588 44479364 46830196 48603254 49559832 49593410 48741503 47133485 44933266
57069D4933266k627894k906528l057570l100270l050335k925662k748417k539551
$$ 44933266 42305372 39398844 36341274 33241004 30190669 27265007 24516590 21977039
57061B1977039k314693k086147j864491j656322j463736j287733j129839r89913
$$ 21977039 19662346 17576199 15711708 14055386 12591650 11303917 10174078 9184165
57053I184165q65661p55700o60551n79644n10050m49320l97121l52981l14826
$$ 9184165 8318504 7562804 6902253 6322609 5812559 5363239 4966118 4613137 4298311
57044D298311k81032k51796k27172k05713j86232j69103j54490j41008j27493
$$ 4298311 4017279 3765483 3538311 3332598 3146366 2977263 2822773 2681765 2554272
57035B554272j14689j03870r4954q7162q0414p4851o9872o4794n9859n5739n2506
$$ 2554272 2439583 2335713 2240759 2153597 2073183 1998332 1928460 1863666 1803807 1748068 1695562
57024A695562m9688m6772m3346l9372l5574l2791l0771k8468k5611k2901k0527
$$ 1695562 1645874 1599102 1555756 1516384 1480810 1448019 1417248 1388780 1363169 1340268 1319741
57013A319741j7708j4108j0439p130l481J296P264J4599K4138L6386N0970O7978
$$ 1319741 1302033 1287925 1277486 1270356 1266875 1268171 1275435 1290034 1314172 1350558 1401528 1469506
57001A469506Q8676J13147J36728J49558J40875J05522M8236j7821p7838j22275
$$ 1469506 1558182 1671329 1808057 1957615 2098490 2204012 2252248 2234427 2156589 2034314
56991B034314j48630j58490j54879j41989j24833j07139r0020p3368n7909m5085
$$ 2034314 1885684 1727194 1572315 1430326 1305493 1198354 1108334 1034966 977057 931972
56981I31972l5694k9589k6358k5450k5824k6215k5889k4829k3299k1445j9224
$$ 931972 896278 866689 840331 814881 789057 762842 736953 712124 688825 667380 648156
56970F48156j6545j3563j0818q751p155n453l468j467N66L164O800J1455J6740
$$ 648156 631611 618048 607230 598479 591324 585871 582403 580936 581502 584666 591466 602921 619661
56957F19661K1856K5400K5716K1844J4029L556p582j7174k3724k7063k7732k6130
$$ 619661 641517 666917 692633 714477 728506 732062 724480 707306 683582 656519 628787 602657
56945F02657k2793j9049j6293j4521j2453r263n425j750J590M868Q299J2118J6606
$$ 602657 579864 560815 544522 530001 517548 508285 502860 501110 502700 507568 515867 527985 544591
56932E44591K1702K6832L1029L2829L0404K2678J0562l408j6555k6885l3120l5161
$$ 544591 566293 593125 624154 656983 687387 710065 720627 717219 700664 673779 640659 605498
56920F05498l4471l2838l0689k7444k3425k0047j7953j6242j4073j1810j0009
$$ 605498 571027 538189 507500 480056 456631 436584 418631 402389 388316 376506 366497
56909C66497q412o717n315m463l552k140r62r20j543j512m61O90J116R79R16J314
$$ 366497 358085 351368 346053 341590 338038 335898 334936 334016 332473 330961 330500 331190 332306 333285 334201 335515
56893C35515K306L964O152Q415J0317J1935J3843J6416J9029K0136J8447J3954
$$ 335515 337821 341785 347937 356352 366669 378604 392447 408863 427892 448028 466475 480429
56881D80429P792J271m682r475j2753j4399j4428j3006j0708q331o156l728p81
$$ 480429 488221 489492 484810 475335 462582 448183 433755 420749 410041 401710 395554 391826 391045
56868C91045K187M781P600J1503J6444K1868K7865L4892M2372M8429N0841M7779
$$ 391045 393232 398013 405613 417116 433560 455428 483293 518185 560557 608986 659827 707606
56856G07606L8175K2765M657j2187k5312l4160l8748l9212l6491l2065k6717k0467
$$ 707606 745781 768546 773203 761016 735704 701544 662796 623584 587093 555028 528311 507844
56844E07844j3686p249j468M088R792J5884K3086L2107M2623N3873O5778P7676
$$ 507844 494158 486909 485441 489529 499321 515205 538291 570398 613021 666894 732672 810348
56832H10348Q5806Q4211O9344M3103J1232k0060m5842o3178p1739p3253o9726
$$ 810348 896154 980365 1049709 1092812 1104044 1083984 1038142 974964 903225 829972 760246
56821G60246o2645n3658m4499l5772k7087j8679j1505n306J715J0500J9929K8857
$$ 760246 697601 643943 599444 563672 536585 517906 506401 501095 502810 513310 533239 562096
56809E62096L7938M8118N8268O5281O5757N7205L9194J4661j0855l2402m7763
$$ 562096 600034 648152 706420 771701 837458 894663 933857 948518 937663 905261 857498
56798H57498n6552n8954n6257n1079m5536l9916l3912k7959k2432j6849j1045
$$ 857498 800946 741992 685735 634656 589120 549204 515292 487333 464901 448052 437007
56787D37007n899j755K645Q343J4564K0242K5718L1051L3859L0982K1953R176
$$ 437007 431108 429353 431998 440341 454905 475147 500865 531916 565775 596757 618710 627886
56775F27886m684j7784k8203l4255l6024l5181l3083l0047k6295k2457j9047j6292
$$ 627886 623202 605418 577215 542960 506936 471755 438672 408625 382330 359873 340826 324534
56763C24534j4265j2482j0013o856m524m197m959n067m255l489l075k580k099
$$ 324534 310269 297787 287774 280918 276394 272197 267238 262171 257916 254427 251352 248772 246673
56750B46673k138k431k327k043k231k586k349j799j823k243k104j445j237j658
$$ 246673 244535 242104 239777 237734 235503 232917 230568 228769 226946 224703 222599 221154 219917 218259
56736B18259j886j698j726k087k224k176k555l054k523q87M49N53N1k66n95j221
$$ 218259 216373 214675 212949 210862 208638 206462 203907 200853 198330 197443 197892 198445 198496 198230 197635 196414
56720A96414j599j160k90K31K25N5M3K88O77Q36M61k45q28j128j162q04j66O1
$$ 196414 194815 193655 193365 193596 193821 193876 193919 194207 194884 195720 196181 195936 195108 193980 192818 192014 191848 191909
56702A91909n22j194j031l19n5l29l55P7L63L17L92N97L21m83r91p08q4L34N61
$$ 191909 191387 190193 189162 188843 188788 188459 188104 188181 188544 188861 189253 189850 190171 189688 188697 187989 187905 188239 188800
56683A88800P42P61N95M38L90M68P68J091P05p06k226k739k405k131j974j353
$$ 188800 189542 190303 190898 191336 191726 192194 192962 194053 194758 194052 191826 189087 186682 184551 182577 181224
56667A81224n07l89j000j301q57l52k79l45m12p58j203j096n16l02o10o70k28
$$ 181224 180717 180328 179328 178027 177170 176818 176539 176194 175782 175024 173821 172725 172209 171907 171297 170627 170399
56650A70399m3m46o94k90J72J87K08O59J003N75l57j157j687k026j962j427r16
$$ 170399 170356 169910 169216 168926 169098 169285 169493 170152 171155 171730 171373 170216 168529 166503 164541 163114 162198
56633A62198q05p14q5Q89J416R95j09j084j171l66M84O57M05L92N65M18J07L70
$$ 162198 161393 160679 160594 161483 162899 163894 163785 162701 161530 161164 161648 162305 162710 163102 163667 164085 164192 164562
56615A64562J251J886J681R45K08k44j10P31J662J733R10P1k45l50n37o47o79
$$ 164562 165813 167699 169380 170325 170533 170289 170179 170910 172572 174305 175215 175286 175041 174691 174154 173507 172828
56598A72828r05j181j015m20Q8M64J095J688J336pj129j075k01O40J122J321J344
$$ 172828 171923 170742 169727 169307 169395 169859 170954 172642 173978 173971 172842 171767 171566 172206 173328 174649 175993
56581A75993J494K036K607K541J984J810K250K583K396K181K327K552K709L257
$$ 175993 177487 179523 182130 184671 186655 188465 190715 193298 195694 197875 200202 202754 205463 208720
56567B08720M362N393N827N960O247O648P053P712Q746R756J0250J0047R125P637
$$ 208720 213082 218475 224302 230262 236509 243157 250210 257922 266668 276424 286674 296721 305846 313483
56553C13483O195N444N275N019M415L689K771J341l41j556k231k986m051n046
$$ 313483 319678 325122 330397 335416 339831 343520 346291 347632 347291 345735 343504 340518 336467 331421
56539C31421n883o922q120q954r343r646r748r175q119p242o438n079l538l033
$$ 331421 325538 318616 310496 301542 292199 282553 272805 263630 255511 248269 241831 236752 233214 230181
56525B30181l694m187l699k921k566k290j737j412j744k297k595k809l021k771
$$ 230181 226487 222300 218601 215680 213114 210824 209087 207675 205931 203634 201039 198230 195209 192438
56511A92438j919j097p37m79q9j9n99j394j843j816j319m56J95J12j62L22J208
$$ 192438 190519 189422 188685 188206 188117 188098 187499 186105 184262 182446 181127 180671 180866 180978 180816 181138 182346
56494A82346J130l9p21L5J221J542J162Q89Q06O09N01Q17J314J496J220P32N37
$$ 182346 183476 183437 182716 182751 183972 185514 186676 187565 188371 188980 189481 190298 191612 193108 194328 195060 195597
56477A95597J239K737L777L236J735Q53R59J090Q36P71J068J298J682K849M210
$$ 195597 196836 199573 203350 206586 208321 209174 210133 211223 212059 212830 213898 215196 216878 219727 223937
56462B23937M359L288K502K630K803K615K739L153K781J489M55K7o98j702j688
$$ 223937 228296 231584 234086 236716 239519 242134 244873 248026 250807 252296 252751 252778 252080 250378 248690
56447B48690n57J01k34k02O25P49k19l11J394K784K062O07L40N00m94j901k058
$$ 248690 248133 248234 248000 247798 248423 249172 248953 248642 250036 252820 254882 255489 255829 256329 255835 253934 251876
56430B51876j369j411k216k763l080l679l959l334k834l592m662m470l380k772
$$ 251876 250507 249096 246880 244117 241037 237358 233399 230065 227231 223639 218977 214507 211127 208355
56416B08355k535j672n40l13p99r01o35o85o25L96J654J643M96k26P7N48N84L76
$$ 208355 205820 204148 203608 203295 202496 201595 200960 200275 199650 200046 201700 203343 203839 203613 203690 204238 204822 205198
56398B05198On20o49N7R69J298J386J804K028J358M28L39Q95J196J231J442J510
$$ 205198 205204 204684 204035 204092 205061 206359 207745 209549 211577 212935 213363 213702 214597 215793 217024 218466 219976
56381B19976J068Q59J607K480K265J385J077J298J152P93J107J927K223J834J456
$$ 219976 221044 221903 223510 225990 228255 229640 230717 232015 233167 233960 235067 236994 239217 241051 242507
56366B42507J327J174J109J276J158M26j72N0N05M72M91J244J995J681P68M69
$$ 242507 243834 245008 246117 247393 248551 248977 248805 248855 249360 249832 250323 251567 253562 255243 256011 256480
56350B56480R38J560K199K738K466J387R76K128L493L520K901L104L751L516K619
$$ 256480 257418 258978 261177 263915 266381 267768 268744 270872 274365 277885 280786 283890 287641 291157 293776
56335B93776K310K694L077L605M642N428N246M993N720O643O570O091O227O230
$$ 293776 296086 298780 301857 305462 310104 315532 320778 325771 331491 338134 344704 350795 357022 363252
56321C63252N041L713L801M422L639J769N51n7j306k624k306q97o56j851k466
$$ 363252 368293 372006 375807 380229 383868 385637 386188 386131 384825 382201 379895 378998 378342 376491 374025
56306C74025j750j182j587j927j433p22k90J10M88P07J432L191M876N173M788
$$ 374025 372275 371093 369506 367579 366146 365424 365134 365244 365732 366439 367871 371062 375938 381111 385899
56291C85899N259O232O381O245P398R317R954R289R360J0832J2354J3440J5145
$$ 385899 391158 397390 403771 410016 417414 426731 436685 445974 455334 466166 478520 491960 507105
56278E07105J7528J9179J9745K0564K2320K4283K6171K8623L1560L4244L7083
$$ 507105 524633 543812 563557 584121 606441 630724 656895 685518 717078 751322 788405
56267G88405M1335M6947N2743N8659O5651P3553Q1287Q9011R7740J07046J15441
$$ 788405 829740 876687 929430 988089 1053740 1127293 1208580 1297591 1395331 1502377 1617818
56256A617818J22805J29929J36045J39414J40132J39520J36930J30066J18547
$$ 1617818 1740623 1870552 2006597 2146011 2286143 2425663 2562593 2692659 2811206
56247B811206J04331Q8476P0462N0930L2196J5475J06j4083k6116l5753m3637
$$ 2811206 2915537 3004013 3074475 3125405 3157601 3173076 3173182 3159099 3132983 3097230 3053593
56236C053593m9464n2604n4348n6884o0099o2261o3734o6882p2120p7292q1270
$$ 3053593 3004129 2951525 2897177 2840293 2780194 2717933 2654199 2587317 2515197 2437905 2356635
56225B356635q5076q9012r1816r3267r4566r5540r4420r0991q7180q3901q0178
$$ 2356635 2271559 2182547 2090731 1997464 1902898 1807358 1712938 1621947 1534767 1450866 1370688
56214A370688p5820p1997o8629o4123n8337n3011m8679m3955l8428l3398k9338
$$ 1370688 1294868 1222871 1154242 1090119 1031782 978771 930092 886137 847709 814311 784973
56203G84973k5356k1583j9165j7705j5647j3369j2671j3104j2191r660p826p385
$$ 784973 759617 738034 718869 701164 685517 672148 659477 646373 634182 624522 616696 609311
56191F09311o475m561l506l884l806k372r19L8J700L983N076M782M925N727N374
$$ 609311 602836 598275 594769 590885 587079 584707 583788 583826 585526 589509 594585 599367 604292 610019 615393
56176F15393L827L311M224M406L307K924L658L343J578R00K272L443L127K805
$$ 615393 619220 622531 626755 631161 634468 637392 641050 644393 645971 646871 649143 652586 655713 658518
56162F58518K979J869n28j257Q56L189L855M321N820P023P301Q451J1242J3785
$$ 658518 661497 663366 662838 661581 662437 665626 669481 673802 679622 686645 693946 702397 713639 727424
56148G27424J5199J7301K1070K5195K9685L6987M7833N9838P1766Q5036R9498
$$ 727424 742623 759924 780994 806189 835874 872861 920694 980532 1052298 1137334 1236832
56137A236832J12186J21944J30790J38704J41740J37495J27996J15318R9254Q1726
$$ 1236832 1349018 1470962 1601752 1740456 1882196 2019691 2147687 2263005 2362259 2443985
56127B443985O8205O1455N8040N3659M7661L9865K8174J2742j904j2291j9689
$$ 2443985 2512190 2573645 2631685 2685344 2733005 2772870 2801044 2813786 2811882 2799591 2779902
56116B779902k5915l0252l3534m0364n3526p0187q6652j02376j16353j24590j25075
$$ 2779902 2753987 2723735 2690201 2649837 2596311 2526124 2439472 2337096 2220743 2096153 1971078
56105A971078j20923j15141j06661r4898q3338p4612o6581n7154m8538m2815l7883
$$ 1971078 1850155 1735014 1628353 1533455 1450117 1375505 1308924 1251770 1203232 1160417 1122534
56094A122534l1766k6461k3532k0464j5511j1554j0883j0750q369n768n197m459
$$ 1122534 1090768 1064307 1040775 1020311 1004800 993246 982363 971613 963244 957476 952279 947820
56082I47820j409J487J768J706L722N572M845L765M800N967N262N182P770R867
$$ 947820 946411 947898 949666 951372 955094 960666 965511 969276 974076 980043 985305 990487 998257 1008124
56068A008124Q499O576P923J0887J2067J2193J3211J3801J2700J2278J4003J4959
$$ 1008124 1016623 1023199 1031122 1042009 1054076 1066269 1079480 1093281 1105981 1118259 1132262 1147221
56056A147221J3365J2540J4684J6258J4612J3394J5772J8281J7322J5949J7874
$$ 1147221 1160586 1173126 1187810 1204068 1218680 1232074 1247846 1266127 1283449 1299398 1317272
56045A317272K0528K0590K0666K3710K6453K5383K3733K5588K8496K8776K8548
$$ 1317272 1337800 1358390 1379056 1402766 1429219 1454602 1478335 1503923 1532419 1561195 1589743
56034A589743L0509L1634K9251K7401K9926L3291L3563L3926L7736M1029M0074
$$ 1589743 1620252 1651886 1681137 1708538 1738464 1771755 1805318 1839244 1876980 1918009 1958083
56023A958083L9306M3247M7673M7636M6943N0434N4344N4091N4039N9208O4918
$$ 1958083 1997389 2040636 2088309 2135945 2182888 2233322 2287666 2341757 2395796 2455004 2519922
56012B519922O5365O4891O9550P5187P5622P5092Q0358Q7848R1011R3067R9849
$$ 2519922 2585287 2650178 2719728 2794915 2870537 2945629 3025987 3113835 3204846 3297913 3397762
56001C397762J07606J10841J14380J24327J35204J39767J43104J52626J63059
$$ 3397762 3505368 3616209 3730589 3854916 3990120 4129887 4272991 4425617 4588676
55992D588676J66618J68849J78364J90251J96434K02795K18352K37325K50532
$$ 4588676 4755294 4924143 5102507 5292758 5489192 5691987 5910339 6147664 6398196
55983F398196K64223K88147L15797L37146L59718L94967M35571M69757N06004
$$ 6398196 6662419 6950566 7266363 7603509 7963227 8358194 8793765 9263522 9769526
55974I769526N58219O19200O75754P36991Q18566R12915J006554J112247J250132
$$ 9769526 10327745 10946945 11622699 12359690 13178256 14091171 15097725 16209972 17460104
55965A7460104J412843J586616J790159K051660K366232K722746L153676L707712
$$ 17460104 18872947 20459563 22249722 24301382 26667614 29390360 32544036 36251748
55957C6251748M396924N232157O286763P657655R396346J1565689J4325246J7840515
$$ 36251748 40648672 45880829 52167592 59825247 69221593 80787282 95112528 112953043
55949A12953043K2134714K7145559L2777799L8464049M2486473M2163959L5397784
$$ 112953043 135087757 162233316 195011115 233475164 275961637 318125596 353523380
55942C53523380K2397981N897580j0354072k3396769l1862306l5771272l6004478
$$ 353523380 375921361 381818941 371464869 348068100 316205794 280434522 244430044
55935B44430044l3809137l0358668k6472335k2618362j9066182j5962087j3328416
$$ 244430044 210620907 180262239 153789904 131171542 112105360 96143273 82814857
55928H2814857j1113564r272806p774122o557482n549099m709204m024206l464180
$$ 82814857 71701293 62428487 54654365 48096883 42547784 37838580 33814374 30350194
55920C0350194k988459k582060k248205j973014j731323j518656j344834j202956
$$ 30350194 27361735 24779675 22531470 20558456 18827133 17308477 15963643 14760687
55912A4760687j074346r57302q62530p86013p12955o43142n87293n42983m97841
$$ 14760687 13686341 12729039 11866509 11080496 10367541 9724399 9137106 8594123 8096282
55903H096282m52255m16419l88896l59230l28183l05047k88382k68570k46187
$$ 8096282 7644027 7227608 6838712 6479482 6151299 5846252 5557870 5289300 5043113
55894E043113k29485k17057k00813j82775j71564j65263j54746j41131j33219
$$ 5043113 4813628 4596571 4395758 4212983 4041419 3876156 3721410 3580279 3447060
55885C447060j30190j23220j12317j05693j03827r9340r1543q6714q4837p9838
$$ 3447060 3316870 3193650 3081333 2975640 2871813 2772473 2680930 2594216 2509379 2429541
55875B429541p2140o7830o6331o1567n4416n1624n3222n2938n0016m8989m8988
$$ 2429541 2357401 2289571 2223240 2161673 2107257 2055633 2002411 1949473 1899457 1850468 1801480
55864A801480m4959l8380l5306l4806l0558k2866j7811j5580j1068n339n013j0337
$$ 1801480 1756521 1718141 1682835 1648029 1617471 1594605 1576794 1561214 1550146 1544807 1539794 1529457
55852A529457j4833j6901k1057k7444l0734l0190l0771l3490l4145l2322l2348
$$ 1529457 1514624 1497723 1476666 1449222 1418488 1388298 1357527 1324037 1289892 1257570 1225222
55841A225222l4559l4621l2199l1531l2861l1899k8355k6427k6335k3936j9335
$$ 1225222 1190663 1156042 1123843 1092312 1059451 1027552 999197 972770 946435 922499 903164
55830I03164j7339j8498j8044j4705j2464j2551j1683r385r214j1407j1836r671
$$ 903164 885825 867327 849283 834578 822114 809563 797880 788495 779281 767874 756038 746367
55818G46367q749j0060j0005p498n838o128n577l648l320m939n263l801l835o053
$$ 746367 737618 727558 717553 710055 704217 698089 692512 688864 685544 680605 675342 671541 667706 661653
55804F61653p379p114p895r657r041n980m505n816o695o066o799r637j1492j1350
$$ 661653 654274 647160 639265 629608 620567 614587 610082 604266 597571 591505 584706 575069 563577 552227
55790E52227j1883j3553j3105r691o827o321n635l170j011n77m69m29k597p101
$$ 552227 540344 526791 513686 503995 497168 490847 485212 482042 481031 480454 479985 479556 476959 469858
55776D69858j0912j2519j3560j4672j4312j2626j1950j2426j1635r351q124q364
$$ 469858 458946 446427 432867 418195 403883 391257 379307 366881 355246 345895 337771 329407
55764C29407p699n908n528o751o735n010m404n600n824m235l468m449m692l276
$$ 329407 321708 315800 310272 303521 296786 291776 287372 281772 275948 271713 268245 263796 259104 255828
55750B55828k556l238k553P70M207N847O849P873P321M813K385P90j406m009m699
$$ 255828 253272 250034 247481 248251 252458 258305 265154 273027 280348 285161 287546 288336 286930 282921 278222
55735B78222l465l130m308m343k427j132j495j361j76n38l053m430k981j513k413
$$ 278222 274757 271627 267319 262976 260549 259417 257922 256561 256385 255847 252794 248364 245383 243870 241457
55720B41457l963m007l415l453l303k420k059k439j710N72K224K235K384L626
$$ 241457 237494 233487 230072 226619 223316 220896 218837 216398 214688 215260 217484 219719 222103 225729
55706B25729M493M486N332P346Q314P426O563O240M408P87j787k211l038n632
$$ 225729 230222 234708 240040 247386 255700 263126 269689 275929 280337 281124 279337 277126 274088 268456
55692B68456p571p134o292o768p041n765m403l935k631L42K612K605K325L527
$$ 268456 260885 253751 247459 240691 233650 227885 223482 219547 216916 217258 219870 222475 224800 228327
55678B28327M500L445J813J472J513O65J9O45J195M77k07L39Q44J55n61l74n98
$$ 228327 232827 236272 238085 239557 241070 241735 241754 242399 243594 244071 243864 244203 245047 245202 244641 244267 243669
55661B43669j926k480j059L94N5q20o19k93j039j730j258r05j904l016l029l172
$$ 243669 241743 239263 238204 238598 238653 237833 237214 236921 235882 234152 232894 231989 230085 227069 224040 220868
55645B20868m575n836n601n131n825o567o106n599o184o447n009l370l364l965
$$ 220868 216293 210457 204856 199725 193900 187333 181227 175628 169444 162997 157988 154618 151254 147289
55631A47289l416k444k508k735j660k83n24j906k468j852j080m78P3o3j205k260
$$ 147289 143873 141429 138921 136186 134526 134243 133719 131813 129345 127493 126413 125935 126008 125945 124740 122480
55615A22480k275j881j745j321m70l52j282j744j073q56j937k556j366N6p9r00
$$ 122480 120205 118324 116579 115258 114788 114436 113154 111410 110337 109481 107544 104988 103622 103678 103599 102699
55599A02699q95n80q39p95L16J173N97j78K55R81P38K75M86K82j215k426j804
$$ 102699 101804 101224 100385 99590 99906 101079 101676 101498 101753 102734 103472 103747 104233 104515 103300 100874 99070
55582I9070o07p16j531j568j211j321j022M97J791J351L15L51P11Lr08n94J60
$$ 99070 98463 97747 96216 94648 93437 92116 91094 91591 93382 94733 95048 95399 96110 96113 95205 94611 94771
55565I4771M4k9J182K318J487j94l35P44R19K3l98k28o29j486j765j697k012j888
$$ 94771 94815 94786 95968 98286 99773 99579 99244 99988 100907 100930 100532 100304 99675 98189 96424 94727 92715 90827
55547I0827l06J512J722J053J593L135L655K807K156K285K297K019K180K564K180
$$ 90827 90521 92033 93755 94808 96401 99536 103191 105998 108154 110439 112736 114755 116935 119499 121679
55532A21679J195O97Q02Q00O86Q36P63j32j209j638j883k532k829k144j690k698
$$ 121679 122874 123571 124373 125173 125859 126695 127458 127326 126117 124479 122596 120064 117235 115091 113401 110703
55516A10703m127m235l361k952l060k937k934l505l536k046m07m51j512j756j286
$$ 110703 106576 102341 98980 96028 92968 90031 87097 83592 80056 78010 77603 77152 75640 73884 72598
55501G2598j340j615j093m61r31j661j170l75j137k654k567j012l44j113j525
$$ 72598 71258 69643 68550 68089 67158 65497 64327 63952 62815 60161 57594 56582 56238 55125 53600
55486E3600q38k25j04M18J189R06l19p98j18K74k88p26l18K52L73K45o3o38q67
$$ 53600 52762 52537 52433 52851 54040 54946 54627 53829 53711 53985 53697 52971 52653 52905 53278 53523 53460 52822 51955
55467E1955j67O43M29k13J26J182J454P69K57J55l17j096j351j172j218j179n00
$$ 51955 51788 52431 52860 52647 52773 53955 55409 56178 56435 56590 56273 55177 53826 52654 51436 50257 49757
55450D9757j4o49j231p6J843J990K48j000o43L3R7J27K93k15j361k016j844j516
$$ 49757 49743 49094 47863 47787 49630 51620 51868 50868 50225 50258 50355 50482 50775 50560 49199 47183 45339 43823
55432D3823r89K83J509J234r8n57K03O17L9m66l57l09l69K65J302J500R42J008
$$ 43823 42834 43117 44626 45860 45762 45205 45408 46025 46064 45598 45241 44932 44563 44828 46130 47630 48572 49580
55414D9580J764J787Q61M02P89P48j6j28Q21J266L30p25p46l95n46p70m82j05
$$ 49580 51344 53131 53992 54394 55183 55931 55915 55787 56608 57874 58204 57479 56733 56338 55792 55022 54540 54435
55396E4435j39l14l50l69k22L39P29J92o56n96J8k90j515k153j820j694k052j727
$$ 54435 54296 53982 53632 53263 53041 53380 54109 54301 53645 53049 53067 52777 51262 49109 47289 45595 43543 41816
55378D1816m52M57L80K49N22M14k29l25M18Q18L25r0J44K72o8q4M16L88n40j293
$$ 41816 41364 41821 42201 42450 42972 43386 43157 42832 43250 44068 44393 44303 44447 44719 44651 44567 44983 45371 44831 43538
55358D3538j208r85j065q29j61J2n11n62L95J312J337R38N80m8q07q00j1M03P5
$$ 43538 42330 41345 40280 39451 39290 39302 38791 38229 38624 39936 41273 42211 42791 42743 41936 41136 41125 41528 41603
55339D1603L5O94J041N56R7J66N0n44p44k22J11j94l88k12m57j154j093%P36M09
$$ 41603 41638 42332 43373 43929 44026 44192 44242 43698 42954 42732 42843 42649 42261 42049 41592 40438 39345 39345 40081 40490
55319D0490N3K78M6j248k383k275j506q51LJ086J420Q18O28J432J884J096K36
$$ 40490 40543 40821 40867 39619 37236 34961 33455 32604 32607 33693 35113 35931 36559 37991 39875 40971 41207
55302D1207L61N48j81r24o31r4l46o25J40J160J022M0n15m76m32k43L93Q13L76
$$ 41207 41568 42116 41935 41011 40380 40286 39940 39315 39455 40615 41637 41677 41162 40686 40254 40011 40404 41217 41593
55283D1593k40k42k22r13j432n60J027J581Q04j13n31q55j203j099m58K17O18
$$ 41593 41353 41111 40889 39976 38544 37984 39011 40592 41396 41283 40752 39897 38694 37595 37137 37354 37972
55266C7972P70O62L47J22L2k73p93r68o34l07j12M53J232J184J69m03L33J288
$$ 37972 38742 39404 39751 39873 39905 39632 38839 37871 37237 36930 36818 37271 38503 39687 39856 39453 39786 41074
55248D1074J175L67j34l59o72o22J27O28m3j132j208k21O98R40O92J40n23p39
$$ 41074 42249 42616 42482 42123 41451 40829 40956 41584 41541 40409 39201 38980 39678 40618 41310 41450 40927 40188
55230D0188k74K05O4l64m58j98L01J180K075J953O66l98j44P30J012O99M52L46
$$ 40188 39914 40119 40183 39819 39361 39163 39464 40644 42719 44672 45338 44940 44796 45526 46538 47237 47689 48035
55212D8035K71N07R27O31n41j330r10j91q4J10J125J921J266p0n19k38m47j133
$$ 48035 48306 48813 49740 50371 49830 48500 47590 47399 47315 47425 48550 50471 51737 51667 51148 50910 50463 49330
55194D9330j352j237j582j922j045O95J552R41J09N6L93M81L58J58k37o97q25
$$ 49330 47978 46741 45159 43237 42192 42887 44439 45380 45489 45545 45938 46419 46777 46935 46698 46001 45176
55177D5176n77j66M52J245J580R48j25p49r23j158j336j048n84m87m28K22J018
$$ 45176 44599 44433 44885 46130 47710 48658 48533 47784 46861 45703 44367 43319 42735 42248 41820 42042 43060
55160D3060R36P0m49j93J54J60K16N28O61L60Rj1K21N10P17N55j53r63j114m09
$$ 43060 43996 44066 43617 43424 43578 43738 43954 44482 45143 45503 45512 45501 45722 46232 46949 47504 47351 46388 45274 44865
55140D4865N34J013Q18K88m2J00M17N19O04J135J877K089J809J882K390K328J374
$$ 44865 45399 46412 47230 47518 47476 47576 47993 48512 49116 50251 52128 54217 56026 57908 60298 62626 64000
55123F4000P28J251J968J542K04q56j257j328j091n20k18o77j334j424j175j162
$$ 64000 64728 65979 67947 69489 69693 68837 67580 66252 65161 64641 64423 63746 62412 60988 59813 58651
55107E8651j185q38n63q99j316r81k06J26J03N13J338J733J331O35K19K73O55
$$ 58651 57466 56628 56065 55166 53850 52869 52663 52789 52892 53405 54743 56476 57807 58442 58661 58934 59589
55090E9589P67J3j109j173J99J492J419P06O51J015Q20K95L33O75L70m28o82j62
$$ 59589 60356 60369 59260 58087 58286 59778 61197 61903 62554 63569 64389 64684 65017 65692 66062 65634 64952 64790
55072F4790N22J168J868K098J447P25R24J470J109N0m15n9K17J97M87R94R93O45
$$ 64790 65312 66480 68348 70446 71893 72618 73542 75012 76121 76171 75756 75697 75914 76111 76598 77592 78585 79230
55054G9230P62J116P21k17l99L09N63j63p10k31N30O34K95J46K40M05O66Q68P28
$$ 79230 79992 81108 81829 81612 81213 81522 82085 81922 81212 80981 81511 82145 82440 82586 82826 83231 83897 84765 85493
55035H5493M88N87O84lj206j671r36Q9N33M67K29q9j36N59J598J892J122R2o20
$$ 85493 85981 86568 87252 87249 86043 84372 83436 83525 84058 84525 84754 84665 84529 85088 86686 88578 89700 89792 89172
55016H9172j300k180k902l248l408l292k521j377p84r73j131o79M9O10J042J330
$$ 89172 87872 85692 82790 79542 76134 72842 70321 68944 68160 67187 66056 65377 65426 66036 67078 68408
55000F8408J198P32M15K48k34r22j088n90j85k72l04J69P45R35Q62P74N60K11
$$ 68408 69606 70338 70753 71001 70767 69845 68757 68167 67982 67710 67406 67575 68320 69255 70117 70891 71451 71662
54982G1662J04M51R72J334J494J544J678K185K908K946J735K24r9Q61J868K385
$$ 71662 71766 72217 73189 74523 76017 77561 79239 81424 84332 87278 89013 89237 89138 89999 91867 94252
54966I4252L182M772O467P483P947Q367Q925R712J0883J2168J2935J2864J2018
$$ 94252 97434 102206 108673 116156 124103 132470 141395 151107 161990 174158 187093 199957 211975
54953B11975J0159P002L119l85l281o268r381j1544j2074j1611j1051j0446r550
$$ 211975 222134 229136 232255 231870 228589 222321 212940 201396 189322 177711 166660 156214 146664
54940A46664q587p965p715p625p405o597m983l242k359k284k053j315p38o50m01
$$ 146664 138077 130112 122397 114772 107367 100770 95787 92545 90186 87902 85849 84534 83796 83146 82745
54925H2745M95J565K317L006L903M640M936N298O331P864R316J0415J1119J1260
$$ 82745 83240 84805 87122 90128 94031 98671 103607 108905 115236 123100 132416 142831 153950 165210
54911A65210J0666R326P220M377J217j688m274o776q917j0046j0156r979r889
$$ 165210 175876 185202 192422 196799 198016 196328 192054 185278 176361 166315 156159 146180 136291
54898A36291r525q712p838p039n909m412l244k836k723k357j890j642j404p96
$$ 136291 126766 118054 110216 103177 97268 92856 89612 86776 84053 81696 79806 78164 76760 75964
54884G5964O0P08R00P05L38N1j00l47p86j085j016r54j275j570j313r55j370k388
$$ 75964 76024 76732 77632 78337 78675 78726 78626 78279 77493 76408 75392 74438 73163 71593 70280 69325 67955 65567
54866F5567k952k674k137j689j048k29K37K32J87J58j99o36m99M0R0l92m42J64
$$ 65567 62615 59941 57804 56115 55067 54838 55075 55307 55494 55652 55453 54817 54318 54358 54448 54056 53614 53778
54848E3778L66m17j247j046n3Q26J147Q85J19n81k99J040K353K659J996Q86k20
$$ 53778 54144 53727 52480 51434 51381 52207 53354 54239 54358 53777 53478 54518 56871 59530 61526 62412 62192
54831F2192p01r8R30J084K87n2Q03J774J760J300J444J984J958J268O85O80J112
$$ 62192 61491 61393 62323 63407 63694 63642 64445 66219 67979 69279 70723 72707 74665 75933 76618 77298 78410
54814G8410J734K311K601K759L360M595N904O793P442Q182R010R924J1033J1940
$$ 78410 80144 82455 85056 87815 91175 95770 101674 108467 115909 124091 133101 143025 154058 165998
54800A65998J1789J0314Q162N843L199K74k334m369o257p976q664q040p189p086
$$ 165998 177787 188101 196263 202106 205305 205579 203245 198876 192619 184643 175979 167939 160750 153664
54786A53664p244o722n652m838m441m055l627l429l413l209k547j314L36J654
$$ 153664 146420 139698 134046 129208 124767 120712 117085 113656 110243 107034 104487 103173 103509 105163
54772A05163J833J157R05J715K879L728M636N972P121P441P442Q052R275J0480
$$ 105163 106996 108153 109058 110773 113652 117380 122016 127988 135109 142550 149992 158044 167319 177799
54758A77799J1432J2205J2485J1730R834P183M408K263J118K96j235l256m373
$$ 177799 189231 201436 213921 225651 235485 242668 247076 249339 250457 250753 249518 246262 241889
54745B41889m092l662m250n388o121o557p228p862p992p990q401q782q330p161
$$ 241889 237797 234135 229885 224497 218376 211819 204591 196729 188737 180747 172346 163564 155234 148073
54731A48073o060n360m955m873n069n063m563l894l298k481j509j215j865k307
$$ 148073 142013 136653 131698 126825 121756 116693 112130 108236 104938 102457 100948 99733 97868 95561
54717I5561j555l23Q8k93n53n65p87r66m71K88K39o28j112m82P02J539J668J154
$$ 95561 94006 93683 93771 93478 92925 92360 91573 90607 90136 90424 90663 90035 88923 88441 89143 90682 92350 93504
54699I3504L68QN15J350J468N90m89q54l51M19P05L32j24j02N8k99q22m18Q99
$$ 93504 93872 93880 94395 95745 97213 97803 97314 96460 96109 96528 97233 97565 97441 97339 97397 97098 96276 95858 96757
54680I6757J693J217N81R26J643J597J079J226K182L193L962M604M749L963K826
$$ 96757 98450 99667 100248 101174 102817 104414 105493 106719 108901 112094 116056 120660 125409 129372 132198
54665A32198K385K680K880K674K538K762L113L316L212K654J845J403J522J614
$$ 132198 134583 137263 140143 142817 145355 148117 151230 154546 157758 160412 162257 163660 165182 166796
54651A66796J447J775L014M141M055L320L355M474N973P542R280J0744J1428J1878
$$ 166796 168243 170018 173032 177173 181228 184548 187903 192377 198350 205892 215172 225916 237344 249222
54637B49222J2999J4422J4832J3618J1078P308K306l024p377j0573j3307j5506
$$ 249222 262221 276643 291475 305093 316171 323479 325785 322761 315384 304811 291504 275998
54625B75998j6273j5558j4460j3686j2835j1519j0022q620p214n923n110m610
$$ 275998 259725 244167 229707 216021 203186 191667 181645 173025 165811 159888 154778 150168
54613A50168l760k448j345q89p65n16m0N87J160J315R27L85k2o03j524k118j867
$$ 150168 146408 143960 142615 141726 140961 140445 140405 140992 142152 143467 144394 144779 144757 144154 142630 140512 138645
54596A38645j472j947l036l679l593l292k892k236j861k432l400l536k830k361
$$ 138645 137173 135226 132190 128511 124918 121626 118734 116498 114637 112205 108805 105269 102439 100078
54582A00078k433k257j637j383j778j951j324n03k27m65q54j167j089m65R7k21
$$ 100078 97645 95388 93751 92368 90590 88639 87315 86812 86585 86120 85266 84099 83010 82545 82642 82421
54566H2421j112j421q29j58O3J84M28M86M18P37J302J246M08l28m07k30r1L63
$$ 82421 81309 79888 79059 78901 78964 79148 79576 80062 80480 81217 82519 83765 84173 83845 83438 83208 83117 83480
54548H3480J078J252N98n3K4N79J222K086L093L537L086K407K190K356K749L704
$$ 83480 84558 85810 86408 86355 86379 86958 88180 90266 93359 96896 99982 102389 104579 106935 109684 113388
54532A13388N322O902P788Q081Q016P342N996M632L802L099J759k70k389m120
$$ 113388 118710 125612 133400 141481 149497 156839 162835 167467 171269 174368 176127 175857 173468 169348
54518A69348n348o129o571o689o359n696n314n617n955n355m009l084l026l086
$$ 169348 164000 157871 151300 144611 138252 132556 127242 121625 115670 110315 106306 103222 100196 97110
54504I7110k708k240j928j348l64L98M97L12J63k34q89j118n90L9J63Q8K17K48
$$ 97110 94402 92162 90234 88886 88522 88920 89417 89729 89892 89658 88769 87651 87061 87100 87263 87351 87568 87816
54486H7816j08l72l5N81R24J094J354J407Q97J74k02k54k54q8M12R02R95R18J032
$$ 87816 87708 87336 87301 87882 88806 89900 91254 92661 93558 93732 93530 93276 93022 92934 93346 94248 95243 96161 97193
54467I7193J076O12r8l85k13k62r21j705j849j203m24k30n41n96n4L77k0p39p06
$$ 97193 98269 98881 98783 98398 98185 97923 97002 95297 93448 92245 91821 91591 91050 90454 90400 90777 90757 90018 89312
54448H9312L9L48k70r77j020p72q13r16o07o4K56L63M44L15k49r78j415j461j279
$$ 89312 89351 89699 89429 88452 87432 86660 85847 84931 84324 84260 84516 84879 85323 85638 85389 84411 82996 81535 80256
54429H0256r24m16N7L10K58j49p59j023m68N48J203J285J265J344J224R03P96
$$ 80256 79332 78916 78973 79283 79541 79392 78633 77610 77142 77690 78893 80178 81443 82787 84011 84914 85710
54412H5710R25Q58O65R98J913K538K246J415P07M36Q61K064L344L746L478L645
$$ 85710 86635 87493 88158 89156 91069 93607 95853 97268 97975 98411 99272 101336 104680 108426 111904 115549
54396A15549M371M545L857L508M111M445L446J971J285R60j35j719k587k638k770
$$ 115549 119920 124465 128322 131830 135941 140386 143832 145803 147088 148048 147913 146194 143607 140969 138199
54381A38199l138l093k615k449k727k677j943j246j454k563l731l956k901j488
$$ 138199 135061 131968 129353 126904 124177 121500 119557 118311 116857 114294 110563 106607 103706 102218
54367A02218j185k322l519l417k325j388q68k17N59Q39M99R5PJ67O16J438K262
$$ 102218 101033 98711 95192 91775 89450 88062 87194 86977 87536 88375 88874 88969 88976 89143 89759 91197 93459
54350I3459K530K255J901J677J525J580J958K323K358K419L007L839M212M056
$$ 93459 95989 98244 100145 101822 103347 104927 106885 109208 111566 113985 116992 120831 125043 129099
54336A29099L792L377K359Q32n06j325j887k314k358k029j815k061k671l440m139
$$ 129099 132891 136268 138627 139459 138953 137628 135741 133427 131069 129040 127225 125164 122493 119053 114914
54321A14914m316l667k661k215k589l073k889k082j377j431k233l000k885j967
$$ 114914 110598 106931 104270 102055 99466 96393 93504 91422 90045 88614 86381 83381 80496 78529
54307G8529j252j403j864j756j108n71l21o4J20j43p20j042r95r46q97m71Q7q2
$$ 78529 77277 75874 74010 72254 71146 70575 70254 70190 70310 70167 69447 68405 67410 66464 65567 65096 65183 65101
54289F5101j098j793j129L77J293R76J00l85k84n6n9r7K60J069J806J929J462
$$ 65101 64003 62210 61081 61458 62751 63727 63827 63442 63158 63102 63043 62946 63206 64275 66081 68010 69472
54272F9472Q97N19J17n45j216j317o72J90O29O41P97J342J794J620J011N76N32
$$ 69472 70369 70888 71005 70460 69244 67927 67255 67445 68074 68715 69512 70854 72648 74268 75279 75855 76387
54255G6387N86M57Q7m60q50n43M42J170Q73J28J5M10K98l48m45K28M44m84j510
$$ 76387 76973 77430 77517 77057 76207 75664 76106 77276 78149 78277 78292 78702 79000 78652 78207 78435 78879 78395 76885
54236G6885j533j029r83j186p71K33J070J429J426Q73l27j480j762j351r43n47
$$ 76885 75352 74323 73340 72154 71383 71616 72686 74115 75541 76414 76087 74607 72845 71494 70551 70004
54220G0004K89J296J675J336R52P88M56o5j79L08O76K93m34n71J87J207J645J300
$$ 70004 70293 71589 73264 74600 75552 76340 76796 76731 76552 76860 77536 77829 77395 76824 77011 78218 79863 81163
54202H1163O82L05O2m50j185j636j539j114n77p2j1p77j884k315j870j278q21
$$ 81163 81845 82150 82212 81762 80577 78941 77402 76288 75711 75639 75628 74851 72967 70652 68782 67504 66683
54185F6683K5J155J420L86p18p85m37o53r99n90J04N1m06j46O71Q33J53k89k8
$$ 66683 66708 67863 69283 69669 68951 68166 67729 67076 66077 65487 65591 65642 65236 65090 65761 66594 66747 66458 66430
54166F6430K59K28M60J136J531J270R63J062J028L37n03n90P9N73R1j198k250
$$ 66430 66689 66917 67377 68513 70044 71314 72277 73339 74367 74704 74201 73611 73690 74263 74354 73156 70906
54149G0906k084p21Q47J704J687J019q8j124j347p67l44n97q31m81k93j040j971
$$ 70906 68822 68101 68948 70652 72339 73358 73270 72146 70799 70032 69688 69091 68260 67779 67486 66446 64475
54132F4475j870j019o21p51m82K52N11M9l78m00m37n67l68N0J11j9L40R45Q42
$$ 64475 62605 61586 60965 60214 59732 59984 60495 60544 60166 59766 59329 58762 58394 58444 58555 58536 58876 59821 60663
54113F0663J13q2N19Q46M20J61O65J200J105Q60Q97O62k31j054j114r20j178j519
$$ 60663 60776 60694 61213 62059 62479 62640 63305 64505 65610 66470 67367 68029 67798 66744 65630 64710 63532 62013
54095F2013j208m38L7Mk62n95p98m97K47O45K30l99m88j74N4K86P86J224J132
$$ 62013 60805 60367 60404 60408 60146 59551 58753 58256 58503 59148 59378 58979 58491 58317 58371 58657 59443 60667 61799
54076F1799P93P85R66O81j02o19l22M89J077J011M18k58o91r03r54n72M95J782
$$ 61799 62592 63377 64343 65024 64922 64303 63981 64470 65547 66558 66976 66718 66027 65124 64170 63598 64093 65875
54058F5875K326J781P80M7l40n84o22k99K73Q73J379J632J493J226J331J884K379
$$ 65875 68201 69982 70762 70809 70469 69885 69263 68964 69237 70110 71489 73121 74614 75840 77171 79055 81434
54041H1434K442K209J890J478J134J274J956K703L173L555M068M511M678M783
$$ 81434 83876 86085 87975 89453 90587 91861 93817 96520 99693 103248 107316 111827 116505 121288
54027A21288N056N282N076M386L573L098L217L711L980L636K937K372K011J729
$$ 121288 126344 131626 136702 141088 144661 147759 150976 154687 158667 162303 165240 167612 169623 171352
54013A71352J722K117K362J850J021Q40J188Q90n33k143l003l323l664l879l607
$$ 171352 173074 175191 177553 179403 180424 181264 182452 183342 182809 180666 177663 174340 170676 166797 163190
53998A63190l107k914l043l115k998k861k804k724k408j727r80q55j579k334k191
$$ 163190 160083 157169 154126 151011 148013 145152 142348 139624 137216 135489 134509 133654 132075 129741 127550
53983A27550j504j460k259k755k103q49l9p5p42j534j699p59O28J198O93J42K38
$$ 127550 126046 124586 122327 119572 117469 116620 116581 116506 115764 114230 112531 111772 112400 113598 114291 114433 114671
53966A14671M26J44q7M69J551K274K211J522N67j51j82L17O93P48R46J413J555
$$ 114671 115097 115241 115154 115623 117174 119448 121659 123181 123748 123597 123415 123732 124425 125173 126119 127532 129087
53949A29087J060M96M77Q49J133J173R97P09P34J430K297K481K179K476L549M288
$$ 129087 130147 130643 131120 131969 133102 134275 135272 135981 136715 138145 140442 142923 145102 147578 151127 155415
53933A55415M132L912M276M564L988K764J244p14k662l187j834j71L20K76J000
$$ 155415 159547 163459 167735 172299 176287 179051 180295 179581 176919 173732 171898 171727 172047 172323 173323
53918A73323K102K294J734J813K953M188M760M777M473M022L898M290M489L882
$$ 173323 175425 177719 179453 181266 184219 188407 193167 197944 202417 206439 210337 214627 219116 222998
53904B22998L212L552M445M398L041J429K65p61j740k042j446p25o42j127j713
$$ 222998 226210 229762 234207 238605 241646 243075 243340 242579 240839 238797 237351 236626 235984 234857 233144
53889B33144k138k373k622l313m549n653n843n262m709m544m601m830n251n435
$$ 233144 231006 228633 226011 222698 218149 212496 206653 201391 196682 192138 187537 182707 177456 172021
53875A72021m979m310m143m287l965l115k430k138j843j609k046l083l743l493
$$ 172021 167042 162732 158589 154302 150337 147222 144792 142654 140811 139202 137156 134073 130330 126837
53861A26837k909k625k467k046j534j318j427j710k169k737l077k934k390j674
$$ 126837 123928 121303 118836 116790 115256 113938 112511 110801 108632 105895 102818 99884 97494 95820
53847I5820r42l33Q0L70M85J19p82j519j275k19O04N66J06J5N38J295J699J368
$$ 95820 94878 94545 94625 94995 95480 95599 94817 93298 92023 91804 92408 92974 93080 93095 93633 94928 96627 97995
53829I7995L74p55j490j645j247l66O59J206J000M89K20K58M90J010J624J564
$$ 97995 98369 97614 96124 94479 93232 92866 93525 94731 95731 96220 96440 96698 97188 98198 99822 101386
53813A01386N10o32p06J69R08R99Q47P77P04P25J152J899K460K670K846L210L708
$$ 101386 101896 101264 100558 100727 101635 102634 103481 104258 104962 105687 106839 108738 111198 113868 116714 119924 123632
53796A23632M331M979N166M524L478K813K620K349J759J180Q75R05J415K414L318
$$ 123632 127963 132942 138108 142632 146110 148923 151543 153892 155651 156831 157706 158611 160026 162440 165758
53781A65758L435K779J827P85k49p16j99O39O27m81j938l174m084m372l731k659
$$ 165758 169193 171972 173799 174584 174335 173619 173420 174059 174686 174205 172267 169093 165009 160637 156906 154247
53765A54247k073k087k113k053k320k759k743k423k552k974k609j259j19j3l84
$$ 154247 152174 150087 147974 145921 143601 140842 138099 135676 133124 130150 127541 126282 126163 126150 125766
53750A25766n70q07j309j491r85m22m29n90k76L06O33P48Q89Q25L81l0kK28L92
$$ 125766 125196 124389 123080 121589 120604 120182 119753 119163 118887 119193 119826 120574 121463 122288 122669 122639 122637 122865 123257
53731A23257P66J418J597P20n25j008o66l32l61l91k90m09q78j324j416j180p36
$$ 123257 124023 125441 127038 127758 127233 126225 125559 125227 124866 124475 124185 123776 122898 121574 120158 118978 118242
53714A18242k28Ml62j085j420q40M05J486J701J110N21O29J196J355Q29K87L74
$$ 118242 118014 118018 117656 116571 115151 114311 114716 116202 117903 119013 119534 120163 121359 122714 123543 123830 124204
53697A24204R04J375J771K321K881L067K859K558K326K199K341K849L343L258
$$ 124204 125108 126483 128254 130575 133456 136523 139382 141940 144266 146465 148806 151655 154998 158256
53683A58256K596J984J978K530L268L863M063L611K588J686J735K716L539L191
$$ 158256 160852 162836 164814 167344 170612 174475 178538 182149 184737 186423 188158 190874 194413 197604
53669A97604J906Q22N34N87L93n3o17j425k293k439j535m82l77j068j583j583
$$ 197604 199510 200332 200866 201453 201846 201793 201176 199751 197458 195019 193484 193002 192625 191557 189974 188391
53653A88391j486j471j389j469k001k432j865n21L79L74K06L93M99K14NJ27Kp42
$$ 188391 186905 185434 184045 182576 180575 178143 176278 175757 176136 176510 176716 177109 177608 177822 177827 177954 177956 177214
53635A77214j505j615j231p60j33O44J041Q06N72R46J534J656J417J327J356J148
$$ 177214 175709 174094 172863 172103 171970 172614 173655 174461 175033 175979 177513 179169 180586 181913 183269 184417
53619A84417P99O37N75L72K40N43J105J434J404J215R86Q80J280K261L218L562
$$ 184417 185216 185853 186428 186800 187040 187583 188688 190122 191526 192741 193727 194607 195887 198148 201366 204928
53603B04928L462L344L082K412J745J776K431K965L082L254L888M774N418N493
$$ 204928 208390 211734 214816 217228 218973 220749 223180 226145 229227 232481 236369 241143 246561 252054
53589B52054M956M139L708M084M904N406N309M962M642M245L616K903K404K284
$$ 252054 257010 261149 264857 268941 273845 279251 284560 289522 294164 298409 302025 304928 307332 309616
53575C09616K443K557K357J952J786K069K455K457K015J478J211J361J755J951
$$ 309616 312059 314616 316973 318925 320711 322780 325235 327692 329707 331185 332396 333757 335512 337463
53561C37463J655J211J252J759K012J693J425J717J994J345r5j255j442r64m32
$$ 337463 339118 340329 341581 343340 345352 347045 348470 350187 352181 353526 353431 352176 350734 349770 349338
53546C49338r6J59M81Q29R12M30m13r20p05k32k23p51j317j566j455r36K2J100
$$ 349338 349242 349401 349882 350711 351623 352053 351640 350720 350015 349783 349560 348809 347492 345926 344471 343535 343557 344657
53528C44657J799J985J985K090K258K307K238K312K882M028N271N948N953N877
$$ 344657 346456 348441 350426 352516 354774 357081 359319 361631 364513 368541 373812 379760 385713 391590
53514C91590O219O824P297P661Q216R016R831J0442J0707J0603J0473J0978J2393
$$ 391590 397809 404633 411930 419591 427807 436823 446654 457096 467803 478406 488879 499857 512250
53501E12250J4140J5382J5943J6320J6962J7888J8869J9693K0307K0884K1657
$$ 512250 526390 541772 557715 574035 590997 608885 627754 647447 667754 688638 710295
53490G10295K2568K3266K3563K3638K3725K3909K4273K4769K4875K4008K2478
$$ 710295 732863 756129 779692 803330 827055 850964 875237 900006 924881 948889 971367
53479I71367K1474K1660K2432K2951K3231K3609K3839K3503K2907K2630K2486
$$ 971367 992841 1014501 1036933 1059884 1083115 1106724 1130563 1154066 1176973 1199603 1222089
53468A222089K1838K0804K0190K0247K0248J9516J8175J6638J5001J3236J1532
$$ 1222089 1243927 1264731 1284921 1305168 1325416 1344932 1363107 1379745 1394746 1407982 1419514
53457A419514J0097Q888P728O573N473M465L558K725J804N03j481m216p316j0019
$$ 1419514 1429611 1438499 1446227 1452800 1458273 1462738 1466296 1469021 1470825 1471328 1469847 1465631 1458315 1448296
53443A448296j1776j2818j3786j4828j5563j6043j7031j8908k0825k1594k1116
$$ 1448296 1436520 1423702 1409916 1395088 1379525 1363482 1346451 1327543 1306718 1285124 1264008
53432A264008k0360k0227k0911k2089k3159k3449k2751k1669k0976k0724k0364
$$ 1264008 1243648 1223421 1202510 1180421 1157262 1133813 1111062 1089393 1068417 1047693 1027329
53421A027329j9592j8577j7446j6046j4304j2455j0896r892r409r007q075o370
$$ 1027329 1007737 989160 971714 955668 941364 928909 918013 908121 898712 889705 881630 875260
53409H75260m198k008q5J286J908K217L193N243P603R311J0335J1228J2207J3213
$$ 875260 871062 869054 868969 870255 872163 874380 877573 882816 890419 899730 910065 921293 933500 946713
53395I46713J4526J6449J8637K0437K1752K2953K4137K5188K6368K8034K9908
$$ 946713 961239 977688 996325 1016762 1038514 1061467 1085604 1110792 1137160 1165194 1195102
53384A195102L1363L2464L3912L5848L7499L8293L8689L9597M1361M3589M5619
$$ 1195102 1226465 1258929 1292841 1328689 1366188 1404481 1443170 1482767 1524128 1567717 1613336
53373A613336M7014M7825M8489M9302N0044N0314N0067M9516M8707M7594M6295
$$ 1613336 1660350 1708175 1756664 1805966 1856010 1906324 1956391 2005907 2054614 2102208 2148503
53362B148503M4922M3261M1066L8482L5751L2707K9053K5019K1170J7719J4454
$$ 2148503 2193425 2236686 2277752 2316234 2351985 2384692 2413745 2438764 2459934 2477653 2492107
53351B492107J1173P792M225O00k712n740r175j3343j7401k0422k2959k6466l1329
$$ 2492107 2503280 2511072 2515297 2515897 2513185 2507445 2498270 2484927 2467526 2447104 2424145 2397679 2366350
53338B366350l6450m0797m4285m7025m8750m9352m9140m8272m6656m4699m3353
$$ 2366350 2329900 2289103 2244818 2197793 2149043 2099691 2050551 2002279 1955623 1910924 1867571
53327A867571m2968m2840m2223m1198m0240l9557l9204l9244l9336l8745l7107
$$ 1867571 1824603 1781763 1739540 1698342 1658102 1618545 1579341 1540097 1500761 1462016 1424909
53316A424909l4868l2558l0202k7692k5227k2982k0851j8911j7605j7017j6408
$$ 1424909 1390041 1357483 1327281 1299589 1274362 1251380 1230529 1211618 1194013 1176996 1160588
53305A160588j5043j3194j1805j1324j1286j0942r940q469o978n733m616l363
$$ 1160588 1145545 1132351 1120546 1109222 1097936 1086994 1077054 1068585 1061607 1055874 1051258 1047895
53293A047895j989o79N67J806K678K685K110K026L087M740N953O450O839P807
$$ 1047895 1045906 1045227 1045794 1047600 1050278 1052963 1055073 1057099 1060186 1064926 1070879 1077329 1084168 1091975
53279A091975R539J1726J3827J5352J6241J6942J8066J9866K1931K3350K3448
$$ 1091975 1101514 1113240 1127067 1142419 1158660 1175602 1193668 1213534 1235465 1258815 1282263
53268A282263K2489K1459K0954K0628K0019J9346J8893J8124J6385J4176J2667
$$ 1282263 1304752 1326211 1347165 1367793 1387812 1407158 1426051 1444175 1460560 1474736 1487403
53257A487403J1929J0826Q854O939N905N184L718J406j117l497n719p622r076
$$ 1487403 1499332 1510158 1519012 1525951 1531856 1537040 1540758 1542164 1541047 1537550 1531831 1524209 1515133
53244A515133j0401j2028j3961j5944j7857j9492k0384k0433k0399k1177k2741
$$ 1515133 1504732 1492704 1478743 1462799 1444942 1425450 1405066 1384633 1364234 1343057 1320316
53233A320316k4213k4832k4487k3514k2444k1770k1588k1493k1104k0476j9818
$$ 1320316 1296103 1271271 1246784 1223270 1200826 1179056 1157468 1135975 1114871 1094395 1074577
53222A074577j9103j8272j7520j7022j6602j6034j5421j5013j4814j4710j4649
$$ 1074577 1055474 1037202 1019682 1002660 986058 970024 954603 939590 924776 910066 895417
53211H95417j4439j3694j2342j0861r702q804q044p725q128q907r513r963j0643
$$ 895417 880978 867284 854942 844081 834379 825575 817531 809806 801678 792771 783258 773295 762652
53198G62652j1585j2539j3509j4591j5329j5022j3692j2173j1181j0808j0980
$$ 762652 751067 738528 725019 710428 695099 680077 666385 654212 643031 632223 621243
53187F21243j1680j2549j2937j2682j2353j2396j2537j2423j2377j2882j3572
$$ 621243 609563 597014 584077 571395 559042 546646 534109 521686 509309 496427 482855
53176D82855j3449j2154j0565r883j0372j1215j1398j0594r316q404q328q833
$$ 482855 469406 457252 446687 436804 426432 415217 403819 393225 383909 375505 367177 358344
53164C58344r228r064q511p979p510o761n674m810m761n349n789n631n221n034
$$ 358344 349116 340052 331541 323562 316052 309291 303617 298807 294046 288697 282908 277277 272056 267022
53150B67022m894m201k912j865j885k815l709l968l813l641l320k594j775j483
$$ 267022 262128 257927 255015 253150 251265 248450 244741 240773 236960 233319 229999 227405 225630 224147
53136B24147j717j778j311q03q19j182j322j067o37j53L92Q91J268J734K482L236
$$ 224147 222430 220652 219341 218538 217719 216537 215215 214148 213511 213358 213750 214641 215909 217643 220125 223361
53120B23361L473L044K308J727J545J637J420K44j775l553m133l740l332l396
$$ 223361 226834 229878 232186 233913 235458 237095 238515 238759 236984 233431 229298 225558 222226 218830
53106B18830l715l992m115l943l485l188l423l844l809l310k849k564k207j890
$$ 218830 215115 211123 207008 203065 199580 196392 192969 189125 185316 182006 179157 176593 174386 172496
53092A72496k028k486k595k185j884k132k599k795k674k345j819j222q80r10j158
$$ 172496 170468 167982 165387 163202 161318 159186 156587 153792 151118 148773 146954 145732 144852 143942 142784
53077A42784j563k078k330j980j443j459j933j961j230m39r8J46N58N79k56j357
$$ 142784 141221 139143 136813 134833 133390 131931 129998 128037 126807 126368 126270 126416 126974 127553 127297 125940
53061A25940j744j230l91K97O93P22L59k01o96r67r55p13n30o12p60p25p58j138
$$ 125940 124196 122966 122575 122872 123565 124287 124646 124445 123749 122782 121827 121114 120584 119972 119212 118487 117729 116591
53043A16591j369p25M85J138Q46K44l12j122j941j789n46N22N43K18M51Q90Q16
$$ 116591 115222 114497 114982 116120 116966 117210 116898 115776 113835 112046 111500 112022 112565 112783 113234 114124 114940
53026A14940M06J59j19o89j090r24o56o24j80J094K210K108J410J340J649J210
$$ 114940 115346 115505 115386 114697 113607 112683 112027 111403 111223 112317 114527 116635 118045 119385 121034 122244
53010A22244J31m04j61m6l18k38L73P14M96M09P94J046P81M44L66K29p0k3N38
$$ 122244 122375 121971 121810 121764 121446 121208 121581 122295 122791 123200 123994 125040 125821 126265 126631 126860 126790 126767 127305
52991A27305R68Q52O73R26J269J085M20j45j61M91J566K504K873K901L099L495
$$ 127305 128273 129125 129798 130724 131993 133078 133498 133353 133192 133683 135249 137753 140626 143527 146626 150121
52975A50121L757L940M268M335L547K372K056K711K878J536m27j456j308r83j254
$$ 150121 153878 157818 162086 166421 169968 172340 174396 177107 179985 181521 181094 179638 178330 177347 176093
52960A76093k025k758k960k465j653j174j159j122q70q58j374j878j732j065m34
$$ 176093 174068 171310 168350 165885 164232 163058 161899 160777 159907 159049 157675 155797 154065 153000 152566
52945A52566n7R9m4m45o54l54Q8J44o0L7N21Q66O70R8l63l56J15P13J083J254
$$ 152566 152509 152608 152564 152119 151465 151111 151199 151343 151283 151320 151841 152707 153377 153475 153112 152756 152871 153584 154667 155921
52925A55921J487J671J304K61q20j283j173r30o77l13Q6L73O40R87J226J166R45
$$ 155921 157408 159079 160383 160644 159824 158541 157368 156438 155761 155448 155534 155907 156547 157534 158760 159926 160871
52908A60871O52L0r20j386o24P68J337O06m00o31k87q6j5M33J215J663J462J039
$$ 160871 161523 161553 160633 159247 158623 159391 160728 161334 160934 160303 160016 159930 159915 160348 161563 163226 164688 165727
52890A65727Q43P74N26R6l06o02p76p27m11NL50O89J069J251J055P72P92Q93N33
$$ 165727 166570 167344 167870 167966 167660 167058 166282 165555 165144 165149 165499 166188 167257 168508 169563 170335 171127 172020 172553
52871A72553j76l64L87J335J517J003P06J145J902K246J963J475J426J996K651
$$ 172553 172377 172013 172400 173735 175252 176255 176961 178106 180008 182254 184217 185692 187118 189114 191765
52856A91765K699K176J816K068K565K885L196L749M182M024L428K784J918N20
$$ 191765 194464 196640 198456 200524 203089 205974 209170 212919 217101 221125 224553 227337 229255 229775
52842B29775q40j070k5J114J163J8j615k991l681l738l707m060m533m531m147
$$ 229775 228935 227865 227840 228954 230117 230135 228520 225529 221848 218110 214403 210343 205810 201279 197132
52827A97132m059m364m273l349k234j790j985k143j918j492j153j048j160j261
$$ 197132 193073 188709 184436 181087 178853 177063 175078 172935 171017 169525 168372 167324 166164 164903
52813A64903j082o76l99l96n08o88j118j668j778j193l77O7L6k64p15j135j154
$$ 164903 163821 163145 162746 162350 161842 161154 160036 158368 156590 155397 155020 155087 155123 154859 154144 153009 151855
52796A51855o91k33k61o83j177j716k324k645k313j576j077j072j246j323j396
$$ 151855 151164 150931 150670 149987 148810 147094 144770 142125 139812 138236 137159 136087 134841 133518 132122
52781A32122j619j816j575p28K87O20j59j453k190k017j555j373j269q86m02k18
$$ 132122 130503 128687 127112 126384 126671 127291 127132 125679 123489 121472 119917 118544 117275 116389 115987 115769
52765A15769k85l57n96j315k231k585k006r47k09k83j007j634j469o82k63q35
$$ 115769 115484 115127 114531 113216 110985 108400 106394 105447 105238 104955 103948 102314 100845 100163 99900 99065
52749I9065j820k242j994j708j610j318p25k67j31P2N80J002R42N53J43k42n12
$$ 99065 97245 95003 93009 91301 89691 88373 87648 87381 87250 87322 87902 88904 89846 90399 90542 90300 89788
52732H9788k87M60R93N79m83j188j030l44L93R45J091O34j35n83n41m74o43o07
$$ 89788 89501 89961 90954 91533 91050 89862 88832 88488 88881 89826 90917 91551 91416 90833 90292 89818 89175 88568
52714H8568N9J060J804K143K224K004J496J174J456J987K073J759J702J986J887
$$ 88568 88627 89687 91491 93634 95858 97862 99358 100532 101988 103975 106048 107807 109509 111495 113382
52699A13382J016o3o84q78r06o49k5M34J07r10j942k479k429j944j385j202j426
$$ 113382 114398 114335 113651 112773 111867 111218 111193 111627 111734 110824 108882 106403 103974 102030 100645 99443 98017
52682I8017j613j552j654k177k645k528k100j875j660r55rM32K64P4O4j83p69
$$ 98017 96404 94852 93198 91021 88376 85848 83748 81873 80213 79258 79249 79681 79945 80019 80083 79900 79131
52665G9131j153j001o70n90o73o17k95K19P25Q70N34J39J36K51j98j240k170k499
$$ 79131 77978 76977 76307 75717 75044 74427 74132 74351 75076 75946 76480 76619 76755 77006 76808 75568 73398 70899
52647G0899k290j617n05O06J112J128J278J570J437J007J192K097K466J441j29
$$ 70899 68609 66992 66487 67093 68205 69333 70611 72181 73618 74625 75817 77914 80380 81821 81692
52632H1692r82j173j527k030j942j207o78q83j414j606j268o78k46j95l64l86
$$ 81692 80710 79537 78010 75980 74038 72831 72153 71270 69856 68250 66982 66304 66058 65863 65499 65113
52616F5113k44k40l01P9Q45J042J24r30p43N97J684J717J262J086J104Q75M01
$$ 65113 64869 64629 64328 64407 65252 66294 66418 65488 64745 65342 67026 68743 70005 71091 72195 73070 73471
52599G3471l4l47n68n21l0O53R73O89J81%K38M58L47J24R1R6j01j81M00J446K051
$$ 73471 73437 73090 72522 72001 71971 72624 73597 74286 74467 74467 74705 75163 75510 75634 75725 75821 75720 75539 75939 77385 79436
52578G9436J794J197P91M80J76L06J029J596J295N22K28N50Q39Q16Q82J267J621
$$ 79436 81230 82427 83218 83698 83874 84180 85209 86805 88100 88622 88850 89400 90239 91055 91937 93204 94825
52561I4825J539J065N41L24O33J317J859J921J739J635J450Q96K57J17M57O69
$$ 94825 96364 97429 97970 98294 98927 100244 102103 104024 105763 107398 108848 109744 110001 110118 110575 111244
52545A11244M72K88N08R06R66N40Rj38J77N28N36M28P31J319J389N99l47o50m03
$$ 111244 111716 112004 112512 113418 114384 114924 114933 114795 114972 115500 116036 116464 117195 118514 119903 120502 120155 119505 119102
52526A19102l7M91J209J418M68j010j715j368q04n39l19j23m43j200j472p40L40
$$ 119102 119065 119556 120765 122183 122651 121641 119926 118558 117754 117215 116896 116773 116330 115130 113658 112918 113258
52509A13258R71J165J257J118N49k15q66j508k106k079j034L81J084P63m8q21
$$ 113258 114229 115394 116651 117769 118318 118103 117237 115729 113623 111544 110510 110891 111975 112738 112690 111869
52493A11869j342j372p04M10J333J629J307N72k24n52j31N74P60K89j19J29P50
$$ 111869 110527 109155 108451 108861 110194 111823 113130 113702 113478 112926 112795 113369 114129 114418 114299 114428 115178
52476A15178J066Q69N29M39O76J095J433J384Q35O4m51m91k29M7J57J0l47o01
$$ 115178 116244 117113 117642 118081 118757 119852 121285 122669 123504 123568 123117 122626 122397 122444 122601 122611 122264 121663
52458A21663l81K33O26L83j27j45N48J474K049K038J436M32m52n90P5Q53J021
$$ 121663 121282 121515 122141 122524 122397 122252 122800 124274 126323 128361 129797 130229 129777 129187 129262 130115 131136
52441A31136M71l19p87n50L55J346J655J163O08O70J142J299Q72K56j02j21O2
$$ 131136 131607 131288 130501 129951 130306 131652 133307 134470 135078 135748 136890 138189 139061 139317 139215 139094 139156
52424A39156L29N63O23M32J7m62p56p29o15q96j775k840l382k955j705l85J25
$$ 139156 139485 140048 140671 141103 141120 140658 139902 139173 138558 137662 135887 133047 129665 126710 125005 124620 124745
52407A24745l79j057r49j93K22k8k02J15J59q27k158k439j412j86K51M5n9L84
$$ 124745 124366 123309 122360 122167 122389 122361 122159 122274 122433 121606 119448 117009 115597 115411 115662 115707 115648 116032
52389A16032J239J989K057J351M41K0K49Q33J388J510Q44l60j119p11L81J049
$$ 116032 117271 119260 121317 122668 123109 123129 123378 124211 125599 127109 127953 127593 126474 125763 126144 127193
52373A27193Q95L80j8j64P7P71J524J823J727J634J516J092O43Q30J626K272K407
$$ 127193 128088 128468 128450 128286 128363 129134 130658 132481 134208 135842 137358 138450 139093 139923 141549 143821 146228
52356A46228K412K486K285J802J693K259K807K692K304K384K799K786K144J423
$$ 146228 148640 151126 153411 155213 156906 159165 161972 164664 166968 169352 172151 174937 177081 178504
52342A78504J071R96R85J054J226J327J229J043R61R69R18Q47J083J780K532K706
$$ 178504 179575 180571 181556 182610 183836 185163 186392 187435 188396 189365 190283 191130 192213 193993 196525 199231
52326A99231K240J744J609J464R36M76P74J646K213K204K237K705L146L055K671
$$ 199231 201471 203215 204824 206288 207224 207700 208474 210120 212333 214537 216774 219479 222625 225680 228351
52311B28351K509K565K529K445K735L569M638N443N764N769N831O150O578O913
$$ 228351 230860 233425 235954 238399 241134 244703 249341 254784 260548 266317 272148 278298 284876 291789
52297B91789P252P804Q446Q831Q922R041R403R891J0336J0694J0954J1158J1495
$$ 291789 299041 306845 315291 324122 333044 342085 351488 361379 371715 382409 393363 404521 416016
52284D16016J2034J2420J2315J1997J2111J2758J3446J3885J4238J4504J4345
$$ 416016 428050 440470 452785 464782 476893 489651 503097 516982 531220 545724 560069
52273E60069J3821J3539J3747J3825J3175J2136J1501J1447J1499J1304J0874
$$ 560069 573890 587429 601176 615001 628176 640312 651813 663260 674759 686063 696937
52262F96937J0240R291Q022O623N233L863K561J526R60R15J179J354J102M23l79
$$ 696937 707177 716468 724490 731113 736346 740209 742770 744296 745256 746171 747350 748704 749806 750229 749850
52247G49850r94j367j603j741j591q48M68J772K428K564K972L969M916N221N305
$$ 749850 748856 747489 745886 744145 742554 741706 742174 743946 746374 748938 751910 755879 760795 766016 771321
52232G71321N912O863P415P587Q233R666J1066J1516J1104J0641J0722J1168J1245
$$ 771321 777233 784096 791511 799098 807331 816997 828063 839579 850683 861324 872046 883214 894459
52219H94459J0376Q890P804P598P531O757N560M736M239L428K410J831J466L11
$$ 894459 904835 913725 921529 929127 936658 943415 948975 953711 957950 961378 963788 965619 967085 967396
52205I67396j709l393l957l983m259m817n553o630p776q282q251q665r636r811
$$ 967396 965687 962294 958337 954354 950095 945278 939725 933095 925319 917037 908786 900121 890485 880674
52191H80674q371o505n729n879n961n982o468o937o433n270m701m939m940m141
$$ 880674 872303 865798 860069 854190 848229 842247 835779 828842 822409 817139 812438 807499 802559 798418
52177G98418l208k816k821k941l260l684l706l156k605k609k969l049k564j853
$$ 798418 795210 792394 789573 786632 783372 779688 775982 772826 770221 767612 764643 761594 759030 757177
52163G57177j505j776k325k563k372k190k266k312k147k100k362k470k058j574
$$ 757177 755672 753896 751571 749008 746636 744446 742180 739868 737721 735621 733259 730789 728731 727157
52149G27157j539j607j197o82r46k012k975l313l300l249l145l134l479l944l971
$$ 727157 725618 724011 722814 722132 721186 719174 716199 712886 709586 706337 703192 700058 696579 692635 688664
52134F88664l583l440l852m424m780m892m661l936l147l102l826m334l952l183
$$ 688664 685081 681641 677789 673365 668585 663693 659032 655096 651949 648847 645021 640687 636735 633552
52120F33552k820k782k418j514n22J8j69r87j896k162j569p19k61n0O13J980L513
$$ 633552 630732 627950 625532 624018 623496 623514 623345 622358 620462 618300 616731 616012 615751 615701 616314 618294 621807
52103F21807M505M739M454M010L705L840M535N497O206O558P133Q504J0425J2114
$$ 621807 626312 631051 635505 639515 643220 647060 651595 657092 663298 669856 676989 685493 695918 708032
52089G08032J3221J4033J4735J5147J5334J5765J6488J6902J6787J6793J7264
$$ 708032 721253 735286 750021 765168 780502 796267 812755 829657 846444 863237 880501
52078H80501J7326J6095J4329J3642J4308J4849J3957J1895R851Q690Q503Q722
$$ 880501 897827 913922 928251 941893 956201 971050 985007 996902 1006753 1015443 1023946 1032668
52066A032668Q438P177N471M166L241J944N1j772l056m140n389o509o996o788
$$ 1032668 1041106 1048283 1053754 1057920 1061161 1063105 1063156 1061384 1058328 1054188 1048799 1042290 1035294 1028506
52052A028506o198n684n748o528p385p467o877o559o878p064o492n640n247n150
$$ 1028506 1022308 1016624 1010876 1004348 996963 989496 982619 976060 969182 962118 955626 949986 944739 939589
52038I39589m658l608k415j358m99OO8K6L95J283K355L238L740L914M064M443
$$ 939589 934931 931323 928908 927550 927051 927057 927125 927151 927546 928829 931184 934422 938162 942076 946140 950583
52022I50583M752M389L445K885L314M050M061L356K712K292J483J21j040j371
$$ 950583 955335 959724 963169 966054 969368 973418 977479 980835 983547 985839 987322 987443 986403 985032
$$ [...]
##END NTUPLES=NMR SPECTRUM
##END=
