##TITLE=NES1057_10436_9270512_i6ZycdL28d
##JCAMPDX= 6.0         $$ Bruker NMR JCAMP-DX V2.0
##DATA TYPE= NMR SPECTRUM
##DATA CLASS= NTUPLES
##ORIGIN= BRUKER
##OWNER= Administrator
$$ 1.72 TOPSPIN		Version 2.1
$$ 2015-07-11 20:04:33.800 -0700  Administrator@X
$$ Compression mode = diff/dup
##.OBSERVE FREQUENCY= 400.02188249412
##.OBSERVE NUCLEUS= ^1H
##.ACQUISITION MODE= SIMULTANEOUS (DQD)
##.ACQUISITION SCHEME= undefined
##.AVERAGES= 64
##.DIGITISER RES= 22
##SPECTROMETER/DATA SYSTEM= spect
##.PULSE SEQUENCE= noesygpps1d.comp
##.SOLVENT NAME= COFFEE_meoh
##.SHIFT REFERENCE= INTERNAL, COFFEE_meoh, 1, 14.96305
##AUDIT TRAIL= $$ (NUMBER, WHEN, WHO, WHERE, PROCESS, VERSION, WHAT)
$$ ##TITLE= Audit trail, TOPSPIN		Version 2.1
$$ ##JCAMPDX= 5.01
$$ ##ORIGIN= Bruker BioSpin GmbH
$$ ##OWNER= Administrator
$$ $$ E:\/data/COFFEE/nmr/NES1057_10436_9270512_i6ZycdL28d/12/pdata/1/auditp.txt
$$ ##AUDIT TRAIL=  $$ (NUMBER, WHEN, WHO, WHERE, PROCESS, VERSION, WHAT)
(   1,<2015-07-11 20:04:28.285 -0700>,<Administrator>,<X>,<go>,<TOPSPIN 2.1>,
      <created by zg
	started at 2015-07-11 19:52:58.597 -0700,
	POWCHK enabled, PULCHK disabled,
       configuration hash MD5:
       21 0F 79 D6 B3 7B B4 F6 88 20 88 DB 03 48 BD 9F
       data hash MD5: 64K
       0F 63 80 12 63 E3 3C 8D DA 37 0F A2 94 14 A8 46>)
(   2,<2015-07-11 20:04:31.660 -0700>,<Administrator>,<X>,<proc1d>,<TOPSPIN 2.1>,
      <Start of raw data processing
       efp LB = 0.3 FT_mod = 6 PKNL = 1 PHC0 = 0 PHC1 = 0 SI = 128K 
       data hash MD5: 128K
       1E A6 9D 6D B8 2F 3F D6 33 94 06 80 EE 91 81 E9>)
(   3,<2015-07-11 20:04:32.566 -0700>,<Administrator>,<X>,<proc1d>,<TOPSPIN 2.1>,
      <pk PHC0 = -83.69934 PHC1 = 0 
       data hash MD5: 128K
       50 73 B5 71 63 48 DB 2B CA 89 E6 9F FE B0 4E 58>)
(   4,<2015-07-11 20:04:32.972 -0700>,<Administrator>,<X>,<proc1d>,<TOPSPIN 2.1>,
      <abs ABSG = 1 
       data hash MD5: 128K
       E9 33 B7 1C 52 8F DD 55 C8 25 FD BF EE 35 63 0E>)
(   5,<2015-07-11 20:04:33.066 -0700>,<Administrator>,<X>,<proc1d>,<TOPSPIN 2.1>,
      <abs ABSG = 2 
       data hash MD5: 128K
       EC 60 7D 99 06 09 79 2B 3B 15 B2 15 3F 9E 04 E0>)
(   6,<2015-07-11 20:04:33.160 -0700>,<Administrator>,<X>,<proc1d>,<TOPSPIN 2.1>,
      <abs ABSG = 3 
       data hash MD5: 128K
       C1 55 75 AF 03 05 BE 2B 90 C9 8A C0 B1 2E BD 5B>)
(   7,<2015-07-11 20:04:33.253 -0700>,<Administrator>,<X>,<proc1d>,<TOPSPIN 2.1>,
      <abs ABSG = 4 
       data hash MD5: 128K
       B1 AD B7 A8 F8 05 0E 9C FD FE AF 89 FC 8D 8E EE>)
(   8,<2015-07-11 20:04:33.488 -0700>,<Administrator>,<X>,<proc1d>,<TOPSPIN 2.1>,
      <abs ABSG = 5 
       data hash MD5: 128K
       6C 9F D4 44 F6 B7 F9 A7 58 AB F1 11 DB D3 69 C8>)
$$ ##END=
$$ 
$$ $$ hash MD5
$$ $$ 70 FA D4 92 AF CE 6E 10 5D C0 FA 5B F3 93 37 0E
##$RELAX= 
##$RELAX= 
##$RELAX= 
##$RELAX= 
##$RELAX= 
##$RELAX= 
##$RELAX= 
##$RELAX= 
$$ Bruker specific parameters
$$ --------------------------
##$DU= <E:\>
##$EXPNO= 12
$$ [...]
##$TP07= 0
##$TPNAME0= <>
##$TPNAME1= <>
##$TPNAME2= <>
##$TPNAME3= <>
##$TPNAME4= <>
##$TPNAME5= <>
##$TPNAME6= <>
##$TPNAME7= <>
##$TPOAL= (0..7)
0.5 0.5 0.5 0.5 0.5 0.5 0.5 0.5
##$TPOFFS= (0..7)
0 0 0 0 0 0 0 0
##$TUNHIN= 0
##$TUNHOUT= 0
##$TUNXOUT= 0
##$USERA1= <user>
##$USERA2= <user>
##$USERA3= <user>
##$USERA4= <user>
##$USERA5= <user>
##$V9= 5
##$VALIST= <valist>
##$VCLIST= <CCCCCCCCCCCCCCC>
##$VD= 0
##$VDLIST= <DDDDDDDDDDDDDDD>
##$VPLIST= <PPPPPPPPPPPPPPP>
##$VTLIST= <TTTTTTTTTTTTTTT>
##$WBST= 2048
##$WBSW= 25
##$XGAIN= (0..3)
0 0 0 0
##$XL= 0
##$YL= 0
##$YMAX_a= 8569366
##$YMIN_a= -17140392
##$ZGOPTNS= <>
##$ZL1= 120
##$ZL2= 120
##$ZL3= 120
##$ZL4= 120
##$ABSF1= 14.96305
##$ABSF2= -5.595132
##$ABSG= 5
##$ABSL= 3
##$ALPHA= 0
##$AQORDER= 0
##$ASSFAC= 0
##$ASSFACI= 0
##$ASSFACX= 0
##$ASSWID= 0
##$AUNMP= <proc_prof1d_extract.lims>
##$AXLEFT= 0
##$AXNAME= <>
##$AXNUC= <1H>
##$AXRIGHT= 0
##$AXTYPE= 0
##$AXUNIT= <>
##$AZFE= 0.1
##$AZFW= 0.1
##$BCFW= 0
##$BC_mod= 0
##$BYTORDP= 0
##$COROFFS= 0
##$CY= 15
##$DATMOD= 1
##$DC= 0
##$DFILT= <>
##$DTYPP= 0
##$F1P= 0
##$F2P= 0
##$FCOR= 0.5
##$FTSIZE= 131072
##$FT_mod= 6
##$GAMMA= 0
##$GB= 0
##$INTBC= 1
##$INTSCL= 1
##$ISEN= 128
##$LB= 0.3
##$LEV0= 0
##$LPBIN= 0
##$MAXI= 10000
##$MC2= 0
##$MEAN= 0
##$ME_mod= 0
##$MI= 0
##$NCOEF= 0
##$NC_proc= -2
##$NLEV= 6
##$NOISF1= 0
##$NOISF2= 0
##$NSP= 0
##$NTH_PI= 0
##$NZP= 0
##$OFFSET= 14.96305
##$PC= 1
##$PHC0= -83.69934
##$PHC1= 0
##$PH_mod= 1
##$PKNL= yes
##$PPARMOD= 0
##$PPDIAG= 0
##$PPIPTYP= 0
##$PPMPNUM= 2147483647
##$PPRESOL= 1
##$PSCAL= 4
##$PSIGN= 0
##$PYNMP= <proc.py>
##$REVERSE= no
##$SF= 400.02000881668
##$SI= 131072
##$SIGF1= 0
##$SIGF2= 0
##$SINO= 400
##$SIOLD= 131072
##$SPECTYP= <>
##$SREGLST= <1H.CDCl3>
##$SSB= 0
##$STSI= 131072
##$STSR= 0
##$SW_p= 8223.68421052631
##$SYMM= 0
##$S_DEV= 0
##$TDeff= 65536
##$TDoff= 0
##$TI= <>
##$TILT= no
##$TM1= 0
##$TM2= 0
##$TOPLEV= 0
##$USERP1= <user>
##$USERP2= <user>
##$USERP3= <user>
##$USERP4= <user>
##$USERP5= <user>
##$WDW= 1
##$XDIM= 131072
##$YMAX_p= 429875997
##$YMIN_p= -11387
##$CURPLOT= <Network HP LaserJet P1505>
##$CURPRIN= <$Network HP LaserJet P1505>
##$DFORMAT= <normdp>
##$LAYOUT= <+/1D_H.xwp>
##$LFORMAT= <normlp>
##$PFORMAT= <normpl>
##$SURQMSG= 1
$$ End of Bruker specific parameters
$$ ---------------------------------
##NTUPLES= NMR SPECTRUM
##VAR_NAME=  FREQUENCY,     SPECTRUM/REAL,   SPECTRUM/IMAG
##SYMBOL=    X,             R,               I
##VAR_TYPE=  INDEPENDENT,   DEPENDENT,       DEPENDENT
##VAR_FORM=  AFFN,          ASDF,            ASDF
##VAR_DIM=   131072,        131072,          131072
##UNITS=     HZ,            ARBITRARY UNITS, ARBITRARY UNITS
##FACTOR=    0.0627417313425164, 1,          1
##FIRST=     8223.62146879497, -2693,        -61666
##LAST=      0,             -145,            -62885
##MIN=       0,             -11387,          0
##MAX=       8223.62146879497, 429875997,    0
$$ Real data points
##PAGE= N=1
##DATA TABLE= (X++(R..R)), XYDATA
$$ [...]
64387 81940 82246 82295 81785 80925 80364 80420 80697 80749 80870 81822 83751 85769 86845 86928 86892 87392 88125 88397 88146 87993
64367 87993 88376 89016 89400 89456 89540 89986 90839 91887 92736 93059 93020 93308 94438 96041 97146 97248 96857 96937 97912
64348 97912 99414 100852 102011 103052 104078 104961 105608 106192 106954 107918 109023 110487 112776 116104 120193 124624
64332 124624 129320 134572 140700 147786 155706 164370 173881 184369 195595 206867 217394 226540 233532
64319 233532 237262 236876 232578 225492 216740 206957 196644 186384 176509 167037 158185 150578 144608 139917
64305 139917 135859 132237 129270 127004 125216 123788 122791 122144 121447 120336 118917 117800 117636 118515 119778
64290 119778 120549 120553 120312 120533 121425 122664 123843 124848 125831 126873 127665 127680 126877 126094 126357 127832 129770 131444
64272 131444 132683 133437 133382 132263 130303 128041 126009 124743 124642 125459 126251 126219 125445 124597 124123 123986 123883
64255 123883 123458 122561 121660 121701 123106 125053 126174 125953 125087 124549 124635 124986 125230 125479 126262 127980 130390 132765
64237 132765 134646 136225 137856 139493 140881 142105 143578 145548 147908 150432 152902 155004 156366 156796
64223 156796 156339 155161 153532 151906 150823 150595 151147 152142 153269 154440 155800 157557 159817 162598 165900
64208 165900 169776 174477 180618 188903 199419 211370 223838 236594 249749 262832 274761 284675
64196 284675 292164 296688 297501 294456 288338 280152 270558 260192 249902 240262 231205 222468 214006 205821
64182 205821 197947 190917 185537 181690 177953 173112 167684 163249 160548 158908 157410 155932 154914 154524
64168 154524 154266 153401 151833 150508 150559 151946 153426 154028 154028 154207 154832 155838 157430 159839 162829 165984 169196
64151 169196 172478 175777 179383 183907 189298 194465 198624 202441 207022 212359 217679 222862 228371 234100
64137 234100 239421 244241 248867 252812 254899 254800 253464 251727 249357 245768 240937 235255 229139 223069 217465
64122 217465 212298 207359 202906 199400 196519 193245 189149 184817 180820 177092 173672 171241 170351 170718 171719
64107 171719 173050 174472 175579 176404 177750 180297 183695 187042 189949 192621 195234 197830 200650 204023
64093 204023 207895 211863 215685 219494 223516 227784 232113 236207 239755 242461 244060 244464 243990 243193 242204
64078 242204 240454 237459 233659 230001 226869 224031 221534 219815 218839 217918 216709 215695 215327 215328 215299 215444
64062 215444 216157 217283 218353 219255 220216 221417 223022 225311 228320 231612 234880 238555 243265 248828 254327
64047 254327 259201 263829 268858 274330 279722 284771 289995 296301 304056 312614 320819 327816 333329 337423
64033 337423 340383 342713 344856 346843 348528 350071 351761 353418 354563 355328 356721 359712 364456 370586
64019 370586 377823 386012 394953 404567 414984 426221 437989 450013 462295 474859 487524 500074
64007 500074 512382 524252 535460 546072 556341 566192 575251 583560 591722 600174 608898 618171 628848
63994 628848 641327 654835 668512 682846 699208 718163 739035 761140 784675 810259 838287
63983 838287 869046 903000 940548 981726 1026392 1074521 1126140 1181193 1239765 1302411 1370123
63972 1370123 1444029 1525301 1615359 1715993 1829236 1957315 2102932 2269530 2461104 2681769
63962 2681769 2935825 3228317 3565239 3952926 4397207 4902667 5471433 6101636 6787281
63953 6787281 7520544 8294566 9103832 9942109 10800322 11665528 12520246 13342177 14105824
63944 14105824 14786295 15363264 15823154 16159334 16370523 16457565 16420134 16255874 15962496 15540742
63934 15540742 14996587 14342844 13599733 12792685 11947537 11086331 10226088 9379451 8555467
63925 8555467 7761089 7003786 6292901 5637666 5043818 4512401 4041128 3625998 3262174
63916 3262174 2944797 2669511 2431807 2226147 2046688 1889052 1750691 1629450 1522533
63907 1522533 1427029 1340783 1262414 1191041 1126244 1067699 1014433 964790 917479 872342 829815
63896 829815 789939 752241 716400 682594 651166 622099 594875 568837 543690 519659 497141
63885 497141 476335 457294 440104 424778 411058 398583 387133 376447 365981 355226 344277
63874 344277 333718 323902 314667 305826 297539 290037 283213 276756 270588 264963 260192 256344 253175 250294
63860 250294 247415 244470 241550 238874 236825 235810 235842 236364 236671 236472 235875 234920 233403 231183 228501 225893
63844 225893 223871 222594 221665 220266 217768 214342 210786 207562 204184 199847 194646 189763 186199 183612
63830 183612 180841 177486 174408 172484 171443 170309 168585 166438 163997 161190 158311 156160 155354 155761 156665
63815 156665 157191 156714 155306 153806 153024 152864 152624 152081 151647 151462 151040 150058 148903 148200 148271 149163 150605 151790
63797 151790 151862 150931 149922 149178 148003 145986 143915 142720 142266 141917 141666 141789 141881 141173 139642 138010 136806
63780 136806 136084 135819 135827 135468 134215 132523 131465 131528 132283 133140 133803 134096 134045 134173 135065 136558 137904 138708
63762 138708 139198 139574 139759 139871 140309 141153 141993 142573 143137 143945 144844 145640 146624 148421 151359 155057 158640
63745 158640 161561 164306 168116 173713 180548 187637 194861 203012 212710 223840 236012 249051 262982
63732 262982 277891 293856 310721 327938 344793 360597 374396 384846 390947 392755 390961 385976
63720 385976 377954 367483 355598 343099 330377 317819 305797 294230 282754 271368 260471 250301
63708 250301 240840 232229 224679 218024 211915 206458 202007 198381 195028 192078 190399 190327 191021 191510 191750
63693 191750 192228 193086 194173 195643 197928 201319 205942 212025 219796 229144 239634 250900 262990 276365
63679 276365 291557 308606 326790 344972 362149 377466 389924 398528 402862 403203 399948 393134 382641
63666 382641 368763 352543 335552 319148 303777 289197 275425 263036 252289 242525 233036 224138
63654 224138 216739 211140 206986 204048 202231 200954 199551 198281 198008 198697 199207 198880 198535 199407 201837 205447
63638 205447 209982 215347 221286 227538 234121 241168 248770 257179 266734 277350 288475 299834 311850
63625 311850 325129 339899 356115 373571 391529 408602 423379 435048 443362 448404 450584 450431
63613 450431 448161 443793 437851 431550 426072 421922 419112 417535 416914 416672 416014 414043 410042 404134 397434
63598 397434 390885 384085 376122 367441 359761 353941 349042 343936 338700 333738 328638 322920 317146 312266
63584 312266 308364 305028 302432 301036 300505 300001 299468 299665 300929 302808 305088 308424 313664 320995 329945
63569 329945 339869 350323 361351 373511 387348 402812 419361 436492 453844 470849 486671 500520
63557 500520 511854 520347 525911 528731 529165 527754 525461 523632 523515 525896 531194 539461 550117 562178
63543 562178 575053 588728 602928 616626 628817 639210 647589 652967 654150 650827 643350 631639
63531 631639 615167 594110 569828 544062 518070 492518 467618 443273 419587 397331 377501
63520 377501 360402 345566 332615 321718 313105 306565 301605 297775 294728 292287 290612 289962 290147 290535
63506 290535 290746 291051 291872 293082 294156 294964 296218 299018 303938 310642 318422 327061 337031 348933 363005
63491 363005 379165 397165 416616 437165 458847 481871 505798 529228 550583 568874 583403
63480 583403 593158 597161 595268 588146 576589 561313 543339 523949 504066 484044 464188 445166
63468 445166 427720 412192 398480 386350 375668 366345 358135 350597 343422 336740 330892 325963 321900
63455 321900 319008 317766 317981 318748 319609 321221 324421 329142 334782 341203 348699 357350 367171 378636 392239
63440 392239 407622 423892 440737 458545 477412 496815 516421 536502 557277 578366 599077
63429 599077 618684 636233 650571 660880 666872 668411 665518 658918 650049 640255 630350 621056 613198
63416 613198 607041 601948 597168 592537 587939 582481 574939 564961 553324 540968 528196 514886 501109
63403 501109 487325 474122 461930 450919 441052 432212 424290 417273 411346 406833 403840 401992 400773
63390 400773 400177 400814 403275 407529 412997 419030 425312 432028 439791 449159 460076 471909 484171 497068
63376 497068 511214 526974 544234 562700 582203 602697 624033 645666 666528 685305 700950
63365 700950 712943 721104 725401 726188 724543 722078 720160 719221 718759 718027 716791 715438 714286 712768 709414
63350 709414 702777 692432 679062 663684 646946 629145 610634 591978 573725 556225 539714 524302
63338 524302 509786 495707 481857 468668 456846 446645 437635 429172 420927 413052 406103 400732 397100
63325 397100 394526 391956 388892 385654 382764 380415 378587 377295 376489 376016 375889 376338 377394 378641 379553
63310 379553 379870 379495 378334 376428 374035 371375 368533 365697 363113 360654 357773 354192 350277 346500 342957
63295 342957 339739 337266 335723 334568 333209 331929 331430 331613 331535 330563 328984 327400 326109 325269 325081 325506
63279 325506 326067 326168 325388 323428 320173 316053 312029 308895 306680 304950 303596 303034 303495 304352 304529 303678
63263 303678 302679 302593 303369 304147 304797 306318 309350 313000 315820 317520 319002 320929 323093 325188 327505 330639
63247 330639 334907 340133 345646 350543 354396 357808 361898 367238 373604 380732 388825 398216 408932 420779
63233 420779 433575 447290 462131 478418 496036 514049 531196 546796 560916 573879 586160
63222 586160 598580 611923 626204 640834 655593 670853 686738 702746 718586 734709 751475
63211 751475 768234 783787 797493 809321 818957 825476 827998 826307 820742 811817 800031 785720 768952
63198 768952 749743 728582 706617 685178 665229 647351 631998 619349 608950 599982 592133 586003
63186 586003 582396 581441 582696 585822 590769 597472 605896 616165 628086 640656 652812 664775 677870
63173 677870 692731 708455 723853 738769 753546 767984 781624 794585 807274 819506 830607
63162 830607 840169 848077 854027 857664 858935 857708 853318 845171 833584 819387 803006 784679 765270
63149 765270 745902 726846 707621 688241 669564 652371 636880 623174 611319 600918 591272 582130
63137 582130 573698 565968 558760 552368 547264 543095 538845 534170 529702 525903 522536 519477 517023 515035
63123 515035 512788 510204 508309 507823 508139 508396 508824 510184 512464 514977 517426 520125 523358 527110 531212
63108 531212 535394 539476 543779 548829 554265 558675 561119 562305 563591 565296 566738 567527 567945 568280 568665
63093 568665 569552 571524 574415 577255 579303 580742 582193 583952 585905 587924 590061 592348 594536 596162
63079 596162 597084 597889 599455 601983 604747 606935 608437 609707 611273 613608 616973 620996 624754 627769 630685
63064 630685 634601 640055 647084 655874 666655 679078 692375 706258 721191 737681 755720 775152
63052 775152 796272 819764 846096 875115 906272 939227 974158 1011375 1050667 1091193 1131961
63041 1131961 1172187 1211300 1249042 1285666 1321590 1356659 1390188 1422057 1453300 1485098 1517406
63030 1517406 1549009 1578782 1606373 1631655 1653980 1672134 1684777 1690736 1689027 1678881 1659974 1632738
63018 1632738 1598371 1558348 1513861 1465818 1415259 1363543 1312089 1262190 1215046 1171731 1132981
63007 1132981 1099089 1069991 1045371 1024947 1008899 997822 991935 990622 993102 999171 1008721 1020951
62995 1020951 1034979 1051058 1070091 1091862 1114788 1137675 1160651 1183924 1206704 1228117 1248334
62984 1248334 1267922 1286652 1303785 1319071 1332556 1343670 1351248 1354389 1352722 1345975 1333756 1315664
62972 1315664 1291319 1260543 1223862 1182469 1137412 1089278 1039063 988748 940294 894343 850503
62961 850503 808610 769136 732585 699121 668689 641071 615933 593131 572718 554386 537307
62950 537307 520887 505261 490705 477148 464731 454148 445693 438467 431369 424446 418404 413256 408421
62937 408421 403843 399926 396464 392758 388870 385743 383782 382206 380173 377835 375848 374410 373208 371947
62923 371947 370558 369093 367654 366288 364890 363324 361553 359492 356952 354069 351555 350092 349586 349425 349298
62908 349298 349358 349765 350494 351462 352409 352887 352722 352217 351468 349916 347274 344480 342807 342185 341311 339444 337170
62891 337170 335264 333631 331765 329625 327669 326385 325928 325940 325729 324978 324141 323699 323341 322579 321932 322525 324428
62874 324428 326348 327231 327327 327373 327609 328089 329251 331424 334152 336582 338371 339824 341362 343137 345004 346706
62858 346706 348205 349918 352311 355277 358209 360669 362587 363840 364229 363967 363607 363254 362393 360810 359230
62843 359230 358649 359275 360413 361229 361458 361509 361975 362906 363628 363537 362868 362303 361953 361272 359927 358216 356610 355430
62825 355430 354966 355279 355803 355791 355263 354923 355105 355519 356142 357469 359494 361304 362267 362988 364455 366733 369132
62808 369132 371282 373395 375670 378002 380249 382491 385143 388916 394299 400873 407513 413513 419197 425231
62794 425231 431923 439480 448332 458626 469833 481516 494201 508986 526544 546976 570351 596776
62782 596776 626077 657974 692528 730067 770797 814904 862776 914644 970079 1028336 1088996
62771 1088996 1151699 1215264 1277693 1337235 1392965 1444139 1489351 1526628 1554149 1570673 1575564
62760 1575564 1568796 1551046 1523603 1487942 1445246 1396346 1342202 1284356 1224665 1164531 1104672
62749 1104672 1045702 988553 934035 882248 832866 785961 742260 702573 667159 635664 607448
62738 607448 581915 558662 537381 517646 498941 481018 464191 449128 436321 425769 417053 409629
62726 409629 403095 397284 392155 387673 383869 380944 379080 378128 377696 377615 378169 379794 382691 386797 391936
62711 391936 397906 404628 412364 421628 432712 445417 459388 474666 491698 510830 531955 554824
62699 554824 579693 607530 639416 675666 715647 758491 803751 851189 900211 949830 999147
62688 999147 1047485 1094080 1137879 1177667 1212086 1239537 1258466 1267961 1267931 1258687 1240597 1214347
62676 1214347 1181280 1143176 1101551 1057162 1010251 961329 911676 862927 816185 771804 730063
62665 730063 691564 656706 625169 596385 570193 546545 524905 504608 485710 468794 453969
62654 453969 440698 428624 417848 408225 399090 390076 381646 374367 368048 361995 355847 349770 344002
62641 344002 338576 333414 328477 323776 319328 315107 311069 307301 303992 301093 298201 295085 292186 290216
62627 290216 289351 289157 289216 289359 289397 289107 288573 288192 288345 289333 291406 294368 297360 299655 301572 304002 307179
62610 307179 310689 314566 319463 325589 332388 339527 347329 355951 365011 374467 385034 397240 410799
62597 410799 425495 441929 460698 481457 503553 527157 553028 581481 612215 644725 678163
62586 678163 711048 741934 770319 796390 819964 840168 856032 866894 872322 872142 866514 855626
62574 855626 839433 818095 792580 764469 735185 705654 676537 648362 621403 595705 571296
62563 571296 548298 526913 507377 489708 473416 457710 442153 426940 412502 399162 387229
62552 387229 376998 368388 360859 353817 346805 339395 331468 323763 317500 313146 310063 307602 305805 304679
62538 304679 303581 302028 300525 299844 299895 300036 300186 300910 302608 305279 308959 313792 319699 326381 333530 340722
62522 340722 347491 354003 361333 370484 381381 393349 406274 420633 436613 453989 472832 493634
62510 493634 516648 541584 567994 595461 623383 651020 677821 703335 726784 747156 763752
62499 763752 776340 784685 788196 786075 777808 763726 745237 724187 701761 678251 654053 630277
62487 630277 607913 586959 567035 548468 531989 517574 504453 492238 481314 471985 463837 456121
62475 456121 448308 440200 431924 423957 416834 410764 405730 401820 399078 397195 395807 395014 395164 396155 397409
62460 397409 398533 399599 400833 402412 404508 407054 409491 411231 412405 413706 415407 416958 417646 417319 416289
62445 416289 414784 412638 409398 404731 398813 392238 385504 378800 372458 367238 363704 361529 359832 358161
62431 358161 356797 356170 356273 356587 356476 355860 355696 357378 361335 366590 372060 377806 384401 391499 397966 403483
62415 403483 409297 417049 427136 438341 448930 458109 466516 475183 484111 492373 499620 506640 514004
62402 514004 520991 526629 531105 535131 538415 539865 539139 536947 533826 529631 524409 518893 513856 509512
62388 509512 505713 502259 499053 496446 495286 496104 498463 501832 506790 514459 524941 537304 551198 567412
62374 567412 586660 608786 633463 660782 690763 723063 757559 794536 833973 875303 918134
62363 918134 962440 1007632 1052142 1094285 1132853 1166570 1193795 1213408 1225362 1229913 1227008 1217079
62351 1217079 1201747 1182833 1160977 1135887 1107613 1076849 1044225 1010105 975066 939893 905092
62340 905092 870928 838092 807792 780908 757312 736279 717416 700940 687112 675659 665934 657536
62328 657536 650462 644644 639676 635285 631773 629653 628977 629354 630486 632333 634894 638105 641752 645131 647112
62313 647112 647094 645711 644065 642488 640631 638462 636288 633879 630574 626490 622772 620309 618849 617689 616590
62298 616590 615680 615101 615255 616877 620438 625737 632259 639507 646831 653552 659680 666050 673360 681421 689567
62283 689567 697360 704601 711282 718037 726153 736493 748640 761594 775091 789728 805928 823382
62271 823382 841649 860979 882365 906866 934972 966556 1001329 1039144 1079829 1123007 1168297
62260 1168297 1215419 1263746 1311880 1357962 1400154 1436546 1465120 1484615 1495322 1498396 1494643 1484695
62248 1484695 1470039 1452697 1433688 1412809 1390126 1366733 1343682 1321177 1299431 1279448 1262276
62237 1262276 1248091 1236645 1228080 1222618 1219877 1219129 1219952 1222168 1225535 1229949 1235638 1242671 1250553 1258661
62223 1258661 1266823 1275224 1284090 1293698 1304172 1314994 1325263 1334859 1344830 1356195 1368917 1382440
62211 1382440 1396651 1411731 1427667 1444645 1463474 1484827 1508366 1533334 1559767 1588379 1619489
62200 1619489 1652837 1688414 1726755 1768280 1812837 1860013 1909426 1960706 2013557 2067793 2122854
62189 2122854 2177132 2228196 2273906 2313209 2345871 2371765 2390691 2402923 2409781 2413426 2415880 2418375
62177 2418375 2421849 2427837 2438292 2454495 2476576 2504061 2536246 2571906 2609446 2647826 2686779 2725578
62165 2725578 2762201 2794473 2821851 2845510 2866848 2886447 2904382 2920843 2936173 2950501 2963473
62154 2963473 2974381 2982676 2988461 2992390 2995160 2997321 2999516 3002388 3006116 3010418 3015139 3020440 3026265 3032064
62140 3032064 3037315 3041983 3046251 3050120 3053385 3055678 3056547 3055946 3054647 3053530 3052485 3050770 3048531 3046972
62126 3046972 3046676 3046750 3046190 3045174 3044286 3043336 3041882 3040310 3039411 3039251 3039363 3039738 3040776 3042420 3044094 3045389
62110 3045389 3046211 3046513 3046495 3046861 3048203 3050280 3052571 3055348 3059583 3065882 3074071 3083707 3094470 3106221 3119361
62095 3119361 3134972 3153839 3175017 3195807 3213406 3226629 3236341 3244643 3253601 3264449 3277846 3294362
62083 3294362 3313762 3333485 3348810 3355581 3352651 3341466 3324032 3302076 3277354 3251273 3223943 3194435
62071 3194435 3162098 3127055 3089536 3049573 3007522 2964166 2919983 2874704 2827855 2779497 2730402
62060 2730402 2681762 2634661 2589566 2546264 2504313 2463275 2422503 2381343 2340010 2299907 2262538
62049 2262538 2228423 2197392 2169420 2144569 2122473 2102435 2083609 2064566 2043255 2018305 1990092
62038 1990092 1959864 1928216 1895231 1861678 1828911 1797598 1767485 1738392 1710540 1683744 1657127
62027 1657127 1629952 1602220 1574435 1547351 1521871 1498488 1476726 1455672 1435131 1415725 1397981
62016 1397981 1382041 1368272 1357465 1350220 1346649 1346702 1350310 1357187 1367079 1380203 1396892 1416660 1438037
62003 1438037 1459183 1478225 1493161 1502183 1504103 1498068 1483104 1458708 1425845 1386657 1343241 1297338
61991 1297338 1250990 1206428 1165038 1127114 1092758 1062348 1035956 1013067 993098 975673 960246
61980 960246 946167 933356 922397 913726 907183 902391 899053 896785 895246 894520 894887 896223 898189 900956
61966 900956 905039 910401 916482 923222 931253 940877 951637 963208 976053 990888 1008099 1027945 1050710
61953 1050710 1076306 1104307 1134708 1168161 1205221 1245896 1290178 1338355 1390338 1445205 1501950
61942 1501950 1560485 1621671 1686561 1755787 1829345 1906902 1988598 2075485 2168676 2267991 2371857
61931 2371857 2478284 2585048 2688763 2784828 2869254 2940767 3001515 3056621 3113236 3178998 3260348
61920 3260348 3362122 3488522 3643662 3830784 4051526 4306568 4596738 4923236 5287081
61911 5287081 5688673 6127564 6602156 7109198 7642691 8191891 8739469 9261521 9729554
61902 9729554 10113132 10383051 10516018 10500062 10337503 10043597 9642454 9162710 8633781 8082482
61892 8082482 7530494 6993264 6480298 5996545 5544482 5125651 4740683 4388705 4067826
61883 4067826 3776347 3512900 3275615 3062150 2870767 2700430 2549542 2415494 2295929
61874 2295929 2189737 2096367 2014925 1944355 1883769 1832052 1787899 1750861 1721750 1701287 1688839
61863 1688839 1683089 1683499 1690443 1704221 1724497 1750524 1781449 1816597 1855685 1898417 1943730 1989905
61851 1989905 2035565 2079824 2121147 2157022 2185468 2206298 2220246 2227594 2228586 2224777 2218874 2213206
61839 2213206 2208949 2206702 2207168 2211148 2219273 2231643 2247448 2265082 2282929 2299784 2314382 2325087
61827 2325087 2330668 2331098 2327207 2320002 2310943 2302531 2297771 2298962 2307284 2323049 2345455 2371911 2398174
61814 2398174 2419474 2431707 2432385 2421603 2402483 2380145 2359732 2345143 2339081 2343507 2359658 2387901
61802 2387901 2427956 2479415 2542163 2616409 2702456 2800672 2911873 3037659 3180079 3341008
61792 3341008 3522144 3725607 3954177 4210917 4499045 4822346 5185357 5592903 6049690
61783 6049690 6560334 7129387 7760987 8458513 9224104 10057471 10954123 11903616 12887612
61774 12887612 13877420 14832527 15702500 16432342 16969285 17270102 17309052 17084157 16617485
61765 16617485 15948757 15126807 14203006 13226244 12238019 11269313 10341251 9467893 8658004
61756 8658004 7915493 7240313 6630036 6080841 5587909 5146083 4750547 4396687 4079693
61747 4079693 3794883 3538346 3306932 3097992 2909501 2740022 2587977 2451232 2327802
61738 2327802 2216545 2116718 2027324 1947459 1876749 1814656 1759772 1710588 1666715 1628591 1596163
61727 1596163 1568609 1545042 1524609 1505881 1487028 1466816 1444896 1421019 1394521 1364845 1332358
61716 1332358 1298531 1265358 1234266 1205291 1177559 1150849 1126359 1105635 1089265 1077014 1068625
61705 1068625 1063749 1061449 1060512 1059988 1058690 1054536 1045361 1030485 1010886 987977 962906 936904 911409
61692 911409 887486 865539 845580 827309 810016 793034 776387 760531 745509 730871 716449
61681 716449 702651 689897 678153 667086 656383 645979 636268 627863 620740 613903 606479 598961 592694
61668 592694 588260 585048 582342 579992 577866 575504 572749 570215 568655 568183 568485 569519 571680 575277 580071
61653 580071 585313 590200 594328 597736 600616 603097 605248 606920 607543 606555 604249 601749 599826 598238 596592
61638 596592 595377 595530 597369 600639 605378 612026 620732 631205 643297 657211 673076 690611 709118
61625 709118 727355 743472 755490 761929 761989 755514 743222 726688 707605 687149 666237 645932
61613 645932 627056 609686 593601 578995 566262 555450 546459 539473 534512 530810 527389 524145 521731
61600 521731 520479 520067 520181 520841 522081 523850 526201 529106 532226 535323 538687 542599 546720 550698 555105
61585 555105 560914 568125 575771 583387 591684 601651 613654 627604 643436 661157 680825 702525 726098
61572 726098 751022 776911 803905 832031 860494 888213 914797 940275 964156 985689 1004929
61561 1004929 1022616 1039059 1054142 1068462 1083380 1099591 1116574 1133823 1151745 1170770 1190297
61550 1190297 1209209 1227043 1244116 1260700 1276510 1290901 1303310 1313437 1320926 1324900 1324217 1318494
61538 1318494 1308509 1295189 1278735 1259420 1238763 1218878 1200806 1184394 1169674 1157362 1147892 1141031
61526 1141031 1136703 1135406 1137584 1143286 1152555 1165439 1181585 1200705 1223546 1251464 1284920 1323419
61514 1323419 1367193 1417795 1476512 1543182 1617255 1699219 1790368 1891901 2004930 2130663 2269818
61503 2269818 2422292 2588022 2767573 2961128 3167167 3382548 3603105 3823120 4034333
61494 4034333 4226473 4389333 4514626 4596753 4633184 4624884 4576293 4494412 4387260 4262481
61484 4262481 4126795 3986167 3845850 3709859 3580710 3460128 3349705 3250338 3161399 3081391
61474 3081391 3009552 2946109 2890942 2842814 2800119 2761861 2727789 2698329 2674529 2657409 2647158
61463 2647158 2643471 2646536 2656749 2673325 2694199 2717703 2743508 2771599 2801202 2831236 2861111 2890624
61451 2890624 2919802 2949439 2981160 3016421 3055894 3100093 3149706 3204764 3264190 3326808 3392158
61440 3392158 3459578 3526958 3591081 3648893 3698082 3737089 3765338 3783257 3791515 3790393 3780010 3760686
61428 3760686 3732829 3697114 3655180 3609522 3562178 3514129 3466411 3420986 3379729 3343127 3310718
61417 3310718 3282219 3257314 3234731 3212628 3190052 3167538 3146423 3128063 3113409 3102579 3094775
61406 3094775 3088949 3084531 3081257 3078610 3075806 3072154 3067135 3060365 3051844 3042055 3031745 3021931 3014207 3010487
61392 3010487 3012228 3020447 3036647 3063010 3101258 3152024 3215767 3293626 3386831 3495986 3621558
61381 3621558 3764489 3925586 4104634 4300454 4511091 4733220 4961927 5191628 5416462
61372 5416462 5629122 5820256 5980462 6103011 6184487 6223949 6222824 6185104 6116095 6020524 5902156
61361 5902156 5764456 5610282 5441136 5257956 5062871 4859408 4651162 4441297 4233326
61352 4233326 4031141 3837734 3654532 3482257 3321805 3174065 3039496 2918201 2810062
61343 2810062 2714648 2631378 2559825 2499625 2450246 2411217 2382335 2363141 2352422 2348825 2351794 2361320
61331 2361320 2376932 2397618 2422649 2451775 2484576 2520175 2557621 2596122 2635007 2673885 2712637
61320 2712637 2750843 2787578 2822357 2855778 2888288 2918641 2944445 2964069 2977130 2983548 2983462 2978155
61308 2978155 2969756 2959614 2947900 2934969 2921927 2909305 2896202 2881413 2864587 2845623 2823676
61297 2823676 2797635 2767227 2733071 2695961 2656624 2615847 2574371 2532890 2492464 2454623 2420707
61286 2420707 2391398 2367061 2348061 2334355 2325277 2320148 2318819 2321192 2326657 2334560 2344963 2358318
61274 2358318 2374443 2392241 2410324 2427442 2442206 2452826 2457352 2454145 2442229 2421661 2393966 2362242
61262 2362242 2330461 2302124 2279331 2263149 2254766 2255878 2267792 2290717 2324440 2369465 2426884 2497291
61250 2497291 2580370 2675306 2780798 2894619 3013997 3136686 3260931 3383857 3500282 3603375
61240 3603375 3686003 3741417 3763921 3750460 3701914 3622442 3517480 3392617 3253866 3107865
61230 3107865 2961066 2818673 2684268 2560026 2447020 2345538 2255470 2176366 2107008 2045079
61220 2045079 1987669 1932338 1877672 1822863 1767316 1711183 1656114 1604738 1559069 1519703 1486652
61209 1486652 1460368 1441535 1430324 1426380 1429115 1437224 1448049 1458215 1465162 1467817 1466043 1460262 1451725
61196 1451725 1442356 1433813 1426868 1421705 1418189 1415573 1412526 1407909 1401290 1392447 1380820 1365962 1348250
61183 1348250 1328685 1308055 1286609 1264446 1241852 1219301 1197416 1176918 1158390 1142118 1128282
61172 1128282 1117214 1109162 1103848 1100477 1098294 1097055 1096968 1098386 1101627 1106901 1114168 1122964 1132319 1140821
61158 1140821 1146709 1147987 1142802 1130124 1110285 1084816 1055695 1024755 993601 963588 935571 909784
61146 909784 886166 864677 845190 827352 810876 795874 782577 770846 760228 750473 741724 734258
61134 734258 728234 723593 719977 716840 713920 711478 709741 708270 706322 703801 701413 699840 699163 699122 699579
61119 699579 700646 702786 706753 712899 720244 726660 730284 730482 727367 720976 711420 699495 686576 673848
61105 673848 661871 650760 640475 630953 622206 614274 607035 600212 593731 587928 583218 579681 577137
61092 577137 575453 574629 574690 575633 577304 579191 580658 581585 582530 584009 585941 588119 590848 594531 598845 603044
61076 603044 607080 611734 617488 623856 630108 636114 642118 648165 654206 660477 667255 674347 681241 687653
61062 687653 693621 699118 703921 707867 711076 713995 717379 721965 727797 733969 739344 743491 746760 749687
61048 749687 752721 756316 760788 765982 771410 776728 781898 787033 792419 798506 805513 813205 821392 830360
61034 830360 840284 850516 860176 869278 878590 888453 898535 908621 918784 928771 938146 947198 956843
61021 956843 967506 978983 991449 1005561 1021339 1038093 1055807 1075497 1097873 1122823 1150727
61010 1150727 1183013 1220743 1263813 1312171 1366501 1426860 1491803 1559685 1629756 1701468 1774423
60999 1774423 1850117 1932260 2024271 2127919 2245161 2378987 2530743 2698709 2881419 3080893
60989 3080893 3301606 3549569 3835131 4173605 4579359 5061604 5629193 6296341 7080117
60980 7080117 7998691 9081626 10380475 11962007 13893662 16237198 19023306 22165204
60972 22165204 25355520 28086237 29866637 30505974 30219523 29471693 28722434 28292108 28363939
60963 28363939 28976313 29936908 30786362 30958492 30075855 28144415 25493917 22550555 19646946
60954 19646946 16972471 14611296 12582416 10862356 9409316 8185852 7163113 6312454
60946 6312454 5604198 5014439 4525709 4120460 3779491 3487155 3233251 3009418 2808074
60937 2808074 2625282 2460340 2311506 2175358 2050655 1939020 1840897 1754022 1676550 1608235
60927 1608235 1547355 1489606 1431639 1373400 1315989 1259665 1205090 1154095 1107705 1065144 1025724
60916 1025724 989889 957567 927563 899534 874600 853018 833141 813673 795113 777985 761529
60905 761529 745214 729703 715194 700627 685764 672275 661350 651837 642283 633415 626953 622999
60893 622999 620110 617231 614365 612020 610966 611809 614035 616214 617726 619281 621283 623035 624244 625873
60879 625873 628447 630850 631979 632471 633619 635561 637654 639678 641463 642159 641189 639362 637934 637079 636239
60864 636239 635489 635544 636706 638596 640712 642696 644293 645399 645949 645743 644884 644171 644251 644612 644524 644769 646891
60847 646891 650742 654511 657570 661445 667228 673674 678752 681523 681616 678592 673133 667514 663528 661002 659280
60832 659280 658720 659330 659279 656488 650986 644372 637778 631651 626732 623709 622332 622012 622771 624661 626981 629128
60816 629128 631577 634931 638665 641874 644616 647395 649924 651474 652015 652048 651835 651562 651644 652034 651985 651304 650997
60799 650997 651748 652647 652548 651818 651477 651316 650220 647885 645077 642542 640681 639834 639904 640047 639587 638770 637952 636793
60781 636793 635054 633364 632211 630974 629033 627048 626012 625677 625085 624082 623236 622794 622750 623327 624453 625372
60765 625372 625708 626113 626939 627207 626012 624003 622190 620237 617333 613908 610872 607937 604334 600576 597888
60750 597888 596342 595208 594639 595253 596248 595683 592694 588075 582812 577463 572847 569892 568627 568390 568868 569888
60734 569888 570618 570244 569127 567990 566341 563173 558865 554791 551234 547272 542595 537818 532975 527349 520984
60719 520984 514803 508991 502746 495958 489691 484587 480076 475583 471259 467058 462304 456824 451554 447425
60705 447425 444299 441423 438375 435374 433160 432586 433652 435110 435722 435758 436441 438195 440388 442588 444895
60690 444895 447157 449005 450840 453743 458214 463779 469773 475716 481049 485525 489827 494989 501241 508200
60676 508200 515846 524397 533541 542883 552857 564134 576427 588983 601884 615566 629431 642380
60664 642380 654526 666841 679204 690243 699176 706307 711710 714936 716254 716690 716539 715132 712285 708629
60650 708629 704279 698606 691618 684156 676378 667458 657275 647022 637588 628539 619289 610187 601859 594471
60636 594471 588046 582612 577737 572911 568590 565728 564096 562307 559871 557866 557104 556901 556294 555367 554731
60621 554731 554647 555271 556855 559220 561878 565027 569467 575174 581023 586372 591880 598245 605083 611610 617598
60606 617598 623207 628623 634247 640459 646942 653022 658796 664945 671361 677028 681365 684512 686199 685803
60592 685803 683814 681712 679828 676742 671479 664975 658611 652605 646696 641221 636487 632020 627386 622941
60578 622941 618982 614963 610352 605542 601128 596905 592301 587298 582346 577831 573962 570678 567472 563995
60564 563995 560851 558918 557857 556396 554201 552217 551013 550144 549485 549624 550459 550947 551015 552213 555486 559620
60548 559620 562928 565318 567630 570006 572143 574349 577248 581026 585734 591690 598925 606994 615966 626770
60534 626770 639994 655243 672200 691203 712157 734056 756469 780365 806632 834792 863961
60523 863961 893807 923470 950695 973224 990156 1000981 1004472 999998 989138 974634 958314 941080
60511 941080 924089 908493 894409 881359 869395 858913 849837 841935 835462 830636 827027 824345 823302
60498 823302 824813 828960 835555 845098 858256 874973 894917 918149 944481 972801 1001809 1030622
60486 1030622 1057810 1080859 1097829 1108965 1115645 1118568 1118238 1116532 1116291 1119591 1127525 1141382 1162879
60473 1162879 1193382 1233748 1284727 1346787 1419954 1504584 1601854 1713044 1839138 1981842 2143881
60462 2143881 2326831 2528912 2745238 2968588 3188149 3388519 3552424 3665416 3718037 3705313
60452 3705313 3627069 3489478 3304824 3088703 2857004 2623903 2400187 2192194 2002597 1832228
60442 1832228 1681001 1548020 1432047 1331864 1245696 1170985 1105689 1049200 1001072 959579
60432 959579 922777 890325 862836 839876 820071 802826 788371 776141 764680 753198 741984
60421 741984 731183 720533 710442 702048 695858 691338 687979 685703 684083 682301 680252 678734 678248 678487
60407 678487 679201 680664 682950 685543 688042 690601 693415 696380 699464 702809 706299 709577 712622 715781
60393 715781 719153 722494 725789 729367 733290 737099 740329 743001 745625 748871 753022 757480 761084 763228
60379 763228 764326 764920 764966 764402 763724 763314 762889 762360 762577 764255 766725 768782 770344 772244 774811 777809
60363 777809 781479 786386 792239 797972 803071 807896 812679 817148 821177 825029 828848 832664 836859 841945
60349 841945 847929 854597 862212 871177 881124 891090 900485 909092 916337 921442 924369 925825 926293 925676 923899
60334 923899 921220 918022 914793 912146 910299 908769 907077 905477 904463 903962 903541 902855 901248 897635 891709
60319 891709 884730 878091 871598 864105 855334 845986 836572 827373 819151 812533 806869 800963 794742 789026
60305 789026 783828 778249 772041 766018 760732 755846 750972 746172 741548 737235 733800 731775 730915 730731 731510
60290 731510 733780 737058 740340 743624 747688 752503 757257 761910 767233 773072 778079 781653 784961 789464
60276 789464 795379 802112 809285 816794 824535 832481 840624 848661 856227 863337 870085 876205 881733 887816
60262 887816 895870 906080 917636 930206 944158 959546 976057 993847 1013235 1033653 1054135 1074856
60250 1074856 1096992 1121104 1146956 1174965 1206433 1242127 1281928 1326125 1375739 1431210 1492038
60239 1492038 1558207 1630825 1710847 1798093 1891808 1991179 2094925 2201281 2308693 2415774
60229 2415774 2520501 2620451 2713878 2799517 2875381 2939130 2989809 3027911 3053536 3065965 3065502
60218 3065502 3054267 3034405 3006689 2971606 2930826 2886934 2842574 2800352 2762662 2730902 2705501
60207 2705501 2687010 2676494 2674781 2682327 2699963 2728706 2768617 2819041 2880150 2952951 3037402 3131819
60195 3131819 3234503 3344393 3459361 3575205 3687311 3792420 3888197 3972317 4042925 4099042
60185 4099042 4139580 4162713 4166930 4152072 4118866 4068420 4002779 3925079 3838475 3745657 3649829
60174 3649829 3554993 3464520 3380315 3304014 3237982 3184346 3144003 3117422 3105526 3108920 3127022
60163 3127022 3158814 3203678 3260532 3326715 3398573 3472570 3545166 3612314 3670203 3716475 3750276
60152 3750276 3771472 3780209 3776722 3761155 3733963 3696754 3652172 3602787 3550752 3498603 3449384 3405674
60140 3405674 3369400 3342869 3328823 3328955 3343520 3373008 3419124 3483452 3566264 3667529 3788116
60129 3788116 3929087 4090710 4273131 4477220 4703677 4951755 5219676 5505646 5807469
60120 5807469 6121510 6442773 6765645 7084057 7391560 7682142 7950864 8193274 8404693
60111 8404693 8580507 8716842 8810753 8860417 8865552 8826993 8745480 8621523 8456809 8255103
60101 8255103 8021651 7762661 7485708 7199455 6912115 6630698 6361845 6112021 5885920
60092 5885920 5685453 5511113 5363693 5244112 5152472 5088189 5050581 5038852 5052062 5089421
60082 5089421 5149683 5229655 5324098 5427571 5535534 5643266 5744915 5834536 5907409 5959991
60072 5959991 5989767 5996041 5980084 5943749 5888553 5816328 5729412 5629369 5516504 5391391 5255928
60061 5255928 5112282 4962123 4807755 4652787 4500685 4353781 4214661 4087095 3974184
60052 3974184 3876620 3794187 3728030 3679979 3650521 3639017 3645363 3669923 3712189 3770907 3845279
60041 3845279 3934828 4038214 4153160 4277141 4407068 4538512 4666210 4785260 4891281 4980047
60031 4980047 5047987 5092952 5114018 5111049 5084891 5037075 4968462 4878950 4769395 4643229 4505417
60020 4505417 4360618 4213174 4067771 3928655 3798588 3679483 3573399 3481950 3405550 3344390
60010 3344390 3299540 3271988 3261301 3266546 3288026 3326838 3383129 3456021 3545022 3650472 3772782
59999 3772782 3911924 4067052 4235557 4412816 4593608 4773205 4946519 5107308 5249707
59990 5249707 5370095 5466534 5537139 5580242 5595555 5583859 5545893 5482530 5395523 5287189 5160142
59979 5160142 5018459 4868317 4716129 4566488 4422772 4288610 4167198 4059967 3967577 3891621
59969 3891621 3833734 3793584 3769550 3761141 3769254 3794338 3835856 3893195 3965428 4050251 4144560 4245941
59957 4245941 4352205 4459852 4564692 4663906 4755961 4838685 4909165 4965698 5008347 5037502 5053443
59946 5053443 5057517 5052209 5039747 5021989 5001942 4984007 4972282 4969752 4979442 5005155 5050588 5118553
59934 5118553 5211326 5330907 5478856 5656633 5865979 6107945 6381612 6684753 7015349 7370965
59924 7370965 7746397 8132953 8519829 8894676 9242771 9547507 9792973 9966096 10057235 10061142
59914 10061142 9978738 9817266 9587908 9303442 8977778 8625980 8263088 7902327 7553938
59905 7553938 7224919 6919734 6641747 6394099 6179027 5997003 5847386 5729651 5643292 5587137
59895 5587137 5559877 5561037 5590410 5646917 5729141 5836658 5969410 6125676 6301551 6492140
59885 6492140 6691936 6893913 7089392 7268919 7422548 7539681 7610364 7627596 7588455 7493821
59875 7493821 7348349 7160368 6940222 6698003 6442951 6183899 5928440 5681605 5446376
59866 5446376 5225234 5019848 4829531 4651706 4484227 4326322 4177590 4037655 3907047
59857 3907047 3787242 3679661 3585529 3506341 3443164 3395636 3362957 3345448 3343529 3355349 3377205
59846 3377205 3406266 3441047 3478928 3515036 3544063 3561751 3564469 3549433 3516472 3468500 3409660
59835 3409660 3343942 3275525 3208576 3145643 3087150 3032822 2982579 2935993 2892575 2853256 2820305
59824 2820305 2795132 2777176 2765309 2759127 2758492 2763255 2774089 2792527 2819555 2855011 2898336 2948343
59812 2948343 3001647 3052614 3095740 3127593 3146800 3153896 3151573 3143431 3131575 3116445 3099205 3082689
59800 3082689 3069488 3060853 3058378 3065127 3083897 3115586 3160385 3219580 3295191 3388896 3502432 3638256
59788 3638256 3798789 3985666 4200551 4445982 4724386 5036179 5378293 5742444 6112863
59779 6112863 6465627 6771218 6999544 7126084 7138436 7040665 6851779 6598675 6308591 6004924
59769 6004924 5705639 5422731 5163141 4930810 4727801 4553998 4407491 4286056 4187577 4109181
59759 4109181 4047554 4000693 3968115 3948981 3941436 3944324 3958119 3983412 4019818 4067115 4126144 4197745
59747 4197745 4281982 4379171 4490516 4616986 4758772 4916577 5092263 5287505 5503055 5740064
59737 5740064 6000775 6287136 6600072 6940971 7312320 7715660 8150044 8613326 9103245
59728 9103245 9615608 10142375 10672852 11195849 11699834 12172901 12605212 12991967 13333685
59719 13333685 13635046 13904819 14155722 14402093 14657136 14932287 15237428 15579532 15961104
59710 15961104 16380758 16834460 17314966 17810761 18307164 18788526 19238937 19642238 19983667
59701 19983667 20252276 20441719 20549864 20579199 20537357 20435942 20288548 20110114 19917060 19726302
59691 19726302 19553630 19413162 19317524 19277466 19301464 19396350 19567945 19820527 20156358 20576515
59681 20576515 21081616 21670753 22339942 23081967 23886502 24738602 25616465 26490625 27324733
59672 27324733 28077109 28703687 29162941 29421146 29456197 29260338 28842135 28226009 27448343
59663 27448343 26552172 25582743 24583586 23592558 22639228 21744104 20917515 20157042 19446473
59654 19446473 18759345 18065925 17340742 16569195 15751718 14902564 14043026 13194005 12372477
59645 12372477 11590990 10857308 10174479 9542730 8961516 8429549 7944016 7501398 7098917
59636 7098917 6734400 6405212 6108317 5841059 5601072 5385875 5193338 5022090 4870788
59627 4870788 4737478 4620408 4518795 4431955 4358216 4295514 4242539 4198435 4161823 4130838 4103654
59616 4103654 4078314 4052504 4024083 3991330 3952367 3905286 3849468 3785958 3716019 3640386 3560564
59605 3560564 3479449 3399464 3321103 3244417 3171004 3103207 3042137 2987718 2939993 2899129 2864741
59594 2864741 2836420 2814480 2799231 2790053 2786060 2786994 2792587 2801911 2814374 2830496 2850534 2873113
59582 2873113 2896375 2919711 2943151 2965893 2986839 3006125 3024952 3044477 3065933 3090998 3120818
59571 3120818 3155309 3194677 3240837 3295925 3360119 3432306 3512309 3601092 3699471 3808199 3928829
59560 3928829 4062935 4210825 4372340 4548283 4739509 4945067 5162797 5391290 5629486
59551 5629486 5874555 6121890 6367194 6607110 6837971 7055662 7256919 7439516 7601197
59542 7601197 7739974 7855567 7948827 8018933 8062193 8074558 8055274 8008340 7941183 7861932 7777270
59531 7777270 7692601 7614092 7549546 7506575 7490594 7505365 7554429 7640568 7764158 7922870 8112104
59520 8112104 8324369 8548738 8772208 8981516 9163118 9303011 9388872 9412673 9370426 9260319
59510 9260319 9082887 8842782 8548686 8211349 7842563 7455187 7061972 6673625 6298525
59501 6298525 5943660 5614410 5313652 5042402 4801231 4590021 4406889 4248961 4114215
59492 4114215 4001547 3909502 3836445 3781798 3745765 3727966 3727587 3744669 3779942 3833532 3904985
59481 3904985 3994254 4101431 4225809 4366471 4523402 4696635 4884578 5084444 5293797 5510007
59471 5510007 5728298 5941753 6143012 6324718 6478867 6597626 6675073 6707199 6691034 6625665
59461 6625665 6513985 6361785 6175252 5960664 5725670 5478430 5225275 4970876 4720443
59452 4720443 4479499 4251158 4035676 3833146 3644893 3471824 3313327 3168489 3036955
59443 3036955 2918108 2810876 2714848 2630192 2556103 2490776 2433320 2384266 2343705 2310345 2282913
59432 2282913 2261183 2245110 2234149 2227839 2225915 2227533 2231510 2237575 2246150 2256802 2268362 2280822
59420 2280822 2295667 2313884 2335080 2359034 2386532 2417646 2450087 2480086 2504620 2522911 2536946
59409 2536946 2550838 2568779 2593118 2624767 2664969 2715531 2777403 2849864 2930640 3015791 3100519
59398 3100519 3182356 3263914 3351123 3448855 3559490 3684939 3827603 3989116 4170322 4373038
59388 4373038 4600136 4853456 5133388 5441017 5779040 6150137 6556067 6998677 7479775
59379 7479775 7998880 8552100 9133233 9734051 10342997 10945781 11528920 12082253 12598376
59370 12598376 13072020 13501324 13888257 14236502 14549448 14830376 15082684 15308366 15506534
59361 15506534 15673632 15804134 15890847 15925857 15901803 15811874 15649470 15410276 15095563 14712251
59351 14712251 14269582 13777095 13245539 12686970 12112417 11530564 10949153 10375984 9817712
59342 9817712 9279249 8765218 8280548 7828687 7410460 7025470 6673410 6353455 6063715
59333 6063715 5802169 5567035 5355813 5165390 4993832 4840869 4706180 4588541 4487046
59324 4487046 4401525 4331084 4273698 4227914 4193412 4169242 4153105 4143220 4139423 4141577 4148279 4157858
59312 4157858 4169174 4180682 4190153 4196179 4198585 4196671 4188561 4173121 4151011 4123103 4089362 4050195
59300 4050195 4007252 3961938 3914635 3866426 3820097 3778350 3742306 3712713 3691132 3678908 3676371
59289 3676371 3684144 3703934 3736878 3782290 3838965 3906524 3984530 4071476 4165446 4264525 4365791
59278 4365791 4465256 4559497 4646042 4721600 4781482 4821305 4837404 4825213 4780089 4701606 4595386
59267 4595386 4469320 4329655 4181701 4031575 3884513 3742693 3606719 3478142 3358823
59258 3358823 3249126 3148720 3058260 2978655 2909662 2850806 2802629 2765409 2737651 2717583 2705331
59247 2705331 2702070 2707831 2721762 2743803 2774571 2814185 2862601 2920637 2989558 3070313 3164178 3273308
59235 3273308 3399570 3543688 3706601 3890713 4098756 4332390 4593043 4883044 5204592
59226 5204592 5558291 5943447 6358477 6799528 7259191 7727231 8191399 8636934 9047092
59217 9047092 9405932 9700172 9918360 10050805 10092348 10044224 9912125 9704127 9431736 9110705
59207 9110705 8758021 8388268 8013523 7644539 7289539 6952766 6636103 6341267 6069033
59198 6069033 5817846 5585339 5370420 5172341 4989078 4818610 4660631 4514990 4379478
59189 4379478 4251147 4128820 4012283 3900045 3790222 3683008 3580173 3482647 3390515 3304668
59179 3304668 3226353 3155523 3091485 3034686 2986086 2945331 2911379 2884404 2865283 2853668 2848304
59168 2848304 2848709 2854840 2865833 2880998 2901418 2928535 2961451 2997515 3035218 3074628 3115272 3155468
59156 3155468 3193668 3228834 3259608 3284556 3302991 3314294 3316936 3309654 3293052 3268606 3236717 3197172
59144 3197172 3150795 3099010 3042553 2982240 2920212 2858629 2797888 2737957 2680590 2628146 2580831
59133 2580831 2537316 2497567 2462926 2433848 2409865 2391607 2380711 2377745 2382169 2394204 2414757 2443527
59121 2443527 2479142 2521207 2570365 2626312 2687504 2752878 2822222 2894869 2969704 3046399 3125001
59110 3125001 3204361 3282638 3359388 3435807 3513250 3593148 3678025 3770715 3872492 3983418 4103961
59099 4103961 4234212 4371394 4509812 4643120 4764957 4867709 4943011 4984244 4987547 4950861
59089 4950861 4873982 4759883 4614527 4445065 4258982 4064016 3866771 3671225 3479833 3295673
59079 3295673 3121868 2959510 2808111 2667819 2539355 2422165 2314830 2217235 2130240 2053265
59069 2053265 1984244 1922022 1866775 1817969 1774043 1734362 1699358 1668336 1639160 1610783 1584340
59058 1584340 1561122 1541068 1523821 1509803 1499612 1493476 1491690 1494445 1501023 1510199 1521456 1534651
59046 1534651 1548612 1561270 1571020 1576745 1577041 1571185 1560921 1549831 1540889 1535687 1535408 1540855 1551747
59033 1551747 1567498 1588407 1614578 1644275 1675052 1705937 1736597 1765000 1788225 1805413 1817895
59022 1817895 1826814 1833009 1838977 1848213 1862126 1879713 1900515 1925726 1956002 1990169 2026404 2062709
59010 2062709 2095926 2122389 2140115 2148799 2147641 2135285 2112180 2080950 2043917 2001955 1956015 1907833
58998 1907833 1858762 1809642 1761995 1717556 1676537 1638250 1603499 1574175 1550336 1529891 1511521
58987 1511521 1495782 1483048 1472610 1464392 1459379 1457683 1458116 1460170 1464511 1471104 1478910 1487882 1499093
58974 1499093 1512340 1525815 1538945 1553459 1570856 1590840 1613066 1638376 1667153 1698166 1730035
58963 1730035 1762395 1794906 1826635 1857101 1886432 1913891 1937874 1958004 1975757 1992568 2008799
58952 2008799 2024977 2042384 2061941 2084018 2109609 2139985 2174936 2213116 2254416 2300115 2350398
58941 2350398 2403686 2458957 2516920 2578484 2643811 2713229 2787213 2865096 2945624 3029072 3117060
58930 3117060 3210299 3308669 3413662 3528413 3654924 3793398 3944554 4110166 4290952 4486452
58920 4486452 4697613 4927210 5177282 5448625 5743314 6065073 6416320 6797387 7209360
58911 7209360 7655018 8135806 8650220 9196030 9771441 10372745 10992883 11623047 12252964
58902 12252964 12868351 13450691 13981317 14444229 14824619 15108024 15283441 15346125 15296669 15139679
58892 15139679 14884678 14546100 14140392 13683333 13189119 12668557 12127039 11567071 10994403
58883 10994403 10419841 9854593 9306714 8782824 8289473 7830382 7404695 7009952 6644711
58874 6644711 6306998 5993045 5699798 5426739 5173569 4938308 4719358 4517080 4331501
58865 4331501 4160617 4002783 3858519 3728059 3609283 3500059 3400605 3311583 3231905 3160324
58855 3160324 3097150 3042374 2994067 2950697 2913162 2882566 2857875 2837844 2823331 2815488 2813314 2815187
58843 2815187 2821303 2832535 2848394 2868143 2892603 2923007 2959364 3001564 3050532 3106620 3168457
58832 3168457 3235120 3307940 3388634 3477317 3574003 3680232 3797369 3925004 4062846 4212546
58822 4212546 4375885 4552911 4743714 4950446 5175797 5421091 5687630 5978227 6295645
58813 6295645 6641037 7015454 7421034 7858960 8328022 8826676 9354318 9908495 10482566
58804 10482566 11067756 11655142 12233398 12786600 13296737 13747050 14121513 14403752 14579872
58795 14579872 14641908 14587615 14419335 14145390 13780549 13342348 12847677 12313701 11758961 11200398
58785 11200398 10650537 10119355 9616888 9151803 8729462 8353793 8029230 7758291 7538035
58776 7538035 7359137 7204693 7048157 6858019 6612025 6308872 5965417 5604488 5246219
58767 5246219 4905556 4590905 4304182 4044802 3813239 3609235 3429085 3268179 3124894
58758 3124894 2999243 2889505 2793431 2711109 2643174 2587393 2540324 2501205 2471097 2449415 2434554
58747 2434554 2426800 2427270 2434764 2446613 2461474 2478098 2492395 2499148 2496222 2484362 2463860 2434526
58735 2434526 2398066 2357281 2313378 2266733 2219315 2173348 2128287 2082013 2034252 1986040 1936874
58724 1936874 1885460 1832501 1779732 1726936 1672921 1618700 1566725 1517678 1470961 1427579 1389451
58713 1389451 1356410 1326873 1300947 1280021 1263786 1250482 1239443 1230639 1222374 1212301 1200159 1186910
58701 1186910 1172065 1154711 1136373 1119863 1105947 1093834 1083963 1077206 1072131 1066186 1059000 1051687
58689 1051687 1043866 1034545 1025184 1018611 1015445 1014628 1016756 1023696 1035576 1051426 1072273 1100502 1136621
58676 1136621 1179615 1229711 1287630 1351955 1420694 1495053 1578628 1673695 1781639 1906118 2051710
58665 2051710 2218655 2400264 2582905 2744515 2855908 2891659 2844106 2726135 2561258 2373226
58655 2373226 2181998 2001863 1839610 1696364 1572110 1466930 1378993 1305090 1243495 1193719
58645 1193719 1153912 1121532 1096123 1078321 1066604 1058183 1052530 1050689 1051781 1053791 1057290 1064650 1075963
58632 1075963 1089289 1104518 1123264 1145401 1169577 1196726 1229146 1266413 1306304 1349483 1399098
58621 1399098 1455923 1518161 1586062 1662359 1747927 1841373 1943301 2056540 2181540 2315711
58611 2315711 2458033 2610303 2773030 2943925 3120840 3301938 3481912 3651858 3803816
58602 3803816 3932084 4030055 4090346 4109536 4089414 4033031 3943246 3825611 3688349 3538161
58592 3538161 3379376 3217591 3060001 2911124 2771914 2643866 2530136 2431811 2347026 2274827
58582 2274827 2216115 2169861 2132191 2100347 2073951 2051577 2029957 2007705 1986446 1967505 1951093
58571 1951093 1939234 1935485 1940729 1952823 1970729 1994724 2021718 2044636 2057653 2058428 2044979 2015346
58559 2015346 1971922 1921965 1872198 1826278 1788019 1762308 1751033 1751404 1758869 1767619 1768090 1749704
58547 1749704 1708724 1650057 1580555 1504667 1427066 1353745 1287884 1228552 1175118 1128940 1089571
58536 1089571 1053972 1021151 993178 970135 948651 927110 907620 891075 875000 858231 843060
58525 843060 830658 818959 807174 797743 791556 785856 779279 774475 773304 773814 774442 776769 781586 786489
58511 786489 789997 793927 799306 804126 807571 812170 819213 826274 831800 837975 846598 856490 867586 883174
58497 883174 905132 931002 958452 988516 1021747 1055340 1086816 1116519 1143889 1165503 1179581
58486 1179581 1188367 1193408 1192637 1184620 1171342 1154125 1131262 1102516 1071665 1041825 1012568 984070
58474 984070 959251 938959 919889 900321 883046 869535 856354 840933 825952 814255 804130
58463 804130 793471 783938 776981 770156 761461 753173 747581 743087 738220 735252 735998 738263 740114 743360
58449 743360 749100 754354 757132 760402 767111 775662 784366 795837 812662 832878 853737 875587 897943
58436 897943 916315 927326 932743 934513 930553 919771 906313 894043 881434 866667 853055 844198
58424 844198 838221 832101 827547 827386 830154 833475 838925 848507 860098 871368 884379 901497 920636
58411 920636 939308 959130 981315 1001869 1016389 1025703 1031916 1033171 1027455 1017355 1005891 991806
58399 991806 974088 956690 943414 932364 920741 910636 904614 900169 894290 889045 886923 885177 880755
58386 880755 876377 875633 876444 875474 874648 877108 881016 883566 886800 893198 899945 903900 907810 915153 923407
58371 923407 929055 934630 943891 954552 962863 971013 982791 996212 1007646 1019036 1033778 1049708
58359 1049708 1063587 1078291 1098059 1120648 1141578 1161966 1184608 1206482 1222777 1234327 1243622
58348 1243622 1247920 1244103 1235980 1228888 1221475 1210740 1200380 1195592 1194072 1190939 1188274 1191016 1197668
58335 1197668 1203993 1211809 1225157 1241775 1257300 1273850 1295558 1319833 1342004 1364234 1390687 1418490
58323 1418490 1442927 1466854 1495188 1524871 1550394 1574411 1602258 1630569 1652182 1667842 1682039
58312 1682039 1691885 1691791 1685165 1679921 1676175 1669731 1663458 1663212 1666438 1667029 1667754 1675671 1688964 1700813 1712613
58297 1712613 1730619 1753061 1773525 1793828 1820541 1851968 1881585 1911072 1946722 1986288 2022920
58286 2022920 2058970 2102368 2152622 2204067 2259412 2325885 2401300 2478168 2557959 2646506 2738845
58275 2738845 2823771 2900014 2972734 3037897 3086307 3119787 3147314 3168608 3178048 3181032 3189116 3202216
58263 3202216 3212859 3224364 3246736 3278171 3309286 3342222 3386535 3439728 3491610 3544481 3608703
58252 3608703 3681712 3752540 3823832 3907493 4001596 4094128 4186739 4291562 4407138 4521442 4636399
58241 4636399 4764824 4905297 5045287 5187017 5344245 5515572 5687836 5863890 6059037
58232 6059037 6271896 6487854 6709606 6954120 7220907 7494689 7778029 8088755 8426439
58223 8426439 8775649 9141401 9545813 9990493 10459385 10957975 11510626 12119909 12769845
58214 12769845 13468838 14246000 15105926 16033896 17045700 18183349 19462581 20878500 22463533
58205 22463533 24283413 26377569 28767915 31528967 34784328 38638261 43189820 48613727
58197 48613727 55136065 62922866 72089388 82831234 95455536 110310056 127847244
58190 127847244 148787583 174056856 204493097 240622105 282290138 327548717 371278653
58183 371278653 405498512 422464298 418682231 396488004 362067378 322068605 281479618
58176 281479618 243328293 209140553 179383190 153890325 132277341 114133863 99012839
58169 99012839 86452334 76067020 67558156 60649276 55086494 50691005 47351706 44984404
58161 44984404 43547173 43067489 43607519 45215078 47868133 51289515 54696643 56882076
58153 56882076 56815244 54286101 49941144 44734361 39412003 34406645 29944990 26101385
58145 26101385 22826086 20035563 17679404 15710391 14050961 12631799 11425221 10410462
58137 10410462 9543575 8788231 8140026 7593960 7119238 6688467 6301375 5958761 5641459
58128 5641459 5334453 5044993 4778999 4524923 4277115 4049988 3852978 3674726 3506323
58119 3506323 3356921 3232260 3120451 3013031 2918454 2841101 2767519 2686696 2604408 2525538
58109 2525538 2442069 2351005 2265186 2193773 2129618 2067105 2014615 1977893 1948529 1920422 1900920
58098 1900920 1894192 1889533 1877200 1860418 1841299 1810720 1763540 1709297 1656863 1602252 1541851 1483614
58086 1483614 1434232 1388121 1339553 1293434 1254233 1216361 1175269 1136440 1104251 1073413 1040301
58075 1040301 1011165 990251 971198 949004 929142 916017 903651 886861 870845 860573 851153
58064 851153 837771 825129 817939 811770 802167 793516 789972 786628 778257 768253 760678 752076 739263
58051 739263 726778 718571 710535 699045 688598 683172 678329 669748 661432 657527 654027 646665 639331
58038 639331 636529 634907 630297 625976 625935 626950 625259 624343 628037 632327 631886 628793 627311 626026 622593
58023 622593 620336 622720 626794 629106 632492 640159 648891 655201 662504 675121 690589 704880 719832
58010 719832 738454 758265 776401 796119 821157 848467 873463 897638 924041 949842 970339
57999 970339 985976 998774 1006151 1004885 997064 985729 968927 944428 916030 888743 861790 832637
57987 832637 803713 778689 756123 733284 712471 697193 685824 675306 667467 665463 667547 670609
57975 670609 676371 687945 703641 720250 738966 761896 786021 806749 824238 840161 851454 853644
57963 853644 847683 837594 824188 806878 788806 774037 762091 750745 741559 737096 735506 733606
57951 733606 732728 735977 742394 749397 758226 771180 785976 798637 809621 821587 833496 842580 849709
57938 849709 857166 863384 865464 864542 862890 857960 845295 825515 802697 777653 748525 716428 684759
57925 684759 654194 623613 594510 569267 546530 523465 501075 482315 466647 451729 438749
57914 438749 430657 426581 423430 421720 424435 431290 439433 448696 460853 474652 486856 497335 508106
57901 508106 518254 525003 529071 533750 539159 542348 542663 542295 541861 540020 537043 534392 531265 525871 519466
57886 519466 514914 511962 508263 504179 502133 501998 501711 501817 504806 510435 516093 521384 528027 535718 542381
57871 542381 548139 554833 562105 568048 573167 579474 586201 590582 592291 592947 591974 587375 580079 572991 566066
57856 566066 556780 545229 534378 525323 516542 507787 500620 495192 490484 487506 488228 491658 495052 498618
57842 498618 504775 513208 521098 528087 536379 545887 553826 559369 564233 568285 568965 565686 560627 554607
57828 554607 546293 536098 526673 518628 509634 498594 487095 476051 464594 453040 443412 436232 430089
57815 430089 424857 421989 421226 420535 419794 421076 424893 429669 435344 443900 455810 469409 484336 502142
57801 502142 523130 546205 572298 604109 641559 680875 718795 754359 786254 812341 832672
57790 832672 849342 862369 869062 868123 860911 848055 828662 803813 777011 749930 721229 690688
57778 690688 660890 633464 607187 581313 557478 536722 517830 500260 485712 475102 466711 458904
57766 458904 452213 447365 443738 441019 440013 440676 441685 442735 444866 447905 450315 452240 455771 461427
57752 461427 467330 472699 479100 487244 495667 503623 512226 521507 529409 535034 539958 545100 549214 551780
57738 551780 554412 557945 560998 562859 564990 568171 570992 572695 574823 578484 582716 587087 593153 601637
57724 601637 610827 619494 628841 639909 651618 663210 676055 691062 706671 721423 736382 753088
57712 753088 771150 789756 809611 831589 855251 880412 908462 940607 976471 1015714 1059192
57701 1059192 1107329 1159378 1215543 1277791 1347323 1423394 1505962 1597172 1698833 1810669 1932637
57690 1932637 2066692 2214465 2375160 2547097 2728927 2917418 3106022 3287322 3454925
57681 3454925 3601642 3718623 3798932 3840678 3845285 3815155 3755185 3674299 3582663 3488498 3399263
57670 3399263 3323833 3270730 3245190 3249571 3283944 3341811 3404617 3443590 3430393 3349404 3203976
57659 3203976 3013540 2803489 2594656 2399513 2224809 2073980 1946617 1839244 1749010 1675348
57649 1675348 1617320 1571907 1536468 1510701 1494606 1486600 1485368 1491516 1505533 1526045 1551993 1584836
57637 1584836 1626721 1678058 1738589 1809093 1890199 1981097 2081222 2191660 2313247 2444924
57627 2444924 2585537 2735170 2892442 3052056 3207000 3351582 3480216 3585085 3657906 3693551
57617 3693551 3690449 3649021 3572033 3465361 3336058 3190055 3032956 2871449 2711599 2556554
57607 2556554 2407720 2267180 2137118 2017859 1908409 1808251 1717097 1633947 1558076 1490000
57597 1490000 1429899 1376118 1326816 1281950 1242006 1206010 1172588 1141950 1115006 1091446 1070362
57586 1070362 1051767 1035798 1021421 1007594 994779 983804 974331 965922 959306 954922 951515 947946
57574 947946 945059 943900 943464 942311 941158 941664 943714 946093 948905 953073 958287 963681 969840 977926 987410
57559 987410 996744 1005817 1015820 1027244 1039859 1054072 1070499 1088767 1108515 1130909 1157353 1187392
57547 1187392 1219661 1254205 1292117 1333726 1379026 1429086 1485055 1546580 1613177 1686387 1768459
57536 1768459 1859550 1958331 2064621 2179167 2301255 2428583 2558890 2689476 2815501 2930888
57526 2930888 3030584 3110093 3163759 3186405 3176824 3137734 3072714 2985468 2881563 2767909 2649860
57515 2649860 2530675 2413722 2302796 2199878 2104735 2017272 1938471 1868716 1807100 1752901
57505 1752901 1706091 1666013 1631189 1600883 1575433 1554735 1537814 1524098 1513749 1506585 1502083 1500456
57493 1500456 1502358 1507399 1514419 1523341 1535423 1551546 1571537 1595179 1622580 1653550 1687850 1726145
57481 1726145 1769630 1818915 1874308 1936713 2006996 2084976 2170368 2264050 2366833 2477609 2594374
57470 2594374 2716268 2842404 2969033 3089947 3199427 3292732 3364188 3407652 3419635 3400309
57460 3400309 3351538 3276129 3179198 3067771 2947971 2823929 2699534 2579056 2465341 2359142
57450 2359142 2260877 2171474 2091053 2018573 1953494 1896245 1846479 1802449 1762782 1727446 1696440
57439 1696440 1669036 1644996 1625041 1609327 1596609 1585574 1575959 1567892 1561291 1556356 1553565 1552758 1553143
57426 1553143 1554330 1556299 1558420 1559928 1561422 1564399 1569050 1574007 1578464 1583045 1588277 1593848 1599764 1606712
57412 1606712 1614731 1622982 1631305 1640573 1651064 1661951 1672920 1684839 1698186 1712172 1726049 1740027
57400 1740027 1754348 1768668 1782872 1797284 1811628 1825119 1838058 1852013 1867857 1884845 1902042
57389 1902042 1919345 1936615 1953244 1969204 1985348 2002099 2019025 2036063 2053842 2072365 2090799
57378 2090799 2109035 2127937 2147524 2166517 2184394 2202369 2221519 2241337 2261014 2280729 2300758
57367 2300758 2320615 2340018 2359505 2379159 2397936 2415213 2431863 2448871 2466074 2483197 2500971
57356 2500971 2520089 2540057 2560132 2580459 2601334 2622297 2643029 2664292 2686922 2710581 2734439
57345 2734439 2758377 2782631 2807034 2831545 2856914 2883872 2912126 2940851 2969646 2998378 3026687
57334 3026687 3054363 3081705 3109028 3136336 3163851 3192239 3221864 3252451 3283846 3316332 3349931
57323 3349931 3384193 3418973 3454528 3490560 3526186 3561261 3596784 3633633 3671847 3711392 3752392
57312 3752392 3794235 3835750 3876865 3918884 3962566 4007168 4052031 4097820 4145380 4194531 4244760
57301 4244760 4296065 4348332 4400941 4453745 4507392 4562081 4617169 4672489 4728615 4785022 4839548
57290 4839548 4890688 4938905 4984511 5025864 5061197 5090922 5116427 5137681 5153881 5165756 5175431
57279 5175431 5184353 5192877 5201597 5211603 5223472 5237121 5252563 5269954 5289132 5309965 5332849 5358126
57267 5358126 5385361 5413906 5443672 5474659 5506239 5537764 5569377 5601528 5634163 5667086 5700464
57256 5700464 5734290 5767944 5801016 5833886 5866866 5899570 5931969 5965218 6000422 6037229 6074560
57245 6074560 6112051 6149908 6188041 6226310 6264993 6304045 6342515 6379593 6415622 6451144 6485665
57234 6485665 6518295 6548866 6577455 6603578 6627061 6648977 6670458 6691134 6710008 6727374 6744557
57223 6744557 6762135 6779773 6797593 6816348 6836254 6856760 6877581 6899082 6921599 6945137 6969689
57212 6969689 6995211 7021339 7047651 7074050 7100586 7127279 7154345 7181849 7208738 7233176 7254561
57201 7254561 7274211 7293236 7310757 7325280 7336803 7346268 7353812 7359122 7362852 7366028 7368326 7368430 7365934
57188 7365934 7361588 7355844 7348471 7339557 7329581 7318451 7305576 7290918 7274917 7257454 7237968 7216621
57176 7216621 7194202 7170757 7145404 7117777 7088744 7059388 7029993 7000267 6969936 6938915 6907321
57165 6907321 6875361 6842809 6808703 6772048 6732666 6690919 6646845 6600123 6550649 6498634 6444397
57154 6444397 6388616 6332487 6277096 6222926 6170461 6120817 6075221 6034219 5998000 5967034 5941741
57143 5941741 5921895 5906974 5896623 5890115 5885802 5881848 5877219 5871367 5863412 5852284 5837306 5818018
57131 5818018 5793959 5765415 5734098 5702493 5672745 5646475 5625025 5609189 5599157 5595157 5597647 5606443
57119 5606443 5620393 5638598 5661510 5690538 5727384 5774343 5834488 5910876 6006026 6122378 6262387
57108 6262387 6427961 6621058 6845642 7108361 7417211 7781056 8211438 8724080 9338518
57099 9338518 10078016 10971172 12052982 13364059 14949696 16859142 19142835 21847740
57091 21847740 25014259 28675521 32856270 37570466 42818427 48581530 54813630 61434355
57083 61434355 68323549 75300572 82083919 88274188 93420491 97161363 99339768 99999805
57075 99999805 99285821 97348323 94322475 90352666 85607782 80272862 74535515 68576797
57067 68576797 62562785 56637395 50920450 45507942 40469939 35849462 31666526 27923611
57059 27923611 24608137 21694848 19151199 16941916 15029475 13374670 11940619 10695959
57051 10695959 9613493 8668456 7840236 7113807 6477094 5918100 5425786 4991527 4607606
57042 4607606 4265842 3959489 3684805 3438934 3217792 3017618 2836696 2673557 2525089
57033 2525089 2388411 2263116 2149639 2046715 1952336 1865924 1787656 1716771 1652264 1594073
57023 1594073 1541944 1494347 1450105 1409753 1373782 1341070 1310763 1284122 1262601 1245581 1232037
57012 1232037 1222989 1220299 1224446 1235575 1255330 1285643 1327297 1382063 1454720 1550716 1673915 1828667
57000 1828667 2018888 2236134 2446847 2598851 2648461 2585005 2431937 2228286 2009210 1797412
56990 1797412 1604126 1433576 1286729 1163008 1060752 977963 913170 865120 831630 809061
56980 809061 792768 777758 759747 736709 709398 679808 649445 619361 590774 564529 540600
56969 540600 519099 501068 487332 477344 470275 466364 465977 468270 472389 479256 490577 506675 526916
56956 526916 551444 580081 609336 632474 643394 639836 623298 597496 566985 535707 506040 479403
56944 479403 457199 440163 427435 417695 410976 408131 408946 412326 418166 427580 441323 459454 482612
56931 482612 512139 548364 589198 629911 663422 681915 680552 660444 627295 587382 545566 505773
56919 505773 470671 440318 412881 387373 364611 345469 329694 316705 306145 297253 288924 280871
56907 280871 273730 267777 262602 258143 254869 252772 251289 250453 250934 252702 254762 256586 258817 262287 267220
56892 267220 273600 281454 290633 301146 313734 329284 347813 368753 391653 415060 435015 446590
56880 446590 447590 439781 426460 410080 392363 374963 359118 345542 335098 328702 326280 326827 329847
56867 329847 335874 345475 358782 376371 399536 429361 466289 510716 562778 620710 679636 732038
56855 732038 769426 784983 776829 749405 710710 667745 624725 584444 549184 520091 497291 481248
56843 481248 472937 472553 479294 492642 512822 540025 574596 618129 672969 740379 820055 910405
56831 910405 1006346 1095997 1162450 1191833 1180534 1135158 1067216 988218 907326 830582 761244
56820 761244 700900 650150 608663 575750 551213 534990 526207 523864 528521 541960 564981 596951
56808 596951 637862 689120 751004 819506 885583 936921 961695 953854 916574 859903 794355 726940
56796 726940 662020 602850 551042 506398 468676 438568 416310 400820 391011 386686 387454 392303
56784 392303 401156 415495 436504 463822 496576 533580 570988 601394 617392 615884 598453 568912
56772 568912 531719 491412 451591 414275 380668 351679 327122 305667 286525 270253 257122
56761 257122 245980 235732 226697 219404 213248 207552 202841 199722 197500 195260 193385 192631 192501 191932
56747 191932 190939 190199 189656 188770 187661 186748 185717 183990 181799 179809 178077 176354 174853 173820 172853 171485
56731 171485 169980 168727 167499 166060 164860 164314 164064 163662 163231 162840 162188 161628 162324 164417 166174 166148 165110
56714 165110 164635 164798 164632 163929 163093 162023 160632 159840 160541 162089 163150 163513 163745 163683 162792 161624 161394
56697 161394 162225 163067 163173 162574 161366 159691 158263 157893 158569 159736 161177 162925 164842 167005 169862 173237
56681 173237 176004 177666 179330 181996 184837 186476 187119 187932 188993 189423 189082 188498 187462 185233 182057
56666 182057 179120 177061 175634 174693 174291 173977 173078 171734 170700 170309 170404 170918 171676 171930 170975 168957 166448
56649 166448 163763 161295 159715 158998 158147 156815 156235 157414 159421 160752 161449 162422 163545 164039 164058 164203
56633 164203 164060 162820 160975 159823 159686 160021 160850 162534 164546 166010 167133 168603 169955 170104 169276 168864
56617 168864 169468 170426 171105 171440 171431 171329 171996 173910 176256 178064 179590 181353 182718 182945 182791 183374 184179
56600 184179 184015 183214 182950 183017 182323 181101 180491 180315 179488 178409 178668 180414 182203 183500 185118 186979 187698
56583 187698 186886 185943 185998 186753 187754 189188 191018 192850 194914 197684 200485 202091 202828 204373 207303 210553
56567 210553 213446 216488 219930 223272 226553 230494 235096 239630 244138 249266 254539 258558 261131 263483
56553 263483 266213 268841 271508 275098 279290 282395 283588 283555 282614 280091 276061 271825 268095 264318 260219
56538 260219 256226 252000 246412 239542 232924 227378 222342 217687 214118 211257 207509 202655 198550 196356
56524 196356 194985 193261 191660 190756 189716 187675 185197 183158 181398 179463 177531 175711 173585 171183
56510 171183 169293 168213 167322 166294 165478 164790 163682 162529 162432 163265 163644 163282 163556 165181 167100 168323
56494 168323 169091 169543 169126 168139 168019 169183 170258 170342 170312 171083 172259 173438 175174 177706 180319 182799 185871
56477 185871 189437 192131 193526 194994 197434 199856 201254 202160 203344 204672 206192 208576 211435 213012
56463 213012 212737 212361 213327 214649 214695 213505 212065 210706 209528 209057 209348 209588 209484 209788 210761 211592 212003
56446 212003 212784 214092 215011 215511 216860 219296 221287 221972 222187 222218 220911 218268 216470 216829 217922 218252
56430 218252 218468 219273 219428 217925 216210 216163 217483 218908 220315 221696 221813 219895 217315 215716 214803 213675
56414 213675 212744 212622 212570 211806 210919 210309 208806 205634 202283 200629 200554 201062 202197 204129 205905 206963 208406
56397 208406 211055 213739 215205 216146 217567 218880 219490 220609 223369 226681 228968 230511 232097 232954 232278
56382 232278 231316 231632 232602 232865 232983 234394 236786 238674 239679 240352 240742 240921 241802 243718 245426 246111 246939
56365 246939 248986 251283 252774 254412 257322 260588 263067 265616 269207 272532 273930 274238 275240 276662
56351 276662 277180 277060 277385 277923 278103 278786 280804 283142 284884 287419 292238 298051 302635 306077 309703 313319
56335 313319 316315 319948 325569 331833 336539 340135 344595 349989 354992 359607 364512 368786 371164 372566
56321 372566 374609 376701 377284 376803 376617 376158 374123 371333 369471 368092 365873 363633 362976 363049 361847 359721
56305 359721 358395 357532 355638 353514 353372 355187 357092 358692 360789 362718 363327 363932 366897 371810 376311
56290 376311 380061 384543 389604 393732 397394 402676 409834 417389 425331 435013 446212 457447 468947
56277 468947 482263 497321 512861 529259 547866 568209 589007 611332 637542 667669 700166
56266 700166 735481 775468 819870 866899 916755 971082 1029501 1090086 1152611 1217699 1283420
56255 1283420 1346469 1406209 1463898 1518607 1567719 1610792 1648901 1680803 1704016 1719432 1730621
56244 1730621 1738758 1742301 1741391 1738232 1733162 1724596 1712798 1699518 1683903 1663111 1637021 1608078 1576408
56231 1576408 1539523 1497024 1451191 1402669 1350093 1294371 1238888 1184931 1131213 1078296 1029043
56220 1029043 984083 941240 900041 862583 829434 799031 771586 749106 730990 713981 697035
56209 697035 681805 668006 653147 637419 623912 613194 602550 591461 582792 577485 573071 568639
56197 568639 566359 566678 566928 566218 567040 570509 574642 578710 584617 592508 599752 605788 613313 623181 632820
56182 632820 641196 650552 661686 672330 681823 692451 704389 714214 720442 725827 732382 738775 744367
56169 744367 750869 758106 763120 765589 769410 776868 785955 795257 806509 820298 834335 848251 865154
56156 865154 886267 909012 932618 960548 995022 1034216 1077411 1127880 1188107 1257126 1335268
56145 1335268 1426820 1535595 1662723 1811185 1987234 2194334 2429936 2689776 2969282 3257775
56135 3257775 3536954 3789463 4006120 4184418 4326748 4443189 4549394 4655995 4762026
56126 4762026 4859388 4938593 4989306 5003295 4981920 4936502 4878368 4812270 4739401 4658624 4561303
56115 4561303 4432338 4261692 4051167 3808637 3542980 3267656 3000903 2756177 2536713
56106 2536713 2342274 2174752 2033581 1912713 1807117 1716773 1640722 1573669 1512499 1459644
56096 1459644 1415972 1376979 1340027 1308335 1283434 1260800 1237644 1217850 1204241 1193110 1181426
56085 1181426 1172226 1167570 1163417 1157064 1152519 1152886 1154647 1155154 1158274 1166513 1174953 1179468 1183788 1192036
56071 1192036 1201431 1208881 1217498 1229900 1242250 1251675 1262377 1277598 1292989 1304733 1316723 1332657
56059 1332657 1348796 1361881 1376236 1395359 1414458 1429287 1444426 1464684 1486251 1504755 1524035
56048 1524035 1548227 1573176 1594584 1616731 1644125 1672541 1697397 1722837 1753308 1784620 1812841
56037 1812841 1843312 1880860 1919863 1954384 1989365 2031214 2076324 2119978 2167481 2224698 2286181
56026 2286181 2344394 2402095 2464040 2525593 2581661 2637657 2699314 2761122 2817385 2874763 2940668
56015 2940668 3009446 3073822 3139624 3214829 3294619 3372192 3453617 3546435 3644420 3739780 3839364
56004 3839364 3952067 4071560 4188953 4311012 4447615 4592880 4737694 4889069 5057176
55995 5057176 5235294 5413111 5597653 5799712 6012285 6224808 6445710 6687496 6943000
55986 6943000 7201041 7471762 7770583 8091361 8422772 8776622 9171021 9600473 10053010
55977 10053010 10541530 11086164 11681838 12317339 13009816 13784466 14638110 15561769 16580979
55968 16580979 17732936 19024522 20458417 22079951 23950346 26098392 28554264 31408832
55960 31408832 34784114 38777125 43502037 49155228 55956415 64053336 73573519 84745118
55952 84745118 97887226 113354954 131651616 153571355 180073629 211997108 249852545
55945 249852545 293309513 339872536 383626309 416103549 429875997 422424971 397059193
55938 397059193 360414347 319079361 277790823 239348031 205095876 175355185 149870500
55931 149870500 128223104 109982257 94667675 81786165 70940959 61830580 54163352
55924 54163352 47658411 42114647 37399183 33374308 29897248 26876471 24263278 21993683
55916 21993683 19991176 18216101 16659166 15291855 14069066 12972575 12006415 11154291
55908 11154291 10382413 9678977 9051867 8491956 7975120 7496115 7065636 6677600 6312151
55899 6312151 5967452 5656996 5378463 5114985 4864304 4637894 4433706 4237260 4047630
55890 4047630 3876049 3720732 3568303 3418435 3282789 3161104 3041773 2924594 2820260
55881 2820260 2728482 2638477 2549951 2472319 2404266 2334863 2264056 2201721 2147101 2088991 2026038
55870 2026038 1967713 1915388 1861143 1805304 1756913 1716497 1675970 1635917 1605762 1586380 1569301
55859 1569301 1553821 1548395 1554072 1562023 1568015 1574000 1575113 1561097 1532342 1500079 1469599 1437127
55847 1437127 1403433 1375505 1353326 1329183 1301682 1277071 1255531 1229697 1198134 1167106 1137686
55836 1137686 1104210 1066944 1033217 1004206 973279 939271 908965 884402 860001 834418 813329
55825 813329 798103 783176 766992 754308 745415 734151 718976 705426 695469 685004 673856 667474
55813 667474 666505 665167 662134 662523 666812 668412 664960 661720 660918 657766 650118 642286 636100 627616 615903
55798 615903 605962 599642 592433 582303 573113 566291 557810 546508 537024 531386 525854 519119 515512 517114
55784 517114 520537 524249 530814 538850 540960 533336 520108 505229 487610 467285 448586 433455 418583
55771 418583 402492 388691 378762 369185 358103 348512 341774 334688 325920 318714 314298 309234 302217
55758 302217 296923 295139 293568 290329 288116 287980 286545 282442 279089 278012 275711 270230 264560 260395
55744 260395 254816 246434 238724 233950 229643 224249 220302 218870 216783 212629 209635 209386 208622 205529 203311
55729 203311 203953 204265 201796 199128 198579 198027 195640 193458 192574 189994 184154 178643 176619 176159 174719 173543
55713 173543 174119 174821 174617 175764 179515 183471 186227 190154 196615 203141 208426 215281 225324 235512
55699 235512 243275 250384 258273 264366 266694 267615 269202 269386 266377 262496 259769 255928 248726 240240 232994
55684 232994 225665 216422 206860 198843 191000 181982 173771 168258 164001 159676 157233 158267 160807 163030
55670 163030 166679 173452 181424 188320 194930 202225 208655 213443 218838 225858 231500 233478 234060 235839
55656 235839 237426 236843 235491 235045 233894 230375 226235 223343 220278 215669 211512 209544 207740 204091 200511
55641 200511 199218 198492 195837 192213 189354 186042 180889 175638 171750 166796 158357 148612 140963 134883
55627 134883 128255 122006 118112 115370 111469 107138 104263 101957 98390 94561 92410 91086 88679 85855
55613 85855 84354 83838 83446 84269 86963 89123 88526 86808 86592 87282 87050 86568 87104 87254 85334 82917 82329
55596 82329 82679 81974 81023 81576 82702 82730 82728 84277 85809 85044 83190 82861 83627 83428 82608 82696 82901 81742 80560
55577 80560 81530 83684 84770 85523 88229 92431 96051 99512 104864 111815 118413 124661 131881 139392 145251
55562 145251 149305 152212 152655 148966 142398 135450 128116 119148 109722 102207 96360 90237 83850 78546
55548 78546 73930 68960 65027 64251 65602 66241 65886 66384 67838 68733 69178 70526 72373 73286 73876 75878
55532 75878 78768 80513 81048 81893 83081 83599 84088 85946 88521 90347 92228 95848 100244 103095 104702
55517 104702 107171 110399 112415 113113 114010 114707 113136 109138 104459 99497 93303 86518 81033 76872 72503
55502 72503 67941 64497 61812 58332 54417 51819 50345 48213 45443 43751 43239 42305 40713 39766 39563
55487 39563 39027 38377 38696 39383 39015 38263 38849 40084 39726 37954 37082 37554 37607 36823 36551 36742 35792 33757
55469 33757 32424 31982 30917 29436 29636 31767 33575 33943 34106 34638 34362 33074 32417 33105 33783 33477 32852
55452 32852 32384 31626 30800 30950 32031 32932 33569 34833 36456 37230 37355 38238 39888 40870 40773 40412 39750 38123
55434 38123 36342 35953 36551 36451 35780 36161 37540 38305 38448 39555 41579 42731 42772 43342 44646 44886 43528
55417 43528 42230 41993 42149 42559 43975 45744 46028 44921 44598 45848 47151 47691 48482 49909 50923 51317
55401 51317 52091 52993 52404 50332 48769 48410 47721 45935 44251 43360 42480 41522 41525 42210 41880 40546 40357 42065
55383 42065 43775 44130 43986 44022 43456 42241 41849 42622 42803 41427 39805 39073 38600 37899 37768 38371 38460 37571
55365 37571 36897 37092 37383 37561 38479 39800 39812 38327 37261 37430 37374 36323 35548 35620 35094 33298 31802 31655
55347 31655 31681 31008 30770 31729 32644 32696 33189 35039 36752 36802 35988 35661 35467 34702 34161 34819 36069 36855 37220
55328 37220 37440 37102 36247 35860 36079 35603 33974 32682 32760 33116 32603 31943 32122 32504 32077 31175 30609 30366 30302
55309 30302 30758 31470 31257 29817 28384 27781 27387 26787 26727 27477 27989 27581 26823 26036 24835 23865 24779 27432
55291 27432 29280 28761 27262 26561 26479 26390 26831 28045 28905 28882 29240 30719 31850 31196 29569 28459 27931 27602
55273 27602 28031 29477 30757 30849 30313 29882 29193 28170 27962 29079 30210 30274 30072 30541 31099 31108 31312 32288 33097
55254 33097 32921 32500 32524 32227 31015 29902 29833 30170 30188 30408 31076 31093 29980 29099 29387 29697 29020 28449 29145
55235 29145 30120 30092 29858 30806 32483 33596 34079 34380 34104 33232 33168 34675 36188 36131 35501 36107 37579 38252
55217 38252 37905 37527 37376 37190 37392 38242 38783 38325 37873 38395 38943 38292 37168 36849 36773 35681 34134 33746
55199 33746 34651 35702 36440 37065 37181 36433 35713 36066 37076 37775 38270 38936 39063 37959 36432 35526 34802 33480
55181 33480 32238 32122 32789 33516 34760 36864 38378 37783 35971 34985 35080 34951 34051 32840 31535 30393 30331
55164 30331 31462 32056 30802 29066 28878 29799 29982 29341 29283 30110 31045 32228 34298 36472 37363 37321 37759 38557
55146 38557 38374 37231 36554 36829 37300 37862 39150 40833 41849 42412 43918 46800 50135 53305 56431 59323
55130 59323 61673 64107 67375 70692 72484 72557 71921 70818 68698 65879 63378 61203 58549 55606 53515
55115 53515 52565 52028 51629 51638 51674 51056 50241 50334 51258 51899 51882 51722 51445 50669 49867 49928 50537 50557 49961 49894 50880 52328
55093 52328 53760 55124 56067 56201 55910 55686 55056 53507 51956 51767 52754 53696 54381 55470 56772 57446 57684
55076 57684 58428 59583 60134 59954 59892 60202 60439 60778 61856 63427 64637 65468 66470 67325 67194 66245 65353 64600
55058 64600 63600 62889 63337 64504 65222 65497 66206 67329 68240 69304 71285 73544 74798 75312 76292 77348
55042 77348 76871 74890 73311 73058 73099 72619 72115 71892 71431 70841 71218 72958 75129 76929 78391 79473 79882
55025 79882 79970 80352 80562 79605 77795 76477 75935 75290 74368 73779 73105 71089 67998 65771 65265 65177 64324 63243
55007 63243 62815 62842 62768 62572 62321 61922 61663 61915 62170 61550 60228 59027 57817 55985 54383 54847 57477 60266
54989 60266 61812 62681 63684 64654 65526 66894 68777 70265 71057 72030 73749 75743 77679 79974 82755 85495
54973 85495 88007 90600 93138 95344 98105 102823 109246 115631 121435 128156 136994 147351 158183 169287
54959 169287 180677 192171 204178 217529 231990 246160 259104 270600 279596 284196 283683 278949
54947 278949 270481 257761 241312 223606 206925 191699 177606 164788 153179 142011 130946 120684
54935 120684 111893 104616 99072 95685 93908 92441 91005 90466 90850 90941 90374 90434 92077 94808 98293 103357
54919 103357 110436 118481 126501 134973 144837 156231 168988 183203 198490 213596 227314 238780
54907 238780 246637 249247 246263 238893 228335 215209 200525 185559 170524 155106 140492 128833
54895 128833 120295 112779 105153 98560 93786 89728 85707 83027 82668 83279 83036 81868 80425 78496 76002
54880 76002 74042 73317 72778 71257 69202 67499 65915 64111 62804 62476 62135 60870 59444 58864 58577 57668
54864 57668 56667 56569 57011 57036 56791 56934 57145 56697 55813 55130 54527 53741 53397 54130 55433 56529 57557 58736
54846 58736 59310 58671 57614 57088 56627 55456 54242 54113 54676 54678 54136 54095 54656 54926 54811 55312 56904 58905
54828 58905 60584 61912 63062 64021 64822 65586 66346 67234 68623 70750 73498 76748 80389 83809 86297 88254
54812 88254 91026 95070 99406 103473 108301 114993 123260 132447 142975 155711 170767 187824 206565
54799 206565 225721 242723 255626 264600 270431 272547 269879 262836 252974 241278 228160 214607 201851
54786 201851 190117 178875 168223 158969 151552 145731 141210 137854 135574 134566 135239 137396 140075 142718
54772 142718 145839 150044 155249 161479 169463 179596 191173 203531 217117 232570 249575 267448
54760 267448 285955 304643 322217 337507 350318 360477 366948 368746 365833 358284 345658 328207
54748 328207 307622 285556 262526 239328 218137 200609 185926 172348 159893 149842 142282 135867
54736 135867 129652 123702 118180 113191 109323 107122 106144 105400 104378 102897 100632 97673 94882 92733 90594
54721 90594 88070 86169 85962 86928 87787 88181 88340 88000 86973 85973 85525 84878 83331 81754 81308 81503 81146
54704 81146 80463 80611 81607 82465 82929 83491 84126 84570 85415 87311 89457 90499 90629 91212 92625 94024 94987
54687 94987 95799 96320 96163 95908 96655 98398 100247 102062 104482 107436 110133 112499 115272 118695 122359 126215
54671 126215 130457 134559 137811 140670 144255 148589 152736 156639 161381 167586 174847 182837 191800 201864
54657 201864 213050 225981 241513 259543 279128 299655 320897 342084 361825 378701 391007
54646 391007 396571 394158 384763 370378 352014 330246 306983 284753 264388 245099 226803 210636
54634 210636 197101 185379 174792 165489 157402 149936 142975 137018 132097 127752 124173 122122 121519 121344
54620 121344 121122 121329 122126 122872 123135 123156 123094 122748 122158 121655 121280 120989 121163 121963 122512 121849 120373 119132 118012
54601 118012 116054 113300 110858 109191 107790 106447 105457 104609 103431 102384 102314 102714 102072 100068 97909 96377
54585 96377 95075 93804 93116 93141 93234 93110 93042 92804 91837 90603 90306 90969 91272 90633 89985 90075 90434 90508 90493 90536
54565 90536 90356 90081 90280 90796 90788 90338 90715 92588 95119 97251 98769 99811 100552 101808 104718 109376 114784
54548 114784 120396 126522 133102 139496 145894 153513 162865 173042 183176 193266 202966 210822 215492
54535 215492 216824 215262 211197 205341 198727 191798 184306 176291 168195 159968 151302 142895 136106 131076
54521 131076 126512 121663 117139 113445 110186 107251 105367 104804 104741 104474 104093 103587 102660 101870 102451 104348
54505 104348 105823 105755 104971 104615 104589 104435 104395 104582 104271 103074 101863 101629 102307 103392 104750 106128 106881 106978
54487 106978 107314 108351 109360 109644 109455 109114 108434 107756 108336 110709 113635 115627 116657 117482 118180 118334 118016
54470 118016 117647 117395 117277 117352 117335 116682 115488 114584 114439 114758 115304 116144 116899 116922 116575 117094 118716 120122 120203
54451 120203 119158 117465 115173 112772 111328 110995 110627 109539 108382 107698 107010 106038 105300 104719 103197 100542
54435 100542 98263 97368 96888 95828 95079 95861 97562 98672 98900 98870 98618 97921 97391 97822 98905 99741 100192
54418 100192 100757 101669 102931 104619 106446 107805 108902 110863 114092 117640 120876 124395 128382 131582 133224
54403 133224 134558 137016 140038 142181 143291 143982 144057 143109 141837 141095 140331 138562 136178 134158 132132 128918
54387 128918 124543 120241 116760 114039 112094 110834 109448 107344 105293 104347 104121 103491 102437 101754 101417
54372 101417 100775 99997 99839 100250 100625 101083 102092 103124 103249 102863 103251 104505 105360 105156 104620 104600 105273 106648
54354 106648 108659 110764 112564 114728 118152 122276 125528 127414 128870 130487 131723 132171 132310 132556 132568
54339 132568 131930 130756 129259 127362 124981 122180 119003 115713 112984 111165 109492 106819 103096 99398
54325 99398 96556 94489 92778 91171 89504 87710 85906 84023 81630 78608 75663 73599 72455 71881 71800
54310 71800 71974 71565 70034 68048 66648 65976 65686 65966 67050 68158 68157 67035 65745 64781 63920 63047 62227
54293 62227 61232 60000 59246 59574 60335 60466 60117 60264 60999 61531 61760 62521 64075 65503 65865 65134 63942 63111
54275 63111 63352 64654 66107 67051 68068 69965 72271 73853 74657 75618 77038 78305 79108 79722 80194 80495
54259 80495 81409 83886 87348 89924 90702 90630 90930 91686 92383 92839 93100 93112 92922 92699 92407 91957 91595 91541 91370
54240 91370 90435 88816 87134 85656 84337 83497 83543 84130 84531 84625 84678 84422 83412 82149 81734 82356 83129 83405
54222 83405 83329 83113 82724 82289 81952 81389 80330 79410 79516 80436 81080 80961 80517 80209 80257 80976 82303 83340 83498
54203 83498 83736 85294 87531 88546 87745 86245 84829 83271 81753 81103 81197 80791 79443 78106 77301 76297
54187 76297 74737 73489 73055 72591 71468 70534 70780 71793 72553 72840 72899 72529 71545 70504 70042 69995 69846 69544
54169 69544 69237 68752 67995 67365 67225 67398 67691 68435 69988 72138 74295 75875 76289 75228 73266 71529 70431
54152 70431 69348 67822 66321 65402 64883 64371 64013 64180 64849 65693 66367 66447 65626 64257 63202 62914 63166 63817
54134 63817 65096 66855 68260 68672 68303 67641 66794 65709 64572 63585 62743 62020 61443 60917 60380 60081 60154 60057
54116 60057 59186 57993 57656 58574 59990 61223 62349 63457 64143 64116 63670 63226 62998 63160 63712 64115 63820 63167
54098 63167 62958 63154 62945 62148 61491 61349 61239 60863 60598 60621 60527 60166 59956 60060 60166 60327 61023 62097 62691
54079 62691 62639 62840 63822 65017 65916 66867 68086 68876 68559 67361 65847 64287 63048 62663 62953 63027 62674 62844
54061 62844 64162 65958 67394 68604 70046 71653 73321 75312 77382 78462 78070 77280 77482 78799 80437
54046 80437 81825 82745 83153 83644 85306 88414 92025 95497 99447 104333 109110 112431 114494 116641 119708
54031 119708 123688 128358 133211 137373 140614 143966 148314 152900 156238 158082 159488 161315 163650 166366
54017 166366 169268 171909 174089 176195 178314 179503 178901 177084 175268 173570 171193 168053 164982 162422
54003 162422 160008 157505 155093 152630 149693 146521 143948 142083 139926 136738 133070 129989 127818 126151
53989 126151 124689 123512 122664 121902 120971 119932 119073 118457 117740 116671 115648 115384 115964 116634 116724 116350 116035
53972 116035 116064 116485 117294 118239 118792 118706 118338 118164 118242 118385 118469 118300 117651 116724 116209 116448 116902 116790 115994 115073
53952 115073 114707 115317 116809 118474 119571 120299 121761 124711 128828 133472 138557 144246 150363 156669 163327
53937 163327 170500 177758 184313 189728 193946 196760 197629 196109 192488 188017 184237 181727 179768 177614
53923 177614 175743 175198 176116 177865 180345 183913 188094 191699 194457 197285 200613 203790 206559 209766 213891
53908 213891 218190 222108 226350 231554 236970 241503 245176 248503 251211 252690 253053 252769 251850 250327 248841
53893 248841 247776 246404 243869 240455 236920 233169 228624 223410 218112 212780 207110 201235 195439 189498
53879 189498 183206 177148 172079 167967 164481 161858 160283 158916 156642 153502 150315 147260 143873 140204
53865 140204 136834 133825 130711 127544 125040 123610 122929 122487 121903 120805 118995 116741 114483 112493 111062
53850 111062 110524 110564 110176 108891 107428 106491 105716 104705 104247 105242 107059 108247 108493 108575 108701 108288 107346 106737
53832 106737 106952 107732 109015 111149 113973 116629 118561 119967 121075 121736 121874 121650 121073 120024 118746 117721
53816 117721 117045 116410 115681 115088 114897 115302 116379 117796 118973 119982 121715 124592 127751 130288 132652 135801
53800 135801 139538 142846 145551 148407 151683 154763 157240 159418 161689 164168 166978 170160 173372 176260
53786 176260 178864 181106 182358 182334 181920 182111 182588 182441 181838 181713 182037 181772 180548 179127 178123 177384 176725
53769 176725 176172 175350 173666 171272 168943 166916 164727 162193 159600 156921 153835 150598 147930 145971 144185
53754 144185 142277 140274 137907 134985 132241 130542 129264 126858 123176 119873 118103 117149 115886 114393
53740 114393 113400 113136 113454 114300 115325 115640 114617 112532 110097 107822 106090 105271 105386 105991 106594 106815 106325
53723 106325 105252 104523 105025 106422 107597 108241 109101 110621 112244 113314 113789 113845 113516 113012 112683 112567 112633
53706 112633 113436 115700 119167 122761 125933 128986 132006 134549 136601 138807 141444 144089 146680 149973
53692 149973 154493 159779 164984 169508 172847 174742 175876 177553 180226 183023 185107 186806 189003 192010
53678 192010 195492 198997 202262 205397 208872 212860 216640 219244 220638 221638 222816 224274 226255 228996
53664 228996 232032 234625 236780 238880 240535 241027 240746 240712 240700 239484 237158 235529 235570 236091 235752 234960 234804
53647 234804 235280 235648 235603 235148 234127 232748 231827 231772 231948 231697 231232 230975 230765 230264 229319 227456 224079 219787
53629 219787 216459 215263 215486 216002 216794 218143 219427 219898 219902 220235 220924 221610 222474 223788 225111 225925 226589
53612 226589 227762 229379 231090 233212 236298 240153 244100 247848 251329 254241 256621 259448 263756 269443
53598 269443 275690 282108 288664 294925 300344 305048 309560 314009 318393 323282 329323 336236 343111 349628
53584 349628 356186 362942 369442 375221 380187 384417 388066 391450 394889 398543 402577 407094 411638 415262
53570 415262 417574 419246 421046 422885 424371 425642 426864 427401 426453 424289 421962 419890 417504 414324 410709
53555 410709 407356 404535 401944 399060 395638 392032 388847 386218 383730 381185 378869 376838 374599 371955
53541 371955 369583 368162 367422 366654 365730 364935 364192 363204 362186 361687 361749 361851 361686 361528 361837 362850 364634
53524 364634 367209 370565 374580 378855 382811 386336 390261 395622 402427 409780 417263 425376 434447 444062
53510 444062 454055 465139 477947 492156 507247 523400 540846 558966 576892 594671 613075 632586
53498 632586 653251 675284 699148 725104 753032 782462 812593 842819 873511 905685 939574
53487 939574 974199 1008699 1043194 1077803 1111790 1144627 1177161 1210753 1245791 1281912 1319116
53476 1319116 1357689 1397465 1438106 1479754 1522485 1565464 1607520 1648156 1687108 1723322 1755511
53465 1755511 1783677 1809103 1832857 1855122 1875918 1895612 1914570 1933068 1951680 1971204 1992074
53454 1992074 2014163 2036981 2059599 2080568 2098485 2112672 2123066 2129745 2132886 2132748 2129164 2121414
53442 2121414 2109123 2092886 2073515 2051126 2025653 1997793 1968643 1938580 1907169 1873900 1838505
53431 1838505 1800906 1761530 1721432 1681489 1641721 1601917 1562519 1524230 1487042 1450260 1413250
53420 1413250 1375815 1338383 1302360 1269626 1240937 1215302 1191564 1169858 1150830 1134322 1119995
53409 1119995 1108578 1101108 1097392 1096562 1098851 1105396 1116309 1130255 1146161 1164190 1184801 1207879
53397 1207879 1233058 1260119 1288811 1318940 1350684 1384183 1418958 1454468 1491112 1529777 1570547
53386 1570547 1612880 1657091 1704557 1756195 1811608 1870023 1931255 1995462 2062687 2133003 2206516
53375 2206516 2282914 2361475 2441691 2523497 2606870 2691727 2778180 2866222 2955062 3043291 3129855
53364 3129855 3214410 3296684 3375938 3451195 3521684 3587244 3648651 3707364 3764529 3820311 3874468
53353 3874468 3927086 3978210 4027203 4073115 4115337 4153151 4184968 4208715 4222528 4224282 4211030
53342 4211030 4180271 4131979 4068620 3993327 3908844 3817892 3723161 3626535 3528936 3430925 3332814
53331 3332814 3234415 3135744 3037966 2942672 2850089 2758867 2667768 2576716 2486120 2396132 2306949
53320 2306949 2219114 2133266 2050097 1970621 1895756 1825485 1759057 1696224 1637730 1584546 1537159
53309 1537159 1495636 1459755 1428936 1402416 1379459 1359174 1340505 1323025 1307346 1294123 1283045
53298 1283045 1273521 1265777 1260285 1256473 1253147 1249981 1247532 1246119 1245866 1247560 1252081 1258928 1266604 1274540
53284 1274540 1283433 1293653 1304794 1317144 1332165 1350866 1372716 1396748 1422843 1451381 1482349
53273 1482349 1515308 1549659 1584697 1620082 1656374 1694424 1734097 1774373 1814681 1855270 1896224
53262 1896224 1937059 1977316 2016644 2054338 2089921 2124287 2159010 2194253 2228383 2259716 2287437
53251 2287437 2310693 2328261 2339677 2345481 2345869 2340235 2328369 2310770 2287264 2256793 2219336 2176752
53239 2176752 2130857 2081808 2029318 1974305 1918184 1861460 1804193 1747244 1692035 1639501 1590021
53228 1590021 1543862 1500920 1460435 1421513 1383421 1345046 1304901 1262305 1217856 1172226 1125340
53217 1125340 1077364 1029617 983632 939968 898705 860422 825890 795356 768776 746119 726797
53206 726797 709540 693625 679540 667653 656947 645967 634462 623100 612068 600922 589468
53195 589468 577876 566128 554158 542396 531505 521654 512473 503469 494150 484109 473439 462681
53183 462681 452058 441252 430208 419448 409193 398937 388367 377955 368027 358088 347807 337874
53171 337874 329035 320919 312744 304567 296952 289922 283147 276714 270796 265035 259200 254071 250645 248627
53157 248627 246592 243506 239399 234797 230256 226298 223110 220393 217978 216234 215341 214571 213001 210574 207813
53142 207813 204931 201953 199317 197518 196434 195698 195327 195256 194725 193073 190805 188884 187262 185168 182716
53127 182716 181039 180689 180977 181157 181404 182169 183213 183766 183352 182180 180897 180068 179761 179647 179559 179657 179972 180295
53109 180295 180834 182357 185161 188450 191396 194319 197936 201854 204770 206035 206109 205520 204205 202008 199081
53094 199081 195636 191868 188182 184923 181808 178174 173879 169510 165705 162720 160593 159118 157671 155614
53080 155614 153072 150789 149076 147350 144886 141685 138384 135552 133297 131433 129859 128734 128225 128164 128118
53065 128118 127813 127274 126597 125934 125694 126211 127079 127363 126707 125747 125190 125115 125414 126145 126925 126751 125248 123543
53047 123543 123046 123728 124421 124499 124378 124480 124561 124144 123060 121421 119456 117361 115053 112301 109308 106811 105213
53030 105213 104080 102965 102242 102417 103039 103093 102242 101015 99894 98934 98140 97526 96827 95737 94459 93495 92932
53013 92932 92419 91792 91256 91004 91027 91292 91741 92243 92749 93333 93853 93885 93253 92297 91320 90252 89170 88549 88544 88599
52993 88599 88320 88209 88868 90026 90987 91490 91496 90722 89302 88349 88847 90332 91632 92546 93738 95225 96157 96164
52975 96164 95992 96610 98332 100815 103270 104870 105574 106394 108199 110588 112680 114517 116737 119195 121112
52960 121112 122441 123976 126127 128659 131629 135371 139467 142851 145173 147011 148509 148931 147951 146381 145130
52945 145130 144254 143442 142628 141684 140252 138309 136248 134097 131432 128501 126551 126421 127467 128512 129296 130292
52929 130292 131541 132446 132641 132518 132840 134064 135935 137561 138069 137327 135944 134565 133462 132738 132502 132714
52913 132714 133184 133870 134869 136064 137078 137657 137809 137567 136912 135929 134764 133464 132198 131496 131815 132876 133837
52896 133837 134239 134440 135123 136613 138614 140363 141227 141397 141757 142773 143891 144475 144863 145851 147434 148872
52880 148872 149797 150517 151295 152111 153116 154579 156327 157802 158734 159258 159468 159400 159349 159569 159805 159711 159531 159690
52862 159690 159969 159903 159880 160883 163132 165842 168412 171060 174223 178076 182636 187506 191447 193109 192455 190744
52846 190744 189078 187681 186567 185875 185304 184194 182578 181421 181445 182365 183482 184340 184615 184119 183236 182672 182576
52829 182576 182491 182314 182463 182896 182739 181266 178603 175328 172026 169337 167576 166151 164196 161898 160232 159217
52813 159217 157614 154785 151704 149450 147739 145794 143813 142609 142342 142452 142412 141934 140813 139238 137843
52798 137843 136968 136173 134948 133463 132160 131066 129983 128925 127863 126477 124604 122607 120894 119459 118210
52783 118210 117315 116839 116520 116283 116525 117451 118543 119050 118676 117537 115957 114575 114024 114014 113346 111326 108772
52766 108772 107073 106700 107032 107263 106913 105800 104085 102188 100375 98576 96756 95099 93670 92375 91409
52751 91409 91210 91736 92376 92810 93348 94134 94709 94793 94853 95344 95966 96156 95853 95288 94564 93924 93852 94419 95028 95364
52731 95364 96038 97608 99448 100341 99886 98613 96939 94753 92014 89211 87099 86153 86147 86162 85341 83832 82645
52714 82645 82380 82519 82210 81248 79924 78435 76928 75736 75087 74811 74695 74863 75499 76464 77481 78439 79324
52697 79324 80125 80915 81692 82186 82304 82674 84058 86172 87967 89174 90688 93171 96226 99358 102675 106052
52681 106052 108577 109566 109378 108464 106502 103326 99987 97825 96874 96087 94845 93463 92476 92157 92439 92744
52665 92744 92135 90248 87762 85528 83644 81824 80166 78972 78289 78160 78785 79939 80808 81014 81155 81687
52649 81687 82027 81580 80950 81093 81766 81909 81309 80949 81807 84038 87118 90123 92133 93054 93775 94965 96190
52632 96190 96789 97001 97338 97466 96770 95648 95126 95426 95908 96255 96695 97183 97375 97347 97420 97285 96252 94372 92533
52613 92533 91415 91062 91401 92288 93050 92873 91864 91061 91236 92248 93591 94968 96223 97199 97784 97844 97275
52596 97275 96418 96025 96317 96524 95976 95147 94876 95056 95044 94976 95573 96818 97842 98114 97902 97675 97863 98942 100805
52577 100805 102221 102066 100979 100694 101768 103119 103813 104061 104201 104004 103502 103409 104121 105151 106123 107488 109650
52560 109650 112055 113754 114378 114123 113334 112579 112606 113632 114928 115530 115204 114512 114149 114357 114767 114792 114420 114455
52542 114455 115600 117461 118999 119766 120074 120101 119687 119061 118942 119677 120896 122088 122928 123015 122127 120879 120373
52525 120373 120924 121866 122769 124022 125855 127581 128359 128216 127893 128054 128843 129777 129947 128853 127168 126079 125776
52508 125776 125302 124010 122369 121052 120104 119399 119087 119045 118639 117612 116588 116108 115816 115202 114519 114233 114146 113879
52490 113879 113778 114429 115463 115800 115054 113977 113390 113269 113055 112407 111501 110962 111549 113491 115984 117680 117956
52473 117956 117541 117694 118858 120239 120721 120038 118977 118508 118902 119730 120539 121216 121765 122021 121765 121074 120453 120524
52455 120524 121443 122617 123240 123157 122989 123256 123732 123899 123766 123859 124604 126013 127783 129433 130597 131531 133027
52438 133027 135407 137889 139367 139558 138936 137955 136957 136504 136936 137714 137947 137605 137512 138133 139097 139909 140449 140649
52420 140649 140404 139970 139865 140199 140629 141032 141592 142160 142267 141963 141905 142344 142720 142684 142798 143666 144850 145324 144803
52401 144803 144055 143915 144362 144660 144221 143171 142063 141196 140450 139752 139233 138762 137910 136817 136477 137503 139090
52384 139090 140037 140381 141075 142335 143384 143770 143822 143688 143055 142113 141788 142561 143911 145354 147212 149860 152886
52367 152886 155584 157795 159784 161690 163439 164872 165757 166081 166408 167378 168819 169977 170712 171673 173156 174641
52351 174641 175749 176847 178258 179681 180835 181930 183055 183783 183936 184061 184635 185394 185999 186718 187856 189045
52335 189045 189737 189958 190052 190119 190212 190603 191317 191801 191616 191108 190909 191136 191492 191750 191673 190926 189602 188435 188057
52316 188057 188399 189214 190681 192972 195719 198509 201537 205068 208623 211389 213343 215323 218011 221272 224550
52301 224550 227647 231160 236181 243264 251563 259410 265966 271890 278237 285340 293056 301399 310339 319503
52287 319503 328696 338363 348919 359992 370820 381086 390887 400258 409369 418904 429597 441449 453817
52274 453817 466085 477915 489169 499982 510732 521491 531788 541237 550104 558845 567401 575315
52262 575315 582264 588140 593032 597479 602298 607632 612575 616243 618751 620656 621971 622475 622593 623070 623954
52247 623954 624696 625173 625836 626799 627521 627620 627517 628028 629613 632125 635077 638108 641322 645112 649624 654685
52231 654685 660410 667452 676215 686057 695763 704721 713336 722394 732287 742732 753009 762610 771703 780745
52217 780745 789634 797786 805130 812334 819671 826333 831393 834940 837635 839634 840677 840842 840423 839273 836961
52202 836961 833483 829224 824270 818363 811538 804345 797415 791092 785335 779625 773177 765686 757782 750415
52188 750415 743988 738311 733136 728334 723793 719553 715754 712182 708192 703536 698886 695081 692144 689537
52174 689537 687025 684721 682538 680202 677689 675138 672523 669834 667379 665436 663848 662355 661034 659905
52160 659905 658491 656374 653961 652065 650928 650160 649380 648349 646745 644532 642389 641104 640585 640013 638850
52145 638850 637077 634639 631336 627297 622944 618446 613746 609065 604852 601226 597912 594652 591174 586892
52131 586892 581298 574804 568701 564108 561122 558898 556359 553057 549681 547397 546271 544819 541743 537678
52117 537678 534387 532495 531026 529123 527134 525717 524803 524012 523458 523502 524053 524638 525084 525777 527202 529412
52101 529412 531982 534514 537207 540801 545892 552489 560274 568967 578249 587689 597149 607036 617885 629884
52087 629884 643032 657386 672759 688495 703933 718883 733431 747706 762202 777762 794640
52076 794640 811892 828235 843175 856854 869245 880170 889775 898299 905689 912002 917844 923710 929205
52063 929205 933556 936568 938379 938755 937512 935301 932906 929905 925059 918099 910208 902633 895633 888935
52049 888935 882411 875998 869545 863011 856434 849779 843241 837549 833324 830204 827159 823696 820186 817165
52035 817165 814920 813686 813607 814543 816376 819238 822910 826406 828980 831223 834341 838569 843252 848069 853052
52020 853052 857630 861012 863666 867127 872009 877265 881763 885476 888702 891120 892254 892085 890647 887685
52006 887685 883177 877604 871277 863953 855405 845821 835385 824049 811903 799182 785671 770804 754592
51993 754592 737791 720980 704174 687513 671445 655857 639825 622659 604544 585856 566615
51982 566615 547023 527783 509382 491707 474718 458800 444018 429817 416003 403230 391830
51971 391830 380881 369255 357098 345480 334986 325478 316955 309746 303816 298522 293204 287754 282545
51958 282545 278011 274223 270757 267126 263392 260087 257516 255466 253693 252253 251192 250314 249378 248230 246650
51943 246650 244513 242080 239689 237162 234125 230861 228072 225703 222881 219281 215669 212629 209643 206044
51929 206044 202179 198834 196078 193421 190771 188449 186491 184558 182476 180350 178227 176090 174090 172479
51915 172479 171320 170446 169580 168417 166765 164762 162751 160946 159382 158146 157306 156692 156179 156108 156895 158305
51899 158305 159672 160804 161955 162986 163413 163368 163547 163930 163564 162105 160616 160169 160462 160591 160534 160885 161545
51882 161545 161629 160695 159389 158716 159034 159820 160279 160224 160310 161250 162861 164321 165163 165454 165097 163869 162286 161501
51864 161501 161949 162820 163327 163734 164584 165646 166281 166407 166470 166790 167374 168071 168635 168929 169250 169905 170352 169535 167345
51845 167345 165031 163774 163612 164184 165634 168089 170957 173470 175425 176823 177392 177102 176593 176505 176844 177521
51829 177521 178873 181027 183427 185627 187920 190510 192847 194609 196644 199918 204061 208009 211717 216193
51815 216193 222056 229061 236953 245874 255817 266326 276685 285910 292694 295934 295356 291366 284685 276374
51801 276374 267684 259289 251105 243305 236846 232407 229469 227190 225431 224112 222388 219651 216818 215286
51787 215286 214983 214701 214119 214085 214867 215490 215106 213981 212782 211825 211313 211436 211845 211716 210761 209589 208788 208202
51769 208202 207367 206160 204754 203336 202107 201226 200586 199905 199096 198267 197367 196207 194840 193639 192946 192798
51753 192798 192872 192559 191333 189320 187202 185395 183769 182379 181758 181985 182178 181558 180445 179468 178449 176977
51737 176977 175498 174686 174195 173194 171828 170868 170083 168388 165752 163651 163214 163979 164805 165012 164292 162566
51721 162566 160529 159432 159666 160231 160189 159957 160536 162076 163897 165556 167096 168435 169168 169083 168440 167593 166573
51704 166573 165205 163582 162252 161724 161753 161415 160124 158306 156756 155611 154347 152642 150801 149396 148841
51689 148841 149234 150277 151438 152501 153833 155911 158809 162289 165923 168830 169859 168611 165854 162485
51675 162485 158643 154463 150838 148449 146631 144441 142431 141970 142932 143499 142513 140746 139460 138831 138340 137724
51659 137724 136890 135594 133864 132252 131182 130481 129863 129466 129593 130300 131468 132836 133818 133827 132974 131997 131283
51642 131283 130436 129013 127231 125734 125041 125295 126155 126882 126988 126853 127206 128087 128889 129402 130112 131347 132831
51625 132831 134280 135737 137077 137847 137998 138304 139654 142165 145106 147449 148550 148709 149002 150089 151380
51610 151380 151963 152139 153194 155674 158806 161706 164222 166381 167916 168767 169269 169499 169225 168806 169329 171304
51594 171304 173879 175896 177083 177795 178177 178193 177996 177684 177084 176247 175724 175889 176332 176345 175697 174551 172987 171034
51576 171034 168907 166826 164802 162860 161233 160076 159253 158631 158357 158639 159417 160307 160747 160303 159187 158324
51560 158324 158429 159144 159559 159452 159357 159577 159939 160506 161582 162867 163528 163388 163251 163705 164406 164921 165519 166652
51542 166652 168310 170270 172370 174216 175299 175799 176603 178179 180058 181674 182931 183680 183609 183218 183866 186142
51526 186142 188958 191003 192293 193434 194139 193623 192047 190505 189708 189504 189603 189999 190668 191331 191614 191214 190177
51509 190177 189212 189298 190626 192375 193857 195351 197377 199810 202257 204724 207206 209138 210053 210409 211041 211988
51493 211988 212520 212091 210731 208766 206708 205126 204083 202930 201116 198857 196579 194231 191699 189394 187731
51478 187731 186457 185221 184370 184374 184874 185203 185512 186381 187502 187819 186938 185421 183561 180859 177050 172849 169207
51461 169207 166366 164028 162007 160350 159073 158103 157262 156229 154672 152589 150427 148836 148267 148599 149004
51446 149004 148534 147104 145669 145122 145279 145268 144580 143297 141613 139719 137996 136733 135714 134526 133221 132165
51430 132165 131341 130345 129030 127637 126245 124649 122966 121893 121965 122824 123520 123465 122904 122425 122228 122048 121746
51413 121746 121646 122004 122430 122313 121736 121435 121754 122194 122123 121438 120337 118992 117710 116817 116098 114917 113282
51396 113282 112164 112296 113248 114235 115301 116930 118894 120241 120310 119238 117655 116385 116174 117164 118654 119792
51380 119792 120337 120528 120597 120675 120763 120419 118987 116601 114429 113347 112892 112118 110977 110048 109384 108521 107393 106376
51362 106376 105544 104591 103408 102088 100480 98389 96061 93916 92041 90537 90020 90997 92906 94540 95368
51347 95368 95749 95999 95985 95615 95105 94738 94805 95592 96891 97834 97855 97496 97575 97933 97837 97286 96962 97116 97482 98134
51327 98134 99327 100595 101154 101258 101988 103522 104768 105000 104766 104684 104425 103534 102368 101497 100849 100155 99707 99944
51309 99944 100625 100983 100554 99523 98474 98077 98714 100103 101486 102316 102531 102199 101362 100288 99372 98652 97897
51292 97897 97280 97381 98307 99386 99981 100155 100291 100544 100979 101753 102811 103746 104226 104257 103852 102850 101295 99644
51274 99644 98349 97577 97422 97946 98784 99235 99070 98885 99341 100411 101642 102854 104171 105574 106752 107360 107265
51257 107265 106670 105982 105426 104829 104064 103563 103936 105082 106168 106603 106573 106517 106576 106749 107133 107722 108279 108631 108825
51238 108825 108916 108926 109112 109908 111387 113086 114509 115582 116562 117729 119239 121009 122728 124200 125516 126631
51222 126631 127030 126343 125125 124449 124799 125959 127783 130300 133078 135365 137030 138579 139988 140416 139500 138172
51206 138172 137626 137964 138425 138492 138268 138041 137937 137853 137510 136809 136217 136419 137437 138498 138908 138603 137745 136360
51188 136360 134648 133097 131996 131219 130676 130389 129931 128482 125844 122877 120510 118812 117318 115744 114031
51173 114031 112239 110821 110423 110993 111563 111406 110854 110482 110125 109333 108350 107858 108041 108485 108774 108649 107909 106727
51155 106727 105844 105867 106614 107641 109102 111400 114171 116389 117585 118450 120063 122754 125763 127865 128442 128087
51139 128087 128012 128805 130065 131234 132147 132560 131952 130383 128941 128551 128810 128772 128446 128592 129241 129458 128653 127300
51121 127300 126146 125409 125027 125061 125541 126237 126858 127237 127307 127191 127343 128192 129599 130986 131994 132699 133292 133927
51103 133927 134806 135880 136430 135594 133583 131878 131839 133404 135410 136928 137900 138666 139311 139637 139609 139582 139938 140519
51085 140519 140667 140012 139081 138834 139653 140985 141945 142054 141437 140557 139845 139437 139248 139337 139972 141140 142240 142674
51067 142674 142670 143028 144007 144895 144885 144004 142909 142061 141475 141131 141192 141748 142548 143161 143323 143101 142763 142512 142315 142031
51047 142031 141754 141936 142958 144584 146112 147190 148268 149954 152114 154018 155385 156799 158896 161563 164210
51032 164210 166536 168618 170526 172289 174147 176379 178913 181443 183884 186376 188873 191179 193371 195762
51018 195762 198352 200683 202366 203446 204239 205143 206637 209006 211926 214658 216778 218376 219528 220073 220137
51003 220137 220446 221810 224506 228255 232535 236751 240526 244057 247907 252290 256806 261113 265549 270898
50989 270898 277719 286036 295468 305536 316062 327364 339864 353591 368402 384614 402840 423165
50977 423165 445085 468527 494426 523949 557431 594246 633329 673772 715346 758648 804300
50966 804300 851866 899984 947578 994298 1039600 1082283 1121344 1156566 1187691 1213695 1233590
50955 1233590 1247529 1256443 1261027 1261683 1259074 1253971 1246785 1237856 1228017 1218300 1209232 1200926 1193613 1187490
50941 1187490 1182158 1176766 1170631 1163286 1154054 1142105 1127011 1108858 1087806 1063744 1036324 1005255
50929 1005255 970773 933956 896204 858219 819955 781724 744712 709902 677106 645668 615665
50918 615665 587790 562494 539954 520448 503979 489806 477115 465965 456879 449771 444059 439664
50906 439664 437028 436160 436468 437552 439491 442270 445544 448987 452327 455106 457021 458448 459918 461235 461857
50891 461857 462083 462909 464617 466403 467672 468852 470574 472818 475276 477940 480850 483804 486853 490680 495989
50876 495989 502808 510698 519408 529050 539886 552176 566012 581221 597762 616285 637762 662477
50864 662477 689934 720077 753981 792910 837194 886605 941449 1002621 1070691 1145536 1226856
50853 1226856 1314602 1408728 1508816 1614011 1723067 1834389 1946197 2056708 2163997 2265640
50843 2265640 2358653 2440012 2507405 2559660 2596656 2618878 2627105 2622483 2606839 2582788 2553387 2521590
50831 2521590 2490000 2461030 2436994 2419620 2409321 2405221 2406113 2411093 2418797 2426295 2429604 2425648 2413336
50818 2413336 2392646 2363285 2324577 2276024 2217373 2148564 2070286 1984437 1893531 1799809 1705322
50807 1705322 1612550 1524207 1442394 1368243 1302228 1244408 1194563 1152669 1119179 1094468 1078209
50796 1078209 1069738 1068792 1075280 1088614 1108021 1133410 1165017 1201993 1242106 1283105 1323775 1363352
50784 1363352 1400516 1433579 1461337 1483306 1499251 1508869 1512018 1509056 1500752 1487693 1469801 1446719
50772 1446719 1418809 1387393 1353721 1318015 1279909 1239465 1197303 1154071 1110462 1067622 1026896
50761 1026896 989197 955035 924872 898791 876102 856146 839428 827105 819383 815351 814506 817465
50749 817465 824843 836417 851907 871837 896928 927214 962298 1002074 1046689 1096227 1150995 1211786
50737 1211786 1279336 1353598 1433767 1518611 1606378 1694720 1781285 1864313 1942382 2013737 2076184
50726 2076184 2127571 2166252 2191343 2202760 2200977 2186730 2161312 2127203 2087959 2047106 2007323
50715 2007323 1970737 1939400 1914950 1897900 1887606 1882797 1881983 1883625 1886227 1888246 1887854 1883081 1872420
50702 1872420 1855064 1830429 1797824 1756995 1708789 1654911 1597013 1536302 1474013 1411949 1352359
50691 1352359 1297273 1248034 1205421 1170012 1142106 1121373 1107100 1099149 1098347 1105564 1120758 1143399
50679 1143399 1173562 1211930 1258908 1314419 1378506 1451309 1532297 1620074 1712932 1808974 1905622
50668 1905622 1999874 2089288 2172112 2246370 2309817 2361301 2401436 2431343 2451253 2460810 2460130 2450018
50656 2450018 2431646 2406485 2375879 2339983 2297739 2248773 2194942 2139209 2083353 2027756 1973248
50645 1973248 1921964 1876045 1836261 1802402 1774491 1753105 1738709 1731046 1729138 1731710 1737565 1745602
50633 1745602 1754591 1763218 1770594 1776583 1781411 1785155 1787955 1790639 1794629 1801025 1810033 1821529 1836022
50620 1836022 1854720 1878555 1907262 1939469 1973444 2007402 2039189 2066283 2086594 2099229 2104325
50609 2104325 2102380 2094080 2080465 2062691 2041597 2017800 1991963 1964415 1934506 1900903 1862603 1819274
50597 1819274 1770783 1717098 1658806 1597077 1532886 1466810 1399768 1333421 1269568 1209539 1154287
50586 1154287 1104369 1059466 1018451 980436 945533 914365 887242 864018 844261 827304 812611
50575 812611 800402 791475 786117 783724 783714 786190 791298 798597 807628 818626 832131 848436 867962
50562 867962 891594 919928 952588 989094 1030119 1077052 1130521 1190032 1254799 1324044 1396499
50551 1396499 1470435 1544366 1617181 1687478 1753459 1813771 1868144 1917148 1961809 2003573 2044032
50540 2044032 2084148 2123770 2162098 2198533 2233018 2265767 2296901 2326390 2354352 2381380 2408514
50529 2408514 2436902 2467499 2500973 2537625 2577307 2619533 2663590 2708317 2751915 2792427 2828481
50518 2828481 2859218 2883495 2899639 2906142 2902173 2887432 2862067 2826869 2782878 2730503 2669673 2601320
50506 2601320 2528205 2453821 2380935 2311494 2247305 2190021 2140745 2100111 2068417 2045175 2028843
50495 2028843 2017605 2010272 2006199 2004815 2005754 2009060 2014682 2021938 2029757 2036962 2041808 2041678 2033810 2016020
50481 2016020 1986587 1944329 1889720 1825333 1754214 1678106 1598093 1516356 1435991 1359115 1286232
50470 1286232 1217457 1153346 1094376 1040632 992340 949908 913052 880551 851246 824800 801360
50459 801360 781037 763930 750063 738937 729585 721303 714102 708316 704211 702066 702210 704735 709392
50446 709392 715865 723899 733228 743684 755409 768707 783844 801249 821639 845462 872409 902044
50434 902044 934695 971142 1011524 1055241 1101888 1151617 1204570 1260523 1319115 1379770 1441453
50423 1441453 1503189 1564949 1627288 1690024 1751966 1812133 1870458 1927040 1981505 2033584 2083705
50412 2083705 2132366 2179232 2223163 2262831 2297015 2324808 2346026 2361164 2370540 2373568 2369062 2356056
50400 2356056 2334184 2303602 2264873 2218766 2165913 2106700 2041529 1971078 1896284 1818280 1738380
50389 1738380 1658031 1578813 1502448 1430425 1363297 1300797 1243132 1191742 1148029 1111673 1081148
50378 1081148 1055835 1036539 1023823 1016922 1014809 1017297 1024314 1034722 1046663 1058644 1069611 1078264
50366 1078264 1083012 1082584 1076283 1063847 1045565 1022444 995813 966676 935643 903401 871020 839730
50354 839730 810464 783489 758464 735026 713367 693991 676990 661946 648607 637181 627753 619839
50342 619839 612880 606928 602504 599929 599049 599498 601039 603656 607451 612430 618416 625240 632844 641045 649424
50327 649424 657813 666703 676738 687979 700232 713937 729972 748563 769122 791401 816111 844113
50315 844113 875641 910609 948986 990308 1033316 1076623 1119493 1161610 1202550 1241905 1279567
50304 1279567 1315338 1348428 1377732 1402382 1421761 1435276 1442512 1443453 1438348 1427673 1412424 1394054
50292 1394054 1373662 1351471 1327318 1301198 1272964 1241906 1207259 1169056 1128193 1086005 1044134
50281 1044134 1004386 967958 934796 904095 875278 848129 822286 797271 773123 750478 729879
50270 729879 711305 694439 679037 664910 651758 639222 627160 615839 605849 597623 591001 585481
50258 585481 580885 577447 575196 573708 572746 572719 574090 576655 579767 583052 586496 590110 593991 598494 603847
50243 603847 609664 615300 620599 625742 630408 633688 635118 635421 635916 637306 639217 640838 641825 642544 643449
50228 643449 644394 644754 644134 642672 640637 638205 635745 633810 632413 630785 628405 625958 624650 624760 625573
50213 625573 626684 628589 631792 636066 641080 647265 655415 665582 676939 688801 701398 715496 731588
50200 731588 749694 769746 791762 815534 840461 865864 891275 916113 939302 959675 976801
50189 976801 991044 1002637 1011040 1015444 1015664 1012344 1006545 999269 991049 981616 970177 956364 940837
50176 940837 924790 909107 894342 881195 870421 862276 856590 853482 853536 857075 863652 872607 883878
50163 883878 897887 914841 934500 956663 981449 1008985 1039187 1072293 1109487 1152630 1203240
50152 1203240 1262020 1329503 1406898 1496050 1598714 1715957 1847867 1993391 2150380 2315774
50142 2315774 2485281 2652528 2809162 2947120 3061611 3152160 3221349 3273405 3313807 3348589
50132 3348589 3382412 3416719 3449540 3476332 3490571 3484474 3450774 3384850 3285640 3155205 2998150
50121 2998150 2821331 2633080 2441766 2254580 2077121 1913249 1764801 1631662 1512739
50112 1512739 1407229 1314996 1235708 1167909 1109318 1058169 1013976 976722 945607 919041 895840
50101 895840 875902 859534 846496 836035 827618 821281 817253 815421 815204 815928 817299 819418 822248 825337
50087 825337 828326 831542 835698 841050 847277 854092 861467 869289 877361 885912 895502 906148 917016 927246
50073 927246 936590 944982 952061 957628 962199 966619 971343 976513 982438 989604 998336 1008857 1021504 1036568
50059 1036568 1054056 1073829 1095778 1119641 1144958 1171489 1199434 1228903 1259456 1290482 1321778
50048 1321778 1353522 1386062 1420166 1457131 1498043 1543014 1591580 1643746 1700348 1762636 1832016
50037 1832016 1910109 1998559 2098814 2212456 2341740 2489483 2658381 2850460 3066767 3306831
50027 3306831 3568031 3845179 4130272 4412653 4680628 4924613 5139857 5326758 5489421
50018 5489421 5634317 5769080 5900223 6030394 6157269 6274545 6373218 6442140 6469306 6444882
50008 6444882 6364381 6229611 6047203 5826437 5577471 5309864 5031343 4747484 4462623 4181032
49998 4181032 3907084 3644419 3395391 3161503 2944029 2743894 2561277 2395845 2247240
49989 2247240 2114812 1997043 1891948 1798177 1715088 1641590 1575689 1515571 1460530 1410353 1364390
49978 1364390 1321885 1282776 1247482 1216009 1187637 1161230 1135491 1109300 1082345 1055182 1028342
49967 1028342 1001704 975188 949553 925847 904338 884587 866213 848987 832560 816932 802985
49956 802985 791669 782672 774600 766472 758420 751005 744620 739506 735555 731954 727790 723235 719566 717811
49942 717811 717936 719406 721825 724748 727602 730248 733186 736841 741087 745782 751274 757940 765569 773690
49928 773690 782374 792340 804400 819045 836480 856765 879912 906027 935465 968825 1006766 1049785
49916 1049785 1098200 1152536 1214006 1284455 1365728 1459338 1566751 1689514 1828630 1984023
49906 1984023 2154668 2338366 2530424 2722737 2905203 3068675 3207027 3317691 3401832 3464367
49896 3464367 3512661 3554127 3594411 3636663 3680687 3721832 3751248 3758150 3732539 3666999 3558027
49885 3558027 3407230 3221418 3010881 2786976 2560419 2340237 2132939 1942172 1769326
49876 1769326 1614552 1477366 1356804 1251529 1159980 1080531 1011635 951884 899925 854536
49866 854536 814963 780972 752203 727655 706155 687158 670595 656073 642770 630154 618339
49855 618339 607684 598442 590749 584427 578800 573198 567691 562821 558597 554357 549704 544944 540383 535734
49841 535734 530549 524824 518937 513251 507897 502717 497430 492227 487983 485326 483616 481556 478786 476032
49827 476032 473675 471128 467960 464679 461801 458942 455476 451603 448097 445464 443865 443379 443654 443674 442648
49812 442648 441060 440282 441176 443399 445950 448018 449397 450436 451553 452676 453330 453337 453012 452447 451098 448590
49796 448590 445537 442988 441203 439503 437315 434900 432959 431867 431457 431362 431355 431349 431240 430940 430592 430555 430958 431488
49778 431488 431820 432033 432259 432263 431908 431785 432643 434296 435816 436819 437799 439067 440239 441024 441741 442684 443737
49761 443737 444994 446945 449475 451455 452107 452247 453376 455858 458690 460829 462065 462730 463163 463526 463869 464316
49745 464316 465243 466892 468795 470053 470412 470474 470592 470267 469126 467778 466994 466626 466124 465676 465918 466735 467141
49728 467141 466331 464281 461399 458186 455108 452303 449444 446304 443255 440768 438739 436784 434941 433428
49714 433428 431976 430090 427862 425881 424393 423131 421925 420934 420296 419987 419980 420087 419761 418559 416735 414948
49698 414948 413570 412715 412688 413714 415300 416546 417081 417253 417472 417889 418613 419606 420489 421031 421727 423171 424940
49681 424940 425952 426008 426141 427182 428748 430065 431138 432585 434739 437425 440356 443405 446604 450090 453997
49666 453997 458314 462992 468078 473439 478459 482521 485778 489003 492563 496050 498994 501423 503537 505422
49652 505422 507423 510297 514463 519380 524116 528352 532442 536614 540577 544033 547207 550618 554345 557783
49638 557783 560284 561979 563756 566458 570306 575076 580353 585401 589289 591664 593188 594742 596417 597790
49624 597790 598934 600496 602744 605166 607132 608565 609896 611710 614372 617592 620426 622265 623712 625923
49610 625923 629157 632729 636439 641207 647878 656139 665059 674136 683302 692372 701117 709693 718566 728145
49596 728145 738689 750265 762532 774902 787243 800133 814090 828896 844032 859434 875344
49585 875344 891688 908179 924901 942258 960337 978839 997766 1017815 1039808 1063864 1089233
49574 1089233 1114844 1140056 1165004 1190343 1216679 1244269 1273138 1303213 1334277 1366002 1398185
49563 1398185 1430824 1463954 1497715 1532652 1569501 1608296 1647980 1687334 1726185 1765333 1805427
49552 1805427 1846393 1887919 1929864 1971902 2013097 2052273 2088803 2122872 2154989 2185303 2213317
49541 2213317 2238133 2259071 2276183 2290169 2301689 2310766 2316883 2319637 2319186 2316082 2310867 2303947 2295785
49528 2295785 2286973 2278107 2269704 2262299 2256420 2252367 2250169 2249907 2251923 2256413 2262932 2270598 2278958 2288396
49514 2288396 2299557 2312577 2327126 2342986 2360219 2378735 2398056 2417756 2437928 2458946 2480836
49503 2480836 2503167 2525475 2547416 2568371 2587413 2604004 2618473 2631287 2641990 2649319 2652455 2651650
49491 2651650 2647495 2639986 2628602 2612977 2593172 2569498 2542322 2511969 2478665 2442690 2404662 2365442
49479 2365442 2325674 2285665 2245772 2206501 2167972 2129733 2091504 2053853 2017768 1983742 1951585
49468 1951585 1920832 1890961 1861562 1832847 1805787 1781117 1758311 1736121 1714107 1693053 1673841
49457 1673841 1656548 1640862 1626739 1614161 1602682 1591708 1581184 1571629 1563426 1556247 1549202 1541632
49445 1541632 1533764 1526489 1520312 1514735 1509006 1503365 1499017 1496704 1495748 1494804 1493339 1492083 1492297 1494901 1500022
49430 1500022 1506742 1513063 1516645 1516262 1512741 1508206 1504266 1501018 1497825 1494580 1491831 1489945 1488821 1488455
49416 1488455 1489223 1491367 1494612 1498560 1503073 1508011 1513002 1517823 1522711 1527985 1533651 1539676 1546213 1553176
49402 1553176 1559986 1566255 1572420 1579146 1586357 1593390 1599845 1605706 1610879 1615333 1619568 1624188 1628936 1632808
49388 1632808 1635240 1636645 1637705 1638650 1639378 1639756 1639704 1639378 1639276 1639732 1640380 1640663 1640766 1641381 1642557 1643693 1644808
49371 1644808 1646895 1650454 1654509 1657791 1660427 1663679 1668315 1674018 1680358 1687582 1696104 1705685 1715652 1725880
49357 1725880 1737121 1750085 1764502 1779550 1795149 1812104 1830767 1850409 1870555 1892242 1916890
49346 1916890 1944315 1973015 2002341 2033187 2066358 2101473 2137985 2176264 2216925 2259860 2304677
49335 2304677 2351541 2400813 2452318 2505677 2561077 2619025 2679485 2741731 2804890 2868271 2931486
49324 2931486 2994741 3058798 3124167 3190501 3257119 3323836 3390791 3457721 3524001 3589303 3653641
49313 3653641 3716671 3777328 3834205 3886063 3931985 3971402 4004108 4030226 4050217 4064910 4075242
49302 4075242 4081769 4084531 4083513 4078957 4071162 4060364 4047111 4032409 4017158 4001685 3986127 3971061
49290 3971061 3957374 3945664 3936153 3929046 3924643 3923131 3924556 3929009 3936651 3947571 3961670 3978561 3997585
49277 3997585 4018175 4040310 4064321 4090111 4116807 4143340 4169037 4193521 4216415 4237439 4256467
49266 4256467 4273199 4287079 4297773 4305343 4309600 4309682 4304739 4294771 4280347 4261708 4238614 4210869 4178493
49253 4178493 4141511 4100044 4054642 4006150 3955223 3902199 3847322 3790767 3732524 3672672 3611806
49242 3611806 3550967 3491043 3432393 3374923 3318388 3262660 3207900 3154361 3101977 3050433 2999876
49231 2999876 2951271 2905740 2863587 2824181 2786656 2750550 2715932 2683164 2652469 2623644 2596351
49220 2596351 2570675 2547007 2525281 2504885 2485571 2467934 2452575 2439265 2427414 2416891 2407691
49209 2407691 2399190 2390481 2381317 2372013 2362524 2352347 2341432 2330425 2319763 2309017 2297377 2284454
49197 2284454 2270471 2256006 2241763 2228330 2215930 2204504 2193985 2184325 2175256 2166300 2157033 2147330
49185 2147330 2137492 2128223 2120128 2112969 2105694 2097595 2089115 2081043 2073239 2064828 2055533 2046072 2037233 2029222
49171 2029222 2022060 2015827 2010227 2004446 1997943 1991057 1984565 1978929 1974292 1970814 1968596 1967441 1967086 1967610
49157 1967610 1969368 1972555 1977099 1982969 1990378 1999595 2010600 2023022 2036494 2051074 2067144 2084774
49145 2084774 2103267 2121528 2138695 2154270 2167900 2179524 2189712 2199374 2208929 2218072 2226462 2234255
49133 2234255 2241679 2248470 2254145 2258683 2262530 2265937 2268685 2270598 2271989 2273274 2274304 2274429 2273282 2271189
49119 2271189 2268684 2265909 2262763 2259420 2256273 2253332 2250063 2245930 2240868 2235214 2229453 2224091 2219455 2215463
49105 2215463 2211860 2208724 2206433 2205069 2204230 2203583 2203267 2203625 2205036 2208125 2213507 2220961 2229316 2237637 2246095
49090 2246095 2255260 2265080 2275198 2285760 2297106 2308877 2320175 2330538 2340099 2348888 2356677 2363481
49078 2363481 2369569 2374928 2379339 2382977 2386262 2389079 2390808 2391201 2390586 2389069 2386254 2382037 2377007 2371714
49064 2371714 2366151 2360305 2354601 2349217 2343435 2336219 2327179 2316551 2304518 2291082 2276375 2260565 2243603
49051 2243603 2225514 2206810 2188032 2168940 2148780 2127585 2106658 2087363 2069699 2052499 2034900
49040 2034900 2017204 2000257 1984404 1969364 1954901 1941280 1929013 1918350 1909106 1900874 1893507 1887505
49028 1887505 1883747 1882521 1882944 1883852 1885285 1888525 1894423 1902251 1910666 1919424 1929512 1941864 1956470 1972672
49014 1972672 1989766 2007337 2025497 2044882 2066048 2088815 2112455 2136486 2160958 2186098 2212076
49003 2212076 2239063 2266990 2295237 2323016 2350170 2377127 2404003 2430232 2455331 2479592 2503684
48992 2503684 2527884 2552037 2576067 2600209 2624807 2650182 2676679 2704674 2734409 2765706 2797768
48981 2797768 2829354 2859454 2887826 2914729 2940142 2963542 2984531 3003397 3020799 3036950 3051336
48970 3051336 3063343 3073056 3081214 3088238 3093521 3096109 3096023 3094329 3091639 3087063 3079176 3067649 3053395 3037427
48956 3037427 3020327 3002819 2986080 2971092 2958081 2946768 2936865 2928125 2920245 2913044 2906683 2901654
48944 2901654 2898561 2897800 2899269 2902454 2907001 2913128 2921287 2931617 2943961 2958198 2974153 2991328 3009184
48931 3009184 3027695 3047247 3068064 3090092 3113386 3138161 3164414 3191855 3220246 3249515 3279605
48920 3279605 3310567 3342736 3376450 3411619 3447907 3485252 3523879 3563918 3605429 3648703 3694043
48909 3694043 3741383 3790522 3841595 3894832 3950057 4007055 4066262 4128383 4193381 4260574 4329697
48898 4329697 4401126 4475075 4551438 4630502 4712849 4798302 4885900 4975192 5066572 5159844 5253485
48887 5253485 5346215 5438505 5531555 5625192 5717670 5807267 5893320 5975867 6055076 6131027 6203423
48876 6203423 6271491 6334650 6393183 6447755 6498345 6544143 6584460 6619128 6647833 6669607 6683357
48865 6683357 6688749 6686286 6676652 6660198 6637048 6607497 6572085 6531299 6485393 6434612 6379396 6320144
48853 6320144 6256945 6189795 6118970 6044892 5967758 5887678 5805124 5720904 5635714 5550149 5465060
48842 5465060 5381359 5299382 5218883 5139752 5062260 4986544 4912381 4839731 4769120 4701344 4637114
48831 4637114 4577061 4521595 4470630 4423846 4381261 4343060 4308865 4277879 4249969 4225959 4206620
48820 4206620 4191918 4181535 4175456 4173702 4176117 4182826 4194320 4210609 4230859 4254348 4281251 4312060
48808 4312060 4346715 4384844 4426242 4470510 4516715 4564093 4612731 4662945 4714413 4766579 4819566
48797 4819566 4873917 4929652 4986246 5043332 5100741 5158050 5214764 5270872 5326581 5381687 5435840
48786 5435840 5489384 5543231 5597913 5653356 5709630 5767136 5825858 5885070 5944169 6003429 6063580
48775 6063580 6124853 6186734 6248572 6310183 6371738 6433101 6493518 6552169 6608864 6663650 6715712
48764 6715712 6763368 6805599 6843001 6876646 6906482 6931597 6951812 6968128 6981565 6992268 6999923
48753 6999923 7004421 7005759 7003656 6997593 6987124 6972017 6952075 6926822 6895309 6856442 6809668 6755262
48741 6755262 6693919 6626403 6553751 6477428 6398963 6319776 6241649 6166882 6097364 6033682 5975532
48730 5975532 5922706 5875153 5832462 5794026 5759629 5729286 5702705 5679640 5660620 5646473 5637047
48719 5637047 5631199 5628157 5628021 5630611 5634702 5639077 5643637 5648606 5653026 5654976 5653385 5648817 5642129 5632895
48705 5632895 5619693 5601651 5579102 5552779 5523007 5489960 5454155 5416062 5375509 5332118 5286301
48694 5286301 5239275 5192047 5145024 5098728 5054177 5012183 4972815 4935971 4901950 4870953 4842463
48683 4842463 4815744 4790738 4767965 4747773 4730104 4714762 4701436 4689596 4678798 4668941 4659964 4651543
48671 4651543 4643404 4635618 4628211 4620885 4613517 4606481 4599962 4593452 4586610 4580126 4574882 4570563 4566078 4561242
48657 4561242 4557090 4554366 4552559 4550620 4547907 4544160 4539116 4532466 4523746 4512108 4496626 4477024 4453746
48644 4453746 4427328 4398090 4366421 4332753 4297089 4258956 4217983 4174185 4127687 4078652 4027497
48633 4027497 3974788 3920880 3866085 3811168 3757121 3704379 3652755 3602244 3553371 3506633 3462063
48622 3462063 3419411 3378316 3338238 3298774 3260219 3223359 3188619 3155824 3124840 3095871 3069015
48611 3069015 3044147 3021428 3001362 2984066 2968994 2955602 2943758 2933237 2923439 2914063 2905631 2898876
48599 2898876 2893940 2890588 2888892 2889217 2891732 2896328 2902866 2911171 2920914 2931772 2943602 2956271 2969486
48586 2969486 2983020 2996985 3011638 3027044 3043145 3060090 3078244 3097848 3118773 3140621 3163086
48575 3163086 3186224 3210283 3235205 3260357 3284948 3308583 3331312 3353317 3374893 3396593 3419022
48564 3419022 3442435 3466824 3492338 3519266 3547681 3577470 3608702 3641532 3675675 3710482 3745721
48553 3745721 3781966 3819967 3859869 3901258 3943807 3987684 4033389 4081234 4130991 4182122 4234357
48542 4234357 4287815 4342448 4397683 4452840 4507544 4561480 4614213 4665769 4716890 4767983 4818038
48531 4818038 4865340 4909058 4949398 4986366 5019379 5048158 5073029 5094008 5110416 5121816 5128702
48520 5128702 5131810 5131316 5127106 5119452 5108983 5096384 5082361 5067555 5052171 5035934 5018540 4999780
48508 4999780 4979193 4956163 4930569 4902895 4873449 4841952 4808036 4771681 4732902 4691532 4647618
48497 4647618 4601628 4554059 4505153 4455098 4404037 4351822 4298366 4244337 4190826 4138170 4085874
48486 4085874 4033953 3983430 3935007 3888163 3842209 3797538 3755023 3714809 3676530 3640247 3606340
48475 3606340 3574813 3545468 3518429 3493635 3470091 3446514 3422724 3399572 3377550 3356257 3335345
48464 3335345 3315221 3296408 3278758 3261599 3244368 3226852 3209028 3190918 3172451 3153494 3134102
48453 3134102 3114684 3095671 3077045 3058336 3039011 3018732 2997379 2975102 2952299 2929284 2906059
48442 2906059 2882563 2858954 2835398 2811717 2787540 2762764 2737655 2712554 2687663 2662952 2638024
48431 2638024 2612215 2585156 2557222 2529208 2501569 2474166 2446622 2418686 2390336 2361781 2333441
48420 2333441 2305726 2278784 2252458 2226396 2200206 2173706 2147198 2121342 2096625 2073086 2050648
48409 2050648 2029546 2010141 1992449 1976084 1960618 1945838 1931711 1918385 1906220 1895648 1886849
48398 1886849 1879628 1873721 1869152 1866088 1864251 1862694 1860494 1857610 1854698 1852125 1849639 1847172 1845276 1844370
48384 1844370 1844073 1843839 1843703 1843686 1843004 1840889 1837972 1835737 1834629 1833771 1832674 1832087 1832663 1833814 1834540 1834683 1834676
48367 1834676 1834614 1834189 1833206 1831645 1829538 1827208 1825306 1824285 1824135 1824783 1826253 1828248 1830253 1832474 1836012
48352 1836012 1841606 1848736 1856449 1864557 1873425 1883137 1893604 1905156 1918348 1933358 1950083 1968585
48340 1968585 1988924 2010776 2033741 2057884 2083500 2110508 2138449 2166894 2195517 2223977 2252085
48329 2252085 2279874 2307163 2333259 2357375 2379143 2398457 2415061 2428563 2438542 2444484 2445907 2442783
48317 2442783 2435561 2424651 2410303 2392919 2372883 2349928 2323469 2293846 2262514 2230726 2198781
48306 2198781 2166826 2135342 2104299 2072883 2040868 2009365 1979356 1950429 1921963 1894694 1869817
48295 1869817 1847154 1825642 1805252 1787046 1771401 1757450 1744297 1731794 1720067 1709259 1699786
48284 1699786 1691903 1684967 1678030 1671186 1665429 1661104 1657530 1654288 1651992 1651370 1652304 1654148 1656403 1658776
48270 1658776 1661087 1663483 1666420 1670226 1674878 1680154 1685698 1691094 1696329 1702032 1708817 1716513 1724550 1732849
48256 1732849 1741635 1750490 1758470 1765266 1771649 1778494 1785871 1793293 1800507 1807804 1815693 1824294 1833007 1840972
48242 1840972 1847937 1854317 1860320 1865586 1869997 1874046 1877853 1880480 1880971 1879565 1877106 1873753 1869076 1862937
48228 1862937 1855400 1846222 1835342 1823593 1812100 1801322 1791384 1782755 1775513 1768497 1760350 1751151 1741953
48215 1741953 1733091 1724068 1714709 1705196 1695251 1684536 1673615 1663261 1653100 1642272 1631155 1621117
48203 1621117 1612803 1606106 1601534 1600105 1602078 1607405 1617271 1633655 1657714 1690144 1732620 1787064 1854472
48190 1854472 1937104 2041380 2176140 2349110 2567389 2835992 3143365 3443040 3659606 3727844
48180 3727844 3633174 3415071 3134624 2841475 2564177 2316424 2102796 1921353 1767620 1638470
48170 1638470 1531807 1444229 1371201 1309250 1256576 1211874 1173692 1140739 1111948 1086345 1063366
48159 1063366 1043095 1025710 1010891 997989 986467 975969 966238 957174 948701 940526 932391 924479
48147 924479 917210 910656 904607 899044 893961 888859 883170 877266 872302 868907 866601 864718 863285 862664
48133 862664 862845 863437 864147 864986 866140 867628 868951 869267 868238 866547 865180 864456 864219 864623 865890 867399
48117 867399 867937 867055 865448 863841 862266 860726 859734 859568 859584 858960 857864 857269 857751 859056 860804 863182
48101 863182 866646 871226 876346 881391 886306 891506 897244 903304 909491 916101 923530 931461 938891 945103
48087 945103 950327 955292 960375 965363 969982 974339 978723 983003 986514 988762 990193 991861 994352 997417
48073 997417 1000871 1005314 1011496 1019207 1027332 1034905 1041694 1047776 1053066 1057481 1061300 1065126 1069486 1074472
48059 1074472 1079714 1084697 1089119 1092857 1095673 1097274 1097773 1097811 1098047 1098742 1099906 1101467 1103024 1103810 1103293 1101655
48043 1101655 1099475 1097199 1095065 1093162 1091233 1088836 1086098 1083923 1083008 1083029 1083327 1083927 1085183 1086646 1087157
48028 1087157 1086063 1083653 1080321 1075953 1070292 1063426 1055685 1047470 1039200 1030988 1022292 1012342 1001143 989654
48014 989654 978767 968423 957903 946711 935030 923513 912796 903051 893960 885140 876495 867946
48002 867946 859017 849153 838474 827836 818040 809185 800806 792362 783556 774480 765508 756925 748679 740660
47988 740660 733020 725885 718845 711179 702596 693426 684068 674627 665162 655858 646795 637868 629090 620799
47974 620799 613331 606649 600385 594165 587833 581454 575159 568941 562714 556655 551236 546654 542362 537523
47960 537523 531935 526223 521100 516731 512865 509290 505989 502956 499995 496784 493191 489447 485790 481941
47946 481941 477335 472035 467011 463193 460624 458903 458061 458321 459212 459660 459076 457882 456909 456759 457735 459834
47930 459834 462516 464892 466443 467449 468648 470729 474134 478945 484778 491062 497627 504819 512869 521342
47916 521342 529502 537160 544975 553788 563661 573670 582710 590457 597455 604394 611547 618782 625673 631524
47902 631524 635705 638204 639559 640204 640327 640365 640861 641512 641162 639335 637087 635611 634671 633356 631779 630801
47886 630801 630329 629267 627274 625459 624920 625565 626780 628439 630745 633729 637437 642172 648078 654872 662306
47871 662306 670415 679048 687635 695823 703894 712193 720530 728592 736536 744662 752725 760059 766297 771586
47857 771586 776176 780085 783144 785092 785726 785165 783988 782916 782257 781672 780455 778115 774667 770345 765134
47842 765134 758892 751941 744997 738168 730536 721331 711185 701453 692486 683446 673846 664413 656200 649533
47828 649533 644151 639749 636014 632655 629751 627621 626151 624792 623470 622866 623440 624800 626592 629414 634067
47813 634067 640269 646830 653019 659087 665510 672310 679318 686640 694516 702773 710639 717304 722790 728116
47799 728116 734238 740895 746904 751579 755327 758713 761577 763423 764117 763689 762000 759269 756600 755145 754778
47784 754778 754197 752387 749472 746155 742961 740277 738485 737577 736869 735597 733799 732333 731968 732645 733735
47769 733735 734861 736255 738323 741099 744326 747884 751872 756277 760768 764909 768364 770898 772426 773229
47755 773229 773828 774362 774105 771881 767067 760128 752078 743451 733915 722896 710410 697057 683388 669632
47741 669632 656096 643317 631562 620552 610034 600366 592095 585201 579166 573646 568647 564201 560280
47728 560280 556926 554055 551375 548988 547850 548944 552018 555753 559247 562780 567107 572585 579147 586534
47714 586534 594407 602653 611714 622161 633898 646265 658885 671814 684867 697576 709915 722328
47702 722328 734789 746552 757110 766685 775461 783037 789059 793748 797376 799783 800836 800841 800065 798426
47688 798426 795960 792940 789137 783769 776815 769661 763681 758784 754140 749745 746297 743923 742096 740708
47674 740708 740279 741109 743000 745935 750410 756888 765339 775378 786530 798486 811389 825685 841363
47661 841363 857619 873718 889888 906791 924475 942469 960636 979096 997394 1014580 1030267
47650 1030267 1044905 1058727 1070961 1080419 1086525 1089572 1090136 1088392 1083879 1075937 1064444 1049916 1032740
47637 1032740 1012709 989775 964915 939600 914512 889364 863978 839021 815601 794503 775789
47626 775789 758750 742290 725824 709780 694866 680990 667496 654400 642687 633143 625443 618723
47614 618723 612639 607475 603439 600249 597380 594529 591748 589238 587086 585319 584029 583159 582227 580718 578904
47599 578904 577743 577636 577828 577482 576768 576268 575792 574709 573198 572321 572762 574196 575878 577177 577588 576979 575925
47582 575925 575167 574625 573555 571645 569222 566366 562749 558533 554488 550782 546549 541215 535501 530391 525703
47567 525703 520520 514550 508241 501809 495022 487951 481215 475286 470067 465267 460797 456657 452793 449285
47553 449285 446450 444547 443496 442999 442898 443331 444568 446748 449785 453436 457344 461019 463989 466190 468073
47538 468073 470120 472209 473666 473834 472369 469128 464179 458008 451336 444550 437539 430204 422862 415966
47524 415966 409659 403730 397859 391791 385540 379520 374229 369639 365125 360175 354967 350079 345898 342503
47510 342503 339910 338137 337149 336929 337448 338387 339077 339074 338719 338842 339843 341291 342387 342713 342505 342368 342772 343700
47492 343700 344734 345519 346127 346916 348105 349607 351216 352760 354064 355013 355810 356981 358866 361165 363289
47477 363289 365204 367550 370743 374269 377253 379484 381428 383372 385153 386864 389172 392605 396936 401610
47463 401610 406363 411027 415184 418671 422184 426687 432210 437834 442929 447848 453206 459021 464965 471046
47449 471046 477621 484776 492041 498784 504745 510106 515041 519333 522582 524822 526657 528584 530395 531563
47435 531563 532036 532246 532406 532216 531372 529974 528235 526108 523464 520497 517636 515012 512193 508658 504553
47420 504553 500765 498008 495977 493763 491049 488379 486222 484401 482830 482122 482873 484764 487118 490022 494097
47405 494097 499330 504944 510478 516137 521947 527327 531889 535990 540106 544091 547485 550197 552435 554199
47391 554199 555210 555282 554550 553353 551868 549800 546519 541805 536328 531052 526309 521899 517895 514621 511800
47376 511800 508534 504519 500639 497924 496379 495301 494340 493755 493872 494794 496510 498944 501920 505292 508956
47361 508956 512718 516445 520463 525401 531360 537616 543433 548805 554073 559169 563732 567768 571718 575927
47347 575927 580323 584486 587758 589497 589566 588379 586212 582718 577576 571323 564919 558518 551325 542882 533912
47332 533912 525554 518169 511323 504691 498345 492190 485695 478554 471277 464635 458668 452640 445972 438800
47318 438800 431619 424913 419274 415171 412134 408779 404303 399559 395927 393497 391294 389087 387775 387855 388609
47303 388609 389330 390418 392570 395497 398178 400006 401101 401783 402335 403043 403984 404892 405586 406271 407060 407542 407300
47286 407300 406640 406231 406144 405730 404507 402797 401396 400837 401043 401555 402086 402806 403987 405517 407039 408537 410338
47269 410338 412466 414526 416337 418160 420101 421917 423681 426028 429247 432758 436003 439321 443305 447815
47255 447815 452329 456874 461858 467276 472869 478811 485507 492881 500581 508591 516794 524210 529757 533837
47241 533837 538047 543034 547589 550359 551583 552507 553741 554951 555836 556614 557560 558554 559212 559237 558662 557861 557287
47224 557287 557095 557082 556943 556457 555459 553925 552069 550126 548038 545648 543240 541489 540822 541088 541938 543172
47208 543172 544670 546393 548640 551882 556113 560676 565034 569447 574620 580854 587841 595134 602488 609788
47194 609788 616886 623568 629586 634774 639194 643062 646405 648839 649768 648826 646169 642395 638206 634003 629754
47179 629754 625299 620665 615938 610951 605430 599499 593826 589123 585649 583223 581531 580357 579752 580048 581528
47164 581528 584057 587249 591107 596177 602838 610735 619204 628091 637775 648438 659692 671058 682467
47151 682467 694078 705815 717410 728825 740245 751540 762047 771182 779084 786332 793124 799087
47139 799087 803880 807587 810470 812692 814401 815635 815957 814633 811499 807298 802820 798170 793295 788749
47125 788749 785211 782497 779883 777264 775174 773563 771445 768153 764227 760595 757427 754353 751358 748824
47111 748824 746855 745175 743614 742302 741330 740605 740055 739736 739777 740419 742009 744624 747762 750775 753635 756867
47095 756867 760661 764431 767546 770177 773005 776156 778868 780290 780271 779108 776815 773036 767649 761024 753560
47080 753560 745295 736222 726759 717563 708929 700651 692441 684221 676008 667817 659806 652293 645468 639141
47066 639141 632913 626534 620141 614265 609563 606339 604176 602185 599713 596845 594290 592918 593350 595651
47052 595651 599260 603358 607509 611929 617077 623091 629701 636533 643364 650145 656934 663745 670335 676229
47038 676229 681095 685133 688862 692508 695723 698039 699428 700301 701057 701870 702938 704642 707326 711001 715407
47023 715407 720222 725127 729814 734154 738272 742292 746153 749832 753540 757379 761020 764174 767234 770872
47009 770872 774935 778366 780438 781582 782713 784283 786341 788959 792013 794925 797273 799539 802717 807310
46995 807310 813101 819590 826075 831572 835407 837911 839953 841815 843128 843860 844507 845126 844933 843328 840727
46980 840727 837887 834914 831411 827285 822875 818550 814637 811548 809411 807728 805872 803952 802767 802864 804020
46965 804020 805700 807632 809771 812074 814646 817910 822246 827476 833047 838799 845230 852785 861115 869403
46951 869403 877297 885049 892699 899648 905376 910231 915099 920419 925831 930681 934565 937502 939914 942400
46937 942400 945209 947922 949852 950645 950313 948970 946961 945068 944080 944093 944652 945519 946825 948511 950177 951598
46921 951598 952913 954243 955630 957447 960271 964154 968564 973250 978575 984655 990822 996433 1001684 1007051
46907 1007051 1012382 1017240 1021811 1026709 1031965 1036909 1041098 1044827 1048639 1052863 1057780 1063809 1071223 1079857
46893 1079857 1089239 1098876 1108411 1117756 1127079 1136425 1145339 1153089 1159289 1164070 1167628 1169909 1170882 1170893 1170504
46878 1170504 1170081 1169647 1169170 1168916 1169517 1171587 1175243 1180036 1185418 1191162 1197272 1203688 1210287 1217036 1223870
46863 1223870 1230510 1236688 1242553 1248506 1254565 1260163 1264735 1268305 1271352 1274282 1277157 1279852 1282255 1284419
46849 1284419 1286663 1289501 1293352 1298282 1304077 1310490 1317408 1324800 1332649 1340901 1349386 1357795 1365821 1373361
46835 1373361 1380560 1387636 1394668 1401533 1407940 1413456 1417541 1419768 1420141 1419171 1417515 1415434 1412712 1409114
46821 1409114 1404830 1400346 1395990 1391721 1387382 1382984 1378644 1374390 1370195 1366200 1362801 1360392 1359017 1358343
46807 1358343 1358000 1358033 1358961 1361357 1365347 1370642 1377085 1384985 1394748 1406291 1419109 1432810 1447298 1462375
46793 1462375 1477631 1492933 1508644 1524968 1541311 1556742 1570901 1584005 1596086 1606761 1615775
46782 1615775 1623171 1628788 1632081 1632679 1630708 1626439 1620118 1612436 1604577 1597343 1590530 1583478 1575818 1567256
46768 1567256 1557131 1544981 1531443 1518048 1506046 1495698 1486437 1477323 1467554 1457159 1447133 1438478
46756 1438478 1431194 1424630 1418586 1413405 1409085 1405019 1400794 1396680 1393192 1390613 1389115 1388935 1390206 1392836
46742 1392836 1396559 1400865 1405040 1408769 1412647 1417591 1423802 1430833 1438577 1447498 1457741 1468707 1479750
46729 1479750 1490731 1501591 1511919 1521325 1529863 1537897 1545876 1554322 1563481 1572761 1581010 1587660 1593125
46716 1593125 1597903 1601919 1605096 1607976 1611218 1614824 1618314 1621386 1624141 1626973 1630546 1635480 1641808 1649064
46702 1649064 1657023 1665747 1674742 1682868 1689602 1695738 1702194 1708712 1714414 1719068 1722901 1725517 1725910 1723494
46688 1723494 1718454 1711192 1702010 1691219 1678928 1664883 1649029 1632030 1614600 1596510 1576905 1555525
46676 1555525 1532923 1509633 1485907 1462291 1439642 1418345 1398051 1378362 1359269 1340840 1323040
46665 1323040 1305999 1289899 1274484 1259209 1244063 1229694 1216496 1204151 1192365 1181447 1171691
46654 1171691 1162607 1153395 1144098 1135773 1129503 1125550 1123569 1123366 1125171 1129177 1135044 1142175 1150429 1160188
46640 1160188 1171606 1184188 1197394 1211271 1225963 1240891 1255040 1267974 1280001 1291317 1301508
46629 1301508 1310026 1316669 1321482 1324646 1326584 1327762 1328229 1327723 1326390 1324965 1324075 1323782 1324127 1325674 1329139
46614 1329139 1334600 1341498 1349413 1358587 1369666 1383048 1398487 1415265 1432688 1450342 1468008 1485597
46602 1485597 1503290 1521274 1539043 1555236 1568654 1579236 1587591 1593835 1597496 1598370 1596671 1592298 1584822
46589 1584822 1574513 1562640 1550225 1537023 1522239 1505853 1488687 1471442 1454256 1437162 1420471
46578 1420471 1404573 1389517 1374899 1360161 1345134 1330261 1316082 1302596 1289436 1276629 1264576
46567 1264576 1253151 1241478 1229098 1216864 1206100 1197056 1188766 1180333 1171785 1163714 1156555 1150400 1145132
46554 1145132 1140528 1136390 1132712 1129607 1127036 1124735 1122455 1120189 1118181 1116770 1116153 1116122 1116155 1115960 1115965 1117003
46538 1117003 1119349 1122236 1124479 1125664 1126590 1128490 1131914 1136448 1141432 1146637 1152201 1158217 1164706 1171761
46524 1171761 1179398 1187319 1195222 1203335 1212237 1222076 1232353 1242628 1253059 1264015 1275430 1286925
46512 1286925 1298422 1310328 1323183 1337311 1352738 1369229 1386429 1404130 1422327 1440899 1459381
46501 1459381 1477322 1494828 1512477 1530552 1548513 1565405 1580669 1594456 1607105 1618585 1628564
46490 1628564 1636841 1643353 1647836 1649980 1650169 1649694 1649745 1650325 1650522 1649699 1647954 1645551 1642471 1638725 1634518 1629824
46474 1629824 1624167 1617178 1609121 1600547 1591624 1582089 1571727 1560566 1548623 1535726 1521661 1506389
46462 1506389 1490042 1472691 1454163 1434263 1413260 1391914 1370711 1349266 1326944 1304052 1281918
46451 1281918 1261665 1243344 1226449 1210759 1196384 1183407 1172002 1162640 1155701 1151018 1148129 1146843
46439 1146843 1147201 1149029 1151948 1155849 1160956 1167376 1174796 1182655 1190351 1197370 1203542 1209330 1215577 1222725
46425 1222725 1230353 1237649 1244273 1250572 1256871 1262742 1267269 1270050 1271678 1273005 1274170 1274731 1274580 1274209 1274010
46410 1274010 1273851 1273656 1273973 1275511 1278369 1282118 1286523 1291803 1298214 1305786 1314516 1324625 1336505 1350581
46396 1350581 1367248 1386817 1409380 1434660 1461976 1490494 1519780 1550158 1582278 1616279 1651516
46385 1651516 1687109 1722380 1756628 1788936 1818630 1845690 1870379 1892550 1911619 1927037 1938479
46374 1938479 1945707 1948649 1947557 1942785 1934444 1922546 1907454 1889899 1870571 1850026 1828932 1808008
46362 1808008 1787569 1767491 1747850 1729310 1712566 1697560 1683672 1670826 1660107 1652969 1649827 1649705
46350 1649705 1651438 1654952 1661099 1670472 1682929 1698318 1717082 1739727 1766051 1795389 1827510 1862786
46338 1862786 1901410 1942815 1986012 2030301 2075486 2121464 2167751 2213452 2257638 2299609 2338695
46327 2338695 2373988 2404602 2430141 2450555 2465509 2474294 2476582 2472885 2463941 2449932 2430616 2405986
46315 2405986 2376472 2342669 2305239 2264983 2222726 2179198 2135189 2091537 2048773 2007108 1967125
46304 1967125 1930083 1896967 1867507 1840738 1816421 1795340 1778277 1765329 1756253 1750876 1748956 1750066
46292 1750066 1753792 1759798 1767795 1777916 1791038 1808115 1828989 1852398 1877171 1902876 1929289 1956101
46280 1956101 1983435 2011858 2041358 2070983 2100042 2129019 2158560 2188059 2216099 2242075 2266543
46269 2266543 2290029 2312214 2332338 2349757 2364008 2374815 2382151 2385952 2385824 2381505 2373516 2362746
46257 2362746 2349395 2332997 2313607 2292291 2270211 2247871 2225642 2204377 2184931 2167448 2151669
46246 2151669 2137628 2125525 2115196 2106301 2098916 2093362 2089565 2087133 2086023 2086503 2088386 2090868 2093361
46233 2093361 2095987 2098985 2102105 2104974 2107726 2110746 2113903 2116401 2117388 2116513 2113899 2109810 2104368 2097545
46219 2097545 2089411 2080312 2070623 2060287 2048960 2036706 2024245 2012228 2000560 1988778 1976893 1965384
46207 1965384 1954387 1943286 1931194 1917679 1903074 1888417 1875018 1863716 1854396 1846410 1839461 1833818
46195 1833818 1829724 1826984 1825308 1824736 1825549 1827976 1832199 1838381 1846472 1856033 1866469 1877389 1888729 1900684
46181 1900684 1913647 1928029 1943846 1960420 1976664 1991837 2006166 2020708 2036382 2052980 2069218
46170 2069218 2083934 2097138 2109692 2122198 2134590 2146716 2158822 2171245 2183971 2196677 2208939
46159 2208939 2220406 2231105 2241753 2253291 2265814 2278260 2289526 2299659 2309677 2320396 2331801
46148 2331801 2343404 2354769 2365655 2375956 2385666 2394884 2403812 2412719 2421745 2430698 2439225 2447263 2455100
46135 2455100 2462859 2470200 2476779 2482815 2488959 2495703 2503047 2510486 2517155 2522247 2525683 2528264 2530932 2534024
46121 2534024 2537458 2541304 2545707 2550403 2554871 2559058 2563481 2568418 2573338 2577460 2580731 2583966 2587966 2592681
46107 2592681 2597345 2601327 2604570 2607153 2608842 2609563 2610101 2611632 2614320 2616976 2618486 2619009 2619350 2619621 2619234
46092 2619234 2617963 2616213 2614351 2612423 2610584 2609177 2608208 2607287 2606301 2605677 2605820 2606701 2608276 2610827 2614517
$$ [...]
##END NTUPLES=NMR SPECTRUM
##END=
