##TITLE=NES1058_SeabridgeLH_9270760_XtPAL5oZl9
##JCAMPDX= 6.0         $$ Bruker NMR JCAMP-DX V2.0
##DATA TYPE= NMR SPECTRUM
##DATA CLASS= NTUPLES
##ORIGIN= BRUKER
##OWNER= Administrator
$$ 1.72 TOPSPIN		Version 2.1
$$ 2015-07-11 23:33:35.831 -0700  Administrator@X
$$ Compression mode = diff/dup
##.OBSERVE FREQUENCY= 400.02188249412
##.OBSERVE NUCLEUS= ^1H
##.ACQUISITION MODE= SIMULTANEOUS (DQD)
##.ACQUISITION SCHEME= undefined
##.AVERAGES= 8
##.DIGITISER RES= 22
##SPECTROMETER/DATA SYSTEM= spect
##.PULSE SEQUENCE= zg30
##.SOLVENT NAME= COFFEE_meoh
##.SHIFT REFERENCE= INTERNAL, COFFEE_meoh, 1, 14.98509
##AUDIT TRAIL= $$ (NUMBER, WHEN, WHO, WHERE, PROCESS, VERSION, WHAT)
$$ ##TITLE= Audit trail, TOPSPIN		Version 2.1
$$ ##JCAMPDX= 5.01
$$ ##ORIGIN= Bruker BioSpin GmbH
$$ ##OWNER= Administrator
$$ $$ E:\/data/COFFEE/nmr/NES1058_SeabridgeLH_9270760_XtPAL5oZl9/10/pdata/1/auditp.txt
$$ ##AUDIT TRAIL=  $$ (NUMBER, WHEN, WHO, WHERE, PROCESS, VERSION, WHAT)
(   1,<2015-07-11 23:33:28.519 -0700>,<Administrator>,<X>,<go>,<TOPSPIN 2.1>,
      <created by zg
	started at 2015-07-11 23:32:22.550 -0700,
	POWCHK enabled, PULCHK disabled,
       configuration hash MD5:
       21 0F 79 D6 B3 7B B4 F6 88 20 88 DB 03 48 BD 9F
       data hash MD5: 64K
       E9 D9 CA 2F A3 05 5F 71 5A 23 6E C6 94 BC 9C 01>)
(   2,<2015-07-11 23:33:31.660 -0700>,<Administrator>,<X>,<proc1d>,<TOPSPIN 2.1>,
      <Start of raw data processing
       efp LB = 0 FT_mod = 6 PKNL = 1 PHC0 = 0 PHC1 = 0 SI = 32K 
       data hash MD5: 32K
       00 4C CE F0 37 75 43 CC 8D 03 2E 30 F3 B7 27 0E>)
(   3,<2015-07-11 23:33:31.956 -0700>,<Administrator>,<X>,<proc1d>,<TOPSPIN 2.1>,
      <pk PHC0 = 94.39453 PHC1 = 0 
       data hash MD5: 32K
       91 CC E5 7D 84 4F CE 97 B1 61 09 53 AD 41 31 A3>)
(   4,<2015-07-11 23:33:32.066 -0700>,<Administrator>,<X>,<proc1d>,<TOPSPIN 2.1>,
      <abs ABSG = 1 
       data hash MD5: 32K
       60 51 2B EB B3 AE 33 7D 5C 74 D9 95 57 EA 88 2D>)
(   5,<2015-07-11 23:33:32.128 -0700>,<Administrator>,<X>,<proc1d>,<TOPSPIN 2.1>,
      <abs ABSG = 2 
       data hash MD5: 32K
       5A EF 7D 5A A5 73 E2 9C 35 78 67 CF 70 C5 18 E8>)
(   6,<2015-07-11 23:33:32.191 -0700>,<Administrator>,<X>,<proc1d>,<TOPSPIN 2.1>,
      <abs ABSG = 3 
       data hash MD5: 32K
       1A E2 09 7E E5 F0 A9 E2 22 CB 08 72 76 15 41 7F>)
(   7,<2015-07-11 23:33:32.253 -0700>,<Administrator>,<X>,<proc1d>,<TOPSPIN 2.1>,
      <abs ABSG = 4 
       data hash MD5: 32K
       5B C1 35 56 D7 A1 C4 42 3B 70 D4 3E 4C F7 23 80>)
(   8,<2015-07-11 23:33:32.316 -0700>,<Administrator>,<X>,<proc1d>,<TOPSPIN 2.1>,
      <abs ABSG = 5 
       data hash MD5: 32K
       FF 57 A4 C9 45 CC 09 83 85 30 33 2E E4 12 3A EE>)
$$ ##END=
$$ 
$$ $$ hash MD5
$$ $$ 69 C7 B0 4E EA BA 03 BB FE 16 32 AF 86 D3 69 FA
##$RELAX= 
##$RELAX= 
##$RELAX= 
##$RELAX= 
##$RELAX= 
##$RELAX= 
##$RELAX= 
$$ Bruker specific parameters
$$ --------------------------
##$DU= <E:\>
##$EXPNO= 10
$$ [...]
##$TP= (0..7)
150 150 150 150 150 150 150 150
##$TP07= 0
##$TPNAME0= <>
##$TPNAME1= <>
##$TPNAME2= <>
##$TPNAME3= <>
##$TPNAME4= <>
##$TPNAME5= <>
##$TPNAME6= <>
##$TPNAME7= <>
##$TPOAL= (0..7)
0.5 0.5 0.5 0.5 0.5 0.5 0.5 0.5
##$TPOFFS= (0..7)
0 0 0 0 0 0 0 0
##$TUNHIN= 0
##$TUNHOUT= 0
##$TUNXOUT= 0
##$USERA1= <user>
##$USERA2= <user>
##$USERA3= <user>
##$USERA4= <user>
##$USERA5= <user>
##$V9= 5
##$VALIST= <valist>
##$VCLIST= <CCCCCCCCCCCCCCC>
##$VD= 0
##$VDLIST= <DDDDDDDDDDDDDDD>
##$VPLIST= <PPPPPPPPPPPPPPP>
##$VTLIST= <TTTTTTTTTTTTTTT>
##$WBST= 2048
##$WBSW= 25
##$XGAIN= (0..3)
0 0 0 0
##$XL= 0
##$YL= 0
##$YMAX_a= 633583
##$YMIN_a= -525113
##$ZGOPTNS= <>
##$ZL1= 120
##$ZL2= 120
##$ZL3= 120
##$ZL4= 120
##$ABSF1= 14.98509
##$ABSF2= -5.573092
##$ABSG= 5
##$ABSL= 3
##$ALPHA= 0
##$AQORDER= 0
##$ASSFAC= 0
##$ASSFACI= 0
##$ASSFACX= 0
##$ASSWID= 0
##$AUNMP= <proc_prof1d_extract_pilot.lims>
##$AXLEFT= 0
##$AXNAME= <>
##$AXNUC= <1H>
##$AXRIGHT= 0
##$AXTYPE= 0
##$AXUNIT= <>
##$AZFE= 0.1
##$AZFW= 0.1
##$BCFW= 0
##$BC_mod= 0
##$BYTORDP= 0
##$COROFFS= 0
##$CY= 15
##$DATMOD= 1
##$DC= 0
##$DFILT= <>
##$DTYPP= 0
##$F1P= 0
##$F2P= 0
##$FCOR= 0.5
##$FTSIZE= 32768
##$FT_mod= 6
##$GAMMA= 0
##$GB= 0
##$INTBC= 1
##$INTSCL= 1
##$ISEN= 128
##$LB= 0
##$LEV0= 0
##$LPBIN= 0
##$MAXI= 10000
##$MC2= 0
##$MEAN= 0
##$ME_mod= 0
##$MI= 0
##$NCOEF= 0
##$NC_proc= -8
##$NLEV= 6
##$NOISF1= 0
##$NOISF2= 0
##$NSP= 0
##$NTH_PI= 0
##$NZP= 0
##$OFFSET= 14.98509
##$PC= 1
##$PHC0= 94.39453
##$PHC1= 0
##$PH_mod= 1
##$PKNL= yes
##$PPARMOD= 0
##$PPDIAG= 0
##$PPIPTYP= 0
##$PPMPNUM= 2147483647
##$PPRESOL= 1
##$PSCAL= 4
##$PSIGN= 0
##$PYNMP= <proc.py>
##$REVERSE= no
##$SF= 400.02
##$SI= 32768
##$SIGF1= 0
##$SIGF2= 0
##$SINO= 400
##$SIOLD= 32768
##$SPECTYP= <>
##$SREGLST= <1H.CDCl3>
##$SSB= 0
##$STSI= 32768
##$STSR= 0
##$SW_p= 8223.68421052631
##$SYMM= 0
##$S_DEV= 0
##$TDeff= 65536
##$TDoff= 0
##$TI= <>
##$TILT= no
##$TM1= 0
##$TM2= 0
##$TOPLEV= 0
##$USERP1= <user>
##$USERP2= <user>
##$USERP3= <user>
##$USERP4= <user>
##$USERP5= <user>
##$WDW= 1
##$XDIM= 32768
##$YMAX_p= 452051060
##$YMIN_p= -760764
##$CURPLOT= <Network HP LaserJet P1505>
##$CURPRIN= <$Network HP LaserJet P1505>
##$DFORMAT= <normdp>
##$LAYOUT= <+/1D_H.xwp>
##$LFORMAT= <normlp>
##$PFORMAT= <normpl>
##$SURQMSG= 1
$$ End of Bruker specific parameters
$$ ---------------------------------
##NTUPLES= NMR SPECTRUM
##VAR_NAME=  FREQUENCY,     SPECTRUM/REAL,   SPECTRUM/IMAG
##SYMBOL=    X,             R,               I
##VAR_TYPE=  INDEPENDENT,   DEPENDENT,       DEPENDENT
##VAR_FORM=  AFFN,          ASDF,            ASDF
##VAR_DIM=   32768,         32768,           32768
##UNITS=     HZ,            ARBITRARY UNITS, ARBITRARY UNITS
##FACTOR=    0.250966925370066, 1,           1
##FIRST=     8223.43324360094, -276376,      15710
##LAST=      0,             51971,           33752
##MIN=       0,             -760764,         0
##MAX=       8223.43324360094, 452051060,    0
$$ Real data points
##PAGE= N=1
##DATA TABLE= (X++(R..R)), XYDATA
$$ [...]
19461c63732a65228B1675a39240J9030I8957a23637n4514f310p7367o0761g2058
19449i5883j11440A57880a48059e6790b7640a2264o6200C03359a34418J135C6448
19437b96590h9225A09225e9557o9350N3608k49M88j5765C12700b52664c5889j5410
19425e1299D2234b17975d4904j88459J10078b0156k12121k67655H7629a38381
19414c13072A18246J34484b6826j65043A37073k0354a68412B78641h8595L1262
19404e7333j78947i7350J983k01420j29754I0234a93224P7551o2138m8984J2488
19393b14307A86006i0015K1990B33723I634R6888b38681G277L2779b7181j9k74428
19381c01628i2122F1826a9226j27958k01705h083n628k09839O3354A4249J15576
$$ plain form
19461 -363732 -165228 21675 -139240 -120210 98957 -123637 -178151 -6310 -83677 -144438 -72058
19449 -95883 -207323 157880 -148059 -56790 -27640 -12264 -78464 303359 -134418 -133283 36448
19437 -296590 -89225 109225 -59557 -128907 -75299 -75548 -75060 -90825 312700 -252664 -35889 -51299
19425 -51299 42234 -217975 -44904 -233363 -123285 -20156 -232277 -499932 87629 -138381
19414 -313072 118246 252730 -26826 -191869 137073 116719 -168412 278641 -88595 -57333
19404 -57333 -236280 -97350 -95367 -296787 -426541 90234 -193224 -115673 -177811 -226795 -214307
19393 -214307 186006 -90015 -68025 233723 9634 106522 -238681 7277 40056 -27181 -27200 -301628
19381 -301628 -92122 61826 -19226 -147184 -348889 -8083 -13711 -223550 -160196 14249 129825
19370A29825C6184a72362b7102A26653o0268a34973L0424k43395a51811A32331
19359i8463j1583B6107i4273a0390C2781b38667c0477C8253J58000a36143c6813
19347C4541J46704b34541h6844A78533F0330J96528I7049j8200J56394a15162
19336d2136q1994I1669a27021d7395l66752d3509j01768B08472C7646K6372q614
19325E5404B3964J5297d0580m7446A65611e1434j90248B2281b77795J37284a9681
19313c81654e3224q5577J6820B5708q867M3494h4407j15826o9840A30685i9192
19301h9976C06761g5969r4921B37755a46359a9244m02886a9462G3539Q1058c59638
19289E0920N9063b08605a3644C2368a33751l09269J55527A08993a69651f4688
$$ plain form
19370 129825 36184 -172362 -27102 126653 66385 -134973 -104549 -347944 -151811 132331
19359 -98463 -110046 26107 -94273 -10390 32781 -238667 -30477 38253 196253 -136143 -36813
19347 34541 181245 -234541 -86844 178533 60330 256858 97049 78849 235243 -115162
19336 -42136 -124130 91669 -127021 -47395 -414147 -43509 -145277 208472 37646 64018 55404
19325 55404 23964 39261 -40580 -88026 165611 -51434 -241682 22281 -277795 -140511 -19681
19313 -381654 -53224 -138801 -121981 25708 16841 60335 -84407 -200233 -270073 130685 -99192
19301 -89976 306761 -75969 -170890 237755 -146359 -19244 -422130 -19462 73539 154597 -359638
19289 50920 109983 -208605 -13644 32368 -133751 -443020 -287493 108993 -169651 -64688
19278h8125L7092k08077h1006k63344A78477a47503h41A03451d09125J50121k6603
19267b85607j56757a71739P4757B8854d0994k69052n711J47897k27864b1351A47980
19255c5466k42138A32811J2156b81359M1363B0609a36131A57785B9834J40053
19245A69887a09231F8599a11823A4082f1418j91459H8413J05148a7773j37435
19235a55208A04997i5921L0334l541n6018L888a1995k1305j47925l76573b51838
19223f8197E0707e1499j24179h3375q4563f9622k0167p8945P5704A4907a09444
19211B60432b90953a25667l34132A31877M2906p8783D0420K75897A15830b11899
19200h6922j4423n4105B34165a13814B5418e14244h6337K286A30598b76204d0474
$$ plain form
19278 -88125 -51033 -259110 -81006 -344350 178477 -147503 -841 103451 -409125 -259004 -285607
19267 -285607 -442364 -171739 -96982 28854 -40994 -310046 -315757 -167860 -395724 -21351 147980
19255 -35466 -277604 132811 144967 -281359 -239996 20609 -136131 157785 29834 169887
19245 169887 -109231 68599 -111823 14082 -61418 -252877 88413 193561 -17773 -155208
19235 -155208 104997 -95921 -65587 -69128 -125146 -121258 -11995 -33300 -181225 -557798 -251838
19223 -68197 50707 -51499 -175678 -83375 -167938 -69622 -89789 -168734 -93030 14907 -109444
19211 260432 -290953 -125667 -459799 131877 174783 96000 40420 316317 115830 -211899
19200 -86922 -101345 -155450 234165 -113814 25418 -514244 -86337 -84051 130598 -276204 -40474
19188B6295g3435j16070A12273a65482G5295k0084e2664j37648K5629n2472c034
19176c13977c6556D0318a26465C40289j31524b6284C35517a14675A35375E3654
19165a34811A05468a23123A91559c8285q5604j29391g0831m4694D245M37176A92527
19153d84755a86669K5550f0092I532P0777c6119A80165a19105e3894l26505a7355
19141d75557a15816P853j04410F1909a28537J4285J7620j44577H0218a99035j71246
19130c70281B05443I1695b91424F7892L5960J8161a23813k76518J11196O9384
19120b19751A06790m299c24752c1717H189J75319d4804A09085J89121c47883J47340
19109b00543j05897j359A59059O1893b072r8820E0665a22774L4965M2987j05669
$$ plain form
19188 26295 -73435 -189505 112273 -165482 75295 55211 -52664 -190312 -164683 -217155 -3034
19176 -313977 -36556 40318 -126465 340289 208765 -26284 335517 -114675 135375 53654
19165 -134811 105468 -123123 191559 -38285 -123889 -253280 -70831 -115525 4245 441421 192527
19153 -484755 -186669 -161119 -60092 9532 80309 -36119 180165 -119105 -53894 -380399 -17355
19141 -475557 -115816 -107963 -212373 61909 -128537 -114252 -96632 -241209 80218 -199035 -370281
19130 -370281 205443 91695 -291424 67892 103852 122013 -123813 -400331 -289135 -219751
19120 -219751 106790 102491 -324752 -31717 8189 183508 -44804 109085 298206 -347883 -200543
19109 -200543 -306440 -307799 159059 220952 -2072 -100892 50665 -122774 -87809 -44822 -150491
19098a50491C6803K845e9455k96665H4758C4554c22268F1744I677i5627A68223
19086B7360f6217H2583B4710f4518j26354K5215A96179h6449h218B89809b10640
19074b65820J22033j15896L8413A5891a72116o3392R5737G8593e58429B21498
19063A1042c33635k6022A46099a0644F3678h2213G8601a23679n0739J4620g706
19051e499j25075k66126a35357A37302K499c815j98297e9164h319k27384A46993
19039G7805b62102L5774c5325k9046n9947l0987F4215g3679o6469f4483E0040
19027A50339a01055k70743A03883J60673C2664b1311B37511J50714d36017B33921
19016c59440i5831j02009j48157J67025A10489a88688c2847C69136A2072P867
$$ plain form
19098 -150491 36803 39648 -59455 -356120 84758 34554 -322268 61744 9677 -95627 168223
19086 27360 -66217 82583 24710 -64518 -190872 -165657 196179 -86449 -8218 289809 -210640
19074 -265820 -143787 -259683 -221270 15891 -172116 -235508 -139771 78593 -558429 221498
19063 11042 -333635 -359657 146099 -10644 63678 -82213 78601 -123679 -174418 -159798 -7706
19051 -5499 -130574 -396700 -135357 137302 139801 -3815 -202112 -59164 -8319 -235703 146993
19039 77805 -262102 -226328 -35325 -64371 -124318 -155305 64215 -73679 -140148 -64483 50040
19027 150339 -101055 -371798 103883 264556 32664 -21311 237511 388225 -436017 233921
19016 -359440 -95831 -197840 -345997 -178972 110489 -188688 -32847 369136 12072 19939
19006A9939M6409c34877a9760H5130d8040k5212j3476d2477B24631j01193e484
18994b06250b7651k16515A45062b39724P2409A18024N7512A4429b65925J13914
18984a52011I2958J58679a29471F6486a01765p7743m4620a06938K6568n4240A25165
18972e3394b3386r2785B9201K91048L6299j32591k4507P5962n3197d9787j50358
18961b00145C7469J11368c92518f3922B40106C6327a26963D4950J03012E7730
18950a5757m18269a02901M2222j28343j9633K2342D3901c79309B08946I5203J97043
18939B92246f0509C3755a35851j00715N6808I675i8737A64061b35329K0214G5034
18927a402A65355b91867C97414F2059a66786k9006A14417Q7285G8976a81219A5914
$$ plain form
19006 19939 66348 -334877 -19760 85130 -48040 -73252 -86728 -42477 224631 123438 -5484
18994 -206250 -27651 -244166 145062 -239724 -167315 118024 175536 14429 -265925 -152011
18984 -152011 92958 251637 -129471 66486 -101765 -179508 -224128 -106938 -80370 -134610 125165
18972 -53394 -23386 -116171 29201 320249 356548 223957 199450 275412 222215 -49787 -200145
18961 -200145 37469 148837 -392518 -63922 240106 36327 -126963 44950 147962 57730
18950 -15757 -434026 -102901 -60679 -189022 -208655 -186313 43901 -379309 208946 95203 292246
18939 292246 -60509 33755 -135851 -236566 -179758 9675 -98737 164061 -235329 -215115 75034
18927 -1402 165355 -291867 397414 62059 -166786 -195792 114417 201702 78976 -181219 15914
18915B06880C046e6026j84513i5684m8372O0768A4178a74190d7470A74965J15620
18904B90585k3895r1870j8233b53440a10879B11988b42099a15008l71259D3097
18893c02598j67632H5201a08075L3749A23055e8930A1193b1278C50092a7075j02207
18882a19282l5904q7775D3004d7708J8258J0688j49001P0780j70932F8831c23083
18870g919j01147B9194d1042j72239L2813B40755E3480i0132j28334n1778I9516
18858E5257K92590f1983j84545L5266J8793A91167C5005B066M791d04899e7310
18846i7733H1578C6777j5557b27274M3938M0650F3179b41398B8961c211A48737
18834B05924c37400e3040A40763b11203I3390k8055a64725A1550b08591A86546
$$ plain form
18915 206880 3046 -56026 -240539 -95684 -144056 -83288 14178 -174190 -47470 174965 290585
18904 290585 266690 174820 156587 -253440 -110879 211988 -242099 -115008 -486267 43097
18893 -302598 -470230 85201 -108075 -74326 123055 -58930 11193 -21278 350092 -17075 -119282
18882 -119282 -155186 -242961 43004 -47708 -29450 -18762 -167763 -96983 -267915 68831 -323083
18870 -7919 -109066 29194 -41042 -213281 -180468 240755 53480 -90132 -218466 -270244 99516
18858 55257 347847 -61983 -246528 -211262 -192469 191167 35005 2066 6857 -404899 -57310
18846 -97733 81578 36777 21220 -227274 -183336 -142686 63179 -241398 28961 -3211 148737
18834 205924 -337400 -53040 140763 -211203 93390 65335 -164725 11550 -208591 186546
18823g6114C1416J85792i4989K0646A60531b04513J00146I3324N6374n4312c18807
18811d5111f216F2545k9780c5335l22911B16036C8731J09898A7786b1323F9134
18799a3605m6140B62665a3906j90545A62968G760e7778j68271A09233j6434l5320
18788E7479J2391J0374b79726F8189d6867j67542J199C20509g7985p6055M6550
18777a07490C01500c5192A48100o9652J12230K12457a94404R1924J3175L3131
18767e6174E0309O4487B6382b16264A42809c74228a64822P9557j68802h4252j04675
18756a88927N8000j744j47381a29749O887q8495h9898l9010c0302A24444A8180
18744G8592R4210b12378A29879a29261A49679C3599d18573J66183H1520f0689
$$ plain form
18823 -76114 31416 217208 -94989 -74343 160531 -204513 -104367 93324 149698 95386 -318807
18811 -45111 -6216 62545 32765 -35335 -358246 216036 38731 148629 17786 -21323 69134
18799 -13605 -59745 262665 -13906 -204451 162968 7760 -57778 -226049 109233 92799 57479
18788 57479 69870 80244 -279726 68189 -46867 -214409 -213210 320509 -77985 -154040 -107490
18777 -107490 301500 -35192 148100 78448 190678 403135 -194404 -102480 -89305 -56174
18767 -56174 50309 114796 26382 -216264 142809 -374228 -164822 -85265 -254067 -84252 -188927
18756 -188927 -130927 -132671 -280052 -129749 -122862 -211357 -89898 -128908 -30302 124444 18180
18744 78592 172802 -212378 129879 -129261 149679 33599 -418573 -252390 81520 -60689
18733c41789f484m85820a40752j78736a07002l19940b12292j08854D9615a15404
18722b4145B30704a03959j39428J02870F851b00177D7570Q7377b43891A00721
18711I159b26829M7471O702F4480f1038l28176J08212b5047G5682e21808b30058
18699A45898o8048a35730n6294m1686a0204j27474o7159q4543B7341A3578P7272
18688I0850a50370d146k37162F9799a17344k03950a11081k31295B5483L0534a14624
18676b5318B21276b2054A15585g6087K1839l5162F3065i2990p4138K9734I3746
18664c21752g2464i271A30888E5287h7889j02325E7876P6872N3698Q2300b34470
18652a58571D6653a9834r6293J5342A20294f3563E7913j6521b45365b486j43621
$$ plain form
18733 -341789 -6484 -492304 -140752 -319488 -107002 -426942 -212292 -321146 49615 -115404
18722 -24145 230704 -103959 -243387 -140517 6851 -200177 47570 134947 -243891 100721
18711 9159 -226829 -179358 -172656 64480 -61038 -389214 -281002 -25047 75682 -521808 -230058
18699 145898 77850 -135730 -192024 -233710 -10204 -137678 -204837 -289380 27341 13578 90850
18688 90850 -150370 -4146 -241308 69799 -117344 -321294 -111081 -342376 25483 56017 -114624
18676 -25318 221276 -22054 115585 -76087 -54248 -89410 63065 -92990 -167128 -137394 93746
18664 -321752 -72464 -9271 130888 55287 -87889 -190214 57876 134748 188446 270746 -234470
18652 -158571 46653 -19834 -116127 -100785 120294 -63563 57913 41392 -245365 -2486 -146107
18641a46107n4110G9360i2656n6444j92747A29095C0141K93956e1294H8604f1396
18629b67355A59074c27801C86609a06565B52829J2936a48610I8009k3792a6697
18618e1120k74414P9966E4526b80040A41266a22n3095j38104f3516B94326E7834
18606F0901a40954F1485B097f7361n02005b14271R0428j73347B49194b66161d2677
18594h6j27641H5259K0336P3308D3336b0939C3769e5665I6860c01366A06700L1309
18582A38009a63368F4631b99453A75415a43332A15720N937l2893a70920J4469
18572a56451c2414o7836J09j83249A1999a91350H0331l4401D169L3385b13212
18560D23947f2389j94615k0253d7383D8882a96740N6687B12412b03289g947A08354
$$ plain form
18641 -146107 -200217 79360 -92656 -149100 -341847 129095 30141 324097 -51294 88604 -61396
18629 -267355 159074 -327801 386609 -106565 252829 265765 -148610 98009 74217 -16697
18618 -51120 -325534 -245568 54526 -280040 141266 -122 -53217 -191321 -63516 294326 57834
18606 60901 -140954 61485 2097 -67361 -569366 -214271 -123843 -297190 249194 -266161 -42677
18594 -86 -127727 85259 105595 178903 43336 -20939 33769 -55665 96860 -301366 106700 138009
18582 138009 -163368 64631 -299453 175415 -143332 115720 121657 88764 -170920 -156451
18572 -156451 -32414 -100250 -100141 -283390 11999 -191350 80331 45930 4169 37554 -213212
18560 423947 -62389 -257004 -277257 -47383 48882 -196740 -140053 212412 -203289 -7947 108354
18548a30177n664B19419j01103i3174n7288a8440k3601J5255D7003b25469B6092
18536a2016k45546g0913j53971c6384j66442k82338e7138l01214a54344G6160
18525a67040F3a28719d0512l62811J05728A4742K81378b30644f048p4418B42023
18513E9313N6014a95271B95873G3055h20l34035b3313j08667C8466Q4838e0955
18501a6769F4536k5794d84869a7431A05947b00852b8743j64026c9471j83312q6603
18490c09386a7088k37358E0489K10385A00928L4350B257a22408L0996B1036c68357
18478C51858A50477P7938d6168m4083H0374a99594c4939n7609p5855M0879N7863
18467f9661j20800b4932m1175m5466c2564k20410G4651a12897C25439F6984C0184
$$ plain form
18548 -130177 -135841 219419 118316 -93174 -150462 -18440 -42041 -26786 47003 -225469 26092
18536 -12016 -257562 -70913 -224884 -36384 -202826 -485164 -57138 -358352 -154344 76160
18525 -167040 63 -128719 -40512 -403323 -297595 14742 296120 -230644 -6048 -80466 242023
18513 59313 115327 -195271 295873 73055 -820 -334855 -23313 -131980 38466 123304 -50955
18501 -16769 64536 38742 -484869 -17431 105947 -200852 -28743 -192769 -39471 -222783 -309386
18490 -309386 -17088 -254446 50489 260874 100928 135278 2257 -122408 -91412 21036 -368357
18478 351858 150477 228415 -46168 -90251 80374 -199594 -34939 -92548 -168403 -127524 -69661
18467 -69661 -190461 -24932 -66107 -111573 -32564 -252974 74651 -112897 325439 66984 30184
18455b5371k10252M4746j04197c6076E0697g3914B72489b1017j9824C1712L8406
18444G0118g0688A94924a60659j60295d1583A41759a91384p4918A26042a3347
18433a2607B87286a10374A32492i5796E5224O8121K11776p3195e3557I2115L1932
18422A24047E438a44529k889A46472a2051F9563a21799j55276e3608p8221c2970
18410b08387i549l49410a29267K0758B09284b21935B37043d5855k83219i9033
18399A00824K2984h610b813j43700c1155A12894b605l31335g3228c1804n2933
18388h4737m2354j37421i2714l0862o3740g931m2276j06035N6948D3675L8369
18377H2044a7916A7566a3918j22577H8293b99966Q9690j82974D27912A60836b15619
$$ plain form
18455 -25371 -235623 -190877 -295074 -36076 50697 -73914 272489 -21017 -40841 31712 70118
18444 70118 -70688 194924 -160659 -320954 -41583 141759 -191384 -266302 126042 -13347
18433 -12607 287286 -110374 132492 -95796 55224 123345 335121 261926 -53557 92115 124047
18422 124047 5438 -144529 -147418 146472 -12051 69563 -121799 -277075 -53608 -131829 -32970
18410 -208387 -9549 -358959 -129267 -108509 209284 -221935 237043 -45855 -329074 -99033
18399 100824 123808 -8610 -2813 -146513 -31155 112894 -2605 -333940 -73228 -31804 -84737
18388 -84737 -127091 -264512 -92714 -123576 -187316 -7931 -50207 -156242 -99294 43675 82044
18377 82044 -17916 17566 -13918 -136495 88293 -299966 -210276 -393250 427912 160836 -215619
18365A6504O1013L5009A5287b58953J24179e8533C6818K02095i1381m777c6890
18353C16451A17389a73657j843k9971N5307C19557a31552j91929R2691b5967n4499
18342h0466k4768B8681J97720c8139j86131D84937a45423A21862a26062B15198
18331B12515d0594k60756J37066P1059I6678B7351K89128f7526a2394A46777k1085
18320A25692a49576d8134l8194j58149k79706l0634b25719Q6386O4024B11925
18309b8408e005j40987O5069k84968J42037A6204a88469k2990A11347O3535c2288
18297E188b30291A21550a73426I2108a02093c284I4822J67658B1333N3675g9574
18285D1544b19899g8000m3682G542b08060a8401A18749e3746j1123H8263g810
$$ plain form
18365 16504 77517 112526 15287 -258953 -134774 -58533 36818 238913 -91381 -96158 -36890
18353 316451 117389 -173657 -175500 -205471 -150164 319557 -131552 -323481 -230790 -25967 -80466
18342 -80466 -105234 28681 226401 -38139 -224270 484937 -145423 121862 -126062 215198
18331 212515 -40594 -301350 -164284 -93225 96678 27351 316479 -67526 -12394 146777 125692
18320 125692 -149576 -48134 -86328 -244477 -524183 -554817 -225719 -139333 -75309 211925
18309 -28408 -5005 -145992 -80923 -365891 -223854 16204 -188469 -211459 111347 174882 -32288
18297 5188 -230291 121550 -173426 92108 -102093 -3284 94822 262480 21333 75008 -79574
18285 41544 -219899 -78000 -121682 7542 -208060 -18401 118749 -53746 -64869 88263 -7810
18273a1719k40651J00787F5732i6342o8795B12767a06123A63448g6978A07342
18262A81728D6831K5327K41366c19500M0606B45591a64887l6242d2971I477J94974
18251B04451b842A94151a97664F627K22896b03089f4984B72620a82420A6500d0475
18239B18574f4680j45130i084B4217M9604J28530d1761F0851d21749g5551c0642
18227a82273h2606A62166a1449M626k2629D75749A0950J21980a25752p56a9422
18215A94775a9618m2572j18658D18111j57974C0714a18797K9347j75155H6181
18204A61457n6055K5000n2924J36265A05580c14511C13432j32067d2406a0571
18193a00515D5101O7327c145j56401E6541J31429a36009N2384j82916f338k14289
$$ plain form
18273 -11719 -252370 -151583 65732 -96342 -165137 212767 -106123 163448 -76978 107342
18262 181728 46831 72158 313524 -319500 -278894 245591 -164887 -201129 -42971 9477 204451
18251 204451 -2842 194151 -197664 6627 229523 -203089 -64984 272620 -182420 16500 -40475
18239 218574 -64680 -209810 -9084 24217 73821 202351 -41761 60851 -421749 -75551 -30642
18227 -182273 -82606 162166 -11449 -6823 -29452 475749 10950 132930 -125752 -126508 -19422
18215 194775 -19618 -62190 -180848 418111 260137 30714 -118797 -89450 -264605 86181
18204 161457 105402 130402 77478 213743 105580 -314511 313432 181365 -42406 -10571
18193 -100515 45101 112428 -3145 -159546 56541 187970 -136009 -83625 -266541 -6338 -220627
18182b20627G101L8724i0186b5951j5482E4311a25458e4446A2844b55277C6340
18170c25553i3823D8644J51321i2764j0252P635C6533J48900m604E9879a49036
18158E4642a59439A20752c5571G4541k9324A6560b38188G6889c88982J61906M0205
18147a86871A07489M3085L8558a30296j38071N7951A57257J56074d2841k62746
18137c05587G8671I47f3368C7486c54832d5701B33180a5446l4475a8268j80260
18126a98528N526E3027c1085i5j38493i140A36275b60928F4692a29157a5389l58126
18114c73515J61214L1857D36177b45044A68508J19407q7710a38923G303K7306
18104C4609i1547B57171j22744a06511B07680H9730a79472p8239A82156q2471
$$ plain form
18182 -220627 7101 45825 -90186 -25951 -41433 54311 -125458 -54446 12844 -255277 36340
18170 -325553 -93823 48644 199965 -92764 -103016 -95381 36533 185433 180829 59879 -149036
18158 54642 -159439 120752 -35571 74541 45217 16560 -238188 76889 -388982 -227076 -186871
18147 -186871 107489 150574 189132 -130296 -268367 -210416 157257 313331 -42841 -305587
18137 -305587 78671 947 -63368 37486 -354832 -45701 233180 -15446 -49921 -18268 -198528
18126 -198528 -193002 53027 -31085 -95 -138588 -9140 136275 -260928 64692 -129157 -15389 -373515
18114 -373515 -212301 -180444 436177 -245044 168508 287915 200205 -138923 7303 34609
18104 34609 -91547 257171 134427 -106511 207680 89730 -179472 -257711 182156 99685
18094I9685a0678A88043a81487A53203d783B60593a77195A87428k4715c09001
18083H9026L2028P9251a90415f6364j21991c8974E7817A4694K51150a60653B04015
18071B08925f0071j23152c436C11519a78822O0485K7418O524o2536B23576c5353
18059C36021G3497c59968I5866A5915L25407b2658J0847j82539J7515B18811m5394
18048A73417o3982h8585m6023l6454d1638k32309Q0145j14432j3658J30191K7997
18037a63704h1672C4138f0038H8194f5567r1342N3046d9679k62476C26786A6650
18025d2379A24509i7967B65392i4635j48491F2893d2009d054A72994a16596B06858
18013H357g839l46499f6684j71586e0434B3489c0581D4403M6476f6003J1597B62321
$$ plain form
18094 99685 -10678 188043 -181487 153203 -4783 260593 -177195 187428 162713 -309001
18083 89026 121054 200305 -190415 -66364 -188355 -38974 57817 14694 265844 -160653 204015
18071 208925 -60071 -183223 -3436 311519 -178822 -118337 -90919 -84395 -146931 223576 -35353
18059 336021 73497 -359968 95866 15915 341322 -22658 -11811 -194350 -176835 218811 173417
18048 173417 109435 -88585 -134608 -171062 -41638 -273947 -193802 -308234 -321892 -191701 -163704
18037 -163704 -81672 34138 -60038 88194 -65567 -156909 -103863 -49679 -312155 326786 16650
18025 -42379 124509 -97967 265392 -94635 -243126 62893 -42009 -4054 172994 -116596 206858
18013 8357 -7839 -354338 -66684 -238270 -50434 23489 -30581 44403 90879 -66003 -54406 262321
18000c138G131Q3507C5971d0187k95796B08569l1254G8054J98176h4949m7461
17989a32410A56465K3354a46007N5879p8947n5007I5389J77496j34034d8894H9037
17977B4492a16342K1409A58516a0839k01166A57088L0310j9694a72553f9321o2678
17966a31999B0694O003a84044C9217a68331l3263C15413a56586B74812e7873j24537
17955a82410f317A27581d6184H2607K99871g7984q7034N1191q8830B72850A8203
17943c7471j5087l41657a10004A50090a82234K1016N769H4634f8111A74503F5870
17931I3873f520B29339n9237a5634B57523c6488A01854a84495b2928B4332O9378
17920I3710f7051n3366m7768H3759a58723A14882c43952D39075B7823J8592j7582
$$ plain form
18000 -3138 7131 90638 35971 -40187 -335983 208569 177315 78054 276230 -84949 -132410
17989 -132410 156465 179819 -146007 -90128 -169075 -224082 95389 272885 138851 -48894 89037
17977 24492 -116342 -94933 158516 -10839 -212005 157088 187398 167704 -172553 -69321 -131999
17966 -131999 20694 26697 -184044 39217 -168331 -201594 315413 -156586 274812 -57873 -182410
17955 -182410 -6317 127581 -46184 82607 382478 -77984 -165018 -113827 -202657 272850 18203
17943 -37471 -52558 -394215 -110004 150090 -182234 -161218 -155449 84634 -68111 174503 65870
17931 93873 -6520 229339 170102 -15634 257523 -36488 101854 -184495 -22928 24332 93710
17920 93710 -67051 -120417 -168185 83759 -158723 114882 -343952 439075 27823 46415 28833
17909B8833K99696A494a68531b0891B29014J25583d2642A42221K2813a62991B68208
17897h8697B62707P6436A54845c6916A28701a57631G7929K10896c27465F3541
17886c7697J6254C39948g0106A28057C3849f9443A01474M151c10313g9132a3545
17874C11301b29829g010j54677b3589H8176a56767c7703G2508m954i6672A93541
17862A35790d9423j40166l9551A70790b70457A90199g4531A32275J90264a66566
17851D4321P5012i3779E3368b1457j2986B62839j24175b78975A93648M9663o0619
17840A82692j3254h8901A75204b10924g6451F2564B3735c84457A49405K59507
17830D08912A88646M6827b14287A97728P947o1510n2829L93669G6561k1600a40531
$$ plain form
17909 28833 328529 1494 -168531 -20891 229014 354597 -42642 142221 165034 -162991 268208
17897 -88697 262707 339143 154845 -36916 128701 -157631 77929 288825 -327465 63541
17886 -37697 -21443 339948 -70106 128057 33849 -69443 101474 105625 -310313 -79132 -13545
17874 311301 -229829 -7010 -161687 -23589 88176 -156767 -37703 72508 67554 -96672 193541
17862 135790 -49423 -189589 -229140 170790 -270457 190199 -74531 132275 322539 -166566
17851 44321 119333 -93779 53368 -21457 -34443 262839 138664 -278975 193648 243311 182692
17840 182692 169438 -88901 175204 -210924 -76451 62564 23735 -384457 149405 408912
17830 408912 188646 235473 -214287 197728 205675 144165 91336 485005 76561 54961 -140531
17818h6079K5897b6775B46162a0734m04433B34233B2046A0535M8794Q7391J67739
17807C14459A51344c04487f1384j37305A56165N1026G7307M74817c8144B15126
17796g4326B96120d4244a2521A35545J84166a00239A80292I328J75329O2954A19281
17784f2886A87820d9336B38045L3406Q8048p7820a00554B78881D5746F098g7694
17772D8830J04351a04966H5268a04493B27455J04149G2423c8202C12943c2828
17761g8964E13367F2797b03022C53085C3722J424b16681A17734J2667a78729G9667
17749G071O9135c4318A01923a70805B48745E7611K7710N1255n1101c11009e7948
17737A4708d45938A48481k8417a83333B54872d6355M639A26924M7172m5480J33105
$$ plain form
17818 -86079 -60182 -26775 246162 -10734 -415167 234233 22046 10535 59329 146720 314459
17807 314459 151344 -304487 -61384 -198689 156165 207191 77307 552124 -38144 215126
17796 -74326 296120 -44244 -12521 135545 319711 -100239 180292 9328 184657 247611 119281
17784 -62886 187820 -49336 238045 271451 359499 281679 -100554 278881 45746 6098 -77694
17772 48830 153181 -104966 85268 -104493 227455 331604 72423 -38202 312943 -32828
17761 -78964 513367 62797 -203022 353085 33722 35146 -216681 117734 130401 -178729 79667
17749 7071 76206 -34318 101923 -170805 248745 57611 85321 136576 85475 -311009 -57948
17737 14708 -445938 148481 120064 -183333 254872 -46355 -41716 126924 174096 128616 261721
17726B61721J63692A35734a38032H2298h9469E2889J60162i8434I446K66311n8934
17715B16823a22380E1911Q6445l2833a63011F3525a01145a7042k35914M6733G3553
17703a46008A97163i8120D16131a66665D7412b68A48732J73795b7937C31372g79
17691B99848a75887n0991A25256g4455j9649H7424A4859e376j96265O5129E3535
17679F2775Q8530J93791e0035j95497A76377b15453A42897P9558a4148A47464
17668A45889a75440h0255A6735P163J71317o3579M1315P0834J10929I0432a76106
17656a99892B01945b38965R5808A563O0622a1093k60547A79993a2220A11128k8960
17645H2168C7367a33396e8710B08501n1477E4098K07788a03415A85627J19006
$$ plain form
17726 261721 425413 135734 -138032 82298 -89469 52889 213051 -98434 9446 275757 216823
17715 216823 -122380 51911 138356 105523 -163011 63525 -101145 -17042 -252956 -206223 73553
17703 -146008 197163 -98120 416131 -166665 47412 -268 148732 322527 -27937 331372 -779
17691 299848 -175887 -226878 125256 -74455 -94104 87424 14859 -5376 -201641 -136512 53535
17679 62775 151305 345096 -50035 -245532 176377 -215453 142897 222455 -14148 147464
17668 145889 -175440 -80255 16735 23898 195215 131636 172951 243785 354714 90432 -176106
17656 -199892 201945 -238965 -143157 1563 62185 -11093 -271640 179993 -12220 111128 82168
17645 82168 37367 -133396 -58710 208501 157024 54098 261886 -103415 185627 304633
17635C04633A34359A7148i4694B29061N0492a86203g3904I5000a30365A35727
17624B45387a39367F2115M71838D2984m862d5290A66048b1876D72743j82778c8791
17612A28564O9728b78237A04689J08588d4767k10013B19943A9464g3622F9500
17601A16911K83253d0691j41118C08418q1296J97811J69532D1359J07480i5564
17590B04160q8448l3831O5746K39070o8332j15739J47141j36172r7495c1119A84272
17578C67052K12704B44115a88489d9255C10554C4915O5526b1824B20275h3706
17567a08825D55547A68989e322A39135E3146J05004O0092J04431I363K07415q7899
17556A28879K40858A10767J46851J40932C1601L40692q0691I8760D3747K82822
$$ plain form
17635 304633 134359 17148 -94694 229061 279553 -186203 -73904 95000 -130365 135727
17624 245387 -139367 62115 533953 42984 38122 -45290 166048 -21876 472743 289965 -38791
17612 128564 198292 -278237 104689 213277 -44767 -254780 219943 19464 -73622 69500
17601 116911 400164 -40691 -181809 308418 227122 424933 594465 41359 148839 -95564
17590 204160 115712 81881 147627 386697 318365 202626 349767 213595 116100 -31119 184272
17578 367052 579756 244115 -188489 -49255 310554 34915 100441 -21824 220275 -83706
17567 -108825 455547 168989 -5322 139135 53146 158150 218242 322673 9363 216778 128879
17556 128879 369737 110767 257618 398550 31601 372293 291602 98760 43747 326569
17546C26569b2697B31449D7925L3903J0435a1768A93383P2551G5220J91450L929
17535B70599L8383p2645l0941B6408b2298B81468J71326j28311o3855o8324L9178
17524B31482L34796K15905j0023j26876M9392j17822j34254l1572p7861B9730
17513A18209M76383A48370K77518N9431K61780l154l24404L36523C14022J63312
17503D77334B23955J85952p8523j7992a14400C60421A23728L26488A81291L70392
17493E51683A00649K77362j15973K01329A55833G1932l074Q1449k977N2695N6240
17482B56265H4843K10007d0915B34514q1524J18467J03871l7672A56812L15760
17472D72572A90523k6444Q0927H8288J51590G5985J78471K08477F9966L87798
$$ plain form
17546 326569 -22697 231449 47925 81828 92263 -11768 193383 265934 75220 266670 270599
17535 270599 308982 236337 205396 26408 -22298 281468 452794 324483 260628 192304 231482
17524 231482 566278 782183 772160 645284 694676 576854 442600 411028 333167 29730
17513 118209 594592 148370 425888 485319 747099 743945 419541 756064 314022 477334
17503 477334 223955 409907 331384 313392 -114400 360421 123728 450216 181291 551683
17493 551683 100649 378011 262038 463367 155833 71932 68858 150307 147330 200025 256265
17482 256265 84843 294850 -40915 234514 152990 271457 375328 337656 156812 472572
17472 472572 190523 164079 245006 88288 239878 75985 254456 462933 69966 457764
17462D57764r7506p6038j20813K15136j09617J89786B22785J74092E8386N2000
17452A10386J4702P4415K32858k3900K5094A87543M58309P0115L5369j11856k24447
17441D15033I4903K78498k2069G5529K30952J4154E6324K92626j11795A09635
17430A42129M29639j12329K00193r8216K23073J9934k81012q6677o7142J66179
17420E35771n7679A24769J15998M18535j86261k8412J33568J14233k13931L04562
17410G83061l42955j00663R97L7067j6680K6008j65158K48267k33137A12793L5091
17399A47884k1493M8082o722a06188E8359R1728F2187N05213k19114j08348j01105
17388A38833J90034q3470L34961j56519j50211N566A37120L0303J3981l9237R8658
$$ plain form
17462 457764 360258 284220 163407 378543 268926 458712 222785 396877 58386 110386
17452 110386 125088 199503 432361 408461 433555 187543 645852 715967 751336 639480 415033
17441 415033 94903 373401 351332 75529 306481 320635 56324 348950 237155 109635
17430 142129 571768 459439 659632 561416 784489 804423 523411 436734 369592 535771
17420 535771 478092 124769 240767 659302 473041 444629 578197 692430 478499 783061
17410 783061 440106 339443 340440 377507 360827 386835 221677 469944 236807 112793 147884
17399 147884 126391 174473 167751 -106188 58359 150087 62187 567400 348286 239938 138833
17388 138833 328867 245397 580358 423839 273628 279194 137120 167423 181404 142167 240825
17377B40825m3415K09364a29763B63654H5871M8810J21457J49029q6235k6626
17367B92306N6031B8611J5550J98259K84761j79894E6874K650K94205j27672J8552
17356B44609r0833P3091r9325J50560o2729b3365A43298M13777j39966A00418
17345A41963J62636R284J6380r4573M4814M86707A38417K27272A53174J02844
17335B56018A11410O6379R7787A12072J44621A01981J65704K37164A98767M9148
17325B47915J6793j30033J04747M17464B57381j02368J30153K4883A47796J83154
17315C30950Q5036B06521J69751P771A65371C2396Q3875D5532J98604K5279J41423
17304D10838A7212L73045a19142E65914B19146J77145j04294a56310C87412L2075
$$ plain form
17377 240825 197410 406774 -129763 263654 85871 134681 256138 405167 318932 292306
17367 292306 348337 28611 44161 242420 527181 347287 56874 59524 353729 226057 244609
17356 244609 153776 226867 127542 278102 215373 -23365 143298 557075 417109 100418
17345 141963 304599 313883 330263 235690 280504 767211 138417 365689 153174 256018
17335 256018 111410 177789 275576 112072 256693 101981 267685 504849 198767 247915
17325 247915 264708 134675 239422 656886 257381 155013 285166 310049 147796 330950
17315 330950 415986 206521 376272 384043 165371 32396 116271 45532 244136 269415 410838
17304 410838 17212 390257 -119142 565914 219146 396291 291997 -156310 387412 419487
17294D19487j31390j29184N56998C17697j09540F3684M87788B68959L77855C20815
17283H401N58016A18286K56384P1530A48073L19031k0469E9085J88703p1553J65115
17272C41350j64725K50126j41757k4674l5548o8345K6935R2643J68479B1348K65288
17261B86636J37681K71126j02435k16149J1862O0612j47396A48893M32303A78133
17250B78986K33127j34296J34946j45392j00973J20917O638J87648B18654J24416
17240C43070o4400K77488J4158k40940n023n8302l189N5809J56199J12240k76312
17229C10798p9439L87778r0736L5521J33327q0852j10681A01715K76807K37901
17219F16423B18018N10318A38668R1672N54411C70850J89983j02998J23008j59103
$$ plain form
17294 419487 288097 158913 715911 317697 208157 63684 551472 268959 646814 320815
17283 8401 566417 118286 374670 446200 148073 467104 446635 59085 247788 176235 341350
17272 341350 176625 426751 284994 260320 224772 156427 183362 276005 444484 21348 286636
17261 286636 424317 695443 593008 376859 388721 449333 301937 148893 581196 178133
17250 278986 512113 377817 512763 367371 266398 387315 393953 581601 218654 343070
17240 343070 278670 556158 570316 329376 324353 266051 262862 318671 474870 587110 310798
17229 310798 231359 619137 528401 563922 697249 616397 505716 101715 378522 616423
17219 616423 218018 728336 138668 230340 784751 370850 560833 457835 580843 421740
17209D21740M89351B36077n9965L13211k3901d0588C93503k2246J23300j71913
17199C22644L31145n2106k96167J63156Q3687j83097L61822l53950o69M63459
17189H39924j89199j95373j17523J5804K58360Q2705k33512k2068j01272K05648
17179E43494r7140K21285k7028j70271J52482J81124p1319B73351J36559K17959
17169F27869A53158L57870o5972K27771C36208K71983J53506l3138r8757J03434
17159G33236k90320o9485Q1505N42679l4055m65650N7159J25233j02493j25640
17149D52169J87950J76880j75912m6295n8944j81584K20182j00704L3469J95421
17139G02632o6225J71393k82187j14350L51294K100j01934L05638m82104L24151
$$ plain form
17209 421740 911091 236077 176112 489323 465422 -40588 393503 371257 494557 322644
17199 322644 653789 601683 305516 468672 552359 369262 731084 377134 376465 839924
17189 839924 650725 455352 337829 353633 611993 694698 461186 439118 337846 543494
17179 543494 446354 667639 640611 470340 622822 803946 732627 273351 409910 627869
17169 627869 153158 511028 445056 672827 336208 608191 761697 728559 629802 733236
17159 733236 442916 373431 454936 997615 963560 497910 555069 680302 577809 452169
17149 452169 640119 816999 641087 594792 535848 354264 574446 473742 507211 702632
17139 702632 636407 807800 525613 411263 762557 764657 662723 968361 486257 810408
17129H10408k4706j92768J96757j98530L53614D01831M85596R0697D51049M61311
17119I12360j26366p169j17481q6800J11367J82396l1847k46078j6163J44047
17109G18266l9109J44139k44014M51112k82648L12162l19363j93221J16664L5418
17099F99406J16387q6241P9104k26916O20736k68292J42692j07205J09194o2366
17089A016499k60769K81165k26743L74494k68411D55346M35506L91294o03099
17080F79047M07219J52715l78865J90403p5448R3766j99350R3729k58174J29751
17070H34793r6104L51501j69593K26001p1808L45182m59045J22780k4741J1198
17060A070164J20866m1972P181K16459j73058J71372l65869K68326l78792L42023
$$ plain form
17129 810408 785702 592934 789691 591161 944775 401831 887427 978124 451049 912360
17119 912360 785994 778825 661344 574544 685911 868307 836460 590382 574219 718266
17109 718266 679157 823296 579282 1030394 747746 1059908 740545 547324 663988 699406
17099 699406 815793 729552 808656 581740 1202476 934184 1076876 969671 1078865 1016499
17089 1016499 755730 1036895 810152 1184646 916235 455346 890852 1282146 679047
17080 679047 1086266 1238981 860116 1050519 975071 1068837 869487 963216 705042 834793
17070 834793 738689 1090190 920597 1146598 1074790 1419972 960927 1083707 1058966 1070164
17060 1070164 1191030 1149058 1156239 1372698 1199640 1371012 1005143 1273469 894677 1236700
17050A236700l1151j70718L89212l81304j0421L4215L3396L54107k17741K27852
17040A464147j62480P296q5006r6949l83933M46528P0442K92771m12985J60821
17030A300652l883K10173k11437J44037k96557K52078j48909P1442J33775j53105
17020A298266j44312j4686K46113j62705L08100O685o7864P6498n108j8120n0697
17009A472170j43727J03326j12078N06955l34703K1063Q5942J1332j77266L30658
16999A763672j33957j99596k7842M54709l51269M81104l90699p0501J29967n5012
16989A600576L23296l48744K54159k35135J24522L6947K77212J77134k37318K64551
16979B237200l6950k33254n2307P3053k72665J57811J21103N9004k51572K93870
$$ plain form
17050 1236700 1205549 1034831 1424043 1042739 1032318 1066533 1099929 1454036 1236295 1464147
17040 1464147 1301667 1308963 1223957 1127008 743075 1189603 1260045 1552816 1139831 1300652
17030 1300652 1296769 1506942 1295505 1439542 1142985 1395063 1246154 1317596 1451371 1298266
17020 1298266 1153954 1139268 1385381 1222676 1530776 1537461 1469597 1546095 1540987 1522867 1472170
17009 1472170 1328443 1431769 1319691 1826646 1491943 1513006 1598948 1610280 1433014 1763672
16999 1763672 1629715 1430119 1402277 1856986 1505717 1986821 1596122 1525621 1655588 1600576
16989 1600576 1923872 1575128 1829287 1594152 1718674 1755621 2032833 2209967 1972649 2237200
16979 2237200 2200250 1966996 1914689 1987742 1715077 1872888 1993991 2052995 1801423 2095293
16969B095293K66297l09700J79397k79482M50889l30362M72688k31204R6167j33732
16959B276251P540j7776J67856q7063J53724J65414k11616l4027R905r4599P9131
16948B414740L42557k24166O2701j0634K22989j87790L1421L3742l23841K99264
16938B660983N2001k245J60011j52009L56761j23420k55121L41727o5586O9179
16928C042281J44214k74712o8687L96688M3125N1529L13481j37957k52588O1686
16918C319060M2223J19004k8418p3251K32762M4691j03101K05211N8355m6293
16908C770243j36201K92319k9143J21603n1415j49496K49208J07706J65088j51195
16898D188717J04305j0469L45681l62096J26449K23764j54356O3353K01246k1309
$$ plain form
16969 2095293 2361590 2051890 2231287 1951805 2402694 2072332 2545020 2313816 2409983 2276251
16959 2276251 2283791 2266015 2433871 2346808 2500532 2665946 2454330 2420303 2430208 2335609 2414740
16948 2414740 2757297 2533131 2595832 2585198 2808187 2620397 2651818 2685560 2361719 2660983
16938 2660983 2712984 2710739 2870750 2718741 3075502 2952082 2696961 3038688 2973102 3042281
16928 3042281 3186495 2911783 2843096 3239784 3282909 3334438 3647919 3509962 3257374 3319060
16918 3319060 3361283 3480287 3451869 3378618 3611380 3656071 3552970 3758181 3816536 3770243
16908 3770243 3634042 3926361 3897218 4018821 3967406 3817910 4067118 4174824 4339912 4188717
16898 4188717 4293022 4282553 4628234 4266138 4392587 4616351 4461995 4525348 4726594 4705285
16888D705285O8746J59971o7758P5943J9945Q0203J25877m2964K61719J7277J55505
16877E559749l23733M06594M2022O9181M4954k50972K41487j15353L80156q0268
16867E973817L32586J25827j81532L73042J6651J13148j89961J71220J47232K70454
16857G152484j8755J6147K04568J60798j64984N62607j07887K46258o5536L84034
16847H369734r6902P8829K03721L9732J43918J95162k8846L59691N701J31202
16837I401942K93411K92691J44637K78081K30526j63902L40232L09940J8350J765
16827A1147673L45724O3582K55196J04131M18246n5458N46382L64387P8435K46363
16817A3514661K7629N13778K87449O0626K04219J84907M07837K52510N58365K21023
$$ plain form
16888 4705285 4774031 4934002 4866244 4942187 4962132 5042335 5168212 5125248 5386967 5404244 5559749
16877 5559749 5236016 5642610 5684632 5753813 5798767 5547795 5789282 5673929 6054085 5973817
16867 5973817 6306403 6432230 6250698 6623740 6640391 6753539 6563578 6734798 6882030 7152484
16857 7152484 7133729 7149876 7354444 7515242 7350258 7912865 7804978 8051236 7985700 8369734
16847 8369734 8272832 8351661 8555382 8595114 8739032 8934194 8905348 9265039 9270740 9401942
16837 9401942 9695353 9988044 10132681 10410762 10641288 10477386 10817618 11127558 11145908 11147673
16827 11147673 11493397 11556979 11812175 11916306 12334552 12279094 12825476 13189863 13268298 13514661
16817 13514661 13542290 14056068 14343517 14404143 14608362 14793269 15201106 15453616 16011981 16233004
16807A6233004M62252j04273Q28948Q1102N39196o7199N31038L62378L76594L64255
16797A9607295L76975N41968M35505K67078O49172M01209N52796L85656O01137
16788B3818791M70413L05298N69456Q25923K39609N15016R72191Q88582L56512
16779B8961791N03362O15178P68669O69401M23087Q73054R25291N92909P95469
16770C5128211R08835J187107N77447R81812J120572Q92937R01193O86330J210245
16761D3594689R20907O74307J259983O89690J391426J019547J164171R76903J200353
16752E2891976J134765J112938J162783J087830J292915Q17474J349231J170962
16744F2020874J053755J218970J049382J144686R89296J338498P48411J321206
$$ plain form
16807 16233004 16695256 16590983 17419931 17501033 18040229 17973030 18504068 18866446 19243040 19607295
16797 19607295 19984270 20526238 20961743 21228821 21877993 22279202 22831998 23217654 23818791
16788 23818791 24289204 24594502 25163958 25989881 26229490 26744506 27716697 28605279 28961791
16779 28961791 29465153 30080331 30849000 31518401 31941488 32814542 33739833 34332742 35128211
16770 35128211 36037046 37224153 37801600 38783412 39903984 40796921 41698114 42384444 43594689
16761 43594689 44515596 45189903 46449886 47139576 48531002 49550549 50714720 51691623 52891976
16752 52891976 54026741 55139679 56302462 57390292 58683207 59500681 60849912 62020874
16744 62020874 63074629 64293599 65342981 66487667 67476963 68815461 69563872 70885078
16736G0885078M18131J346134O07852P57364O97465R33333N17309L32442R46951
16727G7442059Q9080L48314R2265N36488K22053r9816j02487L80707o45185j46552
16717G8116926k45041m96576n30259j70508r17466o38875o98207r16220r28003
16708G2575771o82252j143309p03433q25030j392529q94470r43950j269983r09195
16699F3811620j176117j334085j012578r65716j175549p44360j732516o06835
16691E5063864j425116j119871q63200j163464j038689j069213j134937q37836
16683D6411538j157463n60250j352593o74815j154010q72377l43659r46195j160969
16674C8189207r37906o92063o52582r89550q12824o71962p14589m71261j324371
$$ plain form
16736 70885078 71303209 72649343 73257195 74014559 74712024 75645357 76162666 76495108 77442059
16727 77442059 77531139 77879453 77971718 78508206 78730259 78630443 78527956 78908663 78263478 78116926
16717 78116926 77871885 77375309 76845050 76674542 75757076 75118201 74419994 73503774 72575771
16708 72575771 71893519 70750210 70046777 69221747 67829218 66934748 65990798 64720815 63811620
16699 63811620 62635503 61301418 60288840 59323124 58147575 57403215 55670699 55063864
16691 55063864 53638748 52518877 51655677 50492213 49453524 48384311 47249374 46411538
16683 46411538 45254075 44693825 43341232 42666417 41512407 40640030 40296371 39350176 38189207
16674 38189207 37251301 36559238 35906656 34917106 34104282 33432320 32717731 32246470 30922099
16665C0922099J17672r09215p28486m67515m24871o96817o89140m21971p33696
16656B5968060o10179m45825k14331p97257k05118n91008n22938l02208n97828
16647B1681368j90713l45609k99802p06205j38147p4407q41520j18077n17163
16638A8449725k99095Q7476m91108o23831r7539l55809j26760n22671l36850m38140
16628A5245398J5131k98248l17662J84889m46137k95703j54767j03163l51716
16619A3478022l13803r411n47793J73125j71670m48065J1812n90092J20860k58650
16609A1444335L9593l32350J09415m06444L9784k56908J8993m33485O2705O3764
16599A0349402p31338J89253j19456k01706M9887k8967l45299p1470p6877k05108
$$ plain form
16665 30922099 31039771 30130556 29402070 28934555 28509684 27812867 27123727 26701756 25968060
16656 25968060 25357881 24912056 24697725 23900468 23695350 23104342 22581404 22279196 21681368
16647 21681368 21490655 21145046 20845244 20139039 20000892 19926485 19084965 18966888 18449725
16638 18449725 18150630 18238106 17746998 17123167 17025628 16669819 16543059 16020388 15683538 15245398
16628 15245398 15260529 14962281 14644619 14829508 14383371 14087668 13932901 13829738 13478022
16619 13478022 13164219 13154808 12607015 12780140 12608470 12160405 12172217 11582125 11702985 11444335
16609 11444335 11483928 11151578 11260993 10854549 10894333 10637425 10656418 10222933 10285638 10349402
16599 10349402 9618064 9807317 9687861 9486155 9536042 9507075 9161776 9090306 9013429 8808321
16589H808321n7670l68767k50888N12699j46978n06347J39182j31658k5948j23980
16579G847966J17370K4112m92722k4056M5196m24574J02326M6625k6923l47986
16569F867334J91904j190l12744r5320l40785J67866q2471P6711J22627l25892
16559F268040L9466j60897k19732J77935j33471k27979P8309j21768o9004j77730
16549E453169K22723k97530j66219K54831P1453Q6377m68342J89521k37436k03283
16539D905264J01706k54359M9631J48128K46633p18616K67571J58840k52588m8048
16529D604162j03022R4769k08346m6033j72808M23164m74023K12585n7981m7546
16519D224921r5462P9558l60834M55232L3540l01217L42978j79792j94586r3420
$$ plain form
16589 8808321 8750651 8381884 8130996 8643695 8496717 7990370 8129552 7997894 7971946 7847966
16579 7847966 7965336 7989448 7496726 7472670 7517866 7093292 7195618 7242243 7215320 6867334
16569 6867334 7059238 7058048 6745304 6649984 6309199 6477065 6394594 6471305 6593932 6268040
16559 6268040 6307506 6146609 5926877 6104812 5971341 5743362 5821671 5699903 5630899 5453169
16549 5453169 5675892 5378362 5212143 5466974 5538427 5624804 5156462 5345983 5108547 4905264
16539 4905264 5006970 4752611 4802242 4950370 5197003 4478387 4745958 4904798 4652210 4604162
16529 4604162 4501140 4595909 4387563 4341530 4168722 4591886 4117863 4330448 4272467 4224921
16519 4224921 4129459 4209017 3848183 4303415 4336955 4035738 4378716 4198924 4004338 3910918
16509C910918j85495J40030j35199J9070n8635J37601l09859J96891r7219p5434
16499C542669O720k04550M92558k55154N0257j28858l34287R1605K02946q3631
16489C380275J64689l25016j20264m0443M22277l75529j77485j26502K62023J25032
16479C189057k38670L4471k16923N76298r86851O79454J32601n7632k82380j48731
16469B680694K19474m37749K23620L73069j64611m1750M868r2618k14947J21565
16459B671615l501l21724M2719j71060J54761L7732J98029l81932K10487m5534
16449B391592j63261P3455K18070j69518n4277n6279J77912J32454j07460K31053
16439B673741l1095n27123J95845K8534l162k78280J39098O7255l17705J29919
$$ plain form
16509 3910918 3725423 3865453 3730254 3749324 3690689 3828290 3518431 3715322 3618103 3542669
16499 3542669 3549389 3344839 3837397 3582243 3632500 3503642 3169355 3260960 3463906 3380275
16489 3380275 3544964 3219948 3099684 3059241 3481518 3105989 2928504 2802002 3064025 3189057
16479 3189057 2950387 2984858 2767935 3344233 2357382 3036836 3169437 3111805 2829425 2680694
16469 2680694 2900168 2462419 2686039 3059108 2894497 2852747 2857615 2764997 2550050 2671615
16459 2671615 2668114 2346390 2389109 2218049 2372810 2410542 2608571 2226639 2437126 2391592
16449 2391592 2228331 2301786 2519856 2350338 2296061 2239782 2417694 2550148 2442688 2673741
16439 2673741 2642646 2115523 2311368 2339902 2336740 2058460 2197558 2264813 1947108 2077027
16429B077027J62162o4625k71154K72842q6061K41489n16429L83567j23245m5208
16419B030365k07353L08472k25448M2484M5032k2750k53858N4552J29124j58199
16409A742421K00329Q220M27809o10439q3741K32892l53021k4310K72863j93457
16399A619566K39585N1538j51265k8653j88019M52909l65014J94072k09011j1566
16389A604142J7450M9591L44587n45864j34090L68103K8303J40452m08828L68746
16379A832592l12715J05977k29115J34975J82185j77581q903j55894J97852j42445
16369A426928j40915j8095L22355p5188J66177O1782q8419k12727K33035l34704
16359A340229J73683k85140K91474j00245L04345m2640k78696k77808j13763M54839
$$ plain form
16429 2077027 2239189 2174564 1903410 2176252 2090191 2331680 1815251 2198818 2075573 2030365
16419 2030365 1823012 2131484 1906036 1948520 1993552 1970802 1716944 1771496 1900620 1742421
16409 1742421 1942750 1950970 2378779 1768340 1684599 1917491 1564470 1540160 1813023 1619566
16399 1619566 1859151 1910689 1759424 1730771 1542752 1995661 1630647 1824719 1615708 1604142
16389 1604142 1621592 1671183 2015770 1469906 1335816 1703919 1732222 1872674 1463846 1832592
16379 1832592 1519877 1625854 1396739 1531714 1713899 1536318 1527415 1371521 1569373 1426928
16369 1426928 1286013 1267918 1590273 1515085 1681262 1743044 1654625 1441898 1674933 1340229
16359 1340229 1513912 1228772 1520246 1420001 1724346 1681706 1403010 1125202 1011439 1466278
16349A466278j27965K17541J89255l81049k01238K09999k8040J46525k38585K15480
16339A468201k53889m5363L5394O1032j36688J37079Q6138k7275k64122j20242
16329I40265K69288k08796M12484l37012R0196k78040J82783j49227L16410M0241
16319A278592k25626K70379k08384j72521J44798j0954p4491J25415n3254J36529
16309A210483j98621M817O1469l24376K00633J51323N9623k13242o2869K54698
16299A143938k16544K09316k5854K3106m63501M66721j32640J27184j96221j23933
16289H11572N05437j80393O6833k12139L36588m56878J1884n665l07805O01067
16279A170501Q9248k06816k63125k5827J26674J64458L9861k32314J82655r9940
$$ plain form
16349 1466278 1338313 1555854 1745109 1364060 1162822 1372821 1344781 1491306 1252721 1468201
16339 1468201 1214312 1168949 1204343 1265375 1128687 1265766 1351904 1324629 1060507 940265
16329 940265 1209553 1000757 1413241 1076229 1166425 888385 1071168 921941 1238351 1278592
16319 1278592 1052966 1323345 1114961 942440 1087238 1076284 1001793 1127208 1073954 1210483
16309 1210483 1011862 1016679 1078148 753772 954405 1105728 1165351 952109 889240 1143938
16299 1143938 927394 1136710 1110856 1133962 670461 1137182 1004542 1131726 935505 811572
16289 811572 1317009 1136616 1203449 991310 1327898 871020 882904 877239 569434 1170501
16279 1170501 1259749 1052933 789808 763981 890655 1055113 1094974 862660 1045315 945375
16269I45375j90941K06098j27138m1454J97098l75838J17710L58072m57896M08410
16259A039496q1769J12399J5636l33692J71739k97831N5918j34564N63405k90124
16249H20613j55383J07801M2195L61068l33983k69708N55516l36249j93097K9542
16239F28315j10769K76276J95843l79859J10707j51202L33898k67441J46797K16740
16229I99305k93761K71052D63119Q7579R7864j32322K77204j97117j16939J89461
16219F68849k79386L86839k12144L7306N8329k28617J53141J69999j50188k44391
16209C59737N59266k40604K80275j61425l35981J87011r2116L08422k49149o1760
16199E53676L23993j81150q5791k33942J24910K02137n6819p2752K6141B88202
$$ plain form
16269 945375 754434 960532 833394 791940 989038 613200 730910 1088982 631086 1039496
16259 1039496 957727 1070126 1085762 752070 923809 625978 681896 547332 1110737 820613
16249 820613 665230 773031 815226 1176294 842311 572603 1128119 791870 598773 628315
16239 628315 517546 793822 989665 609806 720513 569311 903209 635768 782565 999305
16229 999305 705544 976596 463119 550698 648562 516240 793444 596327 479388 668849
16219 668849 389463 776302 564158 601464 659793 431176 584317 754316 604128 359737
16209 359737 919003 678399 958674 797249 461268 648279 556163 864585 615436 553676
16199 553676 877669 696519 610728 376786 501696 703833 647014 574262 600403 288202
16188D35031K57467j22748o5247Q5442J46235J41460l09603L20730p6120J8733
16178H31380C97125A25268M58094r3630p0672m9419j66568K49626j656K40623
16168F91666j50631A77405L26856B33697O33942l87774J1598M2311K4414j46440
16158D11748J49904j6160k5634j69302q0948J83434M00628l39065K553J10879
16148F28037m9239j43528r008K74071B01514O40424C97443P7042k17768N17034
16138G73751j12158l06466A31748J53832J82802N573J51718j72270q9539P3457
16128D37321j18504P1564J22166A77111P3962K69165J01348k68795I5515N34074
16118F29589k29278M2795j36834J0600K07965o6305r0351N2567A50393L34007
$$ plain form
16188 435031 692498 569750 504503 589945 736180 877640 568037 888767 812647 831380
16178 831380 397125 125268 583362 489732 419060 369641 203073 452699 451043 691666
16168 691666 541035 177405 504261 233697 867639 479865 491463 533774 558188 411748
16158 411748 561652 545492 519858 350556 269608 453042 853670 514605 517158 628037
16148 628037 578798 435270 426262 700333 201514 841938 397443 474485 256717 773751
16138 773751 661593 355127 131748 285580 468382 473955 625673 453403 363864 437321
16128 437321 318817 390381 512547 177111 251073 520238 621586 352791 95515 629589
16118 629589 400311 443106 306272 316872 524837 458532 368181 420748 150393 484400
16108D84400n7385j10634J6861F3395M54787k23122f1518G26250q8867C12443
16097C51667j21156a26472D39834P972k08128J38836K22519B36253J35885j38187
16087B33951J93955j61338M8027j9192q1685M5844J50638O2395A42723J80005
16077C22728J03590q8323p4562K91871j17598A94694R8359r9130J72565A27023
16066D00724j80324j7962J93927j86802K65268R126A95323n7389O8332J18109
16056C24375q2104j07669J90522j54476d9808A18464j1880I814L25775q2764A9983
16044C61977B6926L91980A80699M8288q1067B0418J76978J87588A33247m3728
16034H9519J91754k2066Q8873j11212D3373J42727J56014j16323O4278m4019L42373
$$ plain form
16108 484400 427015 316381 333242 63395 518182 295060 -61518 726250 637383 312443
16097 351667 230511 -126472 439834 447806 239678 378514 601033 236253 372138 233951
16087 233951 427906 266568 314595 295403 213718 259562 410200 472595 142723 322728
16077 322728 426318 337995 263433 555304 437706 194694 293053 193923 366488 127023
16066 400724 220400 202438 396365 209563 474831 483957 195323 137934 206266 324375
16056 324375 242271 134602 325124 170648 -49808 118464 106584 9814 335589 252825 19983
16044 361977 26926 418906 180699 228987 147920 20418 197396 384984 133247 89519
16034 89519 281273 259207 348080 236868 43373 186100 342114 225791 290069 246050 588423
16023E88423F0911B3761R22M73985B28492H3377j6854L68925G2829J7009J71667
16012B61505c3580A82093L0569K37508j97725p7613N9981n4071N7330Q1922j52935
16001A67059a52617P2090C1714L61678J2442N9231B21720Q3114J55514J88336
15991F48684Q7994K35229k62856N85155l23969q6288C13047J90858l433A24241
15980C49919r6701K14200j68621o9019L8795a15365A22462J50583B2143J19055
15970A41198A5708a76363A27085a2379C50144b3642A52196K94221b2797A54331
15959E8971b5161j10107C10064C5474J61782p0572J63077f7203o25A21167M8214
15948A69381o2305J63869o302G4049P5715J7471j374a77218D57125a40325A60698
$$ plain form
16023 588423 60911 23761 24683 498668 228492 83377 66523 435448 72829 89838 261505
16012 261505 -33580 182093 212662 450170 252445 174832 234813 180742 238072 319994 167059
16001 167059 -152617 -80527 31714 393392 405834 465065 221720 304834 460348 648684
15991 648684 736678 971907 709051 1294206 970237 883949 313047 503905 500472 124241
15980 349919 253218 467418 298797 229778 268573 -115365 122462 273045 22143 141198
15970 141198 15708 -176363 127085 -12379 350144 -23642 152196 446417 -22797 154331
15959 58971 -25161 -135268 310064 35474 197256 126684 289761 -67203 -67828 121167 169381
15948 169381 107076 270945 264643 74049 149764 167235 165861 -177218 457125 -140325 160698
15936G2203J96245a0758A11033N67339l15901J13073A9622J42120r671F6463K7762
15925I4225O2544f5098A3546K63693b3393j04910C52804a99804A97846m7334f1645
15913a53407j6980e1821H4781L05942F7848K81029j60644o565a75986g7140A37084
15901F4798B8004M20847B17294f7507Q351j16231C55222j35088K1615j09947M7008
15890A78810M0682N3591o9977J79386b30107A29934b82090G8703L1482j4979K2388
15879A17594b19308A89567N866k4424n7044g0090H6729d6018j9939G7285Q023
15868H5308K28636i6543G9159K5142l0415J24695i1787r8580D8986N540a33711
15856E52901k28677j46093a77221m2629O4585j78424e1528l0095a1460J962j38182
$$ plain form
15936 72203 268448 -10758 111033 678372 362471 475544 19622 161742 152071 66463 94225
15925 94225 156769 -65098 13546 277239 -23393 -128303 352804 -199804 197846 150512 -61645
15913 -153407 -170387 -51821 84781 390723 67848 348877 188233 181668 -175986 -77140 137084
15901 64798 28004 448851 217294 -67507 -59156 -175387 355222 220134 241749 131802 178810
15890 178810 219492 273083 203106 382492 -230107 129934 -282090 78703 110185 95206 117594
15879 117594 -219308 189567 195433 171009 113965 -70090 86729 -46018 -65957 77285 85308
15868 85308 313944 -96543 79159 104301 73886 198581 -91787 -190367 48986 54526 -133711
15856 552901 324224 178131 -177221 -219850 -155265 -333689 -51528 -81623 -11460 -9498 -147680
15845a47680f5688E42784F8910a48749j58588A63524R2148a16701B80829J66456
15835D47285h401A02701b9288A01675c56439B43144C6075c7400A13174E2098K3235
15824G5333J96764a1572B23755d0595j2255M45m0637o8410G6158A8329N1115J82239
15812B51683K3380a8559E4914c3607B01560l4198d7150k7321A2467a78876E0342
15800a32630C5852d6829e251l71524A43693m6024J78664j2893l8797e2197l44129
15789c96326d201o2753I760h4728A33279g0295F0606h5063A62803B1222J19317
15778A40539b07844E3895J61931B3860f681C04407j42419a54004j65729A14056
15767f740j56133F2002M1596d1355K0250k04111G8265R5308B1724b19068A27870
$$ plain form
15845 -147680 -65688 542784 68910 -148749 -307337 163524 255672 -116701 280829 447285
15835 447285 -8401 102701 -29288 101675 -356439 243144 36075 -37400 113174 52098 75333
15824 75333 272097 -11572 223755 -40595 -52850 -52405 -93042 -161452 76158 18329 69444 251683
15812 251683 275063 -18559 54914 -33607 201560 167362 -47150 -74471 12467 -178876 50342
15800 -132630 35852 -46829 -5251 -376775 143693 97669 276333 263440 224643 -52197 -396326
15789 -396326 -4201 -66954 9760 -84728 133279 -70295 60606 -85063 162803 21222 140539
15778 140539 -207844 53895 215826 23860 -6681 304407 161988 -154004 -319733 114056
15767 -6740 -162873 62002 103598 -41355 -21105 -225216 78265 173573 21724 -219068 127870
15755G5174Q1506n4472h657I956d2322B438K23479a29300a8052j57062C6500a01924
15742c63883A10019k9394R1169J40540b8724j83915I5689a81725A48499b09663
15731h7783F9391A859J36425a54596l12531g9843b6817F4759Q1581a80760B27018
15719B65685j12626C2756a01431A43913a53577F9228e08864C26564a26642A09631
15708e2416A55194l6200B922a28357j88089A26379c7836o675A95898J343G2851
15696d4608H9269K14132H0830a85150C19145H1022N2851b27125P7515H2717Q7707
15685A70424m9770K04966g2896B93414g9653k04966G9442m290a97426N4345A96276
15673B24093C142i060l17120B71992a3489A4389L07874h0083B05765a12129K9036
$$ plain form
15755 75174 156680 102208 -8657 9956 -42322 2438 225917 -129300 -18052 -175114 36500 -101924
15742 -363883 110019 80625 171794 312334 -28724 -212639 95689 -181725 148499 -209663
15731 -87783 69391 1859 138284 -154596 -467127 -79843 -26817 64759 146340 -180760 227018
15719 265685 153059 32756 -101431 143913 -153577 69228 -508864 326564 -126642 109631
15708 -52416 155194 118994 2922 -128357 -316446 126379 -37836 -44511 195898 197241 72851
15696 -44608 89269 303401 80830 -185150 319145 81022 133873 -227125 -149610 82717 170424
15685 170424 120654 325620 -72896 293414 -79653 -284619 79442 75152 -197426 -143081 196276
15673 224093 3142 -9060 -326180 271992 -13489 14389 322263 -80083 205765 -112129 -83093
15662h3093G7351e9469A93044a58697I838J53252B5532b68045A1809M2175D717
15650I0390a96502g7250K9075A32857j2285d7468D5332Q4527a03143m0613A22867
15638a38550B46051A04296k8915K50622j44122c09502L4420A44767b94998A68345
15627i7893H3668a66413f9375C14727I2588f642p1541A5955c2024j09104A40276
15615H8181B5690O31c8909A6774M60d0968l6616A18930a30j575k32397d9075k71486
15602c20561a07205d4264A11040a42621A76062h2171i223F1955b80865d6813p6053
15591a22866A18988d1877m0112j76312i0962k6679N1451l0610l13419B15078b37725
15579A54522a89109A20040D706a31658F0052O3963J60747h2240A18785d0963m9622
$$ plain form
15662 -83093 77351 -59469 193044 -158697 9838 163090 25532 -268045 11809 53984 4717
15650 90390 -196502 -77250 -48175 132857 120572 -47468 45332 129859 -103143 -143756 122867
15638 -138550 246051 104296 75381 326003 181881 -309502 -275082 144767 -294998 168345
15627 -97893 83668 -166413 -69375 314727 92588 -6642 -78183 15955 -32024 -141128 140276
15615 88181 25690 26321 -38909 16774 17234 -40968 -77584 118930 -130 -1705 -234102 -49075 -320561
15602 -320561 -107205 -44264 111040 -142621 176062 -82171 -9223 61955 -280865 -46813 -122866
15591 -122866 118988 -41877 -81989 -258301 -90962 -117641 -66190 -96800 -410219 215078 -237725
15579 154522 -189109 120040 4706 -131658 60052 124015 284762 -82240 118785 -40963 -90585
15568i0585I9289k4027B0607J29128n0420d6770k28606C60514E530b82108e9010
15556a72312G5606a37662j88138i5842B07947p0784J33835a9202A0578P124J43418
15545A61120c26942B51926k065J5913l0499M3657a10063M7017m231H4241J1303
15534I5544i5461C27611I0162b1482A39833K38560G6699b09325j11741A11670
15523c0929G6871a17242E0378b95237a3495E342c31751B24002C1009a78325A4764
15511a07054A66452A9487e5000I2451J55402a7381j21478M9370L7447B24592C497
15499A39835d769D0401J74504P028e0071k85737B39592b40351G2390b78908D9689
15487A60517J5825Q6484c9422B68690C0336J3824a53725A03592K38754q9872L55570
$$ plain form
15568 -90585 99289 75262 20607 149735 99315 -46770 -275376 360514 5530 -282108 -59010
15556 -172312 75606 -137662 -325800 -95842 207947 137163 270998 -19202 10578 17702 161120
15545 161120 -326942 251926 249861 265774 235275 278932 -110063 -63046 -67277 84241 95544
15534 95544 -95461 327611 90162 -21482 139833 378393 76699 -209325 -321066 111670
15523 -30929 76871 -117242 50378 -295237 -13495 5342 -331751 224002 31009 -178325 14764
15511 -107054 166452 19487 -55000 92451 247853 -17381 -138859 -89489 -52042 224592 3497
15499 139835 -4769 40401 214905 221933 -50071 -335808 239592 -240351 72390 -278908 49689
15487 160517 176342 262826 -39422 268690 30336 44160 -153725 103592 342346 252474 608044
15476F08044B95990N412a9155C0536M47922b0512A21996g0948j43579e723F5056
15464B20155D1771a80409D7255c2066j19492e004k9237j93905f7624E0969R7400
15453A48369b42384a00064A80549J46118K07203j85047N4168L04336r0186N0340
15443F67481m021B63197H3151J74065D167M2322N4602g268A52909R6807i0504
15431A06437C0341b58782J11407A81908a39410A68476G1293P8048J25560B1012
15420c05976A03278c99018A60418g3242L5859l4637c7m89517b0167H0723b9885
15408A486b21328p3498c7177j31585F0430f8111l6548o9346A29572j1396i7376
15396c51757a39965E3745c73448R3307E38969c34413A9651d7434j98566a20049
$$ plain form
15476 608044 295990 301402 -19155 30536 478458 -20512 121996 -70948 -214527 -5723 65056
15464 220155 41771 -180409 47255 -32066 -151558 -5004 -34241 -228146 -67624 50969 148369
15453 148369 -242384 -100064 180549 326667 533870 348823 402991 707327 617141 667481
15443 667481 663460 263197 83151 257216 4167 46489 101091 -7268 152909 249716 -90504
15431 106437 30341 -258782 -147375 181908 -139410 168476 71293 149341 274901 21012
15420 -305976 103278 -399018 160418 -73242 -37383 -72020 -37 -489554 -20167 80723 -29885
15408 1486 -221328 -294826 -37177 -168762 60430 -68111 -104659 -174005 129572 118176 -97376
15396 -351757 -139965 53745 -373448 -280141 538969 -334413 19651 -47434 -246000 -120049
15385A53515A0468b29636A65258J2919M7836i1302a4291C6514a18426D52161F7024
15373c3984C32705r8375F4847L4436K53242j14064k8473p1027n3963g2602G4250
15361C12176g5557B216J25759K38280H2057M00488d0491H1068c5784C69922j27498
15350B42424O8587f0599B60213l3391D8088f4400H2146N7494K55042p3755n7767
15339B63160M7550A36472K2424a20261b9187H8124d2197q1678A40447K6246l8336
15328A28357k4995m2027J18834a54215B58320j26051l8937J39683J28513a46036
15317I4638j621K67072A14478m8452J01509b3929D00778j07676b5752B06412h0429
15305C09857j06572P1908a16091F6845J77971O547G163a42174B18650b05188E08588
$$ plain form
15385 153515 10468 -229636 165258 178177 226013 -91302 -14291 36514 -118426 452161 67024
15373 -33984 332705 234330 64847 99283 352525 238461 209988 138961 84998 -72602 74250
15361 312176 -75557 2216 127975 366255 82057 482545 -40491 81068 -35784 369922 242424
15350 242424 311011 -60599 260213 226822 48088 -64400 82146 139640 394682 320927 263160
15339 263160 310710 136472 158896 -120261 -29187 88124 -42197 -123875 140447 166693 128357
15328 128357 103362 61335 180169 -154215 258320 132269 93332 233015 361528 -146036
15317 94638 93017 360089 114478 66026 167535 -23929 400778 293102 -25752 206412 -80429
15305 309857 203285 275193 -116091 66845 244816 251363 7163 -142174 218650 -205188 508588
15293a40731A74122a30544r6933R7558j59593C0377d490j04043j96081Q0643M1585
15282a82386I8966a4510B03191B4520J16238K68991g1792J5223n8663B12149a33261
15270b94333a38106m7579B58517B9199L89003e272A45791J59466F2660g1872A65155
15258a48438F6746b15089C52877l9093a75194c8682A54092F6156J62683N237N25961
15247G60037J134770N09372r38880J039670q55865D88511N7708a21060m2990E6137
15236A76533a52057q1739C60987h568j88584b9833A61933B6741J48354B0291J73754
15225A94045D6893j5520L10454l5760d27690A52487a6642A75913a36435A21675
15214A24250C438L08378I8679l6069P041a95780a742B647b13590k4739H0586n039
$$ plain form
15293 -140731 174122 -130544 -227477 -129919 -289512 30377 -4490 -108533 -304614 -223971 -182386
15282 -182386 98966 -14510 203191 24520 140758 409749 -71792 -56569 -115232 212149 -133261
15270 -294333 -138106 -185685 258517 29199 418202 -5272 145791 305257 62660 -71872 165155
15258 -148438 66746 -215089 352877 313784 -175194 -38682 154092 66156 228839 234076 760037
15247 760037 1894807 2404179 1465299 2504969 1649104 488511 546219 -121060 -164050 56137
15236 176533 -152057 -233796 360987 -8568 -197152 -29833 161933 26741 175095 20291 194045
15225 194045 46893 31373 341827 306067 -427690 152487 -16642 175913 -136435 121675
15214 124250 3438 311816 98679 62610 69651 -195780 -1742 2647 -213590 -238329 80586 75547
15202G5547a61497D4838b33633f21j37890B54991j16829c6205E1836B0213K8932
15191D9145a5943r7288I5782d2121p2157k9184o591j86143a43428D8000e2117
15179A33677b5511j01831A69294i5016m071D6545b08496f7277j10877o0596a2049
15167E8275a68686H4077J28344n0426n4899b4185j21598A89019C0234A3899P3008
15156H6907b92114L0267A48085E1074j7250P5341Q848P6380O2863g4656B1969
15144B50479K353p0536J6074Q9040I4696j9835J51112D7421K2345K57059E7922
15132a38183j64496P6507g4534C23852c9901A69349a19872B16150C2560K00494
15122B33054I8634h2359C17892d6606n9395G104M50304b1536A37416L1824L07247
$$ plain form
15202 75547 -161497 44838 -233633 -621 -138511 254991 138162 -36205 51836 20213 49145
15191 49145 -15943 -113231 95782 -42121 -114278 -143462 -150053 -336196 -143428 48000 -52117
15179 133677 -25511 -127342 169294 -95016 -99087 46545 -208496 -67277 -178154 -238750 -12049
15167 58275 -168686 84077 212421 161995 107096 -24185 -145783 189019 30234 13899 86907
15156 86907 -292114 -261847 148085 51074 33824 109165 118013 194393 257256 -74656 21969
15144 250479 252832 182296 198370 287410 94696 74861 225973 47421 69766 326825 57922
15132 -138183 -302679 -226172 -74534 323852 -39901 169349 -119872 216150 32560 233054
15122 233054 98634 -82359 317892 -46606 -106001 7104 457408 -21536 137416 169240 476487
15111D76487L2178b8049C28219j29606C3337f6471A76971a05822e0026j41883
15101a91909B94704j9430b06630B53548e5443A58629c5106A05771K78564A66060
15090B18376G1274L98361k05586F7562M2834e6885B3207J40183J8060L17156b6215
15078A29729E6656J8720K10222M3344B3178J51509I8O2337R0884b95503C106J01242
15066A04348i0738B27890G2550r765J62357a28987B45772j2380H1075J50362J29000
15055C60437l4429c3943B13199j1857M8809R5855l3178l7535K5578o7013j0704
15044B23154A08466M5812J25616B6537R7557k7582O7857J57689J35710k10820
15034B46948J17316B5692L57676p0300o7432Q1558J25977J07368p4613J16854
$$ plain form
15111 476487 508665 -28049 328219 198613 33337 -66471 176971 -105822 -50026 -191909
15101 -191909 294704 275274 -206630 253548 -55443 158629 -35106 105771 384335 166060
15090 218376 71274 469635 264049 67562 110396 -56885 23207 163390 181450 498606 -26215
15078 129729 56656 75376 285598 328942 23178 174687 98 62435 153319 -295503 3106 104348
15066 104348 -90738 227890 72550 62785 225142 -128987 245772 233392 81075 231437 360437
15055 360437 326008 -33943 213199 201342 250151 346006 312828 275293 300871 233858 223154
15044 223154 108466 154278 279894 26537 124094 96512 164369 322058 457768 246948
15034 246948 364264 25692 383368 313068 245636 327194 453171 560539 485926 602780
15024F02780B34835J03335j33563m4410O4891j0266R9137M5602o7998Q0460I431
15012A04249M3832K21835A56540j8327M93087j00453k01877O0288P9009A48655
15001C78770P5127R351B30834M81105A87465K93722j67187a02949C36013j42812
14991A93201O4096P4298K1543A43184m7422K95150j4351l8982O0026j73627E2951
14979E21748l9285L7778K24153k14942J46239l17750A11896K68295K18542k38638
14969C60095M40353l39988J45924k83765J09443A76948R9342B3401L10025F0572
14958C37396K91829B93568n4096p60q2419J34847n6304K62198B39151L40046l2111
14947E47086J39510j14176A65824L27939J4391r6766j66454R2610P1786l0334
$$ plain form
15024 602780 234835 338170 204607 160197 225088 214822 313959 359561 291563 372023 9431
15012 104249 148081 369916 156540 138213 631300 530847 328970 389258 468267 148655
15001 378770 453897 463248 230834 711939 187465 481187 314000 -102949 336013 193201
14991 193201 257297 331595 353138 143184 95762 390912 376561 337579 397605 223978 52951
14979 521748 482463 520241 744394 529452 675691 357941 111896 380191 598733 360095
14969 360095 800448 460460 606384 322619 432062 176948 276290 23401 333426 60572
14958 337396 629225 293568 239472 238712 156293 291140 234836 497034 239151 579197 547086
14947 547086 686596 572420 165824 493763 508154 411388 244934 337544 409330 378996
14937C78996p3860M9191K68872K81327j09839k89967J82603K1742K25267D64963
14926A173158j66943K54361k12768M5020n4928K65679m5142M75581k01553o38967
14916H93498L0851M880j25562m2698q6713r5427K2782o367C5819M75903B22443
14904C53607J3891J25825B38247j684J7292K41497j14562B9970M92244l8720A23652
14892A61368L55363n1470J55155J30897J63522D55541J93362k447j63876O9076
14882E51656Q1391j24013R2232L0523J02320j15164k71393J59496j43484J16286
14872D79850l4210l394j07015K90672J32302C64194j8424K54498k09456P4843
14862D65655O6669A40251M32288j36103K40192C26776k4508P4682J97632k71162
$$ plain form
14937 378996 305136 354327 623199 904526 794687 504720 687323 709065 934332 464963
14926 1173158 1006215 1260576 1047808 1092828 1037900 1303579 1258437 1734018 1532465 893498
14916 893498 924349 929229 803667 760969 674256 578829 601611 595244 35819 511722 222443
14904 353607 367498 493323 238247 236563 253855 495352 380790 29970 522214 483494 123652
14892 161368 516731 465261 620416 751313 914835 455541 648903 646456 482580 551656
14882 551656 633047 509034 601266 631789 734109 618945 347552 507048 363564 479850
14872 479850 445640 442246 335231 625903 758205 364194 345770 600268 390812 465655
14862 465655 532324 140251 572539 436436 676628 326776 302268 376950 574582 303420
14852C03420r7381N47281C66470J64071k02959L29672j26406K50835J87293o6580
14842I02396J23004K26230l69811O5627k27741K1021q1167n9672j03192k5368
14832D71327B19018K19947J37384B81260M87547B78387L35056k40248J24813n3052
14822D44956j09387K95388N8649k78962J78363K37754B79452j14592Q0859J82198
14812D27917K81585k4141n9839m5220n6827J80212N8113J5893j30926K40917J5955
14801I03639B83693M07560k36859J47091q4528j54886o8886K67229k946K71292
14791H28760k55440P9485B72734K49138R5673k49207P615R8700m5146K92160r219
14780G12448C29834K73995L86042k40255j76194l0509N00938m57923j77405K64482
$$ plain form
14852 303420 206039 753320 366470 530541 327582 657254 530848 781683 968976 902396
14842 902396 1025400 1251630 881819 947446 719705 740726 659559 599887 496695 471327
14832 471327 219018 438965 576349 281260 768807 278387 613443 373195 498008 444956
14822 444956 335569 630957 689606 410644 589007 826761 279452 164860 245719 427917
14812 427917 709502 685361 625522 580302 523475 703687 761800 777693 646767 887684 903639
14801 903639 283693 691253 454394 601485 516957 362071 293185 560414 557468 828760
14791 828760 573320 652805 272734 521872 617545 368338 375953 474653 429507 721667 712448
14780 712448 329834 603829 989871 749616 573422 542913 1043851 585928 408523 673005
14770F73005k00955Q5761j24768K92581C40862J01134O06234k82410j67077j66949
14760D31794p1413L44957j15815M0564k35540N51634j16670k60232P5112R5517
14750G39908j50777O349n9008K14335k00160Q9368j73660J31141K31588l75731
14740D53353M21551k62936m4376A86169L44950j34624J01302K1862k37359O75949
14730I58249l60655N82024l40064J85096J06489j44445K21340L20636n7248j5562
14720A455860l89801k9009J2001k44209P9051m36895O28730l88781K66733O3031
14710A016711j06999J02901l70272P7809J405l8169O10141l84845N38412l95580
14700A051514M32357p3200M4013k9767k72661k72205K76622k06319j74564K16730
$$ plain form
14770 673005 472050 557811 433043 725624 340862 441996 1048230 765820 598743 431794
14760 431794 360381 705338 589523 630087 394547 946181 829511 569279 644391 739908
14750 739908 589131 595480 536472 750807 550647 640015 466355 597496 829084 453353
14740 453353 874904 611968 567592 186169 531119 396495 497797 519659 282300 958249
14730 958249 597594 1179618 839554 1024650 1131139 986694 1208034 1528670 1471422 1455860
14720 1455860 1066059 1037050 1049051 804842 883893 446998 1075728 686947 953680 1016711
14710 1016711 909712 1012613 642341 720150 721555 683386 1293527 908682 1447094 1051514
14700 1051514 1483871 1410671 1454684 1424917 1152256 880051 1156673 950354 775790 992520
14690I92520m2629j35950J46476J7113k79841L55363k16659J08392j34999J67827
14680I77613R7169j18284k01283J86545L26017m04739j93829j3415K64735r517
14670I11012K3629j72628K59860M5261j13794J99364l8954j12227q1411K04300
14660A124412k40444L74311m45125m63Q8471K19428p7500k2718k97936L14709
14650A037145j32573L11564j96200J07873J66347m97996K28427K30667k35343
14641A019911J24442q4865j88147K51187l0458j51039l195L93200j49419J58168
14631A339785k03652k89425O63536l44458Q5266K15146q9351n5592j49945q4743
14621A086567k6930L81481k110o3516j32910J0344k379J63726m118k24101M73802
$$ plain form
14690 992520 949891 813941 960417 977530 697689 1053052 836393 944785 809786 977613
14680 977613 1074782 956498 755215 941760 1267777 863038 669209 655794 920529 911012
14670 911012 934641 762013 1021873 1067134 953340 1152704 1113750 1001523 920112 1124412
14660 1124412 883968 1258279 813154 812691 901162 1120590 1043090 1020372 722436 1037145
14650 1037145 904572 1216136 1019936 1127809 1294156 796160 1024587 1255254 1019911
14641 1019911 1144353 1059488 871341 1122528 1092070 941031 937836 1331036 1181617 1339785
14631 1339785 1136133 846708 1510244 1165786 1251052 1466198 1376847 1321255 1171310 1086567
14621 1086567 1059637 1441118 1439008 1375492 1242582 1252926 1250547 1414273 1410155 1186054 1659856
14610A659856r1715l63855J6832K13430J36067j34343O9129j68942K60382j28124
14600A468717j78236N2185J38225J35155l88049N16866o3860l17274N6074L13184
14590A732987l62878j58546K34851K69540k11125M07986n18556J66487J97260
14581A758006N2067l30817J69456r9156M11818j11517j04644K73233K37499n09266
14571A746679O14363j15557K44714m00528J08344Q5918k80259K19407p0564L69604
14561B522121J50134m82795O83418l87416K73226J46379J71594N33172k39330
14552C370503N76638M71664R00665R60120L057220O933906J7761253J3649489
14544D7681458B0829400j0260664j180024D070136j656177m80082j93580K60243
$$ plain form
14610 1659856 1568141 1204286 1221118 1434548 1570615 1436272 1505401 1336459 1596841 1468717
14600 1468717 1290481 1342666 1480891 1616046 1227997 1744863 1681003 1363729 1419803 1732987
14590 1732987 1370109 1211563 1446414 1715954 1504829 1912815 1394259 1560746 1758006
14581 1758006 1810073 1479256 1648712 1549556 1961374 1849857 1745213 2018446 2255945 1746679
14571 1746679 2361042 2245485 2490199 2089671 2198015 2283933 2003674 2223081 2152517 2522121
14561 2522121 2672255 2189460 2872878 2485462 2758688 2905067 3076661 3609833 3370503
14552 3370503 3947141 4418805 5319470 6279590 9336810 16270716 34031969 47681458
14544 47681458 20829400 10568736 9388712 4070136 2413959 1933877 1740297 2000540
14536B000540O843k28446N3993J42876O4908N204k9110Q338J18982r2007P1313
14525B123434J57574J03203l27027L51957k73008L92425m87446L87076j20295
14516B307893j9263J5042L63939j24757k91935J94591j18805M66690m02134J39802
14506B531063N4565J38473J13303o3223J30266j82646N34397p72181P90082p8665
14496C195434j66322J85739n5036O993P0405k71932L77048j75205M09735m47289
14486C129570L53286m7429j54568K1928q5324o1675K34521o5862L00229p6589
14476C548087k3946J83394r5743K67897k7699L9153J95968j83846J24225n6138
14466C971352J2688L08355j83128M07653l37527Q4981L44896r236O4601j36310
$$ plain form
14536 2000540 2007383 1778937 1832930 1975806 2040714 2045918 2016808 2025146 2144128 2052121 2123434
14525 2123434 2281008 2384211 2057184 2409141 2136133 2528558 2041112 2428188 2307893
14516 2307893 2288630 2303672 2667611 2542854 2250919 2445510 2326705 2793395 2391261 2531063
14506 2531063 2585628 2724101 2837404 2774181 2904447 2721801 3256198 2484017 3274099 3195434
14496 3195434 3029112 3214851 3159815 3166808 3237213 2965281 3342329 3167124 3576859 3129570
14486 3129570 3482856 3435427 3280859 3302787 3217463 3155788 3390309 3324447 3624676 3548087
14476 3548087 3524141 3707535 3611792 3879689 3851990 3891143 4087111 3903265 4027490 3971352
14466 3971352 3984040 4292395 4109267 4516920 4179393 4264374 4609270 4600034 4664635 4528325
14456D528325j90588L47619L84586k89107j01215k4081K35449N0340J16769r7111
14446D960986J6267N4010L19777L8193P1946L9389M12971q09043M01884J72081
14436E678461M0692K14855J20333k51385L36689M11931J33179k19864m9963M90112
14426F905040K245k91176M52848K5175K32920m30096L08930K71083J10869R6245
14416G684083L63922l4775R151J40300M251L85737k87629O07269j35588L67293
14406I104014J10664P5647j4915J66508q3790M27635J08170P2437M05044j22012
14396A0249402K95405J69827J69376j4760N43444j70100K47623K57442L23503
14387A2071162j32012O26669M40150L76066j02862L26477J18958J42465L22015
$$ plain form
14456 4528325 4337737 4685356 5069942 4780835 4679620 4655539 4890988 4941328 5058097 4960986
14446 4960986 4977253 5031263 5351040 5389233 5461179 5500568 5913539 5104496 5506380 5678461
14436 5678461 5719153 5934008 6054341 5802956 6139645 6551576 6684755 6464891 6414928 6905040
14426 6905040 6907285 6616109 7068957 7094132 7327052 6896956 7205886 7476969 7587838 7684083
14416 7684083 8048005 8013230 8022381 8162681 8166932 8552669 8265040 8872309 8736721 9104014
14406 9104014 9214678 9290325 9275410 9441918 9358128 9785763 9893933 9966370 10371414 10249402
14396 10249402 10544807 10714634 10884010 10869250 11412694 11242594 11490217 11747659 12071162
14387 12071162 11939150 12565819 13005969 13382035 13279173 13605650 13724608 13867073 14189088
14378A4189088N66685l62900R08454j35663M18802M74690N92496j92624O82252
14369A7141280J20930M75467M43878J94196N04486k42692R12112J83537Q19687
14360B0552881j16230P08114R65829J08150M97286M28480N45610Q62242N22881
14351B5075243M83893O47330M97939J167261K94052N88617P63785J052538N72267
14342C1142925J006287J025518N82120O89668J059602J149443P82049J252981
14334C8690593J237272R30466J143163J333892J620080J240983J294716J759551
14326D9250716J850000R59026K069227J910800J593414J733619K278256K106426
14318F3751484K316600K531813K216516L021743L117733K876201L398221L369518
$$ plain form
14378 14189088 14755773 14392873 15301327 15165664 15584466 16059156 16651652 16459028 17141280
14369 17141280 17262210 17737677 18181555 18375751 18880237 18637545 19549657 19733194 20552881
14360 20552881 20436651 21144765 22110594 22218744 22716030 23144510 23690120 24552362 25075243
14351 25075243 25559136 26206466 26704405 27871666 28165718 28754335 29518120 30570658 31142925
14342 31142925 32149212 33174730 33756850 34446518 35506120 36655563 37437612 38690593
14334 38690593 39927865 40858331 42001494 43335386 44955466 46196449 47491165 49250716
14326 49250716 51100716 52059742 54128969 56039769 57633183 59366802 61645058 63751484
14318 63751484 66068084 68599897 70816413 73838156 76955889 79832090 83230311 86599829
14310H6599829L245848L864086L978654M438907M554267M764260M310815M877396
14302A20634062N094010N702947N875356O747923O490081P251324P340864Q387505
14294A73524072Q689407Q496495R535924R716877J0724873J0890508J1480455
14287B43058611J2370727J2543774J2989357J3634509J3814128J3912439J4759521
14280C37083066J4410201J4849277J4368140J4124596J3813470J2264969J0942572
14273D31856291R407951N811998K623522K351298m0662k475432l245021l382568
14265D42907377p179142j0381470j2895248j3876702j4955688j5539160j5995457
14258C52084510j6059362j5557689j5558663j5323130j4590923j4317966j1736253
$$ plain form
14310 86599829 89845677 93709763 97688417 102127324 106681591 111445851 115756666 120634062
14302 120634062 125728072 131431019 137306375 144054298 150544379 157795703 165136567 173524072
14294 173524072 182213479 190709974 200245898 209962775 220687648 231578156 243058611
14287 243058611 255429338 267973112 280962469 294596978 308411106 322323545 337083066
14280 337083066 351493267 366342544 380710684 394835280 408648750 420913719 431856291
14273 431856291 441264242 447076240 449699762 452051060 452010398 449534966 446289945 442907377
14265 442907377 435728235 425346765 412451517 398574815 383619127 368079967 352084510
14258 352084510 336025148 320467459 304908796 289585666 274994743 260676777 248940524
14251B48940524j2375960j2274961j1329562j1217533r887971j0094827q809983
14244A72949727q210676q288801p457486p137925o728817o473490n365468n648184
14236A17638880n166454m959393m703756m541194l861870l145336l951530l758399
14228H3550948l412376l161062k886889k570090k845591k268946k379955k332466
14220F1693573k126290k203978j882283j763027j854791j846821j258318j314372
14212D7443693j613819j355421j608338j553547q54147p73597j208986j418702
14204C7057136j124173p79449j381431p55048l82189j084023p78928r32636j181001
14195B8658258l81514l40529q11967m27149j254928l10188o41666q39407l36154
$$ plain form
14251 248940524 236564564 224289603 212960041 201742508 191854537 181759710 172949727
14244 172949727 164739051 156450250 148992764 141854839 135126022 128652532 123287064 117638880
14236 117638880 112472426 107513033 102809277 98268083 94406213 91260877 87309347 83550948
14228 83550948 80138572 76977510 74090621 71520531 68674940 66405994 64026039 61693573
14220 61693573 59567283 57363305 55481022 53717995 51863204 50016383 48758065 47443693
14212 47443693 45829874 44474453 42866115 41312568 40458421 39684824 38475838 37057136
14204 37057136 35932963 35153514 33772083 33017035 32634846 31550823 30771895 29839259 28658258
14195 28658258 28276744 27936215 27124248 26697099 25442171 25131983 24490317 23650910 23314756
14186B3314756o31103n66340k55677n70951n54970l97325m81340k05498j58987
14177A9492565p59879m41280j48458m29005n17191j88249l57210l6895m65156
14168A6149242k52744M463m20344p46704m8264o50195j20691J97887l44525o49942
14158A3118183m83224J38015k98964J27269k3334n40733m40866K89592m21443
14149A1464495l8399l27984j66999j46109l90732p5267M57925n88697n13523k4809
14139I649901P8399j17505j58500N7035l96564j8990k4971m73091m4089j68908
14129H382717K62373l1840m66545O8032l38191n1233J4095L17047n50048q5793
14119G520614j3398k96761k66883L60656l89727n3238j3245o5889R7017l68138
$$ plain form
14186 23314756 22683653 22117313 21861636 21290685 20735715 20338390 19857050 19651552 19492565
14177 19492565 18732686 18291406 18142948 17713943 17196752 17008503 16651293 16614398 16149242
14168 16149242 15896498 15900961 15480617 14733913 14685649 14035454 13914763 14112650 13768125 13118183
14158 13118183 12634959 12772974 12474010 12601279 12577945 12037212 11596346 11885938 11464495
14149 11464495 11426096 11098112 10931113 10785004 10394272 10319005 10776930 10188233 9674710 9649901
14139 9649901 9728300 9610795 9452295 9509330 9112766 9093776 9068805 8595714 8551625 8382717
14129 8382717 8645090 8613250 8146705 8214737 7876546 7825313 7839408 8156455 7606407 7520614
14119 7520614 7507216 7210455 6943572 7304228 6914501 6861263 6848018 6782129 6879146 6511008
14109F511008O84K68093m44360K92670k10431l34010l5982J8099k2744l38430
14099E704597j42545m8113n8013J29025P5355l77310J91941j57992m31826M24725
14089E309844j24285l4733J4781m03612M9014J83890M3940l40427j25894L78400
14079D950918m73664l5481n4678K40168m03736j24721J79081j67045K43570n9792
14069D294620m06937M00J38264J75463M4958j44869q6788k21428j04659K43355
14059C932379j78577k18327J11636J992L9819k01633j52399p5335O39253n66538
14049C332270J56612j29017K07539l74700L00277m31762r4361l8597l6584L952
14039B895629K90997q0486J04120J07847J00058m08j28625J4813J34221k92747
$$ plain form
14109 6511008 6511692 6779785 6335425 6628095 6417664 6083654 6047672 6065771 6043027 5704597
14099 5704597 5562052 5513939 5455926 5584951 5660306 5282996 5474937 5316945 4885119 5309844
14089 5309844 5185559 5150826 5165607 4761995 4811009 4994899 5038839 4698412 4572518 4950918
14079 4950918 4477254 4441773 4387095 4627263 4223527 4098806 4277887 4110842 4354412 4294620
14069 4294620 3887683 3888083 4026347 4201810 4246768 4101899 4015111 3793683 3689024 3932379
14059 3932379 3753802 3535475 3647111 3649103 3688922 3487289 3334890 3259555 3898808 3332270
14049 3332270 3488882 3359865 3567404 3192704 3492981 3061219 2966858 2928261 2891677 2895629
14039 2895629 3186626 3106140 3210260 3318107 3418165 3417757 3289132 3303945 3438166 3145419
14029C145419j45553j38092j96410j66856K92212j92765L85567j08631n00944
14020B373947J86478m90028N08967j18552j61935J9432N6767J02068l17418Q5729
14010B245455J58265j55709j45683K84946O8930j15545k8273j96273k63827M34993
14000B287279k98040K70508k39435k40978N84435m32554L16598j40013K03813
13991B311613L18700j01240N62047J248878L925402J1858947K8488768j5946773
13983C2666342A5975234o735548l513067j244351o50989k86746j77533m59226
13975B907774k70889P7196k9930j38298L9586j13277k16268L22604l45082k57553
13965A975863K97218k9602j61855N6567r8476J33285p4237m5373j03684L02776
$$ plain form
14029 3145419 2999866 2861774 2665364 2498508 2790720 2597955 2983522 2874891 2373947
14020 2373947 2560425 2070397 2579364 2460812 2298877 2318309 2375076 2477144 2159726 2245455
14010 2245455 2403720 2248011 2102328 2387274 2456204 2340659 2312386 2116113 1852286 2287279
14000 2287279 1989239 2259747 2020312 1779334 2363769 1931215 2247813 2107800 2311613
13991 2311613 2630313 2529073 3091120 4339998 8265400 20124347 48613115 32666342
13983 32666342 15975234 9239686 5726619 4482268 3831279 3544533 3367000 2907774
13975 2907774 2636885 2714081 2684151 2545853 2585439 2472162 2255894 2578498 2233416 1975863
13965 1975863 2273081 2243479 2081624 2138191 2039715 2173000 2098763 2053390 1949706 2252482
13955B252482k70440J7351m3139k1157P5326l06784J25418J75990q4402k0653
13945A899992P6068k73296j66655K35169j52180Q6938o6810j96291M69844k34847
13935A677932n6868o1067N5553K2247J20185q1014K18826n2167j25733l54304
13925A363590N06456k50725m61493R1896K51141m4130M24125m56720Q8224Q1406
13915A593770q5293M4021L8075k75633N09877k93848q5112m30100M99960L0416
13905A546133l69858O2129J31615l5868j27638N7360l07489J46096J98889k52317
13895A049052J09619J65035J85453J98338n91488K92683l23744L44873J6291k83712
13885A162400K0276L76157p7496m13837j07182M84406q5551j54854N3813O8869
$$ plain form
13955 2252482 1982042 1999393 1956254 1935097 2010423 1703639 1829057 2005047 1920645 1899992
13945 1899992 1976060 1702764 1536109 1771278 1619098 1706036 1639226 1442935 1912779 1677932
13935 1677932 1621064 1559997 1615550 1637797 1757982 1676968 1895794 1843627 1717894 1363590
13925 1363590 1870046 1619321 1157828 1249724 1500865 1456735 1880860 1424140 1512364 1593770
13915 1593770 1508477 1552498 1590573 1314940 1824817 1530969 1445857 1015757 1515717 1546133
13905 1546133 1176275 1238404 1370019 1334151 1206513 1263873 956384 1102480 1301369 1049052
13895 1049052 1158671 1323706 1509159 1707497 1116009 1408692 1084948 1429821 1446112 1162400
13885 1162400 1182676 1558833 1481337 1067500 960318 1444724 1359173 1204319 1258132 1327001
13875A327001K97720n41408J82308j93234L412j00433K78974q984j21540j52495
13865I71321J63071R4410J2157k25523j15360N70655F65878M25043P567K07603
13855A306091k68503K82166k58169M4327q0968M8343m9816m1395L8101j78216
13845H41961K53592k65888J88824L37640m65079q0331k46743K5012K89052k2747
13835H55293l3959J09517l54070J45381K81962k11159K89334m3902j63474j21884
13825G53039m5578L38140l0071l57824K69105m4425k4150j97920K46251j24201
13815G82366k21123k2013O3799J94271k2905J9134l38375K74957K0403J10250
13805H60764K26292Q2128n56536J21760K56931J1882L3765m02093J16701q3827
$$ plain form
13875 1327001 1624721 1083313 1265621 1072387 1075799 975366 1254340 1245356 1123816 971321
13865 971321 1134392 1228802 1240959 1015436 900076 1470731 665878 1090921 1098488 1306091
13855 1306091 1037588 1319754 1061585 1105912 1024944 1073287 1023471 982076 1020177 841961
13845 841961 1095553 829665 1018489 1356129 891050 810719 563976 588988 878040 855293
13835 855293 821334 930851 576781 722162 1004124 792965 1082299 1038397 874923 753039
13825 753039 707461 1045601 1015530 657706 926811 882386 858236 660316 906567 782366
13815 782366 561243 539230 603029 797300 774395 793529 455154 730111 750514 860764
13805 860764 1087056 1169184 612648 734408 991339 1003221 1036986 634893 751594 667767
13795F67767J13717k70416B48716O54296k66014J09192k63226K83743k38541L31230
13785H59396j20623J48985l10062L83677k51985k01821K08424l3190l9514p6947
13775E66340L77895l96905L98839l85742l7793M09705m47603K29095J58748l48948
13765E23631L34834J48215k16716l9506l47637M8112K02972j08080M0958l3709
13755E53074m6783J83051J17525p3556p569k1055k38780M14346k95282j86075
13745C98896R5459q376j29432L02572B64024L39285o1694o2112K78786r4480j37166
13734E26643j06213K92185k70591N6038P8871k27104K28691R0570B85169M18997
13724G04166j3593k13844j19862M01184j42366j82868J23373k61187K90610n8776
$$ plain form
13795 667767 781484 511068 248716 903012 636998 746190 482964 766707 528166 859396
13785 859396 738773 887758 577696 961373 709388 507567 715991 682801 643287 566340
13775 566340 944235 547330 946169 560427 522634 932339 484736 713831 872579 523631
13765 523631 858465 1006680 789964 750458 402821 450933 653905 545825 586783 553074
13755 553074 506291 689342 806867 733311 725742 704687 465907 880253 584971 398896
13745 398896 494355 485979 356547 659119 264024 603309 541615 479503 758289 663809 526643
13734 526643 420430 712615 442024 498062 576933 349829 578520 669090 285169 704166
13724 704166 690573 476729 356867 758051 615685 432817 556190 295003 585613 526837
13714E26837j28209K79679K19237k60371N1212J47852A74005J76340j4600Q9176
13704D24921m8797A59587M42580j79624K69794B27897L53931k02447K95293j0016
13694F64658o3475k5326j09710M16142m27817j31023K55664K01747F4001K45602
13684C09603M14946j83205j39992J41299O9103K02361L0561k47112j80314J79848
13674E97098O4042k69403M790j68723M16272R8557B14769L04694A35933N05965
13664F41898K2975k6375n5516j4072A49966O17346B35383J80786L4763K15428
13654F66360M5057k59730j28378N3316K17784B23080J56217l8829P43Q8539j55660
13643B74090A33687M29802j61055O3318o9332J08037o1898j58164K7408L32657
$$ plain form
13714 526837 398628 678307 897544 637173 688385 836237 174005 350345 335745 424921
13704 424921 376124 159587 602167 422543 692337 227897 581828 379381 674674 664658
13694 664658 601183 575857 466147 882289 454472 323449 579113 780860 64001 309603
13684 309603 724549 541344 401352 542651 611754 814115 844676 597564 417250 597098
13674 597098 661140 391737 396527 227804 644076 742633 214769 519463 135933 641898
13664 641898 664873 638498 582982 568910 149966 767312 235383 416169 450932 666360
13654 666360 711417 451687 323309 376625 594409 223080 379297 340468 341211 429750 274090
13643 274090 133687 563489 402434 465752 396420 504457 442559 284395 311803 644460
13633F44460D0615L37468m2266J33641N5786j47895m0930M0047J19668j53439
13623C42695j1596A14682K55645P146b5215B87653L52797B77526K7941P9187J08740
13612D93394j90142p4113J71677j2822j41149D8815M29443k3632K08991B23095
13601E79513G9411N83463B00143F5260K39570M1633J19950j56006j19676K93280
13591D84011P9641k28208R5867q3628j36382F755N86708A01757Q9564N64183C9049
13579B73780A17586N17973j47180C6678L84351D7804K40649m7058J82626j29550
13569B94471B3441a1953F21703i7222D7987L06239K25497B58806b3176B84541
13558D78005A50247L6799M9038P1418l8177J95148A17550L76460K3127K2412j34932
$$ plain form
13633 644460 40615 378083 335817 469458 525244 377349 336419 376466 496134 342695
13623 342695 331099 114682 370327 377473 -25215 287653 640450 277526 305467 384654 493394
13612 493394 303252 229139 400816 387994 246845 48815 478258 454626 663617 223095
13601 579513 79411 662874 200143 65260 304830 346463 466413 310407 190731 484011
13591 484011 563652 335444 431311 347683 211301 6755 593463 101757 191321 755504 39049
13579 273780 117586 635559 488379 36678 421029 47804 288453 241395 424021 294471
13569 294471 23441 -11953 621703 -97222 47987 354226 579723 258806 -23176 284541
13558 478005 150247 187046 236084 307502 269325 464473 117550 494010 517137 539549 404617
13547D04617Q116j57322J06975D9618N61151H3966M36498k25083J36132m6027
13537C85486h2705B12378D6213P18505I8079K63359j18641J42235A49304J81182
13527C30486B0079L07379J02331k1703q8591n9559J617J94074j50573c8759C78315
13515D41679J525B14251l5396N1305J36747q1658J1136O8810m1262j51947L6049
13504B08035l1216K29851j49390J04936j50987L37691j39581j30586j1699c8214
13493C50257C6635K54535r1334p9257J23554N9807A03453K17231J70985J58587
13483F50256B59892J09532R2475B05374o0566O0502p7736L23203B10589o5192
13473A45397L73104j45399l9894b5341C56548j28505p0456J94309A06138L3388
$$ plain form
13547 404617 412733 255411 362386 49618 610769 83966 520464 295381 431513 385486
13537 385486 -82705 212378 46213 764718 98079 361438 242797 385032 149304 330486
13527 330486 20079 327458 429789 408086 319495 259936 261553 455627 305054 -38759 378315
13515 441679 443204 214251 178855 230160 366907 285249 296385 365195 323933 171986 208035
13504 208035 176819 406670 257280 362216 211229 548920 409339 278753 267054 -38214
13493 350257 36635 291170 199836 120579 244133 303940 103453 320684 491669 650256
13483 650256 259892 369424 461899 205374 144808 205310 127574 450777 210589 145397
13473 145397 518501 373102 333208 -25341 356548 228043 157587 351896 106138 139526
13463A39526Q3720R0455m2295q5824L5102b13064A86835P6088l8077D5518K21534
13452B67052A16475J78470M6020I4312J57804P9051A08171L2578J91628J3928
13442C46305r1401J10315j13264L45538k66605H751K79864F0607M72985f0411
13431D19851H5263L13372H5659k1466Q1809K19325j49880G5130J59099j08160
13421A26069M59561D7063m735e3515C29813J5880D6967J53981J95921l4981d5617
13409a21554K5109O957H8250J80358G3535a18683H9119c6801A51209J98180b20934
13397B59918a78220b3662C78362A84180P3415K17421A52666K58661A61572K30320
13387C91892j07196q0763i6277B96038J48302i3026B22980o5311K45049J54345
$$ plain form
13463 139526 223246 313701 271406 185582 220684 -213064 186835 262923 224846 45518 267052
13452 267052 116475 294945 340965 94312 252116 331167 108171 140749 332377 346305
13442 346305 254904 365219 251955 597493 330888 8751 288615 60607 533592 -60411
13431 419851 85263 398635 85659 64193 146002 365327 215447 75130 234229 126069
13421 126069 585630 47063 42328 -53515 329813 345693 46967 200948 396869 361888 -45617
13409 -121554 -96445 -89488 88250 268608 73535 -118683 89119 -36801 151209 349389 -220934
13397 259918 -178220 -23662 378362 184180 257595 475016 152666 411327 161572 391892
13387 391892 284696 203933 -96277 296038 444340 -93026 222980 157669 402718 557063
13377E57063C0666K05299a25593A5284J45586n62L27576j71587j51768j2749K32296
13366C84076G0396J59357K60894k07448K56147B08999K2213J04146m0756M0991
13356C35593j19764r0348K51941H0605K19196f5341D94167I6775J73076j11827
13346A58024J41242j25428J64584j52560J49799n8458A14137g129C23191A18447
13335E14240n3009Q1078J3070B41577A18665J81046M8375J84118A5881L4032K10877
13324B60790i1751D2378h6677B19472A0004K49757J2646J13238A05980M85098
13314E91078A57203o0319J42811A18394n2490P7983J26542B5407O8872L67414
13304D61693A94320n1006d5758k23633H7484J55970b4423A49095g1876B97098
$$ plain form
13377 557063 30666 235965 -125593 15284 160870 160308 487884 316297 164529 151780 384076
13366 384076 70396 229753 490647 283199 539346 208999 231212 335358 294602 335593
13356 335593 215829 125481 377422 80605 299801 -65341 494167 96775 269851 158024
13346 158024 299266 173838 338422 185862 335661 277203 114137 -7129 323191 118447
13335 514240 461231 542309 555379 241577 118665 299711 348086 532204 15881 49913 260790
13324 260790 -91751 42378 -86677 219472 10004 259761 272407 385645 105980 591078
13314 591078 157203 96884 239695 118394 65904 143887 270429 25407 94279 461693
13304 461693 194320 143314 -45758 -269391 87484 243454 -24423 149095 -71876 297098
13293A3148R4486A6805h8829D46957h6414A1146J88266K66604M4228A709h6005
13281i0366C31962r1797A4908Q1282A7652L0743a48842A71610q0282O7226a05658
13269B84388A21605J50141j26667R9075a53708A87613J25260b6467C6517C999
13258D6751K36081J7221b28299I4489c8003A26456l9517L28687j85098J57596
13248C88124F2044b9097C35361p0030q5635p1915h955A15202k1568M49398D110
13236A41888m7861J66227J1767n5341a53998C63217j59345I4092b7322A53305
13225H3210h6064E11b68155b1066m5026B66188a76821A34632n2824a17741D41712
13213G2538A7574a48601C03072j49860L1249E8928J13852a87066F4645L63540
$$ plain form
13293 13148 107634 16805 -88829 446957 -86414 11146 199412 466016 510244 1709 -86005
13281 -90366 331962 240165 14908 96190 17652 48395 -148842 171610 91328 158554 -105658
13269 284388 121605 271746 145079 244154 -153708 187613 312873 -26467 36517 3999
13258 46751 282832 300053 -228299 94489 -38003 126456 86939 415626 230528 388124
13248 388124 62044 -29097 335361 265331 179696 107781 -8955 115202 93634 543032 4110
13236 141888 94027 260254 272021 216680 -153998 363217 203872 94092 -27322 153305
13225 83210 -86064 511 -268155 -21066 -66092 266188 -176821 134632 81808 -117741 441712
13213 72538 17574 -148601 303072 153212 184461 58928 172780 -187066 64645 428185
13203D28185a63077B71388B0905J50292m9221N3517o161j3701L5532R3028o4079
13192B20112r6526a47211k5884j2662N5050C89944p5953A23193A5897J07978N5472
13181A79347D4920J39842r1014N9640d0814j53098i0284H0822f827q3954B58590
13169D2772K91306i9831A98398J3211b25210C48522b49566C55289A26267K79872
13159D06139j88845A6855J95937l6614J48144I6656J1169D7035L4296P401a10211
13147F2099A5542d0343j6342I5684L98009f2180A84466J7030H0698C8386D183
13135A97926l343J62327j47685F2741a24983j18583D9120K6573f4026B03240R612
13124B12852M0633H5908J42569l4031F9184K6245J60151b6535o1004G2506g0618
$$ plain form
13203 428185 -163077 271388 20905 171197 121976 175493 169332 155631 191163 284191 220112
13192 220112 123586 -147211 -173095 -185757 -130707 389944 313991 123193 15897 123875 179347
13181 179347 44920 184762 93748 153388 -40814 -193912 -90284 80822 -6827 -90781 258590
13169 42772 334078 -99831 198398 211609 -225210 348522 -249566 355289 126267 406139
13159 406139 217294 16855 212792 176178 324322 96656 107825 47035 81331 88732 -110211
13147 62099 15542 -40343 -56685 95684 493693 -62180 184466 201496 80698 38386 4183
13135 197926 194583 356910 209225 62741 -124983 -243566 49120 75693 -64026 203240 212852
13124 212852 253485 85908 228477 194446 69184 95429 255580 -26535 -87539 72506 -70618
13112A37754J20284c0157B35088G2711a89331j10895J26889A35952b21886B31311
13101E1845K56496p5899A01599e2556I9062l6249a00491l9695J2817d3587k24752
13090b68339a18331N9131A32616g7095C12550A44435n0399N8613a14714A04793
13079A304L96289A50353h9919L5550B7502e7098A64988R7861C2735J2649K31998
13068B77382q0083f4777n6661G3625K9129b45882A78541a88674B06464b39769
13057B05717G3433K28290a06819A61112b536k5465j79050B0715J99690h7733C08023
13045F0187J21572b49209e3887F6601K28495C5406K11193a25759C0053L34361
13035C64414j23729j12141h556D1623J2909N1972a21787B30530b78535a19381
$$ plain form
13112 137754 258038 -30157 235088 72711 -189331 -300226 -173337 135952 -221886 231311
13101 51845 308341 232442 101599 -52556 99062 62813 -100491 -140186 -127369 -43587 -268339
13090 -268339 -118331 -59200 132616 -77095 312550 144435 94036 152649 -114714 104793
13079 1304 397593 150353 -89919 -54369 27502 -57098 164988 262849 32735 45384 277382
13068 277382 197299 -64777 -121438 73625 102754 -245882 178541 -188674 206464 -239769
13057 205717 73433 301723 -106819 161112 -2536 -28001 -207051 20715 220405 -87733 308023
13045 60187 181759 -249209 -53887 66601 295096 35406 246599 -125759 30053 364414
13035 364414 240685 128544 -8556 41623 54532 106504 -121787 230530 -278535 -119381
13024f0611A91438Q5958A878J53321J60549F5802b6259j21655C03613j49847K71452
13013D25218F4734a08156c9350A43186j7272K43007A45253J5290j7137k4282L56254
13002D75378i8277F337i998j76511h6967E6856L27787f158B7025J7462J11315
12991A55802k3234j1361k7476O7136L0515a14766B4677J0781J55288r3010e4211
12979E15034A22750k4723j6901a90857F3747b30212B97493l6338g0101B68112
12968B70328b24514B69295j23138b84535B69926q0900H2249f7236l9310C4619
12957A69380g3738G5838N6209f1434B16244C3656f3654A08016J54598G4900n535
12946F9365M0352K5526J59655A4321d11370D4238M9686D6225M58442A14918j3201
$$ plain form
13024 -60611 191438 277396 1878 155199 315748 65802 -26259 -147914 303613 153766 425218
13013 425218 64734 -108156 -39350 143186 125914 368921 145253 160543 143406 119124 475378
13002 475378 -98277 6337 -9998 -186509 -86967 56856 384643 -6158 27025 44487 155802
12991 155802 132568 121207 93731 160867 191382 -114766 24677 35458 190746 97736 -54211
12979 515034 122750 98027 81126 -190857 63747 -230212 297493 261155 -70101 268112
12968 270328 -224514 269295 146157 -284535 269926 189026 82249 -67236 -106546 34619
12957 169380 -73738 75838 132047 -61434 216244 33656 -63654 108016 262614 74900 69365
12946 69365 109717 135243 294898 14321 -411370 44238 93924 46225 504667 114918 101717
12935A01717a19466G4846a27714C2280J53879E7283a92153Q9937L0522k26774
12925b98468D9712J9400a80802A61820O2341b30302A21426k8625a86072L6281
12915a49791M3280J0129A32106D7578j0425b2280H2599J00462a25106A64229B4525
12903A0698R4032f715p7220k7353j42746J17075A23770O9380K14241e6649F3045
12891d2052H9888C1520K44090C5069a27869F6502K59862e870j21475B52847e2394
12879H1259A6859g2500B02749c47249J71311j07689G4098B6625d1321l14557O3232
12868b92646J35922A71636j4651a05693J4180K323A50153e6503H5391l0940O4139
12857A18590c4710A1055J53150o2477g3828G6765O5533b9058C0754K0194L8925
$$ plain form
12935 101717 -119466 74846 -127714 32280 186159 57283 -192153 -102216 -71694 -298468
12925 -298468 49712 69112 -180802 161820 224161 -230302 121426 92801 -186072 -149791
12915 -149791 -106511 -96382 132106 47578 37153 -22280 82599 183061 -125106 164229 24525
12903 10698 104730 -6715 -83935 -111288 -254034 -136959 123770 193150 407391 -56649 63045
12891 -42052 89888 31520 275610 35069 -127869 66502 326364 -5870 -127345 252847 -52394
12879 81259 16859 -72500 202749 -347249 -175938 -283627 74098 26625 -41321 -355878 -292646
12868 -292646 -156724 171636 156985 -105693 -91513 -89190 150153 -56503 85391 54451 118590
12857 118590 -34710 11055 164205 101728 -73828 76765 142298 -29058 30754 50948 89873
12846H9873d1006H6160a41421H8740J71730a35140I3018H647i0479J1435B71275
12834A52612C9670b3621k25568A41666a85131B62709I2505b1461r5632A7279b63020
12822E7577L6783J73874F2931k6831a84236h5314o5248Q926C176i6397e117G6975
12809a06448k4910F4359O0924D1473a03238E1242c1181H4495e4255j99003h474
12797F1234a23657j07010G3820K15351F9043L16537b8808H1394J59411e4669Q308
12786d6361A33915n5897f911m6806B5198Q6214c3513D44254j61160G8081M8834
12775A26915P8748p8697a25231e1581A13018j8718K2907a28516B48267A02781
12764e7790K1704k22770B3980c7707q8022D73922e0758A68423p6375h6970j6168
$$ plain form
12846 89873 -41006 86160 -141421 88740 260470 -135140 93018 8647 -90479 -79044 271275
12834 152612 39670 -23621 -249189 141666 -185131 262709 92505 -21461 -117093 17279 -263020
12822 57577 94360 268234 62931 36100 -184236 -85314 -150562 -141636 3176 -96397 -5117 76975
12809 -106448 -131358 64359 125283 41473 -103238 51242 -31181 84495 -54255 -253258 -8474
12797 61234 -123657 -230667 73820 289171 69043 385580 -28808 81394 240805 -54669 -46361
12786 -46361 133915 78018 -6911 -53717 25198 111412 -33513 444254 283094 78081 126915
12775 126915 205663 126966 -125231 -51581 113018 94300 117207 -128516 248267 102781
12764 -57790 -36086 -258856 23980 -37707 -125729 473922 -50758 168423 92048 -86970 -103138
12753a03138A87184b01290j20074I1926b39879d751B18123a74566g2246E5315
12742a88604K6424j51414D8863a03680M6000b6902A24966A4914Q9415o99J14433
12731B18063l7699B7562N5454c8103A21045R0109d35660G4290h4784j05940q1237
12720b71961B93988F6852J69404b09390q3264Q6923g1264B3179K63435l3350J5241
12709B68505o5612K36515h314j5340j02858C01323O3960a53232C38239f1091A70062
12697E9193J21295J5838I4731i8060R786A10196b0720j46905H7657H343L66391
12686C74734H0033K38848A19078h1626C22570a45311C58292a08719d0157J1650
12676b8507A5401b03228B08113a23085r2182H9852K49789a05719A65732n662G9459
$$ plain form
12753 -103138 187184 -201290 -321364 91926 -239879 -4751 218123 -174566 -72246 55315
12742 -188604 -162180 -313594 48863 -103680 -57680 -26902 124966 14914 104329 103630 218063
12731 218063 180364 27562 83016 -38103 121045 211154 -435660 74290 -84784 -190724 -271961
12720 -271961 293988 66852 236256 -209390 -292654 -205731 -71264 23179 286614 253264 268505
12709 268505 202893 439408 -8314 -23654 -126512 301323 365283 -153232 338239 -61091 170062
12697 59193 180488 196326 94731 -98060 -88274 110196 -20720 -167625 87657 8343 374734
12686 374734 80033 318881 119078 -81626 322570 -145311 358292 -108719 -40157 -28507
12676 -28507 15401 -203228 208113 -123085 -215267 89852 339641 -105719 165732 160070 79459
12664f9245C48012j33979p9850e1760A19655B0233L2259a03004D80786A51841
12653A91232a77755c9340l1781B13557c23036A11698f8197A32917c6543j09884
12643a46427D1741P2693a43494q6144A96896O3296k3767J23786A37042K07591
12633C44633I4567K57874A29540J959D6697a1665A66714F6982K16498b6996m2804
12622f9800B85694c5090m06778f8054A67379a55786k0741A55746a70385P3840
12612i6545B4703J73650a65426k1670H7254Q9295b69884A51157k5718P9300L2147
12601B36886a0809B6079Q549f4266I4795P6106k3197b26374E3196i9788B66273
12589A05462f5363A10065a04540L9751O976p795r7709A02993f3407j08453l1086
$$ plain form
12664 -69245 348012 214033 134183 -51760 119655 20233 52492 -103004 480786 151841
12653 191232 -177755 -39340 -71121 213557 -323036 111698 -68197 132917 -36543 -146427
12643 -146427 41741 114434 -143494 -229638 196896 260192 236425 360211 137042 344633
12633 344633 94567 352441 129540 131499 46697 -11665 166714 66982 283480 -26996 -69800
12622 -69800 285694 -35090 -441868 -68054 167379 -155786 -176527 155746 -170385 -96545
12612 -96545 24703 198353 -165426 -187096 87254 176549 -269884 151157 125439 204739 236886
12601 236886 -10809 26079 34628 -64266 94795 170901 147704 -226374 53196 -99788 266273
12589 105462 -65363 110065 -104540 -64789 -57813 -65608 -163317 102993 -63407 -171860 -202946
12578b02946I7841Q4063h0340n4043o702A04405a57264l3801H247a28507m0248
12567a68755f2193k31718E254a01481L7490k46236A25724E6244J86652j10882
12557A32014Q3808A1034b88134J16625f4915j68998P2724A14559E155b41204C68146
12545E6071M873Q9610n672d8175C40774a18156A11686a18141m1272q7421A02020
12533C7545J86272n9884q1865C0279M6938a66038C6268a14414B00723c2997B8604
12521B44763B8624c7639B45839a51571A69256J488K83036J07548l6637j83172
12511C41519J2919C7055O71738a1586A78035M6787J64414i059A03865a28624B55565
12499a03492k8964A9296P4175N3285K06244G8243K45233A10015c97878f326A05719
$$ plain form
12578 -202946 97841 181904 -80340 -134383 -141085 104405 -157264 -191065 8247 -128507 -168755
12567 -168755 -62193 -293911 5254 -101481 -63991 -310227 125724 56244 242896 132014
12557 132014 215822 11034 -288134 -171509 -64915 -233913 -161189 114559 5155 -241204 368146
12545 56071 60944 150554 144882 -48175 340774 -118156 111686 -118141 -159413 -246834 102020
12533 37545 223817 163933 82068 30279 77217 -166038 36268 -114414 200723 -32997 28604
12521 244763 28624 -37639 245839 -151571 169256 170744 453780 561328 524691 341519
12511 341519 354438 37055 708793 -11586 178035 224822 389236 -9059 103865 -128624 255565
12499 -103492 -132456 19296 93471 146756 353000 78243 323476 110015 -397878 -6326 105719
12487A77800N9771a11739D49446L33934B2208a38588E55182A87235L7250q526
12477B15959g1723b6431B87498a5205m7377G1990L6119J09876G4999a31406l22569
12466d53975a84309k2168o1745b9088C29440H3172B6963J84516b15210B10682
12455H3914Q8228G6206K0810K00495a19333A97952f5695C704c51417C6856a81481
12443c71918J01405B19677d4916p2327A05413a59536C199J5647J0243J61356a7401
12431f6607l7601H4502j5610a40869B7487a30580k6014p744B52799A8421J0769
12420B9190K2545b09283A84057a06015B14029A3363b06865e8408k4276n1441A78451
12408A01362a43513e2550A93642A0664c42933C2206a68551j6303h5640n1160d7185
$$ plain form
12487 177800 237571 -111739 449446 783380 22208 -138588 555182 187235 224485 215959
12477 215959 -71723 -26431 287498 -15205 -62582 71990 108109 217985 74999 -131406 -453975
12466 -453975 -184309 -206477 -268222 -29088 329440 83172 26963 211479 -215210 210682
12455 83914 172142 76206 97016 297511 -119333 197952 -65695 3704 -351417 36856 -181481
12443 -371918 -270513 219677 -44916 -117243 105413 -159536 3199 18846 29089 190445 -17401
12431 -66607 -104208 84502 68892 -140869 27487 -130580 -156594 -164338 252799 18421 29190
12420 29190 51735 -209283 184057 -106015 214029 13363 -206865 -58408 -82684 -134125 178451
12408 101362 -143513 -52550 193642 10664 -342933 32206 -168551 -184854 -85640 -136800 -47185
12396a35488e4080B56897F4404O6288C6634K5767O0408J87337a32333q2518Q053
12385b06798p414C41896a09211C27383I3278K02986B6414O5200j9422C4924J00709
12374A35633a53257J4215P828B16199E7885h0886A24913h8583A18279b4840l4229
12363e9069l52967A6578c0673k57742H239h8910E3084a85864B40221q3724J39842
12352B96339a13484G2870a16376G5490d7518j40666B05503b25144a05124L6422
12342f8702c466D0698a56801C53234b52969A71013b14859C18906j23307O897a05665
12330d8313A48748k2434E1252h0634A57190F1579J05409e1071E19c6899K905C31704
12317B80492q9174J1800E4921d9757k7459A54987J511N8831e6204E5234M0626
$$ plain form
12396 -135488 -54080 256897 64404 130692 36634 62401 122809 310146 -132333 -214851 -206798
12385 -206798 -214212 341896 -109211 327383 93278 296264 26414 91614 72192 34924 135633
12374 135633 -153257 -139042 -131214 216199 57885 -80886 124913 -88583 118279 -24840 -59069
12363 -59069 -412036 16578 -30673 -288415 8239 -88910 53084 -185864 240221 156497 296339
12352 296339 -113484 72870 -116376 75490 -47518 -188184 205503 -225144 -105124 -68702
12342 -68702 -3466 40698 -156801 353234 -252969 171013 -214859 318906 195599 202496 -105665
12330 -48313 148748 126314 51252 -80634 157190 61579 166988 -51071 519 -36899 -33994 331704
12317 280492 191318 203118 54921 -49757 -77216 154987 156498 215329 -56204 55234 95860
12306I5860c34478A43693J7749a87730j47755a4574p2745q873J8000C46369c34200
12294B02941i4315A54617i6329A64697a53993F420L29045m6491g3120B77998a26784
12282A4480L3348a14166N1141F9398k7033J72214o6781P8547M6822c07933A05124
12270B64358h6491A18117E7762J64812Q6776c1330B44537h9634F8949h6729A61815
12258a01282A33166e8328H000i3841D4688f1868A51281o689i8803D96025a2806
12246B3466d68j04474B84434C4138c95265e899C40736A03411b4723A04232J17256
12235B21488G4337b0064o8100E9987b58155H3042O3985b0841F0404L6699c8335
12223F3536J54040J07301A24217J83657R4665d5928B54724K70489k12021J5014
$$ plain form
12306 95860 -334478 143693 161442 -187730 -335485 -14574 -87319 -96192 -78192 346369 -334200
12294 202941 -94315 154617 -96329 164697 -153993 6420 335465 288974 -73120 277998 -126784
12282 14480 47828 -114166 -63025 69398 42365 214579 147798 226345 273167 -307933 105124
12270 264358 -86491 118117 57762 222574 309350 -31330 244537 -89634 68949 -86729 161815
12258 -101282 133166 -58328 8000 -93841 44688 -61868 151281 144592 -98803 496025 -12806
12246 23466 -468 -104942 284434 34138 -395265 -5899 340736 103411 -24723 104232 221488
12235 221488 74337 -20064 -88164 59987 -258155 83042 147027 -20841 60404 97103 -38335
12223 63536 217576 324877 124217 307874 402539 -45928 254724 525213 313192 328206
12213C28206b8052C00473J91438F959N13800j37848A40924J17314A06212J8077
12203A24289K3284m183K3016b4945A04592J36043J04157F7614L28105j97445k715
12192A95559Q8612J87241o9102j3016j49436q8238L70547j3572A42317L920D7142
12180C40601I5523J25942p761g3050A32782O7628d8567m1348C09875n9715h7277
12168A3084J14399l5902K644J29994D8024K42672E5656J52497o7964L4490H0406
12156C09879G9388O2523m9865B6973J65324l8918J45822j11262O3675n139B650
12144d1904H4145J4104J87706j10453o4878J26829b1118B76360P1219A15534d4206
12132D55755A89523b4156A95456a39452j6621A49540K2192O1078n4992H2657J05422
$$ plain form
12213 328206 -28052 300473 491911 6959 520759 382911 140924 258238 106212 124289
12203 124289 147573 143390 166406 -24945 104592 240635 344792 67614 395719 198274 195559
12192 195559 284171 471412 402310 389294 239858 151620 522167 508595 142317 146237 47142
12180 340601 95523 221465 213704 -73050 132782 200410 -48567 -89915 309875 250160 -87277
12168 13084 127483 91581 94225 224219 48024 290696 55656 208153 140189 174679 80406
12156 309879 79388 141911 92046 26973 192297 153379 299201 187939 251614 246475 2650
12144 -41904 84145 98249 285955 175502 110624 237453 -21118 276360 347579 115534 -44206
12132 455755 189523 -24156 195456 -139452 -156073 149540 171732 232810 177818 82657 188079
12121A88079i3788A08407J04228o0584A904Q944a06664A25519e0433I0491a0497
12109a21399A13566b03645b1200j04481j14420J20019j10160f6192k28019A92853
12098a66214A19076A963d6272i495B31838p0188J16635i6324B57883p7348A5144
12086H8986N7515e1640j77791g7285L3149A28624J55021f0185a3802A37017B1753
12074A03464J3405f2083j8908f324j77097Q4693J1531r5165c9190k00619A68338
12062D12302n1219A17939a25883B67275Q1809h3355L5592H8466C9041h8170E9484
12050H2579f6218J1779B20679q7065J40325a61347f3927m6285j07147f4784A35489
12038b30720j68137a11573G3858d0714o8944q3274A67587A7216a77428p2816i2622
$$ plain form
12121 188079 -93788 108407 212635 152051 1904 10848 -106664 125519 -50433 90491 -10497
12109 -121399 113566 -203645 -21200 -125681 -240101 -120082 -230242 -66192 -294211 192853
12098 -166214 119076 1963 -46272 -9495 231838 161650 278285 -96324 257883 180535 15144
12086 88986 146501 -51640 -229431 -77285 -44136 128624 283645 -60185 -13802 137017 21753
12074 103464 116869 -62083 -80991 -6324 -183421 -98728 -87197 -182362 -39190 -239809 168338
12062 412302 361083 117939 -125883 267275 349084 -83355 -47763 88466 39041 -88170 59484
12050 82579 -66218 -54439 220679 133614 273939 -161347 -63927 -110212 -217359 -64784 135489
12038 -230720 -398857 -111573 73858 -40714 -109658 -192932 167587 17216 -177428 -250244 -92622
12026g8262B78214c8314D1479c11830R2786A55491a08589k00069f8986G8031b65031
12014a47639d5753a8761d080E68800A04852N176b04910M0306K877d3639o881A29481
12001b8986j05284B06663B0337k924a86900P4898d9395g806r8494d3109B05145
11989B976P1476a31886H4512L3265f2222C00525G6915a4257r3147k6608M5734
11978h8278A78878a57845G6106P3786b81601F390P4705k0552a05984k66198C4618
11966c91717B36756C797b79924J33240A30042R5284p5323a54522B36160g733j95860
11955b03593C22202A25056f3594p2604B04314i6288A71603a40950m6200b3652
11944i4932j47324F1152B2558h3227q2987A66533F6616b37281H3070b21731l756
$$ plain form
12026 -78262 278214 -38314 41479 -311830 -219044 155491 -108589 -308658 -68986 78031 -265031
12014 -147639 -45753 -18761 -4080 568800 104852 110028 -204910 -164604 -161727 -43639 -50520 129481
12001 -28986 -134270 206663 20337 17413 -186900 -112002 -49395 -7806 -106300 -43109 205145
11989 2976 74452 -131886 84512 117777 -62222 300525 76915 -14257 -107404 -134012 -88278
11978 -88278 178878 -157845 76106 149892 -281601 6390 81095 60543 -105984 -372182 34618
11966 -391717 236756 3797 -279924 -146684 130042 225326 150003 -154522 236160 -7733 -203593
11955 -203593 322202 125056 -63594 -136198 204314 -96288 171603 -140950 -187150 -23652
11944 -94932 -242256 61152 22558 -83227 -166214 166533 66616 -237281 83070 -221731 -225487
11933b25487h9017A5042b08074d6922A84773a77932B4532R4915d2733r7675C88197
11921I844J57875C9088i8076C6742r188O7810a19755A17303J22874C619g4354
11909F5635J55255F9462d28650a77746N441N1652D07539d2056k15232M8553Q9982
11898a18753c8337j33338k9812f5552A38506n8359b44270J07316E4682h9621E3402
11886a03568c6553k25125I0350a63420A37386J78320b22054L5827G2182d48672
11875A66132B1444a19512K8398J9577I913a66158c9427o7180n7020A4376Q932
11864B3308a40512A17330a80017M0194f1240j26985H7362a44434L2641A57094
11853b17399B4749c71250a2598m0504l0806J3092K3471j1491r9362I521J46017
$$ plain form
11933 -225487 -89017 15042 -208074 -46922 184773 -177932 24532 119447 -42733 -140408 388197
11921 9844 167719 39088 -98076 36742 27554 95364 -119755 117303 240177 3619 -74354
11909 65635 220890 69462 -428650 -177746 -172305 -120653 407539 -42056 -257288 -208735 -118753
11898 -118753 -38337 -171675 -201487 -65552 138506 80147 -244270 -136954 54682 -89621 53402
11886 -103568 -36553 -261678 90350 -163420 137386 315706 -222054 -186227 72182 -448672
11875 166132 21444 -119512 -91114 -71537 9913 -166158 -39427 -106607 -163627 14376 23308
11864 23308 -140512 117330 -180017 -139823 -61240 -188225 87362 -144434 -111793 157094
11853 -217399 24749 -371250 -12598 -53102 -83908 -70816 -47345 -58836 -158198 9521 155538
11842A55538a67531A34294A1315a95009r9655F3929e3206p5038e2110k18133e3703
11830f5734G011J8857j1460M222c85871A3065a49513D72882g286j41486K5250
11819a23522I7347b32050P0364B42806A17467e3268J3971J0236m0745j2156r2193
11808a74155r0253C1249q691M7258Q7071a06092k15119C58605j66182F5127c38390
11796a80693H280b26157A70686a18495i639k42803f2220A21521b08918I4895E429
11784E7767K7484a94950B24019p5521p3629a24280K2030C41918A8918K14263K734
11773B35915H7498P4086c95048B90495a11576k0425A53358o0197h2439A15354
11762a11645j58991L4151B20189H2391b34717Q6284B05590c37637J62983i531
$$ plain form
11842 155538 -167531 134294 11315 -195009 -294664 63929 -53206 -128244 -52110 -270243 -53703
11830 -65734 7011 25868 14408 18630 -385871 13065 -149513 472882 -7286 -148772 -123522
11819 -123522 97347 -232050 -161686 242806 117467 -53268 -39297 -29061 -69806 -81962 -174155
11808 -174155 -264408 31249 22558 69816 156887 -106092 -321211 358605 192423 65127 -338390
11796 -180693 8280 -226157 170686 -118495 -9639 -252442 -62220 121521 -208918 94895 5429
11784 57767 85251 -194950 224019 148498 74869 -124280 -102250 341918 18918 233181 235915
11773 235915 87498 161584 -395048 290495 -111576 -132001 153358 93161 -82439 115354
11762 -111645 -270636 -236485 220189 82391 -234717 -148433 205590 -337637 -174654 -9531
11751a41162B0438J06609J53039a55313j6042A04067a42386F0971i6258B59911
11740a78279g4609l763B4357M310b64427a28250b1954E13924f226r2496j35288
11729b34010J10253D1526N4137Q783a25198l92349e1701j25647j33219b4086j03887
11718a27973g182k00653B60848J6693A30286b59158b8908A41109J06127b3249
11707b2666l0586m31575b23344B3317n67a49906D1257M22669D9204a78338a5006
11695A86088A8854K51958e4603C4186h6236D0769j9782Q8897M3788p2952F116
11683B71163j25146a63438M3335N6752A16327f8195q7681b7511C38946N9871e5695
11671a88799f7002k41546C36824B0910O4833K6143L9069b4799j39747D41607F3629
$$ plain form
11751 -141162 20438 127047 280086 -155313 -171355 104067 -142386 60971 -96258 259911
11740 -178279 -74609 -78372 24357 28667 -264427 -128250 -21954 513924 -6226 -98722 -234010
11729 -234010 -123757 41526 95663 104446 -125198 -517547 -51701 -177348 -310567 -24086 -127973
11718 -127973 -7182 -207835 260848 277541 130286 -259158 -28908 141109 247236 -23249
11707 -22666 -53252 -484827 -223344 23317 22750 -149906 41257 463926 49204 -178338 -15006
11695 186088 18854 270812 -54603 34186 -86236 40769 20987 109884 153672 80720 6116
11683 271163 146017 -163438 -120103 -63351 116327 -68195 -155876 -27511 338946 398817 -55695
11671 -188799 -67002 -308548 336824 20910 85743 111886 150955 -24799 -164546 441607 63629
11659c46393J47563k35949a56668B83796A7832q562b57291a12565J0163F0388
11648A07247h6016n8559N6342C24965j01853q1065d4584A72107g5022A93877H3437
11636a39491A30822b62110F5164b57828l2941A38479g6168K3496D5000a28563
11625B05313J43478n6006A3646C705e3519j34403c1631l5504A19470b67709A15035
11613a58001F5440D710n39L6593a85869l6986H9967b9523n8393G4447r502J05906
11601A70851B9193c43717A71443a8871k22732J2944Q4914A26543a3871O410j04699
11590a12160q3381f2908B32329g3354l13428A35742a42779H5752C4985h282B12843
11578a9803j60843O2040B19042j07130b3093A3749J94831f6322p8081A43251a08219
$$ plain form
11659 -346393 -198830 -434779 -156668 283796 17832 9270 -257291 -112565 -102402 60388
11648 107247 -86016 -144575 -88233 324965 223112 142047 -44584 172107 -75022 193877 83437
11636 -139491 130822 -262110 65164 -257828 -290769 138479 -76168 -52672 45000 -128563
11625 205313 348791 292785 13646 3705 -53519 -187922 -31631 -67135 119470 -267709 115035
11613 -158001 65440 4710 4171 40764 -185869 -222855 89967 -29523 -87916 74447 64945 170851
11601 170851 29193 -343717 171443 -18871 -241603 -228659 -143745 126543 -13871 -7461 -112160
11590 -112160 -195541 -62908 232329 -73354 -386782 135742 -142779 85752 34985 -8282 212843
11578 -19803 -180646 -118606 219042 111912 -23093 13749 208580 -66322 -144403 143251 -108219
11566d8785B71646b50205J20099M018A50013B5617e6221A44112J93780b01516
11555B31237c1917n1588j87186E8416j8244N2204l7147O4061n4926A2342K03416
11544B15758k8215c26176E63467B13511k3357J01457A5984d0765k27590A98329
11533D0269c05046B91332a4574D9517b58207A56487k2168r281m1061l6178J52940
11522B00739c89433A7688b6467A31419j8393J3738L7896k1076L04440b1035o7936
11511h8971G0469c6342B20448a15860A06891L32881j65690p5637c24837B35001
11500B8624Q8494J41441l3738H1574J18605J4990r1675b82593B15661J54299a03607
11488D1981Q7937J23189K1870a21399F2075K04403E4294J69513n1200F7434C2273
$$ plain form
11566 -48785 271646 -250205 -130106 -126088 150013 25617 -56221 144112 337892 -201516
11555 231237 -31917 -83505 -270691 58416 40172 92376 55229 119290 64364 12342 215758
11544 215758 187543 -326176 563467 213511 190154 291611 15984 -40765 -268355 198329
11533 40269 -305046 291332 -14574 49517 -258207 156487 134319 125038 83977 47799 200739
11522 200739 -389433 17688 -26467 131419 113026 126764 164660 143584 448024 -21035 -88971
11511 -88971 70469 -36342 220448 -115860 106891 439772 274082 198445 -324837 235001
11500 28624 117118 258559 224821 81574 200179 215169 123494 -282593 215661 369960 -103607
11488 41981 129918 253107 274977 -121399 62075 266478 54294 223807 172607 67434 32273
11476B20022q4864r444O9317m0798n7835J7288O8913J5648r8260a93212C27397
11464D31830F8801g9614B93724N900d3887C95878m0242C2808O8046C3402b68180
11452E8727A7020g3606D13738a79378A83510J55687A15604J80551b6379E9396
11441A37797f4017H626M0778K64540A24707J44079p7856F1532J10432K74330a52345
11429A65149L7882b86136D6221J95833b77094A06030P488M8328h6484j61191D027
11417C959f7426j05325A41650f4232A49660E9671L79182F016K99227a2059q9221
11406a01280A0755g1773I3323L2612f1662B67323E8143B1384g6537E9491J37355
11395A96846r1587Q666e4809F8266J43028e14675a04056k09152a885A85717G6577
$$ plain form
11476 220022 135158 125714 195031 154233 96398 113686 182599 198247 99987 -193212 327397
11464 431830 68801 -79614 293724 299624 -43887 395878 355636 32808 100854 33402 -268180
11452 58727 17020 -73606 413738 -179378 183510 339197 115604 296155 -26379 59396
11441 137797 -64017 8626 49404 313944 124707 268786 190930 61532 171964 446294 -152345
11429 165149 203031 -286136 46221 242054 -277094 106030 113518 161846 -86484 -247675 4027
11417 3959 -67426 -172751 141650 -64232 149660 59671 438853 6016 305243 -12059 -101280
11406 -101280 10755 -71773 93323 125935 -61662 267323 58143 21384 -76537 59491 196846
11395 196846 105259 113925 -54809 68266 211294 -514675 -104056 -313208 -1885 185717 76577
11383d21449J83756E1577b31428A02628P1040b31577Q0486H2462b64533b1665
11372a79663D8205a79755A78679N5681a84096A65104h2777C10261b45340B02751
11361c9937j13734G1471g4130k55646J19516m4256a7105k62938A8217g1327A24502
11349E5300k3767f0070D1539b4787B07348B9412h768A33198q744b92308A32558
11337a61283B01919q468K9984a35209j1152C23229A03403b72556d2494q7778j87139
11326c17411J55718c2736k5979l7534gp9495E0196a02450e0435b2405A52722c44342
11313A42167L8451a38581B197a56981a100C13224d8822A15629A396a1890k02732
11302b14622I8774b01129j28336d4161j98978P5482o0970A02154C9643d11637
$$ plain form
11383 -421449 -237693 51577 -231428 102628 173668 -231577 -151091 82462 -264533 -21665
11372 -179663 48205 -179755 178679 234360 -184096 165104 -82777 310261 -245340 202751
11361 -39937 -153671 71471 -74130 -329776 -210260 -254516 -17105 -280043 18217 -71327 124502
11349 55300 31533 -60070 41539 -24787 207348 29412 -8768 133198 124454 -292308 132558
11337 -161283 201919 193451 223435 -135209 -146361 323229 103403 -272556 -42494 -130272 -317411
11326 -317411 -161693 -32736 -58715 -96249 -7 -79502 50196 -102450 -50435 -22405 152722 -344342
11313 142167 180618 -138581 2197 -156981 -1100 313224 -48822 115629 1396 -11890 -214622
11302 -214622 98774 -201129 -329465 -44161 -243139 -167657 -228627 102154 39643 -411637
11291b11431h3933A05895f5598j74610D4473J3776d7099j67123A7303e335A64275
11279i0801k66377B14270L465D5070a85232j04389h1286r5247D9606b25027J07347
11268a17680d6148I8063O6374a78272D8978L1442f9686j33904k96287F6114f1811
11256a18378j31333h3489j64536A17253a77529k83058a48779j3444D973g5006
11245a61469j14780D4433F204g5913C09669b09477A79671a44075K0106N0830G0543
11233B9977P4770b40980j54559a85440B37543E4935k2502J32625N1353c42205
11222a6144A62849E3694O3971e8493B31613m5813b7871A444a40394A7861L4648
11211E2509a19106J8965A26225b21887D9970J02891a22302E8773A7635J66097
$$ plain form
11291 -211431 -83933 105895 -65598 -240208 44473 58249 -47099 -214222 17303 -5335 164275
11279 -90801 -357178 214270 217735 45070 -185232 -289621 -81286 -176533 49606 -225027 -117680
11268 -117680 -46148 98063 164437 -178272 48978 80420 -69686 -203590 -499877 66114 -61811
11256 -118378 -249711 -83489 -248025 117253 -177529 -460587 -148779 -162223 4973 -75006
11245 -161469 -276249 44433 6204 -75913 309669 -209477 179671 -144075 -123969 -73139 70543
11233 29977 104747 -240980 -395539 -185440 237543 54935 32433 165058 216411 -342205
11222 -16144 162849 53694 117665 -58493 231613 185800 -27871 1444 -140394 17861 52509
11211 52509 -119106 -100141 126225 -221887 49970 152861 -122302 58773 17635 183732
11201A83732a80087Q3313b8917j15957A26635m414J3560a33599A40223D1803b31761
11189B71870d12330E3314a41278b5551m8282B79823i7810j37650d9977k25658
11179b75635R8580j36804e6861A60228J97866c9207j93702H4732C5073A4881c5039
11167a1642A84783d0346I293J57461a9330j44177G0347a10835A27448a59622j85611
11156c45233a51368N8366j6203A30028c3069B08274M1671b90388N5102o3037A53179
11144A55452k0154E2522O2754a36652o7905c3170o2436H5977D548f0972k17965
11133b78937J36140B78766c2701j01089C8661b8748A54152j8900i8479A2622a70119
11121B72837b79044F7478a1615B72298J9902o2324a06326A049K08096a42645B25069
$$ plain form
11201 183732 -180087 -96774 -28917 -144874 126635 122221 135781 -133599 140223 41803 -231761
11189 271870 -412330 53314 -141278 -25551 -73833 279823 -97810 -235460 -49977 -275635
11179 -275635 -177055 -313859 -56861 160228 358094 -39207 -232909 84732 35073 14881 -35039
11167 -11642 184783 -40346 9293 166754 -19330 -163507 70347 -110835 127448 -159622 -345233
11156 -345233 -151368 -93002 -109205 130028 -33069 208274 249945 -290388 -235286 -298323 153179
11144 155452 135298 52522 115276 -136652 -204557 -33170 -95606 85977 4548 -60972 -278937
11133 -278937 -142797 278766 -32701 -133790 38661 -28748 154152 135252 -98479 12622 -170119
11121 272837 -279044 67478 -11615 272298 292200 229876 -106326 1049 209145 -142645 225069
11109b58221D3534M64370D4951M9278l0376Q8488l9576K13369a80566B46156O2298
11098C08454J58419A38633e2738B01587I7896L02526A87423k7555Q4680J42315
11088C86863A3712J78433J35491N1577A21134K72767f9681D72997C0782I397J47837
11077A57234l7027P2285R1723a04036D06598q9520l0706o4469K9352j3765o5269
11066A72221K93993A64118K42558q9811K24288r240B25921O65350k87207j17325
11056D86739J29575K0089A89334N92930L3539l5054p6365j76407L98086J86622
11046A112685j04635R6650j44436M53116k36510j62041J35688k10448L04914E98287
11035H66099R5784J39883r8730j48555J21016m9477j79991N7151J20419L58830
$$ plain form
11109 -258221 43534 507904 44951 94229 63853 152341 112765 326134 -180566 246156 308454
11098 308454 466873 138633 -52738 201587 97896 400422 187423 159868 244548 386863
11088 386863 13712 192145 327636 379213 121134 393901 -69681 472997 30782 9397 157234
11077 157234 120207 192492 284215 -104036 406598 317078 286372 221903 251255 237490 172221
11066 172221 466214 164118 406676 316865 541153 531913 225921 891271 604064 486739
11056 486739 616314 636403 189334 782264 815803 780749 704384 527977 926063 1112685
11046 1112685 1008050 1104700 960264 1413380 1176870 1014829 1150517 940069 1244983 598287
11035 866099 961883 1101766 1003036 854481 975497 926020 746029 803180 923599 1282429
11025A282429m55018n0706K33220l90560J21645J73204l10213L38803J92457k12987
11015I22274j03236J07989k54317J6206O3118r6450K37933k01766J14063J02283
11005I08097L8753l01557J83554J54308D83021L65367j10742L52716l92469K98007
10995I95900m89749L02309o4337m8452j28085J31433K40707l3537k84690J4883
10985F36382J96259J02776L4452J04207j49361q2010J01257J32133K31518k05814
10975A101799k75204K38209K78924L76488k37229J16292M33466K64763R2865L63282
10965B753655L69730J42790P60701L09131j80562k0770o33768o28446p47942j83258
10955A941261k75946k59865l4655m2506L82622r6067m75527K22971J0580n17372
$$ plain form
11025 1282429 827411 776705 1009925 619365 741010 914214 604001 942804 1135261 922274
11015 922274 819038 927027 672710 688916 752034 655584 893517 691751 805814 908097
11005 908097 946850 645293 828847 983155 483021 848388 737646 1090362 697893 995900
10995 995900 506151 808460 744123 695671 567586 699019 939726 906189 621499 636382
10985 636382 832641 935417 969869 1074076 924715 842705 943962 1076095 1307613 1101799
10975 1101799 826595 1064804 1343728 1720216 1482987 1599279 2032745 2297508 2390373 2753655
10965 2753655 3123385 3266175 4026876 4336007 4155445 4134675 3500907 2872461 2124519 1941261
10955 1941261 1665315 1405450 1370795 1328289 1710911 1614844 1139317 1362288 1372868 855496
10945H55496J2733j99284K42614l48482J26876k8010C25203j26145K96666j04253
10935C91471r8747j24075f33C17045d1481q5994A6950J77899D0173K19595K74309
10924E34077i0443D6845J12198K799N4648j03706a66738A09168d691F9087h3963
10912a55546C58815H7806K37444n9367b08060D23996b56796C4243q6i6961j04317
10901b01278A00352b88540J08435A81907b8397P593j03889j17375J04914C49237
10890A60881g8202K722B51971A25094J28272A25983C0533a84630k69573A8033
10879f7895m73r1674B65201I4869l6297K40617e7071B89881b92422A56346h8969
10867H9496J243M2908i1781I5869b53401E203J20340b51892O6659C5556a80526
$$ plain form
10945 855496 868229 668945 911559 563077 689953 661943 325203 199058 495724 391471
10935 391471 292724 168649 -633 317045 -41481 -127475 16950 194849 40173 259768 534077
10924 534077 -90443 46845 159043 161842 216490 112784 -166738 109168 -4691 69087 -83963
10912 -155546 358815 87806 325250 265883 -208060 423996 -256796 34243 34157 -96961 -201278
10901 -201278 100352 -288540 -180105 181907 -28397 -20804 -124693 -242068 -137154 349237
10890 160881 -78202 -75480 251971 125094 253366 125983 30533 -184630 -454203 18033
10879 -67895 -68368 -160042 265201 94869 58572 299189 -57071 289881 -292422 156346 -88969
10867 89496 90739 133647 -91781 95869 -253401 5203 125543 -251892 -185233 35556 -180526
10855a30239i098c983m9843F8098j5952I679K36250E8188a62580o4592e6100A07273
10842b06651Q0459k12704a11618B98953j23500b26354f3887A5650a38235j88518
10832c26753l5561J69673k08688a29090B62098j02702j9009D6260b35141N8525
10822a76616A35243b51916a07160a8537A51922J2424i158j33442B84377j42101
10812A42276f7981b5993m8299l2437l51787B6996J53772n0484n4412b76365d3222
10800B72106a79688A43029B16M1518a5636j93843A49778b5512C8074a36758L7501
10789i9257A71563a69294A06065b03333I8651a23782C8115a54172p708A15784
10778a80585A65923A0020J30268a63518G990b79403O3080I5682B733b9576G1346
$$ plain form
10855 -130239 -9098 -3983 -53826 68098 52146 9679 245929 58188 -162580 -227172 -56100 107273
10842 -206651 -126192 -338896 -111618 298953 175453 -226354 -63887 15650 -138235 -326753
10832 -326753 -362314 -192641 -401329 -129090 262098 159396 140387 46260 -235141 -176616
10822 -176616 135243 -251916 -107160 -18537 151922 164346 -9158 -142600 284377 142276
10812 142276 -67981 -25993 -74292 -106729 -458516 26996 180768 130284 75872 -276365 -43222
10800 272106 -179688 143029 216 41734 -15636 -209479 149778 -25512 38074 -136758 -99257
10789 -99257 171563 -169294 106065 -203333 98651 -123782 38115 -154172 -161880 115784
10778 -180585 165923 10020 140288 -163518 7990 -279403 -216323 95682 2733 -29576 71346
10766A70254N7082d23178h5616a1429j49591A86714k4772o1667g0270a194o5760
10755f6954l1470n4065K1066F6350c3262B14463E6168g1704k58540c0016r342
10744c9358j65973h5659A20469P6567D6605b34437G2616A8414b76021g9374C4205
10732f9207A32630C194L3968P5039i4041F7307i1904j03274a3302I3214a54158
10720c27217Q585a28285j80570l01223B7946b41460J04006G8999A8147J4990J06740
10709A39877a79346I3226j5460P3218J00382C1601b66721L3880D7169J6775g3191
10697b03862A44500f2096l26407A18016a64226A61198b0123o94l5099C8910a61120
10685f6673m4055j71199N3531b6157r4324G1630b83780G9282a36292A30142a74594
$$ plain form
10766 170254 227336 -423178 -85616 -11429 -161020 186714 161942 100275 -70270 -1194 -66954
10755 -66954 -98424 -152489 -131423 66350 -33262 214463 56168 -71704 -330244 -30016 -39358
10744 -39358 -205331 -85659 120469 197036 46605 -234437 72616 18414 -276021 -79374 34205
10732 -69207 132630 3194 37162 112201 -94041 67307 -91904 -195178 -13302 93214 -154158
10720 -327217 -318632 -128285 -308855 -610078 27946 -241460 -137454 78999 18147 33137 139877
10709 139877 -179346 93226 77766 150984 251366 31601 -266721 -232841 47169 63944 -73191
10697 -203862 144500 -62096 -388503 118016 -164226 161198 -20123 -20817 -55916 38910 -161120
10685 -66673 -110728 -281927 -228396 -26157 -120481 71630 -283780 79282 -136292 130142 -174594
10673A45485g3457B8140K17252E0684b23686g1014G2513d4613B1061N7886c14664
10661a2239j59926l2760b5971j56512j27269c7445o5085I2262a12620j0707H5842
10649a12176j19353K2111D08051a09719K7I4564b0691o7767H6482m1002e9927
10637H9852c9077J5789q0881j31968j50312a33262l2910e1844A29350K11399a39567
10625e835l76868J86966H9280e9127C65879a90509B6880J68214J21607A37038
10614g5070G7589b36846F2085a3468k05813L0113H0887b8651k38674H8239b67777
10602b05301q3723A12004B0108b04361L3185K4783M2152a848A21750a83972d8362
10590g2683m6782j449A20204E8704a42921q2480E2923a40456A8503L91192d4585
$$ plain form
10673 145485 -73457 28140 245392 50684 -223686 -71014 72513 -44613 21061 78947 -314664
10661 -12239 -172165 -204925 -25971 -182483 -309752 -37445 -102530 92262 -112620 -123327 85842
10649 -112176 -231529 -209418 408051 -109719 -109692 94564 -20691 -88458 86482 45480 -59927
10637 89852 -39077 -23288 -104169 -236137 -386449 -133262 -166172 -51844 129350 340749 -139567
10625 -5835 -382703 -195737 89280 -59127 365879 -190509 26880 195094 316701 137038
10614 -75070 77589 -236846 62085 -13468 -219281 -189168 80887 -28651 -267325 88239 -267777
10602 -205301 -289024 112004 20108 -204361 -171176 -146393 -104241 -1848 121750 -183972 -48362
10590 -72683 -119465 -120914 120204 58704 -142921 -225401 52923 -140456 18503 409695 -44585
10578i0411C2421R8045O0601r0776d4304k80291j9550e4195H7589i7878j42158
10567b40036F4942O992K02708b8781o7425E2583L14945A19100c01547B29451d02951
10555e46485A11270a95299j61556A85884d951C1976L2279N2940m6245c2692j05505
10544a38197j95165D27478A36626M30280b42875C4684b93406a11565B8228g0478
10533d7534j99812n9695g3966N669A72581F7636J18336C7106J1377Q0085a16104
10521f6369F9589a04082A51795g5437k06761r6961A9968a50762N1699j32365q9304
10510c20732J56351B7938e4312Q786H3316N2039P8325A6686g7927K1721l5031
10499i1237m4440A27422a75543B2487a8330C08940g643k59608e3874L532j5635
$$ plain form
10578 -90411 32421 130466 191067 100291 -44304 -324595 -344145 -54195 87589 -97878 -240036
10567 -240036 64942 71934 274642 -28781 -96206 52583 367528 119100 -301547 229451 -402951
10555 -546485 111270 -195299 -356855 185884 -4951 31976 64255 117195 70950 -32692 -138197
10544 -138197 -333362 427478 136626 566906 -242875 34684 -293406 -111565 28228 -70478
10533 -47534 -247346 -307041 -73966 -68297 172581 67636 185972 37106 48483 128568 -116104
10521 -66369 69589 -104082 151795 -75437 -282198 -379159 19968 -150762 -99063 -231428 -320732
10510 -320732 -164381 27938 -54312 -45526 83316 135355 213680 16686 -77927 -56206 -91237
10499 -91237 -135677 127422 -175543 22487 -18330 308940 -7643 -267251 -53874 -50342 -65977
10488f5977k11217h9751k10814O1180j33514K9465J28135D9601b40376B5028a86227
10476B39199n3344b15012H5425j6321J26391L08379A94652D834M23371D6600L58473
10465D05073A05932J86313H3648M21002F9465J2953k6586c5333j36123p6233A59467
10453e6056I7645a40945A02220c36048a61947A16884a2335A8638d8216A59474
10442B25868Q303b24163F4603a39372M4288j8843a4667C4725c7379l23053a79235
10430a38363j12871F1653B7547i1868A62692b38095j72614g2540j6690H3429c17356
10418a5714j27779D1454e1906j83584B09559e9120b5668A1975i4161j87409E244
10406c3812R978A90528k5039F8301g5197B67500G2847c66915Q4080C1322P6474
$$ plain form
10488 -65977 -277194 -89751 -300565 -239385 -372899 -343434 -215299 49601 -240376 25028 -186227
10476 239199 185855 -215012 85425 69104 195495 503874 194652 4834 428205 46600 405073
10465 405073 105932 292245 83648 504650 69465 82418 55832 -35333 -171456 -247689 159467
10453 -56056 97645 -140945 102220 -336048 -161947 116884 -12335 18638 -48216 159474
10442 225868 234171 -224163 64603 -139372 -95084 -113927 -14667 34725 -37379 -360432 -179235
10430 -138363 -251234 61653 27547 -91868 162692 -238095 -410709 -72540 -89230 83429 -317356
10418 -15714 -143493 41454 -51906 -235490 209559 -59120 -25668 11975 -94161 -281570 5244
10406 -33812 -23834 190528 165489 68301 -75197 267500 72847 -366915 -282835 31322 107796
10395A07796a94509D6302P8181B489a08915F4322h8745l6784L5242C89794r0783
10384B99011J8470l5134J4027A26530M06640a54547h13E5741L2417M9287O2578
10373B00023J10484A54348K69627A16359b4565D92707k06939j32721J75687j33375
10363A95359m3691L39575A72103R6298L05135j25849r2513j01539L29730A62379
10352A53084P2078J62410K45116j82364j98628M08298B74846N72548j78019A66068
10341B35312D8640C548M54063B24452J94239p9765A60893e3517B74716j05829
10331A68887J50455J35977h3222B19556m4487a50574A8333Q4409K73381I6995
10320G7375J97746n6463J95639l5379J7172K37562G8496g6391H2787O4888n5306
$$ plain form
10395 107796 -194509 46302 124483 2489 -108915 64322 -88745 -125529 -90287 389794 299011
10384 299011 317481 282347 296374 126530 533170 -154547 -813 55741 88158 137445 200023
10373 200023 310507 154348 423975 116359 -24565 492707 285768 153047 328734 195359
10363 195359 151668 491243 172103 268401 573536 447687 355174 253635 583365 162379
10352 153084 225162 387572 632688 450324 251696 659994 274846 847394 669375 166068
10341 235312 48640 3548 457611 224452 418691 338926 160893 -53517 274716 168887
10331 168887 319342 455319 -83222 219556 175069 -150574 18333 102742 376123 96995
10320 77375 275121 218658 414297 378918 396090 633652 78496 -76391 82787 147675 92369
10309I2369N2696l9038A8835J15234F6753K16229i9622o7644A88075a08886c1031
10297a57047A2385Q9183G416f1898C51006G4535R0042e78307A68968g7297I9116
10285d1263l0705j55268i4309B0399M4949a76401M270q4176J23649B37893B7481
10273a85146P0362k76331J52686J12235j46744O5263e9627A70127a12879A86954
10262h5715p6912E2655l437a44452A50693e8814j49960A71724A5540J55264A7109
10250B86086A16475J34709a528A51594a23191A39287d3668A43291C4386a72761
10239a6214B09770b57508b8718o5244F8684i8165K1121K8693n5379n5102j38859
10228b97691a13725A35287C2614J64358D8032a48762A08049J08797g4966L2110
$$ plain form
10309 92369 145065 106027 18835 134069 66753 282982 -99622 -167266 188075 -108886 -31031
10297 -157047 12385 101568 7416 -61898 351006 74535 164577 -578307 168968 -77297 99116
10285 -41263 -71968 -227236 -94309 20399 65348 -176401 -172131 -256307 -132658 237893 27481
10273 -185146 -114784 -391115 -238429 -126194 -272938 -207675 -59627 170127 -112879 186954
10262 -85715 -162627 52655 49218 -144452 150693 -58814 -208774 171724 15540 170804 17109
10250 286086 116475 251184 -1528 151594 -123191 139287 -43668 143291 34386 -172761
10239 -16214 209770 -257508 -28718 -93962 68684 -98165 -77044 -48351 -103730 -158832 -297691
10228 -297691 -113725 135287 32614 196972 48032 -148762 108049 216846 -74966 -42856
10218d2856D16896C4742a65174I0937a92826j13576D9152c9715n9044k06433f5034
10206h7424K7692A93697o7291a94742m8253M9343m9497j3833f696j59084n3063
10195b18843e3400k49938a44979c0407A72055f5020E9495a56056A06662E1422
10184a64699M7129k13351a5013H5944b70711H7871a00201a6593B05549A7275a54491
10172c47157B03216i527K672k40442B0611a03861A2530d23247H1318c33390c3495
10160C8063a56794g467j15627j14422C24192B2016b93399R5571B1114a70158P1499
10149i8659n8888r9084A50113f9894g350m79124b03527A84335a25525A17782C1123
10137b0147o6866C90955a20640A29991N2380E0732b59674B4007n884M9063b91706
$$ plain form
10218 -42856 416896 34742 -165174 90937 -192826 -306402 49152 -39715 -98759 -305192 -65034
10206 -87424 -59732 193697 126406 -194742 -242995 -193652 -243149 -256982 -6696 -165780 -218843
10195 -218843 -53400 -303338 -144979 -30407 172055 -65020 59495 -156056 106662 51422
10184 -164699 -117570 -330921 -15013 85944 -270711 87871 -100201 -16593 205549 17275 -154491
10172 -347157 203216 -9527 -6855 -247297 20611 -103861 12530 -423247 81318 -333390 -33495
10160 38063 -156794 -7467 -123094 -237516 324192 22016 -293399 -197828 21114 -170158 -98659
10149 -98659 -157547 -256631 150113 -69894 -7350 -486474 -203527 184335 -125525 117782 31123
10137 -20147 -87013 390955 -120640 129991 182371 50732 -259674 24007 18123 67186 -291706
10125F0299a17794F0882a20400k9989C28640a69993k8404J0855f1340j10506F9670
10113A49478m0942L493a48025k15728B20274a03877J5293C6007a3081k65298l3420
10102c11799e3875E7788J26476F7693C1433a05808k9832B2586h8652H5690K23613
10091C09303h8519D3469c05554A53590H608L9874J17499g2903j8145A59495B7773
10079c24823A4047e2923k19478A31520b42546A63641a24297N3411m15354b42008
10068A92441M8552q1880a1390j52628M0119B97126f6919A85317B5030b1406j3751
10057c5157B4608J18282Q0146l4375a26377m20579A95465M1583D6550A4682b12948
10045a46461l6112O8029D124P5820d6034n4640J0918b5374m7232J1907k83993
$$ plain form
10125 60299 -117794 60882 -120400 -150389 328640 -169993 -198397 -187542 -61340 -171846 69670
10113 149478 108536 112029 -148025 -363753 220274 -103877 -88584 36007 -13081 -278379 -311799
10102 -311799 -53875 57788 184264 67693 31433 -105808 -135640 22586 -88652 85690 309303
10091 309303 -88519 43469 -305554 153590 8608 48482 165981 -72903 -91048 159495 27773
10079 -324823 14047 -52923 -272401 131520 -242546 163641 -124297 -70886 -486240 -242008
10068 192441 240993 159113 -11390 -164018 -123899 297126 -66919 185317 25030 -21406 -35157
10057 -35157 24608 142890 223036 188661 -126377 -546956 195465 237048 46550 14682 -212948
10045 -146461 -182573 -114544 4124 79944 -46034 -100674 -89756 -25374 -72606 -60699 -344692
10034c44692A37496l1704a70076B13407F5998a21785k8334j9026A00341C6195
10023D967a05855A56978p5532b01834j32151b5335m32642a69185F3457k3760a36844
10011e6245A03897b13613A80411p6857i5351j87429d1919j32270J2411c9158j13846
10000a53004F2208b15499a03269A19582B5704J8876f4743F0575B7926a86689R2628
9989i4061l3186q578r0170K2257d2913j8649a2664q4391B28649a56464K4376a6806
9976B6134a73166j88794f540r8410o2725B73618E8973c1783H585J26831f9023
9964b98518A41656a07745L9163a627G3686J7417B9192J05052b62718a19961J0448
9953a09513f022A49124D4351a06317d0405J6016j7814B43929c51098f5120q027
$$ plain form
10034 -344692 137496 105792 -170076 213407 65998 -121785 -150119 -169145 100341 36195
10023 4967 -105855 156978 81446 -201834 -333985 -25335 -457977 -169185 63457 39697 -136844
10011 -56245 103897 -213613 180411 103554 -95351 -282780 -41919 -174189 -161778 -39158 -153004
10000 -153004 62208 -215499 -103269 119582 25704 44580 -64743 60575 27926 -186689 -94061
9989 -94061 -127247 -135825 -225995 -203738 -42913 -61562 -12664 -97055 228649 -156464 -132088 -16806
9976 26134 -173166 -361960 -6540 -104950 -167675 273618 58973 -31783 8585 135416 -69023
9964 -298518 141656 -107745 -68582 -1627 73686 91103 29192 134244 -262718 -119961 -109513
9953 -109513 -6022 149124 44351 -106317 -40405 -24389 -42203 243929 -351098 -65120 -73147
9942g3147r2052K6473A07756a85160j60267f1537l18649A02987c26638E4282d692
9930b19909i1673r7112A14687i0098A55926b83303O7165A20319e22559K59556
9920b63003h2953o9795B6842b5317l6051j5020A01227g2418b8970E7993b90014
9908b2323J767C2883h7815D0268q81i9602j0920l3128A79317p2881a00504F7915
9895b24026L3568P6086B44701k8685a43467O0825N965O041j06278M8966A49197
9883A12100b16437A56114a82591N164G4301N9599a77571F0567b35244j33659R9223
9872b69680a17376A33839e884n4853j9182E3285a25234a3601C15772c2033A3881
9860D0227b3402A35542m5447M3520a4826o4110j04362P6096A38969l4977a05145
$$ plain form
9942 -73147 -165199 -138726 107756 -185160 -345427 -61537 -380186 102987 -326638 54282 -4692
9930 -219909 -91673 -188785 114687 -90098 155926 -283303 -216138 120319 -522559 -263003
9920 -263003 -82953 -152748 26842 -25317 -61368 -76388 101227 -72418 -28970 57993 -290014
9908 -22323 -20556 32883 -87815 40268 39387 -99602 -110522 -143650 179317 106436 -100504 67915
9895 -224026 -190458 -114372 244701 216016 -143467 -82642 -76677 -70636 -176914 -127948 149197
9883 112100 -216437 156114 -182591 -177427 74301 133900 -177571 60567 -235244 -368903 -269680
9872 -269680 -117376 133839 -5884 -60737 -79919 53285 -125234 -13601 315772 -32033 13881
9860 40227 -23402 135542 90095 133615 -14826 -78936 -183298 -107202 138969 103992 -105145
9848a26442j25033A07095P935B7654c22945J40723a1711B6687a26181k59778a90272
9836a07225m6066I3962e7513a5009H2975A3603L2082j4203b57412f1919C2507
9824B1380b24826A97866G4798K22313a668j15813a094A03244b25232A4596e0885
9812I8249a4123k58399j31330A59164a99747Q4626D5254B0220g3857j74240O8344
9801a79753O5503E4052d40801A40035a70073j96874J13799A37683d89723a93107
9790a0918o9082A22062a56092r5980J05924r8905O3937L3028d7446A97291a17173
9778b99826Q654M14A19459b51397A28804b95798J36023P4937B54075b459l83651
9767c86110O0152G669a17634C8809c05745c6510m5967F5900c8690G7702e5056
$$ plain form
9848 -126442 -251475 107095 115030 27654 -322945 -182222 -11711 26687 -126181 -385959 -190272
9836 -107225 -153291 93962 -57513 -15009 82975 13603 45685 31482 -257412 -61919 32507
9824 21380 -224826 197866 74798 297111 -1668 -117481 -1094 103244 -225232 14596 -50885
9812 98249 -14123 -272522 -403852 159164 -199747 -115121 45254 20220 -73857 -248097 -179753
9801 -179753 -114250 54052 -440801 140035 -170073 -366947 -253148 137683 -489723 -193107
9790 -10918 -80000 122062 -156092 -252072 -146148 -245053 -181116 -148088 -47446 197291 -117173
9778 -299826 -291172 -290758 119459 -251397 128804 -295798 -159775 -84838 254075 -2459 -386110
9767 -386110 -325958 7669 -117634 38809 -305745 -36510 -82477 65900 -38690 77702 -55056
9755a70261A23131D9376m383a06311B08068e03984a94108C1121L8549J3101a11653
9743C7400N19887i7456r1843A33179b17376H7912b49264F7086l2731a10298E8961
9731f3770J9249k67631D7155a03233K851A80812a48703k9524j56944a16984l32897
9720d49881G530f8205j76573F1007a6102j42659E2590D705f0775b6339A6201K01603
9708B17804a59902A24840e1885A1513J85647d53985K00683J10459A37351a05250
9697A81901G7868b66416O9636c8490Q682B5933d14743J74884C2881b7390n20135
9686e47525A13532a5596r2146F2285e8592A98186d8539F2486j4386K90190A62899
9674a85006N2282k67790a74389A544c94185h9k97331R8863H6932j2165k0465j7322
$$ plain form
9755 -170261 123131 49376 44993 -106311 208068 -503984 -194108 31121 69670 82771 -111653
9743 37400 557287 -97456 -189299 133179 -217376 87912 -249264 67086 34355 -110298 58961
9731 -63770 -44521 -312152 47155 -103233 -100382 180812 -148703 -178227 -335171 -116984 -449881
9720 -449881 7530 -68205 -244778 61007 -16102 -158761 52590 4705 -60775 -26339 16201 217804
9708 217804 -159902 124840 -51885 11513 197160 -453985 -253302 -142843 137351 -105250
9697 181901 77868 -266416 -196780 -38490 -29808 25933 -414743 -239859 32881 -27390 -547525
9686 -547525 113532 -15596 -107742 62285 -58592 198186 -48539 62486 48100 338290 162899
9674 -185006 -132724 -400514 -174389 1544 -394185 -89 -297420 -198557 86932 74767 54302 36980
9662C6980c16174K3787A59928b40087C99099j33267a96376D1306a10573A26607
9651b02417o2638D0486h7867j89734R6744A3852b18128c5944A34259h2432H0654
9639b17725F1324K38941h9892l74503B46449C3271O3602J28a52284p9994B53137
9627i8350p1050A10316L2918i0386j74229A18514c16o4447C3440c6209C2374J7992
9615E0366O3983e43693A59444K25451b2562A08840l8458a34671A75413F7893b14371
9603a47272q5466B47556b56004M8917g7861H224J65060C9315a46634r8687k361
9592b47682j8725R6616g885k8406j25724A61172D4067b44631A51341e3711n3056
9581a06767k6460A5114a83951I1661a14984k6958j23103O4301j007G4112Q328
$$ plain form
9662 36980 -316174 -292387 159928 -240087 399099 265832 -196376 41306 -110573 126607
9651 -202417 -265055 40486 -87867 -277601 -180857 13852 -218128 -35944 134259 -82432 80654
9639 -217725 61324 300265 -89892 -464395 246449 33271 96873 97001 -152284 -232278 253137
9627 -98350 -169400 110316 143234 -90386 -264615 118514 -316 -64763 33440 -36209 32374 50366
9615 50366 114349 -543693 159444 384895 -22562 108840 70382 -134671 175413 67893 -214371
9603 -147272 -232738 247556 -256004 -207087 -77861 8224 173284 39315 -146634 -245321 -247682
9592 -247682 -266407 -169791 -7885 -36291 -162015 161172 44067 -244631 151341 -53711 -106767
9581 -106767 -133227 15114 -183951 91661 -114984 -141942 -265045 -200744 -201751 74112 82440
9570H2440b15334K1231F9636a85881F6129R363a37328B17030f9513j77873G9027
9558i0384B60099d20587B59540d0812F7401B8708b71795P5936g5463j91153a29776
9546C0932a14239D6107a13430C4845b17486A8732b35077A13720h1900o7235A03
9534B51116a51705I1969a35620k26760f2179n3609A37304a49867A50279b90263
9523a71791b5215A42646f6339k92786h4380d0340r0986C01921E5445b95067a2601
9511i112l50963a48623J173K8638N2280A89155g0150A34120b27159g8913H5470
9499a84199A13937a82721J0378I4057b09534L8407B22199a78865p6861M714O2017
9488a88995A49233a46082A59521f5584F2875g4287m2528c3928k24943j20815B29080
$$ plain form
9570 82440 -215334 -194103 69636 -185881 66129 75492 -137328 217030 -69513 -247386 79027
9558 -90384 260099 -420587 259540 -40812 67401 28708 -271795 -195859 -75463 -266616 -129776
9546 30932 -114239 46107 -113430 34845 -217486 18732 -235077 113720 -81900 -149135 103
9534 251116 -151705 91969 -135620 -362380 -62179 -115788 137304 -149867 150279 -290263
9523 -171791 -25215 142646 -66339 -359125 -84380 -40340 -131326 301921 55445 -295067 -12601
9511 -9112 -360075 -148623 -147450 -118812 -66532 189155 -70150 134120 -227159 -78913 85470
9499 -184199 113937 -182721 -172343 94057 -209534 -171127 222199 -178865 -255726 -251012 -188995
9488 -188995 149233 -146082 159521 -65584 62875 -74287 -116815 -33928 -258871 -379686 229080
9476c0493k01015c8496k29585K5281c7633o0762j18183R9352I3669m2039a07805
9464a52529F3581A7789d24447g5930A49936e02811B03620A8098i9576j74449M7712
9453b26313M349H908J7933b16249R5767C6238b06310j4173I1593M975l1303a04554
9440F8793b87414J20170P4024a6380B87447b99271A49823a43490B31361a23594
9429E5832J28358C7714g2185j10947a0407n2117B96857q9534a60848j69052C39014
9417A5192J31531J32325A00986b42035K9928R3544l8108A47268b51906J24507
9407a27399j18031f4697G2572i8939H1044d4417k04756d0791C45889F2882d1748
9395c48922B45961A11634a79318j3444I7437b42721Q4023a027l1857G6229J54632
$$ plain form
9476 -30493 -231508 -38496 -268081 -242800 -37633 -98395 -216578 -117226 93669 51630 -107805
9464 -152529 63581 17789 -424447 -75930 149936 -502811 203620 18098 -99576 -274025 -226313
9453 -226313 -221964 8908 26841 -216249 -120482 36238 -206310 -220483 91593 96568 65265 -104554
9440 68793 -287414 -167244 -93220 -16380 287447 -299271 149823 -143490 231361 -123594
9429 55832 184190 37714 -72185 -183132 -10407 -62524 296857 207323 -160848 -329900 339014
9417 15192 146723 279048 100986 -242035 -212107 -118563 -156671 147268 -251906 -127399
9407 -127399 -245430 -64697 72572 -98939 81044 -44417 -249173 -40791 345889 62882 -41748
9395 -348922 245961 111634 -179318 -192762 97437 -242721 -158698 -1027 -32884 76229 230861
9384B30861d6854k69682a22629I3522e916C6678b90478k0718a16787A6878K80000
9373B96878b15785a7708q8252L3053B24760e2807j43791B54089r1292i7520B09895
9361a24795A12377e08670A26535b83903L8741F5948g7159b2510l80545H6096j2490
9350G3606f1269j24807B71610c42733f5196l9060j1706A20981a79836h4290i628
9338B43708a89001A55175a39087H1942q614a56763r5100a14653j86551a6587p2242
9327h8829l04041A19311J06906a52008N8076c8090j22243d8573k22418g6009H253
9315b28765A14955A1473b3141l37421C360c60183e7336j4166I850Q9060b17886
9303i6552b2184B22349c76326B01158a29718k21548a52335c0782j77927I50b59858
$$ plain form
9384 230861 -46854 -316536 -122629 93522 -5916 36678 -290478 -311196 -116787 16878 296878
9373 296878 -215785 -17708 -105960 -72907 224760 -52807 -196598 254089 162797 -97520 209895
9361 -124795 112377 -508670 126535 -283903 -245162 65948 -77159 -22510 -403055 86096 73606
9350 73606 -61269 -186076 271610 -342733 -65196 -104256 -115962 120981 -179836 -84290 -9628
9338 243708 -189001 155175 -139087 81942 73328 -156763 -251863 -114653 -301204 -16587 -88829
9327 -88829 -392870 119311 226217 -152008 -93932 -38090 -160333 -48573 -270991 -76009 8253
9315 -228765 114955 11473 -23141 -360562 3360 -360183 -57336 -71502 9850 98910 -217886
9303 -96552 -22184 222349 -376326 201158 -129718 -351266 -152335 -30782 -208709 950 -259858
9291E380i6260d3097D0495N8285b08564A22244C7610O1c18054B39579a84925j6674
9279b01599M1981B64755a03575G5227d37574a04185j2679E087K08661b35736A94885
9267A00957m4132K73223a55591d6429A39912a59911r0320g5896A94363b66686
9256B48953b68606A12135k0799l2292c2753j99780m3056b1106B12752b53957k08884
9245d62841C1543b21417R0562l30551a56992F2598a81674E8081J944J4684a71208
9233A45799d4678e425j10175l19354A11292f9251A16879l2333f2755p5398C03185
9221I1948C733a77173C0593L847a24668A9690p981g9714L50n8916e207A26896
9208c22410G0429b17148c3824A32127b76831J9726j48326B73210c79483A82788
$$ plain form
9291 5380 -96260 -43097 40495 98780 -208564 122244 37610 37671 -318054 239579 -184925 -201599
9279 -201599 -159618 264755 -103575 75227 -437574 -104185 -116864 5087 213748 -235736 194885
9267 100957 56825 330048 -155591 -46429 139912 -159911 -250231 -75896 194363 -266686
9256 248953 -268606 112135 91336 59044 -32753 -232533 -275589 -21106 212752 -253957 -462841
9245 -462841 31543 -221417 -130855 -461406 -156992 62598 -181674 58081 60025 74709 -171208
9233 145799 -44678 -5425 -115600 -434954 111292 -69251 116879 84546 -62755 -138153 303185
9221 91948 3733 -177173 30593 34440 -124668 19690 11709 -79714 -79364 -138280 -5207 126896
9208 -322410 70429 -217148 -33824 132127 -276831 -257105 -405431 273210 -379483 182788
9197c05002J06345A22921C8016P8002K45387j64390a3685A00364l6505b46728
9186f6372A1062c1179m8283A08637a17022d2420q1545B17646a11208d3466A87814
9174a22788j7181N565n9869k07151A60729c15710b4721j2905A15435d08761H7492
9162A10097g3186B78524A04540D0979a13996A23401b42l4900D6847f7983J0140
9151e7843a6027F653e3979A17149a94980M9167a7301j1473j19941A49498c4745
9139E4754J99154b84899a07570r8644R0777f594k88956a01210j32280g37A77352
9127b36813h9225j8418A22326M4569b25432A05088c42792G4742k4f123o7165j63480
9115b36768B00036G7188e4586k11730b5763j4704F2596J0974J07563b08741R454
$$ plain form
9197 -305002 -198657 122921 38016 116018 361405 197015 -13685 100364 63859 -246728
9186 -66372 11062 -31179 -79462 108637 -117022 -42420 -123965 217646 -111208 -43466 187814
9174 -122788 -139969 -134404 -194273 -401424 160729 -315710 -24721 -37626 115435 -408761 87492
9162 110097 -73186 278524 104540 40979 -113996 123401 -242 -35142 46847 -67983 -57843
9151 -57843 -16027 6653 -53979 117149 -194980 -145813 -17301 -28774 -148715 149498 -34745
9139 54754 253908 -284899 -107570 -206214 -115437 -6594 -295550 -101210 -233490 -737 177352
9127 -236813 -89225 -107643 122326 166895 -225432 105088 -342792 74742 74718 -6123 -73288 -236768
9115 -236768 200036 77188 -54586 -266316 -25763 -40467 62596 73570 181133 -208741 -199287
9104a99287a7001j35043a4494D2308a54842j47262A96583d6526l6599j01119F915
9092F2885b66763B18291o7683b47640N8045G8163K0079c97130C16292c40682c6701
9080B6573d4334n10464K76808C31696B2367M0586R3966d7273A22529j4222c7426
9068b19910m5516D8473a23164c0659D5563a82227k91722E480d8756j81727l0788
9057b61271O4876K6159D1594J35146D6404K35993d74706b07544A7212K87144c71180
9045a07681F6764f3973A799h0895k5320A18320e7715A64111m0841D1708c88282
9033a6799r022H6762a04941b1320J0597j03131M7275j05723A05255e3781r7025
9022a50806L677F8554a9939B14105a87680j89020a49979c4573e028C35476a21957
$$ plain form
9104 -199287 -17001 -152044 -14494 42308 -154842 -302104 196583 -46526 -83125 -184244 6915
9092 62885 -266763 218291 150608 -247640 -189595 78163 98242 -397130 316292 -340682 -36701
9080 26573 -44334 -554798 -277990 331696 22367 62953 156919 -47273 122529 108307 -37426
9068 -219910 -265426 48473 -123164 -30659 45563 -182227 -473949 5480 -48756 -230483 -261271
9057 -261271 -196395 -170236 41594 176740 46404 282397 -474706 -207544 17212 304356 -371180
9045 -107681 66764 -63973 1799 -80895 -106215 118320 -57715 164111 123270 41708 -388282
9033 -16799 -25821 86762 -104941 -21320 -10723 -113854 -66579 -172302 105255 -53781 -150806
9022 -150806 -147129 68554 -19939 214105 -187680 -376700 -149979 -34573 -5028 335476 -121957
9010a27835j84476C0648a96738H6325M1071R1672a98628l7858i7520K6620j35316
8999b06216H6009a39234e2086k90403a62779e2550l01460a56717F0752a10502
8988a77849p6140N3259B36768A1457b64047d8416B54995b42506A89029e6798k37708
8977b94506D9137i0626l2829a3330E5440J66328A10021g3335B09846E6632e5049
8965a20790n9175c7800D03577c55766d5563A72431d5354j22175k4178A01492b33830
8953b06493C56115a8874l2482k32080a39475B0396C42N8363J44941a23567N4831
8942f8736L3021p3760I3566j82K2259k0384a14179q9223j06627J28693L2417G5148
8929a01821n2317q0151A65333b23886A02609h8597A5350e7889k67327B8817e5939
$$ plain form
9010 -127835 -312311 30648 -196738 86325 127396 219068 -198628 -236486 -97520 -70900 -206216
8999 -206216 86009 -139234 -52086 -342489 -162779 -52550 -354010 -156717 60752 -110502
8988 -177849 -253989 -200730 236768 11457 -264047 -48416 254995 -242506 189029 -56798 -294506
8977 -294506 49137 -90626 -123455 -13330 55440 221768 110021 -73335 209846 56632 -55049
8965 -120790 -179965 -37800 403577 -355766 -45563 172431 -45354 -167529 -191707 101492 -233830
8953 -206493 356115 -18874 -51356 -283436 -139475 20396 342 58705 203646 -123567 -68736
8942 -68736 -35715 -109475 93566 93384 115643 95259 -114179 -203402 -310029 -181336 -148919 75148
8929 -101821 -154138 -234289 165333 -223886 102609 -88597 15350 -57889 -325216 28817 -55939
8917G3038Q63122B83357B1243a12315k6892I1091a99312A22614B5685b13658B4514
8905a7286j4425p8314m2740A21229N0352a20899r3355G2846b56357O9212n8063
8894b45208I003a92710h2699k75795a58148j58487F8362A0160K82701h5438l8807
8883a24245i953B13732h3819A01998c72182H8903D2018d1842H1879C31f0633A38693
8870a57879j09013J27485D7317j0512L7847A6035b47921J05272j65793J10196
$$ plain form
8917 73038 936160 283357 21243 -112315 -139207 91091 -199312 122614 25685 -213658 24514
8905 -17286 -31711 -110025 -152765 121229 171581 -120899 -214254 72846 -256357 -187145 -245208
8894 -245208 9003 -192710 -82699 -358494 -158148 -316635 68362 10160 292861 -85438 -124245
8883 -124245 -9953 213732 -83819 101998 -372182 88903 42018 -41842 81879 331 -60633 138693
8870 -157879 -266892 -139407 47317 36805 74652 16035 -247921 -142649 -308442 -198246
$$ [...]
##END NTUPLES=NMR SPECTRUM
##END=
