##TITLE=NES1059_10428_9268947_raccN2AwQT
##JCAMPDX= 6.0         $$ Bruker NMR JCAMP-DX V2.0
##DATA TYPE= NMR SPECTRUM
##DATA CLASS= NTUPLES
##ORIGIN= BRUKER
##OWNER= Administrator
$$ 1.72 TOPSPIN		Version 2.1
$$ 2015-07-10 23:53:19.894 -0700  Administrator@X
$$ Compression mode = diff/dup
##.OBSERVE FREQUENCY= 400.02188249412
##.OBSERVE NUCLEUS= ^1H
##.ACQUISITION MODE= SIMULTANEOUS (DQD)
##.ACQUISITION SCHEME= undefined
##.AVERAGES= 8
##.DIGITISER RES= 22
##SPECTROMETER/DATA SYSTEM= spect
##.PULSE SEQUENCE= zg30
##.SOLVENT NAME= COFFEE_meoh
##.SHIFT REFERENCE= INTERNAL, COFFEE_meoh, 1, 14.98509
##AUDIT TRAIL= $$ (NUMBER, WHEN, WHO, WHERE, PROCESS, VERSION, WHAT)
$$ ##TITLE= Audit trail, TOPSPIN		Version 2.1
$$ ##JCAMPDX= 5.01
$$ ##ORIGIN= Bruker BioSpin GmbH
$$ ##OWNER= Administrator
$$ $$ E:\/data/COFFEE/nmr/NES1059_10428_9268947_raccN2AwQT/10/pdata/1/auditp.txt
$$ ##AUDIT TRAIL=  $$ (NUMBER, WHEN, WHO, WHERE, PROCESS, VERSION, WHAT)
(   1,<2015-07-10 23:53:12.535 -0700>,<Administrator>,<X>,<go>,<TOPSPIN 2.1>,
      <created by zg
	started at 2015-07-10 23:52:06.550 -0700,
	POWCHK enabled, PULCHK disabled,
       configuration hash MD5:
       21 0F 79 D6 B3 7B B4 F6 88 20 88 DB 03 48 BD 9F
       data hash MD5: 64K
       D0 5B 65 65 33 B9 40 48 12 08 87 7D 48 70 6F 48>)
(   2,<2015-07-10 23:53:15.722 -0700>,<Administrator>,<X>,<proc1d>,<TOPSPIN 2.1>,
      <Start of raw data processing
       efp LB = 0 FT_mod = 6 PKNL = 1 PHC0 = 0 PHC1 = 0 SI = 32K 
       data hash MD5: 32K
       A9 3F FB AD A8 40 42 78 76 5C 47 00 57 7C 2E 5A>)
(   3,<2015-07-10 23:53:16.019 -0700>,<Administrator>,<X>,<proc1d>,<TOPSPIN 2.1>,
      <pk PHC0 = 92.4939 PHC1 = 0 
       data hash MD5: 32K
       F4 4A A2 88 AE 3B 81 3F A4 6B B9 13 09 AF BF CB>)
(   4,<2015-07-10 23:53:16.128 -0700>,<Administrator>,<X>,<proc1d>,<TOPSPIN 2.1>,
      <abs ABSG = 1 
       data hash MD5: 32K
       52 96 F5 9C 0F EC C3 CF F1 DD 72 11 3F 16 8B 83>)
(   5,<2015-07-10 23:53:16.191 -0700>,<Administrator>,<X>,<proc1d>,<TOPSPIN 2.1>,
      <abs ABSG = 2 
       data hash MD5: 32K
       81 67 DE 90 94 89 E5 26 AB C3 52 76 1B B9 2D 51>)
(   6,<2015-07-10 23:53:16.269 -0700>,<Administrator>,<X>,<proc1d>,<TOPSPIN 2.1>,
      <abs ABSG = 3 
       data hash MD5: 32K
       48 17 96 78 8C 94 DF 44 ED BC 6E BF 71 A8 60 5D>)
(   7,<2015-07-10 23:53:16.316 -0700>,<Administrator>,<X>,<proc1d>,<TOPSPIN 2.1>,
      <abs ABSG = 4 
       data hash MD5: 32K
       15 18 1D 2F C1 93 11 38 2F 80 34 68 2E 6B FE AA>)
(   8,<2015-07-10 23:53:16.378 -0700>,<Administrator>,<X>,<proc1d>,<TOPSPIN 2.1>,
      <abs ABSG = 5 
       data hash MD5: 32K
       66 A5 0D 0E 45 7A 32 E0 46 C9 D5 64 BA 83 9C B7>)
$$ ##END=
$$ 
$$ $$ hash MD5
$$ $$ 76 A7 34 7C A4 88 5E AE 3C 21 CA 9E 95 8F 07 31
##$RELAX= 
##$RELAX= 
##$RELAX= 
##$RELAX= 
##$RELAX= 
##$RELAX= 
##$RELAX= 
$$ Bruker specific parameters
$$ --------------------------
##$DU= <E:\>
##$EXPNO= 10
##$NAME= <NES1059_10428_9268947_raccN2AwQT>
##$PROCNO= 1
$$ [...]
##$TP= (0..7)
150 150 150 150 150 150 150 150
##$TP07= 0
##$TPNAME0= <>
##$TPNAME1= <>
##$TPNAME2= <>
##$TPNAME3= <>
##$TPNAME4= <>
##$TPNAME5= <>
##$TPNAME6= <>
##$TPNAME7= <>
##$TPOAL= (0..7)
0.5 0.5 0.5 0.5 0.5 0.5 0.5 0.5
##$TPOFFS= (0..7)
0 0 0 0 0 0 0 0
##$TUNHIN= 0
##$TUNHOUT= 0
##$TUNXOUT= 0
##$USERA1= <user>
##$USERA2= <user>
##$USERA3= <user>
##$USERA4= <user>
##$USERA5= <user>
##$V9= 5
##$VALIST= <valist>
##$VCLIST= <CCCCCCCCCCCCCCC>
##$VD= 0
##$VDLIST= <DDDDDDDDDDDDDDD>
##$VPLIST= <PPPPPPPPPPPPPPP>
##$VTLIST= <TTTTTTTTTTTTTTT>
##$WBST= 2048
##$WBSW= 25
##$XGAIN= (0..3)
0 0 0 0
##$XL= 0
##$YL= 0
##$YMAX_a= 626196
##$YMIN_a= -527074
##$ZGOPTNS= <>
##$ZL1= 120
##$ZL2= 120
##$ZL3= 120
##$ZL4= 120
##$ABSF1= 14.98509
##$ABSF2= -5.573092
##$ABSG= 5
##$ABSL= 3
##$ALPHA= 0
##$AQORDER= 0
##$ASSFAC= 0
##$ASSFACI= 0
##$ASSFACX= 0
##$ASSWID= 0
##$AUNMP= <proc_prof1d_extract_pilot.lims>
##$AXLEFT= 0
##$AXNAME= <>
##$AXNUC= <1H>
##$AXRIGHT= 0
##$AXTYPE= 0
##$AXUNIT= <>
##$AZFE= 0.1
##$AZFW= 0.1
##$BCFW= 0
##$BC_mod= 0
##$BYTORDP= 0
##$COROFFS= 0
##$CY= 15
##$DATMOD= 1
##$DC= 0
##$DFILT= <>
##$DTYPP= 0
##$F1P= 0
##$F2P= 0
##$FCOR= 0.5
##$FTSIZE= 32768
##$FT_mod= 6
##$GAMMA= 0
##$GB= 0
##$INTBC= 1
##$INTSCL= 1
##$ISEN= 128
##$LB= 0
##$LEV0= 0
##$LPBIN= 0
##$MAXI= 10000
##$MC2= 0
##$MEAN= 0
##$ME_mod= 0
##$MI= 0
##$NCOEF= 0
##$NC_proc= -8
##$NLEV= 6
##$NOISF1= 0
##$NOISF2= 0
##$NSP= 0
##$NTH_PI= 0
##$NZP= 0
##$OFFSET= 14.98509
##$PC= 1
##$PHC0= 92.4939
##$PHC1= 0
##$PH_mod= 1
##$PKNL= yes
##$PPARMOD= 0
##$PPDIAG= 0
##$PPIPTYP= 0
##$PPMPNUM= 2147483647
##$PPRESOL= 1
##$PSCAL= 4
##$PSIGN= 0
##$PYNMP= <proc.py>
##$REVERSE= no
##$SF= 400.02
##$SI= 32768
##$SIGF1= 0
##$SIGF2= 0
##$SINO= 400
##$SIOLD= 32768
##$SPECTYP= <>
##$SREGLST= <1H.CDCl3>
##$SSB= 0
##$STSI= 32768
##$STSR= 0
##$SW_p= 8223.68421052631
##$SYMM= 0
##$S_DEV= 0
##$TDeff= 65536
##$TDoff= 0
##$TI= <>
##$TILT= no
##$TM1= 0
##$TM2= 0
##$TOPLEV= 0
##$USERP1= <user>
##$USERP2= <user>
##$USERP3= <user>
##$USERP4= <user>
##$USERP5= <user>
##$WDW= 1
##$XDIM= 32768
##$YMAX_p= 444351831
##$YMIN_p= -762863
##$CURPLOT= <Network HP LaserJet P1505>
##$CURPRIN= <$Network HP LaserJet P1505>
##$DFORMAT= <normdp>
##$LAYOUT= <+/1D_H.xwp>
##$LFORMAT= <normlp>
##$PFORMAT= <normpl>
##$SURQMSG= 1
$$ End of Bruker specific parameters
$$ ---------------------------------
##NTUPLES= NMR SPECTRUM
##VAR_NAME=  FREQUENCY,     SPECTRUM/REAL,   SPECTRUM/IMAG
##SYMBOL=    X,             R,               I
##VAR_TYPE=  INDEPENDENT,   DEPENDENT,       DEPENDENT
##VAR_FORM=  AFFN,          ASDF,            ASDF
##VAR_DIM=   32768,         32768,           32768
##UNITS=     HZ,            ARBITRARY UNITS, ARBITRARY UNITS
##FACTOR=    0.250966925370066, 1,           1
##FIRST=     8223.43324360094, -133730,      94707
##LAST=      0,             20508,           -219477
##MIN=       0,             -762863,         0
##MAX=       8223.43324360094, 444351831,    0
$$ Real data points
##PAGE= N=1
##DATA TABLE= (X++(R..R)), XYDATA
$$ [...]
19471c36599a13519C2994b40450j58270C1385b33637r1245M9488j6360E3080a6050
$$ -336599 -113519 32994 -240450 -398720 31385 -233637 -324882 -275394 -291754 53080 -16050
19459b56345A01770e8781j37762A52482J6545b46j13399k87088J91419b8668j87615
$$ -256345 101770 -58781 -196543 152482 169027 -246 -113645 -400733 -209314 -28668 -216283
19448b16283j25757D08691d4504l23682E3968a3791L923p4629c8130A8165a6083
$$ -216283 -342040 408691 -44504 -368186 53968 -13791 -9868 -84497 -38130 18165 -16083
19436A00276c7753l68926a88167k4714Q0550B9241a64856e4170j39409j01224
$$ 100276 -37753 -406679 -188167 -212881 -132331 29241 -164856 -54170 -193579 -294803
19426b94803G6898b30970J0580j35736D5577A0119P3312a44986C37812E8774B6644
$$ -294803 76898 -230970 -220390 -356126 45577 10119 83431 -144986 337812 58774 26644
19414i2868i120A97064a28485B00358H7220a56384a7499A00771J5861B6934F182
$$ -92868 -9120 197064 -128485 200358 87220 -156384 -17499 100771 116632 26934 6182
19402b89990h6135F5363K5650i1831q1926D324L762b80537Q7960f4960k52572
$$ -289990 -86135 65363 91013 -91831 -173757 4324 8086 -280537 -192577 -64960 -317532
19391c17532m9538B81259a20421j19416D40360h2304A88443a97783e1201K1702
$$ -317532 -367070 281259 -120421 -239837 440360 -82304 188443 -197783 -51201 -29499
19381b9499k65609M6822Q137i0j61142e4363D1257K65501j46916o3728a34501
$$ -29499 -295108 -248286 -240149 -90 -161232 -54363 41257 306758 159842 96114 -134501
19369F5171a92011l8658g2388A52854i8654k37220B3355h5550j56071G4121d896
$$ 65171 -192011 -230669 -72388 152854 -98654 -335874 23355 -85550 -241621 74121 -4896
19357G2045a02315D01057b43698A1955c7205a1361C3939a43632B6226a92633C22856
$$ 72045 -102315 401057 -243698 11955 -37205 -11361 33939 -143632 26226 -192633 322856
19345A13814b57750A77174N2694D3548b07476p0153A17184C5604F060d55868A77571
$$ 113814 -257750 177174 229868 43548 -207476 -277629 117184 35604 6060 -455868 177571
19333i9453K8666A21918h7470j13363A8723a90569b0171m49092E0912O6818A5495
$$ -99453 -70787 121918 -87470 -200833 18723 -190569 -20171 -469263 50912 117730 15495
19321b21178o0524D2994a83869C2919J06759a60021D964K5063K94245I4962A6324
$$ -221178 -281702 42994 -183869 32919 139678 -160021 4964 30027 324272 94962 16324
19309b12308h9080j91690D6582c8552k63948A69382P8163e9363A92593F9131a02839
$$ -212308 -89080 -280770 46582 -38552 -302500 169382 247545 -59363 192593 69131 -102839
19297A03095a81414C74977E5873a00082j05111C80428c5993l39794F4729b31598
$$ 103095 -181414 374977 55873 -100082 -205193 380428 -35993 -375787 64729 -231598
19286c7424J3537A12181f6451j23644O2525e2177j60759G8021a49481G2879J1669
$$ -37424 -23887 112181 -66451 -190095 -127570 -52177 -212936 78021 -149481 72879 84548
19275H4548e8519E457b38275A10852b02727A06647a07831c1237j27216P1244l31544
$$ 84548 -58519 5457 -238275 110852 -202727 106647 -107831 -31237 -158453 -87209 -418753
19264d18753e5625A09929M758A0253a75747A55293b597j44544L0209B0282a13528
$$ -418753 -55625 109929 114687 10253 -175747 155293 -2597 -147141 -116932 20282 -113528
19252b54263A61068a1645m22673J69114d0766l27300B33489a00096l4288j48548
$$ -254263 161068 -11645 -434318 -265204 -40766 -368066 233489 -100096 -134384 -282932
19242b82932a14331A0719L509g9887f43n3470j06540A66922J00928b2798A43528
$$ -282932 -114331 10719 14228 -79887 -643 -54113 -160653 166922 267850 -22798 143528
19230d3118l5209J2819j1683J0340A0237J09044A0155b90830J0546e2213a7722
$$ -43118 -78327 -65508 -77191 -66851 10237 119281 10155 -290830 -280284 -52213 -17722
19218B2529b31927j37813N9772a05850n1857B90059a16179C3369M298J02497d8267
$$ 22529 -231927 -369740 -309968 -105850 -157707 290059 -116179 33369 37667 140164 -48267
19206d2144j01245G215e9942B5148N7785f1741K9082j77036A9649c37334d1353
$$ -42144 -143389 7215 -59942 25148 82933 -61741 -32659 -209695 19649 -337334 -41353
19194A410c0045B70854H2327a93841C39634a05720j85111J16806G4670a24325
$$ 1410 -30045 270854 82327 -193841 339634 -105720 -290831 -174025 74670 -124325
19183A3495i4554j82149a23123A6652a40497A92491F5103O1704h332C8436P1874
$$ 13495 -94554 -276703 -123123 16652 -140497 192491 65103 126807 -8332 38436 110310
19172A10310A4068a50564n4406A6648O1181b88706J05026O565I7903C3628G358
$$ 110310 14068 -150564 -204970 16648 77829 -288706 -183680 -177115 97903 33628 7358
19160d77479h7248A49860e5114k59894A28913a97757d2001q2394e6703j06480
$$ -477479 -87248 149860 -55114 -315008 128913 -197757 -42001 -124395 -56703 -163183
19150a63183A15784a27724A53295j9826c23838J30030A32378a26812j55436i9586
$$ -163183 115784 -127724 153295 133469 -323838 -193808 132378 -126812 -282248 -99586
19139A34638b68015C4176L0733e1452m4642D4583k0146a89017J3887H0251J5673
$$ 134638 -268015 34176 64909 -51452 -96094 44583 24437 -189017 -175130 80251 95924
19128I5924a43427o9451A19127b41329o9328J7145B28457a86434n6246J05555
$$ 95924 -143427 -212878 119127 -241329 -310657 -293512 228457 -186434 -242680 -137125
19118a37125r2984k57791q2932K68091i4772j37774A10907E5111i8414E614h936
$$ -137125 -230109 -487900 -570832 -302741 -94772 -232546 110907 55111 -98414 5614 -8936
19106a17672o4341L2626p1654h8635B59584b26495j04319A30037a16576c2909
$$ -117672 -182013 -149387 -221041 -88635 259584 -226495 -330814 130037 -116576 -32909
19095b00136G0427a24045M4478j73959D4109K8850f2659k75789A87189D3858a38461
$$ -200136 70427 -124045 -79567 -253526 44109 72959 -62659 -338448 187189 43858 -138461
19083h0704a8281C49686i4345A74890p2559b3870A04149i9682F2629Q5962Q151
$$ -80704 -18281 349686 -94345 174890 102331 -23870 104149 -99682 62629 148591 156742
19072A56742L2467q0029B7418J541J01547a44739B97101a94061B078b26424H4378
$$ 156742 189209 109180 27418 28959 130506 -144739 297101 -194061 2078 -226424 84378
19060d1660j17590j80476D8217b15393c7629H8575a417l3322D5927b91101a2314
$$ -41660 -159250 -339726 48217 -215393 -37629 88575 -1417 -34739 45927 -291101 -12314
19048B26195e5594B10709G6890i7040b7827n2048A82910J5730l860a24220o1213
$$ 226195 -55594 210709 76890 -97040 -27827 -79875 182910 198640 194780 -124220 -185433
19037a85433h993k94115g7343n832k53676J43443b1992A49231J622b59443G8860
$$ -185433 -8993 -303108 -77343 -83175 -336851 -193408 -21992 149231 150853 -259443 78860
19025b60399A03526K23404a32203c6743k27889R2438a1134j94851G4606J52367
$$ -260399 103526 326930 -132203 -36743 -264632 -172194 -11134 -205985 74606 226973
19015B26973b06495P7903f1085j16556j27399K7590a11726b2479N08j671k67189
$$ 226973 -206495 -128592 -61085 -177641 -305040 -277450 -111726 -22479 -21971 -23642 -290831
19004b90831I4099b00923A73752a36252m9585F5399P7282J74252I382b19778Q5772
$$ -290831 94099 -200923 173752 -136252 -185837 65399 142681 316933 9382 -219778 -134006
18993a34006A31215a79763F9926a4728m5140K6324A01496a74211d4336l09767
$$ -134006 131215 -179763 69926 -14728 -59868 -33544 101496 -174211 -44336 -354103
18983c54103a0496k4799B8449O7927c33803J31721Q9278h112j96017N7115f9824
$$ -354103 -10496 -35295 28449 96376 -333803 -202082 -112804 -8112 -204129 -147014 -69824
18971A59515c2164D05881j66943j00039D8944P2902B6321L06888b14238l3961
$$ 159515 -32164 405881 238938 138899 48944 121846 26321 333209 -214238 -248199
18961b48199m8406B78380c43636J14895g7140A0360g139r1591r3217o3842c0685
$$ -248199 -296605 278380 -343636 -228741 -77140 10360 -7139 -98730 -191947 -255789 -30685
18949a10852o1951A65347a86365l65605e075H6408d6464l13688A19072a16475
$$ -110852 -172803 165347 -186365 -551970 -5075 86408 -46464 -360152 119072 -116475
18938c02516l395A98848b99528a34443b8604m67166a29516r4344f9702I7413a73291
$$ -302516 -305911 198848 -299528 -134443 -28604 -495770 -129516 -223860 -69702 97413 -173291
18926g1003B50954a87155p2808r4757b740k29902A36141f07899A07719d8196l9228
$$ -71003 250954 -187155 -259963 -354720 -2740 -232642 136141 -607899 107719 -48196 -87424
18915h7424m14850a15449i845j93314A01891j3342i3988A66230m3063L6541L59076
$$ -87424 -502274 -115449 -9845 -203159 101891 88549 -93988 166230 123167 159708 518784
18904E18784H6130a75752Q3476o7097j57178J33903C0000j0313J28449o8697b52118
$$ 518784 86130 -175752 -92276 -159373 -316551 -182648 30000 19687 148136 79439 -252118
18892a23443o9629C16705C2267c4133A83348E381J14946c6046j22551n928o1257
$$ -123443 -193072 316705 32267 -34133 183348 5381 120327 -36046 -158597 -164525 -225782
18881b25782a11228A04885b82758J13149O508p627L8879O3428c351B1495d12718
$$ -225782 -111228 104885 -282758 -169609 -163101 -170728 -131849 -68421 -3351 21495 -412718
18869D31636h0451B79977J30554d6808D2620Q4333b66605a01971A38606c1135
$$ 431636 -80451 279977 410531 -46808 42620 126953 -266605 -101971 138606 -31135
18858A76874d46120a603B48447f9131A07822R634a47225d8890o9453I619a2426
$$ 176874 -446120 -1603 248447 -69131 107822 117456 -147225 -48890 -118343 9619 -12426
18846A00152A1055j390N1572B9089a51829A5413a06378j24396I7677L7937d1253
$$ 100152 11055 9665 61237 29089 -151829 15413 -106378 -230774 97677 135614 -41253
18834a3403F0326h2855j108r7879A79629a45636b165D20948a6452q1049A19101
$$ -13403 60326 -82855 -83963 -181842 179629 -145636 -2165 420948 -16452 -97501 119101
18822A2849K4788j0396J25170a15811A40853K7208G3585c85295c3701a861F0410
$$ 12849 37637 27241 152411 -115811 140853 168061 73585 -385295 -33701 -1861 60410
18810B19406r9111a64464B26581a64226H4453a24812b0013j01821b6285J102l39609
$$ 219406 120295 -164464 226581 -164226 84453 -124812 -20013 -121834 -26285 -25183 -364792
18799c64792J32977g2443E8279a36757n8537b6600j43229B9752O4479c71805L3087
$$ -364792 -231815 -72443 58279 -136757 -195294 -26600 -169829 29752 94231 -371805 -338718
18788c38718D4702e7003l70062A21935b54006k56889a91451l9820C3968q709P9586
$$ -338718 44702 -57003 -427065 121935 -254006 -510895 -191451 -231271 33968 25259 104845
18777A04845b09900C5831J46471H895L13425H0292a67113L726j69992A0666a05802
$$ 104845 -209900 35831 182302 8895 322320 80292 -167113 -163387 -333379 10666 -105802
18765A41189A5381a17026A31284l27c37361a18854L0149o9422a0686j28975J6295
$$ 141189 15381 -117026 131284 130957 -337361 -118854 -88705 -158127 -10686 -139661 -123366
18754a23366M7909j74193j52071a585B76519b00881A57933B2153N3099Q1626J02500
$$ -123366 -75457 -249650 -401721 -1585 276519 -200881 157933 22153 75252 156878 259378
18743B59378a01664n8787B19456a50146A10751a79150e8689q2041M2942A7009
$$ 259378 -101664 -160451 219456 -150146 110751 -179150 -58689 -140730 -97788 17009
18732c11209E2828a69264I2850J96983A43907K8780g9523m02092b7755B1009a25568
$$ -311209 52828 -169264 92850 289833 143907 172687 -79523 -481615 -27755 21009 -125568
18720b38786B06302a76538f6316A50366e6163p7677G0834c34502F4080b81153
$$ -238786 206302 -176538 -66316 150366 -56163 -133840 70834 -334502 64080 -281153
18709f3438a1507F8235M2395a73757c2347k12732J05528N1695C2969J27191b33963
$$ -63438 -11507 68235 110630 -173757 -32347 -245079 -139551 -87856 32969 160160 -233963
18697a36431n6118C82670A30783A3807e1170k64688B01420a13636j90222A03638
$$ -136431 -192549 382670 130783 13807 -51170 -315858 201420 -113636 -303858 103638
18686a83717E5549d7293a8246k17298G3740C5948c9099A47944b34086G3585c44297
$$ -183717 55549 -47293 -18246 -235544 73740 35948 -39099 147944 -234086 73585 -344297
18674D5598a34406L6132k1949A95235e4798n2342j42696i4243G0851n432d8308
$$ 45598 -134406 -98274 -120223 195235 -54798 -107140 -249836 -94243 70851 65419 -48308
18662a66103A7639E286a11717A27481J07956a51j11934j36989p8444I8659J3415
$$ -166103 17639 5286 -111717 127481 235437 -151 -112085 -249074 -327518 98659 112074
18651A12074R5431a70855N49g8619b1327B4495b211k07324b0319N890j14249A05094
$$ 112074 207505 -170855 -170306 -78619 -21327 24495 -2211 -209535 -20319 -14429 -128678 105094
18638i9197G9479a63334A38845d4360m50353I0324C4211g1738j24839A6813i7760
$$ -99197 79479 -163334 138845 -44360 -494713 90324 34211 -71738 -196577 16813 -97760
18626a82994C3559c3267B85120G8437c2299j7969C2340P0263b44117k44715I08
$$ -182994 33559 -33267 285120 78437 -32299 -50268 32340 102603 -244117 -488832 908
18614i390o7335B9462d5869r7856C6174b96278E0129h3981A1433a11906k05890
$$ -9390 -76725 29462 -45869 -143725 36174 -296278 50129 -83981 11433 -111906 -317796
18603c17796A69928f2786G7039g9646p0853A7691a88726A99625d7649k35572B75889
$$ -317796 169928 -62786 77039 -79646 -150499 17691 -188726 199625 -47649 -283221 275889
18591g8194A86548A6566b26986b9497o1469A9775J640a18888c4065j82135b341
$$ -78194 186548 16566 -226986 -29497 -90966 19775 21415 -118888 -34065 -216200 -2341
18579a99436g9967h111l33152J5182E5981J69859c5946l84724G8893a53529I1354
$$ -199436 -79967 -8111 -341263 -326081 55981 225840 -35946 -420670 78893 -153529 91354
18567b56774g0693B36101n0317a6963H5817a51180A36254h7235l5572a1334j00007
$$ -256774 -70693 236101 185784 -16963 85817 -151180 136254 -87235 -122807 -11334 -111341
18556a11341A68899h2523j8142B96343a57978J5896A304g9932B91245p2114j02452
$$ -111341 168899 -82523 -100665 296343 -157978 -142082 1304 -79932 291245 219131 116679
18545A16679d4925M584l3791j05580j2829A61656a54547K5004r5264K868P2297
$$ 116679 -44925 -40341 -74132 -179712 -192541 161656 -154547 -129543 -224807 -221939 -149642
18534a49642B86934A01404m8183k6350K3879K87957F6723J61308b83588a16773
$$ -149642 286934 101404 53221 26871 50750 338707 66723 228031 -283588 -116773
18523a32999g040l31562N5494e5721j37809I0849a64175c0639B08195I9419b47980
$$ -132999 -7040 -338602 -283108 -55721 -193530 90849 -164175 -30639 208195 99419 -247980
18511A65726i3455m3426E8663J56978B5476L9932a02051K7820j6074k67416G0727
$$ 165726 -93455 -136881 58663 215641 25476 65408 -102051 -74231 -90305 -357721 70727
18499I8528J30257C8577a27475l9694m1656B7758M8561R0750K3375g707l76545
$$ 98528 228785 38577 -127475 -167169 -208825 27758 76319 167069 190444 -7707 -384252
18488c84252a24579O0412A19751b59713J19173c8182A32512a4248k05442A31559
$$ -384252 -124579 -64167 119751 -259713 -140540 -38182 132512 -14248 -219690 131559
18477D3944e9011H8198a1673A83453L1722c37787f7977j99699g2068l7202A5840
$$ 43944 -59011 88198 -11673 183453 215175 -337787 -67977 -267676 -72068 -109270 15840
18465a91433l6119D565J36760o5982i9853j21536C30619b35128G1700b8091k7427
$$ -191433 -227552 4565 141325 75343 -99853 -221389 330619 -235128 71700 -28091 -55518
18454e5518A30993c98267J01356J4484I0379c95750R8254J23905N5014b3881j19982
$$ -55518 130993 -398267 -296911 -282427 90379 -395750 -297496 -173591 -118577 -23881 -143863
18443a43863B8004L02341A4044a81032L8068d580H6939O2178F5510a18821k46103
$$ -143863 28004 330345 14044 -181032 -142964 -4580 86939 149117 65510 -118821 -364924
18432c64924a08534M1841K4065j09550K617N0197C9099i4655A47917f7511E9334
$$ -364924 -108534 -66693 -42628 -152178 -149561 -99364 39099 -94655 147917 -67511 59334
18420a70482E4912a07320A10504C3518M4548N4171C1112L32422a59744P0587B5274
$$ -170482 54912 -107320 110504 33518 78066 132237 31112 363534 -159744 -89157 25274
18408A01249E149b05294A98371h2810E3422d01247A82743k7803a43499O4783j96965
$$ 101249 5149 -205294 198371 -82810 53422 -401247 182743 154940 -143499 -78716 -275681
18397b75681R0407f8170l7290A44337e8681B04467K18254A49046l1767d12188
$$ -275681 -185274 -68170 -105460 144337 -58681 204467 422721 149046 117279 -412188
18386b13448j05779B96671a62217J5201J5050D7973L1588A3596c20721c4785C66884
$$ -213448 -319227 296671 -162217 -147016 -131966 47973 79561 13596 -320721 -34785 366884
18374a88700m0036B50336a88322F2683a10670j66844G0600a04989J0996B5811
$$ -188700 -228736 250336 -188322 62683 -110670 -277514 70600 -104989 -93993 25811
18363a49379J0369A84303i8910J9009l4653A37287b30677F4746b59526q8732a7037
$$ -149379 -139010 184303 -98910 -79901 -114554 137287 -230677 64746 -259526 -348258 -17037
18351G4716K200A813J82104o3359m9705a57066A30933a8469G0781a72808r3645
$$ 74716 76916 1813 183917 120558 70853 -157066 130933 -18469 70781 -172808 -266453
18340b66453f0917j8033K361B19501d9607j60213B428b20503M1636L7456A20402
$$ -266453 -60917 -78950 -76589 219501 -49607 -209820 2428 -220503 -178867 -141411 120402
18328a16838M0470A22068Q2880E4478a7856A48669Q44g1238j23939A63567F9703
$$ -116838 -76368 122068 204948 54478 -17856 148669 149513 -71238 -195177 163567 69703
18316h1295j42118p0476A30533K5585b54837a6654E6851F491a3519j54222I6511
$$ -81295 -223413 -293889 130533 156118 -254837 -16654 56851 6491 -13519 -167741 96511
18304b65347A80250a15968r6070B93726A1732b25234C05852a0147n57266A77507
$$ -265347 180250 -115968 -212038 293726 11732 -225234 305852 -10147 -567413 177507
18293b13017a709m08470b7901A67662d43742B52601I3636K25728a79196D79938
$$ -213017 -1709 -410179 -27901 167662 -443742 252601 93636 319364 -179196 479938
18282c42160B14134o7323c96102a00601A13381b05761g9068M159C5739A2016g4945
$$ -342160 214134 146811 -396102 -100601 113381 -205761 -79068 -74909 35739 12016 -74945
18270A39186a94532f1969A38799m7672E280a71905f7623a6930A99811e0276j92644
$$ 139186 -194532 -61969 138799 91127 5280 -171905 -67623 -16930 199811 -50276 -242920
18259b42920a09525k37468a00805b6941C7743a32256D53255j74742c6444B9864
$$ -242920 -109525 -346993 -100805 -26941 37743 -132256 453255 278513 -36444 29864
18248B9355N7494a36477e9786B13674a0211F3075K8455J42453B1478K4247n11
$$ 29355 86849 -136477 -59786 213674 -10211 63075 91530 233983 21478 45725 45214
18237D5214g5978p5282B65560b09752i707B37536f1324n6293L4749G5707I754
$$ 45214 -75978 -151260 265560 -209752 -9707 237536 -61324 -117617 -82868 75707 9754
18225a48483b8690A76296H753c02812C5155c53255C0621a15925k6979A872c71730
$$ -148483 -28690 176296 8753 -302812 35155 -353255 30621 -115925 -142904 1872 -371730
18213c9063G8317a05957e2563K2316N280A5872L9601a45750A92144A1238J87107
$$ -39063 78317 -105957 -52563 -30247 -24967 15872 55473 -145750 192144 11238 198345
18202A98345a08258L2395F070c12372A57737n8419M2545a41164j02731Q5123A77172
$$ 198345 -108258 -75863 6070 -312372 157737 99318 141863 -141164 -243895 -158772 177172
18190A46771b4010q3120Q083I4731e48144C48722H2664f2609k59829J05570b0809
$$ 146771 -24010 -107130 -99047 94731 -548144 348722 82664 -62609 -322438 -216868 -20809
18178D9254d9815D2303c70540d3240q7807d7765A7256b09818g3588k79902B8149
$$ 49254 -49815 42303 -370540 -43240 -131047 -47765 17256 -209818 -73588 -353490 28149
18166i1832p0589A17699D7355M0147a55863f4331L0383B40043b70080c120k97030
$$ -91832 -162421 117699 47355 87502 -155863 -64331 -33948 240043 -270080 -3120 -300150
18155c00150E5429R8463b4457B6597b36070h453A73132d55776A57364a23501j43997
$$ -300150 55429 153892 -24457 26597 -236070 -8453 173132 -455776 157364 -123501 -267498
18144b67498A00330b21475i7381A56035a86460I7783a11188j7351r245B42661
$$ -267498 100330 -221475 -97381 156035 -186460 97783 -111188 -128539 -137784 242661
18133A21397m6603c81427p6255ik06434d7781B21338B6099J35778i6109B58433
$$ 121397 74794 -381427 -457682 -9 -206443 -47781 221338 26099 161877 -96109 258433
18121H3682Q1368a88184d9332C7640a9914j06074E2685L662f380j00193j36452
$$ 83682 165050 -188184 -49332 37640 -19914 -125988 52685 56347 -6380 -106573 -243025
18110b43025Q1350B51254P635j00763j936l8344J10704I5715b24031A54244E4373
$$ -243025 -161675 251254 258889 158126 156190 117846 228550 95715 -224031 154244 54373
18098A70859H3998h060D756N0703o248f7316j71509E6295a29211j06791c4458
$$ 170859 83998 -8060 4756 55459 49211 -67316 -238825 56295 -129211 -236002 -34458
18086a37115k97992G8271k3281P6440g419D4606f4126j98445A50026i9612A0728
$$ -137115 -435107 78271 54990 131430 -7419 44606 -64126 -262571 150026 -99612 10728
18074a2780j6972A0112K27247B7250j2531m10K45042e3140l3436c9258p3238N3415
$$ -12780 -29752 10112 237359 27250 14719 14309 259351 -53140 -86576 -39258 -112496 -59081
18062e9081j44490j609C06009h0211k00376H1482a0289k1006A18495a49811L9449
$$ -59081 -203571 -205180 306009 -80211 -280587 81482 -10289 -31295 118495 -149811 -110362
18051a10362k2006j61917e8249B36504H2684c5903B4661K0367b27738l4879C59590
$$ -110362 -132368 -294285 -58249 236504 82684 -35903 24661 45028 -227738 -262617 359590
18039A67965b58081O1952c2107G3762C1475b81988A39082m0113O0292f8256a271
$$ 167965 -258081 -196129 -32107 73762 31475 -281988 139082 98969 159261 -68256 -1271
18027A18774i1847K3527n2058A44091N5211H9319b79902c2739A25677n9720b5128
$$ 118774 -91847 -68320 -120378 144091 199302 89319 -279902 -32739 125677 65957 -25128
18015e1777I0724d3881A69885d7970B10996C3304a19001r539j28624A10227l9392
$$ -51777 90724 -43881 169885 -47970 210996 33304 -119001 -128540 -257164 110227 70835
18004G0835a71443B1906c5541E4805h1635a1613o8160F370K50351a32765F5512
$$ 70835 -171443 21906 -35541 54805 -81635 -11613 -79773 6370 256721 -132765 65512
17992d62681P2384B08266f6884A96182i8793H7450J77983D0169b79014D7690M7204
$$ -462681 -390297 208266 -66884 196182 -98793 87450 265433 40169 -279014 47690 94894
17981I4894C9274R2699n9794c49341A27147a51896H8735m3177j3227Q776J16928
$$ 94894 39274 131973 72179 -349341 127147 -151896 88735 45558 32331 41107 158035
17970A58035a38952D5447c9965B12772r796B8240M7910L1728b04915D0975a01176
$$ 158035 -138952 45447 -39965 212772 202976 28240 76150 107878 -204915 40975 -101176
17958D45826e6374a853l3180A90395a8725A58897j3699C3988K40282b289j30019
$$ 445826 -56374 -1853 -35033 190395 -18725 158897 145198 33988 274270 -2289 -132308
17947a32308k39704h3658j19292L5934l7844B96446B4470f986j54635K0123o8823
$$ -132308 -372012 -83658 -202950 -167016 -204860 296446 24470 -6986 -161621 -141498 -210321
17936b10321N7389C36447a82755B6527O5832h5217k4372l4376b9024A50075d44779
$$ -210321 -152932 336447 -182755 26527 92359 -85217 -109589 -143965 -29024 150075 -444779
17924A42176o7232J0012b8544k10228a18523l9006e1823p5998C18011j42815l5606
$$ 142176 74944 84956 -28544 -238772 -118523 -157529 -51823 -127821 318011 175196 139590
17913A39590c56197A95303a64710D784J29643L3576A0873b57646D6426R5292n3867
$$ 139590 -356197 195303 -164710 4784 134427 168003 10873 -257646 46426 141718 87851
17902H7851b70492C60449a05642j56719P160f8115H9866J8928a32977c8676k91566
$$ 87851 -270492 360449 -105642 -262361 -255201 -68115 89866 108794 -132977 -38676 -330242
17891c30242J01478C1897a53857p3893h9384c5094j54000O2758O0658j17056j31200
$$ -330242 -228764 31897 -153857 -227750 -89384 -35094 -189094 -126336 -65678 -182734 -313934
17880c13934A11311n2135B0951J07860N837K5583o9008M5347a50851C9335a29509
$$ -313934 111311 59176 20951 128811 134648 160231 91223 136570 -150851 39335 -129509
17868f2673C5223J43122a80774b304A69035a3628C85773A23662m8000d0372A98523
$$ -62673 35223 178345 -180774 -2304 169035 -13628 385773 123662 75662 -40372 198523
17856B825a21408r4134d6306H1618a45024B51728b86082N520A23816a33233J1190
$$ 2825 -121408 -215542 -46306 81618 -145024 251728 -286082 -280562 123816 -133233 -122043
17845a22043j59541D6526b91905B78048D5713j3138a52304E1603c6568B47077
$$ -122043 -281584 46526 -291905 278048 45713 32575 -152304 51603 -36568 247077
17834A11470e1695B5490a74091C2268a63521J1975A9089b10766B0025a17024A42420
$$ 111470 -51695 25490 -174091 32268 -163521 -151546 19089 -210766 20025 -117024 142420
17822B72243k175A13466n1083M21b26123B45312D9972J62299r6523c40530i6807
$$ 272243 270068 113466 62383 62804 -226123 245312 49972 212271 115748 -340530 -96807
17810a85600O7290m1155A70977p9371r148a58319g4945E5733a58472g0546j09062
$$ -185600 -118310 -159465 170977 91606 82458 -158319 -74945 55733 -158472 -70546 -179608
17799a79608Q5414b905j45515B25585K915N8982b56262A01481e1842A23300M0281
$$ -179608 -94194 -2905 -148420 225585 228500 287482 -256262 101481 -51842 123300 163581
17788A63581a6062A21746a77324A13563a70480g5837A30134J09509c8687B54843
$$ 163581 -16062 121746 -177324 113563 -170480 -75837 130134 239643 -38687 254843
17777G8508P5817J3358b59747I1842A397a79997I7351a86485c2493A41481K3700
$$ 78508 154325 167683 -259747 91842 1397 -179997 97351 -186485 -32493 141481 165181
17766A65181G8046n056e8545C0318P6312n1095a07771j07414e3562a7346I4304
$$ 165181 78046 72990 -58545 30318 106630 55535 -107771 -215185 -53562 -17346 94304
17754c33532B18958k8072C497Q5875Q5992n4042L6057c7822k0905B22901a00524
$$ -333532 218958 190886 3497 89372 175364 121322 157379 -37822 -58727 222901 -100524
17742A43707a270B75274F4051Q8897d5635k8258j33475c601A48275k7974a3799
$$ 143707 -1270 275274 64051 152948 -45635 -73893 -207368 -3601 148275 120301 -13799
17730C33821A26412R6586L114R7949A58927b14220G491K64055b8720l51700A98785
$$ 333821 126412 222998 226112 324061 158927 -214220 7491 271546 -28720 -380420 198785
17718a10829B56682M1208E5235f3020j13704A13394f2678p3801H9330J94406p8006
$$ -110829 256682 297890 55235 -63020 -176724 113394 -62678 -136479 89330 283736 205730
17707B05730b13386a2432C1701a07069I2400K49401d4131B12486I8609p748K4718
$$ 205730 -213386 -12432 31701 -107069 92400 341801 -44131 212486 98609 90861 115579
17696A15579J7128c17645D2861a78995C52938a24740A10211N5950c9739j7157
$$ 115579 132707 -317645 42861 -178995 352938 -124740 110211 166161 -39739 -56896
17686e6896A42639b45182A49864b92265h8446d869F4858c9650E8326N5809K0367
$$ -56896 142639 -245182 149864 -292265 -88446 -4869 64858 -39650 58326 114135 134502
17675A34502A2261Q5445b12221A03711a51792F5331J38984m5245j2213K19704
$$ 134502 12261 97706 -212221 103711 -151792 65331 204315 159070 146857 366561
17665C66561F8428J72988O9433j35454p1239J1051J64827A23451P8343J71113
$$ 366561 68428 241416 310849 175395 104156 115207 280034 123451 201794 372907
17655C72907D6651J4186R2877c7455C06153c2529k46412D1281Q1640c5748J6116
$$ 372907 46651 60837 153714 -37455 306153 -32529 -278941 41281 122921 -35748 -19632
17644a9632k2675B06223J01146j30361J29886B360Q3603L32187c34485J54838
$$ -19632 -42307 206223 307369 177008 306894 2360 85963 418150 -334485 -179647
17634a79647G9106K619g5952I9260a37659D3480K55772J9635a4454B12166p3053
$$ -179647 79106 81725 -75952 99260 -137659 43480 299252 318887 -14454 212166 139113
17623A39113h8331F2681Q7310D0354K25069H3953d17870B33794A12092a0244k4005
$$ 139113 -88331 62681 149991 40354 265423 83953 -417870 233794 112092 -10244 -34249
17612c4249B82731l0529d6294r0024A30708b45686B23526c456C42636d9286j59947
$$ -34249 282731 252202 -46294 -136318 130708 -245686 223526 -3456 342636 -49286 -209233
17601b09233B80435A12512D8627r702K07434a36960A10977Q0260l7972j4415O8008
$$ -209233 280435 112512 48627 38925 246359 -136960 110977 191237 153265 138850 206858
17590B06858b03374c999k18682A34503j4507b02882A35461a56960A02221L0077
$$ 206858 -203374 -3999 -222681 134503 119996 -202882 135461 -156960 102221 132298
17580A32298l2287c1304C25172b6631F8702a21710B21132b06563K6997Q3925B68868
$$ 132298 100011 -31304 325172 -26631 68702 -121710 221132 -206563 -179566 -95641 268868
17568B20983q0047J43888C9361a95350G798J03025a89979M7982A09921B8840M6843
$$ 220983 140936 284824 39361 -195350 7798 110823 -189979 -141997 109921 28840 75683
17557G5683K8922h8978F8149J02387a03120B42354l8558L7175L326e8842B23583
$$ 75683 104605 -88978 68149 170536 -103120 242354 203796 240971 244297 -58842 223583
17545B3576b4470A66869g0256A28971K34298j40916M1834K10361j22070A43201
$$ 23576 -24470 166869 -70256 128971 363269 222353 264187 474548 352478 143201
17534A87827J27942m6943l4227A00276K24026G2849K98665j09739G7312J17694
$$ 187827 315769 268826 234599 100276 324302 72849 371514 261775 77312 195006
17524A95006J21175M5420j4912L81363K13718k76230B94509J80198k27975O8502
$$ 195006 316181 361601 346689 728052 941770 665540 294509 474707 246732 315234
17514C15234Q8568j08291p850j024m8308M4689K6816n8978K53030L56878m04939
$$ 315234 403802 295511 287661 286637 238329 283018 309834 250856 503886 860764 455825
17503D55825j39516O2009j16854r5075O4198j7341I4948J33542I0936k7389P7901
$$ 455825 316309 378318 261464 166389 230587 213246 94948 228490 90936 63547 141448
17492A41448d0257B69890N8042A42459K24298K97639F5211Q351K41804K3303K0780
$$ 141448 -40257 269890 327932 142459 366757 664396 65211 73562 315366 338669 359449
17481C59449A07904K47675A11955Q1340L05233k25820o6757N3405r0523J97898
$$ 359449 107904 355579 111955 193295 498528 272708 205951 259356 168833 366731
17471C66731A25267J13187O0653k9602g9529H659L20267G5643a18863n6071I3469
$$ 366731 125267 238454 299107 269505 -79529 8659 328926 75643 -118863 -174934 93469
17459A65415m7820K90630a05374A62993K08160G6301J84823J12612j86443K89641
$$ 165415 117595 408225 -105374 162993 371153 76301 261124 373736 187293 476934
17449D76934J128L1868k18011J1856O2627B3800J70611J66134Q7350G7123L95711
$$ 476934 478062 509930 291919 303775 366402 23800 194411 360545 447895 77123 472834
17438D72834J52182A26762P9008K38919A29580K20373A68998N66928B13133p3319
$$ 472834 625016 126762 205770 444689 129580 349953 168998 735926 213133 139814
17428A39814O4521J04190a87825B75043j9718J0081D9400L07568a3127B18855
$$ 139814 204335 308525 -187825 275043 255325 265406 49400 356968 -13127 218855
17417H7463O26764h8940C33817A53441M22180J22963B06413J575L00614A30124
$$ 87463 714227 -88940 333817 153441 575621 698584 206413 207988 508602 130124
17406D2293J57442A3110K59290A30510g5855D24250A02156J83810D0871L33074
$$ 42293 199735 13110 272400 130510 -75855 424250 102156 285966 40871 373945
17396C73945j19069a77440C34873i3850A5458M67716a69134A85891E4010A7064
$$ 373945 254876 -177440 334873 -93850 15458 483174 -169134 185891 54010 17064
17385B86546n5339D9757a7289r352B40684K453P5056f8203C1636L1161c48861
$$ 286546 231207 49757 -17289 -26641 240684 243137 318193 -68203 31636 62797 -348861
17373B34015E2984K13921J10697P6472A54564a75829D25436q5951o3707n2193
$$ 234015 52984 266905 377602 454074 154564 -175829 425436 339485 275778 223585
17363B23585C1076J00262j7594K81913I0594c7860j50236A79278a43506B70863
$$ 223585 31076 131338 113744 395657 90594 -37860 -188096 179278 -143506 270863
17352A43976e2110A18805j6625M24950d5419E19778B01331n1366k9082B9280b0385
$$ 143976 -52110 118805 102180 527130 -45419 519778 201331 149965 120883 29280 -20385
17340E6929M9606K16893A56590M6535O1619l5707A2437O6805N6727l8867N9208
$$ 56929 106535 323428 156590 203125 264744 229037 12437 79242 135969 97102 156310
17329A56310J27394J19560I3876M80791k13989A25983J35277j30224o4477K92166
$$ 156310 283704 403264 93876 574667 360678 125983 261260 131036 66559 358725
17319C58725A63072K5866j8653a2620B73112J0237a59447C91441j94454M4318
$$ 358725 163072 188938 170285 -12620 273112 283349 -159447 391441 196987 241305
17309B41305B5905c7460a037A73463J48805P2713A5628a6621B78871D0103L23275
$$ 241305 25905 -37460 -1037 173463 322268 394981 15628 -16621 278871 40103 363378
17298C63378H0524n396a23811A09770R3588r8235O8370K00574G8745J62534J0059
$$ 363378 80524 75128 -123811 109770 203358 105123 173493 374067 78745 241279 251338
17287B51338D2115b0888H3350p953J10538r2000e418A5873K31912a31914B80225
$$ 251338 42115 -20888 83350 75397 185935 93935 -5418 15873 247785 -131914 280225
17275D93179A9902K04287L06987k16078r7343C2066M3412J96093K0270E6321L1064
$$ 493179 19902 224189 531176 315098 217755 32066 75478 271571 291841 56321 87385
17264H7385J8091b7156f658A1720K4925d2794D34412d563D07586j97206H4623
$$ 87385 105476 -27156 -6658 11720 36645 -42794 434412 -4563 407586 210380 84623
17252C23930r1659P7886F7240B4389K67374o2979a23118I7996Q5823K3750K80583
$$ 323930 232271 310157 67240 24389 291763 228784 -123118 97996 183819 207569 488152
17241D88152i0678G1893H164M47902A89743R5991K08543I8390K87736c08733C7658
$$ 488152 -90678 71893 8164 456066 189743 285734 494277 98390 386126 -308733 37658
17229C82719r1455L4432a04685E00034A17153e2014B68762L28797k16452o9408
$$ 382719 291264 325696 -104685 500034 117153 -52014 268762 597559 381107 311699
17219C11699j8056k0287A33879P8711r6910J6895q535J22284p7016J84867A63805
$$ 311699 293643 273356 133879 212590 115680 132575 124040 246324 169308 354175 163805
17207B76382N8416j8511j18604K43416m0407j81170J09988k9892A39099F5528
$$ 276382 334798 316287 197683 441099 400692 219522 329510 299618 139099 65528
17196C93211j46405j1420N9375o8303J09170l5809b3312C90206q843j79888K01248
$$ 393211 246806 235386 294761 226458 335628 299819 -23312 390206 381363 201475 402723
17185D02723A97717L1247O6319J65419J26830K9518Q9897d1507C04040J739j21093
$$ 402723 197717 228964 295283 460702 587532 617050 706947 -41507 304040 305779 184686
17174A84686J23093n8770L06717O1461j67195A94766L43740k44241j5823N1773
$$ 184686 307779 249009 555726 617187 449992 194766 538506 294265 278442 330215
17164C30215j42867K11110j28412J54415j23385j40440N79165k21293A75223j1990
$$ 330215 187348 398458 270046 424461 301076 160636 739801 518508 175223 163233
17154A63233J00854c4273E5920M62798J00321M413B89084L76490k81461j07708
$$ 163233 264087 -34273 55920 518718 619039 623452 289084 665574 384113 276405
17144B76405J42197K06566B43275K92911A73449M7829J39261J52325p838J04234
$$ 276405 418602 625168 243275 536186 173449 221278 360539 512864 505026 609260
17134F09260B99566K35186j96738J87146k46789J14146K85609O8266o3504B91881
$$ 609260 299566 534752 338014 525160 278371 392517 678126 746392 682888 291881
17123A10603J51965j02434L45943A82774J68279K06394j51893m2301L3451A12301
$$ 110603 262568 160134 506077 182774 351053 557447 405554 363253 396704 112301
17112d824E63448B01075K41432A67737Q6522L15389q5407J96317J02388C2119
$$ -4824 563448 201075 442507 167737 254259 569648 484241 680558 782946 32119
17101C04332o8963N5921L19465J9099q5465p8124J80423C01747L27429k559j99128
$$ 304332 235369 291290 610755 629854 544389 466265 646688 301747 629176 626617 427489
17090D27489K42271l24580l6953l8829L52354O2090k66475J68895p093P3899q0216
$$ 427489 669760 345180 308227 269398 621752 683842 417367 586262 579169 653068 572852
17079E72852Q0839k72639J76135j6101j28340J8628J26637k7769k8090j5945K24155
$$ 572852 653691 381052 557187 541086 412746 431374 558011 530242 502152 486207 710362
17068G10362j20477j19872L0435l6404N34520l79835j30422Q1658k0357j00742
$$ 710362 589885 470013 500448 464044 998564 618729 488307 569965 549608 448866
17058D48866N75133m56781M6256H5568N96840o9767j49312K72816k05492k5277
$$ 448866 1023999 567218 613474 85568 682408 612641 463329 736145 530653 505376
17048E05376j12849K98622p0567J64534j345P6736j65275j33090R9926r6887M3229
$$ 505376 392527 691149 620582 785116 783771 860507 695232 562142 662068 565181 608410
17037F08410J85292j28035J86264j02838l0949j3861B88863O1869K46423J97371
$$ 608410 793702 665667 851931 749093 718144 704283 288863 350732 597155 794526
17027G94526C79253L85054J97256j29262k60622r9940O5594R3428l7732K99833
$$ 794526 379253 764307 961563 832301 571679 471739 537333 630761 593029 892862
17017H92862k22669o4583L19561k14189q8311K56257p266j30531J38652k06090
$$ 892862 670193 605610 925171 710982 622671 878928 871662 741131 879783 673693
17007F73693K95413l26760M56686L4485j69684j7743l66164K53442k14322O4745
$$ 673693 969106 642346 1099032 1133517 963833 946090 579926 833368 619046 683791
16997F83791J80151J06483m1596O5163O3675P1631j59468l130P4068J5126J68885
$$ 683791 863942 970425 928829 993992 1057667 1129298 969830 966700 1040768 1055894 1224779
16986A224779q6593j37341j01749M4599j71029M51784m57392M51511R141l13169
$$ 1224779 1138186 1000845 899096 943695 772666 1224450 767058 1218569 1227710 914541
16976I14541J61941j99568J22929p6201J67132o3262L17052j03287j82222J49772
$$ 914541 1076482 876914 999843 923642 1090774 1027512 1344564 1241277 1059055 1208827
16966A208827k92112L40197j09327K8343n8488J33865R8130j28129L14198l47513
$$ 1208827 916715 1256912 1147585 1175928 1117440 1251305 1349435 1221306 1535504 1187991
16956A187991r2819L15064j09988j49335J06837M4122P1582k01962J03244K61382
$$ 1187991 1095172 1410236 1300248 1150913 1257750 1301872 1373454 1171492 1274736 1536118
16946A536118K9547q6883k07638J79920P266R0787m909J15736j21908K526J2397
$$ 1536118 1565665 1478782 1271144 1451064 1458330 1549117 1544208 1659944 1538036 1540562 1552959
16935A552959Q194J49162j30007M15047m01890j56124R5248L066L3680K19378
$$ 1552959 1561153 1710315 1580308 1995355 1593465 1437341 1532589 1535655 1569335 1788713
16925A788713o3953m1109M21993o0872n53834K50764o9721K39741j6065k7794
$$ 1788713 1724760 1683651 2105644 2044772 1490938 1741702 1671981 1911722 1895657 1867863
16915A867863k0488j55404K80741J50033J23779o7241N62J84858k97961o8575
$$ 1867863 1847375 1691971 1972712 2122745 2246524 2179283 2179845 2364703 2066742 1998167
16905A998167M13530k7068j55305M1642o4912j64092L35151j82428J02272K0078
$$ 1998167 2411697 2384629 2229324 2270966 2206054 2041962 2377113 2194685 2296957 2317035
16895B317035j41948K53062j09391J81559J89166j09023R3309K5179L5007j152
$$ 2317035 2175087 2428149 2318758 2500317 2689483 2580460 2673769 2698948 2733955 2732803
16885B732803k25792K4086k9474M59168q2840L6573j20193K35623J53195K07793
$$ 2732803 2507011 2531097 2501623 2960791 2877951 2914524 2794331 3029954 3183149 3390942
16875C390942r642k53351L2909o8523L14244j14384K7870J25841j55693N58879
$$ 3390942 3381300 3127949 3160858 3092335 3406579 3292195 3320065 3445906 3290213 3849092
16865C849092j03483K75122k60311j17717M7870N4301j7718J58957J48142J37576
$$ 3849092 3745609 4020731 3760420 3642703 3690573 3744874 3727156 3886113 4034255 4171831
16855D171831M40759k79666k33193M21410N8003k44261L12276R6922L55932l88296
$$ 4171831 4612590 4332924 4099731 4521141 4579144 4334883 4647159 4744081 5100013 4711717
16845D711717L12287L38532m45517L41666k3393M04253R0392P1381m7844J6420
$$ 4711717 5024004 5362536 4917019 5258685 5235292 5639545 5729937 5801318 5753474 5769894
16835E769894j1672M69491n6643K59305m87678M38303L38897o3368J48460K40113
$$ 5769894 5758222 6227713 6171070 6430375 5942697 6381000 6719897 6656529 6804989 7045102
16825G045102Q9400q8202L23328l052J89969K59753M7831K98523J39368M0383
$$ 7045102 7134502 7046300 7369628 7366576 7556545 7816298 7864129 8162652 8302020 8342403
16815H342403K88289O5448L72423L77583K52030m5306L97754j26419K4329J000165
$$ 8342403 8630692 8696140 9068563 9446146 9698176 9652870 10050624 9924205 9948534 10948699
16805A0948699j43627j23452N37864N78173N00556k27754J62959N35727M28520
$$ 10948699 10805072 10681620 11219484 11797657 12298213 12070459 12233418 12769145 13197665
16796A3197665O1949K50882L53412O30780P54995M07251P3105M71889N02695M49677
$$ 13197665 13259614 13510496 13863908 14494688 15249683 15656934 15730039 16201928 16704623 17154300
16786A7154300N46113O92105L38829Q13128K81828M50798R73158N09298O19728
$$ 17154300 17700413 18392518 18731347 19544475 19826303 20277101 21250259 21759557 22379285
16777B2379285Q94451Q55085N39805Q85115O15984J201869P03468J204847J018081
$$ 22379285 23273736 24128821 24668626 25553741 26169725 27371594 28075062 29279909 30297990
16768C0297990J094554J262937Q46276J564242Q47061K031408J069980J683046
$$ 30297990 31392544 32655481 33501757 35065999 35913060 37944468 39014448 40697494
16760D0697494J496432J697507J746321J735306K154553J890120K187008K039227
$$ 40697494 42193926 43891433 45637754 47373060 49527613 51417733 53604741 55643968
16752E5643968K318532K733885K845373K264553L209383K935311K889069K491067
$$ 55643968 57962500 60696385 63541758 65806311 69015694 71951005 74840074 77331141
16744G7331141L839622L119897L723348L412942L659600L491879L632062L274545
$$ 77331141 81170763 84290660 88014008 91426950 95086550 98578429 102210491 105485036
16736A05485036L969493L583191L023715L105087L281307K522043K529418J938025
$$ 105485036 109454529 113037720 116061435 119166522 122447829 124969872 127499290 129437315
16728A29437315K115169J334431J050253N88188k21887j77698j051575j188986
$$ 129437315 131552484 132886915 133937168 134525356 134303469 134125771 133074196 131885210
16720A31885210j732536j656629k509384k514050l135993k889956l467845l448959
$$ 131885210 130152674 128496045 125986661 123472611 120336618 117446662 113978817 110529858
16712A10529858l351796l652561l776626l395809l568417l690958l543599l036167
$$ 110529858 107178062 103525501 99748875 96353066 92784649 89093691 85550092 82513925
16704H2513925l764062k858753k830659l124842l211667k532490k624856j961216
$$ 82513925 78749863 75891110 73060451 69935609 66723942 64191452 61566596 59605380
16696E9605380k941771k181980k332882j810096k003577j742763j758719k054642
$$ 59605380 56663609 54481629 52148747 50338651 48335074 46592311 44833592 42778950
16688D2778950j413044j525264j428053j566601j179028j575414j035578j000179
$$ 42778950 41365906 39840642 38412589 36845988 35666960 34091546 33055968 32055789
16680C2055789j320786j312364n68462r33843r05351p38728j083576p21607n06653
$$ 32055789 30735003 29422639 28854177 27920334 27014983 26276255 25192679 24471072 23964419
16671B3964419j152313l32032p45468p51572o16205n19742l86790p31279q80256
$$ 23964419 22812106 22480074 21734606 20983034 20366829 19847087 19460297 18729018 17848762
16662A7848762m53510k71400m60932o71441k84001k83827k10231o06581n63472
$$ 17848762 17395252 17123852 16662920 15991479 15707478 15423651 15213420 14606839 14043367
16653A4043367J55665n64670n12415j51159m21266j50521m88012N4560m27678
$$ 14043367 14199032 13634362 13121947 12970788 12549522 12399001 11910989 11965549 11537871
16644A1537871l74099j68619j43911m56283J01604l62467l08148m84223K58644
$$ 11537871 11163772 10995153 10851242 10394959 10496563 10134096 9825948 9341725 9600369
16635I600369j61676k60859n48608J19595l35808o5698l05165l50034O36597p89107
$$ 9600369 9438693 9177834 8629226 8748821 8413013 8347315 8042150 7692116 8328713 7539606
16625G539606j92979q3365k8343P8428L0198q7215k09721n26222O0047j33773
$$ 7539606 7346627 7263262 7234919 7313347 7343545 7256330 7046609 6520387 6580434 6446661
16615F446661j50995j62472J91088k83842k3661j48091k68941K08691l95753R1594
$$ 6446661 6295666 6133194 6324282 6040440 6016779 5868688 5599747 5808438 5412685 5504279
16605E504279j88157k3146k83789K33676J19894j50432l90093j32642J79709j61668
$$ 5504279 5316122 5292976 5009187 5242863 5362757 5212325 4822232 4689590 4869299 4707631
16595D707631j57182K34311m28829j0959j70453J62574j94053j04327J47018K63414
$$ 4707631 4550449 4784760 4355931 4344972 4174519 4337093 4143040 4038713 4185731 4449145
16585D449145k51097R1483k81537j9813l0292m82843L69358J9993k28072l25319
$$ 4449145 4198048 4289531 4007994 3988181 3957889 3475046 3844404 3864397 3636325 3311006
16575C311006N04904P3178n7284k62887j66560k74233K9487L07098l16357K28361
$$ 3311006 3815910 3889088 3831804 3568917 3402357 3128124 3157611 3464709 3148352 3376713
16565C376713K31544m95692K25473p0449l30814K13053j63045K86292m45315K9627
$$ 3376713 3608257 3112565 3338038 3267589 2936775 3149828 2986783 3273075 2827760 2857387
16555B857387k48264K69294k58420K90927m6750n0217J37754m35127L34117m43925
$$ 2857387 2609123 2878417 2619997 2910924 2864174 2813957 2951711 2516584 2850701 2406776
16545B406776K23933J21414m78223L33719l9331l47574M24915l41133M4889j51073
$$ 2406776 2630709 2752123 2273900 2607619 2568288 2220714 2645629 2304496 2349385 2198312
16535B198312j79340O65742m03982J77202o0978k29j30326n4530j22902M07391
$$ 2198312 2018972 2684714 2280732 2457934 2396956 2396727 2266401 2211871 2088969 2496360
16525B496360J6009l18434j19576l34376L85273J35867k71235k17723q9821K17716
$$ 2496360 2512369 2193935 2074359 1739983 2125256 2261123 1989888 1772165 1682344 1900060
16515A900060K02737l77046J54968n20888M97874L87188l08252l42093K74293
$$ 1900060 2102797 1725751 1880719 1359831 1857705 2244893 1936641 1594548 1868841
16506A868841m7062q304j08767J61605q422m6084k88281j34685M61258k98126
$$ 1868841 1821779 1813475 1704708 1866313 1857891 1811807 1523526 1388841 1850099 1551973
16496A551973M47440l17974J7958K95188o41348J96454J46367o7048P5348o4694
$$ 1551973 1999413 1681439 1699397 1994585 1353237 1549691 1696058 1629010 1704358 1639664
16486A639664L0841R395q7653m03404K32883j2691o9094J19112p9236J39594o6913
$$ 1639664 1670505 1679900 1592247 1188843 1421726 1409035 1339941 1459053 1379817 1519411 1452498
16475A452498K14824l89390K58581l07528J42298J12826l22566M25305j3280k17008
$$ 1452498 1667322 1277932 1536513 1228985 1371283 1484109 1161543 1586848 1573568 1356560
16465A356560p6737L1290J46609m3476k36023K06560l788O3698J55955m80532
$$ 1356560 1279823 1311113 1457722 1414246 1178223 1384783 1380995 1444693 1600648 1120116
16455A120116o0113L17652J90513l40328j08666K19666j87512J37215j58225K48776
$$ 1120116 1060003 1377655 1568168 1227840 1119174 1338840 1151328 1288543 1130318 1379094
16445A379094j02581r7828J81314o5970J14105J61285m59525k40761J31556o1159
$$ 1379094 1276513 1178685 1359999 1294029 1408134 1569419 1109894 869133 1000689 939530
16435I39530K5616J86067m4474q4620J36484j44279K76372r9830k62919K30425
$$ 939530 965146 1151213 1106739 1022119 1158603 1014324 1290696 1190866 927947 1158372
16425A158372R229l10823K72501j19185L62367l90835J55222J65336l95495M55434
$$ 1158372 1167601 856778 1129279 1010094 1372461 981626 1136848 1302184 906689 1362123
16415A362123L8827l12822p3363j27077J19008M2067L5247q707J07329j32237
$$ 1362123 1400950 1088128 1014765 887688 1006696 1048763 1084010 1075303 1182632 1050395
16405A050395J17975q5086J77813o8895k75974J61645O0905j22377N5608l31184
$$ 1050395 1168370 1083284 1261097 1192202 916228 1077873 1138778 1016401 1072009 740825
16395G40825J75266j63177j3346R2746K37447J67003j90640N1775j46947K82396
$$ 740825 916091 752914 739568 832314 1069761 1236764 1046124 1097899 950952 1233348
16385A233348k37747j40977K5299j33796K85231j1524j2044q4899q6524m14364
$$ 1233348 995601 854624 879923 746127 1031358 1019834 1007790 922891 836367 422003
16375D22003N65212j88679J02383k80733K32846N4952n6562j65629K70710l58450
$$ 422003 987215 798536 900919 620186 853032 907984 851422 685793 956503 598053
16365E98053L97689j27677O064k27494K11374n1126J68913j12711N4471o7963
$$ 598053 995742 868065 874129 646635 858009 806883 975796 863085 917556 849593
16355H49593r1847J28375o7250j90931j614L45334j85580m632o1319J2651J52694
$$ 849593 757746 886121 818871 627940 626326 971660 786080 781448 720129 732780 885474
16344H85474k45914L9217j0761C18005O59623k9831M900k04986O3552l19037P9634
$$ 885474 639560 678777 668016 318005 977628 947797 952697 747711 811263 492226 571860
16333E71860N09756n12300K93813K66246D33304M02829j18878q0329K63546m6265
$$ 571860 1081616 569316 863129 1129375 433304 836133 717255 636926 900472 854207
16323H54207k11773K49861l14976J67546k12418J55991j43680J69428l2796q4691
$$ 854207 642434 892295 577319 744865 532447 688438 544758 714186 681390 596699
16313E96699j64792K68996J3897C01559J95988K13571k94843J43647N8554K7303
$$ 596699 431907 700903 714800 301559 497547 711118 416275 559922 618476 645779
16303F45779j30959K12290J0703j6663k39329J75584l6564q1027J83638k03376
$$ 645779 514820 727110 737813 721150 481821 657405 620841 539814 723452 520076
16293E20076B13683K64939O49360m70344B96445K16826J73592M7366j36611j14251
$$ 520076 213683 478622 1127982 657638 296445 513271 686863 734229 597618 483367
16283D83367O7429r9681K11409Q2214j98165J35882l40402K77461k20085N4640
$$ 483367 550796 451115 662524 744738 546573 682455 342053 619514 399429 454069
16273D54069L41068j15740k58404q1831K64767l3266k45317M42662k74965J81503
$$ 454069 795137 679397 420993 339162 603929 570663 325346 768008 493043 674546
16263F74546j09338M6685A89043K99580M913J85545j63937j4464K65337C16406
$$ 674546 565208 611893 189043 488623 493536 679081 515144 500680 766017 316406
16252G30427B93199J23942P5795l1166K7284A77183M13294K38292j71774o843
$$ 730427 293199 417141 492936 461770 489054 177183 590477 828769 656995 650152
16242F50152k69631J21482K5881I6250M17749O0157j00351P7778B32524Q8163
$$ 650152 380521 502003 527884 96250 513999 574156 473805 551583 232524 320687
16232C20687M07274A23893L05804M6949J35192N4791B99595K20436n342q3912
$$ 320687 727961 123893 429697 476646 611838 666629 299595 520031 514689 430777
16222D30777J24800P5169l1343k52937l9975K31372j31981j06171J7353N289J75836
$$ 430777 555577 630746 599403 346466 306491 537863 405882 299711 317064 322353 498189
16211D98189k42491K79660B17075K02489J34256J03469B68862J69410J32554j51414
$$ 498189 255698 535358 217075 419564 553820 657289 268862 438272 570826 419412
16201D19412J45967J56475k08230l0482j68538M4780K59711H1606N9453K10239
$$ 419412 565379 721854 513624 483142 314604 359384 619095 81606 141059 351298
16191C51298j20687J22279I8487M24846J59740C34172J34040A10495M96392p5251
$$ 351298 230611 352890 98487 523333 683073 334172 468212 110495 606887 531636
16181E31636j85590J37221A37125M55023B6509O77613j76702j68431j26136j08151
$$ 531636 346046 483267 137125 592148 26509 704122 527420 358989 232853 124702
16171A24702K61206K21590j77324A93354K21605K6349j34913K24296k60037I7677
$$ 124702 385908 607498 430174 193354 414959 441308 306395 530691 270654 97677
16160C54519o9964R4136J06033A50900Q4164J71561A93300P0525J9667m6448l2576
$$ 354519 284555 378691 484724 150900 235064 406625 193300 263825 283492 237044 204468
16149B04468J59631j72965c2651D1843L94191j58542j21593J69243R5806j63747
$$ 204468 364099 191134 -32651 41843 436034 277492 155899 325142 420948 257201
16139B57201D4040M99154B07409p9821J74835j15115J99860J38421c48853d0806
$$ 257201 44040 543194 207409 127588 302423 187308 387168 525589 -348853 -40806
16128E09701k40281K36354k14919J2812R4810A4882O61654A25663P4790J14437
$$ 509701 269420 505774 290855 303667 398477 14882 676536 125663 200453 314890
16118C14890j34826K5860D4990M31809A88909J09042O330j51850P4124H8512J90987
$$ 314890 180064 205924 44990 476799 188909 297951 304281 152431 226555 88512 279499
16107B79499l2651a6388H4329M9447D2880M16437L21230H8264M3704n9412M41407
$$ 279499 246848 -16388 84329 133776 42880 459317 780547 88264 131968 72556 513963
16096E13963A65770K1858D0064J94223j8176b3767B52920J4219F1682K04772G5300
$$ 513963 165770 187628 40064 234287 216111 -23767 252920 267139 61682 266454 75300
16084A99273C3692a3903O229o3609k24899B09128J22386a00047C07841j17103
$$ 199273 33692 -13903 -7674 -71283 -296182 209128 331514 -100047 307841 190738
16074A90738J29202J61675A74601K3290a00189A94236a64532D5208K55673l1172
$$ 190738 319940 481615 174601 197891 -100189 194236 -164532 45208 300881 269709
16064B69709l8802j11493A7739Q6651D0711J10935d0368I0896J71921A30924L00652
$$ 269709 230907 119414 17739 104390 40711 151646 -40368 90896 262817 130924 431576
16053D31576A71688m2005J05100K0997E7308K15624k1495l3228k0824C5494d8280
$$ 431576 171688 129683 234783 255780 57308 272932 251437 218209 197385 35494 -48280
16041A11854l7374k9890i6252cC1274K38762m3637c3244E9588j2731i860r9725
$$ 111854 74480 44590 -96252 -3 31274 270036 226399 -33244 59588 46857 -9860 -109585
16029a09585c5761A55165a29877B74411h6644E05852d7291j42719B84015Q4419
$$ -109585 -35761 155165 -129877 274411 -86644 505852 -47291 -190010 284015 368434
16019C68434d9338l1134f863j65432D4280b55011C21086b08646C3523L5558K61628
$$ 368434 -49338 -80472 -6863 -172295 44280 -255011 321086 -208646 33523 69081 330709
16008C30709A53058m2001M616p233j9007A500b11805A59983b17261A24760O8068
$$ 330709 153058 111057 115673 108440 89433 1500 -211805 159983 -217261 124760 192828
15997A92828c10341D54450B2041a68322A7522a37732k7723B99653G3108J12731
$$ 192828 -310341 454450 22041 -168322 17522 -137732 -165455 299653 73108 185839
15987A85839p5310M53758k30078O27518j76807k40165q9265O2193B57556g378
$$ 185839 110529 564287 334209 961727 784920 544755 455490 517683 257556 -7378
15976B55373d5778B89434a6559B08267a33444C07432a0538A42040D4372a02861
$$ 255373 -45778 289434 -16559 208267 -133444 307432 -10538 142040 44372 -102861
15965b77230E5884a08318H4285K9227Q0669E1905N9170a57193O7383c4673B90531
$$ -277230 55884 -108318 84285 113512 194181 51905 111075 -157193 -89810 -34673 290531
15953a15199K9180d1574C17689D371d5754G3225J35268c7018j37649C1669r63
$$ -115199 -86019 -41574 317689 4371 -45754 73225 208493 -37018 -174667 31669 30706
15942C0706a43006M9726I1525b50280a09739b3467C3910J2165J7587b83775b2315
$$ 30706 -143006 -93280 91525 -250280 -109739 -23467 33910 46075 63662 -283775 -22315
15930b58245g3038C63537a41807F5605J37151a2735G0496b684j09013m0129K7655
$$ -258245 -73038 363537 -141807 65605 202756 -12735 70496 -2684 -111697 -151826 -124171
15919a24171e9423D3524d3459p7186c076B0712a06084A07900e0665r305C24863
$$ -124171 -59423 43524 -43459 -120645 -3076 20712 -106084 107900 -50665 -59970 324863
15907b24633J0885H0415b76463a31163k11851A48752K95548a41342D4744K16247
$$ -224633 -213748 80415 -276463 -131163 -343014 148752 444300 -141342 44744 260991
15897B60991a13430R498j06075N8285P3554p5243a0633k6951B84445r4858q1668
$$ 260991 -113430 -103932 -210007 -151722 -78168 -153411 -10633 -37584 284445 189587 107919
15886A07919g0249G2435M385j6147M686d49773g73B39310a12200L6379c2259A02704
$$ 107919 -70249 72435 76820 60673 65359 -449773 -773 239310 -112200 -75821 -32259 102704
15873G5711e9157l44204q8678A15555B078K630J7128J6264J8457a98022Q6455
$$ 75711 -59157 -403361 -492039 115555 2078 4708 21836 38100 56557 -198022 -111567
15862a11567A44117e9405A66667A3136M1136J09073a92925B42545A651a25477
$$ -111567 144117 -59405 166667 13136 54272 163345 -192925 242545 1651 -125477
15851A35155J2858F6510h8817c4523m2060F3233b3917o5192H9480P0792L7969
$$ 135155 148013 66510 -88817 -34523 -76583 63233 -23917 -89109 89480 160272 198241
15840A98241i2869A22024a00502j24304d356A26226c065r4112E042C48d072C5939
$$ 198241 -92869 122024 -100502 -224806 -4356 126226 -3065 -97177 5042 348 -4072 35939
15827a49589H6112a59199B5394J83586a00235k77755J0051g9534k94505J73594
$$ -149589 86112 -159199 25394 208980 -100235 -377990 -367939 -79534 -374039 -200445
15817b00445E9045e8514p6751A93154a76136n8910c7613r9380J6292j90921J1615
$$ -200445 59045 -58514 -135265 193154 -176136 -235046 -37613 -136993 -120701 -311622 -300007
15806c00007f4554B16603a52959c9307l39956F000J55903a83603N4914B46083
$$ -300007 -64554 216603 -152959 -39307 -379263 6000 161903 -183603 -128689 246083
15795c4620k13082g2675n9123k220A01695a39629e2961j47781H1068c24560j41616
$$ -34620 -247702 -72675 -131798 -134018 101695 -139629 -52961 -200742 81068 -324560 -466176
15784d66176A22956f5485A55369D4204b8841p7772k7282d5186D8356q564a94185
$$ -466176 122956 -65485 155369 44204 -28841 -106613 -133895 -45186 48356 39792 -194185
15772c24727R2230f9025j15491A75391K9981F1015b92545D7672J25497a81382
$$ -324727 -232497 -69025 -184516 175391 205372 61015 -292545 47672 173169 -181382
15761b01429j81108A513J52956m6228B4726J41082m4976a82198A4291R07J27342
$$ -201429 -382537 1513 154469 108241 24726 165808 120832 -182198 14291 15198 142540
15750A42540g2309L172A40729a57667j5707A21335A8867a14747k02166d925P63
$$ 142540 -72309 -69137 140729 -157667 -173374 121335 18867 -114747 -316913 -4925 -4162
15739d162B9481a47914B37399e7403I2504J14423B7700L6572A0726g4592A2649
$$ -4162 29481 -147914 237399 -57403 92504 206927 27700 64272 10726 -74592 12649
15727A05318C7670b27662o096O8844j71415c8390q1303A39340b60803l6479R6770
$$ 105318 37670 -227662 -233758 -164914 -336329 -38390 -119693 139340 -260803 -297282 -200512
15716b00512A55278a45012A84068M1366b99111G6739h0325J148G6483A2713a9302
$$ -200512 155278 -145012 184068 225434 -299111 76739 -80325 -79177 76483 12713 -19302
15704A08210b1453B78159C9057J02589a69053A31226k3145d6962B68978A4155
$$ 108210 -21453 278159 39057 141646 -169053 131226 108081 -46962 268978 14155
15693f0025k13557Q2922L2689D44012F2850a42145k70166C56052j43760p6836
$$ -60025 -273582 -190660 -157971 444012 62850 -142145 -412311 356052 212292 135456
15683A35456a29989d7148l48419R6075e6034q0364A26671b25008l442h2692H3510
$$ 135456 -129989 -47148 -395567 -299492 -56034 -136398 126671 -225008 -228450 -82692 83510
15671d12722J52826e0557j3383J307p4815l7477j6560a0124j98346Q8334A61939
$$ -412722 -259896 -50557 -63940 -62633 -137448 -174925 -191485 -10124 -208470 -120136 161939
15659b34242R5553j2829e0298A20264B7435Q0899J26295b71052e7227E769J53389
$$ -234242 -138689 -151518 -50298 120264 27435 108334 234629 -271052 -57227 5769 159158
15648A59158b84769E3839J41858b32204c6896k35043B73761c01042B6949M719
$$ 159158 -284769 53839 195697 -232204 -36896 -271939 273761 -301042 26949 31668
15638C1668b63674N2008I9739a29088N6062A56404d8730B61370a37038J510l1986
$$ 31668 -263674 -211666 99739 -129088 -73026 156404 -48730 261370 -137038 -135528 -167514
15627a67514i777n3918B06562a35349A1024C762d90489a58016m3981A64946M4240
$$ -167514 -9777 -63695 206562 -135349 11024 3762 -490489 -158016 -201997 164946 209186
15616B09186c311q4449b3394l78751F0751d629j3683D1627h7550p354j05783E1629
$$ 209186 -3311 -87760 -23394 -402145 60751 -4629 -18312 41627 -87550 -94904 -200687 51629
15603a16625j32779H0124a57208l36082f2789K6644C35108b64935A63872A4471
$$ -116625 -249404 80124 -157208 -493290 -62789 -36145 335108 -264935 163872 14471
15592H473c6192J3207j46568h1746I8490J11298a94783r5102F6802c58728a06592
$$ 8473 -36192 -22985 -169553 -81746 98490 209788 -194783 -289885 66802 -358728 -106592
15580C32094a33231A32969k3464b08312D2093a4545C50344B9709J13695K373b41927
$$ 332094 -133231 132969 109505 -208312 42093 -14545 350344 29709 143404 145777 -241927
15568A36523a90441m574b7332k5063k88755a63739l3775m6262a12027B16935a05292
$$ 136523 -190441 -195015 -27332 -52395 -341150 -163739 -197514 -243776 -112027 216935 -105292
15556b87404F2429b4316n8221q2644F4934f137K122k32346c0931A60063c12221
$$ -287404 62429 -24316 -82537 -165181 64934 -6137 -4015 -236361 -30931 160063 -312221
15544e8201F7985a0453j44209M0132B47949b24748B10229c35250N6616E1519Q4611
$$ -58201 67985 -10453 -154662 -114530 247949 -224748 210229 -335250 -278634 51519 136130
15533A36130M4878C1066G894b41919I4871N6920a68966D19175j88994B4160J39512
$$ 136130 181008 31066 7894 -241919 94871 151791 -168966 419175 230181 24160 163672
15522A63672b4554B49655m1306F448c06628a15315F790K32712m0022r4269J15844
$$ 163672 -24554 249655 208349 6448 -306628 -115315 6790 239502 199480 105211 221055
15511B21055h8717B89619i5788H8558i9502o9474H2646a7595A30204n2495d9155
$$ 221055 -88717 289619 -95788 88558 -99502 -168976 82646 -17595 130204 77709 -49155
15499A5545b58989O8313d8799A33577C5173c51172a09995d3055a2631C3283r792
$$ 15545 -258989 -190676 -48799 133577 35173 -351172 -109995 -43055 -12631 33283 23491
15488B3491J18418i9967l7513B47649I3093d01559m9240A28265a95062b5903n8473
$$ 23491 141909 -99967 -137480 247649 93093 -401559 -450799 128265 -195062 -25903 -84376
15477h4376A17174c6703A72403K00145j33648J59804g7127A68790B3731h87B96055
$$ -84376 117174 -36703 172403 372548 238900 398704 -77127 168790 23731 -887 296055
15465e4602E2740c06895d4530C6713P866b55434F2752a16305D03418A0688O0673
$$ -54602 52740 -306895 -44530 36713 44579 -255434 62752 -116305 403418 10688 71361
15454G1361J89J19842a5055C9358P5087k7236d0511A87868L8782L4315f5130A36257
$$ 71361 71550 191392 -15055 39358 114445 87209 -40511 187868 226650 260965 -65130 136257
15441F5099b3862D35554M8227J0775k4619B24409J73903b15605e0266F8632D029
$$ 65099 -23862 435554 483781 494556 469937 224409 398312 -215605 -50266 68632 4029
15429A02986C5629a67675A43101k4325h0542I4905L57979B7136b0077A09402b8072
$$ 102986 35629 -167675 143101 118776 -80542 94905 452884 27136 -20077 109402 -28072
15417F9116a6282I6569f2906B03326o3286g4959C84029A6590e5651K7732l16836
$$ 69116 -16282 96569 -62906 203326 140040 -74959 384029 16590 -55651 -27919 -344755
15406c44755b8507o1652n7056m4263N6080A08458b72634A46028o9717a0970j592
$$ -344755 -28507 -90159 -147215 -191478 -135398 108458 -272634 146028 76311 -10970 -12562
15395a2562j21884A73633m4104a30261d5306j14183I990J49470m2947g6577A02420
$$ -12562 -134446 173633 129529 -130261 -45306 -159489 9990 159460 116513 -76577 102420
15383A29668c98614B39165a30165A20723i6259F1477J9420l4100a67088A81566
$$ 129668 -398614 239165 -130165 120723 -96259 61477 80897 46797 -167088 181566
15372a03700B63507F4189K22972m534a37707k58221f0849H1581L0039J57368g647
$$ -103700 263507 64189 287161 282627 -137707 -395928 -60849 81581 111620 268988 -7647
15360D0764J42913L7242m7263P2173q4362B4122a66788N2946A15576G134i2908
$$ 40764 183677 220919 173656 245829 161467 24122 -166788 -113842 115576 7134 -92908
15348E1180e5137J1688k05306J00593F5029J08623J2271F1039M28566E5772P2738
$$ 51180 -55137 -43449 -248755 -148162 65029 173652 185923 61039 489605 55772 128510
15337A28510J36009a01174A89165a65443A12139i906n17009a36317A03367h7486
$$ 128510 264519 -101174 189165 -165443 112139 -9906 -526915 -136317 103367 -87486
15326C11221j37568J24879m6870J38094g567A07422B0913J9021J76328b12728
$$ 311221 173653 298532 251662 389756 -7567 107422 20913 39934 216262 -212728
15315a33991A54359p1936H497i0940B08994p7026n2010B4711K42268a21499A8434
$$ -133991 154359 82423 8497 -90940 208994 131968 79958 24711 266979 -121499 18434
15303A39288b51823A70285g0798A46801m2242a00955m3507B51J14973b25091e7195
$$ 139288 -251823 170285 -70798 146801 104559 -100955 -144462 251 115224 -225091 -57195
15291i8401A33609E1295i64o5287A82421B244a49282A85560C4409c6684k90900
$$ -98401 133609 51295 -964 -66251 182421 2244 -149282 185560 34409 -36684 -327584
15280c27584a44874n4822A08044e4263Q798k98800G6602d8312I7687b14880C6157
$$ -327584 -144874 -199696 108044 -54263 -45465 -344265 76602 -48312 97687 -214880 36157
15268d35469A3847n608c47173B02729O4600r6916a63864K6165N4285k2994G4949
$$ -435469 13847 8239 -347173 202729 267329 170413 -163864 -137699 -83414 -106408 74949
15256A86009G4839O9642K06934F6593n467F072K56873B2894J136538l81136K59842
$$ 186009 74839 144481 351415 66593 61126 6072 262945 22894 1159432 778296 1038138
15245A038138j55684m39413j24539p2523I9108b3993A67795K4628I0373m104b43386
$$ 1038138 882454 443041 318502 245979 99108 -23993 167795 192423 90373 86269 -243386
15233A36812b54769b7952j10216A06115J19788K82093B35360l4094a00427B28361
$$ 136812 -254769 -27952 -138168 106115 225903 507996 235360 201266 -100427 228361
15222A42610c4481A7808a26157F6316c5410k2654A1084a11428A79505J3467r1491
$$ 142610 -34481 17808 -126157 66316 -35410 -58064 11084 -111428 179505 192972 101481
15211A01481L97l3559i0754A36199E7717K40366C0533K09106n7406b1140B08526
$$ 101481 101878 68319 -90754 136199 57717 298083 30533 239639 182233 -21140 208526
15199b3259C69176j57385K8538B6560o293J01799b1550p6468k216B05304J8265
$$ -23259 369176 211791 240329 26560 20267 122066 -21550 -98018 -100234 205304 223569
15188B23569A05063K32013a38877j9582B97496n3485a48066A60097g1935C81403
$$ 223569 105063 337076 -138877 -158459 297496 244011 -148066 160097 -71935 381403
15177a24588a560j8845A92062h8201o9827D32043c3729E5864a21658C2877K33376
$$ -124588 -1560 -20405 192062 -88201 -158028 432043 -33729 55864 -121658 32877 266253
15166B66253a87711A621K78482o1338n2628J73368A58001J55863A11480L3307
$$ 266253 -187711 1621 280103 218765 166137 339505 158001 313864 111480 144787
15156A44787L6474c63895J12889C15048F5402J62275G030L92293A45641d7491
$$ 144787 181261 -363895 -251006 315048 65402 227677 7030 399323 145641 -47491
15145A73940i096r2455A68987c15250F8178J09588c3714B7912P5910M02465A64839
$$ 173940 -9096 -101551 168987 -315250 68178 177766 -33714 27912 103822 506287 164839
15133c06407C6273l59b6953C32010g0304B60421j04554B0611J70310O0747E3853
$$ -306407 36273 35914 -26953 332010 -70304 260421 155867 20611 190921 251668 53853
15121a51450d5774A1321D00K14402O4211o5265b7910A53904A5590a21716B10667
$$ -151450 -45774 11321 400 214802 279013 213748 -27910 153904 15590 -121716 210667
15109h7099C37208e4697B01868b03449B53339D7158L14175A19714E3690K29153
$$ -87099 337208 -54697 201868 -203449 253339 47158 361333 119714 53690 282843
15099B82843q9517b16536e6199A78271l5537P1431f5212B63963K2326o5938J3785
$$ 282843 193326 -216536 -56199 178271 142734 214165 -65212 263963 286289 220351 234136
15088B34136D5054M54474c0815j08111A71765E5892J63672D8916M5181J68437
$$ 234136 45054 499528 -30815 -138926 171765 55892 219564 48916 94097 262534
15078B62534J74415G4172J62244a42381D2450G766O8737R496a96895C29019B4272
$$ 262534 436949 74172 236416 -142381 42450 7766 76503 85999 -196895 329019 24272
15066I9106J01406K78177c3368B26522C7096L28631H9675b3328j61134E8382K23153
$$ 99106 200512 478689 -33368 226522 37096 365727 89675 -23328 -184462 58382 281535
15055B81535f5403A70675l3444P9780B9516R9731N5255K65602j26775H4911A2994
$$ 281535 -65403 170675 137231 217011 29516 129247 184502 450104 323329 84911 12994
15043C44392j01964J26013A01745P3016K06200N1874q9832l641A14536J75801
$$ 344392 242428 368441 101745 174761 380961 432835 343003 339362 114536 290337
15033B90337I7183L04961A71295J37476j13958A3583N28117j49728l268o87q0949
$$ 290337 97183 402144 171295 308771 194813 13583 541700 391972 388704 388017 307068
15022C07068K40771a17263B73829e7322C14711K0114A10457M04807J18500j19306
$$ 307068 547839 -117263 273829 -57322 314711 334825 110457 515264 633764 514458
15012E14458B05644N8756J7451n8995H9771L24147n9557l8290P9499j42771K92432
$$ 514458 205644 264400 281851 222856 89771 413918 354361 316071 395570 252799 545231
15001E45231P7370A23049L03622j40611A05913L26155P2241B08996L42149j6164
$$ 545231 622601 123049 426671 286060 105913 432068 504309 208996 551145 534981
14991E34981A65820J30613J1549p1391k0946J71962F7182L35016K3508J53115
$$ 534981 165820 296433 307982 236591 215645 387607 67182 402198 425706 578821
14981E78821j72965j64983E5169M61680j27442K23288j88706k09696M4020J21927
$$ 578821 405856 240873 55169 516849 389407 612695 423989 214293 258313 380240
14971C80240D3314J31384R0305P9330J9358A43780R6892L35807j17810j29165
$$ 380240 43314 174698 265003 344333 363691 143780 240672 576479 458669 329504
14961C29504M3964I0471J99886j2229N3379J94977k26581J60105M0851J09313
$$ 329504 373468 90471 290357 278128 331507 526484 299903 460008 500859 610172
14951F10172B19398J72047m2445L6309K47738B96544j22160M09153k55119M539
$$ 610172 219398 391445 349000 385309 633047 296544 174384 583537 328418 332957
14941C32957K97895B72451L66416k10946P6714j09279A56344K09186R1484j00802
$$ 332957 630852 272451 638867 427921 504635 395356 156344 365530 457014 356212
14931C56212Q1145J08163m5865J81485J2145j90277j0998L50510m7118M531q0781
$$ 356212 437357 545520 499655 681140 693285 503008 492010 842520 795402 799933 719152
14920G19152J708L14339m70549K44101K44453o3397k06193Q9648R8625m82881
$$ 719152 720860 1035199 564650 808751 1053204 989807 783614 873262 971887 489006
14910D89006J11105j4738j00132k04352J40121n8056P7540G9649M56118j21103
$$ 489006 600111 585373 485241 280889 421010 362954 440494 79649 535767 414664
14900D14664j22620r6889a33446B56552K47996j14383M1506K2840P2986j23068
$$ 414664 292044 195155 -133446 256552 504548 390165 431671 454511 527497 404429
14890D04429j01646K07005p5682K31633k99782O8355l6121J07672L4964N8230
$$ 404429 302783 509788 434106 665739 365957 434312 398191 505863 540827 599057
14880E99057j31345j32914J08925P8322K1180M864n9835J6737r2159J18929j77970
$$ 599057 467712 334798 443723 522045 543225 548089 488254 504991 412832 531761 353791
14869C53791K26197j73838J76916B67572M38710l12637K38804p5134m7309o1718
$$ 353791 579988 406150 583066 267572 706282 393645 632449 557315 510006 448288
14859D48288K3218j76388M71481C24868P9750A31418N8813K30638A98329L7937
$$ 448288 471506 295118 766599 324868 404618 131418 190231 420869 198329 236266
14849B36266M5598J03389n7744M01212k57351P9345k3086k36110Q3204L66112
$$ 236266 281864 385253 327509 728721 471370 550715 527629 291519 374723 740835
14839G40835m6787J75193L0583J28370l84231R6585m1408o2188B07672M95117
$$ 740835 694048 869241 899824 1028194 643963 740548 699140 636952 207672 702789
14829G02789J18024l63709N4072q9900j1344J36010j92223M2320L40809k43425
$$ 702789 820813 457104 511176 421276 409932 545942 353719 396039 736848 493423
14819D93423J14684K14970k80805o1324K0318k24913K13517k22247M20262k99900
$$ 493423 608107 823077 542272 480948 501266 276353 489870 267623 687885 387985
14809C87985M00394k99617p5264L9614L6055K75312j61412J16820m1780q864J29373
$$ 387985 788379 488762 413498 453112 489167 764479 603067 719887 678107 669243 798616
14798G98616j99380n1696n3987K47596N883l50811L9658M2296m388J95589j54159
$$ 798616 599236 547540 493553 741149 747032 396221 435879 478175 473787 669376 515217
14787E15217K00155n0161k15994K00219O3434o127r7834R2039K40981C90431J49449
$$ 515217 715372 665211 449217 649436 712870 706743 608909 700948 941929 390431 539880
14776E39880J21994r6281K24860l93621M84738j25474j99867N2480j6279o6320
$$ 539880 661874 565593 790453 396832 881570 756096 556229 608709 592430 526110
14766E26110B05756N45553J07641D15317K28700N8411r196j09203J85645M7241
$$ 526110 205756 751309 858950 415317 644017 702428 693232 584029 769674 816915
14756H16915l24785L70946l20297A93225M50071p6770J3471K09596K55335l79915
$$ 816915 492130 863076 542779 193225 643296 566526 579997 789593 1044928 665013
14746F65013l175O2507j72215p742L10551l42729L25970k53472j94459O15058
$$ 665013 661838 724345 552130 544388 854939 512210 838180 584708 390249 1005307
14736A005307D19050L35799p3205P5451r2929p7736O338N2421K92502k64132R9775
$$ 1005307 419050 754849 681644 757095 664166 586430 592768 645189 937691 673559 773334
14725G73334O0422L45930O8231m46916L73381k01977M4867J96389l73909J50452
$$ 773334 833756 1179686 1247917 801001 1174382 972405 1017272 1213661 839752 990204
14715I90204m12901L16115l38757K25228J02665J65650k13953K09743l39002J71390
$$ 990204 577303 893418 554661 779889 882554 1048204 834251 1043994 704992 876382
14705H76382k85234K88953j0946J80886k34688Q8790m1698j0201Q5302L69280
$$ 876382 591148 880101 869155 1050041 815353 904143 862445 852244 937546 1306826
14695A306826k97695J86601J62724o19920M9316K47113k06279M3403j13149K38411
$$ 1306826 1009131 1195732 1358456 738536 787852 1034965 828686 872089 758940 997351
14685I97351l05430J67011p1685j95092J18004P8704j99089K68122M54434n57457
$$ 997351 691921 858932 787247 592155 710159 788863 589774 857896 1312330 754873
14675G54873L68766j88268J64159k10167p1615K78912Q3616J0021m78894N63410
$$ 754873 1123639 935371 1099530 889363 817748 1096660 1180276 1190297 711403 1274813
14665A274813p7579j31013j36929m9888L19465Q0720m22245J4330o1193L95640
$$ 1274813 1197234 1066221 929292 879404 1198869 1279589 857344 871674 810481 1206121
14655A206121q2620K34484k12190L6681k88441K74231l55269K56780J92531J14594
$$ 1206121 1123501 1357985 1145795 1182476 894035 1168266 812997 1069777 1262308 1376902
14645A376902m2484k26878K39938q9627j61625K07124k51700J54660j96010O7504
$$ 1376902 1334418 1107540 1347478 1257851 1096226 1303350 1051650 1206310 1010300 1077804
14635A077804K83142m17043J89293J20743M3623j3884k86407L38394o4210n7151
$$ 1077804 1360946 943903 1133196 1253939 1297562 1283678 997271 1335665 1271455 1214304
14625A214304M8978K11144o1643m3025R9143l42225K47753J79511m2485n5579
$$ 1214304 1263282 1474426 1412783 1369758 1468901 1126676 1374429 1553940 1511455 1455876
14615A455876l00511K30592J78380O5554k08194J20210Q5834k21636M8982L39548
$$ 1455876 1155365 1385957 1564337 1629891 1421697 1541907 1627741 1406105 1455087 1794635
14605A794635k59350R009K8722p4849j16638J15745J48928r8004K25543j51980
$$ 1794635 1535285 1544294 1573016 1498167 1381529 1497274 1646202 1548198 1773741 1621761
14595A621761j32967m3549L91215j84294j26710K47615j85442M76504q0052k56193
$$ 1621761 1488794 1445245 1836460 1652166 1525456 1773071 1587629 2064133 1984081 1727888
14585A727888R2541l58756J03505K56229j16024J25933M54838k68624j15565o4124
$$ 1727888 1820429 1461673 1565178 1821407 1705383 1831316 2286154 2017530 1901965 1837841
14575A837841l4637k02005J72668L67773m3183K58353k31005K09347j29014K78356
$$ 1837841 1803204 1601199 1773867 2141640 2098457 2356810 2125805 2335152 2206138 2484494
14565B484494l05011k04328N98697L4439j68307L11443M4239N7816K73149K09115
$$ 2484494 2179483 1975155 2573852 2608291 2439984 2751427 2795666 2853482 3126631 3335746
14555C335746P4140N4489L29657M18681Q51409O12918J888095M333702Q217773
$$ 3335746 3409886 3464375 3794032 4212713 5064122 5677040 7565135 11898837 20116610
14546B0116610J6068943R49566j7314794r642025m055468k101360q85963q25018
$$ 20116610 36185553 37135119 19820325 10178300 6122832 4021472 3135509 2310491
14538B310491k13703p3933k21490K45236j26593J72994j62001P0893J42579k9027
$$ 2310491 2096788 2022855 1801365 2046601 1920008 2093002 1931001 2001894 2144473 2115446
14528B115446L3283m9269K86505k7260k33177K50650p3663K67835j17030J81097
$$ 2115446 2148729 2099460 2385965 2358705 2125528 2376178 2302515 2570350 2453320 2634417
14518B634417l48270J81110J04896k6564K49496j50299L4259J61121J01019k78472
$$ 2634417 2286147 2467257 2572153 2545589 2795085 2644786 2679045 2840166 2941185 2662713
14508B662713J31239J54648J73997J4306O4677j71658K22366m85817M1119k0570
$$ 2662713 2793952 2948600 3122597 3136903 3201580 3029922 3252288 2766471 2807590 2787020
14498B787020K48422K57173j3126M8440k6352J70953j17168k339K17164j98053
$$ 2787020 3035442 3292615 3279489 3327929 3301577 3472530 3355362 3353023 3570187 3372134
14488C372134P2221j628L09005k73490K72959J88980k60510j1073j04651K25692
$$ 3372134 3444355 3442727 3751732 3478242 3751201 3940181 3679671 3668598 3563947 3789639
14478C789639L94578l17091l17893M69840l02067L60355L00750l47399M83466
$$ 3789639 4184217 3867126 3549233 4019073 3717006 4077361 4378111 4030712 4514178
14469D514178l53887k9429J27941j98934N47827k30035j08798K50776J25965j45957
$$ 4514178 4160291 4130862 4258803 4059869 4607696 4377661 4268863 4519639 4645604 4499647
14459D499647K90598K90096m60934L26459K11932j55842j69962O93583k41507
$$ 4499647 4790245 5080341 4619407 4945866 5157798 5001956 4831994 5525577 5284070
14450E284070o3904L36464j44435q9755j27996N02721j6436k2502P693L27066
$$ 5284070 5220166 5556630 5412195 5322440 5194444 5697165 5680729 5658227 5665920 5992986
14440E992986J10482j17875M827L37789l20077K33474M07614j05879L01918J12493
$$ 5992986 6103468 5985593 5990420 6328209 6008132 6241606 6649220 6543341 6845259 6957752
14430F957752k91266J90202l8428J45735q818K04618L84553j47486K47455o2630
$$ 6957752 6666486 6856688 6818260 6963995 6955177 7159795 7544348 7396862 7644317 7581687
14420G581687J99676M21475k66807J93354J25623J43601J60120M53197k04895
$$ 7581687 7781363 8202838 7936031 8129385 8255008 8398609 8558729 9011926 8807031
14411H807031N0282J31200J10717L96886p4340L70236l68865M23415K18819J83988
$$ 8807031 8857313 8988513 9099230 9496116 9421776 9792012 9423147 9846562 10065381 10249369
14401A0249369J31705L39377J77897P7477O3952J64355Q2274K38198K90060K53221
$$ 10249369 10381074 10720451 10898348 10975825 11039777 11204132 11286406 11524604 11814664 12067885
14391A2067885k1198M44420m9264N66844J31703l7934K91770N16551j34678N51584
$$ 12067885 12046687 12491107 12441843 13008687 13140390 13102456 13394226 13910777 13776099 14327683
14381A4327683j3642J15788P25465J90140K83336K05612N61229O7044Q55999J68756
$$ 14327683 14314041 14429829 15155294 15345434 15628770 15834382 16395611 16462655 17318654 17487410
14371A7487410L6679K25764K52896M08923N78391K11347N86928J57442O57928
$$ 17487410 17524089 17749853 18002749 18411672 18990063 19201410 19788338 19945780 20603708
14362B0603708J90122Q38026o5903R78875M44469O56522K63369O92778L31496
$$ 20603708 20793830 21631856 21565953 22544828 22989297 23645819 23909188 24601966 24933462
14353B4933462M77804P96534M13384P58014M44401R14676N81079J242641N31335
$$ 24933462 25411266 26207800 26621184 27379198 27823599 28738275 29319354 30561995 31093330
14344C1093330O53300Q14453R32448O97853J094034J276408O08815J034193Q04379
$$ 31093330 31746630 32561083 33493531 34191384 35285418 36561826 37170641 38204834 39009213
14335C9009213J715996N92869J660247J113505J364837J504695J458458J587641
$$ 39009213 40725209 41318078 42978325 44091830 45456667 46961362 48419820 50007461
14327E0007461J665247J173731J974130J520045K424123J957884J926519K031377
$$ 50007461 51672708 52846439 54820569 56340614 58764737 60722621 62649140 64680517
14319F4680517K389361K497587K204931K685146K671953L123838L194485K948935
$$ 64680517 67069878 69567465 71772396 74457542 77129495 80253333 83447818 86396753
14311H6396753L751806L640028L594628L874858M177005M657150M873039N200750
$$ 86396753 90148559 93788587 97383215 101258073 105435078 110092228 114965267 120166017
14303A20166017N314116N725626N639007O675583O720343P059301P760887P555567
$$ 120166017 125480133 131205759 136844766 143520349 150240692 157299993 165060880 172616447
14295A72616447Q531202R063980Q935053J0349874J0363266J0805459J1697420
$$ 172616447 181147649 190211629 199146682 209496556 219859822 230665281 242362701
14288B42362701J1902392J2555590J3111068J3518760J3886211J4291702J4017743
$$ 242362701 254265093 266820683 279931751 293450511 307336722 321628424 335646167
14281C35646167J4318411J4263897J3772420J3457968J2629037J1542221J0599553
$$ 335646167 349964578 364228475 378000895 391458863 404087900 415630121 426229674
14274D26229674Q359940N908870K571037Q50543M31767j911634m984904m679950
$$ 426229674 434589614 440498484 443069521 443920064 444351831 442440197 437455293 432775343
14266D32775343n213456o427442q415122j0270233j2034198j3175422j3909625
$$ 432775343 427561887 421134445 412719323 402449090 390414892 377239470 363329845
14259C63329845j4493725j4715876j4924339j4752235j3632708j3861253j3375589
$$ 363329845 348836120 334120244 319195905 304443670 290810962 276949709 263574120
14252B63574120j2851161j2522021j1572520j1284889j0447617r782788r823237
$$ 263574120 250722959 238200938 226628418 215343529 204895912 195113124 185289887
14245A85289887q481625q289562q080896p258213p102303o971567o148500n520056
$$ 185289887 176808262 168518700 160437804 153179591 146077288 139105721 132957221 127437165
14237A27437165n481143n442032n083308m435575m596847m339647l312333m069145
$$ 127437165 121956022 116513990 111430682 106995107 102398260 98058613 94746280 90677135
14229I0677135l789245l225223l358715k889605k701547k704943k902857k248632
$$ 90677135 86887890 83662667 80303952 77414347 74712800 72007857 69105000 66856368
14221F6856368k535840k187011j724047k123248k063687k004511j716690j278233
$$ 66856368 64320528 62133517 60409470 58286222 56222535 54218024 52501334 51223101
14213E1223101j787892j405907j393035j707569j067008r76110j274860j066234
$$ 51223101 49435209 48029302 46636267 44928698 43861690 42885580 41610720 40544486
14205D0544486r02113j638359p52137j036467j175833m68838j210083p23668j265787
$$ 40544486 39642373 38004014 37251877 36215410 35039577 34570739 33360656 32636988 31371201
14196C1371201l96995q10404p81594o62505r10957q36578o38638m47904n76218
$$ 31371201 30974206 30163802 29382208 28719703 27808746 26972168 26333530 25885626 25309408
14187B5309408n21658k29773r67165o31877n02185r04674k37739k37754n28057
$$ 25309408 24787750 24557977 23590812 22958935 22456750 21552076 21314337 21076583 20548526
14178B0548526l17106m49779n94712j17029o36478k17654l82271l73838n46447
$$ 20548526 20231420 19781641 19186929 19069900 18433422 18215768 17833497 17459659 16913212
14169A6913212j0064m61710k09539k21252o34279o4432j99549j36029m55237m33751
$$ 16913212 16903148 16441438 16231899 16010647 15376368 15311936 15112387 14976358 14521121 14087370
14159A4087370J02427m47794k62142Q1498l52353j21117m99859q0080j92228k24562
$$ 14087370 14189797 13742003 13479861 13561359 13209006 13087889 12588030 12507950 12315722 12091160
14149A2091160j50489o28285J47811l25699P2064N1885n22695k93131j9737j13953
$$ 12091160 11940671 11312386 11460197 11134498 11206562 11258447 10735752 10442621 10422884 10308931
14139A0308931k9221m24647K35096n56041L81898l54609m09972J21201k99348
$$ 10308931 10279710 9855063 10090159 9534118 9916016 9561407 9151435 9272636 8973288
14130H973288r9521k4855j69374r5746l30190L1692j62000j31027K87411n91056
$$ 8973288 8873767 8848912 8679538 8583792 8253602 8285294 8123294 7992267 8279678 7688622
14120G688622J07911j35539k02776n0071L64682k83160k35455r42l24277O9423
$$ 7688622 7796533 7660994 7458218 7408147 7772829 7489669 7254214 7253272 6928995 6998418
14110F998418l87112K15576k50397m9959J07332k04414M2019L53900p46388n58547
$$ 6998418 6611306 6826882 6576485 6526526 6633858 6429444 6471463 6825363 6078975 5520428
14100E520428K69645J92891N4033l31354J8933k77401K19786p8779M1139m68380
$$ 5520428 5790073 5982964 6036997 5705643 5724576 5447175 5666961 5588182 5629321 5160941
14090E160941K97295o8458p2842k58220k05297M95529m22634J62530j98006O5751
$$ 5160941 5458236 5389778 5316936 5058716 4853419 5348948 4926314 5088844 4890838 4956589
14080D956589j2520N0586l39344o3433O7218j36175J23332j43354P8374l35414
$$ 4956589 4944069 4994655 4655311 4591878 4659096 4522921 4646253 4502899 4581273 4245859
14070D245859J27425j96319J59039m67676K62236J48042K332m74165J73936J5569
$$ 4245859 4373284 4176965 4336004 3868328 4130564 4278606 4280938 3806773 3980709 3996278
14060C996278J66884j54754J03323l51885K8675L1562j38443J61577l41462q0548
$$ 3996278 4163162 4008408 4111731 3759846 3788521 3820083 3681640 3843217 3501755 3421207
14050C421207J42736k38184K70068r664n8077q1441j6893j31563m7720J01823
$$ 3421207 3563943 3325759 3595827 3586163 3528086 3446645 3429752 3298189 3250469 3352292
14040C352292r9261K51619l37935J8074J17071k95792K44540j83113O3970J99345
$$ 3352292 3253031 3504650 3166715 3184789 3301860 3006068 3250608 3067495 3131465 3330810
14030C330810j85819l9660p8414p4319M4023n9443j32503L91103n40844O4377
$$ 3330810 3144991 3105331 3026917 2952598 2996621 2937178 2804675 3195778 2654934 2719311
14020B719311K76334m63704K24753j40488M3479j3056k73859J99646M4987P6307
$$ 2719311 2995645 2531941 2756694 2616206 2659685 2646629 2372770 2572416 2617403 2693710
14010B693710k79704n6192j53867J6666J4135r8384L27377k08113L9002j75460
$$ 2693710 2414006 2357814 2203947 2220613 2234748 2136364 2463741 2255628 2294630 2119170
14000B119170R2283P1947j11611J96262n766k57668L36082l69404O05973J19685
$$ 2119170 2211453 2283400 2171789 2368051 2362285 2104617 2440699 2071295 2677268 2796953
13990B796953L38305Q33404L018437O198071J5697168R428869j3869385r640973
$$ 2796953 3135258 3968662 6987099 13185170 28882338 38311207 24441822 14800849
13982A4800849n163376k478116j432534j419289l03668l30163j72294j72157k97874
$$ 14800849 9637473 7159357 5726823 4307534 4003866 3673703 3501409 3329252 3031378
13973C031378l80159J45185j59759k88198L03742J50409o52620J0851m2134J01451
$$ 3031378 2651219 2796404 2636645 2348447 2652189 2802598 2149978 2160829 2118695 2220146
13963B220146l48161J71234J26244R304n4263K49870M2038m03567K34166n16913
$$ 2220146 1871985 2043219 2169463 2178767 2124504 2374374 2416412 2012845 2247011 1730098
13953A730098L05647J8315j44263J85522j90073m8762J4891J50168j34928K0452
$$ 1730098 2035745 2054060 1909797 2095319 1905246 1856484 1871375 2021543 1886615 1907067
13943A907067o989l89726K36948K01241k66412j23564q2913J42108K28768k16487
$$ 1907067 1900078 1510352 1747300 1948541 1682129 1558565 1475652 1617760 1846528 1630041
13933A630041L51881n06625L65417J48335n57427K57246j92860p8387R0952L13353
$$ 1630041 1981922 1475297 1840714 1989049 1431622 1688868 1496008 1417621 1508573 1821926
13923A821926l16979L14333o6621k23340K20739o8146k44217K51939Q2594l99574
$$ 1821926 1504947 1819280 1752659 1529319 1750058 1681912 1437695 1689634 1772228 1372654
13913A372654p8970J51461j6776J47214j98013J04134M329J81484m62131J2775
$$ 1372654 1293684 1445145 1428369 1575583 1377570 1481704 1486033 1667517 1205386 1218161
13903A218161L57754m06017L08967j09785J3982l6711P3591l40550L69372l05135
$$ 1218161 1575915 1169898 1478865 1369080 1383062 1346351 1419942 1079392 1448764 1143629
13893A143629K59203k53806j86145K22495R332m6347J29730Q7316m00740J93356
$$ 1143629 1402832 1149026 962881 1185376 1194708 1148361 1278091 1365407 964667 1158023
13883A158023J72185l57651L15069j41853n3683M92747o20492L26953m9965k12879
$$ 1158023 1330208 972557 1287626 1145773 1092090 1584837 964345 1291298 1241333 1028454
13873A028454K39088n7559k41322J17138K3918J97k04219J23394L48031j07732
$$ 1028454 1267542 1209983 968661 1085799 1109717 1109914 905695 1029089 1377120 1269388
13863A269388n26140K05018l37252N10411k85129L54689j68033j55363j00078
$$ 1269388 743248 948266 611014 1121425 836296 1190985 1022952 867589 767511
13854G67511K66942K74605k96299J04077l16538K29467L444M0749j60578K27285
$$ 767511 1034453 1309058 1012759 1116836 800298 1029765 1033209 1073958 913380 1140665
13844A140665j12125K7425n7722k7241K23581l76690K78052j92345J50588J02915
$$ 1140665 1028540 1055965 998243 971002 1194583 817893 1095945 903600 1054188 1157103
13834A157103l56752R9584J09930q8455L23086k32374j5174J6175n2877p7918
$$ 1157103 800351 899935 1009865 921410 1244496 1012122 996948 1013123 960246 882328
13824H82328J48268q7624k7428K99452l26629p1108q169n876J99994K80926n00453
$$ 882328 1030596 942972 915544 1214996 888367 817259 809090 803214 1003208 1284134 783681
13813G83681j16615J21228R215k90151O27369J1759E67160O6596L91566j18143
$$ 783681 667066 788294 797509 507358 1134727 1146486 567160 633756 1025322 907179
13803I07179D03455M71144l03702P14559k66324k12806J4251J27568l31888J94341
$$ 907179 403455 874599 570897 1285456 1019132 806326 820577 948145 616257 810598
13793H10598O4287k47578L6948N53914l8846m16996j50133j08168P893J73022
$$ 810598 874885 627307 664255 1218169 1179323 762327 612194 504026 511919 684941
13783F84941K23336J12567k86653J20458j7239r4113j62142J87302j56695M838
$$ 684941 908277 1020844 734191 854649 837410 743297 581155 768457 611762 616600
13773F16600L49129l51720K17103j7912j16753J97076l02573J38689r5333O23756
$$ 616600 965729 614009 831112 813200 696447 893523 590950 729639 634306 1258062
13763A258062E70200L511j47306O73091l57017l63245L33194J16453k38961K62092
$$ 1258062 570200 573711 426405 1099496 742479 379234 712428 828881 589920 852012
13753H52012O099l35451K25369M8423k59802K69981k76427J63758k59350j56669
$$ 852012 858111 522660 748029 796452 536650 806631 530204 693962 434612 277943
13743B77943O8137J1669J03268P2136L56927j65509J60162O1014C28957L28471
$$ 277943 346080 357749 461017 533153 890080 724571 884733 945747 328957 657428
13733F57428J4940k9224R5851j76681j03090K11342j39214J78822p9181j33240
$$ 657428 672368 643144 738995 562314 459224 670566 531352 710174 630993 497753
13723D97753o6265j28242K47002p3428N5195J04784L9384j36516J32745A09292
$$ 497753 431488 303246 550248 476820 532015 636799 676183 539667 672412 109292
13712G49619C12923P24740j72610l27773A68516J05041q08M32512L6683j65128
$$ 749619 312923 1037663 865053 537280 168516 273557 272749 705261 741944 576816
13702E76816O3794A83740N12049M778k48176q6701O7681L15188M0629l36222Q6834
$$ 576816 640610 183740 695789 700567 452391 365690 433371 748559 789188 452966 539800
13691E39800N2767k42310M10007j75123k36005K32564k31536K3080K71811j43693
$$ 539800 592567 350257 760264 585141 349136 581700 350164 373244 645055 501362
13681E01362q3340j62591K13242j96935L33579k38776R8831J8018O1902k01460
$$ 501362 418022 255431 468673 271738 605317 366541 465372 483390 545292 343832
13671C43832Q0318A82208J15002K52068q6642j60525L62866C6529P69689k23100
$$ 343832 424150 182208 297210 549278 462636 302111 664977 36529 806218 583118
13661E83118J44856A97525K24029D2526M47696o0861j44089J99447j72189j41341
$$ 583118 727974 197525 421554 42526 490222 429361 285272 484719 312530 171189
13651A71189p9489J43908K97079K092j26698n8218N3190D4611N98681j00777J6093
$$ 171189 91700 235608 532687 534779 408081 349863 403053 44611 643292 542515 558608
13640E58608K7859B03295k8542b36498D18139J94222m0953k10916L7327j93431
$$ 558608 586467 203295 174753 -236498 418139 612361 571408 360492 397819 204388
13630B04388p8121M94283B90795K61334L24898A93370a458D90965j23263K61922
$$ 204388 126267 620550 290795 552129 877027 193370 -1458 490965 367702 629624
13620F29624j80262J08524j27406j76847M74524p053A87559J44591q4161J45449
$$ 629624 449362 557886 430480 253633 728157 721104 187559 332150 247989 393438
13610C93438K28811F0803L90328j28331D6317L51254L8580K0673k06843K65598
$$ 393438 622249 60803 451131 322800 46317 397571 436151 456824 249981 515579
13600E15579k57675k9280r5657J47882q5261J97718J30994k30697C8992M04807
$$ 515579 257904 228624 132967 280849 195588 393306 524300 293603 38992 443799
13590D43799j66188J01496L33483l07830K32029p9210k15739J22737K01956B90411
$$ 443799 277611 379107 712590 404760 636789 557579 341840 464577 666533 290411
13579D89463k23565J13825P1634e0746B95933K32807G1815L36130o8850j09599
$$ 489463 265898 379723 451357 -50746 295933 528740 71815 407945 339095 229496
13569B29496L17487k10269A51196N3143G0762J53880Q3355J43514A93725J21217
$$ 229496 546983 336714 151196 204339 70762 224642 307997 451511 193725 314942
13559C14942q356L31738B22994K54535j33212K68726B96046J63421M8917A77037
$$ 314942 306586 638324 222994 477529 344317 613043 296046 459467 508384 177037
13548A91607J80105A67837l964K7794m9401B8741L36146K2723p7582P4269j77995
$$ 191607 371712 167837 163873 191667 142266 28741 364887 387610 310028 384297 206302
13537B06302J83753j23171k1098J97551j30557H8730P6343K34575k4244M6249
$$ 206302 390055 266884 245786 443337 312780 88730 165073 399648 375404 421653
13527D21653r1235j01568I3163L49239j35551q9446q3067K85108J03793B53697
$$ 421653 330418 228850 93163 442402 306851 217405 134338 419446 523239 253697
13516E57801k44132j49736m1527J22352J74517F7900N81948B32131N5055J11346
$$ 557801 313669 163933 122406 244758 419275 67900 649848 232131 287186 398532
13506C98532j67184L5037p6889j2573K9531J07434a38687G4943k9147f926E13850
$$ 398532 231348 266385 189496 176923 206454 313888 -138687 74943 45796 -6926 513850
13494D13129j47445K45204j53620m6162A14504L32026A0666L64586o9713k7966
$$ 413129 265684 510888 357268 311106 114504 446530 10666 375252 305539 277573
13484B77573a1915D91886j99316a66826q1635c091D62684B18860J95714j56713
$$ 277573 -11915 491886 292570 -166826 -248461 -3091 462684 218860 414574 257861
13474B57861j28893B4963O02714H0261M12535B15582m6027H755L57752E1259J09468
$$ 257861 128968 24963 627677 80261 492796 215582 169555 8755 366507 51259 160727
13463A60727N3445Q2539l1704G6911b63867D25014F6578a34040B80240k3336I7525
$$ 160727 214172 296711 265007 76911 -263867 425014 66578 -134040 280240 256904 97525
13451F5090L1681b6745H0707L97422a2902I5275M1433b6145D3227J78756j4349
$$ 65090 96771 -26745 80707 478129 -12902 95275 136708 -26145 43227 221983 207634
13440B07634E2438L12564A63506N3283J30657i6828B47585f4641A47200K21354
$$ 207634 52438 365002 163506 216789 347446 -96828 247585 -64641 147200 368554
13430C68554a08650E20605I2543K74420A53918J87905O2343k02003o98f0969B98463
$$ 368554 -108650 520605 92543 366963 153918 341823 404166 202163 201465 -60969 298463
13418C70090a8288A8865R4882m3503J60557Q8427O6401r7187J4939L1817q6641
$$ 370090 -18288 18865 113747 70244 230801 319228 385629 288442 303381 335198 248557
13407B48557D9437N7630J52363j8526n9775O1119j502R9164j23185K25115I6842
$$ 248557 49437 107067 259430 240904 181129 242248 240746 339910 216725 441840 96842
13395i1813A44991L30264k03455C8199a39503B95548J02205H9116J52021a24563
$$ -91813 144991 475255 271800 38199 -139503 295548 397753 89116 241137 -124563
13384D38759j93197m0231J61825h8178B20042N0861H9948R4340F1964N39819k57953
$$ 438759 245562 205331 367156 -88178 220042 270903 89948 184288 61964 601783 343830
13373C43830h0058C47274o2536Q3832H3357K11340K24302A47917K34991r9243
$$ 343830 -80058 347274 284738 368570 83357 294697 518999 147917 382908 283665
13363B83665r3343m316L0696Q1987J75587a08646C97839A84037O4394J40146a43791
$$ 283665 190322 186006 216702 298689 474276 -108646 397839 184037 248431 388577 -143791
13351E12345o9915A76819j7441M1732r4586L760j8025K20609K35463k59055j09037
$$ 512345 442430 176819 159378 201110 106524 110284 92259 312868 548331 289276 180239
13340A80239N75359j77539j78897I2875K90595B490L45333r2052D4891K05271
$$ 180239 755598 578059 399162 92875 383470 2490 347823 255771 44891 250162
13330B50162j2872C536a00429B64198b28090B30968K1975k5933A06581D2986J52470
$$ 250162 237290 3536 -100429 264198 -228090 230968 252943 227010 106581 42986 195456
13319A95456K93800r9008J9996j75359I6167K99641F9727K64891a2859D97590
$$ 195456 489256 390248 410244 234885 96167 395808 69727 334618 -12859 497590
13308a9033C24393j0302B4273K87994A33842K41633A33994G338J06518a10253
$$ -19033 324393 314091 24273 312267 133842 375475 133994 7338 113856 -110253
13297A45875J9666b8105A47661J363N2812B093J48370f3797C85984B8018a38623
$$ 145875 165541 -28105 147661 149024 201836 2093 150463 -63797 385984 28018 -138623
13285A61498i5636j7803A85383a86280A2113M83219a41799j40367d0022C12816
$$ 161498 -95636 -113439 185383 -186280 12113 495332 -141799 -282166 -40022 312816
13274B28888N3095b65471f8345B21168i7138I5671a138A03653K08861O7804d7138
$$ 228888 281983 -265471 -68345 221168 -97138 95671 -1138 103653 312514 380318 -47138
13262G4984i2273A88157a85079B62855a07176C4615J85234J95306C1441O1512
$$ 74984 -92273 188157 -185079 262855 -107176 34615 219849 415155 31441 92953
13252I2953A3519J96846m2156i6786M1068i629A36763j9324b15912A74025E8663
$$ 92953 13519 210365 168209 -96786 -55718 -9629 136763 117439 -215912 174025 58663
13240B56550q5695R9498j34962g8378A20785K03273A15136c60894a06652B68300
$$ 256550 170855 270353 135391 -78378 120785 324058 115136 -360894 -106652 268300
13229B57415O0448l1405I0551m4377R4725O4806c3586B19108E7132O4111b7199
$$ 257415 317863 286458 90551 46174 140899 205705 -33586 219108 57132 121243 -27199
13217A95742P9760K2040j31233J12392A23503J46686M6776g984C15515F533M384
$$ 195742 275502 297542 166309 278701 123503 270189 316965 -7984 315515 6533 10917
13206A0917i8763c5837j08860C10721j9449p5206a9866j5441I4225K03500L0288
$$ 10917 -98763 -35837 -144697 310721 291272 216066 -19866 -35307 94225 297725 328013
13195C28013D5443L97014B5997c6977p9238b7993j4357e596I4578B6085a24946
$$ 328013 45443 442457 25997 -36977 -116215 -27993 -42350 -5596 94578 26085 -124946
13183c17877B84805b06935B66149m4215k4736a31909A91419p7061g6471A28220
$$ -317877 284805 -206935 266149 221934 197198 -131909 191419 114358 -76471 128220
13172C2016a38991b7488A66806M3704a05812A88420J23143g7020B62618b407I5653
$$ 32016 -138991 -27488 166806 210510 -105812 188420 311563 -77020 262618 -2407 95653
13160I9507J99061h3692a2587A00271l7055a53148C50214r8203h4610B44320a6395
$$ 99507 298568 -83692 -12587 100271 63216 -153148 350214 252011 -84610 244320 -16395
13148B8404J81509e6934A54785q628r529J5662e5497d502A05042f1841C11483
$$ 28404 209913 -56934 154785 146157 136628 152290 -55497 -4502 105042 -61841 311483
13136A67251j6615d2597K834j86466b2752j32769N5445A47674A6419c33484F8932
$$ 167251 150636 -42597 -39763 -226229 -22752 -155521 -100076 147674 16419 -333484 68932
13124d6842I0378f1103B5518K35380q9374k6240J08772N3830a917B10247L4646
$$ -46842 90378 -61103 25518 260898 171524 145284 254056 307886 -1917 210247 244893
13113B44893q7482J03847l6206D4991M15287B02882r9606L424K77726P577j82045
$$ 244893 157411 261258 225052 44991 460278 202882 103276 106700 384426 392003 209958
13102B09958o0070J96868B3003a13391G4988k5304B4306L1835a9559G7823O8919
$$ 209958 149888 346756 23003 -113391 74988 49684 24306 56141 -19559 77823 146742
13091A46742O2910a97587A51680Q2691k9843Q1469i3157l4124j27785I6858N4875
$$ 146742 209652 -197587 151680 234371 204528 285997 -93157 -127281 -255066 96858 151733
13080A51733o8308J55485c08068N8067B59223r3276j7994c1930F2747A3379g4596
$$ 151733 83425 238910 -308068 -250001 259223 165947 147953 -31930 62747 13379 -74596
13068d3399n6195C62656c8480n8918l572q6403B64596g2180A01223b15062E8632
$$ -43399 -99594 362656 -38480 -97398 -100970 -187373 264596 -72180 101223 -215062 58632
13056B54030J09962A7495a20455A70480b0541A01602b47033f450B53940B5261
$$ 254030 363992 17495 -120455 170480 -20541 101602 -247033 -6450 253940 25261
13045a41435A58167i671B51073I7933J96155a79442C01092r6066a18746N7907
$$ -141435 158167 -9671 251073 97933 294088 -179442 301092 205026 -118746 -60839
13035f0839A6287b6386B41725m351i7833I8049A4966b91756a13041d6342j5248
$$ -60839 16287 -26386 241725 237374 -97833 98049 14966 -291756 -113041 -46342 -61590
13024f1590B13662i9994B01312L1872o5932D7252i3208C317g5393A44530m7897
$$ -61590 213662 -99994 201312 233184 167252 47252 -93208 3317 -75393 144530 96633
13013I6633b3611B88035b39487B28700N6894q0344e4778A29267E5508c5516A78160
$$ 96633 -23611 288035 -239487 228700 285594 205250 -54778 129267 55508 -35516 178160
13001d326j00068A26877B9939d0742A34722R8244j7571r2182r033J13780K9800
$$ -4326 -104394 126877 29939 -40742 134722 232966 215395 123213 114180 227960 257760
12990B57760A000L54072j69799I0593l672b77442G3360J71081E7739L76246G3391
$$ 257760 1000 355072 185273 90593 86921 -277442 73360 244441 57739 433985 73391
12978d5747C94444a16206a059q7741B93002A44891g8275A4854K03218q5731g5662
$$ -45747 394444 -116206 -1059 -88800 293002 144891 -78275 14854 218072 132341 -75662
12966a43386K3509B88584a81711d1404G549J33691a04760D95437C9975M4949O2020
$$ -143386 -119877 288584 -181711 -41404 7549 141240 -104760 495437 39975 84924 146944
12955A46944m4125g2354E2652k411P141J70690A00937d1014j77224i1666j74008
$$ 146944 102819 -72354 52652 50241 57382 228072 100937 -41014 -218238 -91666 -265674
12944b65674A43314c0063B59884A9084K05463j05862C9606a7147C19995j21017
$$ -265674 143314 -30063 259884 19084 224547 118685 39606 -17147 319995 198978
12934A98978r7336g7775C00322E793J66162a09837A93872i82n0654A09110R9949
$$ 198978 101642 -77775 300322 5793 171955 -109837 193872 -982 -51636 109110 209059
12923B09059a60729B24400i7967B02739P5840e1755B133J77097J36352a05018
$$ 209059 -160729 224400 -97967 202739 278579 -51755 2133 179230 315582 -105018
12912F5187d8046C463c35815A12063M9560J03640a76304L7128B83212c9093H8418
$$ 65187 -48046 3463 -335815 112063 161623 265263 -176304 -139176 283212 -39093 88418
12900D04821D0188a14397L5641m6363N1968A19716M9941J02544D4940c0160j114
$$ 404821 40188 -114397 -78756 -125119 -73151 119716 169657 272201 44940 -30160 -31274
12889c1274A12796a44434j2726L4799A33191D8894A5367P1245K6167d6059p057
$$ -31274 112796 -144434 -157160 -122361 133191 48894 15367 86612 112779 -46059 -53116
12878e3116A71475J28859g0814a4795M395b755q1171A45793a11967C81715i9394
$$ -53116 171475 300334 -70814 -14795 -10400 -2755 -83926 145793 -111967 381715 -99394
12866b49205A10225M87132B15177c33679H9858e389l4459q3254C95787j77275
$$ -249205 110225 597357 215177 -333679 89858 -5389 -39848 -123102 395787 218512
12856B18512I0290b9930D0951j4045R4495B0793g5779B5789H265P0028O1799D9444
$$ 218512 90290 -29930 40951 26906 121401 20793 -75779 25789 8265 78293 140092 49444
12843A99663p1188g7664j90812M7433A6608e1950A08480E2374c59498b6054j99524
$$ 199663 128475 -77664 -268476 -221043 16608 -51950 108480 52374 -359498 -26054 -225578
12832b25578m9414B29160j3447I1490K25803a5194C52553a97394e3256I5579C7582
$$ -225578 -274992 229160 215713 91490 317293 -15194 352553 -197394 -53256 95579 37582
12820A24244C4525L8119e1346J7155a1005m1231A34637a02047c0748I3909a68643
$$ 124244 34525 72644 -51346 -34191 -11005 -52236 134637 -102047 -30748 93909 -168643
12808A45042b8790A21952M8226J22344I8802J40642b86972i558j20400J7372L1596
$$ 145042 -28790 121952 170178 292522 98802 239444 -286972 -9558 -129958 -112586 -80990
12797h0990A60273G9899b63141h0716p363A85323j1081a4777l65600D0384P7983
$$ -80990 160273 79899 -263141 -80716 -88079 185323 174242 -14777 -380377 40384 118367
12786A18367a54756A71774D560c3805j52607B75665Q002p3345b53966I8575b29397
$$ 118367 -154756 171774 4560 -33805 -186412 275665 283667 210322 -253966 98575 -229397
12774B08018a10423l1077A11977P5125B2883b17858a00632I1466J550J08063p6268
$$ 208018 -110423 -141500 111977 187102 22883 -217858 -100632 91466 93016 201079 124811
12763A24811e2519A93895a43815a831D21060h8939A0460i0282k42686I0012a09643
$$ 124811 -52519 193895 -143815 -1831 421060 -88939 10460 -90282 -332968 90012 -109643
12751a38364K4700G9917j9037N6816J72338c35740G4452l5736n459b01086I8294
$$ -138364 -113664 79917 60880 117696 290034 -335740 74452 38716 33257 -201086 98294
12739b24256E2455j6512a7571F613J1462d922A75547a03237A86064n1887e743
$$ -224256 52455 35943 -17571 6613 18075 -4922 175547 -103237 186064 134177 -5743
12727G4348K4945A8113b71839A43903d81718a23053G5624g6960C3863J76956o7421
$$ 74348 99293 18113 -271839 143903 -481718 -123053 75624 -76960 33863 210819 143398
12716A43398j9004k9845b055p4549k6120b5165k0938D7100O2642i2943d0985B06637
$$ 143398 124394 94549 -2055 -76604 -102724 -25165 -46103 47100 109742 -92943 -40985 206637
12703A79419A7696K2159J73331b07279N4850A20654L3552k8316a05523A25385
$$ 179419 17696 39855 213186 -207279 -152429 120654 154206 125890 -105523 125385
12692A35579D1029A1074h5153G1037c5939A28503f8596h806I72K66767j25031
$$ 135579 41029 11074 -85153 71037 -35939 128503 -68596 -8806 972 267739 142708
12681A42708C5561J58071I1535l5341J61402m5989B2160a23155K2486a7761j20269
$$ 142708 35561 193632 91535 56194 217596 171607 22160 -123155 -100669 -17761 -138030
12670a38030d4923j47249A43866E2179K94333b4775C9092M93499C2921M9989K48693
$$ -138030 -44923 -192172 143866 52179 346512 -24775 39092 532591 32921 82910 331603
12659C31603R9837A39724E7683M5625k0151J38694j10676b1502B25036J08857
$$ 331603 431440 139724 57683 103308 83157 221851 111175 -21502 225036 333893
12649C33893a51892a5643k1662B51339c8130C00618j39862F891b40016j9137A05312
$$ 333893 -151892 -15643 -37305 251339 -38130 300618 160756 6891 -240016 -259153 105312
12637F0890O0593k2317d9826l33241D4861f0232D29573A60107m4944M7600K35790
$$ 60890 121483 99166 -49826 -383067 44861 -60232 429573 160107 115163 162763 398553
12626C98553A58859a3287A95043F8108L4480m5328g8018A60797M6733b03652H0614
$$ 398553 158859 -13287 195043 68108 102588 57260 -78018 160797 207530 -203652 80614
12614D35293g0436j93088G7632J68195F6404K39147j37955D5870a56485I5226
$$ 435293 -70436 -263524 77632 245827 66404 305551 167596 45870 -156485 95226
12603D11573A35925j1395h5615C1766c6129D4025P8401l6525l4194J13260A5858
$$ 411573 135925 124530 -85615 31766 -36129 44025 122426 85901 51707 164967 15858
12591f5470b0731j07457E9318h6062k51233I6021b53503p8233d5872A85494e9132
$$ -65470 -20731 -128188 59318 -86062 -337295 96021 -253503 -331736 -45872 185494 -59132
12579B61940a20196b1428r2781k81359J41004A68262a39610B82569N9222A40152
$$ 261940 -120196 -21428 -114209 -395568 -254564 168262 -139610 282569 341791 140152
12568I8851a4125k24129g0077j5979B63480a86699A5353O9021J17970a2419A10078
$$ 98851 -14125 -238254 -70077 -86056 263480 -186699 15353 84374 202344 -12419 110078
12556g282B06602b03728A28091J0463q41b55808h3514K1442j46052M5362B44552
$$ -7282 206602 -203728 128091 138554 137713 -255808 -83514 -62072 -208124 -162762 244552
12544i7421L0595k992A49961c58291E01368A27973A1269a48658J0665C80597M819
$$ -97421 -66826 -69818 149961 -358291 501368 127973 11269 -148658 -137993 380597 385416
12533C85416j91161m8657D2689h4037D6525O5995m9912f0825n9074A80202n9461
$$ 385416 194255 145598 42689 -84037 46525 112520 62608 -60825 -119899 180202 120741
12522A20741I218O9581e004A39439J6502b2310p3591k71645a02294F5316N7082
$$ 120741 9218 78799 -5004 139439 155941 -22310 -95901 -367546 -102294 65316 122398
12511A22398a95955b238A28331J53063E1386J57154k7756M7783a4134k7525D3105
$$ 122398 -195955 -2238 128331 281394 51386 208540 180784 228567 -14134 -41659 43105
12499a89117c67I1145c07585J30172C5660c9318j18925j07261a0257A24927p16
$$ -189117 -367 91145 -307585 -177413 35660 -39318 -158243 -265504 -10257 124927 124211
12488A24211a65668A2737a79669o507g6420j63165C05500e2225A20791B7120O0985
$$ 124211 -165668 12737 -179669 -186176 -76420 -239585 305500 -52225 120791 27120 88105
12477H8105m3283P1796K9296i1479A90237a48228c9369k2136A5881J65242b00324
$$ 88105 44822 116618 145914 -91479 190237 -148228 -39369 -61505 15881 181123 -200324
12465B93726b87734a09486A4562a42301A4243a40020j61784A63823o4790P5008
$$ 293726 -287734 -109486 14562 -142301 14243 -140020 -301804 163823 99033 174041
12455A74041k9720a92997k317F2827a89737c8060B2204J45370a84138C82636A11255
$$ 174041 144321 -192997 -195314 62827 -189737 -38060 22204 167574 -184138 382636 111255
12443D2188j1340h6035I0099h1518j98466c702A68027b28557B1380K20888e1270
$$ 42188 30848 -86035 90099 -81518 -279984 -3702 168027 -228557 21380 242268 -51270
12431A23789b31808D08295G6934i3421D8277e2174p7714A16438K55416A39449
$$ 123789 -231808 408295 76934 -93421 48277 -52174 -129888 116438 371854 139449
12420C59372r0697F5705e8669p191E9039E015h5743k7324j20293A20251a59210
$$ 359372 268675 65705 -58669 -65860 59039 5015 -85743 -113067 -233360 120251 -159210
12408G5019a81887A39091A6127a50455f6635o0044M6700F3933c94560a54505I0120
$$ 75019 -181887 139091 16127 -150455 -66635 -126679 -79979 63933 -394560 -154505 90120
12396g6117A07762j0968i0199j127A51326O2708M1168H5730N2981E4899L0337
$$ -76117 107762 96794 -90199 -91326 151326 214034 255202 85730 138711 54899 85236
12385H5236b5895d502E3468R515e9978l763k79423B9260J03297K0174J7018c184
$$ 85236 -25895 -4502 53468 62983 -59978 -63741 -343164 29260 132557 152731 169749 -3184
12372C2556J75904H7417O5943C0507a30774c0465A64445b09049f8414j68778F9887
$$ 32556 208460 87417 153360 30507 -130774 -30465 164445 -209049 -68414 -237192 69887
12360b65203k8163N8267B59411j14503a12025A0638g6437L6796H118J7575R3884
$$ -265203 -293366 -235099 259411 144908 -112025 10638 -76437 -39641 8118 25693 119577
12349A19577A6070c9500A23525m1873J7321C1651G988b41659B85934f3048C78885
$$ 119577 16070 -39500 123525 81652 98973 31651 7988 -241659 285934 -63048 378885
12337A8904Q9415f2438L371j57538D4519k64K17137H650b2630B58283E5391j5753
$$ 18904 108319 -62438 -59067 -216605 44519 44255 261392 8650 -22630 258283 55391 39638
12325C9638g4454B7390O0848q568l516J7041K98775j51089K89894d659B94110
$$ 39638 -74454 27390 88238 79670 76154 93195 391970 240881 530775 -4659 294110
12313a28368G5652K01042A05800M5018g567C4736d1998A12831P6503I3556C9998
$$ -128368 75652 276694 105800 150818 -7567 34736 -41998 112831 189334 93556 39998
12301B33378j3989I4901b10911d8352g214A91546b80660R0755f2035R2j63310
$$ 233378 219389 94901 -210911 -48352 -7214 191546 -280660 -189905 -62035 -61943 -225253
12290b25253A43159L42725D4838K52384J4863j24456D5127e4346C6312a07020
$$ -225253 143159 485884 44838 297222 312085 187629 45127 -54346 36312 -107020
12279C0611a07313c1261c60A09701a67683q7985Q1380C83820c2926A73212c6980
$$ 30611 -107313 -31261 -360 109701 -167683 -255668 -174288 383820 -32926 173212 -36980
12267A78296F3819a21170a8859A28996C2478J92758M6564c02845g2083I6891k9870
$$ 178296 63819 -121170 -18859 128996 32478 225236 271800 -302845 -72083 96891 67021
12256F7021A1841a74505N2537I0707d6412Q488j03443B29215f0449A82279f5729
$$ 67021 11841 -174505 -121968 90707 -46412 -37924 -141367 229215 -60449 182279 -65729
12244D32971j82298j20993G444P1090K099L38209J49734A52796J94084a5983A32338
$$ 432971 250673 129680 7444 78534 80633 418842 568576 152796 346880 -15983 132338
12232B65851N4595I6674J01757c2101F4704M575d6699H0716J18362K0295q0111
$$ 265851 320446 96674 198431 -32101 64704 69279 -46699 80716 199078 219373 139262
12221A39262K04542A56137k1619J15390J07380a52744B01711C6722A0568L04660
$$ 139262 343804 156137 134518 249908 357288 -152744 201711 36722 10568 315228
12211C15228L6791j66023N6916I9915K20857E7994J70469D4140K59868l3205g0940
$$ 315228 352019 185996 242912 99915 320772 57994 228463 44140 304008 270803 -70940
12199g6170A34863k2123N9576L63100B62665I1477A2833K5436L53610R9898k41434
$$ -76170 134863 112740 172316 535416 262665 91477 12833 38269 391879 491777 250343
12188B50343l8493D8543c57943E6651J72791D6704L1407a62479a0417A91032q222
$$ 250343 211850 48543 -357943 56651 229442 46704 78111 -162479 -10417 191032 182810
12177A82810g5281A30413h275A68781p803R8424f241B79691E0354g1667A681K13961
$$ 182810 -75281 130413 -8275 168781 160978 259402 -6241 279691 50354 -71667 1681 215642
12165B15642m7666P8054K9677A22297c44148e9262A89146k8173a16372C62899
$$ 215642 167976 246030 275707 122297 -344148 -59262 189146 160973 -116372 362899
12154e9650j3346L0648C6824J47288f1265A30816F0966b06066B28059q7480D8066
$$ -59650 -72996 -42348 36824 184112 -61265 130816 60966 -206066 228059 140579 48066
12142H9690A1722n400a18358j56301g144A34694b05280A35707K2281e4525C54582
$$ 89690 11722 6322 -118358 -274659 -7144 134694 -205280 135707 157988 -54525 354582
12130A99252K32320B07188f2977C27280l4952l4049j09426O3340J4350n2469G4308
$$ 199252 431572 207188 -62977 327280 292328 258279 148853 212193 226543 174074 74308
12118i0376H2045k0148a62721A72301n8365R5194J41193b34537C10498a71958
$$ -90376 82045 61897 -162721 172301 113936 209130 350323 -234537 310498 -171958
12107g682C49617F0457N638n747Q2106a25671d5029k166l7018B33706b3825A68537
$$ -7682 349617 60457 66095 60348 142454 -125671 -45029 -47195 -84213 233706 -23825 168537
12094b3809l1260A98078a00612E5642b0194k2579a918q2024I3665a30957A8274
$$ -23809 -55069 198078 -100612 55642 -20194 -42773 -1918 -83942 93665 -130957 18274
12082D5156a49383D0713c0542E7922a05406A45023G0233F412O9673K9170i6154
$$ 45156 -149383 40713 -30542 57922 -105406 145023 70233 6412 76085 105255 -96154
12070A00557J74044J04231a14605B34225I6434i9818o1934A26941J6567b7336
$$ 100557 274601 378832 -114605 234225 96434 -99818 -161752 126941 143508 -27336
12059B40625k6078a56111A4629J35947E7204a35955k32944G0929b02991E111b76862
$$ 240625 214547 -156111 14629 150576 57204 -135955 -368899 70929 -202991 5111 -276862
12047h489C3175L68934K04828k05579a05856k86083B06622l8260d329I705O7043
$$ -8489 33175 402109 606937 401358 -105856 -391939 206622 168362 -4329 9705 76748
12036G6748J71291a4020A31179e4685B00338H0727a41554A68832d7580l04193
$$ 76748 248039 -14020 131179 -54685 200338 80727 -141554 168832 -47580 -351773
12026c51773B52467E4212N3848a52232H3340e6603j9911A18488A7441a84137B33626
$$ -351773 252467 54212 108060 -152232 83340 -56603 -76514 118488 17441 -184137 233626
12014A10223P9803M6114a30455f3449K8202k09666A5825e1394F6888c37344B49368
$$ 110223 190026 236140 -130455 -63449 -35247 -244913 15825 -51394 66888 -337344 249368
12002d4576l1251E9767J78795i9453k3803j56392e3208r7186H3283P5026a53129
$$ -44576 -75827 59767 238562 -99453 -123256 -279648 -53208 -150394 83283 158309 -153129
11990H8970i4619I2903b7475r7666B9865F854a54626N1086j24430n6935a19419
$$ 88970 -94619 92903 -27475 -125141 29865 6854 -154626 -103540 -227970 -284905 -119419
11978a05701B18739a19212D4167j391H542c31871j2205g4785A11327A1586J82971
$$ -105701 218739 -119212 44167 42776 8542 -331871 -344076 -74785 111327 11586 194557
11967A94557K29842B11753a11090C6713M0258b04476B17226b19222B30515I1645
$$ 194557 424399 211753 -111090 36713 76971 -204476 217226 -219222 230515 91645
11956b52640B4179a12624k20272M6562M5144A22772d854E2968a4781F5807j9616
$$ -252640 24179 -112624 -332896 -286334 -241190 122772 -4854 52968 -14781 65807 46191
11945D6191a88708a6834l36851C06340A51777a85404e32A43574m0644D1303a27809
$$ 46191 -188708 -16834 -353685 306340 151777 -185404 -532 143574 102930 41303 -127809
11933g5004F0447J40534a96672f3156e640k3674k88861B16672a52689A752a63996
$$ -75004 60447 200981 -196672 -63156 -5640 -29314 -318175 216672 -152689 1752 -163996
11921A85621g3944k8874A56759F6768J96743D4842g7048F7593a05375B29574b2235
$$ 185621 -73944 -102818 156759 66768 263511 44842 -77048 67593 -105375 229574 -22235
11909B8102h4198j04859B43390A06881c17984m0873a09390q1853h6162o323A01891
$$ 28102 -84198 -189057 243390 106881 -317984 -358857 -109390 -191243 -86162 -92485 101891
11897a13982r6010A48523B1318J78931c22374B346a47657l06228A4303b50713
$$ -113982 -209992 148523 21318 200249 -322374 2346 -147657 -453885 14303 -250713
11886B39023b48349F9702e50820b01650l9190p725i4081j18619J144L0824f2893
$$ 239023 -248349 69702 -550820 -201650 -240840 -248565 -94081 -212700 -211556 -180732 -62893
11874A80550c4187k26424C8075L0656N5029c25245e2911o9052A94945G2638a83742
$$ 180550 -34187 -260611 38075 68731 123760 -325245 -52911 -121963 194945 72638 -183742
11862a22414A38640a56880l6355n9671f9941C04472k1544a52689f9186B1773a05196
$$ -122414 138640 -156880 -193235 -252906 -69941 304472 282928 -152689 -69186 21773 -105196
11850a86295l88861I3203n105K2798e2871A76305J13021b26442A36986h1282K6664
$$ -186295 -575156 93203 88098 110896 -52871 176305 289326 -226442 136986 -81282 -54618
11839e4618n0454A56330b42511b7314B35276b35416d6031A21709g6619a5047n1814
$$ -54618 -105072 156330 -242511 -27314 235276 -235416 -46031 121709 -76619 -15047 -66861
11828f6861K9964A42327b40117A90213n1200o0431C6188a14493j79430J34351
$$ -66861 -36897 142327 -240117 190213 139013 78582 36188 -114493 -293923 -159572
11818a59572c6302A6600K07688k1822e05j67100K245C4811J59047H4427a01131
$$ -159572 -36302 16600 224288 202466 -505 -167605 -165360 34811 193858 84427 -101131
11806a82375L7555j3586J6371k0971j00269A73147g5317k59458A75730d43608
$$ -182375 -144820 -158406 -142035 -163006 -263275 173147 -75317 -334775 175730 -443608
11795b03879Q6632i451m4721l534A21355c28381F0839a26427A38722A1771h2376
$$ -203879 -117247 -9451 -54172 -57706 121355 -328381 60839 -126427 138722 11771 -82376
11783a53373j41295o202p4926G1107b0205j45605m1177C13441a56212o6034B50832
$$ -153373 -294668 -300870 -375796 71107 -20205 -165810 -206987 313441 -156212 -222246 250832
11771B10631A7977L34934e9155D4920a49227O9204C31466a94229A12553b4938
$$ 210631 17977 352911 -59155 44920 -149227 -80023 331466 -194229 112553 -24938
11760b74141B84898Q0779j14370a51169C8449J09615A6195a66683C2400b58470
$$ -274141 284898 365677 251307 -151169 38449 148064 16195 -166683 32400 -258470
11749A60813c55863F3710J02470c9999I5288b63567A32258n2782i867l6820C10698
$$ 160813 -355863 63710 166180 -39999 95288 -263567 132258 79476 -9867 -46687 310698
11737G6217B5116c70037A12532d03641A68496a44052j7067A57683k8651a60814
$$ 76217 25116 -370037 112532 -403641 168496 -144052 -161119 157683 129032 -160814
11726D386c8662H5225c6582H0869b25561M3309b8064E5457J47909i4440E2879
$$ 4386 -38662 85225 -36582 80869 -225561 -182252 -28064 55457 203366 -94440 52879
11714F0555O2140F0298J6649J89632A07045a64003J8332j6845F4646c38371N9287
$$ 60555 122695 60298 76947 266579 107045 -164003 -145671 -162516 64646 -338371 -279084
11703b79084R1679C4334a41973d0973B22508B1457d0730C2506b24582J00849c9932
$$ -279084 -187405 34334 -141973 -40973 222508 21457 -40730 32506 -224582 -123733 -39932
11691B32195C4610a35601N5892j98103h7218I5361a57252E4810a8092B85527b16443
$$ 232195 34610 -135601 -79709 -277812 -87218 95361 -157252 54810 -18092 285527 -216443
11679G9602b24350R2469L4404K6454A43810E0490c4553A15213e8995E8238J49506
$$ 79602 -224350 -131881 -97477 -71023 143810 50490 -34553 115213 -58995 58238 207744
11668B07744I3362f0689C0954J82369c4952A98383A4675c96078C6444b37468B34579
$$ 207744 93362 -60689 30954 213323 -34952 198383 14675 -396078 36444 -237468 234579
11656D2082L74712C9917h5522b2002B58751c1856n5496m3272F6987J18022R1488
$$ 42082 416794 39917 -85522 -22002 258751 -31856 -87352 -130624 66987 185009 276497
11645B76497A3251J3859a0401H2649R1901g0759r6595C00807b6278r3993b2331
$$ 276497 13251 27110 -10401 82649 174550 -70759 -167354 300807 -26278 -120271 -22331
11633g6730A72281k110g2120k15195P5485I8673p301A2906J55956b10421E157
$$ -76730 172281 170171 -72120 -287315 -211830 98673 91372 12906 168862 -210421 5157
11621a40297j23223C12678r6474a02726l5343k6674D8568a86003A50014b16490
$$ -140297 -263520 312678 216204 -102726 -138069 -164743 48568 -186003 150014 -216490
11610A02838b49655B52892f7982o875k2499j57377B15221m1198e1341C492O6544
$$ 102838 -249655 252892 -67982 -74857 -97356 -254733 215221 174023 -51341 3492 70036
11599G0036k4503K20124E011L27085A7713f5255D3374O8361c8338k8488D1816
$$ 70036 45533 265657 5011 332096 17713 -65255 43374 111735 -38338 -66826 41816
11587B09451I7435D4555a31215G8362h7248A46494k9821B3427R4453a24352M5539
$$ 209451 97435 44555 -131215 78362 -87248 146494 116673 23427 117880 -124352 -78813
11576g8813c6887B9092J53767c95697A86974A2038a67497C51563A34240h645D7008
$$ -78813 -36887 29092 182859 -395697 186974 12038 -167497 351563 134240 -8645 47008
11564h2440A67304N1787g0602B52099g3021C5628I963L33028I8220a78744A95627
$$ -82440 167304 219091 -70602 252099 -73021 35628 9963 342991 98220 -178744 195627
11552G8395a27010A10005i6183j92989B33938A13022N8942a09532B73174a13962
$$ 78395 -127010 110005 -96183 -289172 233938 113022 171964 -109532 273174 -113962
11541B19096K4758c05592c0031B1089c08129C03844j6261a81880h4495p9696D9967
$$ 219096 243854 -305592 -30031 21089 -308129 303844 287583 -181880 -84495 -164191 49967
11529A10539Q8009l5194G1573C4348c87900g1217j48622c336E7044e0581l4053
$$ 110539 198548 163354 71573 34348 -387900 -71217 -219839 -3336 57044 -50581 -84634
11518h4634A77844i6688d0790l1613A16631a42780c2575l72324A77095j6953a87878
$$ -84634 177844 -96688 -40790 -72403 116631 -142780 -32575 -404899 177095 160142 -187878
11506A70168m0489a85331A7219N2832J73166j21048K34255A40612l6491a14113
$$ 170168 129679 -185331 17219 70051 243217 122169 356424 140612 104121 -114113
11495B29654j05021J35622p7644j8400a63781E6572J39073E7248L15294A63525
$$ 229654 124633 260255 182611 164211 -163781 56572 195645 57248 372542 163525
11484A4109E831N9910K50705C7459K50847c9439i098A63392e4063B35787b5386
$$ 14109 5831 65741 316446 37459 288306 -39439 -9098 163392 -54063 235787 -25386
11472A32501o2598J21896J60365A25613J52402A21694J48718H1766J74829g7483
$$ 132501 69903 191799 352164 125613 278015 121694 270412 81766 256595 -77483
11461B59620K19025j93883P2698f6609C7294J785L7888J82417f7408A96549p7963
$$ 259620 478645 284762 357460 -66609 37294 39079 76967 259384 -67408 196549 118586
11450A18586b11993J04036A73121J30813J06757G2090J21254r332c4294n8120
$$ 118586 -211993 -107957 173121 303934 410691 72090 193344 184012 -34294 -92414
11440i2414r0605B25680a28566A91457c28771J13868A67163J11620G5023b92143
$$ -92414 -183019 225680 -128566 191457 -328771 -214903 167163 278783 75023 -292143
11429i4399A18043H097M81344h3946E8298i0353j1455M9580r1327I2342k1912
$$ -94399 118043 8097 489441 -83946 58298 -90353 -101808 -52228 -143555 92342 70430
11418G0430C4761a37874A02863P24b98436C1991h2052C61379a79355e0967j2767
$$ 70430 34761 -137874 102863 103587 -298436 31991 -82052 361379 -179355 -50967 -63734
11407f3734p8881o318c5727E027d6241C60042H5033h6752A10173f4293B15746
$$ -63734 -142615 -148933 -35727 5027 -46241 360042 85033 -86752 110173 -64293 215746
11395B6356h6967A19416D8792d6312n2467j12195B85933a17270A71690a43001
$$ 26356 -86967 119416 48792 -46312 -98779 -210974 285933 -117270 171690 -143001
11384a78324h9020E8857a32981L1711d1731j43320q9626A58994O9463a80615g4052
$$ -178324 -89020 58857 -132981 -101270 -41731 -185051 -274677 158994 228457 -180615 -74052
11372H3728A9713N8349g3632H671N1862a67559j32840H8831J2602a92988g2281
$$ 83728 19713 78062 -73632 8671 60533 -167559 -300399 88831 101433 -192988 -72281
11360b24509g6992k46641C0649f2409F4786b02224P9671r5406A66300d2296j92673
$$ -224509 -76992 -323633 30649 -62409 64786 -202224 -122553 -217959 166300 -42296 -234969
11349b34969o931J18596l93722C47539I5773f1893H3408a13257A03073K5334c6980
$$ -234969 -241900 -123304 -517026 347539 95773 -61893 83408 -113257 103073 128407 -36980
11337E1057a2338H2072J46796a50147N3639A91106a08709c0048j1182A46762a46107
$$ 51057 -12338 82072 228868 -150147 -96508 191106 -108709 -30048 -41230 146762 -146107
11325c65884J74550H17J82815A895a57027I675b38402g1694j0611l1361A24568
$$ -365884 -191334 817 183632 1895 -157027 9675 -238402 -71694 -82305 -113666 124568
11313A53315a7070L339j87595c1066A69432J30707a33194B02946K20472A51348
$$ 153315 -17070 -13731 -201326 -31066 169432 300139 -133194 202946 423418 151348
11302A23608M6510C7141D381g0109a3912j7439q497j67627K5735A97720B3905
$$ 123608 170118 37141 4381 -70109 -13912 -31351 -39848 -207475 -181740 197720 23905
11290g0064m854j28608b3149F7279A8549b82838a9378k3320C9571b30928A23909
$$ -70064 -74918 -203526 -23149 67279 18549 -282838 -19378 -42698 39571 -230928 123909
11278C8858e536H8610b56258c4113j30044G7193g3229K6113A70690b76417A16239
$$ 38858 -5536 88610 -256258 -34113 -164157 77193 -73229 -47116 170690 -276417 116239
11266b01881e8611k0581A03499b31361C2902b39756g597B59109b56242d956l61093
$$ -201881 -58611 -79192 103499 -231361 32902 -239756 -7597 259109 -256242 -4956 -366049
11255c66049f9375C1891J94901A8692i196j10824A13323J03175l7647n1845A7437
$$ -366049 -69375 31891 226792 18692 -9196 -120020 113323 216498 178851 127006 17437
11243A77039c4123o645k09620j29701J67821k3196H345b65831a32494A01139i6479
$$ 177039 -34123 -40768 -250388 -380089 -212268 -235464 8345 -265831 -132494 101139 -96479
11231A12755a1869j50735j13744A30382f159b594j96735k01090H3222a14244K7821
$$ 112755 -11869 -162604 -276348 130382 -6159 -2594 -199329 -400419 83222 -114244 -86423
11220h6423j31458j11554h2966a6428H3631Q6826b41258H4042K542e7436l4044
$$ -86423 -217881 -329435 -82966 -16428 83631 170457 -241258 84042 86584 -57436 -91480
11209i1480k27116F8053Q1343A8799a12999b4488p5119C4777a02969b2389A27081
$$ -91480 -318596 68053 149396 18799 -112999 -24488 -99607 34777 -102969 -22389 127081
11197b43591e9778q5743A24921m3243K76274b02350d9976J2831a1039B9067J0006
$$ -243591 -59778 -145521 124921 81678 357952 -202350 -49976 -37145 -11039 29067 39073
11186C9073b5662l09346A7907b00181A71946b55663A02280F817b47373b0435B55288
$$ 39073 -25662 -335008 17907 -200181 171946 -255663 102280 6817 -247373 -20435 255288
11174a34770A12908k2345L03760A08073L17020b66455J02889c0087j72018c961
$$ -134770 112908 90563 394323 108073 425093 -266455 -163566 -30087 -202105 -3961
11163c91449A6240b83296a7674k49842D7643a4385C43617F6227b6750D2370l310
$$ -391449 16240 -283296 -17674 -267516 47643 -14385 343617 66227 -26750 42370 39060
11152C9060e2181N269A29960c9114n6205R826o7332j22359N9622E3045k1297b11203
$$ 39060 -52181 -46912 129960 -39114 -95319 -85493 -152825 -275184 -215562 53045 31748 -211203
11139C9339b25437A79941b83110a11025j22994A15220b97307j78589B29952r2675
$$ 39339 -225437 179941 -283110 -111025 -234019 115220 -297307 -475896 229952 137277
11129A37277o7945J6100o498M6067N5190b4866p9244c2249o3800n8905B52138
$$ 137277 69332 85432 78934 125001 180191 -24866 -104110 -32249 -96049 -154954 252138
11117A79120A4948J07830j3707n1889b85916A0752a30445A5407N7949J40836L3480
$$ 179120 14948 122778 109071 57182 -285916 10752 -130445 15407 73356 214192 247672
11106B47672q4733e6960C91724i9786C22092n8409c0897B48054K57102B242J76645
$$ 247672 162939 -56960 391724 -99786 322092 263683 -30897 248054 505156 2242 178887
11095A78887K2213J18370j00219q3187h106l4798A36480a80675D360L73878A21185
$$ 178887 201100 319470 219251 136064 -8106 -42904 136480 -180675 4360 378238 121185
11083B78888K42837B00412K9732J89831A07591O3545j6625J75043L7481F0659
$$ 278888 521725 200412 230144 419975 107591 171136 154511 329554 367035 60659
11072C51972G8078L15566A23157m9678K34285K65964k05883p8625H1438K24216
$$ 351972 78078 393644 123157 73479 307764 573728 367845 289220 81438 305654
11062C05654Q8834O4720j25157O0352L3471P4376k47283L45759J52546K50450
$$ 305654 394488 459208 334051 394403 427874 502250 254967 600726 753272 1003722
11052A003722k06525m9491j73950K43496j68000M8699J08443l11652L26137j37022
$$ 1003722 797197 747706 573756 817252 649252 697951 806394 494742 820879 683857
11042F83857L05381P9205l95071L12633k68497K1670j66122J82680j21514j34803
$$ 683857 989238 1068443 673372 986005 717508 739178 573056 755736 634222 499419
11032D99419J4144Q3497P0888B71994L03546j23961J54161K30251j19171J97337
$$ 499419 513563 597060 667948 271994 575540 451579 605740 835991 716820 914157
11022I14157p1607L5174m11223M5657j45441K91492l2456j52724L13693j50716
$$ 914157 842550 877724 466501 512158 366717 658209 625753 473029 786722 636006
11012F36006J28681l09848j60051L74907j93421N6737O2298N9233J13732q1398
$$ 636006 764687 454839 294788 669695 476274 533011 595309 654542 768274 686876
11002F86876j84475K76073l42886J59163l8951k61319J82318n4112J04184j50278
$$ 686876 502401 778474 435588 594751 555800 294481 476799 422687 526871 376593
10992C76593L32060j58518q844j41710N54112m19188j76713K49217K28011j40662
$$ 376593 708653 550135 541291 399581 953693 534505 357792 607009 835020 694358
10982F94358M73964r2327l60850K17275l2355K53824K46497K8910L28360n5967
$$ 694358 1168322 1075995 715145 932420 900065 1153889 1400386 1429296 1757656 1701689
10972A701689N43158K69819K79452K45889l75468K47557R1463j66965m60006l96082
$$ 1701689 2244847 2514666 2794118 3040007 2664539 2912096 3003559 2836594 2376588 1980506
10962A980506n43060k12253o8243J55111j45465q3836J49815k13828J55286j46333
$$ 1980506 1437446 1225193 1156950 1312061 1166596 1082760 1232575 1018747 1174033 1027700
10952A027700m5201l06681K12767o2603q8934k73549J61475H1189K57037J55460
$$ 1027700 982499 675818 888585 825982 737048 463499 624974 81189 338226 493686
10942D93686A00235K95537j43036H1688M1800g6833K783j45835A17319a5960j29153
$$ 493686 100235 395772 252736 81688 123488 -76833 -74050 -219885 117319 -15960 -145113
10931a45113q8973R9006F4971a2601B44657j09109D5400K28164e9113j96421d4520
$$ -145113 -234086 -135080 64971 -12601 244657 135548 45400 273564 -59113 -255534 -44520
10919G1159K58879c10147D7743b51568i3655B32362b19109h3682n773A98934J6965
$$ 71159 330038 -310147 47743 -251568 -93655 232362 -219109 -83682 -89455 198934 215899
10908B15899a48768A42533a57195a2517F1730j1206f3590A42550o0607M6620b93180
$$ 215899 -148768 142533 -157195 -12517 61730 50524 -63590 142550 81943 128563 -293180
10896A81021D942K16959b1868j3481H7332a00095a198o9987r8200h2094m6268
$$ 181021 4942 221901 -21868 -35349 87332 -100095 -1198 -71185 -169385 -82094 -128362
10885a28362A16211A1609b76644I9657K06321a46299q456J0848e2630A5146b06375
$$ -128362 116211 11609 -276644 99657 305978 -146299 -154755 -143907 -52630 15146 -206375
10873A8757N6122e3837d503A40697b66030B13356g6237L4928C5989J53627a25385
$$ 18757 74879 -53837 -4503 140697 -266030 213356 -76237 -41309 35989 189616 -125385
10861e5497j8388F6807a55614A32262b8703j40011H5688J463J81344a8478l0807
$$ -55497 -73885 66807 -155614 132262 -28703 -168714 85688 87151 268495 -18478 -49285
10850d9285j044j22203c2907k11079j05078h4378C9472J89499a63296l7144m5307
$$ -49285 -50329 -172532 -32907 -243986 -349064 -84378 39472 228971 -163296 -200440 -245747
10839b45747c9730C72966h3965a6601k95815g8798a7323k39462C45185c16910
$$ -245747 -39730 372966 -83965 -16601 -312416 -78798 -17323 -256785 345185 -316910
10828c3221p5886c6713j18399A5941N5749c9011B79895a34992j9536G4195d3867
$$ -33221 -109107 -36713 -155112 15941 71690 -39011 279895 -134992 -154528 74195 -43867
10816f790C4150J27127a50826N1363M0105A20033A0808K28209e1023k64814a6414
$$ -6790 34150 161277 -150826 -99463 -59358 120033 10808 239017 -51023 -315837 -16414
10804D3109J3334B333M1937a33049k74726B52570c15522k3166p9685A58067N234
$$ 43109 56443 2333 44270 -133049 -407775 252570 -315522 -338688 -418373 158067 163301
10793A63301F9145B1744E164J94191A1298J17836h2548H0921i2296c6488G755
$$ 163301 69145 21744 5164 199355 11298 129134 -82548 80921 -92296 -36488 7755
10781H0460C855K1268J58999g2320j33132E272b8725n5132C30535a73474j292
$$ 80460 3855 25123 184122 -72320 -205452 5272 -28725 -83857 330535 -173474 -174766
10770a74766D21848a13034p5001a7300p1845m15434J42261b6377j0901E15290
$$ -174766 421848 -113034 -188035 -17300 -89145 -504579 -362318 -26377 -37278 515290
10759f3574l9023p9109j20309f8432B75483d14282B7381e6366A92922b62699J01273
$$ -63574 -102597 -181706 -302015 -68432 275483 -414282 27381 -56366 192922 -262699 -161426
10748a61426A87581b64532a13393A58801c5080E9602P0900c83031J87760G740
$$ -161426 187581 -264532 -113393 158801 -35080 59602 130502 -383031 -195271 7740
10737B50326J5981q0679D1291a22037l0284P3981j81915a11667D8084a39776B7839
$$ 250326 266307 185628 41291 -122037 -152321 -78340 -260255 -111667 48084 -139776 27839
10725B04227P728a91373g888l23080k9906A78973P0386a28892A23960c87052a36095
$$ 204227 211955 -191373 -7888 -330968 -360874 178973 249359 -128892 123960 -387052 -136095
10713a046A5656d5898l3309j43715Q7861A65348a15606B79959m4995j16516J04676
$$ -1046 15656 -45898 -79207 -222922 -135061 165348 -115606 279959 234964 118448 223124
10702B23124b0337A91390a88451D7635a26634l0885r8034B67532m1640b09915
$$ 223124 -20337 191390 -188451 47635 -126634 -157519 -255553 267532 225892 -209915
10691a36237j84352a03754H7502d90211i4077l3574q120H3494c2884g204m05786
$$ -136237 -320589 -103754 87502 -490211 -94077 -127651 -135771 83494 -32884 -7204 -412990
10680d12990i6767L8428g727j79823A04798a79844B72661J2186b1512k27036P9227
$$ -412990 -96767 -58339 -7727 -187550 104798 -179844 272661 284847 -21512 -248548 -169321
10669a69321D385f7490A22822A4539d13871Q3081a2126m0199C1835b3835j4081
$$ -169321 4385 -67490 122822 14539 -413871 -330790 -12126 -52325 31835 -23835 -37916
10658c7916A30572D4017J70012c77994c49l9860p5085E5244j6384b72335f4009
$$ -37916 130572 44017 214029 -377994 -349 -40209 -115294 55244 38860 -272335 -64009
10646h4900l6469F8240J21509d00372J12997b3165D2324b11631B81179a18784
$$ -84900 -121369 68240 189749 -400372 -287375 -23165 42324 -211631 281179 -118784
10635b21259b8886k90869r1897d8206b2291n895k7962C9637d15967C55230i0876
$$ -221259 -28886 -319755 -411652 -48206 -22291 -28186 -56148 39637 -415967 355230 -90876
10623b6226A6643c3526m071m5198a2726j64054A69318a06058A41519J5268J11496
$$ -26226 16643 -33526 -37597 -82795 -12726 -176780 169318 -106058 141519 156787 268283
10612B68283D7283O7848c4970o6098k02317A11841J47493q7758b11047A34463
$$ 268283 47283 115131 -34970 -101068 -303385 111841 259334 171576 -211047 134463
10601c996r2136L3948E767Q3766C3323L12182c36216g231j73707b9671E6310b64844
$$ -3996 -96132 -62184 5767 89533 33323 345505 -336216 -7231 -180938 -29671 56310 -264844
10588A36437o430a18331D70521b20813e1422A92749A5387f0921A31679e1022m9625
$$ 136437 130007 -118331 470521 -220813 -51422 192749 15387 -60921 131679 -51022 -100647
10577a00647d0177a1627A48264b83053a15555J5537c1444I3220a54560B7483i7452
$$ -100647 -40177 -11627 148264 -283053 -115555 -100018 -31444 93220 -154560 27483 -97452
10565a83593g6140j68568e5264j46436B0189J84257a80048c3031O103q7305B63799
$$ -183593 -76140 -244708 -55264 -201700 20189 204446 -180048 -33031 -26928 -114233 263799
10553H8886a11619N1166A80779c09071A41645h2799E2979c3903m7843B8823d2534
$$ 88886 -111619 -60453 180779 -309071 141645 -82799 52979 -33903 -81746 28823 -42534
10541b37493b5685j38088o9711A54856j6440b87924e3520A34783a04160i892j33611
$$ -237493 -25685 -163773 -233484 154856 138416 -287924 -53520 134783 -104160 -9892 -143503
10530a43503b9913A18901b3284m0460k81123C68600j23623a56832M9803K9295
$$ -143503 -29913 118901 -23284 -63744 -344867 368600 244977 -156832 -107029 -77734
10520g7734H1375b44768B85192B9391c5527l38471J47252O7907a8569n9540j61111
$$ -77734 81375 -244768 285192 29391 -35527 -373998 -226746 -158839 -18569 -78109 -239220
10509b39220f6215A84158D4787J7852a95216P9906L2570C1335a61941L025j37958
$$ -239220 -66215 184158 44787 62639 -195216 -115310 -82740 31335 -161941 -158916 -296874
10498b96874C26451c1596j32003j53989f6969B54764a79934d6968k9850A4338
$$ -296874 326451 -31596 -163599 -317588 -66969 254764 -179934 -46968 -76818 14338
10487b52502g0311A7950c34567Q2984B8741J20409J5310o830b9229B1420J22082
$$ -252502 -70311 17950 -334567 -251583 28741 149150 164460 157630 -29229 21420 143502
10476A43502C4786J57923E4832c7216B47484B7112K418K63588k2923B0425b37229
$$ 143502 34786 192709 54832 -37216 247484 27112 29530 293118 270195 20425 -237229
10464A79910c42703J28503B75353a44064l03594A70271G9636J1943A0758P435
$$ 179910 -342703 -214200 275353 -144064 -447658 170271 79636 91579 10758 18193
10454A8193a74775A35977a71376d3757A68111J06950r2619d737A64328a89464
$$ 18193 -174775 135977 -171376 -43757 168111 275061 182442 -4737 164328 -189464
10443A73216J80473E9517b09407a8529A34292g371I1758h2686c1482k76092f1957
$$ 173216 353689 59517 -209407 -18529 134292 -7371 91758 -82686 -31482 -307574 -61957
10431F1108a41839B3335K08351c5045k24659f3693B90400b40806a00282A46723
$$ 61108 -141839 23335 231686 -35045 -259704 -63693 290400 -240806 -100282 146723
10420d4976m9261A32803e2669A51744i5350N368j49833A14672d18709A2533b42729
$$ -44976 -94237 132803 -52669 151744 -95350 -89982 -239815 114672 -418709 12533 -242729
10408E8218J27810j5662K13122A25475a04609B10000q6205e1293B67646a46752
$$ 58218 186028 170366 383488 125475 -104609 210000 123795 -51293 267646 -146752
10397A29560b67592i0649A70333p0080d51758D01826A22640E520K44412a12419
$$ 129560 -267592 -90649 170333 100253 -451758 401826 122640 5520 249932 -112419
10386B59437b11883j17311J47027G1542b04517P3513D1002J01160G0380e515B93759
$$ 259437 -211883 -329194 -182167 71542 -204517 -131004 41002 142162 70380 -5515 293759
10374C87761k8216j45404b07185A97958j5057n6754J98553K9303a05392A97282
$$ 387761 359545 214141 -207185 197958 182901 126147 324700 354003 -105392 197282
10363C79216m6571J15428M1077q7659A54945L53773F1093J44879L38773A42801
$$ 379216 332645 448073 489150 401491 154945 508718 61093 205972 544745 142801
10352B02452J16147j01585L04309j50602N84724m38816b7068C10014J35004k8006
$$ 202452 318599 217014 521323 370721 955445 516629 -27068 310014 445018 417012
10342D17012I1856J02044r506K31624j59789J15684A28378b87460b3642I6582
$$ 417012 91856 193900 184394 416018 256229 371913 128378 -287460 -23642 96582
10331a28687E2895e370B29399F6554A7384b56012B73214b02600A68960J36491
$$ -128687 52895 -5370 229399 66554 17384 -256012 273214 -202600 168960 305451
10321C05451J6400b25223B45587l058A18761J89029A23628K309l8584L945J27440
$$ 305451 321851 -225223 245587 242529 118761 307790 123628 125937 87353 91298 218738
10310B18738e12233C16173b08111C1250Q317i7038r7179N8679c2287M460k26543
$$ 218738 -512233 316173 -208111 31250 39567 -97038 -194217 -135538 -32287 -27827 -254370
10299b54370r0453A23294D7954K3783b3074C41105I0820c6911j16070d150j23667
$$ -254370 -344823 123294 47954 71737 -23074 341105 90820 -36911 -152981 -4150 -127817
10288a27817B57193C6222O0473L5712I019e83j08051A93235I1730h4484k15258
$$ -127817 257193 36222 96695 132407 9019 -583 -108634 193235 91730 -84484 -299742
10277b99742c6556b697A00113B4909K11113e4927A85704F0644a12161l3095B82977
$$ -299742 -36556 -2697 100113 24909 236022 -54927 185704 60644 -112161 -145256 282977
10265b03911A05876E0999b71030P3964I3543M4725j8278N9536p2315P3193n4519
$$ -203911 105876 50999 -271030 -197066 93543 138268 119990 179526 107211 180404 125885
10254A25885J04081b37563E3390g9672l5944k194J9633B2558b159j46106D6202
$$ 125885 229966 -237563 53390 -79672 -115616 -117810 -98177 22558 -2159 -148265 46202
10242a92263I1075d3065j40995A27154a3686n37279B85616a157B88354a9333j59503
$$ -192263 91075 -43065 -184060 127154 -13686 -550965 285616 -1157 288354 -19333 -178836
10231a78836N7718n6917k656Q8880k3864m29516e933C49035d4676B20878c50052
$$ -178836 -121118 -178035 -180691 -91811 -115675 -545191 -5933 349035 -44676 220878 -350052
10219b84051Q1965L656H9444k1562L6007b10980C2195a45215b7736j36701j29841
$$ -284051 -202086 -198430 89444 67882 103889 -210980 32195 -145215 -27736 -164437 -294278
10208b94278b7923I6699K69137b9880D9580k1248a80917A39626J03319a88872
$$ -294278 -27923 96699 365836 -29880 49580 28332 -180917 139626 242945 -188872
10197a54503p6576g7459r9584k18541A30689j803m3171f80803K88167Q9442a44150
$$ -154503 -231079 -77459 -177043 -395584 130689 128886 85715 -680803 -392636 -303194 -144150
10185C6897M8638P0081f8626k7923G7279j8542R7067a02208I9478J63852h0729
$$ 36897 85535 155616 -68626 -96549 77279 58737 155804 -102208 99478 263330 -80729
10173a06429r8062B05271b04954a01043J8443I8172H993J02516b33797a02709
$$ -106429 -204491 205271 -204954 -101043 -82600 98172 8993 111509 -233797 -102709
10162c34390B93411a33926j66061e8278H5557C0892a22333A0377Q8379a81931
$$ -334390 293411 -133926 -299987 -58278 85557 30892 -122333 10377 98756 -181931
10151g3264B30899A11714r424g6255F924f6558B0122R3474J99477C6736c08897
$$ -73264 230899 111714 102290 -76255 6924 -66558 20122 113596 313073 36736 -308897
10139G1193b37763O8918j47570i2991m9638k40837B5923Q2104E9a29426A07246
$$ 71193 -237763 -168845 -316415 -92991 -142629 -383466 25923 108027 59 -129426 107246
10127a91468d9145l8251o0929m9275i1047M82j10914k4460h8479G6128L9248J7880
$$ -191468 -49145 -87396 -148325 -197600 -91047 -90565 -201479 -225939 -88479 76128 115376 133256
10115A33256M0684m3682b7305j14627D2947a81012k7505a8779j4116k81602a23925
$$ 133256 173940 130258 -27305 -141932 42947 -181012 -208517 -18779 -32895 -314497 -123925
10103f8247K7304j41907H2887c46658B63156q1670g1143G680J2657R0043a98292
$$ -68247 -40943 -182850 82887 -346658 263156 181486 -71143 7680 20337 110380 -198292
10091a77868D5488a58344j69139a32945j73885A38876Q5787m8353b78342p7796
$$ -177868 45488 -158344 -327483 -132945 -306830 138876 224663 176310 -278342 -356138
10081c56138D1020b60248O0319Q2515N2641j53055j16311B38101D8426h9862A86785
$$ -356138 41020 -260248 -199929 -117414 -64773 -217828 -334139 238101 48426 -89862 186785
10069g0396b1072B6247f2963I8946B5158a24861A20154m8719a42307C17275a53907
$$ -70396 -21072 26247 -62963 98946 25158 -124861 120154 71435 -142307 317275 -153907
10057b74215A92490c9293B85041F0599a10726B23404c06233J43688e0746j4190
$$ -274215 192490 -39293 285041 60599 -110726 223404 -306233 -162545 -50746 -64936
10047f4936A33497G90c93971J81102A07141O5456p4751g5202A6754c63690J19722
$$ -64936 133497 790 -393971 -212869 107141 172597 97846 -75202 16754 -363690 -243968
10036b43968j9304a9463B0532J73487h0405n7743A2958J7754Q0201b27515j46836
$$ -243968 -263272 -19463 20532 194019 -80405 -138148 12958 30712 110913 -227515 -374351
10025c74351e6168o8107d2434D5257j2276b08699A62164a4341k16495g8500j23451
$$ -374351 -56168 -124275 -42434 45257 32981 -208699 162164 -14341 -230836 -78500 -201951
10014b01951A24945a5800o8782K2997l25352B58314Q8703a11502j9360j47094
$$ -201951 124945 -15800 -84582 -61585 -386937 258314 347017 -111502 -130862 -277956
10004b77956a8856j01522c4609L794j07907A78074e7223J6895k6695j10347q7971
$$ -277956 -18856 -120378 -34609 -30815 -138722 178074 -57223 -40328 -67023 -177370 -265341
9993b65341J17505A7081b90338C86773a68020h3333B28890J2104A06505a53313
$$ -265341 -147836 17081 -290338 386773 -168020 -83333 228890 240994 106505 -153313
9982C04933b75639B20064o0599l0093j5145F221K28298d11704J73816e2326a2452
$$ 304933 -275639 220064 159465 129372 114227 6221 234519 -411704 -237888 -52326 -12452
9970b79922e1725q9184F0375N9209e4413m51995E9279b3577o0046C50598F2138
$$ -279922 -51725 -140909 60375 119584 -54413 -506408 59279 -23577 -83623 350598 62138
9958a3186k09096A69607G4768b9118j73215A76041G7381a30052F0528c50951a24577
$$ -13186 -222282 169607 74768 -29118 -202333 176041 77381 -130052 60528 -350951 -124577
9946a90215D696e0482j34402n0742D7656J28973a25067l4252k2791E059d3989
$$ -190215 4696 -50482 -184884 -235626 47656 176629 -125067 -159319 -182110 5059 -43989
9934b64946b1807q540k56119C4440r648j1073a56852j12575c7282N044A46105
$$ -264946 -21807 -30347 -286466 34440 24792 13719 -156852 -269427 -37282 -32238 146105
9922c0119j98820E9384a11840A27316d54154e8666n6494k15369D9497b2206k812
$$ -30119 -228939 59384 -111840 127316 -454154 -58666 -115160 -330529 49497 -22206 -25018
9911b5018o5365G0532a18166A88537J6042a44627A05409k7026c06753j0061A5771
$$ -25018 -90383 70532 -118166 188537 204579 -144627 105409 78383 -306753 -316814 15771
9899b54551b3384B4965b17380B9268b04112c7514J6388E0826e21281a37035C6269
$$ -254551 -23384 24965 -217380 29268 -204112 -37514 -21126 50826 -521281 -137035 36269
9887d7047j91181p2045J39362k2246I3517k0709B0745b72876a20037B1237a74204
$$ -47047 -238228 -310273 -170911 -193157 93517 72808 20745 -272876 -120037 21237 -174204
9875A77245b81147F7533J92708b6429d243B5082O3538c98935a70687D5449e941
$$ 177245 -281147 67533 260241 -26429 -4243 25082 88620 -398935 -170687 45449 -5941
9863a5204l4537o0065B39938b05458l4458P0544b9385K161N958j7405n8401E8055
$$ -15204 -49741 -109806 239938 -205458 -239916 -169372 -29385 -27224 -21266 -38671 -97072 58055
9850b14336a2563j84885i4588E6917J02009f2548l45135A5549F229d4517k22797
$$ -214336 -12563 -197448 -94588 56917 158926 -62548 -407683 15549 6229 -44517 -267314
9839b67314K9639n5646a20061h04k95412A64234b238F6207b145I0724N0255d41509
$$ -267314 -237675 -293321 -120061 -804 -296216 164234 -2238 66207 -2145 90724 140979 -441509
9826d6975A13406a48068I3950M6463F5942a03052A73523B1147h0131b3892A21822
$$ -46975 113406 -148068 93950 140413 65942 -103052 173523 21147 -80131 -23892 121822
9814a4254F223a89085m9444A89743a23012j38968l6949A18417l4335A3692b20637
$$ -14254 6223 -189085 -238529 189743 -123012 -261980 -298929 118417 84082 13692 -220637
9802b1578j92605C11506j45591m8738d4147r0263A03324J0401l7650i327l20539
$$ -21578 -214183 311506 165915 117177 -44147 -134410 103324 113725 76075 -9327 -329866
9791c29866R1826A27415e7385n4207B2237J0357L2453Q8767D4110b11496j22954
$$ -329866 -238040 127415 -57385 -111592 22237 32594 65047 153814 44110 -211496 -334450
9780c34450a22311k007q702d9515j1361r803A9754b54499R0571k26695F8431h006
$$ -334450 -122311 -124318 -133020 -49515 -60876 -70679 19754 -254499 -163928 -390623 68431 -8006
9767H1448h0972D0646a65357k19284h4566A4060E749M4706a09537o5754L3776
$$ 81448 -80972 40646 -165357 -384641 -84566 14060 5749 50455 -109537 -175291 -141515
9756a41515O0005L4394j54825e2069B58350I0294O7167c0683l21869c158B73838
$$ -141515 -81510 -47116 -201941 -52069 258350 90294 157461 -30683 -352552 -3158 273838
9744I9799P3473b27123A38299P2659J33411B6621D301J73033i5885n6402d1312
$$ 99799 173272 -227123 138299 210958 344369 26621 4301 177334 -95885 -152287 -41312
9732F0354a12619m4265A18275L624a57533J5583K4266E04238A98800a31983A71952
$$ 60354 -112619 -156884 118275 121899 -157533 -141950 -117684 504238 198800 -131983 171952
9720b78310A00436P2839E1313g8973j63426q4040J39200Q9006L1214r2488q8840
$$ -278310 100436 173275 51313 -78973 -242399 -326439 -187239 -98233 -67019 -159507 -248347
9709b48347h1817q1544P9583K3553A12682b40216a11887G4401j3608c02935d4240
$$ -248347 -81817 -163361 -83778 -60225 112682 -240216 -111887 74401 60793 -302935 -44240
9697f6271E3702M9664c3211B48359a75831j6138b6277j81251j13081a26919k2314
$$ -66271 53702 103366 -33211 248359 -175831 -191969 -26277 -207528 -320609 -126919 -149233
9686a49233g3842j43822C7316a14110B21918o0211A5629L52362c2565n6224C28761
$$ -149233 -73842 -217664 37316 -114110 221918 161707 15629 367991 -32565 -88789 328761
9674a29606A08133A3458d29106a39476a4987j88278g7096j91801L6404B2956e0450
$$ -129606 108133 13458 -429106 -139476 -14987 -203265 -77096 -268897 -232493 22956 -50450
9662i3278B63610a02517A07311a41246O7156k9515d4242j05252b5142E6114b16835
$$ -93278 263610 -102517 107311 -141246 -74090 -103605 -44242 -149494 -25142 56114 -216835
9650A32740a71163g0857j24574A06180a33632K914F0822j7405J14955o6709L6121
$$ 132740 -171163 -70857 -195431 106180 -133632 -130718 60822 43417 158372 91663 127784
9639A27784j2778C001J84449g6109J6494h121r5973n5524A68470a08382B16109
$$ 127784 115006 3001 187450 -76109 -59615 -8121 -104094 -159618 168470 -108382 216109
9627A40763a32020n9903I6513K31560G4235K8498b56331J02137f526r7981m843
$$ 140763 -132020 -191923 96513 328073 74235 102733 -256331 -154194 -6526 -104507 -109350
9616a09350m3146J1218d0473k76753J23727b5414l08851a33155A12162K82210
$$ -109350 -152496 -141278 -40473 -317226 -193499 -25414 -334265 -133155 112162 394372
9606C94372a09320M0926l15836P6626J53484k5731A40174d11783h2737B05334
$$ 394372 -109320 -68394 -384230 -307604 -154120 -179851 140174 -411783 -82737 205334
9595C9758K09606a49269j36389j2132A57799c2935j1055j46055i0210j68147A73332
$$ 39758 249364 -149269 -285658 -297790 157799 -32935 -43990 -190045 -90210 -258357 173332
9583b0698n7638I8352i1158o8273c4631C60035d9009r96k40951B03906c65427
$$ -20698 -78336 98352 -91158 -159431 -34631 360035 -49009 -50005 -290956 203906 -365427
9571c61286a14265k68158a38806A2270a35154M2536j49512O0528K3959o3345A75298
$$ -361286 -114265 -382423 -138806 12270 -135154 -92618 -242130 -181602 -157643 -220988 175298
9559A24785d11704a68941l1093o6241E541a14474E4831a10682A40J82264a27378
$$ 124785 -411704 -168941 -200034 -266275 5541 -114474 54831 -110682 140 182404 -127378
9547g0447n02840i0516j02919F6676a54607G4939a89002f8942a0220j39617A42018
$$ -70447 -573287 -90516 -193435 66676 -154607 74939 -189002 -68942 -10220 -149837 142018
9535E4944J4006g0132q1067b4113k09994D1715K30974f9377j51285g7914a8919
$$ 54944 68950 -70132 -151199 -24113 -234107 41715 272689 -69377 -220662 -77914 -18919
9523b0780G2619a65733H978Q1592a98194d7046j0415n3029j07559q5449a2412
$$ -20780 72619 -165733 8978 90570 -198194 -47046 -57461 -110490 -218049 -303498 -12412
9511c27153A20086Q218a02534k97819f5757A21533m4914b67553C26067d8161G6446
$$ -327153 120086 128304 -102534 -400353 -65757 121533 76619 -267553 326067 -48161 76446
9499D8597a18405J010A8240a07219j7728B30696B0534h8217k98995B14244a2235
$$ 48597 -118405 -117395 18240 -107219 -124947 230696 20534 -88217 -387212 214244 -12235
9487b08126A51358b50941Q4423j88628b6642k56227i9310M9635G2660i7913A4170
$$ -208126 151358 -250941 -166518 -355146 -26642 -282869 -99310 -49675 72660 -97913 14170
9475c21534a4107k4945j34501M6456B62880b159H5348C7688i9821k27006B47281
$$ -321534 -14107 -39052 -173553 -127097 262880 -2159 85348 37688 -99821 -326827 247281
9463A81319f3009A2597d6824A3368a61808m4559O3171d6212E5961d08931f4678
$$ 181319 -63009 12597 -46824 13368 -161808 -206367 -143196 -46212 55961 -408931 -64678
9451b98270j7503E5480b29340G1651c2047j67037B98743b3387j58021D5193J13173
$$ -298270 -315773 55480 -229340 71651 -32047 -199084 298743 -23387 -181408 45193 158366
9440A58366b36312N1395F2066i2748M5268A01454j6102a05967n9284f4534j13980
$$ 158366 -236312 -184917 62066 -92748 -47480 101454 85352 -105967 -165251 -64534 -178514
9429a78514d0529j28762h3291j22325J01579o3906K8285O9323j39880c1822k10899
$$ -178514 -40529 -169291 -83291 -205616 -104037 -167943 -139658 -70335 -210215 -31822 -242721
9418b42721o9841E8095K05355A02635C2256b516q2209D6092b0719j26175l69025
$$ -242721 -312562 58095 263450 102635 32256 -2516 -84725 46092 -20719 -146894 -515919
9407e15919A75L5797i0313H7459J29011a08250k00557L0417a08625D3260J36578
$$ -515919 175 35972 -90313 87459 216470 -108250 -308807 -278390 -108625 43260 179838
9396A79838j2443i0719l74924a85121C43354b2652C9633K55332a57962b6674H5725
$$ 179838 167395 -90719 -465643 -185121 343354 -22652 39633 294965 -157962 -26674 85725
9384b811H539J49186c13296E5515b62066J2032A6255f1894l90784f6496j25182
$$ -2811 8539 157725 -313296 55515 -262066 -250034 16255 -61894 -452678 -66496 -191678
9373a91678P7946q947N547A91194J0338b55826I9137b10956j83005B58092k3871
$$ -191678 -113732 -122679 -117132 191194 201532 -255826 99137 -210956 -393961 258092 234221
9362B34221F0072K9435q692a70613l8992C57391b04587i782q1213o0389r5154
$$ 234221 60072 89507 80815 -170613 -209605 357391 -204587 -9782 -90995 -151384 -246538
9351b46538f8840q5944H430d29562l8373b3515k48141A44430c03976G5983J02829
$$ -246538 -68840 -154784 8430 -429562 -467935 -23515 -271656 144430 -303976 75983 178812
9340A78812D7248J65671r2454n0509g1912l9213a0444j28052B2107b66774J24399
$$ 178812 47248 212919 120465 69956 -71912 -111125 -10444 -138496 22107 -266774 -142375
9329a42375j80909a25262E8459k2005a12558k70073a43114B23377M993N0806H4347
$$ -142375 -323284 -125262 58459 36454 -112558 -382631 -143114 223377 228370 279176 84347
9317B45234J09738g4268j78188P7981h3433B39728I5528a24920A0074c40717b2284
$$ 245234 354972 -74268 -252456 -174475 -83433 239728 95528 -124920 10074 -340717 -22284
9305A015f7070J4129j59374A6777J7960c95172g5847a7289C0393i1384m9874A14955
$$ 1015 -67070 -52941 -212315 16777 34737 -395172 -75847 -17289 30393 -91384 -141258 114955
9292e5897k08470J439P8896B1577b10328f3841r1375g2337D7085J4251i5444A66182
$$ -55897 -264367 -262928 -184032 21577 -210328 -63841 -155216 -72337 47085 61336 -95444 166182
9279G9753l6960d01100B41344a33862c5792A00116B8297i5873A01728a64041c3286
$$ 79753 42793 -401100 241344 -133862 -35792 100116 28297 -95873 101728 -164041 -33286
9267h5782j02167L0024K8260j9140e2638j60911k7933a19974F3654a13053C33324
$$ -85782 -187949 -157925 -129665 -148805 -52638 -213549 -241482 -119974 63654 -113053 333324
9255B1228a08072E99252a32394E0778k1663c3106E810b80909b3099G4427n990
$$ 21228 -108072 599252 -132394 50778 29115 -33106 5810 -280909 -23099 74427 68437
9244F8437N3604l1569K8420g109l25752b1738B63109a32378K0194j32025B00068
$$ 68437 122041 90472 118892 -7109 -332861 -21738 263109 -132378 -112184 -244209 200068
9232b92092G5565a25467l1317A51747G5253a8956j36865B2761J92571a81110n3255
$$ -292092 75565 -125467 -156784 151747 75253 -18956 -155821 22761 215332 -181110 -234365
9221b34365i865m40588c7552n149j53598B3206b99111R0489f3145H548b41821
$$ -234365 -9865 -450453 -37552 -42701 -196299 23206 -299111 -208622 -63145 8548 -241821
9209A54278D1189K80580j31101a717I1319J54262F5874a92396M0960B476R8938
$$ 154278 41189 321769 190668 -1717 91319 245581 65874 -192396 -151436 2476 101414
9198A01414a30041A51778b51486A5054K04260E8672h394E7915a3354k95541o1854
$$ 101414 -130041 151778 -251486 15054 219314 58672 -8394 57915 -13354 -308895 -370749
9187c70749B20837a13902D1921J37469c38830P6493J20602r0567b4519k07865
$$ -370749 220837 -113902 41921 179390 -338830 -262337 -141735 -232302 -24519 -232384
9177b32384A34397n0660C1897b12706B11599D0621b66700j4193a3157j63981F232
$$ -232384 134397 83737 31897 -212706 211599 40621 -266700 -280893 -13157 -177138 6232
9165A90680h5729k41768a46978K9548k09028a22020n0339B08541D0780j5149a25439
$$ 190680 -85729 -327497 -146978 -117430 -326458 -122020 -172359 208541 40780 25631 -125439
9153b95663A81457c53769a29953H3717a75666k96902J95541A86708j4570a2109
$$ -295663 181457 -353769 -129953 83717 -175666 -472568 -277027 186708 172138 -12109
9142G1503b28568A06482J9994b12445j19109E2401J70532b88449R7111H0794R608
$$ 71503 -228568 106482 126476 -212445 -331554 52401 222933 -288449 -191338 80794 90402
9131I0402J08150B8920a11600j6247L9300I0611J7122P0170d8934G555J9629b07748
$$ 90402 198552 28920 -111600 -127847 -88547 90611 107733 177903 -48934 7555 27184 -207748
9118C17149a00399j19705J1277A25493M1974a30947B44829f9198j20696B18278
$$ 317149 -100399 -220104 -208827 125493 167467 -130947 244829 -69198 -189894 218278
9107b0851F3997a73091P8251q9584l4324h4597G6481l1954a88370k1533d2333
$$ -20851 63997 -173091 -94840 -184424 -218748 -84597 76481 44527 -188370 -209903 -42333
9095F4790K1084a32092A5120b95199Q4261k75497a87804h5695I0112c11815J06036
$$ 64790 85874 -132092 15120 -295199 -210938 -486435 -187804 -85695 90112 -311815 -205779
9084b05779B1302i3156m6162C62470a27705j1233E8396a44660B49112j19668a33728
$$ -205779 21302 -93156 -139318 362470 -127705 -138938 58396 -144660 249112 129444 -133728
9072a48920j15511B97092b04031j40676J54808e9550k18737h5251k71468b2178
$$ -148920 -264431 297092 -204031 -344707 -189899 -59550 -278287 -85251 -356719 -22178
9061E8431J2045Q5758F1955k523j5751b25934k9114B72574a32136I0069m3522
$$ 58431 70476 156234 61955 59432 43681 -225934 -255048 272574 -132136 90069 46547
9050D6547i2117C62629D963a43309f7670D5155b97491R0382f5793G538L8313a96812
$$ 46547 -92117 362629 4963 -143309 -67670 45155 -297491 -207109 -65793 7538 45851 -196812
9037B04232F5064R9987b0533E7340e2122b771j13904B06696c34506J62100o9495
$$ 204232 65064 165051 -20533 57340 -52122 -2771 -116675 206696 -334506 -172406 -241901
9026b41901A81248a00194j75306a05480A31356d392A83098Q4092d1537A43784
$$ -241901 181248 -100194 -275500 -105480 131356 -4392 183098 267190 -41537 143784
9015A20959g4423l0126C8452h8018B365b08961k87077B8104b08068k84338g3989
$$ 120959 -74423 -104549 38452 -88018 2365 -208961 -496038 28104 -208068 -492406 -73989
9003a75876d9055j10332A6387J58134a44834D4562a97230e1494a6379k00992a3536
$$ -175876 -49055 -159387 16387 174521 -144834 44562 -197230 -51494 -16379 -217371 -13536
8991B03728j9449K35610j96841c19820a4916B8732h6614B5632J38277b72560a16603
$$ 203728 184279 419889 223048 -319820 -14916 28732 -86614 25632 163909 -272560 -116603
8979b40363q1859b7490B22188c1507o4927A00810d5877C28147A12231i6785m7801
$$ -240363 -322222 -27490 222188 -31507 -96434 100810 -45877 328147 112231 -96785 -144586
8968a44586k39369D0591f3071j04679J2414C99675a89523d1166j61481r7529J21678
$$ -144586 -383955 40591 -63071 -167750 -155336 399675 -189523 -41166 -202647 -300176 -178498
8957a78498d2355H2017a80777B4955b38570J13500F5719d32531a10260b5885F0903
$$ -178498 -42355 82017 -180777 24955 -238570 -125070 65719 -432531 -110260 -25885 60903
8945A70365d5254k01426J08136h629A19703c81837B58073r7625N4887c8996B92130
$$ 170365 -45254 -246680 -138544 -8629 119703 -381837 258073 160448 215335 -38996 292130
8933A20907a69671G9653a6335j57446K4634k23839B63250i3563g329p6256j26290
$$ 120907 -169671 79653 -16335 -173781 -149147 -372986 263250 -93563 -7329 -83585 -209875
8922b09875B0498J5590Q37507B50470p095a9639j25041B7531b12860B37096b21103
$$ -209875 20498 36088 873595 250470 243375 -19639 -144680 27531 -212860 237096 -221103
8910C05349i2870B73945a3939A06140a91293a8369G5343k5500a67023j9855B77775
$$ 305349 -92870 273945 -13939 106140 -191293 -18369 75343 49843 -167023 -186878 277775
8898B61449b06187b1266A69167p3838b09367N9056j2443B39275A0977c3961k10665
$$ 261449 -206187 -21266 169167 95329 -209367 -150311 -162754 239275 10977 -33961 -244626
8887b44626K9612h5360k5734m7447A01106a44183f9606B24484a03421j98943H5489
$$ -244626 -215014 -85360 -111094 -158541 101106 -144183 -69606 224484 -103421 -302364 85489
8875b58177D5883a25197k04693a29472A92206g015A78159c665A21615a53769a2117
$$ -258177 45883 -125197 -329890 -129472 192206 -7015 178159 -3665 121615 -153769 -12117
8863a14622n5446J8110J2868j46046A4353a1916F3206a57417G2211a20925e8204
$$ -114622 -170068 -151958 -139090 -285136 14353 -11916 63206 -157417 72211 -120925 -58204
8851b9451P604B33363I2765k2332b19186Q423R2211o4773d8565j35331j80800
$$ -29451 -21847 233363 92765 70433 -219186 -210763 -118552 -183325 -48565 -183896 -364696
$$ [...]
##END NTUPLES=NMR SPECTRUM
##END=
