##TITLE=NES1059_10428_9268947_raccN2AwQT
##JCAMPDX= 6.0         $$ Bruker NMR JCAMP-DX V2.0
##DATA TYPE= NMR SPECTRUM
##DATA CLASS= NTUPLES
##ORIGIN= BRUKER
##OWNER= Administrator
$$ 1.72 TOPSPIN		Version 2.1
$$ 2015-07-11 00:06:23.722 -0700  Administrator@X
$$ Compression mode = diff/dup
##.OBSERVE FREQUENCY= 400.02188249412
##.OBSERVE NUCLEUS= ^1H
##.ACQUISITION MODE= SIMULTANEOUS (DQD)
##.ACQUISITION SCHEME= undefined
##.AVERAGES= 64
##.DIGITISER RES= 22
##SPECTROMETER/DATA SYSTEM= spect
##.PULSE SEQUENCE= noesygpps1d.comp
##.SOLVENT NAME= COFFEE_meoh
##.SHIFT REFERENCE= INTERNAL, COFFEE_meoh, 1, 14.96175
##AUDIT TRAIL= $$ (NUMBER, WHEN, WHO, WHERE, PROCESS, VERSION, WHAT)
$$ ##TITLE= Audit trail, TOPSPIN		Version 2.1
$$ ##JCAMPDX= 5.01
$$ ##ORIGIN= Bruker BioSpin GmbH
$$ ##OWNER= Administrator
$$ $$ E:\/data/COFFEE/nmr/NES1059_10428_9268947_raccN2AwQT/12/pdata/1/auditp.txt
$$ ##AUDIT TRAIL=  $$ (NUMBER, WHEN, WHO, WHERE, PROCESS, VERSION, WHAT)
(   1,<2015-07-11 00:06:18.144 -0700>,<Administrator>,<X>,<go>,<TOPSPIN 2.1>,
      <created by zg
	started at 2015-07-10 23:54:48.613 -0700,
	POWCHK enabled, PULCHK disabled,
       configuration hash MD5:
       21 0F 79 D6 B3 7B B4 F6 88 20 88 DB 03 48 BD 9F
       data hash MD5: 64K
       11 FE 65 EB BA 63 23 A7 73 2D DC F9 B8 54 1A 67>)
(   2,<2015-07-11 00:06:21.597 -0700>,<Administrator>,<X>,<proc1d>,<TOPSPIN 2.1>,
      <Start of raw data processing
       efp LB = 0.3 FT_mod = 6 PKNL = 1 PHC0 = 0 PHC1 = 0 SI = 128K 
       data hash MD5: 128K
       5A 14 92 22 5F 8F 7A 37 A3 C2 4A 22 42 4E 47 27>)
(   3,<2015-07-11 00:06:22.503 -0700>,<Administrator>,<X>,<proc1d>,<TOPSPIN 2.1>,
      <pk PHC0 = -85.47363 PHC1 = 0 
       data hash MD5: 128K
       29 7A C1 D6 8E 8B 79 62 FA 29 98 B6 5E B8 F3 FF>)
(   4,<2015-07-11 00:06:22.910 -0700>,<Administrator>,<X>,<proc1d>,<TOPSPIN 2.1>,
      <abs ABSG = 1 
       data hash MD5: 128K
       3C 23 A0 D7 0D 8F 0C 61 69 87 64 EC 9E 3C 09 06>)
(   5,<2015-07-11 00:06:22.988 -0700>,<Administrator>,<X>,<proc1d>,<TOPSPIN 2.1>,
      <abs ABSG = 2 
       data hash MD5: 128K
       1F 82 5D 43 99 9F 59 E8 E2 3A 2E 95 AF 8B 80 01>)
(   6,<2015-07-11 00:06:23.081 -0700>,<Administrator>,<X>,<proc1d>,<TOPSPIN 2.1>,
      <abs ABSG = 3 
       data hash MD5: 128K
       BF FE D0 76 3E 07 2C 69 74 C7 90 AC BF D2 BF 28>)
(   7,<2015-07-11 00:06:23.175 -0700>,<Administrator>,<X>,<proc1d>,<TOPSPIN 2.1>,
      <abs ABSG = 4 
       data hash MD5: 128K
       C9 A6 A5 FA A2 C5 01 37 F6 66 8B 15 41 C8 AC 83>)
(   8,<2015-07-11 00:06:23.269 -0700>,<Administrator>,<X>,<proc1d>,<TOPSPIN 2.1>,
      <abs ABSG = 5 
       data hash MD5: 128K
       91 30 EF 46 38 87 C2 F7 E3 86 CE 80 C0 0E 30 D9>)
$$ ##END=
$$ 
$$ $$ hash MD5
$$ $$ 23 69 36 A0 35 F5 35 88 3B CD F0 DD 32 CB B7 1A
##$RELAX= 
##$RELAX= 
##$RELAX= 
##$RELAX= 
##$RELAX= 
##$RELAX= 
##$RELAX= 
##$RELAX= 
$$ Bruker specific parameters
$$ --------------------------
##$DU= <E:\>
##$EXPNO= 12
$$ [...]
##$TP07= 0
##$TPNAME0= <>
##$TPNAME1= <>
##$TPNAME2= <>
##$TPNAME3= <>
##$TPNAME4= <>
##$TPNAME5= <>
##$TPNAME6= <>
##$TPNAME7= <>
##$TPOAL= (0..7)
0.5 0.5 0.5 0.5 0.5 0.5 0.5 0.5
##$TPOFFS= (0..7)
0 0 0 0 0 0 0 0
##$TUNHIN= 0
##$TUNHOUT= 0
##$TUNXOUT= 0
##$USERA1= <user>
##$USERA2= <user>
##$USERA3= <user>
##$USERA4= <user>
##$USERA5= <user>
##$V9= 5
##$VALIST= <valist>
##$VCLIST= <CCCCCCCCCCCCCCC>
##$VD= 0
##$VDLIST= <DDDDDDDDDDDDDDD>
##$VPLIST= <PPPPPPPPPPPPPPP>
##$VTLIST= <TTTTTTTTTTTTTTT>
##$WBST= 2048
##$WBSW= 25
##$XGAIN= (0..3)
0 0 0 0
##$XL= 0
##$YL= 0
##$YMAX_a= 6798798
##$YMIN_a= -12484483
##$ZGOPTNS= <>
##$ZL1= 120
##$ZL2= 120
##$ZL3= 120
##$ZL4= 120
##$ABSF1= 14.96175
##$ABSF2= -5.596432
##$ABSG= 5
##$ABSL= 3
##$ALPHA= 0
##$AQORDER= 0
##$ASSFAC= 0
##$ASSFACI= 0
##$ASSFACX= 0
##$ASSWID= 0
##$AUNMP= <proc_prof1d_extract.lims>
##$AXLEFT= 0
##$AXNAME= <>
##$AXNUC= <1H>
##$AXRIGHT= 0
##$AXTYPE= 0
##$AXUNIT= <>
##$AZFE= 0.1
##$AZFW= 0.1
##$BCFW= 0
##$BC_mod= 0
##$BYTORDP= 0
##$COROFFS= 0
##$CY= 15
##$DATMOD= 1
##$DC= 0
##$DFILT= <>
##$DTYPP= 0
##$F1P= 0
##$F2P= 0
##$FCOR= 0.5
##$FTSIZE= 131072
##$FT_mod= 6
##$GAMMA= 0
##$GB= 0
##$INTBC= 1
##$INTSCL= 1
##$ISEN= 128
##$LB= 0.3
##$LEV0= 0
##$LPBIN= 0
##$MAXI= 10000
##$MC2= 0
##$MEAN= 0
##$ME_mod= 0
##$MI= 0
##$NCOEF= 0
##$NC_proc= -2
##$NLEV= 6
##$NOISF1= 0
##$NOISF2= 0
##$NSP= 0
##$NTH_PI= 0
##$NZP= 0
##$OFFSET= 14.96175
##$PC= 1
##$PHC0= -85.47363
##$PHC1= 0
##$PH_mod= 1
##$PKNL= yes
##$PPARMOD= 0
##$PPDIAG= 0
##$PPIPTYP= 0
##$PPMPNUM= 2147483647
##$PPRESOL= 1
##$PSCAL= 4
##$PSIGN= 0
##$PYNMP= <proc.py>
##$REVERSE= no
##$SF= 400.020009334789
##$SI= 131072
##$SIGF1= 0
##$SIGF2= 0
##$SINO= 400
##$SIOLD= 131072
##$SPECTYP= <>
##$SREGLST= <1H.CDCl3>
##$SSB= 0
##$STSI= 131072
##$STSR= 0
##$SW_p= 8223.68421052631
##$SYMM= 0
##$S_DEV= 0
##$TDeff= 65536
##$TDoff= 0
##$TI= <>
##$TILT= no
##$TM1= 0
##$TM2= 0
##$TOPLEV= 0
##$USERP1= <user>
##$USERP2= <user>
##$USERP3= <user>
##$USERP4= <user>
##$USERP5= <user>
##$WDW= 1
##$XDIM= 131072
##$YMAX_p= 402910128
##$YMIN_p= -13234
##$CURPLOT= <Network HP LaserJet P1505>
##$CURPRIN= <$Network HP LaserJet P1505>
##$DFORMAT= <normdp>
##$LAYOUT= <+/1D_H.xwp>
##$LFORMAT= <normlp>
##$PFORMAT= <normpl>
##$SURQMSG= 1
$$ End of Bruker specific parameters
$$ ---------------------------------
##NTUPLES= NMR SPECTRUM
##VAR_NAME=  FREQUENCY,     SPECTRUM/REAL,   SPECTRUM/IMAG
##SYMBOL=    X,             R,               I
##VAR_TYPE=  INDEPENDENT,   DEPENDENT,       DEPENDENT
##VAR_FORM=  AFFN,          ASDF,            ASDF
##VAR_DIM=   131072,        131072,          131072
##UNITS=     HZ,            ARBITRARY UNITS, ARBITRARY UNITS
##FACTOR=    0.0627417313425164, 1,          1
##FIRST=     8223.62146879497, -138,         -50284
##LAST=      0,             2447,            -50758
##MIN=       0,             -13234,          0
##MAX=       8223.62146879497, 402910128,    0
$$ Real data points
##PAGE= N=1
##DATA TABLE= (X++(R..R)), XYDATA
$$ [...]
63474C74581q89k727m417o388q622j0529j1405j1097j0102r102q460q140p841
63461B74862p220o230n183m318l498k567j778j420j127k64J067K019K194K160
63447B48697K507L017L223L278L658M444N349O327P533Q878J0077J1143J2409
63434C30540J4071J6065J8283K0565K2502K3779K4827K6687K9880L3568L6132
63423E96899L6491L4704L1322K6546K0229J2607M682k247p313j0288j1390j1154
63411G21088j0322r490q831q360q479r829j2540j5933j9104k1597k3366k4378
63399E48859k4580k4027k2848k1150j9148j7306j6028j5144j3969j1984r435p050
63387C46190n251l780k210n90P03J622K590L892N290O452P468Q647J0004J1305
$$ plain form
63474 374581 373692 370965 366548 360160 351538 341009 329604 318507 308405 299303 290843 282703 274862
63461 274862 267642 261412 256229 251911 248413 245846 244068 242648 241521 241257 242324 244343 246537 248697
63447 248697 251204 254221 257444 260722 264380 268824 274173 280500 288033 296911 306988 318131 330540
63434 330540 344611 360676 378959 399524 422026 445805 470632 497319 527199 560767 596899
63423 596899 633390 668094 699416 725962 746191 758798 763480 761233 753920 743632 732242 721088
63411 721088 710766 701276 692445 684085 675606 665777 653237 637304 618200 596603 573237 548859
63399 548859 524279 500252 477404 456254 437106 419800 403772 388628 374659 362675 353240 346190
63387 346190 340939 337159 334949 334359 335062 336684 339274 343166 348456 354908 362376 371023 381027 392332
63373C92332J2512J3795J5245J6846J8694K0950K3537K6114K8276K9670K9986
63362F27957K9060K6913K3551J8954J3402P576K112k680o428q576r040q627q156
63349G06018p532o361n202n355p361j0431j3517j6260j8772k1042k2840k3874
63337E47471k3911k3010k1574j9955j8178j6396j5121j4435j3486j1659r847r393
63325C50506j0014j0123r168q224p992p697o672n644n429n428m522k838j588j576
63311B63591k616l946m567l804k168j109j215j388n81M84N04k11j21J163K247
63296B46263J832J52j626k597k495j647q35o52q93j047j173j687k383k568k164
63281B26480j853j933j850j180l73m1j02r0M3mk87n20n05l66l28m49n70m50l6
$$ plain form
63373 392332 404844 418639 433884 450730 469424 490374 513911 540025 568301 597971 627957
63362 627957 657017 683930 707481 726435 739837 747413 749525 746845 740417 731841 722801 714174 706018
63349 706018 698486 692125 686923 681568 674207 663776 650259 633999 615227 594185 571345 547471
63337 547471 523560 500550 478976 459021 440843 424447 409326 394891 381405 369746 359899 350506
63325 350506 340492 330369 321201 312977 304985 297288 290616 284972 279543 274115 269593 266755 265167 263591
63311 263591 260975 257029 252462 248658 246490 245381 244166 242778 242197 242681 243185 242974 242853 244016 246263
63296 246263 248095 248247 246621 244024 241529 239882 239047 238395 237502 236455 235282 233595 231212 228644 226480
63281 226480 224627 222694 220844 219664 219291 219250 219148 219058 219101 219097 218810 218290 217785 217419 217091 216642 216072 215622 215586
63262B15586M88R49J359J767J951J637R75N95J039K195L332L767L504L177L301
63247B45622L692L857L747L774M172M845N752O883P796P931P562P725Q888J0362
63233C32608J1386J2008J2468J2524J2106J1835J2135J2417J1990J1227J0897
63222D63601J0945J0905J1096J2155J3679J4504J4231J3398J2232J0352P807N202
63210F00107K640m60m138p512r955j1871j3840j5765j7247j8077j8078j7134j5616
63197D53054j4135j2591j0233p009m004k044o92Q34K439L626M574N887P504Q718
63183D35928R242R635J0532J1872J2970J3211J2605J1781J1360J1383J1379J0994
63171E72892J0332R617Q903Q061O914N338L455J600j82k445n667r468j2947j5701
$$ plain form
63262 215586 216074 217023 218382 220149 222100 223737 224712 225307 226346 228541 231873 235640 239144 242321 245622
63247 245622 249314 253171 256918 260692 264864 269709 275461 282344 290140 298071 305633 313358 322246 332608
63233 332608 343994 356002 368470 380994 393100 404935 417070 429487 441477 452704 463601
63222 463601 474546 485451 496547 508702 522381 536885 551116 564514 576746 587098 594905 600107
63210 600107 602747 602287 598149 590637 580682 568811 554971 539206 521959 503882 485804 468670 453054
63197 453054 438919 426328 416095 409086 405082 403038 402346 403180 405619 409245 413819 419706 427210 435928
63183 435928 445170 454805 465337 477209 490179 503390 515995 527776 539136 550519 561898 572892
63171 572892 583224 592841 601744 609805 616719 622057 625512 627112 626930 624485 618818 609350 596403 580702
63157E80702j7864j9321j9650j8978j8080j7411j6627j5409j4063j2999j2126
63146C98174j1135r976q723p396o209n557n456n349m751l776k848k265k156k447
63132C20130k679k327j496q38p24q87j000j000p45j7Q79J173N78l83j147j588
63116C07929j544p03O59J599J656J371J274J124P22N84J069J585J500J193J332
63101C21350J674J588J313J603K347K623K131J645J852K557L185L464L429L203
63087C53964L033L130L398L497L192K521J776J473J983K935L404K988K337K162
63073C91793K300K280K353L152M634O073O954P248P112O963P525R058J0758J1729
63059D79932J2390J3872J6176J7959J8381J8225J8772K0287K2016K3197K3643
$$ plain form
63157 580702 562838 543517 523867 504889 486809 469398 452771 437362 423299 410300 398174
63146 398174 387039 377063 368340 360944 354735 349178 343722 338373 333622 329846 326998 324733 322577 320130
63132 320130 317451 315124 313628 312790 312066 311179 310179 309179 308434 308417 309296 310469 311047 310664 309517 307929
63116 307929 306385 305682 306341 307940 309596 310967 312241 313365 314087 314671 315740 317325 318825 320018 321350
63101 321350 323024 324612 325925 327528 329875 332498 334629 336274 338126 340683 343868 347332 350761 353964
63087 353964 356997 360127 363525 367022 370214 372735 374511 375984 377967 380902 384306 387294 389631 391793
63073 391793 394093 396373 398726 401878 406512 412585 419539 426787 433899 440862 448387 457445 468203 479932
63059 479932 492322 506194 522370 540329 558710 576935 595707 615994 638010 661207 684850
63048F84850K3751K4121K4920K5554K5349K4553K4034K4127K4387K4575K5111
63037I55332K6204K7280K7670K7354K6594K5270K3090K0108J6548J2342P240J275
63025A196307n192j1729j7915k3354k7822l1383l4142l6054l6984l6796l5295
63014H99641l2331k8154k3518j9266j5805j2954j0195p099l671k57K903N839Q488
63001G63621J0589J2255J4210J6867J9444K0713K0520J9829J9317J8774J8021
62990I54160J7538J7707J8142J8170J7484J5923J3241R517N335J015l829r441
62978A074962j5166k0203k4670k9152l3471l6739l8635l9816m0842m1358m0619
62967G14291l8506l5692l3031l0906k9046k6917k4410k2023k0210j8700j6933
$$ plain form
63048 684850 708601 732722 757642 783196 808545 833098 857132 881259 905646 930221 955332
63037 955332 981536 1008816 1036486 1063840 1090434 1115704 1138794 1158902 1175450 1187792 1195032 1196307
63025 1196307 1191115 1179386 1161471 1138117 1110295 1078912 1044770 1008716 971732 934936 899641
63014 899641 867310 839156 815638 796372 780567 767613 757418 750319 746648 746391 749294 755133 763621
63001 763621 774210 786465 800675 817542 836986 857699 878219 898048 917365 936139 954160
62990 954160 971698 989405 1007547 1025717 1043201 1059124 1072365 1081882 1087217 1088232 1084403 1074962
62978 1074962 1059796 1039593 1014923 985771 952300 915561 876926 837110 796268 754910 714291
62967 714291 675785 640093 607062 576156 547110 520193 495783 473760 453550 434850 417917
62956D17917j4996j3633j3167j2964j2256j1113j0168r638r103q160o962n930
62944B89827n264m859m533m179l763l366l148l159l188k910k274j672j573j973
62930B43966k321k085j394r12j003j209q93k52j93j010j740j408n00l44j128j546
62914B26028p16N29R64P36Q34J246R89j00q58m74L63O06L11J87L43M21N29J142
62896B33080K028K236J336M1o56m86J64Q52J281J219O63j08p88j285j490j197
62880B36890m98J0j79q09j179j026o66l50k6J72j47r64j532j264n48k47n20p78
62862B26339o85o34j060j731k022j623q46l05l81q09q61k01N43M89l23r76r49
62845B13965o69n87m62LL98K35j31P9Q62J428J315Q75O50P84J173J674K037K052
$$ plain form
62956 417917 402921 389288 376121 363157 350901 339788 329620 319982 310879 302719 295757 289827
62944 289827 284563 279704 275171 270992 267229 263863 260715 257556 254368 251458 249184 247512 245939 243966
62930 243966 241645 239560 238166 237254 236251 235042 234149 233897 233704 232694 230954 229546 229046 228702 227574 226028
62914 226028 225312 225841 226805 227541 228375 229621 230610 230510 229652 229178 229541 230147 230458 230645 230988 231409 231938 233080
62896 233080 235108 237344 238680 238721 238065 237579 237743 238595 239876 241095 241758 241650 240862 239577 238087 236890
62880 236890 236392 236402 236223 235414 234235 233209 232543 232193 232167 232339 232192 231228 229696 228432 227884 227637 227117 226339
62862 226339 225654 225020 223960 222229 220207 218584 217738 217433 217052 216243 215382 215181 215724 216213 215890 214914 213965
62845 213965 213296 212709 212247 212250 212648 212883 212752 212831 213693 215121 216436 217311 217961 218745 219918 221592 223629 225681
62827B25681J837J651J461J072P22R57J783K454K314J539Q20O37J007J633K084
62812B47652K105J850J645J515J331J337J991L141L958M027L927M359N136N559
62798B89533N472N380N750O758Q523J0967J3461J5151J5820J6077J6685J7993
62786D27570K0018K2593K5295K7666K9780L2285L5561L9162M2343M4918M7166
62775G94357M9016M9846M9190M7180M4074L9692L3702K6313J8269J0169K129n899
62763A158038j3796k1322k8173l3848l7906m0519m2470m4269m5513m5448m4001
62752G60773m1820l9565l7542l5906l4609l3106l0660k7200k3584k0787j9034
62741D16960j7829j6560j4933j3092j1462j0365r695r098q407p615o578n170l738
$$ plain form
62827 225681 227518 229169 230630 231702 232424 233381 235164 237618 239932 241471 242291 242928 243935 245568 247652
62812 247652 249757 251607 253252 254767 256098 257435 259426 262567 266525 270552 274479 278838 283974 289533
62798 289533 295005 300385 306135 312893 321416 332383 345844 360995 376815 392892 409577 427570
62786 427570 447588 470181 495476 523142 552922 585207 620768 659930 702273 747191 794357
62775 794357 843373 893219 942409 989589 1033663 1073355 1107057 1133370 1151639 1161808 1163937 1158038
62763 1158038 1144242 1122920 1094747 1060899 1022993 982474 940004 895735 850222 804774 760773
62752 760773 718953 679388 641846 605940 571331 538225 507565 480365 456781 435994 416960
62741 416960 399131 382571 367638 354546 343084 332719 323024 313926 305519 297904 291326 286156 282418
62728B82418k862k534k080j090J06J153K185L227L658L055K145K078K985M046
62714B98490M925O155P955R587J0412J0951J2171J4173J6244J7995J9823K2179
62702D51060K4997K7906L0690L3322L5818L8273M0795M3272M5331M6558M6627
62691H64649M5233M2139L7450L1589K4863J7278Q941M24p636j5065k1905k7881
62679A000079l2575l6109l9057m1509m2802m2514m1284m0100l9082l7546l5130
62668E72371l2286k9639k7338k5273k3447k1816k0044j7842j5504j3761j3009
62657C32412j2841j2444j1382r873q351p015n905n203n118n476n697n316m361
62644B33430l184k070j216q23j044j854l029m137m569l907k478j244q98j181j296
$$ plain form
62728 282418 279556 277022 274942 273852 273958 275111 277296 280523 284181 287236 289381 291459 294444 298490
62714 298490 303415 309570 317525 327112 337524 348475 360646 374819 391063 409058 428881 451060
62702 451060 476057 503963 534653 567975 603793 642066 682861 726133 771464 818022 864649
62691 864649 909882 952021 989471 1021060 1045923 1063201 1072142 1072566 1064930 1049865 1027960 1000079
62679 1000079 967504 931395 892338 850829 808027 765513 724229 684129 645047 607501 572371
62668 572371 540085 510446 483108 457835 434388 412572 392528 374686 359182 345421 332412
62657 332412 319571 307127 295745 285872 277521 270506 264601 259398 254280 248804 243107 237791 233430
62644 233430 230246 228176 226960 226137 225093 223239 220210 216073 211504 207597 205119 203875 202977 201796 200500
62629B00500p78J77R85J024O8j326k069j581l86O08J174J709K384K916L110L067
62613B11582K882K567K347K538L151L880M553N228N879O469P238Q506J0099J1453
62599B88372J2407J3492J5231J7538J9896K1854K3239K4185K4971K5587K5479
62588E12251K4120K1734J9013J6150J2645Q231L430r85m797q326j1897j5411j8289
62575E57869j9961k0601k1131k2057k2642k1885k0107j8595j7793j6845j5123
62564C41129j3149j1632j0533r626r068q775q019o437m816m055l935l699l287
62551B44098l147l237l181l159l629m266m115k989j882j733k374k946k909k372
62537B02159j710j114m14O37J879K745K977L036L465M174M741N214N981P011P824
$$ plain form
62629 200500 199722 199899 200884 201908 201976 200650 198581 197000 196614 197222 198396 200105 202489 205405 208515 211582
62613 211582 214464 217031 219378 221916 225067 228947 233500 238728 244607 251076 258314 266820 276919 288372
62599 288372 300779 314271 329502 347040 366936 388790 412029 436214 461185 486772 512251
62588 512251 536371 558105 577118 593268 605913 614144 617574 616589 611792 603466 591569 576158 557869
62575 557869 537908 517307 496176 474119 451477 429592 409485 390890 373097 356252 341129
62564 341129 327980 316348 305815 296189 287121 278346 270327 263890 259074 255019 251084 247385 244098
62551 244098 240951 237714 234533 231374 227745 223479 219364 216375 214493 212760 210386 207440 204531 202159
62537 202159 200449 199335 198921 199558 201437 204182 207159 210195 213660 217834 222575 227789 233770 240781 248605
62522B48605Q294Q934J0217J2006J3833J5441J6892J8340J9833K1268K2494K3391
62510D39548K3826K3606K2723K1558K0440J8902J5949J1328O021J116l210p235
62498E94572j0788j3605j6007j8405k0356k1002k0384j9510j9090j8928j8563
62487C97934j7781j6431j4505j2575j1423j0939j0058q156n988m778m768n151
62475B75381n167m778m339l954l389k553j880j963k781l606l877l788l693l320
62461B26293k239p98R4J31j32j72J7L88J061J887K387K448K509K773K837K420
62445B41904J948J882J964J651J054P97R98R92J54j288k513k976k875k737k743
62430B38212k630k241j811j547j273q87q39j558k546k735j861q29m58m83j87M91
$$ plain form
62522 248605 256899 265833 276050 288056 301889 317330 334222 352562 372395 393663 416157 439548
62510 439548 463374 486980 509703 531261 551701 570603 586552 597880 603901 605017 601807 594572
62498 594572 583784 570179 554172 535767 515411 494409 474025 454515 435425 416497 397934
62487 397934 380153 363722 349217 336642 325219 314280 304222 296066 290078 285300 280532 275381
62475 275381 270214 265436 261097 257143 253754 251201 249321 247358 244577 240971 237094 233306 229613 226293
62461 226293 224054 223256 223350 223481 223349 223177 223194 223582 224643 226530 228917 231365 233874 236647 239484 241904
62445 241904 243852 245734 247698 249349 250403 251200 252198 253190 253344 252056 249543 246567 243692 240955 238212
62430 238212 235582 233341 231530 229983 228710 227823 226984 225426 222880 220145 218284 217455 216997 216514 216327 216818
62414B16818J044J250J416J799K253K517K524K363K093J789J715K261L562N122
62400B48526O083O050N508N187N259N433N685O308P266P994Q013P381O451N483
62386C36627M660M065L539K856K178J922K098K180J895J728K339L709N195O290
62372C81281P063P982R497J1677J4206J6712J9230K2161K5791K9994L4367L8436
62360F18397M1826M4494M6746M8642M9345M7532M2640L5445K7385J9632J2868
62349A034952P387L009q01m504q222j2005j6032k0440k5003k9150l2130l3473
62337H63588l3535l3351l3477l3176l1411k8468k5749k3965k2554k1051j9916
62326E56935j9452j8883j7402j5419j3885j2923j1943j0766r660q602p349o116
$$ plain form
62414 216818 217862 219112 220528 222327 224580 227097 229621 231984 234077 235866 237581 239842 243404 248526
62400 248526 254609 260659 266167 271354 276613 282046 287731 294039 301305 309299 317312 324693 331144 336627
62386 336627 341287 345352 348891 351747 353925 355847 357945 360125 362020 363748 366087 369796 374991 381281
62372 381281 388344 396326 405823 417500 431706 448418 467648 489809 515600 545594 579961 618397
62360 618397 660223 704717 751463 800105 849450 896982 939622 975067 1002452 1022084 1034952
62349 1034952 1042339 1045348 1044547 1040043 1031821 1019816 1003784 983344 958341 929191 897061 863588
62337 863588 830053 796702 763225 730049 698638 670170 644421 620456 597902 576851 556935
62326 556935 537483 518600 501198 485779 471894 458971 447028 436262 426602 418000 410651 404535
62314D04535n391n080m606l756k839k003j161m92l04l65MR92K111K911L363L400
62298C91319K881K195K105K627K786J934Q17O11J341J897J507N27k81o15n61k8
62282D11062J179K763L768L445K224J548K503M796P282R166J0409J1193J1666
62269D83004J2249J3594J5976J9060K2460K6108K9942L3702L7383M1447M6070
62258G80995N0494N3605N4838N4030N0717M4474L5938K6686J7844R433J377n661
62246A174770j1072j5346j9555k4091k8519l2470l5823l8142l8850l8139l6931
62235H55832l5573l3416l0080k6399k3412k1038j8505j5705j3146j0885q526o259
62223F12888m930m794m968m541l593k662j764n36J004K374L259L799M278M805
$$ plain form
62314 404535 399144 394064 389458 385702 382863 380860 379699 379207 378903 378538 378542 379534 381645 384556 387919 391319
62298 391319 394200 396395 398500 401127 403913 405847 406664 407275 408616 410513 412020 412547 412266 411651 411090 411062
62282 411062 412241 415004 418772 422217 424441 425989 428492 433288 440570 449736 460145 471338 483004
62269 483004 495253 508847 524823 543883 566343 592451 622393 656095 693478 734925 780995
62258 780995 831489 885094 939932 993962 1044679 1089153 1125091 1151777 1169621 1179054 1180431 1174770
62246 1174770 1163698 1148352 1128797 1104706 1076187 1043717 1007894 969752 930902 892763 855832
62235 855832 820259 786843 756763 730364 706952 685914 667409 651704 638558 627673 619147 612888
62223 612888 607958 603164 598196 593655 590062 587400 585636 585100 586104 588478 591737 595536 599814 604619
62209F04619N299N643N870O254P079Q302R558J0496J0980J1035J0899J1119J2157
62196G19310J3849J5545J6915J8184J9598K1154K3017K5549K8568L1044L2067
62185I64800L1763L0737K8933K5657K0654J4601Q588L496n6j670j377L73L095
62172A129594O667J1217J6676K2496K7899L2372L5736L7655L7431L4686L0061
62161A422490K4741J9413J4213R569O173L891J514j870n836r480j2600j5386j7493
62148A439339j8369j8223j7816j7300j6124j4081j1737r579p424m987k627j001
62136A300071j47P91K722N508P862Q621Q117P868Q753J0057J0668J0723J1319
62123A392933J2937J4843J6143J6864J7807J9660K2151K3867K3209K0000J5970
$$ plain form
62209 604619 609918 615561 621431 627685 634764 643066 652624 663120 674100 685135 696034 707153 719310
62196 719310 733159 748704 765619 783803 803401 824555 847572 873121 901689 932733 964800
62185 964800 996563 1027300 1056233 1081890 1102544 1117145 1125733 1129229 1129173 1127503 1126126 1126499 1129594
62172 1129594 1136261 1147478 1164154 1186650 1214549 1246921 1282657 1320312 1357743 1392429 1422490
62161 1422490 1447231 1466644 1480857 1490426 1496599 1500490 1502004 1500134 1494298 1484818 1472218 1456832 1439339
62148 1439339 1420970 1402747 1384931 1367631 1351507 1337426 1325689 1316110 1308686 1303699 1301072 1300071
62136 1300071 1299924 1300715 1303437 1308945 1316807 1325428 1333545 1341413 1350166 1360223 1370891 1381614 1392933
62123 1392933 1405870 1420713 1436856 1453720 1471527 1491187 1513338 1537205 1560414 1580414 1596384
62112A596384J3187J2189J2138J2397J3076J4054J4439J3407J1054Q186N647L974
62100A730132L211K894K647K851M138O170P678Q081Q357R730J2038J3977J4818
62087A826722J5174J6174J8313K1205K4134K6656K8765L0566L1969L2831L3262
62076B105771L3466L3238L1998K9413K5830K2007J8677J6281J4758J3439J1576
62065B356454R094O512L952P13l837r231j4166j7669j9777k1183k2540k4102k5887
62052B218333k7927l0254l2547l4154l4766l4915l5350l6010l6119l5211l3482
62041A847598l1161k8291k5310k3041k1617k0143j8047j6131j5503j5830j5629
62030A616895j4201j2414j1402j1245j1246j1035j0942j1490j2804j4450j5759
$$ plain form
62112 1596384 1609571 1621760 1633898 1646295 1659371 1673425 1687864 1701271 1712325 1720511 1726158 1730132
62100 1730132 1733343 1736237 1738884 1741735 1745873 1752043 1759721 1767802 1776159 1785889 1797927 1811904 1826722
62087 1826722 1841896 1858070 1876383 1897588 1921722 1948378 1977143 2007709 2039678 2072509 2105771
62076 2105771 2139237 2172475 2204473 2233886 2259716 2281723 2300400 2316681 2331439 2344878 2356454
62065 2356454 2365548 2372060 2376012 2376725 2372888 2363657 2349491 2331822 2312045 2290862 2268322 2244220 2218333
62052 2218333 2190406 2160152 2127605 2093451 2058685 2023770 1988420 1952410 1916291 1881080 1847598
62041 1847598 1816437 1788146 1762836 1739795 1718178 1698035 1679988 1663857 1648354 1632524 1616895
62030 1616895 1602694 1590280 1578878 1567633 1556387 1545352 1534410 1522920 1510116 1495666 1479907
62019A479907j6313j6219j5785j5076j3955j2460j0879r408p960o338m450k302
62007A348762K5K426M827P202R348J0783J1034J0020Q019N324K182j042m025o886
61993A407999j0162j4198j8756k3257k7199l0186l1824l1958l0971k9595k8350
61982A131543k7225k5936k4332k2472k0457j8367j6371j4784j3831j3373j3026
61971I21369j2578j2132j1753j1144r965q370o960o067n378m506l659l356l519
61958H21982l336k257p64K28O29J321K998N291P268Q621R933J1923J4653J7544
61944H96034J9898K1438K2471K3637K5254K6915K7876K7938K7704K7821K8233
61933A175219K8440K8215K7729K6948K5513K3327K0913J8810J7012J5403J4453
$$ plain form
62019 1479907 1463594 1447375 1431590 1416514 1402559 1390099 1379220 1369812 1361852 1355514 1351064 1348762
62007 1348762 1348787 1351213 1356040 1363242 1372590 1383373 1394407 1404427 1412446 1417770 1419952 1418910 1414885 1407999
61993 1407999 1397837 1383639 1364883 1341626 1314427 1284241 1252417 1220459 1189488 1159893 1131543
61982 1131543 1104318 1078382 1054050 1031578 1011121 992754 976383 961599 947768 934395 921369
61971 921369 908791 896659 884906 873762 863797 855427 848467 842400 837022 832516 828857 825501 821982
61958 821982 818646 816389 815625 815853 816482 817803 820801 826092 833360 841981 851914 863837 878490 896034
61944 896034 915932 937370 959841 983478 1008732 1035647 1063523 1091461 1119165 1146986 1175219
61933 1175219 1203659 1231874 1259603 1286551 1312064 1335391 1356304 1375114 1392126 1407529 1421982
61922A421982J4798J6226J7837J9543K2591K8117L5632M3625N1318N9061O7224
61911A797954P5531Q3564R1206R8380J04991J11362J18223J25996J34560J43860
61901B885627J54122J65147J76072J86160J95184K02445K06070K03958J95015
61892D569800J78810J54672J22146Q2227L7345r745n6379r9707j37280j68123
61882D673766j92468k10258k20792k24126k21841k15877k07199j96119j83301
61873B801785j69718j55960j42217j28849j16487j05485r5603q6203p6745o7291
61863A657227n8519n0982m4302l7455k9976k2457j5635r464l502K206P235J1515
61851A405891J5398J8958K1667K2959K2891K1950K0291J7347J2436N834j001o592
$$ plain form
61922 1421982 1436780 1453006 1470843 1490386 1512977 1541094 1576726 1620351 1671669 1730730 1797954
61911 1797954 1873485 1957049 2048255 2146635 2251626 2362988 2481211 2607207 2741767 2885627
61901 2885627 3039749 3204896 3380968 3567128 3762312 3964757 4170827 4374785 4569800
61892 4569800 4748610 4903282 5025428 5107655 5145000 5135255 5078876 4979169 4841889 4673766
61882 4673766 4481298 4271040 4050248 3826122 3604281 3388404 3181205 2985086 2801785
61873 2801785 2632067 2476107 2333890 2205041 2088554 1983069 1887466 1801263 1724518 1657227
61863 1657227 1598708 1547726 1503424 1465969 1435993 1413536 1397901 1388437 1384935 1387141 1394376 1405891
61851 1405891 1421289 1440247 1461914 1484873 1507764 1529714 1550005 1567352 1579788 1585622 1584621 1578029
61839A578029j0712j4083j6900j8265j7296j4290j0293n949j244L737Q360J1886
61827A492980J4010J4809J4320J2286Q381K697l998j0583j6284k1002k5039k8576
61815A454001l1347l2752l2397l0679k8601k6766k4711k1666j7698j3583r679
61804A184122n712j665J990N240Q831J3117J7301K0459K2757K4977K7423L0074
61792A348914L3394L7939M3307M8456N3182N8320O4320P0548P6538Q3091R1356
61781B009365J01302J11966J23050J35462J50049J66520J83969K02203K21933
61772C405819K43808K67569K92231L16736L40173L61532L79434L92016L96922
61763F396240L91449L72998L39610K90468K26423J50423O7203j7959j00364j76005
$$ plain form
61839 1578029 1567317 1553234 1536334 1518069 1500773 1486483 1476190 1470241 1468997 1472734 1481094 1492980
61827 1492980 1506990 1521799 1536119 1548405 1556786 1559483 1555485 1544902 1528618 1507616 1482577 1454001
61815 1454001 1422654 1389902 1357505 1326826 1298225 1271459 1246748 1225082 1207384 1193801 1184122
61804 1184122 1178410 1176745 1178735 1183975 1192806 1205923 1223224 1243683 1266440 1291417 1318840 1348914
61792 1348914 1382308 1420247 1463554 1512010 1565192 1623512 1687832 1758380 1834918 1918009 2009365
61781 2009365 2110667 2222633 2345683 2481145 2631194 2797714 2981683 3183886 3405819
61772 3405819 3649627 3917196 4209427 4526163 4866336 5227868 5607302 5999318 6396240
61763 6396240 6787689 7160687 7500297 7790765 8017188 8167611 8234814 8216855 8116491 7940486
61753G940486k41280k93495l31763l57002l70895l75157l71580l61972l47686
61744D889656l29635l09109k87940k67536k48085k29172k10798j93411j77275
61735B636695j62345j48569j35819j23698j11865j00530r0214q1174p3356o6676
61725A542449o0951n5657n0299m4913l9822l5018l0398k6461k4161k3800k4604
61714A126365k5666k6789k8126k9452l0300l0576l0561l0273k9316k7434k4998
61703H12874k2722k1014j9701j8385j6946j5631j4661j3900j3045j2090j1352
61692F33427j0947j0490r601q602q202q504q720q195p279o739o652o490o152o131
61678E20723o494o601o184n934o379o845o392n304m714m982n352n204m715m219
$$ plain form
61753 7940486 7699206 7405711 7073948 6716946 6346051 5970894 5599314 5237342 4889656
61744 4889656 4560021 4250912 3962972 3695436 3447351 3218179 3007381 2813970 2636695
61735 2636695 2474350 2325781 2189962 2066264 1954399 1853869 1763655 1682481 1609125 1542449
61725 1542449 1481498 1425841 1375542 1330629 1290807 1255789 1225391 1198930 1174769 1150969 1126365
61714 1126365 1100699 1073910 1045784 1016332 986032 955456 924895 894622 865306 837872 812874
61703 812874 790152 769138 749437 731052 714106 698475 683814 669914 656869 644779 633427
61692 633427 622480 611990 602389 593787 585585 577081 568361 560166 552887 546148 539496 533006 526854 520723
61678 520723 514229 507628 501444 495510 489131 482286 475894 470590 465876 460894 455542 450338 445623 441404
61664D41404l704l183k837k606k250j955k200k793k834j965r20m77m72k30O02
61649D13580J947L488M635M919M598M263L677K024m12j991j837j144j384k239
61635D34124k413j744j143r31n65J15O52R24J395K352L796N833Q295J0229J0819
61620D71738J0630J0762J0907R594O473K971K83k049m920q134j0802j2429j2960
61607D72064j2507j1676j1381j1648j1232r276o695n110m827m804m292l569l045
61594C72002k558j779q03OM69O95R21J321J881K436K853L139L291L251L109L180
61578C93414L627M224M628M902N573P141R521J1933J3483J3977J4113J4680J5698
61565E16914J6632J7317J8218J9599K0961K1516K0982J9683J8023J6146J4018
$$ plain form
61664 441404 437700 434517 431680 429074 426824 424869 422669 419876 417042 415077 414157 413680 413208 412978 413580
61649 413580 415527 419015 423650 428569 433167 437430 441107 443131 442719 440728 438891 437747 436363 434124
61635 434124 431711 429967 428824 427893 427328 427443 428095 429019 430414 432766 436562 442395 450690 460919 471738
61620 471738 482368 493130 504037 513631 520104 523075 523358 521309 516389 508255 497453 485024 472064
61607 472064 459557 447881 436500 424852 413620 404344 397649 392539 387712 382908 378616 375047 372002
61594 372002 369444 367665 366862 366868 367337 368032 368953 370274 372155 374591 377444 380583 383874 387125 390234 393414
61578 393414 397041 401265 405893 410795 416368 423509 433030 444963 458446 472423 486536 501216 516914
61565 516914 533546 550863 569081 588680 609641 631157 652139 671822 689845 705991 720009
61554G20009J1721R576P915O696N611M721M650N672O966P410O978O606O666O434
61540H17631N392M145L499L229K438P79j332l436n398p148q602r800j0722j0963
61526G79712j0040q071n801l884k388r76O16K434M365O359Q562J1194J4186J7110
61512H13378J9689K2297K5604K9756L4115L8063M1829M6246N1760N7954O4235
61501A244926P0637P7564Q4853R1672R7469J02499J06982J10152J10685J07763
61491B205202J01195R0757P6280N8509L9163J9806J141j6356l1725m3934n2692
61480B447346n8336o1145o1237n9088n5632n1654m7262m2139l6285l0377k5328
61469A918863k1599j9120j7794j7658j8344j8901j8669j8006j7613j7260j5913
$$ plain form
61554 720009 731730 741306 749221 755917 761528 766249 770899 776571 783537 790947 797925 804531 811197 817631
61540 817631 823023 827168 830667 833896 836334 837113 835781 832345 826947 819799 811197 801397 790675 779712
61526 779712 769672 761601 755800 751916 749528 748552 749168 751602 755967 762326 770888 782082 796268 813378
61512 813378 833067 855364 880968 910724 944839 982902 1024731 1070977 1122737 1180691 1244926
61501 1244926 1315563 1393127 1477980 1569652 1667121 1769620 1876602 1986754 2097439 2205202
61491 2205202 2306397 2397154 2473434 2531943 2571106 2590912 2592053 2575697 2543972 2500038 2447346
61480 2447346 2389010 2327865 2266628 2207540 2151908 2100254 2052992 2010853 1974568 1944191 1918863
61469 1918863 1897264 1878144 1860350 1842692 1824348 1805447 1786778 1768772 1751159 1733899 1717986
61458A717986j3069r329n493j775J911N496Q952J2467J6031J9246K1885K4325
61446A798633K7089L0321L3845L7411M0502M2382M2627M1310L8437L3658K7075
61435B193290J9858J3413Q106L399r09m216n969o393o132n522m528l210j921r22
61421B198344j0J237K685L284J766k288q162j4687k0933k6262l0205l2508l3141
61408B039120l2271l0324k7983k5798k3825k2087k1091k1313k2159k2307k1250
61397A768712j9770j8555j7210j5116j2513r932p124l457R79N514J0033J5090
61385A696651K0883K6905L2823L9089M6308N4400O2642P0480P8081Q6020R4283
61374B308565J01650J06423J07972J07124J04679J00050R1944Q0086O5535M9488
$$ plain form
61458 1717986 1704917 1695588 1690095 1688320 1690231 1695727 1704679 1717146 1733177 1752423 1774308 1798633
61446 1798633 1825722 1856043 1889888 1927299 1967801 2010183 2052810 2094120 2132557 2166215 2193290
61435 2193290 2213148 2226561 2234667 2238066 2237157 2232941 2226972 2220579 2214447 2208925 2204397 2201187 2199266 2198344
61421 2198344 2198334 2199571 2202256 2205540 2207306 2205018 2196856 2182169 2161236 2134974 2104769 2072261 2039120
61408 2039120 2006849 1976525 1948542 1922744 1898919 1876832 1855741 1834428 1812269 1789962 1768712
61397 1768712 1748942 1730387 1713177 1698061 1685548 1675616 1668492 1665035 1666014 1671528 1681561 1696651
61385 1696651 1717534 1744439 1777262 1816351 1862659 1917059 1979701 2050181 2128262 2214282 2308565
61374 2308565 2410215 2516638 2624610 2731734 2836413 2936463 3028407 3108493 3174028 3223516
61364C223516L2548J5247j482j6766l0337m2313n2761o1701o9368p6120q2196
61353B838267q7540r1837r4680r5826r5278r3083q9342q4543p9571p4987p0454
61342A881126o5341n9732n4387m9715m5362m0837l6119l1413k6801k2306j8007
61331A431106j3861r759n860k572J50L035O659J0552J3600J5280J6211J7346J8943
61318A500830K0458K1310K1536K1698K2177K2687K2575K1458J9454J6729J3114
61307A724026Q459L184j752n605q291j0079j1111j1509j1734j2386j3630j5034
61295A634538j6148j6889j7371j7614j7698j7844j8051j7881j7024j5810j4785
61284A447423j3892j2554j0573q456o835n913n570n542n467n133m803m930n375
$$ plain form
61364 3223516 3256064 3271311 3269829 3253063 3222726 3180413 3127652 3065951 2996583 2920463 2838267
61353 2838267 2750727 2658890 2564210 2468384 2373106 2280023 2190681 2106138 2026567 1951580 1881126
61342 1881126 1815785 1756053 1701666 1651951 1606589 1565752 1529633 1498220 1471419 1449113 1431106
61331 1431106 1417245 1407486 1401626 1399054 1399204 1402239 1408898 1419450 1433050 1448330 1464541 1481887 1500830
61318 1500830 1521288 1542598 1564134 1585832 1608009 1630696 1653271 1674729 1694183 1710912 1724026
61307 1724026 1732485 1735669 1733917 1728312 1720021 1709942 1698831 1687322 1675588 1663202 1649572 1634538
61295 1634538 1618390 1601501 1584130 1566516 1548818 1530974 1512923 1495042 1478018 1462208 1447423
61284 1447423 1433531 1420977 1410404 1401948 1395113 1389200 1383630 1378088 1372621 1367488 1362685 1357755 1352380
61271A352380n366m376k681q38R95K874M510N211M475K504K64j081j033o2J232
61256A359008K947N573Q997J2591J6203K0384K5504L1444L8227M6070N4433O1800
61244A683181O6932O9520O9276O5314N7326M6549L4653K2248R387l150j4284k4034
61232B082918l3198m1776m8811n3739n6783n7911n6657n3210m8628m3604l8035
61221A550566l2383k8436k7817l0386l4778l9821m4590m7734m8027m5679m2140
61210A128775l8480l4659l0483k6407k2910j9700j6116j2065p981m170p68J698
61198I16734K462J449m76k436m251n886o714o058m233k408j492j631k700m470
61184H77890o216p053p087p543r180j1115j1896j1384j0752j0778j1031j0905
$$ plain form
61271 1352380 1347014 1342638 1339957 1339119 1340114 1342988 1347498 1352709 1357184 1359688 1359952 1358871 1357838 1357776 1359008
61256 1359008 1361955 1367528 1376525 1389116 1405319 1425703 1451207 1482651 1520878 1566948 1621381 1683181
61244 1683181 1750113 1819633 1888909 1954223 2011549 2058098 2092751 2114999 2124386 2121236 2106952 2082918
61232 2082918 2049720 2007944 1959133 1905394 1848611 1790700 1734043 1680833 1632205 1588601 1550566
61221 1550566 1518183 1489747 1461930 1431544 1396766 1356945 1312355 1264621 1216594 1170915 1128775
61210 1128775 1090295 1055636 1025153 998746 975836 956136 940020 927955 919974 915804 915036 916734
61198 916734 919196 920645 920169 917733 913482 907596 900882 894824 890591 888183 886691 885060 882360 877890
61184 877890 871674 864621 857534 849991 840811 829696 817800 806416 795664 784886 773855 762950
61172G62950j0652j0829j1121j0570q973p452p157p819q159p551o557n674m471
61159F55965k480k09J527K759L824M028K082k058o738j0229j2044j2581j2424
61146F11422j2188j2165j1795j0355q327p113p110p159o325n161m596m621m843
61133E09664n351o162o685o525o152n935n362m035k611j839j394o50J80P13J279
61118D59135K105K480K054K117L946O512P594O767N510M500K736l08l497n628
61104D96023o888p946q706q742q179p496o903o406o030n723n322m779m119l280
61090D05504k409j971k083k072j404o70p29j243j054J11J277J617J282Q83Q31
61075C97870J240J868K279K509L152M254M833M315L653L954M747M938M781N298
$$ plain form
61172 762950 752298 741469 730348 719778 710805 703353 696196 688377 680218 672667 666110 660436 655965
61159 655965 653485 653276 654803 657562 661386 665414 667496 665438 658700 648471 636427 623846 611422
61146 611422 599234 587069 575274 564919 556592 549479 542369 535210 528885 523724 519128 514507 509664
61133 509664 504313 498151 491466 484941 478789 472854 467492 463457 460846 459007 457613 456963 457143 457856 459135
61118 459135 461240 463720 465774 467891 471837 478349 485943 492710 498220 502720 505456 505148 501651 496023
61104 496023 489135 481189 472483 463741 455562 448066 441163 434757 428727 423004 417682 412903 408784 405504
61090 405504 403095 401124 399041 396969 395565 394895 394166 392923 391869 391980 393257 394874 396156 397039 397870
61075 397870 399110 400978 403257 405766 408918 413172 418005 422320 425973 429927 434674 439612 444393 449691
61061D49691O319O774O665O955P684P850P220O630O469O386O417O897P299O816
61047E46072N981O051O875P236P118P649Q856R578R765J0528J1796J2219J1823
61034F61547J2335J4291J6247J7527J9346K2375K5501K7837K9659L0732L0296
61023I07693K9567L1357L6216M1840M7281N4392O3628P2137P8082Q3520R0811
61012A536524R9924J11760J30157J57288J90877K29381K75560L31240L94296M66810
61002C923817N60430O86625Q49553J058873J333565J656832J916684J930739J583005
60993A5500123R51643K79795j97060l92113l48688j31978K07967N69899P65326
60984A7204914O18009J17223n49704j132161j481550j597955j558529j436618
$$ plain form
61061 449691 456010 462784 469449 476404 484088 491938 499158 505788 512257 518643 525060 531957 539256 546072
61047 546072 552053 558104 564979 572215 579333 586982 595838 605416 615181 625709 637505 649724 661547
61034 661547 673882 688173 704420 721947 741293 763668 789169 817006 846665 877397 907693
61023 907693 937260 968617 1004833 1046673 1093954 1148346 1211974 1284111 1362193 1445713 1536524
61012 1536524 1636448 1748208 1878365 2035653 2226530 2455911 2731471 3062711 3457007 3923817
61002 3923817 4484247 5170872 6020425 7079298 8412863 10069695 11986379 13917118 15500123
60993 15500123 16451766 16731561 16534501 16142388 15793700 15661722 15869689 16439588 17204914
60984 17204914 17822923 17940146 17390442 16258281 14776731 13178776 11620247 10183629
60976A0183629j279207j117744r71038q42069p25821o20755n28742m48744l77620
60967C271889l15309k63904k22977j89887j63362j43028j26836j12464j00219
60958A633903r1265q4142p6248o7779o0954n6031n1318m6686m3815m2968m2420
60947I70277m1319m0470m0005l8668l6025l3213l1041k9082k7020k5148k3272
60936F05014k0760j7965j5942j4545j2461r457o840n381m435l557l302l705l598
60923D83066k324p92jL45Q99J506J834K202K862L252K780J782R19K86k79n96n64
60906D97177o05j049j566j838k197k970l680l727l485l915n228o618p300p257
60892D45742o981o917p173p482p453p048o700o686o638o009m868l870l453l456
$$ plain form
60976 10183629 8904422 7786678 6815640 5973571 5247750 4626995 4098253 3649509 3271889
60967 3271889 2956580 2692676 2469699 2279812 2116450 1973422 1846586 1734122 1633903
60958 1633903 1542638 1458496 1382248 1314469 1253515 1197484 1146166 1099480 1055665 1012697 970277
60947 970277 928958 888488 848483 809815 773790 740577 709536 680454 653434 628286 605014
60936 605014 584254 566289 550347 535802 523341 513884 507044 501663 497228 493671 490369 486664 483066
60923 483066 480742 479950 479949 480294 481193 482699 484533 486735 489597 492849 495629 497411 498330 498616 498337 497741 497177
60906 497177 496572 495523 493957 492119 489922 486952 483272 479545 476060 472145 466917 460299 452999 445742
60892 445742 438761 431844 424671 417189 409736 402688 395988 389302 382664 376655 371787 367917 364464 361008
60878C61008l510l476l299k765j681k72Q07J064P03M54P85J463J942K079K207
60863C57509K698L668N047O545P552P446O204M468K913J812J335J884L617N728
60849D18426O778N986M022K244J299P25j52j348k390l037l510m080m748n290n455
60834D09470n073m234l365k950l141l681m262m732n041n178n124m772m001l039
60820C50877k528k835l458l530k875k076j545j090n05n9n0k92l42Q0R41J899K366
60803C34978K015J383J418K283L118L201K757K323J933J432J086J245J742K116
60789C63030K204K091J775J301R51R39J189J660K413L014K593J100o8L69J867
60774C86428K745K342J449Q06K69l60p50p28p02q96p55K54J684K541K387J619
$$ plain form
60878 361008 357498 354022 350723 347958 346277 346005 346812 347876 348579 349033 349818 351281 353223 355302 357509
60863 357509 360207 363875 368922 375467 383019 390465 396669 401137 404050 405862 407197 409081 412698 418426
60849 418426 425204 431190 435212 437456 438755 439480 439328 437980 435590 432553 429043 424963 420215 414925 409470
60834 409470 404397 400163 396798 393848 390707 387026 382764 378032 372991 367813 362689 357917 353916 350877
60820 350877 348349 345514 342056 338526 335651 333575 332030 330940 330435 330376 330326 330034 329692 329772 330713 332612 334978
60803 334978 336993 338376 339794 342077 345195 348396 351153 353476 355409 356841 357927 359172 360914 363030
60789 363030 365234 367325 369100 370401 371352 372291 373480 375140 377553 380567 383160 384260 384192 384561 386428
60774 386428 389173 391515 392964 393770 394039 393679 392929 392201 391499 390603 389848 390102 391786 394327 396714 398333
60758C98333P24j67r68j372j129n76m42j034j737j646o26N51J166J184Q53J84
60742C93298q19j802k457k959l640m422m933n016m701l976k948k046j545j226
60728C50808q54o75q72r35l15N45P44L05K36R99J881K083J717J349J122Q07K52
60711C59197n89j754l049l937l974l324k710k863l850m840m819l766k802k820
60697C14100l363l478l163l165l612l947m030m217m275l452j913r25j085j446
60683B72029j027j84K77M37P42R52O55K57L75O91M83l3K8P41J296J353J418J749
60665B82239J894J656J562J939K354K473K804L904N313O079O055O036O584P370
60651C38262P878Q223Q884R811J0293R815Q719P713O958O039M766L516K611J850
$$ plain form
60758 398333 399057 398890 397922 396550 395421 394845 394403 393369 391632 389986 389360 389911 391077 392261 393114 393298
60742 393298 392479 390677 388220 385261 381621 377199 372266 367250 362549 358573 355625 353579 352034 350808
60728 350808 349954 349279 348407 347472 347157 347702 348446 348751 348987 349986 351867 353950 355667 357016 358138 358945 359197
60711 359197 358608 356854 353805 349868 345894 342570 339860 336997 333147 328307 323488 319722 316920 314100
60697 314100 310737 307259 304096 300931 297319 293372 289342 285125 280850 277398 275485 274560 273475 272029
60683 272029 271002 270818 271095 271532 272274 273226 273881 274138 274513 275204 275687 275654 275682 276423 277719 279072 280490 282239
60665 282239 284133 285789 287351 289290 291644 294117 296921 300825 306138 312217 318272 324308 330892 338262
60651 338262 346140 354363 363247 373058 383351 393166 401885 409598 416556 422595 427361 430877 433488 435338
60637D35338R30k5p64j416k237l018l271k899k364k189k524l180l800m101m172
60622D00308m327m451l942k619j314r06j168j283j172j390j817j558l31R43J374
60607C76347J106P28M28J51k9j94o28j159j130m53Pl04p22m66N7K3l40j01Q60
60588C74181J748K105K205K283K268K273K450K426J774R33P10R50P72J93J29O01
60572C98001L81j009k256k097j078m62l89k53j28m84r71q13j70R0j63j68L92R43
60554C89366J051J011J212J640K139K597K789K629K586L206M337N447O558Q090
60540D34658R871J1277J2369J3844J5668J6800J6554J5273J3259J0109N768J225
60528E76675k535n657q620j1071j2293j2352j1867j0983r491p733o497o009n703
$$ plain form
60637 435338 436268 436243 435479 434063 431826 428808 425537 422638 420274 418085 415561 412381 408581 404480 400308
60622 400308 395981 391530 387588 384969 383655 382749 381581 380298 379126 377736 375919 374361 374030 374973 376347
60607 376347 377453 378181 378609 378760 378731 378537 377909 376750 375620 375167 375174 374870 374148 373682 373739 373762 373422 373321 374181
60588 374181 375929 378034 380239 382522 384790 387063 389513 391939 393713 394646 395356 396306 397078 397271 397400 398001
60572 398001 398382 397373 395117 393020 391942 391480 391091 390838 390710 390226 389255 388442 388272 388362 388199 388031 388423 389366
60554 389366 390417 391428 392640 394280 396419 399016 401805 404434 407020 410226 414563 420010 426568 434658
60540 434658 444529 455806 468175 482019 497687 514487 531041 546314 559573 569682 575450 576675
60528 576675 574140 568483 559863 548792 536499 524147 512280 501297 491806 484073 477576 471567 465864
60515D65864n119m420l978l808l480k408l29K216M200N233O045P510R579J1678
60501D88783J3733J6011J8195J9478J9514J8598J6904J4339J1336R014Q114Q282
60489F62301Q778R556J1273J4534J9467K5831L3167M0966M8973N7434O6941P7983
60477A077204R0494J03690J16162J26150J31649J30459J20620J01313P3486L9523
60467B110750K468l4351o7503r3993j12147j21929j24535j21745j15426j07163
60457A214426r8033q8728p9723p1184o2908n4677m6773l9897l4514l0368k6727
60446E80894k3097j9687j7059j5243j3464j1093q655p250o991o737n699m455l891
60433D37573l850l576k978k525k239j770j293j409k066k447k128j634j581j856
$$ plain form
60515 465864 460745 456325 452347 448539 445059 442651 442322 444538 448738 453971 460016 467526 477105 488783
60501 488783 502516 518527 536722 556200 575714 594312 611216 625555 636891 645905 654019 662301
60489 662301 671079 680635 691908 706442 725909 751740 784907 825873 874846 932280 999221 1077204
60477 1077204 1167698 1271388 1387550 1513700 1645349 1775808 1896428 1997741 2071227 2110750
60467 2110750 2113218 2078867 2011364 1917371 1805224 1683295 1558760 1437015 1321589 1214426
60457 1214426 1116393 1027665 947942 876758 813850 759173 712400 672503 637989 607621 580894
60446 580894 557797 538110 521051 505808 492344 481251 472596 465346 458355 451618 445919 441464 437573
60433 437573 433723 430147 427169 424644 422405 420635 419342 417933 415867 413420 411292 409658 408077 406221
60419D06221j991j786j312p15k35l4J27O41J365J616J063J68m44o74p52p08l19
60402D02231N60J801K997L717L962M280N065N949O274O088O041O371O623O473
60388D68432O149N841N351M639M141M170M457M542M297L770L010K277K040K363
60374E25479K741K698K244J520N22n29j074r48p45j042j573j688j213n05J51O72
60358E26710J001J131J214J358J512J713K119K605K777K589K525K838L151L179
60344E56422L239L511L397K247L76j385k733l838m553m541l960l305k646j812
60330E40419j163j338k200k810k645k214k270l005m115n124n420m651l297k397
60316D97770k440k924l144k956k645k537k875l584m069l769l113l156m061m612
$$ plain form
60419 406221 404230 402444 401132 400417 400182 400148 400275 400916 402281 403897 404960 405128 404684 404010 403258 402550 402231
60402 402231 402791 404592 407589 411306 415268 419548 424613 430562 436836 442924 448965 455336 461959 468432
60388 468432 474581 480422 485773 490412 494553 498723 503180 507722 512019 515789 518799 521076 523116 525479
60374 525479 528220 530918 533162 534682 535204 534675 533601 532653 531908 530866 529293 527605 526392 525887 526038 526710
60358 526710 527711 528842 530056 531414 532926 534639 536758 539363 542140 544729 547254 550092 553243 556422
60344 556422 559661 563172 566569 568816 569192 567807 565074 561236 556683 552142 548182 544877 542231 540419
60330 540419 539256 537918 535718 532908 530263 528049 525779 522774 518659 513535 508115 503464 500167 497770
60316 497770 495330 492406 489262 486306 483661 481124 478249 474665 470596 466827 463714 460558 456497 451885
60302D51885l789k156j082j060j516j879k074k040j588q21j86M6l8k96o03o15
60286D32188K8J130J984K218K188K357K648K696K498K414K640K965L056K850K588
60271D66448K629L106L685L782L264K797L218M541N858O326O003N573N473N560
60257E28263N487N106M451L606K735K086J889K179K784L384L730L897M369N606
60243E79572P524R577J1427J3315J5583J8074K0199K1623K2629K3839K5665K8054
60231G97081L0676L3366L6374M0069M4320M8427N1813N4657N7514O0412O2631
60220A317340O3466O2866O1159N8461N4616M9610M3714L7257L0466K3524J6560
60209A819039R544K422m483j0436j4844j7748j9554k0427k0267j9152j7383j4968
$$ plain form
60302 451885 448096 445940 444858 443798 442282 440403 438329 436289 434701 433880 433694 433740 433702 433406 432803 432188
60286 432188 432216 433346 435330 437548 439736 442093 444741 447437 449935 452349 454989 457954 461010 463860 466448
60271 466448 469077 472183 475868 479650 482914 485711 488929 493470 499328 505654 511657 517230 522703 528263
60257 528263 533750 538856 543307 546913 549648 551734 553623 555802 558586 561970 565700 569597 573966 579572
60243 579572 587096 596673 608100 621415 636998 655072 675271 696894 719523 743362 769027 797081
60231 797081 827757 861123 897497 937566 981886 1030313 1082126 1136783 1194297 1254709 1317340
60220 1317340 1380806 1443672 1504831 1563292 1617908 1667518 1711232 1748489 1778955 1802479 1819039
60209 1819039 1828583 1831005 1826522 1816086 1801242 1783494 1763940 1743513 1723246 1704094 1686711 1671743
60197A671743j1579p211k452K345P679J4180K1534K8878L6031M3520N1267N8166
60185A914101O3378O7177O9937P0938O9166O4880N9368N3244M5968L7225K7828
60174B543210J8754R912M85r844k0467l0434l8980m5681n0555n4006n6328n7226
60162B208840n6111n2794m7728m1546l4672k7334j9663j1667l369M974J2897K0058
60150A951885K6285L1254L4349L5120L3761L0978K7355K3020J7883J2108O240
60139B230238Q96l711p815j1597j4698j6460j6661j5765j4293j2203r087m659
60127B104185J180Q566J7457K7252L7057M6534N6218O6955P9151R2575J06580
60116B643710J20477J33912J46923J59325J70151J78028J82226J82872J80147
$$ plain form
60197 1671743 1660164 1652953 1650501 1652846 1660525 1674705 1696239 1725117 1761148 1804668 1855935 1914101
60185 1914101 1977479 2044656 2114593 2185531 2254697 2319577 2378945 2432189 2478157 2515382 2543210
60174 2543210 2561964 2571876 2572361 2562517 2542050 2511616 2472636 2426955 2376400 2322394 2266066 2208840
60162 2208840 2152729 2099935 2052207 2010661 1975989 1948655 1928992 1917325 1913956 1918930 1931827 1951885
60150 1951885 1978170 2009424 2043773 2078893 2112654 2143632 2170987 2194007 2211890 2223998 2230238
60139 2230238 2231134 2227423 2219608 2208011 2193313 2176853 2160192 2144427 2130134 2117931 2108844 2104185
60127 2104185 2105365 2113931 2131388 2158640 2195697 2242231 2298449 2365404 2444555 2537130 2643710
60116 2643710 2764187 2898099 3045022 3204347 3374498 3552526 3734752 3917624 4097771
60107D097771J73830J63893J50893J35305J16898R5326P0950M4549J6637j2244
60097E053808m0849o7639r1810j13167j31074j44340j52395j55882j55785j52525
60087C848342j46175j37040j25653j12609r8709q4817p1297n7940m4703l2090
60077B937309k0470r535J105J1121J9651K6097L0280L2135L1754K9554K5947K0976
60065C135924J4682P616N32o364j3337k0388k7170l3675m0386m7501n4394o0228
60053B855311o4782o8396p1239p3018p3330p2076o9450o5722o1131n5857m9954
60042B130356m3333l5936k7976j9814j1613l202N515J4256K2743L1282M0520N0499
60030B153297O0298O8709P4996P8900Q0257P8983P5211O9112O0728N0255L8301
$$ plain form
60107 4097771 4271601 4435494 4586387 4721692 4838590 4933916 5004866 5049415 5066052 5053808
60097 5053808 5012959 4945320 4853510 4740343 4609269 4464929 4312534 4156652 4000867 3848342
60087 3848342 3702167 3565127 3439474 3326865 3228156 3143339 3072042 3014102 2969399 2937309
60077 2937309 2916839 2907304 2908409 2919530 2939181 2965278 2995558 3027693 3059447 3089001 3114948 3135924
60065 3135924 3150606 3158222 3158754 3152390 3139053 3118665 3091495 3057820 3017434 2969933 2915539 2855311
60053 2855311 2790529 2722133 2650894 2577876 2504546 2432470 2363020 2297298 2236167 2180310 2130356
60042 2130356 2087023 2051087 2023111 2003297 1991684 1988482 1993997 2008253 2030996 2062278 2102798 2153297
60030 2153297 2213595 2282304 2357300 2436200 2516457 2595440 2670651 2739763 2800491 2850746 2889047
60019B889047K5575J2331j571j6088l0699m4625n7113o7558p5529q0797q3280
60008B469693q3018q0242p5431o9141o1838n3872m5483l6718k7524j7958q184
59997A910284J726J1707K1356L0130L8104M6252N5522O5868P6394Q6198R4586
59986B438127J00751J03818J03318R9332R2163Q2173O9914N6064M1264K6162J1394
59975C224480k952j7626l3272m9085o2953p3232p9867q3497q4134q1343p5526
59964B580993o8175o0736n3570m6208l8262k9800k1110j2454m021M150J2385K1243
59952B284435L0899M0681M9402N6244O1226O4716O6693O6701O4436O0203N4693
59941B900329M8519M2018L5395K8859K2569J6580J0982O135K691J344K582O585
$$ plain form
60019 2889047 2914622 2926953 2925382 2909294 2878595 2833970 2776857 2709299 2633770 2552973 2469693
60008 2469693 2386675 2306433 2231002 2161861 2100023 2046151 2000668 1963950 1936426 1918468 1910284
59997 1910284 1912010 1923717 1945073 1975203 2013307 2059559 2115081 2180949 2257343 2343541 2438127
59986 2438127 2538878 2642696 2746014 2845346 2937509 3019682 3089596 3145660 3186924 3213086 3224480
59975 3224480 3221528 3203902 3170630 3121545 3058592 2985360 2905493 2821996 2737862 2656519 2580993
59964 2580993 2512818 2452082 2398512 2352304 2314042 2284242 2263132 2250678 2246657 2250807 2263192 2284435
59952 2284435 2315334 2356015 2405417 2461661 2522887 2587603 2654296 2720997 2785433 2845636 2900329
59941 2900329 2948848 2990866 3026261 3055120 3077689 3094269 3105251 3111386 3114077 3115421 3118003 3124588
59929C124588J3176K1793L1765M2852N5425O9875Q5931J02695J19312J35241J49927
59918C952580J62538J72115J77771J78623J73743J62370J44118J19117Q8186N2954
59908E384115J5574k1842n7490q9761j17234j38914j54284j63255j66317j64660
59898D325932j59629j51977j41877j29673j16086j01717q6816p1724n6958m2607
59888C266868k8214j3600O64J3977K6465L8556N0163O0705O9691P6795Q1595Q3641
59876C727306Q2679P8472P0622N8881M3583K5583O046j3629l2075m8523o2941
59865C936004p5458q6091r5113j03073j10011j15214j18163j19109j18222j14836
59855B880714j08337r9385q9411p9233o8862n8377m8136l8395k9573k2775j9144
$$ plain form
59929 3124588 3137764 3159557 3191322 3234174 3289599 3359474 3445405 3548100 3667412 3802653 3952580
59918 3952580 4115118 4287233 4465004 4643627 4817370 4979740 5123858 5242975 5331161 5384115
59908 5384115 5399689 5377847 5320357 5230596 5113362 4974448 4820164 4656909 4490592 4325932
59898 4325932 4166303 4014326 3872449 3742776 3626690 3524973 3438157 3366433 3309475 3266868
59888 3266868 3238654 3225054 3225718 3239695 3266160 3304716 3354879 3415584 3485275 3562070 3643665 3727306
59876 3727306 3809985 3888457 3959079 4017960 4061543 4087126 4093172 4079543 4047468 3998945 3936004
59865 3936004 3860546 3774455 3679342 3576269 3466258 3351044 3232881 3113772 2995550 2880714
59855 2880714 2772377 2672992 2583581 2504348 2435486 2377109 2328973 2290578 2261005 2238230 2219086
59844B219086j8510j9349k0071j9868j8480j5902j2477q655m688r85J555K326
59832B083982K023K157L632O418J0337J5086J9561K2233K2433K0446J6394J0097
59820B234799K239n538j2186j7923k2908k6299k7364k6718k5640k4781k4204k4082
59808A999395k4469k4754k4083k2188j9370j5954j2254q650n218j603K313N872
59796A849037Q186Q903Q198O415M146K130N78r93k797m103m095k938j304P61L804
59781A875928Q058J3290J9383K6357L3960M1861N0246N9587O9905Q0824R2395
59770B371794J05304J20186J37106J55643J74818J92775K06715K13035K07343
59761C884719J85187J44545Q8563K5491l4891q5244j22054j44709j54442j53916
$$ plain form
59844 2219086 2200576 2181227 2161156 2141288 2122808 2106906 2094429 2085774 2081086 2080101 2081656 2083982
59832 2083982 2086005 2088162 2091794 2098212 2108549 2123635 2143196 2165429 2187862 2208308 2224702 2234799
59820 2234799 2237038 2231500 2219314 2201391 2178483 2152184 2124820 2098102 2072462 2047681 2023477 1999395
59808 1999395 1974926 1950172 1926089 1903901 1884531 1868577 1856323 1847673 1842455 1840852 1843165 1849037
59796 1849037 1857223 1866126 1874324 1880739 1884885 1887015 1887593 1886600 1883803 1879700 1875605 1872667 1871363 1872124 1875928
59781 1875928 1883986 1897276 1916659 1943016 1976976 2018837 2069083 2128670 2198575 2279399 2371794
59770 2371794 2477098 2597284 2734390 2890033 3064851 3257626 3464341 3677376 3884719
59761 3884719 4069906 4214451 4303014 4328505 4293614 4208370 4086316 3941607 3787165 3633249
59751C633249j46655j35919j23801j11114r7987q4550p1331n9203m8908m0510
59741B713271l3229k5892j7677q588P71R760J8067K5683L2793L9761M6975N4635
59729B856330O2772P1484Q0954R1215J02168J13908J26841J41283J57202J74395
59719C978552J92734K12125K32400K53431K75072K96701L17044L34614L48237
59710F440910L56905L59322L54105L40762L20538K96255K71070K47180K25593
59701I212640K07059J92687J83074J76969J71613J64716J55699J44845J31869
59692A0741171J15993R7020P5642N2752K9038N346j7026l6690n2706o4693p2484
59681A0873363p5715p3812o6452n4027l7375j7058O768L3742O2991R3804J26199
$$ plain form
59751 3633249 3486594 3350675 3226874 3115760 3017773 2933223 2861892 2802689 2753781 2713271
59741 2713271 2680042 2654150 2636473 2627885 2628656 2638416 2656483 2682166 2714959 2754720 2801695 2856330
59729 2856330 2919102 2990586 3071540 3162755 3264923 3378831 3505672 3646955 3804157 3978552
59719 3978552 4171286 4383411 4615811 4869242 5144314 5441015 5758059 6092673 6440910
59710 6440910 6797815 7157137 7511242 7852004 8172542 8468797 8739867 8987047 9212640
59701 9212640 9419699 9612386 9795460 9972429 10144042 10308758 10464457 10609302 10741171
59692 10741171 10857164 10954184 11029826 11082578 11111616 11116962 11099936 11063246 11010540 10945847 10873363
59681 10873363 10797648 10723836 10657384 10603357 10565982 10548924 10555692 10589434 10652425 10746229 10872428
59670A0872428J60313J95450K30144K63050K93339L20120L41857L56412L61422
59661A3394535L54642L34278K99325K49633J85794J09240K2671o9612j61993k48546
59651A4469967l24289l85863m31456m60481m73603m72660m59878m37019m05661
59642A0619057l68415l29263k92665k62878k44323k41455k56586k87198l25579
59633H010695l61742l87519l99182l97462l85500l66618l43412l18058k92364
59624D758838k67232k42664k18792j96441j76313j58124j41215j25678j12102
59615C120277j00398q9674p9343o9679o1128n3685m7188m1690l7237l3526l0185
59604B476544k7235k5020k3816k3638k4305k5495k6771k7805k8598k9375l0161
$$ plain form
59670 10872428 11032741 11228191 11458335 11721385 12014724 12334844 12676701 13033113 13394535
59661 13394535 13749177 14083455 14382780 14632413 14818207 14927447 14950118 14880506 14718513 14469967
59651 14469967 14145678 13759815 13328359 12867878 12394275 11921615 11461737 11024718 10619057
59642 10619057 10250642 9921379 9628714 9365836 9121513 8880058 8623472 8336274 8010695
59633 8010695 7648953 7261434 6862252 6464790 6079290 5712672 5369260 5051202 4758838
59624 4758838 4491606 4248942 4030150 3833709 3657396 3499272 3358057 3232379 3120277
59615 3120277 3019879 2930205 2850862 2781183 2720055 2666370 2619182 2577492 2540255 2506729 2476544
59604 2476544 2449309 2424289 2400473 2376835 2352530 2327035 2300264 2272459 2243861 2214486 2184325
59593B184325l0547l0098k8955k7769k6896k5996k4731k3458k2700k2162k1030
59582A899983j9293j7847j7096j6226j4391j1850r332o931m373j893Q9J854M046
59569A786740O559Q654J0164J1783J3995J6464J8720K0831K3128K5731K8664L1959
59557B003392L5382L8499M1343M4635M8914N3707N8051O1728O5570P0474P6456
59546B598151Q2906Q9432R6088J02868J09569J16238J22925J28222J28662J21135
59536C696196J06412Q9317P4562O3109N2995M2719L2419K2363J1960P50j0768
59525D182034k1871l2480m2795n2637o1547o9151p5073p8800q0092p9220p6540
59514C511828p1949o5031n5587m3919l0729j6767k296J3153L0222M8854O8210
$$ plain form
59593 2184325 2153778 2123680 2094725 2066956 2040060 2014064 1989333 1965875 1943175 1921013 1899983
59582 1899983 1880690 1862843 1845747 1829521 1815130 1803280 1793948 1787017 1782644 1780751 1780840 1782694 1786740
59569 1786740 1793299 1801953 1812117 1823900 1837895 1854359 1873079 1893910 1917038 1942769 1971433 2003392
59557 2003392 2038774 2077273 2118616 2163251 2212165 2265872 2323923 2385651 2451221 2521695 2598151
59546 2598151 2681057 2770489 2866577 2969445 3079014 3195252 3318177 3446399 3575061 3696196
59536 3696196 3802608 3891925 3966487 4029596 4082591 4125310 4157729 4180092 4192052 4192802 4182034
59525 4182034 4160163 4127683 4084888 4032251 3970704 3901553 3826480 3747680 3667588 3588368 3511828
59514 3511828 3439879 3374848 3319261 3275342 3244613 3227846 3225550 3238703 3268925 3317779 3385989
59503C385989Q7468J06263J24182J40183J52859J61001J63663J59849J48623J29755
59493D759835J04230P3998M1124P017k7510o1490r3268j20921j42961j58589j67506
59482D213959j70010j67149j60339j50631j38552j24598j09525r4079p8625o3163
59472B957288m7533l1688j6003j330J1639K3105L3946M4619N4550O2682O8433
59461C159708P1840P2978P1504O6844N8740M7485L3673J7786J82j8505l7188n4654
59449C490393p0023q2923r3408j01794j08265j12591j14442j14058j12242j09482
59439B471165j05571j00373r4477q8705q3265p7875p2480o7237o2057n6683n1222
59428A611220m6078m1413l6998l2617k8251k3935j9752j5771j1853p720l382J001
$$ plain form
59503 3385989 3473457 3579720 3703902 3844085 3996944 4157945 4321608 4481457 4630080 4759835
59493 4759835 4864065 4938063 4979187 4986204 4958694 4897204 4803936 4683015 4540054 4381465 4213959
59482 4213959 4043949 3876800 3716461 3565830 3427278 3302680 3193155 3099076 3020451 2957288
59472 2957288 2909755 2878067 2862064 2860734 2872373 2895478 2929424 2974043 3028593 3091275 3159708
59461 3159708 3231548 3304526 3376030 3442874 3501614 3549099 3582772 3600558 3600740 3582235 3545047 3490393
59449 3490393 3420370 3337447 3244039 3142245 3033980 2921389 2806947 2692889 2580647 2471165
59439 2471165 2365594 2265221 2170744 2082039 1998774 1920899 1848419 1781182 1719125 1662442 1611220
59428 1611220 1565142 1523729 1486731 1454114 1425863 1401928 1382176 1366405 1354552 1346832 1343450 1344451
59416A344451N884J2045J8657K2447K0227J2386K896m208p517p643n583k258J490
59403A413274N474J0188J5330J8644J7229J0339O05p753j1933j2053j0027p281
59391A442036l846N20N182R262J2880J6875K1392K5655K9224L2614L6431M0638
59379A668863M5032M9755N4876N9954O4485O8498P2412P6562Q1068Q5874R0889
59368B418268R6377J03254J12546J24523J38789J55111J73524J93694K14976K37283
59358C968345K60958K85403L08434L27435L40728L47697L48308L42925L32068
59349F862301L16113K95740K72710K49213K26057K02306J77096J50780J23643
59340H875959R4672O2619K7602r560m8963r1277j35830j80070k20963k56269k84628
$$ plain form
59416 1344451 1350335 1362380 1381037 1403484 1423711 1436097 1438993 1434785 1427268 1419625 1414042 1411784 1413274
59403 1413274 1418748 1428936 1444266 1462910 1480139 1490478 1491083 1483330 1471397 1459344 1449317 1442036
59391 1442036 1438190 1438710 1443892 1453154 1466034 1482909 1504301 1529956 1559180 1591794 1628225 1668863
59379 1668863 1713895 1763650 1818526 1878480 1942965 2011463 2083875 2160437 2241505 2327379 2418268
59368 2418268 2514645 2617899 2730445 2854968 2993757 3148868 3322392 3516086 3731062 3968345
59358 3968345 4229303 4514706 4823140 5150575 5491303 5839000 6187308 6530233 6862301
59349 6862301 7178414 7474154 7746864 7996077 8222134 8424440 8601536 8752316 8875959
59340 8875959 8970631 9033250 9060852 9051292 9002329 8911052 8775222 8595152 8374189 8117920 7833292
59329G833292l05343l18321l23697l21636l13000k99942k85029k69674k54102
59320E142548k38572k23796k10031j96690j83289j70150j57796j46127j34672
59311C481425j23382j12729j03052r4078q5142p5884o6706n8353n0905m3456l5147
59300B632591k6483j9315j5417j5143j7250j9649k0511j9131j5956j1759o911
59289B445066j623L555Q006J1815J5690K0063K4647K9080L3486L8174M2944M7076
59277B717979M9968N1676N2764N3710N4400N4161N2298M8639M3622L7866L1579
59266C248662K4331J5496N040o319j7870k9634m1877n4010o4592p2615p8344q2650
59254B845618q5996q8316q9364q8822q6511q2991p9521p6815p4134p0236o4985
$$ plain form
59329 7833292 7527949 7209628 6885931 6564295 6251295 5951353 5666324 5396650 5142548
59320 5142548 4903976 4680180 4470149 4273459 4090170 3920020 3762224 3616097 3481425
59311 3481425 3358043 3245314 3142262 3048184 2963042 2887158 2820452 2762099 2711194 2667738 2632591
59300 2632591 2606108 2586793 2571376 2556233 2538983 2519334 2498823 2479692 2463736 2451977 2445066
59289 2445066 2443443 2446998 2455004 2466819 2482509 2502572 2527219 2556299 2589785 2627959 2670903 2717979
59277 2717979 2767947 2819623 2872387 2926097 2980497 3034658 3086956 3135595 3179217 3217083 3248662
59266 3248662 3272993 3288489 3293529 3287210 3269340 3239706 3197829 3143819 3079227 3006612 2928268 2845618
59254 2845618 2759622 2671306 2581942 2493120 2406609 2323618 2244097 2167282 2093148 2022912 1957927
59243A957927n9354n4075m9043m4128l9645l5706l1808k7581k3446k0024j7199
59232A555918j4360j1371q694o449m005p84K844N994Q396J0737J3748J7482K1629
59219A591085K6162L1257L6819M2588M8607N5205O2563P0684P9801R0341J02360
59208B237472J15426J29271J44162J60378J77572J94793K10849K24447K34276
59199C828646K39156K37959K29433K12607J87647J55973J19271P8686L5277r170
59189E315485n2162r1254j24465j50413j68486j78979j82832j81195j75274j66186
59179C844239j54760j41626j27635j13857j00962q8932p7657o7417n8446n0452
59169B862495m3203l7212l3280l1337l0358k9494k8892k9271l1046l3966l7386
$$ plain form
59243 1957927 1898573 1844498 1795455 1751327 1711682 1675976 1644168 1616587 1593141 1573117 1555918
59232 1555918 1541558 1530187 1521493 1515044 1511039 1510255 1513099 1519093 1527489 1538226 1551974 1569456 1591085
59219 1591085 1617247 1648504 1685323 1727911 1776518 1831723 1894286 1964970 2044771 2135112 2237472
59208 2237472 2352898 2482169 2626331 2786709 2964281 3159074 3369923 3594370 3828646
59199 3828646 4067802 4305761 4535194 4747801 4935448 5091421 5210692 5289378 5324655 5315485
59189 5315485 5263323 5172069 5047604 4897191 4728705 4549726 4366894 4185699 4010425 3844239
59179 3844239 3689479 3547853 3420218 3306361 3205399 3116467 3038810 2971393 2912947 2862495
59169 2862495 2819292 2782080 2748800 2717463 2687105 2657611 2628719 2599448 2568402 2534436 2497050
59158B497050m0738m3763m6357m8232m8988m8641m7726m6595m4793m1601l7117
59147B002499l2381k8321k4926k1647j8243j4937j1813q555m888j016K721O436
59135A844929J0481J4641J8154K0821K3457K6730L0012L2161L3079L3663L4325
59124B122453L4561L4058L3253L2478L1358K9590K7549K5675K3789K1545J9062
59113B435371J6612J4139J1524Q954O595M227J644j009l588o308r322j2348j4994
59100B451497j7066j8339j8482j7532j5833j3278r291l995J417O023J0179J4501
59088B369801J8552K1429K3026K3840K3998K3430K2588K1861K0535J7380J2251
59077B598691O164k65p510j6130k5806l5662m4937n3137o0005o5563o9861p2681
$$ plain form
59158 2497050 2456312 2412549 2366192 2317960 2268972 2220331 2172605 2126010 2081217 2039616 2002499
59147 2002499 1970118 1941797 1916871 1895224 1876981 1862044 1850231 1841676 1836788 1835772 1838493 1844929
59135 1844929 1855410 1870051 1888205 1909026 1932483 1959213 1989225 2021386 2054465 2088128 2122453
59124 2122453 2157014 2191072 2224325 2256803 2288161 2317751 2345300 2370975 2394764 2416309 2435371
59113 2435371 2451983 2466122 2477646 2486600 2493195 2497422 2499066 2498057 2494469 2488161 2478839 2466491 2451497
59100 2451497 2434431 2416092 2397610 2380078 2364245 2350967 2341676 2337681 2339098 2345121 2355300 2369801
59088 2369801 2388353 2409782 2432808 2456648 2480646 2504076 2526664 2548525 2569060 2586440 2598691
59077 2598691 2604855 2604590 2597080 2580950 2555144 2519482 2474545 2421408 2361403 2295840 2225979 2153298
59065B153298p3794p3407p2013o9921o7225o4080o0601n6736n2629m8750m5242
59054A468900m1559l7307l3086k9760k7226k4692k1929j9491j7694j6207j4632
59043A185317j2891j1028r175p610o274m447j478K309O089R582J2964J5939J7937
59030A197234J9042J9834K0220J9398J7115J4082J0963P730M399J507n28j999
59018A328997l466n088o657p823q160p400n827m084k534j177j05N33R95J828L082
59003A283114M151M518M295L915L620L293K527J017p95j774j260O0J089J720K657
58988A312147M079N378O045N928M654J866j895n365p896r867j1697j3254j4351
58975A275772j5066j5309j4910j4217j3877j3834j3326j2068j0594r287p921o368
$$ plain form
59065 2153298 2079504 2006097 1934084 1864163 1796938 1732858 1672257 1615521 1562892 1514142 1468900
59054 1468900 1427341 1390034 1356948 1327188 1299962 1275270 1253341 1233850 1216156 1199949 1185317
59043 1185317 1172426 1161398 1152223 1144613 1138339 1133892 1132414 1134723 1140812 1150394 1163358 1179297 1197234
59030 1197234 1216276 1236110 1256330 1275728 1292843 1306925 1317888 1325618 1330017 1331524 1330996 1328997
59018 1328997 1325531 1320443 1313786 1305963 1297803 1290403 1284576 1280492 1277958 1276781 1276676 1277209 1278204 1280032 1283114
59003 1283114 1287265 1291783 1296078 1299993 1303613 1306906 1309433 1310450 1309655 1307881 1306621 1306681 1307770 1309490 1312147
58988 1312147 1316226 1321604 1327649 1333577 1338231 1340097 1338202 1332837 1324941 1315074 1303377 1290123 1275772
58975 1275772 1260706 1245397 1230487 1216270 1202393 1188559 1175233 1163165 1152571 1143284 1135363 1128995
58963A128995m899l454j568O59K409L358M115M984N273M486L333K809L008L617
58949A157125M813O762Q795J0092J0927J2265J4345J6445J7944J8912J9492J9471
58937A317388J8711J7602J6817J6685J6923J7009J6869J7122J8477K0973K4091
58926A518667K7486L1205L5257L9472M3863M8555N3269N7413O0882O4123O7123
58915B047315O8876O8384O5928O2981O1107O1199O3462O7663P3457Q0625Q9029
58904B810026R8455J08616J19215J29769J39591J48394J56836J65978J76239J87224
58894D240343J98332K09049K18834K27419K35036K41677K46163K46594K41634
58885F305081K30663K13074J88547J58151J24093Q8104N0907J3290k3307n7752
$$ plain form
58963 1128995 1124096 1120642 1119074 1119733 1122142 1125500 1129615 1134599 1139872 1144358 1147691 1150500 1153508 1157125
58949 1157125 1161938 1168700 1177495 1187587 1198514 1210779 1225124 1241569 1259513 1278425 1297917 1317388
58937 1317388 1336099 1353701 1370518 1387203 1404126 1421135 1438004 1455126 1473603 1494576 1518667
58926 1518667 1546153 1577358 1612615 1652087 1695950 1744505 1797774 1855187 1916069 1980192 2047315
58915 2047315 2116191 2184575 2250503 2313484 2374591 2435790 2499252 2566915 2640372 2720997 2810026
58904 2810026 2908481 3017097 3136312 3266081 3405672 3554066 3710902 3876880 4053119 4240343
58894 4240343 4438675 4647724 4866558 5093977 5329013 5570690 5816853 6063447 6305081
58885 6305081 6535744 6748818 6937365 7095516 7219609 7307713 7358620 7371910 7348603 7290851
58875G290851q9752j19102j45141j67306j85449j99359k08820k14466k17595k18772
58865E525089k17473k13460k07544k00541j92559j83848j75282j67290j59240
58856C807852j50742j42684j36088j30658j25282j19395j13002j06002r8445r1020
58846B594534q4407p8363p2154o5583n9055n2920m7313m2303l7771l3421k9169
58835A992075k5105k0992j6541j2321r388p612n502k240J166L599N567Q192J1468
58822A922366J4665J7700K0997K4574K8379L2754L7527M1378M3515M5229M8348
58811B277432N2715N6787O0308O4521O9840P5260Q0397Q6432R4308J03394J12776
58800C134170J22695J33762J45645J57523J69262J81233J93255K04557K14681
$$ plain form
58875 7290851 7201099 7081997 6936856 6769550 6584101 6384742 6175922 5961456 5743861 5525089
58865 5525089 5307616 5094156 4886612 4686071 4493512 4309664 4134382 3967092 3807852
58856 3807852 3657110 3514426 3378338 3247680 3122398 3003003 2890001 2783999 2685554 2594534
58846 2594534 2510127 2431764 2359610 2294027 2234972 2182052 2134739 2092436 2054665 2021244 1992075
58835 1992075 1966970 1945978 1929437 1917116 1907728 1900116 1894614 1892374 1893540 1897139 1902706 1910898 1922366
58822 1922366 1937031 1954731 1975728 2000302 2028681 2061435 2098962 2140340 2183855 2229084 2277432
58811 2277432 2330147 2386934 2447242 2511763 2581603 2656863 2737260 2823692 2918000 3021394 3134170
58800 3134170 3256865 3390627 3536272 3693795 3863057 4044290 4237545 4442102 4656783
58791D656783K23763K31775K37845K40627K39173K33259K22822K07287J85899
58782F679233J58776J27135R2302N4953J5710k4066o2633r8805j31966j61437
58772F649202j86439k06543k21593k31442k36327k37374k35964k32554k26738
58763D634228k18569k09162j99713j90368j80484j69808j59000j49039j40247
58754C017838j32143j24141j16147j08274j00346r2182q4138p6705o9606o2107
58744B052049n4288m7250m1605l6609l1284k5740k0732j6537j2990j0189q490
58733A746335q015q742j0746j3792j6935j9062j9687j8841j6610j3173r065m926
58721A586741j267J280J818l00n032j1764j9484k6841l2772l7330m1210m4364
$$ plain form
58791 4656783 4880546 5112321 5350166 5590793 5829966 6063225 6286047 6493334 6679233
58782 6679233 6838009 6965144 7057446 7112399 7128109 7104043 7041410 6942605 6810639 6649202
58772 6649202 6462763 6256220 6034627 5803185 5566858 5329484 5093520 4860966 4634228
58763 4634228 4415659 4206497 4006784 3816416 3635932 3466124 3307124 3158085 3017838
58754 3017838 2885695 2761554 2645407 2537133 2436787 2344605 2260467 2183762 2114156 2052049
58744 2052049 1997761 1950511 1908906 1872297 1841013 1815273 1794541 1778004 1765014 1754825 1746335
58733 1746335 1738320 1729578 1718832 1705040 1688105 1669043 1649356 1630515 1613905 1600732 1591667 1586741
58721 1586741 1585474 1586754 1588572 1588272 1583240 1571476 1551992 1525151 1492379 1455049 1413839 1369475
58709A369475m5969m5986m5548m5243m4206m1773l8866l6656l4747l1892k7881
58698I30708k3535j9369j5392j1790q720n742k406P95K921L642L072J070k350
58685H52904o480j0585j4616j8362k0654k0588j8987j7330j5727j3210r741o430
58673F80194l939j945k39R71J941L468N741Q019R565J0215R998Q930P146M720
58659G44785J573j844m327n148n058n130n199m517l415l001l496m166m671n305
58645F91081o072o749p648r016r934r156o988n038m101l550k765j754l93J517
58631F19434L316L984L744L872M724N371N314N176N349N453N568O584Q700J0779
58617F97368J1912J2529J3392J4498J5595J6873J8434J9865K0879K1782K2984
$$ plain form
58709 1369475 1323506 1277520 1231972 1186729 1142523 1100750 1061884 1025228 990481 958589 930708
58698 930708 907173 887804 872412 860622 851902 846160 843754 844549 847470 851112 854184 855254 852904
58685 852904 846424 835839 821223 802861 782207 761619 742632 725302 709575 696365 686624 680194
58673 680194 676255 674310 674071 675042 676983 680451 686192 694211 703776 713991 723989 732919 740065 744785
58659 744785 746358 744514 740187 735039 729981 724851 719652 715135 711720 708719 705223 701057 696386 691081
58645 691081 685009 678260 670612 661596 651662 642506 635518 630480 626379 622829 620064 618310 617917 619434
58631 619434 622750 626734 630478 634350 639074 644445 649759 654935 660284 665737 671305 677889 686589 697368
58617 697368 709280 721809 735201 749699 765294 782167 800601 820466 841345 863127 886111
58606H86111K4686K7149L0476L3946L6550L8453M0969M4802M9279N3587N7744
58595A323752O1884O5572O8325P0081P0810P0349O8776O6155O1746N4462M4277
58584B026189L2278J9282N507q245k0455l0414l8682m5606n0496n2822n3061n1801
58572A731674m9004m4827m0164l5694l1211k6532k2147j8462j5172j1997r122
58561A427342o520l698p65J187J358N7k361o368j2321j9388k6312l2623l8312
58548A281276m2882m5520m6013m4869m2775m0230l7366l3968k9998k6103k3021
58537H68531k0545j7822j4728j2065j0346r401r283j0435j2589j4549j5478j5494
58525G05796j4754j3062j0807r104q464q232p839p556p476o953n730m678m556
$$ plain form
58606 886111 910797 937946 968422 1002368 1038918 1077371 1118340 1163142 1212421 1266008 1323752
58595 1323752 1385636 1451208 1519533 1589614 1660424 1730773 1799549 1865704 1927450 1981912 2026189
58584 2026189 2058467 2077749 2083256 2075011 2054556 2024142 1985460 1939854 1889358 1836536 1783475 1731674
58572 1731674 1682670 1637843 1597679 1561985 1530774 1504242 1482095 1463633 1448461 1436464 1427342
58561 1427342 1420822 1417124 1416359 1417546 1418904 1418961 1416600 1410232 1397911 1378523 1352211 1319588 1281276
58548 1281276 1238394 1192874 1146861 1101992 1059217 1018987 981621 947653 917655 891552 868531
58537 868531 847986 830164 815436 803371 793025 783624 774341 763906 751317 736768 721290 705796
58525 705796 691042 677980 667173 658069 649605 641373 633534 625978 618502 611549 605819 601141 596585
58512E96585m885m786m126l171j863j84J387K476L307M137M862N597O803Q423
58498F14562R687J0251J0706J1486J2065J1880J1157J0326R442Q697Q687R570
58486G38516J0687J1524J2213J2724J2438J1084R220P274N012K415Q5j793l976
58473H27423o954j0161j2883j5070j6731j7500j7427j7144j6755j5565j3549j1838
58461F55846j1012j0115q276o213n003m432l701k860k403k123j689j757l237n625
58447E87400p158o626m439j992l80M43J517L623O164P819Q257Q409Q988R793J0571
58432F32389J1514J2610J3534J4425J5656J6641J6123J3948J1193Q330M761O55
58420G71779k557m143n008n833n937m914l841l628l591k777j498l72R13K720M491
$$ plain form
58512 596585 591700 586914 582788 579617 577754 577570 578957 581433 584740 588877 593739 599336 606139 614562
58498 614562 624249 634500 645206 656692 668757 680637 691794 702120 711562 720259 728946 738516
58486 738516 749203 760727 772940 785664 798102 809186 818406 825680 830692 833107 833192 831399 827423
58473 827423 820469 810308 797425 782355 765624 748124 730697 713553 696798 681233 667684 655846
58461 655846 644834 634719 626443 620230 615227 610795 607094 604234 601831 599708 598019 596262 593025 587400
58447 587400 580242 573616 569177 567185 566805 567248 568765 572388 578552 586371 594628 603037 612025 621818 632389
58432 632389 643903 656513 670047 684472 700128 716769 732892 746840 758033 766363 771124 771779
58420 771779 769222 765079 760071 754238 748301 743387 739546 735918 732327 729550 728052 727680 728593 731313 735804
58405G35804N786P205R209J1125J2331J3225J3991J3674J1687R083P146N712M005
58392H59983K090L94j139k412k700j893j024o97k12Q29J471J054M05K31j82j282
58376H54916j907j121J9J91m4M33J157J111P52J133J943K239K323L126M403N204
58360H75878N537O053O720P182P790Q894R829R947R887J0615J1954J3307J4910
58347I98503J7051J8972J9799J9853J9885J9732J8769J6912J4296J1007P802N907
58335A188488N343M806L814L325L611L614L323M392P144R414R911J0253J1844
58322A269282J3343J3448J3685J5843J8738K0320K1061K2529K4312K5159K5710
58311A483430K7257K9155K9897K9556K8796K7011K3787K0682J9033J7696J5346
$$ plain form
58405 735804 741590 748795 758004 769129 781460 794685 808676 822350 834037 843120 850266 855978 859983
58392 859983 862073 862467 861328 858916 856216 854323 853299 852602 852390 853219 854690 855744 856149 856380 856198 854916
58376 854916 853009 851888 851907 852098 852054 852487 853644 854755 855507 856640 858583 860822 863145 866271 870674 875878
58360 875878 881415 887468 894188 901370 909160 918054 927883 937830 947717 958332 970286 983593 998503
58347 998503 1015554 1034526 1054325 1074178 1094063 1113795 1132564 1149476 1163772 1174779 1182581 1188488
58335 1188488 1193831 1198637 1202451 1205776 1209387 1213001 1216324 1220716 1227860 1237274 1247185 1257438 1269282
58322 1269282 1282625 1296073 1309758 1325601 1344339 1364659 1385720 1408249 1432561 1457720 1483430
58311 1483430 1510687 1539842 1569739 1599295 1628091 1655102 1678889 1699571 1718604 1736300 1751646
58300A751646J3233J2968J3528J3261J3074J4569J6731J7650J7906J9146K0873
58289A924585K1783K2673K4825K7167K8248K9335L2200L5584L7376L8579M1358
58278B263713M4948M7382M9682N4070N9486O3190O5648O9525P4739P8780Q1205
58267B952368Q3597Q5696Q5615Q3342Q0377P6638P1349O5952O2492O0225N7569
58256C765220N5926N7653O1651O5199O8584P3782Q0108Q5658R1312R8784J06459
58245D610336J11946J16904J24462J33747J42061J50285J60724J71894J81185
58236E903544J90404K02670K16207K27693K39165K54760K73084K90106L07197
58227H104830L28567L53147L77096M02032M32285M66376N00147N35857N78836
$$ plain form
58300 1751646 1764879 1777847 1791375 1804636 1817710 1832279 1849010 1866660 1884566 1903712 1924585
58289 1924585 1946368 1969041 1993866 2021033 2049281 2078616 2110816 2146400 2183776 2222355 2263713
58278 2263713 2308661 2356043 2405725 2459795 2519281 2582471 2648119 2717644 2792383 2871163 2952368
58267 2952368 3035965 3121661 3207276 3290618 3370995 3447633 3518982 3584934 3647426 3707651 3765220
58256 3765220 3821146 3878799 3940450 4005649 4074233 4148015 4228123 4313781 4405093 4503877 4610336
58245 4610336 4722282 4839186 4963648 5097395 5239456 5389741 5550465 5722359 5903544
58236 5903544 6093948 6296618 6512825 6740518 6979683 7234443 7507527 7797633 8104830
58227 8104830 8433397 8786544 9163640 9565672 9997957 10464333 10964480 11500337 12079173
58218A2079173O27689O77944P32745P99067Q75923R57980J048400J155777J280930
58209B0235628J420202J579303J769311J991454K241771K529232K873308L287034
58201C7927243L781422M383473N127993O033564P109623Q384518R901382J1693608
58193I4342826J3800581J6304817J9310538K2877424K6986483L1470553L5757644
58186B60850866L8575168L8115991L2909795K2865411R592897m295841j6335541
58179C82278746k5023633l0003660l1792386l1326732k9536597k7099249k4423281
58172A83073208k1747943j9212309j6875964j4750932j2844505j1165709r704435
58165G6771411q433184p330118o381999n568354m863182m252004l730351l286443
$$ plain form
58218 12079173 12706862 13384806 14117551 14916618 15792541 16750521 17798921 18954698 20235628
58209 20235628 21655830 23235133 25004444 26995898 29237669 31766901 34640209 37927243
58201 37927243 41708665 46092138 51220131 57253695 64363318 72747836 82649218 94342826
58193 94342826 108143407 124448224 143758762 166636186 193622669 225093222 260850866
58186 260850866 299426034 337542025 370451820 393317231 402910128 398614287 382278746
58179 382278746 357255113 327251453 295459067 264132335 234595738 207496489 183073208
58172 183073208 161325265 142112956 125236992 110486060 97641555 86475846 76771411
58165 76771411 68338227 61008109 54626110 49057756 44194574 39942570 36212219 32925776
58157C2925776k901177k564448k276330k031998j819184j630727j466736j323731
58149A6911445j193636j074302r69973q80318p99007p23701o57671o00856n48676
58140I463305n00633m61257m31204m05395l80788l58539l37888l15565k92058
58131E979978k71405k54007k36410k18526k04127j93521j82723j70676j60677
58122D087906j53634j46386j37852j30695j25577j19685j12316j06254j02252
58113B953255r7522r1109q5599q2092p8427p3773p0113o7913o4990o0973n8273
58102B122471n7234n4980n0487m6364m3988m1185l6541l1880k8600k5335k1192
58091A684685j7768j6080j4714j2888j2384j4643j8560k2655k6828l0823l3490
$$ plain form
58157 32925776 30024599 27460151 25183821 23151823 21332639 19701912 18235176 16911445
58149 16911445 15717809 14643507 13673534 12793216 11994209 11270508 10612837 10011981 9463305
58140 9463305 8962672 8501415 8070211 7664816 7284028 6925489 6587601 6272036 5979978
58131 5979978 5708573 5454566 5218156 4999630 4795503 4601982 4419259 4248583 4087906
58122 4087906 3934272 3787886 3650034 3519339 3393762 3274077 3161761 3055507 2953255
58113 2953255 2855733 2764624 2679025 2596933 2518506 2444733 2374620 2306707 2241717 2180744 2122471
58102 2122471 2065237 2010257 1959770 1913406 1869418 1828233 1791692 1759812 1731212 1705877 1684685
58091 1684685 1666917 1650837 1636123 1623235 1610851 1596208 1577648 1554993 1528165 1497342 1463852
58080A463852l4851l6394l8321l8919l7540l5672l4257l2497l0076k8025k6553
58069A090747k4581k2085k0430j9698j8365j6229j4941j4865j4301j2730j1938
58058I00584j2873j4051j4298j4459j5149j5246j4071j2802j2379j1991j0901
58047G52364r886r624r440q704p901p375o617n564n008n140n200n083n443n988
58033F55391n578m444m223n266o055n822n643o199o635o338n895n516m601l559
58019E79617l900n591o438n110k929j637j267j218j545k074j875p09M22J024J839
58004E48609L155M003L845L503L620L858M205N402P267Q359Q114P602P478O936
57990F25956N593M524M435M582M583N465P748J0067J1102J1417J2084J2866J3046
$$ plain form
58080 1463852 1429001 1392607 1354286 1315367 1277827 1242155 1207898 1175401 1145325 1117300 1090747
58069 1090747 1066166 1044081 1023651 1003953 985588 969359 954418 939553 925252 912522 900584
58058 900584 887711 873660 859362 844903 829754 814508 800437 787635 775256 763265 752364
58047 752364 742478 732854 723414 714710 706809 699434 692817 687253 682245 677105 671905 666822 661379 655391
58033 655391 649813 645369 641146 635880 629825 624003 618360 612161 605526 599188 593293 587777 583176 579617
58019 579617 575717 570126 563688 558578 555649 554012 552745 551527 549982 547908 546033 545324 545746 546770 548609
58004 548609 551764 555767 559612 563115 566735 570593 574798 580200 587467 595826 603940 611542 619020 625956
57990 625956 631549 636073 640508 645090 649673 655138 662886 672953 684055 695472 707556 720422 733468
57977G33468J2840J2734J2360J1254R846Q843Q436Q726R919J1463J2019J0881
57965H62789Q415M787l87o655j2511j7160k1152k4727k6982k7349k6442k4874
57953F87752k2624k0104j8236j6797j4428j0906p775n924m414k531j109o53l9
57940E62212J576L176L537K940K025N50j406k606k523k545l794n171n131m063
57926E48777l102j935L11K905M285M376M433N006N655O118O317N587L303Jl227
57911E88810o093q857j1252j2777j3598j4094j3952j2793j1240j0329j0187j0081
57899D53557r418q071o267m719m217m457m089k671j573k059l446m276m333m345
57885C89616m439m225l882l923m162l960l248k487j947j705j852k064j543j22
$$ plain form
57977 733468 746308 759042 771402 782656 792502 801345 809781 818507 828426 839889 851908 862789
57965 862789 871204 875991 875604 868949 856438 839278 818126 793399 766417 739068 712626 687752
57953 687752 665128 645024 626788 609991 595563 584657 576882 570958 566544 564013 562904 562251 562212
57940 562212 563788 566964 570501 573441 575466 576016 574610 572004 569481 566936 563142 557971 552840 548777
57926 548777 545675 543740 544051 546956 551241 555617 560050 565056 570711 576829 583146 588733 592036 592037 588810
57911 588810 582717 573860 562608 549831 536233 522139 508187 495394 484154 473825 463638 453557
57899 453557 444139 436068 429801 425082 420865 416408 412319 409648 408075 406016 402570 398294 393961 389616
57885 389616 385177 380952 377070 373147 368985 365025 361777 359290 357343 355638 353786 351722 350179 350057
57871C50057J202J574J393J497J981K547L248M011M223L644K993K774K371J234
57857C84749P2k27j16o30j797k842l498m007m337m386m510m947n155m597l583
57842C40189k636j636m02O41J242J988L216M092L788K875K492K761L097L314L396
57827C68417K830J374j58r40j293j787k005j327j77P93J868L224L565J493k263
57812C73614n547p378q254q384p363n514l922k890j725j23J421K708M165N990
57798C36798P961J0108J2535J4728J6075J7072J8897K1739K4381K5406K4071K0267
57786E50038J4655Q653L400j156n480r286j2087j4266j6353j7794j7706j6526
57774D66092j5488j4887j4254j3926j4666j5829j5683j3844j1809j0711j0009
$$ plain form
57871 350057 351259 352833 354226 355723 357704 360251 363499 367510 371733 375377 378370 381144 383515 384749
57857 384749 384821 384594 384478 383848 382051 379209 375711 371704 367367 362981 358471 353524 348369 343772 340189
57842 340189 337553 335917 335515 336156 337398 339386 342602 346694 350482 353357 355849 358610 361707 365021 368417
57827 368417 371247 372621 372463 371523 370230 368443 366438 365111 364934 365727 367595 370819 374384 375877 373614
57812 373614 368067 360689 352435 344051 336688 331174 327252 324362 322637 322514 323935 326643 330808 336798
57798 336798 344759 354867 367402 382130 398205 415277 434174 455913 480294 505700 529771 550038
57786 550038 564693 573346 576746 575590 570110 560824 548737 534471 518118 500324 482618 466092
57774 466092 450604 435717 421463 407537 392871 377042 361359 347515 335706 324995 314986
57763C14986q831p275n818m583l708l480l621l298k239j048j77N63J264J651J731
57748B76117J886K109K062J924K282L005L310L045K934L316L728L899M107M313
57734C18037M058L521L553M232M559M029L399L271L015J893L85m96n49l06j44
57719C52457j42m01q27r13k93P21J452J553J210R18J172K003K846L227L438M065
57703C72486N003N656N968O372O860O949O684O660O892O646N680M771M675N385
57689D56687O684Q545J0585J2061J2913J4067J6156J8670K0932K3217K6328L0596
57677F57441L5839M1849M8391N5249O2741P1851Q3488R8067J16016J37667J61201
57666A569800J80479J86035J70139J32762Q3405L6192J493j8859k9137l4141l6728
$$ plain form
57763 314986 306155 298880 293062 288479 284771 281291 277670 274372 272133 271085 270908 271471 272735 274386 276117
57748 276117 278003 280112 282174 284098 286380 289385 292695 295740 298674 301990 305718 309617 313724 318037
57734 318037 322095 325616 329169 333401 337960 341989 345388 348659 351674 353567 353952 353456 352907 352601 352457
57719 352457 352315 351914 351087 350174 349881 350602 352054 353607 354817 355735 356907 358910 361756 364983 368421 372486
57703 372486 377489 383145 389113 395485 402345 409294 415978 422638 429530 436176 441856 446627 451302 456687
57689 456687 463371 471916 482501 494562 507475 521542 537698 556368 577300 600517 626845 657441
57677 657441 693280 735129 783520 838769 901510 973361 1056849 1154916 1270932 1408599 1569800
57666 1569800 1750279 1936314 2106453 2239215 2322620 2358812 2360305 2341446 2312309 2278168 2241440
57655B241440l9007m2923m8918n5547o1385o6247p0215p2742p3597p3565p3310
57644A563984p2309o9771o5975o1822n7650n3275m8699m4068l9396l4929l1327
57633I84763k8785k6377k3018j8790j4799j1965j0313r233p946o022l710j578
57621H22227K87K259M351O161P821J0110J3250J6452J9171K1963K5525K9645L3798
57608A013020L8002M2317M6235M9416N2411N5722N8720O0361O0437N9132N5951
57597A591724N0231M2415L3554K3715J2160q84j3803k5281l5307m4153n1296n6077
57585A526998n8732o0015o0197n9082n6860n4296n1990m9874m7584m5022m2331
57574I41015l9526l6469l3264l0298k7724k5211k2520k0056j8410j7469j6545
$$ plain form
57655 2241440 2202433 2159510 2110592 2055045 1993660 1927413 1857198 1784456 1710859 1637294 1563984
57644 1563984 1491675 1421904 1355929 1294107 1236457 1183182 1134483 1090415 1051019 1016090 984763
57633 984763 955978 929601 906583 887793 872994 861029 850716 841483 833537 827515 823805 822227
57621 822227 822514 824773 829124 835285 843106 853216 866466 882918 902089 924052 949577 979222 1013020
57608 1013020 1051022 1093339 1139574 1188990 1241401 1297123 1355843 1416204 1476641 1535773 1591724
57597 1591724 1641955 1684370 1717924 1741639 1753799 1752915 1739112 1713831 1678524 1634371 1583075 1526998
57585 1526998 1468266 1408251 1348054 1288972 1232112 1177816 1125826 1075952 1028368 983346 941015
57574 941015 901489 865020 831756 801458 773734 748523 726003 705947 687537 670068 653523
57563F53523j5223j3638j1921r999q036o449n339m460l787l485l211k301r21k11
57549E64542p62j690j816j084k25M19R87J466J786K224L058L977M424M401M442
57534E86149M983O061P456Q718R375R474R608J0127J0766J1444J2728J4900J7142
57521G18931J8477J9211K0588K3198K6448K9521L2120L4352L6476L8798M1341
57510A039461M3704M5667M7665N0010N1925N2091N0010M6170M0963L4281K6171
57499A528118J7099P418k738j2821k1858k9280l5268l9985m3058m4193m3816m2707
57487A236911m1237l9314l6909l4276l1738k9447k7278k4923k2183j9225j6429
57476I13952j3972j1738r629p775o330n188l943k169J87K667M739O363P918R502
$$ plain form
57563 653523 638300 624662 612741 602742 594706 588257 582918 578458 574671 571186 567975 565674 564753 564542
57549 564542 563780 562090 560274 559190 558965 559384 560371 561837 563623 565847 568905 572882 577306 581707 586149
57534 586149 591132 597193 604649 613367 622742 632216 641824 651951 662717 674161 686889 701789 718931
57521 718931 737408 756619 777207 800405 826853 856374 888494 922846 959322 998120 1039461
57510 1039461 1083165 1128832 1176497 1226507 1278432 1330523 1380533 1426703 1467666 1501947 1528118
57499 1528118 1545217 1552635 1549897 1537076 1515218 1485938 1450670 1410685 1367627 1323434 1279618 1236911
57487 1236911 1195674 1156360 1119451 1085175 1053437 1023990 996712 971789 949606 930381 913952
57476 913952 899980 888242 878613 870838 864508 859320 855377 853208 853395 856062 860801 867164 875082 884584
57462H84584J0720J1407J2214J4039J7056K0631K4055K6995K9471L1780L4350
57451A117302L7261M0022M2151M3900M5879M8010M9295M8807M6548M3078L8564
57440A600817L2522K4501J4845M612n245j4349k2556k9487l4845l8921m2189m4408
57428A445297m4853m3557m1595l9791l7870l5364l2616l0208k7895k4976k1497
57417A065075j8288j5977j4549j3759j3283j2541j1028q973p142n985n245m405
57405I33900l184j669k82M92O41O72Q88R81O79M06P30J480K090K548L296M396
57389I48064N419O069O349O235N818N539N693N912N873O075P092Q316Q613Q082
57375A039149P944Q543Q800Q143P628Q362R777J0482J0122R424Q840Q247P835
$$ plain form
57462 884584 895304 906711 918925 932964 950020 970651 994706 1021701 1051172 1082952 1117302
57451 1117302 1154563 1194585 1236736 1280636 1326515 1374525 1423820 1472627 1519175 1562253 1600817
57440 1600817 1633339 1657840 1672685 1677297 1672052 1657703 1635147 1605660 1570815 1531894 1489705 1445297
57428 1445297 1400444 1356887 1315292 1275501 1237631 1202267 1169651 1139443 1111548 1086572 1065075
57417 1065075 1046787 1030810 1016261 1002502 989219 976678 965650 956677 949535 943550 938305 933900
57405 933900 930716 929047 928765 929257 929898 930570 931458 932439 933118 933524 934254 935734 937824 940372 943668 948064
57389 948064 953483 959552 965901 972136 977954 983493 989186 995098 1000971 1007046 1014138 1022454 1031067 1039149
57375 1039149 1047093 1055636 1064436 1072579 1080207 1088569 1098346 1108828 1118950 1128374 1137214 1145461 1153296
57362A153296Q254R617J1033J1544J1124J0483J0076R704R149Q880R624J1212
57350A273996J2393J2180J1078J0435J0780J1442J1682J1488J1074J0327R156
57339A396031P944P274P374P996Q627Q764Q316P794P786Q237Q625Q783R039R598
57325A512188J0327J1216J2356J3389J3683J3325J3280J4147J5360J6018J6006
57314A661295J5851J5979J6532J7441J8250J8275J7498J6837J7066J7855J8420
57303A851299J8699J9156J9727J9786J9203J8663J8807J9556K0499K1444K2376
57292B069215K3182K3764K4233K4718K5150K5370K5490K5813K6345K6615K6252
57281B346147K5660K5640K6239K6500K5679K4226K3005K1963K0389J8166J5896
$$ plain form
57362 1153296 1161550 1171167 1182200 1193744 1204868 1215351 1225427 1235131 1244280 1253160 1262784 1273996
57350 1273996 1286389 1298569 1309647 1320082 1330862 1342304 1353986 1365474 1376548 1386875 1396031
57339 1396031 1403975 1411249 1418623 1426619 1435246 1444010 1452326 1460120 1467906 1476143 1484768 1493551 1502590 1512188
57325 1512188 1522515 1533731 1546087 1559476 1573159 1586484 1599764 1613911 1629271 1645289 1661295
57314 1661295 1677146 1693125 1709657 1727098 1745348 1763623 1781121 1797958 1815024 1832879 1851299
57303 1851299 1869998 1889154 1908881 1928667 1947870 1966533 1985340 2004896 2025395 2046839 2069215
57292 2069215 2092397 2116161 2140394 2165112 2190262 2215632 2241122 2266935 2293280 2319895 2346147
57281 2346147 2371807 2397447 2423686 2450186 2475865 2500091 2523096 2545059 2565448 2583614 2599510
57270B599510J3778J1437R022P419O899O598N896N429N894O664O694O190O311
57257B697741P402Q736R814J0909J2101J2779J2531J1843J1469J1524J1636J1653
57245B830138J1894J2725J4034J5113J5182J4288J3439J3477J4017J4026J3308
57234B981641J2720J2855J3287J3396J3278J3299J3245J2535J1137R695Q788Q498
57222C124374Q635Q955R104Q781Q171P872Q119Q378Q018P234O840P184P708P742
57208C237115P322O931O816O924P234P657P738P060N895M988M604M263L491K319
57194C320357R19o58k149l000l120l212l940n069n961o534p193p940q248p871
57180C256381p325p350q103r019r284q563p344o467o153n812m916l790l158l148
$$ plain form
57270 2599510 2613288 2624725 2633747 2641166 2648065 2654663 2660559 2665988 2671882 2678546 2685240 2691430 2697741
57257 2697741 2705143 2713879 2723693 2734602 2746703 2759482 2772013 2783856 2795325 2806849 2818485 2830138
57245 2830138 2842032 2854757 2868791 2883904 2899086 2913374 2926813 2940290 2954307 2968333 2981641
57234 2981641 2994361 3007216 3020503 3033899 3047177 3060476 3073721 3086256 3097393 3107088 3115876 3124374
57222 3124374 3133009 3141964 3151068 3159849 3168020 3175892 3184011 3192389 3200407 3207641 3214481 3221665 3229373 3237115
57208 3237115 3244437 3251368 3258184 3265108 3272342 3279999 3287737 3294797 3300692 3305680 3310284 3314547 3318038 3320357
57194 3320357 3321276 3320618 3318469 3315469 3312349 3309137 3305197 3300128 3294167 3287633 3280440 3272500 3264252 3256381
57180 3256381 3249056 3241706 3233603 3224584 3215300 3206737 3199393 3192926 3186773 3180961 3176045 3172255 3169097 3165949
57166C165949l246l070k715k300j732j046o84j140k420l912m815m814m417m469
57152C125169n261o297p022p425p767q137q669r731j1415j3071j3949j4159j4409
57139B997857j4949j5311j5096j4354j3232j1802j0322r085p828n915l325q68
57127B875770Q35K092L494N007O131O637O701O591O660P453R250J1571J3502J4629
57113B976323J5436J6709J8892K2050K6304L2130M0231N1171O5105Q1831J01238
57102C447420J23824J50931J84520K26470K77837L38645M08434M86912N73857
57093F218850O68301P67940Q69354R68681J061862J144346J210672J254415J268380
57084A5432801J245008J177447J062098R01923P07798M95521K80013P1374j24530
$$ plain form
57166 3165949 3162703 3159633 3156918 3154618 3152886 3151840 3151156 3150016 3147596 3143684 3138869 3134055 3129638 3125169
57152 3125169 3119908 3113611 3106589 3099164 3091397 3083260 3074591 3064860 3053445 3040374 3026425 3012266 2997857
57139 2997857 2982908 2967597 2952501 2938147 2924915 2913113 2902791 2893706 2885878 2879963 2876638 2875770
57127 2875770 2876605 2878697 2882191 2887198 2893329 2899966 2906667 2913258 2919918 2927371 2936621 2948192 2961694 2976323
57113 2976323 2991759 3008468 3027360 3049410 3075714 3107844 3148075 3199246 3264351 3346182 3447420
57102 3447420 3571244 3722175 3906695 4133165 4411002 4749647 5158081 5644993 6218850
57093 6218850 6887151 7655091 8524445 9493126 10554988 11699334 12910006 14164421 15432801
57084 15432801 16677809 17855256 18917354 19819277 20527075 21022596 21302609 21373983 21249453
57075B1249453l03206m60350n93019p00731p85003q48390q94036r25165r44047
57066A4795506r51251r46253r28772q99475q59724q11156p55761o96130o35315
57057G311669n76180n20881m70888m27225l90192l58886l31541l06714k84007
57048C645155k63460k44613k26652k09208j92491j76768j62083j48442j35837
57039A885601j24047j12757j01917r1749q2400p3670o4999n5688m5499l4891k4047
57028A073937j1610L913K0223K9867K5373O518j8661m0435n4047o0114o0933n8270
57016H55761n3667m8717m4357m0596l7131l3803l0527k7304k4263k1473j8862
57005D75061j6589j5064j4330j3781j2945j2075j1499j0865r728q449p705p363
$$ plain form
57075 21249453 20946247 20485897 19892878 19192147 18407144 17558754 16664718 15739553 14795506
57066 14795506 13844255 12898002 11969230 11069755 10210031 9398875 8643114 7946984 7311669
57057 7311669 6735489 6214608 5743720 5316495 4926303 4567417 4235876 3929162 3645155
57048 3645155 3381695 3137082 2910430 2701222 2508731 2331963 2169880 2021438 1885601
57039 1885601 1761554 1648797 1546880 1455131 1372731 1299061 1234062 1178374 1132875 1097984 1073937
57028 1073937 1062327 1066240 1086463 1116330 1141703 1148221 1129560 1089125 1035078 974964 914031 855761
57016 855761 802094 753377 709020 668424 631293 597490 566963 539659 515396 493923 475061
57005 475061 458472 443408 429078 415297 402352 390277 378778 367913 358185 349736 342031 334668
56993C34668o711n690m988m742m097k413j99J629K862L856M586M515L323J302
56979C27901j107l803o822r769j1808j2373j1720j0647r609q358o501m181k026
56966B29177m63P54K245M294O433P965Q954J0400J3081J6365J8570J8454J5884
56953C52113J1261N104j575p225j0706j2046j1964j1029r595q024o512m950l368
56940B81484k197j685j366m88J273L861P196J1000J4589J7334J8968J9035J6549
56927C85553J0981L448l836r264j2625j4480j5489j6159j6562j6228j4863j3072
56915B67404j1779j1060j0258r160q257p726p000n737m506m031m166m107l365
56902A76252k162j043l33j4O2p2l64l81N14K348M322N823P196Q965J0744J1734
$$ plain form
56993 334668 327957 322267 317279 312537 308440 306027 305828 307457 310319 314175 318761 323276 326599 327901
56979 327901 326794 322991 316169 306400 294592 282219 270499 259852 250243 241885 235384 231203 229177
56966 229177 228714 229468 231713 236007 242440 250405 259359 269759 282840 299205 317775 336229 352113
56953 352113 363374 368478 366903 359678 348972 336926 324962 313933 304338 296314 289802 284852 281484
56940 281484 279287 277602 276236 275748 277021 280882 288078 299078 313667 331001 349969 369004 385553
56927 385553 396534 399982 396146 386882 374257 359777 344288 328129 311567 295339 280476 267404
56915 267404 255625 244565 234307 225147 216890 209164 202164 196427 191921 187890 183724 179617 176252
56902 176252 174090 173047 172714 172700 172762 172690 172326 171945 172459 174807 179129 184952 192148 201113 211857 223591
56886B23591J2052J2470J2877J2069R386N659K084j006l731n781o669o471n632
56873B60898m277k292M5K038L219L848M685O401R085J2327J5762J9379K3101K6341
56859C80560K8349K8689K6879K1946J3385K662p143j3681j6792j7590j6918j5265
56847D15081j3271j1507r905p943n216j665K495O824J1072J5690K1408K8179L5063
56834D86305M1263M6368M9105M6998L8319K4043P146r503k3931l4506m0202m1496
56822E89909m0147l7648l4395l0317k5604k0638j5674j0849o104j109M500J0730
56810C82654J7334K4162L0961L6782L9968L8846L2470K1144O800p390j8525k5549
56798E79657k9270l0909l0939k9256k6040k2230j9087j7208j5842j3600j0027
$$ plain form
56886 223591 235643 248113 260990 273059 282445 288104 290188 289182 285451 279670 273001 266530 260898
56873 260898 256621 254329 254374 256412 259631 263479 268164 274565 283650 295977 311739 331118 354219 380560
56859 380560 408909 437598 464477 486423 499808 502470 495327 481646 464854 447264 430346 415081
56847 415081 401810 390303 380398 372455 367239 365574 368069 374893 385965 401655 423063 451242 486305
56834 486305 527568 573936 623041 670039 708358 732401 739547 730044 706113 671607 631405 589909
56822 589909 549762 512114 477719 447402 421798 401160 385486 374637 368533 367424 371924 382654
56810 382654 399988 424150 455111 491893 531861 570707 603177 624321 631121 623731 605206 579657
56798 579657 550387 519478 488539 459283 433243 411013 391926 374718 358876 345276 335249
56787C35249o138l028m27K777O919J1250J5019J7824J8852J6805J1256L550m192
56774D25716j0673j5594j8849k0296k0289j9697j9076j8106j6242j3681j1341
56763B41872r862r009q208p398o950o903o770o142n138m127l349k970l072l371
56749A58603l304k715k145k053k068j501l72N51P43M75L33M65N15J52n03r31p90
56732A45455l24m9q8j26KO3j06l99p86j423k055j905o50R12J651J331O10J27J6
56713A42256Q5N0k11l09L19J407J715N15j218j841r93K54R12Q87M01m04j153j275
56695A41397o34L14J069J358R52r3j049j007N7J255J871J984J954J943K054K339
56679A55764K539K297J798J623J890K055J752J211P00J16n21p76l72L40Q35R46
$$ plain form
56787 335249 329111 326083 325656 328433 335352 346602 361621 379445 398297 415102 426358 429908 425716
56774 425716 415043 399449 380600 360304 340015 320318 301242 283136 266894 253213 241872
56763 241872 232010 223001 214793 207395 200445 193542 186772 180630 175492 171365 168016 165046 161974 158603
56749 158603 155299 152584 150439 148386 146318 144817 144445 144996 145739 146214 146547 147012 147527 147679 147176 146245 145455
56732 145455 145131 145082 144994 144868 144870 144933 144827 144428 143642 142219 140164 138259 137609 138521 140172 141503 142113 142240 142256
56713 142256 142341 142391 142180 141871 142190 143597 145312 145827 144609 142768 141775 142029 142941 143828 144229 143825 142672 141397
56695 141397 140763 141077 142146 143504 144456 144363 143314 142307 142364 143619 145490 147474 149428 151371 153425 155764
56679 155764 158303 160600 162398 164021 165911 167966 169718 170929 171629 171745 171224 170448 170076 170416 171251 172197
56663A72197P97N59N13R21J542J675J027J59j77J06N96J007J282J343J034L32
56647A84913o43j630k212k040j288o50o77j224j742j960k091k407k761k642j818
56632A59128p79k56k66p0O68J215Q03j36m89k2L86R0n03o66k19N09J115J258Q12
56613A62578K3o90j122j154n34O64J606J481P02M66J052J462R73J19k01Q9M89
56596A68003O64M80j37q89j067l27Q20J619J811J542J046O39O01P46N84J52J11
56579A76398O81J171R37L25O5K06K69R4J8L56J093J961K548K585K359K522L312
56562A96900M250M800M921M886M916N160N495N353M372L310L422M689N551M932
56548B62957L585K764K421J693M90m27p42r54j521k347l131l680l973m274n028
$$ plain form
56663 172197 172994 173553 174066 174987 176529 178204 179231 179390 179213 179319 179915 180922 182204 183547 184581 184913
56647 184913 184270 182640 180428 178388 177100 176450 175773 174549 172807 170847 168756 166349 163588 160946 159128
56632 159128 158349 158093 157827 157757 158425 159640 160443 160307 159818 159796 160182 160272 159769 159103 158884 159393 160508 161766 162578
56613 162578 162601 161911 160789 159635 159101 159765 161371 162852 163554 164020 165072 166534 167507 167626 167425 167514 168003
56596 168003 168667 169147 169010 168121 167054 166727 167547 169166 170977 172519 173565 174204 174805 175551 176135 176287 176398
56579 176398 177079 178250 179187 179512 179577 179783 180052 180146 180164 180520 181613 183574 186122 188707 191066 193588 196900
56562 196900 201150 205950 210871 215757 220673 225833 231328 236681 241053 244363 247785 252474 258025 262957
56548 262957 266542 269306 271727 273420 273910 273483 272741 271787 270266 267919 264788 261108 257135 252861 247833
56533B47833o259p361p825p805p557o813n329l644k605k325k252k029j733j451
56519A82845j164r69r33q78p03p11j160j753j988j755j221m15N70J299J392J003
56503A73459M64j43p15q67n61m57j019j698j725j272j035j040q03l93l30n08k42
56486A61115N58J166J157R22Q37O88K55j85l53m14o06p54m75L54J502K517K908
56469A71192K493J602P82L24K58N99J249J785J763J246P12N17P44J315J907K031
56453A90519J587J157J252J513J176K11o48r02o90k77K89Q82J233J248J033N47
56437B00130k81j127j435j104o09l42k66k73m53q57j298j589j679j536j111n45
56421A85625j58j60m75q47j059j068j038j083r94m53M07J048J269J438J789J934
$$ plain form
56533 247833 241574 234213 226388 218583 211026 204213 198884 195240 192635 190310 188058 186029 184296 182845
56519 182845 181681 180712 179779 178901 178198 177487 176327 174574 172586 170831 169610 169195 169765 171064 172456 173459
56503 173459 173923 173780 173065 172198 171637 171180 170161 168463 166738 165466 164431 163391 162588 162195 161865 161357 161115
56486 161115 161673 162839 163996 164918 165755 166443 166698 166513 166160 165746 165140 164386 163911 164265 165767 168284 171192
56469 171192 173685 175287 176069 176393 176651 177250 178499 180284 182047 183293 184005 184522 185266 186581 188488 190519
56453 190519 192106 193263 194515 196028 197204 197415 196767 195865 195175 194898 195187 196069 197302 198550 199583 200130
56437 200130 199849 198722 197287 196183 195574 195232 194966 194693 194240 193383 192085 190496 188817 187281 186170 185625
56421 185625 185467 185307 184832 183985 182926 181858 180820 179737 178743 178290 178697 179745 181014 182452 184241 186175
56405A86175J548J041R81J263J373J217J086R92O79K20N1M03J041J591J791J642
56389B03094J474J722K322K635K237J478R33O48L67P9l2M1K34N48P56M29l82r86
56371B17597r34n87l71j43K43L79K3k61Q6P29J138J507K119K389J623L21l45r2
56353B25421L93O29P16P47P21Q66J270J504J338J334J933K501K344K001K331K856
56337B48905K487J463J072J573J959J751J474J293O82k27m63K17Q41P59M84O08
56321B64878R51J217J480J608J204N12L46Q69J349J456J739K437K891K622K034
56306B87593J627J407J474K183L315L998L975L972M425M726M337L675L327L190
56292C33224K976K817K771K489J850J316J164J094R53J146J793K288K200J964
$$ plain form
56405 186175 187723 188764 189745 191008 192381 193598 194684 195676 196355 196575 196626 197029 198070 199661 201452 203094
56389 203094 204568 206290 208612 211247 213484 214962 215895 216543 216910 216989 216957 216998 217232 217780 218536 218965 218583 217597
56371 217597 216663 216076 215705 215562 215805 216184 216207 215946 216032 216761 217899 219406 221525 223914 225537 225858 225513 225421
56353 225421 225814 226443 227159 227906 228627 229493 230763 232267 233605 234939 236872 239373 241717 243718 246049 248905
56337 248905 251392 252855 253927 255500 257459 259210 260684 261977 262659 262432 261969 262186 263027 263786 264270 264878
56321 264878 265829 267046 268526 270134 271338 271850 272196 273065 274414 275870 277609 280046 282937 285559 287593
56306 287593 289220 290627 292101 294284 297599 301597 305572 309544 313969 318695 323032 326707 330034 333224
56292 333224 336200 339017 341788 344277 346127 347443 348607 349701 350654 351800 353593 355881 358081 360045
56278C60045K158K730L448M385N450O037N738N022M714N177O273P663Q939R884
56264D37663J0815J2176J3768J5030J6060J7600J9850K2195K4223K6233K8459
56253F44072L0636L2526L4158L5321L5592L5055L4166L2898L0894K8505K6566
56242A000389K4948K2523J8868J4884J1365Q097M828J982k10k207m249n926p291
56229A088001r245j2143j5010j7004j8768k1345k4457k6817k7719k7560k7092
56218H60841k6778k6641k6335k5495k4182k2736k1275j9844j8856j8684j8846
56207F11169j8354j6840j4602j1897r021o771n640m836l374j790j310j617j228
56194E13889m2M31m04j320j359r42m74M03J495J893J723K289L721M361L364K097
$$ plain form
56278 360045 362203 364933 368381 372766 378216 384253 389991 395013 399727 404904 411177 418840 427779 437663
56264 437663 448478 460654 474422 489452 505512 523112 542962 565157 589380 615613 644072
56253 644072 674708 707234 741392 776713 812305 847360 881526 914424 945318 973823 1000389
56242 1000389 1025337 1047860 1066728 1081612 1092977 1101074 1105902 1107884 1107674 1105467 1101218 1095292 1088001
56229 1088001 1078756 1066613 1051603 1034599 1015831 994486 970029 943212 915493 887933 860841
56218 860841 834063 807422 781087 755592 731410 708674 687399 667555 648699 630015 611169
56207 611169 592815 575975 561373 549476 540455 533684 528044 523208 519834 518044 516734 515117 513889
56194 513889 513847 514278 513874 512554 511195 510253 509779 510182 511677 513570 515293 517582 521303 525664 529028 531125
56178E31125J998K800L793M998N976N545L960L541N563Q230R275R011R023R459
56164F14297R528R502J0209J1408J2384J3441J5224J7317J8918K0242K1995K4192
56152G98657K6682L0020L4606L9871M5453N2268O1276P2172Q4442R8580J14813
56141A458840J31456J45662J54881J56762J49277J32793J11284R0101P3075O2352
56131B666483N8936O1144O3604O0225M8557L0653J0725o850j8593k3464k3755
56120B927665k3732k7511l8167n6929q1710j07280j28282j41850j47172j44445
56110B030587j35374j23098j10049r6758q3471p1324o0896n1350m2362l5103l0017
56099A190785k5487k0235j5216j1561q557n422l094k235j441M91K464L366M491
$$ plain form
56178 531125 533123 535923 539716 544714 550690 556235 560195 563736 569299 577529 586804 595815 604838 614297
56164 614297 623825 633327 643536 654944 667328 680769 695993 713310 732228 752470 774465 798657
56152 798657 825339 855359 889965 929836 975289 1027557 1088833 1161005 1245447 1344027 1458840
56141 1458840 1590296 1735958 1890839 2047601 2196878 2329671 2440955 2531056 2604131 2666483
56131 2666483 2725419 2786563 2850167 2910392 2958949 2989602 3000327 2993477 2974884 2951420 2927665
56120 2927665 2903933 2876422 2838255 2781326 2699616 2592336 2464054 2322204 2175032 2030587
56110 2030587 1895213 1772115 1662066 1565308 1481837 1410513 1349617 1298267 1255905 1220802 1190785
56099 1190785 1165298 1145063 1129847 1118286 1109729 1104307 1101213 1098978 1097537 1098028 1100492 1103858 1108349
56086A108349P187J0009J0919J0679J1333J2731J3385J3455J4057J4770J4495
56075A241369J3698J3263J2356J0104Q113Q423J0080J0610R869R571J0029J0339
56063A367824J0919J2820J5146J6115J6041J6612J7864J8559J8882J9997K1571
56052A552350K2411K2834K3899K5064K5203K5103K6228K7993K8845K9107L0058
56041A839095L1249L1537L1732L3348L5800L7538L8864M0800M2558M3108M3785
56030B249414M6227M9124N0281N0430N1674N3616N4641N5486N7889O1127O3487
56019B843396O5731O9358P3094P5020P6406P9533Q3463Q6157Q8756R3287R8214
56008C732415J01081J03512J08523J14827J19265J22986J29492J38236J45973
$$ plain form
56086 1108349 1115536 1125545 1136464 1147143 1158476 1171207 1184592 1198047 1212104 1226874 1241369
56075 1241369 1255067 1268330 1280686 1290790 1298903 1307326 1317406 1328016 1337885 1347456 1357485 1367824
56063 1367824 1378743 1391563 1406709 1422824 1438865 1455477 1473341 1491900 1510782 1530779 1552350
56052 1552350 1574761 1597595 1621494 1646558 1671761 1696864 1723092 1751085 1779930 1809037 1839095
56041 1839095 1870344 1901881 1933613 1966961 2002761 2040299 2079163 2119963 2162521 2205629 2249414
56030 2249414 2295641 2344765 2395046 2445476 2497150 2550766 2605407 2660893 2718782 2779909 2843396
56019 2843396 2909127 2978485 3051579 3126599 3203005 3282538 3366001 3452158 3540914 3634201 3732415
56008 3732415 3833496 3937008 4045531 4160358 4279623 4402609 4532101 4670337 4816310
55999D816310J52919J61642J71318J79246J86632J96766K08816K19659K30284
55990F523592K43982K59946K75305K91615L12295L35688L58068L81361M10014
55981I391866M42517M74535N08092N48673N95466O44083O96753P59712Q32714
55972A4894411R11807J000162J104997J226314J360793J514107J696687J910915
55964B5620193K156889K447490K802362L231365L741600M356199N106291O009155
55956E5471544P076351Q338196R836922J1606611J3692917J6182555J9170015
55949A41375111K2686716K6649416L0735674L4094454L5178205L2226281K4400102
55942C47345959J2683844l89545j2061720k0613778k5692751k7834862k7869382
$$ plain form
55999 4816310 4969229 5130871 5302189 5481435 5668067 5864833 6073649 6293308 6523592
55990 6523592 6767574 7027520 7302825 7594440 7906735 8242423 8600491 8981852 9391866
55981 9391866 9834383 10308918 10817010 11365683 11961149 12605232 13301985 14061697 14894411
55972 14894411 15806218 16806380 17911377 19137691 20498484 22012591 23709278 25620193
55964 25620193 27777082 30224572 33026934 36258299 39999899 44356098 49462389 55471544
55956 55471544 62547895 70886091 80723013 92329624 106022541 122205096 141375111
55949 141375111 164061827 190711243 221446917 255541371 290719576 322945857 347345959
55942 347345959 360029803 359640258 347578538 326964760 301272009 273437147 245567765
55935B45567765k6588450k4618381k2369825k0065976j7828267j5733536j3818268
55928A04545062j2086425j0538627r180282q002409o978884o087970n319370m659019
55920D1692076m085469l584582l152570k782169k459597k176746j933228j724691
55912A9793024j541023j377335j235451j113280j003549r04020q18555p46785
55904A1053026o82243o22032n69119n23916m82276m43010m09128l80442l52711
55895F588149l25177l01463k82026k62942k43151k25818k11587j97247j82092
55886D356646j68952j57977j46004j33280j24446j21291j20299j18578j16655
55877C149164j14288j09227j01857r5973r3262r1425q8738q5990q3075p8372p2450
$$ plain form
55935 245567765 218979315 194360934 171991109 151925133 134096866 118363330 104545062
55928 104545062 92458637 81920010 72739728 64737319 57758435 51670465 46351095 41692076
55920 41692076 37606607 34022025 30869455 28087286 25627689 23450943 21517715 19793024
55912 19793024 18252001 16874666 15639215 14525935 13522386 12618366 11799811 11053026
55904 11053026 10370783 9748751 9179632 8655716 8173440 7730430 7321302 6940860 6588149
55895 6588149 6262972 5961509 5679483 5416541 5173390 4947572 4735985 4538738 4356646
55886 4356646 4187694 4029717 3883713 3750433 3625987 3504696 3384397 3265819 3149164
55877 3149164 3034876 2925649 2823792 2727819 2634557 2543132 2454394 2368404 2285329 2206957 2134507
55866B134507o8016o5310o1785n7069n3726n2410n0652m7336m4141m1671l8349
55855A554042l4106l1071k9735k8254k6344k5879k6957k7360k6708k7130k8966
55844A241532k9793k8714k7661k7452k6399k4080k2576k2671k2378k0603j8926
55833I70279j8352j7593j5878j4334j3318j1495q762p012o873o593n378m750n412
55820H34529n775m968m351m671m562l381k887m464o971q852j0240j1722j3066
55807G48619j4224j5650j6816j6419j4820j3970j4312j4120j2580j1064j0471
55796E94173r892q873q539r325r812q983p489n751k941J141N056P460Q062O413
55782E50700K002l788q106r841j0441j1125j1587j1760j2284j2585j1192q677
$$ plain form
55866 2134507 2066491 2001181 1939396 1882327 1828601 1776191 1725539 1678203 1634062 1592391 1554042
55855 1554042 1519936 1488865 1459130 1430876 1404532 1378653 1351696 1324336 1297628 1270498 1241532
55844 1241532 1211739 1183025 1155364 1127912 1101513 1077433 1054857 1032186 1009808 989205 970279
55833 970279 951927 934334 918456 904122 890804 879309 870547 863535 856662 850069 844691 839941 834529
55820 834529 828754 823786 819435 814764 810202 806821 803934 799470 792499 783647 773407 761685 748619
55807 748619 734395 718745 701929 685510 670690 656720 642408 628288 615708 604644 594173
55796 594173 584281 575408 566869 557544 547732 538749 531260 525509 522568 523709 528765 536225 544287 550700
55782 550700 552702 548914 540808 530967 520526 509401 497814 486054 473770 461185 449993 441316
55770D41316p482q058q048o330m819m898n038l715k053j623j953k090k518l722
55756C78969m851n485o825r414j1675j2471j3053j4649j5951j5130j2706j0412
55744B46347q530o413m421l381k960k278j419r67q13o01m83m88r0O85Q57P6o51
55727B14470o23n27j007j596j947k619l690m121l583l253l749l926k977j987k024
55712A76841k300j795j146j265j433n72P90J424J344J261J070L47n35j133j897
55697A71001l091l736l042j917j743k371k700k381j712o18R49K283K785K926L297
55682A59930L450K698J307m9j145j723j180K80J318J315J389K451L576L629L249
55667A80495L582M085L416J740M05k13q80j844k549k806l012l276l400l553l979
$$ plain form
55770 441316 433834 425776 417728 411398 406579 401681 396643 392928 390875 389252 387299 385209 382691 378969
55756 378969 374118 368633 361808 352394 340719 328248 315195 300546 284595 269465 256759 246347
55744 246347 237817 231404 226983 223602 220642 218364 216945 215978 215165 214564 214081 213593 213503 214188 215045 215121 214470
55727 214470 213847 213320 212313 210717 208770 206151 202461 198340 194757 191504 187755 183829 180852 178865 176841
55712 176841 174541 172746 171600 170335 168902 168330 169120 170544 171888 173149 174219 174566 174031 172898 171001
55697 171001 167910 164174 161132 159215 157472 155101 152401 150020 148308 147690 148639 150922 153707 156633 159930
55682 159930 163380 166078 167385 167336 166191 164468 163288 163568 164886 166201 167590 170041 173617 177246 180495
55667 180495 184077 188162 191578 193318 193723 193510 192630 190786 188237 185431 182419 179143 175743 172190 168211
55652A68211m303l959l082k173j286k38P37J329J688K027K205K242K656L662M661
55637A74377N095N173N180M861M001K867J539k14k020k922k863k973l713m090
55623A84298l540l015l250l317k277r29m56m95o9N13K66p36j777k969m766o553
55607A50928p187o609n743n129m718m580m739m775m426m087l973l527k512j751
55593H7172j883k291k251k106k229j965r49l19j083k240k195j127l15J35J010
55578F7364K060K252J682J457J834K006J748J699K102K473K535K331J607J91j247
55563I2094j862j828j827j943k038k610l900m789m158k791k319k703k538j607
55549E5181j207j844k385j913r57m09m26q30j482j979j830j243q95r04p89l78
$$ plain form
55652 168211 163908 159949 156867 154694 153408 153170 153907 155236 156924 158951 161156 163398 166054 169716 174377
55637 174377 179472 184645 189825 194686 198687 201554 203093 202879 200859 197937 195074 192101 188388 184298
55623 184298 180758 177743 174493 171176 168899 167970 167514 167019 166950 167463 167729 166993 165216 162247 157481 150928
55607 150928 143741 137132 131389 126260 121542 116962 112223 107448 103022 98935 94962 91435 88923 87172
55593 87172 85289 82998 80747 78641 76412 74447 73498 73179 72096 69856 67661 66534 66219 66354 67364
55578 67364 69424 71676 73358 74815 76649 78655 80403 82102 84204 86677 89212 91543 93150 93341 92094
55563 92094 90232 88404 86577 84634 82596 79986 76086 71297 67139 64348 62029 59326 56788 55181
55549 55181 53974 52130 49745 47832 46875 46466 46040 45210 43728 41749 39919 38676 37781 36877 36088 35710
55533C5710J22P60J574J920J151j87r15q56p91r21o60N0M48J86j72j14K49O85
55515C8239J087J172P55L20N46J270J721J643J414J305J344J719K407K807K645
55500F0394K752L880N211N319M281L454L380L375L053K717K150N73j786l440l534
55485I1779k941l019m108n587o630o577n338l717k755k668k920l127l204k878
55471C6310j969j021p51j017j192j224j359j195k57P57O01o71j753j898j520j037
55455B0804m56j16n07j192j140l43J40o5j91J98N63N71O42R27Q64K48k82k84m2
55436B0339K57Q88J700J869J005k22r85j063n82J83N96J19p22q09L3P61O07p0
55418B3904o04p41l54O05J654K084J865J486R66J3r68j174p07m14m28j36L39R3
$$ plain form
55533 35710 35832 36592 38166 40086 41237 41050 40135 39279 38488 37567 36907 36957 37405 37591 37419 37305 37554 38239
55515 38239 39326 40498 41253 41573 42119 43389 45110 46753 48167 49472 50816 52535 54942 57749 60394
55500 60394 63146 67026 72237 77556 81837 85291 88671 92046 95099 97816 99966 100539 98753 95313 91779
55485 91779 88838 85819 81711 76124 69494 62917 57579 53862 51107 48439 45519 42392 39188 36310
55471 36310 34341 33320 32569 31552 30360 29136 27777 26582 26325 27082 27683 27012 25259 23361 21841 20804
55455 20804 20348 20232 19725 18533 17393 17050 17190 17125 16934 17132 17695 18266 18908 19835 20699 20947 20665 20381 20339
55436 20339 20596 21484 23184 25053 26058 25836 24851 23788 23206 23389 23985 24104 23382 22573 22606 23367 23974 23904
55418 23904 23300 22559 22205 22810 24464 26548 28413 29899 30865 30878 29910 28736 28029 27615 27187 27051 27390 27483
55400B7483q93j506j241q32p47m70J85N19K74J98N87N81k80j042p45J58O58N52
55382B3439K09j92n04m85l63o74j176r16J44P47J93o27p17l27q3R8L39J58n79
55363A8684j019o01m5j43m76l07J31J91l7j31j82l56k70K94P39N17K0j76k36m80
55343A6117o52o05q42j504j709q45K65N30J46r7k37o34q09j27Q52J068N91L42
55325A1850N00M90K63K96M22Kp49q22j6O02J65r18j585j259j05J181J766J338
55307A3421M95J16L77P93R96J015R29P59O32N98M75K14O3P8j40p15j063p35k53
55288A8055l18o54m93J16L95J15r6K06O37N65j91j300k128k102j239j54O41J185
55270A3240J507J156j7j056p82N94J584J175j30j124j183n65J50O21Q80R48M87
$$ plain form
55400 27483 26590 25084 23843 23011 22264 21794 21979 22498 22772 22970 23557 24138 23858 22816 22071 22229 22887 23439
55382 23439 23648 23456 22952 22467 22104 21430 20254 19338 19482 20229 20422 19795 19078 18751 18668 18766 19105 19263 18684
55363 18684 17665 17064 17019 16876 16400 16093 16224 16415 16378 16247 16065 15709 15439 15733 16472 16989 17009 16833 16597 16117
55343 16117 15465 14860 14018 12514 10805 9960 10225 10755 10901 10804 10567 9933 9124 8997 9849 10917 11508 11850
55325 11850 12350 12840 13103 13399 13821 13823 13074 12252 12236 12838 13003 12085 10500 9241 9136 10317 12083 13421
55307 13421 13916 14032 14409 15202 16198 17213 18142 18901 19533 20131 20606 20820 20883 20961 20821 20106 19043 18308 18055
55288 18055 17737 17083 16590 16706 17101 17216 17120 17326 17963 18528 18337 17037 14909 12807 11568 11414 12055 13240
55270 13240 14747 15903 15886 14830 14048 14642 16226 17401 17271 16147 14964 14399 14549 15170 16050 16998 17485
55253A7485p23j996k054n85J156J807J400Q35M31p5n42m67N8L01n2n09o08m72
55235A5390l84l33k31j98l20m39l62j27M6N3N0K77O75P83K78m90q98q94r34j082
55215A0860q08N7Q95J134R76Q76Q52P25N99N84N08K83J33R9j23n16m87J66O84
55196A7497L86k79m06K8K70p4o96j131j094n17L47R51J031Q39O20K52k98o80p05
55177A6341n94m23P1P28Q54L11p6K37O73N80K68K42K70N9j9K63K60m51j099q96
55157A7599l45k46k41K71O54K1r60r66j81J68J0L54J165J275M72j79k99p22j573
55138A6277j671n28O30O85J77J39M91M96k4p66j454j680r67M49J511J573J031
55121A6369M81L0j73K69J148J464P22k63m05L85J456K196K208J416M62K94R51
$$ plain form
55253 17485 16762 14766 12712 12127 13283 15090 16490 17325 17756 17681 17139 16672 16730 17031 16979 16470 15862 15390
55235 15390 15006 14673 14442 14244 13924 13485 13123 12996 13042 13095 13145 13422 14097 14880 15158 14668 13770 12876 11942 10860
55215 10860 10052 10109 11004 12138 13114 13990 14842 15567 16166 16750 17258 17541 17674 17773 17650 17134 16647 16813 17497
55196 17497 17883 17604 17198 17226 17496 17422 16726 15595 14501 13984 14331 15282 16313 17152 17772 18024 17726 17046 16341
55177 16341 15747 15324 15395 16123 16977 17288 17212 17449 18122 18702 18970 19212 19482 19541 19522 19785 20045 19594 18495 17599
55157 17599 17254 17008 16767 17038 17692 17713 16753 15787 15606 15774 15784 16138 17303 18578 19050 18871 18572 17850 16277
55138 16277 14606 14078 14708 15393 15570 15709 16200 16696 16672 15906 14452 12772 11805 12254 13765 15338 16369
55121 16369 16850 16880 16707 16976 18124 19588 20310 20047 19642 20027 21483 23679 25887 27303 27765 28059 29010
55104B9010J503J468J362J418J012j3n52J43J001N24j058k208k238j792j435j020
55088B7125m53j5J95M10N80L21l96j089j417j430j119k59J025K000J942Q70n13
55071B7777j428j581j221p58l39R0M03K93j74m39j22M34O61N54N44P48Q19N12
55053B6773om76p63p22j74O82J130N55p12j571j307l55L60O06Q30J128R78K89
55035B7245m3O56J605J468K14q28p85j38L11N26Q71J292J429J134N46j0j2Q74
55017C6355K137K636J847M49o22j248j745k024j673p30K64Q56J003Q15M24P0l0
55000C8784J15L11M31M77M52L15L7l55o63n90q8L80K73l55r35j142j109q72k05
54981C5261P40J213P09l20r84r67n84j59K39N73P95R10Q70N61J61K29J072K144
$$ plain form
55104 29010 30513 31981 33343 34761 35773 35760 35208 35351 36352 36876 35818 33610 31372 29580 28145 27125
55088 27125 26672 26657 26852 27262 27842 28163 27767 26678 25261 23831 22712 22453 23478 25478 27420 28290 27777
55071 27777 26349 24768 23547 22789 22450 22540 22943 23236 23062 22623 22501 22935 23596 24150 24694 25442 26261 26773
55053 26773 26767 26291 25528 24806 24632 25314 26444 26999 26287 24716 23409 23054 23414 24020 24850 25978 26956 27245
55035 27245 27202 27858 29463 30931 31145 30317 29532 29394 29705 30231 31102 32394 33823 34957 35503 35493 35481 36355
55017 36355 38492 41128 42975 43424 42802 41554 39809 37785 36112 35382 35646 36502 37505 38320 38744 38814 38784
55000 38784 38899 39210 39641 40118 40570 40885 40922 40567 39904 39314 39226 39606 39879 39524 38589 37447 36338 35466 35261
54981 35261 36001 37214 37923 37603 36619 35652 35068 34909 35148 35721 36516 37426 38296 38857 39018 39247 40319 42463
54963D2463K526J951R72J77l08n93p05o62n83n19l84j79j07k54k99J91J174K047
54945D6908K285K054J981K423L217M143N264O608P842Q605R072R679J0412J0677
54931A31170J0019Q548O602M264J477j621m650p218r010r827r731r123q507q102
54917I4291p671o855n671m593m048l893l648l187k836k676k232j180n7K62k98
54902D5708q56n65O08K119L513M652N534O117O399O603P091P931Q728R089R094
54887A21765Q880P980N763K607k68k387m524p172r402j0124r662r077q555p584
54873G8240o340n625n533n299m551l677k927k109j314r42q70m56L60Q55O39J89
54857D0640K4J05K95O01P51L25m83r42q72q63j191j375j115q47r07j040j034j067
$$ plain form
54963 42463 44989 46940 47912 48089 47781 47188 46483 45821 45238 44719 44335 44156 44049 43795 43496 43687 44861 46908
54945 46908 49193 51247 53228 55651 58868 63011 68275 74883 82725 91330 100402 110081 120493 131170
54931 131170 141189 149737 156339 160603 162080 160459 155809 148591 139581 129754 120023 110900 102393 94291
54917 94291 86620 79765 74094 69501 65453 61560 57912 54725 51889 49213 46981 45801 45744 46006 45708
54902 45708 44852 44287 44895 47014 50527 55179 60713 66830 73229 79832 86923 94854 103582 112671 121765
54887 121765 130645 138625 144388 146995 146727 144340 139816 132644 123242 113118 103456 94379 85824 78240
54873 78240 71900 66275 60742 55443 50892 47215 44288 42179 40865 39923 39053 38597 38957 39812 40451 40640
54857 40640 40664 40769 41064 41665 42416 42741 42258 41316 40444 39581 38390 37015 35900 35053 34146 33106 32072 31005
54839C1005j040m88M15P23J59l24o0K52j72p83o68j55j98p37q87m97k62l36j5
54820B5932R56J763J606O97j81o47q35q98q10n97m32l74j45N69J477J715R33%
54802C0729M8R36J511J340J205J628K008J736J294J468K078K397K295K237K474
54787E5384K881L384L983M579N190O036P020P675Q006Q713R954J0599R502P020
54773A49926M369J958o10l267n318o485p090p211o584n463m654m452m255l531
54759I7333k562j912j643j351p11K31J076J444J476J890L176M944O413P328P923
54744A25055Q228P985P209O296N486M682L842L186K972L239L703L687K493K18
54730A88281k097l581m504n660p213q719r963j0983j1442j0881r541q179p054
$$ plain form
54839 31005 29965 29477 29892 30615 30774 30450 30390 30642 30470 29687 29019 28864 28666 27929 27042 26545 26283 25947 25932
54820 25932 26888 28651 30257 30954 30773 30126 29291 28393 27583 26986 26554 26180 26035 26604 28081 29796 30729 30729
54802 30729 30777 31713 33224 34564 35769 37397 39405 41141 42435 43903 45981 48378 50673 52910 55384
54787 55384 58265 61649 65632 70211 75401 81437 88457 96132 104138 112851 122805 133404 142906 149926
54773 149926 154295 156253 155643 152376 147058 140573 133483 126272 119688 114225 109571 105119 100864 97333
54759 97333 94771 92859 91216 89865 89154 89385 90461 91905 93381 95271 98447 103391 109804 117132 125055
54744 125055 133283 141268 148477 154773 160259 164941 168783 171969 174941 178180 181883 185570 188063 188281
54730 188281 186184 182603 178099 172439 165226 156507 146544 135561 124119 113238 103697 95518 88464
54717H8464n815m461l559l354l365l147k806k491k008j274o66n05o20p22q27j031
54701E1813j202j184j008p10k38K58M36K44J18L28N17K65j52n1O52J196Q83k1
54683E2144n72k19O16J118J078R78J213J502J374Q32L43J98K93L86L42P7m10q95
54665F0398j013o49j58k1k82m43o5N84Q33N95O06J355K225K283J632J158J182
54648G0220J241J297J972L339M479M811M962N689O784P833R166J1113J2975J3786
54634A59667J3639J3229J2409J0367P007L235j66l088n581p635r424j1017j1909
54621A70733j1573j0380r215q293p161n764m623l938l421l058l177l685l999l932
54607H8514l909m128m255m039l556k714j341J18P46L15m29q32r78j039p70j03
$$ plain form
54717 88464 82649 78188 74629 71275 67910 64763 61957 59466 57458 56184 55518 55013 54393 53671 52844 51813
54701 51813 50611 49427 48419 47709 47471 47729 48165 48409 48527 48855 49372 49637 49485 49434 50086 51282 52165 52144
54683 52144 51572 51353 51969 53087 54165 55143 56356 57858 59232 60064 60407 60605 60898 61284 61626 61703 61293 60398
54665 60398 59385 58736 58578 58557 58275 57832 57767 58351 59184 59779 60385 61740 63965 66248 67880 69038 70220
54648 70220 71461 72758 74730 78069 82548 87359 92321 98010 104794 112627 121793 132906 145881 159667
54634 159667 173306 186535 198944 209311 216318 219553 219387 216299 210718 203083 193659 182642 170733
54621 170733 159160 148780 139565 131272 124111 118347 113724 109786 106365 103307 100130 96445 92446 88514
54607 88514 84605 80477 76222 72183 68627 65913 64572 64690 65436 65751 65322 64490 63512 62473 61703 61600
54591F1600M44L91j03o22j020j300j381j238r43m35L41J019J120P73N71O18L86
54574F0221k60p37o68m22m48o54q21r44q80k76O78J070M13n88r15n27k21m86j017
54555E2518j229q65j92K17N4l17k47M04J182J749K161K451K421K000J380O95P4
54538F4456m9O81J843K542K599K633K932L059K867K961L718M600N032N183N388
54523A10445N422N019M466M051L313J623q41l146m509m761m339m053m466n206
54509A03018n358m691l872l238k347j103m05q51j683j871j539j400j388r32j79
54494G2161J54j00m89q05j179j471j373r98o66k67M05R76R72P17Q99J407J508
54477G1851J026M84J08l58q60j038r79j021p49O59K808L969L153J309j19q76j368
$$ plain form
54591 61600 62044 62435 62332 61710 60690 59390 58009 56771 55828 55393 55734 56753 57873 58646 59217 59835 60221
54574 60221 59961 59224 58556 58134 57686 57032 56211 55267 54387 54111 54789 55859 56272 55684 54769 54242 54021 53535 52518
54555 52518 51289 50424 50232 50449 50503 50186 49939 50343 51525 53274 55435 57886 60307 62307 63687 64382 64456
54538 64456 64407 65088 66931 69473 72072 74705 77637 80696 83563 86524 90242 94842 99874 105057 110445
54523 110445 115867 120886 125352 129403 132716 134339 133498 130352 125843 121082 116743 112690 108224 103018
54509 103018 97660 92969 89097 85859 83512 82409 82004 81153 79470 77599 76060 74660 73272 72340 72161
54494 72161 72315 72215 71726 70921 69742 68271 66898 65900 65234 64967 65372 66348 67320 68037 68936 70343 71851
54477 71851 72877 73361 73469 73111 72251 71213 70234 69213 68464 69123 71931 75900 79053 80362 80243 79367 77999
54460G7999j418o10N81J169J002P85Q18O11o1o09n20j90l04q02j051q45n94n80
54442G5381n60l28j63l53o46o38m25l78m43l09j54n20j274j516q83k16l50q61
54424F5364p41M6N56K94j91j90L39J032J632J980J885J332O14Q8o3K06Q02J425
54406G6410J699J531J133P51M81L80M75O23N99L85K04K67N51Q28P38m1j404k679
54388H2931l076k431j272k27M30P00O08K49j15k85l27n10r90j612k004j865j152
54371F9052j08Q33J173O70l23r46o34K43Q27P61L87k7o28j372j699j195k28N80
54353F7366J146J746K271K292J803J398J548K053K315J913Q83l71j347j751j622
54338H1643j194p82p02j079j624j868j759j740k103k548k588k115j349n36R1L43
$$ plain form
54460 77999 76581 75971 76552 77721 78723 79508 80326 80937 80876 80267 79747 79557 79253 78451 77400 76555 75961 75381
54442 75381 74821 74493 74330 73977 73331 72693 72268 71890 71447 71138 70984 70464 69190 67674 66791 66575 66225 65364
54424 65364 64623 64669 65225 65519 65328 65138 65477 66509 68141 70121 72006 73338 73952 74040 73977 74183 74985 76410
54406 76410 78109 79640 80773 81524 82005 82385 82860 83483 84082 84467 84671 84938 85489 86317 87055 87014 85610 82931
54388 82931 79855 77424 76152 75925 76355 77055 77663 77912 77797 77512 77185 76675 75685 74073 72069 70204 69052
54371 69052 68944 69777 70950 71620 71297 70351 69717 69960 70787 71548 71935 71908 71280 69908 68209 67014 66786 67366
54353 67366 68512 70258 72529 74821 76624 78022 79570 81623 83938 85851 86734 86363 85016 83265 81643
54338 81643 80449 79667 78965 77886 76262 74394 72635 70895 68792 66244 63656 61541 60192 59656 59747 60090
54322F0090L13K94L41K10r5k30j91n18j405k171k157j625j161o96O1O49L47n55
54304E1501r71n44o8j81n10m35LL48L98K41l2l34n64p25q67q42m78J5K10Q7O5
54283D6317K88M08K17LK9M4k73o92o35L5P82R79O24L10N40J118J429J204P36K37
54263E3700m01j043j084l23M66M75k6k50j59k51l99K7Q67J208Q56O48R70J095
54245E6376N32pK10O78M77l04q81r68p69k44O75J349R32l83j510j780j431q19
54227E2133p6M04K9j023j609q91P37K262L169L419K909J591m1j191j543j465j442
54210E7372j617j812j690r41L09J300J244K92n57o69m99p07j067q35K8O74N22
54193E1347p8n63r35j417j824j771j344r51p12m02N7M21M97L04p2m65n85l13m
$$ plain form
54322 60090 60403 60697 61038 61248 61153 60923 60732 60214 58809 56638 54481 52856 51695 50999 51060 51709 52056 51501
54304 51501 50530 49986 49918 49737 49227 48792 48795 49143 49541 49782 49750 49416 48852 48127 47260 46418 45940 45955 46165 46252 46317
54283 46317 46605 47013 47230 47233 47262 47306 47033 46341 45706 45741 46523 47502 48126 48436 48976 50094 51523 52727 53463 53700
54263 53700 53299 52256 51172 50849 51315 51790 51764 51514 51355 51104 50705 50732 51599 52807 53663 54311 55281 56376
54245 56376 56908 56901 57111 57789 58266 57962 57081 56113 55344 55100 55775 57124 58056 57673 56163 54383 52952 52133
54227 52133 52057 52461 52490 51467 49858 48967 49704 51966 55135 58554 61463 63054 63013 61822 60279 58814 57372
54210 57372 55755 53943 52253 51312 51621 52921 54165 54457 53900 53231 52732 52025 50958 50123 50151 50825 51347
54193 51347 51269 50706 49771 48354 46530 44759 43415 42464 41752 41350 41407 41828 42325 42629 42557 42092 41507 41194 41190
54174D1190l4j61J68Q33J016L46n17p55m82m05p71j083q47j52N66R69R70O11p
54155D1455o51r34n20M54J297J338O73L8r5j3j98o08q34p43n27k02M88J501K270
54136D4189K281J680R95M23k45j016j473j378j115j178j473j515j156o56j32M78
54120C8709Q49M02p46j549j215j52P42J275J829K377K411J771R08K44j68l98m70
54103D6819m55l40J29R60J443Q63l28q71l76K34J93k5L84J195J543J236R01R70
54085E4475J162J067O74K50m1k16l75n25m57O5Q71J360J100L45l17o84r81j263
54067E6510j162l77Q04J656J704J198Q15R08J140R99N70M16O98P97J24r58j401
54050F4441o74O76J725K135K277K584L070L480L642L593L459L386L533L886M195
$$ plain form
54174 41190 41156 40995 41163 41996 43012 43358 42841 42086 41604 41199 40428 39345 38498 38346 38912 39881 40851 41462 41455
54155 41455 40804 39870 39350 39804 41101 42439 43112 43150 43055 43042 42844 42236 41402 40659 40132 39930 40418 41919 44189
54136 44189 46470 48150 49145 49568 49323 48307 46834 45456 44341 43163 41690 40175 39019 38363 38231 38709
54120 38709 39558 39960 39214 37665 36450 36298 37040 38315 40144 42521 44932 46703 47611 47855 47687 47289 46819
54103 46819 46364 46024 46153 47113 48556 49419 49091 48220 47844 48078 48271 48246 48630 49825 51368 52604 53505 54475
54085 54475 55637 56704 57378 57628 57587 57371 56996 56471 56014 56079 56950 58310 59410 59755 59438 58754 57773 56510
54067 56510 55348 54971 55775 57431 59135 60333 61148 62056 63196 64195 64765 65181 65879 66676 66800 65842 64441
54050 64441 63767 64443 66168 68303 70580 73164 76234 79714 83356 86949 90408 93794 97327 101213 105408
54035A05408M255M263M506M782M483L462K370J850J726J412Q42N26Q21J532K170
54020A44408K292J685N62n62j407k184k972l316k919k360k391k779k699k155k066
54005A21137k808l590l603k977k237j560j063j155j995k993l418l137k497j782
53991H6322j215j094j373j486j025l77k41o94j109r39k76K81J87n01j062r00l40
53974G4158k31p35j099p77r3M84R83J468J617J332J096J130Q75Jp16m20M53Q58
53956H0384P24P96J129J007L51J5M71J195J661J975K170J831J015O75J479K790
53940I9668L575L739L894M178M249M255M926O423P767P753O235M243K953K635
53926A66493K557J852N47l61lJ363K599K976K907L335M605O100O913O636N481
$$ plain form
54035 105408 109663 113926 118432 123214 127697 131159 133529 135379 137105 138517 139359 139885 140706 142238 144408
54020 144408 146700 148385 148947 148385 146978 144794 141822 138506 135587 133227 130836 128057 125358 123203 121137
54005 121137 118329 114739 111136 108159 105922 104362 103299 102144 100149 97156 93738 90601 88104 86322
53991 86322 85107 84013 82640 81154 80129 79752 79511 78817 77708 76769 76493 76774 76961 76460 75398 74498 74158
53974 74158 73927 73192 72093 71316 71223 71707 72690 74158 75775 77107 78203 79333 80208 80209 79493 79073 79526 80384
53956 80384 81108 81904 83033 84040 84391 84406 84877 86072 87733 89708 91878 93709 94724 95399 96878 99668
53940 99668 103243 106982 110876 115054 119303 123558 128484 134907 142674 150427 156662 160905 163858 166493
53926 166493 169050 170902 171449 171088 171085 172448 175047 178023 180930 184265 188870 194970 201883 208519 214000
53911B14000L909K342J184P23Q14Q39L04n68j040p82l24m04j104j936k631l409
53895B11917m352m988m917m583m819n648o121n560m490l868l821l688l193k838
53881A49031l097l705m018l774l248k821k549k106j265l95l40j404k729l087k277
53866A12216j248r30j380k133k732k810k211j319q37r61j185j076p96o64o71p67
53850I0496j063j435j380o80J62N23L47j6j94J84J245K244J934J98j425j606r41
53833H8593q47j317j096P3Q56K62r82j482q05M29J448J771J307N61L68J018J864
53816I2021K140J830J436J212J095J172J683K526L161L138K610K146K175K676
53802A21021L367L982M274M008L264K653K708L043K634J198k20m45M68J526K040
$$ plain form
53911 214000 217909 220251 221435 222158 222972 223811 224115 223547 222507 221725 221401 220997 219893 217957 215326 211917
53895 211917 207565 202577 197660 193077 188258 182610 176489 170929 166439 162571 158750 155062 151869 149031
53881 149031 145934 142229 138211 134437 131189 128368 125819 123713 122448 122053 121713 120309 117580 114493 112216
53866 112216 110968 110038 108658 106525 103793 100983 98772 97453 96616 95655 94470 93394 92598 91934 91263 90496
53850 90496 89433 87998 86618 85938 86100 86623 86970 86954 86760 86944 88189 90433 92367 92565 91140 89534 88593
53833 88593 87746 86429 85333 85406 86262 86524 85542 84060 83255 83684 85132 86903 88210 88771 89139 90157 92021
53816 92021 94161 95991 97427 98639 99734 100906 102589 105115 108276 111414 114024 116170 118345 121021
53802 121021 124388 128370 132644 136652 139916 142569 145277 148320 150954 152152 151932 151487 151955 153481 155521
53787A55521J970J383L27p81j430j647j905k345k707k971l436m028m160l513k443
53772A27835j482r19r75j751k716k886j987r48p68j246j435j047q02j324k247
53757A05302k659k195j432j200j640k123k051j536j095r51r55j008j150j259j109
53742H2939p72o25p76q92o06R3R14J397J067o8j165j246l88L08K34J21Q97K216
53724H3648K852K379J698J732K258K351J689R15P17R79J064P00K92L32Q66J616
53708A06088K337K851K975K672K164J666J213Q94R46J412J918K242K661L366L824
53693A39229L469K741K679L445M020L552K371J434J251J650K123K226J962J826
53679A73978K163K501K086J071M33O05R28P51L35K01K46O7l29o31o97m98k1L98
$$ plain form
53787 155521 157491 158874 159201 158420 156990 155343 153438 151093 148386 145415 141979 137951 133791 130278 127835
53772 127835 126353 125434 124459 122708 119992 117106 115119 114171 113403 112157 110722 109675 108873 107549 105302
53757 105302 102643 100448 99016 97816 96176 94053 92002 90466 89371 88420 87465 86457 85307 84048 82939
53742 82939 82167 81542 80766 79874 79268 79361 80275 81672 82739 82671 81506 80260 79872 80180 80414 80535 81432 83648
53724 83648 86500 88879 90577 92309 94567 96918 98607 99522 100239 101218 102282 102982 103274 103606 104472 106088
53708 106088 108425 111276 114251 116923 119087 120753 121966 122860 123806 125218 127136 129378 132039 135405 139229
53693 139229 142698 145439 148118 151563 155583 159135 161506 162940 164191 165841 167964 170190 172152 173978
53679 173978 176141 178642 180728 181799 182232 182837 183765 184516 184851 185052 185298 185365 185036 184405 183708 183210 183189 183587
53661A83587J25q50j565j186j18N50M06m5k55j20J80L41Q9m31o99n46m79q09j002
53642A77173n81k05q21k019k322j175L10R09O75L55J93m2l62m50r7O35J526K219
53624A75921K353J995J679J811K214K477K536K600K724K831L037L571M333M857
53610B14939M798M345L915L632L266K684K189K198K721L352L754L978M189M356
53596B64316M371M277M146L931L645L530L678L675L057K125J750K180K530J873
53582C09084N32k57O4O49L11r93k116k065j035m9J36l95j074j430j313q43l69
53565B98837k94q04j706k544k870k447j396k45L35J3j002k162k891k768j749l65
53549B75942N26M29l93j326j955k119j694p09M38J223J533J718K097K554K747
$$ plain form
53661 183587 183712 182862 181297 180111 179993 180543 180949 180904 180649 180529 180709 181050 181139 180708 180009 179463 178984 178175 177173
53642 177173 176592 176387 175566 173547 171225 170050 170360 171269 171944 172299 172492 172450 172088 171638 171541 172176 173702 175921
53624 175921 178274 180269 181948 183759 185973 188450 190986 193586 196310 199141 202178 205749 210082 214939
53610 214939 219737 224082 227997 231629 234895 237579 239768 241966 244687 248039 251793 255771 259960 264316
53596 264316 268687 272964 277110 281041 284686 288216 291894 295569 298626 300751 302501 304681 307211 309084
53582 309084 309616 309359 309423 310072 310383 309390 307274 305209 304174 304125 304261 303866 302792 301362 300049 299206 298837
53565 298837 298543 297739 296033 293489 290619 288172 286776 286531 286866 286879 285877 283715 280824 278056 276307 275942
53549 275942 276468 276897 276504 275178 273223 271104 269410 268701 269139 270362 271895 273613 275710 278264 281011
53534B81011K589K414K634L272L944M352M735N506O543P196P181P088P665Q906
53520C55036J0138J0883J1205J1380J1710J2482J3699J4792J5177J5148J5725
53509D97375J7409J9553K1188K2096K2689K3295K3983K4833K5796K6435K6337
53498G50989K5816K5693K6202K6696K6631K6364K6563K7184K7641K7806K8292
53487A045877K9577L1314L2709L3277L2993L1984L0401K8519K6703K5179K3892
53476A372425K2567K0948J9136J7667J6997J6930J6848J6589J6610J7076J7262
53465A571055J6357J4488J2397J0343P966N134K196o43l616o809r854j2430j4612
53452A591972j6572j8308j9908k1593k3302k4622k5500k6503k7987k9378k9825
$$ plain form
53534 281011 283600 286014 288648 291920 295864 300216 304951 310457 317000 324196 331377 338465 346130 355036
53520 355036 365174 376057 387262 398642 410352 422834 436533 451325 466502 481650 497375
53509 497375 514784 534337 555525 577621 600310 623605 647588 672421 698217 724652 750989
53498 750989 776805 802498 828700 855396 882027 908391 934954 962138 989779 1017585 1045877
53487 1045877 1075454 1106768 1139477 1172754 1205747 1237731 1268132 1296651 1323354 1348533 1372425
53476 1372425 1394992 1415940 1435076 1452743 1469740 1486670 1503518 1520107 1536717 1553793 1571055
53465 1571055 1587412 1601900 1614297 1624640 1632606 1637740 1639936 1639293 1635677 1628868 1619014 1606584 1591972
53452 1591972 1575400 1557092 1537184 1515591 1492289 1467667 1442167 1415664 1387677 1358299 1328474
53441A328474k9311k8609k8226k7929k7353k6682k6505k7095k7875k7724k5942
53430A025223k3049k0328j8530j7296j5945j4297j2456j0225p344m060r99J497
53418H82191L486N132O713Q747J1529J4533J6820J8068J8849J9774K0869K1933
53406A048644K2982K4119K5245K6279K7442K9044L1092L3330L5562L7821M0193
53395A381753M2644M5106M7702N0775N4473N8290O1189O2504O2615O2622O3415
53384A993088O5180O7537O9793P1161P1112O9771O7718O5367O2669N9500N6029
53373B718925N2545M9085M5465M1713L8296L5827L4459L3609L2392L0318K7477
53362C140111K4072K0102J5511J0232L692n233j7080l0536m3006n2701n9822o5504
$$ plain form
53441 1328474 1299163 1270554 1242328 1214399 1187046 1160364 1133859 1106764 1078889 1051165 1025223
53430 1025223 1002174 981846 963316 946020 930075 915778 903322 893097 885753 881693 880694 882191
53418 882191 885677 890809 897522 906269 917798 932331 949151 967219 986068 1005842 1026711 1048644
53406 1048644 1071626 1095745 1120990 1147269 1174711 1203755 1234847 1268177 1303739 1341560 1381753
53395 1381753 1424397 1469503 1517205 1567980 1622453 1680743 1741932 1804436 1867051 1929673 1993088
53384 1993088 2058268 2125805 2195598 2266759 2337871 2407642 2475360 2540727 2603396 2662896 2718925
53373 2718925 2771470 2820555 2866020 2907733 2946029 2981856 3016315 3049924 3082316 3112634 3140111
53362 3140111 3164183 3184285 3199796 3210028 3213720 3208487 3191407 3160871 3117865 3065164 3005342 2939838
53350B939838p0115p3137p4404p4738p5084p5472p5184p3774p1597o9391o7713
53339B139229o6832o6870o7628o8474o8691o8009o6569o4423o1488n8042n4800
53328A427403n2121m9478m6070m1873l7646l3996l0844k7886k5102k2606k0248
53317A039533j7779j5316j3281j1803j0425q655o640m997m001l252k228q56N94
53304I40894J892K815L145L088L439M779O634Q094R144J0664J3002J5417J7240
53291A040247J8824K0846K3234K5457K7358K9106L0567L1438L1811L2070L2299
53280A343257L2291L1981L1426L0542K9288K7969K6853K5683K4076K2247K0775
53269A646388J9720J8550J6917J4956J2788J0300P554M822K063j213n272r762
$$ plain form
53350 2939838 2869723 2796586 2722182 2647444 2572360 2496888 2421704 2347930 2276333 2206942 2139229
53339 2139229 2072397 2005527 1937899 1869425 1800734 1732725 1666156 1601733 1540245 1482203 1427403
53328 1427403 1375282 1325804 1279734 1237861 1200215 1166219 1135375 1107489 1082387 1059781 1039533
53317 1039533 1021754 1006438 993157 981354 970929 962274 955634 950637 946636 943384 941156 940300 940894
53304 940894 942786 945601 948746 951834 955273 960052 966686 974780 983924 994588 1007590 1023007 1040247
53291 1040247 1059071 1079917 1103151 1128608 1155966 1185072 1215639 1247077 1278888 1310958 1343257
53280 1343257 1375548 1407529 1438955 1469497 1498785 1526754 1553607 1579290 1603366 1625613 1646388
53269 1646388 1666108 1684658 1701575 1716531 1729319 1739619 1747173 1751995 1754058 1752845 1747573 1737811
53257A737811j4174j8479k2989k7778l2362l6022l8469m0222m2048m3968m5148
53246A376152m5051m4195m3282m2100m0066l7484l5266l3611l1947l0360k9879
53235I62911l0935l2496l3405l3780l4344l5002l4966l3915l2174k9921k7060
53224F04913k3860k1039j8931j7112j5039j2719j0542q769p483o824o944p626
53212D48025q221q080p214o348o224o835p422p290o445n478m892m722m727m841
53198C59286n257n979o492o213n342m825n229n971o060n300m331l682l353l220
53184B88032l328l609l821l872l882l870l732l560l547l561l271k717k267k028
53170B40967j794j647j923k468k646k354k294k809l214k861k223k142k471k398
$$ plain form
53257 1737811 1723637 1705158 1682169 1654391 1622029 1586007 1547538 1507316 1465268 1421300 1376152
53246 1376152 1331101 1286906 1243624 1201524 1161458 1123974 1088708 1055097 1023150 992790 962911
53235 962911 931976 899480 866075 832295 797951 762949 727983 694068 661894 631973 604913
53224 604913 581053 560014 541083 523971 508932 496213 485671 476902 469419 462595 455651 448025
53212 448025 439804 431724 424510 418162 411938 405103 397681 390391 383946 378468 373576 368854 364127 359286
53198 359286 354029 348050 341558 335345 330003 325178 319949 313978 307918 302618 298287 294605 291252 288032
53184 288032 284704 281095 277274 273402 269520 265650 261918 258358 254811 251250 247979 245262 242995 240967
53170 240967 239173 237526 235603 233135 230489 228135 225841 223032 219818 216957 214734 212592 210121 207723
53156B07723j870j744k390l094l105k722k774l384l742l115j753o26l92q01j173
53141A75038j259j371j694j945j795j354r33n93k34M0l5n70j407k256k768k625
53125A54239j864r78m94m95o95q80j019j057q63m62j31j92p13j350j552j075l95
53108A40024l41j146k085k226j474n93l92j037k145l160l673l500k767j840j180
53093A12465j076j381j614j432r93o46l77J05P43J008N78k00p62r35q86o97l84
53076A03516j30j55l77m93l72j70m7M2K04M29N86N41K83j07n64j034j312j135
53058I9705o17l92q33j378j134k25J86n76j760k210j778j097m88K18Q55Q14n2
53041H9238r64j073m38J74K91K06L88P70Q53M75J12K51O89P86L72k2J24O65J006
$$ plain form
53156 207723 205853 204109 201719 198625 195520 192798 190024 186640 182898 179783 178030 177404 177012 176211 175038
53141 175038 173779 172408 170714 168769 166974 165620 164687 164094 163860 163900 163865 163295 161888 159632 156864 154239
53125 154239 152375 151397 150903 150408 149713 148833 147814 146757 145894 145432 145301 145109 144396 143046 141494 140419 140024
53108 140024 139683 138537 136452 134226 132752 132159 131767 130730 128585 125425 121752 118252 115485 113645 112465
53093 112465 111389 110008 108394 106962 105969 105323 104946 105051 105794 106802 107380 107180 106418 105483 104597 103900 103516
53076 103516 103386 103231 102854 102361 101989 101819 101772 101814 102018 102447 103033 103574 103857 103750 103186 102152 100840 99705
53058 99705 99088 98696 97863 96485 95351 95126 95312 94736 92976 90766 88988 87891 87403 87621 88476 89290 89238
53041 89238 88274 87201 86763 86937 87228 87434 87822 88592 89445 89920 90032 90283 90972 91758 92130 92108 92232 92897 93903
53022I3903P03k13j280j921j892j460r86m98m3j34j134k274k192p87L94J01j054
53005G9233j658j436j195j282j236q51n74o14m54L24J315J758J397N46m38j376
52989G3459k041k047j164K71J407J624J211J014J256J150L6j419j811o58R90J763
52973G5041J342M92P0J79K73j16q04j159q68k66J65L47M94O22N03Rp26j411j747
52954G2440j566j022m63k9M91J202J761J666Q09l87j205j013K32J684K207J505
52938G8312L93k04j23K75O79P98L31n07r03l76M94P96L68l02q36j038o24M15J417
52919G9365J665J261Q27O36O16Q23J211J212M31n04n88J58Q52J067J096R96N10
52902I1634p3rO55J006O66K63K00K0m97o77r8M93L06j82L6R21J540J495J269J220
$$ plain form
53022 93903 94606 94393 93113 91192 89300 87840 86854 86356 86313 86179 85045 82771 80579 79792 80186 80287 79233
53005 79233 77575 76139 74944 73662 72426 71575 71001 70387 69933 70257 71572 73330 74727 75273 74835 73459
52989 73459 71418 69371 68207 68478 69885 71509 72720 73734 74990 76140 76176 74757 72946 72288 73278 75041
52973 75041 76383 76875 76945 77124 77397 77281 76477 75318 74450 74184 74349 74696 75190 75812 76315 76324 75598 74187 72440
52954 72440 70874 69852 69389 69360 69851 71053 72814 74480 75289 74902 73697 72684 72916 74600 76807 78312
52938 78312 78705 78501 78378 78653 79332 80130 80461 79954 79051 78675 79169 79965 80333 80031 79195 78157 77533 77948 79365
52919 79365 81030 82291 83118 83754 84370 85193 86404 87616 88047 87543 86955 87113 87965 89032 90128 91124 91634
52902 91634 91561 91552 92207 93213 93879 94142 94342 94362 93865 93188 93090 93583 93889 93707 93743 94664 96204 97699 98968 100188
52882A00188J120P95N52O63R59J180J434J974K612K719J955Q38K85M70N91J9p73
52865A17581q92l62mj34j84K75R13J274J327J095M04n46r96n07L79Q07N63j04
52847A20889j089k367l530m013l683k873j999j379j184j236j076m84K04N38M92
52832I7210L32J98N5j13k82l81k64P6K67j07q68j442j684j942k174j820q09Kq1
52813H6173o60q68m45K74Q82R36R3j254k001j594p26k88k50k08k91o30o56l0M00
52794G8857k67j312j260j37O32M63K45M40K24q27j661j307m92n25j308j620q97
52777F9248K47J068J369J220P65L78L22L31l7o23q15m72j23j33j90J17O11P72
52759G4055M58R0J70Q04J606J983J567N67l24n31k07q7o07j317j395p36j98o31
$$ plain form
52882 100188 101308 102103 102655 103318 104277 105457 106891 108865 111477 114196 116151 116989 117274 117744 118335 118354 117581
52865 117581 116689 116327 116323 116189 116005 116280 117193 118467 119794 120889 121293 120747 119751 119244 119623 120430 120993 120889
52847 120889 119800 117433 113903 109890 106207 103334 101335 99956 98772 97536 96460 95976 96180 96718 97210
52832 97210 97542 97740 97795 97682 97400 97019 96755 96831 97098 96991 96123 94681 92997 91055 88881 87061 86252 86254 86173
52813 86173 85513 84645 84200 84474 85356 86292 86385 85131 83130 81536 80810 80522 80272 80064 79773 79143 78487 78457 78857
52794 78857 78590 77278 76018 75881 76513 76976 77221 77661 77885 77058 75397 74090 73598 73073 71765 70145 69248
52777 69248 69495 70563 71932 73152 73917 74295 74617 74948 74911 74288 73473 73001 72878 72745 72555 72672 73283 74055
52759 74055 74513 74603 74773 75577 77183 79166 80733 81300 80976 80445 80238 80151 79544 78227 76832 76096 75898 75267
52741G5267j863k867k863j995j009n03n08o71p17o98p69p82l80M33J091J058L94
52724F2618m46j161j663j798j431p27k6M51O03L57r2k18J80N15K04l10r2P41R61
52705E8666j8j244j558j115q00q01o48l89o56j451j745p50R84K178K218J508O89
52688E5068pn72q01m32L66R45Q01J49k98j37L64O70N66J78k49m78l05K29P55R07
52668E7719P59O63P74Q96Q30N30ko72j105q51q5L19k12j033r25L13J478J414M12
52649F1222l06j99J28K7k89k50J48M47M87N45P63R34R61J081J403J611J406J000
52631G1119Q40R31Q34L05l92r19j306j745k097j950j122M1R42J221R70N73M28
52614F8673O92J221J670J758J461J013P19P06Q17Q08O67O81J027J394J264N48
$$ plain form
52741 75267 73404 70537 67674 65679 64670 64167 63659 62988 62271 61573 60804 60022 59642 60075 61166 62224 62618
52724 62618 62172 61011 59348 57550 56119 55392 55366 55817 56420 56777 56685 56467 56647 57162 57366 57056 56964 57705 58666
52705 58666 58648 57404 55846 54731 53931 53130 52482 52093 51437 49986 48241 47491 48475 50653 52871 54379 55068
52688 55068 55061 54489 53688 53256 53622 54567 55368 55517 55219 55082 55446 56116 56682 56860 56611 56133 55828 56057 56812 57719
52668 57719 58478 59141 59915 60811 61641 62171 62169 61497 60392 59541 59456 59775 59563 58530 57605 57918 59396 60810 61222
52649 61222 60916 60717 60845 60872 60583 60333 60481 60928 61415 61960 62723 63657 64618 65699 67102 68713 70119 71119
52631 71119 71959 72890 73724 74029 73637 72718 71412 69667 67570 65620 64498 64539 65481 66702 67672 68245 68673
52614 68673 69365 70586 72256 74014 75475 76488 77207 77913 78730 79538 80205 80886 81913 83307 84571 85119
52598H5119k61p02p92p29m58J92J018J497J304O04k01p86j045j126j234j271p51
52581H0378N28J888K244J277k04j181j344r78l87K66Q30J180J324J333J281J292
52565H9727J433J451R88J38n32o99o90q76j064q24k19J84k4p28j408j455o47M49
52547H5204Q75L56l46m95l17l50m06M5P39Q56L66J56O19J015O80P3j1L40M00j8
52527H9781l70k09K73O06N44J74k10l99m83o84q94p15j54J44k43p22m16M85Q01
52508H7309q5j345j744j112l77l40r02j409j420r87m81k21k10j75J00M63N78L53
52490G7995J00J55N64J113J524J486P84l78j306j394p25J32Q02J235J250N44o42
52473H3239j407j087n7Q12J173J279J252R11L29l3Q7L83M96N27P47J014R27M85
$$ plain form
52598 85119 84858 84156 83364 82635 82177 82369 83387 84884 86188 86792 86591 85805 84760 83634 82400 81129 80378
52581 80378 80906 82794 85038 86315 86111 84930 83586 82608 82221 82487 83317 84497 85821 87154 88435 89727
52565 89727 91160 92611 93599 93737 93205 92506 91816 90940 89876 89052 88833 89017 88993 88265 86857 85402 84755 85204
52547 85204 86079 86435 86089 85594 85277 84927 84521 84566 85305 86161 86527 86683 87302 88317 88997 89070 89059 89399 89799 89781
52527 89781 89411 89202 89475 90081 90625 90799 90589 90190 89707 89023 88129 87414 87260 87404 87161 86439 86023 86508 87309
52508 87309 87224 85879 84135 83023 82646 82306 81404 79995 78575 77588 77107 76886 76676 76501 76601 77064 77642 77995
52490 77995 78095 78250 78814 79927 81451 82937 83721 83343 82037 80643 79918 80050 80852 82087 83337 83881 83239
52473 83239 81832 80745 80688 81500 82673 83952 85204 86115 86444 86411 86498 86881 87377 87904 88651 89665 90592 91077
52455I1077K12M82R47R24L14j10M44J732K668K554J769J065N95L8n92q44n12M8
52437A02811M28O04P31Q02P28N24K30j87p56j381j847j839j089K67J542K060J835
52420A05463J384R07J44q26j295q02J42O06L26k13m84l17K46R61J311R22R6m25
52402A08146l06Q1K79K64K55K60J65M2J21M80R21J151J056P48M35J92o1l66n90
52383A13273n75m41n18r57j447j460p51L46J164J311J093J232J990K760K761K032
52367A21813J390J363J602J535J209J048J088R51O03M97R10J537J973K161K090
52352A41770J556O26k1K00R51J453J635K069K782K965K195J204Q86J118J198J037
52336A63624J128J555J790J590J390J675K388L148L628L665L375L384M380O185
$$ plain form
52455 91077 91289 91771 92718 93642 93956 93846 94290 96022 98690 101244 103013 104078 104673 104711 104119 103275 102763 102811
52437 102811 103239 103843 104574 105376 106104 106628 106858 106671 105915 104534 102687 100848 99759 100026 101568 103628 105463
52420 105463 106847 107754 107898 107072 105777 104975 105117 105723 106049 105836 105352 105035 105281 106242 107553 108475 108571 108146
52402 108146 107840 107921 108200 108464 108719 108979 109144 109186 109307 109787 110708 111859 112915 113663 114098 114290 114229 113863 113273
52383 113273 112698 112257 111739 110782 109335 107875 107124 107470 108634 109945 111038 112270 114260 117020 119781 121813
52367 121813 123203 124566 126168 127703 128912 129960 131048 131999 132602 133099 134009 135546 137519 139680 141770
52352 141770 143326 143952 143931 144131 145082 146535 148170 150239 153021 155986 158181 159385 160271 161389 162587 163624
52336 163624 164752 166307 168097 169687 171077 172752 175140 178288 181916 185581 188956 192340 196720 202905
52322B02905P647P812O970O255O385P132P840Q134Q170Q444R308J0503J1254J1050
52308C19809J0242R728J0024J0818J1388J1316J0760J0183R874R639Q995P668
52296D40444N946M480L755L693L685L098J813K85r30j586j646j092j97K24o29
52281D61343k611m610n593n383m360k964j691j035r45p36K8Q76J187J271J986
52266D36763L447M843N630O095O565O821O761P029Q254R956J0917J0605R663Q931
52252E42280Q512P981P106O044N049M324M008M057M125L764K823J524J96j026
52238F00767k135l076l710m010m177m502n031n478n496n065m507m179m266m748
52224E40387n382n674n157l882k505j678j500j640j838j946j720j065m05k96n05
$$ plain form
52322 202905 210552 218364 225334 231589 237974 245106 252946 261080 269250 277694 287002 297505 308759 319809
52308 319809 330051 339779 349803 360621 372009 383325 394085 404268 414142 423781 432776 440444
52296 440444 446390 450870 454625 458318 462003 465101 466914 467199 466269 464683 463037 461945 461748 461972 461343
52281 461343 458732 454122 448529 443146 438786 435822 434131 433096 432151 431415 431443 432319 433506 434777 436763
52266 436763 440210 445053 450683 456778 463343 470164 476925 483954 492208 502164 513081 523686 533349 542280
52252 542280 550792 558773 565879 571923 576972 581296 585304 589361 593486 597250 600073 601597 601793 600767
52238 600767 598632 595556 591846 587836 583659 579157 574126 568648 563152 558087 553580 549401 545135 540387
52224 540387 535005 529331 524174 520292 517787 516109 514609 512969 511131 509185 507465 506400 505995 505699 505194
52209E05194k7J557L178L335J948N61O00J869L005L108K554K284K628L057K940
52194E37791K322J737J507J483J505J720K206K583K342J496N19k53r05j531j965
52179E52557k060k008k165k588k908k730k106j560j609k260l052l587l865m048
52165E16011m121l940l472k827k154j644j482j599j713j713j803k004j889j233
52151D84417o57j065k417l667l921l275k404j821j668j887k227k395k284j943
52137D52786j376o32q2r4l98k53N51J362J584J471J652K263K995L661M256M695
52121D74441M972N405O273P271P782P805Q088R211J0773J1770J1688J1020J0649
52108E87148J0861J1117J0859J0250R849R743R418Q574P542O748O121N394M590
$$ plain form
52209 505194 505167 506724 509902 513237 515185 515746 516346 518215 521220 524328 526882 529166 531794 534851 537791
52194 537791 540113 541850 543357 544840 546345 548065 550271 552854 555196 556692 557211 556958 556053 554522 552557
52179 552557 550497 548489 546324 543736 540828 538098 535992 534432 532823 530563 527511 523924 520059 516011
52165 516011 511890 507950 504478 501651 499497 497853 496371 494772 493059 491346 489543 487539 485650 484417
52151 484417 483760 482695 480278 476611 472690 469415 467011 465190 463522 461635 459408 457013 454729 452786
52137 452786 451410 450778 450696 450602 450204 449951 450502 451864 453448 454919 456571 458834 461829 465490 469746 474441
52121 474441 479413 484818 491091 498362 506144 513949 522037 531248 542021 553791 565479 576499 587148
52108 587148 598009 609126 619985 630235 640084 649827 659245 667819 675361 682109 688230 693624 698214
52095F98214L870L080J965O82l06q87j452k373l563m626n236n343n137m947m981
52080F68960n166n265n117m670l890k778j518m56J52L67N65J156K199L354M262
52065F52155N024O023P291Q311Q562Q114P493P146P145P267P221O869O344N879
52051G50844N497M965M033K633Q66q77k009k314k473l440n229o834p548p727q002
52036G22385q352q512q721r337j0153j0796j1440j2362j3016j2557j1247j0427
52024E95465j0787j1514j1536j0835j0075r545r147q959r087r156q613p557o765
52011D71889o741p175p472p494p579p953q394q471q035p463p355p927q747r123
51997C61960q770q039p488p365p548p863q220q462q327p789p228p095p364p562
$$ plain form
52095 698214 702084 705164 707129 707811 707505 706618 705166 702793 699230 694604 689368 684025 678888 673941 668960
52080 668960 663794 658529 653412 648742 644852 642074 640556 640100 640252 640619 641184 642340 644539 647893 652155
52065 652155 657179 663202 670493 678804 687366 695480 702973 710119 717264 724531 731752 738621 744965 750844
52051 750844 756341 761306 765339 767972 768838 767961 765952 763638 761165 757725 752496 745662 738114 730387 722385
52036 722385 714033 705521 696800 687463 677310 666514 655074 642712 629696 617139 605892 595465
52024 595465 584678 573164 561628 550793 540718 531173 522026 513067 503980 494824 486211 478654 471889
52011 471889 465148 457973 450501 443007 435428 427475 419081 410610 402575 395112 387757 379830 371083 361960
51997 361960 353190 345151 337663 330298 322750 314887 306667 298205 289878 282089 274861 267766 260402 252840
51983B52840p356o898o480o078n466m675m066l890l965l938l793l868m264m466
51969A83637l855k591j648j739k512l095l145l025l049l170l319l590l863l719
51955A41317k995k094j532j381j354j207r23o17m61m80m90l87m21p91j138r31
$$ plain form
51983 252840 245484 238586 232106 226028 220562 215887 211821 207931 203966 200028 196235 192367 188103 183637
51969 183637 179782 177191 175543 173804 171292 168197 165052 162027 158978 155808 152489 148899 145036 141317
51955 141317 138322 136228 134696 133315 131961 130754 129831 129214 128753 128273 127783 127396 126975 126184 125046 124115
$$ [...]
##END NTUPLES=NMR SPECTRUM
##END=
