##TITLE=NES1060_159122.0007_002_9704132_ozipFNsutZ
##JCAMPDX= 6.0         $$ Bruker NMR JCAMP-DX V2.0
##DATA TYPE= NMR SPECTRUM
##DATA CLASS= NTUPLES
##ORIGIN= BRUKER
##OWNER= Administrator
$$ 1.72 TOPSPIN		Version 2.1
$$ 2016-04-30 16:34:14.942 -0700  Administrator@X
$$ Compression mode = diff/dup
##.OBSERVE FREQUENCY= 400.02188249412
##.OBSERVE NUCLEUS= ^1H
##.ACQUISITION MODE= SIMULTANEOUS (DQD)
##.ACQUISITION SCHEME= undefined
##.AVERAGES= 64
##.DIGITISER RES= 22
##SPECTROMETER/DATA SYSTEM= spect
##.PULSE SEQUENCE= noesygpps1d.comp
##.SOLVENT NAME= COFFEE_meoh
##.SHIFT REFERENCE= INTERNAL, COFFEE_meoh, 1, 14.96187
##AUDIT TRAIL= $$ (NUMBER, WHEN, WHO, WHERE, PROCESS, VERSION, WHAT)
$$ ##TITLE= Audit trail, TOPSPIN		Version 2.1
$$ ##JCAMPDX= 5.01
$$ ##ORIGIN= Bruker BioSpin GmbH
$$ ##OWNER= Administrator
$$ $$ E:\/data/COFFEE/nmr/NES1060_159122.0007_002_9704132_ozipFNsutZ/12/pdata/1/auditp.txt
$$ ##AUDIT TRAIL=  $$ (NUMBER, WHEN, WHO, WHERE, PROCESS, VERSION, WHAT)
(   1,<2016-04-30 16:34:09.599 -0700>,<Administrator>,<X>,<go>,<TOPSPIN 2.1>,
      <created by zg
	started at 2016-04-30 16:22:39.958 -0700,
	POWCHK enabled, PULCHK disabled,
       configuration hash MD5:
       21 0F 79 D6 B3 7B B4 F6 88 20 88 DB 03 48 BD 9F
       data hash MD5: 64K
       32 45 1C BE 9B D5 65 59 F2 98 21 CA 22 FD 4C 6B>)
(   2,<2016-04-30 16:34:12.880 -0700>,<Administrator>,<X>,<proc1d>,<TOPSPIN 2.1>,
      <Start of raw data processing
       efp LB = 0.3 FT_mod = 6 PKNL = 1 PHC0 = 0 PHC1 = 0 SI = 128K 
       data hash MD5: 128K
       D1 D6 44 71 C9 89 5C 24 22 EE 58 83 E4 EA 9B B3>)
(   3,<2016-04-30 16:34:13.771 -0700>,<Administrator>,<X>,<proc1d>,<TOPSPIN 2.1>,
      <pk PHC0 = -80.79895 PHC1 = 0 
       data hash MD5: 128K
       3F CB 6C 46 FD 76 3E 38 EE D8 D0 A5 D7 B5 5C DB>)
(   4,<2016-04-30 16:34:14.177 -0700>,<Administrator>,<X>,<proc1d>,<TOPSPIN 2.1>,
      <abs ABSG = 1 
       data hash MD5: 128K
       B1 7F 6C 1E E6 E6 92 9E 39 A1 39 2E 2D FB 68 C2>)
(   5,<2016-04-30 16:34:14.286 -0700>,<Administrator>,<X>,<proc1d>,<TOPSPIN 2.1>,
      <abs ABSG = 2 
       data hash MD5: 128K
       78 56 74 76 5F FA 53 95 A9 39 C3 43 0C FC 9B 87>)
(   6,<2016-04-30 16:34:14.364 -0700>,<Administrator>,<X>,<proc1d>,<TOPSPIN 2.1>,
      <abs ABSG = 3 
       data hash MD5: 128K
       98 01 23 52 E1 C4 FB 21 88 9D 79 88 FB B4 51 19>)
(   7,<2016-04-30 16:34:14.458 -0700>,<Administrator>,<X>,<proc1d>,<TOPSPIN 2.1>,
      <abs ABSG = 4 
       data hash MD5: 128K
       33 DB FE 68 45 0F 4D A3 DF 57 44 2B F6 AB D9 13>)
(   8,<2016-04-30 16:34:14.583 -0700>,<Administrator>,<X>,<proc1d>,<TOPSPIN 2.1>,
      <abs ABSG = 5 
       data hash MD5: 128K
       BF BD 19 67 14 05 54 6F 68 25 CA 0F AF CD C0 25>)
$$ ##END=
$$ 
$$ $$ hash MD5
$$ $$ DE F4 30 C6 23 58 72 DC 77 6D 2D 6F EB 8E E1 88
##$RELAX= 
##$RELAX= 
##$RELAX= 
##$RELAX= 
##$RELAX= 
##$RELAX= 
##$RELAX= 
##$RELAX= 
$$ Bruker specific parameters
$$ --------------------------
##$DU= <E:\>
##$EXPNO= 12
$$ [...]
##$TP07= 0
##$TPNAME0= <>
##$TPNAME1= <>
##$TPNAME2= <>
##$TPNAME3= <>
##$TPNAME4= <>
##$TPNAME5= <>
##$TPNAME6= <>
##$TPNAME7= <>
##$TPOAL= (0..7)
0.5 0.5 0.5 0.5 0.5 0.5 0.5 0.5
##$TPOFFS= (0..7)
0 0 0 0 0 0 0 0
##$TUNHIN= 0
##$TUNHOUT= 0
##$TUNXOUT= 0
##$USERA1= <user>
##$USERA2= <user>
##$USERA3= <user>
##$USERA4= <user>
##$USERA5= <user>
##$V9= 5
##$VALIST= <valist>
##$VCLIST= <CCCCCCCCCCCCCCC>
##$VD= 0
##$VDLIST= <DDDDDDDDDDDDDDD>
##$VPLIST= <PPPPPPPPPPPPPPP>
##$VTLIST= <TTTTTTTTTTTTTTT>
##$WBST= 2048
##$WBSW= 25
##$XGAIN= (0..3)
0 0 0 0
##$XL= 0
##$YL= 0
##$YMAX_a= 5413824
##$YMIN_a= -11449757
##$ZGOPTNS= <>
##$ZL1= 120
##$ZL2= 120
##$ZL3= 120
##$ZL4= 120
##$ABSF1= 14.96187
##$ABSF2= -5.596312
##$ABSG= 5
##$ABSL= 3
##$ALPHA= 0
##$AQORDER= 0
##$ASSFAC= 0
##$ASSFACI= 0
##$ASSFACX= 0
##$ASSWID= 0
##$AUNMP= <proc_prof1d_extract.lims>
##$AXLEFT= 0
##$AXNAME= <>
##$AXNUC= <1H>
##$AXRIGHT= 0
##$AXTYPE= 0
##$AXUNIT= <>
##$AZFE= 0.1
##$AZFW= 0.1
##$BCFW= 0
##$BC_mod= 0
##$BYTORDP= 0
##$COROFFS= 0
##$CY= 15
##$DATMOD= 1
##$DC= 0
##$DFILT= <>
##$DTYPP= 0
##$F1P= 0
##$F2P= 0
##$FCOR= 0.5
##$FTSIZE= 131072
##$FT_mod= 6
##$GAMMA= 0
##$GB= 0
##$INTBC= 1
##$INTSCL= 1
##$ISEN= 128
##$LB= 0.3
##$LEV0= 0
##$LPBIN= 0
##$MAXI= 10000
##$MC2= 0
##$MEAN= 0
##$ME_mod= 0
##$MI= 0
##$NCOEF= 0
##$NC_proc= -2
##$NLEV= 6
##$NOISF1= 0
##$NOISF2= 0
##$NSP= 0
##$NTH_PI= 0
##$NZP= 0
##$OFFSET= 14.96187
##$PC= 1
##$PHC0= -80.79895
##$PHC1= 0
##$PH_mod= 1
##$PKNL= yes
##$PPARMOD= 0
##$PPDIAG= 0
##$PPIPTYP= 0
##$PPMPNUM= 2147483647
##$PPRESOL= 1
##$PSCAL= 4
##$PSIGN= 0
##$PYNMP= <proc.py>
##$REVERSE= no
##$SF= 400.020009289694
##$SI= 131072
##$SIGF1= 0
##$SIGF2= 0
##$SINO= 400
##$SIOLD= 131072
##$SPECTYP= <>
##$SREGLST= <1H.CDCl3>
##$SSB= 0
##$STSI= 131072
##$STSR= 0
##$SW_p= 8223.68421052631
##$SYMM= 0
##$S_DEV= 0
##$TDeff= 65536
##$TDoff= 0
##$TI= <>
##$TILT= no
##$TM1= 0
##$TM2= 0
##$TOPLEV= 0
##$USERP1= <user>
##$USERP2= <user>
##$USERP3= <user>
##$USERP4= <user>
##$USERP5= <user>
##$WDW= 1
##$XDIM= 131072
##$YMAX_p= 403823271
##$YMIN_p= -12040
##$CURPLOT= <Network HP LaserJet P1505>
##$CURPRIN= <$Network HP LaserJet P1505>
##$DFORMAT= <normdp>
##$LAYOUT= <+/1D_H.xwp>
##$LFORMAT= <normlp>
##$PFORMAT= <normpl>
##$SURQMSG= 1
$$ End of Bruker specific parameters
$$ ---------------------------------
##NTUPLES= NMR SPECTRUM
##VAR_NAME=  FREQUENCY,     SPECTRUM/REAL,   SPECTRUM/IMAG
##SYMBOL=    X,             R,               I
##VAR_TYPE=  INDEPENDENT,   DEPENDENT,       DEPENDENT
##VAR_FORM=  AFFN,          ASDF,            ASDF
##VAR_DIM=   131072,        131072,          131072
##UNITS=     HZ,            ARBITRARY UNITS, ARBITRARY UNITS
##FACTOR=    0.0627417313425164, 1,          1
##FIRST=     8223.62146879497, -5074,        -52048
##LAST=      0,             -2902,           -53738
##MIN=       0,             -12040,          0
##MAX=       8223.62146879497, 403823271,    0
$$ Real data points
##PAGE= N=1
##DATA TABLE= (X++(R..R)), XYDATA
$$ [...]
67728 54592 56025 58292 60390 61611 62178 62639 63024 63077 63003 63329 64037 64480 64234 63514 62622 61569 60492 59888
67710 59888 60006 60430 60667 60785 61064 61407 61650 62121 63160 64233 64269 63023 61438 60443 59974 59508 59045 59029
67692 59029 59573 60270 60710 60855 60944 61347 62419 64217 66360 68380 70185 71963 73711 75180 76246 77061
67676 77061 77776 78395 78965 79597 80167 80293 79849 79270 79004 78799 77865 75816 73175 70886 69545 69181 69490 69980
67658 69980 70053 69315 67942 66545 65555 64876 64212 63570 63253 63462 64119 65049 66096 67045 67693 68093 68582 69466
67640 69466 70778 72415 74306 76336 78304 80154 82094 84227 86184 87356 87516 87036 86528 86444 86969 88063
67624 88063 89527 91175 92904 94561 95857 96637 97113 97604 98119 98499 98774 99004 98830 97771 96018 94342
67608 94342 92983 91217 88509 85593 83779 83349 83270 82476 80909 79176 77673 76348 75100 74165 74020 74911
67592 74911 76453 77839 78593 78992 79561 80309 80716 80431 79659 78867 78330 78039 77853 77671 77579 77758 78165 78416 78176
67573 78176 77580 77028 76693 76452 76190 75903 75597 75390 75590 76273 76921 76953 76578 76534 76917 76924 76029 74785 74021 73745
67553 73745 73417 72978 72884 73228 73477 73202 72599 72073 71671 71151 70385 69496 68718 68296 68407 68985 69626 69862 69604
67534 69604 69210 69015 68853 68218 66951 65568 64717 64430 64218 63868 63827 64580 65916 67051 67404 67085 66653 66575
67516 66575 66928 67481 67958 68199 68126 67700 67022 66400 66149 66291 66548 66623 66427 66136 66167 66960 68484 70056 70964
67497 70964 71214 71347 71577 71631 71519 71837 72941 74295 75085 75193 75106 75106 75038 74814 74638 74664 74682 74298 73303 71979
67477 71979 71090 71357 72613 73726 73652 72490 71226 70586 70564 70927 71656 72822 74387 76254 78178 79636 80174
67460 80174 80026 79982 80414 80745 80179 78790 77569 77489 78689 80536 82268 83519 84358 84954 85304 85323 85063 84713
67442 84713 84385 84055 83670 83152 82359 81230 80039 79268 79130 79321 79369 79115 78746 78435 78133 77750 77436 77539 78221
67423 78221 79210 80077 80750 81557 82701 83850 84414 84093 82984 81319 79309 77198 75277 73761 72746 72228
67407 72228 72113 72326 72982 74270 76014 77556 78334 78506 78733 79428 80436 81344 81863 81904 81554 80993 80357 79746
67389 79746 79455 79941 81250 82717 83578 83816 84022 84538 85160 85683 86223 86869 87392 87455 86953 86046 85140 84781 85292
67370 85292 86466 87855 89251 90552 91365 91371 91075 91424 92478 93145 92605 91378 90461 90004 89511 88950 88822 89239
67352 89239 89667 89742 89703 89830 89900 89572 88986 88655 88874 89550 90488 91531 92290 92105 90677 88725 87555 87751 88569
67333 88569 88917 88648 88468 88801 89345 89718 89869 89705 88976 87878 87247 87649 88624 89301 89495 89781 90642 91971
67315 91971 93288 94104 94139 93506 92664 92059 91889 92285 93332 94740 95851 96324 96498 96768 97022 97137 97593 98950
67297 98950 100912 102587 103547 104010 104076 103534 102520 101692 101491 101744 102191 102900 103910 104895 105542 105955 106425 107011
67279 107011 107609 108198 108808 109371 109711 109622 108996 108168 108060 109505 112238 114915 116363 116556 116244 115966 115720 115332
67261 115332 114787 114224 113827 113718 113923 114454 115363 116509 117421 117732 117664 117695 117780 117432 116645 116109 116239 116578 116602 116568
67241 116568 117003 117771 118369 118903 120041 122005 124209 126035 127413 128513 129315 129763 129989 130143 130217 130237 130427
67224 130427 130953 131656 132254 132769 133535 134700 135863 136360 135969 135238 134916 135114 135256 134923 134443 134428 135042 136067
67206 136067 137496 139501 141782 143475 144030 143949 144300 145585 147314 148722 149579 150149 150532 150456 149832 149170 149059
67189 149059 149415 149705 149883 150511 151819 153229 154203 155046 156313 157831 159019 159910 161089 162601 163693 163828
67173 163828 163341 162889 162777 163085 163923 165169 166385 167343 168350 169756 171516 173448 175483 177319 178329 178283
67157 178283 177792 177478 177138 176355 175651 176188 178322 181168 183680 185560 187010 188249 189572 191333 193465 195354
67141 195354 196526 197223 198028 199133 200222 200893 201046 201024 201467 202764 204530 205878 206308 206033 205436 204698 204117
67124 204117 204167 204867 205614 206126 207036 208970 211474 213633 215426 217596 220274 222720 224533 226197 228086 229795
67108 229795 230979 232165 234009 236224 237967 239052 240089 241610 243623 245958 248413 250529 251848 252571
67094 252571 253475 254977 256707 258238 259764 261662 263765 265616 267318 269561 272699 276210 279262 281490
67080 281490 283009 284004 284750 285862 287982 291010 293997 296067 297242 298199 299506 301371 303810 306546 308879
67065 308879 310263 311095 312433 314758 317465 319800 321789 323940 326483 329377 332695 336408 340021 343039
67051 343039 345716 348770 352348 355835 358758 361324 363912 366556 369257 372357 376150 380302 384010 386754
67037 386754 388753 390734 393338 396611 400060 403382 407029 411705 417245 422477 426446 429432 432488 436310
67023 436310 440834 445610 450192 454375 458446 463015 468269 473590 478274 482414 486596 490913 494879 498370
67009 498370 502086 506838 512703 519028 525074 530559 535795 541325 547251 553046 558294 563430 569266 575849
66995 575849 582460 588748 595153 601970 608713 614933 621072 627817 634986 641766 647874 653872 660381 667563
66981 667563 675304 683314 691008 697919 704454 711764 720589 730569 740821 750828 760512 769842 778759 787325
66967 787325 795666 803858 812080 820652 829734 839107 848490 857912 867549 877357 887194 897197 907762 919118
66953 919118 931123 943429 955707 967814 979990 992784 1006430 1020253 1033092 1044456 1055010
66942 1055010 1065775 1077121 1088812 1100752 1113223 1126367 1139875 1153394 1167054 1181345 1196572
66931 1196572 1212586 1228976 1245349 1261433 1277196 1292935 1309059 1325590 1341965 1357564 1372447
66920 1372447 1387409 1403235 1420006 1437146 1454067 1470671 1487324 1504380 1521772 1539105 1556191
66909 1556191 1573425 1591457 1610459 1629842 1648727 1666620 1683656 1700358 1717267 1734664 1752449
66898 1752449 1770254 1787658 1804374 1820348 1835856 1851477 1867728 1884701 1902138 1919732 1937052
66887 1937052 1953258 1967446 1979584 1990807 2002475 2015048 2028071 2040933 2053308 2065048 2076102
66876 2076102 2086480 2096092 2104701 2112320 2119436 2126431 2132922 2138201 2142386 2146629 2151920 2157972 2163502 2167443
66862 2167443 2169698 2170906 2171652 2171930 2171312 2169589 2167042 2163994 2160339 2155863 2150767 2145459 2139908 2133695 2126631
66847 2126631 2118832 2110237 2100654 2090361 2080025 2069823 2059249 2048060 2036670 2025174 2012713 1998529
66835 1998529 1983181 1967916 1953131 1938202 1922698 1906866 1890894 1874505 1857623 1840836 1824764
66824 1824764 1809284 1793679 1777341 1760090 1742090 1723737 1705562 1687971 1671015 1654358 1637454
66813 1637454 1619855 1601568 1583077 1564862 1546886 1528739 1510240 1491674 1473487 1456000 1439422
66802 1439422 1423802 1408789 1393686 1377916 1361463 1344808 1328514 1312815 1297452 1281908 1265887
66791 1265887 1249527 1233075 1216572 1200093 1184112 1169234 1155539 1142465 1129336 1115779 1101710
66780 1101710 1087316 1073086 1059490 1046487 1033656 1020870 1008526 996959 985984 975186 964380
66769 964380 953554 942693 931876 921325 911024 900494 889217 877194 864919 852931 841561
66758 841561 830985 821217 812085 803344 794775 786112 777064 767583 758044 748962 740595 732883 725622 718540
66744 718540 711306 703670 695596 687274 679054 671277 663870 656116 647302 637791 628988 621877 615911 609797
66730 609797 603077 596320 589948 583590 576817 569896 563461 557742 552464 547288 542048 536671 531179 525766
66716 525766 520669 515849 510892 505351 499247 493200 487941 483568 479436 474879 469940 465173 460887 456936
66702 456936 453211 449884 447028 444343 441472 438308 434739 430413 425201 419758 415097 411496 408170 404196
66688 404196 399483 394619 390052 385761 381616 377683 374101 370864 367883 365053 362191 359064 355693 352494
66674 352494 349929 348004 346279 344323 341967 339123 335653 331583 327297 323321 319966 317279 315172 313412
66660 313412 311599 309463 307211 305323 303904 302475 300531 298149 295777 293581 291291 288724 286196 284266
66646 284266 283176 282620 281970 280638 278413 275586 272688 270013 267435 264795 262300 260337 258998 258036 257206
66631 257206 256371 255356 254054 252683 251542 250403 248594 245943 243196 241116 239515 237684 235495 233483
66617 233483 231974 230763 229728 229117 229050 229222 229371 229590 229889 229789 228755 226747 224065 220935 217606 214599
66601 214599 212432 211132 210350 209827 209386 208569 206776 203888 200508 197469 195286 194055 193550 193300 192870 192285
66585 192285 192006 192322 192864 192894 192056 190692 189487 188875 188791 188834 188642 188121 187385 186493 185331 183787 182050 180610
66567 180610 179887 179850 180039 179948 179375 178409 177245 176057 174959 173976 173081 172336 171880 171687 171421 170719 169618 168479
66549 168479 167506 166523 165298 163920 162773 162237 162448 163214 164093 164629 164562 163801 162315 160233 158019 156285 155356
66532 155356 155139 155415 155991 156581 156752 156187 154910 153268 151847 151248 151549 151942 151307 149347 146874 144820 143294
66515 143294 141818 140144 138499 137148 136032 134810 133166 131234 129715 129292 129820 130478 130821 131218 131999 132720
66499 132720 132751 132136 131329 130444 129381 128458 128193 128527 128854 128830 128601 128230 127489 126384 125375 124919 125131 125930
66481 125930 127094 128083 128307 127733 126844 125899 124661 122975 121212 119859 119040 118598 118339 117965 117155 115951 114780
66464 114780 113940 113350 113027 113315 114313 115371 115625 114910 113794 112872 112358 112263 112484 112641 112169 110855 109236 108246
66446 108246 108341 109015 109326 108922 108307 107994 107789 107308 106865 107124 107942 108337 107819 107036 106679 106421 105514 104006 102645
66427 102645 101887 101646 101851 102514 103254 103441 103038 102769 103224 104200 105163 105934 106617 107148 107332 107196 106959 106655 106036
66408 106036 104964 103756 103026 103160 103905 104463 104059 102547 100546 98960 98310 98449 98831 99036 99065 99212 99725
66391 99725 100498 100989 100484 98684 96150 93945 92622 91768 90756 89707 89305 89773 90576 91213 91740 92322 92804
66374 92804 93059 93323 93757 94025 93817 93506 93611 93822 93230 91672 90175 89762 90271 90726 90558 90078 89907 90275
66356 90275 90856 91057 90492 89387 88478 88313 88706 89050 89091 89073 89079 88634 87278 85372 83932 83645 84275 85093 85596
66337 85596 85684 85473 85199 85138 85316 85429 85272 85123 85424 86191 87046 87700 88046 87905 87197 86343 85938 85898 85536 84682
66317 84682 84117 84510 85478 86238 86683 87110 87270 86580 85308 84681 85524 87283 88661 88819 87746 85926 84075
66300 84075 82911 82716 83112 83481 83605 83697 83921 84134 84156 84096 84185 84334 84087 83161 81932 81102 80908 80952 80918 81017 81475
66279 81475 81911 81739 80999 80233 79592 78677 77442 76677 77140 78497 79576 79603 78878 78288 78425 79172 79917 80106
66261 80106 79726 79292 79291 79639 79771 79269 78280 77271 76484 75827 75267 75151 75940 77674 79832 81676 82602 82268
66243 82268 80773 78836 77454 77037 77060 76788 76146 75531 74992 74158 72956 71895 71465 71672 72336 73438 74892
66226 74892 76276 77168 77556 77639 77397 76717 75834 75261 75253 75638 76186 76822 77351 77310 76366 74749 73024 71532 70297
66207 70297 69458 69420 70346 71704 72628 72703 72199 71579 71103 70938 71240 71899 72482 72713 72805 72996 73009 72436 71537 71080
66187 71080 71316 71594 71196 70236 69503 69723 71063 72987 74405 74398 73160 71938 71648 71857 71543 70589 69893 70105
66169 70105 70919 71719 72328 72814 73034 72820 72356 72001 71863 71870 72037 72333 72393 71825 70822 70069 69896 69909 69685 69475
66149 69475 69865 70907 71971 72459 72329 71858 71231 70539 69973 69811 70241 71229 72433 73261 73280 72711 72276 72366 72573
66130 72573 72272 71440 70582 70032 69779 69848 70311 70863 70932 70461 70131 70468 71099 71349 71308 71756 73064 74679 75786
66111 75786 76087 75777 75085 74128 73054 72063 71298 70807 70537 70325 70028 69757 69870 70606 71762 72834 73424 73457
66093 73457 73115 72677 72371 72262 72380 72930 74171 75848 77021 76835 75485 74046 73279 72971 72591 72153 72083 72427
66075 72427 72707 72532 72080 71918 72517 73892 75486 76452 76370 75704 75361 75845 77021 78571 80196 81385 81543
66058 81543 80668 79518 78813 78585 78532 78642 78983 79190 78731 77599 76266 75001 73724 72580 72063 72313 72740
66041 72740 72724 72466 72686 73545 74281 74117 73307 72971 73881 75631 77160 77887 78074 78172 78307 78478 78809 79214 79129
66022 79129 78018 76116 74336 73465 73663 74561 75551 76116 76260 76543 77349 78258 78572 78362 78449 79269 80308 80853
66004 80853 80772 80324 79630 78716 77804 77244 77270 77949 79096 80194 80738 80876 81329 82484 83919 85093 86064 87216
65986 87216 88671 90445 92831 96076 99894 103754 107467 110952 113703 115155 115564 115822 116307 116540 116197 115777
65970 115777 115850 116141 115922 115105 114403 114465 115254 116305 117257 117987 118465 118662 118540 118003 116870 114986 112438 109632
65952 109632 107027 104708 102288 99385 96211 93528 91890 90993 89932 88159 86073 84572 84049 83988 83649
65937 83649 82934 82354 82210 82150 81638 80606 79436 78498 77902 77570 77344 77098 76908 76984 77301 77497 77384 77355 77890
65918 77890 78743 79071 78457 77396 76601 76188 75802 75298 74932 74948 75248 75537 75597 75374 74897 74216 73416 72655 72093
65899 72093 71725 71337 70722 69954 69357 69247 69755 70819 72123 73087 73214 72566 71717 71073 70419 69339 67948 66912
65881 66912 66710 67124 67514 67451 66959 66296 65677 65269 65222 65590 66272 67150 68279 69753 71352 72462 72530 71601 70302
65862 70302 69342 69072 69445 70192 71014 71676 72021 71845 70870 68993 66574 64321 62818 62221 62361 62914 63458 63596
65844 63596 63281 62918 62964 63439 63985 64368 64700 65111 65411 65324 64996 64995 65706 66849 67746 68030 67930 67941 68339 69019
65824 69019 69610 69715 69290 68856 69058 69834 70276 69693 68617 68339 69465 71357 73050 74200 74867 74907 74139 73015
65806 73015 72515 73215 74674 75913 76334 76135 76007 76504 77611 78791 79478 79555 79335 79169 79184 79357 79634 79903
65788 79903 80026 79982 79890 79755 79332 78386 77063 75862 75231 75214 75495 75697 75689 75705 76091 76822 77330 76965 75709 74256
65768 74256 73338 73056 72946 72550 71819 71096 70889 71542 72887 74174 74637 74208 73530 73172 73020 72643 72008 71507
65750 71507 71294 70990 70224 69148 68142 67237 66240 65361 65206 65946 66857 67099 66774 66759 67490 68334 68358 67377 66003
65731 66003 64880 64221 63964 64010 64241 64534 64887 65462 66434 67791 69221 70128 69970 68816 67506 66994 67433 68111
65713 68111 68280 67841 67161 66532 66013 65566 65069 64295 63157 62005 61474 61914 63019 64082 64637 64827 65162 65952
65695 65952 67072 68239 69361 70482 71525 72360 73042 73698 74211 74337 74218 74436 75329 76564 77599 78359 79107
65678 79107 79842 80229 80134 79861 79801 80093 80780 81984 83722 85655 87241 88191 88611 88699 88444 87764 86849 86185 86122
65659 86122 86595 87340 88265 89375 90463 91176 91398 91337 91149 90739 89973 88883 87552 86110 84927 84455 84599
65642 84599 84560 83680 82248 81139 80735 80591 80124 79227 78166 77215 76562 76321 76399 76412 75903 74704 73105 71629
65624 71629 70615 69980 69472 69016 68665 68236 67376 66133 65124 64908 65450 66395 67548 68733 69610 70120 70854
65607 70854 72282 73749 73967 72634 70901 69966 69821 69720 69375 69151 69367 69949 70738 71686 72688 73511 74004
65590 74004 74282 74623 75197 75861 76297 76408 76559 77196 78214 78942 78816 77890 76617 75399 74454 73861 73524 73259
65572 73259 73083 73249 73882 74733 75432 75782 75701 75101 74028 72731 71389 70027 68903 68647 69594 71151 72282
65555 72282 72607 72573 72597 72541 72232 72058 72664 74283 76681 79570 82689 85504 87239 87443 86421 85010 84002
65538 84002 83758 84147 84650 84656 83952 82926 82173 81856 81624 81108 80258 79160 77832 76373 75050 74026 73135 72222
65520 72222 71544 71472 71870 72156 72045 71924 72337 73286 74153 74215 73203 71597 70388 70365 71508 73181 74861 76458
65502 76458 77959 79144 79861 80340 80935 81700 82394 82797 82804 82319 81298 79959 78815 78408 78931 80026 80904 80850
65484 80850 79772 78327 77484 77844 79211 80685 81296 80748 79557 78360 77194 75669 73776 72181 71616 72139
65468 72139 73041 73378 72669 71348 70514 70987 72530 74177 75220 75630 75646 75475 75465 76031 77116 78023 78067 77218
65450 77218 75990 75002 74766 75517 76992 78598 80004 81352 82829 84363 85855 87274 88316 88463 87659 86520
65434 86520 85622 84976 84515 84453 84745 84776 84210 83655 83746 84027 83626 82768 82597 83472 84415 84461 83765 83108 82936 83246
65414 83246 83852 84385 84469 84158 83873 83769 83621 83463 83789 84787 85904 86525 86708 86899 87242 87581 87840 88058 88251
65395 88251 88486 88820 88983 88528 87653 87390 88417 90041 90996 91083 91286 92286 93569 94292 94438 94744 95810 97699
65377 97699 100224 103158 106161 108863 111217 113618 116484 119779 123122 126369 129815 133726 137948 142318
65363 142318 147250 153397 160593 167626 173349 177719 181413 184652 186838 187237 185677 182545 178476 174115
65349 174115 169898 165878 161827 157545 152922 147831 142190 136270 130674 125904 122036 118928 116529 114784
65335 114784 113326 111530 109009 105970 103053 100794 99288 98269 97446 96707 96061 95526 95121 94932 95053 95420
65319 95420 95708 95490 94618 93544 93164 94124 96151 98191 99309 99364 98788 97968 97111 96531 96615 97371 98310 98928
65301 98928 99090 98832 98153 97300 96948 97597 98814 99534 99262 98570 98305 98613 99019 99112 98773 97958 96699 95316
65283 95316 94292 93835 93786 93925 94110 94133 93795 93181 92580 92062 91378 90461 89725 89681 90467 91894 93693 95465 96636
65264 96636 96823 96229 95390 94607 93794 92849 91952 91467 91680 92549 93609 94213 94100 93659 93502 93818 94292 94526 94361
65245 94361 93819 92989 91934 90611 88913 86931 85094 83820 83135 82790 82624 82549 82347 81885 81518 81848 82955
65228 82955 84209 85019 85455 85880 86258 86211 85657 85024 84784 84973 85276 85400 85226 84757 84121 83604 83451 83547 83491 83159
65208 83159 83002 83547 84689 85791 86398 86556 86466 86295 86385 87101 88229 89013 89097 88977 89122 89107 88224 86606 85171
65189 85171 84612 85017 86237 87955 89499 90350 90875 91908 93534 94981 95830 96528 97399 97897 97465 96584 96333
65172 96333 97100 98313 99356 100284 101599 103583 105967 108162 109840 111240 112842 114804 116986 119413 122368
65157 122368 126077 130625 136170 142801 150184 157927 166347 176288 187927 200316 212322 223455 233502
65144 233502 242098 249275 255930 263072 270795 278449 285450 291366 295538 297332 296774 294467 290971 286654
65130 286654 281923 277011 271602 265173 257718 249652 241033 231418 220653 209367 198457 188270 178513
65117 178513 168841 159461 151140 144551 139616 135653 132155 129157 126768 124807 123041 121326 119291 116467
65103 116467 113101 110262 108617 107641 106684 106157 106781 108103 108931 109064 109484 110776 112463 114087 115895 118036
65087 118036 120043 121669 123438 125728 127930 129191 129480 129308 128826 127876 126647 125556 124659 123782 123160 123332
65071 123332 124306 125246 125193 123964 122298 121221 121154 121530 121391 120427 119258 118612 118532 118628 118783 119214 119908 120384 120128
65052 120128 119138 117944 117043 116286 114932 112541 109696 107466 106202 105308 104306 103551 103520 103862 103687 102645
65036 102645 101338 100665 100985 101769 101925 100730 98681 97220 97348 98705 100205 101191 101665 101788 101756 102031 103039
65019 103039 104599 105979 106648 106714 106679 107022 107895 108974 109709 110059 110815 112762 115638 118421 120692 123209 126981
65002 126981 132133 137877 143372 148445 153699 159975 167495 175480 182734 188565 192967 196096 198014 198894
64988 198894 198930 197991 195859 193001 190543 189156 188353 187194 185284 182717 179451 175320 170466 165225 159645
64973 159645 153657 147674 142504 138493 135116 131646 127941 124438 121583 119440 117695 115895 113828 111777
64959 111777 110278 109531 109198 108802 108076 106844 104917 102473 100277 99085 98832 98785 98510 98289 98438 98659 98434
64942 98434 97811 97386 97508 97896 98082 97975 97830 97802 97726 97342 96682 96166 96262 96981 97813 98262 98378 98608 99203 99967
64922 99967 100577 100932 101149 101397 101865 102738 104084 105815 107817 110017 112285 114391 116135 117493 118615 119692
64906 119692 120748 121495 121568 121074 120721 121061 121683 121538 120113 117957 116027 114903 114681 115101 115544 115411 114875
64889 114875 114879 115994 117656 118950 119775 120659 121717 122483 122733 122796 122959 123088 122991 122685 122134 121108 119557 117859
64871 117859 116508 115724 115358 114984 114135 112791 111596 111173 111257 110936 109766 108129 106382 104307 101711 99020
64855 99020 96839 95277 94192 93704 94011 94887 95872 96785 97644 98214 98169 97632 97133 96983 97067 97291 97880 99068
64837 99068 100712 102352 103588 104471 105609 107710 110767 113857 116083 117549 119010 120678 121937 122357 122332
64822 122332 122430 122584 122381 121829 121264 120626 119409 117409 115126 113209 111858 110971 110521 110397 110023 108689 106371
64805 106371 103918 102187 101262 100648 99991 99303 98717 98384 98504 99109 99846 100342 100730 101364 102075 102236 101685 101017
64787 101017 100753 100830 101187 102242 104196 106371 107935 108944 110014 111222 112110 112641 113325 114326 115184 115593
64771 115593 115814 116135 116576 117290 118577 120109 120835 120138 118647 117383 116536 115591 114292 112882 111617 110633
64755 110633 110145 110248 110542 110494 110112 109851 109815 109557 108814 107972 107527 107345 106770 105409 103654 102347 102037 102606
64737 102606 103589 104605 105335 105348 104468 103338 103069 104058 105559 106657 107233 107587 107603 106952 105808 104748 104013
64720 104013 103478 103213 103480 104141 104707 105057 105519 106132 106358 105781 104597 103244 102000 101171 101190 102149 103539 104759
64702 104759 105635 106297 106924 107864 109563 112015 114589 116734 118563 120391 122072 123238 123914 124418 124846 125205
64686 125205 125852 127122 128490 128764 127391 125111 123018 121324 119448 117109 114873 113555 113376 113862 114368
64671 114368 114515 114174 113342 112211 111194 110648 110560 110697 111044 111948 113772 116552 119932 123205 125583 126856
64655 126856 127827 129623 132323 134686 135538 135058 134314 133875 133464 132820 132282 132372 133147 134186 134983 135281 135205 135158
64637 135158 135486 136141 136678 136615 135886 135118 135372 137275 140341 143508 146465 149976 154629 159808 164402 168091
64621 168091 171321 174370 177205 180112 183612 187639 191455 194517 196886 198707 199916 200643 201266 201789 201689
64606 201689 200583 198543 195514 191153 185643 180112 175625 172072 168556 164586 160414 156494 153152 150672
64592 150672 149187 148472 148064 147529 146500 144784 142716 141110 140474 140493 140552 140478 140405 140302 140137 140210 140743 141352 141466
64573 141466 141142 140870 140801 140769 140975 141894 143479 145078 146249 147050 147496 147452 147234 147584 148744 150125 151173 152005
64555 152005 152895 153758 154541 155473 156469 156834 156164 155024 154084 153053 151216 148715 146427 144734 143182 141403
64539 141403 139633 138179 136959 135758 134500 133174 131911 131165 131329 132120 132835 133247 133680 134182 134320 134006
64523 134006 133838 134252 134976 135755 137009 139132 141583 143337 143963 143738 142991 141989 141175 140780 140273 138860 136590
64506 136590 134367 132873 131993 131303 130464 129066 126813 124148 122086 121059 120452 119570 118555 117908 117662 117564
64490 117564 117647 117990 118159 117620 116590 115865 115770 115793 115333 114341 113123 112002 111349 111526 112480 113605 114247 114198 113619
64471 113619 112721 111734 111020 111005 111909 113579 115503 117099 118207 119224 120567 122055 123132 123697 124257 125106
64455 125106 125844 126034 125971 126362 127480 129088 131016 133230 135312 136499 136537 136139 136261 137154 138411 139698 141046
64438 141046 142506 143932 145226 146540 148102 150024 152348 155121 158313 161806 165521 169401 173199 176574
64424 176574 179597 182892 187006 191827 196964 202569 209269 217273 225976 234584 242723 250267 256998 262764
64410 262764 267696 271958 275431 277910 279372 279760 278711 275904 271589 266401 260669 254270 247104 239410
64396 239410 231575 223844 216252 208608 200640 192415 184583 177854 172278 167369 162960 159521 157482 156557
64382 156557 155912 154848 153240 151486 150096 149182 148331 147216 146245 146254 147487 149288 150931 152397 154144 156413
64366 156413 159046 161764 164375 166880 169568 172800 176506 180065 182893 185055 187094 189342 191555 193174
64352 193174 193863 193861 193830 194315 195354 196754 198623 201370 205280 210373 216616 223818 231365 238627 245767 253580
64336 253580 262282 271067 279233 287237 296092 306144 317016 328370 340049 351595 362289 371668 379540
64323 379540 385613 389661 392129 394044 396216 398839 401924 405739 410803 417794 427547 440747 457539 477743
64309 477743 501595 530010 564055 604441 651592 705915 767776 837298 914220 997763 1086427
64298 1086427 1177788 1268233 1352758 1425390 1480473 1514092 1524641 1512599 1480095 1430401 1367276
64287 1367276 1294591 1216473 1137152 1059918 986218 916249 850335 789252 733422 682582 636419
64276 636419 594936 557986 525003 495449 469065 445489 424142 404765 387623 372875 360095
64265 360095 348636 338063 327981 317934 307838 298142 289225 280963 273170 265968 259325 252763 246090
64252 246090 240000 235248 231509 227816 223908 220377 217515 214928 212514 211005 210965 211755 212090 211470 210565 210235
64236 210235 210630 211385 212293 213442 214726 215610 215646 215048 214446 214110 213795 213394 213274 213663 214079 213856 213084 212534
64218 212534 212716 213400 214084 214529 214762 214984 215679 217441 220426 224105 227804 231368 235189 239716 245183 251714
64202 251714 259464 268516 278713 289703 301186 313116 325589 338561 351749 364840 377732 390606
64190 390606 403977 418721 435804 455866 479312 506894 539777 578679 623382 673647 730365
64179 730365 795025 868049 948384 1034755 1126245 1220806 1313678 1398120 1467717 1517796 1545303
64168 1545303 1548653 1528252 1486736 1428194 1357102 1277732 1193945 1109085 1026048 947360 874699
64157 874699 808196 746710 689364 636688 589952 549517 514288 482772 454218 428612 405988
64146 405988 386054 368335 352361 337772 324423 312387 301774 292589 284764 278168 272419 266870
64134 266870 261081 255270 250056 245682 241724 237668 233601 230153 227868 226787 226577 226860 227316 227635 227534
64119 227534 226909 225857 224498 222887 221282 220410 221025 222973 224987 225898 225968 226532 228235 230142 230911 230472
64103 230472 230026 230604 232192 234298 236758 239637 242714 245573 248201 251081 254523 258111 260953 262430 262618
64088 262618 262106 261458 260762 259561 257343 254256 251225 249063 247502 245453 242359 238877 235998 233889 232166
64073 232166 230962 230978 232420 234570 236779 239310 242714 246772 250635 253817 256551 259294 262497 266875 273253
64058 273253 281806 291778 302216 312769 323608 334895 346607 358615 370619 382148 392931 403140
64046 403140 412951 421920 429144 434008 436450 436520 434164 429710 424166 418576 413092 407025 399788 391534 382859
64031 382859 374193 365653 357276 349195 341637 334840 328884 323540 318430 313506 309176 305820 303272 301048
64017 301048 298963 297218 295877 294667 293395 292244 291413 290748 290017 289357 289121 289411 290142 291494 293802 296898
64001 296898 299962 302337 304229 306355 309169 312767 317260 322701 328689 334616 340559 347418 355835 365311
63987 365311 374850 384297 394576 406645 420734 436627 454143 472975 492448 511890 531194 550772
63975 550772 571094 592536 615573 640711 668196 698030 730442 766199 806433 852227 904447
63964 904447 963888 1031671 1109587 1200030 1305488 1428139 1569991 1733141 1919507 2130319
63954 2130319 2366099 2627002 2912629 3221267 3549725 3894268 4251452 4617577 4987248
63945 4987248 5352730 5704819 6034394 6333480 6595521 6815156 6987904 7110020 7178628 7191962
63935 7191962 7149512 7052106 6902127 6703750 6462883 6186634 5882638 5558640 5222241 4880484
63925 4880484 4539332 4203515 3877000 3563523 3266473 2988341 2730538 2493791 2278394
63916 2278394 2083946 1909243 1752843 1613652 1490673 1382331 1286466 1201028 1124542 1055901
63906 1055901 994117 938395 888123 842609 801003 762648 727264 694601 664086 635098 607519
63895 607519 581669 557597 534690 512185 490036 468994 449708 432029 415497 400270 386992
63884 386992 375614 364988 354085 343158 333185 324539 316853 309976 304168 299296 294628 289754 285126
63871 285126 281397 278686 276784 275533 274564 273115 270590 267162 263486 260045 257057 254714 253126 252169 251661
63856 251661 251613 252113 253141 254574 256139 257301 257597 257210 256738 256242 255090 252977 250411 247747 244450 239996
63840 239996 234927 230208 225996 221890 218034 214959 212502 209920 207084 204606 202654 200604 198164 195998
63826 195998 194815 194513 194615 194963 195553 196223 196959 198049 199539 200901 201621 201793 201833 201991 202440 203374 204704
63809 204704 206116 207819 210701 215206 220514 225480 229960 234472 238882 242402 244863 247023 249300 251032
63795 251032 251476 250922 250245 249678 248736 247189 245467 244023 242799 241638 240791 240636 241002 241161 240502 238929 236532
63778 236532 233234 229051 224518 220530 217618 215474 213216 210083 205970 201397 197005 193099 189687 186808
63764 186808 184483 182357 179862 176978 174476 173069 172612 172450 172245 171936 171237 169889 168352 167547 167820 168714
63748 168714 169790 171005 172199 172935 173142 173281 173579 173775 173983 175060 177466 180352 182559 184130 186125 189171
63732 189171 193032 197430 202394 207690 212621 216741 220380 224226 228642 233424 237912 241306 243223 244055
63718 244055 244537 245009 245400 245773 246387 247248 248098 249029 250651 253462 257390 262025 266872 271289 274766 277596
63702 277596 280808 285016 289662 293773 297127 300231 303427 306558 309404 311900 313898 315147 315620 315579 315219
63687 315219 314493 313301 311598 309268 306125 302136 297469 292366 287169 282402 278529 275576 273229 271257
63673 271257 269505 267510 264723 261322 258229 255959 253863 251037 247544 244061 240538 236142 230634 225022
63659 225022 220427 216891 213753 210759 208187 206138 204364 202772 201594 200933 200562 200280 200156 200316 200763 201601
63643 201601 203157 205681 209080 213117 217681 222687 227897 233125 238541 244479 251014 258057 265924 275376
63629 275376 286786 299537 312620 325763 339564 354539 370539 387259 404783 423162 441719
63618 441719 459327 475256 489238 500763 508927 513203 513916 511889 508049 503540 499543 496508 493937
63605 493937 491303 488767 486500 483783 479524 473497 466342 458392 449219 438459 426476 414018 401658
63592 401658 389774 378582 367984 357764 348193 340092 334028 329732 326478 323796 321652 320284 320047
63579 320047 321182 323503 326573 330309 335135 341301 348308 355280 361749 367879 374205 381349 389836 399888
63565 399888 411391 424080 437570 451298 464834 478396 492628 507646 522637 536544 548642
63554 548642 558119 563780 564946 562465 558178 553448 548661 543967 539726 536170 533309 531420 531037 532059
63540 532059 533250 533056 530692 526202 519830 511859 502921 493816 484791 475322 464805 453312 441503 429972
63526 429972 418880 408022 396980 385305 372947 360578 349148 338988 329637 320702 312445 305197
63514 305197 298614 292102 285783 280333 275853 271584 267008 262652 259396 257327 255668 253560 250596 246833
63500 246833 242753 239158 236731 235603 235396 235664 236201 237081 238437 240128 241680 242848 244209 246785 250951
63485 250951 256055 261263 266273 270983 274981 277923 280045 281786 283056 283354 282466 280638 278173 275302 272354
63470 272354 269615 267014 264307 261529 258963 256734 254843 253507 253063 253479 254330 255375 256879 259264 262608
63455 262608 266512 270359 273837 277321 281637 287269 294035 301656 310209 319636 329231 338279 346977 356105
63441 356105 365951 376310 387480 400331 415089 430844 446768 463328 481785 502857 526308 551519
63429 551519 577927 604963 631942 658018 682025 702520 718303 728999 735041 737209 736234 732715
63417 732715 727225 720546 713755 707788 702703 697554 691156 682875 672590 660185 645474 628533 609782
63404 609782 589696 568645 547085 525711 505326 486589 469873 455235 442435 431116 421123 412704
63392 412704 406325 402207 400023 399133 399140 400256 403137 408403 416249 426435 438585 452521 468270 485648
63378 485648 503926 522038 539105 554634 568380 580395 591251 601798 612521 623436 634736
63367 634736 647000 660278 673251 683856 690750 693878 693774 690845 685460 678353 670613 663265 656810
63354 656810 651134 645898 641005 636462 631799 625982 618091 607764 594847 579172 561118 541875 522532
63341 522532 503218 483707 464512 446526 429833 413863 398811 385926 376057 368629 362467 356942
63329 356942 351851 346762 341210 335340 329847 325324 321886 319262 316944 314409 311447 308320 305520 303503
63315 303503 302670 303389 305954 310587 317361 325882 335225 344603 354015 363749 373277 381221 386487 388804 388055
63300 388055 383848 376214 366202 355260 344298 333656 323522 313958 304864 296417 289269 283889 279899
63287 279899 276453 273064 269760 266689 264000 261928 260568 259615 258662 257652 256802 256246 256020 256181 256651 257096
63271 257096 257261 257293 257481 257856 258334 259013 260045 261365 262867 264668 266889 269424 272182 275324 278922 282677
63255 282677 286364 290228 294480 298752 302716 307019 312791 320190 328191 335949 343716 352148 361440 371574
63241 371574 382872 395657 409601 424005 438705 454292 471468 490455 511016 532615 554439
63230 554439 575597 595663 615005 634455 654617 675561 697037 718801 740736 762959 785900
63219 785900 810084 835565 861707 887706 913171 937922 961329 982279 999802 1013388 1022693 1027410
63207 1027410 1027618 1023841 1016495 1005634 991484 974790 956264 936013 913963 890566 866616 842566
63195 842566 818629 795526 774542 756676 742053 730268 720998 714234 710362 710166 714393 722965 734801
63182 734801 748639 763954 780864 799303 818628 838134 857712 877751 898386 919043 938911
63171 938911 957758 976061 994257 1011979 1028100 1041365 1050893 1056236 1057187 1053636 1045574 1033198 1016902
63158 1016902 997117 974293 949162 922799 896051 868981 841335 813625 787268 763435 742122
63147 742122 722611 704431 687543 671981 657911 645907 636655 630317 626457 624631 624784 627116 631806
63134 631806 638849 647901 658277 669252 680328 691067 700791 708642 713836 715658 713450 707056 697247
63121 697247 685346 672335 658589 644473 630821 618603 608342 600009 593303 587813 583077 578794
63109 578794 575078 572251 570285 568596 566623 564525 562994 562322 561971 561241 560077 558905 557954 557199 556756 556810
63093 556810 557113 557097 556601 556099 556138 556945 558566 560828 563052 564463 565185 566287 568484 571277 573778 575923
63077 575923 578386 581653 585681 590221 595063 600168 605895 612828 621084 630091 639352 649033 659479 670621
63063 670621 682347 695052 709306 725325 743247 763515 786360 811217 837350 864860 894520
63052 894520 926745 961279 997632 1035283 1073688 1112619 1152288 1192606 1232699 1271775 1310164
63041 1310164 1348735 1387592 1426187 1464509 1503248 1542790 1582801 1622720 1661795 1698651 1731688
63030 1731688 1759978 1783039 1799764 1808489 1808259 1799182 1781481 1755140 1720696 1679508 1632934 1582063
63018 1582063 1528474 1474335 1421341 1370360 1322420 1279081 1241296 1208751 1180928 1158118 1140797
63007 1140797 1128782 1121742 1119908 1123532 1132106 1144896 1161789 1182988 1208166 1236526 1267315 1299742
62995 1299742 1332849 1366160 1400085 1435041 1470506 1505641 1540438 1575341 1609853 1642360 1671354
62984 1671354 1696093 1715929 1729722 1736274 1734885 1725185 1706722 1679090 1642462 1597903 1547122 1491809
62972 1491809 1433177 1372171 1309983 1247942 1186907 1127249 1069614 1015150 964664 918031 874814
62961 874814 834912 798099 763456 730115 698311 669022 642650 618700 596620 576263 557557
62950 557557 540416 525066 511782 500145 489148 478308 468120 459128 451033 443169 435485 428553
62938 428553 422686 417490 412353 407135 402292 398406 395657 393656 391733 389386 386552 383589 381032 379256
62924 379256 378283 377843 377499 376652 374644 371265 367192 363584 361024 359134 357334 355628 354355 353425 352260
62909 352260 350397 347869 344996 342084 339359 337030 335317 334393 334170 334153 333760 332888 331957 331308 330852 330471 330432
62892 330432 331066 332255 333565 334749 335803 336631 336981 336664 335662 334109 332376 331039 330470 330450 330356 329671 328232
62875 328232 326155 323806 321741 320414 319887 319940 320402 321225 322238 323016 323140 322652 322219 322633 323973 325484 326505
62858 326505 327263 328305 329483 330179 330503 331379 333216 335289 336779 337641 337964 337260 335225 332711 331051 330624
62842 330624 330720 330604 330038 328967 327501 326235 325926 326684 327877 328860 329432 329671 329784 330123 330962 332285 334061
62825 334061 336576 340079 344251 348429 352296 355980 359656 363454 367546 371856 375889 379350 382699 386524
62811 386524 390537 393936 396658 399553 403265 407626 412310 417369 422915 428906 435568 443551 453299 464627
62797 464627 477138 490697 505290 520791 537228 555122 575376 598910 626357 657856 693135
62786 693135 732033 774887 822195 874074 930413 991347 1056990 1126817 1199827 1275177 1351919
62775 1351919 1428121 1500984 1568038 1627559 1677808 1716809 1743285 1757064 1758166 1746338 1722123
62764 1722123 1687600 1645065 1595371 1538456 1475322 1408572 1340883 1273676 1207402 1142442 1079366
62753 1079366 1018737 961136 907205 857341 811357 768688 728983 692399 659293 629751 603512
62742 603512 580217 559512 540893 523786 507993 493817 481482 470602 460603 451508 443931 438312
62730 438312 434559 432361 431400 431184 431151 431192 431820 433708 437234 442451 449120 456756 464998 474061 484532 496740
62714 496740 510634 526231 543659 562774 583332 605722 631026 660114 693151 730142 771397
62703 771397 817168 867405 922245 982176 1047216 1116341 1188183 1261833 1336312 1409577 1478785
62692 1478785 1541539 1596336 1641899 1676674 1699204 1708683 1705050 1688854 1661180 1623474 1577255 1523903
62680 1523903 1464630 1400665 1333584 1265405 1198082 1132817 1070029 1009979 953093 899660 849741
62669 849741 803636 761998 725228 692996 664546 639080 615704 593606 572695 553603 536610
62658 536610 521016 506002 491557 477960 464848 451678 438766 426993 416595 407112 398471 391207
62646 391207 385482 380695 376330 372446 369049 365642 361836 357807 353801 349732 345762 342713 341280 341113
62632 341113 341294 341464 341885 342487 342567 341608 339941 338369 337422 337169 337483 338273 339557 341436 343930 346775 349540
62615 349540 352074 354718 357957 361985 366758 372396 379204 387240 396156 405699 416286 428825 443971
62602 443971 461701 481643 503624 527852 554704 584413 616841 651441 687508 724508 762048
62591 762048 799472 835563 868722 897413 920480 937278 947678 951913 950276 942940 930048 911940
62579 911940 889282 863026 834185 803533 771637 739313 707914 678744 652086 627104 602889
62568 602889 579422 557384 537354 519449 503577 489668 477618 467199 458122 450165 443263 437474
62556 437474 432766 428813 425117 421351 417525 413867 410662 408086 405936 403628 400803 397887 395620 394064
62542 394064 392575 390885 389602 389373 390108 391467 393587 396748 400707 405018 409867 415997 423833 433202 443868
62527 443868 455841 469134 483750 500011 518503 539496 562687 587684 614550 643827 676172
62516 676172 711942 750920 792466 835997 881192 927447 973331 1016973 1057008 1092908 1124532
62505 1124532 1151758 1174576 1193142 1207630 1218235 1225350 1229565 1231586 1232405 1233380 1235648 1239372 1243792
62492 1243792 1247891 1250698 1251106 1248059 1241105 1230449 1216341 1198717 1177361 1151941 1121925 1087147
62480 1087147 1048683 1008587 968437 928496 888455 848424 808862 770151 732877 698076 666554
62469 666554 638103 612040 588348 567669 550189 535183 521883 510304 500954 494011 489090 485660
62457 485660 483448 482454 482724 484095 486227 488932 492383 496821 502120 507875 513938 520633 528312 536796 545363
62442 545363 553206 559898 565515 570379 574626 578003 580237 581595 582867 584583 586315 586958 585668 582414
62428 582414 577656 571763 564913 557338 549381 541243 532921 524487 516274 508617 501467 494495 487539 480876
62414 480876 475021 470390 467099 464897 463245 461704 460410 460066 461241 463711 466639 469449 472353 475877
62400 475877 480012 484062 487432 490361 493640 497648 501981 506172 510468 515565 521644 528026 533842 538750
62386 538750 542912 546624 550273 554406 559436 565185 570955 576156 580781 585325 590419 596611 604261 613528
62372 613528 624497 637396 652581 670295 690607 713650 739736 769076 801487 836536 873783
62361 873783 912604 951826 989832 1025126 1056672 1083770 1105921 1122873 1134564 1140985 1142408 1139777
62349 1139777 1134391 1126873 1116742 1103288 1086633 1067507 1046260 1022629 996509 968546 939917 911828
62337 911828 885191 860386 837183 815117 793990 773908 754976 737277 720981 705993 691552
62326 691552 676752 661563 646872 633451 621400 610664 601346 593158 585247 577197 569757 563986 559956
62313 559956 556813 553806 550662 547245 543615 540410 538487 538057 538619 539797 541705 544361 547309 550162 553144
62298 553144 556775 561182 566052 571138 576482 582096 587650 592773 597672 603256 610391 619076 628613 638498
62284 638498 648756 659347 669824 679873 689673 699272 707998 715090 720668 725428 729554 732588 734477
62271 734477 736207 739238 744662 752887 763765 777021 792966 812715 837193 865951 897411 930256
62259 930256 963975 998056 1031388 1062719 1091074 1115412 1134539 1147897 1156104 1160284 1161052 1158295
62247 1158295 1151455 1139680 1122276 1099602 1073284 1045009 1015324 984076 951743 919703 889261
62236 889261 860995 835088 811713 790881 772257 755393 740017 726109 713892 703725 695676 689148
62224 689148 683263 677778 673339 670639 669523 669202 669223 669963 672165 676230 682037 689190 697263 705951 715224
62209 715224 725266 736004 746676 756166 763852 769817 774116 776334 776270 774713 772933 771546 770386 769387
62195 769387 768857 768830 768943 769326 770974 774743 780386 787008 793916 800470 805682 808929 810904 812918 815151
62180 815151 816461 816254 815764 816980 820922 827557 836960 849595 865480 883797 903595 924367 945737
62167 945737 966963 987055 1005047 1019928 1030685 1036926 1039275 1038704 1035548 1029594 1020935 1010057 996938
62154 996938 980793 961136 938652 914555 889510 863718 837831 813026 790143 769212 749910
62143 749910 732036 715478 700189 686352 674243 663728 654139 644763 635254 625567 615844 606467 597950
62130 597950 590563 584278 579191 575699 574050 573826 573976 573298 570961 566928 562010 557385 553975 552242 552214
62115 552214 553223 553813 552561 549182 544392 538694 531908 524014 515704 507687 500068 492907 486812 482266
62101 482266 478761 475353 471898 469089 467394 466682 466853 468071 470161 472445 474605 477282 481325 486679 492464
62086 492464 498125 504145 511438 520277 530093 540319 551117 563008 575962 589250 602251 615061
62074 615061 628199 642049 656769 672395 688736 705410 722207 739110 755589 770203 781388
62063 781388 788577 792234 793037 791521 788283 783779 777772 769490 758499 744991 729093 710463 688987
62050 688987 665507 641461 617947 595362 573727 552999 533211 514661 497942 483470 470922
62039 470922 459411 448305 437701 428060 419594 412173 405716 400375 396256 393067 390153 386977 383578
62026 383578 380545 378480 377419 376761 375775 374120 371895 369329 366644 364139 362060 360294 358427 356303 354329
62011 354329 353067 352710 353224 354694 357168 360240 363240 365882 368388 371015 373784 376620 379355 381513 382542
61996 382542 382388 381505 380207 378370 375851 372696 368731 363492 356944 349902 343344 337574 332370 327621 323332
61981 323332 319218 314810 310008 305311 301535 299355 298872 299372 299760 299534 299217 299641 301066 303183 305648 308250
61965 308250 310837 313418 316147 318931 321329 323208 325159 327790 330870 333677 336013 338359 341193 344653
61951 344653 348788 353638 359085 365131 372258 381074 391562 403066 414941 426895 438868 451042 463871
61938 463871 477511 491250 503975 515241 525419 534897 543664 551603 558523 563819 566765 567365 566449
61925 566449 564745 562393 559430 556201 553059 550226 548214 547843 549578 553284 558858 566497 576011 586475
61911 586475 597083 607954 619552 631661 643410 654051 663238 670800 676811 681838 686670 691744 697078
61898 697078 702560 707962 712768 716407 718642 719498 718875 716533 712435 706743 699416 690115 678685 665606
61884 665606 651783 637871 623904 609633 595177 581173 568211 556340 545379 535467 526974 519910
61872 519910 513832 508377 503555 499528 496503 494816 494683 495765 497524 500184 504813 512154 521857 533197
61858 533197 546064 560789 577355 595304 614183 633675 653551 673800 694501 715144 734466
61847 734466 751483 766337 779551 790696 798599 802835 804245 803907 802305 799850 797611 797017 799014 803799
61833 803799 811235 821316 834279 850409 869682 891598 915377 940038 964049 985015 1000187 1007425
61821 1007425 1005720 995071 976350 951189 921468 888737 854363 820028 787447 757348 729268
61810 729268 702680 677952 655857 636480 619093 603083 588648 576550 567341 560821 556141 552397
61798 552397 549125 546186 543366 540365 537176 534102 531357 528956 527078 526060 525816 525712 525393 525411 526619
61783 526619 529133 532335 535730 539413 543823 549432 556583 565231 574900 585268 596671 609644 624115
61770 624115 639648 656292 674434 693688 712791 730966 748607 766011 782062 794886 803451 807774
61758 807774 807885 803531 794892 782716 767546 749496 729123 707888 687259 667739 649136 631437
61746 631437 614959 599813 585727 572435 560007 548765 539019 530821 523872 517696 511942 506493 501350
61733 501350 496560 492195 488186 484265 480388 477094 475000 473903 472955 471788 470842 470397 470000 469300 468763 468928
61717 468928 469485 469775 469806 469975 470110 469627 468497 467214 465868 464031 461625 459071 456487 453468 449918 446365
61701 446365 443248 440526 438300 437090 437030 437369 437240 436579 435879 435465 435412 435850 436974 439053 442668 448494 456502
61684 456502 465757 475403 485496 496475 508180 519850 530758 540455 548770 555982 562618 568482 572295
61671 572295 572928 570674 566547 560548 551547 538950 523644 507129 490494 474596 460533 449254 440918
61658 440918 435115 431578 430390 431617 435126 440826 448876 459456 472274 486260 499784 511298 519769
61645 519769 524556 525105 521018 512374 499817 484463 467835 451600 436879 423705 411432 399725
61633 399725 389013 379986 372906 367412 362801 358548 354824 352443 352003 353081 354576 355867 357200 358921
61619 358921 360776 362277 363403 364530 365841 367143 368162 368718 368593 367524 365434 362566 359360 356236 353496
61604 353496 351258 349443 347897 346601 345724 345433 345674 346219 346933 347911 349345 351362 354056 357531 361764 366486
61588 366486 371393 376423 381655 387001 392323 397831 403965 410756 417736 424744 432393 441287 451042 460631
61574 460631 469658 478802 489008 500759 514301 530133 548931 571146 596899 626152 658765 694414
61562 694414 732548 772319 812394 850831 885266 913392 933466 944595 946739 940593 927473 909094
61550 909094 887101 862692 836790 810526 785269 762070 741337 723117 707333 693529 680873
61539 680873 668898 657994 648720 640798 633305 625744 618388 611530 604982 598453 591990 585840 580169 575037
61525 575037 570357 565802 561137 556811 553889 553180 554661 557886 562641 569002 577059 586884 598644 612487
61511 612487 628410 646368 666442 688885 714196 743260 777150 816627 861941 913145 970329
61500 970329 1033423 1102069 1175873 1254460 1336880 1420929 1503159 1579531 1646155 1699860 1738602
61489 1738602 1761631 1769503 1764145 1748813 1727428 1703641 1680630 1661726 1650601 1650353 1662576 1687612
61477 1687612 1725467 1776120 1839150 1913431 1996993 2086673 2177778 2264387 2340136 2398887 2435266
61466 2435266 2445517 2428330 2384978 2318808 2234689 2138399 2035587 1930791 1827429 1728489 1636710
61455 1636710 1553901 1480513 1416173 1360458 1313077 1273720 1242144 1218434 1202955 1196080 1198013 1208773
61443 1208773 1228249 1256329 1292975 1337876 1389616 1444978 1498957 1545523 1578841 1594741 1591934
61432 1591934 1572257 1539675 1498839 1454068 1409028 1366749 1329776 1300276 1279903 1269471 1269023 1278477
61420 1278477 1298185 1328676 1369824 1420188 1476566 1533581 1583878 1619779 1635824 1630317 1604918
61409 1604918 1563311 1510237 1450827 1389597 1329505 1271955 1217581 1166814 1119877 1076741 1037316
61398 1037316 1001541 969271 940294 914447 891506 870966 852269 835210 819792 805630 792085
61387 792085 779225 768203 760183 755163 752269 750982 751521 754091 758335 763651 769699 776441 783983 792440
61373 792440 801606 810650 818423 824247 828153 830220 830042 827165 821908 815417 808898 802887 797234 791596
61359 791596 785902 780365 775073 769674 763567 756365 748047 738813 729014 719174 709695 700524 691416 682575
61345 682575 674589 667566 660794 653588 646142 639194 633179 628140 624153 621241 618945 616530 613705 610785
61331 610785 608239 606572 606549 608728 612476 616089 618439 620179 622921 627523 633626 640488 647571 654527 661381
61316 661381 668916 678194 689332 701139 712303 722565 732367 741805 750552 758689 766872 775484 784063
61303 784063 791865 798686 804840 810566 815754 820142 823476 825453 825710 823961 820090 814229 806869 798847
61289 798847 790985 783689 776944 770670 764959 759963 755743 752326 749857 748637 748954 750856 754091 758370
61275 758370 763757 770702 779600 790345 802362 814849 826782 836863 843827 847016 846635 843544 838900
61262 838900 833815 829005 824689 821038 818691 818583 821266 826755 835135 846945 862838 883275 908894
61249 908894 940848 980342 1027954 1083772 1148052 1221175 1302714 1390625 1481109 1568664 1646217
61238 1646217 1706206 1742852 1754314 1742958 1713705 1672083 1623312 1572343 1523870 1481892 1449159
61227 1449159 1427097 1416244 1416895 1429540 1454832 1493030 1543163 1602498 1666636 1729891 1785510 1826186
61215 1826186 1845666 1841054 1813858 1768634 1710564 1644235 1573959 1503945 1437469 1376145 1320435
61204 1320435 1270645 1226997 1188986 1155327 1124834 1097030 1071746 1048495 1026676 1006290 988047
61193 988047 972565 959610 948329 938156 929247 921901 915690 909477 902371 894395 885957 876837 866093
61180 866093 853038 837980 821775 804957 787590 769898 752637 736716 722540 709791 697794
61169 697794 686121 674952 664902 656508 649966 645274 642383 640995 640428 640013 639535 638985 637931 635536
61155 635536 631246 625174 617712 609149 599788 590059 580257 570482 561103 552960 546695 542082 538467 535774
61141 535774 534622 535393 537555 539993 541784 542623 542805 542896 543266 543883 544697 546017 548122 550553 552386 553389
61125 553389 554389 556226 558912 562346 567392 575295 586095 598460 611323 624978 640108 656323 672330
61112 672330 687222 700858 713054 723150 730622 735611 738617 740127 740795 741418 742226 742513 741570 739828
61098 739828 738529 738372 739106 740466 742753 746091 749695 752457 754077 755173 756401 757873 759352 760623 761534
61083 761534 761945 761772 760994 759630 757841 756098 755035 754956 755509 755947 755830 755448 755485 756260 757417 758419 759150
61066 759150 759880 760846 762163 764021 766558 769525 772406 774980 777432 779930 782538 785631 789852 795300 801110
61051 801110 806201 810227 813615 817040 821169 826564 833396 841478 850940 862614 877308 894923 914772
61038 914772 936647 961000 987947 1016511 1045103 1072709 1099611 1127178 1157037 1190534 1228889
61027 1228889 1273462 1325315 1384566 1450669 1523363 1602976 1690241 1787122 1898270 2030745 2192107
61016 2192107 2390067 2634598 2938779 3316474 3780617 4345071 5026809 5845839 6826592
61007 6826592 7999554 9386525 10958027 12589870 14074178 15205275 15884694 16160583
60999 16160583 16177920 16098925 16059882 16162405 16451362 16869905 17246073 17358508 17049434 16297869
60989 16297869 15202888 13909451 12544655 11196927 9922572 8755016 7710385 6793050
60981 6793050 6000442 5324707 4753477 4272559 3868598 3529196 3242257 2997005 2785264
60972 2785264 2600867 2438601 2294660 2167184 2055009 1956221 1868860 1792315 1726720 1671216
60962 1671216 1623930 1583422 1549051 1519873 1494109 1469850 1445701 1420826 1395116 1369337 1344559
60951 1344559 1321346 1299761 1279809 1261277 1243410 1225327 1206607 1187003 1165945 1142962 1118308
60940 1118308 1092621 1066388 1040418 1016315 995439 977603 961702 947485 935695 926672 919955 915340
60928 915340 913088 912650 912232 910287 906856 902971 899385 896382 894288 893473 894024 895787 898605 902235 906195
60913 906195 909838 912551 913929 913923 912731 910261 906020 899952 893139 887034 882066 877594 873026 868133 862261
60898 862261 854274 843697 831242 817838 803840 789592 776059 764279 754628 747078 741689 738270
60886 738270 735927 733580 730706 727115 722385 716217 709194 702474 696562 690928 685026 679254 674615 671659
60872 671659 670084 669266 668858 668714 668476 667562 665605 662648 658800 653979 648250 642176 636470 631429 626994
60857 626994 623192 620110 617516 614943 612218 609566 607169 604965 602913 601161 599902 599257 599136 598879 597284
60842 597284 593544 588107 582058 575707 568408 559768 550270 540481 530421 520114 510211 501560 494495 488830
60828 488830 484178 479984 475703 471321 467371 464207 461635 459474 457889 456718 455028 451975 447811 443454
60814 443454 439315 435145 430888 427034 423982 421505 419004 416139 413165 410735 409296 408629 408164 407726 407635
60799 407635 407989 408332 408302 408148 408259 408581 408962 409621 410764 412038 412992 413744 414537 414856 413804 411426 408860
60782 408860 407011 405627 403944 401670 398997 396119 393189 390524 388472 387132 386455 386473 387176 388238 389152
60767 389152 389737 390411 391822 394168 396911 399243 400768 401612 401897 401498 400463 399350 398713 398436 397995 397309
60751 397309 396936 397389 398692 400679 403263 406145 408621 410037 410293 409609 408013 405435 402251 399355 397515
60736 397515 396821 396809 396975 397072 397104 397205 397562 398329 399517 400967 402409 403598 404429 404956 405222 405085 404288 402764
60718 402764 400845 399036 397584 396302 394786 392721 389963 386485 382396 378043 373961 370568 367809 365129
60704 365129 361969 358338 354780 351783 349430 347704 346776 346647 346783 346579 346023 345409 344542 343011 341346 341049
60688 341049 342941 346103 349006 351244 353457 356004 358517 360675 362611 364451 366060 367384 368608 369814
60674 369814 370789 371227 370894 369740 368186 367035 366572 365919 363978 361001 358477 357344 356985 356256 354898 353570
60658 353570 352957 353249 354191 355331 356419 357714 359661 362226 364950 367639 370427 373004 374405 373906 371699
60643 371699 368380 364320 359920 355916 352737 349835 346279 341973 337852 334918 333435 333044 333264 333716 334081
60628 334081 334157 334103 334590 336366 339406 342742 345493 347941 351074 355182 359502 363232 366297 368941 371192
60613 371192 372968 374196 374651 374162 373149 372347 371813 370887 369387 368066 367477 367134 366303 364992 363545 361960
60597 361960 360341 359426 359809 361019 362189 363358 365288 368208 371492 374487 376931 378681 379705 380422 381467
60582 381467 383089 385113 387321 389388 390686 390725 389718 388205 386350 384161 382144 381020 380844 381069 381481
60567 381481 382420 384063 386148 388512 391367 394966 399412 404753 410760 416715 422097 427469 433982 441838
60553 441838 449973 457482 464638 472057 479501 486235 492327 498936 507204 517307 528824 541895 557698
60540 557698 577636 602210 630898 662923 697600 733760 769360 802013 829591 850083 861522
60529 861522 862826 854568 838490 816455 790221 761720 732747 704376 677218 652085 629919 611253
60517 611253 596191 584671 576235 570011 565679 564127 566344 571984 579958 590171 603587 620746 641517
60504 641517 666367 696455 731896 770967 811545 852394 892453 929740 961775 986602 1003086
60493 1003086 1011027 1011743 1007956 1002469 997312 994303 995422 1001712 1012362 1025559 1039700 1053071 1063046
60480 1063046 1066723 1062298 1049193 1027272 996910 959713 918241 874834 831128 788476 748021 710222
60468 710222 674972 642372 612942 587005 564305 544331 526589 510517 495618 481892 469763
60457 469763 459399 450282 441627 433058 424822 417525 411676 407282 403819 400749 398049 396090 395029 394514
60443 394514 394064 393641 393832 395425 398711 403182 408036 412977 418308 424262 430692 437597 445489 454721 464630
60428 464630 473789 481100 486333 489728 491576 492328 492757 493712 495647 498411 501444 504245 506774 509444 512805
60413 512805 517342 523493 531504 541095 551565 562500 574262 587634 603126 620721 639984 660214
60401 660214 680783 701703 723680 747377 772820 799708 827882 856986 885975 913689 939885
60390 939885 965172 989818 1013111 1033970 1051630 1065639 1075783 1082453 1086727 1089674 1091696 1092857
60378 1092857 1093586 1094634 1096371 1098448 1100205 1101218 1101409 1100839 1099485 1097234 1094185 1091051 1089069 1089270 1091816
60363 1091816 1096233 1102290 1110397 1121094 1134312 1149195 1164280 1177600 1186834 1189925 1185861 1174885
60351 1174885 1157999 1136332 1110871 1082430 1051691 1019352 986273 953403 921518 891193 862968
60340 862968 837251 813965 792548 772510 753821 736609 720727 705850 691871 678964 667350
60329 667350 657187 648598 641656 636419 633063 631766 632393 634609 638492 644601 653033 662715 672141 680549
60315 680549 687926 694064 698335 700332 700133 697886 693741 688245 682241 676232 670380 665206 661569 659609
60301 659609 658295 656460 653836 650640 646654 641267 634224 625843 616694 607467 598956 591629 585214 579079
60287 579079 573046 567532 562895 559006 555534 552311 549256 546179 542999 540175 538579 538701 540016 541535
60273 541535 543057 545507 549816 555855 562911 570818 579947 590220 600908 611569 622513 634147 646368
60260 646368 658861 671388 683460 694212 703044 710039 715435 719116 720945 721106 719702 716439 711272
60247 711272 705058 698995 693641 688965 685167 682899 682746 685011 689949 697748 708256 721095 736027 752880
60233 752880 771138 789992 808852 827551 846094 864490 882907 901685 921076 941044 961294
60222 961294 981519 1001840 1023101 1046423 1072276 1100294 1130222 1162614 1198155 1236678 1277532
60211 1277532 1320719 1366967 1416633 1469185 1523926 1580631 1639245 1699391 1760437 1821529 1881069
60200 1881069 1936587 1985723 2027414 2061832 2089265 2109545 2122708 2129814 2132774 2133438 2133015 2132239 2131718
60187 2131718 2131968 2133337 2136081 2140319 2145765 2151677 2157415 2162951 2168555 2174073 2178941 2183000 2186885 2191418
60173 2191418 2196859 2202849 2208828 2214246 2218537 2220994 2220608 2216094 2206490 2191843 2173066 2151010 2126033
60160 2126033 2098527 2069370 2039458 2009036 1977743 1945112 1910805 1874713 1837092 1798349 1758414
60149 1758414 1716626 1672587 1626854 1580486 1534210 1488466 1444021 1401970 1363110 1327699 1295788
60138 1295788 1267384 1242202 1219535 1198573 1178829 1160272 1143045 1126918 1111051 1094521 1077084
60127 1077084 1059097 1040657 1021304 1000774 979526 958165 936814 915509 894806 875481 857972
60116 857972 842631 830178 821131 814856 809902 805394 801650 799427 799095 800663 804085 809226 815711 823014
60102 823014 830714 838721 847348 856891 866885 876024 883189 888469 892777 896655 899833 901894 902849 903043 902900
60087 902900 902775 902619 901700 899016 894188 887713 880339 872418 863914 854751 844991 834814 824397 813775
60073 813775 802874 791760 780743 770168 760256 751313 743878 738438 735114 733706 733846 735008 736759
60060 736759 739213 742887 747781 752990 757591 761473 764815 767177 767806 766556 763808 759601 753598 745896
60046 745896 737200 728061 718557 708884 699769 691996 685884 681426 678667 677768 678839 681808 686423 692477
60032 692477 700113 709656 721035 733736 747504 762565 778769 795139 810949 826816 844007 862993
60020 862993 883493 905441 928650 951491 971081 985201 993287 995383 991097 980156 963351 942378
60008 942378 919067 894967 871173 848169 826136 805560 787173 771233 757404 745476 735748 728525
59996 728525 723697 720894 719626 719284 719589 720954 723766 727345 730527 733286 736767 741528 746896 752474 759060
59981 759060 767300 776517 785916 796118 808388 822914 838979 856394 875545 896188 917330 938257
59969 938257 958641 977555 993469 1005527 1013978 1018985 1019824 1015830 1007548 996345 983218 968524 952680
59956 952680 936582 921248 907310 895012 884601 876655 871910 870742 872888 877863 885552 896238 910159
59943 910159 927332 947804 971706 998921 1028952 1061359 1096130 1133419 1173009 1214326 1256912
59932 1256912 1300504 1344443 1387150 1426499 1460686 1488557 1509169 1521505 1524931 1519773 1507289 1489196
59920 1489196 1467415 1443948 1420505 1398134 1377504 1359459 1344819 1333520 1324423 1316296 1308739 1301785
59908 1301785 1294868 1286766 1276659 1264865 1252304 1239527 1226642 1213979 1202255 1191945 1183021 1175748
59896 1175748 1171302 1170902 1174386 1180328 1187631 1196354 1206772 1218368 1230291 1242310 1254828 1268318 1283178
59883 1283178 1299597 1317036 1334326 1351026 1368351 1388022 1410571 1435677 1463980 1497572 1538628
59872 1538628 1588422 1647749 1717409 1797898 1889276 1991583 2104627 2226825 2354306 2481027
59862 2481027 2599188 2699945 2775275 2820432 2834832 2820787 2782121 2724017 2652802 2574583 2493981
59851 2493981 2414466 2339318 2271593 2213360 2165645 2129001 2103583 2088503 2081545 2079928 2081633 2086281
59839 2086281 2094923 2109040 2129807 2158202 2195383 2242549 2300677 2370811 2454437 2553142 2668169
59828 2668169 2800739 2952355 3123785 3313539 3517693 3730659 3945134 4151598 4339539
59819 4339539 4500131 4627586 4718584 4772263 4791623 4783515 4755774 4714164 4662063 4601719 4534531
59808 4534531 4460445 4378083 4285686 4181905 4066498 3941061 3808777 3672827 3535127 3396731
59798 3396731 3258767 3122397 2988299 2856875 2728728 2604567 2485068 2371250 2264596
59789 2264596 2166345 2077008 1996831 1926154 1864876 1812197 1767427 1730548 1701549 1679857 1664968
59778 1664968 1656961 1655706 1660176 1669260 1682638 1699993 1719924 1740559 1760926 1780897 1800234 1818552
59766 1818552 1835762 1851497 1864310 1872439 1875263 1873217 1866620 1855696 1841726 1827142 1814281 1804705
59754 1804705 1799594 1799754 1804969 1814004 1825423 1837980 1850345 1861286 1870136 1876437 1879139 1876908 1869283
59741 1869283 1856850 1840334 1820301 1797749 1773951 1749398 1723650 1696578 1669059 1642069 1615715
59730 1615715 1589605 1563670 1538114 1512894 1487645 1462005 1435864 1409486 1383503 1358594 1335160
59719 1335160 1313505 1294107 1277345 1263186 1251697 1243703 1240212 1241166 1245510 1252695 1263336 1278026
59707 1278026 1296116 1316181 1337271 1359228 1382028 1405307 1428476 1450925 1471972 1490762 1506443
59696 1506443 1518652 1527925 1535394 1541969 1547946 1553545 1559352 1565857 1572902 1580128 1587728 1596121 1604995 1613283
59682 1613283 1620173 1625710 1630524 1635544 1641920 1650605 1661703 1674512 1688184 1702095 1715913 1730002
59670 1730002 1745677 1764243 1785626 1808440 1831464 1854243 1876026 1894846 1908283 1914859 1914412 1907569
59658 1907569 1895274 1878616 1858650 1836272 1812247 1787177 1761394 1735126 1708755 1682739 1657355
59647 1657355 1632858 1609801 1588754 1569659 1551815 1534628 1517927 1501407 1484022 1464124 1440124
59636 1440124 1411142 1377382 1339951 1300111 1258720 1216465 1174397 1133905 1096304 1062792 1034523
59625 1034523 1012243 995977 985478 980821 982129 989012 1000877 1017517 1038634 1062841 1087892 1111876
59613 1111876 1133519 1151492 1164485 1172300 1175985 1176455 1173702 1167865 1160372 1153326 1147989 1144261 1141362
59600 1141362 1138655 1136090 1134222 1133758 1134970 1137731 1142089 1148366 1156570 1166172 1176516 1186891 1195956 1201707
59586 1201707 1202583 1198382 1189811 1177534 1162044 1144131 1124865 1105108 1085388 1066258 1048501 1032850
59574 1032850 1019661 1008938 1000784 995737 994428 996745 1001537 1007474 1014130 1022052 1031920 1043997 1058188
59561 1058188 1074183 1091560 1110235 1130892 1154597 1181850 1212146 1244418 1277556 1310582 1342702
59550 1342702 1373348 1402143 1428967 1454240 1478915 1503913 1529820 1557072 1585528 1613148 1635850
59539 1635850 1650018 1655348 1654590 1650668 1644813 1637057 1627109 1614244 1597377 1575978 1550602 1522259 1491693
59526 1491693 1459322 1425316 1389583 1352183 1313759 1275039 1236072 1196787 1158235 1122208 1089412
59515 1089412 1058985 1030151 1003391 979503 958350 939210 921739 905981 891967 879788 869681
59504 869681 861612 855217 850366 847235 845525 844331 843256 843016 844441 847417 851321 855939 861286 866912
59490 866912 872064 876396 880182 883911 887899 892033 895836 899128 902636 907369 913302 919288 924378 928484
59476 928484 931565 933073 932752 931277 929641 928430 928028 928780 930432 932049 932953 933137 932481 930441 927047 923299
59460 923299 919751 915499 909396 901596 892989 883785 873695 863025 852428 841806 830479 818443 806667
59447 806667 796221 787740 781605 777847 775983 775541 776723 779946 784917 790821 797290 804521 812429 820325
59433 820325 827499 833643 838697 842709 845915 848657 851272 854323 858680 864965 873039 882373 892937 905574
59419 905574 921678 942329 966861 991823 1012159 1024483 1029268 1029556 1028109 1026335 1025207 1025877 1029373
59406 1029373 1036573 1048379 1064849 1083624 1100043 1109621 1110806 1105496 1097222 1088727 1080908 1073726 1067833
59393 1067833 1064915 1066400 1072422 1082429 1096296 1114339 1136559 1162465 1191552 1223591 1258651 1297071
59381 1297071 1339093 1384243 1431499 1480471 1531914 1586563 1643835 1702117 1759687 1814553 1863758
59370 1863758 1903763 1931643 1945728 1945760 1933264 1911422 1883591 1851778 1816945 1780349 1743774 1708620
59358 1708620 1675643 1645563 1619136 1596520 1577173 1560440 1545792 1532613 1520430 1509293 1499260
59347 1499260 1489464 1478386 1465180 1450234 1434392 1418201 1402026 1386284 1371282 1357076 1343650
59336 1343650 1331085 1319593 1309616 1301714 1296109 1292531 1290784 1291167 1294007 1299179 1306588 1316663 1329636
59323 1329636 1344518 1359408 1372602 1382757 1388204 1387000 1377881 1360817 1336834 1307889 1276789 1246466
59311 1246466 1219004 1195411 1175855 1159523 1144630 1129485 1113715 1098127 1083630 1070885 1060624
59300 1060624 1053486 1049629 1049189 1052948 1061781 1075529 1093136 1113771 1137017 1162067 1187601 1212458
59288 1212458 1235737 1256341 1273296 1286523 1296452 1302974 1305724 1305476 1304253 1303864 1305237 1309238 1317010
59275 1317010 1329052 1344893 1364065 1386392 1410768 1434655 1455621 1472841 1486390 1495635 1499093 1495576
59263 1495576 1484879 1467520 1444313 1416107 1383618 1347647 1309404 1270204 1230693 1190883 1151159
59252 1151159 1112746 1076874 1043999 1014062 986976 962451 939841 918667 898954 880710 863504
59241 863504 847021 831683 818183 806611 796498 787492 779577 772741 766895 762101 758539 756200 754839
59228 754839 754293 754629 755900 757820 759772 761240 762283 763444 765132 767239 769497 771933 774671 777512 780121
59213 780121 782483 784755 786838 788627 790595 793539 797710 802779 808751 816276 825824 837107 849724 863947
59199 863947 880437 899375 920281 942595 966172 991131 1017346 1044149 1070613 1096171 1120706
59188 1120706 1143848 1164376 1180623 1191422 1196433 1195783 1189792 1178966 1163964 1145610 1125148 1104210
59176 1104210 1084084 1065213 1047843 1032942 1021942 1015665 1014090 1017152 1025226 1038786 1058044 1083039
59164 1083039 1113785 1150395 1193410 1243874 1302627 1369486 1443367 1522929 1606589 1692031 1776044
59153 1776044 1854706 1923510 1977987 2015187 2034586 2037210 2024380 1998040 1961646 1919451 1874839
59142 1874839 1830148 1787779 1750111 1718086 1691054 1668441 1650859 1639374 1634637 1637011 1646601 1662727
59130 1662727 1684126 1710049 1740416 1774497 1810275 1845627 1879530 1911673 1941470 1967927 1989950
59119 1989950 2006406 2016433 2020099 2018257 2011445 1999423 1982074 1960061 1934197 1904810 1872301 1837818
59107 1837818 1802755 1767871 1733366 1699580 1667229 1637147 1609994 1585962 1564614 1545228 1527309
59096 1527309 1510333 1493085 1473958 1452232 1428594 1404201 1379649 1354998 1330249 1305591 1281622
59085 1281622 1259399 1239800 1222787 1207840 1195066 1185079 1177729 1171828 1166431 1161628 1157777 1154760 1152348
59072 1152348 1150487 1148754 1146232 1142455 1137871 1132911 1127130 1119790 1110757 1100451 1089490 1078815 1069577
59059 1069577 1062344 1056823 1052749 1050598 1051082 1054434 1060506 1068994 1079100 1089476 1098908 1106732 1112314 1114679
59045 1114679 1113045 1107332 1097896 1085256 1070295 1054142 1037553 1020929 1005064 991166 979887 970990
59033 970990 964156 959285 955805 952713 949832 948087 947963 948575 948890 949007 949470 950108 950420 950494 950675 950840 950812
59016 950812 951138 952734 956075 961216 968165 976774 986766 998278 1011661 1026321 1040662 1053895 1067074
59003 1067074 1081480 1096838 1112153 1127522 1143850 1161236 1179012 1197220 1216878 1238720 1262726
58992 1262726 1289079 1318768 1353046 1392906 1439271 1493244 1556052 1628923 1712782 1807725 1913050
58981 1913050 2028149 2152857 2286150 2424556 2562161 2691863 2806429 2899264 2965505 3002711
58971 3002711 3010300 2988773 2940091 2868330 2778942 2677107 2567061 2452656 2337722 2225682
58961 2225682 2119116 2019671 1928150 1844865 1770154 1704359 1647186 1597545 1554380 1517204 1485501
58950 1485501 1458103 1433680 1411457 1391012 1371795 1353412 1336046 1320155 1306036 1294061 1284869
58939 1284869 1278838 1275734 1275268 1277570 1282704 1290209 1299583 1310782 1323838 1338539 1354955 1373767 1395616
58926 1395616 1420698 1449503 1483309 1523340 1570011 1623492 1684337 1752859 1828472 1910161 1996693
58915 1996693 2085312 2170731 2246352 2306328 2346290 2363419 2357379 2331028 2289220 2236904 2178735
58904 2178735 2119506 2063588 2013914 1972186 1939694 1917120 1903987 1899267 1902361 1912917 1930231 1953744
58892 1953744 1983722 2020600 2064014 2113229 2167912 2227440 2289788 2351974 2411094 2463887 2505852
58881 2505852 2532192 2539812 2527847 2496894 2449009 2388129 2319077 2245877 2171573 2099090 2030919
58870 2030919 1968046 1910373 1858223 1812375 1772666 1737717 1706192 1677467 1651049 1626359 1603196
58859 1603196 1581499 1560437 1538517 1514722 1488924 1461193 1431460 1399896 1367037 1333554 1300406
58848 1300406 1268898 1239774 1212447 1185801 1159521 1134023 1109538 1086208 1064614 1045140 1027041
58837 1027041 1009209 991697 975510 961172 948604 938169 930550 925555 922224 920304 920655 924166 931146
58824 931146 941714 955766 972581 991527 1013128 1038386 1067015 1097420 1128396 1159632 1190362
58813 1190362 1218652 1242337 1259674 1268911 1268491 1258314 1240079 1215967 1187606 1156444 1124266 1092824
58801 1092824 1063366 1036649 1012962 992162 974219 959545 948233 939312 931629 925254 921149 919714
58789 919714 920602 923682 929128 936702 946100 957899 973019 991435 1012617 1037119 1066253 1099991 1136376
58776 1136376 1172906 1206978 1234793 1251757 1255161 1245818 1226722 1201089 1171935 1141998 1112929 1085157
58764 1085157 1059115 1035926 1016435 1000384 987141 976614 968883 963488 959540 956193 952814 949128
58752 949128 945389 941967 938773 935550 932561 930349 928996 928371 928932 931363 935561 940848 947088 954607 963170
58737 963170 972079 981254 991105 1001418 1011559 1021868 1033681 1047899 1064683 1084695 1109368 1139726
58725 1139726 1176104 1219374 1271279 1333119 1404929 1485974 1574737 1667904 1760169 1845307 1916853
58714 1916853 1968277 1994469 1993929 1968791 1922674 1859580 1784628 1703813 1621972 1541771 1465001 1393577
58702 1393577 1328781 1270839 1219975 1176976 1142185 1114967 1094830 1082260 1077969 1082151 1094877 1116291
58690 1116291 1145874 1182128 1223170 1266766 1309508 1346782 1373888 1386917 1383207 1362446 1327417
58679 1327417 1282483 1231251 1176524 1121840 1071014 1026037 987137 955074 931488 916615 908686
58668 908686 906378 910180 920522 936037 954308 972640 987229 993316 987797 971056 945694 914575
58656 914575 880511 846286 813682 783217 755267 730486 708788 689296 671812 657051 645080
58645 645080 634963 626406 620129 616072 612945 610163 608527 608273 608269 607990 608446 610144 612013 613497 615857
58630 615857 619993 624670 628297 630906 632934 633622 632281 629771 627140 623916 619276 613703 608050 602080
58616 602080 595477 589277 584774 581877 579749 578075 576526 574155 570674 567269 564872 562779 560169 557693
58602 557693 556086 554498 551836 548715 546532 545614 545790 547629 551442 556047 560263 564788 571054 579065 587975
58587 587975 597826 609007 620697 631575 641529 651163 660310 668464 675948 683210 689792 695489 701711
58574 701711 710031 720126 730727 741828 754249 767730 781314 795078 809640 824210 836812 846335
58562 846335 853038 857379 859763 861184 862764 864718 866686 868703 870936 873045 874651 875648 875062 870622 860731
58547 860731 846114 828459 808455 786381 763415 740844 718926 698050 679982 666275 656194
58536 656194 647710 639843 632665 626069 620102 615460 612053 608087 602256 595771 590454 586029 581324 577017
58522 577017 574832 574754 575357 576320 578439 581633 585185 589651 596425 605594 616065 627454 639947 652642
58508 652642 663999 673724 682491 690146 696043 700795 705935 712203 719861 730146 744423 762287 782362
58495 782362 804616 829988 858140 887408 916602 944993 970989 992771 1009841 1022226 1028814 1028589
58483 1028589 1022857 1014013 1002576 987589 969364 949457 928366 905826 883136 862599 844709 828322
58471 828322 813566 802038 793982 787892 783301 781614 783613 788272 794505 802173 810979 820201 829663 839109
58457 839109 846484 848867 845372 837351 825792 810553 792218 772533 752744 733359 715575 700782
58445 700782 688555 677242 666674 658210 652009 646609 641453 637546 635249 633648 632565 632986 634981 637253
58431 637253 639289 641876 645039 647530 648989 650597 652881 654720 655204 654817 654191 653248 652027 650910 649766
58416 649766 648321 647356 647974 649782 651548 653396 656415 660369 664082 667971 673846 682037 691044 700160 710041
58401 710041 720424 729723 737403 744529 751537 757566 762370 766777 770899 774018 776510 779689 783543 786896
58387 786896 790074 794946 801898 809134 815508 821745 828357 834645 840349 846171 852077 857093 861154 865123
58373 865123 868809 871151 872556 874757 878133 881420 884201 887280 890501 892723 894168 896271 899058 901212
58359 901212 902811 905340 908857 911959 914736 918883 924679 930766 937113 945159 954711 963884 972504 982449
58345 982449 994094 1005592 1016160 1026968 1038205 1048463 1057526 1066630 1075482 1082390 1087818 1094351 1102537
58332 1102537 1110263 1116822 1123967 1132299 1140412 1148453 1158676 1171474 1184723 1198102 1214202 1234170
58320 1234170 1256102 1278978 1304266 1332276 1360822 1388940 1418198 1448943 1479161 1508505 1539469
58309 1539469 1572968 1606566 1638542 1669667 1699359 1724184 1742142 1754795 1763552 1767744 1767960 1767260
58297 1767260 1767342 1767306 1767599 1770974 1778133 1786805 1796660 1810513 1829024 1848961 1868596 1890009 1914177 1938743
58283 1938743 1962677 1988099 2015300 2041129 2064651 2089256 2116691 2144265 2170406 2197616 2227323
58272 2227323 2257447 2287998 2323439 2366337 2413905 2463690 2517002 2573773 2630023 2683894 2738433
58261 2738433 2795161 2850830 2903777 2957112 3012111 3065042 3114426 3164749 3219087 3274929 3331473
58250 3331473 3393732 3464655 3540321 3617908 3701227 3793291 3890801 3991444 4099180 4216613 4339607
58239 4339607 4465343 4598256 4742094 4893899 5051857 5220910 5404212 5597465 5798401
58230 5798401 6013128 6246194 6493614 6753164 7032078 7336669 7664102 8012652 8389863
58221 8389863 8801831 9245215 9719257 10234597 10800294 11413634 12073066 12788870 13570356
58212 13570356 14416499 15332060 16339596 17463175 18715765 20117039 21707748 23532389
58204 23532389 25627616 28047098 30880131 34229021 38193511 42904119 48553019 55377881
58196 55377881 63658403 73765797 86160155 101240596 119168723 139877072 163285497
58189 163285497 189552922 219169847 252680035 289841329 328482719 364036250 390691279
58182 390691279 403823271 401998603 387108840 362866245 333099337 300886676 268453612
58175 268453612 237305913 208368118 182145137 158864115 138529802 120953193 105834522
58168 105834522 92857234 81719097 72129761 63833698 56634584 50377571 44920959 40142938
58160 40142938 35957434 32298136 29094934 26281176 23810287 21646135 19746043 18068441
58152 18068441 16587193 15282831 14127816 13094065 12166661 11336808 10588571 9904980 9280136
58143 9280136 8713317 8197216 7722541 7287679 6893083 6531851 6195703 5884582 5600869
58134 5600869 5339699 5094229 4865026 4655145 4461021 4277100 4104668 3947325 3802005
58125 3802005 3662820 3529737 3405514 3287934 3172866 3061428 2956758 2857113 2759193 2664874
58115 2664874 2577751 2496297 2417108 2341707 2273467 2210831 2150000 2091573 2038376 1989457 1942145
58104 1942145 1897402 1857376 1820358 1783773 1749440 1720252 1694293 1667725 1640966 1616533 1593373
58093 1593373 1568896 1544332 1522553 1502710 1482266 1462249 1445314 1430552 1415237 1399695 1385420
58082 1385420 1370397 1351514 1329999 1309574 1290787 1271838 1253265 1236862 1221347 1203928 1185012
58071 1185012 1166966 1149480 1130494 1110388 1090956 1071552 1050477 1028899 1009066 989931 968844
58060 968844 946433 925526 906247 886369 865587 845336 825228 803777 781864 761629 742717
58049 742717 723462 704917 689717 677558 665717 653519 642557 633020 623621 614834 608508 604389
58037 604389 600354 595887 592189 589167 585458 581115 577278 573559 568685 563169 558450 554014 548408 542452
58023 542452 538269 535644 532483 528461 525144 522857 520482 518030 516543 515807 515001 515117 517848 522549 527245
58008 527245 532126 539008 547858 557086 567062 580084 596831 615786 636188 658669 682955 707739
57996 707739 732898 759128 785458 809913 832816 856870 883908 914065 948025 987394 1032855
57985 1032855 1084536 1144210 1214600 1296505 1389164 1493215 1610439 1740405 1880058 2026589
57975 2026589 2177703 2328431 2470371 2594777 2694341 2761993 2791200 2778957 2727085 2640417
57965 2640417 2525627 2391616 2247993 2101771 1956798 1816365 1684194 1562564 1451659
57956 1451659 1351295 1261529 1181410 1109237 1044522 987967 939342 897202 860812 830394 805341
57945 805341 784113 766100 751705 740535 731398 724067 718915 714854 709936 704247 699979 698262 698047
57932 698047 698397 699718 702254 705522 709850 716572 726224 738372 753611 773807 800007 832019 870306
57919 870306 916206 969835 1029808 1095399 1166623 1241385 1314566 1380761 1436123 1476981 1499120
57908 1499120 1499982 1480333 1442940 1391017 1328555 1260319 1190146 1120094 1051677 986630 926027 870049
57896 870049 819114 773925 734082 698215 665886 637798 613752 592192 572359 555182 541242
57885 541242 529420 518351 507835 498133 489221 481445 475611 471728 468775 466098 463783 461439 458227
57872 458227 454563 452152 451616 451602 450898 449998 449856 450524 451793 453841 456425 458623 460105 461621 463584 465283
57856 465283 466038 466066 465711 464831 463232 460684 456433 450121 443295 438347 435611 433137 429782 426699 425156
57841 425156 424693 424412 424561 425730 427699 430047 432841 436080 439506 443486 448789 454964 460313 464085 467282
57826 467282 470731 473934 476611 479758 483993 488090 490263 489960 487657 483983 479832 476265 473521 471174
57812 471174 469764 470953 475553 482846 492566 506006 524268 547037 574236 607463 648446 697247
57800 697247 753204 816392 886701 962281 1040039 1116732 1188273 1248868 1292471 1315265 1316416 1297405
57788 1297405 1261540 1213308 1156954 1095742 1032648 970629 911525 855673 803317 755390 712226
57777 712226 672663 635497 600922 569687 541779 516889 495210 476692 460360 445323 431744
57766 431744 419913 409280 399381 390920 384850 380980 378406 376621 375281 373685 371515 369558 368762 369091
57752 369091 370091 371904 374783 378182 381220 383647 385675 387312 388499 389341 389674 389068 387778 386920 387102
57737 387102 387773 388532 390122 393349 397923 403331 410050 418871 429611 441323 453258 464861 475322
57724 475322 483787 489473 491296 488335 481237 472116 462375 451660 439627 427475 416653 407125 398181
57711 398181 390103 383764 379218 375754 372842 370146 367327 364754 363644 364448 365749 365724 364064 361579 358744
57696 358744 355656 352694 350066 347248 343805 340139 336567 332440 327203 321557 316552 312222 308168 304718
57682 304718 302429 301220 301099 302991 307703 314878 324243 337043 354934 378266 406948 442288 486392
57669 486392 540194 603405 675278 752897 828567 891047 930707 943542 931186 898860 853266
57658 853266 800512 744771 688776 635033 585670 541615 503037 470263 443145 419974 398560
57647 398560 378409 360635 345761 332883 321050 310244 300747 292513 285336 278889 272591 266284 260892
57634 260892 257507 255907 254905 253893 253047 252183 250623 248230 245588 243061 240604 238444 236964 235885 234499
57619 234499 232760 231306 230389 229658 228936 228356 227754 226798 225719 225156 225347 226153 227566 229422 231027 232034
57603 232034 233305 235756 238766 240971 242357 244097 246419 248206 248860 249074 249370 249202 248047 246283 244421
57588 244421 242458 240455 238859 237746 236406 234124 230788 226604 221906 217435 214025 211757 210021 208475
57574 208475 207303 206586 206213 206391 207326 208393 208538 207608 206369 205225 203926 202546 201614 201038 200076 198692
57558 198692 197883 198189 198895 199236 199497 200398 202123 204519 207574 211257 215400 220071 225511 231509 237446 243080
57542 243080 248476 253039 255496 255268 253079 249910 246127 241940 237823 233950 229880 225339 220791 216873
57528 216873 213836 211795 210883 210761 210636 210106 209492 209126 208897 208753 208945 209574 210573 212300 215325 219354 223281
57511 223281 226679 230340 234795 239168 242220 243858 244929 246054 247329 248702 249973 250764 251030 251281 251812
57496 251812 252091 251360 249531 247064 244271 241170 237804 234346 231109 228575 227080 226256 225250 223737 222315
57481 222315 221593 221343 220863 219803 218343 216875 215730 214927 214011 212511 210667 209255 208526 207828 206488 204590
57465 204590 202649 201024 199900 199364 199181 198905 198486 198392 198947 199959 201219 202901 205195 207928 210819 213748
57449 213748 216579 219064 221147 223054 224973 226929 228960 231033 232844 234191 235443 237039 238593 239275
57435 239275 239065 238876 239283 239983 240656 241465 242336 242594 241880 240798 240192 240261 240729 241235 241179 239946 237805 236047
57417 236047 235667 236342 237131 237736 238652 240507 243583 247514 251156 253266 253752 253783 254330 255145 255538 255540 255740 256406
57399 256406 257354 258408 259588 261061 263114 265815 268578 270555 271640 272537 273661 274725 275650 277059 279350
57384 279350 282025 284531 287087 290025 292932 295264 297337 299947 303258 306793 310333 314194 318694 323827
57370 323827 329413 335255 341258 347602 354548 361955 369314 376388 383258 389581 394477 397544 399392 400674
57356 400674 401103 399972 397199 393359 389091 384931 381371 378565 376236 374192 372599 371568 370995 371058 372201
57341 372201 374221 376082 377172 378123 379813 382187 384756 387606 391091 394954 398614 402052 405683 409566
57327 409566 413377 416972 420398 423551 426297 428732 430950 432913 434990 438063 442520 447552 452073 455938
57313 455938 459657 463380 466938 470541 474607 479080 483593 488077 492615 497023 501232 505756 511011 516449
57299 516449 521185 525316 529789 535114 541022 547323 554128 561087 567240 572024 575981 580255 585715 592596
57285 592596 600517 608749 616825 624919 633355 641909 650018 657580 665076 672905 681011 689147 697166 705093
57271 705093 713222 721989 731449 740999 749939 758150 765920 773418 780808 788614 797388 807065 817114 827239
57257 827239 837533 848039 858609 869121 879511 889669 899673 909959 920876 932140 943131
57246 943131 953633 964049 974976 986767 999333 1012148 1024674 1036940 1049380 1062033 1074463
57235 1074463 1086747 1099813 1114233 1129275 1143908 1158320 1173603 1190186 1207406 1224564 1241634
57224 1241634 1258905 1276505 1294417 1312468 1330282 1347539 1364287 1380740 1396939 1412936 1429043
57213 1429043 1445482 1461977 1478033 1493480 1508456 1523157 1537929 1553284 1569476 1586365 1603976
57202 1603976 1622719 1642655 1663104 1683519 1704293 1726061 1748662 1771396 1793950 1816348 1838352
57191 1838352 1859656 1880500 1901442 1922606 1943619 1964043 1983441 2001488 2018588 2036026 2054801
57180 2054801 2074528 2093989 2112405 2129761 2146452 2163333 2181598 2201695 2222616 2242939 2262308
57169 2262308 2281317 2300440 2319835 2339782 2360474 2381694 2403359 2425919 2449460 2472945 2495243
57158 2495243 2516428 2537155 2557300 2576334 2594598 2612949 2631315 2648745 2664820 2679967 2694475
57147 2694475 2708133 2720792 2732467 2743000 2752413 2761342 2770392 2779460 2788557 2798754 2811193 2825624
57135 2825624 2841068 2857617 2876414 2898274 2923619 2953286 2987899 3026533 3067418 3109923 3154632
57124 3154632 3201716 3250615 3301217 3353909 3408557 3464873 3523792 3587069 3655550 3729278 3809245
57113 3809245 3897477 3995350 4103367 4222746 4355680 4503909 4668631 4852210 5058771 5293162
57103 5293162 5560953 5869857 6230047 6653314 7153529 7748178 8458522 9308965 10327901
57094 10327901 11548437 13005743 14732887 16758866 19106893 21789398 24803515 28132431
57086 28132431 31748397 35610332 39659775 43820022 47986240 51994510 55595748 58486385
57078 58486385 60405395 61233491 61018902 59922868 58141560 55853883 53200653 50282344
57070 50282344 47170565 43927918 40621548 37321696 34093354 30991790 28061173 25331783
57062 25331783 22818260 20522805 18440347 16560967 14870731 13353761 11994189 10776195
57054 10776195 9684223 8705048 7828952 7047951 6353850 5738711 5195641 4717683 4296913
57045 4296913 3925802 3598529 3309903 3054158 2826302 2623900 2446051 2291124 2156684
57036 2156684 2041013 1942761 1858604 1782306 1706768 1627037 1541819 1453021 1364017 1277661 1195287
57025 1195287 1117178 1043558 974895 911604 853847 801539 754315 711565 672653 637077 604435
57014 604435 574382 546648 520973 497145 475207 455385 437546 420976 405010 389581 374779
57003 374779 360321 346022 332395 320074 308883 298236 288223 279475 272082 265499 259554 254708
56991 254708 251257 249027 248005 248600 251162 255833 262891 272604 284683 298373 312831 326674 337421
56978 337421 342481 341011 334198 323799 311217 297788 284769 272690 261551 251799 244153 238321 233005
56965 233005 227679 223479 221947 223697 228701 236933 248150 261793 277676 296051 316336 336266 352821
56952 352821 363635 367492 364429 356045 345011 333462 322042 310715 299837 289981 281365 274099 268606
56939 268606 265311 264357 266064 271221 280409 293455 310081 330696 355897 385252 416785 447246 472625
56926 472625 489110 494529 489216 475431 456080 433928 411233 389443 369144 350514 333710 318799
56914 318799 305633 293938 283286 273064 262859 252917 243763 235344 227078 218726 210649 203179 196416
56901 196416 190690 186445 183508 181259 179767 179895 181999 185396 189539 194917 202260 211655 223049 236848
56887 236848 253246 271511 290548 309530 327234 341361 349575 351160 347112 338973 328143 315982
56875 315982 303739 292268 282084 273426 266067 259601 254458 252109 253646 258632 266127 276504 291398
56862 291398 311976 338100 369172 404758 443697 482803 517055 541526 553617 553799 544353 527607
56850 527607 505562 480675 455855 433173 413147 395728 381489 371388 365948 365356 370158 381309
56838 381309 399685 425825 460015 502366 552985 611840 677413 744787 805722 851639 877072
56827 877072 880792 864977 834120 793880 749354 703769 658884 616198 577208 542840 513385 489087
56815 489087 470444 458058 452504 454167 462955 478507 500922 530825 568209 611339 656766 699684
56803 699684 734151 754451 757791 745715 722290 691248 655335 617372 580335 546241 515909 489783
56791 489783 468115 450358 435476 423254 414669 410685 411239 415671 423779 436099 453282 475065 499506
56778 499506 523161 542264 553896 556417 549674 535306 516218 494900 472359 448970 425721 403824
56766 403824 383528 364328 346256 330138 316568 305305 295718 287229 279386 272076 265590 259909 254131
56753 254131 247256 239389 231454 223877 216337 208718 201360 194264 186944 179373 172402 166886 162825 159589
56739 159589 156569 153488 150447 147773 145586 143590 141590 139878 138624 137297 135390 133450 132479 132451 132396
56724 132396 132012 132174 133562 135681 137641 139197 140578 141805 142623 142819 142407 141816 141873 143110 145079 146868
56708 146868 148270 149754 151276 151969 151300 149873 148745 148517 149289 150906 152986 155277 158261 162771 168674
56693 168674 174602 179550 184236 190372 198901 209370 220808 232797 245781 260629 277771 296671
56681 296671 316231 335628 354415 372019 387704 401124 412388 421514 428402 433451 437551 441207
56669 441207 444254 446708 449260 452555 456484 460600 464805 469242 473893 478708 483744 488796 493173 496264
56655 496264 498082 498955 498981 498160 496786 495208 493221 490013 484828 477611 469058 460026 450849 441255 431104
56640 431104 420941 411533 403029 395089 387651 380934 374680 368151 361124 354301 348420 343374 338510 333419
56626 333419 328245 323650 320708 320365 322618 326529 331271 336763 343031 349429 354962 359124 362053 364055
56612 364055 365279 365700 365169 363607 361297 358776 356303 353621 350395 346654 342635 338357 333539 327887 321475
56597 321475 314935 309211 304897 301859 299648 298173 297730 298664 301303 305949 312368 319453 325921 331304 335886
56582 335886 339930 343567 347190 351154 355181 358801 362312 366440 371002 374844 377350 379204 381417 384314
56568 384314 387742 391526 395353 398856 402168 405847 410002 414117 417889 421491 424725 426728 426994 426034 424597
56553 424597 422858 420834 418899 417348 415963 414560 413473 412956 412459 410930 407580 402081 394425 384909 373932
56538 373932 361664 348253 334379 320934 308077 295317 282727 271208 261200 251919 242463 232968
56526 232968 224194 216500 209741 203662 198006 192735 188427 185821 184639 183494 181297 178114 174416 170425
56512 170425 166552 163488 161266 159081 156633 154696 153731 152965 151701 150528 150206 150222 149667 148882 148941 149955
56496 149955 151106 152081 153262 154584 155313 155052 154214 153443 153179 153601 154330 154356 152959 150692 148939 148613 149653
56479 149653 151404 152974 153619 153393 153170 153533 153998 153854 153289 153086 153628 154794 156368 157922 158807 158923 159064
56462 159064 159890 161112 162312 163820 165862 167500 167547 166116 164318 162827 161717 161190 161353 161599 161419 161516
56446 161516 162946 165316 167117 167789 168247 169259 170510 171548 172585 173856 174974 175371 174926 173949 172994 172658
56430 172658 173095 173724 173913 173813 174004 174514 174842 174769 174503 174165 173773 173536 173524 173238 172205 170795 169765 169238
56412 169238 168853 168655 169014 169783 170342 170388 170054 169460 168800 168571 168995 169598 170122 171321 173806 176540 177726 177037
56394 177037 175834 175279 175392 175865 176593 177291 177689 178262 179732 181812 183469 184469 185544 186901 187787 187875 187859
56377 187859 188241 188558 188390 188291 189048 190622 192356 193776 194756 195274 195300 194802 193904 193239 193781 195733 197929 199011
56359 199011 198894 198367 197753 197041 196918 198313 200906 203355 205115 206859 208995 210991 212469 213795 215146
56344 215146 216062 216383 216742 217666 218920 220126 221286 222404 223322 224238 225706 227850 230247 232685 235329 237994
56328 237994 240050 241253 241996 242652 243320 244223 245585 247157 248574 250050 251892 253615 254639 255567 257437
56313 257437 259877 261530 262356 263894 266864 270196 273100 276524 281575 287667 293344 298124 302621 307473
56299 307473 312915 318928 325223 331429 337573 343865 350001 355426 360341 365444 370578 374781 377923 381021
56285 381021 384480 387265 388577 389271 390840 393806 397808 402517 407764 413385 419514 426546 434463 442837
56271 442837 451796 462218 474680 489006 505108 523374 543914 566366 590891 618440 649636 684268
56259 684268 722334 764740 812503 865987 925249 990294 1060744 1136154 1216829 1303344 1394973
56248 1394973 1489597 1585340 1681050 1774932 1864171 1946620 2021620 2088415 2144853 2188508 2218234
56237 2218234 2234031 2236358 2226260 2205326 2174779 2135197 2087459 2033141 1973628 1909689 1842174
56226 1842174 1772106 1699878 1625509 1550027 1475412 1402841 1332186 1263549 1197890 1135725 1076614
56215 1076614 1020415 967643 918108 870797 825852 785063 749518 718172 689615 663807 641112
56204 641112 621004 602898 587074 573774 562413 552525 544312 537442 530544 522817 515006 507964 501499
56191 501499 495400 490205 486105 482481 479411 478112 478870 480075 480419 480551 481402 482498 483363 485043 488584
56176 488584 493200 497546 501760 506715 512243 517580 522719 528017 533330 538770 545388 553857 563330 572755
56162 572755 582394 593016 604642 617213 631434 647793 665692 684618 705231 728418 754423 783765
56150 783765 817760 857262 902308 953843 1014204 1084770 1164666 1252609 1347903 1448153 1547921
56139 1547921 1641510 1725821 1799495 1861610 1913243 1958403 2000993 2041715 2079135 2111796 2137598
56128 2137598 2153364 2157830 2153834 2145407 2133846 2118233 2097729 2070720 2033366 1982024 1916577 1839514
56116 1839514 1753175 1660215 1565279 1473326 1386875 1306867 1235003 1172760 1119197 1072221 1031234
56105 1031234 996491 967046 941783 921399 906837 896604 887994 880132 873671 868594 864677 862935
56093 862935 864090 866544 868366 870279 874282 880351 887054 894357 903142 912842 922190 931502 941785 952497
56079 952497 962643 973022 984839 997187 1008476 1019195 1030498 1041306 1049796 1056772 1064606 1073710
56067 1073710 1082875 1092147 1102437 1113153 1123109 1132977 1144131 1156117 1167949 1180697 1195807 1212139
56055 1212139 1227697 1243111 1260309 1278931 1297183 1315014 1333357 1351562 1368785 1386391 1405758
56044 1405758 1425365 1443547 1462236 1484074 1507655 1529846 1551152 1574377 1599420 1623946 1647899
56033 1647899 1672795 1697860 1721548 1745820 1774217 1806702 1840911 1877189 1917512 1960741 2004030
56022 2004030 2047925 2095027 2144777 2194696 2245569 2300008 2357056 2413778 2471104 2532509 2598036
56011 2598036 2665344 2735384 2810978 2890964 2971979 3054958 3143566 3237417 3333424 3432578 3538523
56000 3538523 3650642 3765636 3884689 4011665 4145601 4282799 4425073 4577685 4740318
55991 4740318 4908695 5084075 5272315 5474526 5687900 5914780 6161340 6428152 6711894
55982 6711894 7015400 7345830 7704161 8087337 8499372 8948822 9436962 9961065 10527859
55973 10527859 11150411 11833475 12576597 13390392 14294396 15300682 16416879 17664466 19076532
55964 19076532 20679786 22499683 24583050 26996064 29805256 33089461 36974013 41633078
55956 41633078 47270445 54138422 62574796 72976272 85725457 101177718 119715149
55949 119715149 141769292 167797325 198227594 233156752 271537204 310237427 344072669
55942 344072669 367461602 376831693 371986327 355546427 331268217 302639267 272346468
55935 272346468 242290583 213718786 187371553 163643696 142688203 124448166 108703888
55928 108703888 95166050 83543542 73553824 64930615 57454064 50958924 45306685 40369800
55920 40369800 36046219 32263641 28957754 26061358 23518681 21291255 19342081 17628558
55912 17628558 16115818 14782068 13605292 12557929 11619209 10779827 10029730 9352824 8737499
55903 8737499 8180715 7677610 7217675 6794708 6409946 6061549 5740815 5442309 5168165
55894 5168165 4918853 4688717 4473900 4275745 4092899 3918557 3749138 3587913 3436828
55885 3436828 3292383 3152744 3021404 2900439 2787041 2679660 2580680 2490025 2402844 2316707
55875 2316707 2234815 2159248 2087281 2017323 1952370 1894402 1840890 1789610 1741470 1695975 1649465
55864 1649465 1600688 1552904 1507842 1462706 1415847 1370252 1328565 1289414 1251371 1215923 1183784
55853 1183784 1152639 1121210 1091466 1064454 1038051 1011064 985318 961456 936898 910344 884252
55842 884252 860521 837624 814282 792110 772372 753826 735909 720356 707514 694854 681201
55831 681201 668768 658914 649722 639955 631623 626198 621996 617746 615191 615509 616487 615929 614823 614619 614354
55816 614354 613047 612144 612986 614281 614354 613521 612216 609242 603954 597780 591688 584403 574875 564133 553219
55801 553219 541812 530368 520856 513786 507250 500343 494639 490787 486926 482333 479424 479885 481700 482239
55787 482239 481492 480138 477387 473336 470820 472298 477042 483624 492935 506458 523809 543958 566315
55774 566315 588233 604084 609824 606939 599808 591281 583054 577891 578356 584695 596326 614031 638616
55761 638616 669016 703697 742161 782885 821574 853665 877121 890966 893165 882501 860987 832010
55749 832010 797303 757693 715231 672249 629571 587694 548362 512874 480200 448880 419566
55738 419566 393688 370891 349921 330935 314895 301649 290440 281280 274055 267379 260037 252546
55726 252546 245768 239268 232572 226645 222388 219017 215589 212765 211362 210579 209416 208423 208249 207855 206085
55711 206085 203623 201564 199435 196537 193770 192092 190614 188338 186403 186391 187701 188893 190334 193050 196003
55696 196003 197098 196184 194779 193487 191908 190454 190024 190383 190861 192027 194725 198143 200939 203629 207763
55681 207763 213283 218838 224212 230243 236652 242115 246402 250540 254894 258771 261833 264329 266044 266473
55667 266473 265880 264967 263908 262829 262506 263195 263508 261996 259035 255686 251665 246366 241050 237914 237399 238353
55651 238353 240434 244353 250116 257058 265495 276540 290374 306449 325252 348106 375268 405897
55639 405897 439855 477948 520341 566180 614600 664408 712642 755018 788238 811095 823635
55628 823635 826645 821851 811357 796853 780170 764088 751208 742318 737027 735641 739090 747358 759199
55615 759199 773044 786963 798201 804162 803581 795678 778927 752244 717017 676406 632919 587926
55603 587926 542915 499505 458441 420020 385204 354810 327931 302757 278787 256883 237509
55592 237509 220446 205879 194149 184569 175971 168298 162214 157406 152768 148034 143808 140193 136787
55579 136787 133797 131716 130228 128864 128318 129514 131774 133604 134902 136578 138250 138393 136775 134875 133665
55564 133665 132698 131504 130173 128316 125169 121156 117882 116272 115856 116000 116496 116899 116686 116217 116317 116998
55548 116998 117743 118732 120341 121852 122360 122595 123943 125843 126205 124486 122357 121140 120498 119919 119448 118536
55532 118536 116056 112067 107921 104295 100811 97825 96558 96896 97071 96220 95460 95723 96442 97267 99122 102398
55516 102398 105740 107919 109563 111924 115120 118672 122612 127082 131890 137352 144508 153710 164158 175623
55502 175623 189399 206625 226800 248979 273358 300629 330679 362966 397369 433694 470891
55491 470891 507425 541637 571130 592805 604485 605974 597995 580999 555750 524250 489143 452605
55479 452605 416223 381172 347893 316243 286485 259479 235521 213859 193880 175967 160660
55468 160660 147743 136659 127092 118656 110805 103468 96992 91172 85248 79260 74393 71413 69708 68337
55454 68337 67082 65947 64630 63118 61928 61189 60317 59030 57740 56530 54883 52927 51694 51484 51207
55439 51207 50183 49342 49630 50373 50412 49913 49813 50185 50380 50247 50083 49806 49175 48446 47909 47183 45792 44129
55421 44129 43001 42568 42404 42198 41755 40719 39048 37426 36555 36334 36280 36310 36489 36481 35964 35271 34947 34911 34660
55402 34660 34082 33529 33209 32965 32552 31938 31482 31810 33092 34422 34598 33668 33020 33625 34917 35786 35969 35946
55384 35946 36038 36168 36122 35674 34761 33785 33348 33545 33995 34548 35334 36113 36391 36263 36332 36681 36789 36548 36407 36381
55364 36381 35972 35226 34777 34593 33878 32557 31580 31324 30970 30021 29131 28724 28166 27134 26532 27028 27824 27924
55346 27924 27653 27869 28558 29226 29811 30228 29900 28760 27900 28159 28879 29064 28924 29143 29433 29126 28563 28633 29375
55327 29375 30163 30845 31633 32309 32599 32941 33838 34817 35008 34413 33681 33025 32254 31517 31116 30900 30618 30445 30481
55308 30481 30294 29714 29419 29864 30390 30391 30600 32041 34334 36252 37404 38056 37893 36453 34495 33420 33379 33276
55290 33276 32607 31994 31838 31693 31207 30624 30181 29880 29971 30704 31540 31522 30595 29728 29634 30090 30611 30980 30997 30438
55270 30438 29432 28378 27487 26901 27007 27951 28993 29181 28603 28277 28819 29837 30599 30661 30013 29178 28989 29655
55252 29655 30319 30169 29590 29353 29143 27991 25986 24383 23921 24122 24450 25162 26626 28496 30003 30594 30130
55235 30130 28920 27623 26700 25929 24890 23762 23106 23016 23115 23263 23577 23792 23352 22277 21391 21518 22755 24487
55217 24487 25859 26438 26700 27530 28889 29564 28801 27579 27432 28474 29541 29930 29980 30127 30390 30794 31431 32076
55199 32076 32389 32444 32441 32198 31681 31622 32633 33980 34349 33663 33051 33043 33051 32729 32665 33326 34294 34987 35330 35364 34928 34141
55177 34141 33569 33540 33813 34134 34598 35218 35614 35352 34304 32713 31242 30726 31333 32194 32458 32427 32943 33943
55159 33943 34564 34496 34266 34239 34334 34758 35899 37383 38251 38345 38547 39319 39950 39662 38601 37305 35979 34814
55141 34814 34350 34900 36034 37002 37381 37116 36428 35840 35801 36113 36180 35864 35548 35360 35060 34792 35176 36353 37608
55122 37608 38239 38301 38211 38108 37904 37562 37102 36665 36607 37197 38223 39264 40185 40955 41279 41021 40711 40837 40921 40189
55102 40189 38984 38466 38956 39629 39879 39927 39983 39892 39833 40339 41337 42159 42710 43522 44418 44376 43209 42169 42219 42767
55082 42767 42885 42795 43230 44127 44873 45309 45689 46076 46413 46770 47043 46909 46521 46644 47584 48670 49220 49340 49200
55063 49200 48385 46686 44841 43645 42956 42356 42165 42850 43972 44767 45377 46498 48001 48951 48946 48501 48041 47361
55045 47361 46293 45191 44421 43841 43070 42059 41211 41054 41732 42721 43200 42908 42463 42623 43458 44468 45182 45348
55027 45348 44869 44040 43609 44093 45126 45878 46071 46187 46653 47220 47297 46690 45810 45187 44895 44653 44470 44844 46017
55008 46017 47362 48056 48196 48562 49274 49451 48474 46874 45532 44571 43566 42414 41457 40935 40780 40767 40580 39953
54990 39953 39036 38394 38419 38947 39655 40507 41530 42489 43124 43515 43917 44453 45161 46086 47058 47650 47658 47409 47305 47289
54970 47289 47063 46680 46538 46845 47400 47975 48706 49899 51416 52479 52402 51544 51074 51613 52583 53229 53665 54270
54952 54270 54698 54488 54311 55384 57636 59570 60229 60258 60744 62020 64070 67154 71371 76360 81994 88701
54936 88701 96510 104451 111521 117626 122989 127220 129688 130345 129506 127185 123336 118402 113032 107516 101932
54921 101932 96524 91393 86210 80741 75394 70770 66999 63983 61862 60681 59919 58963 57909 57355 57571
54906 57571 58337 59400 60644 61925 63134 64336 65625 67037 68860 71710 75979 81405 87411 93617 99899
54891 99899 106345 113222 120479 127042 131244 132331 131039 128400 124681 119876 114488 109101 103707 98145
54877 98145 92741 87931 83686 79953 77160 75512 74227 72316 69849 67668 66055 64505 62705 60946
54863 60946 59532 58422 57529 56844 56194 55330 54271 53202 52153 51048 50017 49284 48838 48509 48184 47747 47027
54846 47027 46127 45486 45340 45383 45244 44963 44711 44490 44382 44580 44810 44341 43105 42196 42628 44072 45485 46488
54828 46488 47372 48201 48742 49049 49404 49907 50669 51953 53455 53986 52796 50795 49468 48924 48111 46718 45615
54811 45615 45382 45576 45761 46222 47209 48300 48944 49079 48921 48688 48791 49706 51362 53089 54396 55451 56674
54794 56674 58351 60727 63972 67793 71501 74673 77456 80165 82978 86084 89730 93944 98505 103224
54780 103224 108030 112807 117468 122075 126502 130073 131951 131814 129776 125831 120020 113037 106085 99965
54766 99965 94763 90414 87035 84526 82376 80098 77637 75257 73310 72104 71644 71450 70908 69816 68463
54751 68463 67291 66705 66967 67950 69232 70726 72898 75969 79383 82686 86525 91964 98978 106420 113401
54736 113401 119902 126002 131315 135334 137779 138436 137192 134264 129978 124404 117783 111067 105261 100276
54722 100276 95293 90243 86016 83030 80570 77939 75386 73436 72001 70695 69435 68198 66684 64806
54708 64806 63059 61917 61122 60073 58600 56985 55484 54318 53882 54425 55561 56462 56592 56077 55390 54902
54692 54902 54737 54899 55355 55985 56526 56823 57184 58121 59503 60328 59858 58732 58403 59461 61128 62421 63249
54675 63249 64151 65429 66854 67955 68391 68194 67730 67260 66625 65557 64174 62811 61515 60143 58873 58125
54659 58125 57965 58047 58172 58440 58857 59228 59490 59699 59680 59149 58292 57746 57875 58419 58904 59053 58765 58158 57683 57745
54639 57745 58154 58377 58360 58584 59215 59685 59353 58240 56949 56161 56248 57025 57765 57742 56821 55361 53727 52220
54621 52220 51216 50851 50740 50559 50689 51599 52789 53183 52592 51918 51778 51788 51521 51384 52020 53384 54859 55981
54603 55981 56761 57565 58845 60625 62181 62623 61836 60507 59295 58503 58392 59013 59721 59635 58798 58193 58445 59241
54585 59241 60170 61299 62567 63374 63239 62322 61028 59685 58792 58825 59470 59776 59390 58879 58592 58142 57499 57564
54567 57564 58935 60935 62649 64122 65695 66892 67055 66567 66388 66623 66540 65846 64982 64244 63497 62838 62768 63517
54549 63517 64712 65873 66766 67239 67167 66677 66127 65759 65533 65223 64517 63220 61612 60386 59897 59699 59139 58222
54531 58222 57537 57534 58170 59111 59943 60325 60243 60057 60117 60505 61209 62193 63103 63355 62824 62056 61462 60755 59612 58435
54511 58435 57906 58072 58477 59005 59981 61571 63609 65967 68643 71404 73739 75236 75845 75860 75797 76105 76769
54494 76769 77367 77687 78020 78686 79646 80804 82248 83856 85119 85816 86470 87643 89166 90653 92420 95147
54478 95147 98710 102046 104235 105229 105555 105798 106374 107343 108328 108877 108861 108241 106664 103792 100000 96310 93566
54461 93566 91931 91082 90497 89583 88013 86031 84192 82755 81551 80397 79369 78725 78765 79674 81138 82278
54445 82278 82300 81274 79970 78967 78196 77299 76140 74909 74006 73835 74491 75531 76178 75816 74376 72400 70793
54428 70793 70227 70619 71306 71837 72396 73347 74659 75999 77174 78194 79111 79981 80806 81378 81466 81219 81055 81002
54410 81002 80663 80083 80087 81237 82900 83955 84119 83981 83975 83995 83921 83835 83660 83079 81985 80686 79585 78876 78518
54391 78518 78288 77942 77545 77500 78010 78724 79210 79552 80089 80773 81200 81189 80965 80915 81495 83143 85783 88527 90380
54372 90380 91265 92001 93320 95286 97608 100025 102311 104249 105733 106689 106871 105955 103868 100915 97674 94870
54356 94870 93084 92268 91730 90866 89783 88956 88499 88144 87717 87253 86743 86132 85481 84859 84210 83609 83412 83839
54338 83839 84636 85483 86442 87595 88546 88863 88746 88658 88384 87208 85091 83061 82194 82614 83669 84651 85157 85063
54320 85063 84425 83329 81785 79861 77819 75991 74565 73652 73349 73510 73663 73405 72797 72096 71381 70705 70361
54303 70361 70574 71075 71422 71538 71580 71392 70601 69211 67783 67061 67624 69659 72655 75544 77546 78756 79585
54286 79585 79983 79701 78956 78156 77167 75567 73631 72349 72349 73306 74429 75106 75050 74417 73901 74275 75687 77630
54268 77630 79510 80902 81484 81271 80874 80954 81433 81714 81615 81515 81671 82004 82605 83767 85361 86740 87455 87641
54250 87641 87609 87573 87857 88743 89857 90213 89193 87172 85010 83312 82355 82276 82976 84007 84797 84965 84506 83903
54232 83903 83885 84659 85415 85054 83393 81290 79598 78408 77360 76192 74942 73996 73942 74943 76291 77068 77240
54215 77240 77523 78143 78424 77832 76838 76357 76732 77569 78324 78793 79240 80134 81613 83199 84317 84965 85553 86216
54197 86216 86793 87335 88066 88901 89701 91010 93764 97963 102320 105556 107528 108778 109530 109625 109034 107931 106425
54180 106425 104556 102469 100376 98436 96707 95081 93297 91278 89392 88010 86869 85322 83237 81246
54166 81246 80026 79726 80053 80517 80540 79807 78597 77450 76533 75738 75229 75351 76040 76877 77635 78215 78184 77145
54148 77145 75557 74385 73930 73740 73654 73970 74486 74433 73689 73083 73074 73103 72755 72588 73087 73662 73513 72901 72711 73224
54128 73224 74044 74844 75510 75894 76086 76640 77947 79634 81052 81980 82404 82115 81174 80403 80649 81713 82579 82575
54110 82575 81867 81004 80505 80701 81502 82416 83062 83447 83502 82830 81363 79866 79184 79301 79657 80101 80904 82053
54092 82053 83218 84350 85703 87244 88541 89363 90062 91282 93422 96350 99460 102184 104462 106479 107970
54077 107970 108334 107656 106921 106762 106555 105357 103289 101260 99706 98338 96965 95829 95144 94917 95229 96165
54061 96165 97499 98879 100276 101856 103479 104774 105638 106302 106976 107815 108995 110414 111513 111938 112229 113297
54045 113297 115305 117643 119934 122460 125543 129114 133003 137178 141495 145703 149857 154305 159015 163284
54031 163284 166441 168647 170726 173289 176178 178745 180497 181458 182025 182570 183235 183899 184111 183184 180740 177212
54015 177212 173453 169738 165615 160860 156120 152230 149263 146642 143905 140981 137959 134982 132224 129677
54001 129677 127112 124460 121952 119651 117210 114409 111624 109388 107857 107023 107043 107825 108677 108949 108823 108902
53985 108902 109269 109508 109462 109325 109125 108722 108314 108325 108727 108925 108466 107515 106639 106346 106747 107375 107499 106901 106162
53966 106162 105898 106009 106068 106081 106291 106606 106870 107435 108693 110152 110829 110578 110308 110746 111722 112815 114051 115664
53948 115664 117736 120368 123755 127758 131762 135208 138101 140842 143832 147239 150868 154269 157294 160488
53934 160488 164489 169120 173574 177530 181479 185835 190332 194516 198279 201601 204242 206127 207708 209573
53920 209573 211918 214710 218131 222509 227885 233861 239837 245317 250077 254110 257296 259272 259890 259736 259705
53905 259705 259937 259564 257758 254701 251261 248021 244994 242036 239109 236048 232411 227771 222104 215816 209374
53890 209374 202975 196604 190392 184699 179769 175455 171503 167951 164990 162464 159865 156911 153874 151167
53876 151167 148780 146368 143821 141497 139754 138445 137122 135678 134416 133350 131895 129617 126990 124819
53862 124819 123096 121106 118660 116474 115059 113954 112484 110778 109523 109080 109202 109342 108953 107864 106657
53847 106657 106271 106975 108143 109197 110100 110665 110276 108918 107673 107389 107531 107174 106493 106262 106491 106744 107368
53830 107368 109095 111544 113391 114069 114209 114300 114108 113592 113292 113420 113491 113238 113120 113588 114639 116325 118915
53813 118915 122197 125439 128406 131704 135737 140032 144046 147965 152241 156859 161473 165790 169555 172673
53799 172673 175595 178934 182412 184870 185704 185687 186000 187042 188477 189759 190207 189278 187282 185270 183788 182325
53783 182325 180357 178135 175939 173368 170137 166873 164298 162131 159611 156671 153777 151035 148321 145903
53769 145903 144091 142474 140394 137984 135845 133903 131489 128614 126213 124927 124350 123723 122764 121642 120698
53754 120698 120364 120806 121448 121379 120488 119680 119720 120305 120613 120286 119504 118507 117569 117186 117664 118483 118623 117763 116836
53735 116836 117100 118785 120934 122515 123339 123766 123913 123532 122637 121750 121376 121522 121967 122795 124327 126575 129042
53718 129042 131126 132604 133669 134604 135533 136421 137241 138035 138840 139701 140790 142362 144412 146465 147913 148566
53702 148566 148749 148877 149124 149431 149696 149888 150116 150637 151765 153777 156799 160589 164456 167743 170479 173167
53686 173167 175801 177628 178322 178823 180354 182887 185204 186332 186278 185573 184823 184657 185333 186318 186836 186887 187080
53669 187080 187519 187644 187264 186929 187029 187289 187458 187786 188420 188987 189204 189379 189923 190865 192110 193668 195298 196507
53651 196507 197281 198209 199525 200613 200906 200710 200608 200619 200547 200641 201262 202238 203146 203943 204747 205298 205272 204926 204855 205239
53631 205239 205818 206560 207824 209790 212016 213682 214306 214330 214909 216828 219640 222271 224342 226250 228057 229214
53615 229214 229659 230228 231466 232909 234089 235442 237491 239902 242187 244677 247934 251693 255300 258697 262088
53600 262088 265131 267429 269467 272032 274990 277564 279555 281247 282407 282503 281903 281722 282398 283332 284002 284471
53584 284471 284724 284526 284097 284029 284247 283966 282854 281346 279670 277598 275484 274404 274668 275131 274715 273784 273248
53567 273248 273052 272464 271312 269958 268424 266480 264452 263015 262143 261116 259689 258529 258176 258220 257966 257475
53551 257475 257368 257773 258057 257710 257067 256857 257288 257924 258364 258691 259213 260143 261641 263778 266207 268120 268990
53534 268990 269221 269794 271251 273333 275516 277688 280232 283655 288107 293202 298349 303348 308506 314145 320210
53519 320210 326481 332869 339322 345731 352169 358972 366383 374384 383069 392746 403380 414414 425546
53506 425546 437226 449894 463190 476571 490273 504930 520431 536030 551464 567262 583911
53495 583911 601382 619468 637989 656599 674948 693039 710921 728158 744177 759108 773640
53484 773640 788156 802650 817315 832410 847534 861889 875345 888482 901537 914262 926935
53473 926935 940503 955304 970537 985392 999823 1013723 1026272 1036806 1045617 1053187 1059262 1063401
53461 1063401 1065842 1066966 1066409 1063549 1058574 1052254 1044961 1036711 1028007 1019739 1012160 1004672 996669 987973
53447 987973 978344 967226 954332 940144 925590 911394 897743 884315 870589 856387 842143 828495
53435 828495 815693 803712 792780 783363 775556 768884 762866 757516 753141 749886 747636 746129 744993
53422 744993 743828 742583 741868 742630 745280 749250 753621 758160 763466 770029 777565 785582 794324 804587
53408 804587 816670 829992 843855 858120 873014 888759 905610 923855 943447 963939 985102
53397 985102 1007358 1031315 1057127 1084611 1113746 1144668 1177297 1211301 1246351 1282214 1318740
53386 1318740 1356013 1394375 1434011 1474656 1515879 1557460 1599177 1640475 1680787 1720036 1758333
53375 1758333 1795257 1830005 1862362 1893081 1923059 1952461 1980836 2007693 2032668 2055325 2075205
53364 2075205 2092013 2105489 2115083 2119994 2119556 2113520 2101973 2085217 2063803 2038526 2010216 1979519
53352 1979519 1946903 1912766 1877418 1841047 1803934 1766719 1730294 1695273 1661657 1629089 1597316
53341 1597316 1566299 1535987 1506262 1477004 1447975 1418628 1388367 1357208 1326022 1295913 1267437
53330 1267437 1240543 1215134 1191371 1169386 1148976 1129822 1111921 1095593 1081049 1068117 1056356
53319 1056356 1045204 1033951 1021925 1008984 995635 982363 969017 955251 941472 928772 917758
53308 917758 907889 898237 888550 879309 871072 864111 858486 854079 850630 847964 846109 845153 845220 846691 850037
53293 850037 855158 861198 867401 873926 881595 891143 902975 917151 933098 949692 966206 982958 1000509
53280 1000509 1018487 1035912 1052452 1068595 1084598 1100035 1114504 1128117 1141050 1153130 1164018
53269 1164018 1173349 1180542 1184999 1186740 1186497 1184989 1182357 1178329 1172552 1164719 1154709 1142664 1128680
53256 1128680 1112638 1094746 1075953 1057117 1037913 1017429 995853 974619 954655 935400 915958
53245 915958 896417 877464 859372 841939 824882 807742 789903 771343 752918 735308 717965
53234 717965 699720 680207 660221 640944 623221 607273 592540 578054 563492 549689 537643
53223 537643 527301 517908 509302 502038 496197 490775 484618 477465 469746 461671 452962 443414 433277 422866
53209 422866 411976 400069 387168 374262 362488 352075 342440 333157 324281 315747 307136 298324 289828
53196 289828 282171 275250 268676 262419 256821 252169 248397 244953 240880 235536 229402 223645 218595 213234
53182 213234 206649 199417 192972 188060 184483 181956 180348 179159 177592 175354 172865 170568 168433 166284
53168 166284 164275 162841 162312 162561 162914 162531 161100 159120 157379 156303 155946 156264 157066 157861 158154 157854 157167
53151 157167 156254 155232 154290 153541 152857 152103 151426 151071 151086 151363 151772 152083 152064 151834 151756 151749 151155 149681 148011
53132 148011 147002 146683 146625 146924 148031 149780 151372 152367 153089 153982 155108 156321 157402 157954 157669 156807 155938
53115 155938 155111 153784 151795 149907 149050 149279 149768 149654 148738 147484 146509 146034 145765 145334 144777 144458 144581
53098 144581 144924 145061 144742 144171 143928 144450 145446 146078 145855 145046 144054 142808 141224 139814 139202 139156 138743 137520
53080 137520 136083 135357 135696 136725 137712 138025 137534 136686 136017 135641 135404 135331 135554 135894 135972 135726 135486 135532 135913
53061 135913 136621 137558 138325 138410 137642 136274 134672 133237 132457 132582 133218 133663 133671 133578 133718 134163 135011 136357 137812
53042 137812 138535 138056 136797 135579 134851 134597 134736 135332 136416 137726 138624 138452 137228 135913 135666 136730
53026 136730 138225 139113 139137 138763 138478 138384 138379 138461 138682 138792 138295 137164 136334 136944 138996 141279 142802 143766 144854
53007 144854 146235 147772 149583 151597 152970 152865 151670 150678 150589 151081 151735 152522 153271 153519 153220 152987 153317
52990 153317 154087 155065 156390 158225 160264 161933 162862 163096 163114 163584 164694 165721 165751 164872 164113 164154 164663 165037
52972 165037 165129 165012 164615 163989 163493 163353 163383 163423 163638 164172 164873 165608 166401 167034 167039 166408 165841 165833 165938 165418 164271
52951 164271 163041 161927 160691 159337 158265 157689 157348 156919 156414 156051 155955 156161 156755 157818 159168 160208
52935 160208 160180 158705 156101 153148 150655 149274 149374 150717 152423 153680 154413 154925 155099 154630 153935 154036
52919 154036 155237 156627 157259 157204 156933 156283 154810 152872 151530 151329 151749 151970 151730 151244 150737 150349 150271 150664
52901 150664 151433 152284 153051 153790 154483 154807 154506 153947 153966 154994 156633 158245 159598 160595 160788 159805 158126
52884 158126 156765 156173 155991 155946 156324 157353 158638 159616 160225 160810 161624 162684 163944 165389 167027 168842
52868 168842 170621 171932 172519 172622 172540 172011 170449 167791 164685 161799 159423 157656 156397 155084 153084
52853 153084 150515 148144 146373 144935 143692 142955 142690 142167 140888 139311 138130 137380 136768 136331 136147 135788
52837 135788 134764 133342 132371 132403 133351 134825 136389 137610 138250 138381 138239 138152 138605 139882 141474 142457 142705
52820 142705 143113 144158 144901 144095 141818 139284 137398 136231 135608 135385 135199 134656 133843 133156 132623 131922 131018
52803 131018 130268 129878 129711 129654 129742 129857 129687 129076 128219 127526 127489 128480 130310 132146 133240 133655 133913 134128 133928
52784 133928 133178 132337 132051 132666 134034 135465 135979 135076 133311 131847 131457 132043 132951 133439 133130 132367 131934
52767 131934 132100 132193 131590 130799 130925 132251 134065 135765 137367 138777 139454 139244 139013 139894 142140 145025 147643
52750 147643 149485 150478 150908 151295 152068 153188 154189 154687 154897 155564 157246 159624 161680 162680 162799 162678
52734 162678 162633 162544 162339 162196 162236 162289 162053 161422 160607 159942 159529 159154 158695 158427 158611 158937 158951 159003 159988 161916
52714 161916 163524 163866 163570 163768 164397 164489 163791 163046 162747 162564 162123 161512 160846 160065 159421 159397 159836 159812 158849
52695 158849 157684 157318 157660 157749 157029 155841 154692 153632 152585 151828 151735 152112 152200 151439 149926 148012 145883
52678 145883 143935 143079 143796 145013 144914 143104 141046 139955 139337 138353 137612 138344 140361 142204 143104 143566 144053
52661 144053 144407 144777 145859 147633 148857 148533 147206 146204 146086 146397 146525 146210 145482 144627 144111 144181 144638
52644 144638 145153 145613 146030 146379 146707 147192 147954 148901 149757 150081 149411 147826 146273 145831 146593 147699 148472 148939
52626 148939 149219 149012 148004 146330 144413 142729 141767 141766 142310 142686 142725 142844 143214 143579 143941 144623 145421 145598
52608 145598 145174 145306 146690 148346 148773 147735 146034 144117 142021 140413 140452 142405 145235 147817 149870
52593 149870 151489 152475 152614 152150 151524 150827 149842 148515 147173 146283 146071 146311 146453 146086 145292 144500 144065 144066
52575 144066 144453 145151 146061 147037 147901 148407 148346 147845 147454 147690 148458 149109 149127 148610 147997 147489 146933 146243 145717
52556 145717 145729 146237 146824 147266 147742 148390 149027 149557 150313 151521 152706 153204 153192 153634 155169 157629 160649 164099
52538 164099 167715 170949 173541 175755 177693 178899 179127 179013 179409 180300 180919 180761 179950 178715 177055 174999
52522 174999 172838 170961 169602 168712 167914 166770 165269 163933 163209 162961 162702 162082 160840 158631 155451 152113
52506 152113 149767 148829 148686 148485 147907 147120 146341 145621 144888 144033 143016 141996 141287 141209 141923 143308 144934
52489 144934 146269 147032 147252 147020 146381 145465 144432 143223 141728 140395 140212 141707 144285 146952 149363 151638
52473 151638 153445 154098 153662 153282 153991 155578 156934 157355 157160 157172 157832 158849 159543 159505 158963 158523 158634 159365
52455 159365 160583 162122 163742 165146 166214 167182 168419 169948 171311 172109 172710 174183 177270 181533 185810
52440 185810 189460 192813 196376 200120 203747 207228 210582 213361 214837 214711 213350 211322 208963 206392
52426 206392 203671 200902 198262 195904 193750 191483 188939 186351 184002 181823 179599 177481 175931 175147
52412 175147 174831 174599 174364 174199 174020 173604 172862 172036 171544 171590 171883 171860 171302 170613 170327 170445 170442 169892 168874 167816
52392 167816 167146 167124 167799 168958 170137 170780 170537 169582 168648 168528 169400 170751 172040 173220 174532 176061 177747
52375 177747 179563 181353 182710 183449 184042 185115 186605 187986 189343 191424 194288 196598 197071 196305 196271 197936
52359 197936 200211 201602 202194 203283 205477 208022 210005 211374 212486 213368 214011 214924 216699 219189 221745
52344 221745 224198 227046 230641 234768 239163 243896 248974 254046 258861 263690 268949 274598 280211 285507
52330 285507 290548 295558 300763 306353 312456 319168 326569 334533 342633 350654 359193 369224 380929 393402
52316 393402 405808 418321 431598 445805 460720 476431 493260 511066 529156 546880 563970
52305 563970 580355 595994 610917 625119 638472 650971 662876 674270 684609 693090 699482 704282
52293 704282 708135 711346 713856 715345 715457 714255 712383 710431 708218 705121 701077 696857 693260 690325
52279 690325 687485 684289 680920 678099 676449 675872 675742 675843 676793 679226 682916 687193 692006 697922 705219
52264 705219 713680 723370 734895 748510 763391 778190 792068 805055 817664 830391 843346 856096
52252 856096 867870 878067 886544 893589 899733 905404 910377 913695 914592 913504 911732 910045 908049 904990
52238 904990 900647 895223 888868 881713 874031 866045 857752 849201 840702 832506 824566 816908 809977 804232
52224 804232 799483 794978 790131 784938 779760 774970 770848 767606 765389 764269 764193 764939 766232 767981 770294
52209 770294 773217 776600 780312 784428 788955 793483 797270 799725 800825 801149 801592 802897 805219 808005 810337
52194 810337 811462 811210 810074 808840 807937 807082 805720 803800 801896 800479 799314 797796 795700 793307 790895
52179 790895 788418 785770 783041 780284 777196 773436 769270 765580 762994 761186 759331 757086 754777 752662
52165 752662 750526 748201 746027 744462 743436 742461 741193 739621 737871 736235 735241 735279 736056 736719 736618 735745
52149 735745 734494 733232 732134 731168 730126 728772 726999 724815 722323 719899 718194 717627 717906 718286 718333 718204
52133 718204 718305 718946 720311 722494 725553 729701 735310 742447 750574 759062 767911 777591 788323 800066
52119 800066 813132 828122 844977 862626 879972 896864 913759 930736 947276 962946 977908
52108 977908 992674 1007473 1021908 1035234 1047055 1057734 1067937 1077755 1086425 1093034 1097365 1099985
52096 1099985 1101558 1102139 1101210 1098451 1094353 1089761 1084844 1078959 1071733 1063751 1055730 1047526 1038635 1029372
52082 1029372 1020752 1013272 1006550 1000208 994458 989738 986422 984977 985710 988153 991316 994794 999042 1004467
52068 1004467 1010886 1018086 1026155 1034938 1043878 1052790 1062089 1071816 1081162 1089532 1097400 1105416 1113270 1120255
52054 1120255 1126484 1132621 1138604 1143470 1146422 1147425 1146837 1145041 1142364 1138779 1133734 1126842 1118653 1110164
52040 1110164 1101507 1091652 1079433 1064519 1047422 1029121 1010713 992983 976119 960024 944744 930252
52028 930252 916058 901602 887042 873100 860104 847668 835418 823489 812135 801244 790484
52017 790484 779696 768960 758511 748573 739091 729623 719752 709484 698926 687771 675609 662677
52005 662677 649708 636933 623772 609666 594704 579254 563492 547557 531653 515733 499488
51994 499488 482990 466943 451913 437677 423677 409802 396260 383058 370173 358098 347666
51983 347666 339280 332739 327746 324098 321296 318540 315393 312192 309439 306954 303938 299823 294838 289692
51969 289692 284921 280619 276649 272897 269358 266178 263703 262309 262006 262295 262593 262796 263345 264781 267416
51954 267416 271333 276464 282625 289796 298503 309672 323872 340908 360402 382587 408045 436471
51942 436471 465950 493597 516728 533350 541906 541255 531290 513461 490446 465149 439837 415838
51930 415838 393629 373139 354229 337110 322288 310060 300127 291744 284206 277227 270951 265655 261331
51917 261331 257466 253382 248817 244045 239331 234462 229036 223078 217134 211785 207279 203590 200579 197921
51903 197921 195129 191872 188356 185296 183443 183051 183766 185019 186542 188468 190905 193534 195730 197109 197902
51888 197902 198857 200727 203753 207472 211077 214029 216338 218261 219863 221018 221785 222586 223906 225820 227860
51873 227860 229375 230082 230205 229986 229170 227235 224169 220711 217616 214888 212001 208705 205261 201909 198491
51858 198491 194730 190670 186667 183066 179989 177362 175033 172933 171198 170112 169838 170208 170849 171490 172086
51843 172086 172614 172907 172756 172178 171442 170837 170520 170650 171484 173111 175194 177188 178858 180399 181994 183430
51827 183430 184242 184166 183401 182467 181804 181443 181111 180694 180470 180742 181373 181953 182376 182917 183713 184444 184640 184099 182986
51808 182986 181794 181176 181461 182221 182631 182370 181916 181860 182330 183158 184165 185039 185372 185162 184962 185226 185772 186164
51790 186164 186300 186340 186446 186927 188222 190237 192086 193044 193471 194170 195110 195460 194812 193675 192721 192161 191940 191976
51772 191976 192032 191823 191376 190915 190373 189554 188819 189005 190371 192105 193154 193151 192322 190982 189521 188462 188001 187629
51754 187629 186564 184555 182021 179560 177550 176137 175328 175049 175171 175560 176100 176814 177879 179378 181102 182780
51738 182780 184384 185950 187237 188050 188832 190387 192847 195410 197312 198534 199308 199478 198850 197766 196716
51723 196716 195641 194151 192307 190622 189312 188078 186697 185336 184175 183107 182010 180988 180095 179065
51709 179065 177538 175533 173516 172123 171807 172575 173892 174967 175298 174927 174175 173288 172430 171779 171341 170746 169555
51692 169555 167822 166137 164989 164320 163801 163308 162937 162762 162838 163237 163729 163649 162570 161087 160370 160864 161948
51675 161948 163058 164462 166498 168624 169929 170308 170436 170737 171012 171096 171261 171891 173224 175451 178542 181909
51659 181909 184791 187162 189800 193330 197698 202722 208558 215205 222060 228502 234601 240758 246753 251634
51645 251634 254514 255222 254165 251847 248444 243779 237714 230652 223431 216651 210403 204739 200021 196434
51631 196434 193478 190418 187126 184101 181754 180008 178564 177196 175782 174351 173134 172326 171757 171030 170043
51616 170043 169150 168757 168951 169584 170494 171447 172052 172054 171778 172090 173652 176229 178912 181044 182702 184131 185068
51599 185068 184977 183795 181996 180002 178030 176480 175806 175790 175534 174611 173731 173758 174459 174836 174538 174299 174950 176492
51581 176492 178236 179493 180037 180161 180422 181169 182283 183427 184399 185069 185265 185068 185067 185872 187424 189203 191108
51564 191108 193659 197267 201742 206668 211889 217421 223236 229425 236367 244499 253986 264678 276226 288221
51550 288221 300494 313314 326964 340914 353670 363677 370161 372955 371903 366923 358537 347894
51538 347894 336160 324073 312070 300521 289738 279898 271023 262922 255154 247319 239496 232255 226070
51525 226070 220845 216120 211737 208090 205647 204285 203220 201670 199556 197475 196000 195161 194620 194175 193847
51510 193847 193582 193170 192577 192103 192036 192333 192883 193900 195648 197785 199380 199844 199562 199361 199559 199846 199931 199864
51492 199864 199723 199461 199207 199311 199760 199834 198777 196693 194413 192493 190716 188711 186621 184871 183511 182152
51476 182152 180540 178790 176989 174846 172028 168762 165877 164170 163802 164290 165015 165734 166671 168125 169939
51461 169939 171511 172419 172968 173886 175557 177851 180700 184457 189458 195543 202282 209421 216830 224193 231146
51446 231146 237598 243504 248379 251485 252533 251834 249607 245583 239562 232058 224081 216349 208969 201877
51432 201877 195333 189851 185646 182292 179089 175772 172635 169909 167363 164807 162670 161574 161441 161518 161241
51417 161241 160669 160076 159674 159771 160620 161952 163166 164133 165237 166446 167113 167090 167334 168709 170671 171893 171928
51400 171928 171592 171841 172946 174627 176379 177679 178419 179181 180610 182571 184411 185984 187802 190101 192336
51385 192336 193854 194589 194919 195220 195763 196630 197480 197691 196989 195772 194669 193996 193669 193317 192368 190418 187730
51368 187730 185109 183069 181323 179228 176486 173254 169886 166764 164184 162133 160351 158742 157551 157023
51354 157023 157119 157703 158796 160448 162568 165013 167642 170160 172186 173682 175040 176478 177588 177779 176941
51339 176941 175377 173288 170715 167875 165169 162862 160958 159319 157723 155970 154210 153010 152731 153019 153284
51324 153284 153540 154223 155286 156078 156318 156520 157138 157778 157724 156950 156100 155630 155423 155179 154742 154041 153127 152349 152160
51305 152160 152596 153169 153442 153410 153208 152715 151804 150849 150629 151625 153641 156139 158764 161394 163928 166304 168739
51288 168739 171667 175224 178918 181968 184014 185275 185980 185901 184700 182576 180265 178364 176913 175698 174656
51273 174656 173830 173189 172750 172726 173245 174037 174651 174920 174898 174391 173021 170883 168808 167646 167439 167434 166799 165218
51255 165218 163019 160997 159966 160198 161273 162632 164233 166470 169466 172712 175475 177391 178560 179221 179560
51240 179560 179742 179891 179889 179320 177808 175456 172832 170507 168768 167754 167598 168128 168630 168381 167474 166787 166997
51223 166997 167891 168827 169554 170269 171083 171873 172626 173537 174637 175587 176151 176703 178005 180424 183566 186749 189634
51206 189634 192170 194083 194842 194268 192853 191264 189744 188221 186689 185177 183613 182200 181656 182492 184128
51191 184128 185419 186092 186915 188297 189559 190000 189903 189885 189899 189627 189328 189366 189220 187962 185711 183638 182374 181275
51173 181275 179621 177757 176496 175831 174913 173158 170906 168941 167654 166810 166059 165475 165432 165963 166590 167016 167642
51156 167642 168959 170707 172252 173707 175918 179108 182192 183843 183923 183495 183709 184935 186671 187951 187986 186745
51140 186745 184893 183076 181494 180203 179448 179324 179341 178796 177598 176439 176041 176337 176495 175749 174203 172723
51124 172723 171973 171716 171335 170819 170796 171546 172478 172831 172500 171930 171530 171500 171961 172862 173894 174748 175407 175998 176569
51105 176569 177163 177871 178574 178890 178745 178796 179868 182010 184410 186240 187332 188077 188967 190246 191795 193289
51089 193289 194559 195767 197090 198375 199284 199690 199796 199888 200137 200510 200743 200589 200303 200696 202425 205288 208430
51072 208430 211156 213298 215000 216478 217972 219668 221669 224131 227238 230781 234084 236803 239560 243215
51058 243215 247577 251516 254360 256481 258305 259529 259834 259788 260279 261295 261946 261660 260773 259810 258704 256975
51042 256975 254448 251483 248645 246313 244581 243318 242259 241145 239937 239005 238911 239837 241227 242244 242680
51027 242680 243148 244327 246278 248710 251590 255068 258932 262619 265843 268889 272142 275567 278837 281771
51013 281771 284531 287531 291311 296250 302155 308184 313422 317573 320948 323882 326403 328555 330769 333610
50999 333610 337130 340732 343882 346925 350961 356842 364392 372720 381119 389466 397844 406201 414542 423202
50985 423202 432725 443544 455904 469953 485716 503120 522282 543792 568516 596995 629135 664503
50973 664503 702910 744682 790353 839995 892878 947911 1004470 1062488 1121592 1180413 1237071
50962 1237071 1290181 1339058 1383097 1421467 1453603 1479645 1500242 1516103 1527852 1536108 1541527 1544822
50950 1544822 1546679 1547540 1547561 1547056 1546861 1547828 1549957 1552383 1554193 1554694 1552855 1547266 1537120 1522753 1504729
50935 1504729 1482797 1456266 1425044 1389701 1350711 1308233 1262549 1214145 1163434 1111029 1058290
50924 1058290 1007020 958326 912174 868189 826576 788083 753346 722408 694623 668951 644642
50913 644642 621801 601075 582724 566244 551020 537065 524859 514595 505812 497791 490258 483616
50901 483616 478415 474679 472010 470374 470292 471897 474244 476127 477445 479140 481837 485188 488619 492107 495936
50886 495936 500194 504818 509863 515478 521827 529132 537496 546640 556189 566349 577861 591102 605654
50873 605654 621010 637308 655045 674420 695340 717882 742444 769585 799933 834102 872560
50862 872560 915769 964504 1019681 1081657 1150108 1224882 1306701 1396703 1495444 1602455 1716435
50851 1716435 1835653 1958543 2084179 2211797 2339513 2463914 2581323 2689120 2785453 2868276
50841 2868276 2935675 2987150 3023862 3047482 3059315 3060722 3053836 3041519 3026764 3012281 3000397 2993061
50829 2993061 2991786 2997319 3009064 3024886 3041768 3056760 3067239 3070575 3064049 3045319 3012820 2965865
50817 2965865 2904582 2829719 2742193 2642839 2532891 2414644 2291266 2165832 2040809 1918394
50807 1918394 1800850 1690143 1587432 1493156 1407502 1330593 1262324 1202261 1149783 1104311 1065415
50796 1065415 1032766 1005935 984197 966568 952092 940180 930661 923448 918032 913331 908205 902180
50784 902180 895593 889030 882751 876628 870318 863369 855406 846472 837054 827546 817774 807205 795520 782794
50770 782794 769323 755546 742021 729224 717325 706349 696471 687972 681001 675625 672030 670399 670586
50757 670586 672278 675596 681245 689809 701015 713996 728362 744774 764249 787009 812331 839616
50745 839616 869215 901957 938195 977777 1020745 1067505 1118328 1173234 1232416 1296095 1363642
50734 1363642 1433365 1503511 1573114 1641567 1707869 1770715 1828909 1881127 1925563 1960384 1984505
50723 1984505 1997718 2000444 1993839 1979908 1960948 1938901 1915534 1892953 1873424 1858611 1849227 1845197
50711 1845197 1845869 1850340 1857933 1868034 1879112 1888267 1892381 1889470 1878492 1858346 1827983 1787412 1737818
50698 1737818 1680638 1617162 1549041 1478490 1407819 1339103 1274170 1214210 1159435 1109665 1065203
50687 1065203 1026561 993622 965966 943914 928215 918600 913744 912979 916984 926261 939886 956342
50675 956342 974748 994500 1014490 1033606 1051539 1068285 1083239 1095637 1105617 1114045 1121398 1127475
50663 1127475 1132109 1135554 1138168 1140222 1141989 1143634 1145154 1146790 1149317 1153417 1158927 1165281 1172563 1181595
50649 1181595 1193000 1206745 1222639 1240749 1261118 1283486 1307404 1332348 1357623 1382469 1406332
50638 1406332 1428798 1449267 1467021 1481700 1493422 1502440 1508986 1513348 1515595 1515065 1510660 1502039 1490293
50625 1490293 1477155 1463746 1450399 1437410 1425415 1414956 1406049 1398462 1392230 1387717 1385275 1385063 1387089
50612 1387089 1391190 1396913 1403683 1411131 1419001 1426468 1431792 1432954 1428582 1418052 1401014 1377414 1347954
50599 1347954 1313853 1275864 1234076 1189045 1142615 1096986 1053168 1010868 969752 930219 892956
50588 892956 858344 826589 798038 773004 751388 732700 716385 702170 690221 681054 675084 672135
50576 672135 671541 672766 675775 680706 687416 695534 704824 715228 726608 738679 751252 764382 778285
50563 778285 793243 809627 827788 847804 869427 892398 916665 942087 968074 993786 1018696
50552 1018696 1042713 1065691 1087128 1106556 1124145 1140772 1157567 1175480 1195129 1216817 1240610
50541 1240610 1266391 1293946 1323250 1354928 1390288 1430529 1475902 1526076 1581265 1642307 1709361
50530 1709361 1781221 1856381 1934201 2014333 2095476 2175566 2252956 2326448 2394256 2453912 2503475
50519 2503475 2542061 2568912 2582612 2581676 2565473 2534399 2489797 2434079 2370357 2301403 2229182 2155523
50507 2155523 2082675 2012802 1947410 1887678 1834901 1790102 1753590 1725377 1705771 1695086 1693009
50496 1693009 1698684 1711217 1729741 1753198 1780379 1809811 1839093 1864658 1882778 1890765 1886985 1870241
50484 1870241 1839935 1796784 1742730 1680047 1610893 1537548 1462404 1387455 1314142 1243689 1177229
50473 1177229 1115555 1059074 1007950 962014 920647 883237 849772 820623 795855 775172 758450
50462 758450 745728 736675 730633 727397 727397 730885 737375 746131 756757 769012 782442 796681 811853
50449 811853 828218 845445 862434 877760 890078 898282 901724 900498 895528 888350 880675 873824 868352
50436 868352 864249 861545 860599 861753 864946 869847 876239 884120 893584 904786 917898 932910 949591
50423 949591 967863 988164 1011167 1037145 1065841 1097009 1130776 1167340 1206496 1247708 1290463
50412 1290463 1334239 1378144 1420972 1461772 1500166 1535915 1568322 1596226 1618418 1633862 1641723
50401 1641723 1641531 1633280 1617036 1592505 1559402 1518428 1471528 1420951 1368175 1313858 1258571 1203333
50389 1203333 1149595 1099021 1053224 1013349 979678 951689 928684 910595 898206 892468 893447 900081
50377 900081 911032 925470 942682 961245 979197 994978 1007624 1016014 1018649 1014543 1003878 987503
50365 987503 966256 941062 913169 883809 853911 824398 796205 769503 743371 716908 690453
50354 690453 665172 641739 620014 599795 581215 564415 549480 536715 526430 518391 511922 506631
50342 506631 502572 499771 498094 497669 498914 501910 506087 510613 514879 518593 521800 524891 528308 532231
50328 532231 536788 542433 549618 558149 567346 576836 586671 596639 606092 614698 622888 631288 640172 649679
50314 649679 660100 671578 683882 696926 711297 727981 747739 770999 798100 829254 864383
50303 864383 903388 946810 996098 1052715 1115995 1180833 1237545 1275315 1287375 1273909 1240599
50292 1240599 1194861 1143094 1089981 1038685 991122 948363 911122 879800 854206 833586 817139
50281 817139 804448 795429 789966 787679 787953 790157 793896 799129 806053 814798 825218 837084 850625
50268 850625 866788 886608 910065 935746 961797 987016 1010846 1032727 1052084 1068920 1083810
50257 1083810 1097121 1108631 1118049 1125524 1131296 1135100 1136146 1133546 1126601 1114874 1098292 1077235 1052486
50244 1052486 1025152 996542 967896 940159 914115 890640 870457 853510 838806 825069 811484
50233 811484 797849 784296 771046 758304 746217 734918 724539 714975 705693 696002 685545 674385
50221 674385 662727 650838 639122 627898 617062 606243 595304 584364 573427 562477 552014
50210 552014 542897 535407 528889 522568 516360 510652 505744 501817 498996 496959 494828 491943 488594 485595
50196 485595 483315 481610 480537 480554 481837 483793 485495 486419 486631 486397 485800 484742 483228 481491 479743 477894
50180 477894 475676 473050 470252 467463 464691 462062 459882 458265 456989 455874 455088 454840 455038 455514 456423
50165 456423 458157 461044 465403 471700 480245 490731 502420 514970 528954 545533 565666 589632
50153 589632 617239 648433 683621 723322 767636 816134 868065 922208 976603 1029052 1078316
50142 1078316 1124595 1168581 1210353 1249523 1286076 1320419 1352402 1380526 1402238 1415029 1417479
50131 1417479 1409559 1392009 1365469 1330378 1287721 1239452 1187893 1134869 1081651 1029457 979586
50120 979586 933089 890600 852364 818119 787103 758645 732860 710428 691550 675380 660671
50109 660671 646840 634217 623353 614228 606168 598441 590847 583666 577111 571030 565192 559652 554723
50096 554723 550785 548263 547545 548528 550243 551301 550981 549840 549135 549677 551332 553580 556347 560080 565137
50081 565137 571467 578986 587831 597836 608022 617251 625385 633302 641661 650171 658216 665606 672306 677972
50067 677972 682263 685277 687147 687464 685765 682517 678944 675721 672297 667722 661766 655024 648311 642298
50053 642298 637562 634535 633240 633257 634054 635350 637180 639699 643065 647512 653363 660873 670063 680831 693212
50038 693212 707424 723658 741906 762007 783830 807469 833258 861440 891717 923286 955429
50027 955429 987754 1019666 1049964 1077480 1101896 1123418 1141856 1156714 1168179 1177200 1184325 1189004
50015 1189004 1190213 1187086 1178579 1163279 1140256 1109895 1073537 1032671 988828 943792 899242 856296
50003 856296 815678 778046 743830 713117 686115 663349 644897 629752 616453 604106 592352
49992 592352 580702 568592 555918 542972 529988 517294 505630 495603 486853 478439 470055 462294
49980 462294 455689 450090 445034 440141 434977 429035 422128 414536 406673 398857 391379 384452 378160 372775
49966 372775 368929 366933 366035 364975 363314 361659 360592 360050 359902 360335 361315 362250 362642 362638 362561 362223 361161
49949 361161 359297 357003 354686 352538 350566 348585 346408 344161 342264 340919 339866 338785 337704 336835
49935 336835 336292 336133 336433 337059 337614 337861 338014 338416 339091 339825 340530 341256 341986 342634 343226 343931 344953 346440
49917 346440 348357 350358 351951 352859 353107 352744 351719 350101 348130 345901 343314 340504 337997 336171 334809
49902 334809 333487 332152 330911 329471 327354 324662 322103 320045 318090 315873 313870 312833 312660 312473 311847
49887 311847 311345 311484 311789 311462 310691 310515 311412 312708 313586 314065 314651 315525 316510 317482 318343 318884 319117 319469
49869 319469 320252 321188 321955 322916 324677 327136 329636 332027 334825 338224 341676 344702 347477 350228 352592
49854 352592 354091 354846 355357 355777 355852 355438 354655 353571 352096 350261 348359 346746 345654 345309 346017 347875
49838 347875 350356 352364 352994 352281 351052 350020 349221 348333 347119 345461 343362 341336 340419 341254 343301 345356
49822 345356 346761 347726 348612 349420 349904 349840 349250 348719 349221 351056 353125 353960 353405 352598 352333 352287 351965 351512
49804 351512 351204 350885 350354 349714 348882 347393 345251 343420 342830 343230 343634 343626 343598 343899 344332 344440 343891 342633
49786 342633 341003 339594 338737 338271 338058 338338 339173 339835 339430 338040 336683 336065 335922 335673 335208 334726 334171
49769 334171 333312 332257 331487 331305 331495 331668 331760 331994 332470 333106 333975 335324 337040 338517 339391 340099 341300
49752 341300 342989 344693 346221 347562 348245 347728 346548 346200 347490 349638 351402 352496 353465 354737 356346
49737 356346 358204 360059 361459 362175 362477 362719 362995 363495 364719 366887 369575 372416 375749 380012 384753
49722 384753 388860 391542 392673 392494 391534 390564 389953 389247 387961 386587 386157 386976 388508 390488 393312 397164
49706 397164 401422 405318 408730 412044 415526 419119 422613 425794 428556 430952 433074 434921 436515 438049
49692 438049 439746 441672 443893 446580 449735 453057 456431 460382 465634 472337 479970 487704 494386 498543
49678 498543 499223 496963 493424 490022 487305 485521 485084 486300 489168 493638 499537 505987 511283 513737 512547
49663 512547 507953 500945 492858 484792 477104 469651 462483 455944 450141 444880 440332 437314 436509 437670
49649 437670 439881 442498 445616 449695 454698 459529 462451 462358 459603 455433 450873 446475 442676 439587 436571
49634 436571 432949 429220 426711 425779 425272 424219 423138 422991 423607 424038 423998 423942 423937 423422 422186 420848 420107 420004
49616 420004 420128 420208 420319 420734 421642 422906 424157 425240 426341 427469 428182 428277 428479 429785 432151 434415 435636
49599 435636 436005 436275 436785 437285 437410 437028 436393 436087 436582 437653 438459 438401 437717 437097 436984 437460 438509 439987
49581 439987 441418 442217 442250 442086 442611 444399 447308 450637 453690 456288 458680 461029 463224 465207 467219
49566 467219 469539 472192 475107 478334 481837 485242 488088 490255 491870 492932 493331 493140 492556 491623 490393
49551 490393 489280 488753 488566 487839 486130 484001 482203 480655 478690 476112 473602 472187 472589 474949 478789
49536 478789 483287 487916 492906 498952 506523 515527 525421 535388 544670 553122 561270 569479 577132 583047
49522 583047 586665 588466 589368 590184 591539 593710 596372 598906 601044 602920 604566 605857 606928 607971 608572
49507 608572 607948 606089 603945 602124 600055 596926 592836 588467 584128 579799 575745 572335 569414 566481
49493 566481 563353 560212 557223 554647 553070 552835 553311 553380 552664 551754 551268 551261 551574 552098 552487 552135 550795 548906
49475 548906 547134 545793 544826 544083 543514 543283 543659 544551 545292 545255 544650 544234 544248 544122 543350 542148 541035 540202
49457 540202 539595 539308 539511 540138 540913 541657 542474 543708 545753 548759 552519 556769 561462 566520 571491 575898
49441 575898 579875 583980 588226 591806 594052 595340 596829 599586 604114 610288 617282 623645 627945 629553
49427 629553 628893 627027 624958 623149 621536 620065 619094 619110 620152 621830 623822 626044 628401 630892 634048
49412 634048 638731 645187 652700 660387 668040 675916 684139 692678 701664 711303 721603 732422 743633
49399 743633 754982 765950 776025 784959 792614 798887 804071 808968 814167 819389 823931 827563 830467
49386 830467 832416 832736 831258 828751 826036 823078 819377 814996 810683 806955 803524 799859 796017 792588
49372 792588 789938 787861 786091 784795 784292 784427 784578 784280 783529 782417 780793 778542 775997 773772 772176
49357 772176 770889 769198 766418 762271 757091 751711 746932 742946 739359 735809 732403 729401 726650 723605
49343 723605 719967 716004 712141 708549 705418 703393 703294 705362 709085 713697 718357 721877 722972 721206 717329
49328 717329 712305 706398 699627 692616 686211 680418 674411 667730 660937 654950 650151 646253 642643 638732
49314 638732 634283 629565 625097 621276 618376 616617 615785 614963 613251 610747 608310 606379 604648 602859 601203
49299 601203 599747 598245 596882 596523 597673 599665 601389 602442 603082 603447 603438 603224 603233 603644 604230 604737 605194 605929
49281 605929 607465 610192 613942 618027 621977 626025 630629 635688 640572 644816 648553 652303 656487 661026
49267 661026 665224 668200 669565 669592 668744 667334 665732 664383 663361 662279 660955 659725 658740 657437 655316
49252 655316 652972 651601 651557 652009 652032 651439 650431 649088 647586 646457 646140 646438 646779 646947 647291 648159 649455
49235 649455 650951 652882 655920 660452 666132 672362 679044 686529 694944 703930 713015 721855 730033 737126
49221 737126 743227 749075 755421 762417 769749 777098 784405 792019 800691 810968 822497 834425 846651
49208 846651 859990 874775 889990 904384 917765 930530 942537 953495 964115 975746 988790
49197 988790 1002325 1015357 1027642 1039163 1049705 1059356 1068743 1078347 1087990 1097271 1106080 1114462 1122511
49184 1122511 1130694 1139791 1150092 1161040 1171982 1182911 1194129 1205620 1217248 1229195 1241575 1253772
49172 1253772 1264870 1274816 1284650 1295325 1306666 1317769 1328213 1338565 1349702 1361883 1374637 1387411
49160 1387411 1400107 1412891 1425698 1438224 1450423 1462768 1475857 1489885 1504620 1519774 1535212
49149 1535212 1550825 1566379 1581706 1597003 1612762 1629239 1646048 1662511 1678487 1694583 1711358
49138 1711358 1728514 1745198 1761065 1776706 1792967 1810139 1827957 1846134 1864661 1883659 1903175
49127 1903175 1923206 1943933 1965971 1990462 2018724 2051607 2089235 2131639 2179917 2236763 2305546
49116 2305546 2388165 2482811 2583166 2680422 2768210 2847481 2926316 3012355 3103008 3183019 3233487
49105 3233487 3245090 3223628 3183660 3137228 3087445 3030274 2960709 2877912 2786349 2693088 2603996
49094 2603996 2522008 2448175 2383265 2327870 2281686 2243612 2212477 2187183 2166359 2148601 2133230
49083 2133230 2120412 2110390 2102854 2097061 2092315 2088291 2085048 2082664 2080806 2078863 2076647 2074616 2073134
49070 2073134 2071887 2070402 2068717 2066961 2064688 2061397 2057559 2054234 2051616 2048739 2044870 2040470 2036343 2032450
49056 2032450 2028053 2022710 2016614 2010150 2003484 1996542 1989127 1981096 1972556 1963838 1955298 1947293 1940367 1935143
49042 1935143 1931827 1929905 1928503 1927022 1925457 1924314 1924261 1925734 1928752 1933067 1938358 1944204 1950102 1955790
49028 1955790 1961401 1967040 1972373 1976979 1980984 1984944 1989168 1993611 1998371 2003770 2009784 2015865 2021562 2026968
49014 2026968 2032412 2038067 2044064 2050654 2057980 2065824 2073807 2081690 2089378 2096788 2103813 2110319 2116241 2121876
49000 2121876 2127889 2134602 2141315 2146904 2151198 2155198 2159643 2163951 2166972 2168400 2168831 2168751 2168086 2166714 2164799
48985 2164799 2162484 2159608 2155950 2151501 2146369 2140649 2134538 2128440 2122708 2117361 2112207 2107232 2102655 2098614
48971 2098614 2095052 2092159 2090649 2091182 2093456 2096327 2099012 2101815 2105421 2109819 2114347 2118605 2122823 2127373
48957 2127373 2132313 2137418 2142337 2146710 2150497 2154244 2158728 2164301 2170776 2177913 2185616 2193688 2201806 2209952
48943 2209952 2218590 2228274 2239253 2251561 2265293 2280690 2298071 2317695 2339634 2363868 2390616 2420382
48931 2420382 2453358 2489003 2526557 2565864 2607305 2650984 2696453 2743218 2791114 2840193 2890611
48920 2890611 2942518 2995625 3048971 3101658 3153730 3205781 3257763 3308935 3358978 3408200 3456370
48909 3456370 3502301 3545219 3585869 3625536 3664422 3701747 3737127 3771112 3804430 3837306 3869538
48898 3869538 3900777 3930650 3958946 3985763 4011258 4035291 4057559 4078042 4097078 4114872 4131073
48887 4131073 4144895 4155718 4163633 4169331 4173367 4175600 4175492 4172755 4167345 4158928 4146912 4131090 4111832
48874 4111832 4089497 4064089 4035701 4004862 3972141 3937685 3901289 3862628 3821363 3777512 3731924
48863 3731924 3685907 3640034 3593740 3546420 3498465 3450827 3403979 3357847 3312493 3268300 3225602
48852 3225602 3184610 3145654 3109122 3075123 3043444 3013873 2986418 2961318 2938878 2919142 2901688
48841 2901688 2886001 2872116 2860659 2852088 2846197 2842386 2840066 2838754 2838201 2838592 2840177 2842638 2845386 2848639
48827 2848639 2853442 2860235 2868080 2875755 2882993 2890136 2897286 2904539 2912431 2921213 2930074 2937999 2945213 2952892
48813 2952892 2961560 2970593 2979305 2987755 2996400 3005655 3015887 3027238 3039287 3051382 3063371 3075566
48801 3075566 3088042 3100574 3113302 3126797 3141297 3156369 3171538 3186783 3202229 3217734 3232962
48790 3232962 3247552 3261160 3273702 3285640 3297652 3309938 3322159 3334016 3345367 3355756 3364484
48779 3364484 3371457 3377492 3383401 3389086 3393832 3397178 3399107 3399548 3398157 3394567 3388570 3380013 3368696 3354553
48765 3354553 3337792 3318751 3297541 3274004 3248122 3220332 3191148 3160578 3128303 3094498 3059951
48754 3059951 3025161 2989828 2953642 2917071 2880888 2845325 2810430 2776945 2745970 2717768 2691545
48743 2691545 2666540 2642769 2620637 2600458 2582543 2567217 2554449 2543847 2535252 2528956 2525224 2523958
48731 2523958 2524960 2528020 2532547 2537548 2542338 2546980 2551799 2556829 2562053 2567833 2574552 2581936 2589174 2595733
48717 2595733 2601721 2607330 2612233 2615876 2618309 2620353 2622711 2625144 2626805 2627328 2627157 2626849 2626657 2627002 2628581
48702 2628581 2631390 2634106 2635341 2635458 2636406 2639733 2645296 2651974 2658963 2666101 2673466 2681081 2688893 2696897
48688 2696897 2705498 2715803 2729371 2747646 2771842 2803238 2843336 2893904 2957222 3036053 3132786
48677 3132786 3248520 3383106 3535277 3701326 3873199 4038672 4184068 4297008 4367604 4389360
48667 4389360 4360769 4286166 4174370 4036185 3882619 3723806 3567858 3420106 3283584 3160016
48657 3160016 3050066 2953058 2867351 2791263 2723503 2662943 2608456 2559105 2514188 2473110 2435386
48646 2435386 2400697 2368655 2338566 2309713 2281929 2255617 2231076 2207914 2185235 2162318 2139069
48635 2139069 2115897 2093298 2071620 2051091 2031771 2013407 1995526 1977903 1960802 1944550 1929055
48624 1929055 1913975 1899176 1884714 1870531 1856567 1843049 1830233 1817952 1805914 1794357 1783824
48613 1783824 1774363 1765576 1757505 1750659 1744927 1739246 1732829 1726065 1719720 1713853 1708151 1702799 1698179 1694000
48599 1694000 1689501 1684405 1679022 1673458 1667407 1660725 1653577 1645896 1637287 1627685 1617657 1607806 1598252 1588900
48585 1588900 1579880 1571437 1563652 1556528 1550162 1544564 1539469 1534518 1529553 1524577 1519569 1514516 1509470 1504336
48571 1504336 1498688 1492066 1484467 1476214 1467304 1457244 1445755 1433424 1421346 1410222 1400077 1390754
48559 1390754 1382176 1374056 1365794 1357033 1348139 1339877 1332636 1326177 1319989 1313746 1307511 1301631 1296367 1291552
48545 1291552 1286760 1281897 1277302 1273152 1269114 1264891 1260785 1257269 1254218 1251031 1247415 1243587 1239752 1235854
48531 1235854 1231869 1228028 1224646 1221927 1219829 1217933 1215669 1212996 1210578 1208800 1206895 1203754 1199419 1195054
$$ [...]
##END NTUPLES=NMR SPECTRUM
##END=
