##TITLE=NES1060_159122.0007_002_9704132_ozipFNsutZ
##JCAMPDX= 6.0         $$ Bruker NMR JCAMP-DX V2.0
##DATA TYPE= NMR SPECTRUM
##DATA CLASS= NTUPLES
##ORIGIN= BRUKER
##OWNER= Administrator
$$ 1.72 TOPSPIN		Version 2.1
$$ 2016-04-30 16:21:11.286 -0700  Administrator@X
$$ Compression mode = diff/dup
##.OBSERVE FREQUENCY= 400.02188249412
##.OBSERVE NUCLEUS= ^1H
##.ACQUISITION MODE= SIMULTANEOUS (DQD)
##.ACQUISITION SCHEME= undefined
##.AVERAGES= 8
##.DIGITISER RES= 22
##SPECTROMETER/DATA SYSTEM= spect
##.PULSE SEQUENCE= zg30
##.SOLVENT NAME= COFFEE_meoh
##.SHIFT REFERENCE= INTERNAL, COFFEE_meoh, 1, 14.98509
##AUDIT TRAIL= $$ (NUMBER, WHEN, WHO, WHERE, PROCESS, VERSION, WHAT)
$$ ##TITLE= Audit trail, TOPSPIN		Version 2.1
$$ ##JCAMPDX= 5.01
$$ ##ORIGIN= Bruker BioSpin GmbH
$$ ##OWNER= Administrator
$$ $$ E:\/data/COFFEE/nmr/NES1060_159122.0007_002_9704132_ozipFNsutZ/10/pdata/1/auditp.txt
$$ ##AUDIT TRAIL=  $$ (NUMBER, WHEN, WHO, WHERE, PROCESS, VERSION, WHAT)
(   1,<2016-04-30 16:21:03.974 -0700>,<Administrator>,<X>,<go>,<TOPSPIN 2.1>,
      <created by zg
	started at 2016-04-30 16:19:57.677 -0700,
	POWCHK enabled, PULCHK disabled,
       configuration hash MD5:
       21 0F 79 D6 B3 7B B4 F6 88 20 88 DB 03 48 BD 9F
       data hash MD5: 64K
       6E 1F D3 3D A1 2F E7 C5 0F BB D2 99 9D 17 85 99>)
(   2,<2016-04-30 16:21:07.224 -0700>,<Administrator>,<X>,<proc1d>,<TOPSPIN 2.1>,
      <Start of raw data processing
       efp LB = 0 FT_mod = 6 PKNL = 1 PHC0 = 0 PHC1 = 0 SI = 32K 
       data hash MD5: 32K
       C2 3F 9C C7 31 DF 70 D5 E0 36 B8 AB 59 83 E1 0B>)
(   3,<2016-04-30 16:21:07.505 -0700>,<Administrator>,<X>,<proc1d>,<TOPSPIN 2.1>,
      <pk PHC0 = 96.87744 PHC1 = 0 
       data hash MD5: 32K
       3B C4 11 3B BF CC 1B DC BC DF A9 A3 6F DE CB 8E>)
(   4,<2016-04-30 16:21:07.630 -0700>,<Administrator>,<X>,<proc1d>,<TOPSPIN 2.1>,
      <abs ABSG = 1 
       data hash MD5: 32K
       46 5D 55 E3 A4 0E 69 B2 D1 A0 3F 1D 85 5E 83 9E>)
(   5,<2016-04-30 16:21:07.692 -0700>,<Administrator>,<X>,<proc1d>,<TOPSPIN 2.1>,
      <abs ABSG = 2 
       data hash MD5: 32K
       AB 30 08 F5 C4 B6 85 AE A8 67 1F 6C 5C DB 71 63>)
(   6,<2016-04-30 16:21:07.755 -0700>,<Administrator>,<X>,<proc1d>,<TOPSPIN 2.1>,
      <abs ABSG = 3 
       data hash MD5: 32K
       6F 9E B3 7F 6C 1D 64 36 6E 92 BF B7 1C D1 4F 89>)
(   7,<2016-04-30 16:21:07.817 -0700>,<Administrator>,<X>,<proc1d>,<TOPSPIN 2.1>,
      <abs ABSG = 4 
       data hash MD5: 32K
       82 91 29 9D 77 C1 90 0A 6A 5C 4F BF 2B 89 83 5C>)
(   8,<2016-04-30 16:21:07.880 -0700>,<Administrator>,<X>,<proc1d>,<TOPSPIN 2.1>,
      <abs ABSG = 5 
       data hash MD5: 32K
       C4 53 7A A0 96 D6 19 D4 F3 3B 30 A5 B5 D1 51 22>)
$$ ##END=
$$ 
$$ $$ hash MD5
$$ $$ E7 4D 0D 5E 00 3C 76 08 96 BD 09 6A 68 19 80 EE
##$RELAX= 
##$RELAX= 
##$RELAX= 
##$RELAX= 
##$RELAX= 
##$RELAX= 
##$RELAX= 
$$ Bruker specific parameters
$$ --------------------------
##$DU= <E:\>
##$EXPNO= 10
$$ [...]
150 150 150 150 150 150 150 150
##$TP07= 0
##$TPNAME0= <>
##$TPNAME1= <>
##$TPNAME2= <>
##$TPNAME3= <>
##$TPNAME4= <>
##$TPNAME5= <>
##$TPNAME6= <>
##$TPNAME7= <>
##$TPOAL= (0..7)
0.5 0.5 0.5 0.5 0.5 0.5 0.5 0.5
##$TPOFFS= (0..7)
0 0 0 0 0 0 0 0
##$TUNHIN= 0
##$TUNHOUT= 0
##$TUNXOUT= 0
##$USERA1= <user>
##$USERA2= <user>
##$USERA3= <user>
##$USERA4= <user>
##$USERA5= <user>
##$V9= 5
##$VALIST= <valist>
##$VCLIST= <CCCCCCCCCCCCCCC>
##$VD= 0
##$VDLIST= <DDDDDDDDDDDDDDD>
##$VPLIST= <PPPPPPPPPPPPPPP>
##$VTLIST= <TTTTTTTTTTTTTTT>
##$WBST= 2048
##$WBSW= 25
##$XGAIN= (0..3)
0 0 0 0
##$XL= 0
##$YL= 0
##$YMAX_a= 614098
##$YMIN_a= -520119
##$ZGOPTNS= <>
##$ZL1= 120
##$ZL2= 120
##$ZL3= 120
##$ZL4= 120
##$ABSF1= 14.98509
##$ABSF2= -5.573092
##$ABSG= 5
##$ABSL= 3
##$ALPHA= 0
##$AQORDER= 0
##$ASSFAC= 0
##$ASSFACI= 0
##$ASSFACX= 0
##$ASSWID= 0
##$AUNMP= <proc_prof1d_extract_pilot.lims>
##$AXLEFT= 0
##$AXNAME= <>
##$AXNUC= <1H>
##$AXRIGHT= 0
##$AXTYPE= 0
##$AXUNIT= <>
##$AZFE= 0.1
##$AZFW= 0.1
##$BCFW= 0
##$BC_mod= 0
##$BYTORDP= 0
##$COROFFS= 0
##$CY= 15
##$DATMOD= 1
##$DC= 0
##$DFILT= <>
##$DTYPP= 0
##$F1P= 0
##$F2P= 0
##$FCOR= 0.5
##$FTSIZE= 32768
##$FT_mod= 6
##$GAMMA= 0
##$GB= 0
##$INTBC= 1
##$INTSCL= 1
##$ISEN= 128
##$LB= 0
##$LEV0= 0
##$LPBIN= 0
##$MAXI= 10000
##$MC2= 0
##$MEAN= 0
##$ME_mod= 0
##$MI= 0
##$NCOEF= 0
##$NC_proc= -8
##$NLEV= 6
##$NOISF1= 0
##$NOISF2= 0
##$NSP= 0
##$NTH_PI= 0
##$NZP= 0
##$OFFSET= 14.98509
##$PC= 1
##$PHC0= 96.87744
##$PHC1= 0
##$PH_mod= 1
##$PKNL= yes
##$PPARMOD= 0
##$PPDIAG= 0
##$PPIPTYP= 0
##$PPMPNUM= 2147483647
##$PPRESOL= 1
##$PSCAL= 4
##$PSIGN= 0
##$PYNMP= <proc.py>
##$REVERSE= no
##$SF= 400.02
##$SI= 32768
##$SIGF1= 0
##$SIGF2= 0
##$SINO= 400
##$SIOLD= 32768
##$SPECTYP= <>
##$SREGLST= <1H.CDCl3>
##$SSB= 0
##$STSI= 32768
##$STSR= 0
##$SW_p= 8223.68421052631
##$SYMM= 0
##$S_DEV= 0
##$TDeff= 65536
##$TDoff= 0
##$TI= <>
##$TILT= no
##$TM1= 0
##$TM2= 0
##$TOPLEV= 0
##$USERP1= <user>
##$USERP2= <user>
##$USERP3= <user>
##$USERP4= <user>
##$USERP5= <user>
##$WDW= 1
##$XDIM= 32768
##$YMAX_p= 438309322
##$YMIN_p= -708493
##$CURPLOT= <Network HP LaserJet P1505>
##$CURPRIN= <$Network HP LaserJet P1505>
##$DFORMAT= <normdp>
##$LAYOUT= <+/1D_H.xwp>
##$LFORMAT= <normlp>
##$PFORMAT= <normpl>
##$SURQMSG= 1
$$ End of Bruker specific parameters
$$ ---------------------------------
##NTUPLES= NMR SPECTRUM
##VAR_NAME=  FREQUENCY,     SPECTRUM/REAL,   SPECTRUM/IMAG
##SYMBOL=    X,             R,               I
##VAR_TYPE=  INDEPENDENT,   DEPENDENT,       DEPENDENT
##VAR_FORM=  AFFN,          ASDF,            ASDF
##VAR_DIM=   32768,         32768,           32768
##UNITS=     HZ,            ARBITRARY UNITS, ARBITRARY UNITS
##FACTOR=    0.250966925370066, 1,           1
##FIRST=     8223.43324360094, -219284,      -134228
##LAST=      0,             -46366,          -50029
##MIN=       0,             -708493,         0
##MAX=       8223.43324360094, 438309322,    0
$$ Real data points
##PAGE= N=1
##DATA TABLE= (X++(R..R)), XYDATA
$$ [...]
19541D9396a51821L1647h220B11728d4222j82054B24676c00190j18636f3245B08177
$$ 49396 -151821 -120174 -8220 211728 -44222 -226276 224676 -300190 -418826 -63245 208177
19529A15520D0818f2681j39549M7691A03893a95708C34483a80636P9517j56093
$$ 115520 40818 -62681 -202230 -154539 103893 -195708 334483 -180636 -101119 -257212
19519b57212j06649a35437q3713j04523A78764f2047a4866m2074B422K19676d13036
$$ -257212 -363861 -135437 -219150 -323673 178764 -62047 -14866 -56940 2422 222098 -413036
19507A9106a7441A7192a58983G0907k508a57630p3611A0228b53722m5298F6586
$$ 19106 -17441 17192 -158983 70907 68399 -157630 -231241 10228 -253722 -299020 66586
19495i5726A38022b58210C07238j18071b29573Q4403g146k75890J26659j24004
$$ -95726 138022 -258210 307238 189167 -229573 -145170 -7146 -283036 -156377 -280381
19485b80381a21064j66354j53453a67733A04527h2551b5697A8315N271K23729
$$ -280381 -121064 -287418 -440871 -167733 104527 -82551 -25697 18315 23586 247315
19475B47315g3054j62392B0945D283G02b153l45261f3613h657o4346j42510A07665
$$ 247315 -73054 -235446 20945 4283 702 -2153 -347414 -63613 -8657 -73003 -215513 107665
19462a87479l0853I3259b18407J00670G0184N899M7665f6535E6718b39749D6674
$$ -187479 -218332 93259 -218407 -117737 70184 76083 123748 -66535 56718 -239749 46674
19450c30706a45798j9500e78j48727G9259j0604c38244J5815i9073m8445A48922
$$ -330706 -145798 -165298 -578 -149305 79259 68655 -338244 -322429 -99073 -147518 148922
19438c22419b998A51056b55139b4829k44956a24095L6911l44545A69207b84893
$$ -322419 -2998 151056 -255139 -24829 -269785 -124095 -87184 -431729 169207 -284893
19427b69293A94579a34243j72205C2525a54160N9106F6028J52916b14931d423
$$ -269293 194579 -134243 -306448 32525 -154160 -95054 66028 218944 -214931 -4423
19416i9910j45604a09175k8772A956f6027r756K4443I6935N9674n5704A5621R1441
$$ -99910 -245514 -109175 -137947 1956 -66027 -75783 -51340 96935 156609 100905 15621 107062
19404A07062a18985J7559b3903k58197b4374A14271b7749k77761a4153G8400b5939
$$ 107062 -118985 -101426 -23903 -282100 -24374 114271 -27749 -305510 -14153 78400 -25939
19392D8701c2993G7913d0381j41403c8573r5349k0596N0748C06738C32g2624K9407
$$ 48701 -32993 77913 -40381 -181784 -38573 -133922 -154518 -103770 306738 332 -72624 -43217
19380d3217A04304n1431a44619j6635A53820C5354L018K79412F4596a65968k45994
$$ -43217 104304 52873 -144619 -161254 153820 35354 38372 317784 64596 -165968 -411962
19369d11962B5053e2404j14330k61358c9954G8519a48972g1883H8109C4024b16178
$$ -411962 25053 -52404 -166734 -428092 -39954 78519 -148972 -71883 88109 34024 -216178
19357i758A30824c84855a79667k7965F8755a44435E785a83550M150B00636c3844
$$ -9758 130824 -384855 -179667 -207632 68755 -144435 5785 -183550 -179400 200636 -33844
19345a4704E423i1591G0536a22847H7353N01062b85796L9258e4828D7632b0265
$$ -14704 5423 -91591 70536 -122847 87353 588415 -285796 -246538 -54828 47632 -20265
19333a32364I8905J71848j11356G0983c6345j06562D9411J12707k6599A5132b16761
$$ -132364 98905 270753 159397 70983 -36345 -142907 49411 162118 135519 15132 -216761
19321B2183a70460O379B41827a92318h2998o6943l2495k9086h2742L1238J3450
$$ 22183 -170460 -164081 241827 -192318 -82998 -149941 -182436 -211522 -82742 -51504 -38054
19310c8054J359j55446o6474C3165N2914C8569d60338A61708c22165g320n0272
$$ -38054 -36695 -192141 -258615 33165 86079 38569 -460338 161708 -322165 -7320 -57592
19299e7592l15646E6759N2732d2658A57028j5015d67102I5062J64956m5787a3261
$$ -57592 -373238 56759 109491 -42658 157028 142013 -467102 95062 260018 214231 -13261
19287h7903G9579a09462C810a34052L9341A72313k7299d67775a44591F3027a37772
$$ -87903 79579 -109462 3810 -134052 -94711 172313 145014 -467775 -144591 63027 -137772
19275F3236J7711h6390K1420B15568a34415J568J0064j66838i8745I3222K06457
$$ 63236 80947 -86390 -64970 215568 -134415 -132847 -122783 -289621 -98745 93222 299679
19264B99679a40969A30020C9737K472P97b37438H3918a73667a7429E9943K34734
$$ 299679 -140969 130020 39737 42209 43006 -237438 83918 -173667 -17429 59943 294677
19253B94677j39469f9192J0310p420A45830c1996j61702b3791I8190a05425A71604
$$ 294677 155208 -69192 -58882 -66302 145830 -31996 -193698 -23791 98190 -105425 171604
19241c3285j30585C2076b35785J0312A7439J1979b29982g0681j02503A0985b03899
$$ -33285 -163870 32076 -235785 -225473 17439 29418 -229982 -70681 -173184 10985 -203899
19229b74850a13909l04895A23209d10234a89392d4575F7768b90379a30334b1828
$$ -274850 -113909 -418804 123209 -410234 -189392 -44575 67768 -290379 -130334 -21828
19218b11958A60224a42853d7805J3597a5766o8774D35b30424B69673f4777A24208
$$ -211958 160224 -142853 -47805 -34208 -15766 -84540 435 -230424 269673 -64777 124208
19206F1767K94749A49973c46686J70980B8799r549R156b09635K812A69789b14082
$$ 61767 356516 149973 -346686 -175706 28799 19250 28406 -209635 -206823 169789 -214082
19194a15081j73830h7477A00707f602D3242b80283A70450p6304m4168J32516d65946
$$ -115081 -288911 -87477 100707 -6602 43242 -280283 170450 94146 49978 182494 -465946
19182b10228B35472C8195J09704c02241c2083j09795A42645c91567J45779B0343
$$ -210228 235472 38195 147899 -302241 -32083 -141878 142645 -391567 -245788 20343
19171h1118n8356j24480C5234b93054B819d0479o3436b2262r2944A3194a34895
$$ -81118 -139474 -263954 35234 -293054 2819 -40479 -103915 -22262 -115206 13194 -134895
19159A1736d60927B3291A535f4111F4382a53257k97548a18333b7035F9874J22178
$$ 11736 -460927 23291 1535 -64111 64382 -153257 -450805 -118333 -27035 69874 192052
19148A92052b45995h6856D11802a455G0615J0714b22940f0538K7360n2547j2697
$$ 192052 -245995 -86856 411802 -1455 70615 81329 -222940 -60538 -33178 -85725 -98422
19137i8422p8844k2230K4056A4451f0547o3320J1451j65747M1528l4424f4809
$$ -98422 -177266 -199496 -175440 14451 -60547 -123867 -112416 -278163 -236635 -271059 -64809
19125a5586E0628a91301A20357a06760C0250N3583R2557b6010j87836E4972f6142
$$ -15586 50628 -191301 120357 -106760 30250 83833 176390 -26010 -213846 54972 -66142
19113g7763L1882H3722J77158G5123a17074k40014H909a00382A22822M1461a29183
$$ -77763 -45881 83722 260880 75123 -117074 -357088 8909 -100382 122822 164283 -129183
19101d14020P5678J03969h5553q7534D9246K3389d53543a57394b1064C0266M1016
$$ -414020 -338342 -234373 -85553 -173087 49246 72635 -453543 -157394 -21064 30266 71282
19090G1282c814j45278O3067B10685Q7105a72808A0392J22973J0624e1131j05146
$$ 71282 -3814 -149092 -86025 210685 297790 -172808 10392 133365 143989 -51131 -156277
19079a56277E0785J28318K7545q8038g4598m3132r9955g0688j08719A5174J08853
$$ -156277 50785 179103 206648 118610 -74598 -117730 -217685 -70688 -179407 15174 124027
19068A24027a03587j15029d557n7251O083C7769a08008B16826m2503B3164a11901
$$ 124027 -103587 -218616 -4557 -61808 -55725 37769 -108008 216826 174323 23164 -111901
19056B63218I8229k4912i0121J490A17671i9482A158J44910d4772p7508k4229
$$ 263218 98229 73317 -90121 -88631 117671 -99482 1158 146068 -44772 -122280 -146509
19045a46509C7012c26377Q5654N2796k9051C5680b08307C82027D5682P7140N1776
$$ -146509 37012 -326377 -240723 -187927 -216978 35680 -208307 382027 45682 122822 174598
19034A74598M1081c9429D63382G9957f8793j71413A56659B9620c5935p7414K4551
$$ 174598 215679 -39429 463382 79957 -68793 -240206 156659 29620 -35935 -113349 -88798
19023h8798B96c08295H2003a06039m9296L5510e5969I1366a90559P5764G5784
$$ -88798 296 -308295 82003 -106039 -155335 -119825 -55969 91366 -190559 -114795 75784
19011f4104A9289c4054B55963o1450d9230B5488b28926G9515a4571D19487a74879
$$ -64104 19289 -34054 255963 194513 -49230 25488 -228926 79515 -14571 419487 -174879
18999f7159b1957k79465e8416k13437j0569F3625a70218N1049D0949J10420F29
$$ -67159 -21957 -301422 -58416 -271853 -282422 63625 -170218 -119169 40949 151369 629
18987A24610a75606l31999H6720n75B9469a01969d1560j98731D1279Q5874c47411
$$ 124610 -175606 -507605 86720 86145 29469 -101969 -41560 -240291 41279 127153 -347411
18975b12874H8016b93983B12028b12006c5544B69564j02760j5848b03004R831
$$ -212874 88016 -293983 212028 -212006 -35544 269564 166804 150956 -203004 -193173
18965a93173I596a63491C03925i5213o1712j25417c1182I3497k7168r505J40291
$$ -193173 9596 -163491 303925 -95213 -156925 -282342 -31182 93497 66329 56824 197115
18954A97115c6382A00570d8782B17779a07012j19239i835D075a07623d2798j36521
$$ 197115 -36382 100570 -48782 217779 -107012 -226251 -9835 4075 -107623 -42798 -179319
18943a79319D1453g0794G881K1011e2261j5629A5687b57358F3145a50555N7080
$$ -179319 41453 -70794 7881 28892 -52261 -67890 15687 -257358 63145 -150555 -93475
18932i3475C1398K04546f0509D421b39331A31910K42269j35488C4126a67902P0785
$$ -93475 31398 235944 -60509 4421 -239331 131910 374179 238691 34126 -167902 -97117
18921i7117M3472m9259J7995q1211h0280e853E5763e6686j77963C01702b71681
$$ -97117 -53645 -102904 -84909 -166120 -80280 -5853 55763 -56686 -234649 301702 -271681
18909F3716L8971C2285J27546j2015l1836k4920c7120k01621g5841C2628J61728
$$ 63716 102687 32285 159831 147816 115980 91060 -37120 -238741 -75841 32628 194356
18898A94356P3828l9611a88312F4004g4153A35682h2163B07258a55333P5906k4582
$$ 194356 268184 228573 -188312 64004 -74153 135682 -82163 207258 -155333 -79427 -104009
18887a04009j36386N0255j22143h5034j46567O1558j20433l0448g2783q6647I17
$$ -104009 -240395 -190140 -312283 -85034 -231601 -170043 -290476 -320924 -72783 -159430 917
18875A12142a62528A3107I59J91408b45362d7153p9816D9092R4537n3270e30607
$$ 112142 -162528 13107 959 192367 -245362 -47153 -126969 49092 143629 90359 -530607
18863b67965a30593D2960c33074J51717L3232j63525O331J23209A00204a70583
$$ -267965 -130593 42960 -333074 -181357 -148125 -311650 -305319 -182110 100204 -170583
18852a24762j36573C97332h902E3765a04935j8541G844e0133o9674q9786h3901
$$ -124762 -261335 397332 -8902 53765 -104935 -123476 7844 -50133 -119807 -209593 -83901
18840b48330g1715b9467k10021H6599F28a7788A51784L1354a05876b2897D5726
$$ -248330 -71715 -29467 -239488 86599 628 -17788 151784 183138 -105876 -22897 45726
18828a53516c3403l50989A41848a74090G7033g5469F5791a39983E0332M7980k5311
$$ -153516 -33403 -384392 141848 -174090 77033 -75469 65791 -139983 50332 98312 73001
18817G3001a44593B54494b03187C21567a14020c8290C46490D8592K22038j18433
$$ 73001 -144593 254494 -203187 321567 -114020 -38290 346490 48592 270630 152197
18807A52197L8537f0285a9947j66044k7639A0501c55545a5515o8209K0538m4700
$$ 152197 190734 -60285 -19947 -185991 -213630 10501 -355545 -15515 -83724 -63186 -107886
18796a07886A19219a58988A41922j4957a33278o1353A25653o1629n103g7849A2556
$$ -107886 119219 -158988 141922 126965 -133278 -194631 125653 64024 58921 -77849 12556
18784a62383k71185B3118O8810B6802b2398H7385a26533G4999b03489N2704d7450
$$ -162383 -433568 23118 91928 26802 -22398 87385 -126533 74999 -203489 -150785 -47450
18772A07962D1533L16972a43447M2425k62310a00958C9536e4417l205n0783K5539
$$ 107962 41533 358505 -143447 -101022 -363332 -100958 39536 -54417 -57622 -108405 -82866
18761h2866J5578C44007b14861E6046b72671A60225a60388f488k3942l02689J16149
$$ -82866 -67288 344007 -214861 56046 -272671 160225 -160388 -6488 -30430 -333119 -216970
18750b16970F300M8172a51796A11399b35415A04329N8763b00430J2537d5592j40177
$$ -216970 6300 54472 -151796 111399 -235415 104329 163092 -200430 -187893 -45592 -185769
18739a85769j4400F0937P346k7057a7368I587h4874B105K01913E7625A3862f5350
$$ -185769 -200169 60937 68283 41226 -17368 9587 -84874 2105 204018 57625 13862 -65350
18726a68931G6008b8761E8798K00734p6602b26993L5876K1084d4938A19554a29068
$$ -168931 76008 -28761 58798 259532 182930 -226993 -191117 -170033 -44938 119554 -129068
18714B1698b67372Q0986e4813K3061G6821M1516a30379k01539B3576Q12J24707
$$ 21698 -267372 -186386 -54813 -31752 76821 118337 -130379 -331918 23576 24388 149095
18703A49095I959K02380H7335d5861C6985g4281D2530b56490k5983B2436P622
$$ 149095 9959 212339 87335 -45861 36985 -74281 42530 -256490 -282473 22436 30058
18692C0058J33735G9096b6353j23845r3000P6332A20678h7614p6129C0048d7476
$$ 30058 163793 79096 -26353 -150198 -243198 -166866 120678 -87614 -163743 30048 -47476
18680c2223A35896F6129e1116l33767a49879C5093a04907A43421f8321j01591
$$ -32223 135896 66129 -51116 -384883 -149879 35093 -104907 143421 -68321 -169912
18670a69912E918g0045j14896j57262e0668m7678j09658l2150C5816a49654k0368
$$ -169912 5918 -70045 -184941 -342203 -50668 -98346 -208004 -240154 35816 -149654 -170022
18659a70022b3038r9794M8501c5981k20283a0056B66607c04475J0599k14810H5879
$$ -170022 -23038 -122832 -74331 -35981 -256264 -10056 266607 -304475 -293876 -508686 85879
18647G7758b22411g9338j04164d5234k41472E6936g6042A52776p4793a91010A87577
$$ 77758 -222411 -79338 -183502 -45234 -286706 56936 -76042 152776 77983 -191010 187577
18635A09751m7531A6068a07608j20596c5744A75774A8185a87278A04600c58076
$$ 109751 62220 16068 -107608 -228204 -35744 175774 18185 -187278 104600 -358076
18624c58030a28689E9601a37862j85170a40206H31O5500J23815c42305h090m3911
$$ -358030 -128689 59601 -137862 -323032 -140206 831 66331 190146 -342305 -8090 -52001
18613e2001B16846f2654j56151K4224d8113m998A43241e1460m39017c4440m0004
$$ -52001 216846 -62654 -218805 -194581 -48113 -53111 143241 -51460 -490477 -34440 -74444
18602g4444j48274B96253c9031a4163j44225g9122P345A70657N9622h8156j3072
$$ -74444 -222718 296253 -39031 -14163 -158388 -79122 -71777 170657 230279 -88156 -101228
18591a01228C5953P9324J65537O5328a71027r8788c955A37265a10457N4400H7081
$$ -101228 35953 115277 280814 346142 -171027 -269815 -3955 137265 -110457 -56057 87081
18579b04160O6677M8769E576J01425k2672a28143e0261i529k02055F4799J06539
$$ -204160 -137483 -88714 5576 107001 84329 -128143 -50261 -9529 -211584 64799 171338
18568A71338b63349A38808M1335k7417i8922J5234K7328F9634R657R9220A8660
$$ 171338 -263349 138808 180143 152726 -98922 -83688 -56360 69634 79291 178511 18660
18556c25817a512j45081A02841d4902j43995d1785C8643f3659n3251B6892b39432
$$ -325817 -1512 -146593 102841 -44902 -188897 -41785 38643 -63659 -116910 26892 -239432
18544A06259b31672c0122C6275f8656D8867e7182j51890N6445D23883a16143j44675
$$ 106259 -231672 -30122 36275 -68656 48867 -57182 -209072 -152627 423883 -116143 -260818
18533b60818I7970D1032a98223b864r9471k5446E1023J05309b12569B35957b62596
$$ -260818 97970 41032 -198223 -2864 -102335 -127781 51023 156332 -212569 235957 -262596
18521A85783d8327C4698b6061A37089F7042h017j79045A01899B704h5341a9345
$$ 185783 -48327 34698 -26061 137089 67042 -8017 -187062 101899 2704 -85341 -19345
18509H6005l8015a51491j9297J9395l20777G4263k1385R117f0231k64497a6974
$$ 86005 47990 -151491 -170788 -151393 -472170 74263 52878 61995 -60231 -324728 -16974
18497H387i4582a5407m6175m08210e238j97943j5291j21666B444J45461a50590
$$ 8387 -94582 -15407 -61582 -469792 -5238 -203181 -218472 -340138 2444 147905 -150590
18485a18181k5313A77332c18518H793K96084a61867A50926B6674b0092F5099b65815
$$ -118181 -143494 177332 -318518 8793 304877 -161867 150926 26674 -20092 65099 -265815
18473a32348C9369J64296c5711n9370H5627M451Q6687b46519a01973A63281b28043
$$ -132348 39369 203665 -35711 -95081 85627 90078 176765 -246519 -101973 163281 -228043
18461A4829g8781a4672j20090B9584K12306j07937H835b15639A58299p5805g7463
$$ 14829 -78781 -14672 -134762 29584 241890 133953 8835 -215639 158299 82494 -77463
18449D5510L27f9506A81235b52733A52702b41092f9761h373k1571B08216i7969
$$ 45510 45837 -69506 181235 -252733 152702 -241092 -69761 -8373 -29944 208216 -97969
18437B41206e5356n9112P370k13449J02494a7865A52920C6238q660A2901d22473
$$ 241206 -55356 -114468 -107098 -320547 -218053 -17865 152920 36238 27578 12901 -422473
18425A11680a74990j72621N8275i1121j54567e5247q2500E3894b63773A58840
$$ 111680 -174990 -347611 -289336 -91121 -245688 -55247 -137747 53894 -263773 158840
18414F8017a91419h3963C68351a26685G7487K03311H8984h0015l37190C32262
$$ 68017 -191419 -83963 368351 -126685 77487 280798 88984 -80015 -417205 332262
18403f4658A16677M3328b3966n2854m6387p1668F4844g4961r5746A95133a313
$$ -64658 116677 160005 -23966 -76820 -123207 -194875 64844 -74961 -170707 195133 -1313
18391i3125G460J46277b7033B40804g4594I3526e7742j7836E8885h5633J1216
$$ -93125 7460 153737 -27033 240804 -74594 93526 -57742 -75578 58885 -85633 -74417
18380g4417J0272B23201F8143h3169A63468b03119g8795r690j6098n5159b3074
$$ -74417 -64145 223201 68143 -83169 163468 -203119 -78795 -88485 -104583 -159742 -23074
18368a45703A93312C7809A2013J6670J8235f9556l43267d8627j18880C95116b96776
$$ -145703 193312 37809 12013 28683 46918 -69556 -412823 -48627 -167507 395116 -296776
18356A26497b71418C6668K5958a49505B55621c36131e5524R215a8942A00723a87195
$$ 126497 -271418 36668 62626 -149505 255621 -336131 -55524 -46309 -18942 100723 -187195
18344G219a56960j73745a11508k94117h9338j23833f4104a9437l0161r8196k96045
$$ 7219 -156960 -330705 -111508 -405625 -89338 -213171 -64104 -19437 -49598 -147794 -443839
18333d43839A95506a50862I2338A3174a3443A3650K66618r4086m1280p1596e3406
$$ -443839 195506 -150862 92338 13174 -13443 13650 280268 186182 144902 73306 -53406
18321a74816j06181N012f898r3906j6766B9981q593c01035a125B55429j25295
$$ -174816 -280997 -275985 -6898 -100804 -117570 29981 21388 -301035 -1125 255429 130134
18310A30134c89470r372H7843L60607c72607A145c0771A97334L3190h4420J5127
$$ 130134 -389470 -398842 87843 448450 -372607 1145 -30771 197334 230524 -84420 -69293
18299f9293L1598C2656d77104b37535O9698a7371A0797N8825c58281A0445a9732
$$ -69293 -37695 32656 -477104 -237535 -167837 -17371 10797 69622 -358281 10445 -19732
18287a6795q8275j38841Q8302J4508k44578e2385J3813n6350k71128I7865b9138
$$ -16795 -105070 -243911 -155609 -141101 -385679 -52385 -38572 -94922 -366050 97865 -29138
18275A87074B8100b46661A32502a01522A13326b56269Q2132l1702d0772A02784
$$ 187074 28100 -246661 132502 -101522 113326 -256269 -174137 -205839 -40772 102784
18264e3864d49k52811A08463K844G889a19521F801Q3939b44303M943B20124b11061
$$ -53864 -449 -253260 108463 111307 7889 -119521 6801 90740 -244303 -239360 220124 -211061
18251a29873A79488G2585J92660a32056B54029A1789b1536j82110Q0552e0054
$$ -129873 179488 72585 265245 -132056 254029 11789 -21536 -203646 -123094 -50054
18240a94527h6647l5155A67287b15018G9417c99835B06873p60b20887I272N3795
$$ -194527 -86647 -121802 167287 -215018 79417 -399835 206873 206113 -220887 9272 63067
18229F3067J55383b31698C1540P3949c424A2293a40565q5336B03927I6374J15221
$$ 63067 218450 -231698 31540 105489 -3424 12293 -140565 -225901 203927 96374 211595
18218B11595R923d3484F4342K8180a18272a1731A30175c60288H4801A6811Q0195
$$ 211595 221518 -43484 64342 92522 -118272 -11731 130175 -360288 84801 16811 97006
18207I7006c117j55018A68151F9521J094O0025a10326B03853g0294B98553a93575
$$ 97006 -3117 -158135 168151 69521 70615 130640 -110326 203853 -70294 298553 -193575
18195A05854g0570G8040K4777b0076i338A07076b8089k83571a06548q0976b6088
$$ 105854 -70570 78040 102817 -20076 -9338 107076 -28089 -311660 -106548 -187524 -26088
18183g8750J4961F261b60606D1760K93173a94503A61682F1138N3051n2825b2986
$$ -78750 -63789 6261 -260606 41760 334933 -194503 161682 61138 114189 61364 -22986
18171B83573A1250b14442C8375G100a17917F1484I158a28294A07901A9521a77260
$$ 283573 11250 -214442 38375 7100 -117917 61484 9158 -128294 107901 19521 -177260
18159E6821K47551b43128n8160B9782i2494j09729A29845D7622J98404B8391b3077
$$ 56821 304372 -243128 -301288 29782 -92494 -202223 129845 47622 246026 28391 -23077
18147d2270k22459J17519A27003L443F3871a76737j78107e9980j20596F1251J4067
$$ -42270 -264729 -147210 127003 130446 63871 -176737 -354844 -59980 -180576 61251 75318
18136G5318a29793k81677a94170A81051a10215j5853H5252b10352G8310d15958
$$ 75318 -129793 -411470 -194170 181051 -110215 -126068 85252 -210352 78310 -415958
18125A7710a82180e6215A71224c30344h4234A22838d1300F1661b74668A28202
$$ 17710 -182180 -56215 171224 -330344 -84234 122838 -41300 61661 -274668 128202
18114G8591f0587k9836N764b7707G8514d97371i8284j96126D1347b29414E5023
$$ 78591 -60587 -90423 -84659 -27707 78514 -497371 -98284 -294410 41347 -229414 55023
18102A20181a88600A62580A8877J58919E6880e7070k29070D6401A3368b8500B39234
$$ 120181 -188600 162580 18877 177796 56880 -57070 -286140 46401 13368 -28500 239234
18090a99857D387M252a98386d9542l8193q4707J3354A41026a9468A35559a41733
$$ -199857 4387 8639 -198386 -49542 -87735 -172442 -159088 141026 -19468 135559 -141733
18078b2391m6705B758b28572f6614A26941B6505J26170c30448A31900K01058b57178
$$ -22391 -69096 2758 -228572 -66614 126941 26505 152675 -330448 131900 332958 -257178
18066g089n1628A11996a05964A63567g2979j03018A02463b36090C1973J42956
$$ -7089 -58717 111996 -105964 163567 -72979 -175997 102463 -236090 31973 174929
18056A74929a8959A7310i046I4764g9594a7278E8718i5368j0841A0982a16727
$$ 174929 -18959 17310 -9046 94764 -79594 -17278 58718 -95368 -106209 10982 -116727
18044a11850d7906B50444a25670b7169C04885C6289b66053A90548H8194J61691
$$ -111850 -47906 250444 -125670 -27169 304885 36289 -266053 190548 88194 249885
18034B49885b1391B39993a30988B15596b60176O6925c6425j9395j01006b3321
$$ 249885 -21391 239993 -130988 215596 -260176 -193251 -36425 -55820 -156826 -23321
18023D778K28813F601O5119j1932b06344h336l37560k66413F6613J5009L4479
$$ 4778 233591 6601 71720 59788 -206344 -8336 -345896 -612309 66613 81622 116101
18012A16101a78548h1298k18457N6898A71385A1905a23418A5016a07991A01715
$$ 116101 -178548 -81298 -299755 -242857 171385 11905 -123418 15016 -107991 101715
18001a60875N6522b7791k07937E2537b51981J3707f0645n5778c4381A08698f3343
$$ -160875 -104353 -27791 -235728 52537 -251981 -238274 -60645 -116423 -34381 108698 -63343
17989A85257c4090k63129c3089A94516O801o488a69415I0196a24266R834C62231
$$ 185257 -34090 -297219 -33089 194516 201317 194829 -169415 90196 -124266 -114432 362231
17977I5002g1913p2183A88273b53596D4543J89061R7161a7049j39629m9369j21145
$$ 95002 -71913 -144096 188273 -253596 44543 233604 330765 -17049 -156678 -206047 -327192
17966c27192C22920a43012N8782A11165B5625K3940K42176e3241J2473A43428
$$ -327192 322920 -143012 -84230 111165 25625 49565 291741 -53241 -40768 143428
17955H3854j0104b65695j01085J42936b5463D5390d8878G4501C6653N7064J60837
$$ 83854 73750 -265695 -366780 -223844 -25463 45390 -48878 74501 36653 93717 254554
17944B54554p5886P61q9096b4932A35631f0651E3535e3510j88615a04859q3978
$$ 254554 178668 179429 90333 -24932 135631 -60651 53535 -53510 -242125 -104859 -188837
17933a88837F3413d6110g555B15305E6803B2593J20613A1150b36667O6994B09463
$$ -188837 63413 -46110 -7555 215305 56803 22593 143206 11150 -236667 -169673 209463
17921a68710a3283n29795f3550C15498a2959G8730a47102l0310A77015d26274
$$ -168710 -13283 -543078 -63550 315498 -12959 78730 -147102 -177412 177015 -426274
17910G8675e1315j99521B34193E3744d5570C36732A32205a15034G0912a6041A05316
$$ 78675 -51315 -250836 234193 53744 -45570 336732 132205 -115034 70912 -16041 105316
17898a86209C8330a33762e5069H6020e1052G4256b6725A45104c9665j15926m2789
$$ -186209 38330 -133762 -55069 86020 -51052 74256 -26725 145104 -39665 -155591 -198380
17887a98380g9308A47586a27774A35277L3557i0108B26507A09716a09136C2174
$$ -198380 -79308 147586 -127774 135277 168834 -90108 226507 109716 -109136 32174
17876C08031A27365g5061A54261f7676B13893I5918c67276A10426P8334D1273
$$ 308031 127365 -75061 154261 -67676 213893 95918 -367276 110426 188760 41273
17865B08085b00269a2947e145B7880M0917J78633k6974q1037b97649B58273i3898
$$ 208085 -200269 -12947 -5145 27880 68797 247430 220456 139419 -297649 258273 -93898
17853I95K59132b02068A77903i2115G5010A4948a72950d3552K0427j86075a7852
$$ 995 260127 -202068 177903 -92115 75010 14948 -172950 -43552 -23125 -209200 -17852
17841a70027I7381a82302h2137B88311a03724F4851K13159a31121A71897e103
$$ -170027 97381 -182302 -82137 288311 -103724 64851 278010 -131121 171897 -5103
17830b49023D36542a44793A56928c50889a9292A69223a11206b6585C0555a55331
$$ -249023 436542 -144793 156928 -350889 -19292 169223 -111206 -26585 30555 -155331
17819I9135a13743H3949f8745A35538L1868p8180J74605f7542n9133g382G6290
$$ 99135 -113743 83949 -68745 135538 167406 89226 263831 -67542 -126675 -7382 76290
17807a26542B16231m4560A306J1351b38595n1751l503B91378A1742J14249b76507
$$ -126542 216231 171671 1306 12657 -238595 -290346 -293849 291378 11742 125991 -276507
17795g4797j19206g0435A07365D3470J31083c1215C06457r9574H0314J48737c3494
$$ -74797 -194003 -70435 107365 43470 174553 -31215 306457 206883 80314 229051 -33494
17783C51903a27182A8293L0312J81355a63414l16266a54775G7022g4497C2446
$$ 351903 -127182 18293 48605 229960 -163414 -479680 -154775 77022 -74497 32446
17772a96961A1601a50567c0930j0950q4869C19454i4482k97660A38410g8636B56880
$$ -196961 11601 -150567 -30930 -41880 -126749 319454 -94482 -392142 138410 -78636 256880
17760C5894f4136A89976i7620B90052a1060F2071K3346J08006o0694a23853l3796
$$ 35894 -64136 189976 -97620 290052 -11060 62071 85417 193423 132729 -123853 -157649
17749a57649M4934N4424a9747B35227h1055j05391A44097a23568A737J90747e7377
$$ -157649 -112715 -58291 -19747 235227 -81055 -186446 144097 -123568 1737 192484 -57377
17737g5162A53067J1338G737g7114j68306d0827q0087n0999g7681G994P9624J96074
$$ -75162 153067 164405 7737 -77114 -245420 -40827 -120914 -171913 -77681 7994 87618 283692
17725B83692i7874G0596C0287f9026J2779A56059b32863A89610D6905a16991j60406
$$ 283692 -97874 70596 30287 -69026 -56247 156059 -232863 189610 46905 -116991 -277397
17714b77397A45621J85634D6670O2483J32036B2456N2438M1047C4846a17545B9323
$$ -277397 145621 331255 46670 109153 241189 22456 74894 115941 34846 -117545 29323
17702C17129g857A38823n478b65151E2657L17548j35356p7229b32523j59919B1650
$$ 317129 -7857 138823 133345 -265151 52657 370205 234849 157620 -232523 -392442 21650
17690a15599A81285a9129I6770c1228D54011B04511d539B60395C5448O7824C7991
$$ -115599 181285 -19129 96770 -31228 454011 204511 -4539 260395 35448 103272 37991
17678A38746a37786M2487o1795B946Q8875c5414j60117B3026K68524d47382J58281
$$ 138746 -137786 -95299 -157094 2946 91821 -35414 -195531 23026 291550 -447382 -289101
17667b89101E0509c10280i9065G8850J4914J9277B0082g5971C36765A46317c7484
$$ -289101 50509 -310280 -99065 78850 93764 113041 20082 -75971 336765 146317 -37484
17655c2240F5729a16525G4040b4391j7240p8846J5956E9616K10546d0612k51816
$$ -32240 65729 -116525 74040 -24391 -41631 -120477 -104521 59616 270162 -40612 -292428
17644b92428F8300a79916D4071K74864a56754d0184B6207a4056E2377a24788B18485
$$ -292428 68300 -179916 44071 318935 -156754 -40184 26207 -14056 52377 -124788 218485
17632b29023A77983b95423C61629j11300J77867a77411A84751a76707Q6606k54865
$$ -229023 177983 -295423 361629 250329 428196 -177411 184751 -176707 -90101 -344966
17622c44966N3484l6888B47504a52653B47439q4057o9789O5935K85031g132A8614
$$ -344966 -291482 -328370 247504 -152653 247439 163382 93593 159528 444559 -7132 18614
17610B01603Q6244H525K37871G5203N5120k8387j6248a22330B6747K01193j03534
$$ 201603 287847 8525 246396 75203 130323 101936 85688 -122330 26747 227940 124406
17599A24406A9417f4510F2115L24274I5272B2548J34281n8231J15960M2758j09701
$$ 124406 19417 -64510 62115 386389 95272 22548 156829 98598 214558 257316 147615
17588A47615j7850b7858A53550D4282Q7692b8093a111B9541I387b5551A27011
$$ 147615 129765 -27858 153550 44282 131974 -28093 -1111 29541 9387 -25551 127011
17576H3462J589N6194B1997b49096h1491e18A24179a73662B14050i1737B26795
$$ 83462 85051 141245 21997 -249096 -81491 -518 124179 -173662 214050 -91737 226795
17564B89747h8206A53512a04238j06750B47566j18460E5500J51429b44970E6208
$$ 289747 -88206 153512 -104238 -210988 247566 129106 55500 206929 -244970 56208
17553E242J20069M2286K61189a69142D5121B0321J38805o2725i2113B06698B4439
$$ 5242 125311 167597 428786 -169142 45121 20321 159126 96401 -92113 206698 24439
17541B18694J3032P9089j14246H4541R6709A7024L22176I5850J62271a25495A83457
$$ 218694 231726 310815 196569 84541 181250 17024 339200 95850 258121 -125495 183457
17529B24224q2326Q3874d9833B48324A01293C0326K24220b3062C53826E5767M0038
$$ 224224 141898 225772 -49833 248324 101293 30326 254546 -23062 353826 55767 95805
17518I5805J84246J13769a1383j027B41989D7707J05999a57714o8901A57426l2184
$$ 95805 280051 393820 -11383 -12410 241989 47707 153706 -157714 -226615 157426 125242
17507A25242m731a05728E5977B4495L14000a13483e4532E33617B53638l8865J10652
$$ 125242 120511 -105728 55977 24495 338495 -113483 -54532 533617 253638 214773 325425
17496C25425e6043D04859b4785F4721K29203J551G7528K30245a1483C32257c4218
$$ 325425 -56043 404859 -24785 64721 293924 295475 77528 307773 -11483 332257 -34218
17484A57306c19355c1695A16020n246R8444q8910K61806J23544r0080C435M05478
$$ 157306 -319355 -31695 116020 110774 209218 120308 382114 505658 415578 3435 408913
17473D08913i2492B25422K43575e9156C41354I0446J16356J4277j05641R233i9784
$$ 408913 -92492 225422 468997 -59156 341354 90446 206802 221079 115438 124671 -99784
17461A35162d1742D77101k38149K414n6318J18092A47120e7090e791G0332J92085
$$ 135162 -41742 477101 238952 241366 185048 303140 147120 -57090 -5791 70332 262417
17450B62417A28278q713M1042M0745K14071p7595O8915d7571C84218A89020l6600
$$ 262417 128278 119565 160607 201352 415423 337828 406743 -47571 384218 189020 152420
17439A52420J59588I6165J34630E2213J08458b9933o2227r4868B59661F1429K67745
$$ 152420 312008 96165 230795 52213 160671 -29933 -92160 -187028 259661 61429 329174
17428C29174A13659L12221j86005J07886i2890A62660j657i5188H3472K00642
$$ 329174 113659 425880 239875 347761 -92890 162660 161003 -95188 83472 284114
17418B84114J08262q0391j487F0389K90671j02114j01295k2463L3418L18210A88339
$$ 284114 392376 311985 310498 60389 351060 248946 147651 125188 158606 476816 188339
17406a41442J8882c1867A23853k8747J55436C980J25612D2585L36601A72315D4206
$$ -141442 -122560 -31867 123853 95106 250542 3980 129592 42585 379186 172315 44206
17394A20013L46688k22354d7289A360P79761F2413J3577I116L01621a88032C02564
$$ 120013 466701 244347 -47289 1360 781121 62413 75990 9116 310737 -188032 302564
17382B77155f5255B47759q6822o4219i876A58458J06652A06942c7608B10010F8590
$$ 277155 -65255 247759 160937 96718 -9876 158458 265110 106942 -37608 210010 68590
17370B36080b7193A10864J36793J10999b51397A27183K89223H178K88511G0921
$$ 236080 -27193 110864 247657 358656 -251397 127183 416406 8178 296689 70921
17359E07150j85406J12967A8358K32034e1513H5191a32421B53982d4181A14352
$$ 507150 321744 434711 18358 250392 -51513 85191 -132421 253982 -44181 114352
17348I4852J28064A5477Q9059K36889f1175A26361a20361d1362C77679B0097K7944
$$ 94852 222916 15477 104536 341425 -61175 126361 -120361 -41362 377679 20097 48041
17337D8041a311A72716g2874D76082A906P3882L28873H3467a13489m3251F8852
$$ 48041 -1311 172716 -72874 476082 1906 75788 404661 83467 -113489 -156740 68852
17325C80066j51988J67152G4970L26542j31894q1143i0481A03589O2674L2369
$$ 380066 228078 395230 74970 401512 269618 188475 -90481 103589 166263 198632
17315A98632J08129A25137K48048A38738D0266e3202C06418J66956f4480E31605
$$ 198632 306761 125137 373185 138738 40266 -53202 306418 473374 -64480 531605
17304A21625E2775l307L03387B3383L1548a70957B30635J28627A45198R636L9040
$$ 121625 52775 49468 352855 23383 54931 -170957 230635 359262 145198 154834 193874
17293A93874N2686G3410K19633B4843K85205j15627q4124N7031R6223d3986D13842
$$ 193874 246560 73410 293043 24843 310048 194421 110297 167328 263551 -43986 413842
17281H7991J00371l5059J43958n7511c9133A79233A7115R7410I310N04942A72488
$$ 87991 188362 153303 297261 239750 -39133 179233 17115 114525 9310 514252 172488
17269a7240C20230C1422a45474B68407J93522j52305I0683R4485K25181A40001
$$ -17240 320230 31422 -145474 268407 461929 309624 90683 185168 410349 140001
17258A94190a66446G0488h7745G0807K56154J84396r0165j56196P3569J01446
$$ 194190 -166446 70488 -87745 70807 326961 511357 421192 264996 338565 440011
17248D40011q2301r8102r7440q389J29791C1649N53800B30104L5559r0273L73796
$$ 440011 357710 259608 162168 153779 283570 31649 585449 230104 265663 175390 549186
17237E49186C297L00796K65444A09840l8781K11919o8271L82775B54987J23212
$$ 549186 3297 304093 569537 109840 71059 282978 214707 597482 254987 378199
17227C78199j68846K6904D4542M27030q3475K51834B53609p980P3378A41472D8744
$$ 378199 209353 236257 44542 471572 388097 639931 253609 245629 319007 141472 48744
17215A86990J86112j75809L59010k35383J7211R7400K6997L9668k20508Q3398
$$ 186990 373102 197293 556303 320920 338131 435531 462528 502196 281688 365086
17205C65086d8124D01660r1342j51694L75435I3551L66342F0690J07856E3039
$$ 365086 -48124 401660 310318 158624 534059 93551 459893 60690 168546 53039
17194E42428B37807J93794F9239J85638q2676K96657j55458K01879j28326j40254
$$ 542428 237807 431601 69239 254877 172201 468858 313400 515279 386953 246699
17184B46699J51352M39276k30364A54683M01890J14033k34877r5265L02800k41495
$$ 246699 398051 837327 606963 154683 556573 670606 435729 340464 643264 401769
17174D01769j00579J25655o7246A72404J49211j34452N23083C37586A42195J9757
$$ 401769 301190 426845 359599 172404 321615 187163 710246 337586 142195 161952
17164A61952L53432j83266q853A8479N11449J49012L3112C6593M32716I4490J17652
$$ 161952 515384 332118 323265 18479 529928 678940 712052 36593 469309 94490 212142
17153B12142p205J49027N7118Q6543B17262P7398L9065K91754B83043L8215N2244
$$ 212142 204937 353964 411082 497625 217262 294660 333725 625479 283043 321258 373502
17142C73502J5304A68863J47799M6730m4228j36677R6339k7332R4237J4977K37632
$$ 373502 388806 168863 316662 363392 319164 182487 278826 251494 345731 360708 598340
17131E98340j16565R8828j11419O7856N7090n3897p2505n9164N6653q2293J45595
$$ 598340 481775 580603 469184 537040 594130 540233 467728 408564 465217 382924 528519
17120E28519B05935j9138K66737A75526K19881o4393K28990K8125B41781N6476
$$ 528519 205935 186797 453534 175526 395407 331014 560004 588129 241781 298257
17110B98257p8236J91830J05659K82218C81280n8919O8889L34681j64633k12399
$$ 298257 220021 411851 517510 799728 381280 322361 391250 725931 561298 348899
17100C48899L69900l17545J13006r7210J9286j3606K61833o4353j1864q2316J733
$$ 348899 718799 401254 514260 417050 436336 422730 684563 620210 608346 526030 527763
17089E27763j20512M8170n1207J9412M53725k06463j40401M20215m68391J04071
$$ 527763 407251 455421 404214 423626 877351 670888 530487 950702 482311 586382
17079E86382j41341K87914j65910J95069p0911R1645j80984r1300J75194J16415
$$ 586382 445041 732955 567045 762114 691203 782848 601864 510564 685758 802173
17069H02173j96668m6580k743K22420m2791j74774Q9821K40249R8136m64130j51015
$$ 802173 605505 558925 556182 778602 735811 561037 650858 891107 989243 525113 374098
17058C74098L18465J96749l09704q2709L57085j42529n2350J09466j32400J79651
$$ 374098 692563 889312 579608 496899 853984 711455 659105 768571 636171 815822
17048H15822q4288J73513j14755j97095q854K16490k6878j13691j06007J57526
$$ 815822 731534 905047 790292 593197 584343 800833 773955 660264 554257 711783
17038G11783k41210M30517j19303k62930M53637l9174J02180j49513k45450L6351
$$ 711783 470573 901090 781787 518857 972494 933320 1035500 885987 640537 676888
17028F76888J85059m6899p4820J48393j5305K34859k92136Q8936k24784K86749
$$ 676888 861947 815048 740228 888621 873316 1108175 816039 904975 680191 966940
17018I66940J71127j99322P499j13700O2705l88408M46419k511J61651l4591k91167
$$ 966940 1138067 938745 946244 832544 895249 506841 953260 950749 1112400 1077809 786642
17007G86642L44615p5522L0932k44440R7107k51210J82489K59908k59362k03093
$$ 786642 1131257 1055735 1086667 842227 939334 688124 870613 1130521 871159 668066
16997F68066K39591L77452l26674l2994P7593R1710o7520o3283N9938Q2066k15545
$$ 668066 907657 1285109 958435 925441 1003034 1094744 1027224 963941 1023879 1105945 890400
16986H90400K99983o8993r1972J1344J65491J17736K8346k43384J72908J1750
$$ 890400 1190383 1121390 1029418 1040762 1206253 1323989 1352335 1108951 1281859 1293609
16976A293609m09979L72202m9313j36128L10763J0353k21426k37220K69873N42866
$$ 1293609 883630 1255832 1206519 1070391 1381154 1391507 1170081 932861 1202734 1745600
16966A745600k16443n13430M26788l35569J84233J91996l12102M3180j55629K56711
$$ 1745600 1529157 1015727 1442515 1106946 1291179 1483175 1171073 1214253 1058624 1315335
16956A315335K14477K5308j0507J19327j1574l72981N8540j17463J22051J2670
$$ 1315335 1529812 1555120 1544613 1663940 1652366 1279385 1337925 1220462 1342513 1355183
16946A355183Q4338K00473m55237L51551N7830R4038l17504J29433J82299o1854
$$ 1355183 1439521 1639994 1184757 1536308 1594138 1688176 1370672 1500105 1682404 1620550
16936A620550j61036J79783J77363r7662N8056J26436m14233K57850j82390K49755
$$ 1620550 1459514 1639297 1816660 1718998 1777054 1903490 1489257 1747107 1564717 1814472
16926A814472k58617K93988L5018m3320L22868l51446r5433K79288r9918J11308
$$ 1814472 1555855 1849843 1884861 1841541 2164409 1812963 1717530 1996818 1896900 2008208
16916B008208l71307J62719M52499Q0113k06431l61594O47513n5784q0927j03074
$$ 2008208 1636901 1799620 2252119 2332232 2125801 1764207 2411720 2355936 2275009 2171935
16906B171935K55044j06071k26458J13220J04736p2423K29022q0785J16568j95104
$$ 2171935 2426979 2320908 2094450 2207670 2312406 2239983 2469005 2388220 2504788 2309684
16896B309684J65459j39954P0645K13923j44379j5402L93894k76463M05149m30773
$$ 2309684 2475143 2335189 2405834 2619757 2475378 2459976 2853870 2577407 2982556 2551783
16886B551783P7534K95940l4903K56562J32282j70626l31393K21494J52738r6256
$$ 2551783 2629317 2925257 2890354 3146916 3279198 3108572 2777179 2998673 3151411 3055155
16876C055155J39240K3914l7273K21118n7374p9304J81928k4483j21381R0458
$$ 3055155 3194395 3218309 3181036 3402154 3344780 3265476 3447404 3422921 3301540 3391998
16866C391998N2354K39053J64782q7587J37724J24k38539M55065j72589r3904
$$ 3391998 3444352 3683405 3848187 3760600 3898324 3898448 3659909 4114974 3942385 3848481
16856C848481K29614K06732K03172j59910n148K43954k20049l6306K60886r4180
$$ 3848481 4078095 4284827 4487999 4328089 4322941 4566895 4346846 4310540 4571426 4477246
16846D477246M76527j69873J01270J88605q694J972l9718L21234j36920L27706
$$ 4477246 4953773 4783900 4885170 5073775 5065081 5067053 5027335 5348569 5211649 5539355
16836E539355J82175P3599k4971L39456J3844n765l36628N90570J69638P8289
$$ 5539355 5721530 5795129 5770158 6109614 6123458 6117693 5781065 6371635 6541273 6619562
16826F619562L2493J26689L49069l07342J90679N0296L4322K39605P3340M87811
$$ 6619562 6652055 6778744 7127813 6820471 7011150 7061446 7095768 7335373 7408713 7896524
16816G896524L0445J3378L45406K81790j011j38258M52596M10899M32485j85213
$$ 7896524 7926969 7940347 8285753 8567543 8566532 8428274 8880870 9291769 9724254 9539041
16806I539041L26592L029M10213k25484O34712j36593L47693J79513N5250J80767
$$ 9539041 9865633 9868662 10278875 10053391 10688103 10551510 10899203 11078716 11133966 11314733
16796A1314733O29108J72488L72563L16462J05471N01187K65400M73190N78612
$$ 11314733 11943841 12116329 12488892 12805354 12910825 13412012 13677412 14150602 14729214
16787A4729214L33576K04160N24691j00585K46350P30937P27104J46455R65844
$$ 14729214 15062790 15266950 15791641 15691056 15937406 16668343 17395447 17541902 18507746
16778A8507746K72394M11412O07102P68513K06868R66628L24731R62805L85343
$$ 18507746 18780140 19191552 19798654 20567167 20774035 21740663 22065394 23028199 23413542
16769B3413542J106638M30537P28327R28526R52652R31601R60515Q38183R41956
$$ 23413542 24520180 24950717 25679044 26607570 27560222 28491823 29452338 30290521 31232477
16760C1232477J322890R51179J215568J313322J155209J376084J275653J918900
$$ 31232477 32555367 33506546 34722114 36035436 37190645 38566729 39842382 41761282
16752D1761282J024144J773212J808475J704024J900843J989256J831158K097709
$$ 41761282 42785426 44558638 46367113 48071137 49971980 51961236 53792394 55890103
16744E5890103K344235K570907K037551K770551K416844K747973K517033K929101
$$ 55890103 58234338 60805245 62842796 65613347 68030191 70778164 73295197 76224298
16736G6224298K689544L261019K950796K863236L251646L055885K958561L241758
$$ 76224298 78913842 82174861 85125657 87988893 91240539 94296424 97254985 100496743
16728A00496743L336387K814587K539233K454355K835447K274557K034613K202482
$$ 100496743 103833130 106647717 109186950 111641305 114476752 116751309 118785922 120988404
16720A20988404J342808R35992P29441O88865J13535J68607q83940q66576j529475
$$ 120988404 122331212 123267204 123996645 124685510 124799045 124967652 124083712 123217136 121687661
16711A21687661j706120j467530k425296k105120k692759k920533k961329k643867
$$ 121687661 119981541 118514011 116088715 113983595 111290836 108370303 105408974 102765107
16703A02765107l165762l203261l251094l043960k793546l429745k764216l254961
$$ 102765107 99599345 96396084 93144990 90101030 87307484 83877739 81113523 77858562
16695G7858562k696344k760131k810515k628636k808375k533578j906195k512094
$$ 77858562 75162218 72402087 69591572 66962936 64154561 61620983 59714788 57202694
16687E7202694j995681k243254j709437k084205k261482j681545j442211j637961
$$ 57202694 55207013 52963759 51254322 49170117 46908635 45227090 43784879 42146918
16679D2146918j781243r70654j650934j136548j252042j141348j166505j224599
$$ 42146918 40365675 39395021 37744087 36607539 35355497 34214149 33047644 31823045
16671C1823045j280372p79145p72051j149435p48133q68107q49279l72936j159462
$$ 31823045 30542673 29763528 28991477 27842042 27093909 26225802 25376523 25003587 23844125
16662B3844125o29065q01529q51430n49898o30628k71957r63212l93308k89930
$$ 23844125 23215060 22413531 21562101 21012203 20381575 20109618 19146406 18753098 18463168
16653A8463168l84191o33308n71277p01571k63849k29058m52233p61616l4410
$$ 18463168 18078977 17445669 16874392 16172821 15908972 15679914 15227681 14466065 14431655
16644A4431655m78191l08728k82419n13082k90815k26943k62720j54260m05932
$$ 14431655 13953464 13644736 13362317 12849235 12558420 12331477 12068757 11914497 11508565
16635A1508565k33593o9854l54765k48637n00554j81368j55380l04124M06k72868
$$ 11508565 11274972 11205118 10850353 10601716 10101162 9919794 9764414 9460290 9460696 9187828
16625I187828J91414n20600j54529p8304m53619r3122l51m37362J24706k64529
$$ 9187828 9379242 8858642 8704113 8625809 8172190 8079068 8078717 7641355 7766061 7501532
16615G501532q7623l79029N43330n59481r5284k14110P8762n15674J07756L27358
$$ 7501532 7413909 7034880 7578210 7018729 6923445 6709335 6788097 6272423 6380179 6707537
16605F707537m22820M9552l21351j37171Q9480m35411j51373K02809m12252Q3190
$$ 6707537 6284717 6334269 6012918 5875747 5965227 5529816 5378443 5581252 5169000 5252190
16595E252190J66978l76678p8191k17072K02725l79541K27021k60834K7355j71430
$$ 5252190 5419168 5042490 4964299 4747227 4949952 4570411 4797432 4536598 4563953 4392523
16585D392523J90723L2823k99381K36831j66163j62456j52958L0501m97126K76134
$$ 4392523 4583246 4616069 4316688 4553519 4387356 4224900 4071942 4102443 3605317 3881451
16575C881451j32484j78317K55990m26929L85148j22618R9053J28769o57405K5913
$$ 3881451 3748967 3570650 3826640 3399711 3784859 3662241 3761294 3890063 3232658 3258571
16565C258571m829L52964m27779K1706k4230M71K0614l31896j66864M52578j10432
$$ 3258571 3253742 3606706 3178927 3200633 3176403 3176874 3197488 2865592 2698728 3151306 3040874
16554C040874m9007o7501j15059j5138M6723Q9893Q0395k90254Q7469k00571L39707
$$ 3040874 2991867 2924366 2809307 2794169 2840892 2930785 3011180 2720926 2808395 2607824 2947531
16543B947531k72680l12910O4339j14910K23257k14018Q2279j20724J79758o7471
$$ 2947531 2674851 2361941 2426280 2311370 2534627 2320609 2402888 2282164 2461922 2394451
16533B394451p5510j63718m7489j7267j07239M01572j39210L5827j25571k71677
$$ 2394451 2318941 2155223 2107734 2090467 1983228 2384800 2245590 2281417 2155846 1884169
16523A884169J44574k852k44215J99142k80921L53885m13623J49875L77239k32016
$$ 1884169 2028743 2025891 1781676 1980818 1699897 2053782 1640159 1790034 2167273 1935257
16513A935257O5332k11920q2343M4392L17031k16807j68096J67299k65147J03522
$$ 1935257 2000589 1788669 1706326 1750718 2067749 1850942 1682846 1850145 1584998 1688520
16503A688520J20132o4430k37490J19342j45054L38886m19456N45260m99135K27572
$$ 1688520 1808652 1744222 1506732 1626074 1481020 1819906 1400450 1945710 1446575 1674147
16493A674147n5733R9251j06865J52579q6674m72872K91697M638k77391M40794
$$ 1674147 1618414 1717665 1610800 1763379 1676705 1203833 1495530 1500168 1222777 1663571
16483A663571N6795p0286j85419l45831Q7415J17418k3274L1633k07605J68092
$$ 1663571 1720366 1650080 1464661 1118830 1206245 1323663 1300389 1332022 1124417 1292509
16473A292509j42369n120J35507m6475k52183J56692l42153L21843M68913l98814
$$ 1292509 1150140 1145020 1280527 1234052 981869 1138561 796408 1118251 1587164 1188350
16463A188350l61920K47256n5149P5511K34816k37472K9487P8702j18984K04623
$$ 1188350 826430 1073686 1018537 1094048 1328864 1091392 1120879 1199581 1080597 1285220
16453A285220k86830J17401k30165J92440J61056l51593q278K32818j64014l7300
$$ 1285220 998390 1115791 885626 1078066 1239122 887529 879251 1112069 948055 910755
16443I10755J21307Q9734j79946k93725J74841P1692O1062R7194l17374J77919
$$ 910755 1032062 1121796 941850 648125 822966 894658 955720 1052914 735540 913459
16433I13459k13455N46753l45618L4918Q5473l23093K45785P742j11457l13100
$$ 913459 700004 1246757 901139 936057 1021530 698437 944222 951964 840507 527407
16423E27407N28963k57000R6358k0549R8533Q4093k02794j87632K34614r7809
$$ 527407 1056370 799370 895728 875179 973712 1057805 855011 667379 901993 804184
16413H04184j28080J0389L15381j80601l5908o1508L98998n59134M742k8944N8643
$$ 804184 676104 686493 1001874 821273 785365 723857 1122855 563721 568463 539519 598162
16402E98162M9984J72026k89988J29688k40867j065K94259R2556o0324M8878Q408
$$ 598162 648146 820172 530184 659872 419005 417940 712199 804755 744431 793309 801717
16391H01717n5617k65792M03240P6016l50686j17186J87280q2924L14944k85569
$$ 801717 746100 480308 883548 959564 608878 491692 678972 596048 910992 625423
16381F25423B17954L64054j31790Q2602O5171K3204Q4358j37672j03193L5443
$$ 625423 217954 582008 450218 532820 597991 621195 705553 567881 464688 500131
16371E00131J00882P2614k54040J18854A58901L66880j25097J5894K08817j0575
$$ 500131 601013 673627 419587 538441 158901 525781 400684 416578 625395 614820
16361F14820k18218H6198K24038O5736m1602l7633K88360J4251P8347k26955K8276
$$ 614820 396602 86198 310236 375972 334370 296737 585097 599348 677695 450740 479016
16350D79016L24880l28548j7661j69834K22587j0499L53475l05820K3290k25098
$$ 479016 803896 475348 457687 287853 510440 499941 853416 547596 570886 345788
16340C45788J04763k02912P1981J66983j37483K02374k68322K61444B54069M14180
$$ 345788 450551 247639 319620 486603 349120 551494 283172 544616 254069 668249
16330F68249m9089k98274l968J96185l8460l2740N7877j92154J09828J9746j47172
$$ 668249 619160 320886 316918 513103 474643 441903 499780 307626 417454 437200 290028
16319B90028K57959B26257J64763j49450Q1291O4550J70295B09337N4579J24296
$$ 290028 547987 226257 391020 241570 322861 387411 557706 209337 263916 388212
16309C88212j77845K10407j41695L83194j26363k08587q7250K32041J72243j77291
$$ 388212 210367 420774 279079 662273 535910 327323 240073 472114 644357 467066
16299D67066j53294J23029l7501n2374o1206l8737r972K67304m5745j60176j34522
$$ 467066 313772 436801 399300 346926 285720 246983 237011 504315 458570 298394 163872
16288A63872J48370L19943p5493B34859j0573J99511q7126J26471k03921O1288
$$ 163872 312242 632185 556692 234859 224286 423797 336671 463142 259221 320509
16278C20509K59269q5449K85517g2235F8769J29842J63205A67213K56718G4292
$$ 320509 579778 494329 779846 -72235 68769 198611 361816 167213 423931 74292
16267C91501k2134J34265B16810J96218A59415J86068P9475A66758f0627B74216
$$ 391501 369367 503632 216810 413028 159415 345483 424958 166758 -60627 274216
16256F0092J0879K70704p9237n7309a14049C40388j43260J63558K3763Q5540A30400
$$ 60092 70971 341675 262438 205129 -114049 340388 197128 360686 384449 469989 130400
16244D14235R8995k21315M1362A62473J58119I8323K06616j42247M795J5345C9570
$$ 414235 513230 291915 333277 162473 320592 98323 304939 162692 167487 182832 39570
16232C77071a3592C18874c5444G6566h9271A90867J20375J79762f6488D06395
$$ 377071 -13592 318874 -35444 76566 -89271 190867 311242 491004 -66488 406395
16221C07790b8539D50382A51690l5542h6855C42492I4777J23552l8944J9632a2365
$$ 307790 -28539 450382 151690 116148 -86855 342492 94777 218329 179385 199017 -12365
16209B71493G8398P8463N23943a855C05572H4019J94064k9795j22098a39419E2161
$$ 271493 78398 156861 680804 -1855 305572 84019 278083 248288 126190 -139419 52161
16197B21982K4585j7514m606D5389A570J92968J09874K21622B5207J32405J87493
$$ 221982 246567 229053 224447 45389 1570 194538 304412 526034 25207 157612 345105
16186C45105A70413n800a78270G9061C2051a1445r406B83907a84442A73100K45918
$$ 345105 170413 164613 -178270 79061 32051 -11445 -20851 283907 -184442 173100 419018
16175D19018F6688J51573l8001n5401L85044A27355J37133Q8930A67268Q5100
$$ 419018 66688 218261 180260 124859 509903 127355 264488 353418 167268 252368
16165B52368F2363Q2600i658B99475f8272I1948i6239G1785h3063L4318A66267
$$ 252368 62363 144963 -9658 299475 -68272 91948 -96239 71785 -83063 -48745 166267
16153D7221J72731K60895B37717k9017C2396K33149K09400g8587B31643I5607
$$ 47221 219952 480847 237717 208700 32396 265545 474945 -78587 231643 95607
16142A98322E4383h6436q245p360b9974j03615c0329B60958P7701c04947A07402
$$ 198322 54383 -86436 -94681 -102041 -29974 -133589 -30329 260958 338659 -304947 107402
16130b22148C88423a0782A227J43400K04581q3664F2753e0452E418L59359j63192
$$ -222148 388423 -10782 1227 144627 349208 265544 62753 -50452 5418 364777 201585
16119B01585L17272C5713N9428b9178K599k5729C52585d6757C43547A3607J54282
$$ 201585 518857 35713 95141 -29178 -26579 -52308 352585 -46757 343547 13607 167889
16108A67889a70859I1645k9895L9103f9737I6103a01846j35711H0761N8950j7265
$$ 167889 -170859 91645 61750 100853 -69737 96103 -101846 -237557 80761 139711 122446
16097A22446C9530H922M0953K84127p0140a00903C73765A85681J09995b49586
$$ 122446 39530 8922 49875 334002 263862 -100903 373765 185681 295676 -249586
16086E06617e9692A01554J51128I9156b14639i2435J0234o6211A43494Q2411C4997
$$ 506617 -59692 101554 252682 99156 -214639 -92435 -82201 -148412 143494 225905 34997
16074B76704p0366n9280a7653A36138L47063c21468J731h831A03272j7706f0196
$$ 276704 206338 147058 -17653 136138 483201 -321468 -319737 -8831 103272 85566 -60196
16062C42241a57053B0801d8295o9318b0251E416M7855a32194A18207i4963E5592
$$ 342241 -157053 20801 -48295 -117613 -20251 5416 53271 -132194 118207 -94963 55592
16050B06584a9067A49451G2480J41592L0476d0545E8360b12115h2940B13505a45141
$$ 206584 -19067 149451 72480 214072 244548 -40545 58360 -212115 -82940 213505 -145141
16038E8144K29106F8942o247a95653P9713r2022e0569C16252a35073A86335K1520
$$ 58144 287250 68942 62695 -195653 -115940 -207962 -50569 316252 -135073 186335 207855
16027B07855n5175f4948B24111I5760a42987B879f401A19885l8425l9532I342
$$ 207855 152680 -64948 224111 95760 -142987 2879 -6401 119885 81460 41928 9342
16015A09038a82633e7685A05681a42665E3729a05466A19703A6986K30000R4855
$$ 109038 -182633 -57685 105681 -142665 53729 -105466 119703 16986 246986 341841
16005C41841i916A68497c5663j8041D984c24718C0700N8321J50860H2346a69228
$$ 341841 -9916 168497 -35663 -53704 4984 -324718 30700 89021 239881 82346 -169228
15993C9053L21304h7402E8792d0005A2989K50598E9240N17558j57234L25340C04069
$$ 39053 360357 -87402 58792 -40005 12989 263587 59240 576798 419564 744904 304069
15981C56648P9011j26263p7658a50786A08771k265c3702F615K7104O3315A1556
$$ 356648 435659 309396 231738 -150786 108771 106506 -33702 6615 33719 97034 11556
15969A28311r806k8844J79034g7058j19835R0806M1539A56156b21740B21718J09273
$$ 128311 118505 89661 268695 -77058 -196893 -106087 -64548 156156 -221740 221718 330991
15958C30991a81708B01408c27253C16749j44426K43548I4427A7241a01674K4161
$$ 330991 -181708 201408 -327253 316749 172323 415871 94427 17241 -101674 -77513
15948g7513j52395J11286M0155A75426A1187b64969G0078Q4105c264B0155a17942
$$ -77513 -229908 -118622 -78467 175426 11187 -264969 70078 154183 -3264 20155 -117942
15936c79647J78299A64076B4846J34294J41340e3970j5258H0413f3221G7109b55201
$$ -379647 -201348 164076 24846 159140 300480 -53970 -69228 80413 -63221 77109 -255201
15924A48812a65969f6595C8695i8991j50089g2914E7282L07159a6088r7781A05901
$$ 148812 -165969 -66595 38695 -98991 -249080 -72914 57282 364441 -16088 -113869 105901
15912A30592b503k59525e9148H1540a09385k05463B73681A02877k24a80610B93706
$$ 130592 -2503 -262028 -59148 81540 -109385 -314848 273681 102877 102653 -180610 293706
15900G8931l6912a05121d7088A9087b79078B40181g7125B21097d3993n8218j05081
$$ 78931 42019 -105121 -47088 19087 -279078 240181 -77125 221097 -43993 -102211 -207292
15889b07292M981Q6526r3665A82784B8209h0255G1002g8706n6335A66698a62399
$$ -207292 -202311 -115785 -209450 182784 28209 -80255 71002 -78706 -135041 166698 -162399
15877I9400e6980p9287k31149B2105a02303C47729e2356K3604E2014L8684C7332
$$ 99400 -56980 -136267 -367416 22105 -102303 347729 -52356 -28752 52014 90698 37332
15865b47755b6790C7849N817J15794g9209A9760K07817f0229A07170A1804Q7788
$$ -247755 -26790 37849 43666 159460 -79209 19760 227577 -60229 107170 11804 99592
15854I9592a03712B10143m2193b9302B85875a40864A11366G562L06163a09666
$$ 99592 -103712 210143 167950 -29302 285875 -140864 111366 7562 313725 -109666
15843a82776P7840H3675c54422C569b37665A5257B106J36074J71376d02560J22135
$$ -182776 -104936 83675 -354422 3569 -237665 15257 2106 138180 309556 -402560 -280425
15832b80425a13570k18773J28842g4355j29120k0941B4909c5911B39580A7902
$$ -280425 -113570 -332343 -203501 -74355 -203475 -224416 24909 -35911 239580 17902
15821h8043D5124K04746b16543O0267j44632F6547B8325a52295K9318j0256o4698
$$ -88043 45124 249870 -216543 -156276 -300908 66547 28325 -152295 -122977 -133233 -197931
15810a97931p4125A75081a43841I3040l1135L15210D1135J11204f5772K059E977
$$ -197931 -272056 175081 -143841 93040 61905 377115 41135 152339 -65772 -63713 5977
15798A99401H4418a15477J1110j0980L2000K3358o6543A64505o6675J21481D701
$$ 199401 84418 -115477 -104367 -115347 -83347 -59989 -126532 164505 97830 219311 4701
15786A25972l1236g4247m0518A99285d20776a08564c4041A52777d073B21192n1650
$$ 125972 94736 -74247 -114765 199285 -420776 -108564 -34041 152777 -4073 221192 169542
15775A69542B094c16001A68084D3648B0776b37843R9775j03849C77351j7112A71877
$$ 169542 2094 -316001 168084 43648 20776 -237843 -138068 -241917 377351 360239 171877
15763b5645B2995J98622A2661J2511c03134B5278K12904H6656d0114F8137J64711
$$ -25645 22995 221617 12661 25172 -303134 25278 238182 86656 -40114 68137 232848
15752B32848A03184D6137L286N5319K1270a0984n0841G6045P0351o8139N5125
$$ 232848 103184 46137 49423 104742 126012 -10984 -61825 76045 146396 78257 133382
15741A33382F2733Q5628g0587B89493A44510J47827a34895M5633l3039e0369j0107
$$ 133382 62733 148361 -70587 289493 144510 292337 -134895 -89262 -122301 -50369 -60476
15730f0476j0833j52833P7917a8276D7357h033l67316a2123k49908J15223B65800
$$ -60476 -71309 -224142 -146225 -18276 47357 -8033 -375349 -12123 -262031 -146808 265800
15718B9564O4599q658c7638p3185J5722q5592A68313a6640r6969I5742L27786
$$ 29564 94163 85505 -37638 -110823 -95101 -180693 168313 -16640 -113609 95742 423528
15707D23528I821c9487m2478o4911E9879O4406f4856A07735c21592J43785j20268
$$ 423528 9821 -39487 -81965 -146876 59879 124285 -64856 107735 -321592 -177807 -298075
15696b98075a15941K1112A53187e80260B9709J53095a3494A22681a13147A40493
$$ -298075 -115941 -94829 153187 -580260 29709 182804 -13494 122681 -113147 140493
15685A82008E8517b88546m5438K6982b5645J355m27B07272F04a21344p8784A39433
$$ 182008 58517 -288546 -333984 -307002 -25645 -24290 -24717 207272 604 -121344 -200128 139433
15672B82223j26406a17072A61737d8838k7058G2647a50854b893j4670A00521b78186
$$ 282223 155817 -117072 161737 -48838 -75896 72647 -150854 -2893 -17563 100521 -278186
15660b09849P5442B04302c3698C48046c24337k297A7515c2334G1805b08254B4769
$$ -209849 -134407 204302 -33698 348046 -324337 -326634 17515 -32334 71805 -208254 24769
15648F3716b0415F1166a2912j39137A13177a42561G2622b32342a4079A40329b4663
$$ 63716 -20415 61166 -12912 -152049 113177 -142561 72622 -232342 -14079 140329 -24663
15636A08514c4643Q849B829J11633a45009l4987E7630a71591q2270D5639b46218
$$ 108514 -34643 -25794 2829 114462 -145009 -179996 57630 -171591 -253861 45639 -246218
15624b3355E4697K87995C3353K00621a60418F2829d8329A04296K43741b25221
$$ -23355 54697 342692 33353 233974 -160418 62829 -48329 104296 348037 -225221
15613a14244c6199A55910b35831A31283i4450B66348c00380A15422J63896J00489
$$ -114244 -36199 155910 -235831 131283 -94450 266348 -300380 115422 279318 379807
15603C79807j05123E2475h9568j14196Q5729A80874b82480d8828k3691a7288k1754
$$ 379807 274684 52475 -89568 -203764 -118035 180874 -282480 -48828 -72519 -17288 -39042
15592c9042E2590r895H753K46561A1360L53452E5518B4385b70648C759b42583
$$ -39042 52590 42695 8753 255314 11360 364812 55518 24385 -270648 3759 -242583
15580i202D4115R2680L9622d9718A34681g8483A38141a269n0560m5984A77216
$$ -9202 44115 136795 176417 -49718 134681 -78483 138141 -1269 -51829 -97813 177216
15568a74216p0695i444B24723a39493b7956j72083B37692c9595l9828k2696m2900
$$ -174216 -244911 -9444 224723 -139493 -27956 -200039 237692 -39595 -79423 -102119 -145019
15557a45019a4038A45257a19341m39375i8297l6967A108b47358L1465A78145c79744
$$ -145019 -14038 145257 -119341 -558716 -98297 -135264 1108 -247358 -215893 178145 -379744
15545b40453C80026A57546i707q0616A00400a52636e9448b3281l62896A07406
$$ -240453 380026 157546 -9707 -90323 100400 -152636 -59448 -23281 -386177 107406
15534d1105A37453J81636j05305A7229N081a71887B33553c80987h4990j49565
$$ -41105 137453 319089 213784 17229 22310 -171887 233553 -380987 -84990 -234555
15524b34555e5535a5648k64954F3912a42369b049D5057L1108g1194m5884M2009
$$ -234555 -55535 -15648 -280602 63912 -142369 -2049 45057 76165 -71194 -117078 -75069
15513g5069j10374m013d9383j26841L5780O3478B9989a06177D8088K1918L0530
$$ -75069 -185443 -189456 -49383 -176224 -140444 -76966 29989 -106177 48088 70006 100536
15502A00536d576m3986A50717p1100a64395B00703b3118E910K2719c07958a10027
$$ 100536 -4576 -48562 150717 79617 -164395 200703 -23118 5910 28629 -307958 -110027
15490A60091a32842O5131p1521d8332A44747o5693B9233J72375e1040k89507h5924
$$ 160091 -132842 -67711 -139232 -48332 144747 79054 29233 201608 -51040 -340547 -85924
15478b97685b2205b189k38366A92372G5397P2072i4904D6213a06060q5423f8973
$$ -297685 -22205 -2189 -240555 192372 75397 147469 -94904 46213 -106060 -191483 -68973
15466c4986q2310j2222p3425o8234c9213d595D4626J91125b17316G2908J58288
$$ -34986 -117296 -129518 -202943 -271177 -39213 -4595 44626 235751 -217316 72908 231196
15455B31196F3776J05254K58943B3433J56976C5998j2721b1296j6953m2522k6356
$$ 231196 63776 169030 427973 23433 180409 35998 23277 -21296 -38249 -80771 -107127
15444a07127A05011a92080b3409D6787d42766a07451N2452D0143g5684A02665
$$ -107127 105011 -192080 -23409 46787 -442766 -107451 -54999 40143 -75684 102665
15433B41675G8659M2291m7135l048d53273a33624c0128I8111J61531I4923B3219
$$ 241675 78659 120950 73815 70767 -453273 -133624 -30128 98111 259642 94923 23219
15421C61807E6309j8088a94715a9317k12591J3119H5383J5712g5882C16930j19215
$$ 361807 56309 38221 -194715 -19317 -231908 -218789 85383 101095 -75882 316930 197715
15410A97715b6424l9077a006k00976g5773H5678b2752E4751J68353a60580A34755
$$ 197715 -26424 -65501 -1006 -201982 -75773 85678 -22752 54751 223104 -160580 134755
15398F0626k0503f177D9018J27039L9949n7144c7881l26262a37146B39064I3915
$$ 60626 40123 -6177 49018 176057 216006 158862 -37881 -364143 -137146 239064 93915
15386d3348B31907B9989J75979b51278h5171c8881o0346b9688A11711m5676l0735
$$ -43348 231907 29989 205968 -251278 -85171 -38881 -99227 -29688 111711 66035 35300
15375C5300J85897p6606e5491B77866A05418c24700B4786b16206B77187M9602
$$ 35300 221197 144591 -55491 277866 105418 -324700 24786 -216206 277187 326789
15365C26789e5635A77135a27201A39569R9993i265o5658A39711J26268d25784
$$ 326789 -55635 177135 -127201 139569 239562 -9265 -74923 139711 265979 -425784
15354G6531J34584l7360b12027C24627c6297N50G377M2100a29588B60105i1681
$$ 76531 211115 173755 -212027 324627 -36297 -35747 7377 49477 -129588 260105 -91681
15342A8026d4884K0713A67573l4145m1000b46431b3620p9621k40797J20296i0751
$$ 18026 -44884 -24171 167573 133428 92428 -246431 -23620 -103241 -344038 -223742 -90751
15330a54087I4905a89763g515B11348f1872C3480q541A1801Q7035e9764C44042
$$ -154087 94905 -189763 -7515 211348 -61872 33480 24939 11801 98836 -59764 344042
15318a12008f381A39883g4478b5621j90259A15676e5682A41923J09089H2610J12223
$$ -112008 -6381 139883 -74478 -25621 -215880 115676 -55682 141923 251012 82610 194833
15307A94833o6206f3693p7913D3105P7476K05956J16045b84829a415H0066M9783
$$ 194833 128627 -63693 -141606 43105 120581 326537 442582 -284829 -1415 80066 129849
15296A29849d4822A02285k1016M973i4427j6439D61481b3166j37373n0027I5087
$$ 129849 -44822 102285 81269 86242 -94427 -110866 461481 -23166 -160539 -210566 95087
15284b01730B8490a22498a4161A85389c5650G7793a4126E9600J10612i234B21513
$$ -201730 28490 -122498 -14161 185389 -35650 77793 -14126 59600 170212 -9234 221513
15272B45621a54928A3303K48766D4177a54345A09812J81423j04007k0429b5848
$$ 245621 -154928 13303 262069 44177 -154345 109812 291235 187228 166799 -25848
15261I6191J46739b38206b1518A53798a64226L8920B48317j4565L3205J26538
$$ 96191 242930 -238206 -21518 153798 -164226 -125306 248317 233752 266957 393495
15251C93495L66959j7242J5574L33388n04801I5105J68375D4322J77751J93187
$$ 393495 760454 743212 758786 1092174 587373 95105 263480 44322 222073 415260
15241D15260A3416a80642A41234E839d06199h0514A85837a07843C20124E9763
$$ 415260 13416 -180642 141234 5839 -406199 -80514 185837 -107843 320124 59763
15230a65215k0452A64037R0321C0632i5691A50319c28754B18831J47443a11765
$$ -165215 -185667 164037 254358 30632 -95691 150319 -328754 218831 366274 -111765
15219a072k04101c8486A32379I814J03246G364a13006M5282k49048E487J89086
$$ -1072 -205173 -38486 132379 9814 113060 7364 -113006 -67724 -316772 5487 194573
15208A94573p9928J54037a25048B9982J07211l6809a10132H6979K41728a8117
$$ 194573 114645 268682 -125048 29982 137193 100384 -110132 86979 328707 -18117
15197A17025e8316j2278I8419F594J19774l999m9487a17682j86289B14650D2197
$$ 117025 -58316 -70594 98419 6594 126368 122369 72882 -117682 -303971 214650 42197
15185B10347m0528a58282C37916j12757C6794c6891A7331J29040C1172J69604
$$ 210347 169819 -158282 337916 225159 36794 -36891 17331 146371 31172 200776
15175B00776J16291E1801K0803a52250B19857O117C6915a57812I0789i2893B53764
$$ 200776 317067 51801 72604 -152250 219857 225974 36915 -157812 90789 -92893 253764
15163D9957F779K80077J62973A4764a7775A83006a67304C8199K50282b61489A1273
$$ 49957 6779 286856 449829 14764 -17775 183006 -167304 38199 288481 -261489 11273
15151C7352J35016D4910M8845a09063R90C03198E2167J88759b2769l3675i191
$$ 37352 172368 44910 93755 -109063 -108073 303198 52167 240926 -22769 -56444 -9191
15139A5522e8694A51589a37349c4644D17660A14306L27154B14150b8765B39119
$$ 15522 -58694 151589 -137349 -34644 417660 114306 441460 214150 -28765 239119
15128A51637l03F3893e6876i774j27865e836A30034l8829e3297j79442B18684
$$ 151637 151334 63893 -56876 -9774 -137639 -5836 130034 91205 -53297 -232739 218684
15116A14424N6103b05018C50679j58611C0690g2214A70175E094a84176A80008
$$ 114424 170527 -205018 350679 192068 30690 -72214 170175 5094 -184176 180008
15105A14581d719H7831R652R2900L7086A06884J86010h1106c7828B69755k565
$$ 114581 -4719 87831 97483 190383 227469 106884 292894 -81106 -37828 269755 267190
15094B67190J27695j79910b6579C33150b5800A20565A5396N3177J7744J27489
$$ 267190 394885 214975 -26579 333150 -25800 120565 15396 68573 86317 213806
15084B13806N7449j04851k0378f0822B89628j25733c8346a392C53929A65467k9344
$$ 213806 271255 166404 146026 -60822 289628 163895 -38346 -1392 353929 165467 136123
15073A36123K89419c3001m6424C54484I0068K0437J08128L8392D4161h7485A87951
$$ 136123 425542 -33001 -79425 354484 90068 110505 218633 257025 44161 -87485 187951
15061B27214d9486G2587k5918L0641J76103J73656b7729A00354L00880J20264
$$ 227214 -49486 72587 46669 77310 253413 427069 -27729 100354 401234 521498
15051E21498f3866R598B72885M8010J98327j69480a4954C54110p5676K9054k4481
$$ 521498 -63866 -54268 272885 320895 519222 349742 -14954 354110 278434 307488 283007
15040B83007p4783A01483J20696J1400O8145n1889p2454j1812O3093H8734f8628
$$ 283007 208224 101483 222179 233579 301724 249835 177381 165569 228662 88734 -68628
15028A30502K6255L9157f5623C82806A21051K35337B2338J24449m9868c9406B00716
$$ 130502 156757 195914 -65623 382806 121051 356388 22338 146787 96919 -39406 200716
15016A09104K51417P0429K1807A70696k445a55352A16785J4227J53120j05347
$$ 109104 360521 430950 452757 170696 168251 -155352 116785 131012 284132 178785
15006A78785o9099o237K74907A77427D4553Q7333K42688C9546R1048K38347l9298
$$ 178785 109686 103449 378356 177427 44553 131886 374574 39546 130594 368941 329643
14995C29643A25610J54132A38978K50165a5218A96253N0957n1228J26920D0692
$$ 329643 125610 279742 138978 389143 -15218 196253 247210 195982 322902 40692
14984E85754j39270A23272J11288J33659J97636k15866q1069J50093j34171Q2326
$$ 585754 446484 123272 234560 368219 565855 349989 268920 419013 284842 367168
14974C67168p8897r8363a49066A63757j8706K26682q6822n8155J18944J93968
$$ 367168 288271 189908 -149066 163757 145051 371733 284911 226756 345700 539668
14964E39668B57714K12014j4897K32531k70824j97188J50963A39442j0042J09557
$$ 539668 257714 469728 454831 687362 416538 219350 370313 139442 129400 238957
14954B38957L08342j49214j93335J68843K21209A31657m3381K46380O0399A21589
$$ 238957 547299 398085 204750 373593 594802 131657 88276 334656 395055 121589
14943A80146K30581L7553n4971A08026J81842p6856K21981K11687A72934J10679
$$ 180146 410727 448280 393309 108026 289868 213012 434993 646680 172934 283613
14933B83613q8060K39048A74089K07843A50012J95193m6237N1816L4991o7598
$$ 283613 195553 434601 174089 381932 150012 345205 298968 350784 385775 318177
14923C18177a2728I5671M14533B52059L0740j27558L88254Q808A28006P50561
$$ 318177 -12728 95671 510204 252059 282799 155241 543495 552303 128006 878567
14913H78567C91264j81447L1224q8008M60235B05209k6295K48331K089l4847O0841
$$ 878567 391264 209817 241041 153033 613268 205209 178914 427245 429334 394487 455328
14902D55328j89380J1285J44629A10760J86973L2900L60j547n3010K9469M810
$$ 455328 265948 277233 421862 110760 297733 330633 330993 329446 276436 305905 310715
14891C10715A20761J90036J86511k8751j05510l1336J97219q2359m0939j70088
$$ 310715 120761 310797 497308 468557 363047 331711 528930 446571 405632 235544
14881B35544E3514R6297N8245K80471K0343P286B9966M41436j03272K11021j04552
$$ 235544 53514 149811 208056 488527 508870 516156 29966 471402 368130 579151 474599
14870D74599A38436L8233J11912J83719j49785L8518J11226j90992L5447A16374
$$ 474599 138436 176669 288581 472300 322515 361033 472259 281267 316714 116374
14859C84481k7946j78219J18473A36821M87098J78238C08615A44862L28736p7566
$$ 384481 356535 178316 296789 136821 623919 802157 308615 144862 473598 396032
14849C96032A87336K41165J51905B62275J65727B08383L04064j05193D4367L38804
$$ 396032 187336 428501 580406 262275 428002 208383 512447 407254 44367 383171
14839C83171L15923k59069o3783J3248J99472B20643L69958j12859A96896K99635
$$ 383171 699094 440025 376242 389490 588962 220643 590601 477742 196896 496531
14829D96531P8936r5347K97997A97565R4422L7136Q8437J87856A33301M6015L71720
$$ 496531 575467 480120 778117 197565 291987 329123 417560 605416 133301 179316 551036
14818E51036j21370p8234K46500B05140J75346J6280j54845J54185M9878N4494
$$ 551036 429666 351432 597932 205140 380486 396766 241921 396106 445984 500478
14808E00478j9422A32004K54731K17630k78686A31340K05938k1151R238K71937
$$ 500478 481056 132004 386735 604365 325679 131340 337278 316127 325365 597302
14798E97302j39631n0755R2593o4007K8396L981M5071j14596J24510M6798n8385
$$ 597302 457671 406916 499509 435502 463898 467879 512950 398354 522864 569662 511277
14787E11277A74321M13348L22644D25263L9322J45811J35367l06794K86094j90730
$$ 511277 174321 587669 910313 425263 464585 610396 745763 438969 725063 534333
14777E34333P6696j64112L92630B85439J61303L69300l51229J73719o5387m8072
$$ 534333 611029 446917 839547 285439 446742 816042 464813 638532 573145 525073
14767E25073K49339j93775J38773R4350J9827l92069P1059j42704K01665j32268
$$ 525073 774412 580637 719410 813760 833587 441518 512577 369873 571538 439270
14757D39270J4224K51481B67506K64267K13478l38970j50378M45953j18923M8334
$$ 439270 453494 704975 267506 531773 745251 406281 255903 701856 582933 631267
14747F31267N9716C15479K27904K87229C93139L03502k77153J42922K57104J18683
$$ 631267 690983 315479 543383 830612 393139 696641 419488 562410 819514 938197
14737I38197j48810k75699K70502p4959J7263J2113L8393j88552K79937k92806
$$ 938197 789387 513688 784190 709231 726494 738607 777000 588448 868385 575579
14727E75579L85080k25830R9555K08139l61883p7688M14638j96140o7128o8493
$$ 575579 960659 734829 834384 1042523 680640 602952 1017590 821450 754322 685829
14717F85829o4407p2108M13264m02443K5638j92368J39294J8047K79681l23682
$$ 685829 621422 549314 962578 560135 585773 393405 532699 550746 830427 506745
14707E06745J58372L27803l30301K00523m14204M0759K65285l64703M52815k94147
$$ 506745 665117 992920 662619 863142 448938 489697 754982 390279 843094 548947
14697E48947K52021P5485j76162M2541L47225r6321j53003j39216L38287j58103
$$ 548947 800968 876453 700291 742832 1090057 993736 840733 701517 1039804 881701
14687H81701Q6643k49746J49648J8772L8271J58071l07354J89345O1287j03864
$$ 881701 968344 718598 868246 887018 925289 1083360 776006 965351 1026638 922774
14677I22774J16564k24498O0134k45586K25045L53407n32538K06156J19444o3720
$$ 922774 1039338 814840 874974 629388 854433 1207840 675302 881458 1000902 937182
14667I37182Q8626J86627k56554o608L51692j59111j24974o7976R1869j33945
$$ 937182 1025808 1212435 955881 949273 1300965 1141854 1016880 948904 1040773 906828
14657I06828J39218j39679J26231l3134J1934J11879q3986M4161l46967L33210
$$ 906828 1046046 906367 1032598 999464 1011398 1123277 1039291 1083452 736485 1069695
14647A069695r622J19003j83058L03016Q5726k87219k53664J77213R2016L81971
$$ 1069695 1060073 1179076 996018 1299034 1384760 1097541 843877 1021090 1113106 1495077
14637A495077m38463K58888k34560j21028K5352q8389J77404K39606j03327Q8813
$$ 1495077 1056614 1315502 1080942 959914 985266 896877 1074281 1313887 1210560 1299373
14627A299373O1744J61378l02359q0794K04733K52469j12316k18389J13102O1661
$$ 1299373 1361117 1522495 1220136 1139342 1344075 1596544 1484228 1265839 1378941 1440602
14617A440602o6717P9771k2218l23664J97192O4641j76333K48827M5720j91859
$$ 1440602 1373885 1453656 1431438 1107774 1304966 1369607 1193274 1442101 1487821 1295962
14607A295962Q8900q8321J19080M1455P4628n948j23130o4219J63333J65833k27623
$$ 1295962 1384862 1296541 1415621 1457076 1531704 1525756 1402626 1338407 1501740 1667573 1439950
14596A439950k6022J01050L4097R8153j75605L21043n0175j01676j67855K67619
$$ 1439950 1413928 1514978 1549075 1647228 1471623 1792666 1742491 1640815 1472960 1740579
14586A740579K61877j98293o1630J74005l29893L11515l93185K42381p8650L64434
$$ 1740579 2002456 1804163 1742533 1916538 1586645 1898160 1504975 1747356 1668706 2033140
14576B033140j17961R1490k55854J22138L03023M2418j29516n8731P0250m9989
$$ 2033140 1915179 2006669 1750815 1872953 2175976 2218394 2088878 2030147 2100397 2050408
14566B050408J38192k5273j50554j35761K93783J85997K36641j05844M141J76283
$$ 2050408 2188600 2163327 2012773 1877012 2170795 2356792 2593433 2487589 2491730 2668013
14556B668013N05924l06673L95938K24622K21267L82574J216824J360577M178729
$$ 2668013 3173937 2867264 3263202 3487824 3709091 4091665 5308489 6669066 10847795
14547A0847795Q970393J5123582O655211B0293191I207297l961453j999172l85432
$$ 10847795 19818188 34941770 41596981 20293191 9207297 5245844 3246672 2861240
14539B861240r85200j62105J00999M0488k09447L73365K0960j86313J56937J78670
$$ 2861240 1876040 1713935 1814934 1855422 1645975 2019340 2040300 1853987 2010924 2189594
14529B189594j77808O0898l1956p3963K34221n736k70447K81825n6289L65580
$$ 2189594 2011786 2072684 2040728 1966765 2200986 2195250 1924803 2206628 2150339 2515919
14519B515919j54949K01172l46997L54199J1563L5817l94475M29058l76056K83898
$$ 2515919 2360970 2562142 2215145 2569344 2580907 2616724 2222249 2651307 2275251 2559149
14509B559149M18096m90141q9001p1454M73568j30140m241K41061j2401J12269
$$ 2559149 2977245 2487104 2398103 2326649 2800217 2670077 2665836 2906897 2894496 3006765
14499C006765j89245J93865k00930L54658p7385J79282j24202J75258k4775n9384
$$ 3006765 2817520 3011385 2810455 3165113 3087728 3267010 3142808 3318066 3293291 3233907
14489C233907K06728j76335N5317O1672M0508J12951j57627K87337m01810J07469
$$ 3233907 3440635 3264300 3319617 3381289 3421797 3534748 3377121 3664458 3262648 3370117
14479C370117J53080K90820j18703k62607q8512L19691J65179M1596l7102P3468
$$ 3370117 3523197 3814017 3695314 3432707 3344195 3663886 3829065 3870661 3833559 3907027
14469C907027R8869K4714K92090K3097j50131J65921J52177l43456M50190j33574
$$ 3907027 4005896 4030610 4322700 4345797 4195666 4361587 4513764 4170308 4620498 4486924
14459D486924p81J69843k8602j22065O0125k74205K19360K99869L92261k52865
$$ 4486924 4486143 4655986 4627384 4505319 4565444 4291239 4510599 4810468 5202729 4949864
14449D949864L43994k02460J59139j0951K62897l77716K80527J37171k15464M06458
$$ 4949864 5293858 5091398 5250537 5239586 5502483 5124767 5405294 5542465 5327001 5733459
14439E733459K67374r7020l01847N68924J24864m80722L38640j22423K33859J88118
$$ 5733459 6000833 5903813 5601966 6170890 6295754 5815032 6153672 6031249 6265108 6453226
14429F453226K35690K2520l87259K79562K63144K75498k92853K84623n8487M4032
$$ 6453226 6688916 6711436 6324177 6603739 6866883 7142381 6849528 7134151 7075664 7119696
14419G119696K36919L368L92521j93895Q0287K35154L54599Q1516j06158K64035
$$ 7119696 7356615 7359983 7752504 7558609 7638896 7874050 8228649 8310165 8204007 8468042
14409H468042M72301k96963L61739j03615J5906L49606K33705k04668J02321J72582
$$ 8468042 8940343 8643380 9005119 8901504 8917410 9267016 9500721 9296053 9398374 9570956
14399I570956K81024r893K56282N46198m01447M41087L50348K46159k33689J41659
$$ 9570956 9851980 9842087 10098369 10644567 10243120 10684207 11034555 11280714 11047025 11188684
14389A1188684M42310M62104J06120M5591O352L12821K00984L84819K9034L62607
$$ 11188684 11630994 12093098 12199218 12244809 12251161 12563982 12764966 13149785 13178819 13541426
14379A3541426Q87948l10734j94662R35882J7879M76544J78899L47213P3724M86001
$$ 13541426 14429374 14118640 13923978 14859860 14877739 15354283 15533182 15880395 15954119 16440120
14369A6440120L09231M91107K19714L31695K27803L33158J84824Q10377L87152
$$ 16440120 16749351 17240458 17460172 17791867 18019670 18352828 18537652 19348029 19735181
14360A9735181j86R03101M61164J77083O22486J62359N08141Q41830L92733Q81839
$$ 19735181 19734995 20638096 21099260 21276343 21898829 22061188 22569329 23411159 23803892 24685731
14350B4685731J69048R83265O74627O08265M88666R41458N06931M72793J122399
$$ 24685731 24854779 25838044 26512671 27120936 27609602 28551060 29057991 29530784 30653183
14341C0653183O71313O65583J095890J022649Q59480R11053J036021J010690R07760
$$ 30653183 31324496 31990079 33085969 34108618 34968098 35879151 36915172 37925862 38833622
14332C8833622J610267Q45671J531874J466198Q54605J619713J538417J747947
$$ 38833622 40443889 41289560 42821434 44287632 45142237 46761950 48300367 50048314
14324E0048314J428365J948316J499816K536073J638754K139150K078941K407176
$$ 50048314 51476679 53424995 54924811 57460884 59099638 61238788 63317729 65724905
14316F5724905K480184K409364L010964K754407K983071K989613L531335L766656
$$ 65724905 68205089 70614453 73625417 76379824 79362895 82352508 85883843 89650499
14308H9650499L800341L880202M252792M289984M787981N210960N175820N877836
$$ 89650499 93450840 97331042 101583834 105873818 110661799 115872759 121048579 126926415
14300A26926415N920136O146027O940977O956574P462002Q380646Q432003R099255
$$ 126926415 132846551 138992578 145933555 152890129 160352131 168732777 177164780 186264035
14292A86264035R424614J0213033J0700893J1130114J1814909J2107605J2981640
$$ 186264035 195688649 205901682 216602575 227732689 239547598 251655203 264636843
14285B64636843J3381676J3774154J4150858J4413758J4461075J4695836J4423085
$$ 264636843 278018519 291792673 305943531 320357289 334818364 349514200 363937285
14278C63937285J4191130J3507842J2598310J1187253J0076520P831100M145943
$$ 363937285 378128415 391636257 404234567 415421820 425498340 433329440 437475383
14271D37475383L60041M73898q26315l095800m446705m961501n564062o840012
$$ 437475383 437835424 438309322 437483007 434387207 429940502 424979001 419414939 412574927
14263D12574927r320695j1959340j3411407j4015368j5071767j5194028j4406357
$$ 412574927 403254232 391294892 377883485 363868117 348796350 333602322 319195965
14256C19195965j4761886j4589150j4132884j3434994j3038574j2422263j1719331
$$ 319195965 304434079 289844929 275712045 262277051 249238477 236816214 225096883
14249B25096883j1535606j0591764j0267838r365962q825866q261521p929790
$$ 225096883 213561277 202969513 192701675 183335713 174509847 166248326 158318536
14242A58318536p487014o983479o784070o446782n548885n498983n350105n234487
$$ 158318536 150831522 143848043 137063973 130617191 125068306 119569323 114219218 108984731
14234A08984731m436347m245366m226929l403026l774484l944191l250628l109050
$$ 108984731 104548384 100303018 96076089 92673063 88898579 84954388 81703760 78594710
14226G8594710k885271k636478l248209k376917k431128k259445j818278k253968
$$ 78594710 75709439 73072961 69824752 67447835 65016707 62757262 60938984 58685016
14218E8685016j939471k041807j583273k203155j172523j144155j753737j640238
$$ 58685016 56745545 54703738 53120465 50917310 49744787 48600632 46846895 45206657
14210D5206657j384706j357797j080190o50132j471181j398050p90884j384405
$$ 45206657 43821951 42464154 41383964 40733832 39262651 37864601 37073717 35689312
14202C5689312q61158o95530q69375q87855p63874j159072m67516j367542J4522
$$ 35689312 34828154 34132624 33263249 32375394 31611520 30452448 29984932 28617390 28631912
14193B8631912r40586o52689q20606l14415q91192p60857o68829k91529n36685
$$ 28631912 27691326 27038637 26218031 25903616 25012424 24251567 23582738 23291209 22754524
14184B2754524k38596q54308m38851l43393m26209n30815m00014l38105m64906
$$ 22754524 22515928 21661620 21222769 20879376 20453167 19922352 19522338 19184233 18719327
14175A8719327l69377m71155l65722k77116o61285j02671k42971n24247K07754
$$ 18719327 18349950 17878795 17513073 17235957 16574672 16472001 16229030 15704783 15912537
14166A5912537m72075j41744n04047j19706j30659m90203k29396k65390l67858
$$ 15912537 15440462 15298718 14794671 14674965 14544306 14054103 13824707 13559317 13191459
14157A3191459J26173l61093m22884J22369l50597l75202J89962o03092J3135
$$ 13191459 13317632 12956539 12533655 12656024 12305427 11930225 12120187 11517095 11530230
14148A1530230j84797n56048j1852J9520n78875J79409l91504N2000j03102k46684
$$ 11530230 11345433 10789385 10777533 10797053 10218178 10397587 10006083 10058083 9954981 9708297
14138I708297j87075q4741j54506l27691r874J40202o56624K48374q2159j79201
$$ 9708297 9521222 9436481 9281975 8954284 8944410 9084612 8427988 8676362 8594203 8415002
14128H415002m4296m3786m64822M8821q7205r6243j83611o6798P8757m30347r6157
$$ 8415002 8370706 8326920 7862098 7910919 7823714 7727471 7543860 7477062 7555819 7125472 7029315
14117G029315j34517K99395j43194l58500j24920J68983m5610k51178q048K75359
$$ 7029315 6894798 7194193 7050999 6692499 6567579 6736562 6690952 6439774 6431726 6707085
14107F707085o31401M47162n26536q4833Q2425n34061J33486L9415L00090n92058
$$ 6707085 6075684 6522846 5996310 5911477 5993902 5459841 5593327 5632742 5932832 5340774
14097E340774J97107q0743j22446K30724m96948L11837r7075Q1100l19909l00487
$$ 5340774 5537881 5457138 5334692 5565416 5068468 5380305 5283230 5364330 5044421 4743934
14087D743934m0869L41509m8271l82168k5275L7369J20473l17116O5376J77756
$$ 4743934 4703065 5044574 4996303 4614135 4588860 4626229 4746702 4429586 4494962 4672718
14077D672718k84039L08329j91291k38461K391K45793o90214P9430J66001k7154
$$ 4672718 4388679 4697008 4505717 4267256 4269647 4515440 3825226 3904656 4070657 4043503
14067D043503P4233k6655P4681j15935k95439N6446k22768J47973k17953J42233
$$ 4043503 4117736 4091081 4165762 4049827 3754388 3810834 3588066 3736039 3518086 3660319
14057C660319l35528J86979k08632M91821j85976j68290O0507q774l15527K56127
$$ 3660319 3324791 3511770 3303138 3794959 3608983 3440693 3501200 3492426 3176899 3433026
14047C433026j61239J15297j80992J64107J11902j4624L2965n36281L02959k50359
$$ 3433026 3271787 3387084 3206092 3370199 3482101 3467477 3500442 2964161 3267120 3016761
14037C016761k27123K44128L2520N4945l18145j06700L15719J67014l79176j56084
$$ 3016761 2789638 3033766 3066286 3121231 2803086 2696386 3012105 3179119 2799943 2643859
14027B643859J32183k23344l4021K43876K38081k31284J42686l13026L1824k97864
$$ 2643859 2776042 2552698 2518677 2762553 3000634 2769350 2912036 2599010 2630834 2332970
14017B332970K95929l77414K34703l3203q4825J14869n25937K54479j39905K76661
$$ 2332970 2628899 2251485 2486188 2452985 2368160 2483029 1957092 2211571 2071666 2348327
14007B348327j86291l01412K94966R45q9350O8271J02814J05986m02117O5527
$$ 2348327 2162036 1860624 2155590 2156535 2067185 2135456 2238270 2344256 1942139 2007666
13997B007666Q7397l12950J86749K05800k38425r3324L68051J84532K99152K243364
$$ 2007666 2095063 1782113 1968862 2174662 1936237 1842913 2210964 2395496 2694648 4938012
13987D938012O064649J4536577J8706260j6746414j2699995n376815k873204j715803
$$ 4938012 11002661 25539238 44245498 27499084 14799089 9422274 6549070 4833267
13979D833267p01723q61820j45524j03845P7563o96833O27557p73357L68008M0066
$$ 4833267 4131544 3269724 3124200 3020355 3097918 2401085 3028642 2255285 2623293 2663359
13969B663359r4516l67043J82877k44113m2350K82800k51549j13000O6783j40205
$$ 2663359 2568843 2201800 2384677 2140564 2098214 2381014 2129465 2016465 2083248 1943043
13959A943043j02487J95792r6141l3478J81368k11712J5290o3384J22810k97673
$$ 1943043 1840556 2036348 1940207 1906729 2088097 1876385 1891675 1828291 1951101 1653428
13949A653428J34579Q5514l9405j59624N1122J46255k25433L51606k69414J62760
$$ 1653428 1788007 1873521 1834116 1674492 1725614 1871869 1646436 1998042 1728628 1891388
13939A891388j41459j3021L2936J03991m06113O7538k4071L00693n68709K02750
$$ 1891388 1749929 1736908 1769844 1873835 1467722 1535260 1511189 1811882 1243173 1445923
13929A445923j7510N13224l85368J68600l26784N19675l98575j01022L7845J72738
$$ 1445923 1428413 1941637 1556269 1724869 1398085 1917760 1519185 1418163 1456008 1628746
13919A628746j56172Q2841j45790j39378J17452j84519K61796L5754M5299n28011
$$ 1628746 1472574 1555415 1409625 1270247 1387699 1203180 1464976 1500730 1546029 1018018
13909A018018O23211k42062j2970j94078K43433L6174j07223Q1280j28263j39712
$$ 1018018 1641229 1399167 1386197 1192119 1435552 1471726 1364503 1445783 1317520 1177808
13899A177808j38475M63037j41831J778J47291j97298n5391n1622l70811M21526
$$ 1177808 1039333 1502370 1360539 1362317 1509608 1312310 1256919 1205297 834486 1256012
13889A256012l00086O9561L53181p0847l19651K34137K23429o36241L92238k30115
$$ 1256012 955926 1025487 1378668 1307821 988170 1222307 1445736 809495 1201733 971618
13879I71618L19771k45594J91700l05670J92879p7565o702n0414N8427k7071J40791
$$ 971618 1291389 1045795 1237495 931825 1124704 1047139 1040437 990023 1048450 1021379 1162170
13868A162170o2350r2554J2849O984J97913k21980J87382p8550m16550L93383
$$ 1162170 1099820 1007266 1020115 1027099 1225012 1003032 1190414 1111864 695314 1088697
13858A088697j37029J22907M383M185j31750l4995k21454J33827L72003l11177
$$ 1088697 951668 1074575 1078958 1083143 951393 916398 694944 828771 1200774 889597
13848H89597K69200Q4199E20861L03302J63387j54584K79274m35537J31685L90887
$$ 889597 1158797 1242996 520861 824163 987550 832966 1112240 676703 808388 1199275
13838A199275k19021j87428O8596N1758k21689K63201J1429k54450L33006Q7817
$$ 1199275 980254 792826 861422 913180 691491 954692 966121 711671 1044677 1132494
13828A132494k41233j57089L9990J30023j66785L12955j65266j5071K22577k67776
$$ 1132494 891261 734172 774162 904185 737400 1050355 885089 870018 1092595 824819
13818H24819k01809J95069J8674j93902Q757M31062j7823l1696k00781R1635k96816
$$ 824819 623010 818079 836753 642851 651608 1082670 1064847 1033151 832370 924005 627189
13807F27189K0530K4308J7691O6142k6920L77936l06676k56368L31267l01241
$$ 627189 647719 672027 689718 755860 728940 1106876 800200 543832 875099 573858
13797E73858O4622j17899K79734L17054m17834n5329K25235j52413L1163k40588
$$ 573858 638480 520581 800315 1117369 699535 644206 869441 717028 748191 507603
13787E07603N0713K14706k1660M5740j38453K59638j05826r2065j0369j08333
$$ 507603 558316 773022 751362 797102 658649 918287 812461 720396 710027 601694
13777F01694P0303j79510L52611k38629N0781j43500J62235K3955j16769J27129
$$ 601694 671997 492487 845098 606469 657250 513750 675985 699940 583171 710300
13767G10300r7734J21132A66904N61895k06246R0578k5571p3146L89938n8912
$$ 710300 612566 733698 166904 728799 522553 613131 587560 514414 904352 845440
13757H45440o3131j16556m2152K9770k20408L4813N7060L17630C85546k5333L20381
$$ 845440 782309 665753 623601 653371 432963 467776 524836 842466 385546 360213 680594
13746F80594m8230l2586K9076J09015K459C30485N19218l51191K8241O6071q612
$$ 680594 632364 599778 628854 737869 740328 330485 849703 498512 526753 592824 584212
13735E84212k51824m3001K59338P0934k6161j73488M29138C16526R9969J88036
$$ 584212 332388 289387 548725 619659 593498 420010 849148 316526 416495 604531
13725F04531j75791L27860m953j46650K68957l78958K70552k53420L10773j37959
$$ 604531 428740 756600 751647 604997 873954 494996 765548 512128 822901 684942
13715F84942K22723k66341k56502j1207L9852J91564k30897J92096L51081B08922
$$ 684942 907665 641324 384822 373615 413467 605031 374134 566230 917311 208922
13704A71798K56462K352j1972K28005B58451J8376N67795C31897K93410k31743
$$ 171798 428260 430612 418640 646645 258451 276827 844622 331897 625307 393564
13694C93564M0154J64367r2554j8861A94791K47777l0830J64158O3031j76586
$$ 393564 433718 598085 505531 486670 194791 442568 411738 575896 638927 462341
13684D62341p3633j60728K04873n6141n8766N67570B64479M15548k35069J36357
$$ 462341 388708 227980 432853 376712 317946 885516 264479 680027 444958 581315
13674E81315q4423K1388J8325p1879j12693J28550K28429j76679j78481r1559
$$ 581315 496892 518280 536605 464726 352033 480583 709012 532333 353852 262293
13664B62293K31932J19368k71353K0643A58155P5095J48070A06293K24320l2130
$$ 262293 494225 613593 342240 362883 158155 233250 381320 106293 330613 298483
13654B98483Q2019j82281K72030I4768A6400M28872Q0563J7758B02451J5191o8837
$$ 298483 380502 198221 470251 94768 16400 445272 525835 543593 202451 217642 148805
13643A48805J54187l1772j09186J89998A24991J48854j3032A29378L96629j30365
$$ 148805 302992 271220 162034 352032 124991 273845 260813 129378 526007 395642
13633C95642N7454l3338n0101R1449r2394m4537N8235j66902N01719A62354K83026
$$ 395642 453096 419758 369657 461106 368712 324175 382410 215508 717227 162354 445380
13622D45380j64905j9950q0907J52221K3594o2719M0624K0129M7203J73203B48666
$$ 445380 280475 260525 179618 331839 355433 292714 333338 353467 400670 573873 248666
13610B04275L06298j30950F1421M31643j00112R2514m0719N4475e3800D77034
$$ 204275 510573 379623 61421 493064 392952 485466 444747 499222 -53800 477034
13599B27477O719K10151p7544j59823J94650K1526A7994K51547K78747m3572A51633
$$ 227477 234196 444347 366803 206980 401630 423156 17994 269541 548288 504716 151633
13587D95201b379A77678j8278K19861a42233A78062K97147J08563D3633J97961
$$ 495201 -2379 177678 159400 379261 -142233 178062 475209 583772 43633 241594
13577B41594N2158q3660L74542B49545J77763k9788A0241R5250R3072J09320J80948
$$ 241594 293752 210092 584634 249545 427308 397520 10241 105491 198563 307883 488831
13566D88831k23224K5676j28302J19096E7610M70858B40508N6624j9612O3899
$$ 488831 265607 291283 162981 282077 57610 528468 240508 297132 277520 341419
13556C41419m4601A47207N7668K4250J0937K6678J69995A53296D9560J20130N3395
$$ 341419 296818 147207 204875 229125 240062 266740 436735 153296 49560 169690 223085
13545B23085j02631M2025J39605o5366J27257O0558L9808j53200A32663L32692
$$ 223085 120454 162479 302084 236718 363975 424533 464341 311141 132663 465355
13535D65355B10122F5597N5057K15626M81544B14692K7210L65945k05399J11872
$$ 465355 210122 65597 120654 336280 817824 214692 241902 607847 402448 514320
13525E14320H5638J43006o4333J54582k3725J79144A64920J31688q5472F9172
$$ 514320 85638 228644 164311 318893 295168 474312 164920 296608 211136 69172
13514A44599K85275l7087j24131P4444r7077A13023R1252j0689a0945D73528j12860
$$ 144599 429874 392787 268656 343100 246023 113023 204275 193586 -10945 473528 360668
13503C60668A52702J88355J40209A1784J91051J40099r2730k9931P5105H5896
$$ 360668 152702 341057 481266 11784 202835 342934 250204 220273 295378 85896
13492C93786j59297K68852j71781E664N99682j23534j25763n6882j45283G414
$$ 393786 234489 503341 331560 5664 605346 481812 356049 299167 153884 7414
13481E39154B55451j16202d6393B39501J78864J18877j96272A64549g4575C80334
$$ 539154 255451 139249 -46393 239501 418365 537242 340970 164549 -74575 380334
13470B12074l8899K29850b5412A04865o928K54031j40983m9077J49447A8828K52756
$$ 212074 173175 403025 -25412 104865 97937 351968 210985 161908 311355 18828 271584
13459B71584J74182i2261j60934A61769O1946N8351I161J36567J85383C5603K27054
$$ 271584 445766 -92261 -253195 161769 223715 282066 9161 145728 331111 35603 262657
13448B62657K6509M2989H9012J28434J6167A15619c8614B50577J40391G9723J15462
$$ 262657 289166 332155 89012 217446 233613 115619 -38614 250577 390968 79723 195185
13437A95185M9116a73772B89733k3842o0565r4380J70549p217p1153K86644G8875
$$ 195185 244301 -173772 289733 265891 205326 110946 281495 274278 203125 489769 78875
13425C58827c9957D66037b01752D11534A12246j0922K01805E9306R5028P126k9661
$$ 358827 -39957 466037 -201752 411534 112246 101324 303129 59306 154334 161460 131799
13414A31799R0489C7241o228f92B69502R8526A31321B3625J43338l689q0854C5322
$$ 131799 222288 37241 31013 -692 269502 368028 131321 23625 166963 163274 82420 35322
13401G8900P2862R1719R1628i8598D2363J61586C537K98076L6856G5358c8978
$$ 78900 151762 243481 335109 -98598 42363 203949 3537 301613 338469 75358 -38978
13389B5041M39620k24150n2056q8332L26125k05460k8818l2676K16497A85990
$$ 25041 464661 240511 188455 100123 426248 220788 191970 159294 375791 185990
13378A82945m8219M9960J1577K3680R9474a9134A55988K04581j04287q1439R6267
$$ 182945 134726 184686 196263 219943 319417 -19134 155988 360569 256282 174843 271110
13367B71110k9472c2968A45776k5021J37604I6841k1051B6033M55570A8557M7264
$$ 271110 241638 -32968 145776 120755 258359 96841 75790 26033 481603 18557 65821
13356F5821K03016P6053a09960B86463O7673J79909I4045f027C63201j27475G3309
$$ 65821 268837 344890 -109960 286463 354136 534045 94045 -6027 363201 235726 73309
13344B57391b02207B83380H6814d6328A74165J90230e2074A39093J04939p4431
$$ 257391 -202207 283380 86814 -46328 174165 364395 -52074 139093 244032 169601
13334A69601a0389G3839J90851E6114A7395K96909j21629o6794J02036H6813J51470
$$ 169601 -10389 73839 264690 56114 17395 314304 192675 125881 227917 86813 238283
13323B38283q1241F038P1919j8756K58730k5017r4722L45814k22304j24002M3084
$$ 238283 157042 6038 77957 59201 317931 292914 198192 544006 321702 197700 240784
13312B40784G1674J8667J16831J01619Q4620a55066B01687K49253r5387D5100
$$ 240784 71674 90341 207172 308791 393411 -155066 201687 450940 355553 45100
13301A81137n285K71847n9023f5690D443K36404a6825B31369q8071F2738J59052
$$ 181137 175852 447699 388676 -65690 4443 240847 -16825 231369 143298 62738 221790
13290B21790a27602j0935A35290m0197D2918K5775d0239B20125J05452A19006
$$ 221790 -127602 -138537 135290 95093 42918 68693 -40239 220125 325577 119006
13279B15958c05615B93547E173K11651i4068E0613a30560C9196J36993R303E9801
$$ 215958 -305615 293547 5173 216824 -94068 50613 -130560 39196 176189 185492 59801
13267a40124L1977D07829j53783q5853j7630i9006M0687H1307Q6630F9955N90
$$ -140124 -108147 407829 254046 168193 150563 -99006 -58319 81307 167937 69955 70545
13256G0545q559R7146P4956P5045J3788r8781C1142J39421h5727A82514D8108
$$ 70545 61986 159132 234088 309133 322921 224140 31142 170563 -85727 182514 48108
13244D13678D7562J68860h4924A95634M76822A66653a03934I6245M6143m110b10080
$$ 413678 47562 216422 -84924 195634 672456 166653 -103934 96245 142388 138278 -210080
13232i4541A20373j7418o579a92794p151Q6613A68509l5317K46973r7006a40135
$$ -94541 120373 102955 96376 -192794 -199945 -113332 168509 133192 380165 283159 -140135
13220g1422a2448r1745D15959q5036F9921K54747C7947f3333C06138r6835l6587
$$ -71422 -12448 -104193 415959 330923 69921 324668 37947 -63333 306138 209303 172716
13209A72716G5135J3363K10121n530j07769K11365i5256C30289D2023J6225J22018
$$ 172716 75135 88498 298619 293089 185320 396685 -95256 330289 42023 58248 180266
13198A80266n3358d46275b0186A41739J74721A19641D4496K32041B0645a40868
$$ 180266 126908 -446275 -20186 141739 316460 119641 44496 276537 20645 -140868
13187A33420L6724A1236K76140F3361h5027C167J9863E618a21613D65568c79841
$$ 133420 170144 11236 287376 63361 -85027 3167 23030 5618 -121613 465568 -379841
13175c1543a1949B36214C1499a95008A25920d1891A80885Q149O898a38602F5073
$$ -31543 -11949 236214 31499 -195008 125920 -41891 180885 189034 195932 -138602 65073
13163H2755e0768A21768b13558i9159F2648J30664D7244B2701J34472J05636g2472
$$ 82755 -50768 121768 -213558 -99159 62648 193312 47244 22701 157173 262809 -72472
13151a94436Q2304a4182m3624A19196b76786h3372A44715J99634R693i2166A87020
$$ -194436 -112132 -14182 -57806 119196 -276786 -83372 144715 344349 354042 -92166 187020
13139a6737j9321A29666m1761O3598J04142F5706J98607G4070O9668M6390k2251
$$ -16737 -36058 129666 87905 151503 255645 65706 264313 74070 143738 190128 167877
13128A67877E7291J24885a80142e4565B44351H5369K53534j66755B0303a90869
$$ 167877 57291 182176 -180142 -54565 244351 85369 338903 172148 20303 -190869
13117I235K36906I4491b3853j9782B63790E4485d2556l51526i760A86459e0545
$$ 9235 246141 94491 -23853 -43635 263790 54485 -42556 -394082 -9760 186459 -50545
13105A59426a19304B0953a2828l979D5748i3268B34579a75482E2858a59676c9671
$$ 159426 -119304 20953 -12828 -16807 45748 -93268 234579 -175482 52858 -159676 -39671
13093B97408a50257B87709g8033k1635A3993K3994n111J77085a34014A03724K15358
$$ 297408 -150257 287709 -78033 -99668 13993 37987 32876 209961 -134014 103724 319082
13082C19082k5881j7245A5721O0790J04305b36538c6207J6388m06530h848C1519
$$ 319082 293201 275956 15721 76511 180816 -236538 -36207 -19819 -426349 -8848 31519
13070D4167L62356I5795c42615I5983Q3782o033a76436f4076C2117J28868K0802
$$ 44167 406523 95795 -342615 95983 179765 173732 -176436 -64076 32117 160985 181787
13059A81787H5072d8049A27066k153N3404R3341q3572J10212H2036M1093K6000
$$ 181787 85072 -48049 127066 124913 178317 271658 188086 298298 82036 123129 149129
13048A49129N1823J2029o6072R5518J74371B01611b2028A08842a32814C23561
$$ 149129 200952 212981 146909 242427 416798 201611 -22028 108842 -132814 323561
13037a17563C6674L15920A08690E2698k0674n121K55725q6134c4649j63451A86249
$$ -117563 36674 352594 108690 52698 32024 26903 282628 196494 -34649 -198100 186249
13025A20070j7528L01898D0977c2306B9576K06588R8323e6379A8767K8183K8800
$$ 120070 102542 404440 40977 -32306 29576 236164 334487 -56379 18767 46950 75750
13014G5750J81901H6951a72411A18236b61883c2375m7008C54957b8583B56701
$$ 75750 257651 86951 -172411 118236 -261883 -32375 -79383 354957 -28583 256701
13003A68028Q7038j18433d2346m1012B12488r0801b5661C03507A3111b74966l8124
$$ 168028 255066 136633 -42346 -83358 212488 121687 -25661 303507 13111 -274966 -313090
12992c13090e6185C38368a57006B97592a68459R360C30456A15206a3009A68276
$$ -313090 -56185 338368 -157006 297592 -168459 -159099 330456 115206 -13009 168276
12981B17870d34220A95513c15343B75663H4570K7339i6434J0912A63203K03601
$$ 217870 -434220 195513 -315343 275663 84570 111909 -96434 -85522 163203 366804
12971C66804B2990g6182F289a99550B47551a03836B85484H1110a75031F8774J0959
$$ 366804 22990 -76182 6289 -199550 247551 -103836 285484 81110 -175031 68774 79733
12960G9733i8937B39714a35251H2638c4988D7370e1529C45772e9993E9589d266
$$ 79733 -98937 239714 -135251 82638 -34988 47370 -51529 345772 -59993 59589 -4266
12948A61601C8653Q8675J35357a3612A39045B6330c1538E2076O2818M892J60528
$$ 161601 38653 127328 262685 -13612 139045 26330 -31538 52076 114894 119786 280314
12937B80314r0749f1164m0776B28364P4951a12485M5471A54386f0568n4009B32037
$$ 280314 189565 -61164 -101940 228364 303315 -112485 -67014 154386 -60568 -114577 232037
12925B02371a69297G7952J72406A8325a97284D55690a14725G4820J5315i9980
$$ 202371 -169297 77952 250358 18325 -197284 455690 -114725 74820 90135 -99980
12914B7676a30899A66854o9912b32149o961e7221p3981M7341i792A09059N3700
$$ 27676 -130899 166854 96942 -232149 -239110 -57221 -131202 -83861 -9792 109059 162759
12903A62759h3677k98762A39194B5725g8304G1942J52180C40b75161A25435J64768
$$ 162759 -83677 -382439 139194 25725 -78304 71942 224122 340 -275161 125435 290203
12892B90203F0983a7483A69866D6621P2971b13547A7680K8065c00742A01094b6592
$$ 290203 60983 -17483 169866 46621 119592 -213547 17680 45745 -300742 101094 -26592
12880e8458a9382B53554a07254a3596m1353j6277G979c24335b9108A21261a37114
$$ -58458 -19382 253554 -107254 -13596 -54949 -71226 7979 -324335 -29108 121261 -137114
12868A4247f9529A49959M7913b3073H9431l8258N9680L04D3798P0344J44576a46779
$$ 14247 -69529 149959 197872 -23073 89431 51173 110853 111157 43798 114142 258718 -146779
12855f0156A30307K98253j59308p9412a76334d3777O572D6974J3166g1041o3689
$$ -60156 130307 428560 269252 189840 -176334 -43777 -37205 46974 60140 -71041 -134730
12844a34730B64965B6928a19403b6752B81927j21829J18000j31904b10204B08031
$$ -134730 264965 26928 -119403 -26752 281927 160098 278098 146194 -210204 208031
12833d9768k65730e3007A9692b83380A81467c6462R418r4980b4771G821e7877
$$ -49768 -315498 -53007 19692 -283380 181467 -36462 -27044 -122024 -24771 7821 -57877
12821A86920b14527C147J51638a94073H4327M8105D7504A73i6212A45325O9398
$$ 186920 -214527 3147 154785 -194073 84327 132432 47504 173 -96212 145325 214723
12810B14723B6958J78003g6111K1100C40411a58662g1384J074E4398J94056I6727
$$ 214723 26958 204961 -76111 -55011 340411 -158662 -71384 -70310 54398 248454 96727
12798a46195B8957L5408c72951g2443F0476a47233k05117h6307A61842a7426j36830
$$ -146195 28957 64365 -372951 -72443 60476 -147233 -352350 -86307 161842 -17426 -154256
12787a54256B3640b15865A87309b01011A98325J21549f4963k91564M7068a49291
$$ -154256 23640 -215865 187309 -201011 198325 319874 -64963 -356527 -309459 -149291
12776f9757j8540j97458J41304k45166a22513B13296J13235j57751b41183E8347
$$ -69757 -88297 -285755 -144451 -389617 -122513 213296 326531 168780 -241183 58347
12765E2364a1990B09297a6922k5436q8279N2729A11606n3835O8940N8570I1002
$$ 52364 -11990 209297 -16922 -42358 -130637 -77908 111606 57771 126711 185281 91002
12753a44186G6522M3559a38391c5790B87683a53789E3287g3395D5073L977L576
$$ -144186 76522 120081 -138391 -35790 287683 -153789 53287 -73395 45073 49050 52626
12742E2626f644j6148C96870G9572b6694h146A63349a35103J1762A73884b02096
$$ 52626 -6644 -22792 396870 79572 -26694 -8146 163349 -135103 -123341 173884 -202096
12730B09043a43550F2864c68867a50018r057A12490a85790K3143D0527M2495a10665
$$ 209043 -143550 62864 -368867 -150018 -159075 112490 -185790 -162647 40527 83022 -110665
12718h805A30553Q7452b17495B38197c70692a04908c9584E3383R7400g962c645
$$ -8805 130553 218005 -217495 238197 -370692 -104908 -39584 53383 150783 -7962 -3645
12706B94873r5134K07312a41656E02323G3827J4789H601K42156j06774O0148l1663
$$ 294873 199739 407051 -141656 502323 73827 88616 8601 250757 143983 204131 172468
12695A72468b68759a23297l2850c7995B96839a77369A25454Q0344F4078f4530
$$ 172468 -268759 -123297 -156147 -37995 296839 -177369 125454 205798 64078 -64530
12684I5155J52054a57429E5474j9707K52533a94048D3778K95188A9540K15134
$$ 95155 247209 -157429 55474 35767 288300 -194048 43778 338966 19540 234674
12674B34674a7694G4953J755J7374i1079C8471J38036a99581A31983M9319l8075
$$ 234674 -17694 74953 76708 94082 -91079 38471 176507 -199581 131983 181302 143227
12663A43227a14806r5162C98783M286j92020j9539R5424a97066j05863i5647A30882
$$ 143227 -114806 -209968 398783 403069 211049 191510 286934 -197066 -302929 -95647 130882
12651A26996D5284l426K65710A46339c66390A86815J97630F587f5708A76440a93404
$$ 126996 45284 41858 307568 146339 -366390 186815 384445 6587 -65708 176440 -193404
12639H411J94795J40744j16285a3386E641R1179L4304M6560E9640J18157b35703
$$ 8411 203206 343950 227665 -13386 5641 96820 131124 177684 59640 177797 -235703
12627B11049B4290J35985i7973A02078K07805A09156B8594b9957B71566h4007
$$ 211049 24290 160275 -97973 102078 309883 109156 28594 -29957 271566 -84007
12616B59391a51480B11305r2403p363c3160A511b33096B85398E2028f4930B25716
$$ 259391 -151480 211305 118902 111539 -33160 1511 -233096 285398 52028 -64930 225716
12604A46236A5567K38328M1980D0781J62640E1116K43935a40374A05753O851J25431
$$ 146236 15567 253895 295875 40781 203421 51116 295051 -140374 105753 112604 238035
12593B38035a84553e3508C0695G002J2504l506c7079q3900r7506K3477F548a10372
$$ 238035 -184553 -53508 30695 7002 19506 16000 -37079 -120979 -218485 -195008 6548 -110372
12580B40715c27169B30827G2401e1588l27029a35267D1190a5231j64324E9282
$$ 240715 -327169 230827 72401 -51588 -378617 -135267 41190 -15231 -179555 59282
12569A55389J77174H5930L48056A1759M00599a5574A32301M4179a24819j2574
$$ 155389 332563 85930 433986 11759 412358 -15574 132301 176480 -124819 -137393
12559a37393G4610b576n7975j5637j3364J6723j07214E04091D1712L38036D6390
$$ -137393 74610 -2576 -60551 -76188 -89552 -72829 -180043 504091 41712 379748 46390
12547G5365a47408d3377l6353A45482a05691b9740C90241F4406p354K55546G1591
$$ 75365 -147408 -43377 -79730 145482 -105691 -29740 390241 64406 57052 312598 71591
12535b07906j28820a15068J6727A86721K9188a00789m7583k41377a82736D908
$$ -207906 -336726 -115068 -98341 186721 215909 -100789 -148372 -389749 -182736 4908
12524c5805G2693F617J77325a18925K3237C8537a06168F4221Q7246a22217k50107
$$ -35805 72693 6617 183942 -118925 -95688 38537 -106168 64221 151467 -122217 -372324
12513c72324J45303c0913f949G6359K1519o358d701k7371A86552f0413l9531j74610
$$ -372324 -227021 -30913 -6949 76359 97878 91520 -4701 -32072 186552 -60413 -99944 -274554
12501b74554B13492b6672j69377c6587j06056L600L7648o9301g6666H0527b14652
$$ -274554 213492 -26672 -196049 -36587 -142643 -139043 -101395 -170696 -76666 80527 -214652
12489B1987J97597b95j86354l8588r909G6195c1557B12200d03066A81974d0855
$$ 21987 219584 -295 -186649 -225237 -235146 76195 -31557 212200 -403066 181974 -40855
12477D33366c33292A11854n5038P8451P202E5580a23658B62466H4630a88861G9931
$$ 433366 -333292 111854 56816 135267 142469 55580 -123658 262466 84630 -188861 79931
12465c4392A32339K86503a31436J1428E2604N1702e8009H3057g7370A12180b01058
$$ -34392 132339 418842 -131436 -120008 52604 104306 -58009 83057 -77370 112180 -201058
12453B71570g1761j82522C41424g2496j34697E8104c13167B21309B4715J10952
$$ 271570 -71761 -254283 341424 -72496 -207193 58104 -313167 221309 24715 135667
12443A35667f2637C76688C6896g3556j02559B3021h2563j73295N1967g4981C34665
$$ 135667 -62637 376688 36896 -73556 -176115 23021 -82563 -255858 -203891 -74981 334665
12431a11769k05274A07606a47495N8177k90854d3020a7833B39589j12414N1514
$$ -111769 -317043 107606 -147495 -89318 -380172 -43020 -17833 239589 127175 178689
12421A78689j0981k5659b05725D3336g3176r046b1912A25653e7968k08868b7271
$$ 178689 167708 142049 -205725 43336 -73176 -82222 -21912 125653 -57968 -266836 -27271
12409D6735a49041H9409l6043d4511H6751b54B08788E098d72235g0266B4587J68472
$$ 46735 -149041 89409 53366 -44511 86751 -254 208788 5098 -472235 -70266 24587 193059
12397A93059i3192j92387C84256b5211G4399i8291n4626e4869j33193A97373b62517
$$ 193059 -93192 -285579 384256 -25211 74399 -98291 -152917 -54869 -188062 197373 -262517
12385a41016c2259B10206H150Q1424a28638M4613A97220D7326J26308F3941p170
$$ -141016 -32259 210206 8150 89574 -128638 -84025 197220 47326 173634 63941 56771
12374E6771K34390j21261p7726a32333c1807A7068J81813c9595k8325m2505A81272
$$ 56771 291161 169900 92174 -132333 -31807 17068 198881 -39595 -67920 -110425 181272
12362B17975A1260M7455h0333b5192A81081P4037M4114a4141l34558A4353f9736
$$ 217975 11260 58715 -80333 -25192 181081 255118 299232 -14141 -348699 14353 -69736
12350A40606f7052D04466a65993q2072J10333c3750j3642j69901d5192k09223
$$ 140606 -67052 404466 -165993 -248065 -137732 -33750 -47392 -217293 -45192 -254415
12340b54415A54157J73059A43489g3124A91387C0735a61603A5966a22178j54012
$$ -254415 154157 327216 143489 -73124 191387 30735 -161603 15966 -122178 -276190
12330b76190B9486f5897A9392e6295q2273j39670d7953j95356L8961Q4159R784
$$ -276190 29486 -65897 19392 -56295 -138568 -278238 -47953 -243309 -204348 -120189 -110405
12319a10405K2197L2846j7778a6285h112j1360n4804p5485n3501E4412c48675
$$ -110405 -88208 -55362 -73140 -16285 -8112 -19472 -74276 -149761 -203262 54412 -348675
12307a34761C1729K15624b2669l7503C8702N4943g6183B49421b32940e5484k2477
$$ -134761 31729 247353 -22669 -60172 38702 93645 -76183 249421 -232940 -55484 -77961
12296g7961j77183C2953K5296R9394m9345h9200c9082A56138A406a52399F7569
$$ -77961 -255144 32953 58249 157643 108298 -89200 -39082 156138 1406 -152399 67569
12284c4430F4769F380L56865n6339A2201g9766D2930i364B48714g7833r0667e7617
$$ -34430 64769 6380 363245 306906 12201 -79766 42930 -9364 248714 -77833 -168500 -57617
12271A40544K46c5975E2370J6744c18476D150f9194A32820o1463a95630p522c1203
$$ 140544 140790 -35975 52370 69114 -318476 4150 -69194 132820 71357 -195630 -203152 -31203
12258a63648M5644D9988a64878d8957H1795K56876g6214E3691c0620n4273D18437
$$ -163648 -118004 49988 -164878 -48957 81795 338671 -76214 53691 -30620 -84893 418437
12246E3518c24765E7858N565i6838j5939B8464L7978g0080B65982g6715B12435
$$ 53518 -324765 57858 63423 -96838 -112777 28464 66442 -70080 265982 -76715 212435
12234A31900C6686K87817i8819J4800B8008h4262B73207o6689L1611R5956j03891
$$ 131900 36686 324503 -98819 -84019 28008 -84262 273207 206518 238129 334085 230194
12223B30194K87854B57068j4456J87674E2812M79241c8004A44322M21499B08368
$$ 230194 518048 257068 242612 430286 52812 532053 -38004 144322 565821 208368
12212C55971H9719a07158A45705M3878H2264a11606B8983i241c17C76928b16267
$$ 355971 89719 -107158 145705 189583 82264 -111606 28983 -9241 -317 376928 -216267
12200E0542Q2377K11937G1016J33891J20852e8721J9602I2134d4417B53885A00845
$$ 50542 132919 344856 71016 204907 325759 -58721 -39119 92134 -44417 253885 100845
12188G7364a02524d3770G7177K50467q2144m7544B7874J9433A8337L13676A54817
$$ 77364 -102524 -43770 77177 327644 245500 197956 27874 47307 18337 332013 154817
12176b16958C76007a25323B10664n8072k3330M9691e636m9386C71563l5159A52917
$$ -216958 376007 -125323 210664 152592 129262 178953 -5636 -55022 371563 336404 152917
12164C17709A54289n4163J05510C2779A5354b29840D3899K0301a18928H6596J26863
$$ 317709 154289 100126 205636 32779 15354 -229840 43899 64200 -118928 86596 213459
12153B13459L0648p3213L5743C8853J03567a89982C98690a09336M8299a7002A43208
$$ 213459 244107 170894 206637 38853 142420 -189982 398690 -109336 -61037 -17002 143208
12141B94354A31142K29045I9048e964j06317F4321N9454n8731a5857m4904J7037
$$ 294354 131142 360187 99048 -5964 -112281 64321 123775 65044 -15857 -60761 -43724
12130d3724A99330a324B08191b89760B32268r8843a25643e9830C40843g4889k62359
$$ -43724 199330 -1324 208191 -289760 232268 133425 -125643 -59830 340843 -74889 -337248
12119c37248B19314O0801a46403B20208A6778N355N2505a64573b9754j81541Q1334
$$ -337248 219314 280115 -146403 220208 16778 22133 74638 -164573 -29754 -211295 -129961
12108a29961K7246A59321d6591A37979n2804b96081A72345b6755G4990R7204K6437
$$ -129961 -102715 159321 -46591 137979 85175 -296081 172345 -26755 74990 172194 198631
12097A98631a63092G7453e0858A81354j4053c96343B3326K55611A25530P0116
$$ 198631 -163092 77453 -50858 181354 167301 -396343 23326 278937 125530 195646
12087A95646a8612I9427C5324N2676l0343a96761d5125B08516N71126F2249b33514
$$ 195646 -18612 99427 35324 88000 57657 -196761 -45125 208516 779642 62249 -233514
12075a28315G1808b29958A24377b0923A64445b10192p9003A0998L150b03242f2269
$$ -128315 71808 -229958 124377 -20923 164445 -210192 -289195 10998 14148 -203242 -62269
12063A87869b22582o0509e9579k59046G6951b2379B0770g952A72149b35217A5314
$$ 187869 -222582 -283091 -59579 -318625 76951 -22379 20770 -7952 172149 -235217 15314
12051a22389a3766O285H4011c15809e1114J9848a2846A52935a0740r5776E021
$$ -122389 -13766 -7481 84011 -315809 -51114 -31266 -12846 152935 -10740 -106516 5021
12039b7569D3974J75264a33370C7344d528q9666A63729O148b08645A465N3428
$$ -27569 43974 219238 -133370 37344 -4528 -94194 163729 169877 -208645 1465 54893
12028E4893c7882p9036i844F2336M7543a36833A8160N5935J07718M6491E0328
$$ 54893 -37882 -116918 -9844 62336 109879 -136833 18160 74095 181813 228304 50328
12016a25639J3615M2618A21246K5259a95096i3857D8675K47306b4225A87213K1538
$$ -125639 -112024 -69406 121246 146505 -195096 -93857 48675 295981 -24225 187213 208751
12005B08751b36134h5401j56575I0210J00553e3926j40984h5938M1667C7805L24331
$$ 208751 -236134 -85401 -241976 90210 190763 -53926 -194910 -85938 -44271 37805 362136
11994C62136I2991a12393j40815C25657E5649b43356a676A16580a32810j21958
$$ 362136 92991 -112393 -253208 325657 55649 -243356 -1676 116580 -132810 -254768
11984b54768B6420f9921E8265b86823f1553A36150f0531n5706C0799b7622C42437
$$ -254768 26420 -69921 58265 -286823 -61553 136150 -60531 -116237 30799 -27622 342437
11972b17295C6593b8429G0458a68589b9663B6604K13073B4181d0880B48572o0990
$$ -217295 36593 -28429 70458 -168589 -29663 26604 239677 24181 -40880 248572 187582
11961A87582a10785A59388a33590r31A2279J25256i2913j40981N0045b7574m09191
$$ 187582 -110785 159388 -133590 -134521 12279 137535 -92913 -233894 -183849 -27574 -436765
11950d36765J93965J3938N7471a877B27171e6949B05258M8966a47826e9445o6190
$$ -436765 -242800 -228862 -171391 -1877 227171 -56949 205258 254224 -147826 -59445 -125635
11939a25635A85827q3128d0273n0660E9787A5148J34653j7189n760d5508B06716
$$ -125635 185827 102699 -40273 -90933 59787 15148 149801 132612 126852 -45508 206716
11927b1218I0218j0383c74353P2016C9347b19345j0647A01804b73596J10593C9403
$$ -21218 90218 79835 -374353 -302337 39347 -219345 -229992 101804 -273596 -163003 39403
11915A20996l7913f4819C17382c02828A11289a65180h1716H017a68597m0770C5024
$$ 120996 83083 -64819 317382 -302828 111289 -165180 -81716 8017 -168597 -209367 35024
11903c50371F3584M29503c9202A3079O9894c5100k28807a22425q3875A54577m3749
$$ -350371 63584 493087 -39202 13079 82973 -35100 -263907 -122425 -206300 154577 110828
11892A10828a85390K024A56499a81603g8326a272r9369A18736b16910R9030n4004
$$ 110828 -185390 -183366 156499 -181603 -78326 -1272 -100641 118736 -216910 -117880 -171884
11881a71884p2951J11404a7533G4366J7830a57537P6816b6556A85087b08394A85922
$$ -171884 -244835 -133431 -17533 74366 92196 -157537 -80721 -26556 185087 -208394 185922
11869c02856R9629E9795d0883A82928H8067J3918k1613K5178d22451J38280c0707
$$ -302856 -203227 59795 -40883 182928 88067 101985 80372 105550 -422451 -284171 -30707
11857a74116E8439B285g2309p3566b9224H2571a10493B24976E563d3221A12794
$$ -174116 58439 2285 -72309 -145875 -29224 82571 -110493 224976 5563 -43221 112794
11845I8675a90141B45413a28572N4515E9503a73891C3040K45525I343h8759q0777
$$ 98675 -190141 245413 -128572 -74057 59503 -173891 33040 278565 9343 -88759 -169536
11834a69536e0534i398r6989a2530j0825B28266B2254c19031a12947N0823A4311
$$ -169536 -50534 -9398 -106387 -12530 -23355 228266 22254 -319031 -112947 -62124 14311
11822C9874e877q2484e472j9768m9943H6141C8158L44524b40637b636k12023E4234
$$ 39874 -5877 -88361 -5472 -25240 -75183 86141 38158 382682 -240637 -2636 -214659 54234
11809B570J9d14882A80436g1241B14773j7723H6018g1231r3092N3744a0330p2336
$$ 2570 2589 -414882 180436 -71241 214773 197050 86018 -71231 -164323 -110579 -10330 -82666
11797h2666C3824A071a29353K820J8086B33046l0034b21428e1575B29538D7157
$$ -82666 33824 1071 -129353 -126533 -108447 233046 203012 -221428 -51575 229538 47157
11785G6140b35962f3875O848A68487a7747o0793C13546A6847h9203A53769n7499
$$ 76140 -235962 -63875 -57027 168487 -17747 -78540 313546 16847 -89203 153769 96270
11774I6270i3650G8418d5174k51814A79409e41589B85394C0290M9571Q8537F8023
$$ 96270 -93650 78418 -45174 -296988 179409 -541589 285394 30290 79861 168398 68023
11762b99798G7273b54153h5624A2023J80697b22919B9502J70666d4436C1276R2962
$$ -299798 77273 -254153 -85624 12023 192720 -222919 29502 200168 -44436 31276 124238
11751A24238P1545J24894a67100E3137a47443B14973a13290k39397D2795c00788
$$ 124238 195783 320677 -167100 53137 -147443 214973 -113290 -352687 42795 -300788
11740D7479J24543f9939K0251C15174a72176m7789l7895A66548K29725d61390
$$ 47479 172022 -69939 -49688 315174 -172176 -219965 -257860 166548 396273 -461390
11729D21911D322a22254c689F7192a5848l38989J5730A43936o111A5815J02066
$$ 421911 4322 -122254 -3689 67192 -15848 -354837 -339107 143936 137825 15815 117881
11718A17881b9205A43459p1399L03168A38388b37653Q4085F1126k283f2055C23723
$$ 117881 -29205 143459 72060 375228 138388 -237653 -153568 61126 58843 -62055 323723
11706A39770i8938A01382C6346d3125J9536A69108J28221A04668d2634m0034q9819
$$ 139770 -98938 101382 36346 -43125 -23589 169108 297329 104668 -42634 -82668 -172487
11695a72487e3127D49027a43186K8729j67279h9231A67733M4597h890j1245A48941
$$ -172487 -53127 449027 -143186 -114457 -281736 -89231 167733 212330 -8890 -20135 148941
11683b79488m3247i9610j954B80449B9140a0428d412l30045B9633b35686A03787
$$ -279488 -322735 -99610 -101564 280449 29140 -10428 -4412 -334457 29633 -235686 103787
11671b62932A8553a07844F143a98214g8165C70423A63985J56561A04476a26861
$$ -262932 18553 -107844 6143 -198214 -78165 370423 163985 320546 104476 -126861
11660A20248B9584J0105P8744E1896N5974J4781b9115n7728A18511a09181A92481
$$ 120248 29584 39689 118433 51896 107870 122651 -29115 -86843 118511 -109181 192481
11648b21584B73032Q9399G9028O807g5636b7068o2985A0835K71483c72265h963
$$ -221584 273032 362431 79028 85835 -75636 -27068 -90053 10835 282318 -372265 -8963
11636B61633f9254A56919J13915F200J8789a78927l2661I0209K13395j47607a80917
$$ 261633 -69254 156919 270834 6200 24989 -178927 -211588 90209 303604 155997 -180917
11624B022K20935A9653g9968n552E2034B5793J03078N9657G7483a55714L5219
$$ 2022 222957 19653 -79968 -85520 52034 25793 128871 188528 77483 -155714 -120495
11613a20495H7406D2690g1167a0459l9394l26706a3963F1808g6195j25775B2994
$$ -120495 87406 42690 -71167 -10459 -49853 -376559 -13963 61808 -76195 -201970 22994
11601d52800a2287H8964i1502k29372B36720m4844j5846a03325G0893d7580B68693
$$ -452800 -12287 88964 -91502 -320874 236720 191876 176030 -103325 70893 -47580 268693
11589b63582F5395e7876A78319L528k767e2915m9870I6260n640d7099B08297E0903
$$ -263582 65395 -57876 178319 181847 179080 -52915 -102785 96260 90620 -47099 208297 50903
11576a8744k57255F9425L21791j01884F7500O6387n5550J33151K02700f6242J8101
$$ -18744 -275999 69425 391216 289332 67500 133887 78337 211488 414188 -66242 -48141
11565d8141J5665C5018K0755b30477D597L116J5978J85086r6260d4629C2984a46390
$$ -48141 -32476 35018 55773 -230477 4597 7713 23691 208777 112517 -44629 32984 -146390
11552a36111J6425C50377a99405n39i1954H5845K42848C8108a32170D3323N4997
$$ -136111 -119686 350377 -199405 -199944 -91954 85845 328693 38108 -132170 43323 98320
11541I8320a10616B3774a77462c2938k27347B55210a67752G3150K7104a03156
$$ 98320 -110616 23774 -177462 -32938 -260285 255210 -167752 73150 100254 -103156
11530b4968I4590R8486p8455g3744k6345B91095j1631a16236A21284L13373A22966
$$ -24968 94590 193076 114621 -73744 -100089 291095 279464 -116236 121284 434657 122966
11518D92508A77270R4588J85857h4665B90743J10829g4556B54946e067A42500
$$ 492508 177270 271858 457715 -84665 290743 401572 -74556 254946 -5067 142500
11507A22482e2574A76028b9762C10677b91728i187A15186C9753J39138q5173c13481
$$ 122482 -52574 176028 -29762 310677 -291728 -9187 115186 39753 178891 93718 -313481
11495D8562a40848b7720j3892A56141a87796B2899O0662K22112G2106O6721o264
$$ 48562 -140848 -27720 -41612 156141 -187796 22899 83561 305673 72106 138827 132563
11484A32563a73955A6883f5320A49562K3798Q7265A5486M5968M2145L00823a68977
$$ 132563 -173955 16883 -65320 149562 173360 260625 15486 61454 103599 404422 -168977
11472B10128g3361H322a08687A38559i276B17733P7756A17087b62683A41155L26736
$$ 210128 -73361 8322 -108687 138559 -9276 217733 295489 117087 -262683 141155 467891
11461D67891B20844A04778A8993Q6253l1749a64288f7867j789A47981P2333B5270
$$ 467891 220844 104778 18993 105246 73497 -164288 -67867 -69656 147981 220314 25270
11449e4111A64709j7011J97701D5695b38724G8018b1471B79130B9770J68899A4868
$$ -54111 164709 147698 345399 45695 -238724 78018 -21471 279130 29770 198669 14868
11437b34810f7915j24874R4176b7285C9200H163P7412a1778B99397B7561a02373
$$ -234810 -67915 -192789 -98613 -27285 39200 8163 85575 -11778 299397 27561 -102373
11425C09332I4106F884J02778B2194a85044I3490C5328a94357h9505l42226e3450
$$ 309332 94106 6884 109662 22194 -185044 93490 35328 -194357 -89505 -431731 -53450
11413a75750A12307K34462F4047P5536J13184E9685J2543m336k7107L83848a36068
$$ -175750 112307 346769 64047 139583 252767 59685 72228 67892 40785 424633 -136068
11401f8782E952c7010n3887Q720f075A06631N7020a88955g6942B6519N2432a19150
$$ -68782 5952 -37010 -90897 -82177 -6075 106631 163651 -188955 -76942 26519 78951 -119150
11388C02997i536n7669P455n8737a8769I1691B5670K52128q1829r3365j465J01823
$$ 302997 -9536 -67205 -59750 -118487 -18769 91691 25670 277798 195969 102604 101139 202962
11376B02962J77033A33294k0480J36133h117n3752l8703A98023b398k67836f5258
$$ 202962 379995 133294 112814 248947 -8117 -61869 -100572 198023 -2398 -270234 -65258
11364a06347j69052C37779h6770b9676j4306j62659a0655A35184C2424c4494I4770
$$ -106347 -275399 337779 -86770 -29676 -43982 -206641 -10655 135184 32424 -34494 94770
11352b77261A97833b52829A00986A386K32436d2509E8835b4263D725b3148A48499
$$ -277261 197833 -252829 100986 1386 233822 -42509 58835 -24263 4725 -23148 148499
11340b25228A71313g7146k61700h1908B33645b9003j29359D332J07549e1231j79570
$$ -225228 171313 -77146 -338846 -81908 233645 -29003 -158362 4332 111881 -51231 -230801
11329b30801d2963j39164i0066A33031a18687J9926b703j48055M7992c501k17000
$$ -230801 -42963 -182127 -90066 133031 -118687 -98761 -2703 -150758 -102766 -3501 -220501
11318b20501b441F727L0518g1784H2640O0200a42876e627D7797a79853g1964L685
$$ -220501 -2441 6727 37245 -71784 82640 142840 -142876 -5627 47797 -179853 -71964 -68279
11306f8279I5953R4344B8669a17878B12804d2511n5884K1445k0311j74817n220
$$ -68279 95953 190297 28669 -117878 212804 -42511 -98395 -76950 -97261 -272078 -277298
11295b77298d4595A1939h6817k28591J32179a5780k17666B65451p9674i3853j14667
$$ -277298 -44595 11939 -86817 -315408 -183229 -15780 -233446 265451 185777 -93853 -208520
11284b08520o9912A74021n4846k5784J92558f9556J1063A3229a85969j96919R950
$$ -208520 -278432 174021 119175 93391 285949 -69556 -58493 13229 -185969 -382888 -372938
11273c72938D86515a39503A91021d3408q1234j72318O1104J01318r1884i2594
$$ -372938 486515 -139503 191021 -43408 -124642 -296960 -235856 -134538 -226422 -92594
11262a71190O3546a0793B08685b00380P4830J2328A17087Q123a17123H661Q8060
$$ -171190 -107644 -10793 208685 -200380 -125550 -113222 117087 125210 -117123 8661 96721
11251I6721I179g8602m8790j27754I6912a73643B56179D7819c3274A1117f7025
$$ 96721 9179 -78602 -127392 -255146 96912 -173643 256179 47819 -33274 11117 -67025
11239I4610k4020J29878A5165a0794f01j16610r6109A15893a20827F6194L1417
$$ 94610 70590 200468 15165 -10794 -601 -117211 -213320 115893 -120827 66194 97611
11228I7611b7520q6564j10794A76997m7789a93299R4569H5825q024m641J18857
$$ 97611 -27520 -114084 -224878 176997 129208 -193299 -98730 85825 77801 73160 192017
11217A92017a17315B63772c6516E9708M5086a77980A20119c63589a14617g341
$$ 192017 -117315 263772 -36516 59708 104794 -177980 120119 -363589 -114617 -7341
11206G5497Q6746C149c37388e9306B09801b25383a7396n6514k76600P1362n767
$$ 75497 162243 3149 -337388 -59306 209801 -225383 -17396 -73910 -350510 -279148 -284915
11195b84915H8386J3561e3297A74139A2265K83017a16864o8760P4283m1179F8451
$$ -284915 88386 101947 -53297 174139 12265 295282 -116864 -185624 -111341 -152520 68451
11183E6821O3198a91597g4895J9878A62781m7379c2905j11123A81317a9117A64551
$$ 56821 120019 -191597 -74895 -55017 162781 115402 -32905 -144028 181317 -19117 164551
11171a95449c8409j14424l23329g843B2468a49933A40431m0137c7044a481E8434
$$ -195449 -38409 -152833 -476162 -7843 22468 -149933 140431 100294 -37044 -1481 58434
11159A37002G863M7714b51519c5118C88958a29606m9129k8327B74177j09012c51072
$$ 137002 7863 55577 -251519 -35118 388958 -129606 -178735 -207062 274177 165165 -351072
11147b3956I2046b77855J26765m201j31927B879b17878A965a57860f1004A78609
$$ -23956 92046 -277855 -151090 -155291 -287218 2879 -217878 1965 -157860 -61004 178609
11135g1643j18720A36874a40832k09632B53889a61745A52032E9162a76671A67567
$$ -71643 -190363 136874 -140832 -350464 253889 -161745 152032 59162 -176671 167567
11124H5735l3695C276J97801r8522a54325A32790M0469E9739i6737H138K19879
$$ 85735 52040 3276 201077 102555 -154325 132790 173259 59739 -96737 8138 228017
11113B28017g3385B377J46296K58279b8945j6543D63454j36732k0342j45896a13175
$$ 228017 -73385 2377 148673 406952 -28945 -45488 463454 326722 306380 160484 -113175
11101D6917a72575A55871E608b1872o9998C73296A31295O2033F5894a50625A29620
$$ 46917 -172575 155871 5608 -21872 -91870 373296 131295 193328 65894 -150625 129620
11089F9990Q4119c4815B91611b5026D2996A8282K01485J2599K0755E037J14500
$$ 69990 154109 -34815 291611 -25026 42996 18282 219767 232366 253121 5037 119537
11078A19537K47075A35286a03697K8492p8729B33907J90371D5499G822c4441F1080
$$ 119537 366612 135286 -103697 -75205 -153934 233907 424278 45499 7822 -34441 61080
11066A02845L04671j21294K06529j79343n6433R1388J39780L5764j68711L71592
$$ 102845 407516 286222 492751 313408 256975 348363 488143 523907 355196 726788
11056G26788p6575l2571B39910K60627L8601j35497K7479J06112O6471K13857
$$ 726788 650213 617642 239910 500537 539138 403641 431120 537232 603703 817560
11046H17560l98842L8080J91833k19687p6097J00386J45603m6677o1636m1804
$$ 817560 418718 456798 648631 428944 352847 453233 598836 552159 490523 448719
11036D48719J92184k25328J08484j1349B18292J92922P8532n2508J40693J03959
$$ 448719 640903 415575 524059 512710 218292 411214 489746 437238 577931 681890
11026F81890k80093M23314C79484j3235J99789n2876K67906j08016k30731A94616
$$ 681890 401797 825111 379484 366249 566038 513162 781068 673052 442321 194616
11015A32818P5866J30770K06803j70402M3665j80662L12286B36020J28626A64791
$$ 132818 208684 339454 546257 375855 419520 238858 551144 236020 364646 164791
11004D60497R9404k33966L98596k42669J24189j07478A88145N6004j17484J99249
$$ 460497 559901 325935 724531 481862 606051 498573 188145 244149 126665 325914
10994C25914q6456L51968n031L752Q9102J00498l22858J3432J48429k14568R9277
$$ 325914 239458 591426 586395 590147 679249 779747 456889 470321 618750 404182 503459
10983E03459L9235J79877J9746q9097J64050p0770k4191N71475j05058J38370
$$ 503459 542694 722571 742317 653220 817270 746500 722309 1293784 1188726 1327096
10973A327096J79466K38699O8855L42160l81537Q1499j05190M2716k51681j53924
$$ 1327096 1506562 1745261 1814116 2156276 1774739 1856238 1751048 1793764 1542083 1388159
10963A388159j15544j98976K43206k69356Q2774J09534R431K12085j41763J0093
$$ 1388159 1272615 1073639 1316845 1047489 1130263 1239797 1249228 1461313 1319550 1329643
10953A329643J10978l53937k03409O7545J8332k96774j00946k35039J49618j26622
$$ 1329643 1440621 1086684 883275 950820 969152 672378 571432 336393 486011 359389
10943C59389j14607R9104G3810M24052k37845J01321a002A49824e7722r3373B67749
$$ 359389 244782 343886 73810 497862 260017 361338 -1002 149824 -57722 -151095 267749
10931D17753A63874a14657A7235K01290H6883b1142A61073d8826C27013i4628
$$ 417753 163874 -114657 17235 218525 86883 -21142 161073 -48826 327013 -94628
10920F5802a39734C9941h9672p3849k118D7843a4301B11670a67327A60410b6556
$$ 65802 -139734 39941 -89672 -163521 -165639 47843 -14301 211670 -167327 160410 -26556
10908b56017e4845f443E4616M1082a66989P9773F676a187j02699n3113N6137M5694
$$ -256017 -54845 -6443 54616 95698 -166989 -87216 6676 -1187 -103886 -156999 -100862 -55168
10896e5168F3540f852B10713b64978B58741c39506a58484G6933d1998E6799L23761
$$ -55168 63540 -6852 210713 -264978 258741 -339506 -158484 76933 -41998 56799 380560
10885C80560B7948b31622D8419b8117j2528A27680i6762J9251B18503b541j15848
$$ 380560 27948 -231622 48419 -28117 -40645 127680 -96762 -77511 218503 -2541 -118389
10874a18389o3125B17144c3830A08169J35995b09822E9969a04826j4059a2623
$$ -118389 -181514 217144 -33830 108169 244164 -209822 59969 -104826 -118885 -12623
10863C60141a13434j7994K298g586o2556N589C0413J38359h7972F2186J3264Q6678
$$ 360141 -113434 -131428 -129130 -7586 -70142 -64553 30413 168772 -87972 62186 75450 162128
10851A62128f2397D54136B2474a27485O2530j13355r0407B13937k1662f2351j88
$$ 162128 -62397 454136 22474 -127485 -64955 -178310 -268717 213937 192275 -62351 -62539
10840f2539A0883a53602M0748A44307a4387q6274C1192a83463B55800g7135D4102
$$ -62539 10883 -153602 -112854 144307 -14387 -100661 31192 -183463 255800 -77135 44102
10828A41860d0273j7972H8248d12503e3203D1419R8909E2436a4799P26k66103
$$ 141860 -40273 -58245 88248 -412503 -53203 41419 140328 52436 -14799 -14073 -280176
10817b80176J18960g28C5477B860N0447a5126B37279a62759p6955B25446b19577
$$ -280176 -161216 -728 35477 2860 53307 -15126 237279 -162759 -239714 225446 -219577
10805c68264a73432b6530k19543B55479r5118j6026a43028g37j98085O3023f359
$$ -368264 -173432 -26530 -246073 255479 160361 144335 -143028 -737 -198822 -135799 -6359
10793I626K02602r4072b37848A1380J64214n6072J39635c13258B76864l0328d1949
$$ 9626 212228 118156 -237848 11380 175594 119522 259157 -313258 276864 246536 -41949
10781c55971e8159B13149a49340j1513A45497A7583E8a06328m5350k4630B3976
$$ -355971 -58159 213149 -149340 -160853 145497 17583 58 -106328 -151678 -176308 23976
10769a35935B4503K07942a56026L1383A14813f1620f823A38934D256c4659H9139
$$ -135935 24503 232445 -156026 -124643 114813 -61620 -6823 138934 4256 -34659 89139
10757a88922A69913i1037A20215c7228k8470J4028A38369j152c37166I8708O88
$$ -188922 169913 -91037 120215 -37228 -65698 -51670 138369 137217 -337166 98708 99396
10746I9396p097J7215a39044B5089J67767i3206r5850A09836a32570A22620e4845
$$ 99396 92299 109514 -139044 25089 192856 -93206 -189056 109836 -132570 122620 -54845
10734a4779G8383i3675D6782a34391N9761L3341A01933J08343b29531q7271P7017
$$ -14779 78383 -93675 46782 -134391 -74630 -41289 101933 210276 -229531 -316802 -239785
10723b39785a9984m00938a41230l9866B03886r1417g1350j42920j39406B26257
$$ -239785 -19984 -420922 -141230 -181096 203886 112469 -71350 -214270 -353676 226257
10712b99716f4532j45070C7409K0805b71777a14237j18530a10711A05517g2305
$$ -299716 -64532 -209602 37409 58214 -271777 -114237 -232767 -110711 105517 -72305
10701D7706h400A23187a79815A7221K1542a47907n661j47414a02806B02336e2799
$$ 47706 -8400 123187 -179815 17221 38763 -147907 -153568 -300982 -102806 202336 -52799
10689g3111I206b40066K7187O0217D4699O3318a83292A37372B761a24708e4972
$$ -73111 9206 -240066 -212879 -152662 44699 108017 -183292 137372 2761 -124708 -54972
10677b22096j06750a25530j23785F1126d7540f203j28552a276l17220N7982b7892
$$ -222096 -328846 -125530 -249315 61126 -47540 -6203 -134755 -1276 -318496 -260514 -27892
10665b19399H1754k104a46295K4764J3890p312B26171r0225a76893M885d7646
$$ -219399 81754 79650 -146295 -121531 -107641 -114953 226171 135946 -176893 -172008 -47646
10653a49026N312g239B13447a89438A02482L6963D7544J72789f1020a5705C14905
$$ -149026 -143714 -7239 213447 -189438 102482 139445 47544 220333 -61020 -15705 314905
10641b13487d782k1224k2694l1462n4421A39939a8702n6566A44073J1919b97433
$$ -213487 -4782 -26006 -48700 -80162 -134583 139939 -18702 -75268 144073 155992 -297433
10629a67145A32616n7874b1999j25132A94121b88648P6708G7236A6427h0646j22196
$$ -167145 132616 74742 -21999 -147131 194121 -288648 -211940 77236 16427 -80646 -202842
10618b02842J1630r0873B65335g1788q0790j22502a11884B283N6184d64850g7236
$$ -202842 -191212 -282085 265335 -71788 -152578 -275080 -111884 2283 58467 -464850 -77236
10606c13949d3870q4295f3108j65861h130c472n386l6247k51629Q9821A17180
$$ -313949 -43870 -128165 -63108 -228969 -8130 -3472 -8858 -45105 -296734 -206913 117180
10594c16226d007j02783N958q7822B31473a7724A49292b26451f6669j64660B12413
$$ -316226 -4007 -106790 -100832 -188654 231473 -17724 149292 -226451 -66669 -231329 212413
10582A01418b17078f5629B633K3529M697E607J55675h1160I3860J08223K7344
$$ 101418 -217078 -65629 2633 26162 30859 5607 161282 -81160 93860 202083 229427
10571B29427a18246o7724d4977a3473A51644B2835b31923A10964i0497E458a47408
$$ 229427 -118246 -185970 -44977 -13473 151644 22835 -231923 110964 -90497 5458 -147408
10559a41831B39510b49050L5232P5930C5919c8225n5596E9287J24002a18424C20419
$$ -141831 239510 -249050 -213818 -137888 35919 -38225 -93821 59287 183289 -118424 320419
10547f6388I8254Q6617C56O5380N9401c4667D2347b7176q2289d4561p242j49273
$$ -66388 98254 184871 356 65736 125137 -34667 42347 -27176 -109465 -44561 -51803 -201076
10535b01076D6496P2648D2154a87647M72f12A26498A5533b1370p424A19089B1265
$$ -201076 46496 119144 42154 -187647 -187175 -612 126498 15533 -21370 -28794 119089 21265
10522B10063c36409I556b5736B65207k4032a78918j94656a16825m1529A43253
$$ 210063 -336409 9556 -25736 265207 241175 -178918 -373574 -116825 -158354 143253
10511c6036k37173k5359a002B18830a29851A4873e4316E0531C495b82798c5624
$$ -36036 -273209 -298568 -1002 218830 -129851 14873 -54316 50531 3495 -282798 -35624
10499a14539A62719d05028e4896j74491A10189k9184d0866c88j08882G4639O5601
$$ -114539 162719 -405028 -54896 -229387 110189 81005 -40866 -388 -109270 74639 140240
10488A40240a27284I338K54038a68218B83699c85574B00636d0167D42669m9379
$$ 140240 -127284 9338 263376 -168218 283699 -385574 200636 -40167 442669 393290
10478C93290A59168N8345J10872K3101a19360j07284f7253j41919A06086a84652
$$ 393290 159168 217513 328385 351486 -119360 -226644 -67253 -209172 106086 -184652
10467A59879b08181f7471F6744a34108B22853H7550a10290R012a8095l5963j2996
$$ 159879 -208181 -67471 66744 -134108 222853 87550 -110290 -101278 -18095 -54058 -67054
10456f7054I837d52715A62839p9225p86b76922L5472G7091f3654j06577N6741
$$ -67054 9837 -452715 162839 83614 82828 -276922 -241450 77091 -63654 -170231 -113490
10445a13490m2463O8638I7929b21815f9991m3888j49285a8939j43338A98993A0335
$$ -113490 -155953 -87315 97929 -221815 -69991 -113879 -263164 -18939 -162277 198993 10335
10433g6672B62825f9372A30921a55062C53587a7350j39848I5450e5794D166J34296
$$ -76672 262825 -69372 130921 -155062 353587 -17350 -157198 95450 -55794 4166 138462
10422A38462a06810B2258J04459a4596B73606i7263K1035r6372L8653D2354a04725
$$ 138462 -106810 22258 126717 -14596 273606 -97263 -76228 -172600 -133947 42354 -104725
10410A28594g3019j14182d8575A43487c79928D1723N2937b01800j03622B57835
$$ 128594 -73019 -187201 -48575 143487 -379928 41723 94660 -201800 -305422 257835
10399a12230A05078L2346c9861l12987A3606b30519a11849A93613H2747b18045
$$ -112230 105078 137424 -39861 -352848 13606 -230519 -111849 193613 82747 -218045
10388i3275o9257C04235a67122N6224E7408m761P8579f605q282D7177i1952A40886
$$ -93275 -162532 304235 -167122 -110898 57408 52647 131226 -6605 -14887 47177 -91952 140886
10375C41091b3264A28176c2389B35131o2877P1103K69258k10008j27174J8237
$$ 341091 -23264 128176 -32389 235131 172254 243357 512615 302607 175433 193670
10365A93670q3635L93420B15021J20086A24204J5050n2572J93465G870J9190a7762
$$ 193670 110035 503455 215021 335107 124204 139254 86682 280147 7870 27060 -17762
10353A08029M93621A98494J94852L1827m4364J81310A01391L31758C2377K1297
$$ 108029 601650 198494 393346 425173 380809 562119 101391 433149 32377 53674
10343E3674J92007N1403K4560j05172J25782H199J09330J16159C78b0482D8195
$$ 53674 245681 297084 321644 216472 342254 8199 117529 233688 378 -20482 48195
10331a05706a040B05253q4125a79525A41966I826P708K744J27317P2086A00476
$$ -105706 -1040 205253 121128 -179525 141966 9826 17534 20278 147595 219681 100476
10319A63729p1203j652a03213A70210g0265A99045a88102c9690I6032a09074d8943
$$ 163729 92526 90874 -103213 170210 -70265 199045 -188102 -39690 96032 -109074 -48943
10307g7182A94286P1827E2457B912J57711o6467b51995F0974a4430k2501p7877
$$ -77182 194286 266113 52457 2912 160623 94156 -251995 60974 -14430 -36931 -114808
10296a14808B53185H0268a18855B15380a98767j09603J30158I2077M89A0272a81760
$$ -114808 253185 80268 -118855 215380 -198767 -308370 -178212 92077 92566 10272 -181760
10284c14989K6189h3773j12134R1288c4168m526B70021c8886G371a44910E0549
$$ -314989 -288800 -83773 -195907 -104619 -34168 -38694 270021 -38886 7371 -144910 50549
10272I3928C8390A6310M4966A9349a86472e7399l1921C2147K21658c40075f4003
$$ 93928 38390 16310 61276 19349 -186472 -57399 -89320 32147 253805 -340075 -64003
10260A72718i4751c043C96259M7225k19689n4559J3995e7189A78171J9899c4541
$$ 172718 -94751 -3043 396259 443484 223795 169236 183231 -57189 178171 198070 -34541
10248b34568i8825m7671A3333M5105P9894b69827a9468l62023B0474P9751J1623
$$ -234568 -98825 -146496 13333 58438 138332 -269827 -19468 -381491 20474 100225 111848
10237A11848b2180l84846A81054d4467j41534H5146d9095B838P939h2844j9182
$$ 111848 -22180 -407026 181054 -44467 -186001 85146 -49095 2838 10777 -82844 -102026
10226a02026E7715j4768a05486L2832h861A23522a14304k39114f9954A02141c86601
$$ -102026 57715 42947 -105486 -72654 -8861 123522 -114304 -353418 -69954 102141 -386601
10214F6865h3696o182b0784O549j60915h6940m8990A3475K66322a42398j0981
$$ 66865 -83696 -89878 -20784 -14235 -175150 -86940 -135930 13475 279797 -142398 -153379
10203a53379J6650e5396B88410b59686J16028N4078q0039P8946j33755m6603a19668
$$ -153379 -136729 -55396 288410 -259686 -143658 -89580 -169619 -90673 -224428 -271031 -119668
10191d9452k29599A3812c28994A78679m5994o2230b28836j25651B8029h1063k28589
$$ -49452 -279051 13812 -328994 178679 132685 70455 -228836 -354487 28029 -81063 -309652
10180c09652d4762B38227a7447J505k1033j46818I1004a6658D364L12935b99738
$$ -309652 -44762 238227 -17447 -15942 -36975 -183793 91004 -16658 4364 317299 -299738
10168B00732f3664F2059b48941e7785A60481C0666K9758c50619B0707b63723J19136
$$ 200732 -63664 62059 -248941 -57785 160481 30666 60424 -350619 20707 -263723 -144587
10157a44587N3147C40049a20001k0750a2108A97565o9943b07109E9644g4503F4610
$$ -144587 -91440 340049 -120001 -140751 -12108 197565 127622 -207109 59644 -74503 64610
10145C95080c03715a03617A52077a31934C1743a09678r2970i378C40797a86655
$$ 395080 -303715 -103617 152077 -131934 31743 -109678 -202648 -9378 340797 -186655
10134d4341k28172e7259j6377o8682B39775A8141a43494k34791a7058A73355d2078
$$ -44341 -272513 -57259 -73636 -142318 239775 18141 -143494 -378285 -17058 173355 -42078
10122D919f6422k01761a31715D86N264b94793E6549c27948B64601h5479D9647
$$ 4919 -66422 -268183 -131715 486 5750 -294793 56549 -327948 264601 -85479 49647
10110c58819J75909O1718A9988a3564k09516h9698k94482e7747j77218c3473D0164
$$ -358819 -182910 -121192 19988 -13564 -223080 -89698 -384180 -57747 -234965 -33473 40164
10098a02066d1685C91802d6764j88539C01364b6168p5577a0546B67752F9639A4273
$$ -102066 -41685 391802 -46764 -235303 301364 -26168 -101745 -10546 267752 69639 14273
10086a85700I6440K876C8947a03092q171A21475k4301a35634E9751F662N0462
$$ -185700 96440 99316 38947 -103092 -111263 121475 97174 -135634 59751 6662 57124
10075E7124g9663H6498b68080Q7223i0124A04561b09868g3687k6015K1550p7543
$$ 57124 -79663 86498 -268080 -180857 -90124 104561 -209868 -73687 -99702 -78152 -155695
10064a55695A00238a57935c8179B66208a76698A21278l8726a46993c0413j59451
$$ -155695 100238 -157935 -38179 266208 -176698 121278 82552 -146993 -30413 -189864
10054a89864l3166a08363A66114n9040a73341b6377B002d9124F2714d820B03888
$$ -189864 -223030 -108363 166114 107074 -173341 -26377 2002 -49124 62714 -4820 203888
10042A05267a69586c4969k16022a04877E1991k100b40200a0242l73979J88580
$$ 105267 -169586 -34969 -250991 -104877 51991 49891 -240200 -10242 -384221 -195641
10032a95641A64836a76729j45147J44236M7876f4609j97836J27951j41764c8578
$$ -195641 164836 -176729 -321876 -177640 -129764 -64609 -262445 -134494 -276258 -38578
10021a03878C15161A36112K6819h9147l01507B89513H734K66235b07893G5791
$$ -103878 315161 136112 162931 -89147 -390654 289513 8734 274969 -207893 75791
10010E788J19408b49618J05794E359b9267B13455o3877J37607E7030b1910k64246
$$ 5788 125196 -249618 -143824 5359 -29267 213455 149578 287185 57030 -21910 -286156
9999b86156a29540j89386B48687D6159O0867J00830e4150j37131A7952a29209
$$ -286156 -129540 -318926 248687 46159 107026 207856 -54150 -191281 17952 -129209
9988H2596b27128h814j00032j93592I724O147b26478j10023f0296j11993A4687
$$ 82596 -227128 -8814 -108846 -302438 9724 15871 -226478 -336501 -60296 -172289 14687
9976a97823m2207B00512b03652c746j80841A31377n6179b54912J19739j87800
$$ -197823 -240030 200512 -203652 -3746 -184587 131377 75198 -254912 -135173 -322973
9966c22973a7732A15423c8068H5356g7711A24391b76335A52194b07409G1199L5581
$$ -322973 -17732 115423 -38068 85356 -77711 124391 -276335 152194 -207409 71199 106780
9955A06780m8234B8202P5801f730E8753J56229g0144j60291A4728J7884J63910
$$ 106780 58546 28202 104003 -6730 58753 214982 -70144 -230435 14728 32612 196522
9944A96522e2102F5292a57039j38028a06077p6388j46434A18957D7519d7216A66946
$$ 196522 -52102 65292 -157039 -295067 -106077 -182465 -328899 118957 47519 -47216 166946
9932g429l2377A23834E8594b0222B86467a01311M0141C7850K5049K8011J69598
$$ -7429 -39806 123834 58594 -20222 286467 -101311 -61170 37850 62899 90910 260508
9921B60508A16832b50342g9959A8361d66811e0857H1662c77200E1748d2103A26689
$$ 260508 116832 -250342 -79959 18361 -466811 -50857 81662 -377200 51748 -42103 126689
9909G753L3774h5440o8701f4084o7478l16192a73726j33433H5939h8552j10666
$$ 7753 41527 -85440 -154141 -64084 -131562 -447754 -173726 -307159 85939 -88552 -199218
9898a99218j96051a86624A11762B5542i4377l36947b07768j2989E7772b9236j69644
$$ -199218 -395269 -186624 111762 25542 -94377 -431324 -207768 -220757 57772 -29236 -198880
9887a98880m7974g5334j44060h3496F052K42513A170e1245A97348o1315a7251
$$ -198880 -246854 -75334 -219394 -83496 6052 248565 1170 -51245 197348 136033 -17251
9875g2839A84599f4525b0852r7346l6462j74717J28420A74h1042G6316g6121L0681
$$ -72839 184599 -64525 -20852 -118198 -154660 -329377 -200957 174 -81042 76316 -76121 -45440
9863d5440k72758A25910j4233a42542o4903F9349J8890b38570J01860m1187k7975
$$ -45440 -318198 125910 111677 -142542 -207445 69349 88239 -238570 -136710 -177897 -205872
9852b05872N1024j6777k0561g4267J5754D1244h6030r5812h0701R392G8121O1565
$$ -205872 -154848 -171625 -192186 -74267 -58513 41244 -86030 -181842 -80701 -71309 78121 139686
9840A39686g7811l22988g3230J571r3380g7751j93807I6760P95N1420a96684c0059
$$ 139686 -77811 -400799 -73230 -71659 -165039 -77751 -271558 96760 97555 148975 -196684 -30059
9827i2329b023j80050L7800A4794e1974j0733n0842d1054j1750j22443P9451l974
$$ -92329 -2023 -182073 -144273 14794 -51974 -62707 -113549 -41054 -52804 -175247 -95796 -99770
9815i9770d5754E5374a76154B23864b26592h5609m8067j6481G4557l344R9143
$$ -99770 -45754 55374 -176154 223864 -226592 -85609 -133676 -150157 74557 71213 170356
9804A70356c6015k5608B45762b02525A23066a37262k34581a07239G9332J50355
$$ 170356 -36015 -61623 245762 -202525 123066 -137262 -371843 -107239 79332 229687
9794B29687a18544A49058b09259G6721b84759k1821f9813I8694b77459K7448R1114
$$ 229687 -118544 149058 -209259 76721 -284759 -306580 -69813 98694 -277459 -250011 -158897
9783a58897E682b14273A59520c27963C93691b47824E9754a58379j5848F0720d8276
$$ -158897 5682 -214273 159520 -327963 393691 -247824 59754 -158379 -174227 60720 -48276
9771A20745i8087A7833f8097l33623B10161a03070d1687r7874o9001G4037e7378
$$ 120745 -98087 17833 -68097 -401720 210161 -103070 -41687 -139561 -208562 74037 -57378
9759A33117J4762a12706j13275h6874j66264J12376E5371a55913A2164b74475
$$ 133117 147879 -112706 -225981 -86874 -253138 -140762 55371 -155913 12164 -274475
9748B78871b26814B4713b41633k5501B1743J83062b46255q4310C12154b21239
$$ 278871 -226814 24713 -241633 -267134 21743 204805 -246255 -330565 312154 -221239
9737A62612h7273f429B03921k4610b28563B5646a84727r2266N3714D3662c008
$$ 162612 -87273 -6429 203921 179311 -228563 25646 -184727 -276993 -223279 43662 -3008
9725b27A98675G2637K0643d4401A159a29648D1494n589h3729A2931E922J67214
$$ -227 198675 72637 93280 -44401 1159 -129648 41494 35905 -83729 12931 5922 173136
9713A73136b51219a5678k05728B02526b14327C3968d54831a58498c6596A04449
$$ 173136 -251219 -15678 -221406 202526 -214327 33968 -454831 -158498 -36596 104449
9702D2094b8182A68093i8460j66050H2919C6218J03546a88581A33888o2766Q22
$$ 42094 -28182 168093 -98460 -264510 82919 36218 139764 -188581 133888 71122 71944
9691G1944g5458B53906b0144o7608k15212A35306a81125J3034p2828j18456D3308
$$ 71944 -75458 253906 -20144 -87752 -302964 135306 -181125 -168091 -240919 -359375 43308
9679a581B39968d04035H349K04590c1313k0990b4050E6921r212b18217A53338
$$ -1581 239968 -404035 8349 212939 -31313 -52303 -24050 56921 47709 -218217 153338
9667a77476f8440C63660d21819B67951F167J49213k8282K9249a441F5494J8641
$$ -177476 -68440 363660 -421819 267951 6167 155380 127098 156347 -1441 65494 84135
9656H4135l9069e43j40529M4388h864A76554a91989l600C71K34884J18876b66712
$$ 84135 45066 -543 -141072 -96684 -8864 176554 -191989 -195589 371 235255 354131 -266712
9643b35711Q7310j3611D6010a02292m29295b9501A34217b64538a3031j12799c4882
$$ -235711 -148401 -162012 46010 -102292 -531587 -29501 134217 -264538 -13031 -125830 -34882
9631g6619q0146O8232j03689Q0378L9891l2929j63865F1747J98664E2215d6426
$$ -76619 -156765 -88533 -192222 -111844 -71953 -104882 -268747 61747 260411 52215 -46426
9619d3299j09119f0121H5292c3931j34933j08618j76194a79256B6800b20007M2721
$$ -43299 -152418 -60121 85292 -33931 -168864 -277482 -453676 -179256 26800 -220007 -177286
9608a77286j167L4591F6523a94772B59473b51696o7659A1129Q5957A9396f381
$$ -177286 -178453 -143862 66523 -194772 259473 -251696 -319355 11129 97086 19396 -6381
9596A38290C6551c4302A17061e359k19027M4312l2010j68944a00978A43292C8102
$$ 138290 36551 -34302 117061 -5359 -224386 -180074 -212084 -381028 -100978 143292 38102
9584b560j82607J2962N3948M6428b8992k24416F6602K15972a71044h43j35937
$$ -2560 -185167 -172205 -118257 -71829 -28992 -253408 66602 282574 -171044 -843 -136780
9573a36780k35192A72171c4077o7389j28851E4116j8262b8217j7736j46987e6729
$$ -136780 -371972 172171 -34077 -101466 -230317 54116 35854 -28217 -45953 -192940 -56729
9561D8750b99331A58592a12407a0041E9292a20185e2143A40626a38042j33638
$$ 48750 -299331 158592 -112407 -10041 59292 -120185 -52143 140626 -138042 -271680
9551b71680G5074g1728j22927A2301J45867E2257A0326b20788C06180j4692a89206
$$ -271680 75074 -71728 -194655 12301 158168 52257 10326 -220788 306180 291488 -189206
9539C7194K0192a02414p5026l9603G1526h2301A0216Q580A488L4527b11961p6461
$$ 37194 57386 -102414 -177440 -217043 71526 -82301 10216 18796 1488 36015 -211961 -288422
9527b88422g4965c4747j24730E6311J03677a68994p040a4367j61896l2455A75841
$$ -288422 -74965 -34747 -159477 56311 159988 -168994 -176034 -14367 -176263 -208718 175841
9515i0664a1209m4118A71213a14852I0691K08611e2671O540j98500d5302r8684
$$ -90664 -11209 -55327 171213 -114852 90691 299302 -52671 -46131 -244631 -45302 -143986
9504a43986K0348p6388A16599a71019A23768J54517a41861k83324h4686B9929
$$ -143986 -123638 -200026 116599 -171019 123768 278285 -141861 -425185 -84686 29929
9493I7968b61262a12045j90258a04878B34796a27309M1462m066j93450K853B41136
$$ 97968 -261262 -112045 -302303 -104878 234796 -127309 -85847 -89913 -283363 -280510 241136
9481B8439h9003r4337k00454J80329M3233k8031j45396A88229d453j7002Q874
$$ 28439 -89003 -183340 -383794 -203465 -160232 -188263 -333659 188229 -4453 -21455 -12581
9470a2581C349a39669c1301m2010n6963A04234J97404A1329K6968R7564a20125
$$ -12581 3349 -139669 -31301 -73311 -130274 104234 301638 11329 38297 135861 -120125
9458c95752a76121e7360o5967K5966k10782A04319D0004J51471b82932A9499d6038
$$ -395752 -176121 -57360 -123327 -97361 -308143 104319 40004 191475 -282932 19499 -46038
9446F6997a70833e4629j45218B605a81231A39060E667J43937b72201f6877A51107
$$ 66997 -170833 -54629 -199847 2605 -181231 139060 5667 149604 -272201 -66877 151107
9434a12906N5767A21837h6998o5571g6115k0462C4811c2906p2239k2409c6742
$$ -112906 -57139 121837 -86998 -152569 -76115 -96577 34811 -32906 -105145 -127554 -36742
9422b62798A8051M9325J3564a2096m58035A4333d6436A60964c148C6568L6777
$$ -262798 18051 67376 80940 -12096 -470131 14333 -46436 160964 -3148 36568 73345
9411G3345a89150J7683A16163a85462C1061a29373Q546B00833b32545R500h623
$$ 73345 -189150 -171467 116163 -185462 31061 -129373 -120827 200833 -232545 -223045 -8623
9399d09091A79771j7634g781l78336I3919O9680D3354c90663h1143j246D8626
$$ -409091 179771 162137 -7781 -386117 93919 163599 43354 -390663 -81143 -82389 48626
9387A8270d72782D3332b05146K2344N0803l4485A20429K38208a81486N7193M7990
$$ 18270 -472782 43332 -205146 -182802 -131999 -166484 120429 358637 -181486 -124293 -76303
9376g6303A85216c7483f630k07463C47603a01164j4723F949N4444f9637k60102
$$ -76303 185216 -37483 -6630 -214093 347603 -101164 -115887 6949 61393 -69637 -329739
9365c29739I4576a41329A97733f6880n1918b901F8199a66140j85933B34876A979
$$ -329739 94576 -141329 197733 -66880 -118798 -2901 68199 -166140 -352073 234876 1979
9353b05178l0451A26952j8967R3778r6073h2232B1763M8206I144a66207C4026
$$ -205178 -235629 126952 107985 201763 105690 -82232 21763 69969 9144 -166207 34026
9341a31921L7543k11171J23401O9012H8724b88774J18534e0567E927d539B39627
$$ -131921 -94378 -305549 -182148 -113136 88724 -288774 -170240 -50567 5927 -4539 239627
9329d7253k18554B6659L3569K5179a0969k984j08523m4633F5125J0319d697j60796
$$ -47253 -265807 26659 60228 85407 -10969 -13953 -122476 -167109 65125 75444 -4697 -165493
9317a65493r1186A54160i0778m9027L5776f76m6768l0030c3718A19166i4138B0508
$$ -165493 -256679 154160 -90778 -139805 -104029 -676 -47444 -77474 -33718 119166 -94138 20508
9304F2533a30330l43105a59871C986a61704P0969n3546j2056b5957o6065b8603
$$ 62533 -130330 -473435 -159871 3986 -161704 -90735 -144281 -156337 -25957 -92022 -28603
9292D8297j9911J05765J38301H45a24235H5919b24829L5417d7752j78429d200
$$ 48297 28386 134151 272452 845 -124235 85919 -224829 -189412 -47752 -226181 -4200
9280g8661m32691a81393L3779B83720c19644J44512P1345l28939b06339B5847
$$ -78661 -511352 -181393 -147614 283720 -319644 -175132 -103787 -432726 -206339 25847
9269C97815A73184C8109i7504B6300e9603F4964K56867j32948a61184N9501K9792
$$ 397815 173184 38109 -97504 26300 -59603 64964 321831 188883 -161184 -101683 -71891
9258g1891E3042B2828J07909a7379E41e1171C2858J07485m1776e1816g439j68581
$$ -71891 53042 22828 130737 -17379 541 -51171 32858 140343 98567 -51816 -7439 -176020
9246a76020L6879e3280j62133C43096a98504N0569K6462q2445e4453D7840a11006
$$ -176020 -139141 -53280 -215413 343096 -198504 -147935 -121473 -203918 -54453 47840 -111006
9234b59534N1259a02748I5457b7999P84j65503k08206a74202m0199f9814j23508
$$ -259534 -208275 -102748 95457 -27999 -27215 -192718 -400924 -174202 -214401 -69814 -193322
9223a93322L3359A10703I773K23247r7413D1552R854f3119m53712f575H5641b07736
$$ -193322 -159963 110703 9773 233020 135607 41552 51406 -63119 -516831 -6575 85641 -207736
9210a81565O1899M6172j53103F1172e3364n1585a0892A6657A935b53191L0941
$$ -181565 -119666 -73494 -226597 61172 -53364 -104949 -10892 16657 1935 -253191 -222250
9199b22250d5060A8995L80539E7497a26184e6720m8858h402l87862P8881c0995
$$ -222250 -45060 18995 399534 57497 -126184 -56720 -105578 -8402 -396264 -317383 -30995
9187a00765A94602r2025a95045B4558M213h7881B3029b32467h1589b8504G8996
$$ -100765 194602 102577 -195045 24558 28771 -87881 23029 -232467 -81589 -28504 78996
9175b66371O891R1843A16092m3370a24524r0725j09585c4980l1321A1489c94061
$$ -266371 -259480 -167637 116092 72722 -124524 -215249 -324834 -34980 -66301 11489 -394061
9163b30548D222b37463D8439a02391b0239A3828i1175p3546C17035a52335F2216
$$ -230548 4222 -237463 48439 -102391 -20239 13828 -91175 -164721 317035 -152335 62216
9151A88538G7555b34087A46801a97545e2348O591l03142i6527a9524j979n44584
$$ 188538 77555 -234087 146801 -197545 -52348 -45757 -348899 -96527 -19524 -21503 -566087
9140e66087K62334j54183e1846B07403D380a21273G5091a30187k4228M1316A7921
$$ -566087 -303753 -457936 -51846 207403 4380 -121273 75091 -130187 -154415 -113099 17921
9128a75569i882B2137f7439j35169h4529j17997I6262K05155c36595E648f13479
$$ -175569 -9882 22137 -67439 -202608 -84529 -202526 96262 301417 -336595 5648 -613479
9116A15191a72104c9365j66811A19677b37349e278F7846b8842j75625Q2516L4526
$$ 115191 -172104 -39365 -206176 119677 -237349 -5278 67846 -28842 -204467 -121951 -87425
9105h7425B30806b04944A76739i5417d5289j29394O1297F7882b34302G431a08482
$$ -87425 230806 -204944 176739 -95417 -45289 -174683 -113386 67882 -234302 7431 -108482
9093b73963O8739B8602a85187j04916F1729A918a04054l20955J25633A74638h7530
$$ -273963 -205224 28602 -185187 -290103 61729 1918 -104054 -425009 -299376 174638 -87530
9081d2605q1629a8137D5788a10953G8762f2627B7770Q5705a32115a8110A30868
$$ -42605 -124234 -18137 45788 -110953 78762 -62627 27770 113475 -132115 -18110 130868
9069I5378d6571F8851A8665a51007j41108c9686m900k0515l62152G1405J517h2249
$$ 95378 -46571 68851 18665 -151007 -292115 -39686 -44586 -65101 -427253 71405 72922 -82249
9056b9216q908A7028J33821L0982n2390F2514c6260q7629G9214b49233b3329G5415
$$ -29216 -38124 17028 150849 181831 129441 62514 -36260 -123889 79214 -249233 -23329 75415
9043a9A10493a75221O0024k9257m6716K4154d0060m0829j15899g8095k74306b7769
$$ -19 110493 -175221 -115197 -144454 -191170 -167016 -40060 -80889 -196788 -78095 -352401 -27769
9030b11959A00951e67375a91567A00205a58439A2656c3570m1933B34091g1362
$$ -211959 100951 -567375 -191567 100205 -158439 12656 -33570 -75503 234091 -71362
9019A85815k5695d12398a37074q417k50828J93763f1796j39069B1846H292J36331
$$ 185815 160120 -412398 -137074 -145491 -396319 -202556 -61796 -200865 21846 8292 144623
9008A44623R323i5897k5350D6253h2380n4782g461j88780M8035b1837B74827b27522
$$ 144623 153946 -95897 -121247 46253 -82380 -137162 -7461 -196241 -148206 -21837 274827 -227522
8995B00474b72613A93186c4572j05324R922A17595b15169m512J09646k01803J28239
$$ 200474 -272613 193186 -34572 -139896 -129974 117595 -215169 -219681 -110035 -311838 -183599
8984a83599J1995G5792M191L9852g4939M739j05878A7037J57320F9725a6497E379
$$ -183599 -171604 75792 79983 119835 -74939 -70200 -176078 17037 174357 69725 -16497 5379
8971c30439a30087m9006g4526k61287C88173b05691i0515L7994o6461B8162L9442
$$ -330439 -130087 -179093 -74526 -335813 388173 -205691 -90515 -52521 -118982 28162 67604
8960F7604J51874R8979D9469a77511A6347a39936j18801B30190E7015d5486q0731
$$ 67604 219478 318457 49469 -177511 16347 -139936 -258737 230190 57015 -45486 -126217
8949a26217d3851k64971A34960n990A9180a62420g0043C4127J81734a29029a6839
$$ -126217 -43851 -308822 134960 128970 19180 -162420 -70043 34127 215861 -129029 -16839
8937a33591j84535J12940i6575C49112K98950A94770J47967a2736A21532K11816
$$ -133591 -318126 -205186 -96575 349112 648062 194770 342737 -12736 121532 333348
8927C33348A9069K05637M7337L3402M05004R31661L150908J1861570F382474B425643
$$ 333348 19069 224706 272043 305445 710449 1642110 4793018 16654588 6382474 2425643
8916H20974j28272k15653a83137F1677b65I3183h0687g518C69448A72748m3418
$$ 820974 692702 477049 -183137 61677 -265 93183 -80687 -7518 369448 172748 129330
8905A29330R3114a67214F7058a33557a6123A65133a67792D704b29954I8559J98375
$$ 129330 222444 -167214 67058 -133557 -16123 165133 -167792 4704 -229954 98559 296934
8894B96934B5701b26984F9323c44660A28653b06973j06010A01713a93343j37657
$$ 296934 25701 -226984 69323 -344660 128653 -206973 -312983 101713 -193343 -331000
8884c31000L3494A8557e4610F8852J29979a88436E3491K25939b62443A18444J13272
$$ -331000 -297506 18557 -54610 68852 198831 -188436 53491 279430 -262443 118444 231716
8873B31716h6294A09488d8494k5139B78776H055c06000A93207g1906A07552C6645
$$ 231716 -86294 109488 -48494 -73633 278776 8055 -306000 193207 -71906 107552 36645
8861a24266B4159d0472m6190l792D71873c28301B1356a25164n173I148a64727
$$ -124266 24159 -40472 -86662 -90454 471873 -328301 21356 -125164 -130337 9148 -164727
8849I3959K09607a29402M5443A09623A1320a05418A58268J008B5391c3523A50559
$$ 93959 303566 -129402 -83959 109623 11320 -105418 158268 159276 25391 -33523 150559
8837B79057i4465A84675a07352j19227f0601k05745i1123F7486b97560J04108
$$ 279057 -94465 184675 -107352 -226579 -60601 -266346 -91123 67486 -297560 -193452
8827a93452A8787c34915f9927n7203l24339f6273j34023a0498j49280a4120j03256
$$ -193452 18787 -334915 -69927 -127130 -451469 -66273 -200296 -10498 -159778 -14120 -117376
$$ [...]
##END NTUPLES=NMR SPECTRUM
##END=
