##TITLE=NES1060_159122.0007_002_9704132_ozipFNsutZ
##JCAMPDX= 6.0         $$ Bruker NMR JCAMP-DX V2.0
##DATA TYPE= NMR SPECTRUM
##DATA CLASS= NTUPLES
##ORIGIN= BRUKER
##OWNER= Administrator
$$ 1.72 TOPSPIN		Version 2.1
$$ 2016-05-01 18:56:27.942 -0700  Administrator@X
$$ Compression mode = diff/dup
##.OBSERVE FREQUENCY= 400.02188249412
##.OBSERVE NUCLEUS= ^1H
##.ACQUISITION MODE= SIMULTANEOUS (DQD)
##.ACQUISITION SCHEME= undefined
##.AVERAGES= 8
##.DIGITISER RES= 22
##SPECTROMETER/DATA SYSTEM= spect
##.PULSE SEQUENCE= zg30
##.SOLVENT NAME= COFFEE_meoh
##.SHIFT REFERENCE= INTERNAL, COFFEE_meoh, 1, 14.98509
##AUDIT TRAIL= $$ (NUMBER, WHEN, WHO, WHERE, PROCESS, VERSION, WHAT)
$$ ##TITLE= Audit trail, TOPSPIN		Version 2.1
$$ ##JCAMPDX= 5.01
$$ ##ORIGIN= Bruker BioSpin GmbH
$$ ##OWNER= Administrator
$$ $$ E:\/data/COFFEE/nmr/NES1060_159122.0007_002_9704132_ozipFNsutZ/10/pdata/1/auditp.txt
$$ ##AUDIT TRAIL=  $$ (NUMBER, WHEN, WHO, WHERE, PROCESS, VERSION, WHAT)
(   1,<2016-05-01 18:56:21.067 -0700>,<Administrator>,<X>,<go>,<TOPSPIN 2.1>,
      <created by zg
	started at 2016-05-01 18:55:14.786 -0700,
	POWCHK enabled, PULCHK disabled,
       configuration hash MD5:
       21 0F 79 D6 B3 7B B4 F6 88 20 88 DB 03 48 BD 9F
       data hash MD5: 64K
       0B 98 CF 13 57 C1 71 09 A8 21 31 92 B5 69 41 DE>)
(   2,<2016-05-01 18:56:24.130 -0700>,<Administrator>,<X>,<proc1d>,<TOPSPIN 2.1>,
      <Start of raw data processing
       efp LB = 0 FT_mod = 6 PKNL = 1 PHC0 = 0 PHC1 = 0 SI = 32K 
       data hash MD5: 32K
       A6 1E D9 BB 2B 92 8D 24 0F 9E 67 B0 40 04 6F 64>)
(   3,<2016-05-01 18:56:24.411 -0700>,<Administrator>,<X>,<proc1d>,<TOPSPIN 2.1>,
      <pk PHC0 = 93.69141 PHC1 = 0 
       data hash MD5: 32K
       62 D4 8F A3 6E 5C 3B CD 66 AF 60 C3 23 1A 36 C7>)
(   4,<2016-05-01 18:56:24.505 -0700>,<Administrator>,<X>,<proc1d>,<TOPSPIN 2.1>,
      <abs ABSG = 1 
       data hash MD5: 32K
       4C 03 1E 7C 27 D8 E1 A8 7E E4 C1 A3 7A 9F 83 C3>)
(   5,<2016-05-01 18:56:24.567 -0700>,<Administrator>,<X>,<proc1d>,<TOPSPIN 2.1>,
      <abs ABSG = 2 
       data hash MD5: 32K
       44 FC 6F 1E 54 B1 43 20 52 4E E0 A8 64 9A 13 F4>)
(   6,<2016-05-01 18:56:24.630 -0700>,<Administrator>,<X>,<proc1d>,<TOPSPIN 2.1>,
      <abs ABSG = 3 
       data hash MD5: 32K
       28 50 9F 60 C8 C8 D8 4C 68 E6 55 C7 A9 D1 01 1C>)
(   7,<2016-05-01 18:56:24.692 -0700>,<Administrator>,<X>,<proc1d>,<TOPSPIN 2.1>,
      <abs ABSG = 4 
       data hash MD5: 32K
       63 9B 57 C6 A5 6D D2 DF 75 8F 36 EC E7 32 88 FC>)
(   8,<2016-05-01 18:56:24.755 -0700>,<Administrator>,<X>,<proc1d>,<TOPSPIN 2.1>,
      <abs ABSG = 5 
       data hash MD5: 32K
       23 8A 86 B5 CA 46 D9 EE 3B 1C F1 34 FB 30 5A A8>)
$$ ##END=
$$ 
$$ $$ hash MD5
$$ $$ 09 B7 F5 51 2E FD 15 5C 1A F3 6F 74 73 35 50 18
##$RELAX= 
##$RELAX= 
##$RELAX= 
##$RELAX= 
##$RELAX= 
##$RELAX= 
##$RELAX= 
$$ Bruker specific parameters
$$ --------------------------
##$DU= <E:\>
##$EXPNO= 10
$$ [...]
##$TP= (0..7)
150 150 150 150 150 150 150 150
##$TP07= 0
##$TPNAME0= <>
##$TPNAME1= <>
##$TPNAME2= <>
##$TPNAME3= <>
##$TPNAME4= <>
##$TPNAME5= <>
##$TPNAME6= <>
##$TPNAME7= <>
##$TPOAL= (0..7)
0.5 0.5 0.5 0.5 0.5 0.5 0.5 0.5
##$TPOFFS= (0..7)
0 0 0 0 0 0 0 0
##$TUNHIN= 0
##$TUNHOUT= 0
##$TUNXOUT= 0
##$USERA1= <user>
##$USERA2= <user>
##$USERA3= <user>
##$USERA4= <user>
##$USERA5= <user>
##$V9= 5
##$VALIST= <valist>
##$VCLIST= <CCCCCCCCCCCCCCC>
##$VD= 0
##$VDLIST= <DDDDDDDDDDDDDDD>
##$VPLIST= <PPPPPPPPPPPPPPP>
##$VTLIST= <TTTTTTTTTTTTTTT>
##$WBST= 2048
##$WBSW= 25
##$XGAIN= (0..3)
0 0 0 0
##$XL= 0
##$YL= 0
##$YMAX_a= 610730
##$YMIN_a= -515869
##$ZGOPTNS= <>
##$ZL1= 120
##$ZL2= 120
##$ZL3= 120
##$ZL4= 120
##$ABSF1= 14.98509
##$ABSF2= -5.573092
##$ABSG= 5
##$ABSL= 3
##$ALPHA= 0
##$AQORDER= 0
##$ASSFAC= 0
##$ASSFACI= 0
##$ASSFACX= 0
##$ASSWID= 0
##$AUNMP= <proc_prof1d_extract_pilot.lims>
##$AXLEFT= 0
##$AXNAME= <>
##$AXNUC= <1H>
##$AXRIGHT= 0
##$AXTYPE= 0
##$AXUNIT= <>
##$AZFE= 0.1
##$AZFW= 0.1
##$BCFW= 0
##$BC_mod= 0
##$BYTORDP= 0
##$COROFFS= 0
##$CY= 15
##$DATMOD= 1
##$DC= 0
##$DFILT= <>
##$DTYPP= 0
##$F1P= 0
##$F2P= 0
##$FCOR= 0.5
##$FTSIZE= 32768
##$FT_mod= 6
##$GAMMA= 0
##$GB= 0
##$INTBC= 1
##$INTSCL= 1
##$ISEN= 128
##$LB= 0
##$LEV0= 0
##$LPBIN= 0
##$MAXI= 10000
##$MC2= 0
##$MEAN= 0
##$ME_mod= 0
##$MI= 0
##$NCOEF= 0
##$NC_proc= -8
##$NLEV= 6
##$NOISF1= 0
##$NOISF2= 0
##$NSP= 0
##$NTH_PI= 0
##$NZP= 0
##$OFFSET= 14.98509
##$PC= 1
##$PHC0= 93.69141
##$PHC1= 0
##$PH_mod= 1
##$PKNL= yes
##$PPARMOD= 0
##$PPDIAG= 0
##$PPIPTYP= 0
##$PPMPNUM= 2147483647
##$PPRESOL= 1
##$PSCAL= 4
##$PSIGN= 0
##$PYNMP= <proc.py>
##$REVERSE= no
##$SF= 400.02
##$SI= 32768
##$SIGF1= 0
##$SIGF2= 0
##$SINO= 400
##$SIOLD= 32768
##$SPECTYP= <>
##$SREGLST= <1H.CDCl3>
##$SSB= 0
##$STSI= 32768
##$STSR= 0
##$SW_p= 8223.68421052631
##$SYMM= 0
##$S_DEV= 0
##$TDeff= 65536
##$TDoff= 0
##$TI= <>
##$TILT= no
##$TM1= 0
##$TM2= 0
##$TOPLEV= 0
##$USERP1= <user>
##$USERP2= <user>
##$USERP3= <user>
##$USERP4= <user>
##$USERP5= <user>
##$WDW= 1
##$XDIM= 32768
##$YMAX_p= 439059201
##$YMIN_p= -695518
##$CURPLOT= <Network HP LaserJet P1505>
##$CURPRIN= <$Network HP LaserJet P1505>
##$DFORMAT= <normdp>
##$LAYOUT= <+/1D_H.xwp>
##$LFORMAT= <normlp>
##$PFORMAT= <normpl>
##$SURQMSG= 1
$$ End of Bruker specific parameters
$$ ---------------------------------
##NTUPLES= NMR SPECTRUM
##VAR_NAME=  FREQUENCY,     SPECTRUM/REAL,   SPECTRUM/IMAG
##SYMBOL=    X,             R,               I
##VAR_TYPE=  INDEPENDENT,   DEPENDENT,       DEPENDENT
##VAR_FORM=  AFFN,          ASDF,            ASDF
##VAR_DIM=   32768,         32768,           32768
##UNITS=     HZ,            ARBITRARY UNITS, ARBITRARY UNITS
##FACTOR=    0.250966925370066, 1,           1
##FIRST=     8223.43324360094, 128099,       1986
##LAST=      0,             108711,          -52779
##MIN=       0,             -695518,         0
##MAX=       8223.43324360094, 439059201,    0
$$ Real data points
##PAGE= N=1
##DATA TABLE= (X++(R..R)), XYDATA
$$ [...]
23827 284711 161405 -85517 -42197 -214206 138365 -127456 226402 -82329 175315 49955
23816 -32383 -226326 81259 -18727 17891 -292627 -24973 16876 -93480 190873 -67384 -177766
23805 -177766 144610 -112285 -168640 73143 -172560 202442 -90484 -189607 -102583 -150648 -64165
23793 194091 -49396 -3585 73812 207237 -129210 -58289 -205351 189335 -89802 252289 -252556
23781 13891 -80384 58385 82820 94430 -7098 104691 221428 157122 167099 46341 19247 138025
23769 138025 -28581 -26950 -154870 36411 30978 -5534 -284667 113817 55567 -156062 -136960
23758 -136960 -79721 -96913 97699 -25005 -172130 54206 17808 -314466 141726 -113405 25972
23746 13003 192218 161238 99650 65835 27162 173175 150315 377854 66429 121227 367565
23735 367565 65785 51547 -207636 -12000 108608 -62978 11358 34448 -154906 223934 -95749
23723 -253234 -182162 -36936 76458 159220 107566 19641 -159749 -58099 19138 79261 -349992
23711 94728 152359 -303212 155702 -10840 111446 -126363 128574 -23880 -360831 134497
23700 -22920 -26884 -94134 262983 -163171 -66860 -253561 129858 57252 -5915 -107416 77229
23688 -157158 -117451 -28411 -203307 51874 108666 -176103 177583 42047 -51889 11205 -126795
23676 166550 -105181 -227165 -69311 -197363 139857 92316 -86453 22638 -174084 -11702
23665 -74992 131249 36604 336528 -209706 106776 87450 4545 258552 -131238 53707 -8906
23653 -71308 26676 -32026 76094 161532 -177169 -122206 -182863 113889 -274577 -32762 -115132
23642 -115132 75181 124365 -49776 211934 70260 -123113 -165970 136357 204481 -89428 -133394
23631 -133394 55642 -56788 141164 49073 199996 85333 18159 -24281 9361 -490271 154951
23619 -57847 109304 -15996 8565 -105747 -149861 -211359 119592 111070 -217553 -242979 -17920
23607 -38701 -107974 -32193 -164094 172147 215956 113831 -167567 -45180 106688 196170 209576
23596 209576 -271680 77823 300628 -67746 -174280 -29480 220774 -52121 174269 -30175
23585 140789 -14443 -127199 187949 -25531 355418 -33676 46404 -116374 -74550 25954 58311
23574 58311 -123810 -50250 20544 113857 86278 209351 -211737 344336 -106663 -25475 -255371
23563 -255371 240145 -91362 55118 172833 -113258 156358 -37900 -72186 -196213 -55170
23552 -134485 -9641 -218199 -201478 -209426 -219279 -151334 131571 -107482 110317 24665 -48966
23540 -60380 -799 90827 151264 -19401 -162922 -52508 -305566 -211214 -114602 -133655 108415
23528 215953 -197073 -244693 -252610 -6008 18395 222988 112426 -25245 -130520 -226791 3055
23516 -79741 32372 -194623 -185884 -139623 118130 -44441 -30723 -47834 35294 -41071 263477
23504 -332195 14274 -28127 -56544 -123155 30620 10060 -251554 -201467 87239 27110 -200390
23492 199247 4186 -299383 138284 -189669 35918 -112629 169249 -25087 -27965 -43766 -285030
23481 -285030 64426 -97070 204114 6228 -40078 -159662 41188 -295804 68616 -107822 222013
23469 93235 131205 220979 -201057 -189751 -103825 22928 161054 -227271 -197287 218051 -31854
23457 18585 -283684 8992 81335 -102517 115262 -47998 28393 55659 -264961 -120360 -318256
23446 -318256 141447 174843 -25284 196424 -37993 137203 38851 -158906 324765 48893
23435 64305 -54143 -154184 89435 183212 -29567 84828 -118963 -84881 102375 -3858 -279290
23424 -279290 -194228 148825 40034 120077 -224380 -226198 -33180 198918 -87522 -65976 -212323
23413 -212323 123613 33462 58833 190901 90684 156652 -92979 -8034 -10161 -5798 -122878
23402 -122878 -47106 66811 46460 -147001 -106814 40195 91323 228977 108310 89082 -131678
23390 124135 21369 -8996 161519 -142808 88585 -3556 6538 -90717 -29855 102990 -113689
23378 140243 192969 -153107 6133 -170607 355795 150310 -85841 149945 343767 -209240
23367 -30612 7227 -211104 37005 -96974 84885 -202406 -109226 -61218 -79480 -124361 35101
23355 -357703 84928 -302173 -82085 -216407 89999 -195257 -308824 244383 141679 -11686
23344 -254742 14281 -104974 -147413 123998 399688 -107013 -119034 326651 -89178 -29269
23333 -105490 27398 185789 240692 -64188 -6508 -25631 -3335 -322883 5681 -32858 78347 93378
23321 93378 52623 -114488 -170177 -68553 114768 -106778 -206920 14927 -234618 196667
23310 -94549 -278617 -32172 9425 212653 63702 -254522 150544 56183 -117353 334388 66051
23298 244142 -11519 298387 338304 -22282 122659 183258 -27529 209031 -203968 -4942 -198251
23287 -198251 50653 -168460 -106994 -307944 -168654 -141974 4503 180766 -306176 -78008 107520
23275 119930 -127852 138913 95576 133693 -17428 -88298 124281 176495 -224763 -233952 332332
23263 -232537 382453 -22673 -422883 -85867 23145 74092 266839 -10948 -34943 -90651 112703
23251 154101 -136268 -113285 -47379 7516 144545 135108 89643 51023 -365162 42123 255265
23240 255265 26801 104932 -306600 17974 -61584 131076 -89167 -7035 91909 -80001 -74952
23229 -74952 33114 -133492 128416 102660 -102923 76854 46094 194110 48261 97904 98326
23218 98326 -28327 167800 -36969 141524 -277968 -20025 28062 -18503 -239171 236626 -308809
23206 60471 195513 -61784 -27226 -244223 6279 -204249 -349396 -332825 -64023 -2749 -176425
23195 -176425 71708 -28647 43270 -214762 -192823 75933 225569 241048 -149712 75514 -481010
23183 -182884 657 -359536 -43515 98818 99560 56443 27670 -72808 145169 -22407 128398 -29461
23170 -350514 -86059 64605 538918 -53776 67469 -236608 -9308 123978 233775 62407 -175742
23158 -154094 83371 -180102 183889 -50044 -131250 -71776 23119 -142542 95380 -148685 92860
23146 -84706 -156447 228259 45145 -224626 75862 83501 180582 -508215 -70681 220031 -60979
23134 129807 43776 278434 17473 48574 -15923 -322826 -123204 97296 -131912 -156738 -74332
23122 -44465 -36519 64729 57612 -122275 -94512 3492 -81484 -98505 41106 -310897 -59880 101777
23109 102295 106693 312778 -192896 -210250 93460 -174120 -41801 -26873 -48153 100132 142396
23098 142396 -140659 -11446 99746 -99423 -110026 27553 62015 191274 -331284 -2545 22441
23086 -70047 220734 68600 -228584 124400 156252 97190 205600 30647 123808 184920 -106470
23074 -204372 -73310 -319450 122094 -90719 -158038 164646 -149250 -95144 -37572 -14867 -25627
23063 -25627 -236154 -7470 157757 -56672 71444 -93477 -146814 117376 29716 -108810 -38949
23051 -45836 -138090 362625 37647 46052 172694 -50889 127616 -252563 188572 -101617 111768
23039 196440 -282263 -97892 -199334 -73369 -71204 53500 8445 -19833 -170756 -48576 109601
23027 -80199 -249887 53226 328008 21377 257946 -234123 237124 92537 -121424 284966
23016 105223 -44325 -66547 -213718 -122662 -122890 -178337 -135875 85659 39373 -147340 198145
23004 -198249 65015 160291 -326005 -115470 -91984 -108936 5979 175046 -114882 218614 88243
22992 -212346 143678 204613 -25264 -84391 183295 52312 -95742 56661 107703 35916 -45587
22980 -140102 -146948 70178 151207 45221 -252409 227819 -42690 -136429 -158351 -66994 -187256
22969 -187256 -20102 -78225 229828 14451 43175 192862 -5860 -324472 -221939 -285390 230861
22957 -69010 -94861 150410 -2917 86690 186158 17983 -68543 -83213 -55695 -178160 154512
22945 334476 -288669 69235 -9474 138957 25469 -193194 28102 268472 -92400 -163521 -85340
22934 -85340 -207806 209064 31966 -23173 278314 -223336 43943 66138 -202007 -23521 -119091
22923 -119091 -19052 86293 -100375 -87882 -470972 -392975 12736 -7659 16265 35348 45944
22912 45944 36981 73967 66068 -118407 -215059 -28713 -155885 -42622 41639 56303 81887 -9107
22899 51685 -9561 -122322 -14859 139523 -32180 -56983 -64363 -117407 -256275 -43386 -304511
22888 -304511 -88762 38202 193933 -233566 98536 -207267 -102807 -246020 -21085 -283611
22878 -283611 -51283 37417 401568 -102412 42391 31336 -71799 31039 178963 -133008 -353582
22867 -353582 5014 -207000 158201 110065 -56828 -230818 116192 53676 201358 77496 187732
22856 187732 6974 -122488 100342 147527 -282209 -130798 -176352 147711 -175448 175267
22845 218161 -32778 -200706 -389483 205660 483184 -109015 -32945 152307 -266550 16706
22834 329648 -182961 -36461 -348050 -77708 5425 -28702 62054 -24697 88001 -45621 -104657
22823 -104657 -277989 309754 -117100 -140757 -183963 -112567 -78769 -51574 -49487 284041 -44063
22811 241330 42065 -5736 287109 -337835 214372 -69611 -59459 -66628 -128806 217690 -176142
22799 21886 132146 -180405 -153847 -78261 58178 -24882 -66026 391090 62692 27978 -230715
22787 75781 -34056 377414 -47360 150863 8067 104109 32502 -190356 -72167 111978 120602
22776 120602 151051 -244310 76410 16811 234767 129948 -171250 -136602 -83860 209580
22765 -477464 -81110 68496 -33428 15258 168758 85905 10554 35584 107198 -251773 -201145
22754 -201145 59473 70964 -241962 178289 -9092 -230979 -138958 -346219 -49091 107050 -63964
22742 55612 428472 -118323 115848 196833 -175453 -181803 135235 131149 -75436 -171430 -260931
22731 -260931 -41560 100515 -383631 47910 -62504 -163644 127977 98216 -240296 26432
22720 247235 18699 -105017 87209 85617 -160810 -6861 61938 278332 -145941 -248990 -266582
22709 -266582 122861 78460 72462 -123865 18112 -241704 -45975 -84756 -322414 -223359 -89805
22697 -115405 -101670 -69569 -66806 -20773 -273719 12345 -229966 -81768 -100864 92085 90138
22686 90138 236557 -75098 -83033 -317129 -99087 -4064 167971 -59531 -136392 143580 17777
22674 100503 -17085 -84844 -132661 -170838 36115 48463 6060 -31321 -57249 -36755 254725
22662 30374 164586 300521 97298 -251336 -181888 -76515 32249 -162535 -105600 128089 -153433
22650 -225282 -239107 -133858 -15414 -175671 92163 11806 -176076 -143202 -52583 -139180 -268305
22639 -268305 -345670 117439 -23402 -144674 21656 -106778 -131561 -379858 342186 -66462
22628 -15636 -183078 153636 49481 173101 83901 267498 116499 -1185 59966 -49994 -89980
22617 -89980 -94188 44219 -66839 116834 186497 157109 67119 78317 -59837 -445339 139963
22605 -158348 28698 -21113 146512 -89958 84582 -84035 -91701 232074 -102650 -197111 -65372
22593 30476 -28579 -29893 -32165 -117252 211932 -339885 349115 54669 -54235 34265 -40446
22581 49524 -206245 -275080 -6570 -375812 -40547 209314 245679 141083 -83442 85982 102573
22570 102573 40638 -92935 -265296 -14098 210593 -36963 81158 -282014 -41366 85241 -185665
22558 -72891 95981 4184 -167103 270724 -219722 -129658 -112897 82687 45085 32822 120644
22547 120644 -161704 -66586 -87543 28116 53224 -437791 62404 -42021 -215157 13514 -33109
22535 120322 -8134 -48493 -298193 -67108 -130393 142638 -151143 39464 -52075 -323480 43839
22523 157944 -145054 -259185 -83460 -153536 130946 25282 -153502 -135444 210691 -15729
22512 96360 -116945 22733 -110901 -182769 25087 47235 -19625 -143965 -229335 -357575 19391
22500 38083 -231152 389 -134780 103187 -221760 178481 -101715 -132596 188775 -52029 47601
22488 -169268 70935 273306 -254689 -80875 194410 -20860 -128854 -282013 129120 26518
22477 -134966 -244403 -86012 -254970 -190428 114715 70447 104303 -49121 28948 -48067 150730
22465 -111182 -68254 -177458 -24922 207807 -282606 297807 -76413 -61411 132838 13218
22454 -53768 123464 43298 -381776 -72878 146259 -289701 -207262 -90226 -128087 310444 -11095
22442 -197074 -189989 -35724 -308086 -267707 252375 -88933 216414 157657 -58131 -100009 190995
22430 -54557 -112199 364642 -48927 143493 198476 -222899 42451 -212461 -139345 7672 -148964
22418 75723 5767 5139 15630 294148 -233564 -422763 -398715 -29351 107013 -71655 -172953
22407 -172953 -43193 56615 23456 124507 23024 -3505 16459 160502 22613 -64225 5867
22395 -34314 -53175 -70701 -269093 -382665 -278666 -65949 -222577 -22384 -29895 203026 -38632
22383 -14613 178159 130958 -34996 -141280 -10557 -124021 -106187 8789 -144745 -1054 -208230
22372 -208230 343469 -116379 -165472 87454 39934 48301 274465 -206948 132789 50607 -51255
22360 -184984 321117 293891 -218176 -28543 29204 227869 -360720 -250461 64498 61705 -141924
22348 -143855 -337452 236916 -45913 -220026 -31137 190485 -59267 -129715 -87669 -104708 -78685
22337 -78685 -51265 79125 -140523 -204569 292746 -142455 -193594 -31649 172948 94325 9487
22325 -36022 85687 -76295 -112428 268001 -49997 -135587 -219263 72250 14340 -144665 44558
22313 10798 167303 -165999 -175615 -3878 -179492 -326893 136737 60738 76664 190883 -52733
22301 234939 -227347 134711 42181 152825 34783 -202976 -175617 364311 -176511 -150281
22291 -150281 -42575 173091 73537 29280 -17596 -83425 -48851 8782 57992 -143866 394777
22279 -149563 -122904 203966 -264101 236533 -57840 109406 -123579 -124973 45243 -22160 -63765
22268 -63765 -319599 -77404 108033 -125418 -65312 82630 -142942 -26968 -298095 -56398 -251425
22257 -251425 -66243 86721 -242502 166332 51198 99487 -164330 -323102 51534 113818 -47979
22245 863 116026 -160369 -280054 155822 -165054 -107649 108496 -152851 -78919 -60972 -50566
22234 -50566 -29058 -272326 127881 163921 -236646 -203947 127053 -138184 -176475 -10989 -276250
22223 -276250 -89564 -245168 -78264 130934 552167 -56766 -225432 -82762 -72960 -325771 -320725
22212 -320725 -16998 -63265 207557 397725 -264102 -80422 -69408 -112244 -198209 -99378 -190510
22201 -190510 -137110 -32025 128593 365696 26864 -6438 -133826 93096 25036 137015 -118642
22189 -154839 -173178 -69483 9509 121365 181718 -163683 69353 -104280 -66815 205236 44536
22177 -472311 -11580 53554 246016 128571 -148506 -69724 -44537 -180489 -184841 234307 74153
22165 223431 70761 -40951 253721 -254126 -333617 -135594 279682 -5369 233709 201960 61188
22153 -78352 -96624 288315 76390 261317 4841 -5362 119440 -403990 -9678 -150750 -15602
22141 -95567 -101182 -248322 57326 86128 157823 71960 -38780 -15691 -344080 -10543 104413
22129 276209 -46255 -132275 160299 -284640 -226583 -291323 -136482 -166591 55526 -15351 -248421
22118 -248421 139132 -119165 -135424 -169597 -125467 -109867 -123225 -284901 22828 -68354 -310141
22107 -310141 -93672 37483 121637 -330288 -13358 -127641 -99596 289302 119470 77677 162137
22096 162137 -146640 -93022 144218 -150958 -61906 -78860 -98558 -594972 -12177 152612
22085 271694 55612 -185588 -59245 -47823 -273316 183038 112585 -11303 121367 44844 -8789
22073 250007 198371 -146217 104958 -95887 205258 377421 -1954 110039 74121 -100326
22062 -114752 316161 -173002 -8532 -137852 43488 -98401 2411 -113149 -60315 136620 -28563
22050 198834 -91589 -177723 -140818 -59948 37089 -290604 197881 156243 101819 11561 126987
22039 126987 84333 38033 -53591 -82579 -127172 -347930 42863 -162245 -456721 -195107 -269384
22028 -269384 116919 123392 -248301 246748 -193055 -261396 167839 -245461 -21669 -271980
22018 -271980 -106126 -174427 63846 -114433 -21127 -364275 -70506 19592 -6237 -127392 -20251
22006 196917 -224462 -255096 -114006 -44297 -78678 -131987 73779 -117523 15429 45381 -288143
21994 151446 286960 -194705 -29990 -128802 248247 43484 -241565 -345616 37940 92162
21984 92162 -103967 -66943 231529 4409 73788 -49046 -148981 -333821 118919 -56632 -202621
21973 -202621 -241206 35770 -87544 -47617 -7220 229141 -12600 -176094 -329603 18609 -81359
21961 12492 53185 130944 -5810 80223 64355 14067 140302 35439 324404 -75382 -201232
21950 -201232 152879 -114803 -126396 23670 224382 -150024 34580 -42507 -195154 420519
21939 94781 -77557 -185014 -285736 35216 -189598 -289470 171557 1158 -55153 -82116 108622
21927 74293 104006 -51291 34744 25708 -221422 -126069 -151355 168683 93416 -227176 319781
21915 -16859 64911 90200 -283665 -138012 85748 66095 140691 -130610 -104883 -49015 -151367
21904 -151367 131034 58756 98753 46831 -93102 102148 -16197 -66407 -27867 -46784 -224901
21893 -224901 -73242 138804 -491106 -373149 -85678 -45901 105191 -80698 38772 342523
21883 342523 -172633 -348158 102528 -61382 -42478 -31755 -139256 251201 -90352 -38205
21872 -438 140407 -41141 -44146 -9937 21617 -101315 -292610 -242108 28873 -28394 -51885 -265076
21860 -265076 -156035 197811 -259169 -34951 -225155 6722 -61847 -142566 -431329 103078
21849 -80024 154745 -69308 -117480 -66769 -330888 -60479 164319 154493 -12786 -73171 114950
21837 -62189 -300599 -231373 -3201 30334 -41841 -77008 251093 116756 53840 -128317 -251403
21826 -251403 29163 -49051 -194047 -104778 35340 -38076 -177016 -187115 115794 86695 -9647
21814 -225001 -204700 -66835 -38694 -299940 -54605 293027 -35634 289929 -97943 -41323 -358224
21803 -358224 -242829 -273384 100351 -93935 -120598 -279141 51775 10585 -23383 -18199 -111864
21792 -111864 220378 -203977 -105191 -196285 -210166 196495 -94613 94720 -23744 -127481 -217349
21781 -217349 -135886 -85471 -184849 29475 -188250 124510 210154 -40600 -4497 -230939 -9732
21769 46235 -164543 -1489 19107 -154541 488598 -260672 -42032 -206133 -11334 -30753 -87594
21758 -87594 -269978 173546 -106083 -100069 187416 -134977 249282 -46218 -79827 -225757
21748 -225757 -120448 164366 47979 175104 45994 -44649 360375 319535 -355301 -31802
21737 -185625 79201 -338143 -103745 204540 -11355 386378 147653 -43927 -101490 -37548
21726 100425 -1985 111649 -17242 -346107 -83885 -102815 -153437 -183602 -131755 183668 267465
21715 267465 -51107 -201081 30145 -139097 97175 -145071 -40619 296623 -256863 174577
21704 -57054 91119 -63184 -144841 30833 -376502 55816 254474 -118685 -135226 28411 266784
21693 266784 158532 218585 -71346 -259384 -196566 85198 -258246 -95243 385690 -292033
21682 13678 244375 -89447 22582 44665 -29402 -190834 20331 -148902 -188630 109728 -190944
21670 -56178 -161668 11184 -297796 -79836 86802 233623 -264402 58016 -303916 -287915 -21357
21658 101514 142868 -168469 -216477 -72401 78834 -90221 168804 139079 -214245 172980 -112859
21646 -14197 28304 88795 -50761 -12978 -9542 104276 -302676 -351415 -133814 90051 153023
21635 153023 -180688 57968 8724 -243706 -69147 -99388 176308 -188520 -171942 -135857 -236817
21624 -236817 -318644 168517 -32548 -4731 -281873 -200570 -252421 -203943 -110163 -122399 -71828
21613 -71828 -252469 -44616 -54817 -91102 -237862 -71773 26424 -160506 -222143 102566 -24379
21601 -19712 -107767 -50883 -270297 -50435 -41566 238302 -213801 27099 190029 -73259 -161821
21590 -161821 -49421 -72271 121284 167864 -84364 106021 89331 -118381 97226 132751 -66211
21578 -223673 76780 -130039 286164 -261243 -339811 121741 145669 80670 -263254 341125
21567 -84883 -56774 -222668 -163796 -25723 126963 -20162 86141 76305 -85884 -117521 -17437
21555 -23919 -92754 -173245 445332 -182207 44281 -194965 -168784 133439 -35368 -178863 -169639
21544 -169639 51495 60168 -212285 -279443 -163596 22643 270816 74073 -186607 64183 -116852
21532 -167460 -253929 -110574 157699 55305 183308 41694 -162324 246519 85160 100709
21522 100709 194191 -101841 8235 -77539 -222765 -340098 167667 -307665 74544 -200344
21511 -4984 -62847 22416 229836 -1339 58624 -150040 43995 169274 -597939 -48126 -302589
21500 -302589 -142194 355822 -281164 104637 128553 1199 -206604 166082 -324451 -173561
21490 -173561 -91157 -69171 154025 160651 -141459 70512 83351 190356 -10095 180567 -26328
21478 21237 262751 125789 -285494 112101 -12639 -107673 -263865 2959 -66071 274775 -47478
21466 -43441 -30876 -103665 37219 160677 106250 -20048 104442 166724 -257671 177362 -46050
21454 -215791 -152132 53060 -25146 42324 -135422 -123718 -248836 -204933 73284 183144 158742
21443 158742 -142934 -104938 89025 142907 165070 179005 162510 -16605 -46268 -105021 -63907
21432 -63907 -324362 -131978 33791 -270033 213532 -160764 -274984 433606 -173975 -159717
21422 -159717 -356591 106413 -52021 54478 124347 -82242 173048 -141173 104525 -174765
21411 -128184 -3366 -143886 71117 -164937 -93908 -26095 -260077 -56709 -154166 98644 -52152
21399 34970 90221 78906 60900 -152481 174591 11617 -169379 -164705 -95527 -88360 -132378
21388 -132378 -110944 -91469 -235106 -253544 59560 215032 -368285 -33652 -41393 164412 -298320
21376 -107910 -119056 54944 -182705 -239565 -13574 -284470 -162612 -91489 -85105 -115280 64766
21364 131592 184450 26574 10139 29162 126944 86516 -59674 -71176 -17307 157582 62828
21352 -29922 -77679 105364 44790 -43752 -16929 -220209 212663 -81799 -216955 46745 -100699
21340 10570 99884 -120210 -27157 -135657 -149564 135240 -64336 -98404 23909 -281645 -115219
21328 -115517 -14842 59655 -156937 148655 -40879 -106327 -177435 -118383 271238 -67112 -64323
21317 -64323 -350851 444181 161163 81850 -94585 29232 -535725 -252385 51541 -41422 -335457
21306 -335457 176085 -140315 -273972 -129336 -172138 -285052 15132 -103218 -137413 78065
21295 -67414 3887 262325 -17224 -166 212 -64912 -190653 -126991 -87035 99309 -129258 -76458
21283 -76458 -327984 56121 -86150 19775 -362384 41647 -208713 146454 -87130 -1667 53256
21271 -184059 -131418 -86761 128873 -68906 -42421 -161919 121536 82783 116782 -278311 -120270
21259 21997 -80458 184509 -108471 69275 100470 15584 -380614 40212 47559 258980 -95032
21247 84862 -259785 281552 -134762 19438 79573 82522 -99589 177287 -180983 109354 135911
21236 135911 101904 17770 -272323 326398 -372397 -99155 -51096 159641 93353 106861 140137
21225 140137 26567 -317839 -339690 -193767 106939 -385807 21905 171819 1668 -188234
21214 306845 70736 191550 -108082 153398 -248499 122014 -286751 -116195 69569 -21961
21203 73634 -133863 -247510 270185 127075 -103712 -72712 -72464 -161408 -2913 -115564 -157126
21192 -157126 -9060 158781 32391 -164963 -6600 473 145810 137608 -290848 -23329 -83035 -298066
21180 -298066 -120124 83438 97697 -78204 69260 -169691 -17808 299387 -109844 -159848 -321306
21169 -321306 33946 38210 -102488 -17347 -138800 -173962 -289416 -59517 -119308 -146244 -222020
21158 -222020 -298731 -223386 266689 -302734 201675 75281 321976 -24475 6070 -69914 105562
21146 -344886 -435915 -179547 26528 265927 36924 -36587 -92000 -57893 220645 247511 85128
21134 -108122 -332195 291007 -137827 128403 -127836 210255 177217 -91710 -134228 178027
21123 237544 -117610 181350 133403 -17090 2107 -208017 -101526 256485 200935 49991 -36040
21111 9434 105043 -2432 -35198 109409 -110592 293721 15301 165078 -86262 438319 -5856
21099 262554 27845 -186926 -139495 14532 -83755 -182589 47470 -96789 -124167 -29382 47683
21087 348796 -85161 -119060 66502 -36838 -367482 -364112 -116765 -97169 -95028 -265290 90901
21075 36015 -39775 -318760 -16840 -185706 15964 55213 -225142 -78250 -175559 -112224 -213906
21064 -213906 -294597 -3449 -85774 -394410 178429 -166490 -409347 119302 127070 74679 96795
21053 96795 44551 -112156 41161 55618 -70473 50650 -123984 -138522 -213033 32625 135339
21042 135339 67548 -217393 -151157 -57608 88919 -105950 175310 -167223 -279874 -146101
21032 -146101 155400 104294 57787 95512 -199566 -94251 -77581 -92164 -18270 -116549 -48237
21020 -216784 -88332 -215208 -303660 29064 -11812 187102 -202636 -45560 -41590 -140003 -33385
21008 29301 -164108 -175837 -9629 247672 -143498 324371 42174 74328 433725 4780 -190220
20996 -51355 192657 -106377 -121983 195572 -154852 -93828 -214316 -180864 36294 40518 -176466
20984 203898 -31133 -64909 -8412 -11965 -260108 224620 -205658 -3487 197493 -112042 140979
20972 -269355 -217668 -23700 -28592 212813 -207557 -167997 3257 -6230 185000 80903 177895
20961 177895 44881 131259 12265 -129189 144149 52705 -137685 -91892 -117068 31370 -99598
20949 161167 -37776 -80294 -102703 -19587 331522 -171439 181003 -326313 70233 98510 -104442
20937 -73304 -273246 7999 101989 130035 -276466 212860 -3541 -205384 3855 -253483 169973
20925 -253361 87373 49743 -280490 -134421 -3093 117550 -139258 98558 247258 -170716
20914 -155381 230460 118037 -74671 -53286 -211367 -14688 13559 -87082 -46265 1740 460755
20903 460755 -111784 191339 63326 -14140 -26141 120929 58479 72035 -150206 28348 57866
20892 57866 -179954 -56369 -249677 111883 -297166 -74015 -7245 -266105 88920 65825 59867
20881 59867 -41983 166037 -130815 247652 -90112 161903 -255879 194152 -127346 41333
20870 -113257 78873 -228945 306460 31520 -104336 -463209 -27960 -108376 -27428 -285367
20860 -285367 -283563 -183558 -46451 -156608 -119887 -155048 -120817 -5012 -126601 -41493 -145094
20849 -145094 -79479 41465 -371164 -525175 -175136 89955 -28053 -244157 -91681 -292395
20839 -292395 269791 -188719 90170 -60909 150454 -198463 -42254 -555274 -161126 -109728
20829 -109728 71558 -49303 -250192 255258 63211 -77269 -76894 -71548 -185081 -106385 -52073
20817 81910 -54233 -83380 -224141 203015 4747 528083 76318 3326 -310574 -87109 41405
20805 -196617 -98242 -21032 -182050 46728 39455 129147 250606 160855 44318 65244 287973
20794 287973 150420 37495 -55454 11854 11333 21358 109148 123177 -15600 -464143 -131172
20782 -107071 -263773 -23770 -296871 -280760 -137265 160040 101259 -142185 53027 -35530
20771 83520 -159425 -347251 -49668 71127 -105943 -191464 65843 -228670 108639 147387 -158839
20759 -90096 -83019 -229775 -21008 -171315 101409 -67453 -193734 -116204 64861 299463 -238205
20747 -255311 -312334 -28159 -186935 52345 -87277 -110414 -60506 -46745 211604 -26245 -113
20735 51515 6705 -174201 305243 -33089 93887 -177070 27786 -73223 204149 -56637 -71878
20724 -71878 -172351 54678 -95102 61170 -245838 67503 -241196 -109405 -146302 14312 -167270
20712 169897 115571 -63830 -233640 41303 -186254 -47135 -165871 109308 60659 -138958
20701 -101971 90834 43967 -5110 -219556 -264702 207277 17888 9519 -158913 -266921 -277475
20690 -277475 81781 -32493 -72306 80120 48840 -421950 2390 -147321 108470 81970 124544
20679 124544 2520 31727 -73824 48390 -153379 33428 -91554 37815 -78986 -226740 78334
20667 -35838 -134857 18668 72395 -161086 113352 138547 -49900 46884 -208997 98411 -381022
20655 -47962 250165 13161 -42669 71977 -18622 108522 -5214 -99630 -115592 -231928 81126
20643 -173253 -101273 -188048 -126115 -118350 -15455 66744 90361 -151527 -133964 -62170 331491
20631 -13249 -352999 -217834 -216387 -76378 324609 136939 -97553 3890 328729 -25391 90001
20619 -99787 -54870 -336663 -270576 -102895 183801 -78407 310342 44103 -146268 151067
20608 -229912 -308561 43129 -91592 -59662 119924 -154559 -262873 -319551 118587 -207316
20597 145327 16978 -38315 -279691 112686 135836 -142161 -17033 -299282 -70096 55792 -215469
20585 105890 4521 -373388 -23097 -235253 162330 -22276 -162121 125120 143460 -37979 -169707
20574 -169707 204384 -102718 -83550 94730 -218092 -200547 -80698 -261011 126012 -31338
20563 -31842 -234651 -5666 264332 -414619 -156046 35938 -13530 181019 -91714 -135061 228722
20551 154961 -440250 -40221 -84258 -35289 -177066 -202276 3870 69733 -429974 -203972 61947
20539 34706 -107208 -81833 -305782 -278453 -12498 142845 220664 -13997 139912 -203072 40275
20527 -168465 155428 123940 295242 -75134 185682 -94264 359632 -137456 10040 -54071
20516 -59039 9360 236264 -77767 -106641 -106854 369808 426766 -67962 -142787 -37330 -71048 75903
20503 -66885 -42860 158312 46348 -118635 20576 -183230 89958 -309495 -229389 283507 37995
20491 79580 -154995 -86077 -11896 194305 -143825 -84404 -124294 -145552 -37812 84617 -127829
20479 40517 -9322 -277499 -350471 218431 8534 -387718 -156807 -465079 -22196 -244685 -169195
20468 -169195 -5378 -73092 -190140 -91587 -353835 -32769 -426738 38882 -144903 -48197 -405222
20457 -405222 -69321 -449234 -182349 -276245 -141128 -34403 -61085 66660 -88562 -363783 171598
20445 -142753 277150 -180907 284106 -164295 196728 -249647 369365 32788 4566 -164828
20434 -205610 112064 -335949 -21060 -26001 -229552 -173306 33058 -207549 -33928 52505 -206323
20422 -135536 -99049 -234639 25279 95664 -201966 92362 -157551 -23902 -136159 -315791
20412 -315791 -31820 -186327 -157434 544146 -8715 53955 9775 191938 55796 -143940 4977
20400 156248 -176742 13088 5976 -105473 131223 141804 -72581 -194170 123326 106621 -55798
20388 228301 -201206 245033 1642 54429 296305 79033 -228770 -303155 -67142 248041 149114
20377 149114 -334207 -69493 137192 26000 -149240 -202253 98093 -418804 -154339 -190955
20367 -190955 442195 -526357 -281526 -341949 -90505 -62733 -515 -60894 206133 122038 159367
20356 159367 -24221 -74584 15386 -497797 189587 -248681 78993 -8506 -27012 51366 -1499
20344 183368 121858 -295398 -114050 -21785 283103 -245139 -181678 95964 50167 -124982
20333 -58627 92580 206838 -328429 93926 -226732 -200823 52385 42453 176502 -240642 -55406
20321 115937 -329797 110954 -121264 4443 -54173 -170620 -35223 32241 -436258 -409144 -247606
20310 -247606 -170230 -4991 46573 9630 -130416 65807 -25568 61850 20777 -88548 19088 -97377
20297 -132140 -82833 96914 -148585 259335 -220663 -227901 -224831 -21866 -56568 -57836 -427684
20286 -427684 -147614 -193368 -130153 40714 342554 -160926 100257 181646 -52097 -231253
20276 -231253 138365 105758 -148112 -244842 -226314 -79027 -49689 -125830 61292 241029 -61511
20264 -14160 -164347 44696 -194654 53644 -21498 -215307 54297 -87670 -68195 -189204 232717
20252 -203320 -87998 -269109 -464525 79665 -375397 -206495 264173 -181754 -301912 -95215
20241 -209165 1459 7001 171406 -113986 70633 87419 -121605 35686 56568 -23329 1332
20229 -125631 -47338 -127197 -107829 -235000 -374378 58401 16273 -143360 -184494 -206254 -482668
20218 -482668 -257177 39196 88880 -154992 -90065 -170424 18128 -94062 -378326 357145 252825
20207 252825 -171155 -97968 -25264 59138 -20201 16682 -104855 95827 -100423 88119 118736
20196 118736 -36792 -227600 144975 83088 32291 156241 -295150 226075 380270 136340
20185 71082 187493 -323385 -97570 -145580 -10747 257496 -231876 -156763 -21811 -224929 185625
20173 -64697 54094 -157429 -55896 87238 191095 33598 139584 -9259 -181322 -291633 -46302
20161 -226739 -91724 -220046 74368 99327 -429151 -152458 -164566 114041 -98276 30507 171075
20150 171075 36270 59507 -133214 293742 -154814 176797 92255 193691 -2325 -3814 -141171
20139 -141171 199452 344786 409579 -194381 -50680 11214 -8043 223339 243158 -91045 42380
20127 42597 160355 -28052 17440 87812 -277261 292007 4195 -400450 106543 -10708 139777
20115 22852 -110773 37348 -168040 -135759 166512 -137450 1697 26289 -285027 -4108 -249319
20104 -249319 -89903 161723 -42472 39016 -258620 -192079 -66154 81341 -102990 53496 314350
20093 314350 -137625 -254704 190473 -353932 -161578 -92411 -178628 -332575 -100258 236551
20082 195264 -150564 -6352 67494 49552 -123163 -18884 -76721 -168742 160647 41301 -318895
20070 -184090 -78663 -3728 -98377 -152507 103997 60024 -329322 -173699 -151240 -131502 -69665
20059 -69665 -225490 -47498 63433 -384334 160192 -174843 -155564 -58104 -220880 -159651 -8839
20047 105995 -206336 -362514 -125974 122394 290293 96590 -503667 -108846 -163884 68004
20036 149130 -214378 181097 245712 11303 -204506 -106844 200372 117323 32556 20380 213291
20025 213291 27426 -160238 83695 97280 -227394 -230129 20001 -94300 142993 -69141 -173862
20014 -173862 -150177 61364 27709 -367755 -118380 162781 170170 -395013 -228259 104352
20003 -5032 -60449 -25142 -141940 -58735 39179 -72533 14020 -83340 -89022 -372255 -11330 98144
19990 -106375 -7789 -118847 55629 -95081 -103856 22531 227614 195076 -91330 -194176 -13201
19978 175471 -263229 -50139 16346 1297 111208 -61508 -124533 23586 -277539 -79806 -45664
19967 -45664 -155939 310095 8457 91891 -150397 92854 22057 165848 43642 35228 89536
19956 89536 -163862 20360 11013 -339197 -127481 40900 -164937 -142529 -93426 107216 -170644
19944 71440 -243927 120880 16348 -202505 38967 151568 -130569 -66033 -141342 -188292 3818
19932 -289855 39422 74915 -336619 390755 -157747 -535042 -91289 -348074 -85757 196883
19921 183240 -202143 -215424 -240419 -485942 -306320 -24531 150457 305917 -235665 110926
19910 -177384 -97246 -138206 76903 -389487 -35283 -111398 -12114 -43288 181622 -228121 -200457
19899 -200457 153178 -67438 -105951 -37137 -201848 -36057 -89500 -160628 13904 -57140 203087
19887 65998 -5640 -116958 30390 46038 -172344 97486 -281486 -201597 -150814 57804 -37011
19875 264736 109307 -4046 153579 46265 -37540 -124719 37873 65583 150336 -212035 -153057
19864 -153057 -159217 -94737 -262642 -420085 59261 234390 86975 -91611 -67400 -6790 -217452
19853 -217452 -387193 29447 23213 -12664 25229 -173079 -164055 -2753 -150178 111820 -94958
19841 71413 89752 211613 -268656 -164537 -54073 39510 -58447 -26368 12628 -191515 233058
19829 -101029 -68154 -104005 175527 -51329 -149513 -183860 2693 -90560 -161781 -279687 90809
19817 87331 12250 -66015 39076 173393 -261393 -56854 -49792 -195929 -123901 -36349 -325940
19806 -325940 91295 -91443 139905 203425 50520 25999 -223928 -74516 -68558 149103 -250205
19794 3383 -492771 112482 221614 -89852 -16602 -202365 -84082 -130027 101000 -23672 -111238
19783 -111238 149735 137853 10781 167878 -400362 -12193 -339541 -176292 48187 108928
19773 108928 -337064 63182 191892 -323805 -223566 -39693 -67398 -113984 -5244 -82247 99509
19761 81945 26195 -82201 31951 328123 194045 -137115 -53620 57287 -141022 196245 108233
19750 108233 -23952 -190259 -399146 181707 43647 -61411 -102796 -24590 214800 -522721
19739 34287 38637 -217978 94324 -54711 -136402 -285612 236556 51109 145094 -41322 -280966
19728 -280966 -122151 96115 99343 179556 -131626 -193291 -261708 -36239 298766 92653 -108131
19716 -236184 -25722 21833 -200535 -147584 -8281 -130372 -154302 68169 -51967 -261140 126401
19704 -252236 -355363 1208 241159 62257 10255 -276794 8380 -13827 265907 -197019 296037
19692 -239512 -114322 -21738 98029 16939 -141292 -401632 -221309 35294 -104027 -345703
19682 -345703 27882 56514 -210309 151223 17452 26989 -85333 142418 -77300 40168 884
19670 154082 108053 -168078 41721 -81442 222824 -212766 213164 -135014 -118105 19089
19659 27930 -14734 281001 -9352 -64517 -45207 193628 92748 -73595 -281778 167449 210502
19648 210502 -60292 30018 -111058 -447508 -2505 79100 27159 -250119 -231417 -106409 -179401
19637 -179401 -127635 -142984 169114 -387064 -281625 -4793 -174844 343486 -151448 -294529
19627 -294529 -141792 -127001 -188873 263389 13595 -88250 -350769 -49389 64634 -43801 35020
19615 -203260 -110995 95370 -276734 -171957 120534 -34368 -113343 -230834 -102009 -49234
19604 -171432 -248417 -122985 246955 -17818 173287 100432 230053 -110505 59893 -48105
19593 -94773 -66711 -190449 -62488 -79899 195448 40774 -263192 115013 70426 -83836 -94868
19582 -94868 -8555 -46887 334795 -179783 -120362 29524 311686 33343 -227120 366851 -17816
19570 134648 23762 -113338 -271315 169451 125013 -70923 66018 -36758 126464 -5386 -34062
19559 -34062 -168875 102778 -72266 -134043 153526 -183149 -210090 134514 130105 39443 171603
19548 171603 -11425 -331694 -169602 -126233 50362 -61758 23599 -106662 196916 76753 -162465
19536 -169285 13200 203107 -96135 -66180 -63565 -24121 37128 -90023 -253299 145033 -53576
19524 -137076 -2878 -204704 208402 -357848 106841 -139167 -181773 -73702 86976 19868 -77487
19512 -170332 -13208 50807 -129729 64654 -287429 -119621 298948 -362235 287438 -39970
19501 16230 51302 9630 184132 -381616 54905 -2242 -52586 -252528 -365894 -19945 81475
19489 -166335 118346 -12493 -416969 -145836 4630 38301 42382 -201203 -248162 -126128 180155
19477 -63925 -259703 341 -58524 -47527 -91519 -147101 -38712 77371 -291628 -47590 -77160 45948
19464 -58118 -65869 100768 -76194 143461 188581 281222 181966 -10295 -167192 108772 -124244
19452 17323 -66247 -18229 -30464 -17461 16862 -192468 113312 -84851 160264 -232775 -205148
19441 -205148 271997 206199 -222191 -39651 -347766 -75449 94025 -146821 -8996 79126 -184984
19429 57144 -336040 -89791 143285 250115 -306480 124991 -227274 221700 -25266 247006
19418 -120338 54901 11879 101805 -180546 -278213 -366637 -44377 271889 24563 27754 -11722
19406 13163 35734 -142689 -4117 -12197 26214 -134143 -203942 39042 1419 -3684 -2247 11293
19393 52775 -53491 -247015 -154047 -78479 117194 -50345 181311 260923 -209677 61557 -220151
19381 12786 -309258 -168340 24754 175225 -138691 -164836 -234575 129472 -57814 -50686 -34346
19370 -34346 -73691 142740 164759 -138584 -107971 -44919 -4339 16846 -192316 66630 -158125
19358 67328 -135937 -94656 -90708 22783 9528 -388513 69629 -64181 210447 -6590 -270026
19347 -270026 -313646 -18532 -203303 -122711 -331412 -89752 -99938 -163876 -264014 -154419 -156712
19336 -156712 -13389 220342 83799 31340 -16829 179598 -47008 130900 -312235 -325382 23144
19324 64489 -109716 -299690 -192979 -184290 -140713 -277820 -73201 -46326 -183737 -30175 143910
19312 40850 -29789 -55512 131987 72775 -26161 -129608 -307664 90087 -13932 -215352 -20087
19300 -314845 -36605 -128253 213094 -359482 -121554 -75002 57991 141039 73859 -209208 -14340
19288 -8208 104697 200568 202179 -198048 38282 -171022 95581 112848 -286418 104918 -8257
19276 -191802 -267509 -28156 33156 -190684 -89377 2031 -327503 -46949 -38555 -94857 101203
19264 17051 -143540 36530 101506 -107163 22036 64891 -225371 -385978 26188 -132608 48725
19252 -9557 -231186 -161956 -455955 -78899 116715 -31593 -339407 -211112 87327 -22586 -74775
19241 -74775 293314 44240 -456764 -98851 -205209 32815 230465 -22814 114257 -119867
19230 -282026 -254820 11436 -219623 -61139 -17672 -279649 -133546 -39226 -167590 -392135
19220 -392135 -253475 -189144 -92444 -29268 -331976 118579 6007 -144559 177175 -130909
19209 -101909 -53920 -26474 181692 35651 -133618 -60822 -79321 264132 -116724 125419
19198 7277 -103893 29584 -250807 209725 92726 104486 157927 -307377 56375 77921 -203552
19186 -54866 147312 -183481 88869 178426 -257104 -4300 -106673 -60234 283337 -297103 193672
19174 125197 112671 -169571 71723 173428 -81077 178008 -118891 174091 -147219 -257933
19164 -257933 -26613 -215839 -138649 -57753 -88182 6785 -42295 -95469 -388478 35284 -37753
19152 6629 -326086 -206168 -74038 -267682 -227182 54199 -322741 -67840 399801 -127811 -176474
19141 -176474 -89134 -132909 143561 -182887 174329 -242104 -282831 32265 -75401 -1864 274585
19129 -114248 134054 -329304 -47526 77855 -27425 224747 215826 -177897 41990 -79258 13231
19117 -56457 -95282 -120974 41821 205231 -7599 11579 148390 192465 57021 -115650 58682
19105 -374852 124039 109720 84374 -70632 194339 -225982 -117473 18739 206427 -2609 -82352
19094 -82352 140827 -210161 -426134 219391 -95877 -3830 -179363 -421986 205565 329940
19084 329940 41751 -190398 -186010 -310 260402 -36950 -59838 -158196 -69265 -231680 259371
19072 109021 -108954 -60875 -46558 -110729 -97128 7339 244531 -211551 -206276 -136996 139367
19060 -30927 -100810 65425 -274222 -199048 -187426 -208242 -147533 -113884 -15379 179139 -274791
19048 126010 -10700 139801 -196675 -141505 -225107 -172019 -68277 72599 -70010 -78627 96829
19036 -92117 188956 -63071 -97378 163320 -12548 427283 328220 63606 79875 42713 -18199
19024 92422 386500 -162769 -36087 -18414 -134994 -198889 126916 273748 -167909 -26418
19013 -261618 -74225 176050 16506 298016 150858 -215558 294582 222430 269430 26847
19002 148276 -36450 -282900 -141644 -132826 -147429 -128675 174178 -192477 9017 -223903 -122660
18991 -122660 -33173 9093 128570 -50614 24825 355192 -266474 -175228 74078 106944 -202344
18979 -94463 29887 -223676 -182850 -13476 164108 37428 -265666 75772 -46384 -4802 -111598
18968 -111598 -231202 -54593 6211 115130 -3509 -191571 8288 -46603 184279 -176856 293147
18956 -172217 38756 75232 32767 -107596 -199952 -77202 -10750 -192396 -415634 -112046 -20028
18944 -30143 -6535 120399 9357 179828 184605 -65072 -122018 100786 -9667 -168156 135496
18932 129165 -224412 -412032 49534 -137303 -110205 18429 -225269 -109848 143354 -26047
18921 -163324 -158073 -155630 -48180 -29459 159772 -30587 -32617 -79321 106107 -260750 -164407
18910 -164407 -202725 -118958 25840 -13988 41012 218931 -102503 -252758 -357622 33365 122995
18899 122995 -316653 -174153 -25684 179353 -92705 40952 -24071 -30669 19739 262815 -52050
18887 163145 244077 -216060 26353 -11169 -66995 95033 201916 -204457 -70329 165141 -229504
18875 -62282 -212418 7718 60462 -167126 -520605 -40076 -373782 -251253 -308045 -264193 -138287
18864 -138287 -99481 116084 -186365 -76919 39153 -308390 -398474 -74006 -212709 9877 -147627
18852 -120420 -11079 160070 108025 -55847 -64882 -88032 -258153 -178300 36221 -225747 167020
18840 -28105 -272438 -209253 -220384 161623 110292 -153695 -53399 -255725 -339219 102288 5352
18828 121321 -286923 -96539 231724 143124 59177 -77774 99422 274082 427175 -22866 128992
18816 -66100 -167893 -158646 271102 243786 -85912 -30693 -74025 148712 -219395 -111252 -165829
18805 -165829 210505 238448 -76664 -45057 -75414 -17830 -248006 -157231 -314353 -80430 -125613
18794 -125613 -88372 119359 36497 -10035 24931 20538 32240 -171804 -301475 174831 28021
18782 -114261 113144 -117305 -122762 6411 -5363 -51667 -23933 126728 -239588 -197443 -6541
18770 -200668 288475 -214130 -234452 -160742 -216211 -358192 -158531 -96448 -263455 237957
18759 -23848 151221 79852 -74332 -1923 -107002 -83544 -12628 -311781 -91141 -7697 -131705
18748 -131705 78758 -219182 42979 -68427 98100 -70576 14773 -162795 137178 -37534 -318260
18737 -318260 -330712 219405 -165163 303459 224812 -261862 -178594 -89818 -62735 74428 -339294
18725 -215127 296257 76891 -8065 -28076 -147484 -200454 -44826 320912 -235842 -71214 84553
18713 -121817 65562 377173 -41032 -280292 108114 -59313 414389 -7291 -116961 -37676 199597
18701 -312308 102329 -157120 -297309 -277816 6582 101860 152735 108102 -146988 -318635 14769
18689 -107006 -365530 -193941 -79710 -108609 -82237 323691 79515 -309968 -20922 -352283
18679 -352283 -275391 -14023 -234137 -99737 12708 138559 155738 -62430 -233044 32276 -187355
18667 102425 -208310 -214183 -106205 91819 24023 53222 147145 227448 -117625 -176841 49844
18655 -197737 -149565 81359 78202 317654 -168811 370770 -155890 107382 -392824 -119184
18644 -75011 -307915 122340 121677 -1238 -22845 19343 -21690 13582 47100 101062 74935 153700
18632 153700 58308 -269687 39409 -83870 -94721 159818 -70905 -214361 -189991 -89771 -303797
18621 -303797 -24293 16952 194778 -41762 -166315 128003 32443 214283 8743 163285 -261685
18609 -454614 81813 -21263 55623 -398401 -134630 187016 -100699 -224333 -179007 248466
18598 105317 220981 -15980 -16507 181249 273182 -174560 -117079 -139724 -11575 -156283 -68247
18586 6094 -73930 8420 190079 12530 -371474 -10065 -203771 -249927 161083 -61234 150684
18574 -137430 48139 78503 -57290 -279863 131745 -47293 6929 -50217 -264350 -201657 48750
18562 68441 -141861 -114917 31266 11249 -164836 -354309 124680 -94696 29300 -35379 -188768
18551 -188768 -311880 147281 -160150 -154612 238424 -144784 -198098 266911 -238387 -249403
18541 -249403 -206866 -312313 -261735 265868 43374 -85193 -49161 69760 -37880 -105636 -340067
18530 -340067 -448408 89719 -213291 -69404 -338183 -63525 -118629 -63441 306810 -166869
18519 117665 -695518 -79743 158258 -126934 247822 -202915 81030 5236 16194 57027 -212910
18507 -182820 -94797 -31192 -19036 161776 396457 -39524 -90476 -59620 208705 -184036 191784
18495 -44226 -180619 160998 -137009 12147 32457 -193802 -92528 54260 -267939 -140233
18485 -140233 162224 354164 -189335 25216 89621 -172861 178933 313940 -19123 21011
18474 -108370 36825 168899 -75389 -159579 215323 102611 -221358 68355 322899 -93693
18463 -388770 -75981 205693 5259 69086 56655 -25384 -52943 -144035 -74216 -17703 -53797
18452 -53797 -99969 -116648 -314804 -94742 -58815 -101956 69531 9292 23681 122997 -80810 235708
18439 -48558 -116367 -316123 -267965 -12352 -72953 -199041 -6894 59472 298336 41855 346264
18428 346264 -59502 -151271 74614 4852 -123562 119647 16361 225957 154122 40186 197401
18417 197401 214019 -22958 -162546 -45686 -78108 -199582 21128 117891 94432 -180329 -152239
18406 -152239 -106424 4396 95162 -128065 101824 -16917 115134 101801 -68389 200218 129578
18395 129578 -63668 260910 120102 -54874 -149556 116008 20593 -315602 229684 -158090
18384 88681 83748 67378 106561 305451 -102684 10027 59567 -26015 -76138 -305387 -142510
18372 -85166 -28474 -382542 56140 264150 49570 -103712 -137918 2444 193051 -31531 -34877
18361 -34877 14273 -99661 18712 60860 108695 73785 -336453 -240367 20894 -374139 17261
18349 213672 -187406 -123653 -320916 92999 -71618 186439 93175 11062 84594 -184591 -66173
18337 -203260 31830 -8197 -267973 -8351 154863 39943 -60341 176893 160613 -28760 -287590
18326 -287590 -440332 54582 75820 82187 -274749 -185157 16250 -230268 -432979 66328 -42857
18314 -103870 -120236 -58053 -81745 164581 -51279 45648 323481 155710 -37825 -52958 45733
18302 18235 -81130 114544 296614 -278364 -237734 256886 57335 7273 46900 -77730 -69597
18291 -69597 -200744 52446 -314784 -173217 17651 -200654 -68890 -105861 59036 29052 -111979
18279 -73516 -174945 -22554 -84799 92862 189832 -32074 -67892 92661 -299891 78198 96250
18268 96250 -128434 179387 -55465 -100129 105447 -68380 49453 -454420 45406 125347 -37341
18256 108623 24148 23736 88774 -173396 230021 -163175 -351898 77508 -273418 14193 60806
18245 60806 56231 -69890 -217315 -149387 -216333 -45933 -435062 -13645 -50741 83213 -60191
18233 54215 131827 119540 -451979 44833 -42524 -38202 -84867 37690 341594 284461 -124015
18221 -21065 17590 157107 -13045 -4697 184837 2036 106747 168703 47134 110067 79923
18210 79923 -266061 -78889 -93651 -93080 -211192 54902 72791 -58117 -145243 -312004 -48411
18198 66012 -104399 -99709 -11929 -53888 -262695 -248943 -409206 31679 -116059 -124584 250403
18186 -79769 -31174 -142097 118015 -87531 -84325 -216351 170084 -226031 198544 -27142 208341
18174 -268588 -126305 -23436 -345343 -96269 -143661 238128 191339 -42947 47820 -23580 58794
18162 -64819 -126925 -8043 -159349 -30426 7049 111921 126796 -30648 -196871 7150 -62620 -163635
18150 -163635 87094 37868 131489 -115996 -10940 93577 -2979 -241518 -71144 -45400 -145601
18139 -145601 -89860 102636 14838 -96921 -129618 -66560 -61632 -69411 94525 33245 21968 271231
18127 271231 -22763 205000 -161126 54513 157737 -70434 143724 -56152 27671 -79073 139300
18115 152164 152911 -6234 -19075 94132 75852 189771 -67666 -18151 124100 1784 -43067 -203166
18103 -203166 -68398 129179 17880 -171099 -17665 -174427 -348725 -303797 -402916 23597 25939
18092 25939 18396 73505 209223 112365 -144188 -4456 -273704 81682 -101641 -317023 -155744
18080 -130002 -78881 -116925 246027 -171899 55371 75818 -162840 -235928 149472 153623 86699
18069 86699 20151 -291564 293644 33854 310505 260969 170580 -20103 203870 97008 -35064
18057 186874 34472 9638 -86437 21931 -205374 -36464 66444 205872 53843 -148508 -117954
18046 -117954 -84317 9036 -238319 105568 214349 -56811 -17249 -228390 28962 -211590 82997
18034 -223555 -238255 168577 71126 -18824 206163 -248859 -37622 -135454 -78155 6954 -124628
18022 -91571 -93963 -217423 -280536 -272788 163655 72768 -57426 83993 -183616 -180364 260234
18010 -93229 161956 -368144 94924 13135 -323427 -117407 356552 40654 27770 -96888 -105066
17999 -105066 33121 -261432 61312 -139396 -108244 175303 -66281 -155529 33437 -918 -86319
17988 -86319 50756 16403 275726 -10933 -206340 196365 102657 -353506 45511 27206 13370
17976 37728 94406 -8825 72970 -22782 318656 174351 136362 -172296 152480 -67972 -161708
17965 -161708 175641 -65899 -1659 -8991 83812 200126 188948 51703 -81807 -227806 -244956
17954 -244956 -124368 -319020 89764 -55019 50829 217860 319798 -8478 -4830 80735 27368
17942 82448 38561 187406 -55387 199718 -388760 169609 -366506 322567 309829 -41468
17931 45098 -99366 12874 21095 165974 -116395 42644 66599 -97749 68687 -166678 57851
17919 19297 16271 21235 30382 38864 -114600 89348 -152519 -26364 -103916 -274617 -90734 35831
17906 -185703 -344108 -40592 -68935 -162999 -95675 5382 298937 99798 109283 -162012 97249
17894 142318 -38958 -152563 -76638 29786 211384 95802 59866 -191827 34466 -182991 -30554
17882 -130946 290379 -72436 -123308 -371239 9289 -40427 -141441 -63656 -128499 -177225 507591
17870 21489 -56418 -83844 69973 -61413 88755 196438 108062 154509 -145685 319998 -159222
17858 -33831 120271 -123256 -44734 3616 -180251 -1163 -92347 -213320 -273299 -135031 -84696
17847 -84696 -29599 -71183 395986 -99099 -6721 80283 -77933 -93672 259623 161279 -122361
17835 117718 113271 25364 -95940 699205 110958 248487 -6675 -58494 51494 -19225 211442
17823 -121095 113084 -80611 -291665 302822 17323 -168357 -32654 151116 29901 80567
17813 80567 179970 27548 141637 -405078 -131037 -174141 194148 216223 56336 -10143 62241
17801 -48987 394394 146627 -124518 -10085 238397 -127791 212339 55475 -115413 -21812
17790 75993 -170276 124545 52185 -35937 273641 87957 67175 -200098 86186 -178446 276
17778 67918 -82009 154071 290116 58192 -131294 -308427 299765 -55976 -180694 197737
17767 -40725 -24109 -55567 -70357 50437 -215610 16817 205021 53806 -252401 5510 -5724
17755 -98467 -43970 221784 328456 -20066 52150 167248 -166027 -2652 118188 -274218 -190548
17744 -190548 245006 -74379 67596 108713 -6677 63347 121806 279603 -57465 -264135 2596
17732 69904 -35329 99187 -168806 313297 57998 4616 237851 221262 -30559 -17893 63169
17720 57141 249573 -135365 -29107 288594 141960 -62937 -165934 -308529 64771 -62567
17709 -112048 -123528 116104 411318 -149872 94134 153729 -692 85667 -240973 25159 27206
17698 27206 159628 -46712 235458 33341 -271171 32411 63019 -52848 119075 57798 98540
17687 98540 -137366 197703 -240111 -132161 104365 16272 108569 52609 220589 130790
17677 130790 57623 70668 -170786 -124384 195353 -10815 35491 -43285 187735 -30889 190050
17665 -66573 543778 430426 5925 9973 274861 190625 -285657 196540 54685 157503 397365
17654 397365 -37628 -59829 -70000 -17107 -67136 135916 94279 -241327 47797 -58326 -58427
17643 -58427 267642 33115 447290 -14110 -181882 -136413 170496 124367 202526 -56811 -215393
17632 -215393 113866 -95245 668 -305680 216627 41821 -155217 29042 -179857 -196826 -125694
17621 -125694 -26981 -16638 -222367 -102527 -31936 362594 159559 108522 44876 218985
17611 218985 -54401 -50690 224263 -39976 75565 146540 199658 294995 47197 37942 -65698 -185783
17599 -185783 -143094 214046 132172 -164093 133067 -178842 514341 -89588 107793 57707
17589 57707 -163205 69063 -6957 -20767 305812 -163228 20420 185576 193997 -66052 -89204
17578 -89204 -15365 50963 -29295 -126237 155904 121035 -114550 -27311 9145 25492 -160742
17566 -26870 469687 -146518 75878 187047 201539 106270 282199 61697 18834 -39689 69601
17554 68318 12400 -71573 -68405 -35940 -69741 58083 -3440 -38323 28099 -47851 156916 -214331
17541 -123226 -87610 -24573 105986 241778 47988 -2775 24970 139341 -178400 -121761 224830
17529 -91614 111745 -115414 131407 -49004 24709 21091 -43404 15837 -44841 24110 -71262
17517 -4924 144289 158311 86380 163164 34056 177337 138049 -14771 230899 -88412 -331022
17506 -331022 108202 244825 -30345 122206 -108613 -163525 102396 165628 122026 338801
17496 338801 -20598 -32662 -75658 -75697 309050 194680 115919 174040 -83937 227959 118610
17485 118610 28235 63038 233219 -155732 -109654 -114341 298887 109368 -154145 125163
17474 53555 -376664 255090 223176 39791 237849 200640 231863 461755 188902 103991 -63315
17462 219240 86214 167114 -179386 142954 289854 320303 373583 181117 249090 73775 242537
17451 242537 -74354 348594 -182700 144183 316644 272689 68443 101836 357017 124067
17440 262334 54460 434044 159052 118986 57563 275862 201896 376121 -134953 -82705
17430 -82705 553751 83515 185010 302438 163155 -54281 333391 384921 199462 415233
17420 415233 180328 268164 -211402 293170 39309 432162 124346 206707 156537 351353
17410 351353 138385 95006 -79945 93929 -250284 -41059 67379 -21174 -57532 64346 195726
17399 195726 -33959 394494 240928 270811 234953 155729 -11203 171556 -105737 240368
17388 283643 100209 271712 47164 263995 148399 251637 427919 357275 -150040 -60787
17377 299228 449897 252837 40516 4644 10231 -15902 258470 335791 282636 296330 74594
17365 357711 432280 120846 296201 173479 -51604 270065 515755 -109872 162496 62647
17354 115231 157288 428256 145265 -30137 246380 -75398 84926 -100606 281529 288643 327406
17343 327406 271402 341825 376966 162513 114176 654857 34102 69976 508468 -67989 81647
17331 204564 122787 197724 -86635 251465 534147 387878 348247 223983 304543 -61604 307230
17319 179510 201415 334599 -44778 -151511 278837 148568 499046 133508 242478 119941
17308 255785 144617 150218 113321 157573 135976 359945 163456 181196 192208 40889 159040
17297 159040 300772 482834 180426 346166 203585 -68370 30100 126464 311414 165207
17287 165207 215406 -63013 -32337 169887 106937 373249 392625 537591 232631 466313
17277 466313 409487 51122 77378 460020 171222 -39950 91774 148241 270718 62060 180112
17266 180112 174966 317780 330457 257205 47120 225654 40959 138216 232271 -15817 268847
17254 236827 167640 436502 636581 276322 299905 44431 393377 229101 241251 238249 345179
17243 345179 127883 137385 34561 407696 275328 546993 248375 163163 127865 338517
17233 338517 648181 304755 269233 485712 266456 459069 161667 524774 139129 305297
17223 305297 480744 336322 251194 104837 339629 272447 155634 161848 -63971 356700
17212 265144 394416 311916 356066 158845 359065 173876 61975 46014 368636 331525
17202 331525 307609 447337 295503 270310 273340 300717 661795 464455 348851 111874
17191 349250 68243 137962 297462 210903 267679 -42807 356135 258313 256446 90655 264702
17180 264702 308497 294574 400938 575205 616514 474079 360858 318092 316245 571614 380138
17169 380138 122036 47364 70173 581730 43507 100299 207406 146825 314385 394686 89923
17157 188017 354407 524860 428505 229985 529007 365797 211264 421569 599298 238513
17146 582352 323732 708306 181088 379680 642959 190117 493433 201666 417641 399972
17136 399972 575163 470885 489351 293889 260583 425230 445049 411320 336104 428927 396672
17125 396672 386213 432037 431890 550359 346211 446029 571596 255483 235431 391740 417647
17114 417647 492571 443834 501600 582486 353898 475476 450512 699074 306200 520243
17104 520243 217847 246356 233239 459606 560765 684421 858995 467794 421156 621646
17094 621646 320708 385481 706079 569017 604687 712194 340832 591571 469507 658980
17084 658980 345611 617928 249874 740815 704703 526400 721629 612623 753963 611547
17074 611547 736211 502464 607338 554239 709250 719081 511629 692485 401179 648680
17064 648680 465523 543330 421789 1057227 707753 595375 819053 619079 442808 710673
17054 710673 820912 914166 771985 610529 628405 675152 556944 700458 778299 599614
17044 599614 574092 777047 520874 589751 755824 588412 420732 860823 613778 729573
17034 729573 786403 825642 821319 754141 1069325 677323 819369 755851 648409 583363 761129
17023 761129 923291 630974 866290 771467 1147911 948360 1270642 729779 1191049 840744
17013 840744 1212175 610478 786980 959437 858771 1143023 902312 997606 1015033 966832
17003 966832 968088 766370 844281 839693 775866 998045 976536 1311831 910821 1031930 1063825
16992 1063825 912328 1226927 1360591 1014549 1011383 1185241 1095503 1170694 1276390 1304298
16982 1304298 1084944 830729 1317639 1201966 1154829 955671 1286290 907460 1035509 1366773
16972 1366773 920186 1232261 1525560 1359498 1235270 1341057 1294934 1292009 1229370 1132668
16962 1132668 1320200 1094292 1489291 1508080 1187046 1271138 1368245 1212900 1445054 1343092
16952 1343092 1701197 1298565 1327199 1709475 1614793 1520223 1563347 1476129 1424119 1636335
16942 1636335 1546773 1945850 1584090 1695821 1752473 1661482 1362968 1699726 1750675 1657836
16932 1657836 1729584 1795904 1689697 2017088 1681172 1488241 1616725 2053078 1479771 1790769
16922 1790769 1797398 2045212 1919230 2087469 2177832 2062961 2213658 1809665 2131568 2081526
16912 2081526 2023696 1856491 2001889 2407229 2254116 2317140 2422572 1993859 2193528 2407948
16902 2407948 2309528 2387686 2510928 2483075 2283071 2310673 2457253 2278584 2497824 2700929
16892 2700929 2696209 2787096 2717523 2903717 2912597 3142469 2681556 2789916 2803679 2976258 2904740
16881 2904740 3068725 2944060 3096095 2905118 2980321 3226703 3367047 3320690 3423418 3610861
16871 3610861 2971403 3336803 3288928 3574127 3550089 3553494 3546288 4066737 3731050 3979811
16861 3979811 3717879 3970262 3821544 3859538 3912233 4227561 4349098 4531000 4129546 4453183
16851 4453183 4602322 4538467 4446739 4872825 4528682 4724304 4942211 4776423 5358719 5060311
16841 5060311 5085306 5166373 5201978 5370667 5491872 5717293 5687605 5597944 6109705 5684885
16831 5684885 6139523 5899627 6317886 6458152 6692019 6671636 6800696 6861891 7070779 7371443
16821 7371443 7475646 7519671 7591775 7806660 7978943 8254472 8326114 8546995 8616526 8750342
16811 8750342 9063631 9362665 9112094 9581030 9723126 10089597 10259835 10104498 10767739
16802 10767739 10540959 11094301 11248239 11231568 11830743 12239177 12399189 12816731 13106293
16793 13106293 13245474 13302534 14048434 14204533 14402839 15098353 15241075 16073873 16164753 16452180
16783 16452180 16954684 17383533 17922330 18300206 19285790 19582337 20191728 20680994 21225821
16774 21225821 22275549 22609881 23528936 24168023 24860751 25880174 26200976 27396636 28459207
16765 28459207 29066606 30262391 31230756 32501617 33250312 34499888 35874706 37470306
16757 37470306 38562967 39644439 41097996 42906543 44750559 46038480 47846540 49834037
16749 49834037 51858663 53683349 55824466 57882420 60402450 62889442 65159762 67562781
16741 67562781 70397838 73053406 76150528 78671946 81998984 84837808 87828367 91207475
16733 91207475 94100838 97229972 100648309 103370090 106586480 109406066 111806077 114471541
16725 114471541 117184997 119053755 121161224 122395598 123861803 124416976 125131746 125245098
16717 125245098 124851347 124682979 123638817 122320776 120614336 118852763 116796074 114178827
16709 114178827 111699211 109124292 106171506 103113039 100208846 96993117 93836764 90401658
16701 90401658 87496972 84563634 81751221 78233619 75510580 72836026 69876771 67357541
16693 67357541 64596485 62419790 59801657 57627484 55510359 53610157 51467262 49481923
16685 49481923 47729163 45693797 44014363 42288585 41120274 39546038 38260009 36801063
16677 36801063 35472881 34052632 33064939 32032893 30706121 29785601 29005980 28393437 27058484
16668 27058484 26349014 25335980 24560161 24057103 22922031 22703224 21888750 21118050 20384165
16659 20384165 20010644 19766786 19289822 18221760 17922211 17490366 16957955 16336475 15584352
16650 15584352 15697893 15411495 14660502 14472481 14284851 13893888 13255965 13168146 12684040
16641 12684040 12526104 12388840 11936233 11912512 11498317 11347961 10893432 10712522 10199443
16632 10199443 10268583 10334664 9781581 9525516 9665313 9557016 8912375 8595688 8539779 8460223
16622 8460223 8509413 8281682 7744019 7728941 7776648 7534517 7251000 7288103 7132762 7371175
16612 7371175 6817227 6838740 6807082 6503187 6222976 6727087 6252746 5987286 6031524 5837793
16602 5837793 5864019 5783354 6140578 5857666 5721335 5476969 5196537 5119162 5157167 4855932
16592 4855932 4836466 4602713 4751320 4836408 4410611 4845422 4378818 4576192 4552580 4233383
16582 4233383 4400111 4233185 4085366 3726607 4053870 3779622 3866493 3537231 4066980 3713109
16572 3713109 3654183 3725836 3576586 3323904 3641286 3610572 3594045 3366563 3249528 3679073
16562 3679073 3450723 3269729 3258036 3207721 3077287 3014223 2885352 2813153 2951718 2821073
16552 2821073 2901991 2922690 2565633 3250825 2779888 2970556 2560226 2703571 2687593 2820910
16542 2820910 2884705 2234302 2200027 2515050 2516363 2544270 2228410 2372368 2117589 2392179
16532 2392179 2245582 2092082 2632619 2041333 1967877 2545876 2278348 1998861 2228863 1994959
16522 1994959 2461142 1813954 1742588 1831780 2083593 1706248 1929974 1998440 1823111 1963936
16512 1963936 1595082 1973930 1852056 1768715 1822503 1534073 1695101 1830473 1568285 1718169
16502 1718169 1642525 1556713 1708795 1508287 1740350 1776680 1786495 1648219 1653076 1628222 1645336
16491 1645336 1477998 1530415 1555702 1503448 1242576 1443695 1403281 1619004 1414343 1283248
16481 1283248 1582467 1349882 1476767 1457435 1007329 1286973 1627621 1284489 1255171 1156216
16471 1156216 1154060 1113780 1587607 1171229 995256 1444138 1432816 1248254 1377664 1338209
16461 1338209 1383380 1176111 1657491 1138300 968932 1007956 1125974 964701 1324531 1080198
16451 1080198 859871 1034864 947712 1377328 1154299 1037416 1121474 1075286 902934 1135661
16441 1135661 1300154 997063 954933 731689 927445 908446 750142 807102 1353990 1027713
16431 1027713 992339 891253 819539 864452 892025 1029944 969379 966959 836057 1024340 1007991
16420 1007991 867801 824649 747664 1081100 869595 592441 895773 821857 832252 798587
16410 798587 819365 749203 847530 834706 770537 665436 632815 559215 988707 657385 943514
16399 943514 925970 866675 652971 592602 779431 937157 705640 805081 789033 833327 482966
16388 482966 582620 701539 169537 544112 492734 352422 754187 331969 779359 817736
16378 817736 736008 741970 301062 652467 609133 751781 426326 522902 907684 532724
16368 532724 442415 536029 422816 560873 520306 653597 712535 641286 388880 839655
16358 839655 715600 538414 255792 561925 502381 700496 445009 700155 383330 1042422
16348 1042422 670348 402737 401089 540234 348650 309694 571509 636209 780469 315309
16337 388023 446612 464369 214294 669497 638493 256062 203940 542880 554464 579014 606148
16326 606148 564335 367905 467341 282913 288063 718490 261979 450038 602335 308028
16316 308028 677573 171005 223154 429635 463106 617170 175147 592178 246257 522591
16306 522591 194141 267763 488347 439572 460190 169257 355579 144839 387360 244927
16296 244927 392611 241125 390190 386940 104176 317532 604480 526463 241142 360589
16286 360589 157599 440426 437434 308982 513801 255045 455014 402271 212949 380103
16276 380103 331122 41502 285955 353185 679055 419697 204870 267275 541051 405593
16266 405593 287181 321955 223400 18268 710602 426375 433481 521429 272319 90081 238147
16255 238147 56747 199421 45700 146022 297541 429942 341217 381287 93812 263231
16245 263231 175314 480987 189193 379809 265918 233149 36880 183056 402426 63560
16234 227428 12751 239536 258607 75121 348458 641543 178628 339261 190517 409563
16224 409563 156850 408212 469988 125624 -106167 272765 1679 233251 483818 453836
16214 453836 280325 84841 485398 210185 116817 138674 417723 164930 -230765 108364
16203 73452 237695 349102 84994 101770 364020 -166767 492829 21665 398727 202166
16193 202166 493162 354246 92250 69585 174978 164885 -8876 164132 417376 350463 82867
16181 50034 268028 233609 192829 244554 217645 129989 -83220 65185 142481 356439 228047
16170 228047 96089 267844 -159765 311350 -42873 188048 113548 97694 -19850 206948
16159 -11749 -282077 314068 232788 479490 300171 169092 330887 354564 28207 25842 202264
16148 202264 -211079 258100 81129 116789 114670 -7538 198611 310696 45294 -22551 -74583
16137 -74583 215991 27856 365634 192765 -77314 244677 229127 20180 180237 315402
16127 315402 314523 261767 62175 236622 110650 284885 239219 -351840 65690 298465 -51804
16115 194041 -150627 416533 12681 62888 -361558 -22787 -22145 -51684 202319 348706 512123
16104 512123 448145 119567 402212 129154 53833 3553 46276 333051 96489 305156 171589
16093 171589 93004 -6448 -12529 -16428 -108845 -174876 -249819 285621 200249 161466 -39641 -125207
16081 -125207 77824 218555 16366 148237 -151242 -179583 28343 -90246 -14866 89620 213375
16070 213375 183861 130881 -64148 -49681 -60359 240370 39658 127048 58193 -54570 -184841
16059 -184841 167929 9398 185473 266067 21867 55479 530545 62050 31630 165480 156371
16048 156371 75402 -53359 -65040 184774 -196862 219698 458626 292820 17959 84487
16038 84487 -173545 -169915 -283552 64239 222186 -247920 -259782 -235535 36674 393163 414651
16027 414651 159526 -150478 -148672 239233 83555 36135 295901 138640 173891 97289 125700
16016 125700 -37966 155120 41663 40980 -121569 28778 128073 395961 229318 36971 56458
16005 56458 242918 -140763 -153118 285143 50021 203339 -65369 295365 109619 12021
15994 79618 -158983 131680 -70769 15330 -151136 -126842 -79900 448831 51397 457807 169895
15982 561612 406537 102758 -108201 276766 177132 -83931 24718 139908 -220393 -26061
15971 -47683 16109 18781 124953 30057 150977 295806 89078 -68563 357891 11355 -329175
15959 117670 77304 64372 -114395 160353 413016 -358129 56705 207583 -206403 -233327
15949 -233327 -38917 -149675 -29143 13801 -220351 -240391 -32521 -196297 50746 -419180 69751
15937 -28156 150483 20426 -284698 19941 291939 -45246 59454 86567 -50016 69165 -192059
15925 54999 -294295 -40617 120816 -83838 343770 69077 -100553 86209 57467 -19569 -356901
15914 -356901 -175793 130972 -70824 86042 -11356 298048 -203761 18833 -296043 37493
15903 -76720 163095 10634 30471 97621 91624 -78658 -428277 291169 -355154 117410 98424
15892 98424 -192437 81000 297960 -153302 164044 34834 -7427 259091 61900 187356 108266
15881 108266 -15351 156149 405747 188937 -146141 -59163 165436 110409 -312895 97782
15870 -46671 56471 62728 195308 -245672 106526 26937 189014 -25595 19355 29251 -40801
15858 -1874 527482 -38663 28463 57501 -6888 154121 -111310 -93019 66382 -18084 -4884 52159
15845 401390 -45752 -102582 -159049 86260 -160459 -255502 -34290 45086 -208253 -206648 -60809
15833 -236543 -93598 -104218 -138016 203689 -149705 15224 22845 243760 59940 -143850 -292995
15822 -292995 -159985 88566 38758 149026 -153480 -140235 -245983 150094 -27946 46371
15811 107120 -136100 -27581 83364 21089 -196441 -229724 -215812 166790 30090 5354 -204041
15799 -149605 69321 -7912 -184404 68784 55499 269264 -251543 -306258 -36280 99689 144530
15788 144530 291346 -54324 325502 -222292 197109 79774 -86842 -201048 -216832 -177747
15778 -177747 3700 -63727 13087 187770 -156080 192616 205496 -148943 173064 -249124
15767 37840 116929 -287212 -40393 -138217 388247 -112039 -8033 -64653 238698 -25879 334611
15755 8176 -145876 168350 175324 -60603 111831 168382 40209 18997 245423 161795 8494
15743 131297 -105691 -232954 47612 91993 223277 -139816 16000 301961 117336 -97944
15732 -66496 -142493 -47935 -104456 81298 -144378 88256 101454 231536 -60469 -217034 329295
15720 -224168 80059 15539 -306937 15558 92959 -83596 -36493 -77417 32611 -86598 -270016
15709 -270016 108587 26067 -208181 10659 -130961 113459 15742 -96628 -76551 -112882 -73077
15698 -73077 -430389 44931 -157297 57184 95337 -92883 30182 -128823 -6944 -121571 -132694
15687 -132694 211894 -10028 -176997 -155203 175321 112885 -336698 192492 110886 -141366
15676 -7050 -67309 -41601 -109808 7000 275853 115225 -15378 -104526 -156070 -205810 -198272 -52640
15663 -61307 -53125 123118 -133623 -42028 -81787 50874 -22218 95751 -144494 -53891 129767
15651 -19784 5995 -292983 288916 236491 268177 121680 -74441 -23377 -278562 -99842 -224090
15640 -224090 210899 176420 -96561 -189669 -32259 102487 -25519 253996 -151648 157998
15629 -176886 -37516 -102707 -27020 174179 -109106 -213046 -124453 123354 -50438 -155391
15619 -155391 -117890 -35973 1786 164991 -209421 219106 -68119 160593 34533 -77090 -61694
15608 -61694 104210 168174 -180380 109043 28405 54790 250764 50563 -230952 -26440 -196335
15597 -196335 54949 -62941 -14654 141943 39435 73879 113318 -137682 -148851 -12137 13299
15585 41087 -216015 253640 -38731 275492 102843 -169114 279 -16615 -65291 -305525 -217199
15574 -217199 39292 -278903 -138462 148535 55011 -50663 32113 69291 -76252 111416 173413
15563 173413 125528 -37292 -60826 -248966 -26864 -110765 -51640 2524 289856 -120170 29154
15551 78625 -82695 -155257 129486 277130 -100877 1392 -93268 -79331 -26300 117703 410084
15540 410084 -223995 -66391 -4480 137073 -135118 -105260 -41875 -206853 -136816 37898 -156171
15528 -81066 2411 -221549 -185153 -139851 -102436 162912 394127 -202607 -96989 71254 146
15516 -209673 152343 -140789 98004 -114320 266592 153062 60341 268834 -13520 -57214
15506 -57214 260251 -347278 -35956 -222727 -77198 83632 71635 68790 -96462 -184667 65388
15494 -238147 -141882 47194 -200912 -146981 -68475 68126 135380 5325 -147987 -38067 -212081
15483 -212081 116724 30433 -30556 169876 -314622 187737 -75283 82739 188964 51969
15472 -86354 -6980 196802 -82704 7789 -7521 159522 -1566 -87561 -80168 -172709 135376 153750
15460 153750 93077 -104707 401513 -6004 -107794 210563 209425 -94859 91936 34501 -100348
15448 192102 -116656 156586 -134866 -67937 -22107 -200990 -68267 63002 -302040 29230
15437 -254047 261959 141582 -207653 -25565 -29878 122768 -47678 -101927 -277677 -173693
15427 -173693 230968 -46026 119111 109227 -52440 119894 -258771 59827 128162 -38803 144019
15415 -258550 117235 31223 20944 -15867 77290 18426 215928 117014 205994 333831 185518
15404 185518 -130740 -238557 197403 3834 387799 274362 40410 -5807 -19889 129931 -25037
15392 36304 22349 145906 55658 200919 42680 23688 104775 -145105 71707 153157 -95437
15380 126820 409711 -182389 17663 135066 -45159 185203 100387 -141676 -167971 69083
15369 -256866 71659 -4859 8993 307579 -276682 -100780 286786 213175 179689 352241 306059
15358 306059 -71845 246944 -147004 -14071 275447 10714 3481 -7472 242872 -60520 -60343
15347 -60343 97527 118230 124641 29794 248545 35138 272021 186566 127296 -33027 67940
15335 277794 -46494 -54658 -250639 -56768 159896 -229666 38952 126539 -244752 115597 -4358
15323 -48979 -95498 288611 -83171 -124882 53176 -68411 -155775 -19221 84442 -73810 -16063
15311 160621 58231 -187539 -10519 265635 50580 343196 519785 78025 425593 -75772
15300 -51090 -317850 35165 390816 -10713 334973 121813 -191665 95336 -255673 37438
15289 -74282 -29974 -83943 50026 126945 155212 -62066 67819 -155236 17248 206299 302319
15278 302319 54402 229315 157061 339438 212907 212301 -142312 119325 117016 -45460 -27321
15267 -27321 -2386 359722 -286233 355325 -107053 417684 143001 -38215 -204606 -22004
15256 117589 101943 -254442 300608 393281 683112 783610 748163 1083605 553923 451166
15246 451166 467958 -102644 224325 22207 -74233 -22482 -86724 200124 -115687 112124
15235 184423 102549 238307 44931 256003 -27362 88975 -33288 186461 177140 245547 -302678
15223 -27978 4300 379 102660 207973 223336 -142107 -149156 415366 212510 181340 169338
15212 169338 302026 -43965 52025 234741 21464 -181274 256548 -205712 -186297 185064
15201 187722 106059 307836 -26729 -23159 178880 -113867 209792 -62070 -176159 -171214 -69178
15189 -136433 -201015 23724 88160 -22728 44812 40606 -39355 195480 -3165 46432 137762 109353
15177 109353 249193 -218540 311966 372413 201062 145765 -19099 170492 -261928 237129
15166 52188 -6781 115870 -317443 -85957 61818 343270 121953 27000 483619 -113044 307977
15154 -46927 -211787 63770 -187018 501825 -41650 30729 270648 64726 261411 -105124
15143 89333 -204040 -12815 263449 80933 59974 96722 445949 72565 733302 153636 250250
15132 250250 71929 292456 158449 254483 46701 -58952 410306 369794 87212 284500 155011
15121 155011 -38969 22339 179717 386437 375581 -137127 51944 -63668 56267 118638 -40800
15109 57651 136952 253151 193346 109241 -53069 -46219 48258 297392 62086 -34204 189590
15097 -108690 -2356 138169 345665 15451 233570 684019 168468 162636 180003 -27112 445234
15085 76843 119211 -103947 149735 44891 269488 191291 89362 73912 2246 241992 -31053
15073 120217 181796 108604 -60119 380168 65226 127088 93006 149807 235529 215345 329506
15062 329506 350544 -74933 133940 185876 446642 -8811 39871 126966 26130 205205 36462
15050 63922 9244 241205 339980 36102 124263 -118055 133094 175828 -37297 188551 180248
15039 180248 36407 189970 313665 185808 -52813 182006 -273409 144512 158360 28783
15028 389869 469039 -129777 425035 454651 75152 -69632 333239 211288 142041 -95928 197067
15016 31551 106048 99905 40887 98374 41487 97529 -434376 202544 228069 92168 240476
15005 240476 185461 152334 137722 207866 98042 -98832 74178 182552 80487 221148 172810
14994 172810 -67782 246740 194308 323971 3428 151039 202381 311548 488621 319176
14984 319176 86412 299133 242411 161689 471010 541233 114001 117958 200960 217565 81864
14972 262181 126351 278715 -15802 372015 -1726 32229 530824 214995 239749 438561
14962 438561 384339 464413 214469 202716 -58702 165454 232043 251783 247678 529568 536007
14951 536007 93820 338464 595096 299617 715325 -10288 634580 155524 136353 599524
14941 599524 337446 32688 234088 207440 256835 513880 427612 540644 239480 278325
14931 278325 136830 525406 104705 599870 71065 202783 165572 147471 92286 336334
14921 336334 283616 263447 376575 82653 251603 174106 241300 312977 352863 626959 344825
14910 344825 53515 387262 567613 -252483 494999 462754 185593 594722 313419 252202
14900 252202 301231 272404 84453 312039 337762 423355 409968 369588 572623 438048 318235
14889 318235 157086 30950 252918 136691 476518 98038 -105315 318149 290985 193840
14879 193840 692905 416376 282647 459408 402580 409696 331356 467760 168176 396623
14869 396623 703175 451809 375415 319725 348151 365000 301529 435831 302648 73584 484492
14858 484492 203130 424648 142298 641969 89725 662979 668498 398437 565882 639776
14848 639776 580702 239331 475032 524098 196864 406344 385217 234349 500579 497034
14838 497034 575109 335907 588433 338945 722425 533283 528678 425095 409610 563098
14828 563098 491709 360544 205577 243210 551396 247145 582782 492221 586971 478345
14818 478345 373790 507347 485555 506631 370845 618201 220010 246907 556187 247649
14807 371319 396285 335229 228396 520996 621742 533033 372410 140703 561329 583139
14797 583139 741312 393442 329747 559568 628827 615994 486087 853140 922838 664990
14787 664990 1103171 693161 652864 852023 578295 625887 349322 496026 529657 567057
14777 567057 647774 652632 483778 629560 403731 503647 449340 576715 468562 286003
14767 286003 726432 658541 289916 444574 632320 754280 637938 553007 634162 595395
14757 595395 891297 388748 765365 609968 485362 805784 422153 349483 448307 511837
14747 511837 672558 681952 434474 648749 796590 619969 375234 625013 626298 681350
14737 681350 559573 711603 539039 597484 767575 994818 733637 636257 711175 739636
14727 739636 661366 607475 931563 865401 914789 950179 673788 746617 767888 749137 571587
14716 571587 725757 435189 537869 729130 791872 784325 701073 1115572 809670 764128
14706 764128 774565 829796 701223 1144316 1001910 783965 743654 741573 976172 722016
14696 722016 774332 451756 983821 683005 828819 802425 609149 871387 796881 642841
14686 642841 966258 1045244 867563 837598 731173 1158065 755131 847791 1130308 1135740
14676 1135740 805644 923243 819397 866166 871077 949703 959657 933141 977031 968334 841950
14665 841950 1198214 780184 1150543 1221319 885093 896772 1015227 991330 1208169 1052008
14655 1052008 1126851 1010137 1114167 1169320 1073245 994968 1210059 1037822 968568 988762
14645 988762 820130 885785 956988 1170922 1116996 1244789 1108116 1170698 1263845 1110401
14635 1110401 1005531 1147068 1481591 1249413 1243489 1530320 1237270 968693 1205723 1577623
14625 1577623 1361400 1100908 1352940 1553860 1455278 1260917 1247413 1113901 1620521 1254488
14615 1254488 1213391 1267988 1261581 1289866 1176256 1298245 1543972 1205811 1380297 1363137
14605 1363137 1860918 1335824 1567797 1731835 1493019 1376171 1836595 1505840 1280683
14596 1280683 1528307 1570400 1575705 1616187 1397306 1989023 1930714 1819306 1696911 1742939
14586 1742939 1632694 1821436 1781431 1512144 1849684 1657833 1595534 1715339 1983199 1887762
14576 1887762 1861377 2050164 1536009 2213684 1900187 2021656 2020045 1770824 2192362 2246036
14566 2246036 1858320 2473449 2268156 2392786 2627446 2209164 2789843 2615504 2886419
14557 2886419 2735471 2669119 3334635 3140688 3810991 4522217 5333283 5968041 9294448
14548 9294448 14231060 23242177 40897838 32006497 15828276 7582933 4366180 2858475
14540 2858475 2683907 2464599 2150428 2029225 1816146 1930466 1654008 2115073 2114806 2080523
14530 2080523 2030893 2197851 2237070 2080906 2090727 1966307 2204576 1906975 2306445 2688977
14520 2688977 2324619 2314412 2351035 2675972 2500968 2533337 2580148 2737970 2551946 2370602
14510 2370602 2981395 2605877 2871066 2685682 3050222 2640467 2772432 2880323 2781041 3149284
14500 3149284 3221672 2946050 3005646 2706071 3290902 3195766 3219692 3270573 3305860 3071957
14490 3071957 3425683 3299869 3052690 3613074 3204645 3281500 3318125 3524017 3736553 3750317
14480 3750317 3451277 3901500 3838206 3649606 4026878 3905727 4050474 3860702 4171281 4045867
14470 4045867 3949020 4157214 4447650 4303106 4542177 4026399 4443100 4318022 4665403 4578489
14460 4578489 4550542 4734066 4408117 4757496 4851671 4804908 4793227 4471491 5003028 5055923
14450 5055923 5212327 5200103 4871058 5368977 5166171 5356436 5332550 5404666 5464382 5261954
14440 5261954 6159301 5904926 6086395 5893702 6057074 6161826 5941303 6433350 6457289 6232656
14430 6232656 6425587 6675855 6459418 6815358 6904801 7112833 7274693 7017766 6954716 7295357
14420 7295357 7642080 7385543 7931537 7682352 7674934 8126183 8012813 7935421 8515458 8200759
14410 8200759 8759750 8307622 8668075 8947811 8825353 9148455 9138723 9411054 9476073 9870156
14400 9870156 9795270 10159553 10146802 10683074 10844553 10734081 11011940 10997096 11378000 11636208
14390 11636208 11531899 12096554 12097105 12328757 12636562 12573600 12816745 13060595 13264875 13883947
14380 13883947 14031851 14055568 14586730 14889348 14968831 15467128 15740883 15730222 16101742 16196484
14370 16196484 17014838 17268467 17417712 18031242 18288500 18719607 19220812 19534177 19802030
14361 19802030 19883977 20415465 21370597 21475672 21920765 22879427 23245465 23970850 24454291
14352 24454291 24876599 25742527 26128819 27022923 27249156 28164247 28593081 29310698 30203269
14343 30203269 30942444 32015045 32793056 33654919 34713989 35419660 36609192 37670182 38653074
14334 38653074 39628819 41283810 42215149 43696998 45040451 46397208 47899902 49348432
14326 49348432 50918334 52882440 54375202 56012858 57873485 60157041 62129073 64609225
14318 64609225 67166038 69677856 71994273 74922458 77847756 80966022 84085985 87609722
14310 87609722 91322881 94910876 98986722 103365842 107641061 112524294 117789095 123110489
14302 123110489 128712616 134875282 141377895 147989975 155536493 163222505 171428487 179979355
14294 179979355 189312716 199007060 209431774 219831374 231365909 243089749 255740955
14287 255740955 268602867 282335416 295647779 309771530 324430202 338576367 352859761
14280 352859761 367198149 380971682 393675001 406137364 417103789 426918574 434343938
14273 434343938 438158796 438656829 439015713 439059201 435638850 430137407 424574347 419285445
14265 419285445 411685330 401647509 389900773 376728523 363009832 348483292 333259866
14258 333259866 318763243 303887032 289339786 275407508 261794630 248806267 236307956
14251 236307956 224459315 213378811 202698221 192349212 182848664 173990188 165942205
14244 165942205 157991564 150584336 143196264 136490148 130288207 124332043 119286117 114249540
14236 114249540 108900020 104306518 99862777 95584289 91905492 88475583 85227994 81412442
14228 81412442 78284774 75308617 72480918 69786349 67020836 64806009 62145788 60259955
14220 60259955 58153910 56399600 54474996 52479809 51270100 49523586 48108253 46569529
14212 46569529 45185949 43626390 42070529 41020827 39829046 39406193 37751426 36781797
14204 36781797 35623135 34842583 33901052 32885693 32338262 31518626 30484374 29543080 28913098
14195 28913098 27864907 27738230 26737528 25947332 25598969 24866424 24233991 23729578 23196322
14186 23196322 22412825 22438480 21955551 21093189 20750618 20598387 19727050 19334038 19081711
14177 19081711 18719247 18377093 17858367 17544683 17394944 16874171 16427051 15983519 16083641
14168 16083641 15788390 15205188 14951493 14674251 14615348 14262399 14097970 13707745 13512174
14159 13512174 13387232 13102579 12764156 12517811 12445712 12172233 11810747 11728047 11611331 11488918
14149 11488918 10906763 11079638 11087878 10610118 10548341 10883212 10241427 10498744 9946798 10147321
14139 10147321 9784876 9418818 9123282 9071652 9361740 9222307 8966508 8856083 8537759
14130 8537759 8289672 8275655 8189359 7921346 8064289 7907648 7714521 7699960 7701759 7226430
14120 7226430 7439064 7156280 7250365 7326856 6892666 7088405 7073458 6692352 6838626 6413677
14110 6413677 6602019 6302130 6135874 6318889 6283343 5784616 6190345 5956460 5714994 5674990
14100 5674990 5787834 5624686 5741195 5372793 5614670 5495794 5366441 5376558 5261753 5186006
14090 5186006 5104829 4935461 4926516 4806258 4923917 4911380 4976155 4670578 4618440 4432539
14080 4432539 4391349 4672088 4431100 4448253 4198873 4232981 4205548 4180649 4167571 4103066 4230375
14069 4230375 3846050 4103762 3998459 3721404 3608196 3610115 3701572 3596280 3698530 3990187
14059 3990187 3707992 3675724 3824470 3749506 3433088 3243741 3535988 3333707 3395842 3246599
14049 3246599 3074346 3446607 3262419 3146728 3375271 3283342 3332421 3456003 3192389 2995448
14039 2995448 3029203 2994836 2988493 2979750 2973823 2745039 2934113 3059539 2820331 2843641 2696443
14028 2696443 2746551 2414816 2533024 2687497 2763814 2988203 2695475 2731552 2583681 2602343
14018 2602343 2389621 2227443 2278270 2394243 2405043 2326348 2233374 2201838 2291498 2319293 2378394
14007 2378394 2345060 2202959 2078907 2137646 2032611 2229466 2017663 2080597 2009381 1932518
13997 1932518 2237551 1907840 1654567 1901652 2043735 1977430 2319068 2654569 3891515
13988 3891515 7338754 15072926 34433942 37370719 21524647 12153344 8159396 5923769
13980 5923769 4389739 3958670 3306151 3201899 3131041 2633304 2647785 2745322 2423877 2019502
13970 2019502 2401728 2378292 2482538 2443840 2198648 2179299 2031084 1918622 2215350 1852835
13960 1852835 2093757 2186725 2061707 1952601 1882422 2278992 1731392 2115381 1699410 1470853
13950 1470853 2054711 1796529 1919709 1693588 1558137 1600063 1728779 1588591 1716087 1778499
13940 1778499 1513478 1737085 1693924 1317362 1594725 1518685 1702267 1505019 1523452 1514164
13930 1514164 1602501 1620310 1696491 1598617 1295775 1623403 1618275 1381871 1094600 1509479
13920 1509479 1542150 1351764 1436628 1543664 1281626 1185937 1232766 1252174 1402146 1308556
13910 1308556 1478951 1356187 1560003 1567599 1437073 1323268 1275335 1267705 1239747 1113671
13900 1113671 1314150 1100867 1318050 1129362 1363672 1283052 1070581 1302187 1307366 1274131
13890 1274131 1124555 1337799 1364777 1101447 1501022 1089403 1195780 943654 1031354 1161298
13880 1161298 992686 1194987 1062852 911545 972264 1157235 1317348 1406170 1058648 1203459
13870 1203459 1068297 1112255 961516 1129770 785124 1177604 1002202 922339 927797 1103616
13860 1103616 1330046 1073795 945183 724721 1046373 920567 875724 1257783 1120604 992464
13850 992464 944547 1148448 883326 853912 1186993 843731 978717 991133 955846 1009976
13840 1009976 892475 1380005 817404 972363 937615 884243 1266059 805449 795269 1199781
13830 1199781 782464 814267 847409 721296 642312 1030383 845929 919262 1091415 1013149
13820 1013149 854733 1185726 930763 829738 991103 962292 1137523 372438 710881 711643
13810 711643 874079 788747 1021864 662264 417929 903974 914464 703660 547219 879020
13800 879020 610649 782888 890104 915319 838942 762566 385658 924628 651294 372108
13790 372108 955955 1087689 607100 403653 932834 753004 484505 540895 435798 659355
13780 659355 648043 510837 957832 709937 546159 902082 816915 589474 433878 806290
13770 806290 524635 596601 883087 788650 521380 472949 732403 572018 619868 676670
13760 676670 628145 617814 694726 656101 444581 334849 835820 345458 632831 414172
13750 414172 516791 774197 349895 649624 584293 540036 586008 416669 780545 851719
13740 851719 640559 726837 609099 241518 679432 567128 766882 748254 448009 717925
13730 717925 599149 808728 467959 784690 736613 723381 366286 268186 587673 878484
13720 878484 601357 878982 631903 501709 692049 629293 727329 549109 523906 815274
13710 815274 690032 748333 698287 203145 377190 643345 365254 574481 456410 292593
13700 292593 314132 326221 284949 15700 387776 623367 628320 125257 603320 754869 582431
13689 582431 632711 430791 454587 412230 408625 424169 380463 192701 801446 504616 657885
13678 657885 259381 207410 431867 523744 221268 481039 445433 525311 454665 307641
13668 307641 437293 337255 666339 593670 -76869 464195 499132 424068 628123 544805
13658 544805 571697 519709 221076 480701 344916 486067 624241 662974 426061 497299
13648 497299 369535 569010 59016 509395 447940 185348 486333 469902 281757 362356
13638 362356 692932 462311 250673 269483 407363 497534 619492 292914 343373 415082
13628 415082 172251 384210 487759 240536 113103 167363 317417 439092 274966 266315
13618 266315 350693 355342 208212 351820 559576 661756 510142 280139 335960 269428
13608 269428 163053 445735 575707 425552 145300 -182629 628313 545465 73904 -118828
13597 215458 347333 258458 457598 461588 287941 535676 31388 325275 167299 217135
13587 217135 516111 37325 206797 366842 61499 148535 745364 343306 304180 136430
13576 468264 654496 -13776 298165 291307 223699 338509 523043 280498 572150 -120996
13565 337553 203672 356246 434975 345390 501464 273955 343620 279101 324495 177249
13555 177249 167173 126689 225626 18282 325465 48348 451055 -55817 -5361 504275 417672
13544 417672 572083 493243 318978 260428 376996 123340 38790 326454 167068 315118
13534 315118 405854 184943 215389 -95215 455515 108448 389156 438175 479819 63117 239461
13523 239461 -124027 545814 188248 13685 303094 -32301 855194 345040 320286 22834
13512 247200 398181 352661 397424 272146 122196 350526 672279 290076 276259 440580
13502 440580 203764 434503 213679 -342187 203705 177232 90215 395337 257056 289469
13492 289469 303878 171122 259272 196444 212188 259422 403094 287501 -13467 277727 363926
13481 363926 175795 233917 388614 261895 337975 315844 21891 -872 175928 104636 -143409
13469 294321 260833 85068 327228 591541 222631 373692 593052 139060 225443 294542
13459 294542 156931 180501 261970 104473 178643 532629 192749 373206 203891 151637
13449 151637 95504 272985 146183 130226 328180 394944 257948 291636 3899 62969 122529
13438 122529 366196 291740 240548 325079 -20365 -47304 -87856 378998 288957 171072 -37729
13426 371127 304175 366976 135883 290580 138952 371713 123214 -46928 303836 244116
13416 244116 327887 134705 141790 -91947 429868 156629 104162 224273 81209 357545 130871
13404 108638 395115 168176 447090 434451 163948 187702 441481 317334 -81879 213060
13393 89997 160153 174597 10010 151529 235801 247437 246465 -79527 -79518 4127 320629 164681
13381 164681 316196 -30615 -17272 -144422 123204 318257 212309 -123547 231988 19178
13370 320604 125684 268275 155534 236401 320104 152193 260041 20565 235179 80729
13359 173017 58969 18426 147292 270385 136934 144255 147185 -21588 171189 92394 19812
13347 91377 168127 314142 76136 324582 8422 180805 275068 28140 124555 1449 96666
13336 96666 333393 195681 156308 86458 172331 158650 220920 9898 555252 293812 107256
13324 62983 406738 -33916 168444 318171 288175 166864 138165 181216 76249 297837 145807
13312 53358 201708 204219 521396 382981 706346 113753 258855 -10316 167969 148345
13302 148345 -9842 -77701 -864 200282 3096 220689 -85299 199981 202160 -339 -113002 344208
13289 121553 23353 -85641 460059 177451 645427 36747 315989 379627 62128 229014
13279 229014 104391 47777 -51216 161924 -1341 10407 328394 -23715 -103614 189334 291556
13268 291556 98762 247269 -16230 -101495 137404 358113 162852 99420 53817 -35516 265386
13256 -6375 -26316 214159 218315 179061 197230 148038 -125982 274804 210072 179559 -144918
13244 199465 121979 8686 115465 99164 82237 199797 90082 -36592 -27102 182034 378381
13233 378381 56880 46805 101439 59209 16029 -52504 26623 122538 189897 350865 207137
13222 207137 -53718 91021 173503 86987 37749 115248 127817 258632 91800 -67833 154403
13210 -148 23002 117606 160582 -142435 148153 125335 353741 85975 68600 -153107 131225
13198 406463 255103 5247 181375 216016 135905 -24972 120178 -287047 48689 -3884 -268670
13187 -268670 136973 57643 184248 170621 169571 -287907 332953 55979 235480 422686
13177 422686 230939 -53810 34304 80980 16568 289831 76069 45193 177974 -239738 -106314
13165 122948 232122 208179 239098 -2954 41782 279104 247380 -111233 64048 25538 141051
13154 141051 205882 159618 -118354 217304 143307 117851 107649 77849 243125 9520 26051
13143 26051 90911 -118795 124501 273770 -154418 -58317 245123 29018 252432 49852
13132 10023 109504 -70398 -42440 -128792 179275 242736 223485 119981 24505 210978 -101626
13120 402686 177980 49964 87430 -113770 55864 222262 -55067 19989 293558 -171451
13109 198649 92040 -201918 -61411 27603 207187 161711 13963 88000 -153893 -30697 300597
13097 -7059 228893 198640 -58786 433802 -63295 199241 204010 -251287 -77197 -129599 -194023
13086 -194023 259401 60366 123354 96037 -18960 -18894 115642 147733 -49066 130878 85913
13075 85913 -163742 380444 103519 111147 130370 -187972 158073 -182887 109107 71847
13065 71847 177241 -102751 -9761 -103851 27155 168161 71669 49286 134374 240927 20862
13053 157160 1537 127108 211699 171149 270609 198535 253681 186800 58123 368514 -75428
13041 -165700 -130562 48674 103274 -86533 84344 82539 7699 1703 208693 141696 -222247 365704
13028 -41012 21080 61463 -66922 -147680 6110 54788 -60420 239761 -119682 161041 143959
13017 143959 262953 10869 25829 -126583 173623 -215289 198565 106564 -92003 153079
13006 -6642 -190307 -47416 184016 -163754 84020 71043 27993 245913 331773 -145606 13039
12994 192904 17302 14816 -209417 -80295 -148415 140625 -76557 37004 295269 91800 -23798
12982 469610 99877 -30781 185412 165414 206489 -69071 239417 -343324 51097 -116725 54147
12970 -212960 -168531 77548 372770 175610 -129073 90319 246664 40210 -183406 179889
12959 65224 67199 379425 -16041 -75468 -225165 -22163 -72949 110386 86224 382332 274180
12948 274180 115910 -116293 -272457 89552 164577 84541 30802 -240566 208350 -156444
12937 -132024 -69394 190888 47172 60427 -377972 74532 -145475 21499 224335 213918 4666
12925 -219174 -12499 121200 -82647 7790 -267959 211928 156770 195430 359974 -235144 -342457
12914 -342457 128173 -134050 -288375 -315888 84181 -39304 238423 -226713 43670 329027
12904 329027 173160 -30856 189471 38177 -123994 -372941 -72410 46471 -5572 214052 97253
12892 -374953 -84847 -14634 -88745 110394 -240161 404048 -62953 252250 -384578 -120223
12881 -102816 103863 -40997 -32043 11754 47181 142601 336394 -38948 -55545 54321 98293
12870 98293 112564 -218926 24368 -144322 52355 -193708 132908 -168151 183080 219282
12860 219282 465721 40144 -24897 -139943 48939 101831 -85125 -12137 362274 28160 -9141
12848 -34216 164726 -10546 6009 237489 120980 448501 -38155 -29980 114099 -356334 -22103
12836 13177 80183 -80480 97604 4888 87405 110524 11061 95521 179080 61943 151209 -47605
12823 -103473 -193930 15614 65007 -90802 -83140 -280193 10250 -126548 28895 264089 -75890
12811 -175448 -143424 -81100 94150 -176478 -874 -102159 209823 -100595 41475 129854 -142934
12799 -126872 65180 -173964 61055 251766 -41092 -213576 136571 -37498 193370 -225344
12788 37924 -224889 16490 -73969 -70941 17983 80688 -309290 164605 9906 -187021 369252
12776 -29945 -277289 243380 -91079 -77222 1565 -26768 -72931 -488791 -52086 260002 52711
12764 92439 -3703 128713 -161616 27541 71456 154977 -54214 -79120 -148365 122002 162428
12753 162428 163634 86792 323827 6274 93401 10637 20436 412338 -10641 -47014 274506
12741 -42454 -179692 211665 51581 22436 60508 81908 317731 -96474 48866 240944 -225769
12729 6161 51120 -185404 -8671 -341544 75069 -9614 -165002 111286 -20319 110509 211903
12718 211903 367762 46033 63026 333096 -36330 107938 9505 309769 434809 -106308
12707 185344 -153989 116173 34450 185197 410124 1985 28623 -120569 20468 -47879 7610
12695 78130 -158672 270138 68022 318661 325414 -91078 48804 -73674 -53443 162790 -107275
12683 34638 243442 -195159 63779 -78468 338080 254526 145432 125090 146800 58315 -18944
12671 -71169 258166 -1626 19329 -115111 110788 3011 176455 -127777 -19190 234265 210274
12660 210274 -94586 -39643 -117013 413899 27024 227833 -51707 -92309 37652 -279992 46615
12648 -190984 111861 112990 249980 -200963 -148763 -330867 -85529 118870 200754 -232600
12637 -186040 199573 -61267 253892 341 -124412 -150115 135894 55244 339543 468719 -67226
12625 97961 87992 229133 313505 -19581 301848 -150328 209437 146765 157316 -226387 101343
12613 -36049 -204235 -173911 -49856 -135716 -125401 88468 90806 -125835 -72960 101942 -14344
12601 227825 -102684 42317 -233277 -83936 27804 -16430 81347 501828 48225 -168935 156058
12589 -179948 -201530 78993 97249 6439 57778 -34486 63829 267927 -237208 104877 29089
12577 -61845 170928 -94460 149573 -4809 -94682 285781 -67529 -167106 172168 7095 -158093
12565 270313 -216438 -54542 21444 144928 162914 -229445 12944 -47929 246682 57165 -7456
12553 -451570 336038 -88600 73430 75291 -153911 133881 -178309 117398 -175888 -25912
12542 22506 46861 -65371 -52870 -217288 37004 92106 245743 50991 -54065 -120782 -119770
12531 -119770 138498 -33222 33867 -89306 226649 209937 -228964 98490 116932 -59076 -168122
12520 -168122 45257 -391096 -261363 -121748 -16729 101186 -285427 -109795 145155 149913
12510 149913 46155 -221 -63270 185964 145642 -9104 -41269 -351160 98094 200950 -106383
12498 230602 107620 4858 -214785 -148066 -260619 -68661 -128561 -81451 211269 -70217 157365
12486 -45641 -226766 -95972 194286 -84233 -82374 -45666 -27520 -202252 313641 6899 -277385
12474 245440 55364 105898 -1329 -29373 -144993 118331 -111643 154121 -50449 62253 -69609
12462 82910 -153819 23217 -2840 -113697 -131444 149801 191262 289630 238158 -280399 -24045
12450 49665 226547 -57814 -409119 37345 53696 144059 24665 268792 71829 -100656 26038
12438 138699 -375677 -58604 19185 -74156 7400 79152 155613 31401 74588 5994 144993
12427 144993 221949 30648 -32055 -35466 265511 81858 -89998 -57617 -329216 -300823 227748
12415 32774 -24174 36629 -121716 -98644 78056 -172561 -53723 -167090 57211 12207 239767
12404 239767 183429 -148369 34282 -195700 -52739 -245010 -97053 -275595 176312 79057
12393 -97483 86884 44038 266367 -54243 75780 -5081 306976 -127440 43577 213870 81571
12381 13992 50269 -103963 -166364 244392 -23888 -69955 -63249 350671 310473 167355 63406
12369 -46181 -288723 20189 -223264 12314 10584 -33531 163296 -67254 -163056 -197183 -194775
12358 -194775 29144 69700 -130821 -12525 81137 84959 144135 -90502 14723 -126675 198958
12346 330696 -33167 40495 -2098 -101151 133522 -25354 -298635 -199881 -3723 -219301 -170224
12335 -170224 68896 189608 -13784 -474142 -264510 -179745 -456543 250834 33164 62172
12325 62172 -344079 24197 7539 49194 -273531 -147792 -228492 -455727 -287495 -23598 -105986
12314 -105986 -10861 102946 11608 103593 -4200 125467 36803 41091 44436 -115591 191871
12302 -42751 28009 -11802 113892 85797 -85176 -115294 -45988 -290924 140795 -45231 38834
12290 170898 -64881 100551 123257 43778 238266 191627 141033 -17772 329138 -126982 -38312
12278 143586 19278 135989 333360 -87039 -5093 308736 -197685 -108619 -111078 105215 4624
12266 432716 -291047 133789 -205219 148726 80543 42972 141470 214211 -139597 -6681 63584
12254 205883 124204 -21238 -41516 100419 -12154 -20046 -177658 -196682 330149 243555 250154
12243 250154 103835 3523 -279965 -155346 -79568 -80386 122164 33562 -251644 192520 218206
12232 218206 469245 150994 186854 -94163 -78473 136622 272941 210385 -24826 38412 509169
12221 509169 -92643 409759 149967 202596 264002 179366 -199140 -17792 24028 281497 153929
12210 153929 167650 329343 118475 31055 -42458 -38857 -65433 33540 94797 275035 137609
12199 137609 100365 144114 384011 420510 427127 604078 -67546 -92328 175801 386376 32784
12187 202583 53479 56258 -98387 -119096 -73284 -188974 129754 318200 255411 185571 -19963
12175 71417 -31304 -287021 -17043 83733 305235 228767 400721 109389 458693 184684
12164 321098 329478 142537 87685 1080 371329 241092 -193335 298048 180176 26917 129075
12153 129075 -100859 272094 211348 65641 57433 -252844 268108 154004 379873 -89075
12142 -102085 -235293 106547 -235783 8074 -117222 -50658 66899 161614 -80054 -6940 -150436
12131 -150436 -262758 -238950 -116033 198803 46352 139112 53767 -59016 -86095 -85077 -34547
12119 -156292 1460 -200261 -249069 -66045 32662 -223936 293954 12381 -4032 -268753 130685
12107 -171323 -62642 26495 -114785 34582 -179718 -186332 219915 -139756 110381 -174594
12096 -5552 288954 -241366 -144317 -67992 -140506 90872 -109343 15900 -18946 66236 114916
12085 114916 193837 -64948 128554 348201 79371 477799 743656 265098 137453 157551
12075 157551 -156209 109493 -88791 -285605 13306 -194173 -128770 -102603 -51866 -17743 221280
12063 -59064 1061 -151468 141490 183632 -15418 -44070 107037 180385 54628 -128010 37044
12051 -84773 -55619 -152210 -130773 -173507 141976 -288108 50334 -254212 94495 -195824 -232109
12040 -232109 24841 -312407 -188810 -310484 -206938 -44941 28307 -67584 -23228 190343
12029 6264 82021 195572 175707 515590 186418 64231 66233 -124143 228440 -131758 157188
12017 -383201 -80628 -302120 -63016 -171106 35115 101437 51803 17972 -145063 58757 -128891
12005 113614 -171767 -211734 -150908 85251 28882 -127968 -116555 129312 -126748 -5196 13993
11993 -279961 158277 -201046 -193050 -122083 246880 -66482 68389 -105294 -58022 81343 185657
11982 185657 77006 300689 305191 36524 75747 242693 30713 -22526 -456485 159089 -507
11970 28680 56134 137576 77807 152967 -143305 -145542 -189210 -123380 5756 152573 -96766 375751
11957 197373 5185 37767 220657 -70000 60740 42300 -80490 -123655 -265469 -209824 -6269
11945 -125061 -50309 -104728 44011 14131 210754 -165479 69538 37638 209541 -641020 -8932
11933 13092 325764 83666 -4182 96076 119845 141096 -88890 -90444 83087 -48552 80206 -64946
11920 290409 -86746 -188493 212018 78688 -113849 -224948 -292784 107353 -310221 -29688
11909 -92309 157699 44066 -359577 -369046 312786 66984 -118741 328874 268963 -56881 235887
11897 -156092 -97822 -184197 -155560 36109 -92284 37296 -79792 -38307 -287553 -89795 -365500
11886 -365500 -128675 191975 335987 21051 -219384 -314919 380928 -209203 87605 -128897
11875 -38165 -317069 -3402 -83833 -25150 -34578 7372 43208 1226 -83549 -187601 24637 -231935
11862 125873 -57344 -128377 -45847 47311 19745 9257 -81303 -51396 -42654 -275120 67963 -64658
11849 174845 -16668 -125923 -29430 -340944 -76281 -55275 14840 11206 -170656 -80842 -159292
11838 -159292 -140529 21068 6273 311880 -205234 125587 31847 -184066 -137689 -30984 -124246
11827 -124246 -217148 250216 13504 159420 -94603 145846 -177536 -241011 157934 -27829
11816 -150649 -127646 -95386 320709 -74336 -201022 -143128 -327399 -52500 222744 233447 -278435
11804 -80906 -46593 -73436 5281 32117 250872 111142 59107 22720 240820 -170294 -176064
11793 -176064 -4919 312479 -43347 -133293 -87411 384917 -106065 337143 209125 -136083
11782 -230869 9745 181366 81849 -60159 -246527 -113768 21329 33459 -57008 275904 -67563
11770 131869 325187 201199 219044 147004 -148438 -233044 -309895 93109 -184799 -204120 85367
11758 -4263 -210460 -171399 56509 6005 68900 59492 164488 -50976 -121981 -112634 27035 -8680
11745 -113312 85091 -28354 12809 148637 -128610 1632 29202 -105596 -64006 -8130 -137824
11734 -137824 227531 -121857 177522 266471 -390564 97449 -42540 -403407 -28228 -318774
11724 -318774 -354541 -76843 -41906 859 -7528 320869 -104561 36819 -247534 -81473 -126619
11713 -126619 207048 -12339 -69773 163727 46055 394095 82665 -130781 240590 145036
11703 145036 29427 -151493 48014 -14135 34384 -51171 19802 302043 -247537 -64186 -39365
11692 -39365 -60084 237480 -53829 230871 45618 32561 159176 -198352 174722 -29772 36582
11680 113200 -120003 171188 196304 -47184 -107150 64721 161053 90981 129134 -34953 -34031
11669 -34031 515890 -101303 179471 157868 -101830 349744 161954 172856 -145328 -153822
11659 -153822 228845 263964 -251269 11722 117105 2770 -155610 76811 -80450 -270579 195036
11647 -77474 -359959 -29029 235722 -90868 23932 2654 -148193 -149960 -234287 -256802 -105202
11635 68597 -81835 -282185 218510 -5004 -109239 3185 196686 230668 415095 -59570 53024
11623 -140160 129643 31349 -90071 -17242 8973 341517 -190339 509277 -139823 377725
11612 -194093 -145836 123617 -208167 -172614 36799 -52560 95825 -342469 300356 -19516 46664
11600 10336 192090 8863 -20408 -64523 -74551 81706 29543 218188 -260338 -71134 -158106
11589 -158106 474899 279868 189232 -142892 -231433 -31113 -177023 -154016 -3317 -19996 45352
11577 55021 -20404 90354 273950 -47959 -129195 166976 33286 148741 -56392 66102 194835
11566 194835 151807 -121358 146877 -80940 -4784 -34617 -171884 68625 29807 -109866 -309479
11555 -309479 -114300 -173859 355288 -175651 217634 -252319 116883 -168779 -29573 84566
11544 209674 -15198 211364 -78576 -204196 300356 -94870 238304 -58303 66077 -32885 79475
11532 -137225 303463 -205246 217846 141629 -47471 -149930 -59445 59223 -91329 11401 394370
11521 394370 -162221 -149739 -200025 4424 71912 -36015 -86238 206720 29533 139143 469886
11510 469886 241293 -55408 -62282 -60232 177866 58775 4537 305108 -146239 216261 -178131
11498 62348 95189 154724 190392 -64309 295779 -361132 301733 61346 -7090 -8360 -56349
11487 -56349 5073 -49392 253508 159864 -9002 -207041 -17670 201089 147350 -3870 -57200 226033
11474 -39321 373911 -146071 168022 333760 264932 209012 333108 -104258 175906 352340
11464 352340 -92005 221570 -182911 85880 478124 151244 -13822 -7200 44709 -85448 93985
11452 58509 63927 211235 -57619 36892 175816 -140335 140892 116220 244978 -101358 -22320
11440 47472 5422 -5457 69969 189913 239812 -1823 -153405 196226 140634 5849 -78413 74406
11427 23331 -1052 -410180 -215405 218276 222126 -114819 -75921 -313299 -200621 -315657 244360
11415 -349850 269236 69619 -266371 98099 -57241 127578 297366 -15963 -202577 -166736
11405 -166736 219905 23250 -224224 158971 -118709 -82920 -25293 -19595 -34144 -8899 67312
11393 -217921 -20882 -196064 -181069 -38903 -28916 -314426 109037 46663 -457634 90373 -28243
11381 283349 248604 -138852 103312 -216407 168672 37238 315775 -32956 -200746 108287
11370 22796 -101200 -98463 29710 -10346 367463 213629 -21423 -26645 43621 -183622 331111
11358 -71097 11862 186379 100632 33277 -349398 239627 -112094 102709 -61349 8636 -140112
11346 -184338 142560 -236903 7052 32109 113314 63701 141271 343285 -12702 87813 -167662
11334 30917 -55486 -293030 -52659 -87276 -170742 -27156 60222 235397 136329 247983 -336257
11322 -155437 147185 -126313 -14351 217586 114544 -252235 -11889 -176715 39574 -415164
11311 -28503 -6249 44285 -64460 -126725 232978 -168782 -86707 218278 -281488 -188744 -70621
11299 23619 -297442 69388 -66726 -283207 161891 -217231 -80197 102004 108959 -27282 31493
11287 -17556 -132875 65227 135487 -115825 -279475 141176 -253030 289447 2997 90249 38910
11275 106849 7611 54355 -94853 242 -144666 -361220 104574 -5936 -179356 -188746 -23620 14232
11262 -44825 131502 283684 188209 122211 59163 -232425 115138 42583 -398610 -43440 -239979
11251 -239979 250205 -256881 -9006 -33113 -68310 62899 -91953 -211580 106443 -63805 -15517
11239 -259533 118734 83584 -255632 40334 -118530 200924 50285 192414 -93947 -128639
11229 -128639 -110273 153378 -98730 -3152 19809 157753 -125318 70256 26618 45688 -120132
11217 224075 -251611 -120423 -221750 60365 -438370 62559 -86752 -60126 78335 138701 2101
11205 116043 58282 30552 -131926 -33008 -148851 -109371 15577 55946 201738 29684 63971
11194 63971 -42198 -23744 -134331 61001 -82826 70711 -1302 -314485 -368779 -210821 -113683
11183 -113683 -3807 222285 -167716 77839 -166600 -119561 3728 90934 -187906 106007 93502
11172 93502 7346 -317998 -110244 -82274 10588 -196885 210576 -34869 -42077 -369271 -265628
11161 -265628 84815 -84926 6830 60413 -227008 176584 52930 109976 63251 167485 -307035
11149 -233153 -103425 232990 -84679 280531 249284 45507 -128392 -197528 -56915 -36574 93301
11137 -265425 125034 13478 85242 223795 -112368 164552 -103696 219702 -41261 28302
11126 140409 42739 173565 152713 -123110 69577 70739 89699 126498 -58287 -214940 52838
11114 -258524 -101165 144626 -314371 174131 -31118 27731 49469 141801 63369 -78468 -88253
11103 -88253 -39797 -139206 83882 92548 238096 -25204 116836 -34684 -92518 -134969 328741
11091 40422 -38355 -229498 92228 359426 269516 161037 135164 -52048 77681 374405 218561
11080 218561 342356 -68072 -60419 100046 137620 339716 75966 218079 69668 253653 282594
11069 282594 13388 222045 287414 240334 309197 307315 303688 178541 249392 489879 399498
11058 399498 242824 667519 632346 560268 518351 601133 725569 421284 314004 471321
11048 471321 327459 533316 468643 496279 435721 643042 670524 654857 561047 831856 714819
11037 714819 572104 519811 716979 195289 519759 551554 233130 532092 560960 374645
11027 374645 531581 484810 492909 641819 377695 274210 553972 299218 646185 575583
11017 575583 300968 649336 532137 540866 584714 461233 508292 625518 507793 500792 429500
11006 429500 286500 514841 445319 720784 426687 48585 311215 99919 465782 400857
10996 400857 503636 585307 248135 594801 311344 448039 429355 602187 761144 420413
10986 420413 451684 355575 606385 928683 570792 575366 1100287 755909 1005853 1050721
10976 1050721 1305672 621173 1312341 1397189 1844938 1791992 1417566 1799494 1656822 1518053
10966 1518053 1509375 1462098 1329041 1264932 928846 1273551 1205503 1189028 1240534 1155212 1523340
10955 1523340 1324672 1155998 1333098 1224498 766260 948891 895967 565223 611097 559427
10945 559427 92166 518367 221840 280258 -183592 257126 242203 49629 393576 48736
10934 10642 -163595 27331 87731 223944 35631 151622 -171730 -64099 -368993 111949
10923 137362 149824 -24519 6290 -198500 95416 18906 -222767 -137577 182250 -50387 -202303
10912 -202303 283633 43868 -52839 141033 52744 -342389 159112 -16354 138247 -86565
10901 50568 -37006 186704 301832 -311477 -22687 -15024 -126683 124441 -132688 174222
10890 -51896 -109406 -354185 294359 -387206 -20036 -174564 49416 344350 102710 -213219
10879 -108539 56590 -217316 -196590 -238896 -256943 -26424 -138312 -36509 -14332 126846 70175
10868 70175 91801 274287 -83501 34776 98064 -77833 -10084 178416 -306541 -239562 -65487
10856 157433 -235544 85587 -245326 179047 143252 42003 -46640 -248372 182259 102971
10846 102971 -17985 117739 37304 -139783 -271461 2317 20866 -189116 -124892 23976 55872
10835 55872 -53794 346048 286117 23995 -220450 -2111 -163838 -114639 -141533 -483101 21138
10823 71781 -56960 -174477 91010 -318047 -33853 150327 -367023 -70215 96436 -88151 -133241
10812 -133241 -56766 -103772 29982 -239180 -144364 228649 -137421 -151957 -93963 53813 -21418
10800 172507 -34156 -66175 30752 32601 50639 3714 257564 -165782 -157875 97641 -342000
10788 202880 217594 205427 10770 -60312 -328578 79245 -128415 -162015 -253137 -148716 -142087
10777 -142087 -214155 -186867 26742 -104007 15228 42857 130064 -134633 -245279 2460 -72650
10765 -261 -193478 -22829 -136968 -43811 -245516 101964 -73741 96098 -15470 -54868 -13917
10753 -198704 198235 238268 41848 -218308 23022 -79118 -100851 -65991 -6049 -102683 -117606
10742 -117606 123418 15377 154955 211202 250270 37224 -209103 -324190 -63511 366229
10731 -78447 274240 -37632 -80608 -98159 -195783 -285633 219431 -330217 -84502 48899 19539
10719 269415 -104935 -74594 -128039 -290058 -112120 73786 240701 -78177 106825 -289351
10708 -121789 -36957 -8019 55045 -257522 -144383 -534929 21756 -104341 -222284 -44792 -251944
10697 -251944 -302831 -172739 76162 61219 6773 226204 -312746 236446 11816 50335 -76186
10685 526173 232392 -53809 -77195 -111408 -6350 -332398 -23562 20048 -194628 -29941 253010
10673 -189995 121999 -197474 -128576 -281973 -66556 -130781 115872 333493 11275 230222
10663 230222 157853 7461 7163 -226955 -24463 -74357 -59492 19039 -392352 -287742 -289138 -268585
10651 -268585 -189552 64624 -250632 102236 -193674 -115862 -122747 14967 -175554 175051 200398
10640 200398 205424 -173725 106022 113766 -110393 -85769 -73830 -81473 -41164 191099 -159524
10628 -85076 302202 239393 107031 112296 -67688 -83023 -121332 -25644 141055 -183592 -104815
10617 -104815 136339 233344 71783 -151610 -278951 209975 -50813 3286 -20422 -129107 110048
10605 -39951 -413030 -51433 186506 -193166 -116279 -548134 -135398 -198794 -274496 -171137
10595 -171137 -1496 -54101 107406 -303013 -65524 -272097 114053 -107532 53520 -74614 -173325
10584 -173325 51194 -104823 -108258 -86069 -30674 -16788 -101875 97272 10840 -318138 -190907
10573 -190907 139557 35307 230481 -168251 226960 -168704 107359 -286541 -216068 57984
10562 156500 -130596 1647 101081 -230185 -304807 -178458 57094 139554 -239305 -201406 85502
10550 -261134 -204349 120129 -162963 -15121 139118 -37050 -52882 24304 -88729 152021 102802
10539 102802 10010 -448737 -63521 -24239 -317825 -7643 32671 -50264 -75744 -84595 78592
10527 -169688 -7230 -269667 133898 96150 177564 -244451 315062 -122590 -212250 -190175 47133
10515 31316 143123 161897 -194798 -95318 -181374 -94194 -230513 30848 -244759 -156275 -52949
10503 -126793 67277 -33972 83583 -13457 -414064 -153195 -135095 32389 64489 12519 -472001
10491 27588 62668 -68862 -54895 -121678 -180437 -8055 -32274 403922 -171104 -241114 270601
10479 437907 409131 -84155 242675 -29666 -250656 -115250 -175404 -60346 -131606 -74977 -91006
10468 -91006 224208 -129090 -81181 -261371 -54867 -244161 113414 -183875 -301821 -313842
10458 -313842 134589 6937 88515 -2420 -56723 -246706 -78371 192884 92170 39184 73347
10447 73347 -15857 -28057 -52357 -50072 -7894 -62090 -24139 -188654 206600 57394 277969
10436 277969 -4179 -311915 -625 -333005 -124203 267428 -12623 -169733 -34393 67096 -48034
10424 107100 232696 -253478 -12069 1966 -15325 98028 -15481 87222 219375 185686 190843
10413 190843 -84264 261867 98280 -33204 -79316 61523 -100641 -97337 -137914 8894 -60896
10401 -32602 22701 -248919 17697 -68496 34357 -165715 156434 307693 29312 194059 38651
10389 133857 79886 200660 -97623 47045 -63732 -2643 -200476 -2644 15564 201664 27988
10377 -43852 342546 -14690 184287 19848 358810 273012 262538 166752 19494 -41473 204134
10365 115930 230034 225893 342275 -222662 394287 138794 244376 526258 502954 -61119
10354 -68606 88565 377005 178661 321104 151263 478817 242446 231467 440490 20678
10343 476397 241619 352858 210959 56898 230058 216519 225043 -165629 169310 288282
10333 288282 -75940 -152558 17036 75404 -144914 201973 -104667 74486 87292 46779 190509
10322 190509 -13286 79367 -213456 628619 268095 -11525 -104436 -14037 294431 155779
10312 155779 296788 -61755 -4220 -87392 89371 167467 -168882 203795 -10069 -67225 -49860
10301 -49860 -108020 -24719 -113072 -138519 -143722 14666 -38331 79009 -523651 239615 -337973
10289 -24622 -90731 -237145 -116917 163725 -20923 -33646 -345410 -195750 71900 78526 71936
10278 71936 70675 88772 -96420 -571 -10088 299375 -37871 -14110 116602 -23413 -212355 -246369
10266 -246369 -288606 -11459 186943 445306 114095 209534 426623 369173 256412 300521
10256 300521 219396 156824 72961 -114985 -118658 -70892 -215991 117675 191451 -78515 -138743
10245 -138743 33497 23536 111718 48321 -344907 109741 -33637 -187851 115391 -207178 -340390
10234 -340390 -60423 -90319 82627 100416 -128722 1527 -232954 -110026 11937 -201639 160713
10222 82134 238474 -164585 106099 185923 -18417 -203144 -18843 -130582 -94538 404272
10211 5239 -13623 -307153 -45581 -67350 -465911 -205329 51601 -238945 -293244 -73962 16401
10199 -450629 -119683 88791 -61829 -8481 -357001 -349020 158220 157308 84816 -93477 98828 -12244
10186 23271 -39223 -133474 -108523 196082 14336 -315826 -326240 -19956 -136006 -272250 416
10174 7779 -121306 9197 -131775 109307 -333738 75190 -102966 -118104 159364 -183461 -154374
10163 -154374 -290846 -368347 76883 -129992 -184165 -1319 325706 20348 -64897 47977 -212861
10151 -121616 439164 34272 -223244 16465 -197627 -9222 -198645 -200161 81872 -13437 10563
10139 71611 -107685 -263958 -136156 -73846 -66113 239711 122188 105122 -151530 215992
10128 -39423 -30280 157586 181213 53060 -100976 221650 78134 -117124 74299 -277006 -230093
10117 -230093 170168 98585 12881 -166169 -377338 -176558 -237990 -304680 -21110 24959 656
10105 179068 -334226 34383 28718 271454 -276621 6255 42586 -172402 -233290 -125981 20251
10093 -71677 -31906 -394354 -11479 -272143 92230 -117273 -235129 -74365 -33161 -39617 -290607
10082 -290607 115893 -211558 -161826 -34852 -377887 -162009 245297 141406 42364 -16061
10071 -97733 154774 160269 6216 172174 -303443 70620 107227 -24900 70675 177642 -221156
10059 -315025 -34996 -290617 177078 -140312 -91717 -53349 34679 19863 103843 119641 -421473
10047 -51588 70822 -408397 1820 -296095 21248 -70124 -53803 350296 -55358 73054 224182
10036 224182 -150835 183584 -149440 -108163 34257 -253787 -407930 206431 -38037 3042
10025 -216585 -186608 257689 66815 -154712 -8097 -40881 250542 -245900 -91807 -272719 -25183
10013 36994 15165 -346499 -57932 49389 -251598 -234229 -83589 -109730 -435205 240936 -14212
10001 -49758 60716 9610 -52042 57000 93205 -90743 -289050 90348 -117959 -372906 73576
9989 65749 -117440 -235753 59354 137729 -82109 -130635 21232 -150465 -87665 -150352 -17913
9977 -209129 -224390 142983 101792 28461 -48265 101637 -239215 -125816 -116055 -135183 4887
9965 -70083 277088 435323 -108639 107187 -198288 -85902 -98089 -145640 -69908 95245 -200497
9953 83459 257728 -307365 51772 -127445 -167629 129468 -291138 -169168 222703 -248709
9942 63752 -98067 -309663 223074 174490 59735 -420978 108427 125173 -184040 16477 118894
9931 118894 -87117 -217719 -138713 266662 -104039 -148497 -7362 3993 154928 -357322 -186291
9920 -186291 -64290 135150 -304166 -191319 -92691 -233067 224313 96945 109794 -123175
9909 -85213 60626 -239287 -405151 -184683 -4965 -20899 -69516 -72147 -166700 193819 250726
9898 250726 -162621 -330370 -187927 -136411 111079 -149733 -410567 70039 -670 -150165 -150673
9887 -150673 -92789 981 -137957 -66164 -14098 440461 -255078 -3316 -164455 -10611 -115255
9876 -115255 -78499 -28549 -65185 -6224 -117900 21097 -252705 -28317 -18467 -23343 -178287 -383525
9864 -383525 -3776 -120871 -271110 -305543 10123 158754 -311712 -479070 124111 -18076 -574174
9853 -574174 251536 -47667 -10253 -104253 -106226 -217482 522018 -115196 -380343 -184399 3505
9841 335125 149034 -146069 80489 -74594 -289288 -375653 130730 139688 126667 -70894 36307
9829 -194168 -7312 63665 -253854 -116246 50209 169605 -424259 5260 -138024 88361 -340537
9817 84437 -215558 176599 -335522 -43300 96846 -295048 -117597 8014 -140556 82033 -353775
9805 -67080 -131720 -108189 -224995 32423 18065 128996 -205412 -142866 -1432 -120893 143195
9793 -124685 -103390 -306685 95247 207884 294085 -204452 103848 72073 -229015 -80234 155095
9781 -97573 66930 112069 -26759 -38428 250240 55144 -327385 -186387 -23122 -22833 43718 -219186
9768 -371730 -28888 -25466 82033 274093 -52077 109598 110395 -188160 -74194 168538 -141667
9756 -119502 -192095 -188520 -224634 -118164 50825 -238226 -1696 -237375 -192881 -62637 -153375
9745 -153375 -161634 -304560 -1425 -194381 -74030 -180064 -367463 -160457 -103675 274885 -346691
9733 6781 86784 265780 -230897 16784 -52012 169618 -82316 202850 -28767 44002 -128538
9721 20541 239868 84384 -5328 109143 64027 -89382 379619 -84640 -16859 28435 -58182
9709 -80986 -167418 -101543 100393 223401 -75961 -144710 -128284 -163698 57906 -78077 -38844
9697 176761 -189707 -115229 56446 -173117 -150869 -300962 -261752 117473 93233 257858 -202975
9685 51725 -107270 112613 121997 76641 18759 339919 -141089 -197457 -15808 294911 -128701
9673 -9340 -448926 -87462 1842 -64962 130870 -120833 131979 20916 -49869 -1240 -280200
9662 -280200 -102803 750 -255575 -100124 59712 -72716 24749 -105320 254673 -143174 -7302
9650 30648 -11626 -362830 243250 25863 2396 -221750 -137080 -28257 -42877 -190683 -104824
9639 -104824 -129765 -75807 -319285 11709 -37990 3869 53016 -76699 -310855 9968 -182009
9627 71828 -14584 385223 173572 207724 272879 41767 -316594 10256 -151801 -435770 -167142
9615 -139138 31052 -75917 133334 167144 -244405 91119 -75241 263048 -316200 -137017 -162223
9604 -162223 -213152 -20930 -91196 113953 84961 -9372 -23490 -185884 113020 -75689 -106343
9593 -106343 -161834 104461 -231564 28945 -181209 -202458 -24303 90541 69798 -84510 69146
9581 -98737 61081 183868 -347643 -324608 261533 -415798 -213278 178940 2728 317298 249412
9570 249412 -213580 144908 -411885 -19825 129405 -85620 -163926 66731 -243257 -218492 155562
9558 -7965 -1504 -8118 -200499 -89350 -169042 254187 166580 -41150 25035 64963 156206 114655
9546 114655 172789 165918 -142789 -189210 -52299 -289995 3237 -299878 182674 165321 297459
9535 297459 -21035 163040 -69265 110673 100674 -311626 -222101 -374538 -267528 177217 96106
9524 96106 -138008 -52767 128991 -400431 -65877 -305716 -430788 -266445 -231344 -256434 -49288
9512 104973 -321740 -76096 -80697 53295 -149657 -89910 134025 -14930 -212077 -165465 -237206
9501 -237206 61178 94570 -87971 -36660 -54646 -240323 224468 215660 -135225 -103534 68434
9489 -21858 -291842 -116225 -356775 70407 50369 -24844 -134317 3905 -142655 -235480 -126819
9478 -126819 -88275 -265866 -106856 -68059 29158 -1250 -454369 -125102 46043 -57282 124783
9466 -133911 -169980 -99481 -53904 110113 28241 70823 108698 -18563 72742 71240 -65368 172194
9453 -76041 -72707 46101 -255175 -183248 -49457 -77659 -92215 267440 47264 -93514 -147531 -183164
9441 -183164 64355 -8798 170408 -313327 -72417 -456398 -252526 180007 -169927 -7032 14744
9429 -361047 -235165 -25219 74844 -51946 86611 -30428 -106982 -386933 -76475 89172 -120779
9417 -283184 -167798 -278536 -319555 -399168 -385388 -147706 -145647 193849 -139360 -395830 -157300
9405 -190414 -174452 -247245 -314444 174846 -79101 -119285 -288711 -230500 -232970 8701 -139459
9393 -96506 -113370 108484 -86372 -54671 52767 -263274 173116 -138353 -74645 96803 99163
9382 99163 -179120 168887 -212071 26941 -66255 -14578 -233538 -135746 -103265 4843 70153
9371 70153 431882 149028 -70754 -174557 2196 -66577 -340498 -158000 -80845 176624 -56121
9359 63637 -46923 -103565 -586822 16372 -97555 -16112 -30665 -87909 217202 59495 -292710
9347 -256265 102911 -109300 12524 -7558 -520251 -124258 32102 -15494 250512 70891 -244540
9335 9734 -146075 -273839 69312 423580 32580 -65881 158829 -239729 -108165 -205287 -237481
9324 -237481 -25738 95029 -136847 29452 138739 38239 193532 -41048 316044 -162340 -211431
9313 -211431 156450 -89475 10238 -207755 70549 -78255 -118266 -296254 -161795 45995 -63005
9301 -70876 -50265 222318 -88930 -331747 35740 -38806 -36619 173480 14808 -127241 -155667
9290 -155667 9976 204934 -66602 -42074 -70269 178332 -228901 -129514 4836 5421 16039 -66962
9277 15790 -134776 -17517 -257966 -269059 -446781 39465 -95711 216587 72852 108417 166221
9266 166221 -52122 167505 74328 -177966 -10251 -112295 -210251 -357629 221432 -161188
9255 -114825 -284889 167584 151080 67331 196301 -12676 25902 -52958 -103402 65634 -230886
9243 144871 -434066 -44705 176442 -332534 -167557 -94006 1804 36651 -56146 -39815 -288190
9232 -288190 126417 -386396 -164129 -294444 -98852 -117450 -150648 -50496 36195 9776 36892
9221 36892 -357864 -223069 -13784 130946 -49008 -314983 38683 54394 -109399 -230475 -13035
9209 193950 -30250 -27750 29805 -142231 -74483 111897 -58770 15206 -280444 -6700 -53763
9198 -53763 -171355 53395 76886 -149618 -12919 -29150 -205267 -72753 -73191 -294862 -138303
9186 -174295 -14390 -168089 -44192 3889 127903 -35939 -71079 -63088 -26925 -311474 17188
9174 -48612 64648 -198263 -185826 11822 -416052 -49209 198277 54853 -61232 -211541 26297
9162 164976 -34007 -6371 57714 -196013 142265 -242663 -596858 -181270 37901 266286 41066
9150 -173718 124198 207768 -260978 -22362 -203093 -57627 -81025 -349446 -75802 -141486 -164609
9139 -164609 150441 110647 -180043 229149 304205 -119543 43245 -213646 23885 -96646 -64222
9128 -64222 -38714 -308994 -182928 243962 -148394 -192599 -93164 49981 -23574 14270 32725
9117 32725 65397 59141 34194 -37686 44696 -118862 -116717 28266 -173188 -101297 -55213 -54622
9105 -54622 112508 -135034 -34444 83061 114128 21301 116461 88233 349141 -239289 -99859
9093 -84704 187948 -150200 -94600 -4190 -259783 11008 -194973 5172 -28588 -25459 366517
9081 70149 -67522 -216571 -41742 -96058 -155276 77797 -269425 -58657 -321877 -167022 -123476
9070 -123476 100405 -113414 195986 -115 -133571 -63337 -87390 161004 438878 -162503 -317400
9059 -317400 27612 294825 -505262 87335 -79735 -283185 23057 -26257 4195 29086 -15902
9047 76294 207397 -168386 -254011 8179 -318073 -158609 68873 -126387 121759 -372211 -185310
9035 93612 -93895 248716 194829 -211830 -312611 79860 -145329 65153 -48815 41222 -7372
9023 103612 -52972 35931 -52904 -27192 -57409 9816 2672 -201629 350904 -149153 -201373
9012 -201373 -241567 -98357 67471 -209618 -153244 -122742 -293732 -163491 -5518 -60954 4082
9000 297742 -247971 310666 109022 34600 -286083 -67710 -304569 106351 46097 -191507
8989 202148 -264070 -103136 178809 -243320 119416 -33514 -358481 176856 -161922 -159793
8979 -159793 -337756 -121337 -190735 -153240 -350003 167042 -6389 -204768 8149 96176 100067
8968 100067 159227 -301274 4053 -202686 251065 120430 -195575 59287 -30158 -195995 -257777
8957 -257777 -179899 175860 36415 272722 85578 212446 -170185 -366135 -222238 203646
8946 -161340 146677 -162881 -184290 -228808 -149216 -115345 -75459 -120757 -33068 161748 5228
8934 331940 354707 -158730 173096 -208571 337770 53108 -28231 103558 452957 286344
8924 286344 498788 1273018 3405201 11634584 9334741 3416673 1123515 906522 594884
8915 594884 538837 331529 97402 207288 19694 83300 -331456 423600 625615 51999 456
8903 24710 -43049 84 408444 -50751 -179355 106029 -240563 -181291 234724 -374814 -50949
8891 -197296 -159685 -100816 -420159 -177697 123188 240047 -110191 145892 -199302 125957
8880 -65191 54751 -200357 309603 -86417 -40276 -172261 -112718 285673 -97473 123596 -142009
8868 -468625 314978 126938 -82705 39691 32039 -168181 -167941 -129024 -374413 206404 62849
8856 -85464 135050 -51457 175011 133037 181878 304495 -190954 -98624 -432458 14089 -130863
8844 -389544 -8981 -314776 -196310 -4139 -333063 -69411 29750 -228667 79055 -13486 -135899
8833 -135899 -112365 185250 -226584 -10572 320188 -72616 -61160 -129978 -23554 60501 149738
8822 149738 79216 -49722 71018 -75409 -271431 88505 307169 378575 175941 20090 -56450
8810 124197 110970 -140354 -33510 247006 -266428 -139984 -179621 174840 -52868 217416
8799 -169879 -128005 -68237 -330417 -100314 -251251 -144121 -131015 267646 1672 -67239 -181100
8788 -181100 162233 8356 187966 -144134 138055 122670 -36611 -295080 281192 -48352 -7598
8776 -231519 -146420 -321583 -154800 59123 -226434 -180812 121440 -90214 -15639 -115593 116559
8764 -198180 -106228 -185093 173581 -104456 -44555 -118375 -3469 232271 119203 104447 -166051
8752 -82764 -209361 75610 122047 -262697 98048 -192684 53454 -158474 -266282 -308726 -11586
8740 -54191 -9159 -20186 -50578 -233734 -240011 -188872 33344 -185182 -53975 24992 276662 -344439
8727 286323 128175 31533 -47899 159144 126605 29834 210714 -41518 40184 -293141 106188
8715 281417 -302561 -88240 -34310 122763 -148808 -43906 -52727 -78104 -108274 72732 -22834
8703 94099 -226028 -207110 -29736 439361 -17066 57409 -28310 145291 93461 18728 -96405
8691 23033 468774 72924 -138218 191639 -58338 -55057 125841 92269 -38380 18154 -286524
8679 70894 -153516 -212678 -172461 -68978 149705 -56250 383277 -196579 174572 19227 -51741
8667 3153 -174650 270524 -113846 -149120 -22937 179106 132565 154124 297153 30162 -110983
8655 83441 -193843 9128 -82858 190906 -168406 101623 -306785 -267308 -330225 178664 22540
8643 277238 -118556 48989 -279992 82849 24132 -207537 -162096 -65820 -243014 -36093 32573
8631 120995 5717 171986 235246 -174920 -293820 171550 -224633 128422 -47975 -712 -241978
8620 -241978 -268510 -430159 -10336 -271752 -38867 -35619 -54922 164357 -228902 -140356 10097
8608 119493 -166524 192572 9866 -537577 -56314 -118035 -112638 77294 51425 -96467 -256549
8597 -256549 -121440 -310634 -125057 71367 -238386 -103168 -36517 -163960 -114132 -342580
8587 -342580 140913 -147335 -205002 55680 37416 -259136 26703 203178 69167 6293 -246676
8575 99660 -172814 -76225 264768 39918 -224553 -298551 151550 -205603 -189826 -91056 -285
8563 -133990 -159631 -25203 177342 70031 -189320 -105550 -114136 -181277 274701 -54824 -147425
8552 -147425 147978 -260249 58897 -303584 -164719 -173858 -88420 -8692 330881 -189564 -5419
8540 -71899 26610 -588 22651 12236 -242491 -42996 64471 -182766 -22567 43244 -199924 -363268
8528 -363268 -168986 44364 40941 64153 128729 133575 -27412 211899 -279189 119184 -63953
8516 72025 -165570 -154567 49314 230777 66447 -213533 86512 703 13933 -213212 -523015
8505 -523015 -382477 -21424 -4366 -106615 86922 41821 -10223 193354 -118274 -176041 76655
8493 -365639 -139839 -37036 138037 241875 137391 -155800 -245911 -115878 76812 27308
8482 -321400 229800 -140323 233041 -10441 -24148 93249 -104939 -56223 -108496 72131 234188
8471 234188 66870 -311069 -17053 -99734 -36811 -157219 -427943 -324491 -3138 20884 10381
8459 11037 129305 287336 110392 -56000 -94396 -203721 107270 -182843 87614 -200955
8448 48891 129621 -3731 -38532 93292 -202426 30328 4229 -88251 126658 153571 -84710 -289537
8436 -289537 70720 92166 4554 -373757 -119260 19359 134319 192551 40764 25561 -179909
8424 -371774 260305 -347455 -21696 -104190 -122020 -126081 47710 -290247 81316 22530 -162429
8412 208293 -213351 -104578 -104861 -172823 -271060 -125039 -79247 19022 6461 191424 -270621
8400 146207 -68501 -224716 -163315 385713 115504 -98141 -287083 -96396 -158901 384286 -133288
8388 -79221 -151620 149852 64919 8298 -274565 -138937 -33095 -138527 -58872 139393 -54103
8376 -98266 -260972 -112603 1436 29483 131661 -100563 -296804 73623 -169479 -574456 6262
8364 -236528 -106750 -150164 -203011 -100748 -329213 -29771 -205123 -219970 52675 143193 -2354
8352 160059 157758 98667 224578 62050 189972 -113556 -109962 -104143 -259265 271772 -105720
8340 -51644 -69024 -42021 -101584 -44648 228504 -145010 44982 -141369 98954 211789 130444
8329 130444 149794 79078 -296034 227036 -58554 -59182 12510 -29321 -126345 -248750 193135
8317 -84510 11649 -83897 108460 -2428 32035 30892 -157620 -303188 -59332 55702 54546 -119405
8304 -37557 397686 -44508 -117377 -396552 354652 226507 -243498 -51994 160835 -283569
8293 -255943 -88081 -93086 81539 2010 -144102 -190410 -94007 -1729 -76008 -36595 7446 -104339
8280 372826 -31335 19197 216848 19397 -192879 77741 -162393 -88794 -79593 -17459 -16996 25189
8267 -304942 43067 -232556 82247 -101381 -138007 -106452 -243288 94923 -89126 -130583 -166398
8256 -166398 -331318 -59037 340354 -121897 99083 -34607 6392 -437741 -42860 -332361 -162135
8244 -9746 -1812 109132 -269457 -2196 49235 -231084 -355242 -44957 115274 -68827 121922
8232 -105651 58090 -21268 48384 -95033 -38448 -48212 218878 259651 1944 -53806 -214071 -82777
8219 -363987 -247897 556080 -446682 230708 174995 251783 -38892 -137804 -215733 141138 215452
8208 215452 -307726 -51128 -51803 185623 28886 112412 -212830 59007 6177 75031 206552
8197 206552 -141718 -125417 -240995 -60182 117438 57744 27030 -108571 -79315 -18856 96458
8185 34735 26979 18751 84943 -118885 191674 -72091 11452 -85984 -136611 145337 -201023
8173 -43037 -39182 -189763 -180800 -77282 211645 178368 -29437 -46282 169480 -160776 91951
8161 -124629 91742 -178054 -10103 -204351 -78533 -229751 -248542 -38200 118284 -84435 -126131
8150 -126131 378775 -91988 -268202 119807 261610 157466 166655 -56244 360129 70654 151282
8139 151282 36835 44253 157334 -129860 -3572 73387 -22136 292619 -178186 160655 -65892
8127 -151658 27719 -32545 -169023 -291492 284368 -14994 -102798 144797 32729 -244586 71967
8115 -40442 -10649 50158 -183807 -371259 -18945 86442 5637 -128711 47616 -423529 -51446
8103 233770 107062 -67496 -58268 -579 -173366 -99135 -15130 215947 66565 -398162 -197619
8091 -143946 54721 -197563 -138327 105978 -40502 -100889 193455 -246346 -153701 217936 -40817
8079 -119280 -194768 -142022 211093 106125 114846 -166 140024 -128297 -41462 234204 105511
8067 10307 121618 209045 -313228 121989 33041 -59610 209857 61882 8896 167594 -194962
8055 -34730 18481 -137461 94526 95307 -216824 -21741 -113050 -58491 2234 39019 84839 281662
8043 281662 20994 -92303 -17551 -191242 -32828 -50399 -241946 -278382 -342646 -131212 93986
8031 160953 -193144 -20297 -300510 84306 -189384 225021 -48311 266896 -242522 322341
8020 -352106 -142340 -116028 -4035 -150154 -300454 9299 -358987 -128228 -165735 -382884 -192490
8009 -192490 336247 -109043 -39553 38431 -304827 138552 11503 260637 59801 -34226 -177569
7998 -177569 160128 -163017 -60022 -12878 -6323 -315674 -7397 -247650 -359761 6125 -79983
7986 -11362 350785 102588 184011 -444 -48395 -81497 -4480 94889 -85398 67521 -245805 -102767
7973 -236261 -399437 -338196 -81265 -10225 237703 -240030 22815 420216 60426 -35315 164665
7961 -71454 -260295 33190 -213764 50088 -155369 -244912 -274193 -212235 -460830 38670 -480426
7949 125040 323538 -202379 162656 -214508 193446 112065 227970 35738 -48848 127083
7938 -179010 84535 -11010 -141709 -114447 -66072 5913 22742 73875 -276145 269473 -126065
7926 163859 224000 -34120 -147776 79590 -70173 302420 1737 112378 37750 -69559 -140842
7915 -140842 -33646 59188 53383 17502 36330 -68526 -85196 -108617 -238082 -98347 -262976
7904 -262976 -193978 -250874 -309158 -197232 -72823 105954 84803 -22877 -228390 -284853 76165
7892 194963 -74147 133489 34033 -12003 -127182 51569 -72475 71484 -140139 355040 -119635
7880 296269 -85562 -135257 144776 -250741 304934 150600 200844 -474132 -28204 -224727
7870 -224727 -55917 -178662 129554 272780 -264745 42562 -62995 41921 155969 -67842 -218614
7859 -218614 95615 -151680 217091 202149 -155559 -114767 -271490 -182355 -268571 -267755 178695
7847 195083 12483 303660 -99748 130232 51817 60155 131082 187949 45286 -108550 84505
7835 -39007 -104548 189710 -132687 241100 -130854 -48928 -36773 191988 -133158 -88552 150198
7823 -259287 -45160 -49457 -53642 -233267 -62244 185944 -3433 3891 86496 297154 159362 -187994
7810 6026 15633 -35380 -13900 29853 208457 32168 -240299 -62779 -80991 -112264 -56426 -221542
7798 -221542 123758 289573 72610 -298447 8721 -39645 -23656 -115998 14574 -269881 -112661
7786 79689 -309053 293146 -200677 -199411 -61695 -99424 220812 30006 47054 355994 -44629
7774 -152761 146448 35420 -271338 -211374 247452 -93424 -175272 -162577 -177922 -34283 -87547
7763 -87547 -181630 220633 112555 -251497 -108768 157441 4775 174063 -103066 23487 -325052
7751 161271 167883 17585 -210103 -164755 -37807 -80148 635 28357 -49656 48702 -136619 79858
7738 -89654 -449851 -141204 158600 238473 -14453 -115103 -109753 -117830 -134067 206132 -108676
7726 -108296 74717 -226102 123528 78445 -17433 -510055 -428650 61245 -24895 21635 17570
7715 17570 212054 190006 114811 -212346 -253928 252833 95561 -221086 -106078 -283489 60324
7703 -249312 -150333 9654 -151644 114904 -89304 215065 -17948 32633 171372 197865 -236823
7691 229302 -211847 -94308 -228425 -111935 -104114 236798 -359050 -180412 126089 -3533 97886
7679 6128 91484 -261231 54629 -180668 -210000 79077 -15948 6719 -54685 35912 -16839 -163888
7667 -163888 -192245 191851 105309 -334378 -112758 -231852 117983 234893 -329287 99181
7656 -53449 6157 -69212 -138497 95166 97468 233963 -71806 -111368 -12048 -181173 86998 -300937
7643 -185833 -215665 -60063 -115044 126031 -3005 -295949 402125 13839 -29393 -128956 -25046
7631 -35218 -238584 41525 37739 -4979 -102722 -122633 -192214 -1882 -127191 66081 -180233 209322
7618 -163459 -281037 43814 -128888 203789 -404559 47746 -50124 261821 -60322 -40388 -26289
7607 -26289 -136403 113972 34005 -112114 -148952 33146 32502 -67704 -6439 -217971 -122628 64939
7594 52856 -259134 30946 -311894 -170575 -208530 69364 354590 -28398 -411420 -312900 -15073
7582 -171122 185918 76634 -222751 8124 149694 -40633 -68832 266707 79228 -12735 76770
7570 -65322 112369 430 -129144 -32225 166249 960 -96961 -252043 -150938 -208962 -40286 -34625
7558 -34625 -47470 20903 11012 106065 -97490 -24915 -112860 43726 -238340 -307917 -141826 44424
7545 -122461 -116603 156596 -261090 -150056 -1161 103378 -286974 88001 -118366 -281325 -200852
7534 -200852 59165 371739 -188586 333492 71450 -142457 93703 -185702 -358680 -235602
7524 -235602 77247 -279935 -15033 -135522 -97212 -226176 45280 -34785 133208 152676 150607
7513 150607 269493 36035 257427 178634 -202187 -126125 -47582 -72622 188674 -156690 21621
7501 48481 -66475 -60457 112029 -6045 -194362 -57952 -198352 123993 -66682 121050 113765
7490 113765 270123 -322839 -34270 -135931 -114382 -284230 -134761 3480 17520 -88951 7762
7478 -337423 -98267 -74925 172157 167488 94124 23927 207561 136464 -176723 64364 272855
7467 272855 271827 -165975 56422 94601 52543 -311188 -41785 -63517 96671 -179954 -9081
7455 -50743 -109230 61770 6792 -106956 -306656 -124999 -23398 -43636 -74685 48254 37987
7444 37987 -55405 72973 -204372 188246 -121257 -184406 16834 -168630 23247 65948 105955
7433 105955 -51091 -82168 -227735 -370300 -18670 -186653 -168506 4110 95091 113943 57567
7422 57567 -116325 -174653 -166215 -23764 189576 -104528 -266177 58151 -50669 -38144 -99349
7411 -99349 355215 -74281 -267553 -207141 -260338 48605 181979 -6782 117560 327662 95707
7399 7396 -181051 121665 118680 178767 115324 141739 -84948 42070 -165887 -117677 300000
7387 -143565 94198 -59154 49132 -171760 -265856 -138833 -2783 -370126 -338604 -338869 138837
7375 -187288 -106959 -7865 -266947 -104278 -125244 -91186 -413 182982 -58698 215329 -33566
7363 164205 108531 -71319 84865 71181 -262661 -245005 146964 -265433 135713 99226 234500
7352 234500 -203255 64466 -107618 247080 16132 -243990 -70707 3643 43351 -3057 -423610
7341 -423610 -121819 -61178 -90627 -164870 -64735 833 -179733 -82353 81581 209731 -188090
7329 -306278 -42115 -410720 -257474 -79537 -116663 99632 10227 -182731 259221 -169180 -43712
7317 -129964 196118 217630 54261 218383 32170 -86416 189481 234248 10903 78147 -191953
7305 -21836 -232894 13202 -105753 267582 -37119 101388 -191863 34185 -260316 -271125 -35267
7293 92742 -277755 42438 131149 107084 143826 -208642 27705 111380 38374 -152490 -115942
7282 -115942 -171470 296860 -9191 4178 57279 -183800 22513 169263 138083 -66822 -188592
7271 -188592 -155065 415935 -51885 -67473 327974 57316 94991 -111441 99565 61270 95208
7260 95208 5920 16914 -41730 76609 306959 -135598 -19821 -266412 226378 -136533 124526
7248 43340 -460848 243296 -180106 61644 -162879 56356 -198457 151036 144806 -27550 -36922
7237 -36922 -142513 -147107 72539 53175 -63514 44280 103440 54996 19950 -180542 -335232
7226 -335232 -256009 -214564 221202 -227051 33061 68689 -103262 -110272 -83167 -222456 -304242
7215 -304242 -163213 43994 -443161 235058 -84018 -125609 -245252 58771 -215684 5700 150132
7204 150132 -156288 -159005 -168452 197824 -85676 -6627 -43721 -134281 -137078 -105665 -236620 20570
7191 208263 83967 -2993 -16760 77721 -456650 -107863 31793 -78171 -182228 22241 -89604
7179 -104182 139062 91701 -77937 -251596 -355335 -206209 -254299 98578 -343649 192549
7168 18262 315188 89810 -87631 116968 160122 -25115 108124 95251 -161847 -119986 79938
7156 127121 45666 235428 -94919 -115949 128385 -65154 93619 -220735 6762 -210758 329383
7144 -92796 -27547 44801 -130521 -9554 -117553 -119235 -340307 -50288 36907 215237 129204
7133 129204 -37888 36753 104577 43356 -92165 -18717 73383 -32988 18496 -184601 48887
7121 424312 39987 -131315 -125481 -202534 -80402 -123561 -108771 -34785 -59021 99500 -4894 305013
7108 -364726 -32971 322470 -140472 183643 -45874 -94549 -152766 127014 -46436 -378617 377293
7096 43547 2307 69505 20261 -130209 -82900 163318 -368979 46264 370486 242362 -189656
7084 70809 -146900 -250592 98913 19440 45311 4549 -4213 144345 295328 70041 5465 203748
7072 203748 114889 111268 101572 328118 43910 -61733 -269266 -129883 581 -122201 -135819 -20191
7059 196478 8236 135621 332897 42703 -176084 58154 -394694 116367 -19859 -85124 192578
7047 -198804 29182 -167302 99897 114228 265671 -42275 -106738 479093 -42287 191944 -72530
7035 -37979 -149853 -316048 -430221 34472 7873 -212721 -7050 -180825 218010 -36722 44893
7023 178628 -149184 109848 -81051 -367273 179637 -34145 -431142 -68490 -309865 159795
7012 272857 345601 -229065 -58282 185560 147335 -344772 54201 -11495 270752 22860 -48473
7000 -32243 -52589 -25110 -210311 -259425 171251 83574 -97502 4291 -161555 -159254 102712
6988 -3463 -139801 -158348 -105079 -105041 -5485 11199 81291 246313 -31208 43409 -180253 -336681
6976 -336681 -184703 -24465 270080 -54674 -125213 -150906 -46596 -20773 -292948 40523 -20997
6964 -9223 -23788 67439 -75125 199754 122016 121517 30758 -1903 98607 -156323 128453 -64208
6951 -102116 -76517 58095 8491 -113145 219050 -90619 -271091 -54665 -231773 187192 -297597
6939 -51024 -11490 -26176 -43109 -110147 296813 190832 108148 -144709 226377 138998 41646
6927 358839 267972 212604 -46977 -237929 181898 -248551 -272288 317666 -22878 18420 -43623
6915 -5935 129382 126084 -171693 95887 -4781 31512 178788 160102 43872 162268 173157 -30633
6902 83969 64659 -134424 -280722 -43651 70012 257230 36879 320263 213349 -31920 -149940
6891 -149940 -327688 16195 -148003 -188068 172720 98178 133628 -195457 188693 -289869
6880 54612 -219863 95661 -216149 260149 178101 412804 136687 59569 -190491 -57227 -15238
6868 -10657 -183021 -124743 -146190 91206 9597 84999 -21206 -6620 -118254 -258009 115894
6856 -283145 92009 307230 393720 -35003 -161947 -126196 146038 95050 -90181 -326131 223055
6844 170808 -16857 133816 -141569 -152919 210315 219373 -76743 133539 -126083 3684 211527
6833 211527 -203871 -205744 65451 -134301 -241424 -104902 41504 154122 64863 -20656 -246047
6822 -246047 -106701 -121098 21749 -87166 176306 3942 259142 -5378 -32074 -301081 -145973
6810 -16135 -54672 -5617 -150108 34577 -2738 83937 42665 -381582 -112917 102571 -31477
6798 82058 94160 -239898 126602 -32073 -114421 56447 145619 70214 135517 -248230 -132458
6787 -132458 -147177 14589 -147403 405831 -27976 176491 -27710 146591 -103984 -253340
6777 -253340 -285847 85176 -224981 -6729 224818 -163154 -264441 -1028 -102540 190997 -11235
6765 -173546 180508 -240325 -85060 -190465 -410173 207585 -131096 5700 3008 -275402 70618
6753 -34603 47176 -38827 60478 -189959 112818 -170807 89032 29773 -7909 52626 82236
6742 82236 63391 -155467 -54412 -100048 60882 207122 242544 84322 37700 -127434 -1067
6730 -246842 203097 314121 55967 -54349 88993 -269022 85764 212372 -111516 153088
6719 -32834 -99681 -53945 124063 -36380 -30793 -395512 119956 157078 -71874 299437 -220808
6707 -28851 169448 84255 83823 -436230 -120770 77865 -128937 55816 -103858 86056 -109006
6695 -83509 -8088 23311 -111873 -45172 35653 -10433 -105631 -35207 12421 -130812 51647 66187
6683 66187 -40995 -17015 -77894 23564 -149420 342846 -137506 -77869 39474 -389314 -327019
6672 -327019 104122 159550 -256890 -97307 38924 -236167 -168234 159571 -86901 -40555 164201
6660 -39860 51277 -239207 -342906 -200334 178747 -42019 112157 -55075 175261 178044 81966
6648 212694 203377 46132 -90889 -61872 258385 198333 -101720 419679 -51215 82114 -245709
6636 5825 304491 4572 67378 137502 142990 27716 -26768 61146 -8200 249371 71333 -344837
6623 -10303 116539 27858 158636 131887 -41641 37871 -83351 -61760 32254 -251825 195588
6611 -146695 110242 74379 -36742 -147336 -270053 31755 17713 -104756 127196 -154841
6600 -223637 187999 63276 225050 49205 -65512 -178508 38859 228857 -399128 19719 96131
6589 96131 218072 15652 99766 -179098 -323331 188664 -149449 -287347 -109202 -160636
6579 -160636 -77641 20017 97445 -144110 90241 152535 125838 -63467 147612 162381 115621
6568 115621 -145059 313429 26342 -239302 -99816 58953 -17000 -167 38396 -65012 184333
6556 162773 104088 -37758 248419 -480285 -1033 5844 133964 -20123 -79900 115170 203227
6545 203227 -85201 -87286 -168748 290008 -217549 -62070 -155191 325435 262225 132497 -126959
6533 -194400 -182443 -55898 14916 -64382 127070 54654 -63488 -163885 226565 -188407 -98106
6522 -98106 83030 194403 -334920 105059 160271 150565 90590 -303444 87807 -263915 -11995
6510 110492 91520 55376 201080 -67241 -145342 -43080 -132273 -135356 77427 142666 188340 86191
6497 37716 29452 -167168 -63957 -68889 6672 -166745 -97337 -276349 18845 -30738 8844 364280
6485 364280 142022 28433 64617 -128735 146499 45120 58407 -133563 210260 110089
6475 110089 -94650 -71913 227310 -293420 -40290 -278312 95295 -99693 -261308 34082 -312531
6463 151494 -127992 276433 -185891 -164098 -160595 65061 -59853 19273 -241823 -24401 -4398
6451 -41334 115846 62645 -27532 137410 1830 -50125 -74674 -115829 145151 162780 -143313
6439 -18329 -112004 85038 -191605 -129637 3645 -188545 81735 196308 -192665 -75698 193924
6427 160714 76440 -22460 -161674 -106389 202207 -12836 -22482 88308 -146355 252730 -134225
6415 44248 63122 -78040 156607 -95450 116296 6449 -175988 142543 -22435 -277880 -273435
6404 -273435 9113 65742 -223272 29393 11467 -39499 195048 134657 -142100 -119509 -3288
6392 -31253 -89737 109120 -67247 70801 191918 144290 -123663 -145151 -140795 11479 -248869
6380 220801 -117008 -238659 -69091 -174271 -102408 -109328 80245 78098 159290 17249 -228933
6368 52828 127721 115234 149990 -29218 -134885 37137 181053 -185208 -27282 121950 -189822
6356 -9817 -198202 249849 -27610 63813 -122704 153876 -65639 148562 300609 -22138 180487
6344 273835 77310 204447 271290 -42341 212443 -120251 -44609 -196997 -50313 -236881 -57005
6332 -27138 74367 3596 -198202 -53930 11629 -14522 -124013 -62183 -140357 292268 -189252
6320 -159366 -124194 -367310 58249 196354 290464 -191365 133930 -16782 50763 -52504 -49194
6309 -49194 -102352 160855 73286 37931 -90808 50570 -107436 -21047 -365724 -11561 -97507
6298 -97507 -245422 -283214 -127146 114579 -255612 680 -5595 -189071 138510 -132191 10797
6286 158238 -207608 -93688 48337 -393052 84912 4508 -74477 105041 159546 -44916 132465
6274 -123029 -220952 449299 21133 -253426 109144 -64916 -318949 -16467 -204332 218609
6263 315709 52109 -37338 -115748 -130319 36198 -127482 -7854 -211607 -3826 29756 -236391
6251 -112365 346718 -49507 90119 -31810 -8703 -283577 13127 47982 -96806 -167292 -170894 -89081
6239 -89081 299478 13058 -90363 2886 171367 -49326 122741 -123699 58676 -126161 -150497
6228 -150497 77481 -204604 145194 -280312 -47426 20861 -385966 -98432 -9410 41703 163040
6217 163040 -84295 98737 -110248 387668 -270369 98335 127867 -27321 -38348 -106848 -116723
6206 -116723 134355 186763 298234 -171523 -90797 -188385 46480 -82620 -32356 -99990 177663
6194 -40896 -83508 176316 -273083 -111323 58341 471356 82348 45092 90128 -93297 -15245
6182 -104243 -125583 -121520 190575 43760 -79338 74342 -66019 201682 111798 -151533 -101683
6171 -101683 -146857 260796 20208 155028 -190254 -92610 315036 92431 -227022 291182
6160 52166 -62522 72553 46913 325527 44230 -188486 -178160 81318 -117690 84456 12034
6148 -5579 16957 31346 13178 -329829 -94737 -55666 -41803 7552 58575 -32068 -204485 -48150
6135 -173727 -78076 -178524 -4054 -70227 -266743 62531 35367 -396200 121426 -419382 -215159
6124 -215159 -109802 25281 112047 225841 22985 134575 -52530 -97557 -183126 -103138 -102736
6113 -102736 113165 271787 -97442 10999 -142820 3654 -201550 -121424 -238359 11485 -54185
6101 52281 -33016 202509 -81728 -133004 -317 -63584 28279 110670 136685 -453095 -149741 121476
6088 15942 -394803 168832 135660 -16527 -56751 -171744 41236 -84928 511670 -121970 -130121
6077 -130121 171213 42350 -98561 -26245 221293 476522 -173931 -135511 -129392 1516 -154604
6065 52064 275204 70211 269784 -101636 -17023 -39464 56672 -46233 89330 139810 -197107
6053 81546 190705 -103216 -60740 -138225 -149605 -47164 224123 -13278 129840 49435 -194677
6041 38270 137368 366149 308567 126281 -141920 -116654 313441 87919 -123582 -96707 28176
6029 36369 -29242 -32962 118632 98463 -189874 -98621 258555 -285902 87209 -131852 -249849
6018 -249849 309417 -86520 -101810 -107693 -295908 -52157 -173095 313633 -41745 192878 -195709
6006 102395 -8610 -26158 17911 159148 63914 -327058 -140712 -74220 -89491 8518 -257151
5994 -14332 -71935 18668 73879 -33234 2503 -92406 -188190 292406 -79536 62150 -261532 30347
5981 -115908 153362 50335 22758 -107936 -56356 102965 -11160 -100501 99860 339783 148770
5969 -98264 93080 -179786 -24716 -7075 -42707 -64734 -26623 286282 20992 -215822 230232
5957 33830 -113715 24195 102000 382293 -182850 -148811 123670 -163525 -74545 140529 -463083
5945 -160008 -183772 106889 -209973 -6919 14550 -256922 -159676 -99160 297327 -81472 -206575
5934 -206575 -269710 -27694 275003 30645 207378 45777 149520 -168938 -82204 -54145 69279
5922 187498 19634 -123976 112308 9354 80157 -96599 83063 -60494 -278495 64286 164388
5911 164388 -71238 281398 17130 -205993 -159070 340853 213006 104701 -203243 -144282
5901 -144282 161813 155247 171767 -33761 5415 2700 -10779 -72162 -19910 -47671 14090 -224406
5888 -142709 -56625 127897 -109354 -61675 -92196 -226000 -188851 171384 243661 -123934 -169337
5877 -169337 98844 -102453 149292 -291458 -166161 -184708 -208944 53459 266196 -71666 202229
5865 32213 61586 -118754 178829 55316 161683 46371 -107837 -238957 -102341 255639
5854 2154 153916 50252 27312 -78120 141753 103973 11671 -16557 222304 17221 -206550
5842 -198964 54790 4132 281933 9278 -86107 125899 -140428 -45982 100796 150046 -8405
5830 -124383 -141044 177637 -202698 95346 -18373 -145706 -210659 -5431 -6267 33269 150606
5819 150606 -7707 166055 14075 -130555 206481 41213 -6603 99135 -140827 -35107 -141689
5808 -141689 234777 189428 -63157 61759 31843 26286 -67802 91151 -427406 1964 -122375
5796 20390 102607 -136519 -76302 -95078 89072 131273 21310 -57141 61995 -3268 -261926 265836
5783 -161465 -276083 49784 157721 -103292 -77743 82621 -79007 -63567 165858 -76277 66046
5771 -68637 123954 187487 -45386 103028 -176213 -37661 -30550 -177702 286314 -86049 -81096
5760 -81096 39802 -16467 101422 -113969 218787 175463 106445 39377 43165 271888 44849
5748 -73908 82988 160701 -6462 246935 -51557 367991 4142 -23321 -170153 -314713 217185
5736 502 272560 -142139 -35741 -55532 -72649 -188179 37604 -43900 -20749 -149979 -22721
5724 41045 -81350 -21630 211431 -94015 -410167 -163796 -102042 -51132 153611 -28424 651526
5712 91192 189804 -155255 369213 83410 -119852 -134090 40695 -87262 -175079 -56265 123574
5700 43535 -13247 -38355 112864 -27102 -272657 179634 64043 196266 -36246 -87249 56190
5688 -2010 -8418 -127402 258095 35554 -134068 -184175 184643 -51201 -89252 241627 -94180
5676 56735 -24 -154171 2921 -163453 -62300 -259454 -397343 3574 -84889 -157104 205449 -44512
5663 -47549 -106188 244522 170716 29284 152838 -94825 -290985 103992 170044 -60243 -90643
5652 -90643 78370 11512 145282 -203764 73922 -296327 -136992 38357 209376 -67115 -60156
5641 -60156 -130779 -137203 43075 192442 -74968 -59286 -179160 219906 216101 -16857 161537
5629 -252412 -281508 143588 35936 -69826 270003 60732 -51165 -52514 231479 -518143 72577
5617 -34741 166241 -456328 -42515 -184125 -190560 -220991 -201680 -815 1185 102505 -186516 -191507
5605 -191507 252075 283381 -32592 -24088 206028 20257 -192019 25678 70132 155754 83225
5594 83225 -71762 -126986 -496408 40830 61654 56820 21529 5923 -41181 316766 27446 61143
5582 61143 192328 43526 -386030 197778 -95400 -244542 226301 -129867 -130443 154711 238672
5571 238672 -163207 -175179 197737 222616 -310150 1920 -22737 63460 164685 -125495 -21840
5559 291311 154084 -25542 86516 -190400 -62526 -34091 174889 -256696 154033 63662 -210516
5547 44212 -301036 140690 51773 -177526 -292674 63127 162186 179217 -18331 -114346 112312
5535 -56296 -124677 128836 -274408 143434 74399 -108014 166083 -157216 85128 286803
5525 286803 192737 105811 -50801 -164768 141016 62115 139939 -41945 -143439 -79924 -365030
5514 -365030 -90511 93527 174206 73088 10963 6636 -178645 74476 -345588 -137145 66556
5502 125161 -21593 119714 168518 47293 75219 269999 106948 -407520 -264278 30517 -107601
5490 -58468 19977 223201 51125 -84269 217838 187570 156421 -213121 72975 237952 -187121
5478 31819 2764 289708 -29002 -30399 -50056 -270077 236383 -22576 165095 -55765 48587
5466 -23477 240932 35602 37040 -111935 30881 333466 -149688 -326833 -50576 148423 383211
5455 383211 -13594 -94856 -101034 -33942 248279 13698 -285262 -256334 -221254 26412 -140372
5443 -316142 179430 -343600 -31233 23138 -106267 -85941 -23865 26923 135106 75900 77283
5432 77283 29988 -137110 -217980 192624 -87365 117423 -83771 58851 109631 -36067 -244504
5421 -244504 100536 -187081 -224213 180072 261848 96337 156291 249095 564684 101490 -139118
5409 -36045 191542 142197 153649 -360059 82254 -363483 -40091 116950 131267 -130425 140870
5397 134678 105453 126659 96600 80635 -35855 252545 -47603 -281451 19708 -170532 107491
5385 138759 219506 -78213 287741 -283400 115597 -342617 60830 199093 -134559 53272
5374 -115411 167912 -132266 150338 133773 -65407 212631 143918 234414 -106634 -101598 107916
5362 7623 202098 -78609 -12684 4217 -165949 160951 -36737 -74732 7980 -76347 -342279 14736
5349 255617 -108414 -71661 199847 3865 -230793 -245274 -102501 244336 -36082 210386 72688
5337 4954 173561 92694 28995 177077 -152513 98827 -115649 -171433 -193821 -228504 -133145
5326 -133145 128330 93369 -233028 83133 -171116 227042 185814 -84852 -140957 -108272 149735
5314 -161070 -126292 132593 -214467 169590 263918 46144 -256452 129420 -52731 272040
5303 -154158 164668 89979 -129042 67739 26293 69735 118066 -120191 -81151 27131 -8980
5291 183661 53967 143531 77539 162518 -114939 -86283 197872 -127236 109962 256588 217392
5280 217392 -124177 -26950 111963 11288 -31188 126954 53822 -168724 -430484 4865 75271
5269 75271 -78781 129036 -66893 276846 232563 147051 51298 -134125 8301 -89092 155290
5257 -176362 173041 51173 143012 183065 -36688 122284 244631 -120350 -99146 24663 -220817
5245 231436 106163 -163928 -312489 147228 115741 160784 171909 105619 -68037 -274916 122560
5233 -189148 -31470 181526 245453 179110 -243395 -75441 8604 66461 -145718 9475 -32306
5221 -121821 -176602 -207684 141739 37980 -16971 -23641 284215 -68374 -36795 -406163 -341503
5210 -341503 51514 -177195 -215830 245689 -302987 -47097 -174514 221049 47611 -22239 -36434
5199 -36434 -254852 -299627 206138 -170246 125680 68096 -89589 -92021 -187319 78051 57459
5188 57459 118423 -34520 23389 9299 48169 29489 44456 -75581 56376 17002 132444 -250834
5175 -35754 -78394 136156 -39386 453068 41124 -132801 -95033 340363 161015 49538 -101627
5163 98447 270367 149242 69714 -148991 106825 -178295 -49650 -20906 217023 -336299
5152 -199689 85509 -190384 14219 -157300 -147118 290513 3877 -111539 -276087 144967 -131167
5140 112103 15634 -47179 -141259 -79462 117473 4894 36994 259194 -209505 -223325 77106
5128 -121178 -257536 -98105 -140244 277459 244276 -34916 -24180 -150451 -67812 299024 157178
5117 157178 38027 -97430 166352 121717 -206050 -16572 -264798 99899 -21704 273644 -120364
5105 13350 107362 120226 300003 -101780 -94393 -53689 77656 -91538 -260763 136960 -381470
5093 110322 -262007 -137637 -100386 -230480 113633 -45334 -90684 187822 114925 95767 66496
5082 66496 208762 142381 -252344 239949 203183 -21380 76470 -355353 -66272 7410 101737
5071 101737 190689 -84144 32968 -175128 66012 168436 14443 -120779 73589 -307908 316648
5059 20397 62201 -64871 -249667 184172 -115678 -66824 280716 198539 260624 45308 31876
5048 31876 -26604 -25319 -26288 157800 4297 -219971 -42949 -251828 96991 -11633 143128 -71110
5035 146566 37495 210439 177657 138243 -286832 2678 41667 145071 80306 29628 -82196
5023 513246 2891 99164 49123 -146040 5686 196532 9531 -48552 -342727 -8585 -303906 -148646
5010 -150436 -89838 -163021 43655 75515 -43451 -358853 -96152 294084 -208873 -98974 196017
4998 15839 -21564 -158489 21512 -37818 -78116 -268555 -61931 83059 288446 275960 181735
4987 181735 251119 238518 -63930 -152627 189238 -104186 370561 -87324 -69340 180119 88708
4975 -333562 -236897 -146540 -53934 -158990 -123689 -138007 -45940 198745 -88937 70326 239584
4964 239584 291054 233582 213171 98345 -13694 46735 -94296 108818 -115580 483787 -72798
4952 -43815 27973 -102667 112841 -28042 92340 -51694 108841 135841 -237641 -261711 188534
4940 -69370 -136240 -63930 -23531 287238 -154613 -261299 -121654 177292 -4613 92859 41278
4928 49670 -99803 285672 135827 -38000 23554 -172159 -52693 107695 -165336 31352 -42145
4916 108496 118639 -166591 -227110 259315 -22661 -227433 22411 -98083 4044 -40456 179296
4904 -83775 14958 -196763 168145 -132091 310649 -20152 -124114 2050 154811 -12358 222315
4892 48283 41116 -11895 -64114 139901 67214 163212 209013 -156504 -88409 -60451 -166095
4881 -166095 -107155 103372 24624 74055 -115229 -156702 -14593 -166327 210448 100359 163419
4870 163419 -76382 -39961 127736 -58248 -173327 -254812 -6412 125267 -94691 277444 55201
4858 53328 48381 -190721 294527 59548 254255 -471535 -78732 1518 -278239 13763 201144
4847 201144 136028 100310 370670 264826 -55675 297157 -90194 102562 -19741 -14952 -24813
4836 -24813 161469 127238 119618 174286 243954 237982 -120297 81770 248898 -80236 44096 -301505
4823 82937 -168171 -137502 -53907 -52779 82386 -137475 214242 -73571 303694 241089 -40315
4811 -17994 89919 -321725 -54728 -38367 138574 -157485 -252054 -5802 -230559 185587 39295
4799 -158938 135371 -35546 -198373 109232 -130414 15166 26709 -88933 72531 202920 -69976
4787 -219957 -137839 146324 48508 42219 124150 27500 45546 50566 -318015 48385 -19922 61930
4774 20845 221814 -118998 -1415 8092 12016 -31245 132510 -85655 79474 22162 -204997 166130
4761 -53 -27259 -100688 -419800 173586 65128 227646 135588 -13836 415621 -313873 111855
4749 187224 -127069 76032 3266 15751 174643 81993 113505 29711 -99345 -47654 108849
4737 -50779 132113 -166388 94982 -193320 7272 345847 -81302 102141 -21751 196807 -32856
4725 -186575 216048 -253846 -68332 -142079 -87956 145282 -103103 -233812 93560 185432 28049
4713 155080 40519 76916 126573 -295241 -43128 -145564 23962 -199389 -167236 189303 -67583
4701 -92818 70029 -188463 -188415 58214 -172249 -155713 69413 122619 13650 -56211 -268188 132341
4688 44033 -98895 -9495 -138248 -45260 74013 362888 -144209 163069 -71608 -542873 -159048
4676 -205882 201916 44744 -231057 -77208 136012 232521 13571 -127559 -165729 -341948 169872
4664 152017 -166260 168521 59198 48940 104468 -119866 -214638 -95311 469928 79087 311322
4653 311322 -128823 70105 114031 -17452 -31512 285879 -200876 4258 -53902 247738 85840
4641 -82330 -147876 49897 -14231 59600 285642 58354 -96683 -244248 30671 191543 8446
4629 -239568 193476 166955 122498 -190229 -46496 -259384 -260264 -72650 -101271 -160424 -187921
4618 -187921 -228132 148405 -17550 -160617 -203341 -154497 -119000 154437 -22146 3179 94054
4607 94054 247813 72195 -88324 253582 191256 -150320 -99823 66643 276279 -143942 24336
4595 -18132 332859 26649 -157536 -94890 -70752 -22549 -263186 -118915 -56220 220782 319863
4584 319863 -28958 177145 -234295 334369 -69649 -374846 50244 123785 291199 189624
4574 189624 -102383 289991 -36634 43994 198195 282581 -123317 -5468 -126702 -151310 140723
4562 187455 193695 -165236 172760 219070 24961 49174 163087 -240077 255322 -321723 -91519
4550 -118501 101936 283055 158637 -58951 -44455 -110018 -183143 -78853 -249397 297565 -161598
4538 228592 39450 36835 191725 -189582 7785 303199 123469 -55072 9646 60892 -19128
4526 123494 277761 -330673 -87017 393999 117733 -185601 -93431 -499053 80976 -148281
4515 -101553 -5108 217818 159772 144298 -58313 234228 -3779 212152 -87472 -298022 -317174
4504 -317174 -206688 65944 -217411 -66390 -115792 44042 -304011 -390241 32056 -41184 -144317
4493 -144317 -42547 251398 -3381 39073 35055 -424375 -52494 83198 15485 134807 229657
4482 229657 -139479 -100161 -16034 315011 121472 350808 106497 88110 -208867 -239869
4472 -239869 -95018 59012 156319 -332328 -335326 66416 -115951 38200 295490 159053 -327097
4460 47602 -167155 53965 -207406 -294291 -25919 342271 -48652 -38319 123882 64927 -245315
4448 -3216 -361304 165224 -233509 -314768 28181 -23040 154099 345025 -49460 109264 -312693
$$ [...]
##END NTUPLES=NMR SPECTRUM
##END=
