##TITLE=NES1060_159122.0007_002_9704132_ozipFNsutZ
##JCAMPDX= 6.0         $$ Bruker NMR JCAMP-DX V2.0
##DATA TYPE= NMR SPECTRUM
##DATA CLASS= NTUPLES
##ORIGIN= BRUKER
##OWNER= Administrator
$$ 1.72 TOPSPIN		Version 2.1
$$ 2016-05-01 19:09:30.927 -0700  Administrator@X
$$ Compression mode = diff/dup
##.OBSERVE FREQUENCY= 400.02188249412
##.OBSERVE NUCLEUS= ^1H
##.ACQUISITION MODE= SIMULTANEOUS (DQD)
##.ACQUISITION SCHEME= undefined
##.AVERAGES= 64
##.DIGITISER RES= 22
##SPECTROMETER/DATA SYSTEM= spect
##.PULSE SEQUENCE= noesygpps1d.comp
##.SOLVENT NAME= COFFEE_meoh
##.SHIFT REFERENCE= INTERNAL, COFFEE_meoh, 1, 14.96144
##AUDIT TRAIL= $$ (NUMBER, WHEN, WHO, WHERE, PROCESS, VERSION, WHAT)
$$ ##TITLE= Audit trail, TOPSPIN		Version 2.1
$$ ##JCAMPDX= 5.01
$$ ##ORIGIN= Bruker BioSpin GmbH
$$ ##OWNER= Administrator
$$ $$ E:\/data/COFFEE/nmr/NES1060_159122.0007_002_9704132_ozipFNsutZ/12/pdata/1/auditp.txt
$$ ##AUDIT TRAIL=  $$ (NUMBER, WHEN, WHO, WHERE, PROCESS, VERSION, WHAT)
(   1,<2016-05-01 19:09:25.786 -0700>,<Administrator>,<X>,<go>,<TOPSPIN 2.1>,
      <created by zg
	started at 2016-05-01 18:57:56.536 -0700,
	POWCHK enabled, PULCHK disabled,
       configuration hash MD5:
       21 0F 79 D6 B3 7B B4 F6 88 20 88 DB 03 48 BD 9F
       data hash MD5: 64K
       90 BA 2E A5 5D 98 11 34 BB 67 55 4E E2 3F 06 7C>)
(   2,<2016-05-01 19:09:29.177 -0700>,<Administrator>,<X>,<proc1d>,<TOPSPIN 2.1>,
      <Start of raw data processing
       efp LB = 0.3 FT_mod = 6 PKNL = 1 PHC0 = 0 PHC1 = 0 SI = 128K 
       data hash MD5: 128K
       3E B3 7B 1C 64 61 71 81 6A 25 DB 78 87 42 3A 35>)
(   3,<2016-05-01 19:09:30.052 -0700>,<Administrator>,<X>,<proc1d>,<TOPSPIN 2.1>,
      <pk PHC0 = -84.60571 PHC1 = 0 
       data hash MD5: 128K
       6C B7 83 B7 FE A0 79 BE 11 06 0A FF FD F2 FF BE>)
(   4,<2016-05-01 19:09:30.442 -0700>,<Administrator>,<X>,<proc1d>,<TOPSPIN 2.1>,
      <abs ABSG = 1 
       data hash MD5: 128K
       0F CA 37 20 05 51 A4 33 C6 F5 CB D8 7B A7 9F 37>)
(   5,<2016-05-01 19:09:30.536 -0700>,<Administrator>,<X>,<proc1d>,<TOPSPIN 2.1>,
      <abs ABSG = 2 
       data hash MD5: 128K
       B9 AE A8 36 D5 46 07 25 73 C8 12 6C A4 80 E4 E2>)
(   6,<2016-05-01 19:09:30.614 -0700>,<Administrator>,<X>,<proc1d>,<TOPSPIN 2.1>,
      <abs ABSG = 3 
       data hash MD5: 128K
       18 76 58 4D F8 FB CF 2A 3A 0D FD 55 05 37 85 D0>)
(   7,<2016-05-01 19:09:30.692 -0700>,<Administrator>,<X>,<proc1d>,<TOPSPIN 2.1>,
      <abs ABSG = 4 
       data hash MD5: 128K
       AC 48 D7 31 3E DB 80 AC 93 0A 43 BD 27 4D B8 F2>)
(   8,<2016-05-01 19:09:30.771 -0700>,<Administrator>,<X>,<proc1d>,<TOPSPIN 2.1>,
      <abs ABSG = 5 
       data hash MD5: 128K
       9F 8E 1D 8F 28 2D 33 5B 82 89 51 3B 77 50 60 4E>)
$$ ##END=
$$ 
$$ $$ hash MD5
$$ $$ C7 4C 4C 36 52 95 AE 32 AC 73 B4 62 2C F4 9C E7
##$RELAX= 
##$RELAX= 
##$RELAX= 
##$RELAX= 
##$RELAX= 
##$RELAX= 
##$RELAX= 
##$RELAX= 
$$ Bruker specific parameters
$$ --------------------------
##$DU= <E:\>
##$EXPNO= 12
$$ [...]
##$TP07= 0
##$TPNAME0= <>
##$TPNAME1= <>
##$TPNAME2= <>
##$TPNAME3= <>
##$TPNAME4= <>
##$TPNAME5= <>
##$TPNAME6= <>
##$TPNAME7= <>
##$TPOAL= (0..7)
0.5 0.5 0.5 0.5 0.5 0.5 0.5 0.5
##$TPOFFS= (0..7)
0 0 0 0 0 0 0 0
##$TUNHIN= 0
##$TUNHOUT= 0
##$TUNXOUT= 0
##$USERA1= <user>
##$USERA2= <user>
##$USERA3= <user>
##$USERA4= <user>
##$USERA5= <user>
##$V9= 5
##$VALIST= <valist>
##$VCLIST= <CCCCCCCCCCCCCCC>
##$VD= 0
##$VDLIST= <DDDDDDDDDDDDDDD>
##$VPLIST= <PPPPPPPPPPPPPPP>
##$VTLIST= <TTTTTTTTTTTTTTT>
##$WBST= 2048
##$WBSW= 25
##$XGAIN= (0..3)
0 0 0 0
##$XL= 0
##$YL= 0
##$YMAX_a= 5304693
##$YMIN_a= -10688610
##$ZGOPTNS= <>
##$ZL1= 120
##$ZL2= 120
##$ZL3= 120
##$ZL4= 120
##$ABSF1= 14.96144
##$ABSF2= -5.596742
##$ABSG= 5
##$ABSL= 3
##$ALPHA= 0
##$AQORDER= 0
##$ASSFAC= 0
##$ASSFACI= 0
##$ASSFACX= 0
##$ASSWID= 0
##$AUNMP= <proc_prof1d_extract.lims>
##$AXLEFT= 0
##$AXNAME= <>
##$AXNUC= <1H>
##$AXRIGHT= 0
##$AXTYPE= 0
##$AXUNIT= <>
##$AZFE= 0.1
##$AZFW= 0.1
##$BCFW= 0
##$BC_mod= 0
##$BYTORDP= 0
##$COROFFS= 0
##$CY= 15
##$DATMOD= 1
##$DC= 0
##$DFILT= <>
##$DTYPP= 0
##$F1P= 0
##$F2P= 0
##$FCOR= 0.5
##$FTSIZE= 131072
##$FT_mod= 6
##$GAMMA= 0
##$GB= 0
##$INTBC= 1
##$INTSCL= 1
##$ISEN= 128
##$LB= 0.3
##$LEV0= 0
##$LPBIN= 0
##$MAXI= 10000
##$MC2= 0
##$MEAN= 0
##$ME_mod= 0
##$MI= 0
##$NCOEF= 0
##$NC_proc= -2
##$NLEV= 6
##$NOISF1= 0
##$NOISF2= 0
##$NSP= 0
##$NTH_PI= 0
##$NZP= 0
##$OFFSET= 14.96144
##$PC= 1
##$PHC0= -84.60571
##$PHC1= 0
##$PH_mod= 1
##$PKNL= yes
##$PPARMOD= 0
##$PPDIAG= 0
##$PPIPTYP= 0
##$PPMPNUM= 2147483647
##$PPRESOL= 1
##$PSCAL= 4
##$PSIGN= 0
##$PYNMP= <proc.py>
##$REVERSE= no
##$SF= 400.020009462724
##$SI= 131072
##$SIGF1= 0
##$SIGF2= 0
##$SINO= 400
##$SIOLD= 131072
##$SPECTYP= <>
##$SREGLST= <1H.CDCl3>
##$SSB= 0
##$STSI= 131072
##$STSR= 0
##$SW_p= 8223.68421052631
##$SYMM= 0
##$S_DEV= 0
##$TDeff= 65536
##$TDoff= 0
##$TI= <>
##$TILT= no
##$TM1= 0
##$TM2= 0
##$TOPLEV= 0
##$USERP1= <user>
##$USERP2= <user>
##$USERP3= <user>
##$USERP4= <user>
##$USERP5= <user>
##$WDW= 1
##$XDIM= 131072
##$YMAX_p= 379165770
##$YMIN_p= -11355
##$CURPLOT= <Network HP LaserJet P1505>
##$CURPRIN= <$Network HP LaserJet P1505>
##$DFORMAT= <normdp>
##$LAYOUT= <+/1D_H.xwp>
##$LFORMAT= <normlp>
##$PFORMAT= <normpl>
##$SURQMSG= 1
$$ End of Bruker specific parameters
$$ ---------------------------------
##NTUPLES= NMR SPECTRUM
##VAR_NAME=  FREQUENCY,     SPECTRUM/REAL,   SPECTRUM/IMAG
##SYMBOL=    X,             R,               I
##VAR_TYPE=  INDEPENDENT,   DEPENDENT,       DEPENDENT
##VAR_FORM=  AFFN,          ASDF,            ASDF
##VAR_DIM=   131072,        131072,          131072
##UNITS=     HZ,            ARBITRARY UNITS, ARBITRARY UNITS
##FACTOR=    0.0627417313425164, 1,          1
##FIRST=     8223.62146879497, 3629,         -49103
##LAST=      0,             4517,            -48290
##MIN=       0,             -11355,          0
##MAX=       8223.62146879497, 379165770,    0
$$ Real data points
##PAGE= N=1
##DATA TABLE= (X++(R..R)), XYDATA
$$ [...]
67860 65262 64988 64884 65279 65957 66324 66189 65977 66124 66591 66994 66921 66150 64827 63415 62223 61135 60067 59403
67842 59403 59514 60027 60140 59610 58910 58445 58150 57906 57766 57582 56950 55782 54576 53863 53690 53800 54039 54331
67824 54331 54558 54659 54714 54787 54840 54825 54660 54125 53091 51888 51102 50866 50658 49992 49060 48542 48877 49833 50636 50611
67804 50611 49895 49485 50219 51781 53104 53725 54198 55057 55977 56287 55841 54974 53984 53117 52785 53299 54408 55482
67786 55482 56085 56171 55865 55384 55056 55092 55382 55698 56032 56547 57317 58317 59478 60485 60784 60219 59540 59759 60963
67767 60963 62195 62631 62418 62150 61995 61810 61870 62770 64498 66097 66667 66416 66273 66549 66582 65879 65030 64971 65686
67748 65686 66270 66188 65745 65205 64220 62545 60766 59652 59077 58251 56912 55702 55231 55275 55154 54601 53997 53866
67730 53866 54269 54644 54234 52860 51235 50311 50277 50466 50330 50199 50813 52305 53921 54759 54549 53660 52597 51669
67712 51669 51121 51288 52361 54011 55487 56280 56603 57007 57597 57899 57565 56929 56609 56709 56709 56144 55166 54310 53907
67693 53907 53890 54058 54274 54411 54343 54142 54145 54617 55385 56016 56404 57038 58535 60930 63550 65602 66823 67549 68232
67674 68232 69003 69708 70213 70539 70707 70645 70279 69613 68623 67285 65848 64941 65106 66189 67405 68002 67772 66947
67656 66947 65912 65089 64797 64998 65300 65385 65327 65417 65854 66746 68114 69646 70631 70613 70089 70142 71267 72875 74104
67637 74104 74753 75181 75596 75839 75798 75641 75585 75654 75751 75832 76012 76601 77931 79942 82012 83491 84426 85471 87033
67618 87033 88847 90497 91945 93224 93984 93838 92998 92091 91288 90083 88050 85504 83225 81762 81084 80700
67602 80700 79983 78621 76917 75525 74762 74338 73810 73118 72559 72374 72511 72635 72339 71515 70550 69929 69635 69228
67584 69228 68584 68144 68216 68431 68248 67715 67336 67358 67556 67532 66965 65771 64354 63512 63630 64138 64207 63865 63953 65051
67564 65051 66916 68940 70609 71519 71494 70935 70576 70656 70701 70275 69534 68787 67986 67023 66212 65992 66302 66658 66817
67545 66817 67029 67592 68396 68995 69019 68523 67965 67789 67921 67730 66613 64685 62830 61973 62213 62693 62512 61793
67527 61793 61573 62487 63843 64351 63564 62163 61013 60420 60300 60514 60909 61505 62689 64729 66993 68287 68236
67510 68236 67727 67610 67603 67069 66325 66323 67238 68228 68616 68612 68637 68578 68086 67300 66897 67440 68828 70315 71065 70845 70162
67489 70162 69635 69323 68902 68339 67954 67759 67264 66243 65313 65294 66155 67035 67284 67069 66893 66965 67272 67895 68810
67470 68810 69547 69602 69201 69273 70450 72370 74112 75053 75142 74633 73841 73018 72247 71541 71086 71083 71256 71017 70405 70309
67450 70309 71256 72495 72976 72881 73324 74798 76819 79033 81553 84011 85364 85136 84076 83059 82036 80613
67434 80613 78935 77364 75840 74293 73171 72872 72977 72745 72074 71396 70959 70856 71405 72735 74246 75214 75733
67417 75733 76280 76591 75891 74289 72961 72709 73123 73520 73992 75041 76666 78346 79683 80624 81198 81398 81317
67400 81317 81252 81568 82385 83319 83697 83230 82343 81644 81336 81395 81993 83167 84270 84460 83758 83028 82826 82817 82474 81759
67380 81759 80864 79805 78654 77839 77878 78942 80737 82626 83892 84314 84484 85138 86146 86730 86731 86940 87872 88907
67362 88907 89196 88915 88964 89741 90814 91647 92092 92225 92171 92129 92212 92236 91996 91723 91975 92958 94171 94844 94684 94129
67342 94129 93872 94106 94365 94200 93848 93873 94233 94210 93405 92309 91588 91278 91071 91011 91367 92043 92680 93268 94113 95169
67322 95169 95912 96033 95916 96204 97137 98474 99860 101086 102129 103166 104488 106226 108034 109141 108916 107517
67306 107517 105853 104729 104103 103405 102485 101872 101995 102576 103001 103003 102718 102335 102001 101915 102180 102702 103410 104401 105588
67287 105588 106497 106814 106937 107556 108758 110006 110940 111723 112528 113193 113538 113672 113797 114025 114491 115311 116223 116612
67269 116612 116156 115209 114359 113819 113505 113439 113762 114525 115736 117435 119430 121120 121949 121962 121619 121190 120674 120254
67251 120254 120345 121130 122381 123801 125154 126011 125928 125155 124727 125427 126940 128421 129598 130814 132191 133355
67235 133355 134033 134387 134640 134823 135040 135557 136387 137122 137390 137257 137022 136906 137122 137862 138956 139835 140189 140402
67217 140402 141087 142378 143939 145437 146648 147326 147391 147126 146867 146649 146414 146396 146943 148102 149689 151516 153223
67200 153223 154194 154188 153821 153884 154365 154784 155301 156638 158893 161242 162962 163983 164320 163876 163190 163434 165009 166884
67182 166884 168079 169139 171225 174179 176538 177400 177310 177184 177219 177227 177395 178126 179378 180565 181134 181091 180954 181227
67164 181227 181894 182533 182929 183385 184271 185501 186734 187900 189234 190853 192607 194257 195526 196139 196169 196265 197120
67147 197120 198688 200317 201577 202560 203374 203947 204544 205872 208258 211075 213439 215196 216756 218205 219214
67132 219214 219834 220745 222423 224526 226479 228291 230336 232566 234527 236183 238076 240463 242728 244089 244559
67117 244559 244837 245457 246484 247886 249685 251750 253870 256070 258478 260870 262817 264363 266069 268290 270837
67102 270837 273489 276269 278967 280965 282069 283067 284932 287735 290859 293956 297066 299925 301917 302888 303531
67087 303531 304758 306969 310003 313458 316905 320033 322750 325039 326754 327787 328446 329446 331400 334420
67073 334420 338144 342001 345491 348406 350855 352986 354834 356532 358486 361044 364164 367636 371495 375854
67059 375854 380439 384685 388276 391265 393723 395712 397611 400019 403119 406482 409620 412480 415297 418298
67045 418298 421702 425690 430135 434605 438871 443274 448404 454535 461472 468677 475379 480789 484626 487445
67031 487445 490263 493809 498136 502840 507476 511832 516020 520394 525316 530879 536830 542733 548280 553473
67017 553473 558521 563611 568859 574454 580593 587206 593942 600643 607629 615289 623484 631593 639048 645601
67003 645601 651251 656303 661483 667589 674895 683059 691546 699855 707482 714196 720476 727253 734956 743164
66989 743164 751415 760003 769540 779931 790231 799527 807731 815501 823588 832373 841866 851987 862763
66976 862763 874248 886319 898612 910628 921952 932529 942833 953570 964982 976619 988003
66965 988003 999322 1011138 1023595 1036385 1049385 1062767 1076407 1089785 1102709 1115692 1129340
66954 1129340 1143714 1158505 1173451 1188275 1202687 1216841 1231483 1247205 1263769 1280522 1297216
66943 1297216 1314004 1330914 1347858 1365025 1382722 1400809 1418772 1436390 1453923 1471673 1489770
66932 1489770 1508381 1527610 1547081 1566124 1584610 1603139 1622113 1641087 1659443 1677399 1695759
66921 1695759 1714787 1733864 1752349 1770366 1788503 1807029 1825696 1844204 1862606 1881230 1900370
66910 1900370 1920043 1939976 1959741 1979027 1997803 2016200 2034214 2051587 2068073 2083797 2099238
66899 2099238 2114824 2130573 2146166 2161333 2176140 2190889 2205743 2220484 2234676 2248084 2260827
66888 2260827 2273090 2284757 2295464 2305033 2313770 2322311 2331146 2340211 2348868 2356399 2362617 2367906 2372538
66875 2372538 2376091 2377837 2377718 2376612 2375462 2374382 2372792 2370234 2366761 2362603 2357786 2352225 2346027 2339500
66861 2339500 2332856 2325983 2318560 2310375 2301507 2292195 2282565 2272481 2261604 2249569 2236158 2221461 2205909
66848 2205909 2190106 2174562 2159451 2144521 2129217 2113082 2096135 2078794 2061360 2043718 2025673
66837 2025673 2007359 1989030 1970568 1951574 1932008 1912412 1893350 1874846 1856529 1838139 1819666
66826 1819666 1801061 1782091 1762557 1742551 1722374 1702232 1682107 1662019 1642260 1623136 1604510
66815 1604510 1585889 1567048 1548273 1529802 1511429 1492895 1474310 1455747 1436849 1417512 1398736
66804 1398736 1381902 1367050 1352631 1337252 1321018 1304841 1289086 1273455 1257736 1242020 1226389
66793 1226389 1210967 1196095 1181974 1168230 1154277 1140092 1126229 1113118 1100648 1088456 1076258
66782 1076258 1063887 1051197 1038011 1024099 1009418 994547 980557 968126 956900 946015 935028
66771 935028 923993 912921 901778 890940 880981 871837 862680 852800 842310 831773 821531 811601
66759 811601 801918 792400 782923 773465 764199 755344 747001 739136 731593 724155 716779 709702 703034 696291
66745 696291 688786 680548 672418 665022 658024 650710 642962 635247 627805 620344 612608 604894 597840 591790
66731 591790 586472 581287 575877 570389 565147 560164 555156 549970 544713 539397 533788 527795 521731 515962
66717 515962 510508 505277 500435 496146 492070 487601 482609 477592 473017 468884 465035 461464 458031 454227
66703 454227 449641 444564 439790 435795 432375 429027 425415 421444 417186 412889 408902 405382 402203 399207
66689 399207 396396 393740 390981 387880 384540 381239 377980 374513 370868 367564 365063 363218 361448 359342
66675 359342 356882 354228 351540 349013 346764 344615 342183 339317 336258 333226 330088 326639 323098 320009
66661 320009 317661 315876 314380 313015 311429 308947 305213 300874 297199 294910 293639 292487 290795 288302
66647 288302 285080 281678 278982 277450 276596 275570 274135 272610 271023 268942 266324 263935 262507 261837 261140
66632 261140 260074 258919 257827 256445 254490 252333 250687 249752 248947 247533 245377 242956 240719 238687 236724
66617 236724 234952 233604 232586 231518 230264 229143 228465 228032 227272 225724 223315 220299 217109 214224 212037
66602 212037 210788 210480 210774 211032 210776 210106 209453 208899 208041 206591 204743 202812 200886 199102 197888 197487
66586 197487 197447 196986 195820 194318 192942 191902 191279 191020 190730 189866 188371 186908 186228 186329 186382 185497 183537
66569 183537 181203 179368 178374 177993 177873 177789 177553 177098 176753 176991 177664 177832 176742 174749 172840 171455 170156
66552 170156 168363 165996 163476 161462 160538 160751 161395 161568 160942 159742 158179 156360 154731 153981 154317 155203
66536 155203 155982 156446 156677 156696 156472 155954 154985 153536 152086 151349 151390 151375 150444 148513 146033 143464 141408 140723
66518 140723 141792 143752 145078 145031 144132 143194 142364 141322 140001 138747 137858 137265 136678 135923 135097 134460 134120
66501 134120 133800 132996 131494 129721 128447 128015 127962 127542 126545 125464 124836 124736 124953 125387 125984 126523 126767 126744
66483 126744 126587 126221 125519 124665 123952 123301 122395 121298 120428 119815 118932 117574 116403 116143 116571 116786 116346 115628
66465 115628 115125 114868 114656 114502 114574 114890 115261 115523 115692 115870 116064 116174 116073 115633 114688 113202 111603 110706
66447 110706 110979 112004 112946 113475 113857 114186 114071 113219 111871 110386 108810 107101 105494 104324 103770 103979
66431 103979 105079 106714 107942 108019 107085 105751 104345 102972 101940 101491 101289 100821 100178 99868 99972 100141 100395
66414 100395 101121 102118 102452 101679 100593 100272 100826 101537 101822 101510 100503 98847 97042 95783 95293 95279 95449
66397 95449 95774 96263 96869 97636 98559 99266 99195 98236 96950 95997 95562 95424 95387 95435 95625 95981 96378 96417 95561 93550
66377 93550 90697 87730 85431 84405 84922 86706 88950 90749 91641 91695 91235 90609 90128 89945 89949 89894 89633 89121
66359 89121 88246 86948 85472 84244 83381 82593 81766 81357 81877 83149 84405 85144 85522 85894 86261 86353 86007 85283
66341 85283 84332 83362 82649 82410 82616 83005 83291 83352 83276 83258 83390 83494 83222 82359 81004 79490 78294 77983 78926
66322 78926 80809 82561 83144 82497 81551 81214 81525 81861 81745 81129 80061 78538 76918 76012 76260 76965 76925 75983
66304 75983 75361 76117 77708 78642 78256 77257 76596 76470 76575 76661 76525 75921 74943 74210 74274 74979 75704 76066 76095 75923
66284 75923 75646 75402 75197 74758 73879 72925 72628 73310 74554 75703 76405 76647 76568 76344 76073 75596 74674 73475
66266 73475 72744 73144 74457 75633 75819 75202 74659 74562 74243 72884 70764 69161 68951 69718 70465 70793 71002 71324
66248 71324 71625 71769 71780 71596 71048 70222 69510 69210 69320 69795 70612 71522 72088 72216 72302 72655 73009 72904 72345 71818
66228 71818 71765 72288 73165 73912 74000 73347 72555 72324 72654 72902 72609 71942 71250 70504 69463 68246 67413 67408 68053 68780
66208 68780 69343 70097 71383 72791 73395 72820 71690 70772 70045 69067 68051 67866 68838 70133 70733 70617 70517
66191 70517 70754 70862 70392 69582 68990 68754 68522 68026 67474 67289 67563 67881 67768 67275 66965 67279 68013 68543 68523
66172 68523 68179 67980 68161 68529 68587 67887 66510 65190 64729 65225 66061 66668 66985 67121 67029 66781 66810 67355 67871
66153 67871 67527 66300 65170 65143 66369 68208 69753 70225 69370 67762 66469 66113 66445 66944 67482 68130 68643
66136 68643 68658 68295 68103 68336 68600 68321 67342 65958 64577 63413 62441 61565 60872 60702 61363 62807 64653 66415
66118 66415 67586 67716 66790 65522 64888 65169 65690 65685 65163 64730 64746 65027 65354 65884 66914 68401 69935 71117
66100 71117 71820 72104 72069 71851 71572 71180 70455 69350 68246 67583 67229 66502 64990 63121 61722 61150 61104 61146
66082 61146 61096 61003 61092 61786 63434 65816 68153 69735 70404 70413 70111 69938 70335 71327 72345 72815 72815 72878 73245 73685
66062 73685 73950 73997 73729 72959 71823 70804 70110 69306 67903 66089 64580 63904 64116 65017 66240 67214 67521
66045 67521 67345 67276 67566 67918 68036 68018 68037 67983 67675 67157 66535 65762 64845 64101 63908 64287 64959 65717 66483 67092
66025 67092 67305 67098 66787 66818 67418 68340 68896 68518 67425 66474 66178 66167 65853 65300 65022 65216 65728 66561 67785
66006 67785 69019 69652 69681 69763 70322 71093 71715 72215 72709 73141 73564 74161 74768 74849 74295 73701 73512 73412 73052 72869
65986 72869 73537 74988 76649 78405 80592 83146 85481 87299 88930 90707 92472 93860 94711 95099 95272
65971 95272 95620 96368 97233 97682 97559 97159 96712 96187 95630 95256 95069 94826 94549 94679 95457 96424 96852 96500 95712
65952 95712 94924 94271 93543 92394 90678 88714 87013 85635 84044 81837 79494 78128 78431 79952 81450
65937 81450 81892 81148 79820 78519 77447 76606 76108 76017 76033 75681 74790 73524 72009 70313 68816 68175 68621
65920 68621 69567 70133 69902 69085 68153 67535 67419 67608 67688 67547 67538 67943 68470 68564 68092 67382 66694 66061 65649 65813
65900 65813 66527 67113 66919 66158 65695 65974 66531 66703 66513 66501 66843 67057 66594 65411 63832 62181 60794 60007
65882 60007 59813 59707 59310 59027 59626 61131 62537 62793 61810 60377 59405 59364 60123 61063 61502 61271 60794 60561
65864 60561 60697 61168 62081 63396 64603 65115 65012 65006 65539 66239 66441 66024 65512 65454 65906 66421 66385 65400 63598
65845 63598 61628 60162 59383 59100 59354 60559 62772 65115 66358 66118 65164 64530 64648 65377 66408 67381 67878
65828 67878 67751 67345 67116 67090 66936 66543 66232 66376 66910 67285 66824 65309 63329 61905 61614 62143 62794 63216
65810 63216 63470 63710 64106 64898 66052 66961 66901 65800 64287 63011 62278 62324 63388 65329 67458 69010 69694
65793 69694 69734 69559 69475 69415 68994 68015 66877 66244 66282 66542 66580 66380 66127 65987 66225 67136 68604 69962 70586 70476
65773 70476 70104 69891 69988 70359 70806 70974 70551 69516 68187 67090 66703 67137 68002 68738 69095 69215 69293 69360 69376
65754 69376 69320 69202 69152 69406 69959 70274 69706 68234 66527 65246 64518 64033 63371 62269 60936 60028 59983 60421
65736 60421 60608 60394 60181 60036 59528 58532 57546 56947 56510 55913 55155 54225 52945 51543 50787 51053 51735 52084
65718 52084 52162 52437 52843 52934 52750 52856 53534 54424 54945 54811 54232 53865 54337 55552 56715 57325 57720 58266 58532
65699 58532 57947 56958 56685 57473 58525 59119 59546 60604 62612 65129 67315 68412 68196 67194 66322 66175 66752
65682 66752 67744 68891 70091 71376 72782 74097 74866 74817 74223 73679 73645 74269 75312 76068 75773 74505 73319
65665 73319 73043 73318 73401 73517 74535 76378 77757 77734 76858 76314 76493 76837 76694 75898 74713 73627 73074 73060
65647 73060 73043 72355 70766 68595 66350 64331 62508 60827 59589 59314 60075 61202 61929 62143 62198 62203 61959 61518
65629 61518 61258 61321 61499 61752 62369 63348 64010 63607 62152 60428 59305 59226 60123 61587 63086 64126 64346 63662
65611 63662 62504 61714 61829 62442 62579 61791 60579 59604 58886 58080 57278 57050 57666 58667 59453 60073 61043 62427
65593 62427 63578 64009 64131 64629 65392 65732 65617 65879 66993 68392 69380 70027 70606 70755 69969 68525 67151
65576 67151 66058 65024 64206 64078 64617 65279 65764 66187 66552 66743 66996 67617 68262 68217 67488 66871 66810 66889 66594
65557 66594 65867 64761 63344 62225 62377 63998 66147 67879 69142 70257 71241 72157 73448 75227 76681
65542 76681 76872 75910 74862 74668 75469 76697 77454 77137 75996 74792 73700 72093 69713 67409 66157 65869
65526 65869 65860 66000 66612 67497 67961 67799 67540 67652 68077 68606 69151 69527 69498 69231 69277 69843 70418 70374 69767 69250 69292
65505 69292 69690 69951 70005 70294 71014 71604 71360 70486 70023 70629 71904 73107 73992 74614 74796 74329 73427 72549 71890
65486 71890 71364 70836 70096 68888 67333 66043 65391 64956 64136 62991 62051 61496 61151 61072 61511 62319 62945 63138
65468 63138 63188 63468 64090 65025 66149 67191 67951 68529 68986 68965 68143 66995 66541 67261 68687 70089 71081 71586
65450 71586 71797 72329 73784 75898 77558 77994 77588 77192 77029 76632 75678 74485 73690 73643 74088 74429 74353 74131
65432 74131 74113 74065 73436 72255 71288 71172 71886 73231 75233 77595 79281 79387 78316 77412 77400 77723 77533 76765
65414 76765 75932 75305 74847 74761 75505 77112 78845 79833 79894 79538 79306 79359 79635 80065 80493 80672 80608 80749 81541 82796
65394 82796 83767 83921 83482 83100 83081 83144 82910 82434 82149 82357 83000 83897 84964 86087 87004 87641 88452 90125 92918
65375 92918 96482 100295 103961 107125 109560 111516 113684 116582 120176 124234 128682 133394 137948 141964
65361 141964 145528 148967 152301 155173 157178 158045 157651 156136 153962 151590 149136 146399 143100 139041 134296
65346 134296 129418 125100 121423 117829 114197 111422 110292 110084 109076 106438 102888 99450 96382 93693
65332 93693 91952 91771 92717 93382 92720 90967 89131 87856 86995 86175 85418 85038 85137 85505 85959 86388 86427 85581
65314 85581 83939 82451 82060 82768 83899 84978 85958 86777 87256 87390 87306 86977 86366 85763 85538 85598 85630 85806 86641
65295 86641 88012 89007 89033 88526 88233 88260 88275 88209 88189 88041 87388 86226 84930 83729 82626 81843 81889 82929 84361
65276 84361 85287 85281 84517 83298 81788 80220 79035 78550 78624 78888 79178 79537 79862 79895 79585 79189 78945 78920 79207
65257 79207 79839 80389 80165 79107 78065 77742 77735 77141 75879 74780 74519 75004 75816 76675 77371 77700 77697 77658 77800
65238 77800 78104 78455 78748 78890 78879 78781 78496 77886 77321 77611 78889 80094 80302 80130 80818 82252 83086 82857 82642
65219 82642 83227 83818 83307 81869 80477 79562 78987 78784 79032 79376 79454 79489 79710 79540 78235 76170 74616 74245
65201 74245 74601 75085 75680 76492 77281 77806 78233 78862 79799 81043 82520 83812 84247 83634 82685 82317 82666 83102
65183 83102 83143 82996 83053 83206 83006 82481 82349 83167 84499 85354 85374 85202 85566 86463 87433 88332 89453 91110 93395
65164 93395 96239 99435 102705 105963 109359 112890 116201 119089 122030 125816 130780 136728 143539 151338
65150 151338 159949 168595 176475 183473 190138 196972 203926 210532 216460 221831 226967 231881 236156 239307
65136 239307 241049 241160 239363 235705 230956 226254 222201 218409 214008 208508 202084 195114 187594 179183
65122 179183 169878 160479 152113 145247 139361 133626 127717 121894 116560 111920 107890 104204 100690 97576
65108 97576 95364 94259 93889 93701 93453 93155 92730 92034 91146 90435 90360 91228 92977 95055 96716 97698 98511 99851
65090 99851 101747 103461 104209 103886 103162 102908 103472 104484 105436 106324 107457 108740 109601 109720 109313 108504 106982
65073 106982 104700 102444 101135 100809 100768 100543 100220 99995 99920 99987 100008 99557 98533 97632 97727 98797 100020 100841
65055 100841 101317 101440 100896 99817 99050 99254 100101 100706 100484 99314 97332 95023 93168 92193 91668 90822 89384
65038 89384 87660 86075 85037 85030 86161 87593 88011 86917 85122 83760 83106 82686 82279 82327 83284 84906 86387
65021 86387 87133 87238 87262 87638 88343 89077 89679 90365 91538 93361 95581 97817 99920 101941 103867 105634 107450
65004 107450 109834 113174 117318 121703 125781 129284 132264 135048 138032 141358 144863 148403 152061 155861
64990 155861 159482 162467 164629 166003 166512 165952 164333 161991 159359 156754 154302 151872 149099 145714 141828
64975 141828 137726 133445 128817 123921 119212 115143 111866 109363 107630 106586 105959 105397 104620 103418 101635
64960 101635 99263 96542 93900 91737 90184 88971 87633 85973 84284 83045 82537 82845 83970 85669 87292
64945 87292 88201 88333 88135 87887 87441 86601 85474 84312 83292 82507 81988 81621 81296 81193 81650 82626 83570 84037
64927 84037 84193 84539 85262 86137 86895 87507 88123 88960 90192 91772 93371 94603 95335 95701 95848 95809 95618 95442
64909 95442 95474 95713 95933 95937 95834 95949 96512 97495 98720 99922 100702 100742 100234 99825 99916 100270 100529 100818 101445 102259
64889 102259 102816 103014 103044 102799 101927 100510 99111 98119 97641 98038 99714 102074 103554 103281 102099 101343 101182
64872 101182 100902 100328 99908 99601 98663 96704 94242 92051 90586 90172 90986 92507 93538 93277 92035 90678
64856 90678 89648 88861 88195 87725 87608 87944 88559 88813 88010 86231 84443 83507 83393 83611 84015 84721 85556 86178
64838 86178 86607 87162 87954 88867 89969 91419 92994 94215 94985 95624 96201 96309 95753 95017 94833 95529 96929
64821 96929 98485 99459 99444 98948 98918 99438 99436 98150 96321 95277 95214 95141 94354 93165 92122 91273 90462 89767 89308
64802 89308 88953 88514 87990 87480 87082 86964 87266 87801 88104 87923 87446 86999 86815 87133 88127 89580 90929 91803
64784 91803 92203 92106 91334 90098 89230 89453 90567 91707 92342 92818 94014 96503 99852 102673 103717 103119 102246
64767 102246 102156 102562 102528 101729 100602 99614 98892 98380 97853 96962 95661 94487 93976 93911 93526 92352 90528 88485
64749 88485 86797 86097 86494 87056 86515 84670 82609 81463 81413 82110 83426 85342 87401 88833 89235 88912 88568
64732 88568 88776 89607 90570 90985 90597 89873 89616 90243 91409 92334 92529 92175 91786 91614 91554 91504 91455 91159 90167 88468
64712 88468 86765 85858 85997 87014 88628 90237 90923 90334 89295 88905 89256 89731 90301 91600 93623 95336
64696 95336 95986 96070 96495 97343 98017 98263 98487 99186 100415 101780 102754 103072 102914 102597 102147 101498 100995 101221 102137
64677 102137 102936 102958 102318 101349 99908 97751 95323 93614 93211 93769 94459 94794 94999 95626 96801 98025 98914
64660 98914 99918 101781 104342 106497 107513 107808 108144 108683 109267 110073 111343 112803 113995 114952 115924 116553
64644 116553 116006 114098 111831 110540 110760 112025 113535 114853 116060 117359 118655 119596 120047 120333 120986 122329
64628 122329 124353 126730 128914 130554 131971 133994 137098 140894 144588 147731 150352 152658 154841 156960
64614 156960 158878 160467 161942 163593 165116 165745 165319 164665 164493 164422 163664 162170 160331 157878 154031 148826
64598 148826 143513 139369 136601 134597 132816 131163 129755 128590 127371 125732 123835 122546 122610 123693 124658
64583 124658 124783 124296 123715 123136 122322 121134 119710 118503 118155 118962 120341 121227 121186 120785 120772 121232 121790 122263
64565 122263 122808 123613 124725 126040 127328 128485 129841 131922 134616 136936 137934 137730 137254 137125 137099 136569
64549 136569 135244 133274 130982 128622 126310 124125 122313 121233 120956 121007 120757 120060 119250 118526 117671 116538
64533 116538 115460 114789 114228 113054 111162 109453 108939 109633 110661 111378 111998 113041 114501 115841 116713 117383
64517 117383 118397 119963 121729 123112 123775 123850 123710 123551 123183 122305 120975 119747 119201 119313 119369 118573 116695
64500 116695 114069 111120 108144 105464 103442 102111 101041 99757 98184 96582 95252 94453 94354 94792 95290
64485 95290 95562 95770 96054 96148 95881 95760 96411 97622 98543 98796 98728 98622 98397 98230 98694 99953 101401 102446
64467 102446 103069 103350 103068 102218 101372 101005 100922 100841 101141 102448 104763 107473 109908 111532 112024 111715 111581 112240
64449 112240 113205 113616 113333 112765 112096 111441 111388 112462 114202 115627 116603 117947 120189 123006 125918 128738
64433 128738 131191 132924 134182 135798 138171 140842 143326 145784 148551 151653 155184 159682 165576 172562
64419 172562 179911 187169 194264 201229 208140 215073 221804 227747 232391 235611 237423 237781 236867 235180 232963
64404 232963 229815 225321 219925 214712 210280 206079 200961 194304 186624 179150 172779 167445 162539 157790
64390 157790 153452 149714 146356 143125 140110 137532 135411 133668 132337 131467 130966 130679 130512 130345 130030 129609
64374 129609 129378 129589 130221 131140 132290 133603 134888 136013 137108 138488 140422 142962 145853 148583 150789
64359 150789 152637 154624 156925 159188 161019 162390 163453 164244 164787 165283 165991 167035 168486 170481 173122
64344 173122 176345 179992 183967 188316 193253 199087 205941 213555 221563 229901 238749 248094 257636 267037
64330 267037 275953 283934 290752 296802 302595 307802 311427 313160 313928 314701 315369 315401 315159 315784 317998 321725
64314 321725 326883 333824 342793 353578 366101 381025 399318 421361 446937 476114 509746 548786
64302 548786 593286 642472 695796 753415 815279 880027 945175 1008095 1066220 1116316 1154415
64291 1154415 1177066 1182606 1171267 1144599 1105173 1056342 1001509 943352 883840 824804 768136
64280 768136 715261 666570 621540 579538 540580 505232 473708 445336 419280 395595 375057
64269 375057 357885 343099 329324 315851 302815 290754 280196 271197 263041 254839 246635 239452
64257 239452 233895 229267 224534 219647 215257 211496 207818 203903 200055 196701 194076 192374 191638 191415 191035
64242 191035 190390 190006 190249 190890 191496 191795 191508 190355 188568 186993 186265 186107 185800 185140 184565 184373 184225 183522
64224 183522 182100 180415 179139 178605 178619 178770 178931 179375 180380 181801 183208 184419 185696 187350 189352 191515
64208 191515 193908 196806 200224 203829 207425 211288 215883 221483 228228 236268 245479 255255 264949 274454
64194 274454 284001 293525 302729 311781 321463 332446 344821 358523 373895 391636 412418 436717
64182 436717 464765 496513 531885 571218 615252 664523 718954 778046 841077 906800 973000
64171 973000 1036466 1093320 1139580 1171933 1188351 1188040 1171045 1138436 1092875 1038380 978996 917697
64159 917697 856415 796551 739188 685152 635126 589480 547983 510113 475774 445209 418132
64148 418132 393599 371055 350818 333123 317347 302780 289647 278647 269769 262198 255153 248208
64136 248208 241051 233631 226521 220580 216196 213149 211011 209307 207505 205356 203188 201493 200366 199618
64122 199618 199147 198813 198259 197333 196440 195939 195471 194516 193383 193019 193887 195602 197548 199332 200709 201676 202628
64105 202628 203914 205351 206629 208038 210147 212900 215650 218065 220312 222455 224384 226344 228694 230995
64091 230995 232082 231399 229688 228128 227242 226786 226134 224605 221975 218884 216235 214068 211624 208663 205945
64076 205945 204119 202938 202073 202018 203374 205666 207641 208668 209286 210380 212284 214739 217443 220520 224512
64061 224512 229895 236619 244217 252279 260583 268873 276936 284991 293586 303003 313093 323734 334936
64048 334936 346349 357101 366390 373908 379552 383181 384829 384737 382927 379181 373626 366875 359364 351098
64034 351098 342344 333897 326142 318423 310047 301517 294020 287961 282691 277579 272618 267994 263751 260036
64020 260036 257101 254798 252497 249716 246605 243733 241740 241236 242526 245074 247597 249093 249743 250477 251817
64005 251817 253483 255110 256844 258931 261081 262767 264155 266180 269523 273907 278746 284037 290135 296875
63991 296875 303634 310236 317200 324974 333525 342932 353774 366402 380216 394260 408413 423539 440411
63978 440411 458869 478100 497466 516978 537176 558739 582204 607942 636327 667922 703514
63967 703514 743949 789891 841802 900372 967055 1044014 1133452 1237245 1357322 1495859 1654536
63956 1654536 1833771 2033086 2251981 2489882 2745443 3016642 3301482 3597692 3901437
63947 3901437 4206975 4507809 4797541 5069374 5315834 5529995 5706970 5843838 5938553 5989390
63937 5989390 5995147 5955284 5869982 5740587 5570127 5363335 5126389 4866583 4591531 4307901
63927 4307901 4020796 3734368 3452602 3179225 2917377 2669877 2439397 2227717 2035043
63918 2035043 1860643 1703981 1564672 1441491 1332206 1234546 1146925 1068264 997705 934693
63908 934693 878885 829679 786028 746830 711263 678663 648326 619582 591982 565429 540179
63897 540179 516555 494463 473272 452439 432166 413211 396110 380788 366839 353830 341355
63886 341355 329121 317146 305773 295455 286492 278846 272101 265778 259821 254619 250430 247070 244312
63873 244312 242214 240720 239297 237485 235594 234279 233521 232545 230791 228512 226367 224839 224129 224196 224690 225147
63857 225147 225397 225564 225670 225582 225402 225541 226176 226901 227094 226426 224821 222162 218327 213565 208636 204421 201266
63840 201266 198696 195861 192378 188613 185104 181974 179137 176808 175362 174735 174370 173765 172788 171510 170188
63825 170188 169491 170199 172281 174539 175558 174929 173394 171928 171015 170721 171052 172060 173751 176061 178869 181908
63809 181908 184752 187118 189188 191444 194072 196694 198862 200658 202548 204724 206899 208735 210154 211128
63795 211128 211465 210985 209787 208251 206907 206265 206482 207166 207718 207899 207748 207064 205481 203207 201105 199709
63779 199709 198527 196696 193977 190811 187778 185280 183399 181628 179140 175707 172060 168924 166161 163408
63765 163408 161064 159816 159381 158585 156784 154560 152925 152416 153009 154304 155575 156143 156006 155803 156036 156544
63749 156544 156777 156272 154893 153002 151423 150871 151343 152332 153592 155267 157349 159523 161646 163916 166466
63734 166466 169170 172008 175197 178817 182630 186432 190281 194269 198351 202468 206486 209939 212211 213169
63720 213169 213343 213376 213509 213644 213647 213502 213399 213710 214620 215807 216827 217830 219525 222386 226195 230366 234367
63703 234367 237839 240737 243448 246466 249926 253691 257778 262177 266379 269681 271990 273763 275072 275400
63689 275400 274541 273032 271385 269429 266811 263713 260692 258135 256113 254418 252555 250115 247401 245225
63675 245225 243878 242770 241332 239694 238103 236208 233454 229779 225504 220887 216205 211867 207948 203946
63661 203946 199484 194956 190996 187652 184625 181990 180049 178714 177711 177278 177946 179570 181219 182239 182941
63646 182941 184051 185808 187873 189918 192102 194963 198866 203565 208433 213205 218287 224233 231173 238953
63632 238953 247549 257062 267503 278904 291454 305281 320253 336209 353131 370812 388692 406378
63620 406378 424049 441886 459287 475115 488497 498918 505778 508642 507969 504997 500725 495487 489687
63607 489687 484339 480430 477924 475740 472619 467878 461436 453391 443698 432292 419440 405758 391841
63594 391841 378033 364690 352401 341642 332392 324369 317495 311816 307102 302947 299288 296519 295010
63581 295010 294715 295277 296375 298009 300603 304709 310486 317564 325542 334323 343738 353295 362778 372806
63567 372806 384166 396710 409532 422227 435310 449312 464092 479317 494975 510924 526211
63556 526211 539262 548728 554005 555234 553072 548410 542159 535264 528800 523692 520285 518391 517725 517953
63542 517953 518300 517621 515092 510603 504364 496559 487555 477960 468024 457295 445288 432289 419074 405955
63528 405955 392661 379119 365889 353600 342326 331715 321505 311696 302316 293314 284693 276546
63516 276546 268900 261666 254893 248996 244495 241411 239062 236620 233825 231049 228750 227009 225525 223866
63502 223866 221732 219229 216948 215551 215177 215391 215751 216216 216872 217613 218386 219624 222015 225707 229985 233874
63486 233874 237017 239820 242869 246327 249871 253019 255405 256825 257202 256588 255170 253224 251005 248620 246015
63471 246015 243102 239971 236884 234042 231451 229125 227251 225984 225220 224833 225003 225980 227596 229467 231727
63456 231727 235034 239623 244844 250013 255345 261548 268776 276493 284234 292031 300156 308906 318537 328974
63442 328974 339668 350249 361313 374005 388723 404793 421547 439150 458066 478336 499901
63431 499901 523216 548810 576246 604002 630397 654222 674491 690164 700570 705951 707297 705688
63419 705688 701978 696965 691430 685761 679814 673432 666913 660551 653722 644979 633261 618670 601807
63406 601807 582909 562107 540179 518303 497126 476698 457316 439768 424518 411249 399503
63395 399503 389344 381031 374443 369239 365355 363013 362457 363990 367986 374444 382708 392065 402578 414963
63381 414963 429624 446144 463676 481410 498596 514630 529459 543591 557322 570138 581435
63370 581435 591852 603260 616956 632177 646823 659339 669262 676149 679090 677792 673363 667264 659962
63357 659962 651428 642493 634593 628204 622526 616849 611161 605053 597093 586135 572560 557478 541204
63344 541204 523343 503955 483745 463272 442827 423071 404967 388908 374500 361348 349578
63333 349578 339458 331039 324258 318950 314603 310599 306809 303488 300502 297231 293458 289773 286734 284143
63319 284143 281612 279356 277877 277200 277062 277647 279511 282828 287319 292971 300182 308917 318176 326628 333536
63304 333536 338796 342253 343357 341520 336682 329529 321102 312125 302681 292727 282829 274089 267178 261694
63290 261694 256688 251616 246612 242015 238048 234871 232594 231066 229879 228683 227419 226230 225303 224839 224973
63275 224973 225605 226433 227257 228185 229418 230940 232523 233994 235395 236888 238597 240557 242769 245256 248016
63260 248016 250917 253762 256578 259791 263870 268753 273815 278550 283163 288354 294592 301704 309121 316410
63246 316410 323583 330976 338938 347728 357727 369506 383392 399054 415825 433457 452168 471861
63234 471861 491833 511567 531386 551814 572497 592349 610767 628273 645882 664204 683266
63223 683266 702887 723019 743830 765468 787660 809646 830749 850870 870064 887683 902363
63212 902363 912944 919034 920616 917619 910199 899184 885856 871342 856252 840734 824668 807949
63200 807949 790668 772941 754664 735798 716986 699477 684278 671634 661535 654336 650578 650486
63188 650486 653958 660721 670161 681287 693439 706923 722467 740053 758690 777384 795910 814577
63176 814577 833610 852921 872150 890712 908028 923860 938237 950868 960894 967396 970006 968757
63164 968757 963522 953998 940255 922938 902692 879565 853317 824384 794299 764921 737249 711158
63152 711158 686296 662966 641914 623394 606792 591328 576905 564058 553149 543983 536333 530540
63140 530540 527201 526277 526901 528339 530903 535658 543302 553586 565649 578469 590871 601508 609222
63127 609222 613398 613921 610936 604845 596361 586337 575487 564328 553297 542810 533190 524651 517324
63114 517324 511310 506706 503508 501380 499591 497465 494997 492844 491575 491064 490733 490227 489669 489338 489287 489295 489159
63097 489159 488967 489042 489533 490183 490722 491375 492686 494817 497368 499970 502654 505439 507901 509524 510317 510876
63081 510876 511987 514287 517976 522552 527066 531026 534929 539691 545713 552769 560528 568812 577524 586736
63067 586736 596792 608018 620484 634313 649920 667497 686597 706836 728865 753846 781954
63056 781954 812152 843664 876928 912627 950390 989017 1027687 1066363 1105146 1143764 1181763
63045 1181763 1218914 1255294 1291081 1326409 1361492 1396870 1433261 1470818 1508682 1545596 1580851
63034 1580851 1614127 1644499 1670294 1690096 1703240 1709033 1706220 1693819 1672060 1641955 1604396 1560363
63022 1560363 1511574 1460089 1407405 1354680 1303641 1256273 1213435 1174676 1139785 1109778 1085857
63011 1085857 1068050 1055536 1047901 1045340 1047855 1055021 1066619 1082879 1103813 1128679 1156357 1186035
62999 1186035 1217291 1249703 1282698 1315821 1348994 1382358 1415901 1449268 1481922 1513337 1542935
62988 1542935 1569930 1593436 1612791 1627546 1636979 1639775 1634470 1620251 1597225 1565920 1526799 1480400
62976 1480400 1427807 1370728 1311003 1250083 1189018 1128766 1070298 1014357 961283 911268 864636
62965 864636 821607 781842 744615 709658 677546 648927 623452 599871 577221 555642 535871
62954 535871 518182 502071 486887 472518 459348 447644 437092 427010 417054 407610 399338 392367
62942 392367 386151 380134 374295 368952 364295 360397 357376 355146 353103 350531 347378 344245 341504 338877
62928 338877 336130 333697 332194 331543 331100 330519 329955 329401 328402 326657 324468 322268 320039 317568 315009 312770
62912 312770 310921 309130 307170 305125 303109 301083 299036 296989 294780 292209 289560 287566 286615 286331 286238
62897 286238 286456 287269 288302 288788 288636 288569 289071 289755 290076 290181 290609 291475 292384 292962 293094 292763 292076 291381 290965
62878 290965 290600 289712 288064 286005 283981 282072 280158 278323 276927 276269 276250 276446 276617 277139 278604 280857
62862 280857 282784 283498 283503 284181 286187 288864 291189 292704 293421 293478 293171 292827 292324 291202 289607 288584 288916
62845 288916 290057 290777 290580 289920 289257 288633 288098 287855 287813 287510 286697 285637 284727 284174 284117 284698 285885 287533
62827 287533 289670 292375 295369 298157 300652 303203 305911 308437 310736 313440 317162 321785 326759 331671
62813 331671 336172 339895 343065 346809 352187 359059 366480 374013 381917 390234 398571 407029 416513 427696
62799 427696 440220 453419 467384 482868 500484 520507 543183 568710 597081 628425 663390
62788 663390 702710 746453 794141 845596 901112 960754 1024006 1090273 1159196 1230095 1301465
62777 1301465 1371347 1437916 1499379 1553633 1598578 1632703 1655101 1665080 1662257 1647032 1620558 1584195
62765 1584195 1539247 1487125 1429333 1367250 1302314 1236391 1171354 1108044 1046137 985426 926794
62754 926794 871547 820174 772377 728090 687751 651545 618989 589462 562721 538711 517262
62743 517262 498277 481887 468051 456164 445346 435115 425640 417414 410758 405528 401158 397121 393485
62730 393485 390891 389891 390472 392345 395391 399503 404220 409037 414187 420659 429205 439604 451155 463628
62716 463628 477439 493001 510323 529294 550105 573284 599514 629512 663815 702458 745029
62705 745029 791285 841610 896569 956069 1019260 1085302 1153817 1224279 1295149 1363957 1428222
62694 1428222 1486092 1536142 1576908 1606852 1624740 1629963 1622545 1602968 1572021 1530837 1480989 1424403
62682 1424403 1363013 1298389 1231747 1164257 1097363 1032752 971899 915441 862968 813683 767354
62671 767354 724469 685408 649872 617464 588472 563451 542055 522885 504746 487620 472156
62660 472156 458567 446373 434943 423907 413131 402664 392657 383144 373952 365030 356682 349232
62648 349232 342615 336601 331254 326742 322759 318634 314145 309863 306503 304211 302573 301015 299047 296497
62634 296497 293817 291916 291416 292196 293732 295584 297302 298287 298309 297991 298237 299204 300295 301204 302400 304434
62618 304434 307219 310336 313689 317491 321811 326546 331805 337992 345480 354364 364587 376208 389537
62605 389537 405068 423215 444024 467196 492416 519513 548317 578573 610154 643124 677320
62594 677320 711923 745656 777298 805852 830366 849944 863985 872209 874459 870629 860814 845390
62582 845390 825025 800730 773813 745521 716678 687762 659096 630748 602427 573981 546077
62571 546077 519980 496535 475650 456878 440134 425558 412998 402014 392368 384245 377907 373262
62559 373262 369837 367176 365147 363719 362477 360728 358315 355962 354344 353015 350930 347945 345075 343038
62545 343038 341319 339139 336786 335338 335373 336574 338489 341115 344683 349298 354829 360977 367489 374491 382465
62530 382465 391689 401984 413381 426753 443232 462962 484940 508187 532737 559362 588716 620924
62518 620924 655768 692951 732123 772706 813795 854342 893530 930743 965100 995298 1020220
62507 1020220 1039582 1053812 1063442 1068792 1070024 1067255 1060896 1052104 1042542 1033259 1024163 1015126 1007245
62494 1007245 1002215 1000516 1000890 1001592 1001487 999966 996649 991526 984761 975988 964249 948863 929888 907524
62480 907524 881777 853045 822474 791160 759479 727632 696314 666177 637053 608539 581231
62469 581231 556572 535359 516946 500134 484431 470221 458030 447913 439505 432518 427119 423646
62457 423646 421968 421331 421104 421442 422942 425763 429456 433604 438253 443644 449775 456336 462913 469150 474868
62442 474868 480094 484892 489167 492751 495656 498068 500102 501687 502723 503145 502775 501225 498176 493765 488639
62427 488639 483509 478570 473361 467237 460038 452301 444856 438227 432387 427001 421906 417302 413452 410268
62413 410268 407436 404990 403412 402863 402671 401978 400763 399756 399433 399659 400372 401996 404906 408852 413209 417511
62397 417511 421568 425401 429218 433167 436991 440347 443573 447610 452881 458738 464324 469464 474324 478763
62383 478763 482769 487083 492631 499454 506802 514167 521642 529480 538075 548307 561122 576562 593800
62370 593800 612306 632508 655241 681111 710470 743290 778745 815496 852747 890506 928387
62359 928387 964736 997487 1025582 1048938 1067333 1080063 1086776 1088021 1084737 1077483 1066403 1051644
62347 1051644 1033617 1012923 990161 965702 939600 911889 883127 854501 827159 801406 776740
62336 776740 752777 729981 709286 691084 674768 659293 643980 628736 613759 599277 585457
62325 585457 572369 559931 547957 536253 524721 513533 503264 494655 488039 483056 478999 475385
62313 475385 472154 469481 467551 466385 465761 465408 465309 465640 466315 466886 467061 467091 467444 468369 470056 472873 476998
62296 476998 481935 486849 491326 495594 500185 505701 512642 520895 529491 537398 544582 551877 559934 568779
62282 568779 578347 588673 599400 609724 619173 628020 636663 644994 652688 659751 666572 673775 682186
62269 682186 692576 705211 720103 737844 759612 785906 815779 847818 881377 916190 951132
62258 951132 984182 1013602 1038525 1058446 1072912 1082002 1086601 1087780 1086032 1081099 1072245 1058623 1039812
62245 1039812 1016273 989120 959294 927215 893437 859360 826865 797143 770036 744639 720435
62234 720435 697790 677395 659483 643760 629995 618310 608814 601240 595173 590311 586238 582234 577865
62221 577865 573679 570730 569344 568860 568778 569581 571976 575791 580243 585085 590794 597639 605226 613186 621609
62206 621609 630372 638536 645159 650450 655398 660261 664165 666442 667679 669012 670857 672916 675020 677318
62192 677318 679828 682547 686002 690951 697327 704073 710243 715771 720856 725180 728287 730430 732569 735700
62178 735700 740578 747799 757540 769338 782652 797717 815378 835994 858865 882737 906403 928659
62166 928659 948197 963989 975640 983136 986507 986004 982386 976542 968707 958262 944391 926824 905975
62153 905975 882628 857699 832179 806972 782512 758659 735188 712490 691540 673062 656879
62142 656879 642338 629225 617912 608607 600792 593545 586219 578738 571487 565087 560059 556423 553679
62129 553679 551242 548777 546016 542540 538039 532689 527027 521476 516230 511502 507561 504367 501311 497408
62115 497408 491818 484378 475828 467423 460052 453733 448030 442787 438160 434145 430555 427453 425144 423629
62101 423629 422511 421613 421254 421673 422615 423808 425489 428071 431601 435947 441233 447608 454787 462293 469973
62086 469973 477871 485776 493518 501578 510803 521507 533374 546243 560279 575304 590624 605816
62074 605816 621086 636618 652156 667639 683652 700686 718184 734698 748745 759259 765708 768315
62062 768315 767889 765023 759631 751535 741137 729041 715364 699848 682426 663208 642248 619874
62050 619874 596976 574382 552127 529958 508375 488496 470937 455462 441711 429581 418818
62039 418818 408930 399725 391444 384224 377872 372316 367700 363911 360498 357248 354348 351760 348972 345651
62025 345651 342082 338709 335606 332745 330344 328625 327455 326502 325498 324195 322431 320436 318738 317559
62011 317559 316741 316440 317375 319973 323682 327538 331103 334448 337562 340279 342577 344522 346095 347335 348368
61996 348368 348843 347757 344395 339341 333972 329008 324035 318369 311905 305090 298559 292863 288150 283977
61982 283977 279709 275210 270905 267232 264306 262074 260407 259016 257667 256605 256435 257435 259213 261138
61968 261138 262903 264592 266394 268378 270327 271785 272532 273074 274404 277068 280633 284266 287696 291446 296193
61953 296193 302079 308681 315530 322624 330387 339124 348607 358280 367856 377555 387740 398475 409504
61940 409504 420620 431918 443616 455610 467302 478008 487516 496091 503892 510589 515679 518942 520432
61927 520432 520208 518367 515267 511421 507202 502880 498924 496018 494683 495040 497021 500661 506081 513305 522119
61912 522119 532094 542714 553507 564044 573868 582567 590022 596407 601794 605851 608138 608685 608186 607642
61898 607642 607868 609083 610710 611691 611303 609701 607471 604697 600755 595033 587530 578633 568596 557532
61884 557532 545782 533997 522727 512013 501478 490862 480505 471219 463634 457691 452882 448834
61872 448834 445454 442551 439745 437025 435183 435275 437625 441642 446711 452934 460699 469817 479660 490212
61858 490212 502442 517231 534241 552275 570582 589263 608440 627609 646061 663484 679736
61847 679736 694250 706058 714403 719202 721022 720786 719405 717466 715225 712880 710752 709248 708941 710752
61833 710752 715744 724460 736611 751549 768842 788145 808688 829140 847848 863038 872962 876199
61821 876199 871931 859978 840887 816160 788060 758667 729063 699576 670625 643048 617711 595116
61809 595116 575386 558323 543443 530187 518218 507515 498255 490653 484733 480110 476130 472357 468820
61796 468820 465715 463124 461115 459731 458667 457369 455829 454852 455022 455764 456112 456222 457321 460119 463995
61781 463995 467973 471908 476330 481602 487627 494138 500919 507915 515431 524061 534218 545767 558270
61768 558270 571444 585226 599478 613792 627571 640174 650986 659379 664675 666329 664266 659008
61756 659008 651293 641579 629951 616461 601470 585746 570322 556046 543078 530863 518751 506585
61744 506585 494743 483836 474480 466971 460896 455365 449920 445002 441238 438577 436508 434756 433246 431646
61730 431646 429542 426975 424305 421685 419202 417330 416550 416617 416898 417423 418807 421059 423257 424622 425128 424825
61714 424825 423421 421064 418792 417457 416576 414871 411731 407706 403782 400616 398243 396127 393638 390770
61700 390770 388236 386624 385774 385167 384547 383813 382745 381360 380226 379896 380262 380996 382412 385295 389855 395459
61684 395459 401507 408072 415501 423743 432343 440881 449122 456808 463549 469052 473439 477172 480508 482999
61670 482999 483679 481748 476998 469673 460263 449455 437909 425983 413924 402431 392563 384887 379186
61657 379186 375318 373908 375684 380431 387209 395486 405498 417449 430742 443962 455200 462505 464633
61644 464633 461717 454972 445634 434352 421548 407955 394500 381898 370522 360509 351744 343858
61632 343858 336524 329820 324159 319783 316421 313627 311436 310436 310986 312555 314203 315611 317182 319033
61618 319033 320470 320862 320649 320943 322208 323818 324873 324977 324149 322466 320096 317366 314509 311451 308122
61603 308122 304901 302441 301017 300243 299637 299286 299717 301158 303194 305328 307587 310344 313734 317513 321396
61588 321396 325170 328622 331795 335325 340008 345873 352108 358082 364013 370349 377003 383592 390084 396770
61574 396770 403940 412092 422152 434801 449633 465624 482513 501150 522353 546027 571716 599410
61562 599410 629135 659899 689628 716320 738911 756902 769545 775803 775133 768015 755639 739318
61550 739318 720405 700459 680970 662716 645602 629275 613782 599549 586900 575760 565742
61539 565742 556433 547677 539711 532901 527263 522263 517120 511341 505058 499054 494304 491189 489037 486732
61525 486732 483838 480958 478973 478247 478625 479830 481682 484278 488221 494364 503015 513592 525293 537971
61511 537971 552156 568528 587663 610065 636064 665645 698599 734851 774615 818405 866900
61500 866900 920537 979063 1041650 1107302 1174571 1240790 1302301 1355957 1399994 1433233 1454338
61489 1454338 1462798 1460224 1449756 1434392 1416661 1399560 1386427 1379492 1379446 1386790 1402865 1429008 1465373
61476 1465373 1511124 1565195 1626057 1691008 1756461 1818900 1874947 1920481 1950612 1961311 1951259
61465 1951259 1921925 1876021 1816199 1745248 1666921 1585781 1505866 1429667 1358438 1293146 1234742
61454 1234742 1183771 1140187 1103692 1074009 1050898 1034251 1024305 1021560 1026370 1038762 1058670 1086116
61442 1086116 1120932 1162205 1207752 1253779 1295060 1325988 1342242 1342143 1326905 1299815 1265001 1226440
61430 1226440 1187477 1150710 1118010 1090661 1069716 1056266 1051291 1055322 1068545 1091244 1123641 1164896
61418 1164896 1212217 1260915 1305120 1338601 1355975 1354328 1334164 1298757 1252603 1200286 1145951
61407 1145951 1092816 1042767 996600 954683 917217 884046 854595 828099 803821 781240 760306
61396 760306 741390 724790 710395 697980 687471 678631 670801 663453 656825 651560 647912 645702 644791
61383 644791 645051 646047 647420 649500 652894 657505 662647 668153 674563 681918 689059 694555 697834 699047 698370
61368 698370 695942 692185 687614 682436 676665 670571 664723 659638 655466 651879 648110 643384 637520 631027
61354 631027 624444 617765 610644 602926 594741 586207 577367 568433 559876 552174 545507 539804 535017 531233
61340 531233 528402 526080 523699 521136 518765 516893 515513 514727 514969 516402 518434 520298 521914 523761 526179
61325 526179 529273 533283 538377 544125 549875 555680 562318 570291 579314 588881 598753 608740 618459 627501
61311 627501 635525 642230 647762 653141 659566 667066 674405 680561 685772 690878 696181 701318 705737 708897
61297 708897 710396 710264 708866 706302 702301 696880 690602 683913 676764 669308 662436 657058 653200 650303
61283 650303 648145 646962 646948 648065 650190 653052 656259 659812 664356 670525 678157 686514 694981 703113 710262
61268 710262 715733 719347 721455 722442 722499 721794 720515 718821 717065 715971 716266 718302 722429 729639 741313
61253 741313 758135 779637 805053 834530 869346 911005 960227 1016819 1080290 1150033 1224268
61242 1224268 1298651 1366302 1419785 1453584 1465576 1457209 1432750 1397748 1357337 1315458 1275230
61231 1275230 1239385 1210074 1188700 1176304 1173810 1181651 1199576 1227195 1264323 1310241 1362593 1417072
61219 1417072 1467771 1507737 1530306 1531447 1511466 1474372 1425632 1370453 1313159 1256773 1202762
61208 1202762 1151693 1104360 1061957 1025183 993699 966639 943218 922748 904503 887875 872502
61197 872502 858111 844469 831606 819836 809396 800194 791968 784466 777380 770313 763017 755596 748341
61184 748341 741316 734176 726428 717858 708649 699012 688868 678093 667014 656319 646375 636940 627582
61171 627582 618068 608236 597978 587720 578561 571395 566059 561675 557685 554247 551775 550475 550120 549911
61157 549911 548613 545270 539800 532665 524167 514434 503982 493772 484598 476757 470312 465294 461541 458697
61143 458697 456594 455382 455099 455269 455178 454563 453942 454163 455581 457700 459663 461039 461942 462507 462665 462582 462925
61126 462925 464335 466839 470007 473530 477382 481720 486928 493629 502237 512544 523920 535848 548067
61113 548067 560335 572295 583444 593095 600616 605986 609942 613273 616102 618087 619105 619444 619437 619203 618668
61098 618668 617720 616499 615626 615836 617184 619004 620962 623689 627887 633102 637976 641613 644272 646794 649695
61083 649695 652777 655392 657266 659156 662281 666815 671489 675119 678023 681254 684935 688248 690858 693407
61069 693407 696595 700505 704866 709279 713110 715924 718200 721020 724767 728659 731744 733935 735899 738396
61055 738396 741916 746544 751945 757693 763714 770140 776838 783517 790422 798542 808983 822347 838733
61042 838733 858030 880016 904239 929842 955689 981122 1006718 1033883 1063590 1096157 1132482
61031 1132482 1174450 1223366 1278810 1340013 1407657 1483341 1568335 1664637 1776988 1912283 2077232
61020 2077232 2278019 2521490 2814412 3162142 3571565 4056850 4640611 5350114 6216169
61011 6216169 7271789 8531526 9946150 11369526 12589687 13425839 13822311 13864240 13713330
61002 13713330 13531485 13446352 13543119 13838714 14243450 14567006 14599286 14217229 13435096 12369370
60992 12369370 11164009 9936771 8765014 7692257 6737155 5901805 5180026 4562650 4038901
60983 4038901 3597040 3225936 2915842 2657672 2442572 2262458 2110320 1980052 1866762
60974 1866762 1767209 1679197 1600564 1529337 1464608 1406453 1355056 1310435 1272646 1241345 1215247
60963 1215247 1192731 1172798 1154757 1137360 1119342 1100744 1082760 1066159 1050683 1035963 1022109
60952 1022109 1009254 997368 986717 977693 969931 962342 954220 945553 935973 924273 909479 891885
60940 891885 872583 852489 832299 812888 795120 779391 765706 754159 745134 739115 736302 736154
60928 736154 737307 738291 738488 738152 737588 736755 735659 734608 733871 733560 733961 735490 738068 740992 743722 746363
60912 746363 749022 751097 751675 750494 748095 745148 741892 738224 734060 729582 725129 720737 715800 709457
60898 709457 701395 692010 681738 670679 659083 647774 637608 628711 620706 613570 607827 603834 601254
60885 601254 599361 597585 595566 592923 589269 584517 579052 573591 568895 565507 563578 562796 562592 562578 562745
60870 562745 563150 563461 563050 561553 559161 556184 552561 548053 542887 537960 534242 531893 529991 527238 523103
60855 523103 518332 514212 511420 509717 508642 508047 507874 507847 507681 507344 506798 505726 503759 500812 496919 491927
60839 491927 485691 478453 470765 463113 455769 448852 442316 436008 429873 423967 418223 412546 407255 402940
60825 402940 399631 396663 393757 391584 390571 389666 387281 383246 378885 375173 371775 368073 364214 360702
60811 360702 357613 354720 351934 349261 346704 344558 343411 343478 344147 344496 344140 343402 342885 342990 343611 344223 344517
60794 344517 344914 346054 347757 349041 349370 349373 349939 351063 351931 351878 350909 349513 348242 347271 346168 344346 341903
60777 341903 339631 337955 336363 334320 332360 331607 332348 333657 334479 334672 334878 335713 337267 339221 341285 343370
60761 343370 345261 346256 345621 343542 341275 339986 339687 339631 339419 339316 339750 341028 343392 346664 349759 351169
60745 351169 350245 347789 345174 343168 341656 340128 338191 335871 333682 332275 331808 331829 331902 332160 332958 334190
60729 334190 335325 336087 336732 337551 338385 338855 338907 338890 339129 339607 340108 340439 340452 339939 338728 336925 334920 333041
60711 333041 331210 329047 326376 323512 320867 318326 315281 311466 307504 304319 302133 300378 298583 296948
60697 296948 295921 295643 296004 296829 297644 297677 296680 295527 295447 296619 298136 299400 300927 303442 306695 309746
60681 309746 312169 314413 316981 319685 321900 323206 323546 322974 321608 319823 318095 316458 314355 311382 308003
60666 308003 305094 302826 300591 298254 296833 297370 299488 301751 303285 304376 305522 306732 307995 309699
60652 309699 312073 314619 316591 317774 318406 318599 318300 317599 316542 314696 311481 307107 302786 299709 297955
60637 297955 296626 294942 292983 291395 290588 290399 290404 290283 289821 288871 287596 286680 286940 288640 291341 294417 297531
60620 297531 300605 303606 306511 309249 311533 312911 313189 312718 312156 312003 312403 313275 314510 316054 317749 319101
60604 319101 319399 318364 316638 315268 314680 314451 314097 313635 313224 312727 311967 311101 310403 309950 309892 310730 312804 315603
60586 315603 318079 319718 320928 322333 324075 325990 328071 330391 332652 334150 334405 333793 333382 333993 335428
60571 335428 336763 337374 337407 337206 336749 336023 335672 336693 339425 343261 347544 352296 357853 364084 370445 376724
60555 376724 383336 390766 399043 407941 417406 427465 437821 447956 457813 468167 480138 494560 511880
60542 511880 532343 555848 581802 609506 638493 667976 695943 719445 736010 744484 744481 735855 719293
60529 719293 696889 671357 644629 617654 591285 566671 544756 525967 510557 498763 490425 484871
60517 484871 481475 480094 480822 483633 488531 495753 505549 517896 532669 549998 570249 593803 620966
60504 620966 651923 686426 723432 761069 796849 827974 851969 867608 875396 877026 874446 869549
60492 869549 864435 861322 861900 866846 875845 887642 900009 910170 915705 915047 907162 891316 867605
60479 867605 837440 802955 765946 727688 689491 652762 618407 586714 557960 532547 510312
60468 510312 490300 471771 455005 440596 428302 417217 406919 397695 389687 382520 375939 370159
60456 370159 365255 360769 356339 352284 349049 346426 343872 341395 339531 338460 337768 337201 337130 337932 339323
60441 339323 340724 342104 344046 347054 351146 356167 362116 368970 376425 384017 391390 398264 404254 408909
60427 408909 411944 413361 413517 413184 413247 414015 414977 415608 416302 418021 421108 425003 429266 434233 440419 447850
60411 447850 456412 466280 477462 489353 501402 513945 527717 542818 558824 575684 593702 612716
60399 612716 632142 651890 672423 693732 715049 735871 756550 777442 798141 817932 836386
60388 836386 853041 867134 878255 886830 893419 898020 900603 901872 902781 903600 904178 904793 905968 907577
60374 907577 908913 909631 909908 909749 908877 907473 906317 905961 906351 907538 910186 915048 922310 931659 942537
60359 942537 954001 964758 973654 979829 982182 979252 970228 955811 937531 916350 892395 865975
60347 865975 838254 810757 784526 759926 737014 715893 696729 679467 663574 648288 633323
60336 633323 619118 606098 593936 582058 570784 561247 553959 548117 542801 538326 535707 535137 535832
60323 535832 537332 540044 544249 549324 554479 559705 565352 571111 576077 579701 582069 583250 582964 581120
60309 581120 578315 575551 573586 572632 572413 572418 572208 571524 569988 566912 561701 554450 545841 536493 526715 516854
60293 516854 507398 498661 490730 483863 478569 475110 473211 472328 471880 471173 469623 467332 465054 463349 462136
60278 462136 461295 461148 461928 463175 464292 465481 467575 471048 475685 481151 487392 494400 502050 510295 519246
60263 519246 528927 539115 549441 559488 568843 577295 584942 591905 597972 602665 605561 606337 604744 600951
60249 600951 595828 590401 584932 578936 572330 566211 562173 560964 562024 564290 567244 571195 576798 584498
60235 584498 594432 606630 621074 637530 655466 674188 692992 711243 728562 745049 761203 777570
60223 777570 794575 812642 832086 852774 874171 895997 918640 942761 968802 997050 1027820
60212 1027820 1061181 1096727 1134084 1173534 1215768 1260990 1308522 1357180 1405725 1453092 1498601
60201 1498601 1541912 1582495 1619160 1650498 1675795 1695233 1709274 1718391 1723530 1726299 1728210 1729830
60189 1729830 1730937 1731458 1732049 1733760 1737267 1742502 1748917 1755909 1762909 1769267 1774475 1778639 1782457 1786462
60175 1786462 1790502 1794163 1797400 1800354 1802689 1803579 1802424 1799172 1793810 1785830 1774437 1759320 1741207
60162 1741207 1721754 1702653 1684567 1666814 1648232 1628324 1607425 1585886 1563376 1539012 1511983
60151 1511983 1482025 1449508 1415196 1379810 1343776 1307350 1270923 1235101 1200586 1168043 1137969
60140 1137969 1110516 1085474 1062483 1041175 1021150 1002063 983860 966756 950886 936189 922697
60129 922697 910567 899632 889225 878630 867425 855221 841587 826596 811034 795623 780464
60118 780464 765683 752053 740277 730053 720707 712488 706313 702266 699350 696886 695274 695067 696120
60105 696120 698160 701542 706760 713505 720722 727426 733209 738150 742574 746751 750577 753636 755650 756727
60091 756727 757100 756867 756027 754548 752314 749212 745287 740611 735077 728753 722303 716496 711111 704916 697093
60076 697093 688249 679653 671770 664022 655829 647451 639719 633206 627810 623158 619281 616693 615711 615982 616935
60061 616935 618454 620710 623482 626136 628237 629741 630643 630929 630857 630668 629874 627406 622720 616412 609537 602713
60045 602713 596005 589274 582447 575822 570202 566312 563969 562334 561152 561222 563378 567567 573245 580181 588445
60030 588445 598013 608753 620477 632660 644539 655898 667370 679651 692810 706789 722055 739026
60018 739026 757042 774503 789936 802472 811367 815639 814346 807136 794612 778333 760202 741459
60006 741459 722345 702935 684071 667082 652720 640718 630372 621276 613471 607112 602111 598143
59994 598143 595066 593250 593207 594947 598062 602413 608192 615115 622119 628308 633815 639389 645440 651905 658793
59979 658793 666451 675454 686445 699795 715133 731517 748333 765674 783554 801153 817307 831397
59967 831397 843315 852832 859447 862615 861781 856576 847469 835939 823401 810201 796156 781765 768246
59954 768246 756514 746732 738832 732974 729469 728636 730698 735489 742487 751504 763134 778080 796361
59941 796361 817603 841794 869097 899179 931412 965570 1001606 1038847 1076135 1112735 1148382
59930 1148382 1182404 1213476 1240233 1261460 1275757 1281976 1280314 1272336 1259719 1243618 1225333 1206659
59918 1206659 1188986 1172686 1157788 1144656 1133510 1123774 1114515 1105210 1095695 1085761 1075334 1064729
59906 1064729 1054206 1043488 1032160 1020413 1009007 998684 990020 983589 979708 978045 977937 979241 982565
59893 982565 988502 996789 1006333 1015988 1025293 1034567 1044393 1055094 1066699 1079165 1092352 1105866 1119305
59880 1119305 1132822 1147173 1163137 1181128 1201485 1224819 1251874 1283364 1320211 1363740 1415255
59869 1415255 1475435 1544286 1621578 1707082 1800288 1899846 2002974 2105036 2199687 2279772 2338772
59858 2338772 2372273 2378969 2360753 2321810 2267413 2203218 2134970 2067924 2005916 1950904 1903367
59847 1903367 1862987 1829079 1800873 1777797 1759530 1745882 1736890 1733038 1734994 1743040 1757139 1777724
59835 1777724 1805967 1842932 1888824 1943491 2007425 2081783 2167573 2265290 2375310 2498108 2633842
59824 2633842 2781760 2939717 3103618 3267003 3421618 3559129 3672988 3759400 3817385 3848496
59814 3848496 3856327 3845595 3820963 3786199 3744036 3696372 3644124 3586765 3522392 3448881 3365352
59803 3365352 3272600 3172275 3066043 2955624 2843091 2730522 2619323 2510130 2403303 2299168
59793 2299168 2197876 2099605 2005182 1916172 1834006 1759200 1691660 1631520 1579212 1534809 1497794
59782 1497794 1467711 1444683 1429018 1420423 1417841 1419975 1425775 1434551 1445819 1459067 1473565 1488483
59770 1488483 1503290 1517859 1532023 1545171 1556606 1566098 1573657 1578769 1580329 1577551 1570721 1560979 1549760
59757 1549760 1538596 1529076 1522580 1520021 1521865 1528049 1537631 1548806 1559689 1569077 1576397 1581103 1582464
59744 1582464 1579841 1572951 1561875 1546985 1528783 1507761 1484551 1460220 1436046 1412699 1389910 1367262
59732 1367262 1345036 1323837 1303564 1283298 1262316 1240786 1219335 1198279 1177488 1156827 1136527
59721 1136527 1117123 1099159 1082976 1068825 1057077 1048149 1042221 1039241 1039333 1042842 1049760 1059320 1070499
59708 1070499 1082843 1096602 1112210 1129833 1149237 1169767 1190467 1210364 1228538 1243953 1255659
59697 1255659 1263544 1268637 1272353 1275620 1278907 1282627 1286982 1291734 1296744 1302527 1309630 1317565 1325032 1331234
59683 1331234 1336363 1340737 1344179 1346545 1348414 1350817 1354505 1359659 1366063 1373404 1381525 1390533 1400640 1412053
59669 1412053 1425204 1440788 1459104 1479364 1499948 1519256 1536010 1549000 1557190 1560139 1557915 1550643
59657 1550643 1538660 1523041 1505350 1486632 1467068 1446646 1425729 1404849 1384414 1364739 1345946
59646 1345946 1327825 1310249 1293737 1279021 1265944 1253302 1239930 1225325 1209057 1190176 1167577
59635 1167577 1140579 1109094 1073810 1036467 999352 964169 931704 902568 877546 856954 840391
59624 840391 827605 819036 815157 815907 821178 831153 845523 862930 881806 901254 920455 937779 951410
59611 951410 960659 965944 967758 966441 962868 958501 954557 951516 949407 948117 947445 947263 947553 947980 947768
59596 947768 946658 945864 947319 951846 958583 966178 973917 981504 988362 993537 995950 994493 988324 977586
59582 977586 963742 948775 933810 918612 902513 885814 870061 856818 846401 838123 831622 827281
59570 827281 825319 825271 826826 830513 836822 845125 854329 864417 876442 890965 907370 924919 943723
59557 943723 964342 987023 1011771 1038588 1067021 1095774 1123444 1149618 1174860 1199676 1224033
59546 1224033 1248046 1272563 1298332 1324354 1347404 1363641 1371024 1370414 1364694 1357029 1349513 1342611 1335341
59533 1335341 1326191 1314232 1299435 1282009 1261873 1238994 1213837 1187086 1159140 1130227 1100772
59522 1100772 1071146 1041212 1010633 979685 949322 920467 893632 869242 847777 829276 812992
59511 812992 797793 782820 767798 753114 739780 728965 721115 715545 711046 706920 703328 700761 699311
59498 699311 698489 697662 696709 696221 697019 699353 702620 705910 708915 712279 717009 723474 730970 738317 744787
59483 744787 750414 755559 760447 765134 769624 773786 777280 779647 780480 779631 777518 775221 773841 773618 773958
59468 773958 774414 775198 776479 777653 777789 776597 774480 771797 768473 764266 759029 752667 745172 736704 727456
59453 727456 717514 707098 696772 687077 678033 669336 660996 653434 646995 641776 637990 636116 636438 638613
59439 638613 641862 645577 649709 654696 660953 668319 676046 683424 690328 696997 703417 709179 713922 717827
59425 717827 721784 727097 734751 744823 756993 771774 790462 812959 836007 854635 865732 869789
59413 869789 869389 867043 864743 864318 867083 873443 883563 897908 916016 934776 949145 955433 953737
59400 953737 947029 938410 929660 921694 915269 910879 908597 908487 910955 916403 924744 935625 949019 965253
59386 965253 984573 1006946 1032273 1060427 1091126 1124155 1159698 1197984 1238504 1280078 1321999
59375 1321999 1364634 1408432 1452549 1494830 1532846 1564453 1587600 1600432 1602110 1593454 1576666 1554404
59363 1554404 1528912 1501610 1473241 1444459 1416308 1390080 1366742 1346513 1328956 1313378 1299323
59352 1299323 1286810 1276063 1266895 1258443 1249619 1239784 1228949 1217512 1205927 1194472 1183152 1171801
59340 1171801 1160289 1148594 1136854 1125604 1115889 1108600 1103568 1099698 1096201 1093337 1091787 1091850 1093597
59327 1093597 1097367 1103526 1112001 1122455 1134538 1147409 1159276 1168050 1172426 1171952 1166443 1156150 1142330
59314 1142330 1126615 1109337 1089091 1064461 1035896 1005624 976051 948661 924191 903229 886318
59303 886318 873564 864486 858517 855666 856425 860922 868473 878205 889851 903594 919372 936779 955477
59290 955477 975097 994647 1012591 1027803 1040155 1049960 1057150 1061389 1062877 1062671 1062131 1062263 1063777 1067600
59276 1067600 1074898 1086349 1101543 1119318 1138564 1158458 1178121 1196530 1212789 1226068 1235279 1239313
59264 1239313 1237720 1230664 1218219 1200338 1177708 1151845 1123887 1093941 1062094 1029420 997344 966516
59252 966516 936992 909046 883036 858831 836120 814992 795560 777416 760309 744964 732211
59241 732211 721416 710815 699480 688073 677560 668135 659677 652418 646679 642397 639299 637184 635894
59228 635894 635334 635594 636661 638058 639242 640360 642077 644616 647427 649859 651722 653183 654586 656336 658507
59213 658507 660649 662503 664699 668167 673034 678768 685233 692710 700910 708988 716735 724966 734527 745642
59199 745642 758449 773298 790157 808386 827457 847359 868064 889219 910580 932047 952986
59188 952986 972080 988103 1000284 1007897 1010317 1007767 1001233 991368 978249 962441 945333 927992
59176 927992 910606 893650 878652 867027 858829 853419 850779 851428 855579 863211 874636 890309 910338
59163 910338 934777 964071 998717 1038764 1084109 1134765 1190260 1249172 1309864 1371266 1432293
59152 1432293 1490847 1544064 1589381 1624856 1648899 1660525 1659943 1648509 1628275 1601897 1572448 1542497
59140 1542497 1513379 1485798 1460888 1440097 1424230 1413300 1407299 1406625 1411701 1422583 1438916 1459930
59128 1459930 1484440 1511116 1538754 1566291 1592836 1617937 1641456 1662828 1680696 1693549 1700549
59117 1700549 1701621 1697202 1688198 1675729 1660439 1642245 1620982 1596832 1569944 1540272 1508411 1476041
59105 1476041 1444887 1415566 1387984 1362383 1339242 1318466 1299473 1281907 1265608 1249980 1234083
59094 1234083 1217349 1199656 1180859 1160851 1140067 1119366 1099357 1080290 1062465 1046194 1031392
59083 1031392 1017795 1005634 995589 987953 982211 977477 973051 968564 964011 959697 955813 952066 948004
59070 948004 943644 939439 935636 931968 927913 922920 916493 908514 899616 890920 883266 876819 871412 867067
59056 867067 864137 863116 864312 867617 872566 878667 885643 893301 901197 908376 913369 914751 912032 905959
59042 905959 897632 887561 875971 863715 852032 841442 831646 822666 815261 810008 806763 805271 805497
59029 805497 807026 808993 811011 813325 815698 817145 817347 817309 817887 818577 818657 818527 818910 819567 820025 820873 822995
59012 822995 826062 829175 832701 838075 845822 854993 864635 874731 885596 897281 909660 922339 934549
58999 934549 945941 957396 970177 984423 999409 1015129 1032611 1052710 1075665 1101857 1131969
58988 1131969 1166278 1204853 1248667 1299512 1358494 1425534 1500551 1584100 1676294 1775776 1880077
58977 1880077 1986235 2090612 2188751 2276003 2348116 2401344 2432827 2441317 2427178 2391704 2336984
58966 2336984 2266442 2184610 2095905 2003895 1911637 1821893 1736734 1657460 1585039 1520060 1462214
58955 1462214 1410575 1364625 1324434 1289757 1259604 1232906 1209041 1187648 1168544 1151892 1137737
58944 1137737 1125334 1113641 1102545 1092879 1085206 1079425 1075634 1074352 1075595 1078609 1082848 1088456 1095538
58931 1095538 1103860 1113600 1125506 1139963 1156752 1176124 1199157 1226552 1258101 1293923 1335224 1383004
58919 1383004 1436757 1495317 1558224 1625221 1694769 1763871 1828837 1885344 1928332 1953302 1958346
58908 1958346 1944733 1915796 1875793 1829420 1781256 1734907 1692659 1655854 1625366 1601790 1585462
58897 1585462 1576413 1574294 1578524 1588644 1604341 1625177 1650570 1680096 1713481 1750244 1789709 1831376
58885 1831376 1874822 1919007 1961917 2000740 2031903 2051187 2054922 2041767 2013087 1971559 1920034
58874 1920034 1861811 1800883 1740910 1684059 1631127 1582390 1537966 1497812 1461883 1430107 1402015
58863 1402015 1376760 1353699 1332595 1313019 1294100 1275111 1255837 1236127 1215599 1194141 1172164
58852 1172164 1149989 1127487 1104656 1082070 1060314 1039386 1019019 999133 979586 959942 939996
58841 939996 920208 901209 883202 866198 850505 836570 824526 814150 805075 796981 789931 784652
58829 784652 781996 782094 784487 789088 796295 806098 817957 831798 848177 867026 887164 907678 928925
58816 928925 951430 974432 996257 1015480 1030950 1041215 1044840 1041220 1030679 1014277 993880 971663
58804 971663 948744 924831 899896 875528 853762 835099 818701 804105 791685 781607 773469 767076
58792 767076 762739 760661 760641 762494 766227 771756 778913 787747 798440 811047 825745 843151 863928
58779 863928 888017 914418 941207 965432 983545 992971 993337 985924 972261 953863 932849 911705
58767 911705 892051 874115 857514 842222 828683 817301 807910 799783 792420 786311 782384 780496 779184
58754 779184 777358 775499 774495 773994 772921 771206 769878 769565 769892 770430 771314 772779 774838 777694 781804
58739 781804 787283 793716 800760 808443 816727 825216 833631 842352 852303 864422 879271 896958 917443
58726 917443 941014 968411 1000485 1038041 1082169 1134221 1194898 1263285 1336830 1411827 1483621
58715 1483621 1546829 1596142 1627238 1637271 1625350 1593213 1545034 1485781 1419651 1350094 1280601
58704 1280601 1214474 1153830 1099352 1051026 1008768 972562 942513 918756 901097 888973 882095
58693 882095 880897 886023 897679 915764 940114 970043 1003899 1039449 1074148 1104406 1125293 1132356
58681 1132356 1124213 1102999 1072384 1035614 995196 953465 912887 875905 844503 819646 801171
58670 801171 788425 780997 778725 781288 787897 797018 806099 811985 812055 804990 790635 769869 744832 718397
58656 718397 692652 668135 644794 623032 603405 586048 571020 558541 548278 539171 530749 523963
58644 523963 519777 517538 515689 513600 511631 509900 508192 506935 507094 508985 511977 515345 518743 522028
58630 522028 525256 528688 532068 534218 534082 531951 528950 525675 522078 518276 514509 510542 506061 501449
58616 501449 497341 493734 490422 487919 486829 486547 485747 484064 482238 480674 478952 476804 474458 471952 469101
58601 469101 466252 464166 463046 462511 462557 463635 465788 468630 472210 476973 482797 488987 495311 502205 509867
58586 509867 517913 525990 533960 541555 548618 555549 562696 569507 575193 580025 584963 590266 595609 601400
58572 601400 608635 617497 627336 638032 650019 662852 675188 686440 697138 707337 716053 722764
58560 722764 728223 733146 737194 739898 741626 743011 744145 744753 744374 742021 736477 727273 714806 699572
58546 699572 682226 664286 647366 631482 615450 599270 584698 572932 563149 554081 545753 538757
58534 538757 532960 527903 523618 520059 516519 512438 508198 504403 501068 498149 496176 495536 495779 496295 497219
58519 497219 499049 501858 505431 509739 514820 520578 527030 534308 542288 550743 559880 569875 579758 587736
58505 587736 593033 596607 599811 603308 607601 613523 621603 631735 643923 658555 675611 694521 715092
58492 715092 737510 760958 783426 803516 821423 837448 850595 859467 863660 863449 858896 850108 837818
58479 837818 822970 806199 788154 769692 751359 733383 716461 701714 689455 678903 669521 661735
58467 661735 656045 652496 651502 654013 660193 668933 679183 690641 702543 712974 720186 723609 722953 717612
58453 717612 707857 695473 682187 668386 654148 640386 627960 616637 605971 596284 587952 580666
58441 580666 574303 569436 566029 562819 559125 556145 555196 555733 556456 557391 559331 561987 564278 566028 567943
58426 567943 570241 572512 574637 576668 578058 578072 576818 575146 573806 573320 574034 575621 577100 578068 579280
58411 579280 581397 584052 586841 590230 594601 599414 604330 610095 617189 624634 631407 638087 645708 653800
58397 653800 661038 667169 672827 677977 681980 684901 687452 689934 692305 694923 698147 701622 704950 708612
58383 708612 713247 718564 723965 729676 736242 743396 750409 757044 763296 768820 773495 777852 782084 785455
58369 785455 787616 789589 792470 796068 799793 803801 808097 811676 813937 815921 818772 822026 824880 828031
58355 828031 832502 837596 841826 845274 849339 854714 861211 868922 878001 887853 898026 909189 921727
58342 921727 934194 944855 954020 963134 972279 980416 987481 994355 1001199 1007678 1014445 1022617 1032033 1041546
58328 1041546 1050737 1059921 1069113 1078580 1089825 1104334 1121740 1140701 1160920 1182776 1205779 1229154
58316 1229154 1253298 1278914 1305374 1331656 1358129 1385634 1413611 1440981 1468054 1495576 1522632
58305 1522632 1547483 1569663 1589294 1605327 1616794 1625025 1632340 1639193 1644898 1650297 1657196 1665809 1675290
58292 1675290 1686246 1700163 1716812 1734772 1754118 1776078 1800367 1825345 1850483 1876275 1902188
58281 1902188 1927204 1951992 1978125 2005565 2033325 2061985 2093025 2126304 2160804 2197246 2237269
58270 2237269 2280692 2326240 2374231 2425757 2480031 2535390 2591977 2650431 2709052 2765655 2821164
58259 2821164 2877949 2935721 2992778 3050142 3110323 3172963 3236062 3300734 3370242 3444976 3523060
58248 3523060 3605378 3695124 3792568 3895169 4002770 4117838 4240671 4369403 4504706 4649422
58238 4649422 4803598 4965213 5135722 5319294 5516462 5724342 5943301 6177397 6427986
58229 6427986 6693398 6975554 7280268 7610093 7963567 8342542 8753449 9200230 9682927
58220 9682927 10204228 10769913 11381842 12038835 12746637 13519388 14370057 15308477 16351094
58211 16351094 17523662 18852098 20360406 22080392 24053448 26320987 28927274 31939678
58203 31939678 35458274 39604907 44521794 50391498 57433098 65830625 75627013 86682906
58195 86682906 98781393 111857407 126205413 142493086 161566204 184218487 211022152
58188 211022152 242012355 276013753 309966388 339117108 358504131 364972969 358324147
58181 358324147 340901675 316207513 287628443 257827207 228652476 201249747 176229532
58174 176229532 153845910 134127729 116947810 102078569 89256843 78225906 68742679
58167 68742679 60582667 53555778 47507874 42302472 37811719 33926268 30559095 27633900
58159 27633900 25079621 22838780 20869641 19135308 17598602 16229343 15006618 13910273
58151 13910273 12918281 12015081 11194155 10449188 9769893 9148850 8584512 8073916 7608903
58142 7608903 7182374 6792013 6435036 6105474 5799568 5518158 5260742 5022433 4799475
58133 4799475 4592562 4401891 4223858 4055588 3898177 3752472 3615781 3485580 3362641
58124 3362641 3247748 3138728 3033385 2932185 2835723 2742549 2651711 2564670 2482736 2405145
58114 2405145 2331231 2261713 2196437 2133699 2073255 2017125 1965975 1917614 1870443 1825466 1783469
58103 1783469 1743255 1704314 1668367 1636448 1607013 1578551 1551527 1526166 1500856 1474462 1447933
58092 1447933 1422164 1396609 1371444 1348591 1328987 1310991 1292986 1275304 1258241 1240544 1221557
58081 1221557 1202678 1185067 1168014 1151034 1135345 1121612 1108299 1093999 1079417 1065352 1050788
58070 1050788 1034799 1018505 1003141 987815 971159 953719 936816 920236 902954 885167 867941
58059 867941 851522 835303 818668 800940 781539 761173 741813 724536 708510 692775 677611
58048 677611 663324 649246 635058 621727 610062 599640 590045 581714 574598 567554 560195 553867 549632
58035 549632 546656 543694 540655 537558 533529 528235 522959 518850 515273 511171 506815 502987 499617 496443
58021 496443 493745 491323 488105 484064 481090 480541 481274 481585 481825 483483 486831 491091 496008 501679 507713
58006 507713 514050 521810 531938 543826 556549 570492 586352 603523 620955 638754 657433 676445
57994 676445 694966 713406 732726 753092 774678 798951 827544 860572 897608 939642 988431
57983 988431 1044624 1108215 1180256 1262254 1354120 1454322 1561703 1675316 1792411 1907938
57973 1907938 2015855 2109601 2181784 2225595 2237408 2217409 2168111 2093574 1999716 1893457 1780750
57962 1780750 1665955 1552794 1444570 1343330 1249891 1164818 1088462 1020167 958623 903231
57952 903231 854297 811883 775357 744010 717269 694357 674637 658200 645254 635072 626459 619095
57940 619095 613350 608861 604498 599910 596046 593851 593223 593469 594030 594511 594684 594766 595304 596730 599391 603862
57924 603862 610761 620458 633537 651229 674692 704075 738954 779373 825577 876858 931414 987169
57912 987169 1041822 1092127 1134073 1164151 1180172 1181240 1167799 1141731 1105669 1062018 1012886 960585
57900 960585 907402 854952 804296 756515 712540 672680 636949 605594 578637 555205 534201
57889 534201 515431 499229 485194 472266 459991 448783 438834 429655 420817 412380 404438 396867 389784
57876 389784 383693 379007 375750 373665 372280 371022 369722 368796 368576 368801 369240 370275 372201 374467 376431
57861 376431 378377 380779 382994 383853 383363 382623 382080 381015 378820 375688 371858 367300 362520 358716 356611
57846 356611 355768 355381 355168 355282 355976 357513 359863 362389 364411 366144 368456 371633 375086 378332 381530
57831 381530 384943 388494 392039 395468 398492 400843 402623 403782 403387 400359 395026 389146 384196 380413
57817 380413 377560 375698 374900 375019 376185 378953 383678 390349 399246 411121 426478 445202 467116 492410
57803 492410 521507 555153 594611 640824 693053 748928 805926 861972 914387 959208 992225
57792 992225 1010442 1012665 999675 974202 939920 899869 856096 810658 765872 723177 682716 644551
57780 644551 609410 577677 548499 520763 494391 469982 447733 427448 409185 393084 378835
57769 378835 365933 354322 344244 335725 328626 322920 318423 314535 310813 307625 305695 305087 305061 304944
57755 304944 304761 305003 305980 307459 308868 309874 310704 311696 312640 312986 312631 312067 311644 311201 310617 310223 310394 311164
57737 311164 312484 314440 316876 319234 321252 323649 327668 333959 342039 350837 359617 368390 377337 385802
57723 385802 392172 395062 394389 390997 385546 378355 369951 360910 351250 340815 330325 321238 314356 309220
57709 309220 304962 301055 297178 293228 289682 287179 285500 283734 281613 279698 277995 275510 271787 267855
57695 267855 264863 262554 259951 256920 254178 252141 250522 248798 246555 243764 241199 240082 240805 242580
57681 242580 244899 248578 254651 262898 272552 284005 298762 317944 341835 370891 406243 449021
57669 449021 499566 556776 616865 672477 714302 735065 732755 710670 674916 631698 585779 540253
57657 540253 497077 457633 422847 392981 367587 345771 326676 309921 295508 283136 271835
57646 271835 260782 250354 241735 235335 230257 225528 221094 217272 213925 210781 208038 206055 204766 203836
57632 203836 202998 201847 199825 196900 193881 191572 189992 188753 187700 186690 185287 183304 181204 179431
57618 179431 177793 176000 174303 173014 171940 170974 170655 171381 172583 173506 174322 175553 176871 177578 177943 178931
57602 178931 180627 182007 182405 182272 182328 182752 183392 184099 184642 184826 184794 184767 184583 184035 183442 183193 182822 181305 178287
57583 178287 174342 170069 165663 161390 157721 154872 152796 151681 151837 153023 154477 155678 156503 156713 156015
57568 156015 154598 152934 151032 148641 146150 144422 143643 143147 142518 141997 141653 141047 140118 139539 139822 140830
57552 140830 142588 145734 150476 155768 160290 163919 167621 172105 177105 181851 185812 188915 191203 192317
57538 192317 191560 188801 185070 181718 178995 176138 172755 169341 166322 163530 160982 159282 158667 158399 157759
57523 157759 157079 157085 157694 158205 158370 158576 159100 159858 160790 161990 163401 164774 165957 166998 167982 168985 170052
57506 170052 171088 171904 172571 173478 174842 176335 177406 177773 177474 176682 175682 174764 173905 172739 171028 168973
57490 168973 166865 164726 162514 160504 159147 158636 158678 158610 157798 156213 154644 153993 154271 154597 154297 153564 152919
57473 152919 152418 151701 150517 148921 147100 145173 143057 140629 138233 136766 136699 137162 136754 135324 134149 134147
57457 134147 134763 135040 134966 135159 135907 137197 139150 141608 143775 145031 145873 147331 149735 152729 156150 160032
57441 160032 163835 166640 168298 169694 171600 173820 175651 176759 177335 177735 178174 178504 178213 176905 174907
57426 174907 173102 172088 171685 171313 170602 169576 168525 167787 167471 167292 166897 166459 166719 168283 170918 173624
57410 173624 175380 175786 175136 174029 172993 172390 172415 172921 173394 173401 173154 173347 174384 175997 177716 179370 180945
57393 180945 182270 183134 183593 183912 184280 184686 184990 185067 185024 185262 186077 187202 188149 188999 190341 192324 194327 195851
57375 195851 197164 198685 200326 202041 204447 208090 212369 216050 218842 221686 225381 229533 233089 235447
57361 235447 236828 237969 239616 241968 244378 245867 246127 245890 246168 247281 248674 249565 249663 249340 249181 249447
57345 249447 250054 250961 252204 253478 254153 254062 253906 254384 255186 255447 255091 255049 256050 257748 259342 260582 261815
57328 261815 263282 264849 266427 268321 270881 273905 276664 278742 280686 283362 286731 289818 292135 294517
57314 294517 297989 302285 306231 309356 312273 315493 318786 321951 325397 329423 333520 337008 340032 343263
57300 343263 346828 350187 353111 356174 359986 364378 368722 372882 377401 382695 388433 393959 399128 404384
57286 404384 410023 415673 420661 424725 428274 432053 436675 442289 448494 454640 460336 465636 470753 475812
57272 475812 480999 486667 493017 499789 506561 513282 520272 527733 535451 543008 550092 556585 562564 568263
57258 568263 573978 579988 586567 593939 602080 610690 619447 628186 636776 645053 653039 661089 669627 678878
57244 678878 689040 700392 712882 725771 738123 749705 761035 772561 784129 795394 806389
57233 806389 817504 829106 841403 854440 867904 881070 893326 904953 917068 930571 945257
57222 945257 960232 975072 990141 1005728 1021407 1036584 1051248 1065784 1080385 1095201 1110785
57211 1110785 1127610 1145212 1162493 1178949 1194962 1210850 1226447 1241849 1257728 1274427 1291471
57200 1291471 1308452 1325776 1343898 1362442 1380756 1398927 1417559 1436943 1457115 1478359 1500876
57189 1500876 1524239 1547874 1571870 1596558 1621590 1646317 1670981 1696585 1723495 1750959 1778156
57178 1778156 1805012 1831809 1858747 1886107 1914198 1942811 1971210 1998954 2026287 2053625 2081151
57167 2081151 2109003 2137236 2165384 2192738 2219363 2246228 2273945 2301975 2329609 2357101 2385195
57156 2385195 2413942 2442841 2471875 2501548 2531878 2562148 2592004 2622193 2653774 2686977 2721258
57145 2721258 2756260 2792191 2829242 2867073 2905069 2942926 2980856 3019367 3058934 3099704 3141395
57134 3141395 3183648 3226537 3270502 3315639 3361521 3408096 3456262 3506804 3558881 3610409 3660216
57123 3660216 3709256 3759580 3812798 3869877 3931705 3999132 4072754 4153220 4241772 4340281 4451042
57112 4451042 4576763 4720516 4885437 5074740 5292328 5543294 5833929 6171786 6566069
57103 6566069 7027988 7571205 8213009 8975592 9885999 10975000 12276489 13827093 15663992
57094 15663992 17821199 20327220 23205077 26472466 30140593 34212271 38678403 43510909
57086 43510909 48653941 54016499 59462972 64796865 69749791 74003410 77254635 79292830
57078 79292830 80041291 79546564 77939943 75400769 72128608 68319471 64148238 59763031
57070 59763031 55288317 50828169 46467229 42272265 38294400 34569723 31119466 27952699
57062 27952699 25070426 22467757 20134295 18055222 16212884 14587053 13155045 11893956
57054 11893956 10783593 9806788 8947462 8189841 7519634 6924804 6394916 5920689 5494490
57045 5494490 5110690 4765334 4455898 4181079 3939645 3728475 3541375 3369751 3204918
57036 3204918 3040997 2876700 2714528 2557993 2409491 2270303 2141266 2022597 1913629
57027 1913629 1813463 1721552 1637266 1559468 1487196 1420253 1358569 1301456 1248084 1198137 1151409
57016 1151409 1107372 1065837 1027364 992187 959303 927505 896775 867688 840059 813289 787681
57005 787681 764147 742765 722708 703537 685522 668723 652831 638007 624896 613663 603833 595159
56993 595159 587864 581926 577012 573265 571372 571648 573824 577957 584718 594323 605577 616124 623291 624840
56979 624840 619820 609117 594796 578670 561801 545137 529756 516169 504037 492961 483110 474815
56967 474815 468035 462603 458711 456752 456894 459124 463733 471599 483820 500736 520963 541404 558467
56954 558467 569478 573240 569899 560649 547205 531079 513434 495670 479524 466088 455123 445849
56942 445849 438039 431903 427502 425108 425804 430799 440272 453602 470638 491953 517697 546566 575639
56929 575639 600760 617615 623607 619007 605990 586862 563682 538810 514423 491411 469712 449662
56917 449662 432086 417103 403982 392339 382423 374014 366091 357999 350062 342635 335411 328078 320859
56904 320859 313891 306848 299718 293312 288436 285099 283001 282280 283249 285827 289758 295040 301760 309897 319700
56889 319700 331985 347556 366437 387676 409466 429222 444151 452421 453858 449475 440640 428814
56877 428814 415586 402391 390165 379313 369892 361822 355250 350754 349019 350384 355053 363574 376616
56864 376616 394351 416609 443578 475627 512061 550336 586462 615931 634694 640502 633971 618075
56852 618075 596361 571767 546647 522878 501545 483108 468167 457633 452050 451349 455468 464725
56840 464725 479493 500098 527174 561603 604047 654947 714320 779999 845531 901146 938073
56829 938073 952221 944248 917612 877248 828803 777326 726218 677525 632788 593217 559529 532127
56817 532127 511168 496327 487159 484017 487989 499533 518052 543336 576458 617981 665427 713134
56805 713134 754407 783584 797034 793809 775852 747105 712098 675021 639125 606086 576063 548944
56793 548944 525297 505709 489742 476497 466069 459654 458150 461314 468501 479682 495429 516098
56781 516098 540991 567890 593131 612399 622090 620604 608868 589667 566104 540440 514259 489164
56769 489164 466569 446735 428721 411639 395561 381067 368444 357599 348256 339900 332021 324621
56757 324621 318057 312154 306046 299200 292025 285106 278441 271800 265188 258494 251319 243752 236775 231195
56743 231195 226610 222037 217215 212610 208537 204942 201850 199398 197531 196078 194907 193723 192142 190421
56729 190421 189536 189963 190811 190893 190207 189610 189441 189382 189477 190241 191590 192545 192333 191324 190572 190766 191762 192974 194068
56710 194068 195350 197319 199823 201972 203119 203550 203931 204510 205210 206048 206958 207572 207761 208154 209567 212156
56694 212156 215496 219260 223348 227672 232308 237584 243621 250171 257414 266430 278164 292225 307438
56681 307438 323266 339896 357162 374249 390478 405535 418896 429769 437889 443832 448342 451764
56669 451764 454254 456178 458105 460575 463807 467475 470969 474118 477400 481163 485050 488568 491795 494953
56655 494953 497669 499350 500025 500157 499827 498798 497197 495385 493233 490191 485997 480753 474418 466896 458545
56640 458545 449908 440967 431418 421685 412931 405940 400487 395876 391455 386661 381239 375599 370374 365562
56626 365562 360686 355846 351921 349538 348558 348804 350616 354227 359143 364595 370191 375661 380262 383016 383557
56611 383557 382426 380491 378228 375621 372625 369564 366889 364609 362193 359125 355332 350971 346166 341104
56597 341104 336070 331173 326373 321998 318780 317049 316376 316348 317185 319143 321923 325336 329934 336129 343073
56582 343073 349332 354375 358577 362085 364792 367278 370617 374996 379451 383176 386282 389094 391603 393968
56568 393968 396795 400441 404611 408975 413646 418681 423548 427496 430103 431288 431168 430159 428843 427491
56554 427491 425982 424294 422636 420965 418841 416106 413345 411237 409629 407613 404498 400474 396148 391558
56540 391558 385930 378587 369901 360869 351839 342235 331690 320773 310218 300048 289981 280154 270894
56527 270894 262237 254293 247598 242384 237906 233236 228342 223718 219384 215099 211160 207973 205136 201957
56513 201957 198743 196531 195579 195113 194482 193595 192253 190158 187810 186368 186265 186699 186723 186096 184932 183356
56497 183356 181815 181041 181378 182586 184299 186122 187429 187900 188233 189456 191512 193395 194669 195730 196416
56482 196416 195616 192874 189466 187153 186473 186779 187337 187804 188070 188181 188295 188485 188759 189200 189734 189926 189533 189113
56464 189113 189463 190591 191895 193119 194306 195088 195075 194827 195298 196287 196649 196169 195986 196856 198218 199369 200365
56447 200365 201243 201502 201090 200908 201619 202766 203665 204341 204958 205156 204680 203991 203644 203714 204355 206149 209263 212841
56429 212841 215788 217545 217766 216182 213470 211392 211107 211867 212050 211006 209261 207537 206368 206171 206862 207580
56413 207580 207445 206454 205309 204674 204871 205794 206712 206668 205493 204076 203322 203327 203754 204391 205035 205446 205820 206652 207821
56394 207821 208520 208415 208160 208364 208864 209475 210563 212252 213825 214657 215135 216026 217509 219385 221605 223937
56378 223937 225763 226852 227808 229103 230217 230340 229425 228034 226690 225912 226215 227395 228374 228415 227961 227726 227609
56361 227609 227204 226773 226920 227732 228895 230249 231571 232348 232433 232483 233117 234068 234814 235544 236767 238343 239663
56344 239663 240548 241281 241966 242474 242904 243661 245128 247481 250579 253914 257017 260037 263446 267148 270492 273238
56328 273238 275724 277980 279598 280739 282303 284626 286904 288340 289030 289330 289326 289396 290278 291974 293532 294500
56312 294500 295618 297493 299672 301728 304226 307719 311758 315772 320039 324934 330067 335041 340234 345963
56298 345963 351730 357100 362505 368335 374102 379379 384623 390185 395435 399789 403675 407590 411189 414346
56284 414346 418013 422896 428242 433142 438058 443825 450077 456080 462261 469543 477843 486562 495887 506333
56270 506333 517713 529890 543846 560656 580062 601355 625001 652064 682777 717069 755774
56259 755774 799819 848900 902431 961154 1026198 1097147 1172645 1252312 1336374 1423867 1512990
56248 1512990 1602886 1693361 1782974 1869043 1949343 2022323 2085874 2137610 2176459 2202684 2216473
56237 2216473 2217763 2207154 2185563 2153252 2110593 2059446 2002249 1940035 1872849 1801801 1729014
56226 1729014 1655714 1582072 1508896 1437857 1369893 1304825 1242566 1183272 1126407 1071212 1018196
56215 1018196 968781 923424 881472 842815 808138 777418 749561 723728 699934 678324 658998
56204 658998 642306 628133 615180 602284 590124 580164 572350 565458 559282 554531 550756 546448 541390
56191 541390 537014 534089 531785 529418 527450 526323 525757 525631 526229 527324 528296 529363 531427 534580 538090
56176 538090 541914 546775 552594 558264 563182 567724 572188 576619 581728 588485 596708 605362 614253 624055
56162 624055 634839 646192 658708 673662 691114 709995 730151 752720 778406 807067 839156
56151 839156 875916 918060 965936 1021113 1085926 1160996 1244628 1334638 1428830 1523324 1612383
56140 1612383 1691015 1757141 1811457 1856629 1896507 1934223 1970308 2003222 2031117 2051851 2062457
56129 2062457 2061197 2050204 2034158 2016301 1997203 1976396 1952407 1921377 1878687 1822738 1755421
56118 1755421 1679195 1596316 1510833 1428104 1351389 1281126 1217869 1163271 1117534 1078595 1044900
56107 1044900 1016674 993770 974687 958604 946105 936981 929615 923448 919807 919328 920678 922684 925623
56094 925623 929567 933571 937380 941937 947506 953348 959787 968278 978773 989317 998958 1008760 1019310
56081 1019310 1029739 1040006 1051643 1065242 1079533 1093711 1108367 1123434 1137737 1151291 1165541
56070 1165541 1180655 1195107 1208433 1221649 1234480 1245324 1254615 1265002 1277427 1290331 1303538
56059 1303538 1319124 1337226 1354821 1370395 1386301 1404686 1424501 1444399 1465149 1487120 1508648
56048 1508648 1529117 1550642 1574615 1599462 1623802 1648797 1675429 1702455 1729115 1756828 1786268
56037 1786268 1815749 1844465 1874281 1906422 1939500 1972655 2007471 2044938 2083822 2123793 2166629
56026 2166629 2212529 2258980 2305187 2353771 2406110 2460144 2514886 2572769 2635177 2700068 2766529
56015 2766529 2837108 2912908 2991054 3070010 3152689 3241156 3333025 3426398 3523582 3626408 3732870
56004 3732870 3842146 3957947 4082858 4214176 4349375 4490864 4641343 4799596 4965030
55995 4965030 5141075 5329669 5527763 5733797 5952089 6186215 6433900 6693495 6969505
55986 6969505 7266560 7584118 7922412 8287105 8682399 9106413 9559386 10049464 10584346
55977 10584346 11164922 11793853 12482303 13241084 14073764 14986432 15995706 17119533 18370252
55968 18370252 19765826 21338172 23122093 25148871 27462680 30132987 33242654 36881741
55960 36881741 41169145 46266424 52354878 59612337 68224003 78397417 90361530 104396414
55952 104396414 120903425 140424437 163561336 190865427 222658689 258529847 296483529
55945 296483529 332430623 360939634 377235370 379165770 367755625 346199691 318317555
55938 318317555 287475399 256191622 226135136 198273363 173079731 150718745 131148450
55931 131148450 114178085 99539694 86954687 76155513 66885942 58918307 52069490
55924 52069490 46186477 41125043 36754567 32971519 29691849 26836582 24336325 22141127
55916 22141127 20212375 18509924 16996654 15648365 14447863 13373943 12405082 11528611
55908 11528611 10737080 10019778 9365569 8769480 8228759 7736337 7284757 6872186 6497930
55899 6497930 6156217 5840638 5550273 5285072 5039303 4805950 4583918 4375006 4177492
55890 4177492 3988706 3810304 3644889 3490311 3342983 3203967 3076349 2959208 2849322
55881 2849322 2746225 2650535 2559736 2470688 2384292 2303254 2227393 2155406 2088855 2029984 1977485
55870 1977485 1928334 1881642 1836858 1790668 1739946 1685963 1631924 1578444 1525041 1473604 1426292
55859 1426292 1381977 1338623 1297166 1259213 1223024 1185916 1148900 1114883 1083798 1053395 1023413
55848 1023413 995088 967795 939957 912325 886927 863676 841167 819640 800039 781319 761891
55837 761891 742621 725402 709931 694898 681071 670053 661124 652403 644061 637391 631847 626114 620968
55824 620968 617911 615909 612629 608048 603695 599206 592947 585602 579931 577129 576159 576303 577616 579122 579243
55809 579243 577970 576353 574181 570427 565479 560587 555535 549224 542143 535947 530866 525700 520056 514517
55795 514517 509073 503516 498977 496881 496631 496126 494202 490899 486201 480526 475836 474251 476179 481629 492369
55780 492369 510544 535844 565971 598612 630337 654676 664875 659199 641661 617889 592320 568612
55768 568612 549599 536079 527502 524020 526365 534180 546517 563668 586482 614050 643943 674338
55756 674338 703940 730323 750528 763082 767550 762788 748083 725600 699032 669828 637144 601380
55744 601380 565100 530179 496540 464232 434429 407714 383400 361190 341730 325047 310190
55733 310190 296773 285204 275178 265771 257278 250959 246604 242249 236863 231427 226811 222455 217901
55720 217901 213963 211424 209933 208919 208344 207885 206561 203848 200270 196449 192559 188902 185943 183608 181565
55705 181565 180230 180287 181216 181597 180920 179816 178557 176786 174789 173452 172757 171835 170729 170568 171664 172969
55689 172969 173857 174995 176921 179145 181240 183577 186347 188985 191180 193536 196692 200542 204597 208380
55675 208380 211371 213363 214917 216652 218342 219593 221001 223359 226138 228278 230190 233306 237659 241625
55661 241625 244095 245197 244802 242257 238040 233891 230662 227663 224664 222925 223437 225618 228583 232478 237802
55646 237802 244549 252732 262705 274433 287445 302008 319303 340074 364234 392049 424332 460874
55634 460874 499863 539249 577499 612660 642287 665017 681058 690570 692959 688427 678945 666860
55622 666860 653723 641052 630789 624037 620426 619602 622221 628642 637665 647378 656207 662366 663504 657955
55608 657955 645605 626795 601469 570245 535196 498502 461157 423949 388634 356861 328593
55597 328593 302780 279062 257812 238989 221965 206210 191392 177255 164052 152600 143221 135137
55585 135137 127609 121072 116323 113054 110105 106913 103976 101986 101105 100987 101101 101059 100754 100024 98303 95190
55569 95190 91376 88259 86522 85729 85361 85316 85265 84576 83315 82408 82367 82698 82893 83132 83583 84004 84428 85257 86235
55550 86235 86463 86018 86413 88652 91899 94895 97673 100868 104213 106825 108423 109281 109483 109018 108164 107147
55534 107147 105897 104638 103926 103585 102531 100364 98202 97047 96317 95024 93530 92818 92670 91972 90539 89396
55518 89396 89303 90006 90925 91823 92809 94246 96516 99485 102618 105966 110409 116375 123099 129844 137085 145600
55502 145600 155198 165494 177313 191988 209618 229254 250569 274069 299689 326443 353598 381164
55490 381164 408864 435431 459207 478704 492331 498311 495501 484225 466143 443381 417611 389689
55478 389689 360106 329780 300120 272176 246181 222128 200272 180774 163455 148382 136135
55467 136135 126858 119524 112698 105697 98559 91490 84920 79545 75522 72034 68373 64933 62417 60571
55453 60571 58617 56480 54623 52942 50897 48610 46890 46090 45759 45444 45086 44633 43971 43305 42905 42519 41703
55436 41703 40775 40631 41476 42378 42343 41331 39974 38749 37726 36829 36079 35601 35488 35630 35809 36007 36330 36573
55418 36573 36270 35376 34510 34209 34370 34639 34880 34924 34478 33710 33305 33458 33445 32832 32356 32733 33196 32322 29962
55399 29962 27289 25143 23394 21899 21013 20950 21448 22293 23476 24680 25239 24861 23935 23021 22432 22306 22559
55382 22559 22752 22452 21770 21201 21001 21151 21691 22621 23576 24194 24679 25477 26550 27488 28160 28641 28675 27992 27093
55363 27093 26902 27518 28029 27762 27057 26588 26443 26256 25857 25476 25473 25947 26482 26339 25178 23521 22247 21788 22081
55344 22081 22988 24285 25458 26101 26434 26935 27535 27725 27381 26936 26772 26914 27328 27979 28634 29021 29202 29372
55326 29372 29438 29298 29323 29917 30639 30467 29060 27185 25757 25004 24675 24578 24651 24870 25283 25894 26495 26894 27239
55307 27239 27749 28202 28140 27561 26949 26597 26286 25616 24307 22286 19978 18407 18391 19564 20717 21235 21690 22880
55289 22880 24790 26722 28001 28281 27547 26217 25022 24486 24492 24528 24292 23989 24040 24602 25474 26476 27642 28793
55271 28793 29258 28604 27570 27448 28346 28884 27990 26200 24596 23314 21981 20996 21257 22848 24919 26696
55255 26696 27884 28310 28040 27695 27805 27991 27562 26742 26381 26569 26551 26079 25807 26089 26352 26020 25335 24821 24554
55236 24554 24313 23971 23477 22851 22435 22738 23862 25397 26877 27946 28219 27571 26534 25818 25467 25096 24780
55219 24780 24939 25381 25380 24894 24797 25597 26709 27369 27551 27553 27314 26714 26100 25985 26441 27084 27498 27496 27244 27177 27512
55198 27512 27897 27855 27464 27147 26954 26714 26778 27736 29317 30360 30148 29099 27955 27000 26349 26219 26458 26405 25704
55179 25704 24866 24676 25414 26910 28864 30815 32236 32985 33437 33958 34558 35112 35536 35699 35565 35382 35261 34681
55161 34681 33061 30785 28938 27982 27461 27026 26870 26994 26950 26631 26442 26414 26020 25251 24961 25652 26744 27544
55143 27544 28116 28669 28946 28849 28859 29146 29008 28001 26928 26863 27738 28757 29668 30724 31828 32628 33160 33548
55125 33548 33325 31948 29842 28131 27376 27240 27320 27614 28175 28951 30039 31529 33076 34068 34312 34136 33812
55108 33812 33247 32315 31175 30214 29861 30404 31801 33692 35667 37392 38495 38725 38367 38149 38469 39043 39486
55091 39486 39790 39954 39587 38404 36820 35646 35350 35899 37067 38528 39876 40860 41519 41942 42125 42152 42148 41982
55073 41982 41433 40768 40606 41017 41369 41306 41248 41511 41627 41032 39905 38769 37804 37067 36933 37713 39161 40779
55055 40779 42189 42920 42518 41404 40937 41903 43489 44382 44278 43565 42279 40414 38767 38250 38573 38652 38180
55038 38180 37832 38028 38507 39136 40138 41375 42232 42433 42272 41935 41260 40248 39175 38144 37158 36663 37258
55021 37258 38761 40228 41079 41586 42123 42646 43082 43558 43955 43789 42939 42018 41686 41952 42372 42644 42738 42667 42327
55002 42327 41451 39808 37689 36041 35690 36452 37458 38274 39227 40575 41923 42642 42501 41759 40948 40629 41007
54985 41007 41750 42424 43030 43759 44396 44518 44247 44257 44925 45915 46646 46731 45950 44391 42747 41948 42202 42762 42843
54966 42843 42476 42269 42643 43463 44211 44406 44073 43788 44061 44758 45419 46023 47013 48545 50124 51051 50974 50106 49205
54947 49205 49230 50514 52299 53550 54173 55057 56946 59761 62994 66281 69599 73351 78241 84598 91846
54932 91846 99044 105757 111808 116435 118602 118191 116062 112772 108105 102093 95632 89629 84248 79471 75691
54917 75691 73098 71014 68492 65308 61876 58541 55465 52963 51385 50713 50610 50831 51367 52335 53832 55733
54901 55733 57585 59042 60424 62437 65240 68303 71322 74677 78690 83062 87477 92161 97313 102479
54887 102479 107107 111232 114889 117222 117120 114683 111204 107593 103530 98459 92814 87745 83894 80847
54873 80847 77719 74017 69954 66160 63210 61323 60289 59587 58685 57393 55903 54380 52689 50755 49013
54858 49013 48056 47842 47743 47466 47419 47873 48253 47712 46161 44343 43011 42363 42184 42175 42138 42051 41980 41920 41815 41758 41925
54837 41925 42261 42493 42559 42755 43322 44162 45074 45897 46267 45715 44333 42960 42290 42099 41731 41013 40236 39549 38932
54818 38932 38584 38696 38895 38528 37621 37075 37687 39335 41253 42812 43852 44476 44744 44580 44009 43494 43832 45356
54800 45356 47391 48872 49493 49896 50749 52090 53679 55532 57742 60045 61925 63093 63780 64627 66386 69484
54784 69484 73705 78426 83262 88322 93698 99013 103777 107956 111788 115105 117255 117766 116771 114622 111406
54769 111406 107075 101882 96478 91575 87567 84284 81085 77405 73388 69743 66814 64139 61279 58761
54755 58761 57596 57935 58824 59370 59570 59808 60156 60623 61567 63320 65635 68013 70414 73178 76353 79565
54739 79565 82625 85819 89573 94081 99283 104900 110418 115213 118643 119979 118586 114605 109254 103937
54725 103937 99099 94357 89606 85307 81608 77964 74023 70367 67838 66357 64888 62531 59395 56484
54711 56484 54890 55017 56347 57898 58949 59331 59214 58880 58681 58838 59101 58842 57668 55808 53826 52131
54695 52131 50874 50051 49477 48803 47793 46598 45576 44904 44487 44316 44790 46427 49103 51794 53465 54264
54679 54264 55382 57530 60026 61724 62418 62759 63157 63486 63738 64120 64372 63712 61846 59556 57970 57500 57645
54662 57645 57532 56524 54671 52739 51550 51231 51332 51552 51896 52195 52055 51451 50816 50413 50084 49788 49849 50475
54644 50475 51487 52702 54086 55337 55969 56049 56270 56931 57455 57267 56601 55998 55586 55332 55430 55840 55944 55369
54626 55369 54730 54875 55692 56358 56530 56581 56803 57040 57097 56919 56436 55760 55504 56290 57821 58919 58644 57091 55069
54607 55069 53358 52278 51709 51396 51337 51748 52519 52995 52642 51770 51216 51452 52335 53575 55008 56465 57746
54590 57746 58777 59542 59911 59801 59428 59148 59066 58971 58606 57912 57176 56953 57491 58168 58009 56939 55934 55641 55550
54571 55550 55040 54491 54502 54616 53971 52913 52803 54198 56241 57987 59315 60253 60412 59717 59043 59445 61010
54554 61010 62862 64086 64421 64305 64430 65037 65571 65265 64042 62508 61136 59993 59215 59063 59301 59131 58126
54537 58126 56851 56221 56550 57417 58127 58132 57357 56332 55751 55795 56201 56887 57954 59006 59216 58379 57304 56751
54519 56751 56546 56161 55592 55161 54947 55000 55673 57055 58415 58923 58746 58737 59211 59766 60197 60759 61422 61703 61540
54500 61540 61673 62687 64182 65345 65977 66485 67156 67977 69029 70488 72208 73746 74912 75985 77244 78654
54484 78654 80161 81999 84403 87227 90166 93168 96274 99167 101360 102906 104459 106421 108356 109486
54470 109486 109487 108490 106638 104101 101331 98799 96457 93934 91334 89338 88329 87785 86920 85643 84498 83803
54454 83803 83279 82610 81922 81453 80998 80070 78587 77026 75800 74826 73938 73418 73689 74589 75452 75941 76390 77134
54436 77134 77918 78220 77859 77007 75829 74448 73077 71959 71250 71151 71872 73240 74573 75290 75491 75633 75830
54419 75830 75839 75627 75499 75647 75884 75901 75666 75548 76083 77434 79044 80105 80513 80952 81829 82581 82450 81486 80283
54400 80283 79149 78147 77572 77619 77796 77488 76992 77168 78029 78548 78014 76803 75621 74713 74136 74116 74647 75286
54382 75286 75715 76105 76612 77016 77178 77410 77969 78638 79229 80117 81784 84084 86377 88218 89612 90776 91977
54365 91977 93385 94797 95657 95598 94793 93615 92232 90711 89202 87731 86092 84274 82694 81681 80983 80160
54349 80160 79269 78693 78384 77783 76555 75116 74207 74140 74607 75196 75891 76904 78075 78783 78665 78182 78109 78564
54331 78564 78960 78825 78219 77360 76379 75531 75149 75206 75298 75162 74811 74150 73001 71662 70867 70950 71497 71992 72232
54312 72232 71914 70557 68257 65937 64374 63471 62863 62608 62740 62792 62499 62488 63475 65088 66249 66510 66316 66194
54294 66194 66342 66877 67714 68344 68375 68221 68578 69366 69927 70145 70492 70902 70594 69350 68163 68048 68808 69512 69777
54275 69777 70014 70670 71817 73398 75342 77304 78629 78882 78403 78154 78858 80276 81473 81813 81516 81148 80888
54258 80888 80544 80064 79641 79324 78896 78205 77407 76873 76969 77831 79172 80368 80922 80826 80385 79820 79191 78511 77754
54239 77754 76891 76122 75866 76281 76965 77366 77269 76711 75694 74338 73000 71890 70818 69711 69085 69494 70699
54222 70699 71891 72614 72961 73033 72730 72107 71429 70838 70365 70185 70462 71004 71473 71861 72364 72885 73162 73278 73564
54203 73564 74118 74872 75955 77369 78490 78644 78178 78181 79109 80467 81994 84148 87034 89707 91240 91978 93034
54186 93034 94858 96832 98101 98337 97726 96527 94679 91846 88012 83955 80755 78825 77795 77276 77136
54171 77136 77015 76307 74966 73733 73201 73145 73107 73019 72818 72041 70439 68649 67561 67280 67184 66831 66232 65407 64255
54152 64255 62943 62000 61936 62856 64364 65735 66400 66414 66269 66188 65970 65639 65710 66482 67518 68215 68483 68491 68220 67724
54132 67724 67404 67444 67458 67252 67468 68661 70118 70642 70361 70757 72729 75521 77783 78962 79301 79163 78827 78417
54114 78417 77693 76255 74327 72891 72654 73226 73718 73918 74452 75874 77945 79831 80842 81035 81146 81848 83036
54097 83036 83975 84116 83525 82575 81664 81325 82073 83766 85453 86280 86384 86566 87328 88675 90667 93458 96660
54080 96660 99227 100433 100680 100910 101313 101081 99538 97098 94775 93023 91492 89872 88436 87559 87114 86735
54064 86735 86446 86598 87244 87978 88487 88983 89960 91697 94062 96645 98997 100861 102263 103384 104459 105877
54048 105877 108150 111493 115508 119583 123582 127789 132207 136377 140006 143353 146737 150038 153009 155818
54034 155818 158857 162084 164903 166755 167683 168266 169113 170308 171302 171428 170564 169107 167279 164839 161736 158655
54018 158655 156394 154839 153034 150292 146851 143360 140132 137053 133888 130481 126864 123378 120436 118032
54004 118032 115674 112996 110256 108044 106662 105956 105525 104871 103605 101829 100222 99404 99239 99082 98621 98130
53988 98130 97922 98024 98450 99331 100432 100986 100419 99134 98132 97899 98023 97934 97632 97506 97700 97976 98073 97937 97532
53969 97532 96713 95455 94103 93213 93126 93808 95045 96564 97943 98724 98821 98663 98753 99292 100450 102627 105926
53952 105926 109543 112280 113771 114699 115776 117156 118964 121587 124938 128098 130417 132556 135752 140340
53938 140340 145691 151317 157173 162995 168187 172522 176266 179537 182268 184915 188324 192543 196555 199669
53924 199669 202480 205887 209809 213614 217327 221500 226162 230716 234845 238719 242241 244850 246375 247465
53910 247465 248714 249727 249529 247764 245099 242402 239883 237165 234000 230574 227102 223368 218924 213654
53896 213654 207912 202187 196786 191749 186803 181467 175604 169864 165145 161556 158342 154905 151407 148203
53882 148203 145286 142600 140314 138366 136323 134204 132822 132590 132472 131064 128424 125840 123896 121852 119171
53867 119171 116618 115296 115242 115567 115527 114945 113872 112340 110428 108388 106714 106018 106498 107511 108034 107700 107014
53850 107014 106555 106421 106553 106991 107469 107288 106046 104196 102536 101445 100914 100934 101424 102029 102461 102849 103383 103886
53832 103886 104127 104335 104897 105698 106274 106560 106989 107828 108860 109800 110682 111698 112871 113994 114782 115165 115637
53815 115637 117103 120105 124254 128716 133110 137512 141725 145197 147832 150375 153647 157671 161743 165172
53801 165172 167735 169669 171466 173516 175696 177352 177885 177323 176247 175223 174389 173504 172344 171044 170026
53786 170026 169485 169036 168031 166185 163627 160498 156899 153233 150071 147395 144471 140873 137261 134644 133072
53771 133072 131651 129798 127898 126577 125834 125157 124156 122795 121215 119636 118376 117696 117625 117985 118491 118771
53755 118771 118429 117323 115733 114161 112987 112311 111961 111542 110669 109369 108187 107684 107865 108271 108564 108792 109106
53738 109106 109481 109858 110293 110819 111267 111421 111362 111530 112393 113995 115821 117162 117733 117921 118284 118883 119352 119623
53720 119623 120262 121875 124400 127187 129638 131510 132770 133553 134325 135699 137871 140372 142557 144193 145477
53705 145477 146590 147478 148029 148260 148239 147981 147574 147389 148021 149885 152813 156061 158735 160341 161024 161353 161843
53688 161843 162669 163784 165173 166835 168505 169724 170353 170831 171620 172521 172925 172699 172396 172456 172651 172588 172382 172411
53670 172411 172698 172968 173204 173689 174525 175516 176508 177441 178044 177963 177373 177052 177565 178643 179691 180664 182050 184049
53652 184049 186144 187619 188269 188452 188544 188567 188393 188147 188156 188573 189338 190564 192569 195256 197782 199326 200019 200623
53634 200623 201381 201823 201713 201529 201738 202164 202485 202847 203510 204324 205128 206351 208507 211230 213501 214923 216105
53617 216105 217566 218886 219414 219473 220324 222915 226975 231404 235301 238516 241350 243955 246206 248045 249745
53602 249745 251712 254163 257082 260355 263810 267259 270628 273895 276796 278806 279713 280008 280409 281126 281903
53587 281903 282565 283035 282938 281838 280027 278525 277928 277667 276693 274582 271659 268472 265578 263615 262965 263278
53571 263278 263699 263627 263045 262136 260912 259306 257373 255340 253516 252182 251400 251000 250850 250992 251295 251231 250428
53554 250428 249431 249329 250475 251977 252745 252698 252584 252890 253355 253535 253452 253628 254635 256600 258979 260888 261925
53537 261925 262642 264017 266456 269557 272850 276399 280530 285220 290049 294674 299141 303790 308953 314770
53523 314770 321163 327952 334966 342069 349123 356100 363246 370953 379397 388442 397954 408025 418802 430308
53509 430308 442599 455879 470189 485155 500334 515724 531618 547975 564327 580407 596539
53498 596539 613200 630381 647592 664409 680832 697172 713663 730196 746466 762394 778310
53487 778310 794507 810734 826387 841244 855641 869832 883537 896412 908658 920834 933282
53476 933282 946089 959452 973559 987997 1001673 1013599 1023611 1032228 1040019 1047173 1053437 1058206
53464 1058206 1060763 1060696 1058169 1053726 1047873 1040860 1032766 1023628 1013558 1002945 992448 982478 972546 961477
53450 961477 948609 934656 921036 908324 895745 882277 867912 853532 839858 826867 814111
53439 814111 801249 788270 775547 763708 753295 744506 737386 732056 728437 725892 723657 721689 720668
53426 720668 721028 722427 724356 726831 730156 734299 738907 743727 748699 753826 759298 765633 773363 782618
53412 782618 793173 804758 817155 830254 844396 860409 878864 899277 920409 941385 962378
53401 962378 984339 1008360 1035142 1064594 1095891 1128202 1161370 1195649 1230944 1266795 1303099
53390 1303099 1340342 1378927 1418660 1459118 1500155 1541718 1583385 1624457 1664481 1703471 1741580
53379 1741580 1778694 1814403 1848324 1880378 1910688 1939252 1965935 1990803 2014119 2035764 2054948
53368 2054948 2070838 2083300 2092561 2098335 2099788 2096297 2087690 2073754 2054183 2029365 2000659 1969476
53356 1969476 1936371 1901353 1864775 1827454 1790057 1752728 1715356 1678096 1641606 1606750 1573872
53345 1573872 1542378 1511315 1480430 1450269 1421122 1392256 1362575 1331833 1300959 1271284 1243591
53334 1243591 1217760 1193140 1169361 1146782 1125996 1107012 1089376 1073034 1058481 1045901 1034772
53323 1034772 1024605 1015378 1006690 997105 985208 971087 956139 941575 927752 914783 902934 892187
53311 892187 882085 872331 863221 855277 848759 843721 840247 838370 837856 838204 838836 839413 840142 841752 845011
53296 845011 850220 857220 865654 875100 885213 896050 908049 921406 935773 950906 967219 985113
53284 985113 1003953 1022473 1040124 1057362 1074504 1091023 1106232 1120024 1132568 1143770 1153428 1161561
53272 1161561 1168128 1172687 1174746 1174378 1172220 1168862 1164388 1158440 1150629 1140944 1129737 1117164 1102768
53259 1102768 1085977 1066940 1046522 1025508 1004269 983178 962687 942734 922676 902207 881888
53248 881888 862393 843684 825429 807735 790824 774276 757323 739820 722271 704883 687255
53237 687255 669198 651329 634448 618648 603344 588062 572934 558464 544979 532386 520412
53226 520412 509017 498455 488938 480394 472654 465639 459217 453026 446686 440044 432961 425010 415799 405595
53212 405595 395247 385274 375316 364663 353168 341453 330286 319931 310116 300574 291554 283686 277213
53199 277213 271467 265394 258663 251961 246015 240595 234837 228431 222050 216491 211779 207323 202689 197831
53185 197831 192801 187675 182794 178593 175052 171706 168430 165862 164641 164464 164303 163440 161920 160134 158369
53170 158369 156805 155583 154714 154127 153766 153458 152800 151577 150207 149317 148871 148190 146944 145633 144971 145187 146031
53153 146031 146987 147241 146043 143519 140800 138972 138165 137936 138153 138979 140271 141448 141933 141514 140487 139622
53137 139622 139655 140538 141497 142104 142856 144337 146276 147999 149383 150715 151887 152471 152442 152166 151776 151139 150324
53120 150324 149453 148241 146479 144847 144366 144877 144982 143766 141819 140189 139112 138280 137660 137330 136939 136038
53104 136038 134770 133709 133107 132730 132276 131646 130879 130103 129481 129047 128768 128820 129447 130354 130711 130142 129344 129249 129853
53085 129853 130302 129951 128852 127389 125977 125099 125064 125633 126246 126680 127154 127749 128129 127990 127459 126869 126311 125620
53067 125620 124690 123687 123008 122999 123636 124520 125262 125812 126277 126557 126465 126111 125837 125718 125438 124837 124301 124390 125138 125974
53047 125974 126317 126120 125774 125572 125390 124951 124275 123655 123160 122454 121317 120203 119948 120883 122479 123932 124913
53030 124913 125674 126636 128019 129726 131369 132475 132852 132835 133030 133746 134698 135299 135203 134563 133818 133364 133417 133993
53012 133993 134884 135714 136246 136655 137360 138515 139787 140727 141238 141599 142128 142976 144129 145399 146392 146697 146234
52995 146234 145343 144429 143581 142683 141870 141705 142721 144804 147199 149174 150624 151910 153244 154393 155041 155288
52979 155288 155642 156460 157467 158023 157894 157550 157437 157212 156213 154680 153800 154179 154860 154509 153184 152160 152143 152510
52961 152510 152412 151825 151199 150756 150600 150975 151900 152872 153425 153693 153982 154052 153337 151750 149827 148191 147189 146892
52943 146892 146986 146768 145754 144278 143164 142775 142768 142735 142644 142527 142177 141402 140411 139681 139477 139566 139414 138728 137845 137441
52923 137441 137733 138153 137982 137124 135985 134824 133641 132635 132287 132814 133845 134808 135440 135866 136333 136931 137474
52906 137474 137693 137628 137754 138470 139584 140566 141219 141770 142325 142632 142454 141870 141104 140313 139624 139140 138787 138406 138054
52887 138054 137980 138205 138411 138319 137978 137557 137115 136771 136885 137910 140059 143086 146255 148607 149641 149854 150348
52870 150348 151725 153502 154671 154630 153523 151961 150581 149647 148883 147758 146000 143720 141105 138306 135699
52855 135699 133842 132961 132678 132415 131902 131169 130304 129393 128491 127501 126292 125072 124358 124355 124612 124568 124253 124179 124755
52836 124755 126006 127673 129264 130186 130211 129789 129598 129861 130332 130860 131620 132708 133794 134252 133577 131772 129532
52819 129532 127941 127645 128245 128693 128403 127769 127501 127684 127682 126908 125438 123805 122358 121050 119847 119098 119277
52802 119277 120463 122226 123985 125271 125724 125204 124006 122738 121854 121426 121377 121657 122162 122762 123467 124288 124911
52785 124911 124882 124252 123561 123038 122288 121074 119863 119176 118880 118677 118831 119753 121147 122328 123191 124103 124918 124972
52767 124972 124150 123202 122748 122678 122817 123409 124472 125327 125404 125159 125556 126895 128666 130371 131921 133271 134202
52750 134202 134645 134886 135362 136377 138020 140152 142486 144722 146562 147595 147495 146535 145623 145480 145975 146524
52734 146524 146903 147238 147446 147271 146822 146532 146492 146327 145850 145311 144867 144290 143563 143251 143806 144832 145538 145731 145849
52715 145849 146156 146474 146770 147487 149004 151018 152635 153041 152100 150543 149503 149572 150254 150564 150124 149315 148423
52698 148423 147210 145512 143726 142274 141063 139908 139097 138900 138775 137860 136246 135023 134814 134939 134355 132914
52682 132914 131279 130014 129344 129461 130383 131479 131749 130812 129280 127987 127135 126421 125730 125363 125626 126447 127435
52665 127435 128168 128413 128266 128159 128560 129501 130450 130855 130766 130713 130996 131414 131823 132542 133840 135263 135982 135751 135025
52646 135025 134105 132722 130776 128977 128275 128819 129986 131323 132996 135206 137519 139054 139254 138336 136996
52631 136996 135749 134620 133507 132680 132660 133552 134780 135658 136044 136231 136426 136625 136776 136664 135738 133580 130693
52614 130693 128433 127803 128525 129488 129979 130180 130580 131245 131828 132062 131999 131796 131478 131041 130675 130729 131374 132399 133353
52595 133353 133892 133970 133839 133902 134483 135631 137110 138586 139852 140953 142134 143553 144913 145493 144831 143390
52579 143390 142312 142406 143477 144606 144922 144154 142813 141938 142206 143131 143465 142660 141559 141252 141606 141468 140172
52562 140172 138257 136640 135642 135069 134837 135103 135876 136809 137485 137855 138257 138958 139780 140369 140795 141610 143217 145441
52544 145441 147838 150121 152075 153431 154155 154666 155478 156830 158907 161926 165516 168405 169507 169192 168794
52529 168794 168880 168780 167862 166415 164924 163209 160862 158063 155441 153436 152149 151534 151277 150776 149679 148272
52513 148272 146978 145693 144059 142217 140790 140125 139949 139774 139287 138342 136941 135386 134158 133513 133328 133367
52497 133367 133499 133561 133260 132397 131133 129911 129152 129072 129704 130969 132662 134380 135559 135776 135195 134651 135037
52480 135037 136467 138137 139092 139063 138504 137986 137787 137982 138541 139205 139596 139758 140333 141775 143506 144371 143979 143094
52462 143094 142545 142300 141932 141515 141496 141963 142570 143078 143522 143897 144119 144297 144716 145550 146806 148400 150056 151385
52444 151385 152440 153909 156348 159450 162625 165978 170032 174683 179281 183654 188124 192381 195332 196464
52430 196464 196511 196303 195640 193875 191081 188071 185561 183728 182259 180571 178359 176094 174449 173132 171067
52415 171067 168036 165214 163510 162287 160545 158581 157419 157199 157202 157119 157188 157278 156964 156432 156310 156573 156613 156442
52397 156442 156821 157981 159165 159798 160339 161489 163172 164707 165523 165429 164635 163755 163361 163339 163155 162875 163304 164903
52379 164903 167153 169279 171029 172464 173605 174749 176553 179268 182211 184469 185850 186822 187876 189331
52365 189331 191360 193742 195843 197268 198280 199250 200095 200670 201303 202303 203222 203378 203056 203495 205477 208478
52349 208478 211444 213993 216542 219465 222565 225448 228239 231684 236421 242254 248461 254796 261779 269800
52335 269800 278317 286350 293617 300783 308672 317511 326921 336391 345777 355523 366342 378450 391264
52322 391264 404047 416754 429909 443772 458007 472201 486391 500916 515946 531278 546472
52311 546472 561232 575719 590413 605429 620045 633185 644406 654187 663217 671670 679234 685599
52299 685599 690731 694740 697600 698955 698308 695554 691354 686749 682368 678167 673917 669681 665682 661981
52285 661981 658503 655196 652002 648815 645737 643372 642557 643674 646265 649432 652618 656076 660623 666910
52271 666910 674888 683970 693703 704137 715513 727774 740589 753725 767106 780462 793255 805138
52259 805138 816272 826965 837156 846484 854720 861808 867552 871704 874391 876027 876557 875269 871764 866853
52245 866853 861927 857475 852724 846749 839504 831567 823314 814711 805725 796584 787652 779232 771452 764239
52231 764239 757465 751217 745786 741210 737016 732663 728240 724479 722011 720789 720320 720254 720566 721290 722361
52216 722361 723786 725738 728338 731473 735005 739007 743555 748349 752881 757009 761024 765012 768562 771378
52202 771378 773828 776458 779171 781419 783053 784439 785680 786319 786011 785008 783669 781888 779390 776414 773668
52187 773668 771610 769992 768179 765793 763038 760402 758062 755712 753067 750329 747791 745180 741918 738113
52173 738113 734676 732229 730382 728442 726340 724395 722549 720511 718454 716970 716283 715988 715594 714960 714115
52158 714115 713126 712210 711616 711227 710619 709698 708948 708775 708822 708329 707097 705743 704872 704336 703563 702457 701544 701193
52140 701193 701150 701200 701879 703919 707082 710276 713043 716303 721238 727968 735853 744676 754827 766437 779079
52125 779079 792390 806491 821620 837712 854486 871607 888708 905574 922490 940085 958580
52114 958580 977291 995020 1010847 1024531 1036356 1046676 1055551 1062773 1068275 1072362 1075364 1077200 1077578
52101 1077578 1076525 1074411 1071508 1067841 1063403 1058120 1051611 1043538 1034382 1025355 1017173 1009218 1000372 990515
52087 990515 980787 972418 965691 960125 955358 951583 949180 948180 948304 949501 952190 956766 963016 970318
52073 970318 978437 987832 999102 1012263 1026638 1041221 1055111 1067792 1079200 1089464 1098627 1106749
52061 1106749 1114147 1121167 1127605 1132716 1135940 1137391 1137454 1136193 1133421 1129113 1123404 1116358 1108027 1098647
52047 1098647 1088492 1077545 1065539 1052332 1038068 1023017 1007438 991517 975231 958337 940809
52036 940809 923243 906553 891144 876604 862279 847927 833722 819901 806671 794291 782906
52025 782906 772253 761794 751190 740524 729991 719615 709388 699481 690080 681098 672241 663258
52013 663258 653907 643792 632681 621000 609592 598786 588067 576817 564951 552486 539042 524402
52001 524402 509294 494819 481086 467101 452137 436588 421193 406071 390977 376130 362217
51990 362217 349729 338636 328644 319503 311243 304334 299355 296197 293795 291016 287695 284508 281954 279877
51976 279877 277888 275811 273604 271155 268371 265317 262176 259123 256162 253019 249330 245157 241219 238342
51962 238342 236734 236011 235803 236058 236832 238192 240408 243838 248466 253869 259783 266511 274600 284359 295901
51947 295901 309446 325339 343860 365104 388788 413803 437947 458374 472498 478646 476258 465984
51935 465984 449615 429596 408183 386889 366559 347684 330508 315038 301163 288822 277978
51924 277978 268495 260175 252901 246633 241229 236396 231845 227392 222915 218414 214182 210671 207937 205368
51910 205368 202257 198610 195095 192183 189644 186950 183894 180661 177612 175211 173939 173921 174732 175742 176574
51895 176574 177070 177068 176607 176233 176702 178300 180721 183608 186787 189929 192491 194348 196155 198622 201479 203611
51879 203611 204301 204007 203759 204076 204694 205203 205494 205583 205379 204927 204594 204589 204359 202890 199798 195778 191800 188177
51861 188177 184719 181445 178580 175963 173065 169772 166725 164621 163500 162953 162711 162668 162605 162336 162078 162227
51845 162227 162738 163103 163062 162948 163175 163687 164212 164760 165443 165994 165976 165514 165318 165786 166486 166828 166899 167162 167586 167595
51825 167595 166882 165777 164673 163548 162336 161365 161072 161422 161938 162227 162250 162231 162539 163552 165315 167304 168800
51808 168800 169545 169879 170237 170720 171195 171586 171892 171985 171581 170527 169156 168274 168528 169749 171111 172032 172717 173635
51790 173635 174776 175724 176306 176786 177493 178593 180177 182212 184363 186168 187389 187950 187688 186597 185257 184418
51774 184418 184020 183243 181804 180599 180520 181158 181313 180551 179551 178984 178736 178372 177754 176878 175554 173713 171867
51757 171867 170799 170735 170987 170538 168945 166706 164829 163979 163969 164002 163435 162325 161334 161193 162221 164174 166387
51740 166387 168110 168921 168995 168990 169544 170813 172503 174325 176254 178235 179832 180464 179986 178868 177752 177045 176884
51723 176884 177158 177414 177055 175881 174322 172936 171828 170779 169674 168490 167000 164952 162570 160532 159316
51708 159316 158849 158868 159308 160097 160820 160944 160332 159287 158073 156632 154888 153139 151865 151166 150607 149820 149091
51691 149091 149054 149792 150582 150682 150087 149269 148426 147467 146632 146617 147847 149886 151759 152726 152682 152082 151648 151953 153026
51672 153026 154393 155626 156762 158053 159504 160807 161660 161979 161918 161911 162594 164371 167006 169789 172199 174313
51656 174313 176607 179539 183262 187525 191805 195766 199733 204506 210480 217018 222840 227023 229463 230477
51642 230477 230163 228243 224392 218683 211820 204977 199200 194795 191264 187907 184428 180917 177478 174159
51628 174159 171184 168869 167087 165092 162236 158834 156036 154780 155140 156671 158963 161543 163579 164276 163686
51613 163686 162749 162365 162660 163326 164333 165941 168113 170305 171938 172842 173207 173228 172883 171899 169969 167213 164385
51596 164385 162348 161266 160606 159994 159652 159747 159783 159193 158304 158064 158741 159480 159383 158639 158255 158933 160450 162020
51578 162020 162968 163182 163063 163077 163351 163820 164658 166192 168291 170298 171777 173003 174406 175912 177287 178870
51562 178870 181392 185110 189667 194808 200727 207469 214431 220827 226559 232444 239615 248681 259335 270728
51548 270728 282281 294007 305870 317024 325965 331365 332506 329195 321892 311975 301216 290647 280193
51535 280193 269560 258993 248978 239728 231330 224093 218270 213666 209782 206166 202419 198303 194135
51522 194135 190656 188022 185354 181875 178199 175744 174993 174991 174569 173403 171845 170420 169724 170165 171486 172937
51506 172937 174100 175111 175935 176056 175306 174500 174706 176154 178239 180293 181891 182698 182598 181987 181472 181258 181067
51489 181067 180634 179954 179170 178531 178351 178582 178473 177088 174302 170955 167958 165564 163612 162052 160874 159795
51473 159795 158398 156594 154709 153094 151830 150850 150213 150071 150395 150841 151058 151095 151453 152627 154716 157455
51457 157455 160520 163685 166796 169810 172882 176356 180645 186050 192502 199397 205943 211839 217395 222718
51443 222718 227060 229395 229498 227961 225160 220800 214711 207582 200514 194111 188322 182979 178115 173884
51429 173884 170419 167703 165365 162820 159932 157450 156378 156875 157989 158520 157897 156267 154070 151737 149595
51414 149595 147893 146835 146541 146926 147730 148822 150352 152331 154194 155176 155182 154914 155032 155554 156296 157457 159331
51397 159331 161603 163424 164298 164624 165237 166574 168320 169757 170470 170793 171546 173265 175709 178212 180362 182130
51381 182130 183448 184018 183719 182951 182364 182185 181914 180720 178243 175037 172128 170006 168203 166031 163538 161402
51365 161402 159875 158334 156040 153033 149983 147387 145268 143495 142069 141037 140373 140025 139966 140243 141000 142404
51349 142404 144425 146807 149385 152266 155491 158680 161258 162945 163739 163526 162148 159875 157404 155227 153266
51334 153266 151313 149474 147974 146789 145810 145134 144866 144767 144469 143976 143598 143400 143110 142697 142654 143410 144643 145476
51316 145476 145373 144605 143795 143181 142450 141261 139788 138676 138489 139253 140545 141922 143228 144488 145634 146421
51300 146421 146597 146172 145499 145100 145379 146413 147918 149400 150460 151107 151782 152976 154803 157003 159288 161529
51284 161529 163622 165364 166577 167265 167540 167559 167514 167556 167540 167048 165855 164306 162994 162151 161578 161107 160794 160597
51266 160597 160189 159311 158121 156989 156075 155348 154919 155031 155624 156174 156185 155680 155046 154550 154302 154620 156001 158434
51248 158434 161044 162753 163259 163133 163018 163058 163084 163012 162896 162777 162607 162152 161044 159207 157258 156027 155533 154858
51230 154858 153352 151554 150432 150042 149521 148328 146904 146025 146037 146880 148419 150464 152737 155045 157316 159368
51214 159368 160888 161822 162537 163426 164481 165447 166251 167092 168162 169381 170347 170563 169866 168721 167901 167779 167997
51197 167997 167835 166797 164901 162670 160905 160169 160366 160976 161694 162601 163749 165009 166414 168169 170016 171027
51181 171027 170484 168714 166710 165134 164064 163411 163006 162386 161130 159473 158170 157584 157279 156662 155682 154716
51165 154716 154030 153580 153155 152527 151607 150663 150311 151087 152921 155061 156597 157149 157126 157324 158280 160057 162511
51148 162511 165394 168132 169943 170536 170454 170344 170186 169698 169207 169352 170003 170261 169737 169091 168884 168594 167371 165315
51130 165315 163302 161812 160679 159881 159804 160537 161532 162284 162927 163818 164810 165337 165039 164068 162874 162017 162067 163259
51112 163259 165108 166647 167255 167174 167043 167087 167021 166688 166420 166572 166986 167295 167594 168421 169987 171828 173418 174827
51094 174827 176458 178318 179928 180957 181609 182324 183318 184512 185706 186699 187389 187856 188302 188825 189361 189898 190620
51077 190620 191731 193232 194965 196777 198530 200054 201283 202425 203844 205710 207874 210113 212394 214877
51063 214877 217719 220906 224199 227175 229448 230917 231856 232765 234180 236483 239621 242968 245662 247242 247834
51048 247834 247657 246625 244648 242048 239309 236515 233455 230262 227486 225460 223993 222849 222079 221659 221214
51033 221214 220528 220058 220468 221823 223652 225637 227717 229623 230942 231814 233097 235462 238662 241973 245184
51018 245184 248801 253352 258691 264058 268753 272750 276643 280946 285544 289932 293850 297408 300749 303974
51004 303974 307441 311652 316670 321998 327231 332483 337975 343638 349488 355992 363522 371618 379342 386336
50990 386336 393127 400364 408127 416136 424385 433492 444512 458390 475410 495262 517737 543040 571193
50977 571193 601578 633730 668367 706890 749727 795847 844069 894177 946427 1000645 1056278
50966 1056278 1112730 1168980 1223275 1273925 1320252 1362178 1399124 1430076 1454701 1473699 1487908
50955 1487908 1497689 1503405 1505879 1506034 1504470 1501768 1498862 1496742 1495938 1496451 1497853 1499221 1499353 1497443 1493388
50940 1493388 1487079 1477611 1463604 1444161 1419227 1389200 1354624 1316133 1274202 1228926 1180463 1129729
50928 1129729 1078203 1027012 976627 927534 880674 836900 796398 758995 724721 693673 665532
50917 665532 639653 615615 593425 573270 555338 539777 526405 514485 503135 492105 481899
50906 481899 473104 465858 460050 455667 452650 450616 449041 447704 446756 446442 446959 448528 451223 454624 457940
50891 457940 460757 463514 466942 471145 475626 480209 485529 492294 500402 509092 517819 526644 535888 545842
50877 545842 556824 569200 583194 598869 616284 635457 656265 678720 703330 730791 761355
50866 761355 794985 832214 874248 921921 975154 1033804 1098502 1170038 1248431 1333373 1425280
50855 1425280 1524959 1632161 1745245 1862422 1982723 2105461 2229285 2351975 2470667 2581998
50845 2581998 2682555 2769804 2842557 2900484 2943518 2972039 2987286 2991216 2986051 2974211 2958452
50834 2958452 2941667 2926417 2914725 2908124 2907642 2913601 2925372 2941180 2958156 2972855 2981896 2982143 2970626
50821 2970626 2944958 2904207 2849044 2780717 2699942 2606958 2502409 2388014 2266594 2141658
50811 2141658 2016638 1894134 1775810 1663066 1557484 1460429 1372467 1293456 1223006 1160611
50801 1160611 1105627 1057509 1016038 981033 951959 928073 908793 893690 882219 873720 867485 862570
50789 862570 857804 852386 846325 839983 833373 826296 818904 811465 803660 794779 784804 774687 765244 756146
50775 756146 746339 735211 723032 710426 697721 684862 671890 659426 648516 639773 632838 626994
50763 626994 622216 619237 618626 620250 623709 628804 635409 643409 653118 665325 680488 698142 717486
50750 717486 738380 761382 786937 815040 845752 879662 917616 960094 1006905 1057387 1110910
50739 1110910 1167334 1226942 1289821 1355272 1421939 1488455 1553880 1617561 1678781 1736595 1789794
50728 1789794 1836860 1876043 1905745 1925046 1933887 1932716 1922193 1903579 1879447 1853526 1829271 1808523
50716 1808523 1791666 1778906 1770914 1768251 1770669 1777214 1786649 1797498 1807964 1816163 1820242 1818096 1807206
50703 1807206 1785344 1751637 1706969 1653413 1593389 1529011 1461782 1392794 1323412 1255749 1192200
50692 1192200 1134404 1082779 1037062 997036 962649 933730 909958 891154 877397 868768 865135 866314
50680 866314 872337 883235 898487 916882 937108 958310 979845 1000688 1019554 1035720 1049409 1061140
50668 1061140 1070957 1078506 1083666 1086881 1088942 1090654 1092577 1094826 1097148 1099381 1101867 1105261 1110043 1116356
50654 1116356 1124294 1134129 1146205 1160726 1177672 1196849 1218018 1241065 1265979 1292586 1320312 1348279
50642 1348279 1375545 1401291 1424893 1445968 1464249 1479396 1491064 1499250 1504321 1506512 1505550 1500990
50630 1500990 1492783 1481334 1467224 1451195 1434309 1417713 1402232 1388412 1376816 1367890 1361506 1357091
50618 1357091 1354290 1353216 1353934 1356128 1359480 1364058 1370021 1377121 1384649 1391622 1396733 1398304 1394655 1384639
50604 1384639 1367871 1344651 1315772 1282108 1244172 1202259 1157187 1110540 1063833 1017701 972319
50593 972319 928412 887213 849463 815059 783823 756016 731777 710575 691774 675482 662363
50582 662363 652662 645842 641157 638229 636979 637364 639354 643017 648426 655566 664372 674831 686936 700521
50568 700521 715100 729926 744463 759010 774601 792028 811071 831054 851995 874637 899225
50557 899225 924892 950504 975644 1000265 1023950 1046216 1067351 1088139 1108740 1128627 1147917
50546 1147917 1168090 1190907 1217034 1246132 1277856 1312145 1348855 1387976 1430378 1477722 1531212
50535 1531212 1590748 1655531 1725178 1799799 1879158 1962167 2047279 2132951 2217546 2299051 2375253
50524 2375253 2444192 2504289 2554139 2592493 2618475 2631430 2630333 2613693 2580618 2532078 2470905
50513 2470905 2400562 2324148 2244392 2163877 2084811 2008856 1937585 1872944 1816923 1770828 1735063
50502 1735063 1709438 1693344 1685838 1686055 1693671 1708669 1730576 1758167 1789760 1823313 1856036 1884273
50490 1884273 1904121 1912206 1906083 1884525 1847850 1797806 1736893 1667782 1593220 1515868 1437812 1360395
50478 1360395 1284816 1212601 1145071 1082617 1024939 971962 924074 881527 844105 811432 783165
50467 783165 758810 737808 720080 706135 696336 690291 687209 686688 688897 694130 702361 713120 725552
50454 725552 738765 752374 766706 782227 798775 815395 830735 843453 852490 857383 858431 856454
50442 856454 852375 847089 841461 836124 831356 827457 825202 825561 828864 834552 841894 850742 861476 874392
50428 874392 889314 905713 923125 941553 961564 983968 1009398 1038215 1070586 1106348 1144905
50417 1144905 1185636 1228422 1273368 1319845 1366230 1410832 1452844 1492146 1528411 1560726 1587946
50406 1587946 1609205 1624109 1632498 1633874 1627129 1611218 1586217 1553306 1513578 1467455 1415656 1360095
50394 1360095 1303127 1246225 1190109 1135920 1085373 1039741 999454 964805 936292 913966 897203
50383 897203 885637 879847 880618 887809 900318 916774 935796 955799 975127 992364 1006200 1015014
50371 1015014 1017000 1010937 996878 976171 950824 922664 892801 861808 830260 798894 768295 738724
50359 738724 710390 683569 658336 634438 611617 589845 569179 549761 532148 517218 505360
50348 505360 496024 488421 482377 478071 475214 473052 471198 470021 470190 472177 476172 482014 489003 496048
50334 496048 502259 507449 512088 516872 522242 528177 534541 541560 549685 558805 568038 576634 584759 592907
50320 592907 600870 607927 613969 619755 626001 632852 640350 648721 657912 667452 677260 688198 701298 716691
50306 716691 733803 752502 773574 797990 826161 858303 895476 939690 991924 1049119 1103045
50295 1103045 1143091 1161388 1156274 1131804 1094733 1051760 1008094 966952 929728 896842 868627
50284 868627 845446 827259 813470 803249 795835 790609 787120 785160 784687 785739 788511 793367 800603
50271 800603 810186 821853 835381 850618 867379 885513 904965 925484 946260 966094 984060 999924
50259 999924 1013950 1026475 1037690 1047652 1056365 1063848 1070025 1074414 1075969 1073393 1065724 1052662 1034568
50246 1034568 1012408 987656 961895 936293 911491 887967 866290 846825 829327 813051 797267
50235 797267 781575 765768 749589 732768 715303 697638 680477 664379 649503 635666 622585
50224 622585 610036 597815 585650 573294 560845 548932 538276 528842 519639 509768 499642 490718
50212 490718 483872 478454 473300 468224 463990 461025 458835 456722 454495 452254 449992 447780 445968 444784
50198 444784 443929 442992 442176 442137 443096 444431 445246 445093 444018 442200 439813 437150 434635 432613 431157 430093
50182 430093 429155 428045 426346 423567 419564 414998 411125 408872 408163 408258 408566 408905 409227 409637 410751 413499
50166 413499 418214 424186 430435 436781 443931 452680 463416 476346 491775 509953 530852 554330 580570
50153 580570 610237 644096 682381 724586 769968 818108 868647 920457 971553 1020172 1065727
50142 1065727 1108481 1148637 1186207 1221454 1254716 1285577 1312575 1333800 1347470 1352032 1346350 1330215
50130 1330215 1304458 1270445 1229699 1184004 1135336 1085378 1035307 986142 938884 894165 852287
50119 852287 813892 780015 750952 725497 701941 679661 659199 641026 624874 610242 596940
50108 596940 584991 574441 565374 557762 551190 545097 539402 534597 531205 529426 529269 530547 532621 534618
50094 534618 536222 538061 541050 545451 550659 555780 560363 564742 569721 575813 582802 590148 597638 605325
50080 605325 612992 620194 626832 633223 639444 644993 649284 652124 653531 653504 652256 650341 648170 645557 642010
50065 642010 637340 631773 625636 619217 612854 606932 601785 597650 594593 592439 590946 590108 590159 591265 593420
50050 593420 596679 601203 606966 613771 621671 631026 641902 653692 665643 677570 689866 703015 717302
50037 717302 732755 749139 766159 783897 802819 823243 845096 868362 893268 919551 945841
50026 945841 970264 991653 1009861 1025129 1037610 1047411 1054695 1059732 1063058 1065262 1066159 1064294 1057762
50013 1057762 1045490 1027312 1003083 972539 936259 896184 854821 814187 775545 739553 706314
50002 706314 675646 647761 623432 603173 586385 571683 557990 545079 533097 521892 510898
49991 510898 499573 487786 475792 463870 452082 440423 429106 418578 409248 401272 394442 388141
49979 388141 381624 374717 368197 363030 359160 355428 350842 345553 340339 335534 330945 326565 322812 319973
49965 319973 317814 315956 314376 313359 313099 313554 314590 316076 317826 319558 320948 321712 321716 321146 320471 320039
49949 320039 319629 318633 316802 314582 312530 310632 308528 306244 304261 302888 302043 301682 301915 302502 302824 302762
49933 302762 303116 304607 306753 308310 308638 308050 306968 305465 303711 302188 301228 300777 300840 301705 303478 305745
49917 305745 307958 309799 311003 311221 310416 309083 307769 306562 305372 304381 303865 303653 303186 302093 300461 298644
49901 298644 297017 295835 295071 294434 293708 292957 292211 291146 289402 287106 284772 282751 281114 280050 279965 281065
49885 281065 283066 285362 287287 288252 288003 286907 285750 285089 284944 285117 285513 286056 286648 287424 288728 290548
49869 290548 292271 293412 294431 296332 299453 303114 306527 309645 312849 316164 319133 321322 322596 322950
49855 322950 322399 321177 319829 318898 318502 318264 317741 316931 316221 315794 315219 313933 312142 310871 310909 311969 313129
49838 313129 313827 314075 313970 313542 313067 312982 313305 313516 313195 312465 311682 311043 310740 311169 312643 315032 317871 320688
49820 320688 323069 324680 325488 325790 325860 325728 325397 324971 324389 323436 322274 321555 321561 321604 320834 319316 317750 316344
49802 316344 314733 312895 311306 310084 308764 307221 306108 305937 306262 306335 306185 306440 307245 307889 307565 306195
49786 306195 304492 303380 303304 303891 304279 303869 302754 301413 300230 299392 299017 299114 299489 299805 299760 299206 298274 297410
49768 297410 297068 297260 297543 297524 297209 296831 296633 296869 297671 298746 299500 299707 299824 300439 301662 303257 305074 307002
49750 307002 308721 309909 310586 310985 311265 311630 312515 314227 316466 318529 319969 320795 321197 321438 321901 322798 323875
49733 323875 324825 325946 327822 330294 332391 333606 334735 336983 340513 344315 347291 349064 349826 349919 349629
49718 349629 349075 348152 346810 345420 344627 344765 345660 347080 349095 351726 354523 356873 358702 360497 362625
49703 362625 365030 367726 371180 375720 380781 385181 388237 390277 392015 393763 395416 396905 398363 399956
49689 399956 401822 404168 407247 411255 416270 422220 428749 435160 440603 444325 445776 444753 441722 437936
49675 437936 434828 433118 432606 432965 434549 438120 443740 450115 455223 457543 456669 453005 447347 440769 434376
49660 434376 428605 422916 416626 410066 404489 400788 398650 397181 396030 395662 396810 399860 404557 409942
49646 409942 414678 417737 418826 418100 415684 411696 406627 401395 396898 393495 390844 388189 385082 381947
49632 381947 379760 378951 378791 378125 376545 374618 373099 372310 372216 372696 373558 374516 375324 375914 376400 376989 377826 378788
49614 378788 379512 379772 379744 379809 380243 381242 382942 385093 386896 387669 387650 387706 388216 388733 388895 389140 390126 391755 393210
49595 393210 393829 393615 393020 392505 392325 392483 392789 393119 393639 394668 396314 398343 400390 402202 403720 405017
49579 405017 406188 407203 407921 408348 408866 410004 411917 414252 416593 418908 421390 423961 426224 427964 429481
49564 429481 431243 433360 435538 437449 438936 439892 440216 439940 439253 438302 437103 435697 434200 432643 430954
49549 430954 429259 428024 427666 428058 428602 428812 428737 428802 429336 430303 431486 432878 434754 437287 440307 443811 448577
49532 448577 455710 465324 476067 486276 495284 503192 509761 514262 516471 517222 517725 518693 520281 522485
49518 522485 525210 528166 531000 533518 535570 536836 537022 536348 535609 535546 536209 537030 537475 537429 536908 535676 533425
49501 533425 530271 526731 523169 519555 515882 512445 509490 506808 504032 501184 498668 496824 495736 495298
49487 495298 495165 494774 493788 492539 491672 491324 490986 490201 489093 488087 487416 487062 486955 486960 486780 486097 484859 483444
49469 483444 482462 482241 482425 482205 481137 479612 478328 477471 476710 475850 475123 474817 474993 475675 476963 478856 481187
49452 481187 483797 486533 489036 490919 492327 494012 496633 500184 504240 508519 512945 517310 521188 524207
49438 524207 526350 528070 530172 533450 538239 544286 550960 557414 562596 565494 565679 563621 560378 556966
49424 556966 553981 551659 550211 550015 551313 553698 556221 558387 560827 564512 569444 574701 579812 585414
49410 585414 592264 600190 608446 616668 624975 633429 641934 650577 659594 669039 678772 688690 698598 707917
49396 707917 715953 722604 728542 734570 740893 747019 752160 755721 757545 757805 756661 754139 750465 746369
49382 746369 742729 739800 737005 733643 729706 725780 722158 718354 713789 708843 704769 702359 701093 699980
49368 699980 698924 698628 699244 699835 699405 697926 695998 694006 692040 690273 688813 687292 685097 682066 678638
49353 678638 675297 672149 669019 665764 662415 659162 656243 653777 651690 649789 647824 645546 642945 640418
49339 640418 638453 637168 636471 636675 638390 641570 645137 647830 649031 648545 646226 642381 638011 633856 629440
49324 629440 623823 617167 610826 605826 601933 598299 594384 590045 585314 580478 576062 572397 569322 566421
49310 566421 563383 560164 557056 554558 552871 551547 549973 548175 546732 545975 545681 545541 545419 545118 544515 544028
49294 544028 544384 545628 546906 547507 547647 547920 548493 549282 550436 552045 553581 554217 553725 552776 552391 553328 555831
49277 555831 559627 564193 569180 574484 579894 584932 589197 592605 595196 597071 598682 600634 602843 604294
49263 604294 604134 602624 600585 598406 596212 594532 593855 593664 592886 591457 590544 590948 592044 592752 592878 592922 592998
49246 592998 592661 591637 590221 588911 587993 587488 587256 587155 587277 588005 589741 592653 596749 601989 608196 615017
49230 615017 622176 629672 637554 645610 653467 660910 668010 674993 682096 689428 696870 704248 711646 719382
49216 719382 727541 735789 743836 751870 760373 769709 780125 791870 804928 818753 832594 846063 859111
49203 859111 871648 883612 895363 907526 920327 933376 946179 958565 970551 982141 993481
49192 993481 1004916 1016677 1028581 1040055 1050410 1059208 1066733 1074108 1082548 1092359 1102953 1113881
49180 1113881 1125372 1137689 1150426 1162825 1174488 1185468 1195954 1206229 1216692 1227484 1238246
49169 1238246 1248528 1258276 1267630 1276511 1284854 1293096 1301947 1311708 1322141 1332930 1343898 1354882 1365852
49156 1365852 1377160 1389343 1402663 1417136 1432820 1449632 1466991 1484195 1501216 1518606 1536618
49145 1536618 1554933 1573301 1591861 1610628 1629243 1647486 1665500 1683273 1700402 1716797 1733147
49134 1733147 1750251 1768227 1786694 1805344 1823949 1842276 1860629 1880182 1902166 1926764 1953317
49123 1953317 1981575 2012361 2047174 2087675 2135654 2192937 2260664 2337930 2420512 2501324 2574038
49112 2574038 2638181 2700428 2768612 2842461 2909990 2954102 2964167 2942770 2902454 2856076 2808941
49101 2808941 2758263 2698751 2628424 2550142 2469265 2390875 2318652 2254855 2200396 2155025 2117728
49090 2117728 2087105 2061608 2039870 2021028 2004678 1990637 1978931 1969771 1963119 1958316 1954494 1951243
49078 1951243 1948482 1945902 1943175 1940752 1939661 1940197 1941304 1941565 1940381 1937937 1934578 1930688 1926842 1923478
49064 1923478 1920513 1917619 1914732 1912002 1909453 1907005 1904707 1902614 1900481 1897777 1893936 1888536 1881550 1873664
49050 1873664 1866028 1859336 1853340 1847555 1842096 1837354 1833122 1828736 1824111 1820058 1817361 1815979 1815365 1815243
49036 1815243 1815799 1817335 1819967 1823534 1827555 1831407 1834739 1837735 1840840 1844218 1847605 1850714 1853746 1857370
49022 1857370 1862144 1868021 1874528 1881352 1888514 1896013 1903644 1911347 1919404 1927979 1936701 1945097 1953233 1961463
49008 1961463 1969634 1977142 1983890 1990628 1998028 2005828 2013309 2020292 2027169 2034113 2040782 2046830 2052200 2056733
48994 2056733 2059909 2061357 2061417 2060869 2060163 2059234 2057949 2056310 2054057 2050500 2045139 2038350 2031134 2024221 2017685
48979 2017685 2011376 2005320 1999619 1994311 1989590 1985895 1983528 1982322 1981930 1982254 1983299 1984772 1986325 1988198
48965 1988198 1991096 1995158 1999448 2002921 2005695 2008887 2013133 2017718 2021453 2024163 2026927 2030884 2036129 2041925
48951 2041925 2047726 2053695 2060317 2067853 2076335 2085933 2097077 2110143 2125132 2141690 2159542 2178923
48939 2178923 2200548 2225080 2252607 2282704 2314934 2349170 2385461 2423812 2464178 2506528 2550765
48928 2550765 2596668 2644016 2692677 2742483 2793076 2844038 2895078 2945980 2996404 3045869 3093912
48917 3093912 3140283 3185080 3228851 3272371 3316080 3359664 3402305 3443307 3482421 3519729 3555501
48906 3555501 3590172 3624140 3657455 3689817 3721018 3751228 3780745 3809550 3837278 3863573 3888328
48895 3888328 3911549 3933098 3952686 3970168 3985782 3999976 4012907 4024146 4032922 4038660 4041250 4040898
48883 4040898 4037772 4031704 4022140 4008509 3990811 3969722 3945881 3919174 3889059 3855535 3819375 3781256
48871 3781256 3741067 3698405 3653451 3606909 3559245 3510429 3460509 3410084 3360052 3311103 3263513
48860 3263513 3217256 3172206 3128369 3085999 3045433 3006834 2970205 2935604 2903128 2872744 2844496
48849 2844496 2818976 2797183 2779611 2765654 2754206 2744710 2737329 2732206 2728948 2726916 2725742 2725457 2726256
48836 2726256 2728237 2731288 2735145 2739606 2744691 2750522 2757116 2764336 2771959 2779679 2787224 2794708 2802713 2811686
48822 2811686 2821270 2830603 2839199 2847143 2854420 2860678 2866004 2871475 2878354 2886886 2896302 2905901 2915760 2926390
48808 2926390 2938074 2950672 2963832 2977330 2991248 3005774 3020731 3035462 3049418 3062699 3075785
48797 3075785 3088895 3101994 3115277 3129138 3143561 3157919 3171496 3183879 3194845 3204344 3212805 3221045
48785 3221045 3229529 3237956 3245793 3252910 3259434 3265290 3270256 3274243 3277117 3278489 3278078 3276063 3272526 3266680
48771 3266680 3257320 3244175 3228227 3210524 3191221 3170046 3147053 3122282 3095128 3064896 3031960
48760 3031960 2997727 2963255 2928449 2892846 2856703 2820915 2786129 2752372 2719457 2687396 2656396
48749 2656396 2626712 2598573 2572124 2547431 2524606 2503897 2485563 2469709 2456297 2445156 2435920
48738 2435920 2428224 2422127 2418102 2416318 2416212 2417115 2419020 2422184 2426172 2430032 2433488 2437255 2441929 2447216
48724 2447216 2452615 2458242 2464435 2471025 2477533 2483714 2489284 2493446 2495444 2495540 2494827 2494073 2493306 2492457 2491725 2491118
48708 2491118 2490235 2488819 2487183 2485874 2485214 2485291 2486033 2487135 2488268 2489552 2491535 2494482 2497936 2501194 2504020
48693 2504020 2506864 2510625 2516329 2524628 2535389 2548077 2562857 2581168 2604994 2635822 2674608 2722595
48681 2722595 2781799 2854634 2943188 3048691 3171071 3308236 3455096 3602957 3740154 3854089
48671 3854089 3933684 3971248 3963565 3912414 3824109 3707760 3573239 3430077 3286870 3150189
48661 3150189 3023562 2908057 2804004 2711639 2630279 2558151 2493771 2436799 2386895 2342503 2301756
48650 2301756 2264125 2230142 2199674 2171423 2144228 2117866 2092329 2067150 2042020 2017486 1994373
48639 1994373 1972662 1951437 1929921 1908224 1887052 1866968 1848061 1830158 1813124 1796904 1781484
48628 1781484 1766958 1753510 1741114 1729314 1717586 1705901 1694653 1684001 1673702 1663708 1654429 1646114
48616 1646114 1638417 1631017 1624245 1618587 1613785 1609050 1604105 1599423 1595412 1591847 1588227 1584245 1579743 1574607
48602 1574607 1568962 1563266 1558006 1553364 1549216 1545298 1541321 1537063 1532372 1527045 1520824 1513673 1505862 1497580
48588 1497580 1488663 1479079 1469459 1460624 1452596 1444652 1436455 1428610 1421855 1416169 1411082 1406445 1402427 1398848
48574 1398848 1395009 1390225 1384231 1377017 1368614 1359199 1349232 1339186 1329141 1318855 1308284 1297855 1288036
48561 1288036 1278829 1269943 1261401 1253581 1246545 1239718 1232477 1224844 1217340 1210280 1203506 1196700 1189682 1182515
48547 1182515 1175525 1169148 1163505 1158233 1152960 1147842 1143326 1139459 1135717 1131537 1126783 1121743 1116939 1112875
48533 1112875 1109681 1106932 1104010 1100675 1097180 1093961 1091377 1089548 1088110 1086291 1083590 1080332 1077170 1074154
48519 1074154 1070817 1067116 1063704 1061046 1058776 1056188 1053038 1049534 1045892 1042240 1038735 1035415 1032134 1028946
48505 1028946 1026420 1025161 1025030 1025174 1024894 1024171 1023236 1021989 1020202 1018097 1016226 1014739 1013211 1011441 1009958
48490 1009958 1009219 1008632 1007094 1004556 1002286 1001315 1001260 1001085 1000408 999408 997957 995701 992863 990194 988075 986305
$$ [...]
##END NTUPLES=NMR SPECTRUM
##END=
