##TITLE=NES1061_159122.0010_001_9704394_M04ESlPhw2
##JCAMPDX= 6.0         $$ Bruker NMR JCAMP-DX V2.0
##DATA TYPE= NMR SPECTRUM
##DATA CLASS= NTUPLES
##ORIGIN= BRUKER
##OWNER= Administrator
$$ 1.72 TOPSPIN		Version 2.1
$$ 2016-04-30 14:44:01.005 -0700  Administrator@X
$$ Compression mode = diff/dup
##.OBSERVE FREQUENCY= 400.02188249412
##.OBSERVE NUCLEUS= ^1H
##.ACQUISITION MODE= SIMULTANEOUS (DQD)
##.ACQUISITION SCHEME= undefined
##.AVERAGES= 8
##.DIGITISER RES= 22
##SPECTROMETER/DATA SYSTEM= spect
##.PULSE SEQUENCE= zg30
##.SOLVENT NAME= COFFEE_meoh
##.SHIFT REFERENCE= INTERNAL, COFFEE_meoh, 1, 14.98509
##AUDIT TRAIL= $$ (NUMBER, WHEN, WHO, WHERE, PROCESS, VERSION, WHAT)
$$ ##TITLE= Audit trail, TOPSPIN		Version 2.1
$$ ##JCAMPDX= 5.01
$$ ##ORIGIN= Bruker BioSpin GmbH
$$ ##OWNER= Administrator
$$ $$ E:\/data/COFFEE/nmr/NES1061_159122.0010_001_9704394_M04ESlPhw2/10/pdata/1/auditp.txt
$$ ##AUDIT TRAIL=  $$ (NUMBER, WHEN, WHO, WHERE, PROCESS, VERSION, WHAT)
(   1,<2016-04-30 14:43:53.708 -0700>,<Administrator>,<X>,<go>,<TOPSPIN 2.1>,
      <created by zg
	started at 2016-04-30 14:42:47.942 -0700,
	POWCHK enabled, PULCHK disabled,
       configuration hash MD5:
       21 0F 79 D6 B3 7B B4 F6 88 20 88 DB 03 48 BD 9F
       data hash MD5: 64K
       E1 EA 0E 30 4A 82 09 35 36 63 25 87 8F EB 5A B0>)
(   2,<2016-04-30 14:43:56.942 -0700>,<Administrator>,<X>,<proc1d>,<TOPSPIN 2.1>,
      <Start of raw data processing
       efp LB = 0 FT_mod = 6 PKNL = 1 PHC0 = 0 PHC1 = 0 SI = 32K 
       data hash MD5: 32K
       72 6C C0 33 16 D4 A4 36 0D F4 CC 81 49 3A 97 E6>)
(   3,<2016-04-30 14:43:57.224 -0700>,<Administrator>,<X>,<proc1d>,<TOPSPIN 2.1>,
      <pk PHC0 = 94.0155 PHC1 = 0 
       data hash MD5: 32K
       68 27 AA 80 13 F7 CB 28 48 B5 BF 84 51 F9 63 58>)
(   4,<2016-04-30 14:43:57.349 -0700>,<Administrator>,<X>,<proc1d>,<TOPSPIN 2.1>,
      <abs ABSG = 1 
       data hash MD5: 32K
       ED 2C 30 9F C0 19 D3 86 27 E8 B3 68 78 78 CB 8D>)
(   5,<2016-04-30 14:43:57.411 -0700>,<Administrator>,<X>,<proc1d>,<TOPSPIN 2.1>,
      <abs ABSG = 2 
       data hash MD5: 32K
       07 4E 30 60 38 2F 1F A2 7E 91 22 1A B0 D0 E5 8C>)
(   6,<2016-04-30 14:43:57.474 -0700>,<Administrator>,<X>,<proc1d>,<TOPSPIN 2.1>,
      <abs ABSG = 3 
       data hash MD5: 32K
       FE 3F A3 CC 9B 6E 57 F9 C7 F5 FB 4B 76 A2 D1 67>)
(   7,<2016-04-30 14:43:57.536 -0700>,<Administrator>,<X>,<proc1d>,<TOPSPIN 2.1>,
      <abs ABSG = 4 
       data hash MD5: 32K
       1A F0 10 27 82 F3 C8 C8 0E 98 05 AE 6F 76 5C 13>)
(   8,<2016-04-30 14:43:57.599 -0700>,<Administrator>,<X>,<proc1d>,<TOPSPIN 2.1>,
      <abs ABSG = 5 
       data hash MD5: 32K
       47 53 A4 59 A2 CC F2 5D 99 80 94 B1 11 94 67 DB>)
$$ ##END=
$$ 
$$ $$ hash MD5
$$ $$ 67 EE C1 28 F1 52 96 39 11 95 CF 5E CE F0 FD BA
##$RELAX= 
##$RELAX= 
##$RELAX= 
##$RELAX= 
##$RELAX= 
##$RELAX= 
##$RELAX= 
$$ Bruker specific parameters
$$ --------------------------
##$DU= <E:\>
##$EXPNO= 10
$$ [...]
150 150 150 150 150 150 150 150
##$TP07= 0
##$TPNAME0= <>
##$TPNAME1= <>
##$TPNAME2= <>
##$TPNAME3= <>
##$TPNAME4= <>
##$TPNAME5= <>
##$TPNAME6= <>
##$TPNAME7= <>
##$TPOAL= (0..7)
0.5 0.5 0.5 0.5 0.5 0.5 0.5 0.5
##$TPOFFS= (0..7)
0 0 0 0 0 0 0 0
##$TUNHIN= 0
##$TUNHOUT= 0
##$TUNXOUT= 0
##$USERA1= <user>
##$USERA2= <user>
##$USERA3= <user>
##$USERA4= <user>
##$USERA5= <user>
##$V9= 5
##$VALIST= <valist>
##$VCLIST= <CCCCCCCCCCCCCCC>
##$VD= 0
##$VDLIST= <DDDDDDDDDDDDDDD>
##$VPLIST= <PPPPPPPPPPPPPPP>
##$VTLIST= <TTTTTTTTTTTTTTT>
##$WBST= 2048
##$WBSW= 25
##$XGAIN= (0..3)
0 0 0 0
##$XL= 0
##$YL= 0
##$YMAX_a= 610666
##$YMIN_a= -515082
##$ZGOPTNS= <>
##$ZL1= 120
##$ZL2= 120
##$ZL3= 120
##$ZL4= 120
##$ABSF1= 14.98509
##$ABSF2= -5.573092
##$ABSG= 5
##$ABSL= 3
##$ALPHA= 0
##$AQORDER= 0
##$ASSFAC= 0
##$ASSFACI= 0
##$ASSFACX= 0
##$ASSWID= 0
##$AUNMP= <proc_prof1d_extract_pilot.lims>
##$AXLEFT= 0
##$AXNAME= <>
##$AXNUC= <1H>
##$AXRIGHT= 0
##$AXTYPE= 0
##$AXUNIT= <>
##$AZFE= 0.1
##$AZFW= 0.1
##$BCFW= 0
##$BC_mod= 0
##$BYTORDP= 0
##$COROFFS= 0
##$CY= 15
##$DATMOD= 1
##$DC= 0
##$DFILT= <>
##$DTYPP= 0
##$F1P= 0
##$F2P= 0
##$FCOR= 0.5
##$FTSIZE= 32768
##$FT_mod= 6
##$GAMMA= 0
##$GB= 0
##$INTBC= 1
##$INTSCL= 1
##$ISEN= 128
##$LB= 0
##$LEV0= 0
##$LPBIN= 0
##$MAXI= 10000
##$MC2= 0
##$MEAN= 0
##$ME_mod= 0
##$MI= 0
##$NCOEF= 0
##$NC_proc= -8
##$NLEV= 6
##$NOISF1= 0
##$NOISF2= 0
##$NSP= 0
##$NTH_PI= 0
##$NZP= 0
##$OFFSET= 14.98509
##$PC= 1
##$PHC0= 94.0155
##$PHC1= 0
##$PH_mod= 1
##$PKNL= yes
##$PPARMOD= 0
##$PPDIAG= 0
##$PPIPTYP= 0
##$PPMPNUM= 2147483647
##$PPRESOL= 1
##$PSCAL= 4
##$PSIGN= 0
##$PYNMP= <proc.py>
##$REVERSE= no
##$SF= 400.02
##$SI= 32768
##$SIGF1= 0
##$SIGF2= 0
##$SINO= 400
##$SIOLD= 32768
##$SPECTYP= <>
##$SREGLST= <1H.CDCl3>
##$SSB= 0
##$STSI= 32768
##$STSR= 0
##$SW_p= 8223.68421052631
##$SYMM= 0
##$S_DEV= 0
##$TDeff= 65536
##$TDoff= 0
##$TI= <>
##$TILT= no
##$TM1= 0
##$TM2= 0
##$TOPLEV= 0
##$USERP1= <user>
##$USERP2= <user>
##$USERP3= <user>
##$USERP4= <user>
##$USERP5= <user>
##$WDW= 1
##$XDIM= 32768
##$YMAX_p= 424249209
##$YMIN_p= -671958
##$CURPLOT= <Network HP LaserJet P1505>
##$CURPRIN= <$Network HP LaserJet P1505>
##$DFORMAT= <normdp>
##$LAYOUT= <+/1D_H.xwp>
##$LFORMAT= <normlp>
##$PFORMAT= <normpl>
##$SURQMSG= 1
$$ End of Bruker specific parameters
$$ ---------------------------------
##NTUPLES= NMR SPECTRUM
##VAR_NAME=  FREQUENCY,     SPECTRUM/REAL,   SPECTRUM/IMAG
##SYMBOL=    X,             R,               I
##VAR_TYPE=  INDEPENDENT,   DEPENDENT,       DEPENDENT
##VAR_FORM=  AFFN,          ASDF,            ASDF
##VAR_DIM=   32768,         32768,           32768
##UNITS=     HZ,            ARBITRARY UNITS, ARBITRARY UNITS
##FACTOR=    0.250966925370066, 1,           1
##FIRST=     8223.43324360094, -319403,      -113211
##LAST=      0,             -124450,         127567
##MIN=       0,             -671958,         0
##MAX=       8223.43324360094, 424249209,    0
$$ Real data points
##PAGE= N=1
##DATA TABLE= (X++(R..R)), XYDATA
$$ [...]
19525h5781I0458e1727m679A38647b69116A90587c36142J51742O2231m7094H470
$$ -85781 90458 -51727 -56406 138647 -269116 190587 -336142 -184400 -122169 -169263 8470
19513A14882a18897j02574A08109J32902r9008h8174A29499c43320d9977A26589
$$ 114882 -118897 -221471 108109 241011 142003 -88174 129499 -343320 -49977 126589
19502B25918a95806j7167B39800d66412C4114h5908b0391k11850N6805b0106k03803
$$ 225918 -195806 -212973 239800 -466412 34114 -85908 -20391 -232241 -175436 -20106 -223909
19491b23909J09239D415h0381L7355o7018o1542r464A28134b99569c9604k76436
$$ -223909 -114670 4415 -80381 -43026 -110044 -171586 -181050 128134 -299569 -39604 -316040
19480c16040A83031J52552b00591A63921B7421a54718A85069g32p6154m2651F462
$$ -316040 183031 335583 -200591 163921 27421 -154718 185069 -732 -76886 -119537 6462
19468D5377b61750C9827O4497a95390C1391J59776d86166e4149K712J9970I7784
$$ 45377 -261750 39827 104324 -195390 31391 191167 -486166 -54149 -51437 -31467 97784
19456e0659F432J19627l7848a10187J6061C6140f2456A32317b12790l8321a19971
$$ -50659 6432 126059 88211 -110187 -94126 36140 -62456 132317 -212790 -251111 -119971
19444b81238F4964b04134H1871d8262r241A45434a78389a4334E31J01293b18713
$$ -281238 64964 -204134 81871 -48262 -57503 145434 -178389 -14334 531 101824 -218713
19432c34171B01650B3231d9908p232G386a2535r7379o3574r2880K7708L4313H7309
$$ -334171 201650 23231 -49908 -57140 7386 -12535 -109914 -173488 -266368 -238660 -204347 87309
19419b74536B10642L6320p1862J3679b22023n097h72E8109b45975K870c7436j17967
$$ -274536 210642 246962 175100 188779 -222023 -227120 -872 58109 -245975 -243105 -37436 -155403
19407a55403j43610B45418a41645A02428b99719A09359H363g4292H685a69089
$$ -155403 -299013 245418 -141645 102428 -299719 109359 8363 -74292 8685 -169089
19396b25850a9614A26860K20520a21784k73151A26264b57058R0615B4290a39558
$$ -225850 -19614 126860 347380 -121784 -394935 126264 -257058 -166443 24290 -139558
19385d82022A19171h179n5363p7313B0603i1697p427K5491m5804A17032d2892
$$ -482022 119171 -8179 -63542 -140855 20603 -91697 -99124 -73633 -119437 117032 -42892
19373a88881f2600B30993b83429A70829b97909C22360H6596e7902p8330k12713
$$ -188881 -62600 230993 -283429 170829 -297909 322360 86596 -57902 -136232 -348945
19363c48945C02811b45475C5283b40368a01529q4767g6374j65661j32732J81526
$$ -348945 302811 -245475 35283 -240368 -101529 -186296 -76374 -242035 -374767 -193241
19353a93241A08994n4130a10964K4853K7065b7164j29775f6515g848A86942i3372
$$ -193241 108994 54864 -110964 -86111 -59046 -27164 -156939 -66515 -7848 186942 -93372
19341c83199A2551J25718h3208h275k20773A39281e4357G0923j7891b20766O3614
$$ -383199 12551 138269 -83208 -8275 -229048 139281 -54357 70923 53032 -220766 -157152
19330a57152n1081i9611A21368h4918j17185i4564C17699a31715o7438C0343c1995
$$ -157152 -208233 -99611 121368 -84918 -202103 -94564 317699 -131715 -199153 30343 -31995
19318c26351a44028I2027b53524F61b47659H0448h3813m103J8417b8125A10123
$$ -326351 -144028 92027 -253524 661 -247659 80448 -83813 -87916 -69499 -28125 110123
19306b66764J27653N3225l06044h1083A52664d232B24220a1361B93457b16271
$$ -266764 -139111 -85886 -391930 -81083 152664 -4232 224220 -11361 293457 -216271
19295i6294A56330a41485f3969L1520A2690b02433H8549C0779H797J26303N5070
$$ -96294 156330 -141485 -63969 -32449 12690 -202433 88549 30779 8797 135100 190170
19284A90170a22697b0909B53050B7225J65041c21378A94297b09555P5468o3613
$$ 190170 -122697 -20909 253050 27225 192266 -321378 194297 -209555 -134087 -197700
19274a97700A6116M83579H991L79900b44539i1081L5203C05656b56926r7285a02682
$$ -197700 16116 499695 8991 388891 -244539 -91081 -55878 305656 -256926 -354211 -102682
19262c39024J48383b9275j97159O0653j22530O2755g3369k57737E7401f4103k2230
$$ -339024 -190641 -29275 -226434 -165781 -288311 -225556 -73369 -331106 57401 -64103 -86333
19251h6333j09209j56902f442C65978f9148r4419B2564b65398e5986k29005e0739
$$ -86333 -195542 -352444 -6442 365978 -69148 -163567 22564 -265398 -55986 -284991 -50739
19239C5391N17362a75406J0465d9071m4192c5777A19070a67931N5658H2950g3880
$$ 35391 552753 -175406 -164941 -49071 -93263 -35777 119070 -167931 -112273 82950 -73880
19227F2567c8674k4091c0303j9455K1920k3664j70683f4272B13097h9915B09554
$$ 62567 -38674 -62765 -30303 -49758 -27838 -51502 -222185 -64272 213097 -89915 209554
19215b14303m5102c3720l5698r4935n8874D1323j5232a9786B6275c9470m5933
$$ -214303 -259405 -33720 -69418 -164353 -223227 41323 26091 -19786 26275 -39470 -85403
19204h5403j33517A10651f0173K3208O322C9588a76306B31984G7858H963J50710
$$ -85403 -218920 110651 -60173 -36965 -30643 39588 -176306 231984 77858 8963 159673
19193A59673n5365i3770A12025a84372l0658c2693l6276b9338j98925f1746B6119
$$ 159673 104308 -93770 112025 -184372 -215030 -32693 -68969 -29338 -228263 -61746 26119
19181a86436m6687a15348j71306E7356d3067a2033r7968o6909H1890K99267a47467
$$ -186436 -233123 -115348 -286654 57356 -43067 -12033 -110001 -176910 81890 381157 -147467
19169D2317L45206b37384A9947b59063Q6591h5219C40493b0965A11986d8628r4477
$$ 42317 387523 -237384 19947 -259063 -172472 -85219 340493 -20965 111986 -48628 -143105
19158a43105O2601k58902R6923J07608c801k70110i220n3348b1264k34637c1778
$$ -143105 -80504 -339406 -242483 -134875 -3801 -273911 -9220 -62568 -21264 -255901 -31778
19146A81882c55978b7152j8395J4632D1059a7149D6217j0006a3820B61927a5169
$$ 181882 -355978 -27152 -45547 -30915 41059 -17149 46217 36211 -13820 261927 -15169
19134A32577c9571o980E7844i4978k73646J50626A00766f4329I1054b62199f6625
$$ 132577 -39571 -46551 57844 -94978 -368624 -217998 100766 -64329 91054 -262199 -66625
19122a44577c3421k9489o2677j11210A05712a8796A2976K9550b89995Q7566j61860
$$ -144577 -33421 -62910 -125587 -236797 105712 -18796 12976 42526 -289995 -202429 -364289
19111c64289M7315a19085K8399j00732C912L86171a44435n6111D9627a28270k84427
$$ -364289 -316974 -119085 -90686 -191418 3912 390083 -144435 -200546 49627 -128270 -412697
19100d12697A25417a22390e7466J4994i83q1179l09502I324J30209b53277C13245
$$ -412697 125417 -122390 -57466 -42472 -983 -82162 -391664 9324 139533 -253277 313245
19088a38786p8056a08151j70317g4372j43383f7758D4320a5178C0272J86542J11050
$$ -138786 -216842 -108151 -278468 -74372 -217755 -67758 44320 -15178 30272 216814 327864
19077C27864a34304d6973G4775a79481m1425E1458J79495d07903a49902K5217
$$ 327864 -134304 -46973 74775 -179481 -220906 51458 230953 -407903 -149902 -124685
19067a24685j11560N7667g2682p1886k6051k16683A19957g1682A87445F5950b4515
$$ -124685 -236245 -178578 -72682 -144568 -170619 -387302 119957 -71682 187445 65950 -24515
19055a28832N7139k89994J57465K1959A04816J56587r6652M2346C6831a96789
$$ -128832 -71693 -361687 -204222 -182263 104816 261403 164751 207097 36831 -196789
19044B42997h2020L479n913j34139c9344l48299J7724a63664g5467o8961I1717
$$ 242997 -82020 -78541 -84454 -218593 -39344 -387643 -369919 -163664 -75467 -144428 91717
19032a12937j35389G9774Q7401J07841d27498J36874J35715B35065r7363o0823
$$ -112937 -248326 79774 167175 275016 -427498 -290624 -154909 235065 137702 76879
19022G6879a98108h9702r8191c3321j81424n1762J28632A6629J15825o311J81677
$$ 76879 -198108 -89702 -187893 -33321 -214745 -266507 -137875 16629 132454 126143 307820
19011C07820A31992b87440E1916b6549j00680B03941b31680A82683a13284r3136
$$ 307820 131992 -287440 51916 -26549 -127229 203941 -231680 182683 -113284 -206420
19001b06420H653J93864N412a9839K296j70408j7299F228b12467f693k12882b8835
$$ -206420 8653 202517 207929 -19839 -17543 -187951 -205250 6228 -212467 -6693 -219575 -28835
18988b45276B8064o447h7697k52604J47344R4780B36381h0881c6151j31132F2251
$$ -245276 28064 21617 -87697 -340301 -192957 -98177 236381 -80881 -36151 -167283 62251
18976B98231A8928P79d5009J7133A26576J20310C8407b42840j63459A04901a88001
$$ 298231 18928 19707 -45009 -27876 126576 246886 38407 -242840 -406299 104901 -188001
18964G0778e9382B2239P1926a25885A15408d25283F1225a99493O5166b9398j97533
$$ 70778 -59382 22239 94165 -125885 115408 -425283 61225 -199493 -134327 -29398 -226931
18953b26931a7439j06310l22249C20601d106B17185b7616G3877b95775a6527A01949
$$ -226931 -17439 -123749 -445998 320601 -4106 217185 -27616 73877 -295775 -16527 101949
18941a56448A1227M04811a3957k69578b5932C5484b39470a3711j8709j11743o9340
$$ -156448 11227 416038 -13957 -283535 -25932 35484 -239470 -13711 -32420 -144163 -213503
18930b13503d8206g203D285e4169A52420Q673a46614I847k798a24761k5279q773
$$ -213503 -48206 -7203 4285 -54169 152420 161093 -146614 9847 7049 -124761 -150040 -158813
18918a58813M1097b2673m6157E760c64672A91892b39008n5421H3309a24550A16154
$$ -158813 -117716 -22673 -68830 5760 -364672 191892 -239008 -294429 83309 -124550 116154
18906c0015q4446A93008L8537A1745J46568C1268i1056C0841A743b35353D2296
$$ -30015 -114461 193008 231545 11745 158313 31268 -91056 30841 1743 -235353 42296
18894H3891c8019A7677J07127O9709b62154f0268b2018j16563O8399j36831B0495
$$ 83891 -38019 17677 124804 194513 -262154 -60268 -22018 -138581 -70182 -207013 20495
18882A89956j8532b23329j8158h0863q7261A26346b98996B08561b17092j33705
$$ 189956 171424 -223329 -241487 -80863 -168124 126346 -298996 208561 -217092 -350797
18872c50797B16699c77474G9558b0064l03676A65443a13003e1941A79858j2999
$$ -350797 216699 -377474 79558 -20064 -323740 165443 -113003 -51941 179858 166859
18862A66859B2032a03854B56484I3181b44225c3641j01246A47021a38391A92005
$$ 166859 22032 -103854 256484 93181 -244225 -33641 -134887 147021 -138391 192005
18851a48354A13315i6195I5690d32551a66081D7944a19447e9380m3172F6103L4760
$$ -148354 113315 -96195 95690 -432551 -166081 47944 -119447 -59380 -102552 66103 100863
18840A00863e1449k9224B56843c04295D4637b55814j4223J25333I6831K17432
$$ 100863 -51449 -80673 256843 -304295 44637 -255814 -270037 -144704 96831 314263
18830C14263E8215a79638A8872K76908I3645l0147b3847p5159B3790c18466e5120
$$ 314263 58215 -179638 18872 295780 93645 63498 -23847 -99006 23790 -318466 -55120
18818B75244B1001I31K67115a02417B11607a330j29047A18973J1828f277A83248
$$ 275244 21001 931 268046 -102417 211607 -1330 -130377 118973 130801 -6277 183248
18806C98656j86790a60302b4361p0967B12847q6859a82574A55747b14407i4648
$$ 398656 211866 -160302 -24361 -95328 212847 125988 -182574 155747 -214407 -94648
18795A7851b9831l31278I1965K4320D0577Q8559a48267A64045b64834a19843M5988
$$ 17851 -29831 -361109 91965 116285 40577 129136 -148267 164045 -264834 -119843 -73855
18784g3855k68879J30009i0849F0055i0567F263a06108L2970B8011N9061l4670
$$ -73855 -342734 -212725 -90849 60055 -90567 6263 -106108 -73138 28011 87072 52402
18773E2402b77911C6334B263c3518p4295K5885j56472B5171J572K45866b56132
$$ 52402 -277911 36334 2263 -33518 -107813 -81928 -238400 25171 26743 272609 -256132
18761E2532a74718K7259K6994j58031F1674a41307f1163a2179k03310A22135O5978
$$ 52532 -174718 -147459 -120465 -278496 61674 -141307 -61163 -12179 -215489 122135 188113
18750A88113a63640k6431E02875b22938j8300A4538M472d3036A71165J6719e2031
$$ 188113 -163640 -190071 502875 -222938 -241238 14538 19010 -43036 171165 187884 -52031
18738c13066a05794n0650j8649D4227e5840k3086j71857l132H2545M8476b52859
$$ -313066 -105794 -156444 -175093 44227 -55840 -78926 -250783 -253915 82545 131021 -252859
18726h8609j69844a05557j07516g8812j178p1804B17787l6030J88399A13238D1817
$$ -88609 -258453 -105557 -213073 -78812 -79990 -151794 217787 181757 370156 113238 41817
18714b1610m72046a86124B7779o556a89269B79488g6813A70638A5541h1146A17864
$$ -21610 -493656 -186124 27779 21223 -189269 279488 -76813 170638 15541 -81146 117864
18702d0834j90887Q3123M7623k17982a0566C8424a13886j18329B77403c34601
$$ -40834 -231721 -148598 -100975 -318957 -10566 38424 -113886 -232215 277403 -334601
18691I468L4173g0691j21061E6062e0517q4947K5771j42866j8580C7933e4756
$$ 9468 43641 -70691 -191752 56062 -50517 -135464 -109693 -252559 -271139 37933 -54756
18679H0461a30810G3615a81582a0320A23523B909c3015E0448g1021C73120e8674
$$ 80461 -130810 73615 -181582 -10320 123523 2909 -33015 50448 -71021 373120 -58674
18667A61795b25599F9497J09405a8239l79938H8758A6171R3557a25217p0421e6068
$$ 161795 -225599 69497 178902 -18239 -398177 88758 16171 109728 -125217 -195638 -56068
18655a92984e0142q9116L4626o1002j07439a29646b1884j51998d2619j12687M2824
$$ -192984 -50142 -139258 -104632 -165634 -273073 -129646 -21884 -173882 -42619 -155306 -112482
18644a12482N3833A95275O5114b13967C29837A35271a15083k73211c0230B2832
$$ -112482 -58649 195275 260389 -213967 329837 135271 -115083 -388294 -30230 22832
18633B23939G8904d12805A46356a43300D9486a99745C17200b93144F5545a71300
$$ 223939 78904 -412805 146356 -143300 49486 -199745 317200 -293144 65545 -171300
18622b13286P624A56356i6634j03626d1908A71068p4747b06558A78273A1265g8381
$$ -213286 -205662 156356 -96634 -200260 -41908 171068 96321 -206558 178273 11265 -78381
18610a14303M6590j5849e33r7327M548n1932k74925g1751A92134b09817J02281
$$ -114303 -67713 -83562 -533 -97860 -93312 -145244 -420169 -71751 192134 -209817 -107536
18599a07536L6755j15958A64989c27011A52273Q2223N1775b7231B4928j789d08148
$$ -107536 -70781 -186739 164989 -327011 152273 234496 286271 -27231 24928 23139 -408148
18587A60121D3754a93143L1779C5298L4842J02953b24502a2724m2572k47977e2077
$$ 160121 43754 -193143 -161364 35298 70140 173093 -224502 -12724 -55296 -303273 -52077
18575a65019B35654A09640b20169j1610N4188A49531f22A14207o554a81481N6047
$$ -165019 235654 109640 -220169 -231779 -177591 149531 -622 114207 107653 -181481 -125434
18564a25434A16073C7462h5779J8813F6583I874C134b02099k6770c0200A06231
$$ -125434 116073 37462 -85779 -66966 66583 9874 3134 -202099 -228869 -30200 106231
18552H4270a75964O0798B9313a86031F9249i7577B09146J1305b57036A61514a59102
$$ 84270 -175964 -115166 29313 -186031 69249 -97577 209146 220451 -257036 161514 -159102
18540b74979G5290Q7802a29911H8910a09349n1193A15847c57604f7167n0389o7311
$$ -274979 75290 163092 -129911 88910 -109349 -160542 115847 -357604 -67167 -117556 -184867
18529a84867D0374J27806f9291j64732I8907l0098e7886A03438b33913C527a14968
$$ -184867 40374 168180 -69291 -234023 98907 68809 -57886 103438 -233913 3527 -114968
18517A82424b38057f7391K1170k9228q0531k4828B27738I5515a958j1137l9995
$$ 182424 -238057 -67391 -46221 -75449 -155980 -180808 227738 95515 -1958 -13095 -53090
18506e3090k28352e1036J4988A8563f4604L0915l4236k94653B78862M9950A49774
$$ -53090 -281442 -51036 -36048 18563 -64604 -33689 -67925 -362578 278862 328812 149774
18494a72880e4884j81724A68992b17328d7316j00004j23521Q5800L7861I4630
$$ -172880 -54884 -236608 168992 -217328 -47316 -147320 -270841 -185041 -147180 94630
18483b45369G3685i9834j94108j6200G7300a97361A84533F4009j8776c2443c412
$$ -245369 73685 -99834 -293942 -310142 77300 -197361 184533 64009 45233 -32443 -3412
18471b14281C3738a1882C99094a35314r736A31029f7877c2611j07049e9047J2290
$$ -214281 33738 -11882 399094 -135314 -145050 131029 -67877 -32611 -139660 -59047 -46757
18460d6757E9105d1795C1035a64173a0781A66101B5031b66005R0866D011M48J47146
$$ -46757 59105 -41795 31035 -164173 -10781 166101 25031 -266005 -175139 4011 4459 151605
18448A51605o7625J27768j9099a85656I8007a49077N1299A03508f2617k37155
$$ 151605 83980 211748 192649 -185656 98007 -149077 -97778 103508 -62617 -299772
18438b99772g9557m1875k00239a8759A1955P0139e8432m5911j68036K0494J14458
$$ -299772 -79557 -121432 -321671 -18759 11955 82094 -58432 -104343 -272379 -251885 -137427
18427a37427j8536J2309j84184A83039a57486o2669d2285k06324b419A17454a60886
$$ -137427 -155963 -143654 -327838 183039 -157486 -220155 -42285 -248609 -2419 117454 -160886
18415A73453i4851A49200a29285A17171m0568K48747A16770m3255e7230A46229
$$ 173453 -94851 149200 -129285 117171 76603 325350 116770 73515 -57230 146229
18404A15244a43171k1549A64879m3972l9558P9170A2775b8983B23146r6169g8308
$$ 115244 -143171 -164720 164879 120907 81349 160519 12775 -28983 223146 126977 -78308
18392A64705h0718n9603B2069J9487n714f46j89094H3150R736j8319a03940j0116
$$ 164705 -80718 -140321 22069 41556 35842 -646 -189740 83150 92886 74567 -103940 -114056
18380a14056b1046j15902G1452J12955b0552j97609k0129C0804a40681K8463b8858
$$ -114056 -21046 -136948 71452 184407 -20552 -218161 -238290 30804 -140681 -112218 -28858
18368b56801f8694C4728a84834A45237d5297n4641r3022A89648L630b50410D3775
$$ -256801 -68694 34728 -184834 145237 -45297 -99938 -192960 189648 193278 -250410 43775
18356A42200c8335F6105e7682r0163M8844j57892g055K316q2713a5371k19328
$$ 142200 -38335 66105 -57682 -147845 -99001 -256893 -7055 -4739 -87452 -15371 -234699
18345b34699e3711l7132L1665j09867q5461J01922A6767f2364l0474r2107O5492
$$ -234699 -53711 -90843 -59178 -169045 -254506 -152584 16767 -62364 -92838 -184945 -119453
18334a19453A06230C2678C257c4639l6871B30396b92671E7508P52J9813Q8208
$$ -119453 106230 32678 3257 -34639 -71510 230396 -292671 57508 58260 78073 166281
18323A66281G542L108a62367l1853e3063A88916c11149g8072k00002K2018A32853
$$ 166281 7542 10650 -162367 -194220 -53063 188916 -311149 -78072 -278074 -256056 132853
18311e8844A38516j6492b66424B2256L3402K59449a17687j163C23179A57961a08264
$$ -58844 138516 122024 -266424 22256 55658 315107 -117687 -118850 323179 157961 -108264
18299A55870h9485k2448A91998J35966B4437L8503j8798M3557a34564A6927O1528
$$ 155870 -89485 -111933 191998 327964 24437 62940 44142 87699 -134564 16927 78455
18288G8455c9154j5457k07146A46520a10561M7301B71864O7272c15417F0586J59557
$$ 78455 -39154 -54611 -261757 146520 -110561 -63260 271864 339136 -315417 60586 220143
18277B20143b078H1155J41651H5156a30468N0575A64700a10743L2469k11349a40926
$$ 220143 -2078 81155 222806 85156 -130468 -79893 164700 -110743 -78274 -289623 -140926
18265A88949b53020a16343l6385A53971a7481F954a01411k10659A41787C9031
$$ 188949 -253020 -116343 -152728 153971 -17481 6954 -101411 -312070 141787 39031
18254D5232b12414A44721a18844A84307l2114a91152b5174A08093d22122A279
$$ 45232 -212414 144721 -118844 184307 152193 -191152 -25174 108093 -422122 1279
18243d36886a78963C89842A72665J90115a36702L6838j01545A08886Q9226b46258
$$ -436886 -178963 389842 172665 362780 -136702 -99864 -201409 108886 198112 -246258
18232I4756a02834k17047a30987B25264d2355q3817q5034B0733g4488K3719a0284
$$ 94756 -102834 -319881 -130987 225264 -42355 -126172 -211206 20733 -74488 -50769 -10284
18220c02599g5099I4594l8305A6601L01376h4876j54146d5934j08531j87476A00431
$$ -302599 -75099 94594 56289 16601 317977 -84876 -239022 -45934 -154465 -341941 100431
18208a51408q1727n9700B48636a94175I7483L0707J27537C8188L97346j60955
$$ -151408 -233135 -292835 248636 -194175 97483 128190 255727 38188 435534 274579
18198B74579a32039n46j36002N2852A84438F553M1052b84604A7930b05512n787
$$ 274579 -132039 -132585 -268587 -215735 184438 6553 47605 -284604 17930 -205512 -211299
18187b11299E9731e1332E2025a93201N1656f8134j03839r823G9560b9779k2586
$$ -211299 59731 -51332 52025 -193201 -141545 -68134 -171973 -181796 79560 -29779 -52365
18176e2365k65677c6032C42338d841k55140C16401b41520B2670O5360p939J86266
$$ -52365 -318042 -36032 342338 -4841 -259981 316401 -241520 22670 88030 80091 266357
18165B66357a10937J7070J9048a6129A26537a3199k71282C18a17110j72687b1956
$$ 266357 -110937 -93867 -74819 -16129 126537 -13199 -284481 318 -117110 -289797 -21956
18153b84254A18264D397b78948a25650A76404a4665m6266A24294J94601D7488
$$ -284254 118264 4397 -278948 -125650 176404 -14665 -60931 124294 318895 47488
18142A77883J53449d00845c6609A19942b38558j01143J65489O8544H0313P5378
$$ 177883 331332 -400845 -36609 119942 -238558 -339701 -174212 -105668 80313 155691
18132A55691a08208n1023j8616E0461f3462j03593b5842m4976A1311i1808K25
$$ 155691 -108208 -159231 -177847 50461 -63462 -167055 -25842 -70818 11311 -91808 -91583
18121i1583f123A80563b32593G2668J76273d9954k8624C06121a08961j64243G8259
$$ -91583 -6123 180563 -232593 72668 248941 -49954 -78578 306121 -108961 -273204 78259
18109c2134J5013A37402m4216a70641f4230B36681F4203J46597c8045a5112A69939
$$ -32134 -17121 137402 93186 -170641 -64230 236681 64203 210800 -38045 -15112 169939
18097C7982j4136j799d3739l0656m1366k4112E6800Q1394l3659a72906H8668h0017
$$ 37982 23846 22047 -43739 -74395 -115761 -139873 56800 138194 104535 -172906 88668 -80017
18084c7939l49416B15000H6782j183M7693a48373N1862j30114d808j32649J733
$$ -37939 -387355 215000 86782 85599 133292 -148373 -96511 -226625 -4808 -137457 -135724
18073a35724G526K20108B1669A0244a48276j75039P7945B31610h6377j83940d0088
$$ -135724 7526 227634 21669 10244 -148276 -323315 -245370 231610 -86377 -270317 -40088
18061A08713c4496A91494e4394A47671G0692F400Q2819b1450m5922a6319A50597
$$ 108713 -34496 191494 -54394 147671 70692 6400 89219 -21450 -67372 -16319 150597
18049A22738R630l2766B9899M9769A7289a11933A26493h4184p3208j1332A60408
$$ 122738 132368 99602 29899 79668 17289 -111933 126493 -84184 -157392 -168724 160408
18037a71176e844A97929e154B07358r4446a38910c6582A65839b61039J23261j70630
$$ -171176 -5844 197929 -5154 207358 112912 -138910 -36582 165839 -261039 -137778 -308408
18026c08408J00226B22613E8917b0013B98952F676c39511B37818C8629r302R961
$$ -308408 -208182 222613 58917 -20013 298952 6676 -339511 237818 38629 29327 39288
18015C9288J28265p3928J55548a31755D7869a66454P6749j80197I3583f6022A65412
$$ 39288 167553 93625 249173 -131755 47869 -166454 -89705 -269902 93583 -66022 165412
18003a01720k00493P2555A37228D7240a27943G1390a13091j36839a15337E8462
$$ -101720 -302213 -229658 137228 47240 -127943 71390 -113091 -249930 -115337 58462
17992F8018J55356a33950d7113k57897F9549J70516b63897c4096A02684b6217
$$ 68018 223374 -133950 -47113 -305010 69549 240065 -263897 -34096 102684 -26217
17981b11026A64425a3623r5240D4f7265j94024J13530A16144D1706K3287a02416
$$ -211026 164425 -13623 -108863 44 -67265 -261289 -147759 116144 41706 64993 -102416
17969A13257c41063J49493R2133k2740A79198B3457i3694H4722J6220A4799J58838
$$ 113257 -341063 -191570 -99437 -122177 179198 23457 -93694 84722 100942 14799 173637
17958A73637h3474D5754J99133C8211b44124L4924e0032A44798P7929b5889A6369
$$ 173637 -83474 45754 244887 38211 -244124 -209200 -50032 144798 222727 -25889 16369
17946E0912L08938D5096Q2419e374k57799A3519f4977B3755a95648C6550R5790
$$ 50912 359850 45096 127515 -5374 -263173 13519 -64977 23755 -195648 36550 132340
17935A32340a96341B1962O9603L2130J82783b5847F6644a60308f7242C340a29644
$$ 132340 -196341 21962 91565 123695 306478 -25847 66644 -160308 -67242 3340 -129644
17923a91034H4335b3873n0099l44026A84338a51069j74197c8684k2599A91079
$$ -191034 84335 -23873 -73972 -417998 184338 -151069 -325266 -38684 -61283 191079
17912A66668i6032A40664b59848Q5495M7648C0372i5097k10581J27553r5538j1557
$$ 166668 -96032 140664 -259848 -174353 -126705 30372 -95097 -305678 -178125 -273663 -285220
17901b85220c7805j05478J8663J8088H275Q2269i779C42444g7210L2060I5627
$$ -285220 -37805 -143283 -124620 -106532 8275 90544 -9779 342444 -77210 -45150 95627
17889a58719M2019I3873j365O0795P7361A14241n6821N1745J1999M4379a01371
$$ -158719 -116700 93873 92508 153303 230664 114241 57420 109165 121164 165543 -101371
17877b04288i5258o8365A66484a31756B4713a12181B33872b848A64747b2348C16169
$$ -204288 -95258 -163623 166484 -131756 24713 -112181 233872 -2848 164747 -22348 316169
17865b32068A77906E3198c25731E8811g0131j66432C9336a22222B5702L1705J14398
$$ -232068 177906 53198 -325731 58811 -70131 -236563 39336 -122222 25702 57407 171805
17854A71805J43825A1612J22469Q1405c5158A39053l3159M8379a8420D30936g6988
$$ 171805 315630 11612 134081 215486 -35158 139053 105894 154273 -18420 430936 -76988
17842E9393J8665c2579B42160Q697B6244b34368B13408a20722A03313a69494O2686
$$ 59393 78058 -32579 242160 250857 26244 -234368 213408 -120722 103313 -169494 -106808
17831a06808b798A37810j4736N310J49954B3638N801h0520B35551a52610H7314
$$ -106808 -2798 137810 123074 128384 278338 23638 29439 -80520 235551 -152610 87314
17819a52189A44837a9680j16282l52037d505C08519D9275a44611j3597A47653
$$ -152189 144837 -19680 -135962 -487999 -4505 308519 49275 -144611 -158208 147653
17808A67444c8236b413p327r4823B73251a9077I3739a8453l46637A04971c9629
$$ 167444 -38236 -2413 -9740 -104563 273251 -19077 93739 -18453 -365090 104971 -39629
17796a68853I9207K3260J32425h303j05919A27026h46j16276d5000p9251A17673
$$ -168853 99207 122467 254892 -8303 -114222 127026 -846 -117122 -45000 -124251 117673
17784a53649J4081l8834A27177J68285a31187k0018D10974k02106G8072K58174
$$ -153649 -139568 -178402 127177 295462 -131187 -151205 410974 208868 78072 336246
17774C36246A659L9803l110b42524D13727b48948A85606b9662j20984f7866C39705
$$ 336246 1659 41462 38352 -242524 413727 -248948 185606 -29662 -150646 -67866 339705
17762i3372C6834M8274i0385l7193B73024D9078a15994D3009J40555G8192a09631
$$ -93372 36834 85108 -90385 -127578 273024 49078 -115994 43009 183564 78192 -109631
17750i6464A73779q4153b05304A32947a74873E1443a29500e9498I8932l4256J77511
$$ -96464 173779 89626 -205304 132947 -174873 51443 -129500 -59498 98932 64676 242187
17739B42187d8445G1886O9314a56656G827i9026I1917K17691c49229f2219B36521
$$ 242187 -48445 71886 141200 -156656 7827 -99026 91917 309608 -349229 -62219 236521
17727A4567b0751D76831A23640d9349D6056J1665m932A7603J05805C3577O685
$$ 14567 -20751 476831 123640 -49349 46056 57721 52789 17603 123408 33577 40262
17716D0262L98195h6917K592B9045a48381A27690b9654B53452C0646N1681R7390
$$ 40262 438457 -86917 -84325 29045 -148381 127690 -29654 253452 30646 82327 179717
17705A79717B2270e7074k99892f0802K3662G3562a28464H6524J97232m0551i4329
$$ 179717 22270 -57074 -356966 -60802 -37140 73562 -128464 86524 283756 243205 -94329
17693A09769P5084a87761B48248D2711L6812a5183p4237A1616C048R2202J49467
$$ 109769 184853 -187761 248248 42711 79523 -15183 -89420 11616 3048 95250 244717
17682B44717G845K8970Q0931n0841j0099K30146A22893b23350A53977k8656K44089
$$ 244717 7845 36815 117746 66905 56806 286952 122893 -223350 153977 125321 369410
17671C69410j01653a41872A52872a00217J1076j16928R9318B66439b70944b3484
$$ 369410 267757 -141872 152872 -100217 -89141 -206069 -106751 266439 -270944 -23484
17660A3554M6274J98808o8991K59282a4154k14986H5857N4826a32235A59532J68197
$$ 13554 59828 258636 189645 448927 -14154 -229140 85857 140683 -132235 159532 327729
17649C27729A43578b34918A12568N5044K8744E6390h6963g840j14585I7563A3160
$$ 327729 143578 -234918 112568 167612 196356 56390 -86963 -7840 -122425 97563 13160
17637H1744M2270b3792A36317a07477M063C37199D3361P9036b70358J33044C7741
$$ 81744 124014 -23792 136317 -107477 -103414 337199 43361 122397 -270358 -137314 37741
17625a054j78898a4276j29595E3314J18419a39637A12157P4968a8005m7842B41820
$$ -1054 -179952 -14276 -143871 53314 171733 -139637 112157 187125 -18005 -65847 241820
17613A25925P3456a40809B54243l6113P81J52711r0549K39788B3004J8153a12066
$$ 125925 199381 -140809 254243 218130 218911 371622 281073 520861 23004 41157 -112066
17601F1957R2427f5492H7037a64679B12929E6437d1606l6742K6796A94563c2638
$$ 61957 154384 -65492 87037 -164679 212929 56437 -41606 -78348 -51552 194563 -32638
17589A06702l532J12025r5952k3899K9789J78913c8488k51330m6243F9859d1021
$$ 106702 103170 215195 119243 95344 125133 304046 -38488 -289818 -336061 69859 -41021
17577A82365B1596O9979K8376j6050L3832J84333I0558P6199B5791J56431a27146
$$ 182365 21596 91575 119951 103901 137733 322066 90558 166757 25791 182222 -127146
17565A0317b99053A14153J01334O0928G779d8579A40867d5842k2959C0612a736
$$ 10317 -299053 114153 215487 276415 7779 -48579 140867 -45842 -68801 30612 -1736
17553F6765J17983m2289l4210J36232A7728J50097a76515e6875l0297D6611f3163
$$ 66765 184748 142459 108249 244481 17728 167825 -176515 -56875 -87172 46611 -63163
17541B85740F531L1626J35643N7114B4324L09411I4207a04792C21577b09899F3008
$$ 285740 6531 38157 173800 230914 24324 333735 94207 -104792 321577 -209899 63008
17529B84122A05117k9594C2752a81702b6977J0687B54951K10417J88630k51617
$$ 284122 105117 75523 32752 -181702 -26977 -16290 254951 465368 653998 402381
17519D02381j27933J20595o2739a3207k5726m7764E819J44307a2235j35866A66707
$$ 402381 274448 395043 332304 -13207 -38933 -86697 5819 150126 -12235 -148101 166707
17507A52100M7248K84K24320A44930l1512J21668I0772J18197K91353a03411A81484
$$ 152100 199348 199632 423952 144930 113418 235086 90772 208969 500322 -103411 181484
17495h2339J2911C44483j46877a12219C76205e6194C66819J1919A09788j6601
$$ -82339 -69428 344483 197606 -112219 376205 -56194 366819 378738 109788 93187
17485I3187J6216B1654a35579C2151P1931J10106a3745C38820D0016K12700j5644
$$ 93187 109403 21654 -135579 32151 104082 214188 -13745 338820 40016 252716 237072
17474B37072A13393a23798B14350p7028J4755m3949K0440K61408B2130J73095
$$ 237072 113393 -123798 214350 137322 152077 108128 128568 389976 22130 195225
17464A95225J70164A9879J04642a15694B60322p5070F6071A9634p485d4955A73991
$$ 195225 365389 19879 124521 -115694 260322 185252 66071 19634 12149 -44955 173991
17452B4059L78559j05669j19146N9023o2985K396J82792J79575A88770K636k3461
$$ 24059 402618 296949 177803 236826 173841 176237 359029 538604 188770 191406 167945
17441A67945J20125j37500J390a30569B23223p7371k4055B8461K77231K6224a43030
$$ 167945 288070 150570 151960 -130569 223223 145852 121797 28461 305692 331916 -143030
17429B14042J18719j35660M1503J62318f9945B96333A4798a574p5203C66950p396
$$ 214042 332761 197101 238604 400922 -69945 296333 14798 -1574 -76777 366950 359554
17418C59554A46334N0245B2913P59J30546K73659E2351J40747j6754m6207O741
$$ 359554 146334 196579 22913 23672 154218 427877 52351 193098 176344 130137 136878
17407A36878J38081n3498R1108f0990K6746o9098A38269a24531n5645E7677a10699
$$ 136878 274959 221461 312569 -60990 -34244 -103342 138269 -124531 -180176 57677 -110699
17395A66542E811e0546D29042j86972J24519A13570K2392P3744k3992F9802J07028
$$ 166542 5811 -50546 429042 242070 366589 113570 135962 209706 185714 69802 176830
17384A76830R6292J40524A19007b5853l3196o7212B01867q3834L49662A32573
$$ 176830 273122 413646 119007 -25853 -59049 -126261 201867 118033 467695 132573
17373c7817D2200N572K83230I2708J02309F2435J51996K40229A48655b5577A63988
$$ -37817 42200 47772 331002 92708 195017 62435 214431 454660 148655 -25577 163988
17361B77291a83685d4417A25584A141J91627a00900A5923h7563C00016g9685j602
$$ 277291 -183685 -44417 125584 1141 192768 -100900 15923 -87563 300016 -79685 -81287
17350h1287I9119l9309J28861o0703J05305A03463f6711B07529b8005k1783o0467
$$ -81287 99119 59810 188671 127968 233273 103463 -66711 207529 -28005 -49788 -110255
17339a10255C62036a3633B25355l9095a53556A34760G071b0753D57887h8883A58648
$$ -110255 362036 -13633 225355 186260 -153556 134760 7071 -20753 457887 -88883 158648
17327a5878C42248A13592i702C3583J73345J00657a12106B49140H8486b61288
$$ -15878 342248 113592 -9702 33583 206928 307585 -112106 249140 88486 -261288
17316B52320q4579K02574j50748r5587E6020a13562L4959A84430f893A17700K56124
$$ 252320 167741 370315 219567 123980 56020 -113562 -78603 184430 -6893 117700 373824
17305C73824j01903h756F2446K01956q221P2565I7346K29752o9570h4140B96045
$$ 373824 271921 -8756 62446 264402 256181 328746 97346 327098 257528 -84140 296045
17293B77736n5355a5054B20707n9678J47321o5476R9251a39909C34047A55581
$$ 277736 222381 -15054 220707 161029 308350 242874 342125 -139909 334047 155581
17282C02964j17011O8491c5589C2583L5805K05506j3517a8830k5671C33469i7460
$$ 302964 185953 254444 -35589 32583 68388 273894 260377 -18830 -44501 333469 -97460
17270B25054J17084a35709B78157j04483J77303A33909M5664Q6933I862k912K32166
$$ 225054 342138 -135709 278157 173674 350977 133909 179573 266506 9862 6950 239116
17259B39116O2882A4566J54763J70942M2215C9258M08535B02878K72149I3210
$$ 239116 301998 14566 169329 340271 382486 39258 447793 202878 475027 93210
17248C118N63171A76331j5818J00144b12794A2906J84550J99526I1753L16190
$$ 3118 566289 176331 160513 260657 -212794 12906 197456 396982 91753 407943
17238D07943j68399o7221p6512J80995p3483q9188Q1239K38068J22547G9574J50322
$$ 407943 239544 172323 95811 276806 203323 114135 195374 433442 555989 79574 229896
17227B29896P9394k7306j40027h8836A52119K4284p1880J57276J01082J33077
$$ 229896 309290 281984 141957 -88836 152119 176403 104523 261799 362881 495958
17217D95958B9477Q5809P0269N3692J8234o2771K12251j43424n3681j04754J25387
$$ 495958 29477 115286 185555 239247 257481 194710 406961 263537 209856 105102 230489
17206B30489n7672l7929a34535A50780k9816r78C7329K96160G3301K19211k5732
$$ 230489 172817 134888 -134535 150780 120964 119986 37329 333489 73301 292512 266780
17195B66780c833C5281L06035j30311D0925N90918C06236N5012A73445J70933
$$ 266780 -3833 35281 341316 211005 40925 631843 306236 361248 173445 344378
17185C44378j03111J31344j71478J58119j17841q1789n0809J74922E4863N03975
$$ 344378 241267 372611 201133 359252 241411 159622 108813 283735 54863 558838
17175E58838j81371q6044J13615J68878B55005j22679J64206J64357I0984M53725
$$ 558838 377467 291423 405038 573916 255005 132326 296532 460889 90984 544709
17165E44709j61825n9315A35394q584J25108J03204j25753p0460D3114L76770
$$ 544709 382884 323569 135394 126810 251918 355122 229369 158909 43114 419884
17155D19884R3979B14971N4689o3531J30055A54604J5613K64359j93753O9595
$$ 419884 513863 214971 269660 206129 336184 154604 170217 434576 240823 310418
17145C10418K17944j69915j41495P8890r75L05229k42614J50384A87027K51932
$$ 310418 528362 358447 216952 295842 294867 600096 357482 507866 187027 438959
17135D38959j42528M46557B80511R9840L9144A65614N5480o6055N60533C01034
$$ 438959 296431 742988 280511 380351 419495 165614 221094 155039 715572 301034
17124C18779j23701K49407b2803D15973j84031R0369J42305c2217B70038J03333
$$ 318779 195078 444485 -22803 415973 231942 322311 464616 -32217 270038 373371
17114C73371I9453M31941j32909o3277l0028L91180C32685p02J06160o3791J80581
$$ 373371 99453 531394 398485 335208 305180 696360 332685 331983 438143 374352 554933
17103E54933j79841A75604M32394B63261r0162J78448Q7435p9733m7663J66984
$$ 554933 375092 175604 607998 263261 173099 351547 438982 359249 311586 478570
17093D78570J37093j80719j18536L39388k10079J4674j68715l5315J94560A03426
$$ 478570 615663 434944 316408 655796 445717 460391 291676 256361 450921 103426
17082B60484J92039M898p7962K8j44111J58496K57413k15857p1809K11072A72918
$$ 260484 452523 457421 379459 379487 235376 393872 651285 435428 363619 574691 172918
17070D35339P7445J43040j81859k1383q6173K23837N2862k43994o0319J94300
$$ 435339 512784 655824 473965 452582 366409 590246 643108 399114 338795 533095
17060E33095J04308k3693l6020r3156K8060j3251K99464l26253k2267J86854o7599
$$ 533095 637403 613710 577690 484534 512594 499343 798807 472554 450287 637141 569542
17049E69542k63866J27592J16212J19085j92146N5662o4358L80455l38174r99
$$ 569542 305676 433268 549480 668565 476419 532081 467723 848178 510004 509005
17039E09005M14473k30973M3641K7863o2757B23332N02148J12098j92498j42111
$$ 509005 923478 692505 736146 764009 701252 223332 725480 837578 645080 502969
17029E02969L41840l24260K27505j60219R7719K11765k20194J17108N09002F47607
$$ 502969 844809 520549 748054 587835 685554 897319 677125 794233 1303235 647607
17018G05836O1526k67393J69141j33577M3756J21978O3197j21460J65037M2907
$$ 705836 767362 499969 669110 535533 579289 701267 764464 643004 808041 850948
17008H50948k2647j09090o0040K7160l24025M07444q6769M7232O08579n38765
$$ 850948 828301 719211 659171 686331 362306 769750 682981 730213 1338792 800027
16998H00027J78956l02601K85507l70282J58587P7733k0138C91301M00860M2173
$$ 800027 978983 676382 961889 591607 750194 827927 807789 391301 792161 834334
16988H34334k60613K08564p6749k5808M8484J35286P0583j09675J28123j64946
$$ 834334 573721 782285 705536 679728 728212 863498 934081 824406 952529 787583
16978G87583J50436q6948J49123k08450R9168k52623K87668J15847N0473j62544
$$ 787583 938019 851071 1000194 791744 890912 638289 925957 1041804 1092277 929733
16968I29733J05650m8312l83181K93200K85395k32469J57916k02412l7605N2070
$$ 929733 1035383 987071 603890 897090 1182485 950016 1107932 905520 867915 919985
16958I19985n6779O0190L74892p6254K68329n27018J38832q4990p1404O3482J17856
$$ 919985 863206 923396 1298288 1222034 1490363 963345 1102177 1017187 945783 1009265 1127121
16947A127121l9864J55102j89279K12365k92646L41189k2187n4141K3882N05625
$$ 1127121 1087257 1242359 1053080 1265445 972799 1313988 1291801 1237660 1261542 1767167
16937A767167l32726q6278j025J0330o1575j16939O16803m24270K24987n00081
$$ 1767167 1434441 1348163 1347138 1357468 1295893 1178954 1795757 1371487 1596474 1096393
16927A096393K58574K73089K5574o70m00399L25858J80190l075j94117O9816m9666
$$ 1096393 1354967 1628056 1653630 1652960 1252561 1578419 1758609 1755534 1561417 1631233 1581567
16916A581567n2423M62962k70657j53634M99147k78709J99464N4149l17801j5942
$$ 1581567 1529144 1992106 1721449 1567815 2066962 1788253 1987717 2041866 1724065 1708123
16906A708123J47437Q0741K23109j56578Q7962l6022l03309M57147j8963l94284
$$ 1708123 1855560 1936301 2159410 2002832 2090794 2054772 1751463 2208610 2189647 1795363
16896A795363N25003J431J19452j38667j58288J69705L97954l49621L46138l46241
$$ 1795363 2320366 2321797 2441249 2302582 2144294 2313999 2711953 2362332 2708470 2362229
16886B362229R1033J36422j49920j97999L84378K4269j03894J35765L3432K42971
$$ 2362229 2453262 2589684 2439764 2241765 2626143 2650412 2546518 2682283 2715715 2958686
16876B958686r8772j8367q0684J41414J10392K89187J06649j91724j13393K55757
$$ 2958686 2859914 2841547 2760863 2902277 3012669 3301856 3408505 3216781 3103388 3359145
16866C359145r1030M4829M02316l41433j39159M01403n216P8847m8652K7713J88239
$$ 3359145 3268115 3312944 3715260 3373827 3234668 3636071 3630855 3709702 3661050 3688763 3877002
16855C877002J59355j47474k729M91338M9307J98168j05046M75982l10266J48731
$$ 3877002 4036357 3888883 3886154 4377492 4426799 4624967 4519921 4995903 4685637 4834368
16845D834368r6113M72686k88015p5369N40858k19494K30947K43757q1859j27628
$$ 4834368 4738255 5210941 4922926 4847557 5388415 5168921 5399868 5643625 5561766 5434138
16835E434138K00997M78657J1695N6395J15780m0008L65321p6080M06962K39405
$$ 5434138 5635135 6113792 6125487 6181882 6297662 6257654 6622975 6546895 6953857 7193262
16825G193262P4292n2032M15226J99067J74561J32552K88831m0289N96292L5303
$$ 7193262 7267554 7215522 7630748 7829815 8004376 8136928 8425759 8385470 8981762 9017065
16815I017065M25308l45746M18966R7454N82638L22912k3157L98005K68928L16735
$$ 9017065 9442373 9096627 9515593 9613047 10195685 10518597 10495440 10893445 11162373 11479108
16805A1479108N18268R1493M7861M87953L41919N38196K43Q23251M27741K0946
$$ 11479108 11997376 12088869 12136730 12624683 12966602 13504798 13505041 14328292 14756033 14776979
16795A4776979L91676P81825O27682L96708O66167L86032M05728Q53881N66285
$$ 14776979 15168655 15950480 16578162 16974870 17641037 18027069 18432797 19286678 19852963
16786A9852963Q37028P72251N41739P76133O52427O74590R40370R72053J029046
$$ 19852963 20689991 21462242 22003981 22780114 23432541 24107131 25047501 26019554 27048600
16777B7048600O21521J707899O93829J147596P14379J301804J187145J421915
$$ 27048600 27670121 29378020 30071849 31219445 31933824 33235628 34422773 35844688
16769C5844688J421104J521839J653113J529374J696903J883251J674715K055381
$$ 35844688 37265792 38787631 40440744 41970118 43667021 45550272 47224987 49280368
16761D9280368J918850K141011K175622K448925K641709K425394K151469L094182
$$ 49280368 51199218 53340229 55515851 57964776 60606485 63031879 65183348 68277530
16753F8277530K433697L079478L271584K804942L249464L092808L175591L420433
$$ 68277530 70711227 73790705 77062289 79867231 83116695 86209503 89385094 92805527
16745I2805527L198150L377187L320178K897746K997068L337372K582590K453442
$$ 92805527 96003677 99380864 102701042 105598788 108595856 111933228 114515818 116969260
16737A16969260K329504K222265J438661J995973P88985L40097O56391l03292
$$ 116969260 119298764 121521029 122959690 124955663 125744648 126084745 126741136 126437844
16729A26437844l24283r30660j420516j308555j898857j944561k489631k800536
$$ 126437844 126113561 125182901 123762385 122453830 120554973 118610412 116120781 113320245
16721A13320245k710800k900235l073449l330641k840067l408747l074012l163793
$$ 113320245 110609445 107709210 104635761 101305120 98465053 95056306 91982294 88818501
16713H8818501l261886k692326k874085l429985k791454l015715k128712k446612
$$ 88818501 85556615 82864289 79990204 76560219 73768765 70753050 68624338 66177726
16705F6177726k740106k237151k559436k556901j612305k238847j932404k007230
$$ 66177726 63437620 61200469 58641033 56084132 54471827 52232980 50300576 48293346
16697D8293346j520220j847713j580460j370485j752937j244934j317530j461143
$$ 48293346 46773126 44925413 43344953 41974468 40221531 38976597 37659067 36197924
16689C6197924j462725j086498j021174r46222j004122j052884j229508k02342
$$ 36197924 34735199 33648701 32627527 31681305 30677183 29624299 28394791 28192449
16681B8192449j224802p51909j124878k66929j102430n22057n52825q74035l65617
$$ 28192449 26967647 26215738 25090860 24823931 23721501 23199444 22646619 21772584 21406967
16672B1406967n34780q62587p30904p09158m19492l94305j91624o51995m15197
$$ 21406967 20872187 20009600 19278696 18569538 18150046 17755741 17564117 16912122 16496925
16663A6496925n98138j22936q12673j21914l06929m57981m36471l61539j52759
$$ 16496925 15898787 15775851 14963178 14841264 14534335 14076354 13639883 13278344 13125585
16654A3125585l37602n43609M9679k21441n75687k58633k94860J09601l51813
$$ 13125585 12787983 12244374 12294053 12072612 11496925 11238292 10943432 11053033 10701220
16645A0701220j85939j71792l50765j79097l55123K41677o49044p4282r4217k61367
$$ 10701220 10515281 10343489 9992724 9813627 9458504 9700181 9051137 8976855 8882638 8621271
16635H621271l54095l06310K67866p15471k1293N27697o77268m0974J08197m03150
$$ 8621271 8267176 7960866 8228732 7513261 7491968 8019665 7342397 7301423 7409620 7006470
16625G006470k14333j49532m2532j49605m37848K29403m318k32866l12470M0893
$$ 7006470 6792137 6642605 6600073 6450468 6012620 6242023 6237705 6004839 5692369 5733262
16615E733262M31064n36264J83859j44764p9268j81188n38718J68539k72473M23510
$$ 5733262 6164326 5628062 5811921 5667157 5587889 5406701 4867983 5036522 4764049 5187559
16605E187559l07168o8347j66891N3753K68268n34725K85923l74839K91587n93440
$$ 5187559 4880391 4812044 4645153 4698906 4967174 4432449 4718372 4343533 4635120 4041680
16595D041680K18542L78349m90640J9035k55057J27940o6485k24330q6989P4746
$$ 4041680 4260222 4638571 4147931 4166966 3911909 4039849 3973364 3749034 3662045 3736791
16585C736791R6464j23414P224k90390K654m8858m7869L66673k32718j38504k84132
$$ 3736791 3833255 3709841 3717065 3426675 3429329 3380471 3332602 3699275 3466557 3328053 3043921
16574C043921j61385L30233l7578L5242j8161k84664O7269J8901K87412n16784
$$ 3043921 2882536 3212769 3175191 3210433 3192272 2907608 2974877 2993778 3281190 2764406
16564B764406q0886K90098m98433P08311l87829k9678J63004r5738j57508M43494
$$ 2764406 2683520 2973618 2475185 3183496 2795667 2765989 2928993 2833255 2675747 3119241
16554C119241n68260O2560J7780p7027j19730J40460J54947l27994Q7026m0397
$$ 3119241 2550981 2613541 2631321 2554294 2434564 2575024 2729971 2401977 2489003 2448606
16544B448606l30861J73561K56198k52636P6365k33446J95851k44606M23503p5534
$$ 2448606 2117745 2291306 2547504 2294868 2371233 2137787 2333638 2089032 2512535 2437001
16534B437001m98667J32763j92845K12569M4416j27547M54342l62059M34162m91509
$$ 2437001 1938334 2071097 1878252 2090821 2135237 2007690 2462032 2099973 2534135 2042626
16524B042626L71366m70439j32369L26738n2761J75671m92365K49029l09110K44793
$$ 2042626 2413992 1943553 1811184 2137922 2085161 2260832 1768467 2017496 1708386 1953179
16514A953179J34486j53253k23169K37644l24647K74908k31760J42093N401n2509
$$ 1953179 2087665 1934412 1711243 1948887 1624240 1899148 1667388 1809481 1814882 1762373
16504A762373k9635p3568J4919j99624L81279q2496k82582M50219l10284L6543
$$ 1762373 1732738 1659170 1674089 1474465 1855744 1773248 1490666 1940885 1630601 1667144
16494A667144K273J419J03881R3466k1083o5765l24902m572Q5879k96840M15999
$$ 1667144 1669417 1670836 1774717 1868183 1847100 1781335 1456433 1451861 1537740 1240900 1656899
16483A656899k57051J10381J63254p8348n24768M49745R8786j71012j95954L30262
$$ 1656899 1399848 1510229 1673483 1595135 1070367 1520112 1618898 1447886 1251932 1582194
16473A582194k59793K86259j51083J13927M95892q65981M01341j84198M4831j1888
$$ 1582194 1322401 1608660 1457577 1571504 2067396 1201415 1602756 1418558 1463389 1451501
16463A451501r7282L7621j80528N2307j02124K42393J9734j80539L13775j11350
$$ 1451501 1354219 1391840 1211312 1263619 1161495 1403888 1423622 1243083 1556858 1445508
16453A445508l5433P3268k28161J35940j08988N2735j78719L56644l5410J15726
$$ 1445508 1410075 1483343 1255182 1391122 1282134 1334869 1156150 1512794 1477384 1593110
16443A593110m98847j4036K31647Q5588l1646K59699j98726j59679N7051J03988
$$ 1593110 1094263 1080227 1311874 1397462 1365816 1625515 1426789 1267110 1324161 1428149
16433A428149j75010L06729j95430k96250m0563K18158K74618o1645q8916j94911
$$ 1428149 1253139 1559868 1364438 1068188 1027625 1245783 1520401 1458756 1369840 1174929
16423A174929Q726K92323k51642L00248l122l29834L26895l50367L34001l87646
$$ 1174929 1183655 1475978 1224336 1524584 1521462 1191628 1518523 1168156 1502157 1114511
16413A114511M57568n61818L1001K53728N3784j10170R8926j27599K88780k79065
$$ 1114511 1572079 1010261 1041262 1294990 1348774 1238604 1337530 1209931 1498711 1219646
16403A219646N1331q4114K85798k11051J40766j94750R6902J17953j63362l34417
$$ 1219646 1270977 1186863 1472661 1261610 1402376 1207626 1304528 1422481 1259119 924702
16393I24702M37451j58637K20861l37456j21392L95969o3491j35203J31665k05075
$$ 924702 1362153 1203516 1424377 1086921 965529 1361498 1298007 1162804 1294469 1089394
16383A089394L87148r5068o6052K04368k26031k03852K49370j44975J04606L46428
$$ 1089394 1476542 1381474 1315422 1519790 1293759 1089907 1339277 1194302 1298908 1645336
16373A645336l95332K41738k59303O6075J52351k18904j53847K6396J02321q3030
$$ 1645336 1250004 1491742 1232439 1298514 1450865 1231961 1078114 1104510 1206831 1123801
16363A123801r1389L45236R8249k22323j71626L46286p7999j23607R0959k18405
$$ 1123801 1032412 1377648 1475897 1253574 1081948 1428234 1350235 1226628 1317587 1099182
16353A099182L40965l42983L00505l81477M91734l24632J27495k28967J78641
$$ 1099182 1440147 1097164 1397669 1016192 1507926 1183294 1310789 1081822 1260463
16344A260463J5047K82138l11323K17115L9604m26651L94696m02500N6077J15607
$$ 1260463 1275510 1557648 1246325 1463440 1503044 1076393 1471089 1068589 1124666 1240273
16334A240273J07975j13395N73j172M8533j61080J1579J22771l21916k44941N05962
$$ 1240273 1348248 1234853 1235426 1234254 1282787 1121707 1133286 1256057 934141 689200 1195162
16323A195162J36030l5750J69983k0184k45833j24210K9686Q1934j0057o1155
$$ 1195162 1331192 1295442 1465425 1445241 1199408 1075198 1104884 1186818 1176761 1115606
16313A115606J63971j03974n295J36574q5933J61754k19898k5097J94966j73055
$$ 1115606 1279577 1175603 1170308 1306882 1220949 1382703 1162805 1137708 1332674 1159619
16303A159619j00562M50286m67330L70093k35514o354L8658O695J46810k97255
$$ 1159619 1059057 1509343 1042013 1412106 1176592 1170238 1208896 1215591 1362401 1065146
16293A065146P1323J88521j98879L65453k56246J55232k2871k68495J39869k28800
$$ 1065146 1136469 1324990 1126111 1491564 1235318 1390550 1367679 1099184 1239053 1010253
16283A010253L80332l49571Q5583k06134L05579j10314m4977Q3835j58451M41680
$$ 1010253 1390585 1041014 1126597 920463 1226042 1115728 1070751 1154586 996135 1437815
16273A437815j74695j39047Q1623r0214j58919Q0916L06269k06914O8629j13347
$$ 1437815 1263120 1124073 1205696 1115482 956563 1037479 1343748 1136834 1205463 1092116
16263A092116p9707K43760J4709L3861k35828K54736k95153J92534R374N3757
$$ 1092116 1012409 1256169 1270878 1304739 1068911 1323647 1028494 1221028 1230402 1284159
16253A284159l67333p4229K86297n2894K39477k96614L64056p8195m5431k10568
$$ 1284159 916826 842597 1128894 1076000 1315477 1018863 1382919 1304724 1259293 1048725
16243A048725q2638k06439M36422l60274M18830j74803K47704l91806L89608n18435
$$ 1048725 966087 759648 1196070 835796 1254626 1079823 1327527 935721 1325329 806894
16233H06894K63080j50930J16789k12574M31944k30624J27945k46453L4339j41457
$$ 806894 1069974 919044 1035833 823259 1255203 1024579 1152524 906071 940410 798953
16223G98953K31161Q3351j24213k63245M66858L0160m11429K34327l43472J16071
$$ 798953 1030114 1113465 989252 726007 1192865 1223025 811596 1045923 702451 818522
16213H18522N2057M3517J13593l05778L32694J69692j00867n19010L35648M0696
$$ 818522 870579 914096 1027689 721911 1054605 1224297 1123430 604420 940068 980764
16203I80764l30988J80166M20340l69775k37070K59298j92072J47750K20197m49647
$$ 980764 649776 829942 1250282 880507 643437 902735 710663 858413 1078610 628963
16193F28963J62053k64236K25594r5262N6291J95627k67744n0316J56199p7335
$$ 628963 791016 526780 752374 657112 713403 909030 641286 590970 747169 669834
16183F69834J40319k09938O0828J57304J26573l96668q3458N8542J86080j46688
$$ 669834 810153 600215 661043 818347 944920 548252 464794 523336 709416 562728
16173E62728O2895k98134J07339L20426j59674J90640j15024o5174m406p3704
$$ 562728 625623 327489 434828 755254 595580 786220 671196 606022 601616 527912
16163E27912k8472J74593C31706K51749P572J45299C48585L63620P2151J8810
$$ 527912 499440 674033 331706 583455 591027 736326 348585 712205 784356 803166
16153H03166k15312K09724l46914J52916j70376J6647J74757J31089j20344j80141
$$ 803166 587854 797578 450664 603580 433204 449851 624608 755697 635353 455212
16143D55212J28082m4763k38054M61662B94255K04646J18536k90198J66965J11696
$$ 455212 583294 538531 300477 762139 294255 498901 617437 327239 494204 605900
16133F05900N424k70265g159C27664O4575n8473K28874k47002k3127r9136L93627
$$ 605900 611324 341059 -7159 327664 392239 333766 562640 315638 292511 193375 587002
16122E87002j51743r6326K19805j28847j38475J08546k8752L0707O8086j03871
$$ 587002 435259 338933 558738 429891 291416 399962 371210 401917 470003 366132
16112C66132K92557A30080L25315n3333j35116J55003F0234M38475A3031K11504
$$ 366132 658689 130080 455395 402062 266946 421949 60234 498709 13031 224535
16102B24535K70663J34112B64709j27369K62448q0166l9705e6528B69503P8950
$$ 224535 495198 629310 264709 137340 399788 319622 279917 -56528 269503 348453
16092C48453p5881o1617M1485J58596B00025q1322R5029J44385H7054O3126L69453
$$ 348453 272572 210955 252440 411036 200025 118703 213732 358117 87054 150180 519633
16081E19633j93902N946J25130B03274o0175J05252F494P5233L85517A23189K4722
$$ 519633 325731 331677 456807 203274 143099 248351 6494 81727 467244 123189 147911
16070A47911J39686E057K16156E8686N2715J12434j5765G6378K68887i8278A83739
$$ 147911 287597 5057 221213 58686 111401 223835 208070 76378 345265 -98278 183739
16058d4646C0206K77894m2387A20908L9768J50642E3419J12315o2866P6203a20412
$$ -44646 30206 308100 265713 120908 160676 311318 53419 165734 102868 179071 -120412
16046A26724C9907K59654r7400f2998G5614J33094l7840a4210j17310G136K11744
$$ 126724 39907 299561 202161 -62998 75614 208708 170868 -14210 -131520 7136 218880
16035B18880N1110Q3063F7833a94612I5272h5950E75750A39110p947J27970a27770
$$ 218880 269990 353053 67833 -194612 95272 -85950 575750 139110 131163 259133 -127770
16023a23877b6724B65904N8276o475l616A25790j0813c5517A40070f6530A31083
$$ -123877 -26724 265904 324180 317705 314089 125790 114977 -35517 140070 -66530 131083
16011B37581F9839a06220C23342l8588A09477L17713A31278j8271a36215B22352
$$ 237581 69839 -106220 323342 284754 109477 427190 131278 113007 -136215 222352
16000B26465O7052d8723B52410a43151M8117c7505l9988K880A07395h754C97164
$$ 226465 293517 -48723 252410 -143151 -95034 -37505 -77493 -74613 107395 -8754 397164
15988A96424J02410R0888E9312P04558j88471r8911o9637a28247B17433F5200
$$ 196424 298834 389722 59312 763870 575399 476488 406851 -128247 217433 65200
15977A77944b6474D81176A02632Q7233M068c6405j96985a1137A44225h4629F1084
$$ 177944 -26474 481176 102632 189865 193933 -36405 -233390 -11137 144225 -84629 61084
15965B45760j01843B0054Q8305i8400B34897h4782o0560C84803j15835J04675
$$ 245760 143917 20054 108359 -98400 234897 -84782 -145342 384803 268968 373643
15955C73643e5302p0740o6604E5460b77380B01492j0612C4085J86913a66256D4306
$$ 373643 -55302 -126042 -192646 55460 -277380 201492 190880 34085 220998 -166256 44306
15943D8039K15532E761K50054b3931B1245a14307G1063J25361H0444f916G3070
$$ 48039 263571 5761 255815 -23931 21245 -114307 71063 196424 80444 -6916 73070
15931b2246C05193a40809j00582k47309A78117c01467D028a69514A5223M8776
$$ -22246 305193 -140809 -241391 -488700 178117 -301467 4028 -169514 15223 63999
15921F3999l9h4249j2109a0288j5982j07580a293j4183A54127a38015j1536B23
$$ 63999 63960 -84249 -96358 -10288 -26270 -133850 -1293 -15476 154127 -138015 -149551 223
15908C13428A46233J863J3571e5543b6400A33129m5793J01365a84803A03485a94709
$$ 313428 146233 148096 161667 -55543 -26400 133129 87336 188701 -184803 103485 -194709
15896h0690B21945n8461E3635J24704c06672d2617k55086J19091o1452I3477P143
$$ -80690 221945 163484 53635 178339 -306672 -42617 -297703 -178612 -240064 93477 100620
15885A00620J13254m5374q3474R307k1929i3260d0522G9245i0581A05974b89229
$$ 100620 213874 168500 85026 94333 72404 -93260 -40522 79245 -90581 105974 -289229
15873a3446G9643a21491B8975f2450D3105N4377J52393b82728B82630a58817L7789
$$ -13446 79643 -121491 28975 -62450 43105 97482 249875 -282728 282630 -158817 -121028
15862a21028K2360A2173c31457a5585A90912E0541J05992K03964j19060B4611
$$ -121028 -98668 12173 -331457 -15585 190912 50541 156533 360497 241437 24611
15851D74461b51462G3749c27768Q6134R3234b9563A01515l1296J52145a1053k5262
$$ 474461 -251462 73749 -327768 -241634 -148400 -29563 101515 70219 222364 -11053 -36315
15840c6315k04588h79B90785b01660O2576c720I4938J21011E9841K12453a2781
$$ -36315 -240903 -879 290785 -201660 -139084 -3720 94938 215949 59841 272294 -12781
15828a95146H1225Q4457D437d5930j9956j8654j2800j25574I9694C6340R4768
$$ -195146 81225 165682 4437 -45930 -65886 -84540 -97340 -222914 99694 36340 131108
15817A31108a84863A47554c4335E64758b40451B86080i8311A00588a03199n0582
$$ 131108 -184863 147554 -34335 564758 -240451 286080 -98311 100588 -103199 -153781
15807a53781C8909c6699r4699p6727o5220H5152i3529a155k91706B80426D5986
$$ -153781 38909 -36699 -131398 -208125 -273345 85152 -93529 -1155 -292861 280426 45986
15795B15036b19926O0558l2823B03027C0055N2825M5316c2898D628c20007I0633
$$ 215036 -219926 -159368 -192191 203027 30055 82880 128196 -32898 4628 -320007 90633
15783I2244c02586J50287E3893J40020b510j88541A38426h0807a8708A07794a17420
$$ 92244 -302586 -152299 53893 193913 -2510 -191051 138426 -80807 -18708 107794 -117420
15771a00013I1103c05834H6642a26107k31577J29976A6076i0579E3798a18398
$$ -100013 91103 -305834 86642 -126107 -357684 -227708 16076 -90579 53798 -118398
15760B21369k534G8730B0114P1648D5870J24861a83579I6668b05032j35187J31519
$$ 221369 218835 78730 20114 91762 45870 170731 -183579 96668 -205032 -340219 -208700
15749b08700k9360e6942m9464c7310k05515e5695K7627l9913k11421B25088a19281
$$ -208700 -238060 -56942 -106406 -37310 -242825 -55695 -28068 -67981 -279402 225088 -119281
15737i4587l1394M9417a3166A12679a24932B864M8538b27276B5479a7364C06234
$$ -94587 -125981 -76564 -13166 112679 -124932 2864 51402 -227276 25479 -17364 306234
15725h694j18131j96558a59432c0592k39960a25463F1558A8818b11816F5760c40828
$$ -8694 -126825 -323383 -159432 -30592 -270552 -125463 61558 18818 -211816 65760 -340828
15713c765B75758G849B677J57265a06066C5082a24724j09024J11388A61744K7523
$$ -3765 275758 7849 2677 159942 -106066 35082 -124724 -233748 -122360 161744 189267
15702A89267b24491P3921A38119m9273A987a47293A36547b22131i3974a86B98785
$$ 189267 -224491 -150570 138119 88846 1987 -147293 136547 -222131 -93974 -186 298785
15690B02722p2539e4106a6046p5275B25628a2434F5985P9325A6057b3814h418
$$ 202722 130183 -54106 -16046 -91321 225628 -12434 65985 145310 16057 -23814 -8418
15678F907a01478L9862l20681a46348f4194r2144I3790b84534F4946b6274k65077
$$ 6907 -101478 -61616 -382297 -146348 -64194 -156338 93790 -284534 64946 -26274 -291351
15667b91351a17255j46356A61281J55704a38914D7530J77507a19044A08965a79737
$$ -291351 -117255 -263611 161281 316985 -138914 47530 225037 -119044 108965 -179737
15656A95347b4864p4797e14p1883B4295N6015e25531b04511I8436O4466D4475
$$ 195347 -24864 -99661 -514 -72397 24295 80310 -525531 -204511 98436 162902 44475
15644A52418o9080a48561A4342c539D17380C9788Q5688l6023c08861e4603E643
$$ 152418 83338 -148561 14342 -3539 417380 39788 125476 89453 -308861 -54603 5643
15632e8595i958l97555a47002H2695i4457A01384J31989b16080l4667O3609N6029
$$ -58595 -9958 -407513 -147002 82695 -94457 101384 233373 -216080 -250747 -187138 -131109
15621a31109M0632l3694d2451A0549K6868M566k0712A794f4092p7405B32134i2271
$$ -131109 -90477 -124171 -42451 10549 37417 41983 21271 1794 -64092 -141497 232134 -92271
15608a02341j03040F9150b17940G1725q020a3239k66652J17329N6835C19069a75113
$$ -102341 -205381 69150 -217940 71725 63705 -13239 -279891 -162562 -105727 319069 -175113
15596b11580g4673r1921L4806k6204J4048F2139B4002a07317d2887j85679D568
$$ -211580 -74673 -166594 -131788 -157992 -143944 62139 24002 -107317 -42887 -228566 4568
15584i4522H2228a48752A36741l4854l6674k6101K41057A04234i9247j22090c7619
$$ -94522 82228 -148752 136741 101887 65213 39112 280169 104234 -99247 -221337 -37619
15572g53k7072A1029J39688a27910G4259b03684j53477e0298C7261R8458i8520
$$ -753 -27825 11029 150717 -127910 74259 -203684 -357161 -50298 37261 135719 -98520
15560B27936a9122A57271h7147G9680P5329b7460A4423c9843C05897H309M44076
$$ 227936 -19122 157271 -87147 79680 155009 -27460 14423 -39843 305897 8309 452385
15549D52385A30500B806b5601C3901N4352h6005B1555J31782J01606i4554C9063
$$ 452385 130500 2806 -25601 33901 88253 -86005 21555 153337 254943 -94554 39063
15537b21231B2884J87938b34710A9056b9264q6014d4532E629a58289B16852o7248
$$ -221231 22884 210822 -234710 19056 -29264 -115278 -44532 5629 -158289 216852 149604
15526A49604h2240b1667A8697J68215b09187C12846j37526a5687m5098K0168J8130
$$ 149604 -82240 -21667 18697 186912 -209187 312846 175320 -15687 -60785 -40617 -22487
15515b2487A5292a50452E7935K04971a06991G0470b31403a1325o7151j73365i4802
$$ -22487 15292 -150452 57935 262906 -106991 70470 -231403 -11325 -78476 -251841 -94802
15503a0499B11958b59266B30697a44646F1302k367f3319n3988d3739c153l45441
$$ -10499 211958 -259266 230697 -144646 61302 58935 -63319 -117307 -43739 -3153 -348594
15492c48594J51868k5634A13522b15497a6470C66317a29556l9887b4835j24308
$$ -348594 -196726 -222360 113522 -215497 -16470 366317 -129556 -169443 -24835 -149143
15482a49143b9122B98711m2376d6292j65229A17933N8023J35811k9609k8072i242
$$ -149143 -29122 298711 256335 -46292 -211521 117933 175956 311767 282158 254086 -9242
15470b08286O8761N9082q1416M1089A44556m5893c7122j1895k26793e2963j12473
$$ -208286 -139525 -80443 -161859 -120770 144556 98663 -37122 -49017 -275810 -52963 -165436
15459a65436A87760m1003o4771B4377d9175G77b0235k96689E0231a40068k0658
$$ -165436 187760 146757 81986 24377 -49175 777 -20235 -316924 50231 -140068 -160726
15448a60726b3325l1426J8132G48J74572f1917A60336J15895j536I1315P7052
$$ -160726 -23325 -54751 -36619 748 175320 -61917 160336 276231 274695 91315 168367
15437A68367a31301l7543A79887Q6674r6610L0604a83072B13662a12567j60271
$$ 168367 -131301 -168844 179887 266561 169951 200555 -183072 213662 -112567 -272838
15427b72838B84274b90346M0570F758J47049a50370P4888j48797h1904B5130J58408
$$ -272838 284274 -290346 -249776 6758 153807 -150370 -75482 -224279 -81904 25130 183538
15416A83538F4767c1348r8978d0255a3457q9355A89668a47672L3882A32564m049
$$ 183538 64767 -31348 -130326 -40255 -13457 -102812 189668 -147672 -113790 132564 128515
15405A28515c1240C9583h6693A06610N0611L2725q8095P3312p4977d9722j91630
$$ 128515 -31240 39583 -86693 106610 157221 189946 101851 175163 100186 -49722 -241352
15394b41352N6180H6294d8230B9979P9368c13896C2764a11638j19428C1582J17247
$$ -241352 -185172 86294 -48230 29979 109347 -313896 32764 -111638 -231066 31582 148829
15383A48829a96618M4990f9712j88931B0320R6617J00068a68858P1106A53660
$$ 148829 -196618 -151628 -69712 -258643 20320 116937 217005 -168858 -97752 153660
15372B95564F7550K69525m73f9297B48051R6583e0454A3068a17111L8112B6640
$$ 295564 67550 337075 336602 -69297 248051 344634 -50454 13068 -117111 -78999 26640
15360b7038n8991B76369q3793A7033c2915E7658g8841c5117E9040N4182a3972
$$ -27038 -86029 276369 192576 17033 -32915 57658 -78841 -35117 59040 113222 -13972
15348A3717J13013Q7314c3857j80382c107A29408A5681i5300K1059A11995b16959
$$ 13717 126730 214044 -33857 -214239 -3107 129408 15681 -95300 -74241 111995 -216959
15336a9402A0489J64684J16668B3506E01J13018a41916q1913B44437h3772B67106
$$ -19402 10489 175173 291841 23506 501 113519 -141916 -223829 244437 -83772 267106
15324D4704Q3058J01888J40995j35405A10835J62931g5769B18905c59873G702
$$ 44704 127762 229650 370645 235240 110835 273766 -75769 218905 -359873 7702
15313G5449d7690j64658h6542J2m2719G968J92265M5143q3306E9539c355A97993
$$ 75449 -47690 -212348 -86542 -86530 -129249 7968 200233 245376 162070 59539 -3355 197993
15300B30542g0075q9013H3465N4087F28J31605e8409C20139a47854c6496A31391
$$ 230542 -70075 -159088 83465 137552 628 132233 -58409 320139 -147854 -36496 131391
15288b70483A87606J24060A51103a78605E2507a85254B12239d48371J6750g9828
$$ -270483 187606 311666 151103 -178605 52507 -185254 212239 -448371 -431621 -79828
15277a22580p9191A29352n6881J36233i1594D6061K3983J62642J2743f288P49
$$ -122580 -201771 129352 72471 208704 -91594 46061 70044 232686 245429 -6288 -5539
15266e539k45423C22456E423K07335J26117b82236B37338n5468l4544d5573B55186
$$ -5539 -250962 322456 5423 212758 338875 -282236 237338 181870 147326 -45573 255186
15254B5685a83235F04506B77258O84833J73676m18468J76050k85217A54822a21284
$$ 25685 -183235 604506 277258 962091 1135767 717299 893349 608132 154822 -121284
15243f72A41871h1696B74280j00050J54767A15638P2415M9714a73547J0131F1467
$$ -672 141871 -81696 274280 174230 328997 115638 188053 237767 -173547 -163416 61467
15231D3604i4064E2978J1397a37010q0070A98344a9395D2376O66338d8873I2167
$$ 43604 -94064 52978 64375 -137010 -217080 198344 -19395 42376 708714 -48873 92167
15219D5665M81382b66796D0496k742F799c14735G419J60637i7165B29618a24620
$$ 45665 527047 -266796 40496 37754 6799 -314735 7419 168056 -97165 229618 -124620
15207a23362C83998h4969K5948J3050j29812N6424K352B28294l4701A7274K3074
$$ -123362 383998 -84969 -59021 -45971 -175783 -119359 -117007 228294 193593 17274 40348
15196D0348a72593B76589H6229P022R7029m4999m4191i779n4523a7163B58303
$$ 40348 -172593 276589 86229 93251 190280 145281 101090 -9779 -64302 -17163 258303
15184C9236a13227K9610D4730J82382c3549j88606H3850j9831b14569B1520a95103
$$ 39236 -113227 -83617 44730 227112 -33549 -222155 83850 64019 -214569 21520 -195103
15172B14821j6648J301O1894H5610J09869b46809A98610a09441C76371b08706
$$ 214821 198173 199474 261368 85610 195479 -246809 198610 -109441 376371 -208706
15161F0525k219A8293K25822g1045F1288k1411O1764N5581B2824b9919B1142b04790
$$ 60525 58306 18293 244115 -71045 61288 39877 101641 157222 22824 -29919 21142 -204790
15148B79481a22920F1317b2522E3859J49057m0704b7507A47410c9046q7250D4485
$$ 279481 -122920 61317 -22522 53859 202916 162212 -27507 147410 -39046 -126296 44485
15136a29030A49535N4361O1528J59570C6638j5924i7998A79263f0005B30180a39444
$$ -129030 149535 203896 265424 424994 36638 20714 -97998 179263 -60005 230180 -139444
15124A06760O6751J19254k5424A21771K6121b11002E3427R0041Q1111e7825p9385
$$ 106760 173511 292765 267341 121771 147892 -211002 53427 143468 224579 -57825 -137210
15113a37210B46499a03925c1750A01081k1080E69J52651i939F1583L4206J33387
$$ -137210 246499 -103925 -31750 101081 80001 569 153220 -9939 61583 95789 229176
15102B29176j03705F2512J91130J18617f8536D03707A51454J31061A11837j8846
$$ 229176 125471 62512 253642 372259 -68536 403707 151454 282515 111837 92991
15092I2991i8139c9470B3722p940K42479J14456j60654a91187e898A69976M4250
$$ 92991 -98139 -39470 23722 15782 258261 372717 212063 -191187 -5898 169976 214226
15081B14226R8118a8573a587l45790i3144D0158c5295B0321J28893L1117a66018
$$ 214226 312344 -18573 -1587 -347377 -93144 40158 -35295 20321 149214 180331 -166018
15069c6466D9977K65484j18916G5917L53J88468D6880J31909E8684b24998B0700
$$ -36466 49977 315461 196545 75917 76270 264738 46880 178789 58684 -224998 20700
15057B54815D9184a5533F18953a20444B79600A1968J98719E7439O6898L22587
$$ 254815 49184 -15533 618953 -120444 279600 11968 210687 57439 124337 446924
15047D46924A63722c5291A84521J50757l6089p9491L00645j57408Q7062k00608
$$ 446924 163722 -35291 184521 335278 299189 219698 520343 362935 449997 249389
15037B49389p8373p8896P7001l0058n2973J96123j25857o7649K71676a23277B98070
$$ 249389 171016 92120 169121 139063 86090 282213 156356 88707 360383 -123277 298070
15025F3636M74087k06479J13074N090N3447Q9696b7874B85979c31659E02345B28291
$$ 63636 537723 331244 444318 449408 502855 592551 -27874 285979 -331659 502345 228291
15013B99398N1203A06360m5038K48631R9550j96777p9098f6706E78203I2456J15930
$$ 299398 350601 106360 61322 309953 409503 212726 133628 -66706 578203 92456 208386
15002B08386a74771A88096n334b7011F1484A0674K6221M66624K6172j04774o5064
$$ 208386 -174771 188096 182762 -27011 61484 10674 36895 503519 529691 424917 359853
14991C59853a3830B45991F3985K09437K4984j10088P7972E9144J99659j06298
$$ 359853 -13830 245991 63985 273422 298406 188318 266290 59144 258803 152505
14981A52505D4045L80689A96843O5459J60638J6741j89822l4349j7017k8175C2071
$$ 152505 44045 424734 196843 262302 422940 439681 249859 215510 198493 170318 32071
14969B90514J60346A96047K15350A99462K89409B40457L04643B17369l5096R193
$$ 290514 450860 196047 411397 199462 488871 240457 545100 217369 182273 191466
14959A91466O5331m1410K9764l6481J03871J16491A41576J62096j40931O8171
$$ 191466 256797 215387 245151 208670 312541 429032 141576 303672 162741 230912
14949B30912R6228j4518G2417N6979L12796A27161L05464J10550A97685L2341
$$ 230912 327140 312622 72417 129396 442192 127161 432625 543175 197685 230026
14939B30026r2674J75306o6650a04513D17189k8455n0973J47989L4948B60038
$$ 230026 137352 312658 246008 -104513 417189 388734 337761 485750 520698 260038
14928D37404J76025j90005j57556L37360j13329K45157n4073J38579C82152j9746
$$ 437404 613429 423424 265868 603228 489899 735056 680983 819562 382152 362406
14918C62406K76471B86554M60621R4192J6252C67262M15510j0209l64462o6520
$$ 362406 638877 286554 747175 841367 857619 367262 782772 772563 408101 341581
14908C41581L56159j99218A26934K51603j23643J09579J46391B52548j23493L06309
$$ 341581 697740 498522 126934 378537 254894 364473 510864 252548 129055 435364
14898D35364Q2885M3702j57678j18108r9682Q7657L8903K12524j95618F2561N02664
$$ 435364 518249 561951 404273 286165 186483 274140 313043 525567 329949 62561 565225
14887E65225B35879J35363L4025J34788j45852J69385k1197k17082q5429p8650
$$ 565225 235879 371242 405267 540055 394203 563588 542391 325309 239880 161230
14877A61230L9522L44589j01295l5609o1209P9911J21259N9014k51133j57837
$$ 161230 200752 545341 444046 408437 347228 427139 548398 607412 356279 198442
14867A98442J67107K06067J0359q4260j89121L11370O68k60444A27352R1241L0136
$$ 198442 365549 571616 581975 497715 308594 619964 620632 360188 127352 218593 248729
14856B48729K584J62944a27030B16162K93280A62209O21041C66179J44094J4770
$$ 248729 251313 414257 -127030 216162 509442 162209 783250 366179 510273 525043
14846E25043p1827H6687N75464M4375j54084B62471p5964J52347J77898o9921
$$ 525043 453216 86687 662151 706526 552442 262471 186507 338854 516752 446831
14836D46831J44375L77128D39541J25871Q4451l1443j87931k3827J94595r7672
$$ 446831 591206 968334 439541 565412 649863 618420 430489 406662 601257 503585
14826E03585J19218q5105l7054j17502A12123J34376N3582N2903K44447j09079
$$ 503585 622803 537698 500644 383142 112123 246499 300081 352984 597431 488352
14816D88352j07177K82816C01631J91172J18476j63013k07981M80014q0701C12325
$$ 488352 381175 663991 301631 492803 611279 448266 240285 720299 639598 312325
14805C56624j24546M16345n9256L277K9462k02826L22579j87189o745J21560j56073
$$ 356624 232078 648423 589167 592444 621906 419080 741659 554470 547725 669285 513212
14794E13212B49589Q4718J71963q6260m5343L0088K31593B23222M51190j25276
$$ 513212 249589 334307 506270 420010 374667 404755 636348 223222 674412 549136
14784E49136r8987R8595K15521C35089J14729L6611o6208L01663m7290q4124B92104
$$ 549136 450149 548744 764265 335089 449818 486429 420221 721884 674594 590470 292104
14772E17891B41272M52069J32600j55267O471N322j26549k15307N1746P1214M45905
$$ 517891 241272 693341 825941 670674 677145 682467 555918 340611 392357 463571 909476
14761I09476D00229R1960O9529j83947K16413P8900j39091o5432Q4477M6538j59303
$$ 909476 400229 492189 561718 377771 594184 673084 533993 468561 553038 599576 440273
14750D40273K85504K5566j38641k67035M52586L8071l52601J5892J43835K0556
$$ 440273 725777 751343 612702 345667 798253 836324 483723 499615 643450 664006
14740F64006k33034N42648k35973J33491l20679P8121K49476l57592j8068p5873
$$ 664006 430972 973620 737647 871138 550459 628580 878056 520464 502396 426523
14730D26523Q2726L00834r485K24554K6481D65561L03572j8906J83694k97026
$$ 426523 509249 810083 800598 1025152 1051633 465561 769133 750227 933921 636895
14720F36895J69591R3674n441J06914r0733k78510J12903N5704n6997L3510k89971
$$ 636895 806486 900160 894719 1001633 910900 632390 745293 800997 744000 777510 487539
14709D87539M40677j36730N39645n77699k84243K45447M9499j17786J77186L84495
$$ 487539 928216 791486 1331131 753432 469189 714636 764135 646349 823535 1208030
14699A208030l95685j11584J31006q2674l7801L30387p9669Q5689K3644j32858
$$ 1208030 812345 700761 831767 749093 711292 1041679 962010 1047699 1071343 938485
14689I38485k430l18936O68356E97767J49057J64194k69778L77528l44164K38614
$$ 938485 936055 617119 1285475 597767 746824 911018 641240 1018768 674604 913218
14679I13218M7977j56280k2747K04337k09637n0141K65610K5109J78600j42749
$$ 913218 961195 804915 782168 986505 776868 726727 992337 1017446 1196046 1053297
14669A053297k15288J82923r10k44456J60367n7051R4177j15114r4264J16526
$$ 1053297 838009 1020932 1020022 775566 935933 878882 973059 857945 763681 880207
14659H80207J96862k88829K65002n777r3674J79718k43019M09179m01795j19097
$$ 880207 1077069 788240 1053242 1047465 953791 1133509 890490 1299669 897874 778777
14649G78777K45576J44026R6243j14899N1134j53760L05850k44030j328K2183
$$ 778777 1024353 1168379 1264622 1149723 1200857 1047097 1352947 1108917 1107589 1129772
14639A129772M4650L53837o19559J61769p7026J19881j01905R8649q2633J97849
$$ 1129772 1174422 1528259 908700 1070469 993443 1113324 1011419 1110068 1027435 1225284
14629A225284j05309j41926J44098M6790p7665L70688m28745R0785M4369J99420
$$ 1225284 1119975 978049 1122147 1168937 1091272 1461960 1033215 1124000 1168369 1367789
14619A367789k41798K30159m6018O7175k58944L73960K71146l37792l96133M53692
$$ 1367789 1125991 1356150 1310132 1377307 1118363 1492323 1763469 1425677 1029544 1483236
14609A483236p9168M4235o6463l0411p5143K68185O2475n82366N76859j28461
$$ 1483236 1404068 1448303 1381840 1351429 1276286 1544471 1606946 1024580 1601439 1472978
14599A472978K31893J9290l72626J24202m7469J54668m5862k32038J07514K9869
$$ 1472978 1704871 1724161 1351535 1475737 1428268 1582936 1537074 1305036 1412550 1442419
14589A442419J10805j65517J45960q5177J84250P451n3072L86572j25858j59931
$$ 1442419 1553224 1387707 1533667 1448490 1632740 1640191 1587119 1973691 1847833 1687902
14579A687902M29454l87013J918M59561k03824j31072J85841j22116j54848K68298
$$ 1687902 2117356 1730343 1732261 2191822 1987998 1856926 2042767 1920651 1765803 2034101
14569B034101k33910L17813M05468l29101J35762K55612j47898M1942M2983L80930
$$ 2034101 1800191 2118004 2523472 2194371 2330133 2585745 2437847 2479789 2522772 2903702
14559B903702Q2531j96140L65076J42846J48192L38186O28334Q43870O15957J611332
$$ 2903702 2986233 2790093 3155169 3298015 3446207 3784393 4412727 5256597 5872554 7483886
14549G483886K927955M737095P020381N217225k147049r258144o363311l461205
$$ 7483886 10411841 15148936 22169317 27386542 25239493 15981349 9618038 6156833
14541F156833j966765j242871m28329m5825j08474k859k85007J51634l37828K63741
$$ 6156833 4190068 2947197 2518868 2473043 2364569 2361710 2076703 2228337 1890509 2154250
14531B154250J12368k92184L20402J04968m05291K5580L80639l47964K10767j59646
$$ 2154250 2266618 1974434 2294836 2399804 1994513 2020093 2400732 2052768 2263535 2103889
14521B103889k8211K19969k63373L73117L11499k93696q4636K72431j2893k17201
$$ 2103889 2075678 2295647 2032274 2405391 2716890 2423194 2338558 2610989 2598096 2380895
14511B380895K46469n0746P782k24257J79688j51881O25400k84162j1271j17751
$$ 2380895 2627364 2576618 2584400 2360143 2539831 2387950 3013350 2729188 2717917 2600166
14501B600166Q8759L473J67908J07228q0230J52188J16500l7602P688J08679j71451
$$ 2600166 2688925 2692398 2860306 2967534 2887304 3039492 3155992 3118390 3126078 3234757 3063306
14490C063306Q6021L17435p1305m79844M75442l58157L69570O9203J49801o09
$$ 3063306 3149327 3466762 3395457 2915613 3391055 3032898 3402468 3471671 3621472 3620863
14480C620863k29016N02421l28844J07507r0282K7908m8875O9344J29521J95527
$$ 3620863 3391847 3894268 3565424 3672931 3582649 3610557 3561682 3631026 3760547 3956074
14470C956074k89403O24762k04984m6607Q9681K74222q1426J28864j98730J82798
$$ 3956074 3666671 4291433 4086449 4039842 4129523 4403745 4322319 4451183 4252453 4435251
14460D435251J24643k44411k346L50346r326p2937N58078l86129K791K71500j03163
$$ 4435251 4559894 4315483 4313137 4663483 4654157 4581220 5139298 4753169 4755960 5027460 4924297
14449D924297L97732j90083P6935J75135O9142l23927L74320J84431j24496k04281
$$ 4924297 5322029 5131946 5208881 5384016 5453158 5129231 5503551 5687982 5563486 5359205
14439E359205N36532o4294k1488J48717J60111J96177L7970k06168K45909L56888
$$ 5359205 5895737 5831443 5809955 5958672 6118783 6314960 6352930 6146762 6392671 6749559
14429F749559l24868L43216M48387k63672j05349R9432k23483Q29927k5318J60067
$$ 6749559 6424691 6767907 7216294 6952622 6847273 6946705 6723222 7553149 7527831 7687898
14419G687898r7612P2988K19546K33302J37399q3697J96973J98429K52143n47325
$$ 7687898 7590286 7663274 7882820 8116122 8253521 8169824 8366797 8565226 8817369 8270044
14409H270044N97567L0753J57054q4553K90733N70945K8239P9788L07841l54032
$$ 8270044 8867611 8898364 9055418 8970865 9261598 9832543 9860782 9940570 10248411 9894379
14399I894379L84822K89621J97027J20848n2563L85287N8462J71965K36598J1385
$$ 9894379 10279201 10568822 10765849 10886697 10834134 11219421 11277883 11449848 11686446 11697831
14389A1697831N39610L353N48902N4216J00323J74981O34643J24190K96598J11642
$$ 11697831 12237441 12240794 12789696 12843912 12944235 13119216 13753859 13878049 14174647 14286289
14379A4286289K77727J49846N31878K27364N42890M27487L50477j68388N03288
$$ 14286289 14564016 14713862 15245740 15473104 16015994 16443481 16793958 16625570 17128858
14370A7128858N45148L15918K45019J65245L30015R34748J08341N75088K74388
$$ 17128858 17674006 17989924 18234943 18400188 18730203 19664951 19773292 20348380 20622768
14361B0622768N33044L99796N10970N03979N70542O62997L63631Q65030N2597
$$ 20622768 21155812 21555608 22066578 22570557 23141099 23804096 24167727 25032757 25085354
14352B5085354R59847N30607Q34998K67632R78331P32960P27829Q33141R20159
$$ 25085354 26045201 26575808 27410806 27678438 28656769 29389729 30117558 30950699 31870858
14343C1870858O06544Q28533P58585J024377J202220J163689N66397J242355J353905
$$ 31870858 32477402 33305935 34064520 35088897 36291117 37454806 38021203 39263558 40617463
14334D0617463J218908J204565J307235J173829J770374J271462J656598J616598
$$ 40617463 41836371 43040936 44348171 45522000 47292374 48563836 50220434 51837032
14326E1837032J614721J887426J847653J701984K100851K442509K294363J905963
$$ 51837032 53451753 55339179 57186832 58888816 60989667 63432176 65726539 67632502
14318F7632502K409257K675464K731447L121660L139081K897519L713930K999522
$$ 67632502 70041759 72717223 75448670 78570330 81709411 84606930 88320860 91320382
14310I1320382L922735L742402M328883M550244M419168N069642M977054N259865
$$ 91320382 95243117 98985519 103314402 107864646 112283814 117353456 122330510 127590375
14302A27590375O044844O080661O592852O644102O941422P605000Q052350Q366107
$$ 127590375 133635219 139715880 146308732 152952834 159894256 167499256 175551606 183917713
14294A83917713Q911615R082300R928015J0180470J0774199J0844596J1647408
$$ 183917713 192829328 201911628 211839643 222020113 232794312 243638908 255286316
14287B55286316J2040970J2454540J2602547J3080573J2998944J3400863J2870119
$$ 255286316 267327286 279781826 292384373 305464946 318463890 331864753 344734872
14280C44734872J3139640J2467042J2183639J1210258J0083420Q658662O044791
$$ 344734872 357874512 370341554 382525193 393735451 403818871 412477533 418522324
14273D18522324K901266J791720Q50339J83560j419945l863579m363802n968612
$$ 418522324 421423590 423215310 424065649 424249209 422829264 418965685 414601883 408633271
14265D08633271p826963r629132j1040755j2091136j3137829j3817363j3919334
$$ 408633271 400806308 391177176 380136421 368045285 354907456 341090093 327170759
14258C27170759j4172861j3183566j3592438j3315791j3075143j2235261j1866652
$$ 327170759 312997898 299814332 286221894 272906103 259830960 247595699 235729047
14251B35729047j1411867j0942824j0115078j0217099r148529q547496q228682
$$ 235729047 224317180 213374356 203259278 193042179 183893650 175346154 167117472
14244A67117472p499293p651763o910665o863719o023169n696144n604959n150180
$$ 167117472 159618179 151966416 145055751 138192032 132168863 126472719 120867760 115717580
14236A15717580m912067m759463m527967m126307l665183l529114l457817l616355
$$ 115717580 110805513 106046050 101518083 97391776 93726593 90197479 86739662 83123307
14228H3123307l020796k885527l311629k396057l067360k349896k073697k172538
$$ 83123307 80102511 77216984 73905355 71509298 68441938 66092042 64018345 61845807
14220F1845807k231332k036260j916192j697654j646346j624966j442393j862525
$$ 61845807 59614475 57578215 55662023 53964369 52318023 50693057 49250664 47388139
14212D7388139j282639j455160j492499r42557j237433r96638j105541j266467
$$ 47388139 46105500 44650340 43157841 42215284 40977851 39981213 38875672 37609205
14204C7609205j283318j095902r22890m13478q72204j009917j059837j012775
$$ 37609205 36325887 35229985 34307095 33893617 33021413 32011496 30951659 29938884
14196B9938884o46839o06157n00495r65119n18273o60377n99780n20623o06058
$$ 29938884 29292045 28685888 28185393 27220274 26702001 26041624 25441844 24921221 24315163
14187B4315163p32933r32657o7824n01255o89850k83109o64377m98316k08911
$$ 24315163 23582230 22649573 22581749 22080494 21390644 21107535 20443158 19944842 19735931
14178A9735931l92476n45002l30640m12257l47834j87187m37088o96781J08034
$$ 19735931 19343455 18798453 18467813 18055556 17707722 17520535 17083447 16386666 16494700
14169A6494700n45068p7381l39671k82060l76670l98508M5762l24455k13038k23111
$$ 16494700 15949632 15872251 15532580 15250520 14873850 14475342 14521104 14196649 13983611 13760500
14159A3760500k91443n74538k3677J12367n11330l05705j08729l50325M864k83766
$$ 13760500 13469057 12894519 12870842 12983209 12471879 12166174 12057445 11707120 11711984 11428218
14149A1428218l30976K55355l65967m33467q1092k31169K47340l19897l60210
$$ 11428218 11097242 11352597 10986630 10553163 10472071 10240902 10488242 10168345 9808135
14140I808135p1102j11419k43943k23013K58900k52601O561n91159L08172j98679
$$ 9808135 9737033 9625614 9381671 9158658 9417558 9164957 9171518 8580359 8888531 8689852
14130H689852j30449l95934J98235k38758l577j71427l11570k24740L02705l51912
$$ 8689852 8559403 8163469 8361704 8122946 8119369 7947942 7636372 7411632 7714337 7362425
14120G362425N2719q5408k39228j51961l7864l546q0756o8472j50567R0110l42518
$$ 7362425 7415144 7329736 7090508 6938547 6900683 6897137 6816381 6747909 6597342 6687452 6344934
14109F344934l56485N86338l23590l03930N55297m34950k67543K07447j42776
$$ 6344934 5988449 6574787 6251197 5947267 6502564 6067614 5800071 6007518 5864742
14100E864742j26873k53376Q038j17019M03029k17411j05374m579n1614J8898
$$ 5864742 5737869 5484493 5492531 5375512 5778541 5561130 5455756 5451177 5399563 5418461
14090E418461m58417N5985K37629P6861j74691n63852K76417k22026K6012M81758
$$ 5418461 4960044 5016029 5253658 5330519 5155828 4591976 4868393 4646367 4672379 5154137
14080E154137p07292J05379J56133k12637J65694K9469m34489K57930J02127m91523
$$ 5154137 4446845 4552224 4708357 4495720 4661414 4690883 4256394 4514324 4616451 4124928
14070D124928Q4695k14546q4671K97731k5280q3630k54594J03958j60147P6933
$$ 4124928 4209623 3995077 3910406 4208137 4182857 4099227 3844633 3948591 3788444 3865377
14060C865377K68651k81756R3952q7514p9441J72133j3163j17312k78104K12725
$$ 3865377 4134028 3852272 3946224 3858710 3779269 3951402 3938239 3820927 3542823 3755548
14050C755548l3350k06486O2863l46295J02687J6279R3888k15369M9349q9223
$$ 3755548 3722198 3515712 3578575 3232280 3334967 3351246 3445134 3229765 3279114 3189891
14040C189891J49428j70122K60323j95440q5322M2579K6866k46932q179o2135
$$ 3189891 3339319 3169197 3429520 3234080 3148758 3191337 3218203 2971271 2963092 2900957
14030B900957j44114J88267K29929k28384j17711P199j74080N5245j79066K00430
$$ 2900957 2756843 2945110 3175039 2946655 2828944 2836143 2662063 2717308 2538242 2738672
14020B738672K9159q8105k23698M2773L87112l44444N481k1892P633k03114K12453
$$ 2738672 2767831 2679726 2456028 2498801 2885913 2541469 2546950 2525058 2532691 2329577 2542030
14009B542030j97179n4483r8337K89687l57064M48268m9257j16635p0933k14985
$$ 2542030 2344851 2290368 2192031 2481718 2124654 2572922 2523665 2407030 2336097 2121112
13999B121112J82961j47396J12410j09632J67314O3025K9795N72967N02743O74044
$$ 2121112 2304073 2156677 2269087 2159455 2326769 2389794 2419589 2992556 3495299 4169343
13989D169343K343772L285785O196624P714170K935544o574511o614721m170298
$$ 4169343 6513115 9798900 15995524 23709694 26645238 20070727 13456006 9285708
13981I285708k521185j117081r24329o03908o17726j54006l43196j65596J65072
$$ 9285708 6764523 5647442 4723113 4119205 3501479 3347473 3004277 2838681 3003753
13972C003753j82189n83193L72758n3487k73627j99370K09000n6070l11602J76990
$$ 3003753 2821564 2238371 2611129 2557642 2284015 2084645 2293645 2237575 1925973 2102963
13962B102963P6114M5507k65643L13009J40582l48086J25924k35516R7978N9811
$$ 2102963 2179077 2224584 1958941 2271950 2412532 2064446 2190370 1954854 2052832 2112643
13952B112643j24144J08756n58737M42652j71492o4084J68751J4178l55100j03938
$$ 2112643 1988499 2097255 1538518 1981170 1809678 1745594 1914345 1928523 1573423 1469485
13942A469485K44875k7769n8259m7081O5487J06261m06996N13032k56107l28662
$$ 1469485 1714360 1686591 1628332 1581251 1646738 1752999 1346003 1859035 1602928 1274266
13932A274266M41036l42600J67107m2501k86606M88759j48881J33133j79733j26867
$$ 1274266 1715302 1372702 1539809 1497308 1210702 1699461 1550580 1683713 1503980 1377113
13922A377113L35826l73231K46894k03615O656M25763l86060j63017J99877L4039
$$ 1377113 1712939 1339708 1586602 1382987 1389643 1815406 1429346 1266329 1466206 1500245
13912A500245k90940O4043o3180q2019K40651J85848j84453l3401j16850n1553
$$ 1500245 1209305 1273348 1210168 1128149 1368800 1554648 1370195 1336794 1219944 1168391
13902A168391L89209m9683j82092K5961K72860n53428L17317l0015j49355K36022
$$ 1168391 1557600 1507917 1325825 1351786 1624646 1071218 1388535 1358520 1209165 1445187
13892A445187j90619k2833M672q8218K56353k98523K8629J96622J25476k35219
$$ 1445187 1254568 1231735 1236407 1148189 1404542 1106019 1134648 1331270 1456746 1221527
13882A221527k08981K91953j87118j61939L58681j25018Q4923k38069J51055n0159
$$ 1221527 1012546 1304499 1117381 955442 1314123 1189105 1274028 1035959 1187014 1136855
13872A136855J89844n06702J78463j5500O15758l80287j50066o9738L36222m24152
$$ 1136855 1326699 819997 998460 982960 1598718 1218431 1068365 998627 1334849 910697
13862I10697L59219o1728j68973j96971O61781q8539o07483J83421P728k51037
$$ 910697 1269916 1208188 1039215 842244 1504025 1415486 808003 991424 999152 748115
13852G48115O0694J98211J61770o2731k54758L4361P0096P7684m1542M3000j1579
$$ 748115 808809 1007020 1168790 1106059 851301 885662 955758 1033442 991900 1034900 1023321
13841A023321L25810k32911m7385k38396R150K04203J9518K02668l90578J21969
$$ 1023321 1349131 1116220 1068835 830439 839589 1043792 1063310 1265978 875400 997369
13831I97369J84212j33337j43426j11220J62869N2338l23141M49636j58647p3001
$$ 997369 1181581 1048244 904818 793598 956467 1008805 685664 1135300 976653 903652
13821I03652o9308j2064J30931C51487M46472J53716l34797K99883l10493J05248
$$ 903652 834344 822280 953211 351487 797959 951675 616878 916761 606268 711516
13811G11516J36900L6294N7156l84849L42273m02929K50345j4309j15777J58036
$$ 711516 848416 884710 941866 557017 899290 496361 746706 732397 616620 774656
13801G74656l60540M19969K30924k74453J37250j69387O5923q0581j93702O8464
$$ 774656 414116 834085 1065009 790556 927806 758419 824342 743761 550059 618523
13791F18523K42823K3368C65394P81599C44301M90656k80384P1252j67067K96393
$$ 618523 861346 884714 365394 1146993 344301 834957 554573 625825 458758 755151
13781G55151k73437K02978l688J55075k05058N1448r055K89237j46391K269l40633
$$ 755151 481714 684692 681004 836079 631021 682469 673414 962651 816260 818529 477896
13770D77896K90319K34092q211j73701o8706k31682o9613J03349K50786k51908
$$ 477896 768215 1002307 994096 820395 751689 520007 450394 553743 804529 552621
13760E52621k03122L25984J23156p4232k18154J50160k34330J80544J54663j99473
$$ 552621 349499 675483 798639 724407 506253 656413 422083 602627 757290 557817
13750E57817R2167N2521M969m1018p9684j79121N40902l41850K96631k83425N4413
$$ 557817 649984 702505 707474 666456 586772 407651 948553 606703 903334 619909 674322
13739F74322r1542R1350P6673n4761j21409r3373j04232J82293M3319K49944k87062
$$ 674322 582780 674130 750803 696042 574633 481260 377028 559321 602640 852584 565522
13728E65522k67231P0581K25456k15482K4607l8752J80574A81233M58939m4126
$$ 565522 298291 368872 594328 378846 403453 364701 545275 181233 640172 596046
13718E96046K75316C47797L45102j19987j93726K32549A52119L40113R2036j50130
$$ 596046 871362 347797 692899 572912 379186 611735 152119 492232 584268 434138
13708D34138j26068p3101J50623K9943J20765j13219L95307l74159M8303L2079
$$ 434138 308070 234969 385592 415535 536300 423081 818388 444229 492532 524611
13698E24611j88590J6223L48548j89970K70726l71312K87480q6686k85068K48238
$$ 524611 336021 352244 700792 510822 781548 410236 697716 611030 325962 574200
13688E74200j47403N8520k23653J79281J705K06002q7382k6361j96548K83953
$$ 574200 426797 485317 261664 440945 442650 648652 561270 534909 338361 622314
13678F22314m3308l9431j2202j07648K2553L866o2039j06096J62911K79225J15558
$$ 622314 579006 539575 527373 419725 442278 446144 384105 278009 440920 720145 835703
13667H35703k64820j06959j59785p7730L69435R224K9902A60373J5255K56993
$$ 835703 570883 463924 304139 226409 595844 605068 634970 160373 175628 432621
13657D32621J39089k45159J94952J69759j10653A89824N7444N09141q8103F9628
$$ 432621 571710 326551 521503 691262 580609 189824 247268 756409 668306 69628
13646C71228J94036O3341j66349n2055Q0887j62890k1666j39449J99279A60802
$$ 371228 565264 628605 462256 410201 491088 328198 306532 167083 366362 160802
13635F04912m1476B58800N0144o7897j6375K18906J11683m6186N6892k71746Q1920
$$ 604912 563436 258800 308944 241047 224672 443578 555261 509075 565967 294221 376141
13624C76141p4029J03443Q790J7613j62783K38982A61188O9751J14510m5253r7498
$$ 376141 302112 405555 414345 431958 269175 508157 161188 230939 345449 300196 202698
13613B02698M3309G9325M51102k41261J73371A94937J30225K31974q3995g3206
$$ 202698 246007 79325 530427 289166 462537 194937 325162 557136 473141 -73206
13602E06535j67865O4817j13501L75536j07262B74199K61133H6355J90433J71533
$$ 506535 338670 403487 289986 665522 558260 274199 535332 86355 276788 448321
13592D48321j2082A10782K16832j41423J08047J92124q7224J62871l8746r4872
$$ 448321 436239 110782 327614 186191 294238 486362 399138 562009 523263 428391
13582D28391B08727M7012k9660J95002J9914k19824J10167j27714j6290K4051
$$ 428391 208727 255739 226079 421081 440995 221171 331338 203624 187334 211385
13572B11385J31146J22599k9247A09449L04058P8540H1545K92678N8094B09981
$$ 211385 342531 465130 435883 109449 413507 492047 81545 374223 432317 209981
13561G54435C43292J86524k22187K04924j64832K46564k69637D3420M58460B08283
$$ 754435 343292 529816 307629 512553 347721 594285 324648 43420 501880 208283
13550B67474m6023A8150J78026M10231j54951p1386K80329B09400J04920C3399
$$ 267474 221451 18150 196176 606407 451456 380070 660399 209400 314320 33399
13539F95335A67881J63665K33461A97226J16937q986C4649L93326A62683N7422
$$ 695335 167881 331546 565007 197226 314163 305177 34649 427975 162683 220105
13529B20105K09661j98502K5401J7732l3769M3500j07829J63394D7624Q9343K67283
$$ 220105 429766 231264 256665 274397 240628 284128 176299 339693 47624 136967 404250
13518D04250j0550O2805A62165k5830K70505q1716A40208K10176A42501R6034
$$ 404250 393700 456505 162165 136335 406840 325124 140208 350384 142501 238535
13508B38535N9694r0576D4424J22477J70029m6150O1189J01299A28646K14416
$$ 238535 298229 207653 44424 166901 336930 290780 351969 453268 128646 343062
13498C43062j66175J72721J57940k6084a6329A21410K39904K8969a54260B71423
$$ 343062 176887 349608 507548 481464 -16329 121410 361314 390283 -154260 271423
13487C29426a15403A24215A3035O9440Q8025J19529r4100M27000k03301j08331
$$ 329426 -115403 124215 13035 82475 170500 290029 195929 622929 419628 311297
13477C11297I0560L91683B21517J47531q0867K18930a46778A29373K54589A47479
$$ 311297 90560 482243 221517 369048 288181 507111 -146778 129373 383962 147479
13466C4757J22116N3241A02612J29823l8905F8201K33434A32558L8196J4669o944
$$ 34757 156873 210114 102612 232435 193530 68201 301635 132558 170754 185423 178479
13455A78479J58336j64840F7480K5310N53059A36157J74937A2434L74269A91363
$$ 178479 336815 171975 67480 92790 645849 136157 311094 12434 386703 191363
13444D17345A72511H0279l8196K62903A30883L78723j91706J90611A50696K49509
$$ 417345 172511 80279 42083 304986 130883 509606 317900 508511 150696 400205
13434D00205m021Q9850j30786J9145L46719j08944d8713B69332K2270b13820C11007
$$ 400205 396184 486034 355248 374393 721112 612168 -48713 269332 291602 -213820 311007
13422B70835J28043j09050p7624J55441k5671n7842b6310F41566B82040r3323
$$ 270835 398878 289828 212204 367645 341974 284132 -26310 641566 282040 188717
13412A88717d1488o1659C29419A9053J42510R9850a05732D27465j38669E7786
$$ 188717 -41488 -103147 329419 19053 161563 261413 -105732 427465 288796 57786
13401d8320C52590A25427B3261P8357b5400B4731J84521D1879m561L33235A60948
$$ -48320 352590 125427 23261 101618 -25400 24731 209252 41879 37318 370553 160948
13389A22768n866J82587a20049B19192K10747a5705D007b53861E1443J10878D010
$$ 122768 116902 299489 -120049 219192 429939 -15705 4007 -253861 51443 162321 4010
13377B16084e4619a4230A78851k4930C0367O485M43211j85422J64476j76169q7728
$$ 216084 -54619 -14230 178851 153921 30367 36852 480063 294641 459117 282948 195220
13366A95220I0882L48032j27028j09210P2407j5830K9110H5233K75157m3521B7146
$$ 195220 90882 438914 311886 202676 275083 259253 288363 85233 360390 316869 27146
13354A01305j8342J4469K31944A32580M056o7898M652K85774A72397g156A46969
$$ 101305 82963 97432 329376 132580 136636 68738 73390 359164 172397 -7156 146969
13342C36224J49396R0191A46603K21729j10926A18722P5890Q3969j33362K14674
$$ 336224 485620 575811 146603 368332 257406 118722 194612 278581 145219 359893
13332C59893a85565B60981B7119K07631K17733A44691K48930j40463D8456L45158
$$ 359893 -185565 260981 27119 234750 452483 144691 393621 253158 48456 393614
13322C93614a65629A0950K26002d6673C08805K08190J41806A77409e0450H5101
$$ 393614 -165629 10950 236952 -46673 308805 516995 658801 177409 -50450 85101
13311B72234J5059j19337J4813P7872Q2182E7579J32051a38760A40399M1541M1560
$$ 272234 287293 167956 182769 260641 342823 57579 189630 -138760 140399 181940 223500
13300B23500o2899A9609J96714G0342l09J0315l1415K03559P5415F0732N21467
$$ 223500 160601 19609 216323 70342 70033 80348 48933 252492 327907 60732 582199
13289E82199A95510K5483F6569A9363Q0658Q7086a94078E5540J15488p9932J22540
$$ 582199 195510 220993 66569 19363 100021 187107 -194078 55540 171028 91096 213636
13278B13636K2886h1565A93509q4536f3944p1060A34451J47416a54838D8970L39678
$$ 213636 236522 -81565 193509 108973 -63944 -135004 134451 281867 -154838 48970 388648
13267C88648H0940K37658m9279l7869i26j32891D9813J31556a10119A73213q5753
$$ 388648 80940 318598 269319 231450 -926 -133817 49813 181369 -110119 173213 87460
13256H7460J03603q8651b08799A42415J10792d5452B26098p4139E6362J76662
$$ 87460 191063 102412 -208799 142415 253207 -45452 226098 151959 56362 233024
13246B33024F1614J8691K18335a21026B76061j35828L5521L6482n9728K47835
$$ 233024 61614 80305 298640 -121026 276061 140233 175754 212236 152508 400343
13236D00343O5031A94358L09462j60195a95147F8955L88043F3668K91582P7203
$$ 400343 465374 194358 503820 343625 -195147 68955 456998 63668 355250 432453
13226D32453A0531h1850B29048K248O609a07974C88526o0988J75081B39333J04483
$$ 432453 10531 -81850 229048 231296 237905 -107974 388526 327538 502619 239333 343816
13215C43816A63159l6843a71885C96658a96831B0549K15896Q5975j45380a15884
$$ 343816 163159 126316 -171885 396658 -196831 20549 236445 322420 177040 -115884
13204A02823C2535p625c23658B16961A9429J35381P132G144J85421B3410a0322
$$ 102823 32535 24910 -323658 216961 19429 154810 161942 7144 192565 23410 -10322
13192a75334g1553A37081p742n2810b0936A68173F7109b25729B23112c359B85742
$$ -175334 -71553 137081 129339 76529 -20936 168173 67109 -225729 223112 -3359 285742
13180E0934a731D9313i5811k4641B22720b812C19325Q5847I460c1684B57141r8203
$$ 50934 -1731 49313 -95811 -120452 222720 -2812 319325 405172 9460 -31684 257141 158938
13168A58938M8489J26971E2011j1824d1220B9593R7059J00637n638r0300p374
$$ 158938 207427 334398 52011 40187 -41220 29593 126652 227289 221651 131351 123977
13157A23977K9611J62150j51287n6717Q1957a28027D22402k03168q4096k6859
$$ 123977 153588 315738 164451 107734 189691 -128027 422402 219234 135138 108279
13147A08279j1283L4647A7777a8502A46858J53841q1942A9481O745P4911J97472
$$ 108279 96996 131643 17777 -18502 146858 300699 218757 19481 26226 101137 298609
13136B98609A10936m2473K38638a00409p5622A93375b26901B9967P8351r228J09797
$$ 298609 110936 68463 307101 -100409 -176031 193375 -226901 29967 108318 99090 208887
13125B08887i1675C9815L31180j10489p2726p0638K4804N4653h1178l4778F2074
$$ 208887 -91675 39815 370995 260506 187780 117142 141946 196599 -81178 -115956 62074
13113C46895h4752C0068J20552A2976L89475a41825A90383p7622J27996j05409
$$ 346895 -84752 30068 150620 12976 402451 -141825 190383 112761 240757 135348
13103A35348C4021L67872G4057J19256p9098j2855g467B45395A20086A95J95321
$$ 135348 34021 401893 74057 193313 114215 101360 -7467 245395 120086 195 195516
13092A95516J30700a8280n2645A24441b80507I130L24844b47746G3500A2699f1981
$$ 195516 326216 -18280 -70925 124441 -280507 9130 333974 -247746 73500 12699 -61981
13080d828B30397f0535F6692k2629J07856J25006F9419J04955b72460a18920j8832
$$ -4828 230397 -60535 66692 44063 151919 276925 69419 174374 -272460 -118920 -137752
13069a37752B75737r9361K4969C0972b6344I5819J07831c58058A81149J36307
$$ -137752 275737 176376 201345 30972 -26344 95819 203650 -358058 181149 317456
13059C17456e753H7833G490K72869a54153j706A50058c80641D001b11878A39506
$$ 317456 -5753 87833 7490 280359 -154153 -155859 150058 -380641 4001 -211878 139506
13047e417A03346l3417a83896A95004F3678a39084C67009b5120A89273a84793
$$ -5417 103346 69929 -183896 195004 63678 -139084 367009 -25120 189273 -184793
13036B48173c5923B34453B6764b1871r2073A58272g8814A40266K2466J39748H2805
$$ 248173 -35923 234453 26764 -21871 -113944 158272 -78814 140266 162732 302480 82805
13024C34404e7503j73721H6532b4362j4115e194j35513F6952l288J06938G4327
$$ 334404 -57503 -231224 86532 -24362 -38477 -5194 -140707 66952 63664 170602 74327
13012C15179g8504A65704L4141L5562h8607A55867g0876B00955e0871C17731I9681
$$ 315179 -78504 165704 199845 235407 -88607 155867 -70876 200955 -50871 317731 99681
13000A81310G7598a19975H4315J07650K07134H918L0291K24523a87949A92579
$$ 181310 77598 -119975 84315 191965 399099 8918 39209 263732 -187949 192579
12989c37810A43445R9102c0178k03199A27753J2401E0745l054k2442b08443A02674
$$ -337810 143445 242547 -30178 -233377 127753 140154 50745 47691 25249 -208443 102674
12977A70281a0430C21099B032e3813B87717R8871G6472J45779a37736A0218L44594
$$ 170281 -10430 321099 2032 -53813 287717 386588 76472 222251 -137736 10218 354812
12966C54812j55644J37156C0686N3891J47884I0952D1511g5766A08808o346l0382
$$ 354812 199168 336324 30686 84577 232461 90952 41511 -75766 108808 102462 72080
12955G2080N853b34011B11027a20270K6803j16723A60346f373p2438B6165K0009
$$ 72080 77933 -234011 211027 -120270 -93467 -210190 160346 -6373 -78811 26165 46174
12944D6174c24188a20046A46788C0508N7094m0102a74515B07995b06981D7423
$$ 46174 -324188 -120046 146788 30508 87602 47500 -174515 207995 -206981 47423
12933a6633C09974j9000m1554D8429M4388J6302R1617J24849A14111a36578j15662
$$ -16633 309974 290974 249420 48429 92817 109119 200736 325585 114111 -136578 -252240
12922b52240i5266D60279A80926k8190N8654F3819M5331K16192J23677b03591
$$ -252240 -95266 460279 180926 152736 211390 63819 109150 325342 449019 -203591
12911D1746h5626A21320O996K59296l4669d1988j5438l1885k53848f7919k5402
$$ 41746 -85626 121320 128316 387612 352943 -41988 -57426 -89311 -343159 -67919 -93321
12900i3321A31676c7473a177q1068L4154B64095Q6450j52649J36741d45723a53864
$$ -93321 131676 -37473 -1177 -82245 -48091 264095 350545 197896 334637 -445723 -153864
12888C8647A0336J44053b67726F94923l47454A17008a43256j31760A10741k254
$$ 38647 10336 154389 -267726 694923 347469 117008 -143256 -275016 110741 108487
12878A08487H677a50425A30274j7294e558I5695b61864a9748A11605b45657C44753
$$ 108487 8677 -150425 130274 112980 -5558 95695 -261864 -19748 111605 -245657 344753
12866a01685o4315P9616A33401a32263B2620J11788K41898A27758j6533b26681
$$ -101685 -166000 -86384 133401 -132263 22620 134408 376306 127758 111225 -226681
12855c8872C23016q6917b11036G0847N8625g7762J6921I3610C9597J77776i5360
$$ -38872 323016 236099 -211036 70847 129472 -77762 -60841 93610 39597 217373 -95360
12843A16076L2955o3162j4301G986K7781P8607K87007a06466I2199k8029n858
$$ 116076 149031 85869 71568 7986 35767 114374 401381 -106466 92199 64170 58312
12832E8312a48009A06597a31138j04792g1986j73251C86845a82828E6551J35738
$$ 58312 -148009 106597 -131138 -235930 -71986 -245237 386845 -182828 56551 192289
12822A92289g5911n2204I9637C6206h8021E260a61030A69766g167D5066J36125
$$ 192289 -75911 -128115 99637 36206 -88021 5260 -161030 169766 -7167 45066 181191
12811A81191e5752A41437d6779j8264B54587p7102c585n7280N684B7106J32366
$$ 181191 -55752 141437 -46779 -65043 254587 177485 -3585 -60865 -55181 27106 159472
12800A59472K8132b14355m8174h7413A23552A4075K09572A3268J09964C2575J6507
$$ 159472 187604 -214355 -262529 -87413 123552 14075 223647 13268 123232 32575 49082
12789D9082a23716p8728i3339A20460d1118C4633a53445n3136i708A1401J0146
$$ 49082 -123716 -202444 -93339 120460 -41118 34633 -153445 -206581 -9708 11401 21547
12778B1547F78O6653i6524A72820a23037D5808R3710g3186B05977b28932A17352
$$ 21547 678 67331 -96524 172820 -123037 45808 139518 -73186 205977 -228932 117352
12766A65479f5262c1897j84891B9964b6803A65095e5031c995l18866a38076a4598
$$ 165479 -65262 -31897 -216788 29964 -26803 165095 -55031 -3995 -322861 -138076 -14598
12754d4900C60118F2095b3410j5946a9202o4279B99674C7603a25270A95882b5873
$$ -44900 360118 62095 -23410 -39356 -19202 -83481 299674 37603 -125270 195882 -25873
12742A4150a50512B9207P8405d85991C81207B4113J11488L3009a82419c1960H7147
$$ 14150 -150512 29207 107612 -485991 381207 24113 135601 168610 -182419 -31960 87147
12730E6582B0082g1605d586a303l5214j99756c0475j09592O2912A17623a69476
$$ 56582 20082 -71605 -4586 -1303 -36517 -236273 -30475 -140067 -77155 117623 -169476
12718A15931a13665r07B45274B8312a9615A11224M00370k26967J646j02793k2647
$$ 115931 -113665 -114572 245274 28312 -19615 111224 511594 284627 286273 183480 160833
12707A60833J28339q3900k097D1262e6136r2665A57798k6746N5508a3865j22252
$$ 160833 289172 205272 203175 41262 -56136 -148801 157798 131052 186560 -13865 -136117
12696a36117d6249n6880L3236A89751a47814r25d4538l067p1746A49989D7420
$$ -136117 -46249 -103129 -69893 189751 -147814 -148739 -44538 -47605 -119351 149989 47420
12684b29860H5237i266B74871K49255I6440C9877J2885P393b9706E470J98006
$$ -229860 85237 -9266 274871 524126 96440 39877 52762 60155 -29706 5470 203476
12673B03476o5547N414P2519o8689a50119E9824a27912b2400p9347E4323N8357
$$ 203476 137929 143343 215862 147173 -150119 59824 -127912 -22400 -101747 54323 112680
12662A12680c9556D4204R0959a1350o1385H2290M9359P5377J11298b6464A55433
$$ 112680 -39556 44204 135163 -11350 -72735 82290 131649 207026 318324 -26464 155433
12650a72354C65072g7130D0873B0366a64464D02232a24558N2245B9530b76313
$$ -172354 365072 -77130 40873 20366 -164464 402232 -124558 -72313 29530 -276313
12639C3157J11516J5785m9283f9897H6560e7696k8598B11579A4614L41892E4398
$$ 33157 144673 160458 111175 -69897 86560 -57696 -86294 211579 14614 356506 54398
12627B28244J19371D5585J8388a82187B42117j02206a80512B62634a54027D41881
$$ 228244 347615 45585 63973 -182187 242117 139911 -180512 262634 -154027 441881
12616g3958j16514A35284Q0934a15425A50951O3735J58342j44296n6790g6969
$$ -73958 -190472 135284 216218 -115425 150951 214686 373028 228732 171942 -76969
12605A24049A4837K75006C1518M3548J59344g2545q7627A04216M8820a16143d7823
$$ 124049 14837 289843 31518 75066 234410 -72545 -160172 104216 153036 -116143 -47823
12593c127j76322I1714K31758i5200k45716D3621c62012a74380N6642N2789A65263
$$ -3127 -179449 91714 323472 -95200 -340916 43621 -362012 -174380 -117738 -64949 165263
12581i9472j18711c5816C59510e1258C5260a3684B83201l8586p4552Q9023A07974
$$ -99472 -218183 -35816 359510 -51258 35260 -13684 283201 244615 170063 259086 107974
12569e53530a28774j64907b6373j26427B49671B6107j1624L3647c39242a9638
$$ -553530 -128774 -293681 -26373 -152800 249671 26107 14483 48130 -339242 -19638
12558a64434N0039C18406A05271i9244B77431a03557k8157B09320G0716b48032
$$ -164434 -114395 318406 105271 -99244 277431 -103557 -131714 209320 70716 -248032
12547I0416c2274l4808l9706D1808j1409L4295B0990N8198g9691b9059H3166k3684
$$ 90416 -32274 -67082 -106788 41808 30399 64694 20990 79188 -79691 -29059 83166 59482
12535E9482n434J00919j6741a20685B58329a79828K2284C17872d5814o8977B04035
$$ 59482 54048 154967 138226 -120685 258329 -179828 -157544 317872 -45814 -114791 204035
12523a73930A40106E6597N6589a60419B30408d4747B30867p4598o587b6113A18713
$$ -173930 140106 56597 113186 -160419 230408 -44747 230867 156269 149682 -26113 118713
12511C355M1913K9148L6219J53651A4030K23580k0463c391A669L39103I860a33995
$$ 3355 45268 74416 110635 264286 14030 237610 217147 -3391 1669 340772 9860 -133995
12498a42034K2186L6080A2717b01530A03089P6681p7123b0329B23934D7812J3431
$$ -142034 -119848 -83768 12717 -201530 103089 179770 102647 -20329 223934 47812 61243
12487F1243e130B2721a05930E08725A18707k331f9888H433R6033b92162B0472
$$ 61243 -5130 22721 -105930 508725 118707 116376 -69888 8433 104466 -292162 20472
12475d7918C7750i1435K1449k51686f686j0326l2782A21252k8513a43281J8338
$$ -47918 37750 -91435 -69986 -321672 -6686 -17012 -49794 121252 92739 -143281 -124943
12464a24943A7037a47355E6761b22211A35225n6983a05691B47058a84497A37421
$$ -124943 17037 -147355 56761 -222211 135225 78242 -105691 247058 -184497 137421
12453d43253H2745l9634A6654c2638k3821f61A87930d1628J9512k18225A7420
$$ -443253 82745 43111 16654 -32638 -56459 -661 187930 -41628 -22116 -240341 17420
12441A6354g1070l31133A18686k8170k5559J00051c79942a04887J2692B37901
$$ 16354 -71070 -402203 118686 90516 64957 165008 -379942 -104887 -92195 237901
12430H6387g6186j14562A4345a6287A31232k058E3716A860P1445K1836C3130R0130
$$ 86387 -76186 -190748 14345 -16287 131232 129174 53716 1860 73305 95141 33130 123260
12418A23260M3484q1097a90492k20312a62131A25114J30313E1964J47904i1833
$$ 123260 166744 85647 -190492 -410804 -162131 125114 255427 51964 199868 -91833
12407e55181g4126L4643j86953G1999e5280J8907m11119g0088A3994b21958H191
$$ -555181 -74126 -39483 -226436 71999 -55280 -36373 -447492 -70088 13994 -221958 8191
12395G1409a61407C72911I3229k8548A5982b90003A18740n1375c47141a01194
$$ 71409 -161407 372911 93229 64681 15982 -290003 118740 67365 -347141 -101194
12384c2429j20298H3065e061j84312A75086b86121i4180C42503d3287B81072a66491
$$ -32429 -152727 83065 -5061 -189373 175086 -286121 -94180 342503 -43287 281072 -166491
12372a28055d8959l6114A31758n8768k8354c7073j59303N5812N3704F8291d8396
$$ -128055 -48959 -85073 131758 72990 44636 -37073 -196376 -140564 -86860 68291 -48396
12360a34413M3722A17471L572a31902k51555J28971l20766A18266A8753b97559
$$ -134413 -90691 117471 121043 -131902 -383457 -254486 -575252 118266 18753 -297559
12349e4839j12297d1975a9028o967r8185N9007l2171j17413D4723b42897a00867
$$ -54839 -167136 -41975 -19028 -25995 -124180 -65173 -97344 -214757 44723 -242897 -100867
12337C29261c1307h056B32181c7708A1818J81352E040M09877a05893A40106a86990
$$ 329261 -31307 -8056 232181 -37708 11818 193170 5040 414917 -105893 140106 -186990
12325e3455H5115J89695A6570M7209L2076J93422b25730d997B289a14726C5528
$$ -53455 85115 274810 16570 63779 95855 289277 -225730 -4997 2289 -114726 35528
12313A05820J48637c3749r4296a8267B17589H338b16150C07125b8148r6371l5916
$$ 105820 254457 -33749 -128045 -18267 217589 8338 -216150 307125 -28148 -124519 -160435
12302a60435f1758j45785Q3989B46078n3277o0549k5669E2765h1273B51372a4885
$$ -160435 -61758 -207543 -123554 246078 192801 132252 106583 52765 -81273 251372 -14885
12290C5576P1090a10265c5148D80860j72266j17303j9281C2069h6202D2798K49760
$$ 35576 106666 -110265 -35148 480860 308594 191291 172010 32069 -86202 42798 292558
12279B92558n2977b11394O3705B66542b17085G4736K61473C7612J040a07567C26297
$$ 292558 239581 -211394 -147689 266542 -217085 74736 336209 37612 38652 -107567 326297
12267B05796H1581d5917G5122k0933a7173I3804a3323l9480j06356G9298j7173
$$ 205796 81581 -45917 75122 54189 -17173 93804 -13323 -52803 -159159 79298 62125
12256F2125L6201L3050A9727J13392j734C6080J16095E7909c6011j14256b3482
$$ 62125 98326 131376 19727 133119 131385 36080 152175 57909 -36011 -150267 -23482
12244A47148D5050J48430a13524M0708C3384h8004K5692I3904d8698A41062l4214
$$ 147148 45050 193480 -113524 -72816 33384 -88004 -62312 93904 -48698 141062 106848
12233A06848B9865J76899J0467G295J45834J08848K6859l2804L9358b87554B86359
$$ 106848 29865 206764 217231 7295 153129 261977 288836 256032 295390 -287554 286359
12221i2750A41411K44440A16369R3572j04531J99058j19328H829M42094E3554
$$ -92750 141411 385851 116369 209941 105410 304468 185140 8829 450923 53554
12210e2773l4333A81829L9153K8944H574J2986L03272j28361J41435b26221C53479
$$ -52773 -87106 181829 220982 249926 8574 21560 324832 196471 337906 -226221 353479
12198C57597j17366a48462A56763J99227I7570k2054L9748D9051h4034A39683
$$ 357597 240231 -148462 156763 355990 97570 75516 115264 49051 -84034 139683
12187H6751Q6395K73271h8064a5716C77368A48502J03897J61237a4031A89138
$$ 86751 173146 446417 -88064 -15716 377368 148502 252399 413636 -14031 189138
12176C17605b26643J06473B98251f0057C61946b563A60985D4159k656d0633A67909
$$ 317605 -226643 -120170 298251 -60057 361946 -2563 160985 44159 41503 -40633 167909
12164F3858O0790a09366A11122Q5386a19679A32399F0223P2301L20012A7800a39174
$$ 63858 124648 -109366 111122 196508 -119679 132399 60223 132524 452536 17800 -139174
12152B22331D996a4312I6098b61699B60212a85979E7698a80959I1357a55374A37183
$$ 222331 4996 -14312 96098 -261699 260212 -185979 57698 -180959 91357 -155374 137183
12140f9601J5786A73016D5814b3648j00684C00205b05366B76395b04962C7343
$$ -69601 -53815 173016 45814 -23648 -124332 300205 -205366 276395 -204962 37343
12129B17770a66869A16396c9031A76205b2243j04303d6755B06657a6486A12241
$$ 217770 -166869 116396 -39031 176205 -22243 -126546 -46755 206657 -16486 112241
12118i0322B22265h52F6769a19648A82700B4822b14835A27309d9690A95436n3125
$$ -90322 222265 -852 66769 -119648 182700 24822 -214835 127309 -49690 195436 142311
12107A42311e7974p3513j06454A35898a35849d8155j18314a1199j14566j47330
$$ 142311 -57974 -131487 -237941 135898 -135849 -48155 -166469 -11199 -125765 -273095
12097b73095b461j9419j39170C9299a37413j91660h6998r529A12084b2291q5846
$$ -273095 -2461 -21880 -161050 39299 -137413 -329073 -86998 -96527 112084 -22291 -108137
12086a08137A98666o1013L30053G8028i4570A6917c4922E3978a73430b5118C4897
$$ -108137 198666 137653 467706 78028 -94570 16917 -34922 53978 -173430 -25118 34897
12074a49564J9341F9172K9732a49861P3202I8469L72469j29462F0239h6042M1156
$$ -149564 -130223 69172 98904 -149861 -76659 98469 470938 341476 60239 -86042 -44886
12063d4886A44042Q7911d9068A09806O3312J64327e8981n1063K9874c6227B20113
$$ -44886 144042 231953 -49068 109806 173118 337445 -58981 -110044 -80170 -36227 220113
12051C07227p8941P1685A977L3570b38845O5976c0336A40279c47724f2390A8849
$$ 307227 228286 299971 1977 35547 -238845 -172869 -30336 140279 -347724 -62390 18849
12039b1329j10041A77435R0406b42828J7440R5252A78597e4508a9945H7112e7825
$$ -21329 -131370 177435 267841 -242828 -225388 -130136 178597 -54508 -19945 87112 -57825
12027A54181e9075j5475E05664a03670j23861I739J42036c2947m4115F9692g8392
$$ 154181 -59075 -74550 505664 -103670 -227531 9739 151775 -32947 -77062 69692 -78392
12015a16044b955o7369A07071d0844D54113d08562c9240k16053j2379B23942a05767
$$ -116044 -2955 -70324 107071 -40844 454113 -408562 -39240 -255293 -267672 223942 -105767
12003A87694a12641A78133p2690O2042J6129e3526o7459l927l7132R251F2576
$$ 187694 -112641 178133 105443 167485 183614 -53526 -120985 -124912 -162044 -152793 62576
11991c97388a43488E1424c3631j93979g5105C3100c4948D02803f22j6015G2547
$$ -397388 -143488 51424 -33631 -227610 -75105 33100 -34948 402803 -622 -16637 72547
11979b34269O5851A23300M8390a37326A57521G6320M5226J9571i9703B6962b36163
$$ -234269 -168418 123300 171690 -137326 157521 76320 121546 141117 -99703 26962 -236163
11967g1475Q524l294l4237A08027a18388I0379i4508A23465a55708N9162E3117
$$ -71475 -62951 -66245 -100482 108027 -118388 90379 -94508 123465 -155708 -96546 53117
11955G3225a12582A17817J39525c3980H2773b7765k1629B61890f135F2626a06624
$$ 73225 -112582 117817 257342 -33980 82773 -27765 -49394 261890 -6135 62626 -106624
11943b64663P6559D2229b46067g2487H4263J7930b27218C21877h6305B8209J18348
$$ -264663 -188104 42229 -246067 -72487 84263 102193 -227218 321877 -86305 28209 146557
11932A46557a41734K5778H9087J27801o1637l3801I561b03519F2226L10745a86444
$$ 146557 -141734 -115956 89087 216888 155251 121450 9561 -203519 62226 372971 -186444
11920a37340A81111g753j40855k15749g0640a6826A08821a19137B1252j0513a09627
$$ -137340 181111 -7753 -148608 -364357 -70640 -16826 108821 -119137 21252 10739 -109627
11908b8802n0709k1669k21901C3624J57171a7118F6123d1631q258j2032k8047
$$ -28802 -79511 -101180 -323081 33624 190795 -17118 66123 -41631 -49889 -61921 -89968
11897h9968D1200d07642J41508C2284b1983p0692k41087a04651B39310b61486
$$ -89968 41200 -407642 -266134 32284 -21983 -92675 -333762 -104651 239310 -261486
11886c02876A01364k0914g3514A74964b50057a15040a8897H1418c4938C6259a81661
$$ -302876 101364 80450 -73514 174964 -250057 -115040 -18897 81418 -34938 36259 -181661
11874a93442a9606A61722K0190q6212a955j68144Q1240G3929a05118j58404F5866
$$ -193442 -19606 161722 181912 95700 -1955 -170099 -88859 73929 -105118 -263522 65866
11862C1547J09278a22178k41383J68303e6144g619k935k7332E7270a75002j2143
$$ 31547 140825 -122178 -363561 -195258 -56144 -7619 -10554 -37886 57270 -175002 -187145
11851a87145F1230A7242b0566E3961a46612A13805B9453b74194p718R0609P1735
$$ -187145 61230 17242 -20566 53961 -146612 113805 29453 -274194 -281912 -191303 -119568
11840a19568M3964k10723A58676c95878b2420n7322H1739E544R5039a08344M6774
$$ -119568 -75604 -286327 158676 -395878 -22420 -79742 81739 5544 100583 -108344 -61570
11829f1570j43523b1893m0740C13321b72166G0794f3631q0102C09613J4442P8943
$$ -61570 -205093 -21893 -62633 313321 -272166 70794 -63631 -143733 309613 324055 402998
11818D02998A37597C3325b37769a00959C62396D6456b84136O9998r812N8436e1227
$$ 402998 137597 33325 -237769 -100959 362396 46456 -284136 -214138 -223950 -165514 -51227
11806b60770J24716c7035J6389k27540B31149h7972j19477G095d5582j19361M4160
$$ -260770 -136054 -37035 -20646 -248186 231149 -87972 -207449 7095 -45582 -164943 -120783
11795a20783d1920C67251j38222j08946a59586d9726j22620B77013L5837j43664
$$ -120783 -41920 367251 229029 120083 -159586 -49726 -172346 277013 312850 169186
11785A69186d2033j62368r2821a09217B04281i7345E6607f4064j02106C75385
$$ 169186 -42033 -204401 -297222 -109217 204281 -97345 56607 -64064 -166170 375385
11774a44162A0218C853b7141A2540a26534A25033f1827p5400e2832R466j88988
$$ -144162 10218 3853 -27141 12540 -126534 125033 -61827 -137227 -52832 -43366 -232354
11763b32354A46517a72587m5705A62358K8a35700g402j32691A34981n6461b40102
$$ -232354 146517 -172587 -218292 162358 162386 -135700 -7402 -140093 134981 78520 -240102
11751e371k20161g3717p3973j00366I2005P1028h6411G5338b55908g2602j15319
$$ -5371 -225532 -73717 -147690 -248056 92005 163033 -86411 75338 -255908 -72602 -187921
11740a87921e066A98183c9169j06842a3079k19478e0921P012A92476i9614l7600
$$ -187921 -5066 198183 -39169 -146011 -13079 -232557 -50921 -43909 192476 -99614 -137214
11729a37214K7610l23368A00664k9391J35531I1517K2592K0722a10847B69832
$$ -137214 -109604 -432972 100664 71273 206804 91517 114109 134831 -110847 269832
11718F564a20535G0583K28352i854B84592A41275m5824J85925a25885G6846K68514
$$ 6564 -120535 70583 298935 -9854 284592 141275 95451 281376 -125885 76846 345360
11707C45360g6636B6754a095k2327C3067J99993A9280K92176a7248B98676J65333
$$ 345360 -76636 26754 -1095 -23422 33067 233060 19280 311456 -17248 298676 464009
11696D64009k30852B65f8011D60536D9550a30134J9083D28018H933c4358H4362
$$ 464009 233157 265 -68011 460536 49550 -130134 -111051 428018 8933 -34358 84362
11684b54101N7534I447a51952B41063J11328j31718G5691l2749N0350a72332O0873
$$ -254101 -196567 9447 -151952 241063 352391 220673 75691 42942 93292 -172332 -111459
11673a11459B77182I830J57K99932G6369R4559N681m7424l3706D2477a04644A10784
$$ -111459 277182 9830 9987 309919 76369 170928 176609 129185 95479 42477 -104644 110784
11660b94847F9638N0430f1014A97673e4726I9936a35565q788K2385B26120a97996
$$ -294847 69638 120068 -61014 197673 -54726 99936 -135565 -144353 -121968 226120 -197996
11648a26120d3989j01087K9588I4676Q5094d5266l66399a22737C06417i1730j47604
$$ -126120 -43989 -145076 -115488 94676 179770 -45266 -411665 -122737 306417 -91730 -239334
11637b39334H0339J44412G8778h8478H8427a00060G0138K3345j1413J25005j2010
$$ -239334 80339 224751 78778 -88478 88427 -100060 70138 93483 82070 207075 195065
11626A95065d3166E10830a84012e2983q866r6831H7246O7161E8110J34457c10740
$$ 195065 -43166 510830 -184012 -52983 -61849 -158680 87246 154407 58110 192567 -310740
11614A30627F4953P743b56292a09581A13816b49358f5116j16311h234j62989l63113
$$ 130627 64953 72696 -256292 -109581 113816 -249358 -65116 -181427 -8234 -171223 -534336
11603e34336E2515J24785p7042j0932J22763n1561l8976a44327B01788D7550R6946
$$ -534336 52515 177300 100258 89326 212089 160528 121552 -144327 201788 47550 144496
11592A44496k0476Q3072D8476a52329B67729B1932R8563g3543I5950j2248J2166
$$ 144496 124020 207092 48476 -152329 267729 21932 120495 -73543 95950 83702 95868
11581I5868M6320b86226E4317J57775b08955A09295Q9169a53942A77461a41883
$$ 95868 142188 -286226 54317 212092 -208955 109295 198464 -153942 177461 -141883
11570d0653j80359g4001B56644b04375b8721j53327A84485i8150C75369A06455
$$ -40653 -221012 -74001 256644 -204375 -28721 -182048 184485 -98150 375369 106455
11559B04083Q0355b66152B5654i6215d5860j11455D6278j5321J34688G1445j3267
$$ 204083 284438 -266152 25654 -96215 -45860 -157315 46278 30957 165645 71445 58178
11548E8178a53101G7680C3301c0938j9872m3613B41597l3378b64422I3342C2970
$$ 58178 -153101 77680 33301 -30938 -50810 -94423 241597 208219 -264422 93342 32970
11536d9022j10207h465A53422f5364r8839A64347D855P0373b2880j49142A7158
$$ -49022 -159229 -8465 153422 -65364 -164203 164347 4855 75228 -22880 -172022 17158
11524B60071h4780A30626J5425Q2223C584a20911N0802C18520A17908b49718j93182
$$ 260071 -84780 130626 146051 228274 3584 -120911 -70109 318520 117908 -249718 -442900
11513d42900h6902A41357c1719k8378j2190K610B50049a50861B19032a29728A74451
$$ -442900 -86902 141357 -31719 -60097 -72287 -69677 250049 -150861 219032 -129728 174451
11501B66926g402A63260B6556L19961o2197b00038c6204I2343b0519A95293l9749
$$ 266926 -7402 163260 26556 346517 284320 -200038 -36204 92343 -20519 195293 155544
11490A55544m8822J30563a43218C7877f1864j1999B07609a00386B75241G6160
$$ 155544 106722 237285 -143218 37877 -61864 -73863 207609 -100386 275241 76160
11479A65518L59187E9326B164Q8258a62285A4920K01213J04270q9296o7209K5016
$$ 165518 524705 59326 2164 90422 -162285 14920 216133 320403 231107 163898 188914
11468A88914o0719M9987Q550B9386c48063i1784H1400J0844j3368J36231b7833
$$ 188914 128195 178182 186732 29386 -348063 -91784 81400 92244 78876 215107 -27833
11456b54556c0696A93465D6783K9694J4746h058A96641L055F5081a60717A09723
$$ -254556 -30696 193465 46783 76477 91223 -8058 196641 199696 65081 -160717 109723
11444b97713A79246D2455i3689J7350B08915a97123B09763m7791n4164m5890d6365
$$ -297713 179246 42455 -93689 -76339 208915 -197123 209763 161972 107808 61918 -46365
11432B22155h6142A38317J43253a52265C8980a04349A63891o2369a35209D9617
$$ 222155 -86142 138317 281570 -152265 38980 -104349 163891 101522 -135209 49617
11421B3702J1582M0364J10423a23614c6356k4102j46440I2252L089a04359p7464
$$ 23702 35284 75648 186071 -123614 -36356 -60458 -206898 92252 95341 -104359 -181823
11410a81823G4124K2273j1758A2659a62106G0198r993J59913I8495b468A32968
$$ -181823 74124 96397 84639 12659 -162106 70198 60205 220118 98495 -2468 132968
11398i8399Q451E902J24825h1898E1127Q4199F2372b44775A33903b59131A30323
$$ -98399 -89948 5902 130727 -81898 51127 135326 62372 -244775 133903 -259131 130323
11386F2635a93245C3032R7085d5669p1034F0811a33842b7936L398q5671j7817
$$ 62635 -193245 33032 130117 -45669 -116703 60811 -133842 -27936 -24538 -110209 -128026
11375a28026C73159b5467j26627B2357J20895i478A24728A8908J58500K33482
$$ -128026 373159 -25467 -152094 22357 143252 -9478 124728 18908 177408 410890
11365D10890E4638N0055b71222C03382E1420d32164a28080A30491f8410j06413
$$ 410890 54638 104693 -271222 303382 51420 -432164 -128080 130491 -68410 -174823
11355a74823f9485A25800E8604L61995g1984C65588o0126h4652D44503b8626A7476
$$ -174823 -69485 125800 58604 420599 -71984 365588 305462 -84652 444503 -28626 17476
11343d6478E4075a03941C02928G6217a73316C27205a06088B50074E6507M5489
$$ -46478 54075 -103941 302928 76217 -173316 327205 -106088 250074 56507 101996
11333A01996J1906l6352a84734j44598K7099c0154F4893O6954a96264M0449P6386
$$ 101996 113902 77550 -184734 -329332 -302233 -30154 64893 131847 -196264 -155815 -79429
11322g9429L7138B08280p6984E1374a59508N1486A03088b3607j00944A20583a22200
$$ -79429 -42291 208280 131296 51374 -159508 -108022 103088 -23607 -124551 120583 -122200
11310a38350n2779k53312G0118d28438i7766j49774A01981K7256a54544k0219
$$ -138350 -191129 -444441 70118 -428438 -97766 -247540 101981 129237 -154544 -174763
11300a74763r7391H4423B6853e5453k6790A22864e6327p4318L3529A65129l2036
$$ -174763 -272154 84423 26853 -55453 -82243 122864 -56327 -130645 -97116 165129 133093
11289A33093J12940b7752j50324F5621Q4644a97002B05445A5200M4515g6843I5080
$$ 133093 246033 -27752 -178076 65621 150265 -197002 205445 15200 59715 -76843 95080
11277a7663e186j6640k7773A34171a09947a2052o7445k56936A13436e5321a8103
$$ -17663 -5186 -21826 -49599 134171 -109947 -12052 -79497 -336433 113436 -55321 -18103
11265h3087B5034b87078a09086R919p3158B19614e9122B4427J22070b94515B24121
$$ -83087 25034 -287078 -109086 -99167 -172325 219614 -59122 24427 146497 -294515 224121
11253a19734j2109M8862j72891M9590Q8627A7165J07123E9193a22135j67239L6991
$$ -119734 -131843 -82981 -255872 -206282 -117655 17165 124288 59193 -122135 -289374 -252383
11242b52383J7738D2991K5840a65992A48705J250b40249B36560D8231K09248f8366
$$ -252383 -234645 42991 68831 -165992 148705 149955 -240249 236560 48231 257479 -68366
11230a7747k57485A32487a11024m656b2861k55030a8093k02610P2582f6953k1793
$$ -17747 -275232 132487 -111024 -115680 -22861 -277891 -18093 -220703 -148121 -66953 -88746
11219h8746j55683g721A77042a28419I1982a11462b0849j21255A8176b04896C86724
$$ -88746 -244429 -7721 177042 -128419 91982 -111462 -20849 -142104 18176 -204896 386724
11207a24079A25331b83978R0770D0233O8154a54739I4122a97827q8978i8519M0184
$$ -124079 125331 -283978 -193208 40233 108387 -154739 94122 -197827 -286805 -98519 -58335
11196e8335j6210F655J33970c41289e6213C15251E5256e2199o7015n9880G4798
$$ -58335 -74545 6655 140625 -341289 -56213 315251 55256 -52199 -119214 -179094 74798
11184a60186j06626a17891C2307M3711J91576b10844D4703J7148d635a70A56231
$$ -160186 -266812 -117891 32307 76018 267594 -210844 44703 61851 -4635 -170 156231
11172B13325d14284a57103j27208H6377d403o8885B6539h8013A87830m7664F6482
$$ 213325 -414284 -157103 -284311 86377 -4403 -73288 26539 -88013 187830 140166 66482
11160b21434B91508a61111A85642a73226A42174g7470c6268j02923b171n8736
$$ -221434 291508 -161111 185642 -173226 142174 -77470 -36268 -139191 -2171 -60907
11150f0907B4077N7517f09G978a98278J0406f1749A82673b41894d5492q234q2690
$$ -60907 24077 81594 -609 7978 -198278 -187872 -61749 182673 -241894 -45492 -53726 -136416
11138a36416A29589Q3540G9121C3406J5257n679g6434j74944A13996a87307N3940
$$ -136416 129589 213129 79121 33406 48663 42984 -76434 -251378 113996 -187307 -133367
11127a33367A47902J41801b09260A19394d8108A62155c7610A98057N520e2347
$$ -133367 147902 289703 -209260 119394 -48108 162155 -37610 198057 203577 -52347
11116E0850J69481A6431K26758a32869A8584K25980a60873B19939d1893m8952
$$ 50850 220331 16431 243189 -132869 18584 244564 -160873 219939 -41893 -90845
11106i0845B06103J00416A36135J49583C5276P0375k030g3712j52664H0071b65339
$$ -90845 206103 306519 136135 285718 35276 105651 103621 -73712 -226376 80071 -265339
11094A52161J6201p8416J46258A0284a37151P154D54356i6497F1941K23427j25760
$$ 152161 168362 89946 236204 10284 -137151 -129997 454356 -96497 61941 285368 159608
11083A59608P0637n3309K80726o0340A5259b2747H1682h7099D97259j25694A74928
$$ 159608 230245 176936 457662 397322 15259 -22747 81682 -87099 497259 371565 174928
11071C56971q015k7695K214A16851l2122O2309J0083J12047J01254H158K92406
$$ 356971 348956 321261 323475 116851 84729 147038 157121 269168 370422 8158 300564
11060C00564k9630J64286k2894j55350j19329c9352C97422L25801k05852J01246
$$ 300564 270934 435220 412326 256976 137647 -39352 397422 723223 517371 618617
11050F18617j79800p6813K59904Q2906C51549K31086k12857J02189B30290K51964
$$ 618617 438817 362004 621908 704814 351549 582635 369778 471967 230290 482254
11040D82254j52183j55386K65603J12928o7801J47831j91758j30984l7557Q422
$$ 482254 330071 174685 440288 553216 485415 633246 441488 310504 272947 281369
11030B81369J79635J44511B38535J23029j38778K41741q6754L55234k22016k06279
$$ 281369 461004 605515 238535 361564 222786 464527 377773 733007 510991 304712
11020C04712j13028p8064J80316A06213K29438P9050K8096m4071k1598l7543Q4365
$$ 304712 191684 113620 293936 106213 335651 414701 442797 398726 377128 339585 423950
11009D23950j43587J49387j55343j28084J3284j8821J25713J02125L8581j00455
$$ 423950 280363 429750 274407 146323 159607 140786 266499 368624 407205 306750
10999C06750r1281N06769l53629N9912r1437K16539B69331M03876j52532j04128
$$ 306750 215469 722238 368609 428521 337084 553623 269331 673207 520675 416547
10989D16547j83066L2289L69499J35066k42879K3339J56585j15082K5622K55359
$$ 416547 233481 265770 635269 770335 527456 550795 707380 592298 617920 873279
10979H73279j40488q2577L0882M07944R6524j55900N12719J42869k20626K95921
$$ 873279 732791 650214 681096 1089040 1185564 1029664 1542383 1685252 1464626 1760547
10969A760547l5141l84733M12008l96310j02223o100o0627k01568o1069P3407
$$ 1760547 1725406 1340673 1752681 1356371 1254148 1248048 1187421 985853 924784 998191
10959I98191J00245j7953L90383n29723M71398j89967K23974l44478k7341m10547
$$ 998191 1098436 1080483 1470866 941143 1412541 1222574 1446548 1102070 1074729 664182
10949F64182J0982B48400J30460N9620j93442K65208F7140L82679A78868J24840
$$ 664182 675164 248400 378860 438480 245038 510246 67140 449819 178868 303708
10939C03708O4425c21109F2908a49760B1250R4863K5317J51338j34922O6513a14704
$$ 303708 368133 -321109 62908 -149760 21250 116113 141430 292768 157846 224359 -114704
10927A94814N4823J17960M860F9440a37490j31407A19529a94365l2026j28346
$$ 194814 249637 367597 372457 69440 -137490 -268897 119529 -194365 -226391 -354737
10917c54737J40047r4184A5389o773c42802B94497p5491C5369a34013D00361A82856
$$ -354737 -214690 -308874 15389 8616 -342802 294497 219006 35369 -134013 400361 182856
10905c4017k7183n3507K3471F7147e5204A5220b1425q8987F0065b43382c0623
$$ -34017 -61200 -114707 -91236 67147 -55204 15220 -21425 -110412 60065 -243382 -30623
10893e8876k16742A28227a92091a212A09446a11046C18267l8391G9008c84269
$$ -58876 -275618 128227 -192091 -1212 109446 -111046 318267 279876 79008 -384269
10882d1567l8940A88560a05356n2652o0632B26671c6480j54492C82267d6596C75404
$$ -41567 -80507 188560 -105356 -158008 -218640 226671 -36480 -190972 382267 -46596 375404
10870A99348b16282A73012d01329G3255L4849M6355J42482F0689K90621e2464
$$ 199348 -216282 173012 -401329 73255 108104 154459 296941 60689 351310 -52464
10859I1327J02949b3317B20808A1384b89528E1504b34018M9967B5656L51402E3547
$$ 91327 194276 -23317 220808 11384 -289528 51504 -234018 -184051 25656 377058 53547
10847B0065K3903J16924L7650k2585a17176g324q4943H2661e4764m5074g165A58872
$$ 20065 43968 160892 198542 175957 -117176 -7324 -92267 82661 -54764 -99838 -7165 158872
10834a66216I5648a97674d6644H9418b41526g6383j03380B7288M7699K42493e0944
$$ -166216 95648 -197674 -46644 89418 -241526 -76383 -179763 27288 74987 317480 -50944
10822g3117q1879J2C17546b11758e6999C7934J98343i8921j63623B00617A2940
$$ -73117 -154996 -154984 317546 -211758 -56999 37934 236277 -98921 -262544 200617 12940
10810I9511b75528A99708J68795d7728C07758e2988j47255l362j58877F1963c00763
$$ 99511 -275528 199708 368503 -47728 307758 -52988 -200243 -203605 -362482 61963 -300763
10798D6641a49511B4348a198k41849B16914n5522a79323j47604k300A85164N195
$$ 46641 -149511 24348 -1198 -243047 216914 161392 -179323 -326927 -329227 185164 190359
10787A90359c5120A49972c1481G4499b00831J9103A78105G2816b21739q9787a45573
$$ 190359 -35120 149972 -31481 74499 -200831 -181728 178105 72816 -221739 -311526 -145573
10775A3091N3937J56019n2903G7067J24125A1486a20953A67507a23869j88194
$$ 13091 67028 223047 170144 77067 201192 11486 -120953 167507 -123869 -312063
10765c12063D988L54662i9689H9800d0623E6193a63766A67338a81968P2250j11717
$$ -312063 4988 359650 -99689 89800 -40623 56193 -163766 167338 -181968 -109718 -221435
10754b21435k5835J08758k593K4483H7458P5732a96249c0927o24E1072a60237
$$ -221435 -247270 -138512 -141105 -116622 87458 163190 -196249 -30927 -31551 51072 -160237
10742c93234a12656K3076l8925K6546A94165b82809h7380Q129p313j35963M1196
$$ -393234 -112656 -89580 -128505 -101959 194165 -282809 -87380 -79251 -86564 -222527 -181331
10731a81331D1235b00574k9069C73725b32515J7459j7178e7278j73573f0962H8268
$$ -181331 41235 -200574 -229643 373725 -232515 -215056 -232234 -57278 -230851 -60962 88268
10719A7466M14456e3196j1892A37511a06149k11755A74324E6620L9265B2371b6025
$$ 17466 431922 -53196 -65088 137511 -106149 -317904 174324 56620 95885 22371 -26025
10707A10480g9855r7024k6972H934b8594k09677I4032L29353c08459L5413c0116
$$ 110480 -79855 -176879 -203851 8934 -28594 -238271 94032 423385 -308459 -273046 -30116
10695C6221K81270N2581j35615b0387A37893l1850b14687R4370m0486a6206p7400
$$ 36221 317491 370072 234457 -20387 137893 106043 -214687 -120317 -160803 -16206 -93606
10684i3606a1158N330m8685d469j52601C33d99768d9501j38765Q80H1667R9746
$$ -93606 -11158 -5828 -54513 -4469 -157070 333 -499768 -49501 -188266 -187386 81667 181413
10672A81413E3261N2243a02939j30413A72594F4979J93084A6473K0577b35208
$$ 181413 53261 105504 -102939 -233352 172594 64979 258063 16473 37050 -235208
10661a0142k59876G1360c6832A46477a34109e2182j8095j31685D8756a41301j52813
$$ -10142 -270018 71360 -36832 146477 -134109 -52182 -70277 -201962 48756 -141301 -294114
10650b94114C00473a51789g5277K2716j70897h479C06314g7002K4400D1228d48716
$$ -294114 300473 -151789 -75277 -52561 -223458 -8479 306314 -77002 -52602 41228 -448716
10638e9911A67893b01470j30644J05191A62426h2107l79748a60077A97248b56132
$$ -59911 167893 -201470 -332114 -226923 162426 -82107 -461855 -160077 197248 -256132
10627C00847A45157m7837G427b88509g3972I5406b67178M6018a0421r9868m8906
$$ 300847 145157 97320 7427 -288509 -73972 95406 -267178 -221160 -10421 -110289 -159195
10616a59195A53159K1346p538K6319L2187A6052c69734A57172C2376J92000a93500
$$ -159195 153159 174505 166967 193286 225473 16052 -369734 157172 32376 224376 -193500
10604a21761k5444k11019h6897A61236C4002K9226L42206D8904b76767b0470F678
$$ -121761 -147205 -358224 -86897 161236 34002 63228 405434 48904 -276767 -20470 6678
10592B91271a03732I1135Q7681g6888D304K04899b046l50850A95712E7895b14292
$$ 291271 -103732 91135 178816 -76888 4304 209203 -2046 -352896 195712 57895 -214292
10580C65536a05403j91738E4502j1772a86636A8183d1920k6124B22033b37327
$$ 365536 -105403 -297141 54502 42730 -186636 18183 -41920 -68044 222033 -237327
10569B21516a62765F542J34487c62116A3138a10147D1894J46544d962F7245c3217
$$ 221516 -162765 6542 141029 -362116 13138 -110147 41894 188438 -4962 67245 -33217
10557B23632I1115b52957l8693C48752g4126D9152a37100q7963j193e2042H198
$$ 223632 91115 -252957 -291650 348752 -74126 49152 -137100 -225063 -226256 -52042 8198
10545A73433b33404q8334j41382J97905O9543A92393a31543A88088c45813J04417
$$ 173433 -233404 -321738 -463120 -265215 -195672 192393 -131543 188088 -345813 -241396
10535b41396B98323a7713A22354M8573H402a30207k6067A72882D8677E229M7535
$$ -241396 298323 -17713 122354 170927 8402 -130207 -156274 172882 48677 5229 52764
10524E2764M7556b6119q1041c6870k04587B36475G6800b43061B19393I7660N8981
$$ 52764 100320 -26119 -107160 -36870 -241457 236475 76800 -243061 219393 97660 156641
10513A56641A1770N865b33083l9525M3074a03527B05143d38671a55919L6200F3447
$$ 156641 11770 17635 -233083 -272608 -229534 -103527 205143 -438671 -155919 -119719 63447
10501I5824b15900J00970L4758F0039J37676b16233B98693H6424l8291Q718b99307
$$ 95824 -215900 -114930 -80172 60039 197715 -216233 298693 86424 48133 56851 -299307
10489B99225G3065g5531d738C37079A17731b82666b8114B08049K09623r0738L0420
$$ 299225 73065 -75531 -4738 337079 117731 -282666 -28114 208049 417672 326934 357354
10478C57354m3261n438L5854A45435n1938M0197k9372c2613k71482A44601n9112
$$ 357354 314093 308655 344509 145435 93497 133694 104322 -32613 -304095 144601 85489
10467H5489b3140j96037P4277j70432a01875n4795o983c5668H2877K6173a9129
$$ 85489 -23140 -219177 -144900 -315332 -101875 -156670 -163653 -35668 82877 109050 -19129
10455A37436C6973J8371b74158c7270a7505j18049j57723P8493A32705a92153
$$ 137436 36973 55344 -274158 -37270 -17505 -135554 -293277 -214784 132705 -192153
10444A42327J7815c65733A07228J20902J55969A39493a55805O3491H7656h3369
$$ 142327 160142 -365733 107228 228130 384099 139493 -155805 -92314 87656 -83369
10433b1344C2974K03688G148f4941p5355A55854a51083A61419B4913l627f0367
$$ -21344 32974 236662 7148 -64941 -140296 155854 -151083 161419 24913 21286 -60367
10421A41155l6537a44486H5105a53420j10440h062A83867a8927j61805A00501
$$ 141155 104618 -144486 85105 -153420 -263860 -8062 183867 -18927 -180732 100501
10410B2866b87002O4874k37684d1682j25223M0390A01204R4646a60266a2555A61951
$$ 22866 -287002 -222128 -459812 -41682 -166905 -126515 101204 195850 -160266 -12555 161951
10398A747K19546f6608k86474a47710j91534d0479D6609j8176j1679K10007b23321
$$ 1747 221293 -66608 -353082 -147710 -339244 -40479 46609 28433 16754 226761 -223321
10386h0382k7257A6491P111J90986I9827G422f0313B3386K02795N1119m6928J10434
$$ -80382 -107639 16491 23602 214588 99827 7422 -60313 23386 226181 277300 230372 340806
10374C40806l4555n5342A17738c0743A87467R502A3027K66155J32862j86646J7828
$$ 340806 306251 250909 117738 -30743 187467 196969 13027 279182 412044 225398 243226
10363B43226J11097N0336k01501J6017J1222n3044C3353J47453d9760k0848D7463
$$ 243226 354323 404659 203158 219175 230397 177353 33353 180806 -49760 -70608 47463
10351B93689p5846j06777P6497B7940J73615M11647g1907B68613A32549J83737
$$ 293689 217843 111066 187563 27940 201555 613202 -71907 268613 132549 316286
10341C16286A22046P4301J8447a48085D43137c0216A82723n5718b87437i5989
$$ 316286 122046 196347 214794 -148085 443137 -30216 182723 127005 -287437 -95989
10330A17441P4095p4376h4440j3879A00179J24085a86076M8522D3663J85116C0627
$$ 117441 191536 117160 -84440 -98319 100179 224264 -186076 -137554 43663 228779 30627
10318a38427B22022N4033F6654J73244c1056B13554g4273D6899a79604B25818
$$ -138427 222022 276055 66654 239898 -31056 213554 -74273 46899 -179604 225818
10307a88950q9140F1618a38850C7319K90002n092a40175D4114h9483q1746K4369
$$ -188950 -278090 61618 -138850 37319 327321 322229 -140175 44114 -89483 -171229 -146860
10296a46860B38167b21906H2369a33886M3172E8703f7831r2125b2166A28730a47475
$$ -146860 238167 -221906 82369 -133886 -90714 58703 -67831 -159956 -22166 128730 -147475
10284a82070m1284b8686b47k09754A6930c071j23474p18A45482c12135J8394I6783
$$ -182070 -223354 -28686 -247 -210001 16930 -3071 -126545 -127263 145482 -312135 -293741 96783
10271D5178a3326B84909b13992N8989A96408I1269Q261k6898K21194H109J17608
$$ 45178 -13326 284909 -213992 -155003 196408 91269 99530 72632 293826 8109 125717
10260A25717J62264M303d21292C98207J04643B37568G7492g5442K505m9839J3017
$$ 125717 287981 292284 -421292 398207 502850 237568 77492 -75442 -72937 -122776 -109759
10249a09759o9793A7922L3021M3748h7101j57963d3792l22740B1775a7461n5857
$$ -109759 -179552 17922 50943 94691 -87101 -245064 -43792 -366532 21775 -17461 -73318
10238g3318I8493N6426a67431B25338a87A35252L6306a76696F6626d6054n1135
$$ -73318 98493 154919 -167431 225338 -187 135252 171558 -176696 66626 -46054 -97189
10227i7189A90953a34386j24754h9466k5588A7129N178a18384j29863E9200P2799
$$ -97189 190953 -134386 -259140 -89466 -115054 17129 22307 -118384 -248247 59200 131999
10216A31999d7846A73947a51409j32160J21740d8426E427a7135k5721k16912j1375
$$ 131999 -47846 173947 -151409 -283569 -161829 -48426 5427 -17135 -42856 -259768 -271143
10205b71143a17402k9314D9111J55670a46992j56277a09722B21105b7561B37824
$$ -271143 -117402 -146716 49111 204781 -146992 -303269 -109722 221105 -27561 237824
10194C37571a24593p823p0334f5494K5373a7591k21873r6145F0044a9070p3182
$$ 337571 -124593 -132416 -202750 -65494 -40121 -17591 -239464 -335609 60044 -19070 -92252
10183i2252j62221a27C4204e0712r0155A43257A9668J55081j3399J7372a24975
$$ -92252 -254473 -127 34204 -50712 -140867 143257 19668 174749 161350 178722 -124975
10171c85585H77i4239F2197a67370k6022O0622n5351P622D2864a13014j20312
$$ -385585 877 -94239 62197 -167370 -193392 -132770 -188121 -180499 42864 -113014 -233326
10160b33326f99A75274d71248A45054a7874F807a5316I5228Q132K15148i9338
$$ -233326 -699 175274 -471248 145054 -17874 6807 -15316 95228 103360 318508 -99338
10148C02910A24898b36387O6127M4168B9994a11295L461A41129b42680R4929l932
$$ 302910 124898 -236387 -170260 -126092 29994 -111295 -107834 141129 -242680 -147751 -151683
10137a51683j16614J18498B35830a13438l217b3752A64621a78715k9771n2021
$$ -151683 -268297 -149799 235830 -113438 -116655 -23752 164621 -178715 -208486 -260507
10127b60507A2255a43987p5082a3008j88119a8423j03584G294c17848B60987c13697
$$ -260507 12255 -143987 -219069 -13008 -201127 -18423 -122007 7294 -317848 260987 -313697
10115B1775N7118J26566E6857b01492e6904j22688B20216I041L03213a1936D8103
$$ 21775 78893 205459 56857 -201492 -56904 -179592 220216 9041 312254 -11936 48103
10103G6380A8217c63593I938b77054C7001b1669p6586n2771j01917j2082F4084
$$ 76380 18217 -363593 9938 -277054 37001 -21669 -98255 -151026 -252943 -265025 64084
10091d6931B0649b66963O7753h0558c0820I919c63552B40933j12859B3431a03458
$$ -46931 20649 -266963 -199210 -80558 -30820 9919 -363552 240933 128074 23431 -103458
10079g2405b8167I9354c670m0725j04661j0824d6068D9155M5323f4353j21496
$$ -72405 -28167 99354 -3670 -44395 -149056 -159880 -46068 49155 94478 -64353 -185849
10068a85849H5445C8786c08478G0537i3434k4065D9816J27355a87148N0323j26447
$$ -185849 85445 38786 -308478 70537 -93434 -117499 49816 177171 -187148 -136825 -263272
10057b63272B54292a13321I723b60889h6365j71577Q8221k9511A2560b17023i4416
$$ -263272 254292 -113321 9723 -260889 -86365 -257942 -169721 -199232 12560 -217023 -94416
10045C3545g3876A76668a82408E9751J91284a81818b5830j61834j11104J35603
$$ 33545 -73876 176668 -182408 59751 251035 -181818 -25830 -187664 -298768 -163165
10035a63165D3961J44936c9098D16872C7392M5174O1022E6468c92564A63846k2406
$$ -163165 43961 188897 -39098 416872 37392 82566 143588 56468 -392564 163846 141440
10024A41440A7247O7525h5357E095b869B1247d5556q1558a7966C07868d5779A21760
$$ 141440 17247 84772 -85357 5095 -2869 21247 -45556 -127114 -17966 307868 -45779 121760
10011a00782j2240O114I015c60097d4261I1219f8026k33708A70862C0013p896
$$ -100782 -113022 -106908 9015 -360097 -44261 91219 -68026 -301734 170862 30013 22117
10000B2117b53357A05990C8809i0396N47A2769k126a44369b2619o7404h892A75591
$$ 22117 -253357 105990 38809 -90396 -89849 12769 10643 -144369 -22619 -90023 -8892 175591
9987D0023b49753i6604l3926J3191j838A70986c6511j24556C0322b37783a8459
$$ 40023 -249753 -96604 -130530 -117339 -119177 170986 -36511 -161067 30322 -237783 -18459
9975c32315a02744l4268m1217c6221A3435a57333n6880F2590a59540j8766b6018
$$ -332315 -102744 -137012 -178229 -36221 13435 -157333 -214213 62590 -159540 -178306 -26018
9963B4954b60215o6956a803l05185J51194b6763n4264D3225j7673a88994d7942
$$ 24954 -260215 -327171 -1803 -306988 -155794 -26763 -81027 43225 25552 -188994 -47942
9951A30133a21882a5007k72412d107k85469C4951K1521K39R336h2941f028A9856
$$ 130133 -121882 -15007 -287419 -4107 -289576 34951 56472 56711 66047 -82941 -6028 19856
9938A89462c0031f452j1555k62731A2744J71977b00885j16379j34424A2960K3631
$$ 189462 -30031 -6452 -18007 -280738 12744 184721 -200885 -317264 -451688 12960 36591
9927C6591a17737B36452h456k72007r5540e5049B09971a57115A90253a1345m33709
$$ 36591 -117737 236452 -8456 -280463 -376003 -55049 209971 -157115 190253 -11345 -445054
9916d45054a56680H7936k5387b11654D9272a82958D0672N535K21380E3067g9261
$$ -445054 -156680 87936 62549 -211654 49272 -182958 40672 46207 267587 53067 -79261
9904c60133d1653l2691D4479e9051B17575B9762a93568n1505n7506C8106b45251
$$ -360133 -41653 -74344 44479 -59051 217575 29762 -193568 -245073 -302579 38106 -245251
9892a58698A0716J0667J3698K54892a8028l2548j13347a1197B11993b0057j13243
$$ -158698 10716 21383 35081 289973 -18028 -50576 -163923 -11197 211993 -20057 -133300
9881a33300d6313r1702m905r516A04715i455B42235d153o0370B9971b74083J25380
$$ -133300 -46313 -138015 -142920 -152436 104715 -9455 242235 -4153 -64523 29971 -274083 -148703
9869a48703k9126a1815I6957e6807q0252q9817N712h8193j09071d6713k158A57842
$$ -148703 -177829 -11815 96957 -56807 -137059 -226876 -221164 -88193 -197264 -46713 -48871 157842
9856A48704b88734O1003k2728c6380A9952a38757B37242a28205H5924C7145a66725
$$ 148704 -288734 -227731 -250459 -36380 19952 -138757 237242 -128205 85924 37145 -166725
9844B10880b1944A7356M4799a89679E2612h1227C4708J8289R0417a90493j1527
$$ 210880 -21944 17356 62155 -189679 52612 -81227 34708 52997 143414 -190493 -202020
9833b02020f5207k40723C0805c6676A20380b67656A3908K13321b9974k18133k20349
$$ -202020 -65207 -305930 30805 -36676 120380 -267656 13908 227229 -29974 -248107 -468456
9822d68456a38171B4545a91866Q7639K5746A75120c54615c7406N014l05185i1907
$$ -468456 -138171 24545 -191866 -104227 -78481 175120 -354615 -37406 -32392 -337577 -91907
9810B65999p6714a49133j94839Q3294a26505B78593f5855A68618P8407a15980
$$ 265999 189285 -149133 -343972 -260678 -126505 278593 -65855 168618 247025 -115980
9799H7823m0213J20307a7621j19233F3567l1252l565e34474D0313e1237A47198
$$ 87823 47610 167917 -17621 -136854 63567 32315 28750 -534474 40313 -51237 147198
9787H1046L8536b1970K51j51922h2100A44675e9672A50383c0363A90675C5266
$$ 81046 119582 -21970 -21719 -173641 -82100 144675 -59672 150383 -30363 190675 35266
9775b1470A15443b5593l15848g7585B70143a22295r6737J4142j4607c2550A27807
$$ -21470 115443 -25593 -341441 -77585 270143 -122295 -219032 -204890 -219497 -32550 127807
9763B33040a89176j6372j73793E6770b43189J14165j90291i0663L8660p5271e6582
$$ 233040 -189176 -205548 -379341 56770 -243189 -129024 -319315 -90663 -52003 -127274 -56582
9751e7131j2627D7715c579A03830b14210k1195e9528k90976C6122c41885J25803
$$ -57131 -69758 47715 -3579 103830 -214210 -235405 -59528 -350504 36122 -341885 -216082
9740b16082k59441H8866a777k71452I4468b33698H18L4116a83930H5649i9022
$$ -216082 -475523 88866 -1777 -273229 94468 -233698 818 34934 -183930 85649 -99022
9728a46335c448D2967c01529a38187m1548l4024A27137J14213A13398h4169j13442
$$ -146335 -3448 42967 -301529 -138187 -179735 -213759 127137 241350 113398 -84169 -197611
9717a97611l1915i113A84759E5404P6318n9364c5356l28902A6386K4883c12343
$$ -197611 -229526 -9113 184759 55404 131722 72358 -35356 -364258 16386 41269 -312343
9705a17588j67414D9490L2612l3910D503M6181b48957a09083p6065g1639j00093
$$ -117588 -285002 49490 82102 48192 4503 50684 -248957 -109083 -185148 -71639 -171732
9694a71732d5668A18160a75549B87720A2920a55778H6379e5456G1441j6744g6132
$$ -171732 -45668 118160 -175549 287720 12920 -155778 86379 -55456 71441 54697 -76132
9682G1282a64446j825l6118A85366a85782P8161j33600M436D5031a73673J5658
$$ 71282 -164446 -166271 -202389 185366 -185782 -107621 -241221 -236785 45031 -173673 -158015
9671a58015P6153l4735b0510p7697m5533n8490h6617k1467A12523a35589L1600
$$ -158015 -81862 -116597 -20510 -98207 -143740 -202230 -86617 -108084 112523 -135589 -103989
9660a03989A38527c6542I2033a47582a8483j3601j21146r1473r9542P1051l1456
$$ -103989 138527 -36542 92033 -147582 -18483 -32084 -153230 -244703 -344245 -273194 -304650
9649c04650e7004A3288R5777c2204B29576J0347a0433C7829a25329M9758N439
$$ -304650 -57004 13288 109065 -32204 229576 239923 -10433 37829 -125329 -75571 -70132
9638g0132p3334D6755g2496A34760a28466K5943C31890a89830A15929A9961R6089
$$ -70132 -143466 46755 -72496 134760 -128466 -102523 331890 -189830 115929 19961 116050
9627A16050a60943A1025L57100h2276K900F7882c07958J42496A04356b19621B97293
$$ 116050 -160943 11025 368125 -82276 -79376 67882 -307958 -165462 104356 -219621 297293
9615C05642B8312h4062A08273J00805a2833B27508d3550A43764d18591a78855
$$ 305642 28312 -84062 108273 209078 -12833 227508 -43550 143764 -418591 -178855
9604b58188g47H6971b08984K8080k0136C2663b97570d4630B3607f9645A38409
$$ -258188 -747 86971 -208984 -180904 -201040 32663 -297570 -44630 23607 -69645 138409
9592A0804i5358n7681A29442b7429j18699P0289j07721e0759j97467k08646i5344
$$ 10804 -95358 -153039 129442 -27429 -146128 -75839 -183560 -50759 -248226 -456872 -95344
9580a58363N7436j39197e0753o6944j38967a17531m6952j34131a15211q474K3143
$$ -158363 -100927 -240124 -50753 -117697 -256664 -117531 -164483 -298614 -115211 -123685 -100542
9569a00542H6223h3075B38372p4891a7526q9656H3175l516d7618k93186J15733
$$ -100542 86223 -83075 238372 163481 -17526 -107182 83175 79659 -47618 -340804 -225071
9558b25071Q851i2883E9930a7370l2249e412a265l0130j67691A367R259b19580
$$ -225071 -216220 -92883 59930 -17370 -49619 -5412 -1265 -31395 -199086 1367 10626 -219580
9545G5831a01590a5923j9415B26917c6071j94989k1819B76775d7565o3753p4123
$$ 75831 -101590 -15923 -35338 226917 -36071 -231060 -252879 276775 -47565 -111318 -185441
9534a85441D3059a71289m9059d3697B50679G4770P3157a37057C4066b39553J01931
$$ -185441 43059 -171289 -220348 -43697 250679 74770 147927 -137057 34066 -239553 -137622
9523a37622L9893j41442G712J02959K4182E002J50015a84983B42534b2453j0646
$$ -137622 -97729 -239171 7712 110671 134853 5002 155017 -184983 242534 -22453 -33099
9512c3099m0664A25610J25422b64795F7537k3280c3481B5370a37796c2663D2485
$$ -33099 -73763 125610 251032 -264795 67537 44257 -33481 25370 -137796 -32663 42485
9500A85967a59436e2281H7576a88241f3976D1021b93007a36164d007j97022A24352
$$ 185967 -159436 -52281 87576 -188241 -63976 41021 -293007 -136164 -4007 -201029 124352
9488A18887a61108L4482A09087a88039Q7101J1381j64476A6975b1935l8228l3553
$$ 118887 -161108 -126626 109087 -188039 -100938 -89557 -254033 16975 -21935 -60163 -93716
9477i3716A3711f3100I0550b99732a21568b5843k32182c1137j01697k61098E3339
$$ -93716 13711 -63100 90550 -299732 -121568 -25843 -258025 -31137 -132834 -393932 53339
9465b4416A14977b60118d3842A1354L43404a68732K482A74720F7630L16452e1487
$$ -24416 114977 -260118 -43842 11354 354758 -168732 -166250 174720 67630 384082 -51487
9453a78840A3053j434J68162a79953m2741f8662j52197j4640M8660B45269j03881
$$ -178840 13053 11619 179781 -179953 -222694 -68662 -220859 -235499 -186839 245269 141388
9442A41388b50722i5317D3044K6115b69504A17742L9381b38986A48407D566O6338
$$ 141388 -250722 -95317 43044 69159 -269504 117742 157123 -238986 148407 4566 70904
9431G0904a12566A25976b01989O9724j93891i9830K5004m052j62767E9089K37001
$$ 70904 -112566 125976 -201989 -132265 -326156 -99830 -74826 -78878 -241645 59089 296090
9420B96090b6503o925j67409A31297m5737b2529k7637l31147G5980a67861b1463
$$ 296090 -26503 -33428 -200837 131297 85560 -22529 -50166 -381313 75980 -167861 -21463
9408a72013A31810c26847A64402R4920h4669b8429J3648k22090F0315a19862B88188
$$ -172013 131810 -326847 164402 259322 -84669 -28429 -14781 -236871 60315 -119862 288188
9396B10461m245o5085D1823J90721a46685J4724I8179k8150a83465D749h4673
$$ 210461 206216 141131 41823 232544 -146685 -131961 98179 70029 -183465 4749 -84673
9384b65727A5807j241e38474A2084J10502b18680d3096k90993D0497j4792a95296
$$ -265727 15807 14566 -538474 12084 122586 -218680 -43096 -334089 40497 25705 -195296
9372B42576P0473a74610A73144D4107a60489l7332a418B87574c02750P7164i1751
$$ 242576 313049 -174610 173144 44107 -160489 -197821 -1418 287574 -302750 -225586 -91751
9360D9988a54663E7738c1143r6217A80134f2875E3762g2014C5351J63176g5567
$$ 49988 -154663 57738 -31143 -127360 180134 -62875 53762 -72014 35351 198527 -75567
9348a65698A72251A6078c7162C6827K27378e5587k28228J28782E30596E3624J1882
$$ -165698 172251 16078 -37162 36827 264205 -55587 -283815 -155033 530596 53624 65506
9337F5506e09842E1043b50114a15619I0478a21083H1112d9409k03733f9275j42593
$$ 65506 -509842 51043 -250114 -115619 90478 -121083 81112 -49409 -253142 -69275 -211868
9326b11868g3911O677K1852C81986a72551i910j48213h064A41345f6335A6208
$$ -211868 -73911 -67234 -45382 381986 -172551 -9910 -158123 -8064 141345 -66335 16208
9314g4496n1115n7978G5321a30509B3789b4829B53599C8221f5168A2557b20336
$$ -74496 -125611 -183589 75321 -130509 23789 -24829 253599 38221 -65168 12557 -220336
9302A36509c29682F4198h2466L000n2417A33888o1520c33475A20434J3014c73961
$$ 136509 -329682 64198 -82466 -79466 -131883 133888 72368 -333475 120434 133448 -373961
9290A45519b8212l87899a04907A64913k8270d34192a80915h5191G7232A502a17413
$$ 145519 -28212 -416111 -104907 164913 136643 -434192 -180915 -85191 77232 1502 -117413
9278A22048C5516N7986c17953G1623a50754k2552E4062b3542E0086c19619h0604
$$ 122048 35516 93502 -317953 71623 -150754 -173306 54062 -23542 50086 -319619 -80604
9266b27335C70656a40633d1608j48799r2556i9381A0446K35088H8772P5452F7719
$$ -227335 370656 -140633 -41608 -190407 -282963 -99381 10446 245534 88772 164224 67719
9254a41825B6741b5682j28224A56056c41054c5085j04638A11646m0008j2486c03603
$$ -141825 26741 -25682 -153906 156056 -341054 -35085 -139723 111646 71638 59152 -303603
9242E6289a48229b6025A48028a61326F6573e9304B3047L0166K66239b6704C9875
$$ 56289 -148229 -26025 148028 -161326 66573 -59304 23047 53213 319452 -26704 39875
9230h8973A86042a11525D3924J39987a75644H5804g7529j01231A49938j8100a20161
$$ -88973 186042 -111525 43924 183911 -175644 85804 -77529 -178760 149938 131838 -120161
9218d9603C12897b68844F3374a27881I6060a22999j11641c128H5834a81577B6094
$$ -49603 312897 -268844 63374 -127881 96060 -122999 -234640 -3128 85834 -181577 26094
9206c86569A02252J99027H1378i5760A30190h1003D5113P923P2660b0110A39918
$$ -386569 102252 301279 81378 -95760 130190 -81003 45113 53036 125696 -20110 139918
9194a31264A52463n7446d45862B53279q2601a26417B69645a37604k4439a8716
$$ -131264 152463 95017 -445862 253279 170678 -126417 269645 -137604 -162043 -18716
9183A32569F0968a066p5654C6567L92505A33727B7224a7200j91355Q6486B22032
$$ 132569 60968 -1066 -76720 36567 429072 133727 27224 -17200 -208555 -122069 222032
9171D5967B1324e6864L811A15045a24085l6430N9331L1785B96155D7696a00504
$$ 45967 21324 -56864 -53053 115045 -124085 -160515 -101184 -69399 296155 47696 -100504
9159a56198K0796n4186B70951c15507a02043q9315A04590b3712A67769A4770a24128
$$ -156198 -135402 -189588 270951 -315507 -102043 -191358 104590 -23712 167769 14770 -124128
9147C2039g430n8446k79392a1272k52147A00594b17035J07910A05811R2086a83172
$$ 32039 -7430 -65876 -345268 -11272 -263419 100594 -217035 -109125 105811 197897 -183172
9135A3770K865P7626k5412i9972k15190A37028l785R793n5438a97771b1606B6823
$$ 13770 16635 94261 68849 -99972 -315162 137028 133243 143036 87598 -197771 -21606 26823
9122B02962g1872p9871N5365j0301D4325g030B0973O239c985q6168r9735O928
$$ 202962 -71872 -151743 -96378 -106679 44325 -7030 20973 27212 -3985 -90153 -189888 -182960
9110a82960E509J50288b90353g4918E2956M6608h9903B3939O2380f7445j58719
$$ -182960 5509 155797 -290353 -74918 52956 99564 -89903 23939 86319 -67445 -226164
9099b26164f4453j93905Q6739a2790A62525I324K7050a04240A45132d3771G018
$$ -226164 -64453 -258358 -171619 -12790 162525 9324 36374 -104240 145132 -43771 7018
9087B23335b94884f9740l8333j64680N0503g2852m3191p6973h1216j09432f4405
$$ 223335 -294884 -69740 -108073 -272753 -222250 -72852 -116043 -193016 -81216 -190648 -64405
9075b62187O8807d6250D4465P140K0208g6552E7179c55018A52411F9609K6469
$$ -262187 -193380 -46250 44465 51605 71813 -76552 57179 -355018 152411 69609 96078
9064I6078m6942g1654A51245O3859r986a56010b2176I6083e6348k40953a4201
$$ 96078 49136 -71654 151245 215104 205118 -156010 -22176 96083 -56348 -297301 -14201
9052b88151n4949A29125h9284p3606A53879c16122b991B8160b08835C4414a34110
$$ -288151 -343100 129125 -89284 -162890 153879 -316122 -2991 28160 -208835 34414 -134110
9040a99931N7819A7625c39574O1259E6151a13450e2555k10925h0190A14997a27998
$$ -199931 -142112 17625 -339574 -278315 56151 -113450 -52555 -263480 -80190 114997 -127998
9028g7845p7752A06809C6887c32076J37004B19094a35216j27562A9648K09767
$$ -77845 -155597 106809 36887 -332076 -195072 219094 -135216 -262778 19648 229415
9018B29415r2909k2256m1153f8919B24511A09978a67140A14795a96470d6735B94820
$$ 229415 136506 114250 73097 -68919 224511 109978 -167140 114795 -196470 -46735 294820
9006d8215a9517j27532O0981p1549B73351b7684k91405f8009B21782J42310d0452
$$ -48215 -19517 -147049 -86068 -157617 273351 -27684 -319089 -68009 221782 364092 -40452
8994a68351A46536a26630r8534d6092o3355j1749D8012h0487j51223C61542a55329
$$ -168351 146536 -126630 -225164 -46092 -109447 -121196 48012 -80487 -231710 361542 -155329
8982i2014c3247e27F0577N717b91950B30505j9276B1160i7735j940F5330d0608
$$ -92014 -33247 -527 60577 66294 -291950 230505 211229 21160 -97735 -99675 65330 -40608
8969b37633A61570a92372d4690k49803a19955K9350A54582G0437K6305J64472
$$ -237633 161570 -192372 -44690 -294493 -119955 -90605 154582 70437 96742 261214
8959B61214d36545J97027D156d9492m4715q5912l1695O4270c9346B72523D394
$$ 261214 -436545 -239518 4156 -49492 -94207 -180119 -211814 -147544 -39346 272523 4394
8947a53237C44896f0238j38807b0797A5272a64181D957L55350G2853J01034L8454
$$ -153237 344896 -60238 -199045 -20797 15272 -164181 4957 360307 72853 173887 212341
8936B12341p8372A0926J68041M44804j84792A64434J35409A19945k6087r052J71285
$$ 212341 133969 10926 178967 623771 438979 164434 299843 119945 93858 84806 256091
8925B56091p7309M72581K61933J544604M398980Q433876D308156A960435H88115
$$ 256091 178782 651363 913296 2457900 6856880 15290756 4308156 1960435 888115
8915F08636j48674I3524B3574K4102g2666j0446A46724m3141L44215B713a65978
$$ 608636 459962 93524 23574 47676 -72666 -83112 146724 103583 447798 2713 -165978
8903b52029l1090B7570a75481I2433a11927B78634d02346i8015c3235j59509d92
$$ -252029 -283119 27570 -175481 92433 -111927 278634 -402346 -98015 -33235 -192744 -492
8891D5965B463a4027B9606a38846p7342o0424B96139i3262j32014b908j57746
$$ 45965 2463 -14027 29606 -138846 -216188 -276612 296139 -93262 -225276 -2908 -160654
8880a60654A9975L29103a3548r3695A2619O8332c63978A17468h2002p2309m519
$$ -160654 19975 349078 -13548 -107243 12619 80951 -363978 117468 -82002 -154311 -158830
8869a58830l14707K32533a01598A76457a54937l4777G4403a54033d716l43427
$$ -158830 -473537 -241004 -101598 176457 -154937 -189714 74403 -154033 -4716 -348143
$$ [...]
##END NTUPLES=NMR SPECTRUM
##END=
