##TITLE=NES1061_159122.0010_001_9704394_M04ESlPhw2
##JCAMPDX= 6.0         $$ Bruker NMR JCAMP-DX V2.0
##DATA TYPE= NMR SPECTRUM
##DATA CLASS= NTUPLES
##ORIGIN= BRUKER
##OWNER= Administrator
$$ 1.72 TOPSPIN		Version 2.1
$$ 2016-04-30 14:57:04.630 -0700  Administrator@X
$$ Compression mode = diff/dup
##.OBSERVE FREQUENCY= 400.02188249412
##.OBSERVE NUCLEUS= ^1H
##.ACQUISITION MODE= SIMULTANEOUS (DQD)
##.ACQUISITION SCHEME= undefined
##.AVERAGES= 64
##.DIGITISER RES= 22
##SPECTROMETER/DATA SYSTEM= spect
##.PULSE SEQUENCE= noesygpps1d.comp
##.SOLVENT NAME= COFFEE_meoh
##.SHIFT REFERENCE= INTERNAL, COFFEE_meoh, 1, 14.96172
##AUDIT TRAIL= $$ (NUMBER, WHEN, WHO, WHERE, PROCESS, VERSION, WHAT)
$$ ##TITLE= Audit trail, TOPSPIN		Version 2.1
$$ ##JCAMPDX= 5.01
$$ ##ORIGIN= Bruker BioSpin GmbH
$$ ##OWNER= Administrator
$$ $$ E:\/data/COFFEE/nmr/NES1061_159122.0010_001_9704394_M04ESlPhw2/12/pdata/1/auditp.txt
$$ ##AUDIT TRAIL=  $$ (NUMBER, WHEN, WHO, WHERE, PROCESS, VERSION, WHAT)
(   1,<2016-04-30 14:56:58.942 -0700>,<Administrator>,<X>,<go>,<TOPSPIN 2.1>,
      <created by zg
	started at 2016-04-30 14:45:29.536 -0700,
	POWCHK enabled, PULCHK disabled,
       configuration hash MD5:
       21 0F 79 D6 B3 7B B4 F6 88 20 88 DB 03 48 BD 9F
       data hash MD5: 64K
       59 F2 E6 6A D2 F8 EF 79 0A 4C 3B 01 68 38 F9 80>)
(   2,<2016-04-30 14:57:02.567 -0700>,<Administrator>,<X>,<proc1d>,<TOPSPIN 2.1>,
      <Start of raw data processing
       efp LB = 0.3 FT_mod = 6 PKNL = 1 PHC0 = 0 PHC1 = 0 SI = 128K 
       data hash MD5: 128K
       B5 1C F8 6A 1F 57 D0 7C B6 45 4A 7B 7D 30 B1 5D>)
(   3,<2016-04-30 14:57:03.458 -0700>,<Administrator>,<X>,<proc1d>,<TOPSPIN 2.1>,
      <pk PHC0 = -83.79822 PHC1 = 0 
       data hash MD5: 128K
       69 6B 20 F6 76 FF D0 B7 9A BF 97 95 34 01 C0 7F>)
(   4,<2016-04-30 14:57:03.880 -0700>,<Administrator>,<X>,<proc1d>,<TOPSPIN 2.1>,
      <abs ABSG = 1 
       data hash MD5: 128K
       EA 82 4F 83 80 02 A5 00 18 BB 96 61 94 C0 83 54>)
(   5,<2016-04-30 14:57:03.974 -0700>,<Administrator>,<X>,<proc1d>,<TOPSPIN 2.1>,
      <abs ABSG = 2 
       data hash MD5: 128K
       5E 15 88 7A 47 90 61 57 ED D2 D7 EE AA C2 14 36>)
(   6,<2016-04-30 14:57:04.052 -0700>,<Administrator>,<X>,<proc1d>,<TOPSPIN 2.1>,
      <abs ABSG = 3 
       data hash MD5: 128K
       57 49 CB A3 95 EF CC 35 D9 5F 9E 2C F4 BD 10 33>)
(   7,<2016-04-30 14:57:04.130 -0700>,<Administrator>,<X>,<proc1d>,<TOPSPIN 2.1>,
      <abs ABSG = 4 
       data hash MD5: 128K
       78 B5 99 52 14 FA E4 AD E2 CF 90 E8 4D 17 A0 EB>)
(   8,<2016-04-30 14:57:04.255 -0700>,<Administrator>,<X>,<proc1d>,<TOPSPIN 2.1>,
      <abs ABSG = 5 
       data hash MD5: 128K
       BE FE 23 53 A2 4A B8 5D FD 46 60 E1 B8 9C A9 9B>)
$$ ##END=
$$ 
$$ $$ hash MD5
$$ $$ F3 EA 94 53 10 82 22 69 BE 07 26 85 EB 40 DE C4
##$RELAX= 
##$RELAX= 
##$RELAX= 
##$RELAX= 
##$RELAX= 
##$RELAX= 
##$RELAX= 
##$RELAX= 
$$ Bruker specific parameters
$$ --------------------------
##$DU= <E:\>
##$EXPNO= 12
$$ [...]
##$TP07= 0
##$TPNAME0= <>
##$TPNAME1= <>
##$TPNAME2= <>
##$TPNAME3= <>
##$TPNAME4= <>
##$TPNAME5= <>
##$TPNAME6= <>
##$TPNAME7= <>
##$TPOAL= (0..7)
0.5 0.5 0.5 0.5 0.5 0.5 0.5 0.5
##$TPOFFS= (0..7)
0 0 0 0 0 0 0 0
##$TUNHIN= 0
##$TUNHOUT= 0
##$TUNXOUT= 0
##$USERA1= <user>
##$USERA2= <user>
##$USERA3= <user>
##$USERA4= <user>
##$USERA5= <user>
##$V9= 5
##$VALIST= <valist>
##$VCLIST= <CCCCCCCCCCCCCCC>
##$VD= 0
##$VDLIST= <DDDDDDDDDDDDDDD>
##$VPLIST= <PPPPPPPPPPPPPPP>
##$VTLIST= <TTTTTTTTTTTTTTT>
##$WBST= 2048
##$WBSW= 25
##$XGAIN= (0..3)
0 0 0 0
##$XL= 0
##$YL= 0
##$YMAX_a= 5345768
##$YMIN_a= -11015180
##$ZGOPTNS= <>
##$ZL1= 120
##$ZL2= 120
##$ZL3= 120
##$ZL4= 120
##$ABSF1= 14.96172
##$ABSF2= -5.596461
##$ABSG= 5
##$ABSL= 3
##$ALPHA= 0
##$AQORDER= 0
##$ASSFAC= 0
##$ASSFACI= 0
##$ASSFACX= 0
##$ASSWID= 0
##$AUNMP= <proc_prof1d_extract.lims>
##$AXLEFT= 0
##$AXNAME= <>
##$AXNUC= <1H>
##$AXRIGHT= 0
##$AXTYPE= 0
##$AXUNIT= <>
##$AZFE= 0.1
##$AZFW= 0.1
##$BCFW= 0
##$BC_mod= 0
##$BYTORDP= 0
##$COROFFS= 0
##$CY= 15
##$DATMOD= 1
##$DC= 0
##$DFILT= <>
##$DTYPP= 0
##$F1P= 0
##$F2P= 0
##$FCOR= 0.5
##$FTSIZE= 131072
##$FT_mod= 6
##$GAMMA= 0
##$GB= 0
##$INTBC= 1
##$INTSCL= 1
##$ISEN= 128
##$LB= 0.3
##$LEV0= 0
##$LPBIN= 0
##$MAXI= 10000
##$MC2= 0
##$MEAN= 0
##$ME_mod= 0
##$MI= 0
##$NCOEF= 0
##$NC_proc= -2
##$NLEV= 6
##$NOISF1= 0
##$NOISF2= 0
##$NSP= 0
##$NTH_PI= 0
##$NZP= 0
##$OFFSET= 14.96172
##$PC= 1
##$PHC0= -83.79822
##$PHC1= 0
##$PH_mod= 1
##$PKNL= yes
##$PPARMOD= 0
##$PPDIAG= 0
##$PPIPTYP= 0
##$PPMPNUM= 2147483647
##$PPRESOL= 1
##$PSCAL= 4
##$PSIGN= 0
##$PYNMP= <proc.py>
##$REVERSE= no
##$SF= 400.020009349985
##$SI= 131072
##$SIGF1= 0
##$SIGF2= 0
##$SINO= 400
##$SIOLD= 131072
##$SPECTYP= <>
##$SREGLST= <1H.CDCl3>
##$SSB= 0
##$STSI= 131072
##$STSR= 0
##$SW_p= 8223.68421052631
##$SYMM= 0
##$S_DEV= 0
##$TDeff= 65536
##$TDoff= 0
##$TI= <>
##$TILT= no
##$TM1= 0
##$TM2= 0
##$TOPLEV= 0
##$USERP1= <user>
##$USERP2= <user>
##$USERP3= <user>
##$USERP4= <user>
##$USERP5= <user>
##$WDW= 1
##$XDIM= 131072
##$YMAX_p= 289422750
##$YMIN_p= -11373
##$CURPLOT= <Network HP LaserJet P1505>
##$CURPRIN= <$Network HP LaserJet P1505>
##$DFORMAT= <normdp>
##$LAYOUT= <+/1D_H.xwp>
##$LFORMAT= <normlp>
##$PFORMAT= <normpl>
##$SURQMSG= 1
$$ End of Bruker specific parameters
$$ ---------------------------------
##NTUPLES= NMR SPECTRUM
##VAR_NAME=  FREQUENCY,     SPECTRUM/REAL,   SPECTRUM/IMAG
##SYMBOL=    X,             R,               I
##VAR_TYPE=  INDEPENDENT,   DEPENDENT,       DEPENDENT
##VAR_FORM=  AFFN,          ASDF,            ASDF
##VAR_DIM=   131072,        131072,          131072
##UNITS=     HZ,            ARBITRARY UNITS, ARBITRARY UNITS
##FACTOR=    0.0627417313425164, 1,          1
##FIRST=     8223.62146879497, -3207,        -48523
##LAST=      0,             -1364,           -49554
##MIN=       0,             -11373,          0
##MAX=       8223.62146879497, 289422750,    0
$$ Real data points
##PAGE= N=1
##DATA TABLE= (X++(R..R)), XYDATA
$$ [...]
$$ plain form
61307 1214780 1215879 1215772 1214862 1213624 1212327 1211164 1210343 1209757 1208809 1206913 1203974 1200184 1195621 1190345 1184482
61292 1184482 1177858 1169984 1160904 1151706 1143536 1136298 1128960 1120930 1112438 1103730 1094721 1085601 1077021 1069396
61278 1069396 1062585 1056435 1051113 1046720 1043110 1040272 1038350 1037137 1036131 1035287 1035010 1035051 1034131 1031254 1026880
61263 1026880 1022273 1018148 1014600 1012020 1011304 1013234 1018115 1026009 1036904 1050739 1067526 1087333 1109971
61250 1109971 1135076 1162815 1194088 1229525 1268582 1310122 1353481 1398178 1442751 1484657 1521433
61239 1521433 1551399 1573323 1586286 1590280 1586479 1576545 1561835 1543315 1521847 1498398 1474239 1450917
61227 1450917 1429621 1410553 1393346 1378117 1365556 1355859 1348165 1341259 1334157 1325539 1313249 1295225
61215 1295225 1270980 1241767 1209389 1175245 1140392 1106027 1073590 1044460 1019494 998723 981487
$$ packed form
61307A214780J099j07r10j238j297j163q21n86r48j896k939l790m563n276n863
61292A184482o624p874r080r198q170p238p338q030q492q708r009r120q580p625
61278A069396o811o150n322m393l610k838j922j213j006q44k77M1r20k877m374
61263A026880m607m125l548k580p16J930M881P894J0895J3835J6787J9807K2638
61250A109971K5105K7739L1273L5437L9057M1540M3359M4697M4573M1906L6776
61239A521433K9966K1924J2963L994l801r934j4710j8520k1468k3449k4159k3322
61227A450917k1296j9068j7207j5229j2561r697p694o906p102q618j2290j8024
61215A295225k4245k9213l2378l4144l4853l4365l2437k9130k4966k0771j7236
$$ plain form
61204 981487 966922 954222 942497 930796 918615 906225 894147 882471 871044 860208 850824 843316
61192 843316 837023 830795 824077 817133 810236 802981 794611 784850 774187 763356 752848 742998 734127
61179 734127 726200 718600 710708 702716 695417 689178 683549 678049 672855 668428 664853 661911 659560 657973
61165 657973 657268 657545 659011 661712 665199 668729 671747 673965 675183 675307 674374 672162 667987 661352 652822
61150 652822 643798 635388 627728 620347 612714 604433 595508 586618 578723 572126 566237 560423 554686 549268
61136 549268 544061 538839 533743 529034 524672 520676 517700 516509 516841 517433 517437 517269 517780 519076 520597 521996
61120 521996 523388 524962 526927 529737 533788 538738 543597 547559 550282 551264 549736 545659 540286 534959
61106 534959 529642 523391 516114 508952 502775 497179 491446 485795 480945 476857 472694 467969 463106 458775
$$ packed form
61204I81487j4565j2700j1725j1701j2181j2390j2078j1676j1427j0836r384p508
61192H43316o293o228o718o944o897p255q370r761j0663j0831j0508r850q871
61179G34127p927p600p892p992p299o239n629n500n194m427l575k942k351j587
61165F57973p05K77J466K701L487L530L018K218J218J24r33k212m175o635q530
61150F52822r024q410p660p381p633q281q925q890p895o597n889n814n737n418
61136E49268n207n222n096m709m362l996k976j191L32N92Mj68N11J296J521J399
61120E21996J392J574J965K810M051M950M859L962K723R82j528m077n373n327
61106E34959n317o251p277p162o177n596n733n651m850m088m163m725m863m331
$$ plain form
61092 458775 455128 451857 448669 445575 442896 441041 440084 439621 439242 439075 439578 440874 442634 444642 447062
61077 447062 450048 453425 456947 460588 464455 468675 473547 479452 486289 493239 499457 504977 510645 517217
61063 517217 524716 532660 540625 548530 556576 565029 573987 583208 592273 600988 609570 618308 627104 635607
61049 635607 643877 652684 662798 674126 685914 697848 710576 724988 741375 759636 779975 802928
61037 802928 828760 857183 887605 919442 952407 986911 1024148 1065489 1111958 1164628 1225151
61026 1225151 1295223 1375610 1466431 1568647 1684989 1819632 1977584 2164296 2385031 2644482
61016 2644482 2947749 3301885 3716278 4202643 4776764 5460566 6280856 7265524 8440072
61007 8440072 9818109 11373587 13002695 14515675 15694604 16395740 16621545 16506870 16241514
$$ packed form
61092D58775l647l271l188l094k679j855r57m63l79j67N03J296J760K008K420
61077D47062K986L377L522L641L867M220M872N905O837O950O218N520N668O572
61063E17217P499P944P965P905Q046Q453Q958R221R065Q715Q582Q738Q796Q503
61049F35607Q270Q807J0114J1328J1788J1934J2728J4412J6387J8261K0339K2953
61037H02928K5832K8423L0422L1837L2965L4504L7237M1341M6469N2670O0523
61026A225151P0072Q0387R0821J02216J16342J34643J57952J86712K20735K59451
61016B644482L03267L54136M14393M86365N74121O83802Q20290R84668J174548
61007H440072J378037J555478J629108J512980J178929P01136K25805j14675k65356
$$ plain form
60998 16241514 15998366 15902277 16014315 16302520 16621946 16752495 16496632 15773704 14643562
60989 14643562 13254141 11765233 10299903 8934440 7708165 6635495 5715247 4937543
60981 4937543 4288050 3750044 3306153 2940290 2638709 2389729 2183125 2009885 1862172
60972 1862172 1733445 1618899 1515729 1422557 1338520 1262900 1195222 1135115 1082081 1035654 995553
60961 995553 961156 930869 902496 874321 845640 816483 787420 759527 733847 710531 688825
60950 688825 668010 648047 629246 611707 595230 579486 564160 549192 534854 521279 508002
60939 508002 494498 481208 469384 459665 451347 443372 435603 428760 423488 419912 417802 416715 416108 415636
60925 415636 415272 414912 414089 412412 410155 408166 407170 407273 407920 408227 407596 406299 405319 405364 406164 406835 406742 405785
$$ packed form
60998A6241514k43148r6089J12038K88205L19426J30549k55863p22928j130142
60989A4643562j389421j488908j465330j365463j226275j072670r20248p77704
60981D937543o49493n38006m43891l65863l01581k48980k06604j73240j47713
60972A862172j28727j14546j03170r3172q4037p5620o7678o0107n3034m6427m0101
60961I95553l4397l0287k8373k8175k8681k9157k9063k7893k5680k3316k1706
60950F88825k0815j9963j8801j7539j6477j5744j5326j4968j4338j3575j3277
60939E08002j3504j3290j1824r719q318p975p769o843n272l576k110j087o07m72
60925D15636l64l60q23j677k257j989r96J03O47L07o31j297r80M5Q00O71r3r57
$$ plain form
60907 405785 404101 401856 399327 396952 395207 394383 394312 394299 393618 392145 390242 387985 384927 380851 376268 371823
60891 371823 367608 363521 359958 357538 356244 355384 354384 353183 351859 350296 348377 346239 344267 342936
60877 342936 342555 342911 343336 343458 343743 344920 347045 349583 352330 355622 359505 363245 365919 367114 366862 365378
60861 365378 363252 361563 361221 362222 363828 365405 366816 368020 368757 368823 368442 368088 367930 367713 367219 366684 366581
60844 366581 367079 367917 368731 369289 369376 368739 367277 365119 362369 358914 354615 349566 344127 338881 334544 331541
60828 331541 329538 327766 325967 324610 323835 322796 320689 318048 316138 315143 313818 311114 307384 303671 300431
60813 300431 297490 294732 292261 290120 288394 287456 287585 288301 288566 287811 286520 285601 285370 285371 285131 284818 285010
60796 285010 285957 287324 288714 290139 291807 293670 295479 297183 298889 300464 301573 302260 303171 304954 307554
$$ packed form
60907D05785j684k245k529k375j745q24p1j3o81j473j903k257l058m076m583m445
60891C71823m215m087l563k420j294q60j000j201j324j563j919k138j972j331
60877C42936l81L56M25J22K85J177K125K538K747L292L883L740K674J195k52j484
60861C65378k126j689l42J001J606J577J411J204P37O6l81l54j58k17m94n35j03
60844C66581M98Q38Q14N58Q7o37j462k158k750l455m299n049n439n246m337l003
60828C31541k003j772j799j357p75j039k107k641j910r95j325k704l730l713l240
60813C00431k941k758k471k141j726r38J29P16K65p55j291r19k31Jk40l13J92
60796B85010R47J367J390J425J668J863J809J704J706J575J109O87R11J783K600
$$ plain form
60781 307554 310207 312047 312683 312408 311956 311971 312579 313465 314259 314691 314562 313935 313386 313627 314709 315910 316671 317299
60763 317299 318462 320200 321895 323100 323975 324823 325566 325938 325989 326129 326615 327159 327144 326204 324548 322783 321478
60746 321478 320823 320435 319402 316831 312632 307729 303261 299620 296415 293256 290238 287637 285493 283647 282031
60731 282031 280744 279946 279701 279842 280021 280066 280246 280984 282286 283707 284907 286006 287301 288833 290366 291646
60715 291646 292614 293421 294180 294637 294269 292983 291536 290850 290950 291056 290667 290037 289438 288538 286851 284382 281542
60698 281542 278722 276260 274377 272823 270898 268222 265266 262763 260912 259484 258396 257721 257297 256838 256317
60683 256317 255867 255464 255070 254899 255090 255305 255146 254881 255161 256075 257087 257999 259339 261567 264406 267258 269838
60666 269838 272091 273865 275109 276226 277849 280297 283450 287029 290752 294309 297482 300330 303124 306067
$$ packed form
60781C07554K653J840O36k75m52J5O08Q86P94M32j29o27n49K41J082J201P61O28
60763C17299J163J738J695J205Q75Q48P43L72N1J40M86N44j5r40j656j765j305
60746C21478o55l88j033k571m199m903m468l641l205l159l018k601k144j846j616
60731B82031j287p98k45J41J79M5J80P38J302J421J200J099J295J532J533J280
60715B91646R68Q07P59M57l68j286j447o86J00J06l89o30n99r00j687k469k840
60698B81542k820k462j883j554j925k676k956k503j851j428j088o75m24m59n21
60683B56317m50m03l94j71J91K15j59k65K80R14J012R12J340K228K839K852K580
60666B69838K253J774J244J117J623K448L153L579L723L557L173K848K794K943
$$ plain form
60652 306067 309167 312300 315295 318019 320467 322769 325048 327251 329216 330809 331918 332341 331897 330763 329589
60637 329589 329009 329001 328969 328628 328505 329120 329824 329130 326489 323210 321144 320755 320940 320470 319031 316961 314682 312612
60619 312612 311119 310242 309654 309099 308614 308258 307882 307317 306556 305564 304223 302578 300908 299366 297749 295824
60603 295824 293668 291545 289594 287871 286500 285576 284966 284386 283636 282743 281988 281758 282140 282631 282566 281905 281244
60586 281244 280923 280635 280158 279982 280643 281835 282780 283296 283834 284575 285222 285755 286674 288244 290055 291625 292935
60569 292935 294058 294812 295282 296225 298342 301329 304206 306422 308111 309452 310501 311735 314022 317756 322555
60554 322555 328134 334983 343655 353766 364324 375001 386554 399915 415337 432624 451883 473748
60542 473748 498973 527960 560567 596035 632957 669357 702932 731375 752582 764782 766832 758736
$$ packed form
60652C06067L100L133K995K724K448K302K279K203J965J593J109M23m44j134j174
60637C29589n80ql2l41j23O15P04o94k641l279k066l89J85m70j439k070k279k070
60619C12612j493q77n88n55m85l56l76n65p61r92j341j645j670j542j617j925
60603B95824k156k123j951j723j371r24o10n80p50q93p55k30L82M91o5o61o61
60586B81244l21k88m77j76O61J192R45N16N38P41O47N33R19J570J811J570J310
60569B92935J123P54M70R43K117K987K877K216J689J341J049J234K287L734M799
60554C22555N579O849Q672J0111J0558J0677J1553J3361J5422J7287J9259K1865
60542D73748K5225K8987L2607L5468L6922L6400L3575K8443K1207J2200K050q096
$$ plain form
60530 758736 741882 718459 690452 659324 626680 594692 565389 539649 517253 497794 481201
60519 481201 467527 456830 449242 444674 442377 441430 441884 444890 451345 460909 472754 486802 503650
60506 503650 523672 546845 573335 603510 637184 673185 709611 744070 773800 796266 810006
60495 810006 814797 811191 800395 784662 767085 750523 736883 727506 723759 726875 737508 755755
60483 755755 781476 814369 853904 899303 949248 1001291 1051802 1096816 1132874 1157034 1166638 1159866
60471 1159866 1136632 1098705 1048940 990564 926941 861447 797198 736698 681476 631846 587298
60460 587298 547464 512605 482923 457787 436151 417558 402084 389331 378203 367937 358714 350903
60448 350903 344201 337990 332150 327002 322680 319105 316433 314988 314682 314906 315074 314994 314721 314383 314245 314586
$$ packed form
60530G58736j6854k3423k8007l1128l2644l1988k9303k5740k2396j9459j6593
60519D81201j3674j0697p588m568k297r47M54L006O455R564J1845J4048J6848
60506E03650K0022K3173K6490L0175L3674L6001L6426L4459K9730K2466J3740
60495H10006M791l606j0796j5733j7577j6562j3640r377l747L116J0633J8247
60483G55755K5721L2893L9535M5399M9945N2043N0511M5014L6058K4160R604o772
60471A159866k3234l7927m9765n8376o3623o5494o4249o0500n5222m9630m4548
60460E87298l9834l4859k9682k5136k1636j8593j5474j2753j1128j0266r223p811
60448C50903o702o211n840n148m322l575k672j445l06K24J68q0k73l38j38L41
$$ plain form
60432 314586 315331 316057 316534 316998 317707 318382 318357 317287 315571 314063 313361 313365 313485 313315 313044 313163 313866 314946
60414 314946 316212 317687 319378 321151 323003 325244 328219 331992 336411 341269 346253 351029 355638 360651
60400 360651 366652 373663 381277 389140 396984 404461 411387 418131 425219 432543 439416 445526 451325 457262
60386 457262 463055 468065 472087 475330 477877 479647 480913 482455 484969 488428 492105 495189 497416 499134
60372 499134 500737 502096 502748 502667 502501 502855 503554 503950 503795 503473 503395 503498 503408 502847 501811 500530 499387 498681
60354 498681 498345 497939 497015 495434 493362 491031 488559 485947 483220 480534 478009 475382 472007 467454 462116
60339 462116 457022 452881 449448 445933 441983 438116 435155 433305 431845 429686 426114 421034 414813 408129
60325 408129 401821 396454 391952 387938 384430 381843 380168 378599 376329 373393 370454 368050 366472 366014
$$ packed form
60432C14586P45P26M77M64P09O75k5j070j716j508p02MJ20j70k71J19P03J080
60414C14946J266J475J691J773J852K241K975L773M419M858M984M776M609N013
60400C60651O001P011P614P863P844P477O926O744P088P324O873O110N799N937
60386D57262N793N010M022L243K547J770J266J542K514L459L677L084K227J718
60372D99134J603J359O52q1j66L54O99L96j55l22p8J03r0n61j036j281j143p06
60354D98681l36m06r24j581k072k331k472k612k727k686k525k627l375m553n338
60339D62116n094m141l433l515l950l867k961j850j460k159l572n080o221o684
60325D08129o308n367m502m014l508k587j675j569k270k936k939k404j578m58
$$ plain form
60311 366014 366748 368192 369781 371636 374326 377908 381827 385858 390372 395340 399680 402189 402731 402015 400444
60296 400444 397759 393645 388233 381995 375599 369860 365414 362333 360333 359348 359526 360603 361685 361982 361524
60281 361524 360881 360323 359583 358416 357062 356016 355528 355527 355956 356942 358593 360754 363092 365330 367420 369638
60265 369638 372617 377057 383114 390022 396518 401736 405722 409184 412874 417071 421355 424930 427408 429290
60251 429290 431369 433693 435521 436460 437232 438984 442172 446519 451790 458072 465328 473245 481725 491201 502245
60236 502245 515090 529661 545807 563275 581654 600673 620573 641951 665225 690389 717328
60225 717328 746219 777495 811515 848371 887936 929881 973557 1018024 1062475 1106671 1150770
60214 1150770 1194623 1237306 1277472 1313994 1346135 1373300 1395081 1411668 1423897 1432551 1437681 1438816
$$ packed form
60311C66014P34J444J589J855K690L582L919M031M514M968M340K509N42p16j571
60296D00444k685m114n412o238o396n739m446l081k000r85J78J077J082K97m58
60281C61524o43n58p40j167j354j046m88jM29R86J651K161K338K238K090K218
60265C69638K979M440O057O908O496N218L986L462L690M197M284L575K478J882
60251D29290K079K324J828R39P72J752L188M347N271O282P256P917Q480R476J1044
60236E02245J2845J4571J6146J7468J8379J9019J9900K1378K3274K5164K6939
60225G17328K8891L1276L4020L6856L9565M1945M3676M4467M4451M4196M4099
60214A150770M3853M2683M0166L6522L2141K7165K1781J6587J2229Q654N130J135
$$ plain form
60202 1438816 1435762 1429021 1419514 1408202 1396083 1384235 1373630 1364969 1358843 1355952 1356927 1361999 1371053
60189 1371053 1384058 1401261 1422917 1449009 1479393 1514030 1552867 1595477 1640982 1688337 1736507
60178 1736507 1784273 1830013 1871963 1908806 1939913 1964900 1983101 1993725 1996530 1992002 1980622 1962235
60166 1962235 1936460 1903698 1865454 1823676 1780075 1736078 1693036 1652203 1614593 1580931 1551624
60155 1551624 1526750 1506267 1490281 1479002 1472473 1470565 1473187 1480146 1490797 1504201 1519635 1536535
60143 1536535 1553855 1570108 1584279 1596219 1605811 1612319 1615015 1613895 1609238 1600975 1589307 1575588
60131 1575588 1561726 1548775 1536855 1526364 1518498 1514483 1515047 1520746 1532098 1549179 1571756 1600105
60119 1600105 1635110 1677356 1726680 1782883 1846199 1916691 1993779 2076798 2165522 2259626 2358016
$$ packed form
60202A438816l054o741r507j1312j2119j1848j0605q661o126k891R75N072R054
60189A371053J3005J7203K1656K6092L0384L4637L8837M2610M5505M7355M8170
60178A736507M7766M5740M1950L6843L1107K4987J8201J0624K805m528j1380j8387
60166A962235k5775l2762l8244m1778m3601m3997m3042m0833l7610l3662k9307
60155A551624k4874k0483j5986j1279o529j908K622O959J0651J3404J5434J6900
60143A536535J7320J6253J4171J1940R592O508K696j120m657q263j1668j3719
60131A575588j3862j2951j1920j0491p866m015N64N699J1352J7081K2577K8349
60119A600105L5005M2246M9324N6203O3316P0492P7088Q3019Q8724R4104R8390
$$ plain form
60108 2358016 2459144 2561641 2664130 2764666 2860799 2950061 3030115 3098873 3154947 3197843
60098 3197843 3227340 3242891 3243933 3230474 3202975 3162002 3108570 3044589 2972388 2893822 2810238
60087 2810238 2723200 2634749 2546989 2461824 2380933 2305468 2235717 2171529 2113188 2061536 2017225
60076 2017225 1980251 1950356 1927431 1911274 1901218 1896310 1895904 1899950 1908602 1921393 1936730 1952401
60064 1952401 1966794 1979582 1991075 2001102 2008748 2013014 2013417 2009933 2002607 1991280 1975660 1955716
60052 1955716 1931975 1905165 1875496 1842642 1806642 1768503 1729623 1691008 1653358 1617483 1584049
60041 1584049 1553226 1525217 1500909 1481365 1466797 1456774 1451485 1452040 1459334 1473255 1493296 1519355
60029 1519355 1551571 1589751 1633299 1681431 1733158 1787292 1842644 1897967 1951558 2001270 2045153
$$ packed form
60108B358016J01128J02497J02489J00536R6133Q9262Q0054O8758N6074M2896
60098C197843K9497J5551J042j3459k7499m0973n3432o3981p2201p8566q3584
60087B810238q7038q8451q7760q5165q0891p5465o9751o4188n8341n1652m4311
60076B017225l6974k9895k2925j6157j0056m908m06M046Q652J2791J5337J5671
60064A952401J4393J2788J1493J0027P646M266M03l484p326j1327j5620j9944
60052A955716k3741k6810k9669l2854l6000l8139l8880l8615l7650l5875l3434
60041A584049l0823k8009k4308j9544j4568j0023n289N55P294J3921K0041K6059
60029A519355L2216L8180M3548M8132N1727N4134N5352N5323N3591M9712M3883
$$ plain form
60018 2045153 2081893 2110508 2130113 2140313 2141493 2134170 2118160 2092779 2057985 2015127 1966550 1914609
60006 1914609 1861073 1807307 1754776 1705071 1659388 1618194 1581699 1550423 1524918 1505038 1490081
59995 1490081 1479832 1475050 1476682 1484992 1499701 1520643 1547854 1581244 1620623 1666017 1717572 1775028
59983 1775028 1837345 1902796 1969298 2034717 2097043 2154422 2205225 2248256 2282921 2308920 2325773
59972 2325773 2332843 2329868 2317148 2295088 2263973 2224521 2178443 2128120 2075808 2023386 1972634 1925236
59960 1925236 1882322 1844292 1811300 1783827 1762706 1748629 1741744 1741739 1748199 1760807 1779257 1803217
59948 1803217 1832494 1866961 1905987 1948053 1991367 2034935 2078641 2122172 2164264 2203369 2238779
59937 2238779 2270706 2299404 2324654 2346073 2363544 2377171 2387178 2394108 2399078 2403595 2409089 2416707
$$ packed form
60018B045153L6740K8615J9605J0200J180p323j6010k5381l4794m2858m8577n1941
60006A914609n3536n3766n2531m9705m5683m1194l6495l1276k5505j9880j4957
59995A490081j0249m782J632Q310J4709K0942K7211L3390L9379M5394N1555N7456
59983A775028O2317O5451O6502O5419O2326N7379N0803M3031L4665K5999J6853
59972B325773P070k975j2720k2060l1115l9452m6078n0323n2312n2422n0752m7398
59960A925236m2914l8030l2992k7473k1121j4077o885nO460J2608J8450K3960
59948A803217K9277L4467L9026M2066M3314M3568M3706M3531M2092L9105L5410
59937B238779L1927K8698K5250K1419J7471J3627J0007O930M970M517N494P618
$$ plain form
59925 2416707 2427583 2443108 2464651 2492935 2527820 2568820 2615734 2668619 2727286 2791042 2858855
59914 2858855 2929450 3001189 3072081 3140045 3203011 3258813 3305294 3340754 3364120 3374654 3371742
59903 3371742 3355258 3325974 3285393 3235225 3177189 3113199 3045428 2976059 2907020 2839937 2776191
59892 2776191 2716870 2662687 2613982 2570949 2533917 2503403 2479792 2463054 2452880 2449114 2451878 2461250
59880 2461250 2476932 2498234 2524326 2554382 2587517 2622588 2658169 2692930 2726128 2757480 2786357
59869 2786357 2811321 2830726 2843581 2849491 2847999 2838556 2821141 2796367 2764804 2726669 2682376 2633028
59857 2633028 2580094 2524940 2468784 2412665 2357120 2302259 2248472 2196768 2148139 2103012 2061708
59846 2061708 2024964 1993135 1964991 1938062 1910462 1882042 1853703 1826233 1800178 1776330 1755647
$$ packed form
59925B416707J0876J5525K1543K8284L4885M1000M6914N2885N8667O3756O7813
59914B858855P0595P1739P0892O7964O2966N5802M6481L5460K3366J0534k912
59903C371742j6484k9284m0581n0168n8036o3990o7771o9369o9039o7083o3746
59892B776191n9321n4183m8705m3033l7032l0514k3611j6738j0174l766K764R372
59880B461250J5682K1302K6092L0056L3135L5071L5581L4761L3198L1352K8877
59869B786357K4964J9405J2855N910j492r443j7415k4774l1563l8135m4293m9348
59857B633028n2934n5154n6156n6119n5545n4861n3787n1704m8629m5127m1304
59846B061708l6744l1829k8144k6929k7600k8420k8339k7470k6055k3848k0683
$$ plain form
59835 1755647 1738658 1725321 1715490 1709191 1706296 1706276 1708564 1713005 1719632 1728054 1737493 1747502 1758225
59822 1758225 1769617 1780746 1790239 1797327 1802058 1804633 1805064 1803522 1800523 1796485 1791381 1785071 1777745 1769865
59808 1769865 1761885 1754190 1747079 1740579 1734373 1728082 1721610 1715134 1708805 1702517 1695915 1688718 1681111 1673665
59794 1673665 1666650 1659616 1651924 1643492 1634604 1625241 1615320 1605592 1597537 1592066 1588925 1587740 1589165 1594572
59780 1594572 1605014 1620829 1641887 1667887 1698749 1735139 1778283 1828945 1886935 1951966 2024540
59769 2024540 2105587 2195620 2294692 2402535 2517747 2636648 2753214 2859954 2948690 3011459
59759 3011459 3042314 3039189 3004222 2942585 2861261 2768181 2670983 2575599 2485866 2404193 2332039
59748 2332039 2269825 2217165 2173599 2138876 2112506 2093515 2080916 2074167 2073045 2077331 2086756 2101046
$$ packed form
59835A755647j6989j3337r831o299k895k0K288M441O627Q422R439J0009J0723
59822A758225J1392J1129R493P088M731K575M31j542k999m038n104o310p326p880
59808A769865p980p695p111o500o206o291o472o476o329o288o602p197p607p446
59794A673665p015p034p692q432q888r363r921r728q055n471l141j185J425N407
59780A594572J0442J5815K1058K6000L0862L6390M3144N0662N7990O5031P2574
59769B024540Q1047R0033R9072J07843J15212J18901J16566J06740Q8736O2769
59759C011459L0855l125l4967o1637q1324r3080r7198r5384q9733q1673p2154
59748B332039o2214n2660m3566l4723k6370j8991j2599o749j122M286R425J4290
$$ plain form
59736 2101046 2119880 2142990 2170367 2202281 2239159 2281586 2330252 2385617 2447698 2516435 2592115
59725 2592115 2675190 2765884 2864380 2971245 3087276 3212990 3348700 3494918 3652124 3820098
59715 3820098 3997902 4184436 4378489 4578102 4780409 4982187 5180157 5370722 5550042
59706 5550042 5714806 5862908 5993555 6107210 6205431 6290170 6363004 6425306 6479010 6526492
59696 6526492 6569481 6608707 6644826 6678918 6711543 6741837 6768289 6790300 6808558 6824047 6837160
59685 6837160 6847813 6856145 6863076 6870226 6879222 6891066 6906377 6926282 6952717 6987699 7032509 7087657
59673 7087657 7153273 7229346 7315839 7412812 7520266 7637753 7764295 7898568 8038624 8181284
59663 8181284 8322217 8456955 8581573 8692291 8784944 8855191 8898963 8912512 8892637 8837572
$$ packed form
59736B101046J8834K3110K7377L1914L6878M2427M8666N5365O2081O8737P5680
59725B592115Q3075R0694R8496J06865J16031J25714J35710J46218J57206J67974
59715C820098J77804J86534J94053J99613K02307K01778J97970J90565J79320
59706E550042J64764J48102J30647J13655R8221Q4739P2834O2302N3704M7482
59696F526492M2989L9226L6119L4092L2625L0294K6452K2011J8258J5489J3113
59685F837160J0653Q332O931P150Q996J1844J5311J9905K6435L4982M4810N5148
59673G087657O5616P6073Q6493R6973J07454J17487J26542J34273J40056J42660
59663H181284J40933J34738J24618J10718R2653P0247M3772J3549j9875n5065
$$ plain form
59653 8837572 8747732 8625455 8474306 8298825 8104361 7896439 7680187 7460599 7243069 7033133
59643 7033133 6835404 6652593 6484951 6329997 6182659 6035945 5881901 5712877 5523402
59634 5523402 5312081 5081983 4839117 4590532 4343303 4103763 3876426 3663637 3466649
59625 3466649 3286525 3123492 2976199 2842825 2722808 2616488 2523119 2440360 2365969 2298990
59615 2298990 2238919 2184635 2134809 2088694 2045924 2006043 1968883 1934929 1904557 1877128 1851473
59604 1851473 1827139 1804555 1784018 1765040 1746748 1728467 1709903 1691213 1672990 1655716 1639072
59593 1639072 1622133 1604476 1586832 1570415 1555745 1542280 1528950 1514850 1499719 1484110 1469087
59582 1469087 1455442 1443199 1432045 1422137 1414160 1408545 1404937 1402632 1401337 1401319 1402948 1406313 1411182 1417123
$$ packed form
59653H837572q9840j22277j51149j75481j94464k07922k16252k19588k17530k09936
59643G033133j97729j82811j67642j54954j47338j46714j54044j69024j89475
59634E523402k11321k30098k42866k48585k47229k39540k27337k12789j96988
59625C466649j80124j63033j47293j33374j20017j06320r3369q2759p4391o6979
59615B298990o0071n4284m9826m6115m2770l9881l7160l3954l0372k7429k5655
59604A851473k4334k2584k0537j8978j8292j8281j8564j8690j8223j7274j6644
59593A639072j6939j7657j7644j6417j4670j3465j3330j4100j5131j5609j5023
59582A469087j3645j2243j1154r908p977n615l608k305j295j8J629L365M869N941
$$ plain form
59568 1417123 1423656 1430566 1438195 1447396 1459023 1473362 1489987 1508207 1527725 1548874 1572165 1597710
59556 1597710 1625253 1654684 1686221 1720037 1755998 1793938 1833890 1875884 1919801 1965736 2014322
59545 2014322 2066361 2122204 2181434 2242592 2302765 2358017 2405218 2443735 2475074 2501100 2523065
59534 2523065 2541872 2558020 2570954 2579315 2582341 2580495 2574483 2564370 2550121 2532206 2510985 2486054
59522 2486054 2457066 2424839 2390874 2355938 2319917 2283003 2246317 2211284 2179042 2150550 2126672
59511 2126672 2107852 2094087 2085437 2082330 2085336 2094913 2111480 2135385 2166741 2205528 2251866 2305837
59499 2305837 2366966 2434138 2506054 2581469 2658969 2736870 2813421 2886717 2954274 3013028 3060078
59488 3060078 3093463 3112340 3116673 3106776 3082914 3045372 2995230 2935028 2868225 2797883 2726086 2654501
$$ packed form
59568A417123O533O910P629R201J1627J4339J6625J8220J9518K1149K3291K5545
59556A597710K7543K9431L1537L3816L5961L7940L9952M1994M3917M5935M8586
59545B014322N2039N5843N9230O1158O0173N5252M7201L8517L1339K6026K1965
59534B523065J8807J6148J2934Q361L026j846o012j0113j4249j7915k1221k4931
59522B486054k8988l2227l3965l4936l6021l6914l6686l5033l2242k8492k3878
59511B126672j8820j3765q650l107L006R577J6567K3905L1356L8787M6338N3971
59499B305837O1129O7172P1916P5415P7500P7901P6551P3296O7557N8754M7050
59488C060078L3385J8877M333r897k3862l7542n0142o0202o6803p0342p1797p1585
$$ plain form
59476 2654501 2584843 2518639 2457134 2401777 2354168 2314980 2283321 2257822 2238100 2224545 2216844
59465 2216844 2213475 2212785 2213980 2216858 2221064 2225919 2230554 2233764 2233925 2229480 2219564 2204106 2183440 2157923
59451 2157923 2127754 2092935 2053551 2010213 1963981 1915602 1865100 1812473 1758583 1704875 1652272
59440 1652272 1600911 1550939 1502900 1457074 1413055 1370463 1329691 1291446 1255942 1223154 1193563
59429 1193563 1167892 1146071 1127072 1109888 1094270 1080496 1069009 1060426 1055449 1054584 1058194 1066534
59417 1066534 1078852 1092339 1102904 1107685 1106582 1101307 1093835 1086143 1080327 1077818 1078800 1083169 1091426
59404 1091426 1103465 1116702 1126762 1130427 1127319 1118878 1106829 1092955 1079281 1067524 1058618 1053070
59392 1053070 1051298 1053277 1058373 1065990 1076107 1088894 1104298 1122353 1143400 1167510 1194115 1222687
$$ packed form
59476B654501o9658o6204o1505n5357m7609l9188l1659k5499j9722j3555p701
59465B216844l369o90J195K878M206M855M635L210J61m445r916j5458k0666k5517
59451B157923l0169l4819l9384m3338m6232m8379n0502n2627n3890n3708n2603
59440A652272n1361m9972m8039m5826m4019m2592m0772l8245l5504l2788k9591
59429A193563k5671k1821j8999j7184j5618j3774j1487q583m977q65L610Q340
59417A066534J2318J3487J0565M781j103n275p472p692n816k509R82M369Q257
59404A091426J2039J3237J0060L665l108q441j2049j3874j3674j1757q906n548
59392A053070j772J979N096P617J0117J2787J5404J8055K1047K4110K6605K8572
$$ plain form
59380 1222687 1253415 1286655 1322121 1359369 1398862 1441692 1488114 1537042 1587255 1638559 1691504
59369 1691504 1746486 1803616 1863239 1926067 1992815 2064091 2140762 2224174 2315754 2416381 2526282
59358 2526282 2645533 2774428 2913151 3061235 3217587 3381000 3550307 3723928 3899641
59349 3899641 4074945 4247275 4413536 4569897 4712781 4840156 4951510 5046606 5124723 5185091
59339 5185091 5227480 5252054 5259027 5248686 5221392 5177163 5115559 5036326 4939967 4827492 4699957
59328 4699957 4558752 4406061 4244461 4076126 3903065 3728127 3555016 3386895 3225349
59319 3225349 3070945 2924361 2786596 2658542 2540789 2433589 2336593 2248900 2169798 2099190
59309 2099190 2036720 1980681 1928455 1878019 1828617 1780179 1732977 1687984 1646730 1610310 1578860
$$ packed form
59380A222687L0728L3240L5466L7248L9493M2830M6422M8928N0213N1304N2945
59369A691504N4982N7130N9623O2828O6748P1276P6671Q3412R1580J00627J09901
59358B526282J19251J28895J38723J48084J56352J63413J69307J73621J75713
59349C899641J75304J72330J66261J56361J42884J27375J11354R5096P8117O0368
59339E185091M2389K4574O973j0341k7294m4229o1604p9233r6359j12475j27535
59328D699957j41205j52691j61600j68335j73061j74938j73111j68121j61546
59319C225349j54404j46584j37765j28054j17753j07200r6996q7693p9102p0608
59309B099190o2470n6039n2226n0436m9402m8438m7202m4993m1254l6420l1450
$$ plain form
59298 1578860 1552168 1530237 1512869 1499242 1488314 1479352 1471768 1464925 1458610 1453374 1449934 1448445 1448691
59285 1448691 1450656 1454416 1459705 1466072 1473302 1481352 1490142 1499793 1510784 1523425 1537435 1552490 1568748
59272 1568748 1586195 1603794 1620052 1634284 1646555 1656574 1663536 1667068 1667375 1664254 1656784 1644334
59260 1644334 1627216 1606119 1581538 1554060 1524445 1492983 1459419 1423998 1387967 1352570 1318075
59249 1318075 1284350 1251822 1221177 1192451 1165172 1139256 1115169 1093283 1073549 1055663 1039175
59238 1039175 1023623 1009048 996262 986140 978766 973580 970131 968193 967358 967226 968077 970798 975947 983173
59224 983173 991664 1000935 1011119 1022785 1036498 1052427 1070427 1090583 1113429 1139341 1168057 1199232
59212 1199232 1233259 1271061 1313248 1360056 1411978 1469724 1533515 1603106 1678645 1760845 1849961
$$ packed form
59298A578860k6692k1931j7368j3627j0928q962p584o843o315n236l440j489K46
59285A448691J965L760N289O367P230Q050Q790R651J0991J2641J4010J5055J6258
59272A568748J7447J7599J6258J4232J2271J0019O962L532L07l121p470j2450
59260A644334j7118k1097k4581k7478k9615l1462l3564l5421l6031l5397l4495
59249A318075l3725l2528l0645k8726k7279k5916k4087k1886j9734j7886j6488
59238A039175j5552j4575j2786j0122p374n186l449j938q35j32Q51K721N149P226
59224I83173Q491R271J0184J1666J3713J5929J8000K0156K2846K5912K8716L1175
59212A199232L4027L7802M2187M6808N1922N7746O3791O9591P5539Q2200Q9116
$$ plain form
59201 1849961 1945219 2045632 2150746 2260041 2372015 2484490 2595432 2702709 2803164 2892785
59191 2892785 2968128 3027160 3068599 3091036 3093205 3074857 3036890 2980710 2907976 2821122 2723701
59180 2723701 2619637 2512088 2403183 2294803 2189135 2088223 1993312 1904991 1823754 1749962
59170 1749962 1683309 1622928 1568241 1519361 1476451 1439104 1406653 1378761 1355188 1335228 1317869
59159 1317869 1302558 1289346 1278225 1268773 1260544 1253457 1247435 1241905 1235916 1228714 1220131 1210590 1200885
59146 1200885 1191723 1183189 1174711 1165715 1156247 1146850 1138074 1130350 1124074 1119369 1115822 1112840 1110330 1108669
59132 1108669 1108087 1108477 1109828 1112254 1115378 1118273 1120459 1122495 1125091 1127983 1130331 1131988 1133652 1135737
59118 1135737 1137747 1138970 1139302 1139129 1138759 1138188 1137121 1135075 1131740 1127417 1122821 1118316 1113707 1108901 1104310
$$ packed form
59201A849961R5258J00413J05114J09295J11974J12475J10942J07277J00455Q9621
59191B892785P5343N9032M1439K2437K169j8348l7967n6180p2734q6854r7421
59180B723701j04064j07549j08905j08380j05668j00912r4911q8321q1237p3792
59170A749962o6653o0381n4687m8880m2910l7347l2451k7892k3573j9960j7359
59159A317869j5311j3212j1121r452q229p087o022n530n989p202q583r541r705
59146A200885r162q534q478q996r468r397q776p724o276m705l547k982k510j661
59132A108669n82L90J351K426L124K895K186K036K596K892K348J657J664K085
59118A135737K010J223L32j73l70n71j067k046l335m323m596m505m609m806m591
$$ plain form
59103 1104310 1100264 1096461 1092466 1088468 1085067 1082488 1080601 1079590 1079936 1081561 1083591 1085438 1087815 1092174
59089 1092174 1099159 1107950 1117179 1126218 1135427 1145425 1156455 1168391 1180963 1193780 1206385 1218562
59077 1218562 1230438 1241994 1252655 1261739 1269221 1275535 1280543 1283299 1283137 1280465 1276063 1269991 1261794
59064 1261794 1251529 1239827 1226918 1212263 1195383 1176569 1156543 1135888 1115184 1095241 1076594
59053 1076594 1058864 1041137 1022995 1004822 987028 969436 951700 933978 916835 900581 885076
59042 885076 870137 855810 842195 829304 817242 806269 796466 787535 779177 771569 765202 760279 756429
59029 756429 753001 749495 745759 741975 738478 735484 732985 730918 729266 727859 726325 724470 722558 720942
59015 720942 719645 718569 717838 717405 716570 714580 711717 709163 707691 707095 707002 707470 708546 709987 711849 714634
$$ packed form
59103A104310m046l803l995l998l401k579j887j011L46J625K030J847K377M359
59089A092174O985Q791R229R039R209R998J1030J1936J2572J2817J2605J2177
59077A218562J1876J1556J0661R084P482O314N008K756j62k672m402o072q197
59064A261794j0265j1702j2909j4655j6880j8814k0026k0655k0704j9943j8647
59053A076594j7730j7727j8142j8173j7794j7592j7736j7722j7143j6254j5505
59042H85076j4939j4327j3615j2891j2062j0973r803q931q358p608o367m923l850
59029G56429l428l506l736l784l497k994k499k067j652j407j534j855j912j616
59015G20942j297j076p31m33q35j990k863k554j472n96r3M68J076J441J862K785
$$ plain form
58999 714634 718345 722113 725493 729518 735566 743558 752280 761259 771314 783240 796953 812167 829007
58986 829007 847511 867151 887319 907832 928672 949665 970779 992218 1013795 1034607 1053775
58975 1053775 1071210 1087137 1101069 1111820 1118531 1121300 1120761 1117409 1111517 1103521 1094222 1084488 1074691
58962 1074691 1064538 1053647 1042229 1030982 1020344 1010275 1000921 992938 986761 981859 977326 973070
58950 973070 969865 968200 967634 967522 967915 969373 972195 976225 981247 987116 993589 1000480 1008123 1017286 1028407
58935 1028407 1041156 1054981 1069819 1085897 1103007 1120475 1138007 1156208 1176030 1197915 1221665
58924 1221665 1247046 1274273 1303946 1336630 1372580 1411798 1454331 1500263 1549256 1600150 1651336
58913 1651336 1701455 1749475 1794235 1834659 1870815 1904332 1937355 1971279 2006805 2044644 2085475
$$ packed form
58999G14634L711L768L380M025O048P992Q722Q979J0055J1926J3713J5214J6840
58986H29007J8504J9640K0168K0513K0840K0993K1114K1439K1577K0812J9168
58975A053775J7435J5927J3932J0751O711K769n39l352n892p996r299r734r797
58962A074691j0153j0891j1418j1247j0638j0069r354p983o177m902m533m256
58950I73070l205j665n66j12L93J458K822M030N022N869O473O891P643R163J1121
58935A028407J2749J3825J4838J6078J7110J7468J7532J8201J9822K1885K3750
58924A221665K5381K7227K9673L2684L5950L9218M2533M5932M8993N0894N1186
58913A651336N0119M8020M4760M0424L6156L3517L3023L3924L5526L7839M0831
$$ plain form
58902 2085475 2129378 2176066 2225737 2279128 2336719 2398513 2464737 2536036 2612532 2693189 2776671
58891 2776671 2862547 2951206 3042795 3136733 3232213 3328632 3425298 3520867 3613265 3700114 3779293
58880 3779293 3849303 3909278 3958767 3997628 4026143 4045060 4055253 4057294 4051330 4037367 4015560 3986244
58868 3986244 3949689 3905899 3854729 3796342 3731504 3661305 3586591 3507870 3425793 3341463 3256042
58857 3256042 3170199 3084101 2997945 2912297 2827938 2745490 2665264 2587329 2511651 2438233 2367271
58846 2367271 2299239 2234783 2174395 2118176 2065984 2017815 1973913 1934330 1898472 1865334 1834239
58835 1834239 1805263 1778918 1755567 1735229 1717782 1703092 1690904 1680774 1672328 1665595 1660977 1658749
58823 1658749 1658721 1660564 1664347 1670460 1678970 1689399 1701315 1714802 1730062 1746803 1764467 1782993 1802918
$$ packed form
58902B085475M3903M6688M9671N3391N7591O1794O6224P1299P6496Q0657Q3482
58891B776671Q5876Q8659R1589R3938R5480R6419R6666R5569R2398Q6849P9179
58880C779293P0010N9975M9489L8861K8515J8917J0193K041n964j3963k1807k9316
58868C986244l6555m3790n1170n8387o4838p0199p4714p8721q2077q4330q5421
58857C256042q5843q6098q6156q5648q4359q2448q0226p7935p5678p3418p0962
58846B367271o8032o4456o0388n6219n2192m8169m3902l9583l5858l3138l1095
58835A834239k8976k6345k3351k0338j7447j4690j2188j0130q446o733m618k228
58823A658749k8J843L783O113Q510J0429J1916J3487J5260J6741J7664J8526J9925
$$ plain form
58810 1802918 1824629 1847906 1872339 1897903 1924980 1954090 1985862 2021009 2060015 2102855 2149301
58799 2149301 2199499 2254051 2313422 2377405 2445253 2516217 2589914 2666347 2745802 2828605 2914575
58788 2914575 3002578 3090938 3178549 3265373 3351491 3435946 3516963 3593177 3664028 3728805 3785893
58777 3785893 3833224 3869095 3892300 3901994 3897975 3880817 3851369 3810291 3758303 3696517 3626167 3548338
58765 3548338 3464325 3375836 3284269 3190142 3093857 2996694 2900301 2805385 2711740 2619480 2529466
58754 2529466 2442455 2358667 2278369 2202019 2129568 2060387 1994311 1932062 1874131 1819898 1768477
58743 1768477 1719925 1674898 1633370 1594417 1557200 1521663 1488210 1457090 1428123 1400802 1374680
58732 1374680 1349844 1326935 1306565 1288823 1273439 1260211 1249138 1240404 1234413 1231495 1231385 1233223
$$ packed form
58810A802918K1711K3277K4433K5564K7077K9110L1772L5147L9006M2840M6446
58799B149301N0198N4552N9371O3983O7848P0964P3697P6433P9455Q2803Q5970
58788B914575Q8003Q8360Q7611Q6824Q6118Q4455Q1017P6214P0851O4777N7088
58777C785893M7331L5871K3205R694m019j7158k9448m1078n1988o1786p0350p7829
58765C548338q4013q8489r1567r4127r6285r7163r6393r4916r3645r2260r0014
58754B529466q7011q3788q0298p6350p2451o9181o6076o2249n7931n4233n1421
58743A768477m8552m5027m1528l8953l7217l5537l3453l1120k8967k7321k6122
58732A374680k4836k2909k0370j7742j5384j3228j1073q734n991k918j10J838
$$ plain form
58720 1233223 1236283 1240315 1244886 1248766 1250348 1248300 1241381 1228155 1207782 1181170 1150630 1118177 1084543
58707 1084543 1049890 1014839 980456 947622 916866 888578 862974 839899 819022 800339 784277
58696 784277 771189 760879 752796 746652 742711 741408 742853 746708 752341 758812 764826 768976 770133 767521
58682 767521 760663 749667 735556 719853 703566 686880 669978 653790 639601 628124 619301 612792
58670 612792 608225 605116 603042 602040 602453 604095 605754 605862 603727 600005 595819 591473 586206 579263 570977
58655 570977 562468 554405 546487 538336 530479 524032 519516 516462 514228 512816 512600 513505 514943 516611 518938
58640 518938 522460 527017 532051 537494 543812 551087 558614 565582 571562 576080 578468 578749 578126 577837 577878
58625 577878 577618 577263 577711 579090 580533 581571 582794 584881 587856 591660 596699 603287 611163 619904 629310
$$ packed form
58720A233223L060M032M571L880J582k048o919j3226k0373k6612l0540l2453l3634
58707A084543l4653l5051l4383l2834l0756k8288k5604k3075k0877j8683j6062
58696G84277j3088j0310q083o144l941j303J445L855N633O471O014M150J157k612
58682G67521o858j0996j4111j5703j6287j6686j6902j6188j4189j1477q823o509
58670F12792m567l109k074j002M13J642J659J08k135l722m186m346n267o943q286
58655E70977q509q063p918q151p857o447m516l054k234j412k16R05J438J668K327
58640E18938L522M557N034N443O318P275P527O968N980M518K388K81o23k89M1
58625E77878k60l55M48J379J443J038J223K087K975L804N039O588P876Q741R406
$$ plain form
58610 629310 639107 648927 658918 669704 681406 693406 705528 718571 733106 748501 763936 779721
58598 779721 796769 815335 835201 856645 880135 905239 930778 956094 981435 1007111 1032928
58587 1032928 1058442 1083110 1106188 1127034 1145498 1161570 1174797 1184632 1191206 1195093 1196338 1194303
58575 1194303 1188561 1179461 1167774 1154246 1139450 1123656 1106913 1089579 1072558 1056502 1040996 1025175
58563 1025175 1008946 993023 977849 963181 948625 933894 918658 902921 887550 873575 860822
58552 860822 848000 834288 820049 805711 790834 774871 758274 742170 727222 713257 699823
58541 699823 686720 674098 662255 651346 641250 631830 623262 615855 609673 604565 600394 596876 593462
58528 593462 589909 586772 584693 583350 581896 580327 579471 579468 579171 577471 574426 570573 565906 560207 553875
$$ packed form
58610F29310R797R820R991J0786J1702J2000J2122J3043J4535J5395J5435J5785
58598G79721J7048J8566J9866K1444K3490K5104K5539K5316K5341K5676K5817
58587A032928K5514K4668K3078K0846J8464J6072J3227R835O574L887J245k035
58575A194303n742r100j1687j3528j4796j5794j6743j7334j7021j6056j5506j5821
58563A025175j6229j5923j5174j4668j4556j4731j5236j5737j5371j3975j2753
58552H60822j2822j3712j4239j4338j4877j5963j6597j6104j4948j3965j3434
58541F99823j3103j2622j1843j0909j0096r420q568p407o182n108m171l518l414
58528E93462l553l137k079j343j454j569q56lk97j700l045l853m667n699o332
$$ plain form
58513 553875 547674 541906 536432 531355 527139 524117 522285 521520 521636 522236 522753 522833 522660 522934 524398 527159
58497 527159 530559 533951 537494 541848 547182 552968 558652 563942 568358 571186 572239 572263 572238 572555 572978 573076
58481 573076 572552 571469 570308 569451 568577 567036 564915 563146 562396 562404 562638 563073 563964 565260 566528 567146 566575
58464 566575 565011 563763 564138 565692 566452 565289 563196 561649 560683 559485 558044 556972 556097 554564 552339
58449 552339 550504 549838 549958 550172 550459 551201 552453 553931 555473 557226 559432 562124 565003 567709 570344
58434 570344 573503 577500 581810 585662 589054 592755 597343 602705 608435 614217 619661 624215 627579 630073
58420 630073 632364 634856 637394 639610 641570 643999 647648 652433 657471 662125 666704 671920 677988 684556
58406 684556 691171 697416 702859 707446 711835 716837 722468 728034 733134 738084 743170 748049 752207 755699
$$ packed form
58513E53875o201n768n474n077m216l022j832p65J16O00N17Q0j73K74J464K761
58497E27159L400L392L543M354N334N786N684N290M416K828J053K4k5L17M23R8
58481E73076n24j083j161q57q74j541k121j769p50QK34M35Q91J296J268O18n71
58464E66575j564j248L75J554P60j163k093j547r66j198j441j072q75j533k225
58449E52339j835o66J20K14K87P42J252J478J542J753K206K692K879K706K635
58434E70344L159L997M310L852L392L701M588N362N730N782N444M554L364K494
58420F30073K291K492K538K216J960K429L649M785N038M654M579N216O068O568
58406F84556O615O245N443M587M389N002N631N566N100M950N086M879M158L492
$$ plain form
58392 755699 759016 762407 765751 769067 772725 776965 781486 785866 790308 795609 802210 809540 816562 822859
58378 822859 828923 835449 842649 850260 857876 865169 872051 878750 885581 892589 899591 906597 913904 921695
58364 921695 929782 937909 946039 954223 962334 970176 977827 985813 994848 1005264 1016563 1027714 1038148
58351 1038148 1048344 1059214 1071108 1083720 1096715 1109936 1123138 1136112 1149071 1162391 1175966
58340 1175966 1189351 1202510 1215831 1229341 1242613 1255578 1268767 1282470 1296287 1309891 1323666
58329 1323666 1338266 1353971 1370790 1388697 1407439 1426513 1445633 1464869 1484228 1503629 1523449
58318 1523449 1544452 1566851 1590046 1613610 1637882 1663190 1689157 1715269 1741608 1768479 1795882
58307 1795882 1823856 1852810 1882873 1913296 1943118 1972183 2001068 2030349 2060364 2091337 2123210
$$ packed form
58392G55699L317L391L344L316L658M240M521M380M442N301O601P330P022O297
58378H22859O064O526P200P611P616P293O882O699O831P008P002P006P307P791
58364I21695Q087Q127Q130Q184Q111P842P651P986R035J0416J1299J1151J0434
58351A038148J0196J0870J1894J2612J2995J3221J3202J2974J2959J3320J3575
58340A175966J3385J3159J3321J3510J3272J2965J3189J3703J3817J3604J3775
58329A323666J4600J5705J6819J7907J8742J9074J9120J9236J9359J9401J9820
58318A523449K1003K2399K3195K3564K4272K5308K5967K6112K6339K6871K7403
58307A795882K7974K8954L0063L0423K9822K9065K8885K9281L0015L0973L1873
$$ plain form
58296 2123210 2155585 2188143 2220920 2253995 2287425 2321687 2357644 2395684 2435412 2476489 2519193
58285 2519193 2563790 2610013 2657580 2706613 2757123 2808764 2861632 2916632 2974442 3034672 3096624
58274 3096624 3160330 3226342 3295030 3366595 3441249 3518842 3598827 3680887 3765116 3851502 3940092
58263 3940092 4031757 4127509 4226692 4327264 4428526 4532241 4640311 4752798 4869195 4990115
58253 4990115 5116389 5247843 5384412 5527332 5677783 5835435 5999762 6171666 6352234
58244 6352234 6541100 6737879 6944256 7162737 7394083 7637789 7894375 8165316 8451341
58235 8451341 8752726 9070766 9407285 9763235 10139474 10538260 10962341 11413368 11893011
58226 11893011 12404764 12952810 13540078 14169444 14845913 15575592 16363726 17216034 18140836
$$ packed form
58296B123210L2375L2558L2777L3075L3430L4262L5957L8040L9728M1077M2704
58285B519193M4597M6223M7567M9033N0510N1641N2868N5000N7810O0230O1952
58274C096624O3706O6012O8688P1565P4654P7593P9985Q2060Q4229Q6386Q8590
58263C940092R1665R5752R9183J00572J01262J03715J08070J12487J16397J20920
58253D990115J26274J31454J36569J42920J50451J57652J64327J71904J80568
58244F352234J88866J96779K06377K18481K31346K43706K56586K70941K86025
58235H451341L01385L18040L36519L55950L76239L98786M24081M51027M79643
58226A1893011N11753N48046N87268O29366O76469P29679P88134Q52308R24802
$$ plain form
58217 18140836 19147433 20243631 21437388 22739649 24163370 25722531 27436453 29334168
58209 29334168 31451486 33826190 36500324 39524634 42955564 46850689 51273803 56302470
58201 56302470 62023700 68525553 75903117 84271692 93764644 104521592 116687720 130399446
58193 130399446 145701916 162421348 180119352 198213134 216162996 233532116 249852397
58186 249852397 264437509 276335943 284486506 287990160 286363590 279672459 268503246
58179 268503246 253802972 236669993 218177326 199260548 180661513 162914259 146363851
58172 146363851 131202014 117501635 105246000 94358158 84728997 76236477 68755466
58165 68755466 62164473 56351477 51216208 46669730 42634720 39045813 35847339 32990352
$$ packed form
58217A8140836J006597J096198J193757J302261J423721J559161J713922J897715
58209B9334168K117318K374704K674134L024310L430930L895125M423114N028667
58201E6302470N721230O501853P377564Q368575R492952J0756948J2166128J3711726
58193A30399446J5302470J6719432J7698004J8093782J7949862J7369120J6320281
58186B49852397J4585112J1898434Q150563L503654j626570o691131j1169213
58179B68503246j4700274j7132979j8492667j8916778j8599035j7747254j6550408
58172A46363851j5161837j3700379j2255635j0887842r629161q492520p481011
58165F8755466o590993n812996n135269m546478m035010l588907l198474k856987
$$ plain form
58157 32990352 30432364 28138039 26077376 24223080 22550723 21040044 19673602 18434322
58149 18434322 17305757 16273947 15327187 14454626 13647109 12898916 12206635 11566227 10972590
58140 10972590 10421481 9909911 9434545 8991361 8577178 8190187 7828775 7490858 7174438
58131 7174438 6877809 6599104 6336518 6088922 5855535 5635172 5426530 5228869 5041601
58122 5041601 4863670 4694252 4533535 4381747 4237788 4099956 3967680 3841430 3721237
58113 3721237 3606458 3496788 3392290 3292490 3196601 3104631 3017214 2934301 2854995 2778737 2705774
58102 2705774 2636352 2570299 2507421 2447539 2390108 2334470 2280486 2228273 2177562 2128029 2080042
58091 2080042 2034190 1990229 1947329 1905268 1864529 1825386 1787652 1751217 1715963 1681348 1646949
$$ packed form
58157C2990352k557988k294325k060663j854296j672357j510679j366442j239280
58149A8434322j128565j031810r46760q72561q07517p48193o92281o40408n93637
58140A0972590n51109n11570m75366m43184m14183l86991l61412l37917l16420
58131G174438k96629k78705k62586k47596k33387k20363k08642j97661j87268
58122E041601j77931j69418j60717j51788j43959j37832j32276j26250j20193
58113C721237j14779j09670j04498r9800r5889r1970q7417q2913p9306p6258p2963
58102B705774o9422o6053o2878n9882n7431n5638n3984n2213n0711m9533m7987
58091B080042m5852m3961m2900m2061m0739l9143l7734l6435l5254l4615l4399
$$ plain form
58080 1646949 1613249 1580995 1550000 1519537 1489600 1460651 1432354 1403977 1376022 1349946 1325982
58069 1325982 1302651 1278909 1255498 1233517 1212839 1192748 1173185 1154494 1136625 1119356 1102697
58058 1102697 1086350 1069394 1051249 1032549 1014439 997366 981123 965605 950876 936746 922877
58047 922877 909161 895670 882492 869915 858355 847747 837399 826898 816718 807466 798898 790267
58035 790267 781328 772407 763669 754895 745897 736597 726788 716388 705995 696641 688803 681940 675226 668431
58021 668431 661869 655713 649743 643796 638132 633128 628776 624807 621315 618766 617203 615862 614020 611902
58007 611902 610268 609311 608627 608135 608270 609126 610160 611050 612252 614312 617160 620562 624780 630212 636550 642870
57991 642870 648517 653583 658639 664315 671020 678726 687040 695749 705201 715945 728134 741533 755962
$$ packed form
58080A646949l3700l2254l0995l0463k9937k8949k8297k8377k7955k6076k3964
58069A325982k3331k3742k3411k1981k0678k0091j9563j8691j7869j7269j6659
58058A102697j6347j6956j8145j8700j8110j7073j6243j5518j4729j4130j3869
58047I22877j3716j3491j3178j2577j1560j0608j0348j0501j0180r252q568q631
58035G90267q939q921q738q774q998r300r809j0400j0393r354p838o863o714o795
58021F68431o562o156n970n947n664n004m352l969l492k549j563j341j842k118
58007F11902j634r57o84m92J35Q56J034Q90J202K060K848L402M218N432O338O320
57991F42870N647N066N056N676O705P706Q314Q709R452J0744J2189J3399J4429
$$ plain form
57978 755962 771407 787736 804644 821873 839155 855809 870637 882422 890481 894652 894803 890478
57966 890478 881117 866672 847974 826476 803568 780179 756914 734319 712876 692783 673882 655857
57954 655857 638544 622148 607162 594032 582891 573614 566047 560070 555554 552344 550247 548955 548090
57941 548090 547466 547103 546780 545811 543589 540230 536281 531854 526547 520215 513333 506446 499737 493377 487812
57926 487812 483301 479431 475601 471944 469368 468689 469983 472866 477124 482776 489487 496182 501610 505391
57912 505391 508211 510725 512501 512478 510324 506806 502833 498610 493911 488513 482065 474034 464425 454364
57898 454364 445405 438181 432031 425931 419481 413012 407023 401677 396644 391317 385200 378186 370525 362655
57884 362655 355073 348235 342436 337783 334276 331789 330011 328591 327423 326672 326533 327119 328525 330693 333141
$$ packed form
57978G55962J5445J6329J6908J7229J7282J6654J4828J1785Q059M171J51m325
57966H90478r361j4445j8698k1498k2908k3389k3265k2595k1443k0093j8901j8025
57954F55857j7313j6396j4986j3130j1141r277p567n977m516l210k097j292q65
57941E48090o24l63l23r69k222l359l949m427n307o332o882o887o709o360n565
57926D87812m511l870l830l657k576o79J294K883M258N652O711O695N428L781
57912E05391K820K514J776k3k154l518l973m223m699n398o448q031r609j0061
57898D54364q959p224o150o100o450o469n989n346n033n327o117p014p661p870
57884C62655p582o838n799m653l507k487j778j420j168p51j39N86J406K168K448
$$ plain form
57869 333141 335174 336545 337723 339328 341516 344083 346912 349955 352930 355295 356567 356566 355455 353600 351252
57854 351252 348226 344104 338867 333143 327633 322487 317474 312570 308108 304453 301755 299902 298548 297346
57840 297346 296444 296644 298738 302663 307481 312098 315910 318934 321626 324548 327937 331582 335225 338875 342473
57825 342473 345480 347244 347733 347470 346694 345007 341998 337816 332868 327272 320987 314344 308140 303154 299715
57810 299715 297784 297270 298173 300464 303950 308366 313604 319806 327163 335715 345368 355994 367336 378883
57796 378883 390055 400592 410662 420478 429762 437540 442556 444082 442460 438752 433800 427772 420629
57783 420629 412646 404106 394767 384192 372676 361272 350732 340797 330847 320854 311236 301995 292616
57770 292616 282959 273780 266016 259738 254174 248740 243670 239553 236568 234418 232796 231529 230312 228796
$$ packed form
57869C33141K033J371J178J605K188K567K829L043K975K365J272jj111j855k348
57854C51252l026m122n237n724n510n146n013m904m462l655k698j853j354j202
57840B97346r02K00K094L925M818M617L812L024K692K922L389L645L643L650L598
57825C42473L007J764M89k63p76j687l009m182m948n596o285o643o204m986l439
57810B99715j931n14R03K291L486M416N238O202P357Q552R653J0626J1342J1547
57796C78883J1172J0537J0070R816R284P778N016J526j622l708m952o028p143
57783D20629p983q540r339j0575j1516j1404j0540r935r950r993r618r241r379
57770B92616r657r179p764o278n564n434n070m117k985k150j622j267j217j516
$$ plain form
57756 228796 227113 225984 225965 226805 227842 228878 230260 232177 234329 236352 238214 240016 241737 243416 245330
57741 245330 247680 250233 252583 254690 256902 259452 262150 264643 266783 268726 270824 273475 276837 280584
57727 280584 284133 287199 289937 292457 294469 295796 296970 298834 301460 303937 305386 305823 305790 305564 305175
57712 305175 304892 305089 305669 306118 306212 306320 306914 308204 310288 313200 316591 319799 322573 325389 328697 332196
57696 332196 335252 337852 340684 344421 349333 355473 362684 370347 377652 384440 391581 400339 411463 424952
57682 424952 440487 457926 477544 499945 525726 555159 588247 625097 666229 712611 765585
57671 765585 826688 897240 977771 1067281 1162255 1255732 1337706 1397863 1429590 1432638 1412676 1378324
57659 1378324 1337737 1296457 1257309 1221721 1190807 1165091 1143645 1124387 1105572 1086650 1067583
$$ packed form
57756B28796j683j129j9Q40J037J036J382J917K152K023J862J802J721J679J914
57741B45330K350K553K350K107K212K550K698K493K140J943K098K651L362L747
57727B80584L549L066K738K520K012J327J174J864K626K477J449M37l3k26l89
57712C05175k83J97N80M49R4J08N94J290K084K912L391L208K774K816L308L499
57696C32196L056K600K832L737M912O140P211P663P305O788P141Q758J1124J3489
57682D24952J5535J7439J9618K2401K5781K9433L3088L6850M1132M6382N2974
57671G65585O1103P0552Q0531Q9510R4974R3477Q1974O0157L1727L048j9962l4352
57659A378324m0587m1280l9148l5588l0914k5716k1446j9258j8815j8922j9067
$$ plain form
57648 1067583 1047972 1027290 1005487 982814 959346 935287 911431 888614 866747 845059 823393
57637 823393 802574 783361 765719 749433 734735 721778 709980 698562 687511 677409 668537 660744
57625 660744 654019 648518 643982 639907 636497 634796 635461 637844 640738 643718 647375 652529 659647 668786
57611 668786 679608 691491 704047 717520 732395 748700 765988 783913 802423 821461 840903
57600 840903 860777 881065 901188 920061 936796 951071 962785 971791 978083 981735 982402 979332 972190
57587 972190 961569 948344 932822 914867 894603 872583 849445 825771 802091 778661 755323
57576 755323 731932 708788 686357 664834 644390 625645 609226 594799 581090 567103 552963
57565 552963 539429 526976 515600 505203 495828 487595 480571 474641 469471 464759 460579 457248 454799
$$ packed form
57648A067583j9611k0682k1803k2673k3468k4059k3856k2817k1867k1688k1666
57637H23393k0819j9213j7642j6286j4698j2957j1798j1418j1051j0102q872p793
57625F60744o725n501m536m075l410j701O65K383K894K980L657N154P118R139
57611F68786J0822J1883J2556J3473J4875J6305J7288J7925J8510J9038J9442
57600H40903J9874K0288K0123J8873J6735J4275J1714R006O292L652O67l070p142
57587I72190j0621j3225j5522j7955k0264k2020k3138k3674k3680k3430k3338
57576G55323k3391k3144k2431k1523k0444j8745j6419j4427j3709j3987j4140
57565E52963j3534j2453j1376j0397r375q233p024n930n170m712m180l331k449
$$ plain form
57552 454799 452795 450812 448849 447111 445587 444091 442678 441804 442032 443555 445939 448335 450074 451207 452417
57537 452417 454391 457351 461080 465199 469346 473322 477267 481598 486715 492765 499680 507306 515411 523790
57523 523790 532539 542181 553331 566164 580163 594429 608317 621890 635822 650827 667194 684802
57511 684802 703410 722766 742594 762597 782464 801736 819861 836603 852242 867048 880651
57500 880651 892327 901881 909805 916380 920987 922567 920605 915441 907840 898529 888010 876524 864069
57487 864069 850560 836035 820772 805225 789848 774937 760664 747283 735166 724544 715327 707327
57475 707327 700489 694697 689626 685142 681631 679571 678854 679014 680000 682103 685119 688257 691161 694511 699289
57460 699289 705862 714012 723426 733836 745066 757249 770725 785453 800911 816748 833120 850133
$$ packed form
57552D54799k004j983j963j738j524j496j413q74K28J523K384K396J739J133J210
57537D52417J974K960L729M119M147L976L945M331N117O050O915P626Q105Q379
57523E23790Q749R642J1150J2833J3999J4266J3888J3573J3932J5005J6367J7608
57511F84802J8608J9356J9828K0003J9867J9272J8125J6742J5639J4806J3603
57500H80651J1676R554P924O575M607J580j962n164p601r311j0519j1486j2455
57487H64069j3509j4525j5263j5547j5377j4911j4273j3381j2117j0622r217q000
57475G07327o838n792n071m484l511k060p17J60R86K103L016L138K904L350M778
57460F99289O573Q150R414J0410J1230J2183J3476J4728J5458J5837J6372J7013
$$ plain form
57448 850133 867559 885415 904148 923669 942842 960677 977538 994301 1010651 1025233 1037269
57437 1037269 1047003 1054479 1058995 1060127 1058418 1054579 1048640 1040439 1030299 1018628 1005253 989881 973135
57424 973135 956542 941381 927802 915064 902455 889902 877855 866685 856389 846953 838720 832022
57412 832022 826537 821522 816752 812782 810107 808548 807660 807263 807211 807126 806857 806905 807814 809351 810877 812481 815116
57395 815116 819394 824691 829694 833599 836569 839312 842553 846847 852500 859444 867208 875160 882853 890238
57381 890238 897602 905323 913595 922228 930732 938762 946590 954958 964309 974303 984326 994320 1004753 1015784
57367 1015784 1026898 1037561 1047921 1058553 1069697 1080985 1091829 1101888 1111230 1120234 1129321 1138712
57355 1138712 1148435 1158559 1169146 1179907 1190194 1199607 1208473 1217447 1226788 1236371 1246285 1256962 1268581
$$ packed form
57448H50133J7426J7856J8733J9521J9173J7835J6861J6763J6350J4582J2036
57437A037269R734P476M516J132j709l839n939q201j0140j1671j3375j5372j6746
57424I73135j6593j5161j3579j2738j2609j2553j2047j1170j0296r436q233o698
57412H32022n485n015m770l970k675j559q88l97n2q5k69M8R09J537J526J604K635
57395H15116M278N297N003L905K970K743L241M294N653O944P764P952P693P385
57381H90238P364P721Q272Q633Q504Q030P828Q368R351R994J0023R994J0433J1031
57367A015784J1114J0663J0360J0632J1144J1288J0844J0059R342R004R087R391
57355A138712R723J0124J0587J0761J0287R413Q866Q974R341R583R914J0677J1619
$$ plain form
57342 1268581 1280707 1292778 1304679 1316569 1328343 1339724 1350922 1362763 1375849 1389751 1403397
57331 1403397 1416243 1428738 1441573 1454854 1468281 1481863 1495941 1510550 1525193 1539475 1553652
57320 1553652 1568300 1583621 1599382 1615448 1632045 1649345 1667006 1684314 1700847 1716853 1732953
57309 1732953 1749553 1766615 1783847 1800927 1817604 1833918 1850384 1867624 1885644 1903827 1921841
57298 1921841 1940142 1959182 1978535 1997499 2016338 2036142 2057371 2079256 2100812 2121724 2141981
57287 2141981 2161450 2180371 2199639 2219827 2240314 2260085 2279139 2298347 2317992 2337254 2355232
57276 2355232 2371857 2387567 2402625 2417097 2431108 2444748 2457859 2470135 2481356 2491479 2500681
57265 2500681 2509465 2518508 2528208 2538442 2548847 2559306 2570102 2581635 2593965 2606617 2618828 2630088
$$ packed form
57342A268581J2126J2071J1901J1890J1774J1381J1198J1841J3086J3902J3646
57331A403397J2846J2495J2835J3281J3427J3582J4078J4609J4643J4282J4177
57320A553652J4648J5321J5761J6066J6597J7300J7661J7308J6533J6006J6100
57309A732953J6600J7062J7232J7080J6677J6314J6466J7240J8020J8183J8014
57298A921841J8301J9040J9353J8964J8839J9804K1229K1885K1556K0912K0257
57287B141981J9469J8921J9268K0188K0487J9771J9054J9208J9645J9262J7978
57276B355232J6625J5710J5058J4472J4011J3640J3111J2276J1221J0123R202
57265B500681Q784R043R700J0234J0405J0459J0796J1533J2330J2652J2211J1260
$$ plain form
57253 2630088 2640421 2650197 2659858 2669891 2680720 2692316 2704030 2715131 2725527 2735729 2746211 2757022
57241 2757022 2767953 2778782 2789384 2799826 2810320 2820885 2831170 2840918 2850455 2860345 2870653 2880956
57229 2880956 2891062 2901184 2911397 2921431 2931214 2941143 2951560 2962291 2972919 2983187 2992950 3002144
57217 3002144 3011081 3020395 3030357 3040532 3050419 3060040 3069517 3078474 3086498 3094012 3102000 3110771 3119530 3127332
57203 3127332 3134101 3140552 3147368 3154653 3161975 3168791 3174943 3180776 3186745 3192924 3199093 3205209 3211495 3218042
57189 3218042 3224617 3231001 3237254 3243502 3249617 3255347 3260700 3266021 3271713 3277993 3284899 3292437 3300604 3309255
57175 3309255 3318051 3326689 3335193 3343800 3352474 3360771 3368391 3375698 3383378 3391617 3399953 3407912 3415443 3422623
57161 3422623 3429314 3435369 3440907 3446080 3450676 3454239 3456554 3457805 3458326 3458400 3458275 3458092 3457750 3457098 3456398 3456398 3457748
$$ packed form
57253B630088J0333R776R661J0033J0829J1596J1714J1101J0396J0202J0482J0811
57241B757022J0931J0829J0602J0442J0494J0565J0285R748R537R890J0308J0303
57229B880956J0106J0122J0213J0034R783R929J0417J0731J0628J0268R763R194
57217C002144Q937R314R962J0175R887R621R477Q957Q024P514P988Q771Q759P802
57203C127332O769O451O816P285P322O816O152N833N969O179O169O116O286O547
57189C218042O575O384O253O248O115N730N353N321N692O280O906P538Q167Q651
57175C309255Q796Q638Q504Q607Q674Q297P620P307P680Q239Q336P959P531P180
57161C422623O691O055N538N173M596L563K315J251N21P4j25j83l42o52p00%J350
$$ plain form
57144 3457748 3460429 3463977 3468210 3473530 3480432 3488848 3498089 3507329 3516115 3524520 3533034 3542270 3552554 3563770
57130 3563770 3575678 3588412 3602463 3618104 3635078 3653104 3672601 3694681 3720471 3750625 3785430
57119 3785430 3825079 3869795 3919917 3976056 4039015 4109583 4188684 4277884 4379459 4495699 4628387
57108 4628387 4779357 4951459 5148636 5375140 5635218 5933762 6276877 6671517 7124795
57099 7124795 7643883 8236178 8908908 9668248 10518909 11464402 12507119 13647578 14883297
57090 14883297 16208020 17611436 19078905 20590963 22122893 23644881 25122962 26520543
57082 26520543 27800022 28924366 29858854 30573197 31043688 31254969 31201218 30886561 30324274
57073 30324274 29534788 28543464 27379246 26074040 24661797 23177020 21653391 20122835
$$ packed form
57144C457748K681L548M233N320O902Q416R241R240Q786Q405Q514R236J0284J1216
57130C563770J1908J2734J4051J5641J6974J8026J9497K2080K5790L0154L4805
57119C785430L9649M4716N0122N6139O2959P0568P9101Q9200J01575J16240J32688
57108D628387J50970J72102J97177K26504K60078K98544L43115L94640M53278
57099G124795N19088N92295O72730P59340Q50661R45493J042717J140459J235719
57090A4883297J324723J403416J467469J512058J531930J521988J478081J397581
57082B6520543J279479J124344R34488P14343M70491K11281n3751l14657n62287
57073C0324274p89486r91324j164218j305206j412243j484777j523629j530556
$$ plain form
57065 20122835 18614339 17152346 15755628 14437377 13206033 12066045 11018520 10061931
57057 10061931 9192644 8405230 7693261 7050602 6471958 5951982 5484398 5062768 4682049
57048 4682049 4338786 4029891 3751975 3502017 3277911 3077993 2900544 2744099 2607764
57039 2607764 2490902 2392931 2313642 2252635 2207005 2169308 2128678 2074989 2002912 1913200 1811040
57028 1811040 1703027 1594566 1488998 1388400 1294578 1208911 1131620 1061852 998627 941351
57018 941351 889483 842249 798932 759104 722376 688199 656069 625764 597232 570435 545382
57007 545382 522095 500461 480259 461389 443829 427381 411813 397333 384589 373964 365157 357634
56995 357634 351170 345702 341004 336850 333289 330388 327925 325719 324137 323770 324592 325826 326681 326888 326427
$$ packed form
57065B0122835j508496j461993j396718j318251j231344j139988j047525r56589
57057A0061931q69287p87414p11969o42659n78644n19976m67584m21630l80719
57048D682049l43263l08895k77916k49958k24106j99918j77449j56445j36335
57039B607764j16862r7971p9289o1007m5630l7697m0630n3689p2077q9712j02160
57028A811040j08013j08461j05568j00598r3822q5667p7291o9768o3225n7276
57018I41351n1868m7234m3317l9828l6728l4177l2130l0305k8532k6797k5053
57007E45382k3287k1634k0202j8870j7560j6448j5568j4480j2744j0625q807p523
56995C57634o464n468m698m154l561k901k463k206j582l67Q22J234Q55K07m61
$$ plain form
56980 326427 325155 322942 319898 316214 311904 306909 301363 295631 290134 285292 281521 279128 278187 278536 279885
56965 279885 281939 284558 287835 291924 296770 302121 307842 314012 320602 327216 333249 338093 341038 341326
56951 341326 338771 334293 329352 324659 319766 314065 307808 301816 296532 291916 288205 286125 286092 287646 290085
56936 290085 293392 298095 304338 311583 319263 327208 335141 342153 347161 349716 349937 347690 342384 333823
56922 333823 322850 310795 298488 286200 274350 263638 254315 245811 237465 229318 221800 214864 208016
56909 208016 201199 195092 190305 186709 183888 181880 180987 181016 181247 181227 181154 181348 181770 182327 183359 185420 188627
56892 188627 192490 196393 200113 203833 207911 212645 218097 223951 229529 234105 237301 239246 240276 240478
56878 240478 239633 237689 235161 232794 230891 229298 228094 227919 229332 232131 235734 240095 245832 253469 262956
$$ packed form
56980C26427j272k213l044l684m310m995n546n732n497m842l771k393r41L49J349
56965B79885K054K619L277M089M846N351N721O170O590O614O033M844K945K88
56951C41326k555m478m941m693m893n701o257n992n284m616l711k080l3J554K439
56936B90085L307M703O243P245P680P945P933P012N008K555K21k247n306q561
56922C33823j0973j2055j2307j2288j1850j0712r323q504q346q147p518o936o848
56909B08016o817o107m787l596k821k008q93K9K31k0p3J94M22N57J032K061L207
56892A88627L863L903L720L720M078M734N452N854N578M576L196J945J030K02
56878B40478q45j944k528k367j903j593j204j75J413K799L603M361N737P637R487
$$ plain form
56863 262956 274032 286578 300332 314552 328284 340864 351849 360566 366110 367960 366494 362857
56851 362857 358269 353352 347997 341950 335634 330349 327520 327754 330708 335767 342705 351756 363299 377573
56837 377573 394542 413954 435438 458391 481650 503391 521655 534998 542545 543632 537973 526376
56825 526376 510823 493359 474980 455878 436632 418631 403187 390592 380391 372440 367371 365938
56813 365938 368149 373300 380849 390955 403900 419078 434850 449427 461624 470705 475867 476300 471624
56800 471624 462062 448360 431880 414541 398036 382850 368373 354146 340721 329167 320128 313682
56788 313682 309756 308228 308699 310636 313849 318452 324271 330508 336115 340324 342673 342778 340322 335260 327856
56773 327856 318462 307379 294936 281649 268181 255134 242848 231437 221017 211847 204137 197732
$$ packed form
56863B62956J1076J2546J3754J4220J3732J2580J0985Q717N544J850j466l637
56851C62857m588m917n355o047o316n285k829K34K954N059O938R051J1543J4274
56837C77573J6969J9412K1484K2953K3259K1741J8264J3343P547J087n659j1597
56825E26376j5553j7464j8379j9102j9246j8001j5444j2595j0201p951n069j433
56813C65938K211N151P549J0106J2945J5178J5772J4577J2197R081N162M33m676
56800D71624r562j3702j6480j7339j6505j5186j4477j4227j3425j1554r039o446
56788C13682l926j528M71J937L213M603N819O237N607M209K349J05k456n062p404
56773C27856r394j1083j2443j3287j3468j3047j2286j1411j0420r170p710o405
$$ plain form
56761 197732 192130 186936 182243 178404 175501 173197 171159 169308 167505 165264 162190 158588 155172 152132
56747 152132 148994 145612 142737 141095 140284 139205 137415 135440 133841 132708 132080 132036 132095 131299 129422 127514
56731 127514 126687 126887 127468 128398 129999 131840 132951 133175 133396 134225 135293 136086 136732 137512 138249 138701 139103
56714 139103 139808 140804 142014 143630 145555 146895 146733 145277 143643 142575 141977 141619 141595 141880 142035 141711 141115
56697 141115 140677 140507 140407 140241 140089 140213 140971 142615 145049 147898 150890 153934 156919 159798 162997 167239
56681 167239 172618 178194 182902 186646 190052 193415 196426 198856 200822 202263 202729 202060 200855 199904 199459
56666 199459 199400 199819 200876 202255 203365 204201 205479 207661 210225 212232 213428 214399 215723 217332 218705
56651 218705 219369 219112 217902 215918 213582 211363 209419 207544 205544 203602 202109 201167 200452 199618 198648 197680
$$ packed form
56761A97732n602n194m693l839k903k304k038j851j803k241l074l602l416l040
56747A52132l138l382k875j642q11j079j790j975j599j133o28m4N9p96j877j908
56731A27514q27K00N81R30J601J841J111K24K21Q29J068P93O46P80P37M52M02
56714A39103P05R96J210J616J925J340j62j456j634j068n98l58k4K85J55l24n96
56697A41115m38j70j00j66j52J24P58J644K434K849K992L044K985K879L199M242
56681A67239N379N576M708L744L406L363L011K430J966J441M66o69j205r51m45
56666A99459n9M19J057J379J110Q36J278K182K564K007J196R71J324J609J373
56651B18705O64k57j210j984k336k219j944j875k000j942j493r42p15q34r70r68
$$ plain form
56635 197680 196682 195520 194187 192671 190681 187908 184560 181304 178632 176636 175472 175473 176504 177687 178257
56620 178257 178421 178922 179960 181073 181877 182371 182579 182468 182245 182191 182083 181341 179932 178608 177962 177677 177004 175595
56602 175595 173577 171216 168896 167122 166100 165506 165005 164748 164957 165313 165285 164974 165099 166133 167904 170039
56586 170039 172321 174538 176415 177946 179506 181363 183278 184780 185662 186104 186427 186888 187592 188484 189494 190750
56570 190750 192516 194865 197468 199847 201782 203465 205339 207777 210841 214273 217720 220947 223786 226017
56556 226017 227494 228396 229172 230130 231174 231971 232334 232390 232443 232656 232815 232460 231343 229721 228075 226551 224758
56539 224758 222169 218670 214712 210948 207650 204427 200630 196087 191353 187118 183560 180444 177577 174892
56525 174892 172187 169213 166029 163016 160511 158687 157722 157616 157760 157140 155296 152863 150906 149873 149427
$$ packed form
56635A97680r98j162j333j516j990k773l348l256k672j996j164JJ031J183N70
56620A78257J64N01J038J113Q04M94K08j11k23n4j08p42j409j324o46k85o73j409
56602A75595k018k361k320j774j022n94n01k57K09L56k8l11J25J034J771K135
56586A70039K282K217J877J531J560J857J915J502Q82M42L23M61P04Q92J010J256
56570A90750J766K349K603K379J935J683J874K438L064L432L447L227K839K231
56556B26017J477R02P76R58J044P97L63N6N3K13J59l55j117j622j646j524j793
56539B24758k589l499l958l764l298l223l797m543m734m235l558l116k867k685
56525A74892k705k974l184l013k505j824r65j06J44o20j844k433j957j033m46
$$ plain form
56510 149427 149084 148714 148424 148244 148055 147760 147440 147257 147168 146890 146303 145813 146041 147177 148882 150789 152709 154261
56492 154261 154838 154275 153259 152718 152918 153461 153898 153971 153449 152267 150903 150185 150538 151609 152681 153245 153155 152559
56474 152559 151875 151662 152349 154077 156773 160194 163878 167320 170353 173212 176041 178469 179910 180286 180294 180870
56458 180870 182355 184193 185440 185606 185012 184327 183872 183432 182719 181767 180872 180303 180205 180581 181167 181443 180997 179948
56440 179948 178886 178404 178765 179874 181288 182259 182125 180908 179345 178159 177486 177161 177238 177743 178118 177597 176267
56423 176267 175154 174942 175083 174697 173887 173448 173505 173279 172352 171377 171123 171383 171445 171277 171577 172704 174192 175490
56405 175490 176659 178014 179369 180108 179962 179399 179101 179299 179761 180261 180845 181683 182931 184754 187137 189593
56389 189593 191359 192168 192601 193419 194772 196397 198298 200676 203346 205837 208050 210230 212237 213561 214299
$$ packed form
56510A49427l43l70k90j80j89k95l20j83q9k78n87m90K28J136J705J907J920J552
56492A54261N77n63j016n41K00N43M37P3n22j182j364p18L53J071J072N64r0n96
56474A52559o84k13O87J728K696L421L684L442L033K859K829K428J441L76QN76
56458A80870J485J838J247J66n94o85m55m40p13r52q95n69r8L76N86K76m46j049
56440A79948j062m82L61J109J414R71j34j217j563j186o73l25P7N05L75n21j330
56423A76267j113k12J41l86q10m39N7k26r27r75k54K60O2j68L00J127J488J298
56405A75490J169J355J355P39j46n63k98J98M62N00N84Q38J248J823K383K456
56389A89593J766Q09M33Q18J353J625J901K378K670K491K213K180K007J324P38
$$ plain form
56374 214299 215301 216925 218354 218790 218705 219085 219871 220096 219401 218432 217721 217079 216293 215655 215418 215423 215637 216428 217865
56355 217865 219260 220000 220446 221474 223366 225650 227810 229636 230977 231760 232286 233081 234368 235975 237753
56340 237753 239731 241809 243652 245074 246257 247461 248695 249806 250754 251687 252836 254378 256354 258635 261083
56325 261083 263703 266553 269526 272376 274944 277218 279193 280884 282511 284467 286988 289993 293295 296769
56311 296769 300275 303614 306697 309625 312475 315248 318128 321558 325806 330655 335781 341235 347175 353247
56297 353247 358755 363506 367996 372584 376962 380810 384595 389117 394467 399956 405163 410514 416619 423416
56283 423416 430319 436972 443473 449976 456444 462946 469971 478260 488295 500011 513023 527099 542394
56270 542394 559210 577697 597947 620404 645904 675122 708087 744372 783733 826471 873255
$$ packed form
56374B14299J002J624J429M36q5L80P86K25o95r69p11o42p86o38k37NK14P91J437
56355B17865J395P40M46J028J892K284K160J826J341P83N26P95J287J607J778
56340B37753J978K078J843J422J183J204J234J111R48R33J149J542J976K281K448
56325B61083K620K850K973K850K568K274J975J691J627J956K521L005L302L474
56311B96769L506L339L083K928K850K773K880L430M248M849N126N454N940O072
56297C53247N508M751M490M588M378L848L785M522N350N489N207N351O105O797
56283D23416O903O653O501O503O468O502P025Q289J0035J1716J3012J4076J5295
56270E42394J6816J8487K0250K2457K5500K9218L2965L6285L9361M2738M6784
$$ plain form
56259 873255 924758 981415 1043410 1110801 1183616 1261760 1344771 1431775 1521746 1613660 1706213
56248 1706213 1797506 1885196 1966980 2040820 2104911 2157805 2198620 2226861 2241948 2243267 2230950
56237 2230950 2206428 2171888 2129204 2079580 2024154 1964479 1902146 1838067 1772432 1705381 1637511
56226 1637511 1569664 1502516 1436560 1372325 1310272 1250468 1192672 1136911 1083757 1033839 987239
56215 987239 943579 902650 864700 830099 798867 770650 745127 722346 702588 685817 671358
56204 671358 658324 646344 635658 626509 618780 612360 607446 604121 601891 600037 598253 596625 595185
56191 595185 593974 593418 594007 595520 597054 598053 598899 600301 602488 605203 608154 611219 614449 618110 622495
56176 622495 627519 632772 638148 644125 651179 659221 667832 676800 686079 695576 705380 716034 728115 741621
$$ packed form
56259H73255N1503N6657O1995O7391P2815P8144Q3011Q7004Q9971R1914R2553
56248A706213R1293Q7690Q1784P3840O4091N2894M0815K8241J5087J319j2317
56237B230950k4522l4540m2684m9624n5426n9675o2333o4079o5635o7051o7870
56226A637511o7847o7148o5956o4235o2053n9804n7796n5761n3154m9918m6600
56215I87239m3660m0929l7950l4601l1232k8217k5523k2781j9758j6771j4459
56204F71358j3034j1980j0686r149p729o420m914l325k230j854j784j628j440
56191E95185j211n56N89J513J534R99Q46J402K187K715K951L065L230L661M385
56176F22495N024N253N376N977P054Q042Q611Q968R279R497R804J0654J2081J3506
$$ plain form
56162 741621 756088 771277 787376 804702 823655 844964 869521 897766 929585 965000 1004798
56151 1004798 1050347 1102984 1163737 1233491 1313050 1402703 1501415 1606274 1712824 1816152 1911921
56140 1911921 1996889 2069305 2129486 2179856 2223793 2263916 2301063 2334311 2361446 2379712 2387102
56129 2387102 2383715 2371984 2355404 2336629 2316172 2292186 2261245 2219708 2165035 2096591 2015981
56118 2015981 1926895 1834141 1742093 1653808 1571569 1497670 1433957 1380730 1336819 1300866 1272008
56107 1272008 1249381 1231810 1218434 1209042 1203352 1200453 1199460 1200305 1203343 1208421 1214941 1222590 1231465 1241475
56093 1241475 1252168 1263235 1274863 1287516 1301558 1316967 1333143 1349091 1364195 1378845 1394033
56082 1394033 1410397 1427896 1446287 1465492 1485511 1506337 1527998 1550297 1572504 1593761 1613998
$$ packed form
56162G41621J4467J5189J6099J7326J8953K1309K4557K8245L1819L5415L9798
56151A004798M5549N2637O0753O9754P9559Q9653R8712J04859J06550J03328R5769
56140A911921Q4968P2416O0181N0370M3937M0123L7147L3248K7135J8266P390
56129B387102l387j1731j6580j8775k0457k3986l0941m1537n4673o8444q0610
56118B015981q9086r2754r2048q8285q2239p3899o3713n3227m3911l5953k8858
56107A272008k2627j7571j3376r392n690k899r93Q45L038N078O520P649Q875J0010
56093A241475J0693J1067J1628J2653J4042J5409J6176J5948J5104J4650J5188
56082A394033J6364J7499J8391J9205K0019K0826K1661K2299K2207K1257K0237
$$ plain form
56071 1613998 1634079 1654835 1676225 1697673 1718944 1740394 1762541 1785692 1809883 1834927 1860526
56060 1860526 1886551 1913215 1940896 1969777 1999752 2030665 2062547 2095622 2130093 2165902 2202793
56049 2202793 2240682 2279903 2320894 2363654 2407765 2453000 2499680 2548214 2598496 2649964 2702219
56038 2702219 2755399 2809960 2866272 2924457 2984594 3046983 3112137 3180376 3251449 3324772 3400130
56027 3400130 3478038 3559290 3644279 3732831 3824528 3918994 4016017 4115646 4218239 4324265 4434005
56016 4434005 4547541 4665025 4786852 4913473 5045124 5181847 5323847 5471815 5626722
56007 5626722 5789160 5959038 6136203 6321341 6515880 6720878 6936345 7162014 7398485
55998 7398485 7647143 7909068 8184536 8473749 8777648 9097794 9435729 9792830 10170628
$$ packed form
56071A613998K0081K0756K1390K1448K1271K1450K2147K3151K4191K5044K5599
56060A860526K6025K6664K7681K8881K9975L0913L1882L3075L4471L5809L6891
56049B202793L7889L9221M0991M2760M4111M5235M6680M8534N0282N1468N2255
56038B702219N3180N4561N6312N8185O0137O2389O5154O8239P1073P3323P5358
56027C400130P7908Q1252Q4989Q8552R1697R4466R7023R9629J02593J06026J09740
56016D434005J13536J17484J21827J26621J31651J36723J42000J47968J54907
56007E626722J62438J69878J77165J85138J94539K04998K15467K25669K36471
55998G398485K48658K61925K75468K89213L03899L20146L37935L57101L77798
$$ plain form
55989 10170628 10570973 10995868 11447383 11927828 12439935 12986868 13572188 14199842 14874200
55980 14874200 15600088 16382915 17228954 18145638 19141631 20226631 21411240 22707289 24128640
55971 24128640 25692010 27417448 29328611 31453309 33824507 36481472 39470550 42845117
55963 42845117 46664717 50993997 55902073 61462286 67751880 74851820 82847689 91831566
55955 91831566 101902957 113166457 125724768 139665317 155036740 171811254 189831653
55948 189831653 208745844 227939154 246490372 263195672 276701506 285743646 289422750
55941 289422750 287408511 279991163 267974012 252468763 234676926 215718172 196528723
55934 196528723 177823323 160100354 143669324 128686903 115194725 103154860 92479530
$$ packed form
55989A0170628M00345M24895M51515M80445N12107N46933N85320O27654O74358
55980A4874200P25888P82827Q46039R16684R95993J085000J184609J296049J421351
55971B4128640J563370J725438J911163K124698K371198K656965K989078L374567
55963D2845117L819600M329280M908076N560213O289594P099940P995869Q983877
55955I1831566J0071391J1263500J2558311J3940549J5371423J6774514J8020399
55948A89831653J8914191J9193310J8551218J6705300J3505834R042140L679104
55941B89422750k014239p417348j2017151j5505249j7791837j8958754j9189449
55934A96528723j8705400j7722969j6431030j4982421j3492178j2039865j0675330
$$ plain form
55927 92479530 83053347 74749177 67439360 61002924 55329161 50318895 45884863 41951385
55919 41951385 38453107 35333496 32544010 30043594 27797500 25775574 23951224 22301391
55911 22301391 20806509 19449717 18215964 17091748 16065300 15126444 14266075 13475754
55903 13475754 12747749 12075332 11453060 10876752 10343011 9848548 9389871 8963609 8566963
55894 8566963 8197742 7853948 7533327 7233122 6950099 6680969 6423111 6175140 5936902
55885 5936902 5708985 5492141 5286916 5093438 4911389 4740086 4578481 4425108 4278298
55876 4278298 4136819 4000407 3869547 3744713 3625833 3512452 3404208 3301094 3203267 3110622
55866 3110622 3022490 2937864 2856028 2776999 2701234 2629006 2560173 2494437 2431575 2371334 2313340
$$ packed form
55927I2479530r426183q304170p309817o436436n673763n010266m434032l933478
55919D1951385l498278l119611k789486k500416k246094k021926j824350j649833
55911B2301391j494882j356792j233753j124216j026448r38856q60369p90321
55903A3475754p28005o72417o22272n76308n33741m94463m58677m26262l96646
55894H566963l69221l43794l20621l00205k83023k69130k57858k47971k38238
55885E936902k27917k16844k05225j93478j82049j71303j61605j53373j46810
55876D278298j41479j36412j30860j24834j18880j13381j08244j03114r7827r2645
55866C110622q8132q4626q1836p9029p5765p2228o8833o5736o2862o0241n7994
$$ plain form
55855 2313340 2257221 2202772 2149919 2098671 2049122 2001417 1955629 1911662 1869247 1827917 1787115
55844 1787115 1746578 1706626 1667830 1630376 1594011 1558657 1524714 1492615 1462373 1433792 1406774
55833 1406774 1381114 1356240 1331637 1307425 1284095 1261802 1240339 1219825 1200895 1183981 1168730
55822 1168730 1154309 1140034 1125551 1110755 1095873 1081450 1067948 1055338 1043267 1031482 1019991
55811 1019991 1008913 998312 988075 977781 966860 955102 942842 930442 917726 904334 890549
55800 890549 877365 865581 855101 845243 835501 825851 816569 808085 800885 795240 790801 786463 780693
55787 780693 772219 760647 746591 731217 715663 700856 687613 676513 667594 660447 654727 650295
55775 650295 646723 642968 637851 630773 621847 611593 600825 590544 581425 573376 565924 559032 553279
$$ packed form
55855B313340n6119n4449n2853n1248m9549m7705m5788m3967m2415m1330m0802
55844A787115m0537l9952l8796l7454l6365l5354l3943l2099l0242k8581k7018
55833A406774k5660k4874k4603k4212k3330k2293k1463k0514j8930j6914j5251
55822A168730j4421j4275j4483j4796j4882j4423j3502j2610j2071j1785j1491
55811A019991j1078j0601j0237j0294j0921j1758j2260j2400j2716j3392j3785
55800H90549j3184j1784j0480r858r742r650r282q484p200n645m439m338n770
55787G80693q474j1572j4056j5374j5554j4807j3243j1100q919p147n720m432
55775F50295l572l755n117p078q926j0254j0768j0281r119q049p452o892n753
$$ plain form
55762 553279 549239 547079 546648 547503 548761 549430 549097 547895 545628 541444 534739 525955 516014 505266 493517
55747 493517 480867 467914 455112 442420 429686 417011 404679 393020 382422 373099 364733 356595
55735 356595 348216 339854 332268 326136 321557 317918 314299 310246 306050 302069 298056 293606 288991 284854
55721 284854 281097 276899 272059 267572 264412 262331 260399 258252 256204 254393 252527 250393 248121 245940
55707 245940 244065 242766 242194 242179 242438 242859 243299 243317 242548 241160 239555 237790 235779 233947 233030 233199 233922
55690 233922 234748 235694 236713 237420 237661 237884 238639 239968 241537 242969 243819 243661 242589 241343 240552 240040 239203
55673 239203 237835 236208 234581 233130 232276 232486 233645 234995 235901 236439 237054 237896 238680 239050 238868 238163 236975
55656 236975 235320 233271 231096 229259 228197 227931 227938 227527 226461 225168 224296 224229 225132 227229 230557 234454
$$ packed form
55762E53279m040k160m31Q55J258O69l33j202k267m184o705q784r941j0748j1749
55747D93517j2650j2953j2802j2692j2734j2675j2332j1659j0598r323q366q138
55735C56595q379q362p586o132m579l639l619m053m196l981m013m450m615m137
55721B84854l757m198m840m487l160k081j932k147k048j811j866k134k272k181
55707B45940j875j299n72j5K59M21M40J8p69j388j605j765k011j832r17J69P23
55690B33922Q26R46J019P07K41K23P55J329J569J432Q50j58j072j246p91n12q37
55673B39203j368j627j627j451q54K10J159J350R06N38O15Q42P84L70j82p05j188
55656B36975j655k049k175j837j062k66Pm11j066j293q72o7R03K097L328L897
$$ plain form
55640 234454 237907 240794 244354 249878 257143 264680 271442 277528 283267 288363 292266 294795 295985 295757
55626 295757 294241 292073 289881 287607 284762 281193 277279 273538 270415 268299 267315 267113 267150 267061 266465 264598
55610 264598 260692 254744 247505 239664 231402 222818 214289 206126 198154 189914 181232 172443 164132 156682
55596 156682 149962 143434 136659 129732 123124 117210 112170 108204 105523 104022 103205 102485 101436 99890 98102
55581 98102 96749 96307 96396 96168 95462 95140 96056 98174 100966 104144 107419 109935 110728 109809 108199 106729 105244
55564 105244 103178 100496 97726 95280 93048 90606 87623 84194 80916 78572 77551 77561 77996 78500 79068
55549 79068 79747 80516 81443 82746 84520 86537 88406 89864 90866 91471 91734 91666 91174 90090 88422 86544
55533 86544 84996 83971 83085 81762 79891 77966 76524 75492 74261 72398 70153 68152 66757 65919 65511
$$ packed form
55640B34454L453K887L560N524P265P537O762O086N739N096L903K529J190k28
55626B95757j516k168k192k274k845l569l914l741l123k116r84k02L7q9n96j867
55610B64598l906n948p239p841q262q584q529q163p972q240q682q789q311p450
55596A56682o720o528o775o927o608n914n040l966k681j501q17p20j049j546j788
55581I8102j353m42Q9k28p06l22R16K118K792L178L275K516P93r19j610j470j485
55564A05244k066k682k770k446k232k442k983l429l278k344j021J0M35N04N68
55549G9068O79P69R27J303J774K017J869J458J002O05K63o8m92j084j668j878
55533H6544j548j025q86j323j871j925j442j032j231j863k245k001j395q38m08
$$ plain form
55518 65511 65406 65208 64328 62594 60551 58957 58222 58492 59831 61882 63723 64779 65753 67976 71764 76136
55502 76136 80214 84119 88140 91914 95153 98606 103373 109440 115731 121521 126989 132239 136594 139384
55488 139384 140994 142524 144436 145869 145374 142211 136852 130266 122985 115100 107014 99583 93217 87298
55474 87298 80975 74305 68046 62620 57868 53745 50524 48202 46308 44501 42835 41286 39599 37827
55460 37827 36398 35282 33687 31106 28236 26250 25458 25213 24907 24422 23759 22910 22160 21900 21906 21307 19584
55443 19584 17325 15682 15211 15465 15608 15191 14395 13743 13676 14228 14996 15416 15228 14714 14400 14468 14555 14253 13649
55424 13649 13106 12656 11944 10865 9881 9520 9769 10191 10501 10847 11520 12471 13069 12435 10325 7697 6031 5913
55406 5913 6572 6951 6872 6906 7493 8604 9996 11271 11836 11310 10006 8644 7609 6822 6268 6212 6772 7619
$$ packed form
55518F5511j05j98q80j734k043j594p35K70J339K051J841J056R74K223L788M372
55502G6136M078L905M021L774L239L453M767O067O291N790N468N250M355K790
55488A39384J610J530J912J433m95l163n359o586p281p885q086p431o366n919
55474H7298o323o670o259n426m752m123l221k322j894j807j666j549j687j772
55460C7827j429j116j595k581k870j986p92k45l06m85o63q49p50k60On99j723
55443A9584k259j643m71K54J43m17p96o52o7N52P68M20j88n14l14O8Q7l02o04
55424A3649n43m50p12j079r84l61K49M22L10L46O73R51N98o34k110k628j666j18
55406E913O59L79p9L4N87J111J392J275N65n26j304j362j035p87n54n6N60Q47
$$ plain form
55388 7619 8221 8222 7560 6496 5544 5115 5145 5264 5313 5478 5914 6518 7121 7677 8196 8696 9265 9950 10618 11099
55368 11099 11379 11438 11041 10063 8902 8059 7357 6186 4668 3852 4384 5518 5979 5429 4565 4081 4125 4630
55350 4630 5543 6644 7617 8341 8818 8822 8042 6617 5134 3977 3082 2427 2344 2994 3879 4249 3878 3154 2547
55331 2547 2295 2495 3117 3831 4143 3877 3362 2984 2768 2580 2589 3146 4199 5200 5802 6318 7115 7725 7171
55312 7171 5344 3572 3329 4563 5757 5662 4596 3901 4410 5693 6676 6764 6316 6156 6669 7423 7663 7117
55294 7117 6235 5674 5700 6047 6213 5850 5091 4503 4562 5066 5315 4998 4662 5044 6111 7096 7447 7382 7436 7752
55274 7752 8030 8027 7863 7801 7821 7546 6692 5545 4814 4916 5579 6280 6858 7361 7510 6785 5136 3202 1675
55255 1675 769 364 285 212 -225 -900 -1142 -634 -46 -222 -938 -1128 -310 869 1636 2061 2665 3495 4018 3782
$$ packed form
55388G619O02Jo62j064r52m29L0J19M9J65M36O04O03N56N19N00N69O85O68M81
55368A1099K80N9l97r78j161q43p02j171j518q16N32J134M61n50q64m84M4N05
55350D630R13J101R73P24M77Mp80j425j483j157q95o55q3O50Q85L70l71p24o07
55331B547k52K00O22P14L12k66n15l78k16j88RN57J053J001O02N16P97O10n54
55312G171j827j772k43J234J194r5j066o95N09J283R83Q8m48j60N13P54K40n46
55294G117q82n61K6L47J66l63p59n88N9N04K49l17l36L82J067R85L51o5N4L16
55274G752K78lj64o2K0k75q54j147p31J02O63P01N78N03J49p25j649j934j527
55255A675G69C64p9p3b25o75k42N08d6j76p16j90c10H69P67M25O04Q30N23k36
$$ plain form
55235 3782 2891 1923 1536 1968 2763 3166 2980 2797 3248 4198 4958 5099 4786 4401 4156 4039 3929 3694 3332
55216 3332 2991 2833 2932 3327 3975 4536 4502 3821 3173 3284 4052 4757 5029 5188 5561 5914 5807 5195 4405 3742
55196 3742 3341 3251 3451 3837 4389 5191 6096 6590 6297 5588 5305 5808 6623 7153 7441 7933 8708 9351 9573 9613
55176 9613 9885 10435 10932 11075 10878 10603 10508 10572 10463 9914 9159 8739 8777 8723 8092 7251 7054 7790 8819 9280
55156 9280 8832 7693 6285 4973 3910 3048 2410 2281 2856 3746 4222 4034 3658 3662 4132 4804 5327 5288 4457
55137 4457 3242 2439 2336 2449 2407 2500 2935 3135 2399 911 -573 -1677 -2355 -2252 -1042 663 1697 1719 1574
55118 1574 2094 3271 4750 6319 7562 7871 7346 7096 7975 9452 10331 10242 9750 9301 8864 8562 8924 10251
55100 10251 12226 14398 16670 19034 21144 22524 23166 23644 24500 25626 26343 26091 24966 23529 22147 20681
$$ packed form
55235C782q91r68l87M32P95M03j86j83M51R50P60J41l13l85k45j17j10k35l62
55216C332l41j58R9L95O48N61l4o81o48J11P68P05K72J59L73L53j07o12p90o63
55196C742m01r0K00L86N52Q02R05M94k93p09k83N03Q15N30K88M92P75O43K22M0
55176I613K72N50M97J43j97k75r5O4j09n49p55m20L8n4o31q41j97P36J029M61
55156I280m48j139j408j312j063q62o38j29N75Q90M76j88l76MM70O72N23l9q31
55137D457j215q03j03J13m2R3M35K00p36I11e73j104o78J03a042F63J034K2j45
55118A574N20J177J479J569J243L09n25k50Q79J477Q79q9m92m49m37l02L62J327
55100A0251J975K172K272K364K110J380O42M78Q56J126P17k52j125j437j382j466
$$ plain form
55084 20681 18866 16838 15178 14422 14578 15131 15568 15898 16503 17459 18258 18418 18104 17756 17266 16099 14244
55067 14244 12485 11490 11113 10857 10583 10420 10356 10356 10557 10950 11088 10622 9908 9577 9631 9552 9258 9359 10274 11610
55047 11610 12719 13553 14600 16134 17807 18953 19160 18576 17711 16934 16204 15352 14536 14192 14561 15475 16621
55030 16621 17764 18667 19077 18987 18733 18668 18828 19018 19107 19086 18974 18868 19044 19815 21224 22959 24581 25774 26419
55011 26419 26534 26220 25617 24839 23972 23126 22472 22167 22231 22529 22879 23184 23432 23600 23621 23429 23065 22771 22981 24010
54991 24010 25615 26946 27249 26648 25994 25877 26053 26008 25723 25526 25424 25130 24748 24887 25837 27037 27688 27715 27717
54972 27717 28086 28531 28513 27812 26543 24964 23494 22734 23073 24268 25558 26263 26122 25157 23530 21678 20314
54955 20314 19978 20575 21510 22278 22816 23361 24134 25228 26657 28442 30630 33181 35865 38463 41216 44884
$$ packed form
55084B0681j815k028j660p56J56N53M37L30O05R56P99J60l14l48m90j167j855
55067A4244j759r95l77k56k74j63o4%K01L93J38m66p14l31N4p9k94J01R15J336
55047A1610J109Q34J047J534J673J146K07n84q65p77p30q52q16l44L69R14J146
55030A6621J143R03M10r0k54o5J60J90Q9k1j12j06J76P71J409J735J622J193O45
55011B6419J15l14o03p78q67q46o54l05O4K98L50L05K48J68K1j92l64k94K10J029
54991B4010J605J331L03o01o54j17J76m5k85j97j02k94l82J39R50J200O51K7K
54972B7717L69M45j8p01j269j579j470p60L39J195J290P05j41r65j627j852j364
54955B0314l36N97R35P68N38N45P73J094J429J785K188K551K684K598K753L668
$$ plain form
54939 44884 50055 56438 63168 69818 76760 84375 92230 99378 105273 110011 113678 115869 116048 114126 110399
54924 110399 105036 97998 89640 81066 73555 67595 62701 58189 53829 49716 45880 42293 39092 36532
54910 36532 34833 34223 34848 36368 37855 38516 38423 38179 38080 38075 38445 39783 42199 45124 48239 52070 57257
54893 57257 63591 70209 76538 82626 88633 94366 99323 103014 105197 105816 104691 101389 95760 88568 81173
54878 81173 74416 68147 61961 55958 50535 45902 42190 39617 38058 36797 35204 33488 32283 31652 31039
54863 31039 30147 29323 28945 28858 28596 27947 27145 26593 26445 26451 26319 26198 26550 27442 28385 29031 29575 30158 30350 29757
54843 29757 28725 27820 26890 25369 23345 21628 20761 20606 20894 21503 22124 22301 21991 21560 21107 20334 19208
54826 19208 18144 17332 16459 15414 14719 14867 15656 16509 17138 17601 17993 18364 18705 18837 18611 18302 18398 18855 19101
$$ packed form
54939D4884N171O383O730O650O942P615P855P148N895M738L667K191J79j922l727
54924A10399n363p038q358q574p511n960m894m512m360m113l836l587l201k560
54910C6532j699o10O25J520J487O61r3k44r9nL70J338K416K925L115L831N187
54893E7257O334O618O329O088O007N733M957L691K183O19j125l302n629p192p395
54878H1173o757o269o186o003n423m633l712k573j559j261j593j716j205o31o13
54863C1039q92q24l78q7k62o49q02n52j48Oj32j21L52Q92R43O46N44N83J92n93
54843B9757j032r05r30j521k024j717q67j55K88O09O21J77l10m31m53p73j126
54826A9208j064q12q73j045o95J48P89Q53O29M63L92L71L41J32k26l09R6M57K46
$$ plain form
54807 19101 18982 19101 19852 20705 21020 21103 21767 23113 24451 25352 26132 27284 28924 30891 32980 34972 36786
54790 36786 38683 41035 43850 46756 49494 52191 55154 58699 63209 68979 75776 82747 89055 94587
54776 94587 99849 105114 109777 112691 113115 111196 107546 102624 96800 90753 85271 80626 76561 72993 70269
54761 70269 68455 66871 64728 61991 59247 56979 55402 54789 55397 56920 58494 59423 59794 60269 61457 63524
54745 63524 66263 69412 72948 77119 82212 88369 95548 103502 111722 119561 126512 132268 136501 138877
54731 138877 139378 138288 135616 130851 123620 114493 104758 95487 87023 79338 72528 66864 62466 59028
54717 59028 55887 52444 48659 44992 41839 39174 36790 34656 32862 31422 30292 29445 28794 28254 28014
54702 28014 28470 29645 30931 31635 31524 30670 29156 27367 26256 26703 28643 31167 33402 34934 35587 35328
$$ packed form
54807A9101j19J19P51Q53L15Q3O64J346J338R01P80J152J640J967K089J992J814
54790C6786J897K352K815K906K738K697K963L545M510N770O797O971O308N532
54776I4587N262N265M663K914M24j919l650m922n824o047n482m645m065l568k724
54761G0269j814j584k143k737k744k268j577o13O08J523J574R29L71M75J188K067
54745F3524K739L149L536M171N093O157P179P954Q220P839O951N756M233K376
54731A38877N01j090k672m765p231r127r735r271q464p685o810n664m398l438
54717E9028l141l443l785l667l153k665k384k134j794j440j130q47o51n40k40
54702B8014M56J175J286P04j11q54j514j789j111M47J940K524K235J532O53k59
$$ plain form
54686 35328 34438 33372 32397 31622 31264 31465 31935 32263 32650 33807 35990 38464 40165 40662 40332 39849 39630
54669 39630 39649 39707 39875 40474 41467 42101 41577 39953 38048 36577 35797 35772 36337 36814 36473 35504 34966 35491 36552
54650 36552 37329 37829 38674 40131 41845 43385 44692 45995 47557 49485 51650 53886 56343 59497 63709
54635 63709 68901 74658 80449 85778 90517 95212 100707 107185 113808 119452 123570 126111 126984 125924 122853
54620 122853 118095 112286 106144 100183 94548 89256 84537 80703 77664 74908 72051 69056 65841 62160
54606 62160 58067 54056 50464 47176 44180 41898 40525 39458 37952 36042 34310 33008 31972 31211 30948
54591 30948 31131 31426 31702 32044 32367 32513 32695 33328 34396 35428 36138 36604 36823 36607 36010 35328 34544 33352
54573 33352 31921 31062 31246 31935 32336 32426 32724 33311 33676 33481 33012 32742 32811 33083 33492 34103 34883 35566 35860
$$ packed form
54686C5328q90j066r75p75l58K01M70L28L87J157K183K474J701M97l30m83k19
54669C9630J9N8J68N99R93O34n24j624j905j471p80k5N65M77l41r69n38N25J061
54650C6552P77N00Q45J457J714J540J307J303J562J928K165K236K457L154M212
54635F3709N192N757N791N329M739M695N495O478O623N644M118K541Q73j060l071
54620A22853m758n809o142n961n635n292m719l834l039k756k857k995l215l681
54606F2160m093m011l592l288k996k282j373j067j506j910j732j302j036p61k63
54591C0948J83K95K76L42L23J46J82O33J068J032P10M66K19k16n97o82p84j192
54573C3352j431q59J84O89M01R0K98N87L65j95m69k70O9K72M09O11P80O83K94
$$ plain form
54554 35860 35837 35976 36613 37359 37341 36138 34265 32597 31513 30810 30292 30106 30485 31390 32505 33496 34243 34828
54536 34828 35353 35827 36322 37163 38705 40826 42812 44012 44511 45055 46294 48267 50588 53011 55662 58725
54520 58725 62010 64973 67205 68723 69707 70112 69839 69108 68281 67287 65689 63431 61056 58930 56676 53812
54504 53812 50602 47766 45552 43680 42107 41225 41158 41333 41051 40165 39030 38109 37833 38457 39696 40727 40908
54487 40908 40434 40070 40342 41226 42404 43515 44264 44641 44986 45510 45797 45221 43927 42907 42876 43452 43759 43455
54469 43455 42748 41716 40264 38755 38018 38457 39595 40771 41872 43001 43840 43981 43727 43851 44444 44691 44117
54452 44117 43471 43807 45055 46119 46269 45756 45010 44017 42806 42017 42348 43594 44730 44919 44072 42495 40482
54435 40482 38458 37102 36919 37701 38703 39381 39833 40467 41359 42099 42286 42040 41879 42092 42436 42513 42270 41955
$$ packed form
54554C5860k3J39O37P46j8j203j873j668j084p03n18j86L79R05J115R91P47N85
54536C4828N25M74M95Q41J542K121J986J200M99N44J239J973K321K423K651L063
54520E8725L285K963K232J518R84M05k73p31q27r94j598k258k375k126k254k864
54504E3812l210k836k214j872j573q82o7J75k82q86j135r21k76O24J239J031J81
54487D0908m74l64K72Q84J178J111P49L77L45N24K87n76j294j020l1N76L07l04
54469D3455p07j032j452j509p37M39J138J176J101J129Q39J41k54J24N93K47n74
54452D4117o46L36J248J064J50n13p46r93j211p89L31J246J136J89q47j577k013
54435D0482k024j356j83P82J002O78M52O34Q92P40J87k46j61K13L44P7k43l15
$$ plain form
54417 41955 41714 41542 41568 42071 43103 44386 45710 47177 48832 50324 51252 51765 52436 53553 54830 55947
54401 55947 56996 58123 58987 58984 58083 57026 56528 56484 56193 55274 54020 52894 52052 51475 51214 51149 50752 49543
54383 49543 47806 46418 45870 45749 45372 44615 43916 43711 44111 44937 45767 46112 45864 45516 45643 46203 46641 46640 46426
54364 46426 46322 46349 46421 46616 47047 47647 48337 49297 50859 53105 55626 57644 58447 57932 56826 56227 56731 57985
54346 57985 59101 59422 58872 57827 56771 55973 55230 54055 52274 50422 49336 49295 49687 49581 48581 47080
54330 47080 45726 44724 43711 42323 40764 39651 39280 39254 38951 38216 37420 36966 36918 37123 37444 37800 38070 38082
54312 38082 37679 36759 35335 33647 32179 31411 31463 32035 32704 33248 33620 33733 33512 33123 32868 32751 32412 31696
54294 31696 31051 31035 31644 32470 33374 34532 35878 37037 37877 38586 39062 38783 37617 36295 35649 35745 36133 36579
$$ packed form
54417D1955k41j72K6N03J032J283J324J467J655J492R28N13O71J117J277J117
54401E5947J049J127Q64lr01j057m98m4k91r19j254j126q42n77k61o5l97j209
54383D9543j737j388n48j21l77p57o99k05M00Q26Q30L45k48l48J27N60M38jk14
54364D6426j04K7P2J95M31O00O90R60J562K246K521K018Q03n15j106n99N04J254
54346E7985J116L21n50j045j056p98p43j175j781j852j086m1L92j06j000j501
54330D7080j354j002j013j388j559j113l71k6l03p35p96m54m8K05L21L56K70J2
54312C8082m03r20j424j688j468p68N2N72O69N44L72J13k21l89k55j17l39p16
54294C1696o45j6O09Q26R04J158J346J159Q40P09M76k79j166j322o46R6L88M46
$$ plain form
54276 36579 37073 37473 37737 38234 39202 40072 40023 39193 38651 39099 40205 41309 42123 42503 42223 41391 40623 40399 40548
54257 40548 40711 40888 41141 41174 40692 39982 39666 40009 40763 41470 41588 40674 38907 37226 36428 36317 36196 35981 36165
54238 36165 36813 37331 37378 37332 37570 37842 37679 37014 36046 34893 33736 33037 33154 33891 34726 35349 35678 35543 34797
54219 34797 33742 33082 33308 34251 35298 35928 36007 35733 35399 35205 35224 35445 35793 36167 36561 37094 37737 38113 37767
54200 37767 36664 35207 33801 32701 32191 32404 32831 32515 31117 29427 28453 28320 28467 28600 28917 29578 30536
54183 30536 31782 33225 34367 34677 34383 34353 35003 35823 36204 36177 36029 35639 34722 33522 32682 32382 32026 30945
54165 30945 29245 27755 27177 27394 27720 27743 27673 27782 27896 27808 27927 28862 30433 31707 32241 32612 33393 34174 34182
54146 34182 33505 33026 33267 33874 34265 34300 34204 34181 34296 34522 34777 34979 35052 34839 34139 33005 31828 30931 30201 29392
$$ packed form
54276C6579M94M00K64M97R68Q70m9q30n42M48J106J104Q14L80k80q32p68k24J49
54257D0548J63J77K53L3m82p10l16L43P54P07J18r14j767j681p98j11j21k15J84
54238C6165O48N18M7m6K38K72j63o65r68j153j157o99J17P37Q35O23L29j35p46
54219C4797j055o60K26R43J047O30P9k74l34j94J9K21L48L74L94N33O43L76l46
54200C7767j103j457j406j100n10K13M27l16j398j690r74j33J47J33L17O61R58
54183C0536J246J443J142L10k94l0O50Q20L81k7j48l90r17j200q40l00l56j081
54165C0945j700j490n78K17L26K3p0J09J14q8J19R35J571J274N34L71P81P81Q
54146C4182o77m79K41O07L91L5r6k3J15K26K55K02P3k13p00j134j177q97p30q09
$$ plain form
54126 29392 28607 28153 28011 27821 27429 27131 27310 28056 29191 30425 31471 32175 32572 32717 32572 32186 31833 31720
54108 31720 31763 31943 32659 34200 35986 36930 36672 35961 35655 35808 35980 36044 36298 36992 38008 38926 39310 39114 38866
54089 38866 39212 40208 41344 42243 42946 43456 43575 43439 43659 44503 45385 45671 45625 45950 46692 47298 47633 48191 49171
54070 49171 50003 50051 49372 48546 48135 48505 49754 51431 52640 52843 52475 52452 53194 54385 55623 56838 57969
54053 57969 58609 58357 57528 57196 58395 61266 65059 68897 72481 76131 80256 84846 89433 93517 97073
54038 97073 100615 104706 109334 113883 117778 121094 124396 128008 131549 134283 135825 136401 136452 136171 135572 134854
54022 134854 134366 134082 133387 131641 128904 125902 123329 121352 119640 117584 114552 110348 105555 101182 97730
54007 97730 94874 92129 89569 87550 85996 84384 82449 80556 79174 78226 77169 75682 74038 72740 71908
$$ packed form
54126B9392p85m54j42j90l92k98J79P46J135J234J046P04L97J45j45l86l53j13
54108C1720M3J80P16J541J786R44k58p11l06J53J72O4K54O94J016R18L84j96k48
54089C8866L46R96J136Q99P03N10J19j36K20Q44Q82K86m6L25P42O06L35N58R80
54070D9171Q32M8o79q26m11L70J249J677J209K03l68k3P42J191J238J215J131
54053E7969O40k52q29l32J199K871L793L838L584L650M125M590M587M084L556
54038I7073L542M091M628M549L895L316L302L612L541K734J542N76N1k81n99p18
54022A34854m88k84o95j746k737l002k573j977j712k056l032m204m793m373l452
54007I7730k856k745k560k019j554j612j935j893j382r48j057j487j644j298q32
$$ plain form
53992 71908 71195 70304 69313 68444 67671 66777 65670 64436 63212 62230 61877 62320 63108 63494 63179 62473 61727 61054
53974 61054 60672 61015 62179 63564 64400 64480 64165 63854 63659 63394 62773 61810 61122 61510 63032 64841 66143 66956
53956 66956 67671 68340 68857 69476 70560 72007 73439 74851 76558 78604 80765 83075 85828 88959 91921
53941 91921 94397 96804 99889 104007 108824 113591 117726 121360 125280 130150 135869 141909 148025 154196
53927 154196 160032 164842 168401 171227 173971 176866 179866 182920 185994 189168 192832 197451 202940 208557
53913 208557 213573 217819 221530 224879 227744 229651 229900 228078 224588 220415 216280 212256 208212 204207
53899 204207 200336 196572 192924 189461 185943 181777 176534 170341 163656 156919 150568 144988 140249 136097
53885 136097 132394 129246 126593 123999 121071 117770 114172 110261 106235 102552 99412 96558 93916 92007
$$ packed form
53992G1908p13q91r91q69p73q94j107j234j224r82l53M43P88L86l15p06p46o73
53974F1054l82L43J164J385Q36Q0l15l11j95k65o21r63o88L88J522J809J302Q13
53956F6956P15O69N17O19J084J447J432J412J707K046K161K310K753L131K962
53941I1921K476K407L085M118M817M767M135L634L920M870N719O040O116O171
53927A54196N836M810L559K826K744K895L000L054L074L174L664M619N489N617
53913B08557N016M246L711L349K865J907K49j822l490m173m135m024m044m005
53899B04207l871l764l648l463l518m166n243o193o685o737o351n580m739m152
53885A36097l703l148k653k594k928l301l598l911m026l683l140k854k642j909
$$ plain form
53871 92007 91210 90980 90403 89319 88326 87746 87234 86409 85329 84164 82831 81235 79548 78031 76734 75564
53855 75564 74525 73777 73494 73708 74227 74701 74891 74846 74743 74612 74320 73822 73254 72758 72345 71994 71850 72189 73104
53836 73104 74165 74555 73785 72187 70475 68895 67214 65561 64722 65257 66715 68132 69032 69565 69966 70383
53820 70383 71051 72091 73221 74170 75316 77326 80100 82691 84528 86187 88602 91937 95698 99626 103884
53805 103884 108442 112813 116588 119918 123307 127019 130801 134013 135996 136528 136108 135729 136155 137422 139132
53790 139132 141018 142970 144565 145036 143995 141909 139586 137303 134708 131382 127210 122381 117458 113332
53776 113332 110519 108434 105874 102398 98767 95786 93313 90744 87961 85247 82670 80182 78076 76688
53762 76688 75742 74599 73173 72026 71440 70953 70022 68709 67426 66297 65096 63738 62608 62380 63404 65224
$$ packed form
53871I2007p97k30n77j084r93n80n12q25j080j165j333j596j687j517j297j170
53855G5564j039p48k83K14N19M74J90m5j03j31k92m98n68m96m13l51j44L39R15
53836G3104J061L90p70j598j712j580j681j653q39N35J458J417R00N33M01M17
53820G0383O68J040J130R49J146K010K774K591J837J659K415L335L761L928M258
53805A03884M558M371L775L330L389L712L782L212J983N32m20l79M26J267J710
53790A39132J886J952J595M71j041k086k323k283k595l326m172m829m923m126
53776A13332k813k085k560l476l631k981k473k569k783k714k577k488k106j388
53762G6688r46j143j426j147n86m87r31j313j283j129j201j358j130k28J024J820
$$ plain form
53746 65224 66828 67620 67947 68379 68711 68243 67009 65979 65787 65873 65334 64216 63381 63344 63738 63900 63553 62865
53728 62865 62213 61983 62303 62831 63062 62879 62663 62729 62947 63110 63415 64221 65352 66047 65832 65147 64850 65294 66227
53709 66227 67485 69306 71802 74551 77000 79010 80737 82213 83412 84547 85892 87373 88691 89832
53695 89832 91043 92293 93175 93537 93875 94868 96719 99108 101547 103590 104874 105286 105178 105244 106130 108006 110343
53678 110343 112090 112340 111037 109056 107485 106874 107080 107602 107914 107729 107175 106736 106845 107521 108449 109311 109924
53661 109924 110125 109761 108881 107849 107193 107239 107919 108823 109458 109504 108968 108164 107536 107349 107537 107884 108332 109007 109873
53642 109873 110537 110550 109874 108954 108350 108343 108850 109652 110743 112378 114660 117084 118752 119180 118714 118044 117615 117647
53624 117647 118405 119942 121748 123074 123707 124116 124802 125819 126985 128275 129826 131736 133953 136303 138596
$$ packed form
53746F5224J604P92L27M32L32m68j234j030j92Q6n39j118q35l7L94J62l47o88
53728F2865o52k30L20N28K31j83k16O6K18J63L05Q06J131O95k15o85k97M44R33
53709F6227J258J821K496K749K449K010J727J476J199J135J345J481J318J141
53695H9832J211J250Q82L62L38R93J851K389K439K043J284M12j08O6Q86J876K337
53678A10343J747K50j303j981j571o11K06N22L12j85n54m39J09O76R28Q62O13
53661A09924K01l64q80j032o56M6O80R04O35M6n36q04o28j87J88L47M48O75Q66
53642A09873O64J3o76r20o04pN07Q02J091J635K282K424J668M28m66o70m29L2
53624A17647P58J537J806J326O33M09O86J017J166J290J551J910K217K350K293
$$ plain form
53609 138596 140754 142776 144515 145739 146600 147815 150013 152959 155827 158174 160277 162491 164696 166556
53595 166556 168052 169567 171486 173734 175605 176256 175581 174425 173651 173233 172653 171874 171300 170965 170566 170257 170586
53578 170586 171464 172062 172045 172103 172736 173249 172632 170879 168818 167057 165777 165138 165117 165184 164839 164295 164003 163718 162810
53559 162810 161413 160461 160446 160839 160919 160584 160099 159644 159396 159641 160432 161392 162113 162579 163056 163800 164953 166480
53541 166480 168110 169556 170920 172634 174956 177777 180926 184311 187664 190598 193186 196165 200234 205311
53527 205311 210726 215981 221137 226577 232612 239184 245841 252084 257886 263706 269902 276351 282867 289796
53513 289796 297800 307066 316979 326750 336309 346513 358424 372332 387494 402899 418251 434015
53501 434015 450513 467265 483425 498627 513171 527521 541947 556672 571959 587799 603593
$$ packed form
53609A38596K158K022J739J224Q61J215K198K946K868K347K103K214K205J860
53595A66556J496J515J919K248J871O51o75j156p74m18n80p79n74l35l99l09L29
53578A70586Q78N98j7N8O33N13o17j753k061j761j280o39k1O7l45n44k92k85r08
53559A62810j397r52j5L93Q0l35m85m55k48K45P91R60P21M66M77P44J153J527
53541A66480J630J446J364J714K322K821L149L385L353K934K588K979M069N077
53527B05311N415N255N156N440O035O572O657O243N802N820O196O449O516O929
53513B89796Q004R266R913R771R559J0204J1911J3908J5162J5405J5352J5764
53501D34015J6498J6752J6160J5202J4544J4350J4426J4725J5287J5840J5794
$$ plain form
53490 603593 618472 632128 645257 658980 673691 688602 702605 715507 728202 741614 755728
53479 755728 769791 783243 796200 809104 822140 835082 847576 859485 870891 881742 891600 899946
53467 899946 906723 912324 916910 920015 921127 920521 919134 917546 915331 911569 905788 898304 889788 880744
53453 880744 871384 861798 852136 842614 833297 823899 813867 802819 790912 778676 766493 754321 742013
53440 742013 729736 717916 706750 695988 685336 674986 665546 657444 650552 644471 639073 634571 631131
53427 631131 628653 627033 626424 626976 628434 630282 632386 635202 639220 644343 650025 655832 661677 667715 674359
53412 674359 682330 692253 704106 717316 731486 746642 762672 778947 794899 810720 827145 844745
53400 844745 863797 884638 907570 932353 958276 984956 1012793 1042407 1073876 1106692 1140252
$$ packed form
53490F03593J4879J3656J3129J3723J4711J4911J4003J2902J2695J3412J4114
53479G55728J4063J3452J2957J2904J3036J2942J2494J1909J1406J0851R858Q346
53467H99946O777N601M586L105J112o06j387j588k215l762n781p484q516r044
53453H80744r360r586r662r522r317r398j0032j1048j1907j2236j2183j2172j2308
53440G42013j2277j1820j1166j0762j0652j0350r440q102o892o081n398m502l440
53427F31131k478j620o09N52J458J848K104K816M018N123N682N807N845O038O644
53412F74359P971R923J1853J3210J4170J5156J6030J6275J5952J5821J6425J7600
53400H44745J9052K0841K2932K4783K5923K6680K7837K9614L1469L2816L3560
$$ plain form
53389 1140252 1174205 1208478 1243256 1278824 1315185 1351834 1388129 1423854 1459291 1494679 1529717
53378 1529717 1563649 1595780 1625896 1654235 1681040 1706130 1728907 1748866 1766023 1780801 1793522
53367 1793522 1804137 1812401 1818095 1820986 1820737 1817069 1809961 1799510 1785565 1767703 1745713 1719962 1691136
53354 1691136 1659809 1626521 1592179 1557878 1524102 1490428 1456403 1422553 1390105 1359688 1330737
53343 1330737 1302376 1274538 1247833 1222501 1197937 1173302 1148219 1122731 1096939 1071106 1045916
53332 1045916 1022080 999575 977699 956159 935754 917577 901742 887385 873862 861433 850560
53321 850560 840993 831886 822592 812988 803150 793044 782585 771814 760941 750293 740184 730803 722260
53308 722260 714730 708322 702806 697738 693091 689513 687779 688114 690196 693496 697350 701126 704834 709377
$$ packed form
53389A140252L3953L4273L4778L5568L6361L6649L6295L5725L5437L5388L5038
53378A529717L3932L2131L0116K8339K6805K5090K2777J9959J7157J4778J2721
53367A793522J0615Q264N694K891k49l668p108j0451j3945j7862k1990k5751k8826
53354A691136l1327l3288l4342l4301l3776l3674l4025l3850l2448l0417k8951
53343A330737k8361k7838k6705k5332k4564k4635k5083k5488k5792k5833k5190
53332A045916k3836k2505k1876k1540k0405j8177j5835j4357j3523j2429j0873
53321H50560r567r107r294r604r838j0106j0459j0771j0873j0648j0109r381q543
53308G22260p530o408n516n068m647l578j734L35K082L300L854L776L708M543
$$ plain form
53294 709377 715636 723398 731769 740601 750805 763024 776652 790544 804288 818345 833269 849185
53282 849185 865763 882298 897939 912212 925281 937493 948901 959439 969263 978441 986471 992553
53270 992553 996345 998153 998480 997763 996382 994313 990729 984510 975423 964448 952760 940765 928264 915043
53256 915043 900964 885838 869667 852814 835566 817758 799267 780635 762650 745428 728454
53245 728454 711548 695138 679440 663940 648125 632290 617208 603211 590004 577131 564183
53234 564183 550718 536574 522343 509051 497158 486091 474945 463399 451867 441042 431512 423591
53222 423591 417165 411677 406438 401008 395252 389138 382673 375951 369062 361814 353717 344437 334338 324358
53208 324358 315147 306374 297139 287104 276928 267402 258542 249908 241643 234567 229184 224983 220906 216173
$$ packed form
53294G09377O259P762Q371Q832J0204J2219J3628J3892J3744J4057J4924J5916
53282H49185J6578J6535J5641J4273J3069J2212J1408J0538R824R178Q030O082
53270I92553L792J808L27p17j381k069l584o219r087j0975j1688j1995j2501j3221
53256I15043j4079j5126j6171j6853j7248j7808j8491j8632j7985j7222j6974
53245G28454j6906j6410j5698j5500j5815j5835j5082j3997j3207j2873j2948
53234E64183j3465j4144j4231j3292j1893j1067j1146j1546j1532j0825r530p921
53222D23591o426n488n239n430n756o114o465o722o889p248q097r280j0099r980
53208C24358r211q773r235j0035j0176r526q860q634q265p076n383m201m077m733
$$ plain form
53194 216173 210532 204148 197558 191450 186190 181659 177677 174214 171017 167466 163330 159303 156209 153828
53180 153828 151110 147565 143835 140816 138753 137371 136323 135159 133319 130730 128239 126934 127045 127838 128569
53165 128569 129165 129889 130703 131327 131753 132322 133238 134245 134929 135093 134694 133623 131973 130409 129794 130257 130965
53148 130965 131069 130531 129824 129215 128829 129097 130494 132791 135070 136597 137320 137490 137288 137022 137257 138353 139979
53131 139979 141347 141816 141236 139890 138317 137043 136309 136028 135978 135920 135537 134560 133053 131428 130098 129162 128382
53114 128382 127276 125388 122773 120202 118494 117620 116898 116046 115438 115138 114414 112741 110698 109177 108060 106498
53098 106498 104351 102493 101510 100885 99851 98503 97518 97071 96617 95703 94592 93901 93886 94238 94540 94770 95235
53081 95235 96040 96787 96953 96580 96351 96837 97751 98098 97141 95119 92999 91557 90771 90086 89101 87861 86557
$$ packed form
53194B16173n641o384o590o108n260m531l982l463l197l551m136m027l094k381
53180A53828k718l545l730l019k063j382j048j164j840k589k491j305J11P93P31
53165A28569N96P24Q14O24M26N69R16J007O84J64l99j071j650j564o15M63P08
53148A30965J04n38p07o09l86K68J397K297K279J527P23J70k02k66K35J096J626
53131A39979J368M69n80j346j573j274p34k81n0n8l83r77j507j625j330r36p80
53114A28382j106j888k615k571j708q74p22q52o08l00p24j673k043j521j117j562
53098A06498k147j858r83o25j034j348r85m47m54r14j111o91j5L52L02K30M65
53081I5235Q05P47J66l73k29M86R14L47r57k022k120j442p86o85r85j240j304
$$ plain form
53064 86557 85191 83697 82296 81530 81831 83090 84689 86017 86928 87657 88272 88374 87510 85847 84232 83527
53048 83527 83953 85086 86311 87264 87985 88786 89885 91107 92057 92590 92931 93265 93439 93278 93041 93303 94373
53031 94373 95956 97410 98237 98306 97728 96641 95188 93660 92473 91881 91769 91910 92366 93423 95121 97135
53015 97135 99135 101020 102683 103864 104431 104646 104913 105394 106044 106899 108064 109508 111051 112633 114425 116595
52999 116595 118999 121185 122852 124272 126042 128167 129707 129702 128388 127007 126408 126400 126532 126804 127237 127331 126625
52982 126625 125440 124469 123816 123025 121958 121032 120518 120166 119671 119161 118957 119124 119414 119572 119599 119705 119982 120123
52964 120123 119698 118783 118010 117810 117954 118150 118679 119945 121667 123126 124041 124616 124870 124604 124043 123758 123833 123685
52946 123685 122953 122010 121368 121132 121219 121540 121751 121436 120889 121044 122140 123057 122612 121001 119312 118047 116966
$$ packed form
53064H6557j366j494j401p66L01J259J599J328R11P29O15J02q64j663j615p05
53048H3527M26J133J225R53P21Q01J099J222R50N33L41L34J74j61k37K62J070
53031I4373J583J454Q27O9n78j087j453j528j187n92j12J41M56J057J698K014
53015I7135K000J885J663J181N67K15K67M81O50Q55J165J444J543J582J792K170
52999A16595K404K186J667J420J770K125J540nj314j381n99qJ32K72M33R4p06
52982A26625j185r71o53p91j067r26n14l52m95n10k04J67K90J58K7J06K77J41
52964A20123m25r15p73k00J44J96N29J266J722J459R15N75K54k66n61k85P5j48
52946A23685p32r43o42k36Q7L21K11l15n47J55J096R17m45j611j689j265j081
$$ plain form
52929 116966 116055 115644 115551 115051 113957 113020 112899 113340 113756 114052 114413 114682 114549 114134 113831 113670 113365 113022 113247
52910 113247 114333 115731 116616 116709 116300 115628 114620 113174 111381 109454 107694 106516 106150 106178 105772 104673
52894 104673 103686 103783 104853 105770 105685 104845 104097 103967 104401 105046 105454 105234 104317 103038 101772 100625 99683 99332
52876 99332 99948 101309 102698 103754 104902 106716 109076 111254 112757 113758 114641 115372 115532 114772 113042 110459
52860 110459 107256 103881 100877 98565 96956 96097 96184 97224 98759 100177 101196 101887 102313 102375 101957 101043
52844 101043 99758 98473 97711 97687 98000 98043 97595 96745 95403 93393 91015 88988 87634 86559 85359 84276
52828 84276 83778 83791 83679 82876 81327 79481 78023 77341 77010 76081 74209 72217 71110 70775 70299 69440 69062
52811 69062 69858 71274 72189 72270 72139 72377 72948 73557 74053 74282 73979 73162 72407 72380 73191 74495 76064 77874
$$ packed form
52929A16966r11m11r3n00j094r37j21M41M16K96L61K69j33m15l03j61l05l43K25
52910A13247J086J398Q85R3m09o72j008j446j793j927j760j178l66K8m06j099
52894A04673r87R7J070R17q5q40p48j30M34O45M08k20r17j279j266j147r42l51
52876I9332O16J361J389J056J148J814K360K178J503J001Q83P31J60p60j730k583
52860A10459l203l375l004k312j609q59Q7J040J535J418J019O91M26O2m18r14
52844A01043j285j285p62k4L13M3m48q50j342k010k378k027j354j075j200j083
52828H4276m98J3j12q03j549j846j458o82l31r29j872j992j107l35m76q59l78
52811F9062P96J416R15Q1j31K38N71O09M96K29l03q17p55k7Q11J304J569J810
$$ plain form
52793 77874 79647 80785 80977 80540 79959 79395 78896 78754 79207 79957 80442 80537 80616 80944 81432 81968 82597 83227 83572
52774 83572 83533 83331 83129 82825 82369 82011 82040 82528 83425 84647 85930 86941 87722 88676 89903 90884 91105 90695
52756 90695 90128 89578 88988 88540 88589 89184 90025 90854 91614 92245 92648 92811 92717 92218 91252 90158 89472 89451 89981 90886
52736 90886 92077 93479 95089 97009 99159 101044 102173 102710 103336 104426 105604 106175 105721 104276 102232
52721 102232 100215 98767 97978 97565 97355 97514 98194 99186 100103 100795 101485 102536 104087 105902 107592 109042
52705 109042 110465 111952 113153 113663 113603 113484 113600 113827 113974 114008 113895 113565 113078 112597 112237 112173 112790 114263
52687 114263 116045 117246 117644 117867 118441 119169 119674 120054 120539 120923 120802 120246 119837 120156 121451 123552 125783
52670 125783 127196 127324 126638 125923 125333 124418 122956 121246 119543 117677 115432 112995 110776 108996 107638
$$ packed form
52793G7874J773J138J92m37n81n64m99j42M53P50M85R5P9L28M88N36O29O30L45
52774H3572l9k02k02l04m56l58K9M88Q97J222J283J011P81R54J227R81K21m10
52756I0695n67n50n90m48M9N95Q41Q29P60O31M03J63r4m99r66j094o86k1N30R05
52736I0886J191J402J610J920K150J885J129N37O26J090J178N71m54j445k044
52721A02232k017j448p89m13k10J59O80R92R17O92O90J051J551J815J690J450
52705A09042J423J487J201N10o0j19J16K27J47L4j13l30m87m81l60o4O17J473
52687A14263J782J201L98K23N74P28N05L80M85L84j21n56m09L19J295K101K231
52670A25783J413J28o86p15n90r15j462j710j703j866k245k437k219j780j358
$$ plain form
52655 107638 106650 105986 105420 104486 102775 100393 98052 96510 95859 95608 95530 96045 97417 98946 99524 98952 98179
52638 98179 98156 98893 99779 100355 100532 100406 100183 100045 99875 99346 98483 97844 97884 98368 98718 98716 98524 98203 97627 96802
52618 96802 95963 95410 95533 96764 99013 101228 102148 101629 100798 100681 101141 101395 101090 100442 99633 98611 97489
52601 97489 96746 96926 98246 100388 102567 103995 104486 104547 104793 105467 106605 108224 110025 111313 111799 112267 113836
52584 113836 116526 119106 120441 120533 120183 120164 120826 122028 123108 123301 122517 121454 120746 120222 119180 117145 114257
52567 114257 111207 108937 107994 107938 107686 106632 105083 103451 101576 99212 96675 94492 92746 91255 90011
52552 90011 88922 87507 85550 83801 83252 83822 84495 84732 84933 85429 85850 85846 85733 85926 86214 86075 85445 84723
52534 84723 84205 83833 83453 83114 83164 84047 85801 87770 89080 89419 89051 88139 86586 84621 82968 82068 81575
$$ packed form
52655A07638r88o64n66r34j711k382k341j542o51k51p8N15J372J529N78n72p73
52638I8179k3P37Q86N76J77j26k23j38j70n29q63o39M0M84L50kj92l21n76q25
52618I6802q39n53J23J231K249K215R20n19q31j17M60K54l05o48q09j022j122
52601I7489p43J80J320K142K179J428M91O1K46O74J138J619J801J288M86M68J569
52584A13836K690K580J335R2l50j9O62J202J080J93p84j063p08n24j042k035k888
52567A14257l050k270r43n6k52j054j549j632j875k364k537k183j746j491j244
52552I0011j089j415j957j749n49N70O73K37K01M96M21mj13J93K88j39o30p22
52534H4723n18l72l80l39N0Q83J754J969J310L39l68r12j553j965j653r00m93
$$ plain form
52517 81575 80916 80007 79074 78146 77125 76089 75159 74255 73323 72657 72638 73284 74262 75178 75668 75521 74984 74660 74757
52498 74757 74773 74315 73884 74274 75342 76042 75726 74905 74531 74944 75651 75894 75306 74274 73747 74446 76096 77637
52480 77637 78302 78364 78706 79801 81226 82174 82340 82163 82130 82081 81499 80413 79523 79266 79230 78785 77924 77075 76443
52461 76443 75986 75810 76060 76573 77078 77612 78344 79152 79810 80402 81096 81752 82325 83359 85287 87421 88507 88326
52443 88326 87840 87648 87300 86440 85614 85373 85395 85223 85182 85731 86446 86517 85928 85341 85047 84843 84791 85231 86013 86446
52423 86446 86217 85775 85685 86087 86925 88169 89579 90658 91128 91214 91320 91679 92329 93132 93689 93565 92750 91695
52405 91695 90862 90453 90540 91094 91849 92496 93113 94039 95222 96066 96101 95445 94499 93553 92881 92803 93271 93734 93759 93552
52385 93552 93555 93788 93982 94184 94801 96147 98262 101051 104168 106858 108424 109036 109712 111325 113772 116236 118023
$$ packed form
52517H1575o59r09r33r28j021j036r30r04r32o66j9O46R78R16M90j47n37l24R7
52498G4757J6m58m31L90J068P00l16q21l74M13P07K43n88j032n27O99J650J541
52480G7637O65O2L42J095J425R48J66j77l3m9n82j086q90k57l6m45q61q49o32
52461G6443m57j76K50N13N05N34P32Q08O58N92O94O56N73J034J928K134J086j81
52443H8326m86j92l48q60q26k41K2j72m1N49P15P1n89n87k94k04n2M40P82M33
52423H6446k29m42r0M02Q38J244J410J079M70Q6J06L59O50Q03N57j24q15j055
52405I1695q33m09Q7N54P55O47O17R26J183Q44L5o56r46r46o72p8M68M63K5k07
52385I3552LK33J94K02O17J346K115K789L117K690J566O12O76J613K447K464J787
$$ plain form
52368 118023 119030 119628 120266 121149 122134 122955 123528 124003 124583 125453 126798 128679 130832 132812 134440 135928
52352 135928 137445 138768 139546 139872 140325 141370 142861 144306 145601 147296 149988 153588 157414 160967 164288
52337 164288 167512 170520 173340 176539 180719 185771 191134 196733 203092 210449 218303 226112 233986 242368
52323 242368 251439 261245 272054 284073 296951 310076 323370 337380 352556 368741 385387 401932
52311 401932 417935 433217 448008 462714 477417 491760 505369 518138 530037 540912 550658 559416
52299 559416 567464 575021 582209 588966 594934 599581 602620 604125 604193 602706 599645 595472 591017 586945 583398
52284 583398 580026 576297 571962 567338 563037 559403 556384 553951 552315 551619 551831 553178 556251 561252 567464
52269 567464 573924 580529 588042 597113 607794 619794 632599 645313 657039 667735 678308 689618
$$ packed form
52368A18023J007N98O38Q83R85Q21N73M75N80Q70J345J881K153J980J628J488
52352A35928J517J323P78L26M53J045J491J445J295J695K692L600L826L553L321
52337A64288L224L008K820L199M180N052N363N599O359P357P854P809P874Q382
52323B42368R071R806J0809J2019J2878J3125J3294J4010J5176J6185J6646J6545
52311D01932J6003J5282J4791J4706J4703J4343J3609J2769J1899J0875R746Q758
52299E59416Q048P557P188O757N968M647L039J505O8j487l061m173m455m072l547
52284E83398l372l729m335m624m301l634l019k433j636o96K12J347L073N001O212
52269E67464O460O605P513R071J0681J2000J2805J2714J1726J0696J0573J1310
$$ plain form
52257 689618 701678 713881 725538 735956 744572 751489 757549 763480 769185 774175 778287 781488 783244
52244 783244 782836 780300 776540 772409 768076 763311 757927 751783 744754 736970 728860 720805 712979 705586
52230 705586 698873 692774 686859 680936 675431 670916 667433 664593 662123 660017 658217 656563 655038 653785
52216 653785 652804 651919 651164 650961 651751 653555 655997 658655 661251 663629 665808 668101 670961 674558 678533
52201 678533 682247 685248 687427 688811 689443 689528 689525 689917 690897 692309 693757 694686 694646 693719 692519 691479 690248
52184 690248 688192 685402 682660 680313 677755 674316 670181 665971 661810 657482 653293 650070 648144 646873
52170 646873 645414 643588 641678 639732 637456 634783 632191 630301 629177 628145 626367 623658 620641 618065
52156 618065 616097 614394 612601 610551 608186 605660 603456 601959 600907 599637 597924 596188 594758 593436
$$ packed form
52257F89618J2060J2203J1657J0418Q616O917O060N931N705M990M112L201J756
52244G83244m08k536l760m131m333m765n384o144p029p784q110q055p826p393
52230G05586o713o099n915n923n505m515l483k840k470k106j800j654j525j253
52216F53785r81q85p55k03P90J804K442K658K596K378K179K293K860L597L975
52201F78533L714L001K179J384O32Q5lL92R80J412J448R29m0r27j200j040j231
52184F90248k056k790k742k347k558l439m135m210m161m328m189l223j926j271
52170F46873j459j826j910j946k276k673k592j890j124j032j778k709l017k576
52156F18065j968j703j793k050k365k526k204j497j052j270j713j736j430j322
$$ plain form
52142 593436 591996 590692 589926 589746 590012 590757 591990 593391 594589 595595 596645 597898 599698 602839 607942
52127 607942 614639 621990 629731 638528 648865 660314 672192 684413 697344 711200 726036 741971
52115 741971 758917 776262 793290 809844 826156 842092 857041 870642 883237 895398 907263
52104 907263 918445 928385 936638 943068 948016 952119 955739 958569 959922 959302 956609 951981 945804 938825
52090 938825 931843 925095 918089 910223 901469 892397 883766 876225 870130 865219 860623 855643 850581 846518
52076 846518 844230 843702 844762 847645 852562 859082 866414 874108 882076 890168 898243 906644 915978 926241
52062 926241 936595 946233 955135 963779 972425 980980 989245 996881 1003226 1007535 1009586 1009886 1009218 1007875
52048 1007875 1005314 1000580 993279 984080 974047 963476 951778 938642 924847 911503 898728 885616
$$ packed form
52142E93436j440j304p66j80K66P45J233J401J198J006J050J253J800L141N103
52127F07942O697P351P741Q797J0337J1449J1878J2221J2931J3856J4836J5935
52115G41971J6946J7345J7028J6554J6312J5936J4949J3601J2595J2161J1865
52104I07263J1182R940Q253O430M948M103L620K830J353o20k693m628o177o979
52090I38825o982o748p006p866q754r072q631p541o095m911m596m980n062m063
52076H46518k288n28J060K883M917O520P332P694P968Q092Q075Q401R334J0263
52062I26241J0354R638Q902Q644Q646Q555Q265P636O345M309K051L00o68j343
52048A007875k561m734p301r199j0033j0571j1698j3136j3795j3344j2775j3112
$$ plain form
52036 885616 871413 856212 840439 824207 807537 790895 775071 760453 746666 733026 719261
52025 719261 705717 692903 680920 669412 658058 646987 636611 627089 618047 608811 598880 588224
52013 588224 577166 565983 554580 542618 529971 516931 503910 491036 478089 464749 450850
52002 450850 436610 422671 409625 397284 384654 371015 356851 343316 330892 319026 307064
51991 307064 294959 282863 270654 258358 246679 236597 228451 221790 215989 210651 205515 200453 195662
51978 195662 191508 188038 184901 181793 178669 175385 171535 166939 162042 157459 153281 149169 145056 141354
51964 141354 138413 136151 134291 132683 131193 129591 127806 126148 125030 124568 124631 125103 125782 126128 125497 123763
51948 123763 121489 119391 117818 116801 116291 116103 115859 115280 114523 114012 113900 113851 113399 112410 111189 110176 109596
$$ packed form
52036H85616j4203j5201j5773j6232j6670j6642j5824j4618j3787j3640j3765
52025G19261j3544j2814j1983j1508j1354j1071j0376r522r042r236r931j0656
52013E88224j1058j1183j1403j1962j2647j3040j3021j2874j2947j3340j3899
52002D50850j4240j3939j3046j2341j2630j3639j4164j3535j2424j1866j1962
51991C07064j2105j2096j2209j2296j1679j0082q146o661n801n338n136n062m791
51978A95662m154l470l137l108l124l284l850m596m897m583m178m112m113l702
51964A41354k941k262j860j608j490j602j785j658j118m62O3M72O79L46o31j734
51948A23763k274k098j573j017n10j88k44n79p57n11j12m9m52r89j221j013n80
$$ plain form
51931 109596 109407 109508 109858 110237 110015 108531 105874 103055 101143 100326 100006 99655 99277 99069 99006 98906 98694 98473
51913 98473 98409 98588 98853 98740 97742 95756 93180 90583 88395 86915 86306 86375 86542 86279 85551 84649 83676 82458
51895 82458 80968 79615 78905 78928 79321 79673 79873 80033 80204 80294 80267 80261 80410 80599 80526 80035 79293 78612 78227 78270 78798
51874 78798 79669 80524 81077 81462 82117 83268 84669 85883 86662 86950 86700 85941 85044 84652 85188 86458 87800
51857 87800 88640 88921 89117 89890 91649 94277 97196 99767 101781 103665 106196 109820 114168 118339 121842
51842 121842 125189 129367 134807 141156 148024 155515 163833 172802 182187 192161 202856 213494 222519 228718
51828 228718 231858 232210 229988 225501 219368 212143 203981 195034 185903 177274 169211 161268 153291 145794
51814 145794 139539 134987 132073 130198 128443 126156 123446 120901 118866 117259 116039 115399 115374 115617 115792
$$ packed form
51931A09596j89J01L50L79k22j484k657k819j912q17l20l51l78k08o3j00k12k21
51913I8473o4J79K65j13r98j986k576k597k188j480o09O9J67k63p28r02r73j218
51895H2458j490j353p10K3L93L52K00J60J71R0k7oJ49J89p3m91p42o81l85M3N28
51874G8798Q71Q55N53L85O55J151J401J214P79K88k50p59q97l92N36J270J342
51857H7800Q40K81J96P73J759K628K919K571K014J884K531L624M348M171L503
51842A21842L347M178N440O349O868P491Q318Q969R385R974J0695J0638R025O199
51828B28718L140L52k222m487o133p225q162q947r131q629q063p943p977p497
51814A45794o255m552k914j875j755k287k710k545k035j607j220o40k5K43J75
$$ plain form
51799 115792 115889 115945 115733 115073 114228 113683 113628 113962 114662 115712 116674 116828 116041 115113 114910 115310 115472 115074 114781
51780 114781 115274 116212 116553 115739 114125 112375 110877 109847 109532 109946 110611 110855 110367 109465 108952 109635 111620
51763 111620 113934 115238 115162 114612 114514 114678 114324 113338 112346 111806 111701 112101 113258 114962 116446 117234 117601 117950
51745 117950 118232 118392 118908 120410 122883 125660 128087 129931 131289 132435 133678 135094 136370 137049 136929
51730 136929 136193 135285 134663 134448 134228 133468 132182 130941 130150 129701 129436 129406 129337 128411 126197 123476 121478 120446
51712 120446 119556 118187 116603 115301 114315 113432 112581 111743 110789 109684 108608 107672 106777 105954 105518 105594 105687 105131
51694 105131 103905 102751 102474 103311 104945 106832 108417 109178 108803 107403 105498 103640 101987 100289 98308
51679 98308 96172 94294 93027 92443 92327 92351 92353 92528 93252 94580 96105 97376 98296 98943 99268 99208 98900 98515
$$ packed form
51799A15792R7N6k12o60q45n45n5L34P00J050R62J54p87r28k03M00J62l98k93
51780A14781M93R38L41q14j614j750j498j030l15M14O65K44m88r02n13O83J985
51763A11620K314J304p6n50r8J64l54r86r92n40j05M00J157J704J484P88L67L49
51745A17950K82J60N16J502K473K777K427J844J358J146J243J416J276O79j20
51730A36929p36r08o22k15k20p60j286j241p91m49k65l0o9r26k214k721j998j032
51712A20446q90j369j584j302r86q83q51q38r54j105j076r36q95q23m36P6R3n56
51694A05131j226j154k77Q37J634J887J585P61l75j400j905j858j653j698j981
51679I8308k136j878j267n84j16K4KJ75P24J328J525J271R20O47L25o0l08l85
$$ plain form
51661 98515 98059 97661 97785 98644 99608 99777 99175 98709 98847 98999 98588 98051 98183 98940 99520 99460 98990 98438 97969
51642 97969 98000 99238 101852 104921 107164 108159 108598 109393 110748 112189 113337 114393 115788 117502 118995 119855
51626 119855 120301 120872 121765 122681 123219 123184 122585 121645 120829 120601 120966 121428 121536 121312 121005 120605 119843 118614 117132
51607 117132 115628 114126 112691 111679 111498 112142 113155 114089 114792 115134 114707 113106 110546 107985 106533 106718
51591 106718 108221 110146 111535 111905 111505 111045 110994 111143 110835 109630 107743 105921 104940 105061 105855 106558 106696
51574 106696 106353 105860 105398 104995 104729 104670 104651 104339 103640 102932 102808 103625 105266 107172 108576 108962 108527 108178
51556 108178 108814 110552 112735 114700 116395 118166 120097 121833 123066 123966 124987 126386 128078 129865 131592
51541 131592 133100 134210 134824 134930 134556 133925 133656 134422 136221 138200 139518 140252 141130 142495 143966 145131
$$ packed form
51661I8515m56l98J24Q59R64J69o02m66J38J52m11n37J32P57N80o0m70n52m69
51642I7969L1J238K614L069K243R95M39P95J355J441J148J056J395J714J493Q60
51626A19855M46N71Q93R16N38l5n99r40q16k28L65M62J08k24l07m00p62j229j482
51607A17132j504j502j435j012j81O44J013R34P03L42m27j601k560k561j452J85
51591A06718J503J925J389L70m00m60n1J49l08j205j887j822r81J21P94P03J38
51574A06696l43m93m62m03k66n9j9l12o99p08j24Q17J641J906J404L86m35l49
51556A08178O36J738K183J965J695J771J931J736J233R00J021J399J692J787J727
51541A31592J508J110O14J06l74o31k69P66J799J979J318P34Q78J365J471J165
$$ plain form
51525 145131 146104 147119 147957 148218 148060 148176 148924 149793 149930 149051 147612 146174 144834 143390 141827 140405
51509 140405 139290 138359 137588 137368 138054 139203 139727 139074 137911 137222 136960 136134 134212 131829 129911 128662
51493 128662 127792 127307 127434 127870 127797 126821 125467 124443 123705 122550 120572 118193 116197 114900 113941 112825
51477 112825 111492 110176 108871 107291 105420 103748 102685 102037 101379 100713 100292 99998 99489 98897 98727 98924
51461 98924 98692 97563 96123 95268 95178 95442 95798 96216 96521 96468 96051 95365 94475 93856 94482 96718 99348 100620
51443 100620 100185 99152 98230 96899 94768 92638 91438 90901 90213 89466 89430 90093 90426 89715 88388 87329 87032
51426 87032 87622 89042 90833 92209 92855 93317 94196 95190 95441 94687 93616 93026 93100 93625 94498 95733 97168
51409 97168 98532 99729 100794 101597 101876 101572 100912 100089 99079 97924 96928 96400 96330 96462 96547 96325 95517 94122
$$ packed form
51525A45131R73J015Q38K61j58J16P48Q69J37q79j439j438j340j444j563j422
51509A40405j115r31p71k20O86J149N24o53j163o89k62q26j922k383j918j249
51493A28662q70m85J27M36p3r76j354j024p38j155j978k379j996j297r59j116
51477A12825j333j316j305j580j871j672j063o48o58o66m21k94n09n92j70J97
51461I8924k32j129j440q55r0K64L56M18L05n3m17o86q90o19O26K236K630J272
51443A00620m35j033r22j331k131k130j200n37o88p47l6O63L33p11j327j059k97
51426H7032N90J420J791J376O46M62Q79R94K51p54j071n90P4N25Q73J235J435
51409I7168J364J197J065Q03K79l04o60q23j010j155r96n28p0J32Q5k22q08j395
$$ plain form
51391 94122 92596 91382 90379 89239 88100 87478 87364 86934 85419 82938 80208 77808 76009 75014 74891 75321
51375 75321 75695 75464 74326 72356 70148 68543 67884 67736 67584 67566 68114 69152 70154 70885 71560 72237 72620
51358 72620 72557 72290 72021 71642 71145 70939 71453 72622 73951 74922 75151 74417 72851 71014 69592 68956 69049 69529
51340 69529 69913 69760 68927 67670 66432 65574 65237 65236 65085 64398 63440 63051 63805 65376 66884 67733 67993 68152
51322 68152 68663 69572 70378 70465 69844 69335 69700 70748 71621 71880 71960 72543 73799 75318 76499 76893 76387 75255
51304 75255 73947 72741 71695 70860 70337 70097 70026 70213 70939 72246 73722 74928 75805 76474 76813 76612 76048
51287 76048 75638 75603 75612 75321 74929 74927 75419 75987 76240 76264 76417 76841 77322 77586 77542 77244 76800 76389 76244 76419 76616
51266 76616 76435 75856 75336 75349 75918 76707 77460 78183 78987 79990 81351 83094 84814 85871 86145 86368 87330 88901
$$ packed form
51391I4122j526j214j003j140j139o22j14m30j515k481k730k400j799r95j23M30
51375G5321L74k31j138j970k208j605o59j48j52j8N48J038J002P31O75O77L83
51358G2620o3k67k69l79m97k06N14J169J329R71K29p34j566j837j422o36R3M80
51340F9529L84j53q33j257j238q58l37jj51o87r58l89P54J571J508Q49K60J59
51322F8152N11R09Q06Q7o21n09L65J048Q73K59Q0N83J256J519J181L94n06j132
51304G5255j308j206j046q35n23k40p1J87P26J307J476J206Q77O69L39k01n64
51287G6048m10l5Rk91l92kM92N68K53K4J53M24M81K64m4k98m44m11j45J75J97
51266G6616j81n79n20J3N69P89P53P23Q04J003J361J743J720J057K74K23R62J571
$$ plain form
51248 88901 90292 91224 92253 93701 94886 94940 93990 92855 91777 90227 88070 86113 85083 84681 84208 83706
51232 83706 83761 84358 84719 84381 83865 83971 84796 85763 86316 86354 86089 85770 85493 85206 84919 84880 85324 86072 86705 87196
51212 87196 87961 89069 89868 89823 89369 89388 90001 90480 90344 89918 89654 89415 88802 87823 86929 86557 86859 87625 88244
51193 88244 87993 86698 84938 83402 82271 81502 81350 82037 83072 83534 83165 82619 82457 82434 82089 81569 81329 81308
51175 81308 80991 80277 79692 79577 79489 78753 77405 76260 76053 76723 77592 78116 78377 78889 79962 81269 82030 81707
51157 81707 80533 79350 78901 79251 79930 80497 80829 80929 80837 80896 81751 83583 85422 85808 84377 82380 81356
51140 81356 81592 82299 82891 83473 84143 84587 84666 84844 85571 86531 87022 86935 86921 87535 88591 89517 90107 90704 91719
51121 91719 93130 94461 95225 95374 95258 95189 95151 95027 94945 95139 95556 95876 95980 96203 96963 98342 100115 102019
$$ packed form
51248H8901J391R32J029J448J185N4r50j135j078j550k157j957j030m02m73n02
51232H3706N5N97L61l38n16J06Q25R67N53L8k65l19k77k87k87l9M44P48O33M91
51212H7196P65J108P99m5m54J9O13M79j36m26k64k39o13r79q94l72L02P66O19
51193H8244k51j295j760j536j131p69j52O87J035M62l69n46j62k3l45n20k40k1
51175H1308l17p14n85j15q8p36j348j145k07O70Q69N24K61N12J073J307P61l23
51157H1707j174j183m49L50O79N67L32J00r2N9Q55J832J839L86j431j997j024
51140H1356K36P07N92N82O70M44P9J78P27R60M91q7j4O14J056R26N90N97J015
51121I1719J411J331P64J49j16o9l8j24q2J94M17L20J04K23P60J379J773J904
$$ plain form
51103 102019 103785 105103 105844 106357 107233 108642 110088 111006 111433 111826 112236 112087 110961 109388 108432 108497 108907
51086 108907 108862 108496 108659 109829 111564 112972 113405 112731 111334 110013 109529 109995 110833 111486 111977 112629 113474
51069 113474 114242 114779 115177 115498 115628 115391 114683 113549 112249 111184 110558 110206 109877 109498 108987 108070 106671
51052 106671 105322 104736 105007 105646 106390 107524 109327 111634 114058 116232 117715 118190 117982 117956 118642 119842
51036 119842 121269 123010 124977 126508 127095 127158 127463 128104 128696 129300 130348 131704 132628 132819 132881 133498 134709
51019 134709 136173 137689 139183 140618 142181 144215 146710 149199 151338 153307 155514 158246 161732 166059
51005 166059 170754 174930 178241 181380 185276 190135 195652 201775 208712 216312 223991 231286 238166 244838
50991 244838 251632 259064 267647 277536 288577 300710 314105 328937 345273 363197 382880 404491
$$ packed form
51103A02019J766J318P41N13Q76J409J446R18M27L93M10j49j126j573r56O5M10
51086A08907m5l66J63J170J735J408M33o74j397j321m84M66Q38O53M91O52Q45
51069A13474P68N37L98L21J30k37p08j134j300j065o26l52l29l79n11r17j399
51052A06671j349n86K71O39P44J134J803K307K424K174J483M75k08k6O86J200
51036A19842J427J741J967J531N87O3L05O41N92O04J048J356R24J91O2O17J211
51019A34709J464J516J494J435J563K034K495K489K139J969K207K732L486M327
51005A66059M695M176L311L139L896M859N517O123O937P600P679P295O880O672
50991B44838O794P432Q583R889J1041J2133J3395J4832J6336J7924J9683K1611
$$ plain form
50979 404491 428184 454140 482524 513457 547163 583954 623845 666327 710748 756867 804750
50968 804750 854219 904611 955021 1004547 1052365 1097825 1140413 1179457 1214041 1243567 1268229
50957 1268229 1288605 1304894 1317065 1325631 1331576 1335352 1336611 1335366 1332930 1331087 1330539 1330762 1331289 1332451
50943 1332451 1334520 1336584 1336817 1333766 1327027 1316646 1302359 1283677 1260406 1232622 1200299 1163428
50931 1163428 1122557 1078711 1032595 984302 934089 883054 832673 783943 737327 693218 652034
50920 652034 614068 579704 549551 523790 501487 481113 461857 444022 428266 414956 404196
50909 404196 395751 388798 382360 376283 371279 367751 365109 362562 360107 358253 357191 356707 356698 357276 358420
50894 358420 359822 361110 362124 363132 364743 367362 370676 374107 377809 382620 388811 395532 401938 408320
$$ packed form
50979D04491K3693K5956K8384L0933L3706L6791L9891M2482M4421M6119M7883
50968H04750M9469N0392N0410M9526M7818M5460M2588L9044L4584K9526K4662
50957A268229K0376J6289J2171Q566N945L776J259j245k436j843n48K23N27J162
50943A332451K069K064K33l051o739j0381j4287j8682k3271k7784l2323l6871
50931A163428m0871m3846m6116m8293n0213n1035n0381m8730m6616m4109m1184
50920F52034l7966l4364l0153k5761k2303k0374j9256j7835j5756j3310j0760
50909D04196q445o953o438o077n004l528k642k547k455j854j062m84rN78J144
50894C58420J402J288J014J008J611K619L314L431L702M811O191O721O406O382
$$ plain form
50880 408320 415537 423833 432924 442897 454168 466703 480042 494148 509585 526772 545703 566516
50868 566516 589772 615968 645230 677690 713822 754346 800148 852278 911454 977399 1049099
50857 1049099 1125910 1208060 1295947 1389514 1488493 1592721 1701732 1814388 1929201 2044639
50847 2044639 2158707 2268592 2371241 2464212 2545648 2613819 2667352 2706036 2731025 2744187 2747453
50836 2747453 2742738 2732079 2717676 2701903 2687248 2676002 2669925 2670050 2676520 2688255 2702944 2717739
50824 2717739 2729996 2737195 2736355 2724218 2698370 2658017 2603596 2535863 2455594 2363867 2262245 2152601
50812 2152601 2037001 1917792 1797653 1679380 1565560 1458296 1358964 1268039 1185217 1109976
50802 1109976 1042164 981977 929330 883485 843491 808822 779215 753984 731957 712305 695043
$$ packed form
50880D08320P217Q296R091R973J1271J2535J3339J4106J5437J7187J8931K0813
50868E66516K3256K6196K9262L2460L6132M0524M5802N2130N9176O5945P1700
50857A049099P6811Q2150Q7887R3567R8979J04228J09011J12656J14813J15438
50847B044639J14068J09885J02649R2971Q1436O8171N3533L8684K4989J3162L266
50836B747453m715j0659j4403j5773j4655j1246o077J25O470J1735J4689J4795
50824B717739J2257P199q40j2137k5848m0353n4421o7733q0269r1727j01622j09644
50812B152601j15600j19209j20139j18273j13820j07264r9332r0925q2822p5241
50802A109976o7812o0187n2647m5845l9994l4669k9607k5231k2027j9652j7262
$$ plain form
50791 695043 680449 668299 658012 649209 641629 634651 627497 619942 612342 604924 597563 590371 583845
50778 583845 577956 571624 563781 554754 546004 538495 531840 525118 518027 511006 504614 499110 494416 490249
50764 490249 486417 483204 481309 481194 482605 484986 488265 492990 499676 508238 518194 529268 541747 556296
50750 556296 573462 593311 615561 640080 667202 697480 731238 768562 809691 855147 905284
50739 905284 959820 1017927 1078740 1141645 1206107 1271332 1336214 1399563 1460414 1518090 1572005
50728 1572005 1621375 1665097 1701860 1730398 1749760 1759455 1759481 1750351 1733336 1710688 1685407 1660401
50716 1660401 1637757 1618745 1604292 1595196 1591871 1594173 1601522 1612869 1626431 1639687 1650003 1655263
50704 1655263 1653872 1644379 1625446 1596191 1556415 1506576 1447850 1382327 1312818 1242158 1172577 1105692
$$ packed form
50791F95043j4594j2150j0287q803p580o978p154p555p600p418p361p192o526
50778E83845n889o332p843r027q750p509o655o722p091p021o392n504m694m167
50764D90249l832l213j895j15J411K381L279M725O686Q562R956J1074J2479J4549
50750E56296J7166J9849K2250K4519K7122L0278L3758L7324M1129M5456N0137
50739I05284N4536N8107O0813O2905O4462O5225O4882O3349O0851N7676N3915
50728A572005M9370M3722L6763K8538J9362R695K6r130j7015k2648k5281k5006
50716A660401k2644j9012j4453r096l325K302P349J1347J3562J3256J0316N260
50704A655263j391r493j8933k9255l9776m9839n8726o5523o9509p0660o9581o6885
$$ plain form
50692 1105692 1042884 985361 933722 887640 846247 808963 775918 747504 723671 703852 687547
50681 687547 674710 665398 659262 655671 654392 655856 660492 667776 676076 683639 689806 695197 700703 706457
50667 706457 711984 717145 722523 728770 735922 743584 751564 759983 768955 778528 788991 800939 814930
50654 814930 831271 850141 871763 896281 923526 952986 984017 1016182 1049521 1084391 1120871
50643 1120871 1158279 1195335 1230759 1263589 1293116 1318860 1340687 1358657 1372672 1382417 1387729 1388830
50631 1388830 1386117 1379935 1370595 1358388 1343460 1326037 1307030 1288101 1270672 1254952 1240301 1226614
50619 1226614 1214879 1206276 1201053 1198583 1198268 1199975 1203618 1208676 1214333 1219903 1224913 1228788 1230613 1229211
50605 1229211 1223365 1211999 1194434 1170712 1141608 1108205 1071463 1032248 991603 950658 910269
$$ packed form
50692A105692o2808n7523n1639m6082m1393l7284l3045k8414k3833j9819j6305
50681F87547j2837r312o136l591j279J464M636P284Q300P563O167N391N506N754
50667G06457N527N161N378O247P152P662P980Q419Q972R573J0463J1948J3991
50654H14930J6341J8870K1622K4518K7245K9460L1031L2165L3339L4870L6480
50643A120871L7408L7056L5424L2830K9527K5744K1827J7970J4015R745N312J101
50631A388830k713o182r340j2207j4928j7423j9007j8929j7429j5720j4651j3687
50619A226614j1735q603n223k470l15J707L643N058N657N570N010L875J825j402
50605A229211n846j1366j7565k3722k9104l3403l6742l9215m0645m0945m0389
$$ plain form
50594 910269 871011 833564 798765 767078 738310 712154 688731 668231 650166 633615 618305
50583 618305 604910 593959 584895 576746 569508 564192 561458 560785 561270 562794 565919 570885 577172 583983
50569 583983 590754 597145 603081 608958 615502 623124 631681 641080 651826 664561 679180 694824 710757
50556 710757 726899 743446 760291 777006 793245 809087 825127 842280 861220 881902 903792
50545 903792 926705 951259 978440 1008958 1043193 1081560 1124582 1172645 1225938 1284666 1349156
50534 1349156 1419579 1495659 1576639 1661513 1749246 1838781 1928878 2018060 2104851 2187958 2265970
50523 2265970 2336778 2397645 2446171 2481180 2502511 2510124 2503790 2483637 2450599 2406017 2350992 2286506
50511 2286506 2214223 2136902 2057716 1979131 1902613 1829456 1761606 1701375 1650346 1608922 1576934
$$ packed form
50594I10269l9258l7447l4799l1687k8768k6156k3423k0500j8065j6551j5310
50583F18305j3395j0951r064q149p238n316k734o73M85J524L125M966O287O811
50569E83983O771O391N936N877O544P622Q557R399J0746J2735J4619J5644J5933
50556G10757J6142J6547J6845J6715J6239J5842J6040J7153J8940K0682K1890
50545I03792K2913K4554K7181L0518L4235L8367M3022M8063N3293N8728O4490
50534A349156P0423P6080Q0980Q4874Q7733Q9535R0097Q9182Q6791Q3107P8012
50523B265970P0808O0867M8526L5009K1331P613o334k0153l3038m4582n5025o4486
50511B286506p2283p7321p9186p8585p6518p3157o7850o0231n1029m1424l1988
$$ plain form
50500 1576934 1554318 1540992 1536484 1540187 1551844 1571302 1597629 1628762 1662070 1694917 1724540 1747703
50488 1747703 1760936 1761267 1746835 1717149 1673124 1616891 1551275 1479111 1402843 1324586 1246431 1170559
50476 1170559 1098963 1032897 972567 917399 866689 820106 777773 740077 707296 679231 655123
50465 655123 634118 615842 600401 587864 578060 570970 566918 565995 567477 570218 573638 577991 583590
50452 583590 590131 597026 604145 611857 620335 629134 637670 645928 654450 663569 672835 681363 688695 695176
50438 695176 701502 708051 714702 721154 727311 733442 740183 748370 758656 771119 785232 800362 816349
50425 816349 833569 852409 872849 894800 918883 946479 978625 1014948 1053988 1094624 1136843
50414 1136843 1181070 1227138 1274174 1321083 1366723 1409779 1449022 1483748 1513685 1538410 1557113
$$ packed form
50500A576934k2616j3326m508L703J1657J9458K6327L1133L3308L2847K9623K3163
50488A747703J3233L31j4432k9686m4025n6233o5616p2164p6268p8257p8155p5872
50476A170559p1596o6066o0330n5168n0710m6583m2333l7696l2781k8065k4108
50465F55123k1005j8276j5441j2537r804p090m052r23J482K741L420M353N599
50452E83590O541O895P119P712Q478Q799Q536Q258Q522R119R266Q528P332O481
50438F95176O326O549O651O452O157O131O741Q187J0286J2463J4113J5130J5987
50425H16349J7220J8840K0440K1951K4083K7596L2146L6323L9040M0636M2219
50414A136843M4227M6068M7036M6909M5640M3056L9243L4726K9937K4725J8703
$$ plain form
50403 1557113 1568889 1572906 1568197 1553784 1529316 1495495 1453725 1405483 1352147 1295131 1235988 1176490
50391 1176490 1118615 1064164 1014127 968677 927955 892554 863019 839314 821299 809375 803979
50380 803979 804538 809741 818888 832120 848972 867421 885034 900495 913293 922310 925656 921967 911116
50367 911116 893558 869733 840478 807457 772591 737264 702361 668705 636980 607412 579929
50356 579929 554577 531435 510268 490734 472905 457179 443711 432318 422925 415561 409816 404896
50344 404896 400547 397385 395906 395618 395731 396359 398319 401860 406345 411264 416832 423281 430161 436841 443371
50329 443371 450367 458260 466990 476208 485356 493722 500932 507434 514130 521421 528829 535562 541123 545348
50315 545348 548163 549592 549902 549585 549219 549237 549705 550335 550864 551381 552139 553117 553990 554489 554513 553909 552504 550481
$$ packed form
50403A557113J1776M017m709j4413k4468l3821m1770m8242n3336n7016n9143n9498
50391A176490n7875n4451n0037m5450m0722l5401k9535k3705j8015j1924n396
50380H03979N59N203R147J3232J6852J8449J7613J5461J2798R017L346l689j0851
50367I11116j7558k3825k9255l3021l4866l5327l4903l3656l1725k9568k7483
50356E79929k5352k3142k1167j9534j7829j5726j3468j1393r393p364n745m920
50344D04896m349l162j479k88J13O28J960L541M485M919N568O449O880O680O530
50329D43371O996P893Q730R218R148Q366P210O502O696P291P408O733N561M225
50315E45348K815J429L10l17l66J8M68O30N29N17P58R78Q73M99K4o04j405k023
$$ plain form
50297 550481 548373 546489 544638 542652 540938 540223 540934 543138 546957 552621 559978 568155 575822 581737 585165
50282 585165 586068 585082 583152 581010 578894 576689 574274 571748 569374 567307 565389 563303 560898 558220 555163
50267 555163 551315 546398 540729 534993 529597 524448 519335 514199 509013 503722 498554 494114 490917 488904
50253 488904 487633 486872 486735 487232 487987 488515 488712 488970 489982 492375 496290 501095 505715 509444 512348 514759
50237 514759 516604 517572 517791 517776 517723 517328 516443 515330 513929 511445 507211 501637 495657 489507 482772 475520
50221 475520 468482 461917 455077 447256 438770 430442 422565 414937 407605 400978 395248 390177 385480 381109
50207 381109 377231 374112 371920 370463 369251 368023 366895 365786 364078 361381 358337 356054 354745 353546
50193 353546 351700 349417 347413 346059 345268 344866 344768 344916 345202 345426 345390 345163 345140 345595 346317 347044 348144 350398
$$ packed form
50297E50481k108j884j851j986j714p15P11K204L819N664P357Q177P667N915L428
50282E85165R03r86j930k142k116k205k415k526k374k067j918k086k405k678l057
50267E55163l848m917n669n736n396n149n113n136n186n291n168m440l197k013
50253D88904j271p61j37M97P55N28J97K58J012K393L915M805M620L729K904K411
50237E14759J845R68K19j5n3l95q85j113j401k484m234n574n980o150o735p252
50221D75520p038o565o840p821q486q328p877p628p332o627n730n071m697m371
50207C81109l878l119k192j457j212j228j128j109j708k697l044k283j309j199
50193C53546j846k283k004j354p91m02r8J48K86K24l6k27k3M55P22P27J100K254
$$ plain form
50175 350398 354169 359271 365654 373607 383132 393729 405104 417505 430953 444678 457874 470596
50163 470596 483193 495047 504726 511555 516454 520949 525736 530551 535052 539227 542809 544684 543345 538031
50149 538031 529239 517944 504505 488664 470611 451552 432962 415524 399085 383454 368847 355614
50137 355614 344000 334281 326681 320894 315914 310839 305835 301994 300127 299956 300711 302128 304370 307049
50123 307049 309098 309963 310504 312204 315677 320361 325423 330335 334667 338083 340829 343701 347214 351101 354874
50108 354874 358453 361954 365247 368126 370690 373221 375878 378854 382561 387199 392225 396701 400171 402939
50094 402939 405622 408826 413212 419310 427029 435635 444475 453597 463519 474589 486719 499607 512912
50081 512912 526177 538862 550702 561998 573317 584772 595824 605944 615242 624167 632761 640669
$$ packed form
50175C50398L771N102O383P953R525J0597J1375J2401J3448J3725J3196J2722
50163D70596J2597J1854R679O829M899M495M787M815M501M175L582J875j339n314
50149E38031q792j1295j3439j5841j8053j9059j8590j7438j6439j5631j4607j3233
50137C55614j1614r719p600n787m980n075n004l841j867j71P55J417K242K679
50123C07049K049Q65N41J700L473M684N062M912M332L416K746K872L513L887L773
50108C54874L579L501L293K879K564K531K657K976L707M638N026M476L470K768
50094D02939K683L204M386O098P719Q606Q840R122R922J1070J2130J2888J3305
50081E12912J3265J2685J1840J1296J1319J1455J1052J0120R298Q925Q594P908
$$ plain form
50069 640669 647823 654554 660920 666492 671119 675409 680037 685017 690128 695740 702637 711258 721725 734503
50055 734503 750326 769282 790519 813067 836630 861409 887432 914230 940906 966392 989989
50044 989989 1011870 1032977 1054251 1075998 1097911 1119322 1139299 1156704 1170396 1179359 1182658 1179551
50032 1179551 1169823 1153934 1132744 1107125 1077817 1045456 1010624 973936 936115 897925 860041
50021 860041 823058 787549 753882 722032 691723 662802 635288 609109 584146 560643 539327
50010 539327 520829 505058 491239 478561 466721 455964 446652 438787 431869 425250 418641 412223 406303
49997 406303 400972 396108 391623 387598 384129 381027 377749 373752 368950 363700 358329 352913 347594 342762
49983 342762 338624 334799 330696 326203 321629 317077 312296 307171 301969 296947 292050 287183 282533 278375
$$ packed form
50069F40669P154O731O366N572M627M290M628M980N111N612O897Q621J0467J2778
50055G34503J5823J8956K1237K2548K3563K4779K6023K6798K6676K5486K3597
50044I89989K1881K1107K1274K1747K1913K1411J9977J7405J3692Q963L299l107
50032A179551r728j5889k1190k5619k9308l2361l4832l6688l7821l8190l7884
50021H60041l6983l5509l3667l1850l0309k8921k7514k6179k4963k3503k1316
50010E39327j8498j5771j3819j2678j1840j0757r312p865o918o619o609o418n920
49997D06303n331m864m485m025l469l102l278l997m802n250n371n416n319m832
49983C42762m138l825m103m493m574m552m781n125n202n022m897m867m650m158
$$ plain form
49969 278375 274695 271226 267840 264782 262407 260706 259139 257061 254321 251331 248608 246511 245422 245626
49955 245626 246663 247334 246898 246020 245911 246726 247614 248313 249815 253124 258000 263336 268297 272716 276894 281551
49939 281551 287688 295932 306079 317518 329962 343561 358569 375215 393639 413574 434218 454646
49927 454646 474172 492075 507398 519570 529148 537478 545552 553447 560764 567192 572608 576949 579994
49914 579994 581002 578615 571490 559239 542602 522784 500904 478068 455381 433547 412614 392466
49902 392466 373434 356171 341005 327746 316194 306540 298997 293175 288137 283113 277954 272795 267585
49889 267585 262213 256893 251992 247512 243101 238689 234761 231771 229517 227329 224783 222091 219898 218748
49875 218748 218599 218738 218362 217376 216490 216442 217279 218482 219564 220396 221189 222372 224330 227013 229880 232419 234548
$$ packed form
49969B78375l680l469l386l058k375j701j567k078k740k990k723k097j089K04
49955B45626J037O71m36q78j09Q15Q88O99J502L309M876N336M961M419M178M657
49939B81551O137Q244J0147J1439J2444J3599J5008J6646J8424J9935K0644K0428
49927D54646J9526J7903J5323J2172R578Q330Q074P895P317O428N416M341L045
49914E79994J008k387p125j2251j6637j9818k1880k2836k2687k1834k0933k0148
49902C92466j9032j7263j5166j3259j1552r654p543n822n038n024n159n159n210
49889B67585n372n320m901m480m411m412l928k990k254k188k546k692k193j150
49875B18748j49J39l76r86q86m8Q37J203J082Q32P93J183J958K683K867K539K129
$$ plain form
49858 234548 236388 237842 238659 238775 238288 237218 235604 233834 232571 232250 232735 233430 233628 232912 231416 229718
49842 229718 228357 227512 227142 227148 227182 226658 225336 223754 222690 222280 222067 221769 221489 221169 220467 219439 218842 219316
49824 219316 220512 221432 221524 221115 220855 221063 221714 222752 224191 225934 227633 228823 229265 229140 228846 228585 228223
49807 228223 227602 226909 226566 226760 227195 227383 227082 226344 225241 223774 222100 220597 219483 218515 217296 215822
49791 215822 214451 213383 212469 211598 210915 210529 210246 209803 209206 208676 208441 208742 209795 211442 212973 213545 212859
49774 212859 211338 209746 208725 208538 209045 209952 211109 212463 213750 214579 214934 215278 215944 216771 217591 218695
49758 218695 220310 221930 222761 222762 222693 223097 223749 224193 224328 224275 224051 223657 223233 222923 222795 223005 223793 225117 226477
49739 226477 227328 227576 227588 227791 228308 228875 229055 228722 228323 228538 229620 231293 233266 235546 238184 240928 243330
$$ packed form
49858B34548J840J454Q17J16m87j070j614j770j263l21M85O95J98p16j496j698
49842B29718j361q45l70OL4n24j322j582j064m10k13k98k80l20p02j028n97M74
49824B19316J196R20R2m09k60K08O51J038J439J743J699J190M42j25k94k61l62
49807B28223o21o93l43J94M35J88l01p38j103j467j674j503j114r68j219j474
49791B15822j371j068r14q71o83l86k83m43n97n30k35L01J053J647J531N72o86
49774B12859j521j592j021j87N07R07J157J354J287Q29L55L44O66Q27Q20J104
49758B18695J615J620Q31Jo9M04O52M44J35n3k24l94m24l10j28K10P88J324J360
49739B26477Q51K48J2K03N17N67J80l33l99K15J082J673J973K280K638K744K402
$$ plain form
49722 243330 244996 245635 245082 243415 240998 238280 235694 233716 232739 232758 233360 234165 235035 235782 236004 235581 235076
49705 235076 235164 235667 235609 234371 232489 231062 230558 230451 230017 229208 228653 228938 229994 231163 231806 231943 232367 233972
49687 233972 236776 239737 241760 242796 243578 244369 244588 243913 243076 243001 243491 243520 242668 241608 241112 241276 241855 242714
49669 242714 243593 243973 243687 243335 243655 244636 245595 245913 245369 244043 242417 241402 241713 243107 244690 246135 248183
49652 248183 251733 256818 262799 269304 276502 284462 292665 300199 306162 309725 310235 307699 303110 297917
49638 297917 293080 288789 284945 281544 278518 275655 272996 270976 269836 269177 268436 267615 267080 266776 266203 265248
49622 265248 264500 264535 265240 266083 266772 267370 267952 268436 268722 268831 268978 269580 271078 273556 276545 279309 281350
49605 281350 282697 283833 285344 287516 290159 292848 295322 297602 299885 302468 305661 309492 313494 317017
$$ packed form
49722B43330J666O39n53j667k417k718k586j978r77J9O02Q05Q70P47K22m23n05
49705B35076Q8N03n8j238j882j427n04j07m34q09n55K85J056J169O43J37M24J605
49687B33972K804K961K023J036P82P91K19o75q37p5M90K9q52j060m96J64N79Q59
49669B42714Q79L80k86l52L20R81R59L18n44j326j626j015L11J394J583J445K048
49652B48183L550N085N981O505P198P960Q203P534N963L563N10k536m589n193
49638B97917m837m291l844l401l026k863k659k020j140o59p41q21n35l04n73r55
49622B65248p48L5P05Q43O89N98N82M84K86J09J47O02J498K478K989K764K041
49605B81350J347J136J511K172K643K689K474K280K283K583L193L831M002L523
$$ plain form
49591 317017 319834 322274 324814 327748 331201 335163 339368 343357 346784 349643 352308 355396 359392 364085
49577 364085 368577 372241 375506 379235 383536 387814 391956 396589 401923 407147 411437 414934 418223 421417
49563 421417 424428 427656 431596 435986 440045 443404 446174 448265 449469 450275 451767 454353 457192 459256
49549 459256 460589 462060 464186 466614 468706 470261 471604 473167 475120 477360 479744 482241 484815 487320
49535 487320 489654 491934 494342 496864 499407 502150 505529 509729 514335 518627 522212 525328 528575 532362
49521 532362 536623 540995 545243 549505 554145 559432 565214 570810 575383 578743 581697 585244 589325 592807
49507 592807 594759 595266 594768 593210 590412 586825 583088 578978 573659 567120 560634 555369 551035 546373 540690
49492 540690 534418 528319 522655 517277 512133 507393 503146 499237 495503 491963 488576 484921 480451 475183
$$ packed form
49591C17017K817K440K540K934L453L962M205L989L427K859K665L088L996M693
49577C64085M492L664L265L729M301M278M142M633N334N224M290L497L289L194
49563D21417L011L228L940M390M059L359K770K091J204Q06J492K586K839K064
49549D59256J333J471K126K428K092J555J343J563J953K240K384K497K574K505
49535D87320K334K280K408K522K543K743L379M200M606M292L585L116L247L787
49521E32362M261M372M248M262M640N287N782N596M573L360K954L547M081L482
49507E92807J952N07m98j558k798l587l737m110n319o539o486n265m334m662n683
49492E40690o272o099n664n378n144m740m247l909l734l540l387l655m470n268
$$ plain form
49478 475183 469891 465388 461777 458572 455339 451978 448549 445150 441899 438759 435468 431887 428351 425360
49464 425360 422999 420986 419258 418043 417333 416654 415556 414033 412304 410483 408710 407369 406810 406844 406736 405781
49448 405781 403941 401904 400511 400090 400350 400864 401449 402019 402439 402822 403726 405622 408307 411304 414737 419279
49432 419279 425164 431727 437965 443033 446097 446427 444105 440244 436071 432097 428525 425952 425000 425450 426413
49417 426413 427466 429101 431957 435963 440423 444681 448631 452761 457787 464071 471336 479049 486949 495004
49403 495004 503006 510614 517881 525383 533607 542412 551208 559447 566777 572922 577741 581432 584511 587488
$$ packed form
49478D75183n292m503l611l205l233l361l429l399l251l140l291l581l536k991
49464D25360k361k013j728j215p10o79j098j523j729j821j773j341n59L4j08r55
49448D05781j840k037j393m21K60N14N85N70M20L83R04J896K685K997L433M542
49432D19279N885O563O238N068L064L30k322l861m173l974l572k573r52M50R63
49417D26413J053J635K856M006M460M258L950M130N026O284P265P713P900Q055
49403D95004Q002P608P267P502Q224Q805Q796Q239P330O145M819L691L079K977
$$ [...]
##END NTUPLES=NMR SPECTRUM
##END=
