##TITLE=NES1061_159122.0010_001_9704394_M04ESlPhw2
##JCAMPDX= 6.0         $$ Bruker NMR JCAMP-DX V2.0
##DATA TYPE= NMR SPECTRUM
##DATA CLASS= NTUPLES
##ORIGIN= BRUKER
##OWNER= Administrator
$$ 1.72 TOPSPIN		Version 2.1
$$ 2016-04-30 18:44:09.677 -0700  Administrator@X
$$ Compression mode = diff/dup
##.OBSERVE FREQUENCY= 400.02188249412
##.OBSERVE NUCLEUS= ^1H
##.ACQUISITION MODE= SIMULTANEOUS (DQD)
##.ACQUISITION SCHEME= undefined
##.AVERAGES= 64
##.DIGITISER RES= 22
##SPECTROMETER/DATA SYSTEM= spect
##.PULSE SEQUENCE= noesygpps1d.comp
##.SOLVENT NAME= COFFEE_meoh
##.SHIFT REFERENCE= INTERNAL, COFFEE_meoh, 1, 14.96166
##AUDIT TRAIL= $$ (NUMBER, WHEN, WHO, WHERE, PROCESS, VERSION, WHAT)
$$ ##TITLE= Audit trail, TOPSPIN		Version 2.1
$$ ##JCAMPDX= 5.01
$$ ##ORIGIN= Bruker BioSpin GmbH
$$ ##OWNER= Administrator
$$ $$ E:\/data/COFFEE/nmr/NES1061_159122.0010_001_9704394_M04ESlPhw2/22/pdata/1/auditp.txt
$$ ##AUDIT TRAIL=  $$ (NUMBER, WHEN, WHO, WHERE, PROCESS, VERSION, WHAT)
(   1,<2016-04-30 18:44:04.458 -0700>,<Administrator>,<X>,<go>,<TOPSPIN 2.1>,
      <created by zg
	started at 2016-04-30 18:32:34.864 -0700,
	POWCHK enabled, PULCHK disabled,
       configuration hash MD5:
       21 0F 79 D6 B3 7B B4 F6 88 20 88 DB 03 48 BD 9F
       data hash MD5: 64K
       9B 60 6C 2E F5 A7 AD 76 0B B3 36 7C 6D 7C DB 74>)
(   2,<2016-04-30 18:44:07.646 -0700>,<Administrator>,<X>,<proc1d>,<TOPSPIN 2.1>,
      <Start of raw data processing
       efp LB = 0.3 FT_mod = 6 PKNL = 1 PHC0 = 0 PHC1 = 0 SI = 128K 
       data hash MD5: 128K
       7B 47 10 7C 88 FA D4 81 FB FC D9 EE 27 46 25 46>)
(   3,<2016-04-30 18:44:08.536 -0700>,<Administrator>,<X>,<proc1d>,<TOPSPIN 2.1>,
      <pk PHC0 = -84.35303 PHC1 = 0 
       data hash MD5: 128K
       75 A5 21 02 8C CE 8C 6A F5 39 FD 0A D5 51 99 18>)
(   4,<2016-04-30 18:44:08.911 -0700>,<Administrator>,<X>,<proc1d>,<TOPSPIN 2.1>,
      <abs ABSG = 1 
       data hash MD5: 128K
       43 E2 09 4C FB 8A 0E 4F 53 D8 3E C3 5D C7 75 8A>)
(   5,<2016-04-30 18:44:09.021 -0700>,<Administrator>,<X>,<proc1d>,<TOPSPIN 2.1>,
      <abs ABSG = 2 
       data hash MD5: 128K
       0A A4 DD 9E 06 4A 90 DE 43 4F E4 68 A8 BC F3 D9>)
(   6,<2016-04-30 18:44:09.114 -0700>,<Administrator>,<X>,<proc1d>,<TOPSPIN 2.1>,
      <abs ABSG = 3 
       data hash MD5: 128K
       1C 79 6E C3 B0 80 24 60 19 5A BB 22 70 68 EE 39>)
(   7,<2016-04-30 18:44:09.192 -0700>,<Administrator>,<X>,<proc1d>,<TOPSPIN 2.1>,
      <abs ABSG = 4 
       data hash MD5: 128K
       7A 40 4A 0C BC 90 D6 B6 93 7F 38 27 DA F6 AB 2F>)
(   8,<2016-04-30 18:44:09.317 -0700>,<Administrator>,<X>,<proc1d>,<TOPSPIN 2.1>,
      <abs ABSG = 5 
       data hash MD5: 128K
       43 F2 CB B6 1E C4 DA F5 DE 4E 8A D0 91 7E 5D ED>)
$$ ##END=
$$ 
$$ $$ hash MD5
$$ $$ 39 A5 BF 2D EF 49 24 5E 71 A7 36 F0 02 F9 36 C9
##$RELAX= 
##$RELAX= 
##$RELAX= 
##$RELAX= 
##$RELAX= 
##$RELAX= 
##$RELAX= 
##$RELAX= 
$$ Bruker specific parameters
$$ --------------------------
##$DU= <E:\>
##$EXPNO= 22
$$ [...]
##$TP07= 0
##$TPNAME0= <>
##$TPNAME1= <>
##$TPNAME2= <>
##$TPNAME3= <>
##$TPNAME4= <>
##$TPNAME5= <>
##$TPNAME6= <>
##$TPNAME7= <>
##$TPOAL= (0..7)
0.5 0.5 0.5 0.5 0.5 0.5 0.5 0.5
##$TPOFFS= (0..7)
0 0 0 0 0 0 0 0
##$TUNHIN= 0
##$TUNHOUT= 0
##$TUNXOUT= 0
##$USERA1= <user>
##$USERA2= <user>
##$USERA3= <user>
##$USERA4= <user>
##$USERA5= <user>
##$V9= 5
##$VALIST= <valist>
##$VCLIST= <CCCCCCCCCCCCCCC>
##$VD= 0
##$VDLIST= <DDDDDDDDDDDDDDD>
##$VPLIST= <PPPPPPPPPPPPPPP>
##$VTLIST= <TTTTTTTTTTTTTTT>
##$WBST= 2048
##$WBSW= 25
##$XGAIN= (0..3)
0 0 0 0
##$XL= 0
##$YL= 0
##$YMAX_a= 5444978
##$YMIN_a= -10481723
##$ZGOPTNS= <>
##$ZL1= 120
##$ZL2= 120
##$ZL3= 120
##$ZL4= 120
##$ABSF1= 14.96166
##$ABSF2= -5.596521
##$ABSG= 5
##$ABSL= 3
##$ALPHA= 0
##$AQORDER= 0
##$ASSFAC= 0
##$ASSFACI= 0
##$ASSFACX= 0
##$ASSWID= 0
##$AUNMP= <proc_prof1d_extract.lims>
##$AXLEFT= 0
##$AXNAME= <>
##$AXNUC= <1H>
##$AXRIGHT= 0
##$AXTYPE= 0
##$AXUNIT= <>
##$AZFE= 0.1
##$AZFW= 0.1
##$BCFW= 0
##$BC_mod= 0
##$BYTORDP= 0
##$COROFFS= 0
##$CY= 15
##$DATMOD= 1
##$DC= 0
##$DFILT= <>
##$DTYPP= 0
##$F1P= 0
##$F2P= 0
##$FCOR= 0.5
##$FTSIZE= 131072
##$FT_mod= 6
##$GAMMA= 0
##$GB= 0
##$INTBC= 1
##$INTSCL= 1
##$ISEN= 128
##$LB= 0.3
##$LEV0= 0
##$LPBIN= 0
##$MAXI= 10000
##$MC2= 0
##$MEAN= 0
##$ME_mod= 0
##$MI= 0
##$NCOEF= 0
##$NC_proc= -2
##$NLEV= 6
##$NOISF1= 0
##$NOISF2= 0
##$NSP= 0
##$NTH_PI= 0
##$NZP= 0
##$OFFSET= 14.96166
##$PC= 1
##$PHC0= -84.35303
##$PHC1= 0
##$PH_mod= 1
##$PKNL= yes
##$PPARMOD= 0
##$PPDIAG= 0
##$PPIPTYP= 0
##$PPMPNUM= 2147483647
##$PPRESOL= 1
##$PSCAL= 4
##$PSIGN= 0
##$PYNMP= <proc.py>
##$REVERSE= no
##$SF= 400.020009371552
##$SI= 131072
##$SIGF1= 0
##$SIGF2= 0
##$SINO= 400
##$SIOLD= 131072
##$SPECTYP= <>
##$SREGLST= <1H.CDCl3>
##$SSB= 0
##$STSI= 131072
##$STSR= 0
##$SW_p= 8223.68421052631
##$SYMM= 0
##$S_DEV= 0
##$TDeff= 65536
##$TDoff= 0
##$TI= <>
##$TILT= no
##$TM1= 0
##$TM2= 0
##$TOPLEV= 0
##$USERP1= <user>
##$USERP2= <user>
##$USERP3= <user>
##$USERP4= <user>
##$USERP5= <user>
##$WDW= 1
##$XDIM= 131072
##$YMAX_p= 290240480
##$YMIN_p= -9969
##$CURPLOT= <Network HP LaserJet P1505>
##$CURPRIN= <$Network HP LaserJet P1505>
##$DFORMAT= <normdp>
##$LAYOUT= <+/1D_H.xwp>
##$LFORMAT= <normlp>
##$PFORMAT= <normpl>
##$SURQMSG= 1
$$ End of Bruker specific parameters
$$ ---------------------------------
##NTUPLES= NMR SPECTRUM
##VAR_NAME=  FREQUENCY,     SPECTRUM/REAL,   SPECTRUM/IMAG
##SYMBOL=    X,             R,               I
##VAR_TYPE=  INDEPENDENT,   DEPENDENT,       DEPENDENT
##VAR_FORM=  AFFN,          ASDF,            ASDF
##VAR_DIM=   131072,        131072,          131072
##UNITS=     HZ,            ARBITRARY UNITS, ARBITRARY UNITS
##FACTOR=    0.0627417313425164, 1,          1
##FIRST=     8223.62146879497, 722,          -48517
##LAST=      0,             2092,            -48353
##MIN=       0,             -9969,           0
##MAX=       8223.62146879497, 290240480,    0
$$ Real data points
##PAGE= N=1
##DATA TABLE= (X++(R..R)), XYDATA
$$ [...]
$$ plain form
63670 117751 119258 120020 120062 119588 118826 118002 117225 116326 115026 113431 112068 111229 110549 109507 108110 106780 105790
63653 105790 105117 104706 104539 104598 105060 106327 108502 110971 112920 114136 114999 115883 117089 119134 122431 126606
63637 126606 130776 134622 138703 143562 149138 155264 162130 169821 177959 186382 195848 207381 221038 235859
63623 235859 251104 267040 284362 303189 322927 342947 363002 382858 401648 417863 430168
63612 430168 438185 442452 443704 442402 438860 433626 427668 422265 418487 416470 415196 413289 409987 405136
63598 405136 398436 389381 378021 365183 351589 337223 321942 306331 291392 277677 265196 254003
63586 254003 244392 236541 230396 225848 222615 219994 217240 214387 212417 212448 214875 219262 224763 230658 236770
63571 236770 243471 251063 259169 266997 274275 281584 289776 299391 310695 323704 337886 352331 366773
$$ packed form
63670A17751J507P62M2m74p62q24p77q99j300j595j363q39o80j042j397j330r90
63653A05790o73m11j67N9M62J267K175K469J949J216Q63Q84J206K045L297M175
63637A26606M170L846M081M859N576O126O866P691Q138Q423R466J1533J3657J4821
63623B35859J5245J5936J7322J8827J9738K0020K0055J9856J8790J6215J2305
63612D30168Q017M267J252j302l542n234n958n403l778k017j274j907l302m851
63598D05136o700r055j1360j2838j3594j4366j5281j5611j4939j3715j2481j1193
63586B54003r611p851o145m548l233k621k754k853j970L1K427M387N501N895O112
63571B36770O701P592Q106P828P278P309Q192R615J1304J3009J4182J4445J4442
$$ plain form
63558 366773 382120 399383 418141 436548 452803 466062 475925 481829 483389 480979 475502 467928 459476
63545 459476 451885 446726 444210 443071 441800 439707 436792 433037 428177 421869 413719 403249 390205 374987
63531 374987 358556 341922 325735 310227 295355 281018 267347 254771 243644 233813 224720 215957
63519 215957 207574 199839 192864 186594 181010 176184 172066 168321 164550 160703 157191 154385 152107 149859
63505 149859 147532 145530 144054 142625 140678 138352 136333 135007 134185 133608 133278 133220 133251 133172 132948 132700 132750
63488 132750 133690 135990 139397 143008 146134 148886 151759 154904 157977 160461 161919 162182 161581 160781 160065
63473 160065 158906 156613 153384 150343 148406 147344 146171 144328 142317 141101 141071 141768 142662 143971 146446
63458 146446 150364 155033 159433 163133 166409 169703 173226 177029 181134 185512 190114 195039 200539 206754
$$ packed form
63558C66773J5347J7263J8758J8407J6255J3259R863N904J560k410n477p574q452
63545D59476p591n159k516j139j271k093k915l755m860o308q150j0470j3044j5218
63531C74987j6431j6634j6187j5508j4872j4337j3671j2576j1127r831r093q763
63519B15957q383p735o975o270n584m826m118l745l771l847l512k806k278k248
63505A49859k327k002j476j429j947k326k019j326q22n77l30n8L1p9k24k48N0
63488A32750R40K300L407L611L126K752K873L145L073K484J458K63o01q00p16
63473A60065j159k293l229l041j937j062j173j843k011j216l0O97Q94J309K475
63458A46446L918M669M400L700L276L294L523L803M105M378M602M925N500O215
$$ plain form
63444 206754 213514 220567 227958 236049 245032 254587 264250 274169 285271 298513 314122 331664 350722
63431 350722 371276 393590 418093 445253 475086 506523 537452 565605 589372 607948 621131
63420 621131 629248 633004 633114 630099 624588 617688 610831 605174 601090 598078 595037 590792 584516 575668
63406 575668 563635 547783 528066 505463 481598 457904 435180 413783 394061 376527 361520
63395 361520 348699 337102 326022 315746 307122 300449 295243 291094 288139 286476 285728 285649 286730 289655
63381 289655 294462 300734 308349 317379 327459 337928 348711 360466 373719 388383 404285 421664
63369 421664 440835 461723 483984 507250 530890 553784 574681 592668 607016 616805 621248 620542
63357 620542 616125 609872 603062 596200 589609 583852 579409 576038 572652 567904 560853 551127 538683 523594
$$ packed form
63444B06754O760P053P391Q091Q983R555R663R919J1102J3242J5609J7542J9058
63431C50722K0554K2314K4503K7160K9833L1437L0929K8153K3767J8576J3183
63420F21131Q117L756J10l015n511o900o857n657m084l012l041m245o276q848
63406E75668j2033j5852j9717k2603k3865k3694k2724k1397j9722j7534j5007
63395C61520j2821j1597j1080j0276q624o673n206m149k955j663p48p9J081K925
63381B89655M807O272P615R030J0080J0469J0783J1755J3253J4664J5902J7379
63369D21664J9171K0888K2261K3266K3640K2894K0897J7987J4348R789M443p06
63357F20542m417o253o810o862o591n757m443l371l386m748p051r726j2444j5089
$$ plain form
63343 523594 506049 486408 465254 443407 421785 401089 381632 363530 346958 332137 319135
63332 319135 307864 298213 290054 283071 276731 270506 264161 257854 251990 246921 242774 239539 237149 235286
63318 235286 233266 230550 227432 224806 223064 221636 219845 217790 215958 214444 213135 212406 212852 214338 215945
63303 215945 216955 217341 217161 216121 214045 211363 208759 206614 205003 203899 203148 202545 202168 202304 202791 202851
63287 202851 201928 200374 198873 197477 195694 193412 191197 189702 189199 189681 190996 192749 194364 195410 195729
63272 195729 195323 194403 193502 193210 193658 194473 195289 196053 196842 197701 198756 200213 202114 204317 206801 209682 212774
63255 212774 215551 217874 220483 224357 229657 235609 241297 246316 250765 255135 260195 266554 274099 282214
63241 282214 290732 300346 311777 324830 338641 352656 366912 381464 396083 410704 425687 441378
$$ packed form
63343E23594j7545j9641k1154k1847k1622k0696j9457j8102j6572j4821j3002
63332C19135j1271r651q159o983o340o225o345o307n864n069m147l235k390j863
63318B35286k020k716l118k626j742j428j791k055j832j514j309p29M46J486J607
63303B15945J010L86j80j040k076k682k604k145j611j104p51o03l77J36M87O0
63287B02851r23j554j501j396j783k282k215j495n03M82J315J753J615J046L19
63272A95729m06r20r01k92M48Q15Q16P64P89Q59J055J457J901K203K484K881L092
63255B12774K777K323K609L874N300N952N688N019M449M370N060O359P545Q115
63241B82214Q518R614J1431J3053J3811J4015J4256J4552J4619J4621J4983J5691
$$ plain form
63229 441378 457666 474286 491285 508750 526205 542787 558183 573037 588217 603917 619698
63218 619698 635262 650815 666666 682615 697763 710767 720336 725775 727224 725264 720175 711675 699456
63205 699456 683849 665818 646466 626752 607540 589553 573105 558039 544060 531086 519327
63194 519327 509293 501736 497297 495968 497037 499766 504032 510191 518569 529329 542639 558509 576389
63181 576389 595273 614324 633252 652022 670489 688477 706046 723480 741043 758767 776375
63170 776375 793331 809067 823137 835045 843970 848948 849435 845524 837544 825668 810021 790929 768824
63157 768824 744138 717523 690078 663008 636987 611992 587815 564622 543008 523577 506558
63146 506558 491784 478968 467862 458105 449149 440641 432868 426488 421708 418005 414802 412099 410190
$$ packed form
63229D41378J6288J6620J6999J7465J7455J6582J5396J4854J5180J5700J5781
63218F19698J5564J5553J5851J5949J5148J3004R569N439J449j960n089q500j2219
63205F99456j5607j8031j9352j9714j9212j7987j6448j5066j3979j2974j1759
63194E19327j0034p557m439j329J069K729M266O159Q378J0760J3310J5870J7880
63181E76389J8884J9051J8928J8770J8467J7988J7569J7434J7563J7724J7608
63170G76375J6956J5736J4070J1908Q925M978M87l911p980j1876j5647j9092k2105
63157G68824k4686k6615k7445k7070k6021k4995k4177k3193k1614j9431j7019
63146E06558j4774j2816j1106r757q956q508p773o380m780l703l203k703j909
$$ plain form
63133 410190 408990 408040 407083 406292 405915 405962 406301 406796 407193 407027 405842 403601 400833 398232 396028 393836 391292
63116 391292 388768 387135 386688 386656 386016 384615 383248 382750 383282 384343 385200 385362 384982 384846 385704 387521 389525
63099 389525 391055 392208 393606 395710 398507 401739 405236 408931 412667 416201 419472 422749 426302 430008
63085 430008 433476 436526 439346 442192 445252 448780 453018 457831 462737 467444 472098 476921 481969 487422
63071 487422 493680 500834 508444 516208 524494 533803 543980 554463 565126 576393 588710 602406 617930
63058 617930 635672 655576 677360 701069 726930 754735 783911 814205 845795 878636 912193
63047 912193 945868 979269 1012041 1044016 1075667 1107882 1141014 1174539 1207832 1240851 1273861
63036 1273861 1306913 1339966 1373104 1406165 1438204 1467452 1491684 1508748 1517277 1517230 1509477 1494587
$$ packed form
63133D10190j200r50r57p91l77M7L39M95L97j66j185k241k768k601k204k192k544
63116C91292k524j633m47l2o40j401j367m98N32J061Q57J62l80j36Q58J817K004
63099C89525J530J153J398K104K797L232L497L695L736L534L271L277L553L706
63085D30008L468L050K820K846L060L528M238M813M906M707M654M823N048N453
63071D87422O258P154P610P764Q286R309J0177J0483J0663J1267J2317J3696J5524
63058F17930J7742J9904K1784K3709K5861K7805K9176L0294L1590L2841L3557
63047I12193L3675L3401L2772L1975L1651L2215L3132L3525L3293L3019L3010
63036A273861L3052L3053L3138L3061L2039K9248K4232J7064Q529m7p753j4890
$$ plain form
63024 1494587 1472277 1442262 1405321 1363301 1318267 1271849 1225175 1179126 1134785 1093704 1057462
63013 1057462 1026722 1000942 979259 961504 948242 940073 937123 939012 945094 954889 968460 986198
63001 986198 1008108 1033478 1061338 1090965 1121787 1153159 1184583 1215973 1247451 1279013 1310560
62990 1310560 1341995 1373019 1402941 1430949 1456411 1478767 1497212 1510610 1517517 1516349 1505920 1486165
62978 1486165 1458081 1422817 1381109 1333735 1281980 1227182 1170155 1111548 1052571 994843 939601
62967 939601 887447 838674 793410 751493 712638 676701 643485 612500 583383 556504 532615
62956 532615 511773 493011 475210 457950 441432 425925 411569 398486 386776 376380 366992 358158
62944 358158 349593 341463 334210 327921 322058 315998 309680 303437 297422 291643 286472 282574 280133 278485
$$ packed form
63024A494587k2310l0015l6941m2020m5034m6418m6674m6049m4341m1081l6242
63013A057462l0740k5780k1683j7755j3262q169k950J889O082R795J3571J7738
63001I86198K1910K5370K7860K9627L0822L1372L1424L1390L1478L1562L1547
62990A310560L1435L1024K9922K8008K5462K2356J8445J3398O907j168j0429j9755
62978A486165k8084l5264m1708m7374n1755n4798n7027n8607n8977n7728n5242
62967I39601n2154m8773m5264m1917l8855l5937l3216l0985k9117k6879k3889
62956E32615k0842j8762j7801j7260j6518j5507j4356j3083j1710j0396r388q834
62944C58158q565q130p253o289n863o060o318o243o015n779n171l898k441j648
$$ plain form
62930 278485 276718 274487 272149 270331 269372 268977 268317 266679 264142 261484 259418 258116 257394 257035 256782 256287
62914 256287 255318 253841 251834 249188 246007 242786 240072 238036 236614 235922 236179 237131 237900 237751 236891 236229
62898 236229 236289 236679 236768 236550 236456 236502 236175 235273 234351 234026 234153 234069 233477 232735 232368 232601 233335 234258 234987 235309
62878 235309 235300 235034 234268 232698 230481 228198 226223 224466 222822 221540 220887 220651 220282 219522 218612 217822 217040
62861 217040 216082 215250 215156 215866 216563 216421 215581 214857 214633 214594 214596 215089 216296 217479 217609 216577 215271 214496 214190
62842 214190 213688 212439 210478 208449 207170 206981 207534 208262 208873 209246 209254 209105 209592 211438 214367 217321 219698
62825 219698 221956 224805 228181 231322 233705 235625 237828 240728 244083 247401 250513 253597 256769 259944
62811 259944 263115 266391 269709 272828 275820 279174 283203 287713 292530 297947 304292 311469 319396 328494
$$ packed form
62930B78485j767k231k338j818r59l95o60j638k537k658k066j302p22l59k53m95
62914B56287r69j477k007k646l181l221k714k036j422o92K57R52P69j49q60o62
62898B36229O0L90Q9k18r4M6l27r02r22l25J27q4n92p42l67K33P34R23P29L22
62878B35309rk66p66j570k217k283j975j757j644j282o53k36l69p60r10p90p82
62861B17040r58q32r4P10O97j42q40p24k24l9KM93J207J183J30j032j306p75l06
62842B14190n02j249j961k029j279j89N53P28O11L73Qj49M87J846K929K954K377
62825B19698K258K849L376L141K383J920K203K900L355L318L112L084L172L175
62811B59944L171L276L318L119K992L354M029M510M817N417O345P177P927R098
$$ plain form
62797 328494 339184 351214 364107 378029 393631 411255 430962 453141 478252 506105 536216
62786 536216 569017 605879 647765 694480 745396 800145 858306 919129 981938 1046223 1110952
62775 1110952 1174272 1234217 1289198 1337537 1377216 1406673 1425464 1433682 1431129 1417551 1393404 1359958
62763 1359958 1318865 1271945 1220987 1167236 1111230 1053473 995043 937218 880857 826583 775313
62752 775313 728065 685250 646432 610732 577308 545769 516425 489976 466633 445796 426788
62741 426788 409564 394384 381103 369286 358740 349484 341373 334216 328149 323426 319911 317161 314942
62728 314942 313392 312729 313051 314273 316049 318001 320322 323803 328901 335129 341855 349325 358235 368608
62714 368608 379923 392319 406851 424336 444657 467434 492739 520835 551744 585569 622974
$$ packed form
62797C28494J0690J2030J2893J3922J5602J7624J9707K2179K5111K7853L0111
62786E36216L2801L6862M1886M6715N0916N4749N8161O0823O2809O4285O4729
62775A110952O3320N9945N4981M8339L9679K9457J8791Q218k553j3578k4147l3446
62763A359958m1093m6920n0958n3751n6006n7757n8430n7825n6361n4274n1270
62752G75313m7248m2815l8818l5700l3424l1539k9344k6449k3343k0837j9008
62741D26788j7224j5180j3281j1817j0546r256q111p157o067m723l515k750k219
62728C14942j550o63L22J222J776J952K321L481N098O228O726P470Q910J0373
62714C68608J1315J2396J4532J7485K0321K2777K5305K8096L0909L3825L7405
$$ plain form
62703 622974 664930 711987 763942 820079 879659 942249 1007568 1074840 1142430 1208342 1270909
62692 1270909 1328574 1379228 1420465 1450645 1469193 1475793 1469953 1451673 1422023 1382664 1335163 1281085
62680 1281085 1222264 1160490 1097155 1033511 970977 910811 853724 800098 750226 703935 660465
62669 660465 619394 581434 547587 517637 490211 464431 440775 420092 402402 386978 373055
62658 373055 360012 347308 334840 323169 312893 303876 295451 287323 279810 273213 267383 262018 257020
62645 257020 252393 248072 244086 240672 237988 235790 233592 231108 228480 226160 224634 224037 223887 223348 222038
62630 222038 220460 219442 219151 218947 218159 216808 215562 215174 215966 217649 219570 221278 222861 224642 226677
62615 226677 228846 231357 234736 239205 244419 249987 255962 262643 270232 278853 288672 299784 312296 326726
$$ packed form
62703F22974M1956M7057N1955N6137N9580O2590O5319O7272O7590O5912O2567
62692A270909N7665N0654M1237L0180J8548O600n840j8280k9650l9359m7501n4078
62680A281085n8821o1774o3335o3644o2534o0166n7087n3626m9872m6291m3470
62669F60465m1071l7960l3847k9950k7426k5780k3656k0683j7690j5424j3923
62658C73055j3043j2704j2468j1671j0276r017q425q128p513o597n830n365m998
62645B57020m627m321l986l414k684k198k198k484k628k320j526n97j50n39j310
62630B22038j578j018k91k04p88j351j246l88P92J683J921J708J583J781K035
62615B26677K169K511L379M469N214N568N975O681P589Q621R819J1112J2512J4430
$$ plain form
62601 326726 343937 364261 387011 411266 436972 464742 494748 526364 558848 591758 624463
62590 624463 655661 683701 707172 725129 737075 742994 743219 738118 727994 713324 694841 673270
62578 673270 649082 622619 594373 565186 536260 508801 483286 459207 435918 413716 393594
62567 393594 375923 360011 345181 331697 320162 310498 302052 294407 287552 281471 276141 271755 268355
62554 268355 265320 261831 257938 254585 252432 251081 249682 247835 245622 243211 240837 238886 237535 236409
62540 236409 234959 233175 231648 230981 231336 232525 234358 236846 240216 244743 250456 257133 264675 273431 283979
62525 283979 296653 311403 327990 346067 365173 385003 405841 428556 454050 482744 514480
62514 514480 548618 584162 620029 655404 689696 722037 750992 774966 792908 804550 810033 809415
$$ packed form
62601C26726J7211K0324K2750K4255K5706K7770L0006L1616L2484L2910L2705
62590F24463L1198K8040K3471J7957J1946N919K25n101j0124j4670j8483k1571
62578F73270k4188k6463k8246k9187k8926k7459k5515k4079k3289k2202k0122
62567C93594j7671j5912j4830j3484j1535r664q446p645o855o081n330m386l400
62554B68355l035l489l893l353k153j351j399j847k213k411k374j951j351j126
62540B36409j450j784j527o67L55J189J833K488L370M527N713O677P542Q756J0548
62525B83979J2674J4750J6587J8077J9106J9830K0838K2715K5494K8694L1736
62514E14480L4138L5544L5867L5375L4292L2341K8955K3974J7942J1642N483o18
$$ plain form
62502 809415 802501 789152 769883 746139 719793 692169 663648 634303 604755 576226 549814 525833
62490 525833 503773 482805 462494 443263 426086 411537 399180 388048 377588 367847 358849 350236
62478 350236 341674 333314 325618 318841 312833 307198 301510 295460 289057 282721 276998 272112 267798 263678
62464 263678 259785 256564 254293 252632 251043 249569 248784 248793 248804 248154 247510 248410 251602 256365 261507 266504
62448 266504 271403 276150 280485 284319 287859 291420 295260 299368 303287 306363 308350 309467 309633 308090
62434 308090 304292 298942 293580 289114 285183 280932 275938 270278 264190 258016 252244 247266 243148 239775
62420 239775 237117 235197 233858 232710 231372 229751 228136 226971 226415 226162 225815 225465 225708 226987 229008
62405 229008 230922 232070 232510 232876 233790 235360 237198 238930 240675 242963 246175 250117 254203 258032 261716
$$ packed form
62502H09415o914j3349j9269k3744k6346k7624k8521k9345k9548k8529k6412k3981
62490E25833k2060k0968k0311j9231j7177j4549j2357j1132j0460r741q998q613
62478C50236q562q360p696o777o008n635n688o050o403o336n723m886m314m120
62464B63678l893l221k271j661j589j474p85RJ1o50o44R00L192M763N142M997
62448B66504M899M747M335L834L540L561L840M108L919L076J987J117J66j543
62434C08090l798n350n362m466l931m251m994n660o088o174n772m978m118l373
62420B39775k658j920j339j148j338j621j615j165n56k53l47l50K43J279K021
62405B29008J914J148M40L66R14J570J838J732J745K288L212L942M086L829L684
$$ plain form
62390 261716 265604 269734 273662 276894 279455 281922 284882 288449 292371 296436 300652 305075 309644 314303
62376 314303 319224 324874 331808 340381 350701 362797 376733 392480 409857 428888 450180 474593
62364 474593 502394 533001 565773 600765 638322 678006 718182 756707 791802 822327 847587
62353 847587 867145 880833 888884 892027 891276 887400 880504 870230 856321 838853 818014 793988 767252
62340 767252 738812 709983 681929 655450 631001 608685 588210 569106 551184 534755 520280
62329 520280 507754 496553 485887 475304 464641 453765 442641 431603 421115 411118 400975 390328
62317 390328 379810 370534 362983 356678 350870 345260 340001 335307 331231 327721 324802 322692 321624 321441
62303 321441 321459 321045 320253 319674 319672 320123 320883 322050 323529 324823 325703 326823 329114 332606 336416 339970 343674
$$ packed form
62390B61716L888M130L928L232K561K467K960L567L922M065M216M423M569M659
62376C14303M921N650O934Q573J0320J2096J3936J5747J7377J9031K1292K4413
62364D74593K7801L0607L2772L4992L7557L9684M0176L8525L5095L0525K5260
62353H47587J9558J3688Q051L143p51l876o896j0274j3909j7468k0839k4026k6736
62340G67252k8440k8829k8054k6479k4449k2316k0475j9104j7922j6429j4475
62329E20280j2526j1201j0666j0583j0663j0876j1124j1038j0488r997j0143j0647
62317C90328j0518r276p551o305n808n610n259m694m076l510k919k110j068j83
62303C21441J8m14p92n79kM51P60J167J479J294Q80J120K291L492L810L554L704
$$ plain form
62286 343674 348038 352633 356496 359406 362112 365247 368617 371855 375278 379579 384930 390979 397738 405870
62272 405870 415861 427293 439295 451637 465062 480584 498707 519413 542729 569008 598606 631414
62260 631414 666958 704835 744689 785545 825471 862241 894284 920842 941556 956331 965500 969607
62248 969607 968966 963733 954211 940530 922087 898086 868942 836547 802895 768953 735134 702202
62236 702202 671095 642317 616080 592704 572293 554351 538315 524201 512157 501707 492224 483988
62224 483988 477891 473976 471015 467755 464034 460464 457594 455722 455016 455432 456640 458214 459735 460805 461425
62209 461425 462408 464836 468845 473335 477120 480028 482644 485488 488813 492799 497404 502185 506694 510980
62195 510980 515394 520016 524625 529161 533842 538819 544036 549478 555270 561430 567733 573916 579887 585609
$$ packed form
62286C43674M364M595L863K910K706L135L370L238L423M301N351O049O759Q132
62272D05870R991J1432J2002J2342J3425J5522J8123K0706K3316K6279K9598L2808
62260F31414L5544L7877L9854M0856L9926L6770L2043K6558K0714J4775R169M107
62248I69607o41n233r522j3681j8443k4001k9144l2395l3652l3942l3819l2932
62236G02202l1107k8778k6237k3376k0411j7942j6036j4114j2044j0450r483q236
62224D83988o097l915k961l260l721l570k870j872p06M16J208J574J521J070O20
62209D61425R83K428M009M490L785K908K616K844L325L986M605M781M509M286
62195E10980M414M622M609M536M681M977N217N442N792O160O303O183N971N722
$$ plain form
62181 585609 590975 595962 600884 606327 612816 620722 630560 643174 659320 679044 701709 726707 753922
62168 753922 783316 814246 845311 874767 900942 922565 939097 950802 958368 962472 963677 962445
62156 962445 958893 952659 943262 930501 914398 895123 873424 850893 829211 809080 790277 772648
62144 772648 756561 742390 730179 719996 712126 706635 703062 700751 699220 698142 697356 697111 697940 700044
62130 700044 703102 706887 711673 717618 723889 728817 730995 730273 727802 725296 724095 724732 727160 731049 735581
62115 735581 739185 740146 737772 732842 726856 721073 716128 712050 708401 704724 701102 698075 695954 694551
62101 694551 693660 693408 693903 694889 696008 697233 698852 701204 704442 708264 711937 714956 717772 721373 726093
62086 726093 731326 736555 742025 748125 754788 761986 770278 780198 791390 802946 814472 826393 839405
$$ packed form
62181E85609N366M987M922N443O489P906R838J2614J6146J9724K2665K4998K7215
62168G53922K9394L0930L1065K9456K6175K1623J6532J1705P566M104J205j232
62156I62445l552o234r397j2761j6103j9275k1699k2531k1682k0131j8803j7629
62144G72648j6087j4171j2211j0183p870n491l573k311j531j078p86k45Q29K104
62130G00044L058L785M786N945O271M928K178p22k471k506j201O37K428L889M532
62115G35581L604R61k374m930n986n783m945m078l649l677l622l027k121j403
62101F94551q91k52M95R86J119J225J619K352L238L822L673L019K816L601M720
62086G26093N233N229N470O100O663P198Q292R920J1192J1556J1526J1921J3012
$$ plain form
62073 839405 853947 870050 887318 905300 924172 944742 967281 990550 1012352 1030852 1045069
62062 1045069 1054556 1059350 1060181 1058074 1053578 1046639 1037105 1024996 1010289 992847 972601 949583 923913
62049 923913 896032 866885 837624 809258 782715 758859 737970 719426 702357 686427 671635
62038 671635 657651 644052 631122 619752 610415 602673 595727 589005 582215 575396 569072 563882 559813
62025 559813 556088 551976 547508 543287 539865 537349 535361 533299 530810 528042 525292 522575 519797 517184
62011 517184 515152 513826 513076 512920 513476 514534 515620 516488 517167 517550 517429 516973 516688 516825 517238 517827 518544
61994 518544 518867 517885 515206 511299 506718 501512 495749 490069 485089 480568 475683 470025 463889 457713 451698
61979 451698 445964 440692 435987 431809 428074 424679 421460 418327 415470 413236 411732 410647 409510 408151
$$ packed form
62073H39405J4542J6103J7268J7982J8872K0570K2539K3269K1802J8500J4217
62062A045069R487M794Q31k107m496o939r534j2109j4707j7442k0246k3018k5670
62049I23913k7881k9147k9261k8366k6543k3856k0889j8544j7069j5930j4792
62038F71635j3984j3599j2930j1370r337p742o946o722o790o819o324n190m069
62025E59813l725m112m468m221l422k516j988k062k489k768k750k717k778k613
62011E17184k032j326p50j56N56J058J086Q68O79L83j21m56k85J37M13N89P17
61994E18544L23r82k679l907m581n206n763n680m980m521m885n658o136o176o015
61979D51698n734n272m705m178l735l395l219l133k857k234j504j085j137j359
$$ plain form
61965 408151 406891 406276 406532 407301 408030 408649 409685 411642 414419 417474 420449 423466 426842 430710 434948
61950 434948 439382 443974 448892 454480 461117 468933 477582 486483 495466 505091 516046 528303 541150
61937 541150 554067 567207 580878 594997 609285 623645 637971 651920 665307 678563 692333
61926 692333 706749 721443 736188 751126 766507 782641 800053 819265 840392 863339 888354
61915 888354 916056 946904 980993 1018353 1059005 1102765 1149379 1198866 1251258 1306025 1362268
61904 1362268 1419642 1478602 1539570 1602301 1666302 1731437 1797752 1864850 1931583 1996198 2056750
61893 2056750 2111671 2160025 2201034 2233491 2256050 2268064 2269625 2260781 2241383 2211890 2173627 2127872
61881 2127872 2075217 2016308 1952747 1886628 1819384 1751608 1683793 1616711 1551070 1487233 1425409
$$ packed form
61965D08151j260o15K56P69P29O19J036J957K777L055K975L017L376L868M238
61950D34948M434M592M918N588O637P816Q649Q901Q983R625J0955J2257J2847
61937E41150J2917J3140J3671J4119J4288J4360J4326J3949J3387J3256J3770
61926F92333J4416J4694J4745J4938J5381J6134J7412J9212K1127K2947K5015
61915H88354K7702L0848L4089L7360M0652M3760M6614M9487N2392N4767N6243
61904A362268N7374N8960O0968O2731O4001O5135O6315O7098O6733O4615O0552
61893B056750N4921M8354M1009L2457K2559J2014J561q844j9398k9493l8263m5755
61881B127872n2655n8909o3561o6119o7244o7776o7815o7082o5641o3837o1824
$$ plain form
61870 1425409 1365945 1309409 1256484 1207668 1162890 1121503 1082798 1046516 1012878 982327 955262
61859 955262 931705 911058 892388 875184 859704 846543 836049 828150 822407 818135 814721 811906
61847 811906 809500 806948 803695 800010 796729 793937 790533 785473 778852 771400 763670 756345 750664 747535
61833 747535 746445 746136 746283 747765 751362 756942 763936 771874 780227 788391 796050 803136 809228 813509 815503
61818 815503 815469 813904 811127 807504 803600 799808 796201 793052 791123 791107 793067 796760 802189 809470 818338
61803 818338 828329 839454 852362 867701 885437 904805 924883 945346 966889 990751 1017644 1047106
61791 1047106 1078106 1110193 1143853 1179872 1218726 1260678 1306114 1355473 1408985 1466685 1528566
61780 1528566 1594526 1664317 1737903 1815894 1899313 1988749 2083917 2184147 2289057 2398555 2512377
$$ packed form
61870A425409n9464n6536n2925m8816m4778m1387l8705l6282l3638l0551k7065
61859I55262k3557k0647j8670j7204j5480j3161j0494p899n743m272l414k815
61847H11906k406k552l253l685l281k792l404n060o621p452p730p325n681l129
61833G47535j090l09J47J482L597N580O994P938Q353Q164P659P086O092M281J994
61818H15503l4j565k777l623l904l792l607l149j929j6J960L693N429P281Q868
61803H18338R991J1125J2908J5339J7736J9368K0078K0463K1543K3862K6893K9462
61791A047106L1000L2087L3660L6019L8854M1952M5436M9359N3512N7700O1881
61780A528566O5960O9791P3586P7991Q3419Q9436R5168J00230J04910J09498J13822
$$ plain form
61769 2512377 2629927 2750483 2873194 2996704 3118888 3236970 3347940 3449099 3538496 3614808
61759 3614808 3676623 3722007 3749016 3756604 3744747 3713864 3664603 3598308 3517224 3424046 3321415
61748 3321415 3211820 3097460 2979886 2860069 2739121 2618730 2500650 2386006 2275280
61739 2275280 2168783 2066858 1969787 1877794 1791045 1709493 1632878 1561052 1494152 1432260 1375013
61728 1375013 1321705 1271629 1224234 1179218 1136643 1096833 1059953 1025890 994498 965612 938688
61717 938688 912943 888165 864928 843550 823328 803375 783830 765536 748698 732665 717014
61706 717014 702061 688132 675038 662572 650902 639977 629065 617418 605194 593251 582156
61695 582156 571824 562096 553240 545712 539563 534174 528538 521897 514331 506767 500257 495104 490731 486336
$$ packed form
61769B512377J17550J20556J22711J23510J22184J18082J10970J01159Q9397P6312
61759C614808O1815M5384K7009P588j1857l0883m9261o6295q1084r3178j02631
61748C321415j09595j14360j17574j19817j20948j20391j18080j14644j10726
61739B275280j06497j01925r7071r1993q6749q1552p6615p1826o6900o1892n7247
61728A375013n3308n0076m7395m5016m2575l9810l6880l4063l1392k8886k6924
61717I38688k5745k4778k3237k1378k0222j9953j9545j8294j6838j6033j5651
61706G17014j4953j3929j3094j2466j1670j0925j0912j1647j2224j1943j1095
61695E82156j0332r728q856p528o149n389n636o641p566p564o510n153m373m395
$$ plain form
61681 486336 481570 476610 471817 467479 463705 460262 456573 452241 447687 443871 441143 438678 435425 431311
61667 431311 427027 422870 418408 413296 407759 402134 396554 391278 386748 382989 379533 376263 373730 372219
61653 372219 371140 369984 369331 370029 371751 373321 374349 375556 377371 379094 379795 379307 377942 375805 372940
61638 372940 369797 367024 364873 363070 361188 358967 356439 353892 351593 349439 347025 344124 340956 337937
61624 337937 335358 333330 331864 330947 330642 331077 332107 333094 333349 332832 332114 331598 331067 330109 328620 326774 324716
61607 324716 322485 320111 317677 315366 313378 311632 309711 307387 305089 303429 302325 301122 299586 298279
61593 298279 297790 298135 299104 300598 302314 303658 304454 305343 306950 309005 310826 312418 314495 317460 320972
61578 320972 324528 328043 331773 335999 340832 346091 351381 356707 362902 370944 380683 390730 399893 408414
$$ packed form
61681D86336m766m960m793m338l774l443l689m332m554l816k728k465l253m114
61667D31311m284m157m462n112n537n625n580n276m530l759l456l270k533j511
61653C72219j079j156o53O98J722J570J028J207J815J723P01m88j365k137k865
61638C72940l143k773k151j803j882k221k528k547k299k154k414k901l168l019
61624C37937k579k028j466r17l05M35J030R87K55n17p18n16n31r58j489j846k058
61607C24716k231k374k434k311j988j746j921k324k298j660j104j203j536j307
61593B98279m89L45R69J494J716J344P96Q89J607K055J821J592K077K965L512
61578C20972L556L515L730M226M833N259N290N326O195Q042R739J0047R163Q521
$$ plain form
61564 408414 417464 427707 438713 449652 460117 470255 480381 490633 500867 510782 520173 529039
61552 529039 537346 544762 550871 555683 559708 563389 566697 569469 571927 574411 576617 577592 576766 574768 572906
61537 572906 571918 571514 571021 570165 569141 568146 567112 565855 564402 563126 562502 562699 563486 564590 566081 568278
61521 568278 571370 575323 580143 586035 593224 601741 611423 622026 633363 645502 658903 674205 691731
61508 691731 711243 732308 754803 779000 805199 833536 864231 897826 934853 975203 1018020
61497 1018020 1062398 1108075 1155271 1203913 1253185 1301794 1348420 1391885 1431189 1465562 1494451
61486 1494451 1517446 1534337 1545267 1550583 1550576 1545528 1536092 1523349 1508431 1492278 1475751 1459584 1444121
61473 1444121 1429383 1415497 1402662 1390616 1378671 1366587 1354916 1344075 1333576 1322679 1311376
$$ packed form
61564D08414R050J0243J1006J0939J0465J0138J0126J0252J0234R915R391Q866
61552E29039Q307P416O109M812M025L681L308K772K458K484K206R75q26j998j862
61537E72906r88m04m93q56j024r95j034j257j453j276o24J97P87J104J491K197
61521E68278L092L953M820N892P189Q517R682J0603J1337J2139J3401J5302J7526
61508F91731J9512K1065K2495K4197K6199K8337L0695L3595L7027M0350M2817
61497A018020M4378M5677M7196M8642M9272M8609M6626M3465L9304L4373K8889
61486A494451K2995J6891J0930N316pn048r436j2743j4918j6153j6527j6167j5463
61473A444121j4738j3886j2835j2046j1945j2084j1671j0841j0499j0897j1303
$$ plain form
61462 1311376 1300086 1288695 1276651 1263935 1251245 1239226 1228144 1218348 1210400 1204465 1200074 1196760
61450 1196760 1194635 1194184 1195805 1199712 1206021 1214804 1226242 1240680 1258294 1278659 1300890 1324102 1347397
61437 1347397 1369460 1388608 1403370 1412916 1417157 1416808 1413200 1407583 1400637 1393008 1385926 1380611 1377221
61424 1377221 1375181 1374518 1376014 1379975 1385804 1393111 1402323 1413585 1425639 1436249 1443166 1444356 1438253
61411 1438253 1424776 1405760 1383569 1359479 1333919 1307864 1283027 1260684 1241066 1223969 1209281
61400 1209281 1196686 1185436 1174869 1164991 1156308 1149174 1143477 1138979 1135802 1134384 1134874 1136797 1139678
61387 1139678 1143897 1150455 1159826 1171516 1185001 1200615 1219178 1241110 1266277 1294396 1325175 1358302
61375 1358302 1393680 1431442 1471359 1512447 1553513 1593895 1633273 1671013 1706166 1737989 1765896
$$ packed form
61462A311376j1290j1391j2044j2716j2690j2019j1082r796p948n935m391l314
61450A196760k125m51J621L907O309Q783J1438J4438J7614K0365K2231K3212K3295
61437A347397K2063J9148J4762R546M241l49l608n617o946p629p082n315l390
61424A377221k040o63J496L961N829P307R212J1262J2054J0610O917J190o103
61411A438253j3477j9016k2191k4090k5560k6055k4837k2343j9618j7097j4688
61400A209281j2595j1250j0567r878q683p134n697m498l177j418M90J923K881
61387A139678M219O558R371J1690J3485J5614J8563K1932K5167K8119L0779L3127
61375A358302L5378L7762L9917M1088M1066M0382L9378L7740L5153L1823K7907
$$ plain form
61364 1765896 1788956 1806025 1816643 1821410 1821232 1816339 1806171 1790174 1768568 1742312 1712365 1679062
61352 1679062 1642346 1602531 1560559 1517531 1474364 1431920 1390974 1351692 1313511 1275982 1239602
61341 1239602 1205508 1174462 1146386 1120711 1096941 1075072 1055718 1039613 1026725 1015999 1006212
61330 1006212 996880 988236 980694 974720 970861 969371 969970 972352 976721 983378 991908 1001349 1011147 1021538
61316 1021538 1032935 1045260 1057973 1070467 1082276 1092986 1102040 1108778 1112973 1115262 1116657 1117502 1117433
61303 1117433 1116481 1115495 1114991 1114242 1112285 1109348 1106426 1103764 1100662 1096665 1092039 1087001 1081346 1075059 1068545
61288 1068545 1062021 1055260 1048172 1041061 1034028 1026732 1019053 1011475 1004421 997642 990694 983670 977062 971155
61274 971155 965975 961670 958524 956533 955229 954033 952738 951595 950810 949959 948083 944556 939722 934495 929633
$$ packed form
61364A765896K3060J7069J0618M767j78m893j0168j5997k1606k6256k9947l3303
61352A679062l6716l9815m1972m3028m3167m2444m0946l9282l8181l7529l6380
61341A239602l4094l1046k8076k5675k3770k1869j9354j6105j2888j0726r787
61330A006212r332q644p542n974l859j490N99K382M369O657Q530R441R798J0391
61316A021538J1397J2325J2713J2494J1809J0710R054O738M195K289J395Q45o9
61303A117433r52r86n04p49j957k937k922k662l102l997m626n038n655o287o514
61288A068545o524o761p088p111p033p296p679p578p054o779o948p024o608n907
61274I71155n180m305l146j991j304j196j295j143p85q51j876l527m834n227m862
$$ plain form
61259 929633 925783 923901 924896 928791 934811 942514 952407 965281 981451 1000864 1023516 1049430 1078492
61246 1078492 1110659 1146081 1184760 1226132 1269004 1311561 1351293 1385387 1411711 1429506 1439120
61235 1439120 1441368 1437262 1427986 1414675 1398251 1379676 1360222 1341214 1323531 1307553 1293611 1282235
61223 1282235 1273905 1268623 1265793 1264406 1263209 1260638 1254795 1243852 1226734 1203448 1174846 1142342 1107897
61210 1107897 1073770 1041745 1012555 986226 962779 942387 925064 910581 898504 887972 877708
61199 877708 866805 855481 844579 834375 824387 814383 804894 796491 789032 781920 774779 767578 760303
61186 760303 752806 744886 736439 727620 718868 710549 702600 694695 686706 678672 670414 661645 652578 644000
61172 644000 636543 630100 624120 618259 612695 608031 604927 603584 603528 604068 604925 606197 607923 610094 612945
$$ packed form
61259I29633l850j882R95L895O020P703R893J2874J6170J9413K2652K5914K9062
61246A078492L2167L5422L8679M1372M2872M2557L9732L4094K6324J7795R614
61235A439120K248m106r276j3311j6424j8575j9454j9008j7683j5978j3942j1376
61223A282235q330n282k830j387j197k571n843j0943j7118k3286k8602l2504l4445
61210A107897l4127l2025k9190k6329k3447k0392j7323j4483j2077j0532j0264
61199H77708j0903j1324j0902j0204r988j0004r489q403p459p112p141p201p275
61186G60303p497p920q447q819q752q319p949p905p989q034q258q769r067q578
61172F44000p457o443n980n861n564m664l104j343n6N40Q57J272J726K171K851
$$ plain form
61157 612945 616681 620818 624221 625906 625457 622761 617852 611216 603758 596237 588972 582082 575642 569530
61143 569530 563539 557732 552332 547252 542158 536984 531939 527038 522136 517431 513280 509502 505536 501418
61129 501418 497970 495710 494237 492917 491582 490284 488977 487864 487516 488256 489831 492007 495014 499112 504100
61114 504100 509536 515008 519997 523989 526864 528638 528709 526189 521297 515588 510337 505371 499955 494043 487984
61099 487984 481749 475229 468839 463056 457724 452383 446938 441524 436190 431232 427330 424770 422982 421323
61085 421323 419739 418213 416353 414217 412839 413025 414249 415623 417284 419811 422822 425378 427453 429876
61071 429876 433037 436714 440969 446079 451612 456712 461362 466458 472534 479362 486845 495366 504957 514864
61057 514864 524218 532681 540447 548100 556409 565664 575333 584891 594695 605405 616945 628865 641400
$$ packed form
61157F12945L736M137L403J685m49k696m909o636p458p521p265o890o440o112
61143E69530n991n807n400n080n094n174n045m901m902m705m151l778l966m118
61129E01418l448k260j473j320j335j298j307j113l48P40J575K176L007M098M988
61114E04100N436N472M989L992K875J774P1k520m892n709n251m966n416n912o059
61099D87984o235o520o390n783n332n341n445n414n334m958l902k560j788j659
61085D21323j584j526j860k136j378J86J224J374J661K527L011K556K075K423
61071D29876L161L677M255N110N533N100M650N096O076O828P483Q521R591R907
61057E14864R354Q463P766P653Q309R255R669R558R804J0710J1540J1920J2535
$$ plain form
61044 641400 655220 670431 686750 704438 724033 745383 767914 791589 816571 842331 868348
61033 868348 895432 925140 958229 995137 1037591 1087877 1146498 1212174 1284081 1362442 1447469
61022 1447469 1540420 1646145 1772337 1926247 2114919 2348725 2640643 3000879 3436802 3960948
61012 3960948 4595890 5370704 6320619 7491905 8923725 10586319 12318451 13847745 14916354
61003 14916354 15421058 15449770 15199985 14876896 14654231 14671753 14995207 15542749 16071326 16282101
60993 16282101 15978261 15148630 13927687 12496472 11011738 9586263 8291000 7158030
60985 7158030 6188525 5368091 4678836 4102207 3619407 3214674 2877051 2597315 2364937
60976 2364937 2169268 2001936 1856752 1728798 1614838 1513259 1422400 1339853 1264094 1195426
$$ packed form
61044F41400J3820J5211J6319J7688J9595K1350K2531K3675K4982K5760K6017
61033H68348K7084K9708L3089L6908M2454N0286N8621O5676P1907P8361Q5027
61022A447469R2951J05725J26192J53910J88672K33806K91918L60236M35923N24146
61012C960948O34942P74814R49915J171286J431820J662594J732132J529294J068609
61003A4916354N04704K8712k49785l23089k22665J7522L23454N47542N28577K10775
60993A6282101l03840q29631j220943j431215j484734j425475j295263j132970
60985G158030r69505q20434o89255n76629m82800m04733l37623k79736k32378
60976B364937j95669j67332j45184j27954j13960j01579r0859q2547p5759o8668
$$ plain form
60966 1195426 1134377 1080228 1031949 989290 951931 918545 887677 858580 830368 801532 771484
60955 771484 741673 714000 688826 665526 644077 624773 607110 590393 575044 561959 550791
60944 550791 540125 529171 518085 506717 494399 481185 468181 456230 445117 434338 423903
60933 423903 414034 404780 396320 389161 383662 379744 377284 376377 376880 377993 378569 377845 375888 373527 371782
60918 371782 371068 370911 370562 369801 368962 368424 368485 369406 371037 372519 372983 372582 372238 372343 372347 371784 371064 370829 371031
60899 371031 371119 370822 370248 369336 367703 365080 361603 357640 353538 349637 346330 343907 342272 340893 339153
60884 339153 336818 334142 331510 329115 327021 325339 324103 323081 321972 320820 320020 319925 320656 322322 325147
60869 325147 329153 333811 338193 341461 343167 343209 341751 339330 336858 335209 334651 334824 335352 336204 337246 337730
$$ packed form
60966A195426o1049n4149m8279m2659l7359l3386l0868k9097k8212k8836l0048
60955G71484k9811k7673k5174k3300k1449j9304j7663j6717j5349j3085j1168
60944E50791j0666j0954j1086j1368j2318j3214j3004j1951j1113j0779j0435
60933D23903r869r254q460p159n499l918k460r07N03J113N76p24j957k361j745
60918C71782p14j57l49p61q39n38O1R21J631J482M64m01l44J05Mn63p20k35K02
60899C71031Q8k97n74r12j633k623l477l963m102l901l307k423j635j379j740
60884C39153k335k676k632k395k094j682j236j022j109j152q00r5P31J666K825
60869C25147M006M658M382L268J706M2j458k421k472j649n58J73N28Q52J042M84
$$ plain form
60853 337730 336834 334758 332732 331700 331399 331049 330567 330659 331870 333958 336168 337839 338781 339295 339772 340165 340017
60836 340017 339094 337704 336169 334337 332009 329536 327496 325911 324286 322351 320271 318136 315760 313077
60822 313077 310356 307851 305490 302993 300068 296519 292469 288455 285010 282130 279405 276671 274205 272335
60808 272335 271186 270768 270975 271454 271819 271954 271861 271322 270152 268714 267700 267377 267442 267572 267622 267428 267011 266966 267908
60789 267908 269486 270689 271361 272552 274966 277815 279783 280571 280869 281340 282281 283885 286105 288429 290336
60774 290336 291839 293185 294329 295185 296108 297510 299151 300403 301159 301934 303134 304667 306287 307849 309228
60759 309228 310340 311230 311876 312086 311899 311822 312201 312564 312169 311102 310295 310402 311157 311822 311785 310723 308663 305993
60741 305993 303053 299730 295794 291529 287488 283727 279881 275999 272644 270000 267557 264971 262689 261338
$$ packed form
60853C37730q96k076k026j032l01l50m82R2J211K088K210J671R42N14M77L93j48
60836C40017r23j390j535j832k328k473k040j585j625j935k080k135k376k683
60822C13077k721k505k361k497k925l549m050m014l445k880k725k734k466j870
60808B72335j149m18K07M79L65J35r3n39j170j438j014l23O5J30N0j94m17m5R42
60789B67908J578J203O72J191K414K849J968P88K98M71R41J604K220K324J907
60774B90336J503J346J144Q56R23J402J641J252P56P75J200J533J620J562J379
60759C09228J112Q90O46K10j87p7L79L63l95j067q07J07P55O65l7j062k060k670
60741C05993k940l323l936m265m041l761l846l882l355k644k443k586k282j351
$$ plain form
60727 261338 260937 261094 261607 262470 263498 264380 265004 265515 266064 266600 266838 266495 265753 265384 266094 267796 269827 271743
60709 271743 273397 274422 274426 273774 273451 273773 273945 273240 272012 271027 270389 269691 268749 267579 265970 263748 261267
60692 261267 259083 257294 255668 254187 252897 251433 249318 246726 244407 242845 241949 241569 241794 242593 243564
60677 243564 244295 244738 245162 245836 246790 247778 248531 249093 249736 250477 251005 251278 251739 252612 253403 253605 253543 253955 255056
60658 255056 256712 259219 263060 267930 272848 277321 281635 285885 289623 292750 295961 299777 303725 306963
60644 306963 309214 310652 311378 311536 311533 311584 311363 310605 309732 309367 309558 309968 310498 311105 311308 310682 309705 309304 309463
60625 309463 309080 307450 305196 303392 302280 301377 300376 299375 298398 297260 295976 294905 294357 294211 294010 293332
60609 293332 292073 290458 288792 287176 285529 283872 282427 281277 280064 278265 275826 273328 271448 270300
$$ packed form
60727B61338m01J57N13Q63J028Q82O24N11N49N36K38l43p42l69P10J702K031J916
60709B71743J654J025Mo52l23L22J72p05j228r85o38o98r42j170j609k222k481
60692B61267k184j789j626j481j290j464k115k592k319j562q96l80K25P99R71
60677B43564P31M43M24O74R54R88P53N62O43P41N28K73M61Q73P91K02o2M12J101
60658B55056J656K507L841M870M918M473M314M250L738L127L211L816L948L238
60644C06963K251J438P26J58lN1k21p58q73l65J91M10N30O07K03o26r77m01J59
60625C09463l83j630k254j804j112r03j001j001r77j138j284j071n48j46k01o78
60609B93332j259j615j666j616j647j657j445j150j213j799k439k498j880j148
$$ plain form
60595 270300 269338 267919 265997 264303 263768 264629 266117 267099 267060 266397 265854 265813 266167 266635 267016 267241 267400 267776
60577 267776 268718 270326 272235 273777 274413 274175 273705 273791 274689 275899 276736 277156 277903 279684 282311 284832 286579
60560 286579 287923 289837 292780 296259 299550 302624 306116 310559 316058 322743 331066 341312 353118 365962
60546 365962 380113 396678 416672 440399 467847 499164 534296 572212 610724 647077 678609
60535 678609 703060 718630 724071 718958 704089 681612 654445 625233 595744 567083 540103 515449
60523 515449 493490 474442 458365 444870 433176 422855 414349 408299 404505 402061 400593 400830 403804
60510 403804 409914 419065 431327 447009 466295 489237 516120 547283 582278 619329 655797 689151
60498 689151 717347 738543 751026 753963 748233 736292 721076 705072 690272 678511 671505 670678
$$ packed form
60595B70300r62j419j922j694n35Q61J488R82l9o63n43m1L54M68L81K25J59L76
60577B67776R42J608J909J542O36k38m70Q6Q98J210Q37M20P47J781K627K521J747
60560B86579J344J914K943L479L291L074L492M443N499O685Q323J0246J1806J2844
60546C65962J4151J6565J9994K3727K7448L1317L5132L7916L8512L6353L1532
60535F78609K4451J5570N441n113j4869k2477k7167k9212k9489k8661k6980k4654
60523E15449k1959j9048j6077j3495j1694j0321q506o050l794k444j468K37K974
60510D03804O110R151J2262J5682J9286K2942K6883L1163L4995L7051L6468L3354
60498F89151K8196K1196J2483K937n730j1941j5216j6004j4800j1761p006q27
$$ plain form
60486 670678 677182 691950 715469 747567 787568 834499 886773 941630 995103 1042619 1079740 1102789
60474 1102789 1109510 1099454 1073704 1034235 983689 925508 863691 801930 742897 688160 638455
60463 638455 593941 554520 520107 490492 464982 442547 422485 404726 389262 375544 362758
60452 362758 350682 339967 331434 325079 319860 314538 308801 303452 299410 296713 294689 292893 291438 290458
60438 290458 289741 289071 288545 288339 288409 288634 288961 289259 289291 289054 288873 288936 289012 288883 288797 289143 289864 290529 290867 290925 290807
60417 290807 290571 290342 290276 290443 290995 292262 294304 296494 297994 298792 299916 302444 306482 311238 315839 319902
60401 319902 323572 327348 331886 337655 344574 351997 359218 366051 372856 379967 387210 394081 400262 405766
60387 405766 410662 415013 419082 423259 427584 431598 434847 437385 439607 441837 444223 446754 449129 450886
$$ packed form
60486F70678O504J4768K3519L2098M0001M6931N2274N4857N3473M7516L7121K3049
60474A102789O721j0056k5750l9469n0546n8181o1817o1761n9033n4737m9705
60463F38455m4514l9421l4413k9615k5510k2435k0062j7759j5464j3718j2786
60452C62758j2076j0715q533o355n219n322n737n349m042k697k024j796j455r80
60438B90458p17o70n26k06P0K25L27K98L2k37j81O3P6j29q6L46P21O65L38N8j18
60417B90807k36k29o6J67N52J267K042K190J500P98J124K528M038M756M601M063
60401C19902L670L776M538N769O919P423P221O833O805P111P243O871O181N504
60387D05766M896M351M069M177M325M014L249K538K222K230K386K531K375J757
$$ plain form
60373 450886 451937 452781 453893 455128 456103 456941 458166 459917 461719 463000 463461 462960 461526 459573 457721
60358 457721 456248 455039 454110 453756 454004 454302 454018 453029 451620 450086 448612 447323 446181 444990 443713 442554
60342 442554 441514 440059 437542 433888 429602 425227 421065 417395 414557 412582 410890 408600 405177 400756
60328 400756 395823 390675 385294 379735 374383 369636 365455 361477 357551 353905 350728 347890 345214 342808
60314 342808 340916 339630 338950 339012 340005 341872 344291 347043 350311 354570 360092 366462 372580 377324 380228
60299 380228 381436 381014 378655 374181 368087 361332 354766 348946 344224 340676 338033 336046 334822 334468 334521
60284 334521 334239 333554 333211 333707 334517 334724 334141 333343 332764 332327 331972 331987 332518 333146 333417 333636 334710 337139
60266 337139 340482 343914 347024 349887 352608 355165 357737 360867 365062 370255 375748 380694 384626 387598
$$ packed form
60373D50886J051Q44J112J235R75Q38J225J751J802J281M61n01j434j953j852
60358D57721j473j209r29l54K48K98k84r89j409j534j474j289j142j191j277j159
60342D42554j040j455k517l654m286m375m162l670k838j975j692k290l423m421
60328D00756m933n148n381n559n352m747m181l978l926l646l177k838k676k406
60314C42808j892j286o80O2R93J867K419K752L268M259N522O370O118M744K904
60299C80228J208m22k359m474o094o755o566n820m722l548k643j987j224l54N3
60284C34521k82o85l43M96Q10K07n83p98n79m37l55J5N31O28K71K19J074K429
60266C37139L343L432L110K863K721K557K572L130M195N193N493M946L932K972
$$ plain form
60252 387598 389912 391820 393459 394934 396322 397560 398561 399519 400967 403379 406821 411159 416524 423306
60238 423306 431676 441319 451696 462401 473258 484341 496027 508841 523080 538695 555635 574151
60226 574151 594586 617039 641485 668103 697252 729111 763529 800226 838944 879409 921317
60215 921317 964356 1008000 1051222 1092631 1131053 1165959 1197246 1224757 1248123 1266983 1281202
60204 1281202 1290915 1296488 1298415 1297136 1292957 1286205 1277450 1267513 1257165 1246962 1237385 1229095 1222915
60191 1222915 1219536 1219349 1222644 1229904 1241745 1258520 1280100 1306146 1336545 1371375 1410438 1452922
60179 1452922 1497671 1543709 1590278 1636321 1680157 1720012 1754953 1785010 1810200 1829559 1841388
60168 1841388 1844413 1838522 1824501 1803420 1776347 1744244 1707929 1668350 1627031 1585866 1546169 1508290
$$ packed form
60252C87598K314J908J639J475J388J238J001R58J448K412L442M338N365O782
60238D23306Q370R643J0377J0705J0857J1083J1686J2814J4239J5615J6940J8516
60226E74151K0435K2453K4446K6618K9149L1859L4418L6697L8718M0465M1908
60215I21317M3039M3644M3222M1409L8422L4906L1287K7511K3366J8860J4219
60204A281202R713N573J927j279m179o752q755r937j0348j0203r577q290o180
60191A222915l379j87L295P260J1841J6775K1580K6046L0399L4830L9063M2484
60179A452922M4749M6038M6569M6043M3836L9855L4941L0057K5190J9359J1829
60168A841388L025n891j4021k1081k7073l2103l6315l9579m1319m1165l9697l7879
$$ plain form
60156 1508290 1472565 1440309 1413198 1391731 1375011 1362194 1353561 1349866 1351166 1356789 1366096 1378735
60144 1378735 1394243 1411836 1430485 1448881 1465455 1478926 1488847 1495338 1498383 1497785 1493744 1486869 1477442
60131 1477442 1465215 1450335 1434145 1418633 1405218 1394407 1386502 1382129 1381950 1386208 1394880 1408196
60119 1408196 1426862 1451673 1483003 1520724 1564626 1614894 1672095 1736675 1808475 1886701 1970299
60108 1970299 2058328 2150030 2244510 2340271 2435123 2526688 2613100 2693136 2765674 2829115 2881461
60097 2881461 2920922 2946471 2957915 2955513 2939601 2910670 2869812 2818824 2759560 2693256 2620841
60086 2620841 2543924 2465014 2386503 2309736 2235311 2164031 2097086 2035451 1979538 1929458 1885280
60075 1885280 1846961 1814341 1787365 1766081 1750291 1739450 1733141 1731478 1734745 1742601 1753775 1766659
$$ packed form
60156A508290l5725l2256k7111k1467j6720j2817q633l695J300N623R307J2639
60144A378735J5508J7593J8649J8396J6574J3471R921O491L045n98m041o875r427
60131A477442j2227j4880j6190j5512j3415j0811p905m373j79M258Q672J3316
60119A408196J8666K4811L1330L7721M3902N0268N7201O4580P1800P8226Q3598
60108A970299Q8029R1702R4480R5761R4852R1565Q6412Q0036P2538O3441N2346
60097B881461L9461K5549J1444k402j5912k8931m0858n0988n9264o6304p2415
60086B620841p6917p8910p8511p6767p4425p1280o6945o1635n5913n0080m4178
60075A885280l8319l2620k6976k1284j5790j0841o309j663L267P856J1174J2884
$$ plain form
60063 1766659 1780122 1793717 1807174 1819873 1830880 1839365 1844813 1846855 1845182 1839698 1830551 1817819
60051 1817819 1801333 1781033 1757396 1731208 1702858 1672093 1638605 1602796 1565924 1529561 1494935
60040 1494935 1462680 1433051 1406260 1382639 1362668 1347033 1336579 1331935 1333150 1339906 1352106 1369975
60028 1369975 1393575 1422684 1457291 1497689 1543640 1593758 1646195 1699630 1753065 1804921 1853064
60017 1853064 1895678 1931533 1959397 1978000 1986821 1986298 1976924 1958643 1931507 1896511 1855354 1809699
60005 1809699 1761106 1711343 1662161 1614746 1569720 1527620 1489068 1454489 1423992 1397683 1376000
59994 1376000 1359732 1349654 1346020 1348392 1356148 1369237 1388234 1413627 1445346 1483134 1527051 1577282
59982 1577282 1633526 1694691 1758989 1824148 1887703 1947398 2001387 2048179 2086744 2116754 2138389
$$ packed form
60063A766659J3463J3595J3457J2699J1007Q485N448K042j673n484r147j2732
60051A817819j6486k0300k3637k6188k8350l0765l3488l5809l6872l6363l4626
60040A494935l2255k9629k6791k3621j9971j5635j0454m644J215O756J2200J7869
60028A369975K3600K9109L4607M0398M5951N0118N2437N3435N3435N1856M8143
60017A853064M2614L5855K7864J8603Q821n23r374j8281k7136l4996m1157m5655
60005A809699m8593m9763m9182m7415m5026m2100l8552l4579l0497k6309k1683
59994A376000j6268j0078l634K372P756J3089J8997K5393L1719L7788M3917N0231
59982A577282N6244O1165O4298O5159O3555N9695N3989M6792L8565L0010K1635
$$ plain form
59971 2138389 2151661 2156158 2151546 2137948 2115699 2085192 2047403 2004193 1957685 1909553 1861221 1814357
59959 1814357 1770627 1731209 1696950 1668666 1646644 1630174 1618331 1611242 1609950 1615065 1626225 1642908
59947 1642908 1664959 1692116 1723664 1758945 1797626 1839043 1881737 1924066 1964975 2003838 2039877
59936 2039877 2072216 2100319 2124052 2143475 2158900 2170971 2180340 2187361 2192315 2195863 2198996 2202715
59924 2202715 2208067 2216379 2229071 2247130 2270948 2300665 2336459 2378406 2426225 2479245 2536619 2597490
59912 2597490 2660898 2725464 2789236 2850022 2905928 2955459 2997154 3029420 3050837 3060495 3057971 3043351
59900 3043351 3017501 2982075 2938887 2889356 2834816 2777202 2718906 2661781 2606546 2553337 2502692
59889 2502692 2455794 2413853 2377391 2346198 2319860 2298280 2281759 2270706 2265375 2265830 2271975 2283458
$$ packed form
59971B138389J3272M497m612j3598k2249l0507l7789m3210m6508m8132m8332m6864
59959A814357m3730l9418l4259k8284k2022j6470j1843p089j292N115J1160J6683
59947A642908K2051K7157L1548L5281L8681M1417M2694M2329M0909L8863L6039
59936B039877L2339K8103K3733J9423J5425J2071R369P021M954L548L133L719
59924B202715N352Q312J2692J8059K3818K9717L5794M1947M7819N3020N7374O0871
59912B597490O3408O4566O3772O0786N5906M9531M1695L2266K1417R658k524j4620
59900C043351k5850l5426m3188m9531n4540n7614n8296n7125n5235n3209n0645
59889B502692m6898m1941l6462l1193k6338k1580j6521j1053n331M55O145J1483
$$ plain form
59877 2283458 2299578 2319407 2342091 2367102 2394199 2423057 2452822 2482076 2509342 2533583 2554095
59866 2554095 2570102 2580776 2585707 2584992 2578704 2566670 2549006 2526458 2499713 2468533 2432105 2390262
59854 2390262 2343954 2294559 2243258 2191289 2140248 2091686 2046578 2005350 1968033 1933985 1901781
59843 1901781 1869956 1837920 1805834 1773852 1742085 1711296 1682919 1657984 1636370 1617417 1600960
59832 1600960 1587373 1576833 1568962 1563200 1559362 1557849 1559382 1564294 1571899 1580813 1590061 1599546 1609226
59819 1609226 1618328 1625956 1632101 1637300 1641437 1643663 1643627 1642015 1639622 1636578 1632851 1628937 1625493 1622642
59805 1622642 1620105 1617695 1615266 1612405 1608707 1604293 1599775 1595736 1592347 1589186 1585235 1579480 1571958 1563982
59791 1563982 1556861 1550589 1544142 1536783 1528578 1519890 1511083 1502793 1495834 1490617 1487072 1485345 1486222 1490638
$$ packed form
59877B283458J6120J9829K2684K5011K7097K8858K9765K9254K7266K4241K0512
59866B554095J6007J0674M931p15o288j2034j7664k2548k6745l1180l6428m1843
59854B390262m6308m9395n1301n1969n1041m8562m5108m1228l7317l4048l2204
59843A901781l1825l2036l2086l1982l1767l0789k8377k4935k1614j8953j6457
59832A600960j3587j0540p871n762l838j513J533M912P605Q914R248R485R680
59819A609226R102P628O145N199M137K226l6j612k393l044l727l914l444k851
59805A622642k537k410k429k861l698m414m518m039l389l161l951n755p522p976
59791A563982p121o272o447p359q205q688q807q290o959n217l545j727Q77M416
$$ plain form
59777 1490638 1499022 1511356 1527718 1548558 1574473 1605890 1643072 1686546 1737408 1796956 1865911
59766 1865911 1944351 2032539 2131279 2240751 2358804 2480437 2598496 2704444 2789119 2844354
59756 2844354 2865316 2851927 2808391 2741549 2659214 2568915 2477050 2388484 2306496 2232918 2168567
59745 2168567 2113807 2068669 2032449 2003670 1980935 1963680 1951818 1945002 1942746 1945004 1951978 1963491
59733 1963491 1979151 1999035 2023527 2052494 2085376 2122260 2164173 2212038 2265925 2325673 2391722
59722 2391722 2464930 2545917 2634954 2732254 2838155 2953215 3078237 3213934 3360374 3516953
59712 3516953 3682815 3856918 4037672 4222924 4410253 4596697 4778153 4949875 5108108
59703 5108108 5251076 5378335 5489814 5585763 5667083 5735236 5792097 5840026 5881585 5918750 5952606
$$ packed form
59777A490638Q384J2334J6362K0840K5915L1417L7182M3474N0862N9548O8955
59766A865911P8440Q8188R8740J09472J18053J21633J18059J05948Q4675N5235
59756B844354K0962j3389m3536o6842q2335r0299r1865q8566q1988p3578o4351
59745B168567n4760m5138l6220k8779k2735j7255j1862o816k256K258O974J1513
59733A963491J5660J9884K4492K8967L2882L6884M1913M7865N3887N9748O6049
59722B391722P3208Q0987Q9037R7300J05901J15060J25022J35697J46440J56579
59712C516953J65862J74103J80754J85252J87329J86444J81456J71722J58233
59703E108108J42968J27259J11479R5949Q1320O8153N6861M7929M1559L7165L3856
$$ plain form
59692 5952606 5983875 6013207 6040802 6066363 6089816 6111511 6131389 6148653 6162771 6174326 6184335
59681 6184335 6193297 6201608 6210399 6221122 6234529 6250892 6271192 6297390 6331396 6374208 6426083 6487059
59669 6487059 6557273 6637061 6726742 6826051 6933895 7048915 7169990 7295651 7423141 7548553
59659 7548553 7667921 7777769 7874604 7954446 8013112 8046853 8052672 8028463 7973242 7887547 7773691
59648 7773691 7635507 7477574 7304558 7121323 6933329 6746250 6564959 6393167 6233832
59639 6233832 6088950 5958186 5837861 5721483 5601014 5467939 5314720 5137067 4935563
59630 4935563 4715230 4483696 4249402 4019978 3800742 3594394 3402303 3225619 3064775
59621 3064775 2918778 2786129 2666213 2559006 2463704 2378598 2302187 2233581 2171793 2115579
$$ packed form
59692E952606L1269K9332K7595K5561K3453K1695J9878J7264J4118J1555J0009
59681F184335Q962Q311Q791J0723J3407J6363K0300K6198L4006M2812N1875O0976
59669F487059P0214P9788Q9681R9309J07844J15020J21075J25661J27490J25412
59659G548553J19368J09848R6835P9842N8666L3741N819k4209n5221q5695j13856
59648G773691j38184j57933j73016j83235j87994j87079j81291j71792j59335
59639F233832j44882j30764j20325j16378j20469j33075j53219j77653k01504
59630D935563k20333k31534k34294k29424k19236k06348j92091j76684j60844
59621C064775j45997j32649j19916j07207r5302q5106p6411o8606o1788n6214
$$ plain form
59611 2115579 2064083 2016928 1973511 1932897 1894553 1858612 1825249 1794368 1765954 1740139 1716745
59600 1716745 1695279 1675457 1657216 1640110 1623289 1606283 1589308 1572671 1556340 1540255 1524646
59589 1524646 1509795 1495730 1482165 1468447 1453744 1437793 1421371 1405553 1390720 1376845 1364395
59578 1364395 1353979 1345142 1336650 1328191 1320835 1315400 1311367 1307992 1305619 1305086 1306416 1308919 1312293 1316948
59564 1316948 1323451 1332164 1343194 1356226 1370557 1385729 1401976 1419737 1438964 1459297 1480696 1503553
59552 1503553 1528318 1555352 1584983 1617360 1652337 1689675 1729267 1771202 1816029 1865005 1919184
59541 1919184 1977293 2034732 2085624 2126501 2158090 2183751 2206595 2228014 2248127 2266734 2283580
59530 2283580 2298106 2309514 2317228 2321077 2320939 2316558 2307957 2295689 2280245 2261464 2239062 2213571
$$ packed form
59611B115579n1496m7155m3417m0614l8344l5941l3363l0881k8414k5815k3394
59600A716745k1466j9822j8241j7106j6821j7006j6975j6637j6331j6085j5609
59589A524646j4851j4065j3565j3718j4703j5951j6422j5818j4833j3875j2450
59578A364395j0416q837q492q459p356n435m033l375k373n33J330K503L374M655
59564A316948O503Q713J1030J3032J4331J5172J6247J7761J9227K0333K1399K2857
59552A503553K4765K7034K9631L2377L4977L7338L9592M1935M4827M8976N4179
59541A919184N8109N7439N0892M0877L1589K5661K2844K1419K0113J8607J6846
59530B283580J4526J1408P714L849j38m381q601j2268j5444j8781k2402k5491
$$ plain form
59518 2213571 2186134 2157454 2127598 2096854 2066077 2035961 2006659 1978538 1952814 1931034 1914162
59507 1914162 1902330 1895122 1892038 1893165 1899597 1912716 1932928 1959686 1992858 2033246 2081319 2136181
59495 2136181 2196389 2261158 2330036 2401863 2474764 2546877 2616390 2681121 2738746 2787340 2825222
59484 2825222 2850606 2862117 2859596 2843891 2816041 2777217 2729300 2674756 2615759 2553881 2490659
59473 2490659 2428055 2368222 2313004 2263560 2220146 2182327 2149712 2122426 2100684 2084198 2072281
59462 2072281 2064243 2059280 2056307 2054386 2053029 2051674 2049255 2044915 2038727 2030858 2020290 2005370 1985582
59449 1985582 1961782 1934624 1903773 1869018 1831143 1791099 1749067 1704948 1659207 1612580 1565453
59438 1565453 1518173 1471655 1426985 1384600 1344352 1306183 1270286 1236716 1205392 1176368 1149707
$$ packed form
59518B213571k7437k8680k9856l0744l0777l0116k9302k8121k5724k1780j6872
59507A914162j1832p208l084J127O432J3119K0212K6758L3172M0388M8073N4862
59495B136181O0208O4769O8878P1827P2901P2113O9513O4731N7625M8594L7882
59484B825222K5384J1511k521j5705k7850l8824m7917n4544n8997o1878o3222
59473B490659o2604n9833n5218m9444m3414l7819l2615k7286k1742j6486j1917
59462B072281q038m963k973j921j357j355k419m340o188p869j0568j4920j9788
59449A985582k3800k7158l0851l4755l7875m0044m2032m4119m5741m6627m7127
59438A565453m7280m6518m4670m2385m0248l8169l5897l3570l1324k9024k6661
$$ plain form
59427 1149707 1125166 1102445 1081719 1063605 1048611 1036884 1028395 1023185 1021659 1024858 1033760 1047374
59415 1047374 1061624 1071174 1072901 1067483 1057807 1046740 1036501 1028900 1025194 1026201 1033168 1047653 1069060
59402 1069060 1092419 1110042 1116327 1110806 1096809 1078276 1058159 1038588 1021100 1006575 995440 987874
59390 987874 983597 981934 982615 986168 992980 1002380 1013354 1025930 1041030 1059039 1079321 1101213 1124779
59377 1124779 1150400 1178317 1208805 1242150 1278189 1316322 1356221 1397960 1441339 1485727 1530905
59366 1530905 1577402 1625646 1675540 1727379 1782543 1842506 1907719 1978224 2054981 2139673 2233338
59355 2233338 2335985 2447437 2567745 2696757 2834086 2979538 3132705 3291707 3452982
59346 3452982 3612815 3768716 3919024 4061742 4194419 4314993 4422242 4515444 4594037 4657646
$$ packed form
59427A149707k4541k2721k0726j8114j4994j1727q489n210j526L199Q902J3614
59415A047374J4250R550J727n418r676j1067j0239p601l706J007O967J4485K1407
59402A069060K3359J7623O285n521j3997j8533k0117j9571j7488j4525j1135p566
59390I87874m277j663O81L553O812R400J0974J2576J5100J8009K0282K1892K3566
59377A124779K5621K7917L0488L3345L6039L8133L9899M1739M3379M4388M5178
59366A530905M6497M8244M9894N1839N5164N9963O5213P0505P6757Q4692R3665
59355B233338J02647J11452J20308J29012J37329J45452J53167J59002J61275
59346C452982J59833J55901J50308J42718J32677J20574J07249R3202P8593O3609
$$ plain form
59336 4657646 4706089 4739233 4757012 4759648 4747546 4720732 4678527 4620057 4545209 4454928 4350602
59325 4350602 4233470 4104933 3967219 3823195 3675369 3525440 3375083 3226785 3083427
59316 3083427 2947046 2818379 2697683 2585649 2483159 2390155 2304922 2224613 2146629 2069760
59306 2069760 1994364 1921690 1853046 1789281 1730762 1677669 1630298 1588943 1553421 1522906 1496415
59295 1496415 1473381 1453598 1436796 1422585 1410711 1400980 1392954 1386117 1380395 1376202 1373862 1373251 1374019
59282 1374019 1375915 1378892 1383136 1388942 1396203 1404168 1412212 1420778 1431009 1443397 1457355 1472085 1487095
59269 1487095 1501792 1515487 1528186 1540493 1552203 1561746 1567707 1570137 1569582 1565531 1556871 1543426 1525977
59256 1525977 1505027 1480674 1453715 1425756 1397862 1369743 1340513 1309726 1277667 1245294 1214057
$$ packed form
59336D657646M8443L3144J7779K636j2102k6814m2205n8470p4848r0281j04326
59325D350602j17132j28537j37714j44024j47826j49929j50357j48298j43358
59316C083427j36381j28667j20696j12034j02490r3004q5233q0309p7984p6869
59306B069760p5396p2674o8644o3765n8519n3093m7371m1355l5522l0515k6491
59295A496415k3034j9783j6802j4211j1874r731q026o837n722m193k340o11P68
59282A374019J896K977M244N806P261P965Q044Q566J0231J2388J3958J4730J5010
59269A487095J4697J3695J2699J2307J1710R543N961K430n55m051q660j3445j7449
59256A525977k0950k4353k6959k7959k7894k8119k9230l0787l2059l2373l1237
$$ plain form
59245 1214057 1185063 1158149 1132256 1106928 1082916 1061080 1041266 1022643 1004788 988031 972975
59234 972975 959978 948999 939770 932077 925823 920797 916632 913310 911499 911897 914345 917990 922286 927373
59220 927373 933573 941083 950127 960835 972887 985891 1000206 1016802 1036165 1057978 1082116 1109243
59208 1109243 1140090 1174814 1213539 1256941 1305674 1359679 1418716 1483225 1554004 1631267 1714638
59197 1714638 1803823 1898552 1997907 2100363 2204473 2308788 2410959 2507651 2595729 2673010
59187 2673010 2737486 2786455 2817148 2828115 2819526 2792344 2747904 2688294 2616436 2535306 2447311
59176 2447311 2354642 2259830 2165483 2073541 1985119 1900940 1821631 1747673 1679428 1617253 1561296
59165 1561296 1511195 1466204 1425651 1389068 1356040 1326323 1300087 1277600 1258665 1242765 1229710
$$ packed form
59245A214057k8994k6914k5893k5328k4012k1836j9814j8623j7855j6757j5056
59234I72975j2997j0979r229p693o254n026m165l322j811L98K448L645M296N087
59220I27373O200P510R044J0708J2052J3004J4315J6596J9363K1813K4138K7127
59208A109243L0847L4724L8725M3402M8733N4005N9037O4509P0779P7263Q3371
59197A714638Q9185R4729R9355J02456J04110J04315J02171R6692Q8078P7281
59187B673010O4476M8969L0693J0967q589k7182m4440n9610p1858q1130q7995
59176B447311r2669r4812r4347r1942q8422q4179p9309p3958o8245o2175n5957
59165A561296n0101m4991m0553l6583l3028k9717k6236k2487j8935j5900j3055
$$ plain form
59154 1229710 1219524 1211516 1204111 1196001 1187015 1177601 1167972 1158201 1148620 1139503 1130641 1121796 1113319 1105807
59140 1105807 1099310 1093411 1087936 1083092 1079015 1075651 1073033 1071345 1070760 1071483 1073701 1077123 1080869 1084251
59126 1084251 1087496 1091299 1095941 1101212 1106790 1112132 1116422 1119395 1121891 1124737 1127341 1128370 1127707 1126637
59112 1126637 1125893 1124600 1121625 1117079 1111909 1106651 1101246 1095650 1089959 1084106 1077875 1071257 1064594 1058394
59098 1058394 1052952 1048015 1043040 1038138 1034463 1032982 1033022 1032863 1031899 1031377 1032813 1036527 1042036 1048901 1056470
59083 1056470 1063601 1069632 1075401 1082489 1091528 1101782 1112208 1122312 1131943 1140890 1148931 1156096 1162647
59070 1162647 1168768 1174220 1178353 1180644 1181198 1180448 1178348 1174273 1167782 1159123 1148810 1137128 1124291 1110656
59056 1110656 1096461 1081672 1066369 1050977 1035776 1020476 1004690 988637 973007 958219 944089
$$ packed form
59154A229710j0186q008p405q110q986r414r629r771r581r117q862q845q477p512
59140A105807o497n899n475m844m077l364k618j688n85P23K218L422L746L382
59126A084251L245L803M642N271N578N342M290K973K496K846K604J029o63j070
59112A126637p44j293k975m546n170n258n405n596n691n853o231o618o663o200
59098A058394n442m937m975m902l675j481M0j59r64n22J436L714N509O865P569
59083A056470P131O031N769P088R039J0254J0426J0104R631Q947Q041P165O551
59070A162647O121N452M133K291N54p50k100m075o491q659j0313j1682j2837j3635
59056A110656j4195j4789j5303j5392j5201j5300j5786j6053j5630j4788j4130
$$ plain form
59045 944089 930108 915842 901172 886380 871938 858062 844553 831139 817865 805086 793276
59034 793276 782847 773888 766007 758693 751887 745972 741154 737171 733607 730189 726760 723382 720469 718379
59020 718379 716821 715114 713034 710838 708449 705335 701493 697800 694999 692932 691176 689778 688809 687769
59006 687769 686122 684102 682402 681339 680807 680750 681106 681557 681862 682279 683292 685143 687972 692066 697478 703736
58990 703736 710414 717737 726177 735794 746455 758388 771932 787065 803704 822116 842384 863798
58978 863798 885513 907512 930066 952490 973426 992357 1009817 1025911 1039564 1049690 1056335 1060211
58966 1060211 1061699 1060835 1057814 1052935 1046336 1038246 1029324 1020309 1011387 1002197 992456 982475 973095 965129
58952 965129 958668 952981 947332 941928 937651 934826 932755 930774 929296 929307 931066 933911 937318 941624 947460
$$ packed form
59045I44089j3981j4266j4670j4792j4442j3876j3509j3414j3274j2779j1810
59034G93276j0429q959p881p314o806n915m818l983l564l418l429l378k913k090
59020G18379j558j707k080k196k389l114l842l693k801k067j756j398r69j040
59006F87769j647k020j700j063n32n7L56M51L05M17J013J851K829M094N412O258
58990G03736O678P323Q440R617J0661J1933J3544J5133J6639J8412K0268K1414
58978H63798K1715K1999K2554K2424K0936J8931J7460J6094J3653J0126O645L876
58966A060211J488q64l021m879o599q090q922r015q922r190r741r981r380p966
58952I65129o461n687n649n404m277k825k071j981j478J1J759K845L407M306N836
$$ plain form
58937 947460 954800 962881 970958 978945 987388 996982 1008126 1020707 1034220 1048149 1062388 1077381 1093853
58924 1093853 1112382 1133129 1155865 1180303 1206511 1235050 1266571 1301296 1339054 1379798 1423728
58913 1423728 1470680 1519616 1568880 1616746 1661580 1701996 1737520 1769059 1798339 1826840 1855523
58902 1855523 1885217 1916637 1950042 1985427 2023175 2064093 2108843 2157750 2211020 2268558 2329689
58891 2329689 2393793 2461225 2532810 2608367 2686629 2766780 2848998 2933060 3017482 3100707 3182152
58880 3182152 3261102 3335356 3402165 3460129 3509271 3549636 3580981 3603727 3619119 3628247 3631559 3629269
58868 3629269 3621421 3607535 3586998 3560030 3527520 3489720 3445816 3395167 3338473 3277362 3213252
58857 3213252 3146957 3078961 3009599 2939050 2867511 2795396 2723249 2651512 2580431 2510181 2441091
$$ packed form
58937I47460P340Q081Q077P987Q443R594J1144J2581J3513J3929J4239J4993J6472
58924A093853J8529K0747K2736K4438K6208K8539L1521L4725L7758M0744M3930
58913A423728M6952M8936M9264M7866M4834M0416L5524L1539K9280K8501K8683
58902A855523K9694L1420L3405L5385L7748M0918M4750M8907N3270N7538O1131
58891B329689O4104O7432P1585P5557P8262Q0151Q2218Q4062Q4422Q3225Q1445
58880C182152P8950P4254O6809N7964M9142M0365L1345K2746J5392R128L312k290
58868C629269p848j3886k0537k6968l2510l7800m3904n0649n6694o1111o4110
58857C213252o6295o7996o9362p0549p1539p2115p2147p1737p1081p0250o9090
$$ plain form
58846 2441091 2373830 2309237 2247850 2189606 2134065 2080858 2029935 1981640 1936666 1895624 1858469
58835 1858469 1824525 1793222 1764480 1738318 1714528 1693048 1674227 1658270 1644772 1633189 1623434
58824 1623434 1615591 1609390 1604523 1601198 1599847 1600485 1602850 1606943 1612931 1620674 1629868 1640441 1652335 1665147
58810 1665147 1678628 1693267 1709746 1727920 1747016 1766733 1787518 1809837 1833933 1860245 1889331
58799 1889331 1921278 1955880 1993490 2035043 2081015 2130994 2184370 2240848 2300117 2361768 2425858
58788 2425858 2492963 2563252 2635959 2710077 2785109 2860731 2936148 3010246 3082149 3151281 3217008
58777 3217008 3278443 3334442 3383636 3424655 3456526 3478683 3490565 3491515 3481268 3460351 3429769 3390407
58765 3390407 3342822 3287521 3225363 3157691 3085946 3011039 2933304 2853251 2772130 2691331 2611426
$$ packed form
58846B441091o7261o4593o1387n8244n5541n3207n0923m8295m4974m1042l7155
58835A858469l3944l1303k8742k6162k3790k1480j8821j5957j3498j1583r755
58824A623434p843o201m867l325j351O38K365M093N988P743R194J0573J1894J2812
58810A665147J3481J4639J6479J8174J9096J9717K0785K2319K4096K6312K9086
58799A889331L1947L4602L7610M1553M5972M9979N3376N6478N9269O1651O4090
58788B425858O7105P0289P2707P4118P5032P5622P5417P4098P1903O9132O5727
58777C217008O1435N5999M9194M1019L1871K2157J1882R50j0247k0917l0582l9362
58765C390407m7585n5301o2158o7672p1745p4907p7735q0053q1121q0799p9905
$$ plain form
58754 2611426 2532284 2454061 2377559 2303563 2232331 2163871 2098285 2035594 1975486 1917511 1861531
58743 1861531 1807984 1757687 1711111 1667638 1625877 1585098 1546027 1509754 1476179 1444242 1413460
58732 1413460 1384342 1357236 1331650 1307089 1283907 1262908 1244508 1228663 1215270 1204337 1195968
58721 1195968 1190358 1187582 1187368 1189322 1193351 1199332 1206234 1211919 1214001 1210672 1200907 1184542 1162383 1135711
58707 1135711 1105498 1072451 1037811 1003377 970432 939155 909477 881945 857172 834868 814060
58696 814060 794299 776179 760646 748066 738104 730379 725106 722961 724255 728423 734528 741926 750014
58683 750014 757426 762157 762691 758686 750533 738757 724055 707444 689990 672576 656141 641825 630512
58670 630512 622232 616196 611468 607704 605323 604830 605867 607131 607429 606530 604637 601413 596187 589024 580908
$$ packed form
58754B611426p9142p8223p6502p3996p1232o8460o5586o2691o0108n7975n5980
58743A861531n3547n0297m6576m3473m1761m0779l9071l6273l3575l1937l0782
58732A413460k9118k7106k5586k4561k3182k0999j8400j5845j3393j0933q369
58721A195968n610k776k14J954M029N981O902N685K082l329r765j6365k2159k6672
58707A135711l0213l3047l4640l4434l2945l1277k9678k7532k4773k2304k0808
58696H14060j9761j8120j5533j2580r962p725n273k145J294M168O105P398Q088
58683G50014P412M731N34m005q153j1776j4702j6611j7454j7414j6435j4316j1313
58670F30512q280o036m728l764k381m93J037J264K98q99j893l224n226p163q116
$$ plain form
58655 580908 572822 565142 557919 551132 544548 537866 531214 525131 519983 515777 512520 510242 508653 507362
58641 507362 506533 506783 508300 510584 513195 516213 519858 524228 529567 536225 544076 552405 560543 568157 574882
58626 574882 580223 584014 586406 587296 586424 584270 582178 581238 581547 582823 585057 588181 591724 595350 599354
58611 599354 604237 610079 616725 624172 632439 641321 650552 659986 669480 679012 688942 699715 711257 723244
58597 723244 736009 750387 766466 783319 800437 818610 838819 860902 883901 907127 930250
58586 930250 952894 974818 996162 1016909 1036491 1054437 1070876 1085802 1098336 1107491 1113382 1116861
58574 1116861 1118229 1117060 1113194 1107126 1099380 1090190 1079892 1069080 1058127 1046916 1035195 1022908
58562 1022908 1010139 996966 983459 969652 955539 941230 927102 913624 900970 888813 876486
$$ packed form
58655E80908q086p680p223o787o584o682o652o083n148m206l257k278j589j291
58641E07362q29K50J517K284K611L018L645M370N339O658P851Q329Q138P614O725
58626E74882N341L791K392Q90q72k154k092r40L09J276K234L124L543L626M004
58611E99354M883N842O646P447Q267Q882R231R434R494R532R930J0773J1542J1987
58597G23244J2765J4378J6079J6853J7118J8173K0209K2083K2999K3226K3123
58586I30250K2644K1924K1344K0747J9582J7946J6439J4926J2534R155N891L479
58574A116861J368j169l866o068p746r190j0298j0812j0953j1211j1721j2287
58562A022908j2769j3173j3507j3807j4113j4309j4128j3478j2654j2157j2327
$$ plain form
58551 876486 863472 849905 836433 823385 810271 796548 782596 769259 756482 743313 729458
58540 729458 716000 704116 693788 684319 675454 667293 659515 651499 643126 634883 627235 620248 613746
58527 613746 607588 601871 597000 593315 590571 588153 585962 584630 584596 585442 586473 587509 588767 590297 591839
58512 591839 592882 592568 590050 585363 579606 573938 568764 564147 560415 557838 556123 554793 553820 553467 553809
58497 553809 554825 556645 559285 562373 565522 568729 572160 575884 580057 584893 590077 594682 598114 600740
58483 600740 603084 604839 605263 604321 602845 601695 601182 601144 601166 600750 599600 597768 595456 592869 590323 588245
58467 588245 586936 586547 587162 588537 589878 590446 590415 590556 591176 592042 593218 594985 596833 597628 597106 596214 595659
58450 595659 595204 594835 595371 597132 599055 600084 600565 601387 602537 603540 604591 606198 608245 610385 612942
$$ packed form
58551H76486j3014j3567j3472j3048j3114j3723j3952j3337j2777j3169j3855
58540G29458j3458j1884j0328r469q865q161p778q016q373q243p648o987o502
58527F13746o158n717m871l685k744k418k191j332l4Q46J031J036J258J530J542
58512E91839J043l14k518m687n757n668n174m617l732k577j715j330r73l53L42
58497E53809J016J820K640L088L149L207L431L724M173M836N184M605L432K626
58483F00740K344J755M24r42j476j150n13l8K2m16j150j832k312k587k546k078
58467E88245j309l89O15J375J341N68l1J41O20Q66J176J767J848P95n22q92n55
58450E95659m55l69N36J761J923J029M81Q22J150J003J051J607K047K140K557
$$ plain form
58435 612942 616421 620503 624407 627943 631437 634949 638310 641596 644907 648058 651105 654686 659152 663913
58421 663913 668359 672855 677998 683457 688460 692979 697590 702525 707614 712723 717559 721617 725091 729196
58407 729196 734691 740734 746222 751524 757673 764443 770703 776365 782523 789623 796784 803129 808753 814158
58393 814158 819547 824854 829816 834053 837687 841666 846782 852536 857710 861904 865811 870218 875441 881492
58379 881492 888044 894468 900620 907296 915222 923897 932231 939943 947539 955279 963090 971158 979746 988585
58365 988585 997209 1005663 1014223 1022856 1031608 1040993 1051176 1061407 1071164 1081183 1092288 1103868 1114785
58352 1114785 1125256 1136440 1148509 1160537 1172156 1183908 1196027 1208180 1220552 1234006 1248905
58341 1248905 1264631 1280349 1295501 1309725 1323115 1336476 1350529 1365028 1379342 1393546 1408143
$$ packed form
58435F12942L479M082L904L536L494L512L361L286L311L151L047L581M466M761
58421F63913M446M496N143N459N003M519M611M935N089N109M836M058L474M105
58407G29196N495O043N488N302O149O770O260N662O158P100P161O345N624N405
58393H14158N389N307M962M237L634L979N116N754N174M194L907M407N223O051
58379H81492O552O424O152O676P926Q675Q334P712P596P740P811Q068Q588Q839
58365I88585Q624Q454Q560Q633Q752R385J0183J0231R757J0019J1105J1580J0917
58352A114785J0471J1184J2069J2028J1619J1752J2119J2153J2372J3454J4899
58341A248905J5726J5718J5152J4224J3390J3361J4053J4499J4314J4204J4597
$$ plain form
58330 1408143 1423196 1438653 1455028 1472716 1491066 1509213 1527451 1546751 1567275 1588428 1609993
58319 1609993 1632145 1654683 1677284 1700148 1723485 1746901 1770245 1794353 1819884 1846211 1872636
58308 1872636 1899842 1928714 1958558 1988098 2017519 2047894 2079210 2110650 2142256 2174588 2207281
58297 2207281 2239716 2272654 2307366 2343482 2379427 2414694 2450099 2486295 2523714 2563329 2605580
58286 2605580 2649092 2692339 2736001 2781697 2829124 2876766 2924882 2975327 3028623 3083669 3140145
58275 3140145 3198802 3259498 3321387 3385074 3452208 3522894 3595783 3670765 3749206 3831499 3916749
58264 3916749 4004971 4097202 4193304 4291964 4393057 4497723 4606086 4717151 4830990 4948743
58254 4948743 5070631 5196287 5326841 5464125 5608007 5757101 5911810 6073969 6243888
$$ packed form
58330A408143J5053J5457J6375J7688J8350J8147J8238J9300K0524K1153K1565
58319A609993K2152K2538K2601K2864K3337K3416K3344K4108K5531K6327K6425
58308A872636K7206K8872K9844K9540K9421L0375L1316L1440L1606L2332L2693
58297B207281L2435L2938L4712L6116L5945L5267L5405L6196L7419L9615M2251
58286B605580M3512M3247M3662M5696M7427M7642M8116N0445N3296N5046N6476
58275C140145N8657O0696O1889O3687O7134P0686P2889P4982P8441Q2293Q5250
58264C916749Q8222R2231R6102R8660J01093J04666J08363J11065J13839J17753
58254D948743J21888J25656J30554J37284J43882J49094J54709J62159J69919
$$ plain form
58245 6243888 6420681 6605244 6799839 7005019 7220049 7445956 7684842 7936623 8199985
58236 8199985 8476221 8768436 9077391 9402078 9744034 10106924 10492230 10899812 11332442
58227 11332442 11795139 12290263 12818096 13381963 13987629 14638111 15334835 16083683 16893802
58218 16893802 17770462 18715340 19733445 20832935 22019018 23296774 24680826 26194400
58210 26194400 27859265 29696080 31734549 34012806 36567651 39438998 42685146 46379884
58202 46379884 50594841 55403903 60909245 67246102 74565857 83045194 92901243 104308320
58194 104308320 117211905 131237150 145868573 160780826 176001500 191762087 208206255
58187 208206255 225183758 242175337 258286580 272319805 282979050 289167303 290240480
$$ packed form
58245F243888J76793J84563J94595K05180K15030K25907K38886K51781K63362
58236H199985K76236K92215L08955L24687L41956L62890L85306M07582M32630
58227A1332442M62697M95124N27833N63867O05666O50482O96724P48848Q10119
58218A6893802Q76660R44878J018105J099490J186083J277756J384052J513574
58210B6194400J664865J836815K038469K278257K554845K871347L246148L694738
58202D6379884M214957M809062N505342O336857P319755Q479337R856049J1407077
58194A04308320J2903585J4025245J4631423J4912253J5220674J5760587J6444168
58187B08206255J6977503J6991579J6111243J4033225J0659245O188253J073177
$$ plain form
58180 290240480 286120299 277264140 264531369 248989456 231720164 213685649 195666651
58173 195666651 178243045 161797330 146544329 132578608 119914321 108508398 98280239
58166 98280239 89133164 80967238 73681650 67178253 61368905 56176828 51531229 47366055
58158 47366055 43624697 40260553 37231491 34497760 32025530 29787450 27758082 25912140
58150 25912140 24227623 22686851 21273713 19973358 18774969 17671168 16653904 15713871
58142 15713871 14843985 14039845 13296222 12606310 11964876 11368960 10814969 10298074 9814947
58133 9814947 9364130 8943224 8548545 8177968 7831203 7506702 7201101 6912322 6640574
58124 6640574 6385550 6145076 5917205 5701342 5496707 5301892 5116516 4941209 4775435
$$ packed form
58180B90240480m120181q856159j2732771j5541913j7269292j8034515j8018998
58173A95666651j7423606j6445715j5253001j3965721j2664287j1405923j0228159
58166I8280239r147075q165926p285588o503397n809348n192077m645599m165174
58158D7366055l741358l364144l029062k733731k472230k238080k029368j845942
58150B5912140j684517j540772j413138j300355j198389j103801j017264r40033
58142A5713871q69886q04140p43623o89912o41434n95916n53991n16895m83127
58133I814947m50817m20906l94679l70577l46765l24501l05601k88779k71748
58124F640574k55024k40474k27871k15863k04635j94815j85376j75307j65774
$$ plain form
58115 4775435 4617356 4466201 4322690 4186718 4056786 3932188 3813682 3701477 3594470
58106 3594470 3491959 3394190 3300773 3210438 3122852 3038937 2958925 2881813 2807061 2735146 2666094
58095 2666094 2599211 2534580 2473117 2414791 2358475 2303836 2251686 2202124 2154025 2106769 2060862
58084 2060862 2016536 1973325 1931284 1890994 1852048 1813156 1774073 1735879 1699112 1663273 1628341
58073 1628341 1595043 1563264 1531936 1500923 1471286 1443292 1415832 1388358 1361699 1336468 1312256
58062 1312256 1288990 1267399 1247502 1228109 1208552 1189429 1171013 1152377 1132838 1112968 1093568
58051 1093568 1074867 1057194 1041021 1025814 1010238 994127 978816 964918 951295 937001 922749
58040 922749 909450 896677 883654 870723 858727 847762 837449 827727 818633 809943 801605 793765
$$ packed form
58115D775435j58079j51155j43511j35972j29932j24598j18506j12205j07007
58106C594470j02511r7769r3417r0335q7586q3915q0012p7112p4752p1915o9052
58095B666094o6883o4631o1463n8326n6316n4639n2150m9562m8099m7256m5907
58084B060862m4326m3211m2041m0290l8946l8892l9083l8194l6767l5839l4932
58073A628341l3298l1779l1328l1013k9637k7994k7460k7474k6659k5231k4212
58062A312256k3266k1591j9897j9393j9557j9123j8416j8636j9539j9870j9400
58051A093568j8701j7673j6173j5207j5576j6111j5311j3898j3623j4294j4252
58040I22749j3299j2773j3023j2931j1996j0965j0313r722r094q690q338p840
$$ plain form
58028 793765 785989 777319 767548 757517 747783 738005 728085 718790 710666 703353 696440 690021 683979 677809
58014 677809 671684 666555 662627 658873 654688 650851 648120 646036 643941 642105 640936 640069 639178 638813 639478
57999 639478 640612 641409 641957 642748 643707 644546 645481 646831 648487 650500 653581 658291 664217 670646 677528 685155
57983 685155 693418 701993 710875 720238 730203 741125 753490 767172 781397 795787 810710 826243
57971 826243 841529 855491 867245 875430 878343 875602 868738 859333 847397 832392 814887 796130
57959 796130 776746 756966 737557 719334 702130 685281 668831 653293 638571 624215 610661
57948 610661 599211 590601 584251 579009 574191 569905 566787 565308 564997 564557 562992 560320 556896 552633
57934 552633 547417 541754 536233 530578 523935 516028 507524 499432 492522 487118 483021 479777 477291 475903
$$ packed form
58028G93765p776q670r771j0031r734r778r920r295q124p313o913o419o042o170
58014F77809o125n129l928l754m185l837k731k084k095j836j169q67q91l65O65
57999F39478J134P97N48P91R59Q39R35J350J656K013L081M710N926O429O882P627
57983F85155Q263Q575Q882R363R965J0922J2365J3682J4225J4390J4923J5533
57971H26243J5286J3962J1754Q185K913k741o864r405j1936j5005j7505j8757
57959G96130j9384j9780j9409j8223j7204j6849j6450j5538j4722j4356j3554
57948F10661j1450q610o350n242m818m286l118j479l11m40j565k672l424m263
57934E52633n216n663n521n655o643p907q504q092o910n404m097l244k486j388
$$ plain form
57920 475903 475707 476345 477875 481231 487140 494978 503248 510867 517465 522872 527059 530391 533177 535083 535523
57905 535523 534553 532757 530264 526406 520495 512668 503933 495551 488207 481537 474571 466808 458690 450936
57891 450936 443800 437157 430853 424664 418296 411827 405746 400212 394629 388419 381884 375830 370645 366197
57877 366197 362378 359194 356537 354368 352993 352669 353040 353437 353702 354345 355852 358167 360854 363496 365923
57862 365923 368221 370620 373260 376006 378424 379908 379998 378789 376884 374666 371784 367761 362925 358149 353796
57847 353796 349585 345465 341832 338719 335618 332398 329723 328169 327649 328067 329743 332607 335680 338090 340150
57832 340150 342779 346258 350178 354233 358379 362466 366335 370111 373850 377053 378969 379209 377713 374418
57818 374418 369474 363613 357831 352763 348586 345234 342357 339383 336094 333060 331173 330954 332465 335583
$$ packed form
57920D75903j96O38J530L356N909P838Q270P619O598N407M187L332K786J906M40
57905E35523r70j796k493l858n911p827q735q382p344o670o966p763q118p754
57891D50936p136o643o304o189o368o469o081n534n583o210o535o054n185m448
57877C66197l819l184k657k169j375l24L71L97K65O43J507K315K687K642K427
57862C65923K298K399K640K746K418J484R0j209j905k218k882m023m836m776m353
57847C53796m211m120l633l113l101l220k675j554n20M18J676K864L073K410K060
57832C40150K629L479L920M055M146M087L869L776L739L203J916K40j496l295
57818C74418m944n861n782n068m177l352k877k974l289l034j887k19J511L118
$$ plain form
57804 335583 339983 345140 350732 356869 363730 371270 379473 388462 398137 408161 418592 429912 441970
57791 441970 453393 462623 469169 473371 475425 475315 473372 470127 465684 459755 452265 443567 434190 424661
57777 424661 415285 405806 395626 384752 374118 364555 355900 347618 339822 332945 326761 320574 314249
57764 314249 308321 303104 298391 294132 290798 288788 287848 287320 286781 286310 286202 286506 286921 287262 287795 288827
57748 288827 290125 291338 292859 295491 299131 302642 305328 307638 309967 311740 312436 312726 313712 315646 318247
57733 318247 321625 325878 330272 333937 337056 340390 343955 347215 350329 354043 358357 362414 365817 369029
57719 369029 372271 375012 376887 378322 379807 381181 382010 382200 381991 381717 381738 382231 382988 383754 384755 386476
57703 386476 388996 392039 395545 399596 403814 407513 410515 413299 416264 419411 422721 426307 430149 434206
$$ packed form
57804C35583M400N157N592O137O861P540Q203Q989R675J0024J0431J1320J2058
57791D41970J1423R230O546M202K054j10j943l245m443n929p490q698r377r529
57777D24661r376r479j0180j0874j0634r563q655q282p796o877o184o187o325
57764C14249n928n217m713m259l334k010r40n28n39m71j08L04M15L41N33J032
57748B88827J298J213J521K632L640L511K686K310K329J773O96K90R86J934K601
57733C18247L378M253M394L665L119L334L565L260L114L714M314M057L403L212
57719C69029L242K741J875J435J485J374Q29J90k09k74K1M93P57P66J001J721
57703C86476K520L043L506M051M218L699L002K784K965L147L310L586L842M057
$$ plain form
57689 434206 438818 444403 450744 457205 463708 470884 479221 488714 499499 512172 527238 544837 565228
57676 565228 589029 616811 648997 686407 730355 782074 842686 913986 998071 1094677 1198155
57665 1198155 1297228 1378386 1430973 1451029 1441889 1411625 1369527 1323848 1280972 1244779 1216211
57654 1216211 1194128 1177129 1164435 1155198 1147841 1140683 1132944 1124745 1116358 1107693 1098291 1087500 1074837
57641 1074837 1060362 1044649 1028289 1011514 994269 976458 958163 939859 922392 906461 892100
57630 892100 878845 866302 854288 842669 831493 821264 812629 805727 800086 795081 790242 785419 781109
57617 781109 778341 777657 778412 779672 781648 785425 791386 798764 806873 815902 826246 837842 850553 864520
57603 864520 879670 895413 911235 927214 943640 960533 977768 995216 1012552 1029331 1045455
$$ packed form
57689D34206M612N585O341O461O503P176Q337R493J0785J2673J5066J7599K0391
57676E65228K3801K7782L2186L7410M3948N1719O0612P1300Q4085R6606J03478
57665A198155R9073Q1158N2587K0056r140l0264m2098m5679m2876l6193k8568
57654A216211k2083j6999j2694r237p357p158p739q199q387q665r402j0791j2663
57641A074837j4475j5713j6360j6775j7245j7811j8295j8304j7467j5931j4361
57630H92100j3255j2543j2014j1619j1176j0229q635o902n641n005m839m823m310
57617G81109k768o84P55J260J976L777N961P378Q109R029J0344J1596J2711J3967
57603H64520J5150J5743J5822J5979J6426J6893J7235J7448J7336J6779J6124
$$ plain form
57592 1045455 1061005 1075415 1087492 1096575 1103077 1107495 1109529 1108646 1104887 1098502 1089258 1076839 1061658
57579 1061658 1044699 1026783 1008430 990140 972204 954398 936329 917993 899667 881539 863880
57568 863880 847270 832090 817952 804123 790428 777303 765112 753931 743883 735092 727275 719932
57556 719932 713036 707132 702582 699101 696180 693716 692001 691263 691360 691860 692350 692765 693376 694418 695801 697324
57540 697324 699030 701169 703803 706627 709194 711267 713058 715227 718513 723166 728742 734591 740453 746473
57526 746473 752815 759543 766849 775056 784178 793581 802299 809877 816970 825038 835329 848052 862568
57513 862568 878229 894811 912153 929780 947165 964325 981879 1000419 1019906 1039720 1059228
57502 1059228 1078198 1096607 1114210 1130582 1145593 1159540 1172569 1184243 1193922 1201373 1206644 1209581
$$ packed form
57592A045455J5550J4410J2077R083O502M418K034q83l759o385r244j2419j5181
57579A061658j6959j7916j8353j8290j7936j7806j8069j8336j8326j8128j7659
57568H63880j6610j5180j4138j3829j3695j3125j2191j1181j0048q791p817p343
57556G19932o896n904m550l481k921k464j715p38R7N00M90M15O11J042J383J523
57540F97324J706K139K634K824K567K073J791K169L286M653N576N849N862O020
57526G46473O342O728P306Q207R122R403Q718P578P093Q068J0291J2723J4516
57513H62568J5661J6582J7342J7627J7385J7160J7554J8540J9487J9814J9508
57502A059228J8970J8409J7603J6372J5011J3947J3029J1674R679P451N271K937
$$ plain form
57490 1209581 1209927 1207867 1203999 1198729 1192098 1184215 1175421 1165931 1155739 1145035 1134332 1124037 1114213
57477 1114213 1104889 1096194 1088032 1080104 1072502 1065895 1060799 1056997 1053965 1051579 1050072 1049603 1050218 1052028
57463 1052028 1055013 1058791 1062942 1067496 1072806 1079061 1086183 1094100 1102887 1112657 1123456 1135173 1147471
57450 1147471 1160061 1173213 1187696 1203901 1221260 1238901 1256707 1275266 1294806 1314621 1333705
57439 1333705 1351653 1368753 1385338 1401238 1415855 1428666 1439531 1448433 1455036 1458749 1459298 1457020
57427 1457020 1452493 1446128 1438235 1429262 1419708 1409861 1399772 1389420 1378804 1368028 1357385 1347228
57415 1347228 1337675 1328636 1320194 1312710 1306406 1301058 1296234 1291595 1286927 1282307 1278458 1276461 1276602 1277871
57401 1277871 1279068 1280156 1281892 1284381 1286801 1288612 1290269 1292437 1295126 1298058 1301327 1305096 1308963 1312268
$$ packed form
57490A209581L46k060l868n270o631p883q794r490j0192j0704j0703j0295r824
57477A114213r324q695q162p928p602o607n096l802l032k386j507m69O15J810
57463A052028K985L778M151M554N310O255P122P917Q787R770J0799J1717J2298
57450A147471J2590J3152J4483J6205J7359J7641J7806J8559J9540J9815J9084
57439A333705J7948J7100J6585J5900J4617J2811J0865Q902O603L713N49k278
57427A457020m527o365p893q973r554r847j0089j0352j0616j0776j0643j0157
57415A347228r553r039q442p484o304n348m824m639m668m620l849j997J41J269
57401A277871J197J088J736K489K420J811J657K168K689K932L269L769L867L305
$$ plain form
57387 1312268 1314985 1317718 1320767 1323774 1326541 1329666 1333921 1339278 1344999 1350561 1355988 1361305 1366284 1370992
57373 1370992 1376169 1382587 1390179 1398116 1405661 1412688 1419497 1426453 1433769 1441290 1448455 1454745 1460270 1465731
57359 1465731 1471775 1478516 1485673 1492963 1500340 1508017 1516232 1524862 1533358 1541267 1548704 1556056 1563466 1570985
57345 1570985 1579038 1588078 1597742 1606946 1615069 1622585 1630274 1638296 1646354 1654357 1662439 1670570 1678555 1686315
57331 1686315 1693873 1701174 1708205 1715181 1722359 1729716 1737013 1744070 1750862 1757499 1764200 1771122 1778074 1784706
57317 1784706 1791150 1798169 1806265 1814926 1823166 1830750 1838359 1846549 1854955 1862797 1869884 1876841 1884375 1892523
57303 1892523 1900713 1908473 1915915 1923487 1931399 1939495 1947638 1955946 1964576 1973469 1982417 1991317 2000257 2009466
57289 2009466 2019149 2029222 2039251 2048863 2058222 2067811 2077681 2087222 2095885 2103859 2111809 2120077 2128338
$$ packed form
57387A312268K717K733L049L007K767L125M255N357N721N562N427N317M979M708
57373A370992N177O418P592P937P545P027O809O956P316P521P165O290N525N461
57359A465731O044O741P157P290P377P677Q215Q630Q496P909P437P352P410P519
57345A570985Q053R040R664R204Q123P516P689Q022Q058Q003Q082Q131P985P760
57331A686315P558P301P031O976P178P357P297P057O792O637O701O922O952O632
57317A784706O444P019Q096Q661Q240P584P609Q190Q406P842P087O957P534Q148
57303A892523Q190P760P442P572P912Q096Q143Q308Q630Q893Q948Q900Q940R209
57289B009466R683J0073J0029R612R359R589R870R541Q663P974P950Q268Q261
$$ plain form
57276 2128338 2135969 2142567 2148129 2152882 2156977 2160371 2163056 2165235 2167132 2168670 2169558 2169633 2168934 2167546 2165644
57261 2165644 2163565 2161525 2159371 2157014 2154952 2153832 2153531 2153259 2152680 2152319 2152658 2153434 2154087 2154361 2154143 2153276
57245 2153276 2151947 2150818 2150290 2150019 2149555 2149048 2148875 2148969 2149052 2149215 2149686 2150299 2150763 2151291 2152376 2154013 2155685
57228 2155685 2157072 2158291 2159493 2160697 2162009 2163486 2164697 2164894 2163827 2162098 2160541 2159435 2158457 2157229
57214 2157229 2155735 2154217 2152727 2150950 2148580 2145809 2143114 2140614 2138063 2135568 2133761 2132900 2132255 2130897
57200 2130897 2128753 2126356 2123808 2120585 2116349 2111478 2106709 2102585 2099246 2096509 2094092 2091910 2090045 2088323
57186 2088323 2086234 2083510 2080534 2077863 2075579 2073321 2070671 2067197 2062553 2056986 2051409 2046449 2041700 2036491
57172 2036491 2031066 2026335 2022656 2019556 2016596 2013766 2011049 2008278 2005584 2003362 2001663 2000107 1998546 1997298
$$ packed form
57276B128338P631O598N562M753M095L394K685K179J897J538Q88P5o99j388j902
57261B165644k079k040k154k357k062j120l01k72n79l61L39P76O53K74k18q67
57245B153276j329j129n28k71m64n07j73R4Q3J63M71O13M64N28J085J637J672
57228B155685J387J219J202J204J312J477J211J97j067j729j557j106r78j228
57214B157229j494j518j490j777k370k771k695k500k551k495j807q61o45j358
57200B130897k144k397k548l223m236m871m769m124l339k737k417k182j865j722
57186B088323k089k724k976k671k284k258k650l474m644n567n577m960m749n209
57172B036491n425m731l679l100k960k830k717k771k694k222j699j556j561j248
$$ plain form
57158 1997298 1996566 1996133 1995794 1995652 1995839 1996357 1997316 1998891 2000908 2002902 2004756 2006926 2009938 2014063 2019464 2026085
57142 2026085 2033232 2039925 2046007 2052402 2059835 2067785 2075262 2082294 2090056 2099560 2110675 2122504 2134365
57129 2134365 2146251 2158525 2171424 2185017 2199630 2216061 2235052 2256590 2280030 2305007 2331998
57118 2331998 2361984 2395771 2433639 2475320 2520284 2568334 2620045 2676404 2738004 2805000 2877990
57107 2877990 2958576 3048840 3150600 3265491 3395538 3543289 3711452 3902640 4119526 4365211
57097 4365211 4643487 4958711 5315203 5716511 6165019 6661863 7206692 7797296 8429598
57088 8429598 9097896 9794820 10510935 11234649 11952606 12650067 13311115 13919128 14457659
57079 14457659 14911276 15266277 15511700 15640445 15649708 15540610 15317855 14989763 14567877 14065794
$$ packed form
57158A997298p32m33l39j42J87N18R59J575K017J994J854K170L012M125N401O621
57142B026085P147O693O082O395P433P950P477P032P762R504J1115J1829J1861
57129B134365J1886J2274J2899J3593J4613J6431J8991K1538K3440K4977K6991
57118B331998K9986L3787L7868M1681M4964M8050N1711N6359O1600O6996P2990
57107B877990Q0586R0264J01760J14891J30047J47751J68163J91188K16886K45685
57097D365211K78276L15224L56492M01308M48508M96844N44829N90604O32302
57088H429598O68298O96924P16115P23714P17957O97461O61048O08013N38531
57079A4457659M53617L55001K45423J28745R263j09098k22755l28092m21886n02083
$$ plain form
57069 14065794 13498140 12880328 12228314 11557497 10881351 10211010 9555743 8923317 8319835
57060 8319835 7749574 7215116 6717464 6256095 5829415 5435679 5073636 4742148 4439232
57051 4439232 4161786 3906536 3671228 3454709 3255934 3073344 2905344 2751039 2610143
57042 2610143 2482370 2367337 2265089 2176289 2101399 2039116 1985064 1932019 1872335 1801380 1719250
57031 1719250 1629459 1536291 1443386 1353779 1269880 1192919 1122872 1059160 1001170 948211 899587
57020 899587 854980 814453 777918 744874 714705 686910 661018 636694 613981 593056 573631
57009 573631 555015 536876 519568 503590 489065 475849 463749 452482 441821 431884 422920 414719
56997 414719 406695 398676 391074 384105 377393 370681 364377 358987 354394 350136 346063 342331 339074 336473
$$ packed form
57069A4065794n67654o17812o52014o70817o76146o70341o55267o32426o03482
57060H319835n70261n34458m97652m61369m26680l93736l62043l31488l02916
57051D439232k77446k55250k35308k16519j98775j82590j68000j54305j40896
57042B610143j27773j15033j02248q8800p4890o2283n4052n3045n9684p0955q2130
57031A719250q9791r3168r2905q9607q3899p6961p0047o3712n7990n2959m8624
57020H99587m4607m0527l6535l3044l0169k7795k5892k4324k2713k0925j9425
57009E73631j8616j8139j7308j5978j4525j3216j2100j1267j0661r937q964q201
56997D14719q024q019p602o969o712o712o304n390m593m258m073l732l257k601
$$ plain form
56983 336473 334853 334241 334061 333578 332423 330332 326798 321530 315048 308269 301594 294863 288102 281703 275871
56968 275871 270443 265486 261622 259453 258859 259103 259563 260196 261370 263443 266575 270779 275884 281329 286181
56953 286181 289629 291459 291867 290931 288569 284961 280590 275850 271001 266579 263317 261392 260131 258795 257378
56938 257378 256413 256270 256934 258232 260038 262495 266241 271983 279500 287326 293742 297852 299474 298518 295066
56923 295066 289801 283682 277155 270079 262397 254449 246637 239112 231828 224642 217513 210860 205500 201803
56909 201803 199033 195979 192198 188227 184703 181851 179817 178859 178902 179317 179481 179337 179229 179452 180155 181427
56893 181427 183234 185467 188263 192128 197426 203829 210497 216813 222746 228483 233914 238653 242447 245347
56879 245347 247420 248460 248119 246293 243261 239535 235723 232485 230386 229663 230200 231788 234337 237979 243059
$$ packed form
56983C36473j620o12j80m83j155k091l534n268o482o779o675o731o761o399n832
56968B75871n428m957l864k169n94K44M60O33J174K073L132M204N105N445M852
56953B86181L448J830M08r36k362l608m371m740m849m422l262j925j261j336j417
56938B57378r65j43O64J298J806K457L746N742P517P826O416M110J622r56l452
56923B95066n265o119o527p076p682p948p812p525p284p186p129o653n360l697
56909B01803k770l054l781l971l524k852k034r58M3M15J64j44j08K23P03J272
56893A81427J807K233K796L865N298O403O668O316N933N737N431M739L794K900
56879B45347K073J040l41j826l032l726l812l238k099p23N37J588K549L642N080
$$ plain form
56864 243059 249918 258435 267939 277902 288634 300812 314290 327764 339649 348843 354637 356628 355102
56851 355102 351036 345383 338742 331928 326129 321920 318688 315762 313725 313888 316834 322320 330384 341524
56837 341524 355663 371813 389093 407413 426802 446552 465410 482190 495870 505406 509886 508863
56825 508863 502468 491392 476817 460123 442533 425111 408929 394799 382919 373162 365826 361634
56813 361634 360903 363190 367975 375247 385086 396993 409999 423189 435790 446856 455218 459781 459843 455301
56799 455301 446706 434974 420922 405198 388646 372402 357403 344001 332193 322012 313531 306783
56787 306783 301955 299406 299104 300255 301954 304198 307800 313095 319079 324077 327099 328164 327368 324137 317724
56772 317724 308245 296778 284428 271737 259144 247423 237085 227654 218223 208756 200254 193527 188370
$$ packed form
56864B43059O859Q517R504R963J0732J2178J3478J3474J1885R194N794J991j526
56851C55102m066n653o641o814n799m209l232k926k037J63K946N486Q064J1140
56837C41524J4139J6150J7280J8320J9389J9750J8858J6780J3680R536M480j023
56825E08863o395j1076j4575j6694j7590j7422j6182j4130j1880r757p336m192
56813C61634p31K287M785P272R839J1907J3006J3190J2601J1066Q362M563O2m542
56799D55301q595j1732j4052j5724j6552j6244j4999j3402j1808j0181q481o748
56787C06783m828k549l02J151J699K244L602N295N984M998L022J065p96l231o413
56772C17724r479j1467j2350j2691j2593j1721j0338r431r431r467q502o727n157
$$ plain form
56759 188370 184139 180508 177322 174246 171137 168441 166570 165077 163041 160201 157167 154501 152157 149958
56745 149958 148034 146439 144763 142501 139656 136637 133755 131155 129084 127822 127302 127123 127036 127159 127557 127872
56729 127872 127607 126749 125843 125451 125686 126335 127242 128392 129728 131052 132133 132791 132864 132333 131558 131185 131570 132354
56711 132354 132824 132648 132041 131305 130527 129812 129398 129271 128967 128114 126990 126180 125809 125565 125378 125578 126276 127110
56693 127110 127822 128619 129691 130810 131836 133240 135532 138366 140779 142375 143783 145851 148804 152337 156158
56678 156158 160171 164287 168317 172033 175287 178102 180604 182805 184556 185754 186440 186588 186110 185342 185150
56663 185150 186097 187650 188751 189078 189216 189642 190238 190886 191915 193597 195679 197691 199385 200629 201231 201147
56647 201147 200541 199477 197868 195904 194123 192808 191660 190272 188566 186613 184504 182601 181397 180750 179807
$$ packed form
56759A88370m231l631l186l076l109k696j871j493k036k840l034k666k344k199
56745A49958j924j595j676k262k845l019k882k600k071j262n20j79q7J23L98L15
56729A27872k65q58r06l92K35O49R07J150J336J324J081O58P3n31p75l73L85P84
56711A32354M70j76o07p36p78p15m14j27l04q53j124q10l71k44j87K00O98Q34
56693A27110P12P97J072J119J026J404K292K834K413J596J408K068K953L533L821
56678A56158M013M116M030L716L254K815K502K201J751J198O86J48m78p68j92
56663A85150R47J553J101L27J38M26N96O48J029J682K082K012J694J244O02q4
56647B01147o06j064j609j964j781j315j148j388j706j953k109j903j204o47r43
$$ plain form
56632 179807 178129 176382 175395 174987 174327 173086 171548 169868 167974 166061 164493 163194 161761 160256 159361
56617 159361 159633 160948 162725 164383 165592 166394 167058 167576 167540 166825 166160 166472 167770 169132 169724 169372 168270
56600 168270 166737 165287 164329 163633 162466 160411 157800 155336 153594 152840 152925 153378 153889 154669 156002 157625
56584 157625 158993 160033 161170 162686 164545 166662 168817 170410 171022 171179 171839 173093 174119 174553 175107
56569 175107 176566 178871 181559 184394 187152 189368 190813 191872 193054 194548 196483 199056 201998 204465
56555 204465 206043 207395 209326 211581 213219 213897 214117 214362 214652 214948 215400 216018 216490 216500 216006 215146 214060
56538 214060 212776 211104 208708 205479 201780 198105 194554 190819 186675 182311 178185 174630 171578 168651
56524 168651 165606 162696 160417 158934 157956 157165 156425 155504 154015 151830 149318 146968 145055 143745 143156
$$ packed form
56632A79807j678j747r87m08o60j241j538j680j894j913j568j299j433j505q95
56617A59361K72J315J777J658J209Q02O64N18l6p15o65L12J298J362N92l52j102
56600A68270j533j450r58o96j167k055k611k464j742p54Q5M53N11P80J333J623
56584A57625J368J040J137J516J859K117K155J593O12J57O60J254J026M34N54
56569A75107J459K305K688K835K758K216J445J059J182J494J935K573K942K467
56555B04465J578J352J931K255J638O78K20K45K90K96M52O18M72J0m94q60j086
56538B14060j284j672k396l229l699l675l551l735m144m364m126l555l052k927
56524A68651l045k910k279j483r78p91p40r21j489k185k512k350j913j310n89
$$ plain form
56509 143156 143063 142974 142812 143114 144177 145329 145558 144681 143418 142506 142174 142361 142894 143417 143576 143448 143503 144083 145116
56490 145116 146287 147284 147862 147940 147681 147328 147019 146905 147282 148285 149521 150350 150553 150491 150597 150945 151380 151839
56472 151839 152482 153575 155252 157208 158766 159457 159579 159995 161347 163525 165832 167533 168352 168641 169058 169926
56456 169926 170981 171823 172414 172902 173159 172878 172056 171019 169951 168811 167789 167416 167911 168658 168707 167734 166316
56439 166316 165261 164923 165186 165869 166867 167940 168635 168707 168492 168616 169249 169884 169970 169528 168967 168499 168002 167378 166701
56420 166701 165999 165163 164241 163609 163678 164438 165443 166261 166911 167742 168865 169863 170216 169959 169632 169555 169463 169021 168416
56401 168416 168131 168307 168686 169137 169870 171040 172407 173502 174028 174063 174055 174563 175810 177376 178586 179285 179999 181192
56383 181192 182628 183780 184711 186070 188183 190555 192520 194103 195824 197820 199623 200878 201863 203087 204602
$$ packed form
56509A43156r3q9j62L02J063J152K29q77j263r12l32J87N33N23J59j28N5N80J033
56490A45116J171R97N78P8k59l53l09j14L77J003J236Q29K03o2J06L48M35M59
56472A51839O43J093J677J956J558O91J22M16J352K178K307J701Q19K89M17Q68
56456A69926J055Q42N91M88K57k81q22j037j068j140j022l73M95P47M9r73j418
56439A66316j055l38K63O83R98J073O95P2k15J24O33O35Q6m42n61m68m97o24o77
56420A66701p02q36r22o32O9P60J005Q18O50Q31J123R98L53k57l27p7r2m42o05
56401A68416k85J76L79M51P33J170J367J095N26L5qN08J247J566J210O99P14J193
56383A81192J436J152R31J359K113K372J965J583J721J996J803J255R85J224J515
$$ plain form
56368 204602 205984 206851 207150 207055 206759 206360 205835 205210 204815 205127 206182 207375 208108 208464 208937 209743 210792 212105
56350 212105 213782 215595 217113 218291 219462 220761 222036 223387 225210 227491 229513 230618 230946 231158 231766
56335 231766 232918 234505 236165 237500 238563 239906 241891 244230 246426 248400 250421 252654 255025 257349
56321 257349 259359 260838 261920 263013 264304 265748 267652 270737 275178 280010 283988 286742 288728 290406
56307 290406 292070 294192 297227 301076 305227 309427 313763 318147 322189 325705 328996 332541 336626 341220
56293 341220 345988 350521 354794 359282 364414 370084 375908 381652 387106 391939 396213 400785 406523 413250
56279 413250 420035 426409 432688 439182 445876 452950 460933 470074 480181 491289 503951 518534 534778
56266 534778 552408 571778 593482 617725 644480 674081 707230 744541 786413 833238 885416
$$ packed form
56368B04602J382Q67K99r5k96l99n25o25l95L12J055J193P33L56M73Q06J049J313
56350B12105J677J813J518J178J171J299J275J351J823K281K022J105L28K12O08
56335B31766J152J587J660J335J063J343J985K339K196J974K021K233K371K324
56321B57349K010J479J082J093J291J444J904L085M441M832L978K754J986J678
56307B90406J664K122L035L849M151M200M336M384M042L516L291L545M085M594
56293C41220M768M533M273M488N132N670N824N744N454M833M274M572N738O727
56279D13250O785O374O279O494O694P074P983R141J0107J1108J2662J4583J6244
56266E34778J7630J9370K1704K4243K6755K9601L3149L7311M1872M6825N2178
$$ plain form
56255 885416 943157 1006399 1074861 1148051 1225295 1305885 1389082 1473942 1559211 1643384 1724651
56244 1724651 1800772 1869310 1928227 1976183 2012281 2035819 2046506 2044730 2031411 2007712 1975023
56233 1975023 1935038 1889484 1839654 1786305 1730025 1671593 1611898 1551597 1491026 1430515 1370633
56222 1370633 1311977 1254878 1199618 1146801 1096967 1049743 1003970 959048 915757 875367 838397
56211 838397 804741 774501 747872 724503 703835 685942 671062 658296 645884 633187 621429
56200 621429 611891 604176 597073 590471 585419 582532 581273 580852 581005 581675 582498 582991 583025 582884 582998 583692 584989
56183 584989 586601 588233 589949 592053 594577 597133 599421 601771 604917 609184 614118 619075 624084 629855
56169 629855 636885 644888 653319 662127 671567 681460 691236 700806 710875 722194 734894 748866 764414
$$ packed form
56255H85416N7741O3242O8462P3190P7244Q0590Q3197Q4860Q5269Q4173Q1267
56244A724651P6121O8538N8917M7956L6098K3538J0687j776j3319k3699l2689
56233A975023l9985m5554m9830n3349n6280n8432n9695o0301o0571o0511n9882
56222A370633n8656n7099n5260n2817m9834m7224m5773m4922m3291m0390l6970
56211H38397l3656l0240k6629k3369k0668j7893j4880j2766j2412j2697j1758
56200F21429r538p715p103o602n052k887j259m21J53O70Q23M93L4j41J14O94J297
56183E84989J612J632J716K104K524K556K288K350L146M267M934M957N009N771
56169F29855P030Q003Q431Q808R440R893R776R570J0069J1319J2700J3972J5548
$$ plain form
56156 764414 782120 802266 824798 849868 878208 911013 949702 995736 1050427 1114783 1189375
56145 1189375 1273981 1366949 1464824 1562780 1655659 1739099 1810519 1869816 1919367 1962947 2003982
56134 2003982 2044098 2082631 2117174 2144733 2162940 2170959 2169912 2162702 2152854 2142609 2131440 2116192
56122 2116192 2092578 2056785 2006567 1942103 1866362 1784192 1700473 1618977 1542636 1473967 1414594
56111 1414594 1364622 1323077 1288836 1260885 1238074 1219399 1204620 1194038 1187471 1183793 1181697 1180594
56099 1180594 1180667 1182338 1185889 1191298 1198095 1205452 1212737 1220072 1228271 1238178 1250088 1263649 1278129 1292793
56085 1292793 1307254 1321653 1336449 1351961 1368153 1384917 1402447 1421144 1441176 1462297 1484099
56074 1484099 1506219 1528286 1550003 1571476 1593238 1615641 1638366 1660806 1682771 1704512 1726218
$$ packed form
56156G64414J7706K0146K2532K5070K8340L2805L8689M6034N4691O4356P4592
56145A189375Q4606R2968R7875R7956R2879Q3440P1420N9297M9551M3580M1035
56134B003982M0116L8533L4543K7559J8207Q019j047p210r848j0245j1169j5248
56122B116192k3614l5793n0218o4464p5741q2170q3719q1496p6341o8669n9373
56111A414594m9972m1545l4241k7951k2811j8675j4779j0582o567l678k096j103
56099A180594P3J671L551N409O797P357P285P335Q199R907J1910J3561J4480J4664
56085A292793J4461J4399J4796J5512J6192J6764J7530J8697K0032K1121K1802
56074A484099K2120K2067K1717K1473K1762K2403K2725K2440K1965K1741K1706
$$ plain form
56063 1726218 1747850 1769517 1791658 1814778 1839217 1865109 1892258 1920115 1948271 1977020 2007049
56052 2007049 2038533 2070993 2104097 2138118 2173394 2209832 2247277 2285882 2325670 2366127 2406763
56041 2406763 2447934 2490657 2535694 2583140 2632728 2684071 2736670 2790211 2844986 2901703 2960809
56030 2960809 3022231 3085832 3151755 3220218 3291238 3364784 3441031 3520225 3602359 3687208 3774739
56019 3774739 3865385 3959754 4058079 4160080 4265454 4374421 4487611 4605515 4728262 4855952
56009 4855952 4988974 5127870 5273117 5425137 5584319 5750891 5924934 6106715 6296906
56000 6296906 6496323 6705528 6924858 7154772 7396084 7649833 7917001 8198350 8494621
55991 8494621 8807059 9137656 9488596 9861418 10257023 10676588 11122212 11596615 12102644
$$ packed form
56063A726218K1632K1667K2141K3120K4439K5892K7149K7857K8156K8749L0029
56052B007049L1484L2460L3104L4021L5276L6438L7445L8605L9788M0457M0636
56041B406763M1171M2723M5037M7446M9588N1343N2599N3541N4775N6717N9106
56030B960809O1422O3601O5923O8463P1020P3546P6247P9194Q2134Q4849Q7531
56019C774739R0646R4369R8325J02001J05374J08967J13190J17904J22747J27690
56009D855952J33022J38896J45247J52020J59182J66572J74043J81781J90191
56000F296906J99417K09205K19330K29914K41312K53749K67168K81349K96271
55991H494621L12438L30597L50940L72822L95605M19565M45624M74403N06029
$$ plain form
55982 12102644 12643385 13222460 13843794 14511218 15228698 16001042 16834376 17736087 18714487
55973 18714487 19778460 20937368 22201618 23583724 25098976 26765328 28603238 30636230
55965 30636230 32891943 35403140 38208680 41354641 44895436 48894853 53427362 58579392
55957 58579392 64449582 71147647 78792399 87508771 97422261 108649685 121286049 135385659
55949 135385659 150932476 167794734 185664137 203990248 221936367 238398526 252124767
55942 252124767 261931376 266952058 266822862 261732505 252335340 239580580 224525126 208178158
55934 208178158 191399459 174853389 159007130 144155619 130457142 117969549 106681991
55927 106681991 96539982 87463646 79360558 72134576 65691654 59943447 54809487 50217987
$$ packed form
55982A2102644N40741N79075O21334O67424P17480P72344Q33334R01711R78400
55973A8714487J063973J158908J264250J382106J515252J666352J837910K032992
55965C0636230K255713K511197K805540L145961L540795L999417M532509N152030
55957E8579392N870190O698065P644752Q716372R913490J1227424J2636364J4099610
55949A35385659J5546817J6862258J7869403J8326111J7946119J6462159J3726241
55942B52124767R806609N020682j29196n090357r397165j2754760j5055454j6346968
55934B08178158j6778699j6546070j5846259j4851511j3698477j2487593j1287558
55927A06681991j0142009r076336q103088p225982o442922n748207n133960m591500
$$ plain form
55919 50217987 46105267 42414743 39096493 36107209 33409428 30970147 28760018 26753450
55911 26753450 24928474 23265836 21748239 20360562 19090160 17926168 16858382 15877037
55903 15877037 14973447 14140294 13371102 12659817 12001067 11390562 10824887 10300951 9815578
55894 9815578 9365253 8945814 8552491 8180739 7827375 7491032 7171619 6869439 6584564
55885 6584564 6316488 6064134 5826360 5602648 5393094 5197474 5014334 4841211 4675746
55876 4675746 4516541 4363181 4215819 4074896 3940924 3814138 3694250 3580686 3473038
55867 3473038 3371049 3274070 3180823 3090090 3001669 2916264 2834356 2755524 2679139 2605312 2534669
55856 2534669 2467374 2402943 2340976 2281457 2224208 2168649 2114455 2061975 2011599 1963111 1916060
$$ packed form
55919E0217987m112720l690524l318250k989284k697781k439281k210129k006568
55911B6753450j824976j662638j517597j387677j270402j163992j067786r81345
55903A5877037r03590q33153p69192p11285o58750o10505n65675n23936m85373
55894I815578m50325m19439l93323l71752l53364l36343l19413l02180k84875
55885F584564k68076k52354k37774k23712k09554j95620j83140j73123j65465
55876D675746j59205j53360j47362j40923j33972j26786j19888j13564j07648
55867C473038j01989r6979r3247r0733q8421q5405q1908p8832p6385p3827p0643
55856B534669o7295o4431o1967n9519n7249n5559n4194n2480n0376m8488m7051
$$ plain form
55845 1916060 1870439 1826439 1783763 1741833 1700624 1660733 1622530 1585711 1549857 1515026 1481580
55834 1481580 1449757 1419635 1391263 1364571 1339278 1315068 1291791 1269397 1247815 1227001 1207041
55823 1207041 1188044 1169942 1152402 1134969 1117436 1100132 1083649 1068062 1052625 1036678 1020795
55812 1020795 1006536 994826 984939 975313 965059 954344 943620 933044 922681 912735 903260 893834
55800 893834 883834 873069 861890 850671 839417 828045 816833 806304 796781 788430 781648 776698
55788 776698 772554 766673 756748 742727 726635 710561 695453 681781 670314 661566 655143 650455 647842
55775 647842 648165 651044 654016 653760 648129 637208 622841 607335 592255 578085 564852 552902 542902
55762 542902 535230 529692 525826 523156 521184 519535 518251 517529 516984 515570 512602 508435 503691 498123 490906
$$ packed form
55845A916060m5621m4000m2676m1930m1209l9891l8203l6819l5854l4831l3446
55834A481580l1823l0122k8372k6692k5293k4210k3277k2394k1582k0814j9960
55823A207041j8997j8102j7540j7433j7533j7304j6483j5587j5437j5947j5883
55812A020795j4259j1710r887r626j0254j0715j0724j0576j0363r946r475r426
55800H93834j0000j0765j1179j1219j1254j1372j1212j0529r523q351o782m950
55788G76698m144n881r925j4021j6092j6074j5108j3672j1467q748o423m688k613
55775F47842L23K879K972k56n631j0921j4367j5506j5080j4170j3233j1950j0000
55762E42902p672n538l866k670j972j649j284p22n45j414k968m167m744n568p217
$$ plain form
55747 490906 481946 472178 462454 452783 442862 432720 422393 411588 400277 389253 379354 370344 361279
55734 361279 351905 342979 335079 327838 320710 313900 308023 303178 298847 294513 289957 285029 279600 273845
55720 273845 268321 263581 259720 256370 253188 250340 248346 247264 246236 244205 241067 237673 234693 231996
55706 231996 229272 226669 224400 222306 220270 218657 217693 216721 214778 211861 208988 206959 205629 204453 203222
55691 203222 202046 201027 200200 199583 199111 198707 198454 198496 198786 199210 199965 201487 203924 206970 210292 213819 217480
55674 217480 220860 223300 224272 223755 222437 221419 221380 222017 222611 223065 223999 225806 228119 230236 231610 231835
55658 231835 230784 229078 227849 227537 227287 226044 223999 222334 221679 221380 220380 218336 215733 213295 211553
55643 211553 210712 210533 210386 209738 208766 208348 209274 211531 214573 218193 222702 228055 233256 237205 239983 242690
$$ packed form
55747D90906q960r768r724r671r921j0142j0327j0805j1311j1024r899r010r065
55734C61279r374q926p900p241p128o810n877m845m331m334m556m928n429n755
55720B73845n524m740l861l350l182k848j994j082j028k031l138l394k980k697
55706B31996k724k603k269k094k036j613r64r72j943k917k873k029j330j176j231
55691B03222j176j019q27o17m72m04k53M2K90M24P55J522K437L046L322L527L661
55674B17480L380K440R72n17j318j018l9O37N94M54R34J807K313K117J374K25
55658B31835j051j706j229l12k50j243k045j665o55k99j000k044k603k438j742
55643B11553q41j79j47o48r72m18R26K257L042L620M509N353N201L949K778K707
$$ plain form
55627 242690 245922 248969 250780 251234 251006 250511 249523 247797 245587 243424 241603 240017 238416 236696 234994
55612 234994 233491 232158 230750 229022 226841 224069 220497 215940 210296 203485 195574 187044 178750 171356
55598 171356 164845 158672 152343 145809 139416 133586 128457 123773 119120 114324 109560 105170 101466 98647
55584 98647 96664 95188 93904 92856 92293 92207 92255 92107 91623 90799 89925 89778 91085 93585 96029 97354 97484
55567 97484 96858 95676 93907 91595 88737 85278 81602 78558 76455 74442 71566 68120 65208 63218 61604
55552 61604 60104 59207 59168 59433 59461 59534 60231 61547 62957 64082 64865 65428 66068 67156 68683 70138 71112 71721
55534 71721 72139 72172 71755 71445 71774 72341 72258 71364 70198 68804 66502 63172 59881 57663 56279 54870 53351
55517 53351 52336 51917 51429 50520 49646 49283 49276 49337 49654 50524 51712 52629 53043 53267 53829 55167 57445 60271
$$ packed form
55627B42690L232L047J811M54k28m95r88j726k210k163j821j586j601j720j702
55612B34994j503j333j408j728k181k772l572m557n644o811p911q530q294p394
55598A71356o511o173o329o534o393n830n129m684m653m796m764m390l704k819
55584I8647j983j476j284j048n63q6M8j48m84q24q74j47J307K500K444J325J30
55567I7484o26j182j769k312k858l459l676l044k103k013k876l446k912j990j614
55552F1604j500q97l9K65K8P3O97J316J410J125P83N63O40J088J527J455R74O09
55534G1721M18L3m17l10L29N67q3q94j166j394k302l330l291k218j384j409j519
55517E3351j015m19m88r09q74l63pO1L17Q70J188R17M14K24N62J338K278K826
$$ plain form
55499 60271 62737 64221 65181 66831 69969 74310 78986 83346 87248 90902 94671 98833 103313 107617 111122
55484 111122 113413 114418 114310 113251 111102 107497 102371 96357 90369 84762 79170 73288 67605 63093
55470 63093 60187 58226 55954 52592 48458 44533 41468 39110 37014 35120 33689 32692 31636 30091 28175
55455 28175 26436 25346 24945 24908 24942 25114 25628 26257 26286 25238 23426 21506 19687 17852 16270 15616 16174
55438 16174 17383 18306 18311 17351 15949 14919 14695 14886 14792 14265 13669 13131 12483 11922 11965 12523 12763 12213 11376
55419 11376 10821 10321 9425 8342 7665 7586 7943 8651 9477 9791 9225 8340 7928 7865 7363 6188 4900 3874
55401 3874 2902 1874 1133 915 977 1089 1384 1938 2469 2850 3548 5094 7190 8724 8779 7493 5893 4879
55383 4879 4429 3895 3015 2298 2258 2667 2959 3097 3489 4196 4810 5109 5287 5421 5232 4584 3798 3245 2990 2966
$$ packed form
55499F0271K466J484R60J650L138M341M676M360L902L654L769M162M480M304L505
55484A11122K291J005j08j059k149l605n126o014n988n607n592n882n683m512
55470F3093k906j961k272l362m134l925l065k358k096j894j431r97j056j545j916
55455B8175j739j090m01l7L4J72N14O29K9j048j812j920j819j835j582o54N58
55438A6174J209R23Nr60j402j030k24J91r4n27n96n38o48n61M3N58K40n50q37
55419A1376n55n00q96j083o77p9L57P08Q26L14n66q85m12o3n02j175j288j026
55401C874r72j028p41k18O2J12K95N54N31L81O98J546K096J534N5j286j600j014
55383D879m50n34q80p17m0M09K92J38L92P07O14K99J78J34j89o48p86n53k55k4
$$ plain form
55363 2966 3143 3328 3157 2521 1643 572 -984 -3072 -5100 -6430 -6977 -6920 -6174 -4749 -3358 -3042 -4042 -5482
55345 -5482 -6338 -6368 -5999 -5584 -5089 -4405 -3666 -3134 -2793 -2253 -1161 330 1704 2616 3119 3291 2973 2018 575
55325 -1070 -2759 -4318 -5448 -5992 -6116 -5978 -5455 -4593 -4009 -4244 -4813 -4662 -3663 -2953 -3430 -4625 -5545 -6012
55307 -6012 -6379 -6434 -5530 -3776 -2147 -1278 -885 -614 -629 -998 -1250 -1171 -1447 -2769 -4709 -6212 -6904 -7146 -7087
55288 -7087 -6567 -5829 -5421 -5272 -4723 -3693 -2915 -2759 -2703 -2421 -2511 -3379 -4167 -3737 -2307 -1147 -865 -903 -699
55269 -699 -443 -436 -446 -89 595 1270 1747 2092 2494 3146 4060 4918 5315 5214 4932 4692 4404 3945 3408 3005 2879
55248 2879 3043 3350 3518 3330 2792 2014 1053 2 -903 -1520 -1925 -2139 -1922 -1168 -315 80 -10 -177 -157 80 600
55227 600 1275 1425 323 -1840 -4037 -5452 -5994 -5807 -4989 -3960 -3400 -3508 -3841 -4173 -4873 -6060 -6979 -6746
$$ packed form
55363B966J77J85j71o36q78E72i84k088k028j330n47N7P46J425J391L16j000j440
55345e482q56l0L69M15M95O84P39N32L41N40J092C30J374R12N03J72l18r55E75
55325a070j689j559j130n44j24J38N23Q62N84k35n69J51R99P10m77j195r20m67
55307f012l67n5R04J754J629Q69L93K71j5l69k52P9k76j322j940j503o92k42N9
55288g087N20P38M08J49N49J030P78J56N6K82r0q68p88M30J430a147K82l8K04
55269f99K56Pj0h9E95O75M77L45M02O52R14Q58L97j01k82k40k88m59n37m03j26
55248B879J64L07J68j88n38p78r61Bi03o17m05k14K17P54c15H0a0j67K0H0N20
55227F00O75J50C23a840k197j415n42J87Q18J029N60j08l33l32p00j187r19K33
$$ plain form
55209 -6746 -5326 -3296 -1064 1098 2587 2684 1352 -615 -2158 -2550 -1717 -389 363 170 -169 362 1764
55192 1764 3108 3699 3636 3341 3053 2798 2477 1873 929 28 -251 315 1540 3159 4855 6052 6216 5454
55174 5454 4450 3701 3178 2736 2341 1727 429 -1444 -2909 -3052 -2110 -1106 -564 -80 868 2209 3521 4601
55156 4601 5494 6193 6556 6456 5839 4760 3547 2807 2930 3586 3910 3384 2394 1822 2172 3194 4251 4893
55138 4893 5087 5081 5124 5221 5105 4467 3248 1716 319 -519 -622 -180 343 632 864 1532 2847 4398 5466
55119 5466 5629 5095 4527 4518 5093 5690 5697 5068 4362 4202 4811 5958 7199 8100 8469 8490 8548 8817 9140 9360 9588
55098 9588 9999 10496 10831 11024 11455 12430 13766 14940 15581 15729 15587 15199 14472 13484 12558 11952 11596 11221 10726
55079 10726 10290 10153 10345 10594 10521 9978 9246 8792 8835 9277 10008 10927 11624 11466 10388 9208 8750 8868 8827
$$ packed form
55209f746J420K030a064A098J489R7j332f15j543l92Q33c89C63A70a69C62J402
55192A764J344N91o3k95k88k55l21o04I29B8b51C15J225J619J696J197J64p62
55174E454j004p49n23m42l95o14D29a444j465j43R42J004N42h0H68J341J312J080
55156D601Q93O99L63j00o17j079j213p40J23O56L24n26r90n72L50J022J057O42
55138D893J94oM3R7j16o38j219j532C19e19j03a80C43K89K32O68J315J551J068
55119E466J63n34n68rN75N97Po29p06j60O09J147J241R01L69K1N8K69L23K20K28
55098I588M11M97L35J93M31R75J336J174O41J48j42l88p27r88r26o06l56l75m95
55079A0726m36j37J92K49p3n43p32m54M3M42P31R19O97j58j078j180m58J18m1
$$ plain form
55060 8827 8393 7900 7367 6313 4662 3143 2445 2535 3139 4308 5945 7229 7234 6029 4577 3649 3341 3584
55042 3584 4411 5525 6172 5931 5412 5775 7535 10051 12151 13128 13094 12568 11909 11177 10453 10030 10223 11049
55024 11049 12168 13091 13400 12918 11845 10698 9929 9589 9451 9459 9834 10647 11450 11642 11205 10810 10975 11321 11010
55005 11010 9920 8995 9150 10144 10886 10704 9959 9386 9254 9330 9398 9616 10390 11964 14069 16042 17461 18584
54987 18584 19979 21758 23465 24668 25336 25583 25450 25076 24779 24732 24801 24799 24682 24343 23574 22507 21782 21961 22880
54968 22880 23846 24371 24450 24231 23683 22613 20877 18598 16249 14410 13383 13137 13588 14563 15459 15388 14075
54951 14075 12358 11440 11791 13102 15027 17426 19928 21847 22756 22950 23153 24008 25866 28759 32355 36078
54935 36078 39563 43032 47200 52746 59820 67905 76094 83544 89760 94509 97573 98662 97608 94605
$$ packed form
55060H827m34m93n33j054j651j519o98R0O04J169J637J284Nj205j452r28l08K43
55042C584Q27J114O47k41n19L63J760K516K100R77l4n26o59p32p24m23J93Q26
55024A1049J119R23L09m82j073j147p69l40j38QL75Q13Q03J92m37l95J65L46l11
55005A1010j090r25J55R94P42j82p45n73j32P6O8K18P74J574K105J973J419J123
54987A8584J395J779J707J203O68K47j33l74k97m7O9kj17l39p69j067p25J79R19
54968B2880R66N25P9k19n48j070j736k279k349j839j027k46M51R75Q96p1j313
54951A4075j717r18L51J311J925K399K502J919R09J94K03Q55J858K893L596L723
54935C6078L485L469M168N546P074Q085Q189P450O216M749L064J089j054l003
$$ plain form
54921 94605 90202 84975 79177 72852 66297 60150 54836 50162 45815 42035 39302 37367 35248 32390
54907 32390 29355 27059 25755 25139 25075 25650 26704 27749 28395 28584 28515 28608 29399 31205 33945 37498 41992
54890 41992 47510 53735 60310 67301 74808 82178 88131 91763 93075 92498 90313 86676 81868 76317 70522
54875 70522 64984 60006 55481 51089 46714 42520 38704 35423 32900 31247 30152 29117 28083 27477 27491
54860 27491 27689 27502 26778 25567 23757 21385 19147 18074 18559 20065 21849 23604 25210 26231 26219 25460
54844 25460 24909 25178 25917 26410 26464 26310 25937 25073 23863 23003 22934 23276 23267 22546 21317 19998 18912 18166 17598
54825 17598 16989 16355 15864 15448 14874 14277 14207 14899 15883 16558 16781 16659 16220 15631 15339 15447 15329 14395 12988
54806 12988 11980 11765 12151 13031 14418 15907 16808 16923 16723 16679 16900 17424 18374 19664 20981 22172 23382
$$ packed form
54921I4605m403n227n798o325o555o147n314m674m347l780k733j935k119k858
54907C2390l035k296j304o16o4N75J054J045O46J89o9R3P91J806K740L553M494
54890D1992N518O225O575O991P507P370N953L632J312n77k185l637m808n551n795
54875G0522n538m978m525m392m375m194l816l281k523j653j095j035j034o06J4
54860B7491J98j87p24j211j810k372k238j073M85J506J784J755J606J021j2p59
54844B5460n51K69P39M93N4j54l73q64j210q60o9L42rp21j229j319j086p46n68
54825A7598o09o34m91m16n74n97p0O92R84O75K23j22m39n89k92J08j18r34j407
54806A2988j008k15L86Q80J387J489R01J15k00m4K21N24R50J290J317J191J210
$$ plain form
54789 23382 24820 26687 29208 32275 35164 37122 38253 39376 41106 43632 47229 52248 58449 65045
54775 65045 71600 78248 84821 90418 94196 96023 96075 94386 91150 86919 82064 76571 70764 65670 62095
54760 62095 59702 57529 55116 52676 50531 48949 48193 48114 47851 46590 44515 42552 41274 40596 40438 41056
54744 41056 42624 44990 47941 51374 55153 59206 63814 69425 76095 83438 91191 99339 107583 115094
54730 115094 121076 125225 127378 127089 123997 118486 111550 103997 96114 88098 80421 73531 67448 61920
54716 61920 56852 52301 48096 43839 39497 35721 33331 32517 32669 32872 32399 30962 28833 26784 25565
54701 25565 25299 25531 25829 26073 26128 25638 24412 22829 21574 21045 21168 21692 22398 23055 23423 23430 23289 23318 23636
54682 23636 24095 24513 24914 25438 26123 26998 28350 30505 33174 35344 36252 36232 36220 36556 36802 36675 36560 36912
$$ packed form
54789B3382J438J867K521L067K889J958J131J123J730K526L597N019O201O596
54775F5045O555O648O573N597L778J827N2j689l236m231m855n493n807n094l575
54760F2095k393k173k413k440k145j582p56p9k63j261k075j963j278o78j58O18
54744D1056J568K366K951L433L779M053M608N611O670P343P753Q148Q244P511
54730A15094N982M149K153k89l092n511o936p553p883q016p677o890o083n528
54716F1920n068m551m205m257m342l776k390q14J52K03m73j437k129k049j219
54701B5565k66K32K98K44N5m90j226j583j255n29J23N24P06O57L68Pj41K9L18
54682B3636M59M18M01N24O85Q75J352K155K669K170R08k0j2L36K46j27j15L52
$$ plain form
54664 36912 37613 38216 38460 38282 37597 36426 35115 34130 33658 33494 33253 32672 31876 31393 31740 32947 34612 36313
54646 36313 37748 38647 39014 39412 40381 41473 41543 40334 39166 39535 41483 43907 46115 48399 51292 54992
54630 54992 59570 65097 71344 77749 83934 89979 96021 101770 106577 109840 111261 110845 108779 105323 100821
54615 100821 95820 90984 86697 82765 78701 74297 69826 65672 61961 58609 55636 53264 51586 50201
54601 50201 48414 45961 43367 41346 39911 38483 36835 35507 35089 35422 35758 35478 34453 32907 31243
54586 31243 29830 28802 28133 27964 28639 30210 32116 33533 33944 33340 32124 30931 30235 29948 29646 29318 29494
54569 29494 30384 31275 31187 29949 28291 27076 26731 27180 27900 28217 27911 27494 27649 28481 29544 30359 30598 30056
54551 30056 28891 27772 27337 27478 27516 27079 26507 26389 26937 27825 28489 28681 28789 29388 30397 31054 31017 30985 31777
$$ packed form
54664C6912P01O03K44j78o85j171j311r85m72j64k41n81p96m83L47J207J665J701
54646C6313J435Q99L67L98R69J092P0j209j168L69J948K424K208K284K893L700
54630E4992M578N527O247O405O185O045O042N749M807L263J421m16k066l456m502
54615A00821n001m836m287l932m064m404m471m154l711l352k973k372j678j385
54601E0201j787k453k594k021j435j428j648j328m18L33L36k80j025j546j664
54586C1243j413j028o69j69O75J571J906J417M11o04j216j193o96k87l02l28J76
54569B9494Q90Q91q8j238j658j215l45M49P20L17l06m17J55Q32J063Q15K39n42
54551C0056j165j119m35J41L8m37n72j18N48Q88O64J92J08N99J009O57l7l2P92
$$ plain form
54532 31777 33218 34528 35509 36553 37646 38166 37873 37442 37772 39141 41189 43311 44999 46177 47344 49055
54516 49055 51286 53610 55876 58171 60186 61267 61208 60421 59162 57221 54599 51902 49645 47643 45519
54501 45519 43367 41504 39849 38083 36225 34648 33624 33120 32940 32833 32589 32226 31971 31894 31749 31345 30851
54484 30851 30567 30573 30774 31081 31372 31519 31649 32096 32879 33517 33657 33590 33778 34158 34327 34293 34518 35219 36054 36542
54464 36542 36480 35899 34997 34201 34033 34694 35970 37556 39282 40885 41905 42046 41504 40729 39908 38880 37579
54447 37579 36351 35729 35987 36967 38233 39343 39999 40155 39994 39737 39457 39131 38854 38800 38919 38888 38508 37989 37628
54428 37628 37380 37026 36658 36632 36993 37310 37249 37070 37267 37848 38222 37860 36966 36389 36886 38453 40417 42112 43339
54409 43339 44208 44845 45443 46340 47661 49032 49987 50612 51378 52290 52720 52249 51271 50430 49792 48963 47853 46843
$$ packed form
54532C1777J441J310R81J044J093N20k93m31L30J369K048K122J688J178J167J711
54516D9055K231K324K266K295K015J081n9p87j259j941k622k697k257k002k124
54501D5519k152j863j655j766j858j577j024n04j80j07k44l63k55p7j45m04m94
54484C0851k84OK01L07K91J47J30M47P83O38J40o7J88L80J69l4K25P01Q35M88
54464C6542o2n81r02p96j68O61J276J586J726J603J020J41n42p75q21j028j301
54447C7579j228o22K58R80J266J110O56J56j61k57k80l26k77n4J19l1l80n19l61
54428C7628k48l54l68k6L61L17o1j79J97N81L74l62q94n77M97J567J964J695J227
54409D3339Q69O37N98Q97J321J371R55O25P66R12M30m71r78q41o38q29j110j010
$$ plain form
54391 46843 46170 45525 44493 43223 42419 42587 43419 44018 43777 42900 42006 41431 41127 41101 41582 42628 43847 44656
54373 44656 44711 44035 42932 41914 41530 42060 43297 44638 45420 45325 44664 44146 44214 44641 44978 45213 45655 46309 46892
54354 46892 47431 48311 49539 50543 50994 51313 51961 52635 52616 51702 50356 49173 48524 48446 48407 47441 45111 42290
54336 42290 40401 39836 39602 38588 36726 34844 33817 33982 34938 35704 35465 34377 33327 32813 32483 31969 31596
54319 31596 31816 32326 32355 31656 30734 30177 30256 31066 32483 33878 34444 34066 33501 33445 33768 33890 33579 33051 32591
54300 32591 32478 32999 34070 34942 34821 33780 32618 31789 31005 30014 29211 29099 29481 29643 29128 28037 26775
54283 26775 25850 25741 26482 27409 27698 27269 26849 27172 28331 29884 31251 31957 31892 31539 31659 32467 33281 33231 32214
54264 32214 30950 30180 30029 30182 30398 30658 30917 31011 30909 30922 31377 32173 32897 33415 34024 34895 35659 35831 35423
$$ packed form
54391D6843o73o45j032j270q04J68Q32N99k41q77q94n75l04k6M81J046J219Q09
54373D4656N5o76j103j018l84N30J237J341P82r5o61n18O8M27L37K35M42O54N83
54354D6892N39Q80J228J004M51L19O48O74j9r14j346j183o49p8l9r66k330k821
54336D2290j889n65k34j014j862j882j027J65R56P66k39j088j050n14l30n14l73
54319C1596K20N10K9o99r22n57P9Q10J417J395N66l78n65n6L23J22l11n28m60
54300C2591j13N21J071Q72j21j041j162q29p84r91q03j12L82J62n15j091j262
54283B6775r25j09P41R27K89m29m20L23J159J553J367P06o5l53J20Q08Q14n0j017
54264C2214j264p70j51J53K16K60K59R4j02J3M55P96P24N18O09Q71P64J72m08
$$ plain form
54245 35423 34860 34472 34340 34428 34474 33931 32523 30829 29846 29837 30018 29512 28293 27048 26418 26554 27135 27668 27908
54226 27908 28051 28393 28929 29574 30569 32051 33316 33330 32219 31441 31959 32961 33097 32392 31971 32227 32363 31852
54208 31852 31285 31356 31772 31798 31400 31183 31397 31587 31199 30121 28596 26982 25743 25346 25922 27049 28020 28341
54190 28341 27984 27256 26523 26044 25912 26076 26331 26322 25707 24533 23471 23454 24779 26625 27735 27697 27318 27630 28748
54171 28748 29929 30521 30550 30475 30705 31346 32087 32302 31560 30171 28935 28279 27892 27299 26438 25467 24342 23019
54153 23019 21887 21538 22116 23219 24485 25930 27544 28894 29425 29105 28515 28260 28433 28680 28598 27978 26852
54136 26852 25609 24945 25345 26516 27587 28020 28031 27988 27789 27182 26421 26068 26246 26566 26803 27159 27770 28412 28859
54117 28859 29192 29545 29849 29999 30008 29846 29378 28641 27951 27612 27685 28101 28689 29016 28618 27635 26869 26981 27852 28923
$$ packed form
54245C5423n63l88j32Q8M6n43j408j694r83rJ81n06j219j245o30J36N81N33K40
54226B7908J43L42N36O45R95J482J265J4j111p78N18J002J36p05m21K56J36n11
54208C1852n67P1M16K6l98k17K14J90l88j078j525j614j239l97N76J127R71L21
54190B8341l57p28p33m79j32J64K55ro15j174j062j7J325J846J110l8l79L12J118
54171B8748J181N92K9p5K30O41P41K15p42j389j236o56l87n93q61r71j125j323
54153B3019j132l49N78J103J266J445J614J350N31l20n90k55J73K47q2o20j126
54136B6852j243o64M00J171J071M33J1m3j99o07p61l53J78L20K37L56O11O42M47
54117B8859L33L53L04J50Rj62m68p37o90l39P3M16N88L27l98r83p66J12Q71J071
$$ plain form
54097 28923 29867 30661 31360 32107 33100 34197 34812 34583 33935 33603 33739 33885 33722 33466 33550 34210 35337 36490
54079 36490 37115 37050 36775 36928 37662 38688 39774 40879 41894 42641 43135 43580 44115 44788 45665 46650 47296 47178
54061 47178 46551 46271 46920 48164 49080 49012 48142 47390 47693 49228 51367 53452 55450 57666 60066 62256 64070
54044 64070 65836 68090 71289 75673 81021 86563 91529 95806 99772 103537 106778 109372 111677 113953
54030 113953 115923 117200 117893 118491 119299 120203 120884 121061 120676 120029 119585 119438 119074 117874 115832 113563 111621
54013 111621 110002 108288 106076 103150 99471 95302 91263 87965 85412 83042 80547 78376 77025 76048
53999 76048 74415 71916 69533 68128 67355 66384 65160 64240 63711 63136 62501 62387 62964 63482 63122 61945 60687
53982 60687 59971 59951 60331 60462 59781 58485 57466 57248 57281 56702 55552 54754 54961 55947 57179 58475 59880 61186
$$ packed form
54097B8923R44P94O99P47R93J097O15k29o48l32J36J46j63k56Q4O60J127J153
54079C6490O25o5k75J53P34J026J086J105J015P47M94M45N35O73Q77R85O46j18
54061D7178o27k80O49J244R16o8q70p52L03J535K139K085J998K216K400K190J814
54044F4070J766K254L199M384N348N542M966M277L966L765L241K594K305K276
54030A13953J970J277O93N98Q08R04O81J77l85o47m44j47l64j200k042k269j942
54013A11621j619j714k212k926l679m169m039l298k553k370k495k171j351r77
53999G6048j633k499k383j405p73r71j224r20n29n75o35j14N77N18l60j177j258
53982F0687p16k0L80J31o81j296j019k18L3n79j150p98K07R86J232J296J405J306
$$ plain form
53964 61186 61998 62202 62104 62075 62201 62367 62552 62877 63404 64025 64618 65207 65856 66506 67034 67489 68137 69245 70850
53945 70850 72748 74697 76638 78759 81317 84389 87858 91597 95535 99525 103394 107284 111740 117234
53931 117234 123648 130348 136700 142366 147293 151725 156137 160879 165739 170041 173293 175688 178043 181217
53917 181217 185477 190295 194838 198780 202436 206034 209106 210889 211174 210418 209121 207441 205391 203105 200828
53902 200828 198793 197076 195370 193069 189848 186074 182373 178888 175322 171526 167561 163248 158223 152575
53888 152575 146910 141571 136246 130623 125063 120240 116380 113191 110366 107811 105402 102863 99993 96926
53874 96926 94070 91768 89998 88452 86933 85529 84353 83323 82445 82021 82223 82611 82501 81768 80819 79867
53858 79867 78744 77431 76169 74975 73639 72343 71678 71736 71828 71435 70836 70310 69396 67646 65592 64185 63513
$$ packed form
53964F1186Q12K04r8k9J26J66J85L25N27O21N93N89O49O50N28M55O48J108J605
53945G0850J898J949J941K121K558L072L469L739L938L990L869L890M456N494
53931A17234O414O700O352N666M927M432M412M742M860M302L252K395K355L174
53917A81217M260M818M543L942L656L598L072J783K85p56j297j680k050k286k277
53902B00828k035j717j706k301l221l774l701l485l566l796l965m313n025n648
53888A52575n665n339n325n623n560m823l860l189k825k555k409k539k870l067
53874I6926k856k302j770j546j519j404j176j030q78m24K02L88j10p33r49r52
53858G9867j123j313j262j194j336j296o65N8R2l93n99n26r14j750k054j407o72
$$ plain form
53841 63513 62942 62342 62294 62987 63769 64062 64057 64140 64212 64017 63720 63600 63420 62694 61513 60685 60934 62236 63988 65586
53821 65586 66755 67522 68072 68622 69310 70205 71355 72784 74446 76306 78432 80892 83549 86122 88548 91101
53805 91101 94005 97125 100246 103475 107030 110735 114154 117227 120234 122961 124521 124488 123789 123903 125335
53790 125335 127348 129044 130079 130430 130142 129460 128682 127651 125830 123017 119596 115898 111879 107710 104129
53775 104129 101693 99911 97674 94446 90669 87062 83908 81083 78491 76281 74620 73380 72168 70833
53761 70833 69759 69383 69493 69395 68770 67922 67081 65995 64456 62694 60921 58942 56711 54847 53992 53946 54062
53744 54062 54308 55196 56636 57590 57184 55700 54181 53361 53256 53541 53992 54608 55422 56263 56774 56854 56968 57697
53726 57697 58927 59847 59917 59490 59210 59049 58417 57246 56516 57394 59990 63168 65614 66913 67588 68341 69445
$$ packed form
53841F3513n71o00m8O93P82K93nQ3P2j95k97j20j80p26j181q28K49J302J752J598
53821F5586J169P67N50N50O88Q95J150J429J662J860K126K460K657K573K426K553
53805I1101K904L120L121L229L555L705L419L073L007K727J560l3o99J14J432
53790A25335K013J696J035L51k88o82p78j031j821k813l421l698m019m169l581
53775A04129k436j782k237l228l777l607l154k825k592k210j661j240j212j335
53761G0833j074l76J10r8o25q48q41j086j539j762j773j979k231j864q55m6J16
53744E4062K46Q88J440R54m06j484j519q20j05K85M51O16Q14Q41N11Q0J14P29
53726E7697J230R20P0m27k80j61o32j171p30Q78K596L178K446J299O75P53J104
$$ plain form
53709 69445 70751 71969 72909 73586 74194 74904 75663 76303 76794 77265 77776 78253 78618 78795 78661 78341 78548 80149
53691 80149 83170 86606 89509 91921 94350 96733 98504 99562 100486 101709 103051 104233 105363 106537 107343
53676 107343 107256 106371 105335 104568 103944 103283 102728 102494 102514 102615 102796 102999 102807 101826 100361 99248 98886 98825 98512
53657 98512 97998 97572 97111 96359 95626 95644 96709 98413 100218 101831 103004 103490 103344 102928 102499 102160 102210 103002
53639 103002 104248 104991 104624 103583 102708 102296 102103 101980 102023 102286 102713 103321 104252 105647 107560 109741 111518
53622 111518 112264 112222 112486 113910 116315 119013 121653 124178 126312 127646 128169 128302 128555 129343 130923 133120
53606 133120 135333 137166 138906 141042 143539 145926 147927 149622 151145 152634 154311 156263 158281 160170
53592 160170 162023 163815 165057 165381 165213 165295 165641 165550 164631 163276 162104 161450 161412 161878 162370 162338 161712 160839
$$ packed form
53709F9445J306J218R40O77O08P10P59O40M91M71N11M77L65J77j34l20K07J601
53691H0149L021L436K903K412K429K383J771J058R24J223J342J182J130J174Q06
53676A07343q7q85j036p67o24o61n55k34K0J01J81K03j92r81j465j113l62o1l13
53657I8512n14m26m61p52p33J8J065J704J805J613J173M86j46m16m29l39N0P92
53639A03002J246P43l67j041q75m12j93j23M3K63M27O08R31J395J913K181J777
53622A11518P46m2K64J424K405K698K640K525K134J334N23J33K53P88J580K197
53606A33120K213J833J740K136K497K387K001J695J523J489J677J952K018J889
53592A60170J853J792J242L24j68Q2L46r1r19j355j172o54l8M66M92l2o26q73
$$ plain form
53574 160839 159827 158430 156637 154906 153641 152804 152181 151680 151156 150305 148969 147412 146142 145494 145389 145387 145065
53557 145065 144512 144307 144852 145935 147131 148269 149149 149293 148660 148305 149423 151768 153829 154674 154844 155237 155946
53540 155946 156602 157159 157823 158716 160088 162421 165842 169764 173580 177417 181762 186577 191300 195614 199776
53525 199776 204226 209136 214392 219834 225487 231608 238442 245956 253952 262352 271105 279954 288672 297498
53511 297498 306915 317021 327628 338933 351357 364605 377710 390413 403667 418225 433481 448451
53499 448451 463266 478680 494501 509658 523813 537818 552347 566936 580890 594399 608176
53488 608176 622354 636377 649853 663029 676375 690051 703880 717687 731476 745290 758978
53477 758978 772190 784621 796242 807308 818250 829505 841166 852635 862807 870823 876630 880721
$$ packed form
53574A60839j012j397j793j731j265q37o23n01n24q51j336j557j270o48j05kl22
53557A45065n53k05N45J083J196J138Q80J44o33l55J118K345K061Q45J70L93P09
53540A55946O56N57O64Q93J372K333L421L922L816L837M345M815M723M314M162
53525A99776M450M910N256N442N653O121O834P514P996Q400Q753Q849Q718Q826
53511B97498R417J0106J0607J1305J2424J3248J3105J2703J3254J4558J5256J4970
53499D48451J4815J5414J5821J5157J4155J4005J4529J4589J3954J3509J3777
53488F08176J4178J4023J3476J3176J3346J3676J3829J3807J3789J3814J3688
53477G58978J3212J2431J1621J1066J0942J1255J1661J1469J0172Q016N807M091
$$ plain form
53465 880721 883477 884992 885393 884937 883633 880959 876227 869304 860914 852132 843546 834993 826143 817071 808025
53450 808025 798784 788757 777763 766314 754910 743461 731752 720116 709140 698813 688433 677392
53438 677392 665731 653924 642549 632289 623860 617548 612921 609192 605854 602852 600266 598130 596547
53425 596547 595681 595472 595585 595936 597140 600003 604513 609775 615105 620744 627188 634314 641786 650006 659882
53410 659882 671660 684645 698220 712458 727589 743510 760176 777852 796556 815822 835514
53399 835514 856369 879114 903446 928582 954587 982337 1012222 1043593 1075611 1108105 1141386
53388 1141386 1175714 1211155 1247542 1284331 1320813 1356670 1392096 1427194 1461562 1494692 1526554
53377 1526554 1557450 1587312 1615458 1641129 1664146 1684934 1703904 1720899 1735311 1746636 1754833
$$ packed form
53465H80721K756J515M01m56j304k674m732o923q390q782q586q553q850r072r046
53450H08025r241j0027j0994j1449j1404j1449j1709j1636j0976j0327j0380j1041
53438F77392j1661j1807j1375j0260q429o312m627l729l338l002k586k136j583
53425E96547q66k09J13L51J204K863M510N262N330N639O444P126P472Q220R876
53410F59882J1778J2985J3575J4238J5131J5921J6666J7676J8704J9266J9692
53399H35514K0855K2745K4332K5136K6005K7750K9885L1371L2018L2494L3281
53388A141386L4328L5441L6387L6789L6482L5857L5426L5098L4368L3130L1862
53377A526554L0896K9862K8146K5671K3017K0788J8970J6995J4412J1325Q197
$$ plain form
53366 1754833 1760225 1763276 1764382 1763469 1759618 1751406 1737994 1719777 1697833 1672964 1645608 1616341 1585883
53353 1585883 1554532 1522051 1488337 1453963 1419929 1387010 1355447 1325077 1295682 1267262 1240015
53342 1240015 1213971 1188761 1163856 1138927 1113763 1088020 1061489 1034631 1008485 983853 960816
53331 960816 939096 918577 899272 881070 863925 848251 834835 824151 815728 808201 800081 790635
53319 790635 780171 769521 759289 749537 740022 730493 720787 710908 701152 692086 684219 677643 671985
53306 671985 666756 661857 657807 655404 655015 656198 658125 660335 662965 666334 670564 675696 681947 689582
53292 689582 698532 708344 718681 729778 742264 756511 772322 789279 807072 825273 843018 859431
53280 859431 874381 888402 901763 914081 925036 934962 944294 952760 959611 964465 967431 968576 967871
$$ packed form
53366A754833N392L051J106r13l851q212j3412j8217k1944k4869k7356k9267l0458
53353A585883l1351l2481l3714l4374l4034l2919l1563l0370k9395k8420k7247
53342A240015k6044k5210k4905k4929k5164k5743k6531k6858k6146k4632k3037
53331I60816k1720k0519j9305j8202j7145j5674j3416j0684q423p527q120r446
53319G90635j0464j0650j0232r752r515r529r706r879r756r066p867o576n658
53306F71985n229m899m050k403l89J183J927K210K630L369M230N132O251P635
53292F89582Q950R812J0337J1097J2486J4247J5811J6957J7793J8201J7745J6413
53280H59431J4950J4021J3361J2318J0955R926R332Q466O851M854K966J145p05
$$ plain form
53267 967871 965608 962317 958090 952434 944989 935995 925847 914572 902052 888515 874491 860384 846182
53254 846182 831406 815269 797232 777747 758185 739641 721935 704110 685844 667935 651310
53243 651310 636027 621494 607375 593830 580945 568353 555602 542667 529833 517189 504509
53232 504509 491657 478856 466416 454390 442683 431410 420897 411346 402702 394918 388205 382854
53220 382854 378788 375331 371476 366495 360350 353464 346061 337851 328479 318167 307689 297687 288197
53207 288197 278861 269476 260208 251425 243432 236350 230071 224261 218525 212670 206881 201570 196945 192719
53193 192719 188303 183363 178158 173325 169301 165929 162576 158712 154431 150427 147326 145038 142859 140184
53179 140184 137017 133855 131287 129731 129227 129283 129096 128177 126756 125518 124959 125052 125388 125574 125502 125289 124918 124163
$$ packed form
53267I67871k263l291m227n656p445q994j0148j1275j2520j3537j4024j4107j4202
53254H46182j4776j6137j8037j9485j9562j8544j7706j7825j8266j7909j6625
53243F51310j5283j4533j4119j3545j2885j2592j2751j2935j2834j2644j2680
53232E04509j2852j2801j2440j2026j1707j1273j0513r551q644p784o713n351
53220C82854m066l457l855m981o145o886p403q210r372j0312j0478j0002r490
53207B88197r336r385r268q783p993p082o279n810n736n855n789n311m625m226
53193A92719m416m940n205m833m024l372l353l864m281m004l101k288k179k675
53179A40184l167l162k568j556n04N6j87r19j421j238n59R3L36J86p2k13l71p55
$$ plain form
53161 124163 123053 122232 122377 123293 124077 124316 124527 125189 125960 126359 126608 127115 127545 127295 126679 126708 127609 128423 128363
53142 128363 127838 127782 128569 130027 131874 133587 134308 133635 132300 131460 131357 131226 130525 129638 129207 129248 129258 128894
53124 128894 128203 127347 126411 125464 124587 123801 123078 122415 121767 120885 119423 117334 115111 113458 112650 112250 111532
53107 111532 110163 108435 106833 105477 104093 102537 101153 100410 100208 99793 98525 96571 94689 93483 93043
53092 93043 93141 93406 93370 92709 91550 90285 89097 87956 87083 86943 87589 88418 88839 88838 88579 87899 86663 85379
53074 85379 84862 85261 85793 85530 84217 82368 80862 80352 80780 81387 81429 80902 80412 80406 80724 80835 80368 79510 79000
53055 79000 79533 80945 82219 82552 82166 81792 81713 81741 81847 82184 82679 83151 83747 84646 85434 85491 85015 84953 85724 86679
53035 86679 87042 86789 86301 85814 85605 86169 87677 89577 91145 92145 92654 92634 92092 91343 90721 90312 90275 90978
$$ packed form
53161A24163j110q21J45R16P84K39K11O62P71L99K49N07M30k50o16K9R01Q14o0
53142A28363n25n6P87J458J847J713P21o73j335q40j03j31p01q87m31M1J0l64
53124A28894o91q56r36r47q77p86p23o63o48q82j462k089k223j653q08m00p18
53107A11532j369j728j602j356j384j556j384p43k02m15j268j954j882j206m40
53092I3043R8K65l6o61j159j265j188j141q73j40O46Q29M21jk59o80j236j284
53074H5379n17L99N32k63j313j849j506n10M28O07M2n27m90oL18J11m67q58n10
53055G9000N33J412J274L33l86l74p9K8J06L37M95M72N96Q99P88N7m76o2P71R55
53035H6679L63k53m88m87k09N64J508J900J568J000N09k0n42p49o22m09l7P03
$$ plain form
53017 90978 92311 93275 92942 91644 90632 90616 91234 91890 92509 93262 94134 95064 96181 97572 99003 100091 100676
53000 100676 100876 100876 100867 101144 102092 103879 106177 108299 109749 110626 111366 112175 112986 113886 115152 116680 117745 117689
52982 117689 116687 115549 114892 114764 114910 115078 115050 114682 113993 113050 111825 110255 108433 106605 105064 104088 103815
52965 103815 104061 104420 104699 105073 105581 105777 105276 104464 104192 104776 105739 106618 107541 108780 110118 111065 111573 112126
52947 112126 113074 114128 114711 114676 114450 114375 114161 113238 111595 109914 108821 108328 108105 107960 107743 107127 105922 104485
52929 104485 103382 102734 102304 102160 102677 103753 104541 104362 103613 103369 104210 105678 106812 106982 106251 105192 104390
52912 104390 104022 103835 103555 103232 103123 103370 103924 104685 105502 106100 106243 106017 105739 105481 104867 103518 101609 99823
52894 99823 98759 98482 98573 98443 97657 96202 94534 93281 92793 92998 93568 94077 94109 93582 93010 93040 93599 93914 93657
$$ packed form
53017I0978J333R64l33j298j012j6O18O56O19P53Q72R30J117J391J431J088N85
53000A00676K00%rK77R48J787K298K122J450Q77P40Q09Q11R00J266J528J065n6
52982A17689j002j138o57j28J46J68k8l68o89r43j225j570j822j828j541r76k73
52965A03815K46L59K79L74N08J96n01q12k72N84R63Q79R23J239J338R47N08N53
52947A12126R48J054N83l5k26p5k14r23j643j681j093m93k23j45k17o16j205j437
52929A04485j103o48m30j44N17J076P88j79p49k44Q41J468J134J70p31j059q02
52912A04390l68j87k80l23j09K47N54P61Q17N98J43k26k78k58o14j349j909j786
52894I9823j064k77R1j30p86j455j668j253m88K05N70N09L2n27n72L0N59L15k57
$$ plain form
52875 93657 93617 94723 96704 98349 99042 99441 100532 102492 104614 105868 105436 103220 100073 97163 94898 92819
52859 92819 90620 88641 87100 85521 83475 81388 79949 79094 78349 77921 78573 80381 82407 83826 84769 85795
52843 85795 87111 88634 90335 92037 93219 93443 92878 92050 91241 90392 89400 88161 86451 84211 81916 80253
52827 80253 79262 78179 76392 74269 72697 71948 71428 70599 69732 69408 69540 69343 68287 66748 65493 64806 64365
52810 64365 63930 63837 64645 66355 68074 68641 67657 65899 64628 64567 65604 67227 68885 70011 70245 69877 69675
52793 69675 69982 70279 70012 69533 69675 70540 71315 71392 71131 71205 71649 71918 71707 71207 70612 69793 68645 67471 66765
52774 66765 66708 67093 67687 68451 69356 70218 70874 71353 71771 72184 72749 73846 75719 78047 80086 81276 81526 81003
52756 81003 79983 78937 78359 78331 78472 78382 77998 77472 77049 77119 78014 79507 80819 81359 81271 81089 81116 81285 81386
$$ packed form
52875I3657m0J106J981J645O93L99J091J960K122J254m32k216l147k910k265k079
52859I2819k199j979j541j579k046k087j439q55p45m28O52J808K026J419R43J026
52843H5795J316J523J701J702J182K24n65q28q09q49r92j239j710k240k295j663
52827H0253r91j083j787k123j572p49n20q29q67l24J32j97j056j539j255o87m41
52810F4365m35r3Q08J710J719N67r84j758j271o1J037J623J658J126K34l68k02
52793F9675L07K97k67m79J42Q65P75P7k61P4M44K69k11n00n95q19j148j174p06
52774F6765n7L85N94P64R05Q62O56M79M18M13N65J097J873K328K039J190K50n23
52756H1003j020j046n78k8J41r0l84n26m23P0Q95J493J312N40q8j82K7J69J01
$$ plain form
52737 81386 81202 80707 80341 80811 82384 84574 86708 88458 89683 90270 90508 91179 92761 94840 96729 98316
52721 98316 99789 100973 101637 102171 103160 104385 105048 104915 104497 104067 103375 102531 102345 103350 105128 106985 108779
52704 108779 110631 112330 113545 114283 114677 114586 113847 112737 111802 111347 111357 111711 112165 112302 111883 111164 110624 110400
52686 110400 110233 109909 109600 109758 110701 112201 113487 113864 113381 112661 112075 111456 110728 110332 110712 111685 112666 113299
52668 113299 113512 113172 112146 110684 109402 108779 108766 108875 108546 107582 106272 104988 103622 101739 99380 97301
52652 97301 96137 95604 94877 93531 91761 89905 88150 86586 85225 84062 83371 83666 84973 86407 87035 87018
52636 87018 87314 88280 89245 89538 89305 89036 88833 88578 88417 88640 89248 89944 90417 90451 89998 89387 89202 89656 90288
52617 90288 90588 90681 90962 91258 90907 89722 88360 87554 87360 87423 87610 88003 88434 88505 88127 87744 87876 88615 89679
$$ packed form
52737H1386j84m95l66M70J573K190K134J750J225N87K38O71J582K079J889J587
52721I8316J473J184O64N34R89J225O63j33m18m30o92q44j86J005J778J857J794
52704A08779J852J699J215P38L94r1p39j110r35m55J0L54M54J37m19p19n40k24
52686A10400j67l24l09J58R43J500J286L77m83p20n86o19p28l96L80R73R81O33
52668A13299K13l40j026j462j282o23j3J09l29r64j310j284j366j883k359k079
52652I7301j164n33p27j346j770j856j755j564j361j163o91K95J307J434O28j7
52636H7018K96R66R65K93k33k69k03k55j61K23O08O96M73L4m53o11j85M54O32
52617I0288L00R3K81K96l51j185j362q06j94O3J87L93M31P1l78l83J32P39J064
$$ plain form
52598 89679 90771 91766 92638 93443 94350 95456 96543 97226 97464 97787 98779 100382 101936 102942 103536 104129 104834
52581 104834 105460 105904 106214 106356 106247 106082 106245 106796 107334 107561 107673 107907 107986 107464 106430 105431 104724 104038 103080
52562 103080 101813 100205 98199 96114 94553 93596 92517 90712 88533 86753 85533 84445 83332 82538 82263
52547 82263 82151 81622 80346 78445 76523 75360 75217 75527 75645 75781 76687 78525 80610 82246 83202 83337 82498
52530 82498 81047 79853 79412 79474 79777 80462 81374 81677 80845 79490 78497 77758 76585 75060 74030 73836 73911 73758
52512 73758 73500 73225 72523 71064 69154 67369 66020 65268 65297 66000 66816 67292 67566 67976 68447 68654 68586 68541 68664
52493 68664 68906 69398 70370 71574 72164 71498 69987 68909 69290 70968 72763 73574 73347 72956 73177 73856 74182
52476 74182 73675 72740 72186 72348 72805 72930 72600 72223 72180 72367 72348 71842 70997 70338 70505 71813 73800 75307 75347
$$ packed form
52598H9679J092R95Q72Q05R07J106J087O83K38L23R92J603J554J006N94N93P05
52581A04834O26M44L10J42j09j65J63N51N38K27J12K34P9n22j034r99p07o86r58
52562A03080j267j608k006k085j561r57j079j805k179j780j220j088j113p94k75
52547H2263j12n29j276j901j922j163j43L10J18J36R06J838K085J636R56J35q39
52530H2498j451j194m41O2L03O85R12L03q32j355r93p39j173j525j030j94P5j53
52512G3758k58k75p02j459j910j785j349p52K9P03Q16M76K74M10M71K07o8m5J23
52493F8664K42M92R72J204N90o66j511j078L81J678J795Q11k27l91K21O79L26
52476G4182n07r35n54J62M57J25l30l77m3J87j9n06q45o59J67J308J987J507M0
$$ plain form
52457 75347 74032 72476 71721 71912 72465 72792 72746 72615 72852 73693 74927 76150 77234 78307 79284 79797 79822 79930
52439 79930 80541 81264 81501 81488 82038 83236 84080 83716 82504 81490 81223 81542 82240 83316 84635 85784 86387
52422 86387 86317 85563 84219 82670 81518 81171 81599 82463 83307 83683 83495 83266 83702 84747 85381 84713 83101 81811
52404 81811 81588 81950 81960 81400 80890 80970 81362 81330 80678 80120 80483 81698 82912 83571 83976 84608 85337 85714 85801 86140
52384 86140 86950 87845 88493 89036 89632 89961 89640 88949 88766 89763 91911 94732 97749 100632 103097 104889 105875
52367 105875 106174 106171 106317 106836 107629 108512 109478 110700 112396 114722 117612 120601 122991 124494 125588 126976
52351 126976 128752 130441 131801 133128 134652 136084 137082 137859 138984 140761 143178 146209 149774 153492 156968
52336 156968 160373 164306 168994 174049 179163 184653 191075 198561 206820 215479 224244 232961 241841 251459
$$ packed form
52457G5347j315j556p55J91N53L27m6j31K37Q41J234J223J084J073R77N13K5J08
52439G9930O11P23K37j3N50J198Q44l64j212j014k67L19O98J076J319J149O03
52422H6387p0p54j344j549j152l47M28Q64Q44L76j88k29M36J045O34o68j612j290
52404H1811k23L62J0n60n10Q0L92l2o52n58L63J215J214O59M05O32P29L77Q7L39
52384H6140Q10Q95O48N43N96L29l21o91j83R97K148K821L017K883K465J792R86
52367A05875K99lJ46N19P93Q83R66J222J696K326K890K989K390J503J094J388
52351A26976J776J689J360J327J524J432R98P77J125J777K417L031L565L718L476
52336A56968L405L933M688N055N114N490O422P486Q259Q659Q765Q717Q880R618
$$ plain form
52322 251459 262208 273936 286297 299259 312981 327514 342907 359291 376340 392938 407976
52311 407976 421453 434250 446959 459531 471965 484449 496591 507324 516053 523389 530302 537068
52299 537068 543418 549167 554116 557737 559627 560074 559616 558278 555746 552080 547692 542801 537522 532346 527869
52284 527869 524023 520257 516561 513623 511755 510337 508793 507612 507849 509903 513373 517977 523989 531557
52270 531557 540079 548695 557287 566550 576960 588066 599092 609944 621132 632782 644290 655084
52258 655084 665181 674746 683592 691442 698247 703910 708162 711216 714055 717390 720586 722221 721534 718789
52244 718789 714582 709503 704240 699142 693751 687478 680653 674091 667754 660854 653349 646221 639967 633856
52230 633856 627261 620780 615367 611079 607462 604529 602568 601369 600410 599525 598820 598219 597674 597510 597969 598708
$$ packed form
52322B51459J0749J1728J2361J2962J3722J4533J5393J6384J7049J6598J5038
52311D07976J3477J2797J2709J2572J2434J2484J2142J0733Q729P336O913O766
52299E37068O350N749M949L621J890M47m58j338k532l666m388m891n279n176m477
52284E27869l846l766l696k938j868j418j544j181K37K054L470M604O012P568
52270E31557Q522Q616Q592R263J0410J1106J1026J0852J1188J1650J1508J0794
52258F55084J0097R565Q846P850O805N663M252L054K839L335L196J635o87k745
52244G18789m207n079n263n098n391o273o825o562o337o900p505p128o254o111
52230F33856o595o481n413m288l617k933j961j199r59q85p05o01n45j64M59P39
$$ plain form
52214 598708 599380 600432 602620 605904 609459 612721 615798 618869 621785 624399 626804 629181 631678 634465
52200 634465 637551 640591 643187 645293 647078 648513 649506 650260 651060 651808 652159 652065 651717 651061 649854 648153
52184 648153 646230 644016 641159 637726 634324 631380 628689 625849 622733 619438 616102 612966 610258 607893
52170 607893 605584 603334 601452 599952 598358 596346 594183 592279 590603 588886 587136 585609 584447 583613
52156 583613 583024 582407 581198 579013 576221 573672 571789 570244 568649 567258 566684 567080 567890 568376 568096 566917
52140 566917 564966 562810 561380 561300 562296 563522 564466 565321 566601 568757 572205 577256 583771 591153 598924
52125 598924 607177 616320 626587 637935 650215 663251 676911 691170 705950 720888 735570 750040
52113 750040 764684 779533 794112 808170 821997 835705 848672 860144 869933 878081 884342 888587
$$ packed form
52214E98708O72J052K188L284L555L262L077L071K916K614K405K377K497K787
52200F34465L086L040K596K106J785J435R93P54Q00P48L51r4l48o56j207j701
52184F48153j923k214k857l433l402k944k691k840l116l295l336l136k708k365
52170F07893k309k250j882j500j594k012k163j904j676j717j750j527j162q34
52156E83613n89o17j209k185k792k549j883j545j595j391n74L96Q10M86k80j179
52140E66917j951k156j430q0R96J226R44Q55J280K156L448N051O515P382P771
52125E98924Q253R143J0267J1348J2280J3036J3660J4259J4780J4938J4682J4470
52113G50040J4644J4849J4579J4058J3827J3708J2967J1472R789Q148O261M245
$$ plain form
52101 888587 891347 893261 894256 893887 892219 889640 886076 881175 875089 868304 860811 852376 843584 835540 828368
52086 828368 821042 813105 805587 799653 795163 791321 788026 785771 784674 784507 785433 787907 791896 796869 802575
52071 802575 809279 817171 825994 835402 845304 855798 866957 878692 890537 901619 911231 919537 927416
52058 927416 935458 943221 949562 953586 955232 955131 953982 951998 948892 944300 938140 930507 921452 911010
52044 911010 899356 886757 873422 859511 845168 830424 815159 799378 783393 767548 751880
52033 751880 736315 721168 707043 694155 682069 670283 658785 647777 637123 626524 616170
52022 616170 606729 598548 591155 583784 576089 568035 559390 549802 539429 529043 519328 510287 501384 491939
52008 491939 481264 468791 454536 439364 424446 410363 396843 383335 369683 356241 343442
$$ packed form
52101H88587K760J914R95l69j668k579l564m901o086o785p493q435q792q044p172
52086H28368p326p937p518n934m490l842l295k255j097j67R26K474L989M973N706
52071H02575O704P892Q823R408R902J0494J1159J1735J1845J1082R612Q306P879
52058I27416Q042P763O341M024J646j01j149j984l106m592o160p633r055j0442
52044I11010j1654j2599j3335j3911j4343j4744j5265j5781j5985j5845j5668
52033G51880j5565j5147j4125j2888j2086j1786j1498j1008j0654j0599j0354
52022F16170r441q181p393p371p695q054q645r588j0373j0386r715r041q903r445
52008D91939j0675j2473j4255j5172j4918j4083j3520j3508j3652j3442j2799
$$ plain form
51997 343442 331395 319895 308761 297983 287475 276931 266205 255703 246034 237359 229421 222086
51985 222086 215294 208538 201147 193343 186335 181039 177278 174557 172819 171836 170602 168216 164885 161212
51971 161212 157017 151898 146593 142474 139701 137049 133798 130656 128404 126703 124872 123040 121727 120844
51957 120844 119819 118451 117008 115697 114508 113436 112470 111510 110586 109931 109568 109076 108101 106900 106087 105911
51941 105911 106057 106082 105825 105437 105105 104790 104291 103638 103193 103071 102707 101474 99605 97955 96885 96023 95136 94458
51923 94458 93932 92921 91165 89416 88570 88559 88618 88305 87725 87048 86352 85789 85523 85516 85578 85471 84889 83734 82573
51904 82573 82320 83080 83753 83244 81701 80099 78917 77836 76523 75140 74060 73490 73356 73330 73062 72625 72494
51887 72494 72852 73189 72898 72024 71070 70359 69980 70051 70602 71358 72045 72721 73418 73746 73332 72474 71845 71646 71482
$$ packed form
51997C43442j2047j1500j1134j0778j0508j0544j0726j0502r669q675p938p335
51985B22086o792o756p391p804p008n296l761k721j738r83j234k386l331l673
51971A61212m195n119n305m119k773k652l251l142k252j701j831j832j313q83
51957A20844j025j368j443j311j189j072r66r60r24o55l63m92r75j201q13j76
51941A05911J46K5k57l88l32l15m99o53m45j22l64j233j869j650j070q62q87o78
51923I4458n26j011j756j749q46j1N9l13n80o77o96n63k66pO2j07n82j155j161
51904H2573k53P60O73n09j543j602j182j081j313j383j080n70j34k6k68m37j31
51887G2494L58L37k91q74r54p11l79P1N51P56O87O76O97L28m14q58o29j99j64
$$ plain form
51868 71482 70991 70234 69601 69672 70960 73332 75854 77681 78934 80265 81759 82819 83081 82848 82661 82956 84107
$$ packed form
51868G1482m91p57o33P1J288K372K522J827J253J331J494J060K62k33j87K95J151
$$ [...]
##END NTUPLES=NMR SPECTRUM
##END=
