##TITLE=NES1061_159122.0010_001_9704394_M04ESlPhw2
##JCAMPDX= 6.0         $$ Bruker NMR JCAMP-DX V2.0
##DATA TYPE= NMR SPECTRUM
##DATA CLASS= NTUPLES
##ORIGIN= BRUKER
##OWNER= Administrator
$$ 1.72 TOPSPIN		Version 2.1
$$ 2016-05-01 17:19:15.114 -0700  Administrator@X
$$ Compression mode = diff/dup
##.OBSERVE FREQUENCY= 400.02188249412
##.OBSERVE NUCLEUS= ^1H
##.ACQUISITION MODE= SIMULTANEOUS (DQD)
##.ACQUISITION SCHEME= undefined
##.AVERAGES= 8
##.DIGITISER RES= 22
##SPECTROMETER/DATA SYSTEM= spect
##.PULSE SEQUENCE= zg30
##.SOLVENT NAME= COFFEE_meoh
##.SHIFT REFERENCE= INTERNAL, COFFEE_meoh, 1, 14.98509
##AUDIT TRAIL= $$ (NUMBER, WHEN, WHO, WHERE, PROCESS, VERSION, WHAT)
$$ ##TITLE= Audit trail, TOPSPIN		Version 2.1
$$ ##JCAMPDX= 5.01
$$ ##ORIGIN= Bruker BioSpin GmbH
$$ ##OWNER= Administrator
$$ $$ E:\/data/COFFEE/nmr/NES1061_159122.0010_001_9704394_M04ESlPhw2/10/pdata/1/auditp.txt
$$ ##AUDIT TRAIL=  $$ (NUMBER, WHEN, WHO, WHERE, PROCESS, VERSION, WHAT)
(   1,<2016-05-01 17:19:08.161 -0700>,<Administrator>,<X>,<go>,<TOPSPIN 2.1>,
      <created by zg
	started at 2016-05-01 17:18:02.411 -0700,
	POWCHK enabled, PULCHK disabled,
       configuration hash MD5:
       21 0F 79 D6 B3 7B B4 F6 88 20 88 DB 03 48 BD 9F
       data hash MD5: 64K
       40 E9 7C DE 0B 96 BB DF 28 86 C8 C8 C4 DB 36 0F>)
(   2,<2016-05-01 17:19:11.396 -0700>,<Administrator>,<X>,<proc1d>,<TOPSPIN 2.1>,
      <Start of raw data processing
       efp LB = 0 FT_mod = 6 PKNL = 1 PHC0 = 0 PHC1 = 0 SI = 32K 
       data hash MD5: 32K
       7D 70 F1 F2 BB 34 53 CD 7D CC 9F 7E DC 9E CF 47>)
(   3,<2016-05-01 17:19:11.661 -0700>,<Administrator>,<X>,<proc1d>,<TOPSPIN 2.1>,
      <pk PHC0 = 94.52637 PHC1 = 0 
       data hash MD5: 32K
       A3 3F C4 49 32 C9 7F 93 3E F1 33 D8 B7 59 87 BD>)
(   4,<2016-05-01 17:19:11.771 -0700>,<Administrator>,<X>,<proc1d>,<TOPSPIN 2.1>,
      <abs ABSG = 1 
       data hash MD5: 32K
       BC D1 6F 1A ED 9C CC 11 DA D5 CA 5C BF F5 1C DD>)
(   5,<2016-05-01 17:19:11.833 -0700>,<Administrator>,<X>,<proc1d>,<TOPSPIN 2.1>,
      <abs ABSG = 2 
       data hash MD5: 32K
       8E C7 BC DC 36 EB 52 2A B0 78 7F AA 7E F1 88 41>)
(   6,<2016-05-01 17:19:11.896 -0700>,<Administrator>,<X>,<proc1d>,<TOPSPIN 2.1>,
      <abs ABSG = 3 
       data hash MD5: 32K
       E4 84 8B CC 51 EE 25 F1 5C A8 75 7D 12 7D 3F 6B>)
(   7,<2016-05-01 17:19:11.942 -0700>,<Administrator>,<X>,<proc1d>,<TOPSPIN 2.1>,
      <abs ABSG = 4 
       data hash MD5: 32K
       33 06 39 84 5C 37 89 43 FE CA 8B 85 F2 31 BE 32>)
(   8,<2016-05-01 17:19:12.005 -0700>,<Administrator>,<X>,<proc1d>,<TOPSPIN 2.1>,
      <abs ABSG = 5 
       data hash MD5: 32K
       FF BF 66 B2 6B 00 5F A5 54 E4 92 EE 3A 66 7D 64>)
$$ ##END=
$$ 
$$ $$ hash MD5
$$ $$ 98 3D 86 C3 96 6A B1 E8 E3 09 94 70 8F 38 B0 42
##$RELAX= 
##$RELAX= 
##$RELAX= 
##$RELAX= 
##$RELAX= 
##$RELAX= 
##$RELAX= 
$$ Bruker specific parameters
$$ --------------------------
##$DU= <E:\>
##$EXPNO= 10
$$ [...]
150 150 150 150 150 150 150 150
##$TP07= 0
##$TPNAME0= <>
##$TPNAME1= <>
##$TPNAME2= <>
##$TPNAME3= <>
##$TPNAME4= <>
##$TPNAME5= <>
##$TPNAME6= <>
##$TPNAME7= <>
##$TPOAL= (0..7)
0.5 0.5 0.5 0.5 0.5 0.5 0.5 0.5
##$TPOFFS= (0..7)
0 0 0 0 0 0 0 0
##$TUNHIN= 0
##$TUNHOUT= 0
##$TUNXOUT= 0
##$USERA1= <user>
##$USERA2= <user>
##$USERA3= <user>
##$USERA4= <user>
##$USERA5= <user>
##$V9= 5
##$VALIST= <valist>
##$VCLIST= <CCCCCCCCCCCCCCC>
##$VD= 0
##$VDLIST= <DDDDDDDDDDDDDDD>
##$VPLIST= <PPPPPPPPPPPPPPP>
##$VTLIST= <TTTTTTTTTTTTTTT>
##$WBST= 2048
##$WBSW= 25
##$XGAIN= (0..3)
0 0 0 0
##$XL= 0
##$YL= 0
##$YMAX_a= 611679
##$YMIN_a= -515825
##$ZGOPTNS= <>
##$ZL1= 120
##$ZL2= 120
##$ZL3= 120
##$ZL4= 120
##$ABSF1= 14.98509
##$ABSF2= -5.573092
##$ABSG= 5
##$ABSL= 3
##$ALPHA= 0
##$AQORDER= 0
##$ASSFAC= 0
##$ASSFACI= 0
##$ASSFACX= 0
##$ASSWID= 0
##$AUNMP= <proc_prof1d_extract_pilot.lims>
##$AXLEFT= 0
##$AXNAME= <>
##$AXNUC= <1H>
##$AXRIGHT= 0
##$AXTYPE= 0
##$AXUNIT= <>
##$AZFE= 0.1
##$AZFW= 0.1
##$BCFW= 0
##$BC_mod= 0
##$BYTORDP= 0
##$COROFFS= 0
##$CY= 15
##$DATMOD= 1
##$DC= 0
##$DFILT= <>
##$DTYPP= 0
##$F1P= 0
##$F2P= 0
##$FCOR= 0.5
##$FTSIZE= 32768
##$FT_mod= 6
##$GAMMA= 0
##$GB= 0
##$INTBC= 1
##$INTSCL= 1
##$ISEN= 128
##$LB= 0
##$LEV0= 0
##$LPBIN= 0
##$MAXI= 10000
##$MC2= 0
##$MEAN= 0
##$ME_mod= 0
##$MI= 0
##$NCOEF= 0
##$NC_proc= -8
##$NLEV= 6
##$NOISF1= 0
##$NOISF2= 0
##$NSP= 0
##$NTH_PI= 0
##$NZP= 0
##$OFFSET= 14.98509
##$PC= 1
##$PHC0= 94.52637
##$PHC1= 0
##$PH_mod= 1
##$PKNL= yes
##$PPARMOD= 0
##$PPDIAG= 0
##$PPIPTYP= 0
##$PPMPNUM= 2147483647
##$PPRESOL= 1
##$PSCAL= 4
##$PSIGN= 0
##$PYNMP= <proc.py>
##$REVERSE= no
##$SF= 400.02
##$SI= 32768
##$SIGF1= 0
##$SIGF2= 0
##$SINO= 400
##$SIOLD= 32768
##$SPECTYP= <>
##$SREGLST= <1H.CDCl3>
##$SSB= 0
##$STSI= 32768
##$STSR= 0
##$SW_p= 8223.68421052631
##$SYMM= 0
##$S_DEV= 0
##$TDeff= 65536
##$TDoff= 0
##$TI= <>
##$TILT= no
##$TM1= 0
##$TM2= 0
##$TOPLEV= 0
##$USERP1= <user>
##$USERP2= <user>
##$USERP3= <user>
##$USERP4= <user>
##$USERP5= <user>
##$WDW= 1
##$XDIM= 32768
##$YMAX_p= 424123479
##$YMIN_p= -657951
##$CURPLOT= <Network HP LaserJet P1505>
##$CURPRIN= <$Network HP LaserJet P1505>
##$DFORMAT= <normdp>
##$LAYOUT= <+/1D_H.xwp>
##$LFORMAT= <normlp>
##$PFORMAT= <normpl>
##$SURQMSG= 1
$$ End of Bruker specific parameters
$$ ---------------------------------
##NTUPLES= NMR SPECTRUM
##VAR_NAME=  FREQUENCY,     SPECTRUM/REAL,   SPECTRUM/IMAG
##SYMBOL=    X,             R,               I
##VAR_TYPE=  INDEPENDENT,   DEPENDENT,       DEPENDENT
##VAR_FORM=  AFFN,          ASDF,            ASDF
##VAR_DIM=   32768,         32768,           32768
##UNITS=     HZ,            ARBITRARY UNITS, ARBITRARY UNITS
##FACTOR=    0.250966925370066, 1,           1
##FIRST=     8223.43324360094, 106409,       -289280
##LAST=      0,             -65632,          32651
##MIN=       0,             -657951,         0
##MAX=       8223.43324360094, 424123479,    0
$$ Real data points
##PAGE= N=1
##DATA TABLE= (X++(R..R)), XYDATA
$$ [...]
$$ plain form
19532 72852 -528207 -281750 -96086 286350 -40171 -267818 -344721 -133711 -129462 -396556 -54879
19520 -153189 54003 -55807 -69849 -24834 -27534 209749 146788 113323 -24227 -61825 -225828
19509 -225828 81818 -97047 29854 -62646 169975 -39635 -397646 -213152 -186172 -13503 -219855
19498 -219855 161550 -191078 120635 103130 -914 248767 -80970 133957 276541 -93548 298827
19486 -166808 68257 -48260 -24208 27033 -129091 -244655 126117 -268797 -97804 46578 -109219
19474 -304987 -268684 101442 -248047 -94083 16793 -128972 -252932 -55 -119241 -235769 3251
19462 -272501 134866 -79349 -136702 -25021 234336 -209514 -78043 -155412 -96837 -196349 -78421
19450 -203472 -69320 -125066 189498 -65098 55881 176729 112931 -51633 -139799 57370 -190897
$$ packed form
19532G2852e28207K46457i6086B86350d0171k27647p6903a33711M249k67094e4879
19520a53189E4003e5807j4042b4834k700B09749o2961l3465b4227l7598j64003
19509b25828H1818i7047B9854f2646A69975c9635l58011J84494K6980a3503k06352
19498b19855A61550a91078A20635j7505i14B48767h0970A33957J42584i3548B98827
19486a66808F8257d8260K4052B7033a29091j15564A26117b68797i7804D6578a09219
19474c04987L6303A01442b48047i4083A6793a28972j23960e5j19186j16528C251
19462b72501A34866g9349n7353b5021B34336b09514g8043p7369N8575r9512g8421
19450b03472f9320n5746A89498f5098E5881J20848o3798e1633q8166E7370a90897
$$ plain form
19438 73382 76918 242005 73193 -296722 -285548 -77050 -186946 -7068 150544 -363044 48736
19426 -70098 136184 -146948 -121709 -132499 -179912 -98266 -161361 -94467 -222573 200325 -27853
19414 -175409 -178095 -273720 80110 106231 -274141 -161391 41229 -590694 -11944 119301 61526
19403 61526 107471 -402837 34598 -85008 -253170 -96131 -113531 14637 -30445 -96178 -190056
19392 -190056 -127896 -21783 -181987 -23738 99582 -251138 -108420 -221915 -66189 21655 -183613
19380 -115808 266612 71355 -143396 -341224 111679 -105604 69366 -243163 -293163 192239
19369 -32728 -52390 -31728 142819 155824 218938 -55448 14740 -419358 -321607 -162140 77568
19357 112122 21549 -49414 -141118 -298484 -61738 -56352 -12189 -63129 16320 -64993 -21471
$$ packed form
19438G3382L536J65087G3193b96722J1174g7050j09896g068A50544c63044D8736
19426g0098A36184a46948K5239j0790m7413Q1646o3095O6894j28106B00325b7853
19414a75409k686r5625H0110K6121b74141J12750D1229e90694a1944A19301n7775
19403F1526M5945d02837C4598h5008j68162i6131j7400A4637c0445o5733r3878
19392a90056O2160b1783j60204b3738I9582b51138a08420j13495f6189B1655a83613
19380a15808B66612G1355a43396j97828A11679a05604F9366b43163n0000A92239
19369c2728j9662K0662A42819J3005O3114e5448A4740d19358R7751J59467G7568
19357A12122B1549d9414r1704j57366f1738N386a2189n0940A6320f4993b1471
$$ plain form
19345 -195490 7254 113395 -78300 87393 40595 -102008 -22449 -162519 51387 147160 -102421
19333 302671 -77127 -211363 -69099 46191 -161593 -218106 -99013 1388 83013 125120 -112852
19321 -148834 49804 211732 310134 57143 -3363 57710 -85170 -322558 -197105 94329 -365001
19309 38846 102242 -155329 -141637 78363 -5565 158915 35477 -363690 -313682 10910 -30757
19297 49056 -275264 -188218 208 220185 -210424 -271361 168203 -51927 -14504 -157698 -33767
19285 159296 -167629 -381302 -126488 163592 -133876 -220816 -276475 717 -226646 85830 -42170
19273 -132270 -150200 -90173 67816 -355343 -192828 128274 -274817 95339 -68676 -86660 183575
19261 -91271 -206759 196449 6579 -245627 -224130 13468 -58291 4403 -78102 -40615 101222
$$ packed form
19345a95490G254J06141g8300H7393D0595a02008b2449j40070E1387R5773a02421
19333C02671g7127j34236f9099D6191a61593n6513i9013A388Q1625M2107a12852
19321a48834D9804J61928R8402E7143c363E7710h5170k37388J25453I4329c65001
19309C8846O3396a55329J3692G8363e565A58915C5477c63690N0008A0910c0757
19297D9056b75264Q7046B08K19977b10424o0937A68203e1927a4504j43194c3767
19285A59296a67629k13673a26488A63592a33876q6940n5659G17b26646H5830d2170
19273a32270j7930O0027F7816c55343J62515A28274b74817I5339f8676j7984A83575
19261i1271j15488A96449F579b45627K1497A3468e8291D403g8102L7487A01222
$$ plain form
19249 219502 60906 64212 21555 1584 -17617 -44046 -72402 113134 -34253 -226097 321047
19237 179806 -14950 -116199 -212192 -77929 -73430 -378152 217115 -170170 -26964 -60134 -65118
19226 -65118 76230 41689 -228619 -184194 -211286 -331361 23909 224131 -200386 74327 161595
19215 161595 -211585 -203556 -183600 -163200 35527 226867 -149843 -105202 -36540 -173721 -30141
19203 -560832 -75523 7754 -209724 128516 -220643 -282921 -390780 127758 33803 -204934
19192 -36530 -258443 -174141 253040 80027 260596 127231 144560 -216585 -97045 -164618 130295
19180 -38205 -130407 -111999 -115041 -244620 163328 -160385 -97623 -336492 -11685 -172215 52650
19168 -223649 44185 68188 -184102 32430 351564 -93409 -61641 141243 -147795 -37980 26232
$$ packed form
19249B19502F0906L306B1555A584a7617k6429k8356A13134c4253j91844C21047
19237A79806a4950j01249r5993g7929M499l04722B17115a70170b6964l3170m984
19226f5118G6230l4541b28619M4425k7092j20075B3909K00222b00386G4327Q7268
19215A61595b11585Q029J9956K0400C5527J91340a49843M4641c6540j37181c0141
19203e60832g5523G754b09724A28516b20643o2278j07859A27758C3803b04934
19192c6530k21913Q4302B53040H0027J80569A27231J7329b16585i7045o7573A30295
19180c8205r2202J8408l042j29579A63328a60385O2762k38869a1685j60530E2650
19168b23649D4185K4003a84102C2430L19134i3409L1768A41243a47795c7980B6232
$$ plain form
19156 -153827 -64794 -188511 -146266 229445 -165416 124266 133873 -40324 212091 209642 -248439
19144 152419 -65567 144342 -79494 -120650 -118633 -157195 -58131 -182744 -24451 -205003 88632
19132 -92989 -221657 -213214 -263667 -273947 -22360 -100519 -406898 61079 -290868 -86392 -193462
19121 -193462 -9726 25516 143435 344940 -247767 4903 -305792 -134540 -340789 -41063 144442
19109 211846 200273 -36207 57337 -9323 -392164 -38943 139750 -200544 -261329 245216 97683
19097 -38284 -59801 -102331 -31307 -326142 51493 51990 193752 -233816 44791 -123854 51060
19085 -27707 -101087 127205 -178780 -165445 345525 -185242 -185577 -187666 -206268 -279963 97154
19073 -71610 -127464 68130 -19928 -185416 -25076 46385 -108935 -118563 211676 -100367 50346
$$ packed form
19156a53827f4794j23717M2245B29445a65416A24266R607d0324B12091k449b48439
19144A52419f5567A44342g9494m1156K017l8562e8131j24613b4451j80552H8632
19132i2989j28668Q443n0453j0280b2360p8159l06379F1079b90868h6392j07070
19121a93462i726B5516J17919K01505b47767D903c05792a34540k06249d1063A44442
19109B11846j1573c6207E7337i323l82841c8943A39750b00544o0785B45216I7683
19097c8284k1517m2530c1307k94835E1493M97J41762b33816D4791a23854E1060
19085b7707p3380A27205a78780J3335C45525a85242l35k089j8602p3695I7154
19073g1610n5854F8130a9928j65488b5076D6385a08935r628B11676a00367E0346
$$ plain form
19061 -76387 -160585 88795 -94080 -22288 -171693 -145552 -68403 -202682 142444 7428 -160828
19049 -67174 23415 -42123 105383 14236 156843 -226505 56834 -335048 -129155 -179719 -110910
19038 -110910 -43858 126800 -176228 -515417 150501 22387 -202661 107780 -94034 -98637
19028 -98637 -97285 -295868 39001 168673 -133925 117672 100690 8885 81890 -254887 -297786
19017 -297786 -147443 70770 343176 -5177 174028 -145647 39794 -184700 -124780 -12677 -154073
19006 -154073 35586 -337688 -62321 126043 142340 -164511 25781 137412 -44066 140342
18995 233355 347768 71515 -42139 -54893 -657951 -150387 -30179 -38929 152637 -129396 144121
18983 -312282 -34721 -101389 -309305 77477 -102096 -106690 32011 40199 -185431 -174409 25816
$$ packed form
19061g6387q4198H8795i4080b2288j49405K6141f8403j34279A42444G428a60828
19049f7174B3415d2123A05383A4236J42607b26505E6834c35048a29155n0564O8809
19038a10910d3858A26800a76228l39189A50501B2387b02661A07780i4034m603
19028i8637J352j98583C9001J29672a33925A17672j6982H885P3005b54887m2899
19017b97786a47443G0770K72406e177A74028a45647C9794a84700N9920a2677j41396
19006a54073C5586c37688f2321A26043J6297a64511B5781J11631d4066A40342
18995B33355J14413G1515d2139j2754o03058a50387c0179q750A52637a29396A44121
18983c12282c4721o6668k07916G7477a02096m594C2011Q188a85431J1022B5816
$$ plain form
18971 189905 -63120 214030 58881 -73013 -31890 -222672 -175881 -36090 -78427 -97334 57227
18959 -67228 222998 -67136 -10061 17383 -61131 152400 182205 147620 146909 -206561 -141219
18948 -141219 26544 -262700 -119600 100310 -39632 -64776 -14831 197188 -156971 -128990
18938 -128990 -68040 -293200 26274 -176124 -126093 -284244 20269 -90400 -26147 10654 -145276
18926 65078 67450 48543 -198295 97124 -131870 89418 137199 -117593 -121991 124353 -152870
18914 -269946 81991 112201 -147176 107765 -88598 90575 216639 -17823 327760 -145650
18903 130649 87671 38139 40224 104978 72100 -81553 123032 -47373 -124349 -93050 253035
18891 277469 -57605 9543 -250122 50473 3817 32701 -187624 -119672 -269109 -143722 -223544
$$ packed form
18971A89905f3120B14030E8881g3013c1890j90782M6791c6090m2337j8907E7227
18959f7228B22998f7136a0061A7383f1131A52400K9805l4585p11b06561O5342
18948a41219B6544b62700a19600A00310c9632k5144a4831A97188a56971K7981
18938a28990O0950k25160B6274a76124N0031j58151B0269i0400b6147A0654a45276
18926F5078K372j8907a98295I7124a31870H9418M7781a17593m398A24353a52870
18914b69946H1991L0210a47176A07765h8598I0575J26064a7823C27760a45650
18903A30649m2978C8139K085O4754l2878h1553A23032d7373p6976L1299B53035
18891B77469e7605I543b50122E0473C817K8884a87624O7952j49437J25387p9822
$$ plain form
18880 -223544 -83498 -247109 64122 -146733 377899 -68579 46633 106833 -320404 -202997
18870 -202997 -103086 100869 -311216 -8591 269643 35035 -50592 -172698 -303100 32534 -90481
18858 -56303 -68215 157314 -60593 76520 93641 -166494 28867 288721 -50461 -245029 27986
18846 26647 -14199 129513 -16850 11506 164626 -182190 22705 152104 -288565 -74267 36638
18834 97587 62421 -52474 -268043 -81134 14847 -262422 149625 -78227 -57341 51609 -3193
18822 225880 -178101 -199548 40200 -174986 2532 -203214 -147364 96873 -248124 -16769 201678
18810 300580 133311 134394 15829 -101631 67340 30665 -190216 -101182 -105048 -319813 -298120
18799 -298120 -167134 358740 23023 -151651 -115676 -128805 149930 40804 -287249 -232670
$$ packed form
18880b23544h3498j63611F4122a46733C77899f8579D6633O0200c20404J17407
18870b02997R9911A00869c11216h591B69643C5035e0592j22106j30402C2534i0481
18858e6303j1912A57314f0593G6520J7121a66494B8867K59854e0461j94568B7986
18846B6647a4199A29513a6850A1506J53120a82190B2705J29399b88565g4267C6638
18834I7587l5166e2474k15569h1134A4847b62422A49625g8227K0886E1609c193
18822B25880a78101k1447D0200a74986B532b03214N5850I6873b48124a6769B01678
18810C00580A33311J083A5829a01631F7340C0665a90216Q9034l866k14765K1693
18799b98120J30986C58740B3023a51651L5975j3129A49930D0804b87249N4579
$$ plain form
18789 -232670 109996 -278084 -306308 -119139 -119072 -127368 -142518 -254092 150797 91643 168190
18778 168190 89769 225889 -108497 122421 -1039 51063 36887 174668 2442 -171555 -71730
18766 61561 -121294 140601 -253627 -281127 -250233 76367 -295229 -25882 -236471 123952
18755 -44306 -144301 -109838 -254906 326776 -173309 -49204 -361587 436869 200981 -139025
18744 15486 35137 21421 -149196 -40174 -120087 44897 -60340 25789 194118 58972 119102
18733 119102 -222471 -263456 -328882 -115679 -198268 -60564 -182188 -52125 -129315 122449 -397357
18721 -197680 -18786 -198027 210343 30821 -17124 238633 301401 -303807 -7250 -8285 -15404
18710 -15404 -11753 -77322 -147779 -362103 -180554 -253591 -202441 -44086 -213736 73422 -54440
$$ packed form
18789b32670A09996b78084k8224a19139O7q296j5150j11574A50797n9154P6547
18778A68190p8421J36120a08497A22421a039E1063j4176J37781B442a71555g1730
18766F1561a21294A40601b53627k7500L0894G6367b95229b5882k10589A23952
18755d4306r9995L4463j45068C26776a73309d9204l12383D36869B00981a39025
18744A5486J9651j3716a49196d0174p9913D4897f0340B5789J68329E8972O0130
18733A19102b22471m0985o5426a15679q2589f0564j21624e2125p7190A22449c97357
18721a97680a8786j79241B10343C0821a7124B38633O2768c03807g250j035p119
18710a5404L651o5569p0457k14324a80554p3037N1150d4086j69650G3422e4440
$$ plain form
18698 -20126 -109512 57848 -311298 -19212 180804 -244685 280044 86670 -82429 -318744 -28724
18686 -227334 -67884 138521 -101912 -45052 35996 -247538 -136232 -40170 -82749 26236 -402672
18674 -49726 -37036 -243306 -276866 -286671 -226916 -191135 -171751 167962 -112818 -449299 -390811
18663 -390811 11402 -280280 -9897 -72724 6277 -156081 10211 -35279 -85226 72697 55113
18652 55113 66513 3401 17331 368922 -55612 -208370 133788 68750 84134 134877 47980
18640 -158593 498022 -77874 -167961 -175710 170400 -127002 -78828 -345680 300578 -353267
18629 -34430 101684 60907 24142 -116169 -96993 -152664 -321884 212249 186712 -123420 -5609
18617 -269455 377463 -3396 -215525 -16845 -156645 40970 -92062 -38366 432824 -123350 307833
$$ packed form
18698b0126q9386E7848c11298a9212A80804b44685B80044H6670h2429k36315b8724
18686b27334f7884A38521a01912d5052C5996b47538J11306d0170m2579B6236d02672
18674d9726J2690k06270l3560r805N9755L5781J9384A67962a12818l36481N8488
18663c90811A1402b80280i897o2827F277a56081A0211c5279m9947G2697j7584
18652E5113J1400C401J3930L51591e5612j52758A33788o5038J5384N0743D7980
18640a58593D98022g7874r0087p749A70400a27002M8174k66852C00578c53267
18629c4430A01684m0777B4142a16169J9176n5671j69220B12249k5537a23420e609
18617b69455C77463c396k12129a6845j39800D0970i2062c8366D32824a23350C07833
$$ plain form
18605 281720 -122956 126385 -84950 -63744 1546 -171459 -7710 -58150 -67793 126847 -236012
18593 -106430 -62043 50646 2765 37455 -194066 -499856 12967 -126136 -95775 -178588 75424
18581 -72291 -190941 -379046 146056 93329 -92668 -127802 103001 -10192 -74614 -126384 93621
18569 -19538 203055 -41683 265946 -387806 -88354 -193658 -262058 155058 46949 -55679 -57590
18558 -57590 -443404 -148228 253324 -46935 52610 138136 106726 -110938 317225 -58348 -52225
18547 -52225 244562 -244759 182198 -74464 294084 -43351 17526 -74007 6225 -218858 204547
18535 -44778 96116 -783 137187 -75583 54097 -113305 -74421 93755 -221208 -120131 -253404
18524 -253404 150757 -52103 -51771 135904 -92531 -26616 270176 196885 -22433 -107445 8031
$$ packed form
18605B81720a22956A26385h4950K1206A546a71459g710n0440r643A26847b36012
18593a06430M4387E0646B765L4690a94066l05790A2967a26136L0361q2813G5424
18581g2291j18650j88105A46056n2727i2668l5134A03001a0192o4422n1770I3621
18569a9538B03055d1683B65946c87806h8354j05304o8400A55058D6949e5679j911
18558e7590l85814a48228B53324d6935E2610Q5526l1410a10938C17225e8348O123
18547e2225B44562b44759A82198g4464B94084d3351A7526g4007F225b18858B04547
18535d4778I6116g83A37187g5583E4097a13305L8884I3755b21208J01077j33273
18524b53404A50757e2103L32A35904i2531b6616B70176p3291b2433q5012H031
$$ plain form
18512 99501 -186314 -63853 -131041 -112329 26257 -71362 -204841 -58139 -68935 -333191 -457940
18501 -457940 66612 -26994 -86345 13292 236551 338445 159323 181198 -241595 33948 -328736
18489 -178637 120745 96121 -225299 -279640 -208127 -147604 138213 94004 -51985 252353 -442143
18477 16338 -328725 103204 -231989 -53913 -288114 60568 -175166 153721 -67013 55824
18466 8984 -23898 -175972 196601 8705 13590 -17205 182055 -319874 -236089 -192244 -52915
18454 -91103 285669 -234080 -125050 103508 -256870 77850 152409 -155067 -85450 -15476
18443 245290 187242 -116921 -105722 -209578 -132024 -81991 -52930 -238317 204545 46189 -285216
18431 -200747 -176772 150000 99694 11169 435625 -7196 -255993 -39301 -172407 -219681 -157013
$$ packed form
18512I9501a86314f3853o7188J8712B6257g1362j33479e8139j0796k64256j24749
18501d57940F6612b6994n9351A3292K23259J01894A59323K1875b41595C3948c28736
18489a78637A20745k4624b25299n4341P1513O0523A38213m4209e1985B52353d42143
18477A6338c28725A03204b31989e3913k34201F0568a75166A53721f7013E5824
18466H984b3898j52074A96601H705M885a7205A82055c19874Q3785M3845e2915
18454i1103B85669b34080J09030A03508b56870G7850P4559a55067O9617a5476
18443B45290n8048a16921J1199j03856P7554N0033K9061j85387B04545D6189b85216
18431b00747K3975A50000n0306A1169M24456g196k48797c9301j33106m7274O2668
$$ plain form
18420 -157013 310262 -121043 -62666 -91959 109799 218052 -195360 -31533 -156082 -270457
18410 -270457 62357 -26902 198601 26792 107999 172814 -134187 324532 58708 -99224 90902
18398 -250877 -80786 -44041 -273134 -84477 39209 23040 -80612 92229 -53120 -245047 151523
18386 162760 80033 136897 122288 -95459 -113075 -178597 -213362 200897 -174999 -120136 323808
18374 -218734 -113671 116284 81736 -98368 -167105 78172 -225436 61695 -25524 39755 -408046
18362 -3124 -94810 26054 -61817 -119685 46620 85766 -78078 262218 -52622 4068 -23305 -62331
18350 -62331 81654 65897 -96746 39543 -204463 -313276 -85544 -58922 165496 -69765 79253
18338 -43173 328510 -146503 156247 -54879 -109919 30764 -46841 151239 -129414 40926 -20237
$$ packed form
18420a57013C10262a21043N8377k9293A09799J08253a95360c1533j24549j14375
18410b70457F2357b6902A98601B6792Q1207O4815a34187C24532E8708i9224I0902
18398b50877h0786L6745k29093h4477C9209j6169h0612I2229e3120j91927A51523
18386A62760H0033N6864j4609i5459j7616o5522l4765B00897a74999N4863C23808
18374b18734J05063A16284l4548i8368o8737G8172b25436F1695b5524C9755d08046
18362c124r1686B6054f1817n7868D6620L9146g8078B62218e2622D068b3305l9026
18350f2331H1654j5757i6746C9543b04463j08813h5544K6622A65496f9765G9253
18338d3173C28510a46503A56247e4879n5040C0764d6841A51239a29414D0926b0237
$$ plain form
18326 -17335 876 59678 89383 40655 -199690 -123785 274332 -120863 -7142 138461 -94774
18314 -172476 -24730 197461 -46165 -142373 -150758 -154339 347161 108971 92472 -137827 -177396
18303 -177396 40444 157031 -45273 4548 132301 -163547 48368 159197 27778 90102 -437324
18291 157968 -37990 -412526 -38733 -186327 -126465 -40851 -463601 -348685 -35477 22486 108277
18280 108277 -132249 -24790 179141 -136277 259545 -102443 -235350 -262311 -92639 -6722
18269 230713 -303724 231584 -107410 898 -241356 -295535 284375 -32478 224972 -237890
18258 -533407 -93717 300903 223237 44217 -233035 5368 -171176 -36304 186847 150908 12219
18246 251855 -348905 -6724 -270279 -532896 -96639 -183206 -29080 -151607 86538 -29716 -379218
$$ packed form
18326a7335H76N8802K9705D0655a99690P5905B74332a20863g142A38461i4774
18314a72476b4730A97461d6165r6208q385l581C47161A08971j6499a37827l9569
18303a77396D0444J16587d5273D548J27753a63547D8368J10829B7778O2324d37324
18291A57968c7990l74536c8733j47594N9862d0851m22750J14916c5477B2486Q5791
18280A08277a32249b4790A79141a36277B59545a02443j32907k6961i2639f722
18269B30713c03724B31584a07410H98b41356n4179B84375c2478B24972b37890
18258e33407i3717C00903p7666D4217b33035E368a71176c6304A86847l5939A2219
18246B51855c48905f724k63555k62617i6639q6567b9080j22527H6538b9716l49502
$$ plain form
18235 -379218 -185458 -30800 97977 21941 -164306 172831 145446 -121800 9599 -7068 -239202
18224 -239202 23440 35699 -35419 110256 -217606 6613 151698 -145708 176756 60125 -346634
18212 155639 -265920 -48835 84069 -136666 288039 -72860 -81339 95762 -257624 62826 -78932
18200 -208117 110925 10666 -17768 -87036 96222 -123514 66719 145603 -120990 -170253 112652
18188 152910 -80017 360457 -30868 -1596 -330 160280 -211652 -391197 7424 -118415 25347
18176 -4590 -27620 -135126 103091 -286210 37534 -110467 36805 53345 -41091 -179069 -1832
18164 -242260 -599145 -108198 -50262 236555 -7753 -37768 153770 198526 183523 3982 197107
18153 197107 -11168 -101627 -209507 -175246 59723 -87075 139598 -12562 -251202 -9550 59371
$$ packed form
18235c79218a85458c0800I7977B1941a64306A72831k7385a21800I599g068k32134
18224b39202B3440J2259c5419A10256b17606F613J45085a45708A76756F0125c46634
18212A55639b65920d8835H4069a36666B88039g2860q479I5762b57624F2826g8932
18200b08117A10925A0666a7768o9268I6222a23514F6719P8884a20990m9263A12652
18188A52910h0017C60457c0868a596c30A60280b11652j79545G424a18415B5347
18176d590k3030j07506A03091b86210C7534a10467C6805J6540d1091j37978a832
18164b42260l56885a08198e0262B36555g753l0015A53770M4756j5003C982J93125
18153A97107a1168r0459j07880L4261E9723h7075A39598a2562k38640i550E9371
$$ plain form
18141 127420 -124631 -279079 -61947 347352 42895 17814 92951 -156625 -11473 -64077 -33891
18130 -33891 -60117 135670 -229738 308677 -37969 -334988 -126697 -229025 565155 -148918
18119 -7383 75047 196317 161810 -365563 51981 320928 -22056 -132776 -33801 -60324 43730
18107 38756 -148156 -124219 -35122 -241110 26185 -141948 37758 -326115 -68961 -110826 -160205
18096 -160205 -211750 -190131 -229576 -178155 129448 77931 -58575 -339410 61992 156717 -174235
18084 -294736 -188337 190827 -87943 23455 -10142 -363106 -85448 133685 -145756 108637
18073 -181648 -176220 106085 -67480 48094 80497 293190 152377 16522 -168012 -103151 -40889
18061 -271319 -117459 -94399 42200 166997 96366 78860 25500 -42016 -229121 -222496 -38885
$$ packed form
18141A27420a24631j54448f1947C47352D2895A7814P5137a56625a1473n2604L0186
18130c3891k6226A35670b29738C08677c7969k97019a26697j02328E65155a48918
18119g383G5047J21270l4507c65563E1981K68947b2056j10720c3801k6523D3730
18107C8756a48156K3937c5122k05988B6185a41948C7758c26115f8961m1865m9379
18096a60205n1545K1619l9445N1421A29448n1517e8575k80835F1992R4725a74235
18084b94736J06399A90827h7943B3455a0142l52964h5448A33685a45756A08637
18073a81648N428A06085f7480D8094L2403K12693j40813A6522a68012O4861d0889
18061b71319a17459K3060D2200J24797p0631j7506B5500d2016j87105O625c8885
$$ plain form
18049 -67728 107398 -130801 229601 215588 -267901 56989 -159049 -315750 30611 -199964
18038 -26101 -70 148179 118548 -130644 241840 -29541 40596 118045 -31650 -35745 42840 -61374
18025 -102134 -92074 -116545 19784 -327202 77994 -95825 -191811 -13201 47547 274824 -253970
18013 -100964 261856 59873 -224226 136864 -28177 -112345 -120300 226840 -233785 87816 71140
18002 71140 69470 180114 -110034 -108465 -104973 -231650 47477 44609 -13169 -27808 191495 -72558
17989 -231364 55680 184185 118876 -137704 403746 191491 -348703 13473 56037 -130253
17978 217698 110166 74462 -164634 -163155 -103905 123413 -261691 81048 -3535 344439 -92832
17966 88264 80473 -57523 -164788 10248 -199255 175591 -202590 113763 250168 -129579
$$ packed form
18049f7728A07398a30801B29601j4013b67901E6989a59049j56701C0611a99964
18038b6101g0A48179k9631a30644B41840b9541D0596P7449c1650m095D2840f1374
18025a02134J0060k4471A9784c27202G7994i5825r5986a3201D7547K27277b53970
18013a00964B61856E9873b24226A36864b8177q4168p955B26840b33785H7816j6676
18002G1140j670J10644a10034J569L492j26677D7477k868a3169j4639A91495g2558
17989b31364E5680J28505o5309a37704D03746A91491c48703A3473M2564a30253
17978B17698j07532l5704a64634J479N9250A23413b61691H1048c535C44439i2832
17966H8264p791e7523j07265A0248a99255A75591b02590A13763J36405a29579
$$ plain form
17955 -49305 -136486 -195784 130610 43423 -52954 152407 170777 235167 -153949 -125626 -16906
17943 246127 -140403 -10309 399564 241821 87014 -153594 19744 -170263 61357 17721
17932 -16331 75400 -287451 -89604 -55411 -175653 -244562 -347704 159881 35207 -214237 -282666
17921 -282666 71686 -187769 81563 119710 32901 -34347 -205410 277998 -74712 45180 -52691
17909 351305 -61533 -174924 82696 228120 53311 69612 -132823 241014 345601 -117621
17898 174608 -321340 -77296 -74254 -8042 -190322 72132 -12457 180173 -3670 216171 8069
17886 109007 81092 -211867 28109 263353 -176515 120482 -106339 77751 44264 180644
17876 180644 267188 -118527 15888 140411 69603 -44500 164751 300077 24470 -85884 142849
$$ packed form
17955d9305q7181n9298A30610D3423e2954A52407J8370O4390a53949K8323a6906
17943B46127a40403a0309C99564j57743H7014a53594A9744a70263F1357A7721
17932a6331G5400b87451h9604L4193j20242o8909j03142A59881C5207b14237o8429
17921b82666G1686a87769H1563L8147C2901c4347j71063B77998g4712D5180e2691
17909C51305f1533j13391H2696J45424E3311J6301a32823B41014J04587a17621
17898A74608c21340g7296L042h042j82280G2132a2457A80173c670B16171H069
17886A09007k7915b11867B8109K35244a76515A20482a06339G7751l3487J36380
17876A80644Q6544a18527A5888J24523F9603d4500A64751J35326B4470h5884A42849
$$ plain form
17864 -193560 22954 199725 -17183 -50957 51055 -86357 -47784 252589 -87603 428157 60317
17852 -135526 -136937 -85914 -53431 6858 -247410 10837 -64519 188018 -29817 13519 36874
17841 36874 -111114 -37460 140766 22467 150028 -29320 92554 -252898 77752 -101238 -218608
17830 -218608 -93570 33718 -186400 -65105 29875 -229853 -146485 8763 -149425 350796 136574
17818 -54748 24360 -230386 2991 247404 -26568 48677 55590 -105290 76385 139692 -193705
17806 141726 -447375 -146313 303479 -27988 101309 27650 -125294 -12436 -34479 45822
17795 266038 436856 164195 112633 -154039 27818 -55155 -134614 -146986 225308 -77081 336678
17783 82227 -53132 147596 -153340 -245356 65808 -96619 -56666 76156 50036 -122346 96927
$$ packed form
17864a93560B2954J76771a7183l3774E1055h6357L8573B52589h7603D28157F0317
17852a35526j411N1023L2483F858b47410A0837f4519A88018b9817A3519K3355
17841C6874a11114c7460A40766B2467J27561b9320I2554b52898G7752a01238j17370
17830b18608i3570C3718a86400f5105B9875b29853Q3368H763a49425C50796A36574
17818e4748B4360b30386B991K44413b6568D8677O913a05290G6385O3307a93705
17806A41726d47375a46313C03479b7988A01309B7650a25294a2436k2043D5822
17795B66038J70818A64195n1562a54039B7818e5155p9459j2372B25308g7081C36678
17783H2227e3132A47596a53340r2016F5808i6619L9953G6156k6120a22346I6927
$$ plain form
17771 -181439 203003 324225 -120162 274575 181011 192198 209102 -46160 339276 -41689
17760 -342980 296435 263789 -223392 56898 139603 -207081 -4193 249866 -20089 217800 -105007
17748 -97631 -40688 -85090 35066 -88000 -53700 -183246 391331 -57430 219378 -60859 -392166
17737 -392166 -118669 45255 94106 -16125 -201060 -116226 83709 -121852 280826 215049 -37451
17725 116187 84389 -114253 -144771 -38309 317301 34609 57729 175581 91353 39423 164466
17714 164466 -304126 168881 -110928 -152782 82957 292627 -185596 -135770 246102 59381
17703 112588 73210 -239693 35308 345585 128833 59685 11150 -362339 72312 -107482
17692 56649 67361 -23680 147465 -29362 138781 3358 122136 -96693 -221858 74129 32674
$$ packed form
17771a81439B03003J21222a20162B74575r3564J1187J6904d6160C39276d1689
17760c42980B96435l2646b23392E6898Q2705b07081d193B49866b0089B17800a05007
17748i7631d0688m4402C5066h8000L4300j29546C91331e7430B19378f0859l31307
17737c92166a18669D5255M8851a6125j84935Q4834H3709a21852B80826o5777c7451
17725A16187l1798a14253l0518c8309C17301C4609K3120J17852q4228C9423J25043
17714A64466c04126A68881a10928m1854H2957K09670a85596M9826B46102E9381
17703A12588l9378b39693C5308L10277A28833E9685A1150c62339G2312a07482
17692E6649J0712b3680A47465b9362A38781C358J18778i6693j25165G4129C2674
$$ plain form
17680 -18340 -85806 -10641 -37929 -67243 -116856 -12863 245168 118122 -181773 195966 -36528
17668 306153 151050 61081 206099 86758 146829 303137 -2445 -47673 260301 -119618 115946
17656 36568 -1080 201899 213560 344443 70065 45487 -11792 191219 -188547 106368 -178722
17644 80778 159029 226929 176152 282851 -79395 -149048 157222 284388 300627 -49414 354477
17632 -15324 219058 44687 132879 -13208 74533 48801 -6441 114711 -9120 237854 107542
17620 294907 -296282 -125647 -145108 -36347 -179593 -13152 -154510 -52732 -76275 175010
17609 196695 -97327 63164 64285 182643 392391 393628 97833 -142861 138706 -100274 253809
17597 154794 146921 -118967 -103230 248456 48515 -20654 294472 481691 501011 169549 -154738
$$ packed form
17680a8340o7466a0641k7288k9314m9613a2863B45168A18122a81773A95966c6528
17668C06153A51050F1081J45018H6758O0071J56308b445m5228B60301a19618A15946
17656C6568a080B01899J1661J30883G0065k4578a1792A91219a88547A06368a78722
17644H0778P8251O7900n0777J06699g9395o9653A57222J27166J6239d9414C54477
17632a5324B19058D4687Q8192a3208G4533k5732f441A14711i120B37854A07542
17620B94907b96282a25647j9461c6347j43246a3152j41358e2732k3543A75010
17609A96695i7327F3164J121J18358K09748J237I7833a42861A38706a00274B53809
17597A54794p873a18967J5737B48456D8515b0654B94472J87219J9320A69549a54738
$$ plain form
17585 76573 135052 104359 266677 -87943 -89223 -83459 181981 -103018 68181 313109 152617
17573 85182 -32202 -203736 303694 -108678 489916 88085 14592 113036 16930 176103 174361
17562 174361 241046 70527 -148911 75023 376101 194234 187503 65666 -49741 -58984 211217
17550 -198904 122133 -13628 155189 -130683 304150 93076 150292 88567 168764 -117588
17539 70006 34215 167724 94664 208797 118027 -122584 31912 230879 -126816 65382 369250
17528 369250 57056 59587 -12505 -159336 277833 236054 217070 128497 45782 456673 327084
17517 327084 395263 204361 52871 52421 193834 -11931 160843 222655 463613 380137 59698
17505 282523 462454 349180 708333 167998 360120 -33540 236571 -424313 300846 112216
$$ packed form
17585G6573N8479l0693J62318h7943j280N764A81981a03018F8181K44928A52617
17573H5182c2202j71534C03694a08678D89916H8085A4592R8444A6930J59173j742
17562A74361O6685G0527a48911G5023L01078j81867o731F5666d9741r243B11217
17550a98904A22133a3628A55189a30683C04150I3076N7216o1725Q0197a17588
17539G0006C4215J33509p3060J14133r0770a22584C1912J98967a26816F5382L03868
17528C69250E7056K531a2505j46831B77833m1779j8984q8573D5782M10891j29589
17517C27084O8179j90902E2871m50J41413a1931A60843O1812K40958q3476E9698
17505B82523J79931j13274L59153A67998J92122c3540B36571d24313C00846A12216
$$ plain form
17494 68026 389593 4551 -181378 114228 -58499 12783 123491 45518 80729 73841 -108958
17482 -147944 447297 309513 111474 255988 373569 28702 -9145 -70507 100652 360648
17472 360648 131835 173293 175571 12877 542885 161052 162602 65409 -179765 99668 78255
17461 78255 140351 11138 427915 -4896 -59538 -129352 441777 -164219 -61551 190086 165179
17450 165179 243996 210919 365830 237995 139231 99424 463444 259521 95663 270270
17440 270270 142160 71642 326987 243232 -8916 379159 -124288 263039 172423 -119681
17429 37780 -107088 321441 361260 587706 122922 184221 338318 84158 21353 131930
17419 131930 201456 585905 109435 75303 258471 186324 -257328 289854 -51318 104001
$$ packed form
17494F8026L21567D551a81378A14228e8499A2783J10708D5518L5211o888a08958
17482a47944D47297j37784A11474J44514J17581B8702i145o1362A00652K59996
17472C60648A31835M1458K278A2877N30008A61052J550F5409a79765I9668k1413
17461G8255O2096A1138M16777d896n4642o9814D41777a64219f1551A90086k4907
17450A65179P8817l3077J54911j27835r8764l9807L64020k03923I5663J74607
17440B70270j28110p0518K55345q3755h916C79159a24288B63039r0616a19681
17429C7780a07088C21441L9819K26446A22922O1299J54097H4158B1353J10577
17419A31930O9526L84449A09435l4132J83168p2147b57328B89854e1318A04001
$$ plain form
17408 318631 143471 212366 -94405 94702 -296111 -124572 205956 -203514 -124777 373011
17397 -41501 184892 279785 289084 29721 -35054 -107341 363858 267593 133908 131866 135551 245002
17385 245002 568390 222375 29629 295170 -144109 183978 435248 156921 144750 -164733
17374 -61904 373485 239446 154077 10793 -96242 300182 188120 212120 341239 -152460
17363 219382 53125 25095 177066 150811 205561 58279 143679 184223 226989 -18602 -47884
17352 -47884 243875 214778 -53757 29976 196202 320583 48397 134406 291826 27754 75193
17341 75193 -8476 78501 197564 438175 65286 213575 151089 144786 337463 128606 203096
17330 203096 333128 211410 283742 211426 -135969 205470 431225 392093 -31768 97847
$$ packed form
17408C18631A43471O8895i4405I4702b96111a24572B05956b03514P8737C73011
17397d1501A84892R4893R299B9721c5054p2287C63858r6265j33685k042L685J09451
17385B45002L23388B22375B9629K65541a44109A83978K51270A56921j2171a64733
17374f1904C73485j34039q5369A0793i6242C00182j12062K4000J29119a52460
17363B19382E3125B5095J51971k6255N4750E8279Q5400M0544M2766a8602k9282
17352d7884B43875k9097e3757B9976J66226J24381D8397Q6009J57420B7754M7439
17341G5193h476G8501J19063K40611F5286J48289o2486o303J92677A28606P4490
17330B03096J30032j21718P2332p2316a35969B05470K25755l9132c1768I7847
$$ plain form
17319 157565 32686 210888 165782 -18237 135826 -166499 -29278 131479 95621 396647
17309 396647 70852 38812 386969 -31151 348085 -183334 60270 81432 -177220 149750
17298 99028 53217 235985 -134903 24501 -44241 19915 345640 124490 56670 325253 -155847
17286 219343 -40556 141342 163264 -65182 12438 155755 93332 136287 554622 298891 -17376
17274 29815 255959 234671 41328 171876 271996 231205 266940 303937 256955 377933 -153074
17262 316947 223134 -148574 -19379 301641 339638 399882 17452 256891 510206 390225
17252 390225 36607 262694 340865 5249 591521 213657 321396 118982 60416 368773
17242 368773 387492 156830 142193 352937 480109 435517 134385 108845 342667 52004
$$ packed form
17319A57565C2686J78202m5106a8237A35826a66499b9278A31479l5858L01026
17309C96647G0852l2040L48157c1151C48085a83334F0270K1162a77220A49750
17298I9028m5811J82768a34903B4501d4241A9915L25725A24490E6670K68583a55847
17286B19343d0556A41342K1922f5182A2438J43317o2423M2955M18335k55731a7376
17274B9815K26144k1288D1328J30548J00120m0791L5735L6997m6982J20978a53074
17262C16947r3813a48574a9379C01641L7997O0244A7452K39439K53315j19981
17252C90225C6607K26087P8171E249N86272B13657J07739A18982n8566L08357
17242C68773J8719A56830j4637K10744J27172m4592A34385k5540K33822E2004
$$ plain form
17231 280134 162493 -2870 382655 288959 346736 454057 -102731 135792 186002 347580
17221 347580 499949 111594 29116 434978 348057 460473 470197 383729 199307 562426
17211 562426 363852 236005 345976 187432 108538 322210 127028 217067 11690 -21758
17200 -73950 221905 247139 524289 287367 265348 149915 411694 110068 -3684 303600
17189 313460 174600 280723 203829 244658 62477 76545 450544 611563 76715 170482 170095
17178 170095 266843 184248 127748 325477 395152 313128 183633 324075 375141 169757 362446
17167 362446 292447 129179 39160 338823 187692 250999 287536 109584 250697 264714
17157 264714 491088 337308 220151 319238 384668 235634 231821 423062 284965 874849
$$ packed form
17231B80134j17641b870C82655r3696N7777J07321a02731A35792N0210J61578
17221C47580J52369A11594B9116M05862q6921J12416R724q6468j84422L63119
17211E62426j98574j27847J09971j58544p8894K13672A27028R0039A1690b1758
17200g3950B21905K5234K77150k36922k2019j15433K61779A10068c684C03600
17189C13460j38860J06123p6894M0829F2477J4068L73999J61019G6715R3767l87
17178A70095R6748q2595n6500J97729O9675q2024j29495J40442N1066A69757J92689
17167C62446o9999A29179C9160K99663j51131O3307L6537A09584J41113J4017
17157B64714K26374j53780j17157R9087O5430j49034l813J91241j38097N89884
$$ plain form
17147 874849 162427 420673 333153 272419 437052 37471 490367 216133 483778 468631
17137 468631 285583 385890 116353 397561 193456 234645 477777 372729 98248 -25198
17126 232321 248437 311243 279203 323911 363719 144500 442898 392213 579823 699655 391565
17115 391565 529366 306900 394978 265189 227332 282882 376766 352993 355359 634809 361086
17104 361086 460013 246761 140161 598433 314149 486414 379095 688763 214028 317904
17094 317904 261524 612575 209481 451225 562492 274448 188670 357150 268442 709761
17084 709761 244336 521356 499213 386118 403375 866476 517545 407434 457320 529924
17074 529924 310708 787260 829743 689291 437590 714952 408480 528587 561105 448030
$$ packed form
17147H74849A62427K58246q7520o0734J64633C7471M52896B16133K67645j5147
17137D68631j83048J00307A16353K81208A93456M1189K43132j05048I8248b5198
17126B32321J6116O2806l2040M4708L9808A44500K98398n0685J87610J19832l08090
17115C91565J37801k22466Q8078j29789l7857N5550R3884k3773K366K79450k73723
17104C61086R8927k13252j06600M58272k84284J72265j07319L09668B14028J03876
17094C17904n6380L51051B09481K41744J11267B74448q5778J68480q8708M41319
17084G09761B44336K77020k2143j13095J7257M63101l48931j10111M9886P2604
17074E29924k19216M76552M2483j40452k51701K77362l06472J20107L2518j13075
$$ plain form
17064 448030 242973 589349 482191 223289 214332 605241 264522 429821 605874 371320
17054 371320 342312 300695 343933 316714 680961 562119 925276 621676 617216 575147 610487
17043 610487 554258 640432 708772 665273 527182 705892 586788 607762 611497 598374 493468
17032 493468 586368 552170 944419 653532 495091 874853 384436 574716 595977 296421
17021 356692 604505 572383 696034 554637 488139 665519 857972 305937 620159 837410
17011 837410 682649 382259 439876 920114 766262 617394 839293 514519 636085 466403
17001 466403 890509 705117 849048 957922 752416 921972 654996 665088 675594 732525
16991 732525 954512 946248 718253 875450 942707 882513 1239653 910045 926988 888324 800789
$$ packed form
17064D48030k05057L46376j07158B23289q957L90909B64522J65299J76053k34554
17054C71320k9008m1617M3238k7219L64247j18842L63157l03600m460m2069L5340
17043F10487n6229Q6174O8340m3499j38091J78710j19104K0974L735j3123j04906
17032D93468R2900l4198L92249k90887j58441L79762C84436J90280K1261B96421
17021C56692K47813l2122J23651j41397o6498J77380J92453C05937L14222K17251
17011H37410j54761l00390N7617M80238j53852j48868K21899l24774J21566j69682
17001D66403M24106j85392J43931J08874k05506J69556k66976J0092J0506N6931
16991G32525K21987q264k27995J57197O7257o0194L57140l29608J6943l8664q7535
$$ plain form
16980 800789 632551 898249 914326 1035974 964461 784363 800040 979203 1040815 1274378
16970 1274378 1095264 1221028 1072279 923036 953793 1057063 775550 1002062 680759 905519
16960 905519 698164 1144365 1141325 1094197 884140 871684 1368357 1139574 1070878 1062131 1022558
16949 1022558 1212450 1126796 1040005 1098541 1643882 1157248 1441746 1271572 1474500 1374638
16939 1374638 1514877 1079951 1312308 1622304 1451374 1347903 1391927 1125717 1392736 1721725
16929 1721725 1254363 1344996 1818068 1406823 1386676 1438748 1452161 1590916 1775818 1588687
16919 1588687 1589307 1496587 1445342 1424791 1724947 1846376 1556619 1698619 1504482 1746995
16909 1746995 1868585 2066061 1961346 1810216 1997647 1637705 1981649 2186794 1815683
$$ packed form
16980H00789j68238K65698J6077J21648p1513j80098J5677J79163O1612K33563
16970A274378j79114J25764j48749j49243L0757J03270k81513K26512l21303K24760
16960I05519k07355M46201l040m7128k10057j2456M96673k28783o8696q747l9573
16949A022558J89892q5654q6791N8536N45341m86634K84498j70174K02928r9862
16939A374638J40239m34926K32357L09996j70930j03471M4024k66210K67019L28989
16929A721725m67362R0633M73072m11245k0147N2072J3413J38755J84902j87131
16919A588687O20r2720n1245k0551L00156J21429k89757J42000j94137K42513
16909A746995J21590J97476j04715j51130J87431l59942L43944K05145l71111
$$ plain form
16900 1815683 2243038 2175458 2215944 2257833 2414055 2231678 2091774 2165654 2189862 2275901
16890 2275901 2711424 2371692 2069955 2575174 2361013 2691290 2777954 2721718 2513276 2791946
16880 2791946 2556342 2588098 2719857 2992244 2862889 2961968 3107757 2827435 3192049 3118070
16870 3118070 2881509 3422414 3104394 3466567 3312369 3518828 3401225 3458827 3823438 3822886
16860 3822886 3687217 3941387 3519601 4171434 4111577 4056514 4052038 4132732 4354695 4394713
16850 4394713 4186183 4602555 4481095 4585958 4825030 4781207 5083657 5198817 5328171 5281724
16840 5281724 5420048 5506927 5484938 5686985 5737495 5768490 6152490 5991575 6176027 6582004
16830 6582004 6840435 6887780 7015221 7141817 6995864 7420054 7701188 7551799 7791416 8021184
$$ packed form
16900A815683M27355o7580M0486M1889J56222j82377j39904P3880K4208Q6039
16890B275901M35523l39732l01737N05219k14161L30277Q6664n6236k08442K78670
16880B791946k35604L1756J31759K72387j29355R9079J45789k80322L64614p3979
16870C118070k36561N40905l18020L62173j54198K06459j17603N7602L64611n52
16860C822886j35669K54170m21786O51833n9857n5063m476Q0694K21963M0018
16850D394713k08530M16372j21460J04863K39072m3823L02450J15160J29354m6447
16840E281724J38324Q6879k1989K02047N0510L0995L84000j60915J84452M05977
16830F582004K58431M7345J27441J26596j45953M24190K81134j49389K39617K29768
$$ plain form
16820 8021184 8347467 8236688 8704516 8869315 9285099 9375129 9542430 9693950 10099038 10527425
16810 10527425 10585623 10939961 10940804 11438862 11723341 12096746 12283911 12868075 13250326 13294696
16800 13294696 14013905 14250932 14920065 15092666 15141942 16148118 16551756 17156344 17675145
16791 17675145 17930731 18522345 19351029 19734956 20454141 20864456 21639528 22809681 23315455
16782 23315455 24449435 25024681 25835687 26720669 27924609 28902543 29706957 30859752 32168166
16773 32168166 33286835 34734441 35993964 37440416 38861996 40557173 42071042 43867017
16765 43867017 45181238 47302251 49105464 51217712 53238125 55436253 57796826 60059611
16757 60059611 62286762 65200845 67771719 70268095 73442422 76320867 79128623 82267794
$$ packed form
16820H021184L26283j10779M67828J64799M15784R0030J67301J51520M05088M28387
16810A0527425N8198L54338Q43M98058K84479L73405J87165N84164L82251M4370
16800A3294696P19209K37027O69133J72601M9276J006176M03638O04588N18801
16791A7675145K55586N91614Q28684L83927P19185M10315P75072J170153N05774
16782B3315455J133980N75246Q11006Q84982J203940R77934Q04414J152795J308414
16773C2168166J118669J447606J259523J446452J421580J695177J513869J795975
16765D3867017J314221K121013J803213K112248K020413K198128K360573K262785
16757F0059611K227151K914083K570874K496376L174327K878445K807756L139171
$$ plain form
16749 82267794 85408396 88628285 91835275 95247891 97983864 101423622 104364547 107474111
16741 107474111 110019134 112697269 115385319 117373319 119433247 121136016 122381225 123544538
16733 123544538 124450572 124507231 124312836 124089732 123355937 122143633 120663905 119166101 117117812
16724 117117812 114851068 112064522 109752575 107030374 103766830 100769324 97930616 94726731
16716 94726731 91960419 88646398 85873778 82746056 79904142 76817592 74178122 71474160
16708 71474160 68504739 66284052 63886899 61330161 59410360 57271836 54882857 52727958
16700 52727958 50635064 49022525 47243046 45662439 44203378 42552503 41131230 39543985
16692 39543985 38281001 36859191 35616459 34538234 33652143 32338135 31170385 30039740
$$ packed form
16749H2267794L140602L219889L206990L412616K735973L439758K940925L109564
16741A07474111K545023K678135K688050J988000K059928J702769J245209J163313
16733A23544538R06034N6659j94395k23104p33795j212304j479728j497804k048289
16724A17117812k266744k786546k311947k722201l263544k997506k838708l203885
16716I4726731k766312l314021k772620l127722k841914l086550k639470k703962
16708G1474160k969421k220687k397153k556738j919801k138524k388979k154899
16700E2727958k092894j612539j779479j580607j459061j650875j421273j587245
16692C9543985j262984j421810j242732j078225q86091j314008j167750j130645
$$ plain form
16684 30039740 29254587 28277506 27538901 26482962 25860206 24946503 24544832 23625394 22963952
16675 22963952 22431459 21526603 20859999 20378983 19688965 19311727 18438018 18234968 17766002
16666 17766002 17334704 16912643 16341296 15899373 15909502 15166103 15145219 14539980 14531004 13883536
16656 13883536 13756697 12942603 12844729 12435882 12386111 12150612 11823565 11558485 11202920 11060641
16646 11060641 11045102 10482841 10178588 10218191 10038357 9782133 9553796 9151042 9180285 8866409
16636 8866409 8677875 8698129 8372527 8778250 7658885 8077611 7845925 7703114 7484478
16627 7484478 7397348 7518673 7127944 6869283 6896944 6656588 6763736 6457374 6351549 6410464
16617 6410464 6252897 5993915 5819551 6092883 5752059 5758862 5520686 5268598 5458797 5390271
$$ packed form
16684C0039740p85153r77081p38605j055939o22756r13703m01671r19438o61442
16675B2963952n32493r04856o66604m81016o90018l77238q73709k03050m68966
16666A7766002m31298m22061n71347m41923J0129p43399k0884o05239q976o47468
16656A3883536j26839q14094r7874m08847m9771k35499l27047k65080l55565j42279
16646A1060641j5539n62261l04253L9603j79834k56224k28337m02754K9243l13876
16636H866409j88534K0254l25602M05723j119365M18726k31686j42811k18636
16627G484478q7130J21325l90729k58661K7661k40356J07148l06362j05825N8915
16617F410464j57567k58982j74364K73332l40824O803k38176k52088J90199o8526
$$ plain form
16607 5390271 5584623 4976095 5209821 5207154 4813911 5114640 4964954 4543128 4942690 4461548
16597 4461548 4472435 4347394 4461217 4212531 4322823 4028245 4039137 4023960 3751459 4080079
16587 4080079 3759748 3793581 3681959 3807443 3973970 3782323 4038909 3323403 3287920 3678864
16577 3678864 3638664 3061155 3204911 3348149 3389524 3189326 3124325 2854792 2871599 3037213
16567 3037213 3078791 2886593 2871977 2995457 2899816 3029583 2668834 2637762 2911776 2848481
16557 2848481 2793382 3039926 2390157 2648572 2323722 2585058 2554192 2130140 2653242 2466282
16547 2466282 2292116 2416079 2335351 2463764 2202622 2441760 2620415 2452451 2464700 2286941
16537 2286941 2215853 2294531 2371817 2459110 2193774 2275233 2009521 1847459 1908665 2250777
$$ packed form
16607E390271J94352o08528K33726k667l93243L00729j49686m21826L99562m81142
16597D461548J0887j25041J13823k48686J10292k94578J0892j5177k72501L28620
16587D080079l20331L3833j11622J25484J66527j91647K56586p15506l5483L90944
16577C678864m0200n77509J43756J43238M1375k00198o5001k69533J6807J65614
16567C037213M1578j92198j4616J23480r5641J29767l60749l1072K74014o3295
16557B848481n5099K46544o49769K58415l24850K61336l0866m24052N23102j86960
16547B466282j74166J23963q0728J28413k61142K39138J78655j67964J2249j77759
16537B286941p1088P8678P7286Q7293k65336Q1459k65712j62062O1206L42112
$$ plain form
16527 2250777 2083057 2048372 1883066 2094571 1962975 2151643 1992292 2168260 1939930 1989892
16517 1989892 1934954 2295320 1906764 1495231 2187096 2015789 1910435 1734702 2110150 1905772
16507 1905772 1878771 1829187 1606473 2040194 1775138 1913717 1806414 1823537 1654005 1522492
16497 1522492 1655616 1816544 1660556 1681931 1702838 1877794 1782965 1707623 1487404 1453596
16487 1453596 1892909 1613104 1792466 1485731 1621846 1580456 1549323 1765244 1714257 1373847
16477 1373847 1714619 1339330 1722570 1789151 1558822 1462541 1589345 1582371 1664119 1343436
16467 1343436 1440131 1735064 1358038 1513761 1499100 1362837 1466464 1616629 1385163 1881272
16457 1881272 1301982 1554289 1592231 1356917 1408831 1460481 1239875 1460656 1556640 1386670
$$ packed form
16527B250777j67720l4685j65306K11505j31596J88668j59351J75968k28330M9962
16517A989892n4938L60366l88556m11533O91865j71307j05354j75733L75448k04378
16507A905772k7001m9584k22714M33721k65056J38579j07303J7123j69532j31513
16497A522492J33124J60928j55988K1375K0907J74956r4829p5342k20219l3808
16487A453596M39313k79805J79362l06735J36115m1390l1133K15921n0987l40410
16477A373847L40772l75289L83240O6581k30329r6281J26804o974Q1748l20683
16467A343436R6695K94933l77026J55723j4661j36263J03627J50165k31466M96109
16457A881272n79290K52307L7942k35314N1914N1650k20606K20781R5984j69970
$$ plain form
16447 1386670 1525909 1701016 1505008 1185860 1421415 1430769 1465143 1247265 1504078 1564269
16437 1564269 1439961 1170030 1330356 1272803 1415260 1214779 901008 1325819 1368688 1359144
16427 1359144 1194628 952693 1310429 1152457 1189772 1330518 1466925 1159979 1103668 1404945
16417 1404945 1532264 1090162 1289290 1561496 1337848 1373032 1234298 1188631 1356163 1310817
16407 1310817 1283817 1472824 1484891 1415234 1477392 1216875 1407030 1427614 1428946 1313583 1535126
16396 1535126 1618476 1320649 1258538 1674972 1137178 1428243 1383960 1395943 1554026 1253836
16386 1253836 1148529 1352004 928559 1060012 1396637 1570161 1238403 1189314 1374453 1002384
16376 1002384 1434485 1422336 1055691 1360471 1293680 1186958 1373315 1388303 1486795 1417085
$$ packed form
16447A386670J39239J75107j96008l19148K35555R354L4374k17878K56813O0191
16437A564269j24308k69931J60326n7553J42457k00481l13771M24811M2869r544
16427A359144j64516k41935L57736j57972L7315J40746J36407l06946n6311L01277
16417A404945J27319m42102J99128K72206k23648L5184j38734m5667J67532m5346
16407A310817k7000J89007J2067o9657O2158k60517J90155K0584J332j15363K21543
16396A535126Q3350k97827o2111M16434n37794K91065m4283J1983J58083l00190
16386A253836j05307K03475m23445J31453L36625J73524l31758m9089J85139l72069
16376A002384M32101j2149l66645L04780o6791j06722J86357J4988R8492o9710
$$ plain form
16366 1417085 1490115 1545505 1165030 1537544 1267083 1363019 1502946 1478497 1201187 1569480
16356 1569480 1425980 846984 1169319 1194233 1061541 1220716 1465048 1186391 1010411 1567958
16346 1567958 1357352 1542809 1130244 1266889 1339682 1270876 1086307 1287402 1443215 1684162
16336 1684162 1409553 1587388 1125616 1104760 1153837 1314564 1231259 1048910 1201608 1334156
16326 1334156 1444824 1135021 1243295 1064313 984637 1276455 1576303 1224604 1256918 1269463
16316 1269463 1320508 1197976 1318887 1268741 1609595 1077971 1412124 1621208 1625405 1489795
16306 1489795 1430692 1432359 1304593 1311143 1428088 1551428 1180741 1517029 1227166 1543649
16296 1543649 1182149 1431052 1266215 1485640 1130858 1272743 1293441 1494757 1274939 1292637
$$ packed form
16366A417085P3030N5390l80475L72514k70461R5936J39927k4449k77310L68293
16356A569480j43500n78996L22335K4914j32692J59175K44332k78657j75980N57547
16346A567958k10606J85457m12565J36645P2793o8806j84569K01095J55813K40947
16336A684162k74609J77835m61772k0856M9077J60727q3305j82349J52698J32548
16326A334156J10668l09803J08274j78982p9676K91818K99848l51699L2314J2545
16316A269463N1045j22532J20911n0146L40854n31624L34153K09084M197j35610
16306A489795n9103J667j27766O550J16945J23340l70687L36288k89863L16483
16296A543649l61500K48903j64837K19425l54782J41885K0698K01316k19818J7698
$$ plain form
16286 1292637 1746099 1581473 1393854 1294659 1329901 1340002 1491945 1526323 1133881 1295997
16276 1295997 1323164 1100835 1526075 1594597 1219848 1341093 1180593 1197771 1192362 1007148
16266 1007148 987871 1129528 1213189 1341128 1276945 1406766 1269304 1262202 987398 1154172
16256 1154172 1325811 1152325 1167141 1214979 1118207 1025482 1052128 1379112 1070389 1090135
16246 1090135 1375116 1208124 1016187 973287 1442889 1157433 1269219 1066871 1214626 1144814
16236 1144814 1211275 1198765 864348 1434920 1220478 1048894 923931 1037285 985172 783942
16226 783942 1149256 975054 1101868 1120951 1259393 964814 1156737 1154595 1339005 1218210
16216 1218210 891251 903506 957883 868684 931145 914764 784329 731363 1108460 1118039 1022915
$$ packed form
16286A292637M53462j64626j87619r9195L5242J0101J51943L4378l92442J62116
16276A295997K7167k22329M25240O8522l74749J21245j60500J7178n409j85214
16266A007148j9277J41657Q3661J27939o4183J29821j37462p102k74804J66774
16256A154172J71639j73486J4816M7838r6772r2725K6646L26984l08723J9746
16246A090135K84981j66992j91937m2900M69602k85456J11786k02348J47755o9812
16236A144814O6461j2510l34417N70572k14442j71584j24963J13354n2113k01230
16226G83942L65314j74202J26814J9083J38442k94579J91923k142J84410j20795
16216A218210l26959J2255N4377q9199O2461j6381j30435n2966L77097R579r5124
$$ plain form
16205 1022915 908291 1068292 818375 996640 936155 790438 811862 866057 779029 802263
16195 802263 808035 874610 879150 903548 1019090 495159 805201 705387 982822 843803 616099
16184 616099 654982 698342 704762 408809 925996 503822 500598 713728 1124115 1020359 807413
16173 807413 992078 528659 523470 736856 417108 376623 328661 516722 513796 737419 489536
16162 489536 685166 471451 476702 518079 623074 773356 931864 451181 705810 664380
16152 664380 644469 419572 766717 475201 891494 506871 652312 363159 609983 533979
16142 533979 300770 185866 514274 261461 896984 327911 409252 660716 422849 329228
16132 329228 591006 515200 550788 821506 369834 484505 324876 566655 -17808 569420
$$ packed form
16205A022915j14624J60001k49917J78265o0485j45717K1424N4195q7028K3234
16195H02263N772O6575M540K4398J15542D95159L10042r9814K77435j39019k27704
16184F16099L8883M3360O420k95953N17187m22174l224K13130M10387j03756k12946
16173H07413J84665m63419n189K13386l19748m0485m7962J88061k926K23623k47883
16162D89536J95630k13715N251M1377J04995J50282J58508D51181K54629m1430
16152F64380j9911k24897L47145k91516M16293l84623J45441k89153K46824p6004
16142E33979k33209j14904L28408k52813O35523C27911Q1341K51464k37867r3621
16132C29228K61778p5806L5588K70718C69834J14671j59629K41779a7808E69420
$$ plain form
16121 231126 305680 351174 72016 69206 464715 354460 146408 63170 278942 69348 274534
16110 274534 140105 400669 373841 631660 177411 166521 365667 478685 311993 443900
16100 443900 202147 169151 -123369 266963 452845 109869 433163 226543 212015 182152
16090 182152 259070 -101858 422439 470664 271908 396475 163247 168888 512820 192128
16079 342296 501440 302214 525629 75781 56403 651779 171772 179167 348743 284760
16069 284760 137853 -92196 231736 238331 293656 77232 384895 -38433 328145 354538 -60304
16057 280270 334906 54715 163130 342318 349221 147913 215388 26086 -2615 377589 393652
16046 393652 -75385 203429 -33209 97757 267632 356160 -22626 216570 158492 220991 263154
$$ packed form
16121B31126P4554M5494G2016k810L95509j10255A46408F3170K15772F9348K05186
16110B74534j34429K60564k6828K57819A77411j0890J99146J13018j66692J31907
16100D43900B02147l2996a23369B66963J85882A09869L23294k06620j4528k9863
16090A82152P6918a01858D22439M8225j98756J24567A63247N641L43932A92128
16079C42296J59144j99226K23415G5781j9378N95376A71772P395J69576o3983
16069B84760A37853i2196B31736O595N5325G7232L07663c8433C28145K6393f0304
16057B80270N4636E4715J08415J79188O903A47913O7475B6086b615C77589J6063
16046C93652g5385B03429c3209I7757J69875Q8528b2626B16570n8078O2499M2163
$$ plain form
16035 263154 155664 316836 349365 98394 61529 -247962 -22976 32494 180452 13575 89297
16024 89297 -73318 200825 321247 59711 220337 76192 359010 264378 262531 -18762 115946
16012 246680 -46386 48876 54671 218961 190039 219026 -119197 174097 -117021 310973 -608
16000 -20719 391593 -9863 -148287 -46105 454122 134710 61208 210263 264677 -77287 350681
15988 70745 101083 334674 621150 392189 659252 479952 98795 114444 178888 46582 62769
15977 62769 303423 259958 87203 297216 -116215 238420 -113591 72841 282607 -9832 44218
15965 330883 162515 -141678 271984 -16979 39601 109051 -158090 -112047 107613 21137
15954 84394 -215568 50040 444690 -80983 -53515 45051 -214367 134494 -118903 298189
$$ packed form
16035B63154j07490J61172L2529I8394l6865b47962b2976C2494J47958A3575P5722
16024H9297g3318B00825J20422E9711J60626G6192K82818r4632j847a8762A15946
16012B46680d6386D8876N795J64290k8922K8987a19197A74097a17021C10973f08
16000b0719C91593i863j38424d6105D54122A34710F1208J49055N4414g7287C50681
15988G0745L0338K33591K86476k28961K67063j79300I8795J5649O4444D6582J6187
15977F2769K40654m3465H7203K10013a16215B38420a13591G2841K09766i832D4218
15965C30883A62515a41678B71984a6979C9601O9450a58090M6043A07613B1137
15954H4394b15568E0040L94650h0983K7468D5051b14367A34494a18903B98189
$$ plain form
15943 -9222 227068 -25634 -26981 242170 42846 -204926 48999 -151652 49261 -44067 344813
15931 164381 74910 -323830 60955 -51653 -150032 28559 460038 80621 52457 -110759 217822
15919 143478 -223347 -31710 -148595 -176723 262126 -53823 138697 1237 -177233 44953 -15790
15907 -82706 -8880 370248 203426 23185 194706 226269 -416 -116160 -60291 -118989 -73561
15896 -73561 -274632 -111119 264159 213043 -143099 84849 -45909 -10505 -346888 -44262 11652
15884 -170332 -190050 -186533 161231 -144085 185437 -121513 291989 -127573 68740 161353
15874 161353 147570 434425 -16784 90257 111037 117520 23011 18873 9274 -188963 257571
15862 -307980 221683 -97283 -139526 -289749 -411778 225942 -136909 -266914 -417429 -100007
$$ packed form
15943i222B27068b5634j347B42170D2846b04926D8999a51652D9261d4067C44813
15931A64381G4910c23830F0955e1653r8379B8559M31479H0621k8164a10759B17822
15919A43478b23347c1710j16885k8128B62126e3823A38697A237a77233D4953a5790
15907h2706h880C70248j66822B3185J71521L1563d16j15744N5869n8698M5428
15896g3561k01071a11119B64159n1116a43099H4849d5909a0505l36383d4262A1652
15884a70332j9718L517A61231a44085A85437a21513B91989a27573F8740R2613
15874A61353j3783K86855a6784I0257K0780O483B3011m138I274a88963B57571
15862c07980B21683i7283m2243j50223j22029B25942a36909j30005j50515a00007
$$ plain form
15851 -307443 -167010 204527 -15088 -131249 -64397 100076 10568 75340 82748 -288249 -147380
15840 -147380 -67462 69442 37968 8143 123345 33881 -207012 -184635 41953 78426 114418
15829 114418 -371723 -26726 -115160 -188298 -54691 149786 -398308 -3407 125752 -397484 166726
15817 144421 -141149 30770 -62026 -172181 269786 -75708 -48127 -286045 -94662 291626
15806 -86444 -261770 122915 -148520 176123 164365 157176 -32967 12429 79719 -180169 -16026
15794 130947 -32307 172246 -136634 -14460 -106441 80878 161256 -32677 -5246 -199107 -120857
15783 -120857 -11227 88074 48454 -383760 -174050 127772 -277669 25105 57085 -121576
15772 115220 117072 -118751 -131848 45707 -3273 -91045 -141368 208941 366052 -95221 -84724
$$ packed form
15851c07443J40433B04527a5088j16161f4397A00076A0568O4772P408b88249J40869
15840a47380f7462F9442l1474H143J15202C3881b07012K2377D1953L6473L5992
15829A14418c71723b6726q8434p3138e4691A49786c98308c407A25752c97484A66726
15817A44421a41149C0770f2026j10155B69786g5708K7581k37918i4662B91626
15806h6444j75326A22915a48520A76123j1758p189c2967A2429O7290a80169a6026
15794A30947c2307A72246a36634a4460r1981H0878Q0378c2677e246j93861P8250
15783a20857a1227H8074l9620c83760a74050A27772b77669B5105L1980a21576
15772A15220J852a18751j3097D5707c273q7772n0323B08941J57111i5221J0497
$$ plain form
15761 -84724 292211 -183914 58409 49446 232037 -47659 -76822 -100042 19680 -151492 -135049
15750 -135049 -7742 20912 -81167 17912 -17263 187997 350887 -264909 -123017 -32956 -2893
15738 -333837 69508 -155825 127662 -18759 269398 -5758 127265 -8289 29024 -49747 -114119
15727 -114119 42690 -211962 -195179 152142 -156951 -4743 -132438 -134509 399501 -77127 210806
15715 4654 77694 -103480 263193 122922 -185910 177090 6905 280940 -55838 -215816 -15172
15703 3170 -157579 -29902 -129408 -286469 -119024 -139702 -132604 37985 34301 -56959 175552
15691 -210835 51576 -105704 5526 298919 308 -71583 -281967 -203677 -91105 -406261 -250281
15680 -250281 -213166 -10685 -83884 -173167 -194086 213999 78992 -133767 128742 -194180 7059
$$ packed form
15761h4724B92211a83914E8409q963J82591d7659k9163k3220A9680a51492J6443
15750a35049g742B0912h1167A7912a7263A87997J62890b64909a23017c2956b893
15738c33837F9508a55825A27662a8759B69398e758A27265h289B9024d9747o4372
15727a14119D2690b11962J6783A52142a56951d743j27695k071C99501g7127B10806
15715D654P3040a03480B63193A22922a85910A77090F905K74035e5838j59978a5172
15703C170a57579b9902r9506j57061a19024k0678P098C7985l684e6959A75552
15691b10835E1576a05704E526K93393C08g1583k10384P8290i1105l15156J55980
15680b50281L7115a0685p3199q9283k0919B13999G8992a33767A28742a94180G059
$$ plain form
15668 -64178 61659 -385704 -169394 101092 153261 207347 300824 -349583 -116670 -480828
15658 -480828 20776 -180880 -111297 190936 163677 58340 -138771 57648 -22667 -216027 -338992
15647 -338992 32292 -112753 313575 104847 -189119 -74464 102009 -39556 -84204 21142
15636 -74506 69499 -63888 -142216 -49177 -82172 -643 69616 110016 -101923 -59943 -52720 -149760
15624 -149760 -210610 121349 192184 -171921 141552 -107481 72012 -334379 361541 -5501
15613 309889 -83562 -308153 176438 -28947 21411 -288400 -43131 -132525 184049 -270862
15602 -399647 -184376 -261971 -511553 -59381 -19211 -218175 -148749 -266794 -156195 261947
15591 170218 -255831 -151844 -66165 -260435 -160330 -124978 -167937 -118874 379251 17122
$$ packed form
15668f4178F1659c85704a69394A01092N2169N4086R3477c49583a16670l64158
15658d80828B0776a80880O9583A90936k7259E8340a38771E7648b2667j93360j22965
15647c38992C2292a12753C13575A04847a89119g4464A02009c9556m4648B1142
15636g4506F9499f3888p8328d9177l2995f43F9616M0400a01923M1980P223r7040
15624a49760o0850A21349P0835a71921A41552a07481G2012c34379C61541e501
15613C09889h3562k24591A76438b8947B1411b88400d3131q9394A84049b70862
15602c99647a84376p7595k49582e9381a9211j98964O9426j18045J10599B61947
15591A70218b55831J03987f6165j94270J00105L5352m2959M9063C79251A7122
$$ plain form
15580 -299537 201146 211826 -125806 9187 42725 34379 -62598 47122 -61869 -3871 323373
15568 -72256 -79383 -26390 -325659 -27486 -259204 130669 24328 -380081 -69838 955 186531
15557 186531 54156 -112605 -167744 178954 -342840 243523 119013 174595 160706 228017
15547 228017 181673 65202 -19335 148970 -64870 120730 47417 -80668 -241216 386800 -56528
15535 40990 -186428 223095 -90701 275897 -78752 -17957 -14063 34475 -55274 -364410 -176984
15523 -68933 244290 71151 44281 -132755 -232612 -157628 212700 84649 -73346 -203517 146138
15511 -68801 -37315 24028 -92304 -21520 -183701 -35041 370682 -193125 -195612 -193052 -211957
15500 -211957 93322 185149 -66548 176962 77264 -205414 6905 32661 -7731 47360 264800
$$ packed form
15580b99537B01146J0680a25806I187L3538q346f2598D7122f1869c871C23373
15568g2256p127b6390k99269b7486k31718A30669B4328c80081f9838I55J85576
15557A86531E4156a12605n5139A78954c42840B43523A19013N5582j3889O7311
15547B28017m6344F5202a9335A48970f4870A20730D7417h0668j60548C86800e6528
15535D0990a86428B23095i0701B75897g8752a7957L894C4475e5274l09136a76984
15523f8933B44290G1151k6870a32755r9857P4984B12700H4649g3346j30171A46138
15511f8801L1486B4028i2304b1520j62181c5041C70682a93125k487K560j8905
15500b11957I3322R1827f6548A76962G7264b05414F905K5756g731D7360K17440
$$ plain form
15489 264800 -246481 53192 -258267 -27155 140767 283884 -300498 133233 -132543 -5678
15478 214737 -369091 -226501 544 -23408 340184 183580 -27389 -216618 -129374 129656 -200273
15466 -61846 78350 84546 -218620 38525 17073 -68791 -120505 266285 155218 743 69152 -62390
15453 -38702 92087 118775 71207 185542 48013 12048 1438 6919 -30662 115650 -168003
15441 -36222 169472 111454 -29769 275616 479257 -73527 191839 -132365 -147031 -8570 -136264
15430 -136264 36013 -159679 -82443 317216 -136539 281887 -211439 14067 97774 -145655
15419 78982 233957 80235 -24951 -41361 47091 -134892 23525 -256137 -181451 -134465 153705
15407 -240504 -137867 -13070 -343179 303234 -39453 147055 -99072 23260 -173516 331851
$$ packed form
15489B64800b46481E3192b58267b7155A40767J43117c00498A33233a32543e678
15478B14737c69091J42590E44b3408C40184j56604b7389j89229Q7244A29656b00273
15466f1846G8350O196b18620C8525A7073f8791n1714B66285j11067G43O8409f2390
15453c8702I2087K6688m7568J14335D8013A2048A438N481c0662A15650a68003
15441c6222A69472n8018b9769B75616K03641g3527A91839a32365j4666h570j27694
15430a36264C6013a59679P7236C17216a36539B81887b11439A4067Q3707a45655
15419G8982J54975H0235b4951j6410D7091a34892B3525b56137P4686M6986A53705
15407b40504J02637a3070l30109C03234c9453A47055i9072B3260a73516C31851
$$ plain form
15396 -226114 -56413 52907 38896 59692 131325 -2124 -294844 119869 169629 455175 118201
15384 47082 -149498 79720 -31474 -118906 -220995 -6727 297137 -1972 -262319 240676 178150
15373 178150 219779 81127 24136 101248 109407 -155389 274713 -10977 -100086 -4151 -62738
15362 -62738 -119981 199250 77476 305198 -128964 65878 106692 13031 144489 104703 -170859
15350 -191953 -50155 65795 12108 44077 -19682 192616 77799 232051 7270 15465 142208
15339 142208 -103538 195864 -60905 -10715 -91287 -15087 91392 47634 -235698 175774 76049
15327 88475 -48628 170991 -344148 -63295 -4604 224635 -32073 -127236 161085 -200752 -216370
15316 -216370 5935 -158121 150909 12471 -261306 204630 -249883 9973 80702 -154510 348650
$$ packed form
15396b26114e6413E2907j4011K0796P1633b124k92720A19869M9760K85546A18201
15384D7082a49498G9720c1474q7432j02089f727B97137a972k60347B40676o2526
15373A78150M1629H1127B4136P7112Q159a55389B74713a0977q9109d151n8587
15362f2738n7243A99250G7476K27722a28964F5878M0814A3031J31458l9786a70859
15350a91953e0155F5795A2108L1969a9682A92616G7799J54252G270Q195J26743
15339A42208a03538A95864f0905a0715q0572a5087I1392m3758b35698A75774G6049
15327H8475d8628A70991c44148f3295d604B24635c2073r5163A61085b00752j5618
15316b16370E935a58121A50909A2471b61306B04630b49883I973P0729a54510C48650
$$ plain form
15304 114504 -11088 302415 -150963 112583 42588 -33994 24763 119448 -21213 -135647 252167
15292 28084 -21430 236634 -66199 83822 -72259 -126143 -112105 216676 73926 -37356 -140094
15281 -140094 121660 208608 54822 -79336 136528 23613 419543 -175870 147494 -26882
15270 93759 115344 -301523 -64241 -24725 158376 -60266 172617 273614 190880 224565 -34762
15258 161941 241604 -21784 -29976 -9619 432608 52789 -26014 976497 889259 990260 1014987
15247 1014987 664984 374733 -133355 69755 75499 185404 234660 4516 203614 -38651 28529
15235 -13605 -127617 188989 -226700 45642 -26619 -28792 319599 236283 159531 -73122 -7302
15223 -182858 -101358 -20784 -120986 352722 -62503 28634 -55477 75028 -73080 -97301 16833
$$ packed form
15304A14504a1088C02415a50963A12583D2588c3994B4763R4685b1213j14434B52167
15292B8084b1430B36634f6199H3822g2259n3884J4038B16676G3926c7356j02738
15281a40094A21660Q6948E4822g9336A36528B3613L95930a75870A47494b6882
15270I3759K1585c01523f4241b4725A58376f0266A72617J00997q2734L3685c4762
15258A61941P9663b1784q192i619D32608E2789b6014I76497q7238J01001K4727
15247A014987l50003k90251a33355F9755N744J09905M9256D516J99098c8651B8529
15235a3605j14012A88989b26700D5642b6619k173C19599q3316p6752g3122g302
15223a82858Q1500b0784j00202C52722f2503B8634e5477G5028g3080k4221A6833
$$ plain form
15211 -343194 151743 -90305 108687 88471 -85724 -156799 229870 34993 -130653 118756
15200 164696 232599 27184 115139 69969 -79090 247171 33847 -284 -33752 -133263 54293 61388
15188 61388 93345 134718 75545 277262 111446 -98710 114559 172980 -219636 179402 -86237
15176 -124771 166156 104939 -267281 -229990 54072 229957 68546 -184086 246858 21532
15165 63557 -129378 69418 333010 213518 5219 186009 193511 27490 -139633 -22270 -213349
15154 -213349 195459 170825 4508 -109933 14846 50573 -2117 195896 7211 109859 -140473
15142 176864 249267 6409 -26816 260281 49828 -218246 -145708 -56747 81577 62185 -131137
15130 442549 390767 3479 277225 -18394 107986 142679 134456 250594 64536 -123260 206287
$$ packed form
15211c43194A51743i0305A08687k0216h5724p1075B29870C4993a30653A18756
15200A64696O7903B7184Q7955m5170g9090B47171C3847b84l3468r9511E4293P095
15188F1388L1957M1373n9173K01717A11446i8710A14559N8421b19636A79402h6237
15176a24771A66156o1217b67281L7291E4072J75885F8546a84086B46858B1532
15165F3557a29378F9418K63592j19492E219J80790P502B7490a39633b2270j91079
15154b13349A95459k4634D508a09933A4846L5727b117A95896G211J02648a40473
15142A76864P2403F409b6816B60281D9828b18246P2538e6747H1577j9392a31137
15130D42549n1782C479K73746a8394A07986L4693q223J16138F4536a23260B06287
$$ plain form
15118 -85428 106203 24415 123530 366370 199973 314279 -143470 -139071 93832 54846 -172079
15106 -238223 75708 76632 50074 383160 -191731 -95943 44449 -37205 133302 408478 526771
15095 526771 330200 150868 23734 -198614 44630 145850 -64909 -51130 -35872 -70042 213161
15083 194469 -101850 -85670 161573 372671 89281 -54117 -52092 157986 112226 264508 70634
15071 -140248 246373 178028 268381 -467782 46696 153449 275560 -82670 -163065 225165
15060 -100257 164967 -19952 115116 -22945 484159 -122377 86391 299907 401522 211270
15050 211270 177452 261334 255879 150550 174104 238881 300766 48429 391113 184671 546223
15039 546223 166369 101047 176021 391190 156121 169996 366092 366055 296196 137122 132892
$$ packed form
15118h5428A06203B4415R9115K42840j66397J14306a43470M399I3832l8986a72079
15106b38223G5708R24k6558L33086a91731R5788D4449c7205A33302K75176J18293
15095E26771j96571A50868B3734a98614D4630J01220f4909J3779J5258l4170B13161
15083A94469a01850J6180A61573K11098H9281e4117K025A57986m5760J52282G0634
15071a40248B46373o8345R0353d67782D6696J06753J22111h2670q0395B25165
15060a00257A64967a9952A15116b2945D84159a22377H6391K13516J01615j90252
15050B11270l3818Q3882n455j05329K3554O4777O1885D8429L42684A84671L61552
15039E46223A66369o5322P4974K15169A56121J3875J96096l7o9859A37122m230
$$ plain form
15028 132892 240786 390448 238108 194127 242879 278257 245697 111526 245594 171462
15018 171462 -46159 316866 115795 302884 451482 -207592 254979 294568 227647 386107
15008 386107 312608 235566 463973 74807 323997 274944 487527 -82733 254466 166159 323097
14997 323097 332099 118399 123425 459862 309784 155571 203436 -18721 378255 -26591 185559
14985 143200 403875 51512 210694 223717 -24357 99614 -32756 131146 332264 280186 375469
14974 375469 114357 426544 342646 208244 377314 312682 589914 233996 121036 445659
14964 445659 338098 453202 148497 328314 -54406 282966 452764 327213 116839 358774
14954 358774 268081 191149 369730 89288 152969 49380 145378 76853 198260 506980 143317
$$ packed form
15028A32892J07894J49662j52340m3981M8752L5378l2560A11526J34068p4132
15018A71462d6159C16866A15795J87089J48598b07592B54979L9589o6921J58460
15008C86107p3499p7042K28407G4807K49190m9053K12583h2733B54466q8307J56938
14997C23097R002A18399N026L36437j50078j54213M7865a8721C78255b6591A85559
14985A43200K60675E1512J59182J3023b4357I9614c2756A31146K01118n2078R5283
14974C75469A14357L12187q3898j34402J69070o4632K77232B33996j12960L24623
14964D45659j07561J15104A48497J79817e4406B82966J69798j25551A16839K41935
14954C58774r0693p6932J78581H9288O3681D9380R5998o8525J21407L08720A43317
$$ plain form
14942 298232 246687 571431 450535 284024 549657 485457 23128 158421 255883 121884
14931 494821 459435 518170 386982 410332 693131 649894 521914 545463 751301 909187
14921 909187 463006 651146 564119 801590 621346 352390 653115 461837 632689 456039
14911 456039 515325 386615 387854 390040 601537 326967 466922 432787 102609 478116 357867
14900 357867 450010 519109 519543 285650 403407 24793 409111 444654 606331 558626 107750
14888 5641 580114 44165 327718 191849 296862 496337 584977 634590 229050 -21953 556302
14876 330006 588602 665456 423409 285701 -62160 577781 372056 495591 475798 108575
14865 250430 414907 654394 272197 404106 357514 296134 487906 363449 321694 268725
$$ packed form
14942B98232n1545L24744j20896j66511K65633o4200B3128J35293R7462A21884
14931D94821l5386N8735j31188K3350K82799m3237j27980K3549K05838J57886
14921I09187m46181J88140q7027K37471j80244k68956L00725j91278J70852j76650
14911D56039N9286j28710J239K186K11497k74570J39955l4135A02609L75507j20249
14900C57867R2143O9099M34k33893J17757B4793L84318L5543J61677m7705A07750
14888E641N74473D4165K83553j35869J05013J99475Q8640M9613B29050b1953E56302
14876C30006K58596P6854k42047j37708f2160E77781k05725J23535j9793A08575
14865B50430J64477K39487B72197J31909m6592o1380J91772j24457m1755n2969
$$ plain form
14855 268725 321822 145442 358292 616136 377763 416164 399154 472207 276069 257093
14845 257093 431059 579091 519992 512979 554966 153939 781232 727580 761687 557167 674569
14834 674569 550584 822553 473169 458727 378683 502537 181178 28038 381797 750248
14824 750248 191360 161621 382583 415223 673443 398216 680861 584185 308541 572736
14814 572736 256472 587376 186672 629404 335580 690581 164226 437616 557544 658397
14804 658397 295260 483473 683162 254448 656512 249650 330161 615742 747569 275504
14793 628105 439807 704792 397005 574615 480906 336947 587474 855548 692356 672855
14783 672855 604741 609464 141575 326406 516411 763650 609714 855359 434712 589422
$$ packed form
14855B68725N3097A45442K12850K57844k38373L8401j7010P3053j96138j8976
14845B57093J73966J48032n9099p013M1987A53939O27293n3652L4107k04520J17402
14834F74569j23985K71969l49384j4442q0044J23854A81178B8038L53759L68451
14824G50248A91360k9739K20962L2640K58220k75227K82645r6676k75644K64195
14814E72736B56472L30904A86672M42732k93824L55001A64226K73390J19928J00853
14804F58397B95260J88213J99689B54448M02064B49650Q0511K85581J31827B75504
14793F28105j88298K64985l07787J77610r3709j43959K50527K68074j63192j9501
14783F72855o8114M723A41575J84831J90005K47239j53936K45645m20647J54710
$$ plain form
14773 589422 365283 649282 286626 759459 576700 444977 310639 295056 472382 649983
14763 649983 161138 325341 536291 656747 307626 319624 678657 495051 525957 585929
14753 585929 366342 434896 452544 449099 532316 564384 928548 938736 276585 470866 826996
14742 826996 676184 589718 603729 542906 662670 721694 624839 849726 640567 842786
14732 842786 719780 806859 474117 905079 794258 663519 906650 678752 855556 704588
14722 704588 727453 571435 966254 949354 860642 716316 1004344 673900 840048 858761
14712 858761 729792 837117 794440 681300 692930 444727 815449 774569 1130794 776642
14702 776642 1067432 713387 991727 835960 1206189 801642 847209 911984 1185404 781181
$$ packed form
14773E89422k24139K83999B86626M72833j82759j31723j34338j5583J77326J77601
14763F49983A61138J64203K10950J20456C07626J1998L59033j83606L0906N9972
14753E85929k19587O8554J7648l445Q3217L2068L64164J0188B76585J94281L56130
14742H26996j50812q6466J4011o0823J19764N9024r6855K24887k09159K02219
14732H42786j23006Q7079l32742M30962j10821j30739K43131k27898J76804j50968
14722G04588K2865j56018L94819j6900q8712j44326K88028l30444J66148J8713
14712H58761j28969J07325m2677j13140J1630k48203L70722m0880L56225l54152
14702G76642K90790l54045K78340j55767L70229m04547M5567O4775K73420m04223
$$ plain form
14692 781181 1034236 834614 952112 876636 840302 814498 848697 819282 589445 1033357
14682 1033357 960800 1018250 902094 930848 791231 871151 820237 649487 869278 766036
14672 766036 733448 980694 824133 782289 840313 724885 860822 1189319 1086318 978921
14662 978921 981554 930359 1175543 1063485 976914 822542 1280482 907554 1039350 741636
14652 741636 1026827 1134575 669797 1146006 1152178 1215066 1215236 1266584 1123238 1225184 980390
14641 980390 1001013 1397432 1338356 914321 1230723 1379245 1413457 1201567 1177208 1410407
14631 1410407 1416553 1098145 1197362 1088014 1544756 1141262 1343545 1233370 1142035 1342450
14621 1342450 1458966 1163759 1021173 1296731 1248533 1112739 1038782 1537135 1443034 1390659
$$ packed form
14692G81181K53055j99622J17498p5476l6334k5804L4199k9415k29837M43912
14682A033357p2557N7450j16156K8754j39617P9920n0914j70750K19791j03242
14672G66036l2588K47246j56561m1844N8024j15428J35937L28497j03001j07397
14662I78921K633n1195K45184j12058q6571j54372M57940l72928J31796k97714
14652G41636K85191J07748m64778M76209O172O2888J70N1348j43346J01946k44794
14641I80390K0623L96419n9076m24035L16402J48522L4212k11890k4359K33199
14631A410407O146l18408R9217j09348M56742m03494K02283j10175r1335K00415
14621A342450J16516k95207j42586K75558m8198j35794p3957M98353r4101n2375
$$ plain form
14611 1390659 1311145 1316517 1276968 1393964 1676505 1494712 1646188 1346142 1540044 1390425
14601 1390425 1378083 1330403 1508211 1556383 1943115 1462021 1575152 1489547 1870333 1244647
14591 1244647 1531009 1809890 1583348 1808860 2002626 1746202 1932544 1772001 1954668
14582 1954668 1900755 1767377 1937910 1843935 1839938 1775832 1955962 1889352 1664882 1821233
14572 1821233 1805718 2055907 1947644 2144186 1951974 1995254 2281516 2234196 2282432 2630976
14562 2630976 2503236 2765657 2881799 2756681 3063464 2810118 3350551 3501334 4192729
14553 4192729 4365118 4935283 5642255 7039504 9696721 15261336 22539162 28383932 25700706
14544 25700706 15885236 8908953 5681987 4198892 3143003 2934581 2364849 2466341
$$ packed form
14611A390659p9514N372l9549J16996K82541j81793J51476l00046J93902j49619
14601A390425j2342m7680J77808M8172L86732m81094J13131q5605L80786o25686
14591A244647K86362K78881k26542K25512J93766k56424J86342j60543J82667
14582A954668n3913j33378J70533r3975l997o4106J80130o6610k24470J56351
14572A821233j5515K50189j08263J96542j92212M3280K86262m7320M8236L48544
14562B630976j27740K62421J16142j25118L06783k53346N40433J50783O91395
14553D192729J72389N70165P06972J397249K657217N564615P277826N844770k683226
14544B5700706r815470o976283l226966j483095j055889k08422n69732J01492
$$ plain form
14536 2466341 2262953 2264359 2040955 2024248 2170773 2375437 2114784 2144783 2057665 1961825
14526 1961825 2398458 2273965 2327956 2096773 2556442 2341155 2735573 2388080 2468038 2574235
14516 2574235 2483978 2755200 2464645 2680376 2486482 2556460 2693513 2738893 2400768 2580471
14506 2580471 2466266 2496790 2624881 2809649 2673091 2853305 3030926 2538132 2702787 3005092
14496 3005092 3116075 3200525 2843453 2703383 3309100 3240171 3218141 3280739 3381223 3236014
14486 3236014 3023261 3345718 3462985 3304665 3427754 3862844 3671130 3463007 3630476
14477 3630476 3457823 3448520 3855279 3593345 4054145 3729137 3629348 4072509 3945089 4195061
14467 4195061 3909201 4099090 3955733 4213048 4175315 4265575 4277410 4183282 4569078 4487733
$$ packed form
14536B466341k03388J406k23404j6707J46525K04664k60653K9999q7118r5840
14526A961825M36633j24493N3991k31183M59669k15287L94418l47493P9958J06197
14516B574235r0257K71222k90555K15731j93894O9978J37053M5380l38125J79703
14506B580471j14205L0524J28091J84768j36558J80214J77621m92794J64655L02305
14496C005092J10983Q4450l57072j40070O05717o8929k2030O2598J00484j45209
14486C236014k12753L22457J17267j58320J23089M35090j91714k08123J67469
14477C630476j72653r303M06759k61934M60800l25008r9789M43161j27420K49972
14467D195061k85860J89889j43357K57315l7733R0260J1835r4128L85796q1345
$$ plain form
14457 4487733 4655624 4807710 4828958 4641598 4769562 4852938 5061828 5242021 4807148 4959191
14447 4959191 5260903 5085411 5163329 5188222 5348677 5217077 5668955 5604681 5580974 5662336
14437 5662336 6099582 5945849 5902483 6213488 6274739 5979598 6051622 6525889 6422944 6655067
14427 6655067 6795393 6676078 6712716 7134087 6936769 6993941 7540712 7238496 7429685 7764315
14417 7764315 7508710 7980803 8067282 8090523 8078048 8444111 8529791 8854383 8268340 8491275
14407 8491275 9144502 9093140 8872913 9478736 9711709 9469241 9688677 9865390 10495533 10692823
14397 10692823 10532395 10508997 10771488 10689026 11142910 11540678 11366663 11684719 11964951 12087327
14387 12087327 12355784 12580777 12625309 12955278 13460910 13606676 13951878 13879599 14123959 14640207
$$ packed form
14457D487733J67891J52086K1248j87360J27964Q3376K08890J80193m34873J52043
14447D959191L01712j75492P7918K4893J60455j31600M51878o4274k3707Q1362
14437E662336M37246j53733m3366L11005O1251k95141P2024M74267j02945K32123
14427F655067J40326j19315L6638M21371j97318N7172N46771l02216J91189L34630
14417G764315k55605M72093Q6479K3241j2475L66063Q5680L24592n86043K22935
14407H491275O53227n1362k20227O05823K32973k42468K19436J76713O30143J97290
14397A0692823j60428k3398K62491q2462M53884L97768j74015L18056K80232J22376
14387A2087327K68457K24993M4532L29969N05632J45766L45202p2279K44360N16248
$$ plain form
14377 14640207 14873554 14841267 15431177 15917574 16185245 16430799 16583224 17130839 17408471
14368 17408471 17774740 17955259 18553518 18968076 19108812 19682063 19928898 20630649 21240047
14359 21240047 21748831 22101631 22691678 23073918 23764281 24453436 24717771 25441544 25961769
14350 25961769 26718008 26931403 28033956 28605859 29553195 30189275 31416479 32095162 32457595
14341 32457595 33570312 34789137 35581073 36667333 37683202 38997637 39788433 41307991
14333 41307991 41877646 43736848 44789080 46504776 47854764 49326487 51139836 52572349
14325 52572349 54435540 56457767 58115353 60148793 62499815 64866231 67019380 69028934
14317 69028934 72069409 74784387 77495121 80537921 83742024 87049514 90387652 94259740
$$ packed form
14377A4640207K33347l2287N89910M86397K67671K45554J52425N47615K77632
14368A7408471L66269J80519N98259M14558J40736N73251K46835P01751O09398
14359B1240047N08784L52800N90047L82240O90363O89155K64335P23773N20225
14350B5961769P56239K13395J102553N71903R47336O36080J227204O78683L62433
14341C2457595J112717J218825P91936J086260J015869J314435P90796J519558
14333D1307991N69655J859202J052232J715696J349988J471723J813349J432513
14325E2572349J863191K022227J657586K033440K351022K366416K153149K009554
14317F9028934L040475K714978K710734L042800L204103L307490L338138L872088
$$ plain form
14309 94259740 97945939 101901900 106755661 110948287 115995997 121003745 126595402 132294344
14301 132294344 138282549 144655171 151338761 158444862 166266400 173678096 182187252 191295120
14293 191295120 200465962 210009894 220289704 230836314 242062751 253195797 265082579
14286 265082579 277599202 289931233 302442507 315375751 328431574 341096648 353724430
14279 353724430 366021700 377606480 388351255 398290661 407299558 414555280 419610322
14272 419610322 422781742 423821145 424123479 422684713 419339477 414709781 408705080 400537892
14264 400537892 390880343 379934121 367839634 354865266 341563654 327853752 314207842
14257 314207842 301067011 287567680 274717097 261829662 249644927 237699778 226620540
$$ packed form
14309I4259740L686199L955961M853761M192626N047710N007748N591657N698942
14301A32294344N988205O372622O683590P106101P821538P411696Q509156R107868
14293A91295120R170842R543932J0279810J0546610J1226437J1133046J1886782
14286B65082579J2516623J2332031J2511274J2933244J3055823J2665074J2627782
14279C53724430J2297270J1584780J0744775R939406R008897P255722N055042
14272D19610322L171420J039403L02334j438766l345236m629696o004701q167188
14264D00537892r657549j0946222j2094487j2974368j3301612j3709902j3645910
14257C14207842j3140831j3499331j2850583j2887435j2184735j1945149j1079238
$$ plain form
14250 226620540 215740382 205416186 195675521 186446174 177597915 169591589 161666909 154173072
14242 154173072 147364596 140532282 134455901 128561018 123148808 117679716 112800667 108051147
14234 108051147 103708049 99176297 95516020 91526431 88142806 84730739 81491172 78164817
14226 78164817 75385147 72448448 69915345 67043789 64718772 62673718 61024729 58544084
14218 58544084 57001962 54842451 53243629 51247091 49908919 48346437 46968278 45415773
14210 45415773 44230284 42935857 41721099 41238779 39272630 38130336 37365195 36064556
14202 36064556 35133847 34467224 33601156 32494402 31526112 30830584 30106591 29492072 28634753
14193 28634753 28029446 27161212 26342909 26063108 25519003 24921511 24271652 23780333 23022925
$$ packed form
14250B26620540j0880158j0324196r740665r229347q848259q006326p924680p493837
14242A54173072o808476o832314o076381n894883n412210n469092m879049m749520
14234A08051147m343098m531752l660277l989589l383625l412067l239567l326355
14226G8164817k779670k936699k533103k871556k325017k045054j648989k480645
14218E8544084j542122k159511j598822j996538j338172j562482j378159j552505
14210D5415773j185489j294427j214758m82320j966149j142294p65141j300639
14202C6064556r30709o66623q66068j106754r68290o95528p23993o14519q57319
14193B8634753o05307q68234q18303k79801n44105n97492o49859m91319p57408
$$ plain form
14184 23022925 22730406 22076196 21503183 21081410 20844352 20244077 19732897 19228808 19060440
14175 19060440 18965318 18346800 17775208 17905168 17122889 17087858 16483662 16154520 16005563 15778290
14165 15778290 15435650 14952886 14788723 14738880 14178840 14043951 13899876 13575537 13361707
14156 13361707 13390123 12934339 12959892 12362138 11861130 12018652 11846912 12075832 11518899 11337933
14146 11337933 11064674 11331517 10509283 10313884 10458675 10415319 10072063 9956792 9877757 9623904
14136 9623904 9797740 9295726 9030393 9114630 9117662 8742095 8850121 8427060 8617148 8355499
14126 8355499 8147272 7942070 8056102 7578108 7937850 7787112 7777895 7286308 7181158 7469706
14116 7469706 7101911 7125549 6908848 6872751 6756998 6512061 6617226 6553168 6520280 6335733
$$ packed form
14184B3022925k92519o54210n73013m21773k37058o00275n11180n04089j68368
14175A9060440r5122o18518n71592J29960p82279l5031o04196l29142j48957k27273
14165A5778290l42640m82764j64163m9843n60040j34889j44075l24339k13830
14156A3361707K8416m55784K5553n97754n01008J57522j71740K28920n56933j80966
14146A1337933k73259K66843q22234j95399J44791m3356l43256j15271p9035k53853
14136I623904J73836n02014k65333Q4237L032l75567J08026m23061J90088k61649
14126H355499k08227k05202J14032m77994L59742j50738r217m91587j05150K88548
14116G469706l67795K3638k16701l6097j15753k44937J05165o4058l2888j84547
$$ plain form
14106 6335733 6301596 6246867 6145232 6313703 5907334 5750353 6071190 5923057 5981572 5680591
14096 5680591 5463840 5309106 5613658 5317823 5490957 5057028 5227642 5397784 5158602
14087 5158602 5103143 5085253 4701883 4894763 4985244 5022629 4898967 4743070 4690388 4591484
14077 4591484 4650389 4342056 4291526 4686168 4520551 4418090 4556801 4216221 4425383 4131159
14067 4131159 4087133 3979182 4298185 4458987 4001010 4237893 4289777 4077850 3896334 3945412
14057 3945412 4022426 3940170 3676779 3768888 3768735 3404596 3451750 3404719 3601977 3623329 3307034
14046 3307034 3606159 3348877 3202452 3212631 3195708 3071643 3147067 3170434 3282956 3190578
14036 3190578 3024723 3002025 3125657 3269074 2967025 2807168 3136431 2919919 2813926 3036398
$$ packed form
14106F335733l4137n4729j01635J68471m06369j56981L20837j48133N8515l00981
14096E680591k16751j54734L04552k95835J73134m33929J70614J70142k39182
14087E158602n5459j7890l83370J92880R0481L7385j23662j55897n2682r8904
14077D591484N8905l08333n0530L94642j65617j02461J38711l40580K09162k94224
14067D131159m4026j07951L19003J60802m57977K36883N1884k11927j81516M9078
14057C945412P7014q2256k63391R2109j53l64139M7154m7031J97258K1352l16295
14046C307034K99125k57282j46425J0179j6923j24065P5424K3367J12522r2378
14036C190578j65855k2698J23632J43417l02049j59857L29263k16512j05993K22472
$$ plain form
14026 3036398 2776731 2879435 2799060 2779474 2720944 2571524 2695899 2759461 2457591 2560369
14016 2560369 2463894 2642670 2551439 2655167 2478376 2499202 2437803 2544401 2316793 2388966
14006 2388966 2183001 2138946 2334644 2132797 2190203 2362729 2006475 2350096 2260899 2683496
13996 2683496 2629977 2443159 2778234 2865766 3104390 3591079 4433114 5957381 9463565
13987 9463565 15453282 25181376 27489685 20114663 13169498 8937928 6917406 5459020
13979 5459020 4352377 3907973 3483667 3198295 3156181 2452008 2991293 2763095 2860558 2484709
13969 2484709 2526480 2536303 2366133 2395346 2662844 2161727 1965405 2380696 1938813 2285141
13959 2285141 2414674 2059192 1803437 2211865 2049062 2038102 1957128 2063196 1973063 1701478
$$ packed form
14026C036398k59667J02704q0375j9586n8530j49420J24375O3562l01870J02778
14016B560369r6475J78776r1231J03728j76791K0826o1399J06598k27608P2173
14006B388966k05965m4055J95698k01847N7406J72526l56254L43621q9197M22597
13996B683496n3519j86818L35075Q7532K38624M86689Q42035J524267L506184
13987I463565N989717R728094K308309p375022o945165m231570k020522j458386
13979E459020j106643m44404m24306k85372m2114p04173N39285k28198R7463l75849
13969B484709M1771R823j70170K9213K67498n01117j96322M15291m41883L46328
13959B285141J29533l55482k55755M08428j62803j0960q0974J06068r0133k71585
$$ plain form
13949 1701478 2052382 1854122 1751713 1647839 1968592 1508784 1881240 1720161 1614382
13940 1614382 1973678 1888768 1514882 1515378 1817374 1762807 1626345 1577978 1715367 1631281 1452761
13929 1452761 1728799 1524516 1604475 1724816 1416084 1766487 1338635 1297915 1404336 1484199
13919 1484199 1407383 1708415 1260948 1368155 1470643 1386842 1470291 1424086 1330249 1445646
13909 1445646 1458541 1585429 1252305 1438586 1632456 1603821 1176481 1309391 1455266 1464811
13899 1464811 1122349 1135972 1151914 1310542 1355969 1071901 935853 1336922 1298737 1174311
13889 1174311 1276498 1359529 1221973 1387353 1227706 1535642 1192228 1317032 1507713 980721
13879 980721 1175104 930921 1076828 1274105 813306 1262756 1183021 1241090 1342244 965072
$$ packed form
13949A701478L50904j98260j02409j03874L20753m59808L72456j61079j05779
13940A614382L59296q4910l73886M96L01996n4567j36462m8367J37389q4086j78520
13929A452761K76038k04283P9959J20341l08732L50403m27852m0720J06421P9863
13919A484199p6816L01032m47467J07207J02488q3801Q3449m6205r3837J15397
13909A445646J2895J26888l33124J86281J93870k8635m27340J32910J45875R545
13899A464811l42462J3623J5942J58628M5427k84068j36048M01069l8185j24426
13889A174311J02187Q3031j37556J65380j59647L07936l43414J24804J90681n26992
13879I80721J94383k44183J45907J97277m60799M49450p9735N8069J01154l77172
$$ plain form
13869 965072 871643 1546434 986476 837569 1077442 1037403 1304810 1323463 1068160 910368
13859 910368 1219663 1380964 1125953 1011547 863257 1043260 1168359 1165246 1358601 910635
13849 910635 898796 1006537 782584 1370274 888516 867203 1153032 849269 1025964 1213606
13839 1213606 1101952 981770 963882 684752 927049 922237 770186 894186 1095867 1007717
13829 1007717 944194 1049188 1022023 696561 883262 865890 860104 1185831 1058191 1015734
13819 1015734 770876 770248 466614 489930 889242 939834 766057 811378 821368 937882 1097271
13808 1097271 819498 654725 780209 1168834 683114 670819 1188702 1168364 712194 959600
13798 959600 773971 936744 797091 705989 548356 551277 673376 566635 941905 966974
$$ packed form
13869I65072r3429O74791n59958j48907K39873m0039K67407J8653k55303j57792
13859I10368L09295J61301k55011j14406j48290J80003J25099l113J93355m47966
13849I10635j1839J07741k23953N87690m81758k1313K85829l03763J76695J87642
13839A213606j11654j20182j7888k79130K42297m812j52051J24000K01681q8150
13829A007717o3523J04994k7165l25462J86701j7372n786L25727j27640m2457
13819A015734k44858o28l03634K3316L99312N0592j73777M5321R990J16514J59389
13808A097271k77773j64773J25484L88625m85720j2295N17883k0338m56170K47406
13798I59600j85629J62773j39653r1102j57633K921J22099j06741L75270K5069
$$ plain form
13788 966974 732444 614706 933792 937682 769155 739918 880367 532573 605997 783381
13778 783381 841249 817833 819862 462068 425663 595974 1184105 425452 554620 680325
13768 680325 521826 534590 796543 710918 895029 824178 805368 478823 688895 762113
13758 762113 662928 1183196 720907 603587 488593 722770 795013 752561 768493 673592
13748 673592 688179 739479 648881 636347 593918 662131 494204 618447 612815 182052 700568
13737 700568 556610 323279 443125 335417 602319 521188 1086860 433835 605997 387847
13727 387847 387608 510184 717838 506481 521220 674215 245983 522305 759720 607614
13717 607614 419381 648591 677501 496490 621585 644833 615715 533937 612708 418905
$$ packed form
13788I66974k34530j17738L19086L890j68527k9237J40449l47794P3424J77384
13778G83381N7868k3416K029l57794l6405J70311N88131D25452J29168J25705
13768F80325j58499J2764K61953q5625J84111p0851j8810l26545K10072P3218
13758G62113r9185N20268m62289j17320j14994K34177P2243m2452J5932r4901
13748F73592J4587N1300r0598j2534m2429O8213j67927J24243n632A82052N18516
13737G00568j43958k33331J19846j07708K66902q1131N65672D33835J72162k18150
13727C87847k39J22576K07654k11357J4739J52995B45983K76322K37415j52106
13717F07614j88233K29210K8910j81011J25095K3248k9118q1778P8771j93803
$$ plain form
13707 418905 514924 758833 673068 480291 554731 750889 623734 148147 678938 692078
13697 692078 573821 373715 387043 745132 552061 271985 515244 576016 336955 533390
13687 533390 854849 657903 787357 203423 766475 313857 505236 374548 641669 601638
13677 601638 593914 372810 407618 1048483 722781 379185 376447 414793 428839 564405 646493
13666 646493 634863 630196 549962 433361 424031 300018 288513 552062 222178 757318 534062
13655 534062 378027 388277 464992 691996 594662 629293 273268 314116 134368 461955
13645 461955 264462 423327 512317 526193 403510 604983 533645 362945 423884 497468
13635 497468 468257 508974 623718 388408 362842 465609 283941 524333 401914 316212
$$ packed form
13707D18905R6019K43909q5765j92777P4440J96158j27155A48147N30791J3140
13697F92078j18257k00106J3328L58089j93071B71985K43259O0772k39061J96435
13687E33390L21459j96946J29454B03423N63052C13857J91379j30688K67121m0031
13677F01638p724k21104L4808O40865l25702l43596k738L8346J4046J35566Q2088
13666F46493j1630m667q0234j16601r330j24013j1505K63549B22178N35140k23256
13655E34062j56035J0250P6715K27004r7334L4631B73268M0848A34368L27587
13645D61955j97493J58865Q8990J3876j22683K01473p1338j70700O0939P3584
13635D97468k9211M0717J14744k35310k5566J02767j81668K40392j22419q5702
$$ plain form
13625 316212 623201 278677 605670 372473 377610 455974 399478 598124 280011 469654
13615 469654 419805 320352 301749 421868 421223 406544 392279 423815 328375 99326 482228
13604 482228 358223 347077 465169 384459 380302 504085 89363 259970 251200 422169 663670
13593 663670 353825 626439 351140 202288 350557 622740 346713 460863 291016 384861
13583 384861 171501 532588 338715 421460 258380 887098 34920 147859 355107 36156
13572 190460 187015 481478 491356 144210 692557 417609 505419 652931 363501 275741 329446
13561 329446 198380 265310 421826 597681 437250 458114 -23329 199907 547458 219390
13550 541305 -12362 288394 248389 470985 457165 541974 249854 371478 406940 628247
$$ packed form
13625C16212L06989B78677L26993k33197N137P8364n6496J98646B80011J89643
13615D69654m9849r9453j8603J20119o45j4679j4265L1536r5440I9326L82902
13604D82228j24005j1146J18092q0710m157J23783H9363J70607q770J70969K41501
13593F63670l09845K72614k75299j48852J48269K72183k76027J14150j69847R3845
13583C84861A71501L61087j93873Q2745j63080O28718C4920J12939K07248C6156
13572A90460l445K94463R878A44210N48347k74948Q7810J47512k89430q7760N3705
13561C29446j31066O6930J56516J75855j60431K0864b3329A99907L47551B19390
13550E41305a2362B88394m0005K22596j3820Q4809B49854J21624L5462K21307
$$ plain form
13540 628247 116715 80203 496484 246644 407522 266653 160037 580565 6422 381148
13530 381148 151555 463070 481250 276655 371895 469624 293009 478090 288129 19127
13519 77366 177368 480249 85261 238715 189742 371608 266089 343755 239306 565779
13509 565779 21284 253386 472340 348552 381361 448268 -2621 216623 425843 38905 181540
13498 181540 222818 314997 394678 343368 114837 -195 86631 289671 152149 387422 533104
13487 533104 231326 99271 177037 379735 149377 327602 341101 508027 193512 421238
13477 421238 134836 409657 213839 8309 89352 150063 160035 -105259 367031 6251 435312
13466 435312 320797 397106 176328 139644 70656 75734 219949 283758 390729 103899 148363
$$ packed form
13540F28247A16715l6512M16281B46644J60878j40869j06616M20528F422L74726
13530C81148A51555L11515J8180k04595R5240R7729j76615J85081j89961A9127
13519G7366J00002L02881H5261J53454m8973J81866j05519P7666j04449L26473
13509E65779B1284K32102K18954j23788L2809O6907b621B16623K09220C8905J42635
13498A81540M1278R2179P9681n1310A14837a95H6631K03040j37522K35273J45682
13487E33104B31326I9271P7766K02698A49377J78225J3499J66926A93512K27726
13477D21238A34836K74821j95818H309Q1043O0711R972a05259C67031F251M29061
13466D35312j14515P6309A76328l6684o8988N078J44215O3809J06971A03899M4464
$$ plain form
13455 148363 612308 190717 381441 587424 -12901 -33414 455282 675580 145380 242830
13445 242830 147448 241513 57781 353532 378017 93944 239391 44353 318046 129548 -62643
13433 115492 335326 171116 369194 -168282 75036 291848 252234 144278 261575 410839
13423 410839 50322 192664 -155864 149509 -42044 345795 -47103 34729 185593 81489
13412 206403 319319 229145 363840 78809 83522 -58576 280643 314465 235298 25428 373171
13401 373171 238297 143719 243006 -172492 227853 275953 260947 -18384 393677 394133 388866
13390 388866 156892 42048 -12154 62783 145650 51525 -110389 237079 180210 15337 322448
13379 322448 277420 315074 283807 -4230 -58259 -21355 88227 444175 98021 374414 7832
$$ packed form
13455A48363M63945A90717J90724K05983a2901k0513D55282K20298A45380R7450
13445B42830r5382R4065E7781K95751K4485I3944J45447D4353K73693A29548f2643
13433A15492K19834j64210J98078a68282G5036K16812l9614j07956J17297J49264
13423D10839E0322J42342a55864A49509d2044C45795d7103C4729J50864H1489
13412B06403J12916r0174J34695G8809M713e8576B80643L3822p9167B5428L47743
13401C73171j34874r4578R9287a72492B27853M8100j5006a8384C93677M56n267
13390C88866A56892D2048a2154F2783Q2867E1525a10389B37079n6869A5337L07111
13379C22448m5028L7654l1267d230n4029b1355H8227L55948I8021K76393G832
$$ plain form
13367 282702 488941 396847 438056 289529 349104 275315 257843 -118458 284218 -81660 98939
13355 161393 112218 439 432382 12646 39488 9862 136202 209856 56536 407755 221122
13344 221122 -66179 313548 314162 78243 -26207 72781 -33467 197797 434339 291808 277218
13333 277218 238416 187565 452542 244423 126135 161416 117272 126013 -161446 -75941 13702
13321 509953 164553 241102 320501 47171 114309 492310 84941 130712 60412 155497 269249
13310 269249 427354 24044 219172 555169 49482 129035 208807 158186 245030 119308 388808
13299 388808 296282 99718 245178 492769 160850 220893 109524 293908 203303 33688
13288 24606 343586 85765 345357 337207 23280 -322135 -70235 270817 435375 -13280 42563
$$ packed form
13367B82702K06239r2094M1209j48527N9575p3789j7472a18458B84218h1660I8939
13355A61393m9175D39M31943A2646K6842I862J26340P3654E6536L51219j86633
13344B21122f6179C13548O14G8243b6207G2781c3467A97797K36542j42531j4590
13333B77218l8802n0851K64977k08119j18288L5281m4144Q741a61446g5941A3702
13321E09953A64553P6549P9399D7171O7138L78001H4941M5771F0412R5085J13752
13310B69249J58105B4044J95128L35997D9482P9553P9772n0621Q6844A19308K69500
13299C88808r2526I9718J45460K47591A60850O0043A09524J84384r0605C3688
13288B4606L18980H5765K59592q150B3280c22135g0235B70817J64558a3280D2563
$$ plain form
13276 -309230 -180164 41254 13594 31858 164851 285804 -108001 -95539 -105572 371100
13265 122173 139605 -205269 281131 255383 -62161 242333 320586 70339 97723 417184 -223783
13253 1418 171082 182586 -189695 331770 274036 -123200 366575 125191 414146 -7987 189909
13241 33213 97062 79636 65655 16164 501869 123963 168242 -102177 54126 -67 -191355
13230 -191355 115121 168398 380725 -90022 8536 57350 724811 213852 14560 241001 88665
13218 -160783 3208 -158970 -19570 352873 -120422 234807 237701 -27397 382922 -44700 146344
13206 162580 120540 23811 339903 333456 145393 166523 205899 86655 11832 249094 258038
13195 258038 82878 213058 201445 267446 74124 175829 -43717 312018 189277 251166 165529
$$ packed form
13276c09230J29066D1254A3594J8264J32993J20953a08001J2462j0033C71100
13265A22173J7432b05269B81131k5748f2161B42333P8253G0339K7384L19461b23783
13253A418J69664J1504a89695C31770n7734a23200C66575A25191K88955g987A89909
13241C3213O3849j7426j3981A6164M85705A23963M4279a02177E4126f7j91288
13230a91355A15121N3277K12327i0022H536M8814O67461B13852A4560K26441H8665
13218a60783C208a58970a9570C52873a20422B34807K894b7397C82922d4700A46344
13206A62580m2040B3811L16092o447A45393K1130L9376H6655A1832K37262Q944
13195B58038H2878J30180j1613O6001G4124J01705d3717C12018j22741O1889q5637
$$ plain form
13184 165529 -163026 137983 -58086 -336689 24388 -3543 137089 109282 200343 226521 59086
13172 398362 -72251 169048 12346 -138493 -20952 -105310 -72424 52627 235388 333936 -261970
13160 54343 8276 -203790 77957 208636 358793 69664 201221 240008 -81230 89813 141294
13149 141294 -139847 -116046 151526 44457 125008 -17906 93284 -17582 434089 134532 87873
13138 87873 217166 -136108 246830 -186550 170825 110691 -82603 200814 315923 60474
13127 -104888 32390 -20623 450279 184182 3295 -239909 141243 102424 -18670 38463 -144798
13115 135577 107975 488477 -89344 52745 75524 33218 -55093 -93849 90149 203818 56287
13103 -58168 4315 300327 181056 -114120 -192967 114658 119478 187866 12739 146606 90943
$$ packed form
13184A65529a63026A37983e8086k78603B4388c543A37089k7807R1061K6178E9086
13172C98362g2251A69048A2346a38493b0952q4358L2886E2627J82761R8548b61970
13160E4343H276b03790G7957J30679J50157F9664J31557L8787h1230H9813N1481
13149A41294a39847K3801A51526D4457Q0551a7906I3284a7582D34089A34532m6659
13138H7873J29293a36108B46830a86550A70825o0134h2603B00814J15109F0474
13127a04888C2390b0623D50279A84182C295b39909A41243l8819a8670C8463a44798
13115A35577k7602L80502h9344E2745K2779C3218e5093l8756I0149J13669E6287
13103e8168D315K96012j19271a14120p8847A14658M820O8388A2739J33867n5663
$$ plain form
13092 90943 246738 181225 336152 66274 45387 437338 34807 158070 -248959 99351 395687
13081 395687 31922 -75182 48036 132115 -156993 -95272 -286003 -42770 217636 34059 168750
13070 168750 39606 245830 -57574 129067 316084 -74596 101931 255984 345521 133614
13059 20854 284663 96217 286105 169897 97291 -30946 101618 239286 153960 144455 162397
13048 162397 174036 162823 22187 387735 389076 307112 -142400 311248 344542 250380 311432
13037 311432 292021 350718 255323 -148868 -343647 128744 94601 -22680 397759 25717 -21535
13025 114267 -16701 176962 138929 500347 -69204 -65909 251890 -160442 311012 -149493
13014 52980 -121830 -116478 209144 -50683 195529 181704 136869 139401 -566347 -158836 111286
$$ packed form
13092I0943J55795o5513J54927F6274k0887L91951C4807J23263b48959I9351K96336
13081C95687C1922g5182D8036Q4079a56993O1721j90731d2770B17636C4059J34691
13070A68750C9606K06224e7574A29067J87017g4596A01931J54053Q9537A33614
13059B0854K63809I6217J89888j16208p2606c0946A01618J37668q5326r505J7942
13048A62397J1639j1213B2187L65548J341q1964a42400C11248L3294r4162O1052
13037C11432j9411N8697r5395a48868j94779A28744l4143b2680C97759B5717b1535
13025A14267a6701A76962l8033L61418f9204L295B51890a60442C11012a49493
13014E2980a21830N352B09144e0683A95529j3825m4835K532e66347a58836A11286
$$ plain form
13002 323502 318333 21566 220087 77989 196714 173866 -3978 186063 141284 127506 46850
12990 129402 26049 111861 110129 166628 4172 159958 121221 24126 51245 288172 -136274
12978 54860 373592 -109438 -26999 -28927 -305127 45788 -309540 356614 233857 -338843
12967 246406 247566 -161065 74518 -51553 175646 118636 -186254 86248 102069 -109212 -495085
12956 -495085 24263 11627 341161 52249 -53521 449759 -129877 -127201 149838 -146879 216343
12944 308909 -218121 -19226 176332 16154 355976 237545 205955 62676 142966 112618 -56935
12932 45780 200406 -9438 101800 307658 -28938 -64899 52507 97416 -263696 147056 75816
12921 75816 146851 173648 249882 133507 -13611 -269665 -3894 411474 -234919 -80537 51157
$$ packed form
13002C23502n169B1566J98521G7989J18725k2848c978A86063m4779j3778D6850
12990A29402B6049Q5812j732N6499D172J55786l8737B4126K7119K36927a36274
12978E4860L18732a09438b6999j928k76200D5788c09540C56614j22757c38843
12967B46406J160a61065G4518e1553A75646n7010a86254H6248J5821a09212l85873
12956d95085B4263A1627L29534E2249e3521D49759a29877K676A49838a46879B16343
12944C08909b18121a9226A76332A6154L39822j18431l1590F2676Q0290l0348e6935
12932D5780J54626i438A01800K05858b8938l5961E2507M4909b63696A47056p1240
12921G5816P1035K6797P6234j16375a3611k56054c894D11474b34919h0537E1157
$$ plain form
12909 -77399 72525 -165262 185278 55960 -142643 76333 72113 -31607 65703 -70312 286436
12897 169453 -100136 286728 209678 -139831 58929 -20761 129155 -239826 29083 -172902
12886 375444 -139071 41516 91059 78871 137767 143971 164751 32086 -146777 132033 134889
12875 134889 -145765 259534 -288635 193596 -248494 248292 -140988 -79906 346567 42564
12864 2321 7501 35457 59584 183836 115116 31896 318357 -134814 -33813 -6819 61728 112461
12852 112461 36285 156415 164002 216163 -79286 48922 52053 82945 -47309 375825 49886
12840 183262 12715 -110919 265124 38629 -65959 312983 293781 152257 128760 216943 -16148
12828 77534 -21579 27411 32673 -16495 45093 70260 -38462 25702 18283 103488 87488 -27949
$$ packed form
12909g7399G2525a65262A85278E5960a42643G6333m220c1607F5703g0312B86436
12897A69453a00136B86728p7050a39831E8929b0761A29155b39826B9083a72902
12886C75444a39071D1516M9543j2188N8896O204K0780C2086a46777A32033K856
12875A34889a45765B59534b88635A93596b48494B48292a40988O1082C46567D2564
12864B321N180K7956K4127J24252o8720C1896K86461a34814c3813f819F1728N0733
12852A12461C6285J20130P587N2161g9286D8922L131L0892d7309C75825D9886
12840A83262A2715a10919B65124C8629f5959C12983j9202j41524k3497Q8183a6148
12828G7534b1579B7411N262a6495D5093K5167c8462B5702p419Q5205j6000b7949
$$ plain form
12815 -41249 -45481 -303880 63763 12179 222406 153952 60689 -52684 -48397 -331246 264095
12803 97894 -13151 -259000 160890 -58099 142419 -33842 -181989 72263 -306851 -8201 148367
12791 139558 -7997 140576 212635 -212317 -116662 -159760 61241 -36396 146234 -15461 168459
12779 188334 -247552 -131987 153968 63370 -86666 -384355 -115994 1665 18793 -13938 81156
12767 350909 169691 323687 -139636 -327200 135854 -195696 -300047 -316655 -1997 5726
12756 24298 -162232 -269687 -172634 -110220 46468 -74304 -167927 197898 220530 233040 107970
12744 237278 74052 129587 -155494 -347185 4302 32751 172815 18942 -52374 422144 208495
12732 203651 -32229 -22948 45630 -91257 -60629 280649 263692 252440 235628 -150325 66868
$$ packed form
12815d1249m232k58399F3763A2179K10227o8454F0689e2684M287k82849B64095
12803I7894a3151k45849A60890e8099A42419c3842j48147G2263c06851h201A48367
12791A39558g997A40576P2059b12317R5655m3098F1241c6396A46234a5461A68459
12779A88334b47552J15565A53968F3370h6666k97689a15994A665J7128a3938H1156
12767C50909A69691J53996a39636j87564A35854a95696j04351j6608a997E726
12756B4298a62232j07455R7053O2414D6468g4304r3623A97898K2632J2510A07970
12744B37278G4052N5535a55494j91691D302K8449J40064A8942e2374D22144B08495
12732B03651c2229R281D5630i1257L0628B80649j6957j1252j6812a50325F6868
$$ plain form
12720 78361 85959 45348 -78440 278592 -16145 176447 -22515 44998 337972 418104 12070
12708 324198 -130867 487052 100974 328071 169390 38509 -160787 -140678 275454 389866
12698 389866 49564 -14034 -13093 -122628 44734 65096 332674 82247 -19137 -292331 187130
12686 15388 204936 184067 2849 142520 85936 109073 151659 5695 298223 217524 123098
12675 123098 132986 81019 271419 45035 79364 -258244 59855 338142 85978 58522 389977
12664 389977 54188 6646 -120779 175260 194075 44881 29249 -188048 119857 216658 218335
12653 218335 -248169 31314 99771 -147109 38127 -116205 54902 60774 -90587 103131 -13969
12641 -47214 14151 -8417 -4424 -137413 -170844 -129913 16976 77199 23919 212838 4084 176652
$$ packed form
12720G8361P598m0611g8440B78592a6145A76447b2515D4998K92974Q0132A2070
12708C24198a30867D87052A00974K27097j58681C8509a60787K0109B75454J14412
12698C89866D9564a4034R41j09535D4734K0362K67578H2247a9137k73194A87130
12686A5388J89548k0869B849J39671n6584K3137M2586E695K92528q0699r4426
12675A23098R888n1967J90400D5035L4329b58244E9855K78287H5978k7456L31455
12664C89977E4188F646a20779A75260J8815D4881j5632a88048A19857R6801J677
12653B18335b48169C1314O8457a47109C8127a16205E4902N872i0587A03131a3969
12641d7214A4151h417L993j32989l3431M0931A6976O0223B3919J88919D084J72568
$$ plain form
12629 176652 268651 177695 243750 225715 -253881 281584 -164769 -7345 34999 366589 -169095
12617 -30004 160066 123006 -29553 -312780 173455 195203 -35263 -240475 -70687 169010 -15480
12605 191647 78616 209330 121052 295975 211028 -15107 153357 151330 -107572 138772 -99741
12593 -300846 -126549 102779 -116622 -38415 236722 -84353 -350811 94627 -123438 331245
12582 -38279 127049 -154405 -26369 -131708 -47122 254275 158838 253482 314228 27823 197608
12571 197608 -55214 -201275 200427 2836 10072 -26479 -49347 -156384 -249835 -349330 139991
12559 -176969 -39891 49661 -172595 211142 76117 -30905 50854 -136384 -22404 -267839 39398
12547 17557 213740 225038 -86571 88020 183110 136555 309344 199649 130836 -265420 130738
$$ packed form
12629A76652R1999r0956O6055j8035b53881B81584a64769g345C4999L31590a69095
12617c0004A60066l7060b9553k83227A73455K1748c5263k05212g0687A69010a5480
12605A91647G8616J30714q8278J74923q4947a5107A53357k027a07572A38772i9741
12593c00846a26549A02779a16622c8415B36722h4353k66458I4627a23438C31245
12582c8279A27049a54405b6369j05339d7122B54275r5437R4644O0746B7823J69785
12571A97608e5214j46061B00427B836P236b6479k2868j07037r3451r9495A39991
12559a76969c9891D9661a72595B11142G6117c0905E0854a36384b2404k45435C9398
12547A7557J96183J1298h6571H8020R5090m6555J72789j09695o8813b65420A30738
$$ plain form
12535 95501 175937 25443 159397 -194531 -183218 146930 95454 112602 -26073 168534 -93407
12523 -36107 -73208 -137117 28720 28817 94014 218241 46940 12005 137240 -176359 -159487 36898
12510 -1830 77580 59839 -135421 245113 190429 36136 67517 -157095 -126186 -145665 76019
12498 76508 230143 -94731 115855 349744 -34302 -9953 214162 -112221 -17217 -115850 -122630
12487 -122630 -62003 81271 -163354 -185648 -193125 121908 -389894 -157654 -7398 -75499 -226835
12476 -226835 69492 53040 -66666 -142653 197472 -198426 -98560 48494 105927 -101367 -28567
12464 61742 -182678 -100466 -323071 38897 116852 -443714 78655 58371 250836 251578 127448
12453 127448 109582 22965 13826 -173474 130493 -56701 149281 -43959 -143536 -45718 26225
$$ packed form
12535I5501Q0436B5443J33954a94531J1313A46930n1476J7148b6073A68534i3407
12523c6107l7101o3909B8720R7O5197J24227D6940A2005J25235a76359J6872C6898
12510a830G7580j7741a35421B45113n4684C6136L1381a57095L0909j9479G6019
12498G6508J53635i4731A15855K33889c4302i953B14162a12221a7217r8633o780
12487a22630O0627H1271a63354k2294p477A21908c89894a57654g398o8101j51336
12476b26835F9492j6452f6666p5987A97472a98426i8560D8494N7433a01367b8567
12464F1742a82678Q2212k22605C8897P7955d43714G8655k0284J92465P42j24130
12453A27448j7866B2965r139a73474A30493e6701A49281d3959r9577d5718B6225
$$ plain form
12441 -104285 -111205 85114 1587 245785 121049 -247886 134081 79660 56234 -150236 -151520
12430 -151520 -249084 -203682 -242133 91240 -60387 -96300 -148308 -250068 410152 206080 -2475
12418 209604 185521 -117454 26195 -88210 -44687 -223312 277881 -132649 59292 36998 283503
12407 283503 -273624 52491 -75829 57318 -42741 -109254 -68636 -169809 144056 310970 -24607
12395 338181 -36147 -30943 -124211 49947 -90464 457240 159566 69100 111393 20169 -88889
12383 129672 86721 72525 -34561 -34333 -11441 276997 -155727 -74325 -125003 -55030 136359
12371 -40173 -129412 179178 115677 120889 -50704 -180630 365232 -66118 -132120 -230263 -281216
12360 -281216 133293 20522 106936 276110 -24833 45051 -117984 116562 -181984 -24478
$$ packed form
12441a04285o920H5114A587K44198A21049b47886A34081n4421k3426a50236j284
12430a51520r7564M5402l8451I1240f0387l5913n2008j01760D10152k04072b475
12418B09604k4083a17454B6195h8210M3523j78625B77881a32649E9292k2294K46505
12407B83503b73624E2491g5829E7318d2741o6513M0618j01173A44056J66914b4607
12395C38181c6147N204r3268D9947i0464D57240A59566F9100M2293B0169h8889
12383A29672m2951j4196c4561K28a1441B76997a55727g4325n0678e5030A36359
12371d0173q9239A79178o3501N212e0704j29926C65232f6118o6002r8143n0953
12360b81216A33293B0522Q6414J69174b4833D5051a17984A16562a81984b4478
$$ plain form
12349 172754 -420628 171487 18146 -31086 120715 -319263 219255 -29988 -219771 -36658
12338 52075 93287 273515 9716 166632 -12292 -9055 -134551 -5387 80666 79510 -141632 160453
12325 100241 -21086 85320 204438 -31533 270538 430842 95614 180373 178314 245874 -297527
12313 -202538 -82983 -97383 45515 -33572 -187886 299299 -51653 -4341 236445 -120077 -166135
12302 -166135 -129523 239612 -91841 307471 208997 59385 -49393 -175495 280229 3012 -44550
12290 57389 -11649 149566 122563 -209560 -227761 -179975 -17530 -27405 269989 182411 -201961
12278 338751 69631 341613 242028 228661 282226 35411 91119 194792 -232137 92767 311124
12267 311124 13786 236750 -99722 152624 174283 84661 358640 -73826 75861 190991 -109315
$$ packed form
12349A72754d20628A71487A8146c1086A20715c19263B19255b9988j89783c6658
12338E2075M1212J80228I716J56916a2292L237j25496e387H0666j156a41632A60453
12325A00241b1086H5320J19118c1533B70538J60304I5614Q4759k059O7560b97527
12313b02538h2983j4400D5515c3572j54314B99299e1653d341B36445a20077m6058
12302a66135L6612B39612i1841C07471r8474E9385d9393j26102B80229C012d4550
12290E7389a1649A49566k7003b09560j8201M7786a7530r875B69989q7578b01961
12278C38751F9631K71982r9585j3367N3565C5411N5708J03673b32137I2767K18357
12267C11124A3786K22964i9722A52624K1659H4661K73979g3826G5861J15130a09315
$$ plain form
12255 9844 67031 335663 -4471 -9104 89062 232994 209948 112062 -253629 102171 323287
12244 323287 14485 -259183 11697 -143558 218877 -101873 282682 361981 120646 109954
12234 109954 231180 458329 134269 256804 210288 225379 378540 234348 -207697 -6992
12223 125878 311498 103004 432748 366214 334155 141014 321577 -8681 294682 49595
12212 72773 -142150 64561 -249805 163923 94961 293779 -228874 35235 -95851 44920 120558
12201 120558 137187 630434 309470 245897 57328 29778 100110 190552 211368 142219 271980
12190 271980 35401 94619 -14033 107914 256126 -49528 48204 320423 -1777 3775 359975
12179 359975 -120476 264176 200815 250685 265032 318486 -22225 368165 -135578 -362 99728
$$ packed form
12255I844N7187K68632d471m633H9062J43932k3046r7886b53629A02171K21116
12244C23287A4485b59183A1697a43558B18877a01873B82682P9299A20646j0692
12234A09954J21226K27149A34269J22535m6516J5091J53161j44192b07697f992
12223A25878J85620A03004L29744o6534l2059A41014J80563h681B94682D9595
12212G2773a42150F4561b49805A63923o8962J98818b28874C5235i5851D4920P5638
12201A20558J6629M93247C09470o3573E7328k7550P0332R0442K0816o9149J29761
12190B71980C5401N9218a4033A07914J48212d9528D8204K72219a777C775L56200
12179C59975a20476B64176o3361M9870J4347N3454b2225C68165a35578c62I9728
$$ plain form
12167 190984 -316993 -161801 305810 -117745 332005 137220 103824 214127 270936 -11148
12156 532858 -24533 65313 341945 75453 -125736 49688 -190458 -22433 312784 146871
12145 42287 69381 -122808 -127733 103508 181690 -9072 158248 -77512 -218626 280053 -293010
12133 38592 182604 -105147 -45995 -57944 -49134 266194 396644 142198 213937 241052 -46581
12121 -410109 261332 -326011 96434 -111347 -180113 47758 363159 131678 125001 148232 154114
12110 154114 -67395 234468 -119885 22503 336073 -129533 -86036 -172129 -41068 -79094 -71781
12099 -71781 3691 12463 155580 -224837 -17400 -111965 263984 -283004 298020 -153908 -120006
12088 -120006 116820 194926 77799 -15599 2928 -76493 19676 29124 110629 -71916 -16427 186576
$$ packed form
12167A90984c16993J55192C05810a17745C32005A37220l3396J10303N6809a1148
12156E32858b4533F5313K76632G5453a25736D9688a90458b2433C12784A46871
12145D2287K7094a22808m925A03508P8182i072A58248g7512j41114B80053b93010
12133C8592J44012a05147d5995j1949Q810B66194J30450A42198P1739K7115d6581
12121d10109B61332c26011I6434a11347o8766D7758L15401A31678o677K3231N882
12110A54114f7395B34468a19885B2503L13570a29533M3497q6093d1068l8026P313
12099g1781C691Q772J43117b24837a7400r4565B63984b83004B98020a53908L3902
12088a20006A16820P8106G7799a5599B928g6493A9676R448Q1505g1916a6427A86576
$$ plain form
12075 37054 -196244 239585 -109274 221304 56641 -39307 -119994 -29782 21912 102353 8186
12063 -109292 -78459 -229501 -72431 197924 -71508 113795 -22582 46964 -13267 -161303 -206098
12052 -206098 253246 362594 -29495 41798 328101 -168575 193141 -122653 -63773 -63964 158332
12040 14363 -65089 240056 -71750 -47051 -59802 -211349 -293296 -433000 -331515 75714 -226981
12028 162016 181590 -222682 -69474 37962 -253284 -144049 149584 -273439 268562 -101257
12017 -54164 -165936 113910 298280 33481 127009 -276107 -52473 322924 120045 -134519
12006 118392 15793 -69563 33610 -161165 239537 15638 -210419 165036 124892 22608 -253822
11994 1390 82275 -109678 72808 172924 -210817 -8289 -157406 -260577 198089 -59423 110505
$$ packed form
12075C7054a96244B39585a09274B21304E6641c9307q0687b9782B1912Q0441H186
12063a09292L0833j51042g2431A97924g1508A13795b2582D6964a3267j48036m4795
12052b06098B53246J09348b9495D1798K86303a68575A93141a22653N8880j91A58332
12040A4363f5089B40056g1750K4699j2751j51547q1947j39704J01485G5714b26981
12028A62016J9574b22682f9474C7962b53284J09235A49584b73439B68562a01257
12017e4164j11772A13910J84370C3481R3528b76107e2473C22924A20045a34519
12006A18392A5793f9563C3610a61165B39537A5638b10419A65036m0144B2608b53822
11994A390Q0885a09678G2808J00116b10817h289j49117j03171A98089e9423A10505
$$ plain form
11982 -111230 187926 -115585 59366 256641 -95402 -22279 154825 3512 -90462 24694 -39040
11970 -299906 -158229 39247 -133875 -325460 311368 302402 -99339 -1805 20643 -28793 78943
11958 36734 -203421 21890 -76042 -33502 -93834 93363 67405 -165273 266390 -147072 7634
11946 -44002 74753 51180 -300512 -108250 155523 237941 -30777 -90391 -176665 21900 164157
11935 164157 -124924 -151421 -144217 148127 123385 -58607 64861 -179018 219832 -80645 224467
11923 -239318 158704 34210 -70849 -119707 326307 71911 -224597 256490 34295 -72620 -279380
11912 -279380 -35491 -53011 14149 -184586 -96666 295965 -3791 28229 54461 -128400 -8686
11900 123779 -51418 -102127 118628 -326346 208795 125725 178002 -244856 99844 3091 80150
$$ packed form
11982a11230A87926a15585E9366J97275i5402b2279A54825C512i0462B4694c9040
11970b99906J41677C9247a33875j91585C11368q966i9339a805B0643b8793G8943
11958C6734b03421B1890g6042c3502o0332I3363k5958a65273B66390a47072G634
11946d4002G4753k3573c00512a08250A55523Q2418c0777n9614q6274B1900J42257
11935A64157a24924k6497P204A48127k4742e8607F4861a79018B19832h0645B24467
11923b39318A58704C4210g0849m8858C26307G1911b24597B56490C4295g2620k06760
11912b79380c5491j7520A4149a84586Q7920B95965c791B8229K6232a28400h686
11900A23779e1418n0709A18628c26346B08795q3070N2277b44856I9844C091P7059
$$ plain form
11889 80150 -86697 -272810 -41339 -179379 -209360 122516 139408 10625 -140306 -165706 448359
11877 -220611 -48084 -503088 -218373 -38195 13597 43548 -268390 105554 54374 23256 -247233
11865 -89388 -70808 69383 -280514 72497 -71268 -188037 -2223 -80794 171563 70040 -104130
11853 312702 -73561 231797 362719 -271081 161752 -6125 -185372 -259604 -225443 -50626 -55404
11842 -55404 -92730 113359 59320 -145060 20262 -2164 -86342 1707 303412 -138553 5920
11830 -24203 -139662 367857 -71146 -141657 36491 8196 250779 -99560 201478 186506 69023
11818 -76762 144577 -260706 67321 -243223 64323 130774 -15257 87859 -56413 -46188 -218548
11807 -218548 -169232 -238117 -251334 -307893 -179148 -146822 217114 108284 223382 -86250 -24124
$$ packed form
11889H0150h6697j86113d1339j38040k9981A22516J6892A0625a40306k5400D48359
11877b20611d8084m55004b18373c8195A3597K9951b68390A05554n1180B3256b47233
11865h9388J8580F9383b80514G2497g1268j16769b223p8571A71563G0040a04130
11853C12702g3561B31797J30922b71081A61752f125j79247p4232L4161e0626m778
11842e5404l7326A13359n4039a45060B0262b164q4178A707L01705a38553E920
11830b4203j15459C67857g1146p0511C6491H196K42583i9560B01478j4972F9023
11818g6762A44577b60706F7321b43223F4323O6451a5257H7859e6413J0225j72360
11807b18548M9316o8885j3217n6559J28745L2326B17114A08284J15098h6250b4124
$$ plain form
11795 389927 -6194 138660 37623 80593 -34353 -137295 -353889 20629 -14028 80201 -309245
11783 -144526 -95980 -213835 -182588 285851 162772 -42060 -230585 -102136 -205219 -17616
11772 -43463 -84955 135805 105019 233359 -130283 126859 -259297 -5845 108223 -125998
11761 304402 -38525 139296 -307274 156133 210933 81716 77122 71 114976 46226 48235 465708
11749 465708 -165358 77916 -28583 -177348 -66472 -129621 107536 69688 -88098 41182 130702
11738 130702 -8710 -80614 9953 190202 88033 -72347 -104649 -37532 -133079 -321243 203712
11726 -77055 -20219 -109858 105750 107689 -181558 -45256 5511 -55433 -96943 -155490 295314
11714 178820 -100291 -79340 104655 -74623 130720 37349 25207 -354870 123731 100461
$$ packed form
11795C89927f194A38660C7623M2970c4353j02942k16594B0629a4028H0201c09245
11783a44526M8546j17855L1247B85851j23079d2060j88525a02136j03083a7616
11772d3463m1492A35805l0786J28340a30283A26859b59297e845A08223a25998
11761C04402c8525A39296c07274A56133N4800H1716m594G1J14905D6226K009M17473
11749D65708a65358G7916b8583j48765f6472o3149A07536l7848h8098D1182Q9520
11738A30702h710p1904I953J80249H8033g2347l2302c7532r5547j88164B03712
11726g7055b0219q9639A05750J939a81558d5256E511e5433m1510n8547B95314
11714A78820a00291K0951A04655g4623A30720C7349j2142c54870A23731k3270
$$ plain form
11704 100461 100193 46648 179052 -142759 -162029 59559 148477 -317944 -223678 -156015 -12822
11692 97550 -229973 -115833 8279 -114652 -110951 -54581 -8140 -18477 -146564 327038 244123
11681 244123 90990 -85423 -21632 -140603 -186913 180400 -39630 -149489 12180 -146908 -18480
11669 195659 89460 298204 14027 208726 29282 -500411 404609 353902 260198 147364
11659 147364 326411 -37137 92299 440124 3975 93781 37132 -75001 61206 -146917 4983
11647 65809 137230 139813 -329179 -18306 252752 -92005 -145887 -97181 9598 44794 176541
11636 176541 -46153 95925 14053 -137272 -18364 -242448 76748 104446 -133457 36522 133469
11625 133469 5427 49441 21704 -191470 149692 -308205 44272 102316 45620 158760 141548
$$ packed form
11704A00461k68D6648J32404a42759j9270E9559Q8918c17944R4266O7663a2822
11692I7550b29973J14140H279a14652L701e4581h140j0337j28087C27038q2915
11681B44123I0990h5423b1632j18971m6310A80400c9630j09859A2180a46908a8480
11669A95659H9460K08744A4027J94699B9282e00411D04609n0707r3704j12834
11659A47364J79047c7137I2299L47825C975Q9806C7132g5001F1206a46917D983
11647F5809P1421K583c29179a8306B52752i2005n3882M8706I598L5196J31747
11636A76541d6153I5925A4053a37272a8364k24084G6748K7698a33457C6522R6947
11625A33469E427M4014B1704a91470A49692c08205D4272N8044D5620J13140j7212
$$ plain form
11614 141548 173101 44604 -26153 145049 94071 40423 66441 46207 -190479 -180683 133452
11602 31443 16572 119506 142961 -190659 -116093 -167800 165835 -198122 42972 -148915 69084
11590 29838 -225164 136283 199091 -56807 163933 354945 240697 102654 77311 -41319
11579 376357 101519 64700 116673 148332 -64120 -47978 -20735 -61668 232684 -53773 32343
11567 284284 125277 142179 377294 -21309 -121063 -261377 -68272 191333 47088 429425
11557 429425 141716 -197022 -271695 158081 234014 -382219 52742 115817 -105736 234441
11546 136299 179888 73218 -206738 161622 383568 -56252 110271 121224 -131762 30057
11535 -105545 -75793 280159 -44088 307684 336553 169376 -85760 -91133 332566 184849 80549
$$ packed form
11614A41548L1553D4604b6153A45049n0978D0423K6018k0234a90479R796A33452
11602C1443j4871J02934K3455a90659P4566n1707A65835a98122D2972a48915F9084
11590B9838b25164A36283O2808e6807A63933J91012j14248A02654k5343d1319
11579C76357A01519l6819N1973L1659f4120J6142b0735m0933B32684e3773C2343
11567B84284A25277J6902K35115b1309r9754j40314f8272A91333D7088L82337
11557D29425A41716a97022p4673A58081P5933c82219E2742O3075a05736B34441
11546A36299M3589G3218b06738A61622K21946e6252A10271J0953a31762C0057
11535a05545K9752B80159d4088C07684K8869j67177h5760n373C32566j47717H0549
$$ plain form
11523 -18524 -164694 61778 -59955 288451 199547 -136239 130737 -107645 183334 160319
11513 160319 -114806 -185475 88394 117811 373929 133684 69840 115265 39990 7058 -106800
11501 15550 144611 219489 163081 100968 93304 -6432 289385 217622 152239 236265 196502 -127396
11488 41435 -37610 28676 175230 180900 44132 -31767 94222 -34879 -238113 187128 -78054
11476 359292 -109580 -26470 248529 -53517 181436 -17076 168586 69661 -61999 -18939 175932
11464 177559 -11655 158285 146857 432729 -133980 168505 -171709 -366442 7827 467963
11454 467963 55278 -191448 134440 -196703 -294790 248348 -62493 -24140 -64142 261211
11443 464939 -216368 137221 12943 247212 -43983 -243594 184480 70794 177847 22029
$$ packed form
11523a8524j46170F1778e9955B88451q8904a36239A30737a07645A83334k3015
11513A60319a14806p0669H8394K9417K56118A33684o3844M5425C9990G058a06800
11501A5550J29061P4878n6408o2113p664f432B89385p1763o5383Q4026l9763a27396
11488D1435c7610B8676J46554N670D4132c1767I4222c4879k03234A87128g8054
11476C59292a09580b6470B48529e3517A81436a7076A68586F9661f1999a8939A75932
11464A77559a1655A58285j1428K85872a33980A68505a71709j94733G827M60136
11454D67963E5278a91448A34440a96703r8087B48348f2493b4140m0002B61211
11443D64939b16368A37221A2943K34269d3983j99611A84480G0794J07053B2029
$$ plain form
11432 171980 -78511 -37372 88932 -102678 211734 81712 -89359 -118338 -102332 -35832 -79374
11421 -79374 218866 64653 -219459 -166486 -67983 -5077 158066 -211378 -19721 203635 -60501
11409 62953 61456 -32666 252151 -14591 124536 -224564 174878 -115656 -84439 53807 294995
11398 294995 129841 -259483 -245326 -108142 156272 -211877 76386 213523 -129539 -146040
11388 -146040 -66836 -206884 125732 36635 -55805 326280 247314 29687 77845 -171534 353036
11376 102180 261133 -93798 88586 -136547 109729 162833 -103778 211002 -25330 -3324 237290
11364 223596 12207 -57324 -84068 -171114 126612 -144879 80581 198925 217605 -43704 -253692
11353 -253692 43548 194281 -167607 -218714 267828 21546 -78529 -269676 26872 95798 -141033
$$ packed form
11432A71980g8511c7372H8932a02678B11734H1712h9359k8979J6006c5832m3542
11421g9374B18866F4653b19459N2973f7983e077A58066b11378a9721B03635f0501
11409F2953j497c2666B52151a4591A24536b24564A74878a15656L1217E3807K41188
11398B94995A29841b59483J4157a08142A56272b11877G6386J37137a29539j6501
11388a46040f6836j40048A25732C6635e5805C26280p8966B9687M8158a71534C53036
11376A02180J58953i3798H8586a36547A09729N3104a03778B11002b5330c324B37290
11364B23596A2207e7324k6744q7046A26612a44879H0581J18344J8680d3704k09988
11353b53692D3548J50733a67607n1107B67828B1546g8529j91147B6872O8926a41033
$$ plain form
11341 76810 -166357 -206825 -272527 -143855 -36814 124860 -139552 122703 -14635 -230477
11331 -230477 127129 -63840 198622 4908 55861 272797 -194313 164595 -4949 -111519 7405
11319 95132 -21647 -276355 -20665 -225131 45021 128429 -72308 -347 162111 67779 319071
11308 319071 222089 -123237 105159 -185460 120568 -120476 -115475 -237790 44948 337136
11298 337136 79649 191149 -243982 -48870 79863 -43738 -115255 -186073 -304912 8994 14798
11287 14798 63654 90842 -168178 -61354 209979 304 278990 -97242 -7068 167865 -415639
11275 -55913 94835 -85936 46259 -227243 43662 -30114 -152024 34020 -24754 -122762 135712
11263 -98059 98183 -133391 -85005 71452 -145472 -163695 -44575 -76691 -114515 126454 -275546
$$ packed form
11341G6810a66357m0468o5702J28672c6814A24860a39552A22703a4635k15842
11331b30477A27129f3840A98622D908N0953K16936a94313A64595d949j06570G405
11319I5132b1647k54708b0665k04466D5021Q3408g2308c47A62111F7779K51292
11308C19071r6982a23237A05159a85460A20568a20476N001j22315D4948K92188
11298C37136G9649J11500b43982d8870G9863d3738p1517p0818j18839H994N804
11287A4798M8856K7188a68178f1354B09979C04K78686i7242g068A67865d15639
11275e5913I4835h5936D6259b27243D3662c0114j21910C4020b4754r8008A35712
11263i8059I8183a33391M8386G1452a45472j8223d4575l2116l7824A26454b75546
$$ plain form
11251 -370125 -314876 -558857 -133980 248317 18808 -273784 76429 166570 -118269 354290
11240 -24779 195621 -18761 -301876 -151443 -56271 100576 219535 104631 39284 -108895
11229 42165 -22273 -54063 -63081 -15066 137462 -201061 225677 100659 -194645 -33830 -234234
11218 -234234 189045 235255 -12817 19805 127699 -10501 -43200 113979 48197 300809 -96470
11206 -61679 11946 -340282 3034 39052 93503 -38616 -52487 -241721 -221018 -287724 24800
11194 -28660 -186370 -309069 127172 -66844 75060 159295 247418 -209405 90302 -79143 157424
11182 -234012 -135151 134126 -181323 -3686 -162075 -136256 -98157 -43707 290800 -128210 -160241
11171 -160241 -121172 106656 67470 40060 -10020 -162064 50683 40058 -211793 -195273 -180020
$$ packed form
11251c70125N5249k43981a33980B48317A8808b73784G6429R0141a18269C54290
11240b4779A95621a8761k83115J50433e6271A00576J18959A04631C9284a08895
11229D2165b2273l1790r018a5066A37462b01061B25677A00659a94645c3830k00404
11218b34234A89045M6210a2817A9805J07894a0501l2699A13979D8197K52612i6470
11206f1679A1946c40282C034L6018N4451c8616j3871j89234K0703o6706B4800
11194b8660j57710j22699A27172f6844G5060Q4235Q8123b09405I0302g9143A57424
11182b34012R8861A34126a81323c686j58389K5819L8099d3707B90800a28210l2031
11171a60241L9069A06656l9186k7410a0020j52044E0683j0625b11793J6520J5253
$$ plain form
11160 -180020 -14823 31413 396445 -130504 143836 -212155 -166514 -52628 -194427 -51227
11149 115676 3086 -452746 332820 -67799 264470 33867 -209716 -44700 -32882 97810 -77220
11137 -152464 242415 -160464 -21937 214065 116040 -178846 86106 110694 49197 -185301
11126 281174 -144851 -6376 -315985 -43268 25303 209914 -33950 16534 100838 46048 -92309
11114 303620 -98392 314009 -5793 -179231 -138651 57814 -116133 -158631 139650 120218 52805
11102 271293 -447953 212812 17407 -142325 90099 -88726 -119360 1855 199290 59987 351279
11091 351279 -30044 246095 123059 38701 226568 48740 84213 253449 217754 279282 -166859
11079 354506 309883 279493 154274 508773 271682 106598 159764 190375 80752 292125
$$ packed form
11160a80020a4823C1413L65032a30504A43836b12155M5641e2628j41799e1227
11149A15676C086d52746C32820f7799B64470C3867b09716d4700J1818I7810g7220
11137a52464B42415a60464b1937B14065r8025a78846H6106K4588D9197a85301
11126B81174a44851f376l09609d3268B5303J84611c3950A6534Q4304D6048i2309
11114C03620i8392C14009e793j73438M0580E7814a16133m2498A39650j9432E2805
11102B71293d47953B12812A7407a42325I0099h8726l0634A855J97435E9987K91292
11091C51279c0044B46095j23036C8701J87867D8740L5473J69236l5695O1528a66859
11079C54506m4623l0390j25219L54499k37091A06598N3166L0611H0752K11373
$$ plain form
11069 292125 327893 248703 15580 22698 139684 282107 32730 165190 352131 440449 337349
11058 337349 334859 550099 263785 495638 -17511 399409 354988 557663 252441 319354
11048 319354 558278 660034 341193 602151 244882 455444 621422 530577 723857 577507
11038 577507 414619 361383 666717 384244 521486 198781 256327 367570 511715 282650
11028 282650 663219 309404 555592 532250 548944 746177 613357 540144 554152 151361
11017 490459 290426 415102 400870 394497 91412 535057 418175 441920 292169 629037
11007 629037 62157 420039 580521 423076 381657 77845 412026 420017 452984 499218 457551
10996 457551 149837 273876 510703 471190 465125 398168 419974 345559 619917 293891 739356
$$ packed form
11069B92125L5768p9190A5580P118J16986J42423C2730J32460J86941Q8318j03100
11058C37349k490K15240B63785K31853a7511C99409m4421K02675B52441O6913
11048C19354K38924J01756l18841K60958B44882K10562J65978r0845J93280j46350
11038E77507j62888n3236L05334k82473J37242A98781N7546J11243J44145k29065
11028B82650L80569C09404K46188k3342J6694J97233j32820p3213J4008A51361
11017D90459k00033J24676j4232o373I1412M43645j16882K3745j49751L36868
11007F29037F2157L57882J60482j57445m1419G7845L34181P991L2967M6234m1667
10996D57551A49837J24039K36827l9513o065o6957K1806p4415K74358B93891M45465
$$ plain form
10985 739356 513816 603480 564682 456400 550261 816631 792174 919570 759425 996884
10975 996884 880558 1251499 1559961 1449480 1408532 1552973 1651907 1482394 1713776 1643787
10965 1643787 1146388 885886 1269152 1041017 1039878 809129 1300696 1310657 1172618 1087501
10955 1087501 1351950 972868 1249274 1048348 1095753 860947 723396 916723 633626 366913
10945 366913 180990 18233 336062 101567 314028 398805 297513 -89459 102793 155895
10935 155895 -147476 -72572 5647 70741 13492 -580 161451 139503 186097 127233 66410 152910
10923 152910 -50838 -264854 82800 -159395 10417 -151866 -154896 112162 -131935 237080
10912 -165033 119142 218236 2440 -24623 142764 -39181 -328509 49168 -151046 -380901 -188030
$$ packed form
10985G39356k25540Q9664l8798j08282R3861K66370k4457J27396j60145K37459
10975I96884j16326L70941L08462j10481m0948J44441R8934j69513K31382o9989
10965A643787m97399k60502L83266k28135j139k30749M91567R961j38039q5117
10955A087501K64449l79082K76406k00926M7405k34806j37551J93327k83097k66713
10945C66913A80990A8233L17829A01567K12461Q4777j01292h9459A02793N3102
10935A55895a47476g2572E647O5094A3492e80A61451k1948M6594n8864o0823Q6500
10923A52910e0838k14016H2800a59395A0417a51866l030A12162a31935B37080
10912a65033A19142R9094B440b4623A42764c9181k89328D9168a51046k29855a88030
$$ plain form
10900 -211742 -44077 -198354 32874 -42892 -171032 83350 23579 130068 -23972 37320 -53528
10888 -196657 -33712 -227489 -157796 275991 -113864 118890 38626 -106669 195733 -121497
10877 57309 32960 -106669 163957 70726 -14222 -186832 5129 72870 70898 380593 -130635
10865 208903 -115242 59627 107775 369840 178913 131326 41445 -158538 -72322 81528 67629
10854 67629 -80617 -115287 249265 -47951 -154392 -107573 -42999 -218069 104762 53539 -52301
10842 -115559 77085 -294597 -83229 59984 82433 49427 -52439 -22476 -185452 21168 -165727
10830 -240750 4573 -80036 -13536 -343340 255468 426301 -321926 -172802 122782 -37437
10819 -407669 103664 -315782 262504 39672 158278 -2330 -292007 97452 4294 113710 -138034
$$ packed form
10900b11742d4077j54277C2874d2892j28140H3350B3579J06489b3972C7320e3528
10888a96657c3712j93777O9693B75991a13864A18890C8626a06669A95733a21497
10877E7309k4349a06669A63957G0726a4222j72610E129O7741j972L09695a30635
10865B08903a15242E9627M8148K62065A78913m7587D1445a58538g2322H1528j3899
10854F7629h0617l4670B49265d7951j06441M6819d2999j75070A04762n1223e2301
10842a15559G7085b94597h3229E9984K2449l3006e2439b2476j62976B1168a65727
10830b40750D573h0036a3536l29804B55468J70833c21926J49124A22782c7437
10819d07669A03664c15782B62504C9672J18606b330k89677I7452D294J09416a38034
$$ plain form
10807 66094 -48972 -72421 -340734 28695 -159469 -127280 -138579 -93252 -99500 -100172 32975 -170412
10794 121901 102128 -277935 -49204 14526 81537 -101635 -266909 -17588 98495 155928 -79174
10782 -206900 -390260 47328 -10964 140145 -303264 -82272 -759 37559 -105022 355260 -151840
10770 115076 -195822 -45439 -162682 9914 -117817 -322946 -2420 143940 -5016 -69403 -184929
10759 -184929 -25512 99304 -268615 -160423 142496 -168782 -173127 194565 -49693 -29212 -8844
10747 -310148 186978 392980 -201805 55304 -375666 -156080 51295 -2446 236213 20591
10736 81869 228787 -325606 -108452 -244302 -14688 -95802 -101720 -318703 16113 356642 348344
10725 348344 -381702 41641 181912 173115 120473 -69005 152587 136508 -102339 -315861 192582
$$ packed form
10807F6094d8972k3449k68313B8695a59469L2189j1299M5327o248o72C2975a70412
10794A21901j9773b77935d9204A4526O7011a01635j65274a7588I8495N7433g9174
10782b06900j83360D7328a0964A40145c03264h2272g59C7559a05022C55260a51840
10770A15076a95822d5439j17243I914a17817k05129b420A43940e016o4387j15526
10759a84929b5512I9304b68615J08192A42496a68782m345A94565d9693K0481h844
10747c10148A86978K06002b01805E5304c75666a56080E1295b446B36213B0591
10736H1869J46918c25606a08452j35850a4688q1114n918k16983A6113L40529q298
10725C48344c81702D1641J40271q797n2642f9005A52587j6079a02339k13522A92582
$$ plain form
10713 -285169 156692 -80360 -72304 -180244 165154 -49994 66770 -139754 -94268 -51010 9966
10701 -138028 -231246 -189466 -286198 -103122 -86988 -133201 20304 24532 251245 55637 84147
10690 84147 -62106 -126758 28591 52826 -143773 -26439 -223116 -160917 -41931 35 -237283 -134565
10678 -134565 -57475 -19951 -159870 39294 141894 -22557 -28347 -11026 113840 -182940 -13136
10666 111107 306540 183166 -66817 -137755 -177612 -10569 217646 -123774 -168981 -99841 -169481
10655 -169481 -538949 150729 -46888 -294214 -148925 -40970 23951 -404784 -188317 25886
10644 -143179 229426 -208713 105371 -375512 159333 66310 210374 287938 -58777 -69105
10634 -69105 -86226 206357 118204 311008 195562 -160040 -168279 -114989 -302191 -123907 480161
$$ packed form
10713b85169A56692h0360Q056j07940A65154d9994F6770a39754M5486M3258I966
10701a38028r3218M1780r6732a03122J6134m6213B0304M228K26713E5637K8510
10690H4147f2106o4652B8591K4235a43773b6439j96677O2199d1931C5b37283J02718
10678a34565e7475a9951j39919C9294J02600b2557n790a1026A13840a82940a3136
10666A11107J95433j23374f6817p0938l9857a0569B17646a23774m5207O9140o9640
10655a69481l69468A50729d6888k47326J45289d0970B3951d04784a88317B5886
10644a43179B29426b08713A05371c75512A59333F6310J44064P7564e8777j0328
10634f9105j7121B06357q8153J92804j15446a60040q239N3290j87202a23907D80161
$$ plain form
10622 -315706 104198 127088 -205758 -365855 -217299 -142734 -102230 -51691 39016 -1332 -45653
10611 -45653 145041 -168118 -376188 -101446 -186650 161199 32868 -70747 42831 -227586
10600 -36138 133726 -214185 8395 -12044 -164623 271561 155813 -269395 97871 -3198 -227792
10589 -227792 126157 -43692 87142 5785 93379 65049 -17513 -166177 -56151 194855 -120840
10577 -290800 -330799 -276005 -369023 -4314 -235975 -214171 -32684 76508 -96287 -152567 -48852
10565 -252261 -190791 -124635 34644 80167 -55589 66190 -9712 -15353 -235266 -103615 -9209 -437067
10553 -437067 -40090 -92182 -182328 -205976 32536 107227 -120597 65160 -46400 -107786 132447
10541 -146128 -283413 -73314 -55427 -92752 -45536 1696 -5798 28955 -20377 -54865 -134831 -179258
$$ packed form
10622c15706A04198K2890b05758j60097J48556P4565M0504N0539C9016a332m4321
10611d5653A45041a68118k08070a01446q5204A61199C2868g0747D2831b27586
10600c6138A33726b14185H395a2044j52579B71561j15748b69395I7871c198k24594
10589b27792A26157d3692H7142E785Q7594k8330a7513j48664e6151A94855a20840
10577b90800l9999N4794r3018d314k31661K1804c2684G6508i6287n6280d8852
10565b52261O1470O6156C4644M5523e5589F6190i712n641k19913a03615i209m27858
10553d37067d0090n2092r0146k3648C2536P4691a20597F5160d6400o1386A32447
10541a46128j37285g3314J7887l7325d5536A696e798B8955b0377l4488p9966m4427
$$ plain form
10529 -179258 61060 73062 -4984 -84353 -174167 363629 -358449 -210719 -2476 32488 55369
10518 55369 -256215 -62671 89758 -117496 265695 -34703 232826 -109599 -50957 -25946 46606
10506 -179348 -86920 25034 81911 91549 115090 1530 -183428 -181712 183792 37060 17159 -35337
10493 84300 101203 -99827 171357 215444 -96802 -10641 -69990 -31787 -349114 -218389 145192
10481 -145562 356088 239891 458176 161133 -33434 -147387 63378 22488 -93335 41072
10470 -131316 -71097 -224403 -236481 306221 -239274 -60104 3097 203817 5872 -128474 -92517
10459 -92517 -25307 153963 114894 -115607 -157863 96194 -26209 -160494 45547 -11459 8293
10447 112724 20704 -3634 172099 -3049 -249214 -64295 -12836 185422 30584 107919 8256
$$ packed form
10529a79258F1060J2002d984p9369q9814C63629c58449J47730b476C2488K2881
10518E5369b56215f2671H9758a17496B65695c4703B32826a09599e0957K5011D6606
10506a79348h6920B5034N6877R638K3541A530a83428J716A83792C7060A7159c5337
10493H4300J6903i9827A71357M4087i6802a0641n9349c1787l17327J30725A45192
10481a45562C56088j16197K18285A61133c3434j13953F3378B2488i3335D1072
10470a31316O0219j53306j2078C06221b39274f0104C097K00720E872a28474L5957
10459i2517b5307A53963l9069a15607m2256I6194b6209j34285D5547a1459H293
10447A12724B0704c634A72099c049k46165f4295a2836A85422C0584P7335H256
$$ plain form
10435 90480 21197 16755 -150489 117409 103475 -30841 -220255 -266432 41555 237973 -312415
10423 -80527 15222 -21939 20810 -500162 -89947 -129561 -16019 -124768 -15938 -11361 -192124
10412 -192124 -233250 -152743 -259699 -98390 57788 -213514 250670 9381 52230 -276957 172027
10400 -67697 -235464 89160 -155387 220121 145352 -41640 -74082 233684 -393046 -12104 -6944
10389 -6944 309950 -27627 -19806 31060 38926 77660 102351 293635 -67945 -83583 -106319 305234
10376 365166 -59625 136300 76193 30415 139336 40438 -150475 230359 190603 293287
10366 293287 253882 258622 227168 80379 374719 371733 100335 218351 460315 56443 51796
10355 51796 87131 112680 -18807 100716 472206 318434 663434 210620 -121122 -83031
$$ packed form
10435I0480B1197m442a50489A17409j3934c0841j89414m6177D1555J96418c12415
10423h0527A5222b1939B0810e00162h9947l9614a6019j08749a5938M577j80763
10412a92124m1126Q0507j06956i8390E7788b13514B50670I381M2849b76957A72027
10400f7697j67767H9160a55387B20121p4769d1640l2442B33684c93046a2104N160
10389f944C09950b7627P821C1060P866L8734K4691J91284f7945j5638k2736C05234
10376C65166e9625A36300o0107C0415J08921D0438a50475B30359l9756J02684
10366B93287l9405M740l1454H0379K94340k986A00335J18016K41964E6443m647
10355E1796L5335K5549a8807A00716L71490j53772L45000B10620a21122L8091
$$ plain form
10345 -83031 33112 94362 -56713 745639 294987 162733 355376 191690 274689 354034 -66014
10333 -73414 127562 -169558 229477 13206 499794 -106349 -191870 54168 137008 242407
10323 242407 52485 115312 -114520 314463 100114 -158080 -42802 42948 -62457 148326
10312 269856 35752 -54655 113326 -110916 -11614 -68110 203608 109995 -83553 -23172 -30302
10301 -30302 -522908 103742 -64928 130809 -160394 228822 -42819 -86949 139276 89418
10291 89418 151205 -61504 -67701 89186 68364 -59307 -178299 -308171 36277 62822 113391
10280 113391 -258433 -171839 6155 -73200 33863 32262 -288982 -117449 -135686 -99676 55988
10268 -70925 -45682 -440665 -284628 119955 3006 35938 -98567 238250 187697 226544 1448
$$ packed form
10345h3031C3112O1250e6713G45639B94987j32254J92643j63686Q2999P9345f6014
10333g3414A27562a69558B29477A3206M86588a06349q5521E4168Q2840J05399
10323B42407E2485O2827a14520C14463A00114a58080d2802D2948f2457A48326
10312B69856C5752e4655A13326a10916a1614n6496B03608r3613h3553b3172p130
10301c0302m92606A03742f4928A30809a60394B28822d2819m4130A39276m9858
10291H9418O1787f1504o197H9186k0822e9307j18992j29872C6277K6545N0569
10280A13391b58433Q6594F155g3200C3863j601b88982a17449j8237L6010E5988
10268g0925K5243l94983J56037A19955C006L2932i8567B38250n0553L8847A448
$$ plain form
10256 523761 171936 70902 293711 123491 -236123 48198 -183091 136366 15989 -280341
10245 -242230 -141218 131659 -98315 -369735 -61609 79380 113201 90653 -366580 -53328 16393
10233 -132774 -320341 -178354 -220383 -168874 447158 64402 131169 70434 -46037 16712 -98922
10221 -82696 -246503 185470 -4534 19772 44987 -334367 -156783 78750 40458 -318580 211343
10209 -349539 286997 -117979 -91519 75243 -157719 -54244 -327787 34651 -171570 -100400
10199 -100400 22396 100216 250679 110359 -111663 51797 -262517 136927 53659 -148096
10188 -360095 60010 -11617 -23982 60910 -62052 49091 248351 51951 -321515 -99762 -93471
10177 -93471 -151439 -308043 229046 144131 -129729 -376984 -44984 -195868 4767 -179940 -124829
$$ packed form
10256E23761A71936G0902K22809A23491b36123D8198a83091A36366A5989b80341
10245b42230J01012A31659i8315k71420f1609G9380L3821k2548c66580e3328A6393
10233a32774j87567J41987m2029N1509D47158F4402O6767o0735d6037A6712i8922
10221h2696j63807A85470d534A9772K5215c34367a56783G8750l8292c18580B11343
10209c49539B86997a17979K6460G5243a57719e4244k73543C4651a71570P1170
10199a00400B2396P7820J50463A10359a11663E1797b62517A36927E3659a48096
10188c60095F0010a1617j2365F0910f2052D9091J99260E1951c21515i9762O291
10177i3471n7968j56604B29046q4915a29729k47255d4984j50884D767a79940N5111
$$ plain form
10166 -124829 154801 -214795 -102245 214435 68655 -116637 188271 -111361 -348088 -84167
10155 -356926 6930 -90000 22626 -89347 -106440 -57187 -371589 -104482 -202946 41274 89191
10144 89191 93935 227744 -1131 -105953 -257370 119658 180576 -449379 -129412 -27893 -122190
10133 -122190 -236443 -163779 32072 101661 344770 28602 -154035 175638 62067 -71287 160443
10121 -142676 -153123 -255435 142175 -194104 17824 -104279 27543 -124311 -106378 -119549
10111 -119549 27162 -204790 133395 -114219 -98578 38950 100197 86474 128000 -120661 -111617
10100 -111617 -83155 179351 -249603 97018 48841 129201 -51254 -74074 40007 -128653 -51516
10088 38082 -161805 -89270 303753 -138433 -191611 105015 -138653 -91171 33146 -227397
$$ packed form
10166a24829A54801b14795a02245B14435F8655a16637A88271a11361k36727h4167
10155c56926F930i0000B2626h9347j7093M9253l14402a04482r8464D1274M7917
10144H9191M744J33809a131j04822j51417A19658O0918d49379a29412b7893r4297
10133a22190j14253P2664C2072O9589K43109B8602a54035A75638F2067g1287A60443
10121a42676j0447j02312A42175a94104A7824a04279B7543a24311J7933j3171
10111a19549B7162b04790A33395a14219J5641C8950O1247j3723M1526a20661R044
10100a11617K8462A79351b49603I7018m8177Q0360e1254k2820D0007a28653e1516
10088C8082a61805P2535C03753a38433n3178A05015a38653M7482C3146b27397
$$ plain form
10077 -196603 27017 -98634 -127381 -241083 62104 -33112 -228945 92584 206995 7005 -174003
10065 115714 -105223 -299766 5593 53932 -249485 -51558 319371 155589 37468 -118689
10054 151490 -18268 -186375 135349 -277673 -150620 126699 -455600 -203081 -274858 -103461
10043 -143461 42337 50325 51927 -450 179574 99864 -126722 44479 57128 -91701 -67366 22109
10030 -151771 -169749 -167940 177495 66392 222654 283876 87621 20745 -93962 -253469 284027
10018 -178712 -97229 85285 -374703 101105 -25474 57620 74959 185037 65961 72609 -62791
10006 -264675 101686 -147151 -9176 -59482 -33984 304235 -153452 -48621 -84621 55877 123237
9995 123237 -444708 47680 -28534 83343 17452 65365 -462 152042 -154526 86867 -225293
$$ packed form
10077a96603B7017i8634k8747j13702F2104c3112j95833I2584J14411G005a74003
10065A15714a05223j94543E593M8339b49485e1558C19371A55589C7468a18689
10054A51490a8268j68107A35349b77673J27053A26699d55600b03081p1777a03461
10043a43461D2337P988J602d50A79574p9710a26722D4479J2649i1701K4335B2109
10030a51771j7978J809A77495F6392J56262O1222H7621B0745i3962j59507B84027
10018a78712Q1483H5285c74703A01105b5474E7620J7339J10078F5961O648f2791
10006b64675A01686a47151i176n0306K5498C04235a53452d8621l6000E5877O7360
9995A23237d44708D7680b8534H3343A7452M7913d62A52042a54526H6867b25293
$$ plain form
9983 38764 55243 -238888 34391 173307 -243992 -303317 241960 -188427 -300966 -39611 -306899
9972 -306899 -148543 -178523 -37701 -170941 144478 91584 -41387 -219814 187375 -20222 -150882
9961 -150882 296442 -16317 23030 -38706 14650 -68768 63304 -272161 -306239 -30989 25882
9949 293327 207104 -187673 167931 -300240 -116729 -114729 -60211 354382 -187256 -10213 52945
9937 154682 264866 302701 -461481 -154296 -522200 -75856 -37313 315732 -305268 -122716
9926 273298 7653 104798 -84428 -397442 -30409 48938 -203844 75751 -193324 219604 -149361
9914 -112231 -184752 -10922 -217997 -476624 -139258 25186 -21501 -76489 -123984 70327 35104
9902 67389 -82916 -281116 -34284 51446 -270909 27032 149503 242690 -74445 -332905 114312
$$ packed form
9983C8764J6479b38888C4391J38916b43992n9325B41960a88427j12539c9611k67288
9972c06899a48543k9980c7701j33240A44478n2894d1387j78427A87375b0222j30660
9961a50882B96442a6317B3030c8706A4650f8768F3304b72161l4078c0989B5882
9949B93327q6223a87673A67931c00240a16729K000N4518C54382a87256a0213E2945
9937A54682J10184L7835d61481a54296l67904g5856c7313C15732c05268a22716
9926B73298G653R7145h4428l13014c0409D8938b03844G5751a93324B19604a49361
9914a12231p2521a0922k07075k58627a39258B5186b1501n4988m7495G0327C5104
9902F7389h2916j98200c4284E1446b70909B7032J22471R3187g4445k58460A14312
$$ plain form
9890 -193544 -131068 48786 96865 -150199 -201254 226618 -24756 -112048 -331312 26529 144055
9879 144055 269633 -268272 -211083 19734 200546 -204458 -45162 166355 -172508 -163977 -154202
9868 -154202 -27878 -53734 83396 220374 272820 145251 36843 -146979 -89569 -324705 -7981
9856 7942 -8516 -94977 -49068 -377734 -137927 -179064 -128764 -291471 11196 -65876 -158087 65465
9843 163073 -214365 -148657 -255263 -343588 -9569 -372159 -38278 -364453 151308 -319872 206406
9831 -201550 31443 265282 223524 -234248 -120830 173346 -130677 123415 131223 -42927 -93883
9820 -93883 -151238 13925 273704 -15497 226799 -197296 -205870 -322330 6051 171880 133151
9809 133151 37104 -235598 18247 35449 29975 239808 -141552 25253 5963 -92050 11666
$$ packed form
9890a93544O2476D8786M8079a50199n1055B26618b4756q7292k19264B6529J17526
9879A44055J25578b68272N7189A9734J80812b04458d5162A66355a72508Q531R775
9868a54202b7878k5856H3396J36978N2446j27569C6843a46979N7410k35136g981
9856G942h516q6461M5909l28666a37927m1137N0300j62707A1196f5876r2211F5465
9843A63073b14365O5708j06606q8325i569l62590c8278l26175A51308c19872B06406
9831b01550C1443K33839m1758b34248J13418A73346a30677A23415P808d2927n0956
9820i3883n7355A3925K59779a5497B26799a97296q574j16460F051J65829l8729
9809A33151C7104b35598A8247J7202n474K09833a41552B5253E963i2050A1666
$$ plain form
9797 96728 216792 -152045 -44940 128336 -168488 87000 -175354 -108977 82254 -206765 180025
9785 58229 -152251 -259437 52872 -98616 185015 -345237 -43360 -90390 144292 -39778 -180944
9774 -180944 -188560 -165270 -18432 184269 -127038 -233263 -256104 79169 40334 -55367 -60362
9763 -60362 -110213 -133669 -226512 -176427 -273536 186932 190679 -69939 -130185 -193065 -157692 -292308
9751 -292308 -45680 -488984 -84935 229778 -11930 206705 38306 94523 91448 -30656 -134710
9740 -134710 20291 -210669 92939 -207369 -96394 271122 -150213 -3856 27339 81154 62578
9729 62578 -22412 24625 -112864 -43565 -26078 150948 -268136 -36991 21718 -72903 -148186
9718 -148186 -142570 23910 -39875 77054 23575 -182135 -92890 -179786 -81723 -255618 -108738
$$ packed form
9797I6728J20064a52045d4940A28336a68488H7000a75354O6377H2254b06765A80025
9785E8229a52251j07186E2872i8616A85015c45237d3360m7030A44292c9778j41166
9774a80944p616K3290a8432A84269a27038j06225k2841G9169l8835e5367m995
9763f0362m9851k3456r2843N0085r7109A86932L747f9939o0246o2880L5373j34616
9751b92308d5680m43304h4935B29778a1930B06705C8306N6217l075c0656j04054
9740a34710B0291b10669I2939b07369i6394B71122a50213c856B7339N3815j8576
9729F2578b2412B4625a12864d3565J7487A50948b68136c6991B1718g2903p5283
9718a48186N616B3910c9875G7054B3575a82135Q9245q6896h1723j73895a08738
$$ plain form
9706 -24971 305498 -222815 203040 -184362 -84607 26664 -60511 104158 266946 170378 100286
9695 100286 -190096 35881 44284 -254559 176964 364716 110215 -30831 -240411 -136631
9685 -136631 -191024 -353992 -179721 -112842 -130001 -170429 -283302 46360 234774 -274692 -20103
9673 -74736 -167839 -34434 -372862 -320265 -86755 24179 21166 -69989 -151269 61415 136168 -193152
9660 -231254 29514 -82060 55879 -140998 63305 -228537 -244441 -181728 166058 -56888 -325199
9649 -325199 -86896 -144909 76593 60118 -175097 -211097 121451 164342 -31722 18836 117483
9638 117483 -72104 -46744 145790 170490 -133988 -381147 71220 45366 214801 -271948 -128046
9626 -141030 -273985 -195555 227333 -215643 23701 -2699 -22057 194665 23974 -213036 220895
$$ packed form
9706b4971C05498b22815B03040a84362h4607B6664f0511A04158J62788r6568p0092
9695A00286a90096C5881Q403b54559A76964J87752A10215c0831k09580J03780
9685a36631n4393j62968J74271O6879j7159m0428j12873D6360J88414b74692b0103
9673g4736r3103c4434l38428N2597h6755B4179l013f9989q1280F1415P4753a93152
9660b31254B9514h2060E5879a40998F3305b28537j5904O2713A66058e6888k68311
9649c25199h6896n8013G6593j6475a75097l6000A21451M2891c1722A8836R8647
9638A17483g2104K5360A45790K4700a33988k47159G1220k5854J69435b71948a28046
9626a41030j32955P8430B27333b15643B3701b699j9358A94665B3974b13036B20895
$$ plain form
9614 -170434 -272102 -12132 -217137 162697 -42203 -236812 -245104 -99760 7821 1659 78886
9603 78886 -157137 -537991 82324 -19716 -93829 -112947 104078 -245665 166058 11865 39702
9592 39702 150802 242377 149069 -100923 -76063 -477074 -104577 182127 -127162 186033
9581 281394 27775 4876 -41173 74915 -62188 -8667 -10810 58397 145814 -40764 -80845 -217504
9569 -217504 -279355 -43116 -91214 -128681 -19206 85745 -35836 -148398 81482 324174 -150321
9557 22881 -111138 -53577 205011 -181412 -174597 -133655 167811 162601 -189712 -189696 169739 -198606
9544 80798 -301986 -76326 23660 -161548 -167688 -44177 49785 -212471 -103383 -119831 -197469
9533 -197469 234635 -231784 -51508 38804 33500 335368 -209410 -179904 -184239 -93174 286138
$$ packed form
9614a70434j01668a2132k05005A62697d2203j94609q292i9760G821A659P7227
9603G8886a57137l80854H2324a9716p4113j9118A04078b45665A66058A1865K7837
9592C9702J11100R1575r3308a00923K4860m01011a04577A82127a27162A86033
9581B81394B7775D876d1173G4915f2188h667k143E8397Q7417d0764m0081j36659
9569b17504o1851d3116m8098l7467a9206H5745c5836j12562H1482K42692a50321
9557B2881a11138e3577B05011a81412O815M0942A67811n210a89712J6A69739a98606
9544H0798c01986g6326B3660a61548o140d4177D9785b12471a03383j6448p7638
9533a97469B34635b31784e1508C8804n304L01868b09410K9506m335R1065B86138
$$ plain form
9521 80831 -224735 -109902 180538 180608 -112496 88418 -268341 -60865 -357933 94832 -96751
9509 -209524 -147156 -79072 -116071 -84647 -73799 -17853 -88294 -172791 16422 83847 -56470 -38089
9497 -38089 -278479 -213199 -103708 -29935 -153759 -262373 -88619 -87176 -17605 -125786 -83549
9486 -83549 122962 194291 -12827 225958 36174 67083 -244388 96977 -164786 -398491 -41506
9474 286046 -184317 -251592 -23195 -247942 -73591 -104516 29347 295979 -13300 -100757 50760
9462 21986 -25057 -39725 1944 -92351 -80189 -249476 7995 -40877 -121902 140318 56895 20846
9449 168975 -163392 -110515 -171082 -154298 140224 14800 -125589 3211 15862 -299519 124410
9437 -158722 -48898 164547 22528 -204858 -217707 -92170 -178703 88969 -88533 225387 -89827
$$ packed form
9521H0831b24735a09902A80538P0a12496H8418b68341f0865k97068I4832i6751
9509b09524O2368O8084l6999L1424J0848a7853p0441q4497A6422O7425e6470J8381
9497c8089k40390O5280a03708b9935j23824j08614h8619J443a7605j08181M2237
9486h3549A22962P1329a2827B25958C6174L0909b44388I6977a64786k33705d1506
9474B86046a84317o7275b3195k24747g3591l0925B9347K66632a3300q7457E0760
9462B1986b5057j4668A944i2351J2162j69287G995d0877q1025A40318E6895B0846
9449A68975a63392N2877o0567J6784A40224A4800a25589C211J2651b99519A24410
9437a58722d8898A64547B2528b04858j2849i2170q6533H8969h8533B25387h9827
$$ plain form
9425 -200926 -208565 -69743 34912 -176137 -101864 -171634 36742 -160835 -143695 163994 -10521
9413 -369373 26089 -81982 -69964 -219675 9360 123773 -157701 -194208 -167951 -46936 24368
9401 -48293 54559 -205351 28896 -38300 36796 190416 -14545 -105146 -60369 125008 -153052
9389 -18980 149630 -94615 -79986 -177395 51819 148911 -4421 -353101 104026 -317747 -276666
9378 -276666 90325 -331780 53350 -70240 -17902 -212245 79532 -63531 -281325 41016 27347
9367 27347 -217925 93762 110554 -169963 -164187 -273504 -60143 68059 -101204 -96930 -192925
9356 -192925 145803 247719 -30949 -82654 140837 16247 -8999 25540 171033 -69610 -268219
9345 -268219 -162166 109981 97311 15653 -129787 -299353 174067 110599 -56324 157493
$$ packed form
9425b00926p639f9743C4912a76137P4273o9770C6742a60835J7140A63994a0521
9413c69373B6089h1982J2018j49711I360J14413a57701l6507K6257d6936B4368
9401d8293E4559b05351B8896c8300C6796J53620a4545r0601M4777A25008a53052
9389a8980A49630i4615J4629r7409E1819R7092d421l48680A04026c17747M1081
9378b76666I0325c31780E3350g0240a7902j94343G9532f3531k17794D1016j3669
9367B7347b17925I3762J6792a69963N776j09317f0143F8059a01204M274r5995
9356a92925A45803J01916c0949n1705A40837A6247h999B5540J45493f9610j98609
9345b68219J06053A09981j2670A5653a29787j69566A74067o3468e6324A57493
$$ plain form
9334 39797 -143444 91626 75736 134821 -225602 204411 187695 -240300 120545 -48786 -35790
9323 -35790 -130582 -221674 47551 -146030 -299843 258185 602 270595 113537 -3368 -131186
9312 -131186 -167055 -3013 21458 -8481 88426 114142 -234561 -6563 -152297 120014 73816 17062
9299 -9977 -123574 -29819 54683 -157734 165159 -132988 -141818 79531 143119 -285919 -29423
9287 -2979 -177737 -121219 -121553 80253 178604 -393606 -138149 52980 442214 28511 108029 -127147
9274 -113502 -199838 177321 -219920 -49097 212391 -131169 -20478 109288 19215 -168873
9263 -271650 -251636 91136 79804 32105 -258103 6040 113525 -153762 141883 -7543 -274353
9252 -274353 -244651 -23852 37788 265716 -242625 -262881 126449 -35845 75348 -128981 -207676
$$ packed form
9334C9797a43444I1626j5890N9085b25602B04411j6716b40300A20545d8786J2996
9323c5790r4792r1092D7551a46030j53813B58185F02K69993A13537c368j27818
9312a31186l5869c013B1458h481H8426K5716b34561f563j45734A20014m6198A7062
9299i977j13597b9819E4683a57734A65159a32988q830G9531O3588b85919b9423
9287b979j74758N6518l34H0253R8351c93606a38149E2980L89234B8511P9518a27147
9274a13502q6336A77321b19920d9097B12391a31169b0478A09288A9215a68873
9263b71650K0014I1136j1332C2105b58103F040J07485a53762A41883g543k66810
9252b74353K9702b3852C7788K27928b42625k0256A26449c5845G5348a28981p8695
$$ plain form
9241 -207676 -83696 122350 -66267 -268117 -297639 -356422 -25477 84275 -245016 55701 184178
9230 184178 114451 -211672 -158629 -63453 -23777 149705 -251100 279 87670 -35474 -116853
9219 -116853 118696 -52980 17946 79998 49096 39347 21634 -118750 48401 -205963 -282296
9208 -282296 -94583 497480 -205147 -285467 324224 56972 -93149 -75423 -83116 -69091 -294842
9197 -294842 -72115 -360116 -62950 -19198 -72681 58957 -122588 -204769 48718 -256691 165424
9185 17392 170084 300022 122740 -34113 -274262 -47538 199413 -85130 -293155 258871
9174 -508107 48124 -129094 -353409 -149744 49493 -257572 89565 161103 -46644 -104970 -24447
9162 151685 98811 -274850 -118642 21183 26971 139212 51936 -294432 101988 -13999 -139016
$$ packed form
9241b07676h3696A22350f6267k01850k9522n8783b5477H4275b45016E5701J28477
9230A84178o9727b11672N3043f3453b3777A49705b51100B79Q7391c5474q1379
9219a16853A18696e2980A7946O2052l0902r749j7713a18750D8401b05963p6333
9208b82296i4583D97480b05147q0320C24224E6972i3149J7726p693J4025k25751
9197b94842g2115k88001f2950a9198n3483E8957a22588q2181D8718b56691A65424
9185A7392J52692J29938A22740c4113k40149d7538A99413h5130k08025B58871
9174e08107D8124a29094k24315a49744D9493b57572H9565P1538d6644n8326b4447
9162A51685n2874b74850a18642B1183N788J12241E1936b94432A01988a3999j25017
$$ plain form
9151 -139016 252775 142603 -286659 -81783 262766 -134302 -66991 39570 24276 -510251
9140 86292 18289 -101913 294833 -19193 72959 134418 154097 49717 -50958 -223204 -124109
9129 -124109 -21870 -101250 -118491 -27374 -117298 -62755 -87343 270285 98428 -116955 -40845
9117 -125209 -95424 -79728 -44281 -236209 -73531 28709 364742 -56564 -59361 -312040 -166554
9106 -166554 160236 -103915 -196778 -194040 -318452 -155737 -152795 2199 -61208 -379070 -107727
9094 112650 -71944 -52834 -47028 -200984 -184119 103600 -85852 -133932 -56525 314702 -15262
9082 -185667 80917 -19562 -149177 -16917 -324438 -118681 -86542 220446 88490 -95151 209101
9070 59546 95811 -11090 -202690 -69711 -467385 -207684 260230 -62921 -221971 67754 -540038
$$ packed form
9151a39016B52775j10172b86659h1783B62766a34302f6991C9570j5294e10251
9140H6292A8289a01913B94833a9193G2959O1459J9679D9717e0958j72246R9095
9129a24109b1870p9380j7241b7374q9924N4543k4588B70285I8428a16955d0845
9117a25209K9785J5696L5447j91928g3531B8709L36033e6564k797k52679J45486
9106a66554A60236a03915r2863K738j24412a55737K942B199f1208l17862a07727
9094A12650g1944J9110N806j53956J6865A03600h5852m8080e6525C14702a5262
9082a85667H0917a9562j29615a6917l07521a18681L2139B20446H8490i5151B09101
9070E9546L6265a1090j91600f9711l97674b07684B60230f2921j59050F7754e40038
$$ plain form
9058 86191 -33023 -27869 -149156 112646 61897 35394 -215779 -181774 -35434 -230718 -4722
9046 40447 252218 -227462 -161678 49223 160215 -17773 31651 -306625 170374 -54161 75791
9034 -144893 -17152 267288 -61045 -201794 -251369 51360 18665 914 -195468 -164093 -126530
9023 -126530 -117090 -111960 -148322 137163 -93354 331813 405138 70390 -80586 -230581 -3986 71371
9010 -121061 -312486 -219656 198154 -9318 -241754 -106292 -207604 61231 35967 -215968 -351
8998 -155558 -37190 -223047 14061 -81626 -17967 -220319 -39086 3393 -62826 -166869 60891
8986 -264006 -274757 -104171 87470 -30590 -267938 91266 -60360 -232620 -139414 -169858 -219304
8975 -219304 -142565 76049 -131442 174758 -57906 -33387 129044 -161457 213890 46171 -193851
$$ packed form
9058H6191c3023N154j21287A12646n0749k6503b15779L4005c5434j95284d722
9046D0447K11771b27462O5784D9223J10992a7773C1651c06625A70374e4161G5791
9034a44893a7152B67288f1045j40749m9575E1360A8665I14a95468L1375L7563
9023a26530R440N130l6362A37163i3354C31813P3325G0390h0586j49995c986G1371
9010a21061j91425R2830A98154i318k32436a06292j01312F1231k5264b15968c51
8998a55558c7190j85857A4061h1626a7967k02352c9086C393f2826j04043F0891
8986b64006j0751a04171H7470c0590k37348I1266f0360j72260R3206l0444m9446
8975b19304P6739G6049a31442A74758e7906K4519A29044a61457B13890D6171a93851
$$ plain form
8963 188103 -40023 -86584 -220228 118226 -54358 -97414 -63535 2119 -40472 -141462 -237715
8952 -237715 82277 132199 72140 104212 -222957 -200563 106762 -94517 274369 -62625 -158781
8941 -158781 95061 273065 -50994 -8267 167098 -287764 181401 250446 481933 330255 162298
8929 54626 -33258 -1679 276411 130282 172413 250721 666507 1834760 6284955 16012613
8919 16012613 4668002 1596688 705719 715032 -154437 330387 -148830 34563 96786 -285240
8908 -265931 140160 358297 228210 292806 219212 88275 21727 20635 61815 111576 -57604
8896 -13491 -96301 -173562 -120859 -170006 -270448 66329 -52805 -95539 -35807 -138993 129802
8884 -301474 -95422 -215761 187820 136660 118566 -33136 80295 -118106 -13075 91140 -278791
$$ packed form
8963A88103d0023m6561j33644A18226e4358m3056L3879B119d0472j00990r6253
8952b37715H2277M9922o0059L2072b22957K2394A06762i4517B74369f2625r6156
8941a58781I5061J78004e0994h267A67098b87764A81401O9045K31487j51678A62298
8929E4626c3258a679B76411A30282M2131P8308M15786J168253M450195R727658
8919A6012613D668002A596688G05719R313a54437C30387a48830C4563O2223b85240
8908b65931A40160K18137j30087O4596p3594H8275B1727j092M1180M9761e7604
8896a3491q2810p7261N2703m9147j00442F6329e2805m2734c5807j03186A29802
8884c01474i5422j20339A87820n1160j8094c3136H0295a18106a3075I1140b78791
$$ plain form
8872 -69864 -212773 -130280 -131923 -98979 -253255 11629 -193188 29384 -103447 38640 -315039
8860 -143146 -56665 23423 -137565 47958 -185662 -83182 -148969 -7612 -49659 105180 -91758
8848 -75278 145426 134107 -210805 164666 -122387 -97501 -103493 30795 -305627 66895 -314255
$$ packed form
8872f9864j42909Q2493j643L2944j54276A1629a93188B9384a03447C8640c15039
8860a43146e6665B3423a37565D7958a85662h3182o5787g612m2047A05180i1758
8848g5278A45426j1319b10805A64666a22387K4886n992C0795c05627F6895c14255
$$ [...]
##END NTUPLES=NMR SPECTRUM
##END=
