##TITLE=NES1061_159122.0010_001_9704394_M04ESlPhw2
##JCAMPDX= 6.0         $$ Bruker NMR JCAMP-DX V2.0
##DATA TYPE= NMR SPECTRUM
##DATA CLASS= NTUPLES
##ORIGIN= BRUKER
##OWNER= Administrator
$$ 1.72 TOPSPIN		Version 2.1
$$ 2016-05-01 17:32:18.302 -0700  Administrator@X
$$ Compression mode = diff/dup
##.OBSERVE FREQUENCY= 400.02188249412
##.OBSERVE NUCLEUS= ^1H
##.ACQUISITION MODE= SIMULTANEOUS (DQD)
##.ACQUISITION SCHEME= undefined
##.AVERAGES= 64
##.DIGITISER RES= 22
##SPECTROMETER/DATA SYSTEM= spect
##.PULSE SEQUENCE= noesygpps1d.comp
##.SOLVENT NAME= COFFEE_meoh
##.SHIFT REFERENCE= INTERNAL, COFFEE_meoh, 1, 14.96169
##AUDIT TRAIL= $$ (NUMBER, WHEN, WHO, WHERE, PROCESS, VERSION, WHAT)
$$ ##TITLE= Audit trail, TOPSPIN		Version 2.1
$$ ##JCAMPDX= 5.01
$$ ##ORIGIN= Bruker BioSpin GmbH
$$ ##OWNER= Administrator
$$ $$ E:\/data/COFFEE/nmr/NES1061_159122.0010_001_9704394_M04ESlPhw2/12/pdata/1/auditp.txt
$$ ##AUDIT TRAIL=  $$ (NUMBER, WHEN, WHO, WHERE, PROCESS, VERSION, WHAT)
(   1,<2016-05-01 17:32:13.411 -0700>,<Administrator>,<X>,<go>,<TOPSPIN 2.1>,
      <created by zg
	started at 2016-05-01 17:20:43.802 -0700,
	POWCHK enabled, PULCHK disabled,
       configuration hash MD5:
       21 0F 79 D6 B3 7B B4 F6 88 20 88 DB 03 48 BD 9F
       data hash MD5: 64K
       02 C7 33 29 DE 0C FA C3 69 3C 9C 5D DA FF 97 D4>)
(   2,<2016-05-01 17:32:16.567 -0700>,<Administrator>,<X>,<proc1d>,<TOPSPIN 2.1>,
      <Start of raw data processing
       efp LB = 0.3 FT_mod = 6 PKNL = 1 PHC0 = 0 PHC1 = 0 SI = 128K 
       data hash MD5: 128K
       9E 99 FD 21 45 29 EB 0F 33 C8 54 3F 13 03 7D 22>)
(   3,<2016-05-01 17:32:17.427 -0700>,<Administrator>,<X>,<proc1d>,<TOPSPIN 2.1>,
      <pk PHC0 = -83.18848 PHC1 = 0 
       data hash MD5: 128K
       E1 69 8F 69 D3 55 4D 54 00 BB 0D BE 45 4F 93 06>)
(   4,<2016-05-01 17:32:17.817 -0700>,<Administrator>,<X>,<proc1d>,<TOPSPIN 2.1>,
      <abs ABSG = 1 
       data hash MD5: 128K
       34 8A F3 44 CC 8C BA EE A9 E6 29 2D 3D 7E 87 6D>)
(   5,<2016-05-01 17:32:17.911 -0700>,<Administrator>,<X>,<proc1d>,<TOPSPIN 2.1>,
      <abs ABSG = 2 
       data hash MD5: 128K
       90 72 9F 12 E4 08 71 55 A5 0E F8 21 5D 61 8F C5>)
(   6,<2016-05-01 17:32:17.989 -0700>,<Administrator>,<X>,<proc1d>,<TOPSPIN 2.1>,
      <abs ABSG = 3 
       data hash MD5: 128K
       17 36 D3 C9 88 9A 1E D8 E9 60 E4 FC 0C 2C B9 44>)
(   7,<2016-05-01 17:32:18.067 -0700>,<Administrator>,<X>,<proc1d>,<TOPSPIN 2.1>,
      <abs ABSG = 4 
       data hash MD5: 128K
       13 2B E6 98 3A 75 99 E9 B8 54 69 FA FD CC 67 19>)
(   8,<2016-05-01 17:32:18.146 -0700>,<Administrator>,<X>,<proc1d>,<TOPSPIN 2.1>,
      <abs ABSG = 5 
       data hash MD5: 128K
       03 C3 35 4E 10 B8 EF 65 07 04 02 49 B1 A0 6B D3>)
$$ ##END=
$$ 
$$ $$ hash MD5
$$ $$ A6 72 92 B6 93 2C 38 79 29 0F B7 77 F2 DB 5E 70
##$RELAX= 
##$RELAX= 
##$RELAX= 
##$RELAX= 
##$RELAX= 
##$RELAX= 
##$RELAX= 
##$RELAX= 
$$ Bruker specific parameters
$$ --------------------------
##$DU= <E:\>
##$EXPNO= 12
$$ [...]
##$TP07= 0
##$TPNAME0= <>
##$TPNAME1= <>
##$TPNAME2= <>
##$TPNAME3= <>
##$TPNAME4= <>
##$TPNAME5= <>
##$TPNAME6= <>
##$TPNAME7= <>
##$TPOAL= (0..7)
0.5 0.5 0.5 0.5 0.5 0.5 0.5 0.5
##$TPOFFS= (0..7)
0 0 0 0 0 0 0 0
##$TUNHIN= 0
##$TUNHOUT= 0
##$TUNXOUT= 0
##$USERA1= <user>
##$USERA2= <user>
##$USERA3= <user>
##$USERA4= <user>
##$USERA5= <user>
##$V9= 5
##$VALIST= <valist>
##$VCLIST= <CCCCCCCCCCCCCCC>
##$VD= 0
##$VDLIST= <DDDDDDDDDDDDDDD>
##$VPLIST= <PPPPPPPPPPPPPPP>
##$VTLIST= <TTTTTTTTTTTTTTT>
##$WBST= 2048
##$WBSW= 25
##$XGAIN= (0..3)
0 0 0 0
##$XL= 0
##$YL= 0
##$YMAX_a= 5398369
##$YMIN_a= -10958247
##$ZGOPTNS= <>
##$ZL1= 120
##$ZL2= 120
##$ZL3= 120
##$ZL4= 120
##$ABSF1= 14.96169
##$ABSF2= -5.596492
##$ABSG= 5
##$ABSL= 3
##$ALPHA= 0
##$AQORDER= 0
##$ASSFAC= 0
##$ASSFACI= 0
##$ASSFACX= 0
##$ASSWID= 0
##$AUNMP= <proc_prof1d_extract.lims>
##$AXLEFT= 0
##$AXNAME= <>
##$AXNUC= <1H>
##$AXRIGHT= 0
##$AXTYPE= 0
##$AXUNIT= <>
##$AZFE= 0.1
##$AZFW= 0.1
##$BCFW= 0
##$BC_mod= 0
##$BYTORDP= 0
##$COROFFS= 0
##$CY= 15
##$DATMOD= 1
##$DC= 0
##$DFILT= <>
##$DTYPP= 0
##$F1P= 0
##$F2P= 0
##$FCOR= 0.5
##$FTSIZE= 131072
##$FT_mod= 6
##$GAMMA= 0
##$GB= 0
##$INTBC= 1
##$INTSCL= 1
##$ISEN= 128
##$LB= 0.3
##$LEV0= 0
##$LPBIN= 0
##$MAXI= 10000
##$MC2= 0
##$MEAN= 0
##$ME_mod= 0
##$MI= 0
##$NCOEF= 0
##$NC_proc= -2
##$NLEV= 6
##$NOISF1= 0
##$NOISF2= 0
##$NSP= 0
##$NTH_PI= 0
##$NZP= 0
##$OFFSET= 14.96169
##$PC= 1
##$PHC0= -83.18848
##$PHC1= 0
##$PH_mod= 1
##$PKNL= yes
##$PPARMOD= 0
##$PPDIAG= 0
##$PPIPTYP= 0
##$PPMPNUM= 2147483647
##$PPRESOL= 1
##$PSCAL= 4
##$PSIGN= 0
##$PYNMP= <proc.py>
##$REVERSE= no
##$SF= 400.020009360278
##$SI= 131072
##$SIGF1= 0
##$SIGF2= 0
##$SINO= 400
##$SIOLD= 131072
##$SPECTYP= <>
##$SREGLST= <1H.CDCl3>
##$SSB= 0
##$STSI= 131072
##$STSR= 0
##$SW_p= 8223.68421052631
##$SYMM= 0
##$S_DEV= 0
##$TDeff= 65536
##$TDoff= 0
##$TI= <>
##$TILT= no
##$TM1= 0
##$TM2= 0
##$TOPLEV= 0
##$USERP1= <user>
##$USERP2= <user>
##$USERP3= <user>
##$USERP4= <user>
##$USERP5= <user>
##$WDW= 1
##$XDIM= 131072
##$YMAX_p= 305356266
##$YMIN_p= -11731
##$CURPLOT= <Network HP LaserJet P1505>
##$CURPRIN= <$Network HP LaserJet P1505>
##$DFORMAT= <normdp>
##$LAYOUT= <+/1D_H.xwp>
##$LFORMAT= <normlp>
##$PFORMAT= <normpl>
##$SURQMSG= 1
$$ End of Bruker specific parameters
$$ ---------------------------------
##NTUPLES= NMR SPECTRUM
##VAR_NAME=  FREQUENCY,     SPECTRUM/REAL,   SPECTRUM/IMAG
##SYMBOL=    X,             R,               I
##VAR_TYPE=  INDEPENDENT,   DEPENDENT,       DEPENDENT
##VAR_FORM=  AFFN,          ASDF,            ASDF
##VAR_DIM=   131072,        131072,          131072
##UNITS=     HZ,            ARBITRARY UNITS, ARBITRARY UNITS
##FACTOR=    0.0627417313425164, 1,          1
##FIRST=     8223.62146879497, 119,          -48218
##LAST=      0,             1986,            -48306
##MIN=       0,             -11731,          0
##MAX=       8223.62146879497, 305356266,    0
$$ Real data points
##PAGE= N=1
##DATA TABLE= (X++(R..R)), XYDATA
$$ [...]
67824 42228 43556 44547 45117 45733 46677 47417 47201 45976 44340 42853 41878 41753 42448 43201 43156 42308 41253 40168
67806 40168 38797 37457 37168 38386 40258 41546 41867 41667 41401 41221 41157 41212 41407 41940 43047 44475 45480
67789 45480 45679 45601 45989 46792 47302 47104 46370 45318 43965 42546 41718 42073 43610 45819 48062 49758 50556
67772 50556 50647 50760 51520 52804 53940 54532 54821 55167 55459 55323 54783 54417 54757 55743 56848 57620 57966 58039 58029
67753 58029 58086 58319 58822 59618 60572 61363 61680 61457 60808 59750 58201 56315 54565 53306 52408 51543 50670 50000
67735 50000 49621 49444 49499 49962 50797 51643 52140 52225 52028 51622 51004 50213 49349 48499 47742 47202 47031 47237 47500 47301
67715 47301 46495 45752 46104 47877 50265 52172 53209 53606 53450 52584 51256 50292 50343 51229 52260 52978 53344
67698 53344 53420 53263 53144 53510 54521 55758 56662 57245 58102 59596 61330 62662 63496 64205 64898 65382 65838 66891
67680 66891 68725 70675 72105 73178 74315 75329 75742 75628 75463 75278 74656 73497 72150 70808 69418 68224
67664 68224 67702 67812 67888 67422 66458 65093 63266 61310 60065 59989 60621 61232 61576 61644 61255 60419 59702 59663 60181
67645 60181 60905 62071 64193 67031 69580 71236 72500 74265 76775 79532 81928 83632 84478 84392 83603 82699
67629 82699 82184 82046 82092 82748 85019 89259 94361 98747 101978 104775 107544 109673 110492 110207 109442 108403
67613 108403 106933 104963 102452 99226 95414 91749 88956 86999 85271 83325 81094 78715 76545 75040
67599 75040 74108 72878 70695 68130 66284 65231 63908 61707 59425 58321 58715 59935 61306 62725 64362
67584 64362 66152 67713 68656 68891 68585 67867 66809 65755 65356 65882 66673 66677 65589 64149 63304 63376 64100 65125
67566 65125 66245 67272 67912 67835 66951 65643 64578 64161 64237 64405 64402 64039 63089 61583 59989 58734 57717 56681
67548 56681 55874 55829 56599 57729 58940 60258 61394 61684 60923 59767 59034 59004 59615 60754 61963 62317 61276
67531 61276 59492 58293 58363 59274 60195 60694 60871 61057 61480 61984 62070 61410 60317 59530 59515 60162 61121 62138 63031
67512 63031 63601 63766 63687 63622 63716 63992 64472 65144 65825 66177 65996 65461 65019 64990 65359 65941 66600 67193 67454 67201
67492 67201 66654 66306 66386 66605 66516 65961 65044 63880 62627 61684 61597 62610 64363 66099 67171 67386 66944 66166
67474 66166 65363 64937 65382 66928 69184 71371 73094 74694 76714 79117 81252 82540 82999 83041 82967 82775 82332
67457 82332 81584 80614 79646 79017 78986 79459 79974 80131 80081 80466 81762 83733 85580 86654 86953 86934 86929 86788 86110
67438 86110 84748 83008 81268 79551 77654 75709 74364 74171 74960 76047 76931 77535 77846 77727 77231 76758
67422 76758 76622 76672 76637 76663 77117 77897 78405 78345 78114 78140 78167 77687 76873 76536 77051 77861 78222 77997 77440 76626 75599
67401 75599 74753 74521 74744 74909 74987 75488 76590 77751 78436 78783 79239 79913 80648 81458 82459 83489 84150 84192
67383 84192 83672 82886 82333 82534 83544 84727 85289 84989 84149 83148 82203 81499 81149 81070 81145 81486 82230 83184 83969
67364 83969 84485 84885 85158 85110 84832 84792 85356 86456 87780 89025 89898 90232 90278 90583 91381 92315 92918 93217 93649
67345 93649 94563 95932 97428 98591 99049 98775 98143 97636 97458 97498 97603 97817 98299 99000 99508 99420 98863 98457 98632
67326 98632 99210 99855 100589 101503 102227 102265 101832 101839 102881 104658 106465 107830 108600 108929 109420 110735 112604 113660
67308 113660 112852 110800 109211 109040 109739 110320 110552 110871 111532 112281 112752 112876 112868 113020 113565 114547 115737 116770
67290 116770 117537 118382 119719 121416 122782 123226 122776 121894 121059 120691 121088 122094 123080 123716 124584 126471 129140
67273 129140 131416 132573 133031 133452 133804 133740 133427 133442 134058 135089 136305 137635 139042 140493 141984 143391
67257 143391 144444 145070 145590 146345 147324 148356 149420 150446 151085 151092 150764 150595 150615 150489 150193 150140 150650 151629 152768
67238 152768 153718 154187 154269 154650 156032 158297 160650 162582 164196 165531 166257 166327 166397 167133 168459 169878 171225
67221 171225 172643 174089 175339 176366 177287 178004 178332 178426 178662 179092 179506 180035 181205 183191 185493 187599
67205 187599 189549 191465 192932 193423 193237 193392 194501 196204 197873 199423 201142 203060 204911 206610 208363
67190 208363 210306 212314 214230 216056 217843 219578 221231 222781 224154 225320 226504 228084 230162 232384
67176 232384 234341 236023 237719 239585 241464 243090 244247 244799 244845 244918 245768 247728 250347 252878 255080 257334
67160 257334 259899 262336 263946 264641 265049 265739 266725 267953 269823 272724 276171 279047 280875 282389 284504
67145 284504 287106 289333 290813 292075 293702 295702 297913 300477 303467 306352 308498 310153 312310 315402
67131 315402 318647 321046 322638 324328 326756 329894 333561 337646 341749 345294 348320 351560 355362 359014
67117 359014 361670 363583 365792 368819 372325 375953 379874 384366 389409 394833 400446 405897 410823 415284
67103 415284 419638 423918 427764 431112 434411 437852 440960 443409 445827 449220 453762 458747 463588 468336
67089 468336 473198 478126 483108 488453 494413 500694 506661 512011 516995 521925 526710 531124 535423 540317
67075 540317 546154 552384 558146 563206 568067 573299 579160 585737 592899 600048 606480 612206 618009 624486
67061 624486 631516 638924 647095 656367 666204 675579 684051 691977 699786 707531 715124 722580 729990 737597
67047 737597 745860 755095 765015 774973 784676 794407 804509 814933 825344 835462 845282 855147 865526
67034 865526 876485 887477 897921 907923 918095 928799 939980 951670 964080 977019 989780
67023 989780 1001968 1014149 1027228 1041340 1055702 1069565 1082953 1096327 1109771 1122842 1135325
67012 1135325 1147946 1161987 1178110 1195714 1213556 1230755 1247042 1262383 1276895 1291134 1305965
67001 1305965 1321928 1338875 1356349 1374097 1392143 1410577 1429405 1448471 1467409 1485909 1504168
66990 1504168 1522894 1542595 1562983 1583272 1603068 1622689 1642566 1662639 1682576 1702428 1722670
66979 1722670 1743547 1764737 1785887 1807137 1828746 1850459 1871815 1892991 1914709 1937129 1959475
66968 1959475 1981098 2002400 2024246 2046850 2069786 2092801 2115976 2139173 2161949 2184103 2205862
66957 2205862 2227405 2248555 2269028 2288726 2307735 2326251 2344526 2362655 2380460 2397825 2415045
66946 2415045 2432563 2450376 2467988 2484930 2501052 2516421 2531235 2545764 2560045 2573646 2586078
66935 2586078 2597365 2607886 2617743 2626719 2634753 2641987 2648331 2653446 2657226 2659880 2661558 2662402 2662927 2663762
66921 2663762 2664776 2665019 2663736 2661026 2657326 2652794 2647479 2641611 2635291 2628227 2620163 2611265 2601799 2591728
66907 2591728 2580996 2569961 2559109 2548381 2537022 2524092 2509069 2492159 2474145 2455792 2437350
66896 2437350 2418786 2400309 2382210 2364266 2345913 2327082 2308241 2289362 2269673 2248842 2227794
66885 2227794 2207643 2188277 2168639 2148064 2126729 2105019 2083152 2061299 2039471 2017336 1994623
66874 1994623 1971690 1949244 1927552 1906370 1885551 1865249 1845525 1826172 1806915 1787459 1767416
66863 1767416 1746630 1725556 1704924 1685028 1665657 1646577 1627677 1608685 1589265 1569446 1549564
66852 1549564 1529821 1510271 1491215 1473071 1455789 1438841 1421909 1405120 1388530 1371848 1354910
66841 1354910 1338042 1321723 1306124 1291102 1276339 1261401 1246050 1230679 1216081 1202544 1189513
66830 1189513 1176364 1163166 1150388 1138168 1126225 1114284 1102224 1089919 1077307 1064606 1052209
66819 1052209 1040287 1028617 1016764 1004427 991723 979187 967297 955877 944225 932038 920026
66808 920026 909278 900110 891791 883376 874532 865472 856412 847355 838384 829842 822017 814659 807010 798486
66794 798486 789214 779858 771044 763075 755935 749183 741986 733796 725094 716990 709895 703020 695574 687971
66780 687971 681314 675846 670609 664646 658031 651453 645273 639310 633288 627072 620585 613857 607229 601157
66766 601157 595687 590307 584543 578577 573112 568610 564826 561081 556813 551858 546386 540755 535324 530234
66752 530234 525356 520511 515695 511020 506511 502125 497871 493747 489631 485482 481561 478187 475240 472232
66738 472232 468965 465749 462703 459213 454564 449014 443740 439626 436448 433413 430110 426621 422966 418904
66724 418904 414325 409564 405213 401774 399434 397929 396542 394539 391829 389008 386511 383985 380831 377232
66710 377232 374090 371818 369714 366929 363707 361162 359901 359376 358635 357229 355171 352388 348777 344716 341062
66695 341062 338401 336479 334539 332098 329241 326312 323586 321280 319573 318343 317029 315005 312146 308880
66681 308880 305682 302691 299853 297233 295026 293298 291887 290556 289213 287932 286740 285402 283535 281039
66667 281039 278321 275934 274091 272685 271636 270918 270300 269480 268526 267752 267001 265500 262743 259200 255803 252967
66651 252967 250530 248420 246864 245933 245312 244625 243729 242663 241549 240526 239556 238322 236582 234530 232512
66636 232512 230450 228025 225436 223464 222502 221922 220797 219027 217425 216747 216965 217460 217666 217377 216529 214929
66620 214929 212397 209200 206128 203930 202741 202172 201807 201336 200381 198694 196597 194847 193831 193196 192424 191510
66604 191510 190806 190430 190138 189723 189266 188957 188735 188171 186757 184449 181940 180142 179357 179087 178701 178017 177177
66587 177177 176352 175729 175477 175439 175135 174393 173772 173958 174893 175838 176206 175931 175125 173865 172411 171206 170404 169669
66569 169669 168667 167564 166843 166714 166933 167149 167259 167310 167124 166196 164206 161649 159647 158865 158790 158457 157707 157237
66551 157237 157390 157498 156766 155311 153855 152696 151536 150212 149010 148120 147238 145919 144050 141819 139508
66536 139508 137548 136468 136444 136997 137411 137417 137284 137335 137627 137994 138138 137635 136224 134231 132538 131973 132725 134308
66518 134308 135918 136842 136802 136027 134845 133215 130904 128151 125797 124546 124341 124698 125361 126286 127190 127538 127024
66501 127024 125825 124348 122977 122001 121546 121524 121771 122187 122641 122868 122660 122060 121165 119922 118379 116975 116226
66484 116226 116197 116632 117423 118518 119459 119560 118681 117331 115959 114630 113501 112988 113115 113205 112629 111551 110595
66467 110595 110136 110225 110822 111651 112158 112118 112003 112316 112797 112849 112470 112087 111642 110637 109153 108042 107808 107926 107646
66448 107646 106979 106466 106346 106450 106674 107051 107429 107479 107063 106317 105360 104212 103033 102161 101733 101459 100957 100263
66430 100263 99849 100074 100750 101342 101503 101281 100847 100275 99666 99242 99107 99077 98955 98833 98864 98852 98442 97692 97067 96764
66410 96764 96433 95780 95094 94871 95097 95216 94764 93836 93001 92917 93871 95433 96628 96724 95851 94707 93739 92864 91934
66391 91934 91082 90480 90007 89402 88587 87666 86671 85522 84258 83199 82773 83163 84097 85007 85499 85640 85733 85819 85569
66372 85569 84760 83677 82883 82656 82814 83060 83312 83680 84229 84807 85000 84335 82809 81206 80552 81075 81913 82106
66354 82106 81617 81048 80615 79950 78894 77891 77346 77132 77059 77391 78325 79298 79446 78745 78062 78008 78371 78888 79906
66335 79906 81737 83789 84939 84695 83546 82266 81311 80807 80647 80495 80063 79490 79134 79014 78787 78299 77656
66318 77656 76734 75244 73614 73122 74523 76870 78390 78359 77543 76931 76769 76835 76882 76530 75377 73665 72365
66301 72365 72187 72833 73642 74522 75696 76843 77225 76630 75600 74593 73504 72198 71046 70562 70743 71079 71125
66284 71125 70863 70629 70798 71485 72399 73040 73109 72684 71998 71197 70392 69726 69267 68894 68485 68202 68462 69511 71006
66265 71006 72046 71786 70203 68245 67039 66966 67628 68608 69904 71498 72871 73371 72991 72479 72550 73202 73903
66248 73903 74312 74569 74943 75407 75747 75894 75920 75712 75039 74028 73283 73225 73530 73507 72925 72142 71532 71145 70955 71045
66228 71045 71406 71834 72117 72139 71774 70973 70016 69396 69294 69427 69523 69661 70033 70599 71151 71461 71296 70555 69548
66209 69548 68839 68667 68827 69202 69946 70941 71610 71656 71495 71462 71113 70032 68975 69262 71020 72855 73486 73008
66191 73008 72331 72040 72321 73396 75282 77254 78177 77559 75998 74480 73443 72610 71608 70490 69578 68949
66175 68949 68353 67698 67346 67699 68654 69714 70512 70912 70719 69742 68222 66822 66011 65629 65196 64468 63659 63237
66157 63237 63525 64333 64966 64843 64086 63277 62744 62424 62331 62648 63215 63437 62948 62079 61416 61208 61430 62054 62968
66138 62968 63890 64620 65159 65409 65149 64577 64399 64914 65418 65121 64360 64186 64875 65590 65584 65018 64374 63693 62800 61805
66118 61805 60947 60245 59635 59199 58915 58409 57344 55958 54855 54341 54280 54562 55384 56945 59106 61431 63464
66101 63464 64923 65788 66287 66743 67315 67888 68206 68075 67461 66464 65278 64111 63112 62336 61811 61655 62043 62980
66083 62980 64080 64767 64785 64445 64218 64209 64199 64122 64190 64523 64961 65335 65643 65786 65406 64262 62626 61063 59942
66064 59942 59335 59214 59410 59547 59356 59050 59056 59363 59471 59063 58433 58154 58560 59590 60809 61514 61190 60122 59281
66045 59281 59354 60130 61006 61744 62439 63086 63649 64349 65354 66306 66704 66723 67053 67765 67992 67127 65877 65601 66767
66026 66767 68535 69758 69996 69559 69026 68872 69287 70057 70733 71103 71430 72104 73097 73898 74018 73337 71961 69941
66008 69941 67452 65159 63979 64199 65025 65297 64586 63371 62283 61583 61384 61875 62946 63931 64152 63715 63414
65991 63414 63774 64473 64867 64865 64957 65404 65765 65499 64883 64914 66138 67931 69167 69353 68832 68108 67478 67189 67325
65972 67325 67413 66713 65190 63723 63023 62811 62483 62165 62496 63544 64625 65180 65305 65297 65134 64589 63573 62239
65954 62239 60983 60314 60404 60715 60492 59694 59022 58865 58674 57730 56198 54973 54695 55278 56297 57382 58227 58641
65936 58641 58705 58662 58558 58242 57769 57473 57490 57477 57117 56730 56975 57954 58931 59159 58716 58380 58802 59997 61473 62595
65916 62595 62886 62306 61381 60867 61170 62108 63200 64034 64369 64133 63459 62586 61656 60711 59882 59344 59026 58621 58027
65897 58027 57534 57412 57546 57662 57653 57509 57209 56979 57334 58452 59663 60055 59458 58464 57580 56876 56470 56698 57622
65878 57622 58717 59371 59360 58663 57213 55201 53385 52593 52913 53639 54116 54427 55166 56624 58378 59761 60584
65861 60584 61175 61719 61890 61351 60344 59425 58830 58534 58762 59861 61637 63351 64543 65352 65869 65770 65002 64293
65843 64293 64413 65126 65430 64728 63360 62111 61597 62026 63063 63879 63768 62896 62127 62008 62210 62102 61615 61299
65825 61299 61654 62592 63534 63971 63899 63736 63813 64062 64310 64718 65625 66989 68263 68888 68674 67658 65954 64003
65807 64003 62638 62444 63092 63650 63591 63165 62748 62262 61489 60652 60267 60527 61179 61982 62903 63878 64680 65166 65376
65788 65376 65346 65137 65114 65763 66938 67670 67115 65483 63712 62480 61927 62042 62707 63433 63615 63119 62201 60933
65770 60933 59307 57953 57973 59656 61842 63000 62619 61282 59868 59139 59643 61257 62894 63303 62303 60893
65754 60893 60107 60085 60310 60337 60096 59711 59273 58719 57872 56650 55274 54152 53557 53449 53614 53873 54128 54293 54262
65735 54262 53974 53556 53297 53373 53599 53640 53482 53448 53664 53844 53803 53917 54704 56124 57592 58601 58987 58688 57703
65716 57703 56414 55536 55441 55769 55942 55932 56165 56736 57081 56655 55734 55235 55748 56994 58345 59591 60930 62315
65698 62315 63180 62946 61642 59909 58506 57899 58220 59441 61420 63710 65446 65799 64755 63262 62313 62052
65682 62052 62023 62027 62215 62495 62531 62377 62467 62776 62658 61852 61037 60851 60880 60281 59054 58017 57663 57707 57740 57733 57814 58030
65660 58030 58445 59055 59535 59502 59131 59138 59935 61126 61988 62168 61724 60806 59639 58682 58448 59010 59830 60202 59868
65641 59868 59137 58425 57788 57041 56206 55587 55450 55841 56685 57729 58395 58169 57324 56830 57284 58299 59200 59769
65623 59769 59924 59234 57457 55249 53608 52769 52286 52018 52265 53034 53929 54820 55833 56583 56284 54985 53931
65606 53931 54193 55484 56787 57598 58008 58041 57586 56803 56023 55334 54708 54407 54761 55585 56207 56166 55592 54894 54346
65587 54346 54017 53865 53777 53662 53542 53532 53759 54349 55359 56637 57838 58682 59153 59361 59344 59033 58326 57123 55506
65568 55506 53966 53257 53799 55311 57087 58516 59268 59237 58549 57549 56595 55920 55705 56065 56830 57554 57934 58090
65550 58090 58222 58209 57828 57226 56896 57159 57899 58835 59847 60992 62297 63559 64347 64323 63646 62965 62852 63328
65532 63328 64019 64603 64947 64913 64326 63177 61737 60416 59564 59309 59495 59850 60289 60902 61574 61879 61599 61124
65514 61124 60991 61150 61110 60744 60500 60665 60888 60693 60154 59743 59724 60034 60587 61303 61893 62030 61832 61825 62276 62823
65494 62823 62996 62865 62897 63295 63814 64191 64408 64404 63834 62421 60485 58845 58092 58032 57963 57465 56828 56668 57209 58086
65474 58086 58809 59201 59276 58953 58114 56874 55527 54272 53218 52579 52541 52968 53599 54517 56032 57990 59615
65457 59615 60294 60197 59878 59583 59192 58598 57869 57288 57394 58593 60451 61770 61824 61216 61050 61619 62444 63294 64363
65438 64363 65517 66158 66014 65505 65128 64948 64861 64887 64971 64841 64317 63594 63105 63282 64344 66023 67583 68472 68914
65419 68914 69440 70016 70189 70046 70269 71090 71828 71793 71110 70346 69754 69262 68838 68574 68644 69249 70256 70935 70697
65400 70697 70161 70728 72748 74894 75823 75783 75906 76586 77367 77984 78605 79268 79920 80960 82911 85433 87349
65383 87349 87953 87837 88210 89681 91866 93983 95714 97518 100051 103267 106362 108785 110953 113607 116774
65368 116774 119816 122255 123981 124851 124749 124090 123737 124223 125378 126798 128273 129667 130731 131259 131237 130697
65352 130697 129649 128239 126822 125683 124716 123389 121186 118213 115380 113663 113034 112381 110659 107871 104754
65337 104754 101883 99405 97291 95357 93236 90752 88219 86045 84274 82873 82152 82318 82847 82926 82507 82335
65321 82335 82956 84158 85379 86141 86075 85114 83792 82923 82818 83125 83433 83596 83464 82815 81710 80543 79626 79032
65303 79032 78744 78537 77776 75938 73410 71232 69958 69273 68740 68263 67660 66570 65113 63997 63565 63384 63144
65286 63144 63303 64159 64964 64824 64092 63935 64581 64956 64224 62979 62487 63222 64565 65680 66217 66204 65654 64533
65268 64533 63045 61668 60744 60182 59740 59499 59743 60386 60899 60933 60680 60444 60180 59721 59176 58814 58774 59114 59914
65249 59914 60990 61744 61735 61244 60845 60530 59796 58631 57859 58187 59288 60189 60383 60166 59962 59777 59480 59285 59566
65230 59566 60243 60732 60649 60268 60043 59902 59406 58548 57954 58117 58814 59517 60150 61063 62351 63532 63997 63594 62716
65211 62716 61941 61637 61809 62187 62500 62694 62926 63318 63742 63862 63464 62716 62089 61991 62521 63538 64840 66242
65193 66242 67608 68885 70011 70756 70809 70169 69267 68596 68317 68396 68847 69580 70177 70231 69880 69692 70013 70668 71266
65174 71266 71472 71021 69838 68260 66852 65875 65141 64426 63739 63108 62469 61934 61901 62641 63906 65113 65780 65726
65156 65726 65047 64101 63427 63460 64239 65379 66299 66555 66093 65187 64089 62850 61573 60618 60340 60730 61554 62635
65138 62635 63736 64399 64332 63868 63638 63872 64427 65302 66544 67696 68028 67441 66577 65917 65367 64849 64594 64555 64233
65119 64233 63512 63062 63403 64081 64372 64351 64643 65378 66015 66098 65651 64933 64206 63712 63563 63737 64357 65660 67456
65100 67456 68948 69545 69603 69995 71197 73165 75725 78513 80811 82142 82958 84220 86311 88860 91491 94193
65084 94193 96898 99254 100967 101961 102117 101288 99695 98010 96865 96425 96322 95827 94230 91433 88090 84877
65068 84877 81820 78733 75949 74004 72736 71506 70307 69845 70278 70656 70066 68732 67468 66521 65554 64476
65052 64476 63666 63461 63853 64705 65861 66982 67561 67241 66096 64577 63269 62556 62382 62357 62196 62019 62181 62838
65034 62838 63731 64361 64442 64232 64343 65061 65925 66188 65653 64812 64200 63913 63806 63820 63895 63853 63541 62992 62319 61629
65014 61629 61113 60954 60977 60658 59707 58513 57764 57759 58286 59028 59774 60288 60331 59958 59606 59673 60101 60521 60792 61206
64994 61206 62046 63083 63747 63822 63673 63678 63684 63372 62978 63203 64373 66035 67508 68494 68968 68822 68032 67058 66592
64975 66592 66814 67137 66857 65951 65022 64494 64051 63070 61500 60068 59517 59855 60512 61046 61382 61512 61358 60999
64957 60999 60724 60703 60803 60829 60763 60673 60613 60773 61440 62588 63710 64335 64609 65051 65770 66284 66162 65530 64731 63724
64937 63724 62206 60339 59016 59093 60373 61656 61911 61261 60613 60505 60683 60775 60905 61300 61655 61372 60437 59559
64919 59559 59318 59515 59611 59493 59481 59765 60262 60933 61774 62400 62164 61002 59802 59482 59883 59995 59209 57954 57085
64900 57085 57022 57587 58317 58740 58614 58049 57328 56555 55736 55212 55603 57103 59033 60384 60697 60280 59738 59480
64882 59480 59500 59505 59317 59206 59670 60810 62159 63170 63622 63502 62912 62233 61953 62025 61798 60936 60022 59838 60351
64863 60351 60885 61026 60862 60550 60228 60224 60813 61741 62475 62847 63025 62938 62314 61314 60537 60256 60118 59719 59105 58567
64843 58567 58348 58624 59319 59830 59361 57779 55770 54023 52616 51410 50650 50807 52001 53832 55710 57285
64827 57285 58732 60549 62826 64705 64973 63288 60577 58169 56823 56555 56907 57268 57344 57477 58158 59192
64811 59192 59822 59741 59445 59407 59575 59935 60839 62260 63303 63186 62340 61888 62208 62639 62448 61510 60059 58360
64793 58360 56738 55545 54935 54859 55187 55626 55707 55234 54639 54594 55297 56462 57822 59253 60491 61234 61550 61783
64775 61783 62003 61937 61554 61304 61494 61789 61654 61191 61154 62000 63120 63300 62058 60301 59391 59646 60204 60369 60499
64756 60499 61218 62223 62569 61876 60663 59486 58412 57486 57098 57516 58333 58757 58300 57033 55360 53796 52823
64739 52823 52709 53413 54682 56170 57455 58168 58279 58114 57988 57861 57524 57026 56699 56735 56876 56746 56428 56530
64721 56530 57546 59227 60782 61673 61987 62008 61702 60872 59611 58295 57210 56452 56209 56750 57936 58985 59020
64704 59020 57940 56616 56138 56835 58085 59022 59346 59355 59385 59440 59391 59243 59022 58668 58209 57877 57813 57784 57471 56978
64684 56978 56768 57107 57798 58467 58892 59014 58921 58907 59275 59919 60266 59852 58889 58072 57888 58246 58689 58772 58288 57401
64664 57401 56681 56739 57619 58596 58855 58375 57991 58528 60000 61651 62567 62284 61093 59909 59557 59977 60360 60284
64646 60284 60345 61297 62879 64100 64534 64616 64599 63957 62223 59855 57801 56537 55988 56058 56641 57247 57158 56198 55059
64627 55059 54724 55627 57351 59041 60107 60586 60863 61143 61411 61800 62641 63970 65329 66218 66541 66470 66208 66028
64609 66028 66230 66765 67226 67450 67751 68241 68380 67703 66713 66389 66934 67571 67608 67212 67100 67853 69550 71656 73204
64590 73204 73504 72798 71988 71714 71952 72365 72657 72576 72050 71447 71328 71783 72305 72393 72039 71571 71352 71661 72544 73659
64570 73659 74552 75124 75530 75637 75048 73812 72664 72256 72475 72763 72853 72905 73160 73718 74606 75836 77453 79523
64552 79523 81881 83881 84708 84104 82576 80745 78858 77035 75616 74870 74604 74407 74101 73660 72928 71856
64536 71856 70904 70670 71036 71102 70153 68413 66693 65588 65226 65539 66387 67420 68091 67997 67155 66001 65174 65206
64518 65206 66089 67043 66971 65479 63373 61916 61647 62158 62905 63728 64438 64419 63166 61082 59315 58694 59033 59484
64500 59484 59383 58759 58147 57938 57868 57325 56249 55495 55993 57686 59578 60790 61270 61497 61848 62329 62717 62841
64482 62841 62787 62780 62776 62373 61374 60262 59740 59822 59809 59229 58486 58418 59420 61115 62754 63882 64661 65545 66557 67160
64462 67160 67031 66697 67012 68131 69422 70260 70456 70033 69171 68425 68429 69177 70000 70362 70284 69929 69307 68640 68447
64443 68447 68990 69978 71083 72292 73473 74063 73691 72853 72580 73567 75815 78887 82202 85307 88086 90524
64427 90524 92249 92735 92174 91642 92028 93167 94391 95421 96180 96215 95150 93582 92775 93350 94782 96246 97445
64410 97445 98471 99321 99773 99518 98353 96474 94581 93334 92667 91937 90790 89530 88547 87778 86956 86085 85345
64393 85345 84678 83805 82640 81472 80644 80174 79730 78928 77584 75799 73921 72443 71735 71705 71854 71804 71707 71946
64375 71946 72620 73575 74788 76267 77628 78299 78284 78269 78742 79419 79773 79734 79600 79646 80091 81035 82124 82709 82756
64356 82756 83105 84313 85656 85976 85232 84503 84580 85273 86046 86672 87180 87759 88819 90644 92908 94999 96860
64339 96860 98969 101487 104014 106283 108416 110329 111554 112013 112363 113149 114077 114564 114629 114787 115405 116617 118562
64322 118562 121236 124250 127159 129909 132653 135338 137892 140605 143878 147728 152037 157257 164242 173274
64308 173274 183651 194496 205634 217447 230182 243749 258082 273343 289681 306873 324186
64297 324186 340538 354847 366368 374729 379642 380742 377875 371462 362303 350995 337762 323037 307850
64284 307850 293248 279365 265502 251284 237346 224643 213421 203214 193624 184576 175902 167234
64272 167234 158570 150581 144095 139406 136211 133959 132081 130103 127880 125675 123781 122142 120469 118719
64258 118719 117167 115996 114993 113820 112481 111398 111017 111389 112164 112933 113543 114102 114794 115711 116842 118142
64242 118142 119585 121161 122785 124276 125479 126348 126851 126882 126451 125942 125876 126292 126552 125862 123818 120467 116277
64225 116277 112266 109694 109000 109211 108951 108043 107598 108461 110085 111263 111528 111456 111792 112729 114063 115729 117937
64208 117937 120785 123932 126855 129425 131970 134640 137044 138803 140225 141928 143986 145969 147857 150255
64194 150255 153502 157117 160520 163881 167816 172538 177785 183460 189931 197653 206775 217085 228194 239822
64180 239822 252056 265276 279704 295195 311489 328332 345068 360348 372689 381327 386281 387721
64168 387721 385603 379912 370936 359233 345516 330643 315441 300454 285936 272092 259169 247305
64156 247305 236479 226631 217736 209688 202224 194976 187593 179950 172367 165533 159993 155683 152039 148548
64142 148548 145102 141912 139269 137264 135594 133675 131167 128351 125827 123877 122280 120694 118940 117005
64128 117005 115103 113767 113512 114202 115040 115364 115264 115249 115537 115975 116481 117239 118427 119987 121708 123398 124990
64111 124990 126628 128628 131145 133922 136587 139252 142544 146884 152005 157422 163144 169527 176493 183369
64097 183369 189639 195448 201072 206255 210440 213496 215762 217421 218258 218117 217191 215714 213728 211393 209220
64082 209220 207702 206902 206667 207096 208427 210618 213413 216869 221451 227462 234633 242439 250700 259681 269564
64067 269564 279878 289532 297433 303102 306633 308140 307478 304617 300039 294519 288647 282770 277257 272459
64053 272459 268464 265194 262751 261363 260998 261369 262336 263908 265665 266640 266175 264687 263173 262003 260522
64038 260522 257842 253730 248634 243090 237338 231480 225834 220922 216999 213730 210522 207232 204335 202344
64024 202344 201311 201061 201619 203063 205027 206741 207727 208285 209196 211043 213836 217170 220617 223992 227271
64009 227271 230365 233094 235457 237768 240410 243550 247227 251543 256507 261787 266933 271843 276756 281782
63995 281782 286848 292252 298935 307820 318904 331187 343428 354972 366108 377883 391465 407345
63983 407345 425089 443962 463774 484978 508009 532687 558354 584511 611371 639836 670924
63972 670924 705148 742547 783398 828755 880200 939162 1006731 1084017 1172408 1273467 1388910
63961 1388910 1520972 1672704 1847708 2049331 2279753 2539428 2827118 3140506 3476889
63952 3476889 3833501 4207461 4595546 4993740 5396429 5795681 6181252 6541483 6864720
63943 6864720 7140995 7363528 7529071 7636470 7684566 7671499 7595829 7457787 7259384 7004262
63933 7004262 6698474 6351370 5974798 5580591 5178445 4775752 4378689 3992931 3623453
63924 3623453 3274115 2947814 2646956 2373516 2128539 1911647 1721223 1555079 1410901
63915 1410901 1286297 1178837 1086263 1006508 937487 877153 823989 777209 736216 699980 667208
63904 667208 637026 609148 583361 559177 536117 514112 493317 473532 453981 433847 412992
63893 412992 392054 371829 352728 334978 318993 305062 292709 280922 269237 258160 248297 239514
63881 239514 231396 224070 217966 212915 208160 203304 198754 195066 192241 189813 187308 184475 181341 178215
63867 178215 175460 173186 171339 170039 169503 169573 169662 169417 169170 169526 170666 172214 173757 175266 177006 179034
63851 179034 180880 181874 181873 181407 180904 180039 178217 175463 172333 169024 165207 160815 156322 152013 147515 142469
63835 142469 137252 132601 128801 125632 122838 120220 117505 114539 111590 109096 107204 105829 104989 104652 104304
63820 104304 103158 100952 98301 96063 94519 93326 92136 91050 90381 90101 89752 88978 87946 87028 86263 85491
63804 85491 84921 84992 85554 85744 84963 83579 82298 81267 80286 79599 79797 80991 82568 83854 84656 85146 85554
63787 85554 86022 86459 86493 85846 84754 83742 83009 82335 81616 81065 80803 80608 80280 79932 79680 79283 78446 77361
63769 77361 76628 76544 76739 76718 76599 77001 78112 79202 79434 79024 79093 80302 82098 83543 84401 85015 85473 85499 85016
63750 85016 84272 83379 82162 80525 78691 77067 76146 76376 77738 79553 81130 82527 84202 86077 87647
63735 87647 89046 91151 94276 97469 99701 101236 103190 106048 109233 111992 114091 115587 116444 116501 115591
63720 115591 113656 110996 108340 106393 105296 104705 104272 103770 102920 101580 100204 99680 100539 102524 105006 107529
63704 107529 109825 111677 113098 114476 116225 118331 120416 122165 123521 124494 124974 124795 123846 122164 120020
63689 120020 117893 116191 114967 113998 113200 112793 113000 113755 114867 116354 118389 120878 123327 125261 126669
63674 126669 127908 129219 130470 131338 131593 131177 130174 128829 127512 126485 125606 124433 122742 120900 119534
63659 119534 118762 117968 116512 114599 113214 113139 114206 115537 116348 116427 116037 115602 115489 115928 117073 119125 122277
63642 122277 126454 131190 135916 140403 144852 149572 154682 160130 165932 172358 179849 188694 198788 209789
63628 209789 221542 234215 248025 263106 279779 298627 319773 342096 363633 383003 400170
63617 400170 415543 428566 437703 441908 441750 438806 434219 428327 421683 415749 411976 410380 409542 408058
63603 408058 405471 401667 395981 387476 375899 361912 346453 330254 314012 298620 284966 273488
63591 273488 263908 255428 247378 239812 233333 228269 224342 221324 219592 219573 220919 222834 225163 228547 233452
63576 233452 239575 246347 253566 261266 269335 277522 285622 293500 301197 309153 318038 328200 339533 351921
63562 351921 365536 380527 396737 413773 430926 446837 459769 468645 473581 475215 473878 469841
63550 469841 463985 457661 451936 447257 443662 440946 438749 436800 434921 432501 428329 421466 412147 401335
63536 401335 389519 376491 362199 347141 331785 316245 300823 286335 273455 262001 251203
63525 251203 240563 230211 220598 212066 204600 197868 191594 185918 181172 177255 173586 169820 166216 163021
63511 163021 159887 156410 153052 150902 150443 150948 151261 150836 149832 148552 147142 145747 144607 143924 143742 144005
63495 144005 144615 145428 146322 147351 148764 150761 153207 155665 157770 159597 161597 164085 166803 169096 170553
63480 170553 171394 172111 172751 172763 171662 169699 167643 165882 164007 161433 158282 155391 153467 152517 152199 152445
63464 152445 153447 155188 157343 159720 162440 165551 168774 171943 175459 179815 184774 189502 193705 198131
63450 198131 203630 210094 216733 223146 229554 236103 242597 249146 256548 265646 276615 289208 303473
63437 303473 319714 337822 357144 377229 398428 421509 446765 473723 501526 529262 555770
63426 555770 579498 598947 613314 622503 626613 625814 620917 613632 605827 598621 592420 587463 583831 580970
63412 580970 577782 573214 566377 556189 541735 523302 502521 481089 459779 438970 419415 401734
63400 401734 385594 370233 355686 342704 331514 321494 312233 304213 298085 293838 291048 289512 289272
63387 289272 290331 292734 296664 302154 308935 316822 325934 336242 347263 358613 370582 383704 398013
63374 398013 413273 429724 447934 467891 488858 510253 531976 553549 573442 589782 601563
63363 601563 608775 611637 610197 604768 596501 587388 579522 573983 570248 566946 563365 559881 556620 552221
63349 552221 544655 533164 518748 502740 485550 467013 447257 426810 406231 386124 367267 350353
63337 350353 335721 323507 313727 305913 299055 292403 286067 280422 275163 269585 263646 258062 253307 249148
63323 249148 245315 241971 239217 236658 233897 231100 228665 226642 224932 223858 224049 225660 228023 230152
63309 230152 231493 232187 232755 233555 234494 235258 235661 235580 234726 232921 230685 229084 228679 228910 228782 227831 226172
63292 226172 224020 221665 219619 218238 217223 216002 214505 213117 211925 210654 209427 208909 209325 209801 209256
63277 209256 207741 206392 206084 206595 207233 207892 209110 211143 213403 215021 215799 216343 217349 219004 221069 223232
63261 223232 225321 227481 230257 234095 238525 242290 244736 246760 249864 254455 259688 264847 270213 276444
63247 276444 283726 291798 300332 309007 317614 326483 336482 348263 361679 376220 391775 408648 426911
63234 426911 446033 465115 483325 500313 516434 532467 548901 565527 581863 597785 613573
63223 613573 629563 646044 663314 681495 700292 719210 737958 756347 773747 788940 800601
63212 800601 807866 810472 808570 802428 792168 777811 759733 739005 717013 694682 672257 649882
63200 649882 628141 607927 589970 574625 561931 551658 543459 537223 533359 532561 535253 541290 550180
63187 550180 561457 574793 589922 606600 624632 643826 663862 684315 704879 725459 745954
63176 745954 766076 785587 804665 823753 842953 861788 879601 895860 909921 920843 927888 931039
63164 931039 930538 925959 916238 900795 880265 855890 828583 798910 767710 736171 705275 675529
63152 675529 647341 621349 598111 577554 558958 541601 525412 510963 498801 488816 480286 472479
63140 472479 465116 458339 452532 448243 445908 445329 445590 445838 446093 446933 448409 449667 449754 448470 446289 443782
63124 443782 441310 438935 436319 432999 429069 425326 422395 419967 417426 415040 413857 414322 415621 416652
63110 416652 417190 417749 418726 420095 421669 423194 424320 424910 425387 426454 428517 431561 435425 439794 444054
63095 444054 447671 450789 454020 457492 460569 462745 464465 466627 469512 472595 475365 477978 481085 485197
63081 485197 490276 495797 501247 506622 512312 518392 524326 529689 534934 540944 547906 555236 562743 571204
63067 571204 581344 592762 604500 616425 629413 644268 661101 679844 700715 723822 748840
63056 748840 775518 804216 835480 869224 904646 940812 977042 1012909 1048350 1083746 1119459
63045 1119459 1155142 1189885 1223197 1255656 1288387 1322069 1356586 1391495 1426645 1462275 1498550
63034 1498550 1534924 1569917 1601492 1627684 1647001 1658493 1661666 1656218 1641740 1617842 1584783 1543875
63022 1543875 1497004 1445896 1392135 1337726 1285029 1235856 1190866 1149995 1113313 1081350 1054790
63011 1054790 1033984 1018746 1008701 1003941 1005105 1012454 1025067 1041438 1060826 1083466 1109510 1138453
62999 1138453 1169782 1203371 1238764 1274705 1309973 1344359 1378307 1412034 1445535 1479019 1512490
62988 1512490 1544943 1574631 1600172 1620939 1636415 1645700 1647694 1641295 1625467 1599667 1564386 1520865
62976 1520865 1470217 1413163 1350717 1284663 1217163 1150118 1084943 1022602 963658 908431 857118
62965 857118 809644 765549 724449 686552 652294 621435 593016 566403 541909 520079 500637
62954 500637 482488 464742 447480 431546 417658 405740 395117 385250 376053 367507 359395 351706
62942 351706 344911 339332 334510 329733 324996 320877 317577 314745 312164 309878 307579 304684 301302 298369
62928 298369 296451 295024 293322 291277 289177 286954 284410 281771 279425 277422 275672 274316 273371 272294
62914 272294 270495 268109 265731 263515 261034 257992 254575 251174 248188 246072 245098 244970 245010 244810 244492 244332
62898 244332 244455 244853 245417 245857 245845 245325 244589 244049 244007 244516 245302 245950 246366 246912 247926 249292 250672 251859
62880 251859 252598 252359 250859 248682 246854 245761 244915 243791 242384 240814 238979 236950 235313 234660 234828
62865 234828 234976 234416 233237 232105 231595 231710 231967 231952 231736 231653 231728 231529 230695 229428 228322 227723 227397 226788
62847 226788 225517 223607 221341 219061 217111 215805 215223 215065 214914 214682 214588 214708 214787 214707 214817 215581 217015
62830 217015 218769 220649 222766 225254 228134 231437 235107 238738 241774 244242 246982 250784 255357 259523
62816 259523 262543 264958 267909 271862 276389 281061 285942 290988 295547 299099 302242 306309 312006 318985
62802 318985 326828 335750 346076 357603 369962 383283 398041 414496 432699 452861 475345 500393
62790 500393 528251 559449 594589 633830 676876 723448 773639 827814 886307 949119 1015744
62779 1015744 1085318 1156860 1229049 1299724 1366118 1425920 1477807 1520656 1552799 1572639 1579697
62768 1579697 1574485 1557561 1529408 1491096 1444303 1390566 1331107 1267516 1201930 1136180 1071147
62757 1071147 1007202 944926 885153 828626 775904 727341 682911 642258 605134 571632 541746
62746 541746 514924 490394 467927 447973 430975 416660 404175 392852 382649 373790 366196 359522
62734 359522 353626 348614 344444 340965 338430 337413 337881 338893 339763 341095 344020 348714 354421 360820 368484
62719 368484 377806 388223 398957 410086 422486 436992 453989 473629 496085 521517 549965 581405
62707 581405 615991 654257 696929 744508 797191 855202 918660 986838 1057975 1130328 1203087
62696 1203087 1275739 1346790 1413813 1474519 1527099 1569647 1600154 1617321 1620787 1610515 1586648
62685 1586648 1550192 1503139 1447577 1385153 1317584 1246988 1175283 1103686 1033133 964797 899844
62674 899844 839059 782970 731953 685902 644152 606046 571343 539952 511701 486574 464700
62663 464700 445829 429151 413864 399528 385785 372257 358984 346412 334640 323280 312401
62652 312401 302976 295752 290177 284999 279562 273969 268410 263053 258314 254542 251482 248576 245687 243079
62638 243079 240879 239009 237518 236426 235378 233950 232261 230834 229909 229323 228978 228966 229190 229297 229096 228805
62622 228805 228830 229497 230933 232992 235367 237936 240866 244257 247917 251716 255943 261056 267348 275028 284293
62607 284293 294972 306490 318670 332294 348453 367547 389307 413529 440327 469838 502071
62596 502071 536757 572995 609373 644864 679201 711866 741320 766030 785768 800890 810571 812956
62584 812956 807159 794180 775708 753005 727176 699431 670413 639944 607993 575383 543180 512016
62572 512016 482525 455758 432416 411986 393321 375931 360160 346253 333911 322870 313484 306390
62560 306390 301678 298490 295543 292120 288519 285425 282960 280597 277936 275118 272382 269604 266488 262959
62546 262959 259211 255563 252402 250018 248383 247267 246658 246811 247846 249550 251718 254416 257841 262160 267542
62531 267542 274060 281516 289721 299064 310399 324224 340259 358030 377534 399095 422851 448666
62519 448666 476395 506123 538192 572983 610433 649768 689894 729865 768573 804240 834954
62508 834954 859731 878394 890431 894953 892025 882967 868671 848541 822096 790956 758136 725624
62496 725624 693602 661839 630700 600689 572045 545185 520806 499066 479182 460317 442528
62485 442528 426476 412475 400198 389068 378559 368266 358096 348466 340059 333129 327113 321089
62473 321089 314749 308742 303799 299615 295034 289539 284100 280177 278195 277406 276981 276634 276289 275872 275599 275948
62457 275948 277055 278530 280130 282279 285619 290226 295534 300895 306018 310991 316097 321498 327016 332286
62443 332286 337113 341389 344565 345598 343877 340022 335375 330695 325729 320105 314120 308309 302549 296159
62429 296159 288936 281631 275131 269478 264032 258465 253215 248946 245931 244018 242840 241823 240336 238198
62415 238198 235938 234330 233747 234168 235514 237612 239892 241634 242655 243519 244943 247211 250156 253412 256570
62400 256570 259359 261882 264552 267662 271170 274967 279135 283778 288805 294003 299136 303801 307450 309921
62386 309921 311864 314281 317590 321372 325101 328846 333138 338425 344841 352364 360967 370632 381415 393530
62372 393530 407231 422615 439645 458459 479554 503583 531020 561995 596335 633605 673080
62361 673080 713736 754247 792938 827922 857523 880824 897819 909059 915178 916773 914518 909089
62349 909089 900780 889283 874092 855261 833622 810140 785205 758802 731297 703678 676979 651832
62337 651832 628731 608241 590486 574726 559971 545931 532886 520731 508803 496736 484819
62326 484819 473225 461434 448926 436055 423764 412624 402587 393432 385033 377369 370654 365289
62314 365289 361234 357633 353682 349823 347404 346982 347505 347497 346600 345610 345294 345624 346051 346219 346383 347214 349075
62297 349075 351458 353436 354800 356441 359266 363044 366748 369913 373141 377176 381932 386680 390927 394809
62283 394809 398756 403066 407819 412990 418522 424370 430597 437432 445198 454149 464367 475765 488206
62270 488206 501770 517033 535030 556670 582085 610662 641823 675617 712359 751775 792637
62259 792637 833158 871544 906276 936260 960847 979606 992137 998430 999357 996326 990080 980107 965500
62246 965500 946127 922604 895448 864952 831919 797924 764497 732376 701898 673748 648853
62235 648853 627575 609415 593599 579709 567661 557357 548615 541287 535239 530219 525914 522161 518994
62222 518994 516515 514792 513896 513847 514457 515377 516416 517767 519771 522543 525895 529540 533161 536382 538967
62207 538967 541149 543571 546726 550590 554852 559337 564016 568746 573185 576996 580069 582676 585497 589270
62193 589270 594219 599921 605906 612184 618916 625807 632258 638080 643570 648865 653764 658411 663680 670517
62179 670517 679153 689305 700907 714310 729969 748296 769673 794243 821703 851475 882847 914569
62167 914569 944533 970479 991179 1006695 1017609 1024388 1027447 1027249 1024173 1018607 1011166 1002337 991794
62154 991794 978623 962447 943852 923602 902140 880332 860024 842948 829303 818066 808579 801141
62142 801141 796064 792899 790855 789472 788574 787949 787369 786709 785889 784957 784357 784858 787015 790838 796114 802717
62126 802717 810324 817992 824341 828235 829276 827887 825214 822874 822337 824085 827203 829853 830393 828280 824002
62111 824002 818319 811696 804453 797093 790218 784245 779415 775898 773589 771918 770272 768639 767529 767198
62097 767198 767328 767626 768368 770048 772687 775721 778574 781136 783760 786897 790769 795346 800641 806912 814422
62082 814422 823039 832295 841825 851566 861565 871914 882980 895420 909739 925939 943669 962495
62070 962495 981919 1001257 1019686 1036355 1050455 1061359 1068737 1072426 1072267 1068289 1061025 1051258 1039350
62057 1039350 1025108 1008396 989507 968761 946054 921118 894090 865642 836771 808606 782109
62046 782109 757737 735457 715168 696811 680066 664459 650115 637897 628337 620740 613829 607056
62034 607056 600731 595031 589520 583718 577652 571733 566372 561808 557970 554403 550609 546518 542506 538979
62020 538979 536117 533911 532116 530248 528023 525776 524113 523134 522370 521508 520727 520188 519624 518753 517826 517350
62004 517350 517349 517155 516032 513907 511466 509549 508405 507518 506128 503839 500711 496941 492648 487853 482493
61989 482493 476518 470158 463989 458501 453657 449061 444411 439538 434185 428272 422450 417949 415565 414873
61975 414873 414538 413335 410940 408047 405797 404951 405413 406511 407636 408542 409265 410056 411300 413179 415425 417699
61959 417699 420152 423305 427393 432124 437041 441879 446615 451560 457329 464320 472248 480627 489643 499960
61945 499960 511586 523613 535371 547289 560235 574457 589544 605046 620723 636518 652723
61934 652723 669877 688069 706569 724545 741939 759278 776892 794774 813012 831816 851158
61923 851158 870941 891594 914155 939660 968624 1001139 1037181 1076817 1120271 1167722 1218972
61912 1218972 1273480 1330938 1391563 1455510 1522298 1591261 1662399 1736311 1813288 1892815 1973791
61901 1973791 2054780 2134170 2210713 2283882 2353110 2416632 2471750 2516416 2549923 2571815 2580941
61890 2580941 2576161 2557451 2525717 2481950 2427259 2363348 2292138 2214952 2132783 2047399 1961434
61879 1961434 1877153 1795612 1717093 1641706 1569276 1499394 1432242 1369072 1311164 1258419 1209512
61868 1209512 1163425 1120369 1081136 1046073 1014883 987028 962028 939585 919748 902825 888922
61857 888922 877651 868487 861263 856032 852547 850255 848905 848751 849856 851336 851699 850077 846949 843489
61843 843489 840276 836801 832231 826429 820166 814533 810336 807976 807615 809288 812913 818277 825026 832801
61829 832801 841484 851171 861600 871709 880123 886215 890358 893027 894012 892823 889544 884928 879825 874879
61815 874879 870615 867429 865544 865254 867079 871343 877680 885427 894456 905220 917982 932432 948181
61802 948181 965252 983976 1004771 1028048 1053994 1082324 1112667 1145287 1180947 1219896 1261535
61791 1261535 1305366 1351820 1401721 1455387 1512796 1574307 1640602 1711944 1788013 1868539 1953831
61780 1953831 2044708 2142138 2246822 2358808 2477559 2602656 2734160 2871885 3014452 3159598
61770 3159598 3305424 3450751 3594006 3732264 3861830 3979578 4083259 4170507 4238039 4282303
61760 4282303 4301094 4294363 4263359 4209227 4132860 4036074 3922275 3795536 3659254 3516024 3368366
61749 3368366 3218907 3069831 2922697 2778929 2640040 2507198 2380838 2260926 2147356
61740 2147356 2040044 1938912 1844007 1755477 1673317 1597251 1526915 1461917 1401663 1345426 1292797
61729 1292797 1243891 1198889 1157482 1118904 1082454 1047797 1014894 983836 954780 927861 903096
61718 903096 880378 859590 840652 823385 807344 791875 776468 761065 745900 731074 716501
61707 716501 702305 688969 676833 665626 654740 643802 632812 621973 611749 602849 595563 589125
61695 589125 582258 574464 566311 558332 550268 541752 533233 525655 519394 514003 508934 504127 499850 496239
61681 496239 493046 489731 485859 481579 477565 474255 471242 467647 463049 457802 452532 447558 442778 437821
61667 437821 432299 426184 420000 414454 409836 405927 402405 399057 395681 392230 389176 387270 386677 386711 386753
61652 386753 387115 388534 391021 393762 396082 397902 399102 399013 396990 393229 388675 384239 380378 377157 374316
61637 374316 371384 368147 365051 362777 361355 360043 358268 356355 355091 354797 355091 355410 355445 355127 354475 353566
61621 353566 352522 351430 350356 349381 348596 348052 347762 347726 347853 347878 347355 345789 342912 339010 334958 331637 329219
61604 329219 327204 325234 323558 322509 321799 320743 319052 317116 315543 314725 314753 315392 316135 316639 317197 318476
61588 318476 320710 323395 325859 327855 329509 331048 332835 335386 339058 343798 349366 355599 362273 368962
61574 368962 375459 382272 390266 399682 409785 419689 429316 439357 450382 462271 474518 486899 499679
61561 499679 513180 527231 541040 553637 564523 573950 582499 590309 596815 601393 604220 606318 608694
61548 608694 611590 614527 616880 618309 618963 619452 620461 622130 623874 624978 625218 624775 623730 622001 619718
61533 619718 617319 615228 613613 612450 611622 610996 610646 611036 612710 615758 619729 624090 628659 633687 639751
61518 639751 647474 657061 668125 680254 693695 709143 726904 746725 768451 792337 818561 846978
61506 846978 877656 911186 948047 987949 1030260 1074852 1122112 1172250 1225016 1279967 1336527
61495 1336527 1393649 1449715 1502937 1551865 1595558 1633507 1665417 1690945 1709644 1721221 1725817
61484 1725817 1724035 1716812 1705272 1690478 1673160 1653839 1633234 1612305 1591791 1572015 1553313 1536271
61472 1536271 1521164 1507492 1494483 1481864 1469700 1457668 1445006 1431148 1416000 1399664 1382413
61461 1382413 1364994 1348440 1333368 1319772 1307534 1296789 1287708 1280473 1275605 1273779 1274954 1278160
61449 1278160 1282659 1289080 1298879 1312778 1330132 1349809 1371262 1394700 1420488 1448351 1476839 1503459
61437 1503459 1525607 1541586 1550814 1553393 1550032 1542420 1533056 1524147 1516655 1510549 1505697 1502206 1500143
61424 1500143 1499506 1500564 1503820 1509495 1517323 1526986 1538282 1550456 1561504 1568563 1569101 1561812 1546807
61411 1546807 1525469 1500065 1472907 1445524 1418636 1392776 1368562 1346402 1326391 1308669 1293503
61400 1293503 1280799 1269913 1260279 1251943 1245186 1239913 1235857 1233166 1232330 1233537 1236583 1241439 1248575 1258619
61386 1258619 1271948 1288633 1308471 1330986 1355742 1382845 1412957 1446689 1484118 1524912 1568599
61375 1568599 1614490 1661632 1709122 1756422 1803077 1848182 1890403 1928621 1962290 1990980 2013777
61364 2013777 2029491 2037561 2038460 2033008 2021405 2003227 1978212 1946722 1909452 1867205 1821128 1772712
61352 1772712 1723167 1673005 1622500 1572293 1523181 1475626 1429958 1386853 1347007 1310352 1276200
61341 1276200 1244241 1214906 1188578 1165026 1143920 1125477 1110128 1097765 1087707 1079304 1072338 1066872
61329 1066872 1062972 1060606 1059775 1060785 1064254 1070531 1079080 1088812 1099175 1110526 1123216 1136758 1150317
61316 1150317 1163691 1177201 1190691 1203113 1213196 1220234 1224269 1225932 1226202 1225954 1225505 1224703 1223555 1222558
61302 1222558 1222299 1222853 1223698 1224113 1223542 1221622 1218042 1212598 1205519 1197620 1189790 1182192 1174200 1165314 1155881
61287 1155881 1146614 1137687 1128777 1119876 1111466 1103827 1096669 1089694 1083093 1077183 1071899 1067062 1062896 1059866
61273 1059866 1058108 1057341 1057272 1057653 1057905 1057041 1054212 1049266 1042822 1036001 1030016 1025658 1022986 1021605 1021375 1022724
61257 1022724 1026336 1032840 1042842 1056905 1075157 1097119 1122191 1150189 1181169 1214992 1251499 1290965
61245 1290965 1333847 1379842 1427526 1474903 1519816 1559694 1591550 1613018 1623437 1623692 1615242 1599665
61233 1599665 1578845 1554832 1529261 1503211 1477717 1453960 1432810 1414548 1399322 1387475 1379027
61222 1379027 1373046 1367943 1362325 1355230 1345551 1331664 1311886 1285395 1252837 1216290 1178533 1141983
61210 1141983 1108016 1077161 1049758 1026180 1006506 990311 976867 965267 954269 942522 929426
61199 929426 915684 902588 890799 880153 870548 862316 855388 848701 841165 833044 825639 819509 813662
61186 813662 806800 798759 790217 781395 771801 761193 750136 739456 729539 720366 711840 703874 696392
61173 696392 689516 683586 678859 675289 672722 671098 670359 670361 671078 672719 675494 679357 684048 689189 694090
61158 694090 697721 699182 698188 694900 689455 681940 672831 663151 654007 645971 638837 631866 624384 616401
61144 616401 608646 601792 595671 589441 582549 575300 568426 562366 557113 552540 548599 545264 542523 540432
61130 540432 538982 537930 536932 535922 535141 534695 534373 534109 534378 535725 538019 540641 543430 546887 551227 555763
61114 555763 559593 562422 564202 564432 562579 559005 554643 549749 543785 536703 529485 523026 517142 511236
61100 511236 505359 500017 495326 490983 486834 482905 479053 475102 471223 467704 464471 461308 458450 456492
61086 456492 455701 455823 456532 457696 459221 461006 463055 465347 467715 470166 473166 477174 482009 487145 492585
61071 492585 498792 505681 512276 517735 522398 527545 534245 542565 551710 560798 569588 578486 587854 597488
61057 597488 606950 616118 625096 633859 642384 650977 660014 669501 679307 689623 700753 712629 725141
61044 725141 738727 753965 770720 788495 807638 829367 854421 882345 912263 943657 976326
61033 976326 1010392 1046703 1086675 1131603 1182596 1241010 1307951 1383222 1465708 1554951 1651693
61022 1651693 1757433 1875281 2011481 2174388 2371666 2610542 2901267 3257679 3693581
61013 3693581 4222405 4863242 5644269 6597456 7753444 9141464 10773833 12595097 14427737
61004 14427737 15989844 17015691 17402913 17264756 16850132 16416341 16156677 16189002 16537744
60995 16537744 17086730 17570758 17671577 17176728 16080345 14553834 12831799 11112094 9520356
60986 9520356 8119221 6926351 5929790 5103612 4420753 3857706 3393936 3011933 2697868
60977 2697868 2440184 2227706 2050128 1899392 1769309 1654592 1551466 1458393 1374787 1299421
60967 1299421 1230965 1169259 1114720 1066959 1025122 988975 958257 931258 905360 878989 851987
60956 851987 824364 795944 767302 739802 714378 691019 669527 649867 631679 614341 597721
60945 597721 582140 567371 552450 536738 520636 505049 490749 478316 467989 459280 451285 443634
60933 443634 436737 431058 426692 423716 422272 422048 422235 422221 421903 421171 419688 417443 415001 412948 411479 410693
60917 410693 410735 411407 412113 412459 412504 412228 411338 409868 408417 407368 406312 404682 402587 400607 399060 397855
60901 397855 396757 395414 393367 390504 387332 384496 382156 380052 377894 375442 372483 369152 366085 363890
60887 363890 362516 361349 359794 357595 354822 351793 348829 345930 342944 340212 338600 338571 339626 341068 342903
60872 342903 345450 348438 351281 354118 357759 362340 366655 369158 369315 367818 365837 364321 363670 363723 364101
60857 364101 364690 365638 366801 367473 366967 365367 363520 362299 362034 362632 363963 365928 368225 370199 371112 370637
60841 370637 369019 366746 364100 361104 357854 354705 352006 349629 346908 343234 338747 334328 330806 328199
60827 328199 325824 323034 319700 316083 312518 309304 306610 304361 302353 300554 299096 297895 296504 294560
60813 294560 292283 290305 289057 288459 288132 287786 287384 287029 286755 286448 286057 285775 285790 285861 285465 284508 283634 283600 284491
60794 284491 285831 287293 288977 291010 293266 295591 298086 300966 304230 307545 310346 312008 312098 310736 308769
60779 308769 307386 307328 308405 309808 310862 311406 311569 311485 311385 311697 312757 314459 316391 318228 319821 321005
60763 321005 321637 321790 321719 321616 321606 321857 322396 322864 322872 322624 322806 323720 324884 325610 325654 325128 324126 322660 320724
60744 320724 318219 315057 311488 308042 304942 301856 298391 294582 290711 286999 283702 281160 279478 278440
60730 278440 277989 278389 279564 280719 281172 281320 282187 284142 286557 288628 290035 290837 291254 291664 292402 293359 294108
60713 294108 294464 294694 295081 295579 295894 295707 294785 293167 291245 289403 287563 285287 282316 278773 274913 271023
60697 271023 267597 265198 263957 263433 263055 262467 261423 259679 257300 254848 253027 252065 251599 251133 250567 250234
60681 250234 250494 251398 252828 254841 257586 260821 263840 266052 267501 268615 269697 270800 271905 272926 273708
60666 273708 274294 275066 276392 278311 280757 283802 287308 290656 293287 295452 297989 301475 305971 311392 317534
60651 317534 323725 329029 332978 335760 337677 338821 339371 339714 340083 340387 340495 340346 339676 338068 335559 332914
60635 332914 331054 330346 330468 330745 330565 329744 328573 327325 325763 323476 320694 318298 316834 315890 314659 312847
60619 312847 310833 309171 308100 307420 306710 305805 305038 304776 304773 304264 302763 300479 297956 295672 293981 293000 292396
60602 292396 291552 290119 288190 286047 284091 282916 282811 283136 282783 281493 280146 279499 279302 279050 279004 279768 281168
60585 281168 282298 282659 282741 283319 284506 285630 285956 285498 285042 285272 285985 286487 286656 287112 288305 289982 291757
60568 291757 293689 295907 298178 300276 302418 304926 307688 310353 312796 315069 317205 319441 322351 326346
60554 326346 331237 336628 342521 349229 357044 366376 377876 391916 408248 426683 447842 472703 501617
60541 501617 534347 570781 610676 652525 693313 729663 758869 778937 788365 786484 773815 751918
60529 751918 723017 689757 654889 620768 589001 560378 534957 512326 492171 474705 460421
60518 460421 449514 441759 436791 434241 433702 434974 438391 444592 453911 466248 481583 500356 523306
60505 523306 551085 583883 621053 660973 701400 739939 774113 801330 819394 827253 825112 814069
60493 814069 796008 773736 750472 728917 711020 698620 693747 697909 711403 733684 764275 803028
60481 803028 849597 902887 960901 1020788 1078865 1130757 1171863 1198147 1206891 1196994 1168833 1124176
60469 1124176 1066342 999999 930166 860979 795172 734325 679197 629883 586104 547660 514564
60458 514564 486679 463311 443265 425340 408851 393781 380415 368938 359409 351901 346265 341768
60446 341768 337488 333209 329503 326729 324458 322231 320334 319240 318732 318255 317863 318075 318891 319685 320075 320233
60430 320233 320277 320007 319412 318828 318366 317668 316567 315529 315145 315466 316093 316674 317107 317453 317925 318816 320279 322192
60412 322192 324229 326072 327685 329535 332249 335842 339593 343054 346787 351575 357294 363326 369754 377161
60398 377161 385281 392986 399871 406853 414699 422883 430465 437261 443456 448814 453193 457328 462120 467378
60384 467378 472111 475942 479432 483007 486410 489325 491880 494193 495969 496928 497379 498020 499221 500621 501434
60369 501434 501149 500031 498894 498343 498340 498518 498689 498819 498760 498297 497416 496267 494985 493710 492618 491697 490657
60352 490657 489374 488254 487741 487574 486925 485320 483003 480295 477064 473133 468879 464946 461426 457734 453452
60337 453452 448976 445079 441952 439034 435698 431766 427287 422329 417312 413091 410122 407676 404481 400106
60323 400106 395193 390402 385810 381525 378079 375708 373862 372004 370448 369745 369568 369040 368139 368042 369823 373352
60307 373352 377752 382512 387696 393269 398661 403091 406089 407517 407281 405252 401555 396660 390987 384600
60293 384600 377574 370588 364769 360914 359096 358961 359961 361257 362004 362051 361981 362181 362251 361630 360417 359138 358016
60276 358016 356977 356165 355899 356209 356876 357896 359531 361906 364927 368598 373064 378291 383972 389733 395203
60261 395203 399949 403672 406499 408869 411127 413502 416350 420005 424242 428225 431228 433303 435171 437585
60247 437585 440888 445061 449991 455598 461677 467848 473932 480436 488325 498135 509542 522013 535544
60234 535544 550444 566685 583967 602378 622512 644844 669319 695650 723803 754139 787250
60223 787250 823652 863409 906013 950706 996862 1043926 1091194 1137909 1183467 1227250 1268334
60212 1268334 1305662 1338509 1366642 1390114 1409051 1423462 1433041 1437409 1436878 1432708 1426189 1417633 1406774
60199 1406774 1393997 1380611 1367975 1356943 1348205 1342517 1340357 1341889 1347536 1358153 1374275 1395549
60187 1395549 1421229 1451009 1485109 1523757 1566777 1613448 1662538 1712622 1762495 1811089 1857007
60176 1857007 1898539 1934372 1963934 1986808 2002144 2008997 2007010 1996416 1977630 1951241 1918266 1879997
60164 1879997 1837632 1792381 1745855 1699981 1656374 1616012 1579490 1547239 1519440 1496110 1477511
60153 1477511 1464258 1456655 1454087 1455446 1460276 1469125 1482533 1499883 1519595 1540229 1560914 1580660
60141 1580660 1597907 1611190 1619957 1624326 1624285 1619717 1611050 1599303 1585342 1569606 1552740 1536073 1521165
60128 1521165 1509147 1500677 1496200 1496045 1500586 1510639 1527453 1551924 1583890 1622512 1667279 1718441
60116 1718441 1776647 1842495 1916310 1997941 2086603 2181142 2280450 2383448 2488748 2594636 2699440
60105 2699440 2801515 2898748 2988430 3067984 3135669 3190353 3230847 3255982 3265362 3259509 3239032
60094 3239032 3204018 3154705 3092569 3020289 2940598 2855530 2766818 2676496 2586727 2499225 2415161
60083 2415161 2335560 2261466 2193660 2132438 2077777 2029717 1988559 1954658 1927996 1908092 1894485
60072 1894485 1887173 1886184 1890714 1899191 1910474 1924487 1941269 1959720 1977859 1994160 2008128 2019625
60060 2019625 2028183 2033078 2033681 2029618 2020891 2007874 1990943 1970087 1945169 1916404 1884156 1848419
60048 1848419 1809140 1767135 1724071 1681328 1639454 1599038 1561449 1528181 1499827 1476243 1457512
60037 1457512 1444278 1437226 1436620 1442290 1453853 1471089 1494327 1524237 1560970 1603749 1651642 1704379
60025 1704379 1761819 1822692 1884436 1944325 2000266 2050515 2093316 2127325 2152046 2167453 2173287
60014 2173287 2169037 2154512 2130142 2096777 2055485 2007563 1954533 1898052 1839995 1782603 1728139
60003 1728139 1678100 1632900 1592543 1557399 1527948 1503957 1484616 1469779 1460521 1458001 1462135 1472053
59991 1472053 1487615 1509785 1539441 1576530 1620614 1671591 1729402 1793333 1862003 1933705 2006318
59980 2006318 2077141 2143362 2202794 2254009 2295979 2327982 2349721 2361130 2362085 2352646 2333501 2305653
59968 2305653 2269577 2225239 2173413 2116695 2058750 2002533 1949481 1900289 1855928 1817532 1785647
59957 1785647 1760172 1741204 1729496 1725761 1729710 1740241 1756547 1778694 1806976 1841014 1879731 1921961
59945 1921961 1966787 2013337 2060502 2106927 2151281 2192597 2230445 2264647 2294846 2320534 2341646
59934 2341646 2358852 2372990 2384325 2392588 2397709 2400322 2401734 2403726 2408364 2417537 2432375 2453233 2480376
59921 2480376 2514555 2556743 2607404 2666112 2731747 2802824 2877652 2954414 3031300 3106541 3178243
59910 3178243 3244260 3302294 3350120 3385793 3407774 3415068 3407317 3384862 3348854 3301351 3245011 3182282
59898 3182282 3114846 3044036 2971703 2900297 2831962 2767875 2708586 2654645 2606647 2564970 2529850
59887 2529850 2501529 2480033 2465087 2456573 2454909 2460490 2472925 2491236 2514719 2543095 2575902 2612335
59875 2612335 2651654 2693071 2734938 2774704 2810136 2840295 2865026 2883858 2895781 2899874 2895657 2882890
59863 2882890 2861420 2831384 2793477 2748973 2699411 2646172 2590334 2532940 2475110 2417600 2360510
59852 2360510 2303946 2248894 2196917 2149016 2105424 2066428 2032390 2002422 1973945 1944433 1913401
59841 1913401 1882125 1851897 1823286 1796842 1773494 1754002 1738491 1726803 1718882 1714656 1713749 1715528
59829 1715528 1719417 1725189 1732992 1742932 1754536 1766811 1778969 1790744 1801763 1811014 1817442 1820917 1822119
59816 1822119 1821562 1819144 1814623 1808176 1800384 1791938 1783391 1775017 1766930 1759370 1752646 1746620 1740624 1734216
59802 1734216 1727728 1721702 1716031 1710172 1703933 1697533 1690969 1683910 1676163 1667728 1658473 1648283 1637569
59789 1637569 1627110 1617336 1608297 1600430 1594800 1592347 1593331 1597733 1605873 1618439 1636153 1659567 1688944
59776 1688944 1724324 1766023 1815104 1873032 1940849 2018999 2107883 2207980 2319201 2440348 2569001
59765 2569001 2701060 2829857 2946063 3039137 3099585 3121173 3102695 3048562 2967232 2868284 2760478
59754 2760478 2651561 2548173 2454747 2372842 2302234 2242574 2193748 2155259 2126046 2104853 2090299
59743 2090299 2080870 2075511 2074219 2077557 2085683 2098320 2115541 2137893 2165624 2198365 2235820 2278373
59731 2278373 2326717 2381157 2441568 2507890 2580535 2660347 2748208 2844605 2949626 3063560 3187395
59720 3187395 3322369 3469021 3627014 3795996 3976122 4167236 4367610 4573828 4781907
59711 4781907 4988247 5189454 5381723 5560979 5723831 5868365 5994141 6101907 6193553 6271931
59701 6271931 6339976 6399633 6451831 6497546 6538567 6576972 6614027 6649779 6683546 6714603 6742519
59690 6742519 6767168 6788492 6806270 6820281 6830789 6838704 6845089 6850759 6856592 6864027 6874965 6891296
59678 6891296 6914789 6947161 6989773 7043244 7107811 7184043 7272806 7374397 7488134 7612875 7747460
59667 7747460 7890364 8039244 8191089 8342495 8489432 8627027 8750003 8853336 8932311 8982311
59657 8982311 8999204 8980170 8924154 8831773 8705239 8548278 8365698 8162842 7945687 7721221
59647 7721221 7496965 7279638 7074219 6884014 6710698 6553618 6409133 6270826 6130209
59638 6130209 5977520 5803500 5602447 5374645 5125919 4864887 4600469 4340844 4092786
59629 4092786 3860823 3647062 3452032 3275371 3115847 2971665 2841505 2724928 2621361
59620 2621361 2529167 2446360 2371888 2305437 2246105 2192098 2141950 2095449 2053012 2014574 1979433
59609 1979433 1946941 1917033 1890032 1866019 1844359 1823922 1803877 1784145 1764924 1746029 1727123
59598 1727123 1708412 1690501 1673429 1656452 1639077 1621888 1605854 1591050 1576457 1561044 1544758
59587 1544758 1528389 1512656 1497589 1482829 1468440 1455191 1443852 1434388 1426159 1418811 1412601 1407861
59575 1407861 1404673 1403186 1403763 1406392 1410270 1414457 1418844 1424234 1431551 1441182 1452985 1466658 1482139
59562 1482139 1499784 1520046 1542867 1567630 1593849 1621566 1650812 1681157 1712372 1745241 1780891
59551 1780891 1819414 1859959 1902406 1948025 1997984 2052010 2109371 2170430 2235644 2302627 2365436
59540 2365436 2417918 2457836 2487540 2511075 2531214 2548789 2563643 2575440 2583813 2588287 2588333 2583564
59528 2583564 2573967 2559896 2541747 2519737 2494157 2465598 2434578 2401091 2365113 2327571 2290169
59517 2290169 2254020 2219040 2185146 2153483 2125873 2103421 2086344 2074901 2069676 2071005 2078884 2093633
59505 2093633 2116042 2146612 2185129 2231213 2284828 2346028 2414520 2489617 2570158 2654232 2739324
59494 2739324 2822972 2902935 2976593 3040760 3092550 3130177 3152628 3158992 3148666 3122082 3080817
59483 3080817 3027063 2963278 2892114 2816174 2737785 2659217 2582996 2511668 2447224 2390845 2342941
59472 2342941 2303176 2270713 2244918 2225827 2213558 2207353 2205591 2206771 2210128 2215266 2221559 2227990 2233283
59459 2233283 2236121 2235577 2231387 2223482 2211152 2193132 2168796 2138957 2105088 2067898 2027021 1981975
59447 1981975 1933045 1881184 1827445 1772774 1718175 1664702 1613104 1563526 1515615 1468987 1423677
59436 1423677 1380227 1339388 1301635 1266898 1234747 1204894 1177496 1152948 1131427 1112792 1096993
59425 1096993 1084367 1075291 1069560 1066471 1065891 1069101 1077926 1092363 1108966 1122064 1127159 1123526 1113928
59412 1113928 1102341 1092044 1085087 1082600 1085185 1093287 1107155 1125893 1146314 1163228 1171723 1169681
59400 1169681 1158430 1141357 1122119 1103723 1088347 1077234 1070595 1067843 1068298 1071779 1078512 1088527
59388 1088527 1101380 1116597 1134193 1154471 1177418 1202595 1229670 1258803 1290442 1324893 1362134
59377 1362134 1401905 1443962 1488341 1535271 1584647 1635798 1688060 1741508 1796771 1854288 1914300
59366 1914300 1977545 2045353 2118844 2198604 2285444 2380936 2486738 2603695 2731940 2871370
59356 2871370 3021554 3181429 3349649 3524969 3705727 3889134 4071649 4250067 4421752
59347 4421752 4583957 4733656 4868342 4986578 5087587 5170714 5235542 5282136 5310737 5321336
59337 5321336 5313789 5288223 5245041 5184518 5106563 5010959 4897839 4768036 4623169 4465529 4297807
59326 4297807 4122857 3943570 3762915 3584011 3409955 3243327 3085701 2937648 2799177
59317 2799177 2670217 2550871 2441529 2342771 2254939 2177732 2110321 2051647 2000135 1953069 1906996
59306 1906996 1859465 1810432 1761772 1715561 1673026 1634708 1600910 1571757 1547142 1526818 1510489
59295 1510489 1497784 1488267 1481383 1476373 1472410 1469093 1466679 1465633 1466029 1467602 1470251 1474102 1479085 1484828
59281 1484828 1491128 1498357 1507214 1518058 1530506 1543734 1557234 1571285 1586506 1602860 1619320 1634640
59269 1634640 1648257 1660230 1670452 1678225 1682444 1681971 1675942 1664085 1646888 1625348 1600504 1573178
59257 1573178 1543873 1512686 1479500 1444527 1408577 1372629 1337266 1302751 1269403 1237555 1207285
59246 1207285 1178596 1151839 1127556 1105844 1086169 1067876 1050670 1034608 1019920 1006963 996148
59235 996148 987759 981827 978077 975969 974963 974947 976251 979129 983450 989066 996179 1005006 1015353 1027045
59221 1027045 1040527 1056459 1074711 1094352 1114852 1136869 1161688 1190251 1222943 1259891 1301121
59210 1301121 1346613 1396596 1451757 1513030 1581124 1656345 1738742 1828310 1925065 2028964 2139637
59199 2139637 2256040 2376257 2497622 2617182 2732182 2840024 2937715 3021622 3088161 3134774
59189 3134774 3159949 3162593 3142185 3099779 3038089 2960086 2868060 2764483 2653097 2538268 2423484
59178 2423484 2311032 2202653 2099639 2002482 1911390 1827183 1750926 1682696 1621527 1566697 1518296
59167 1518296 1476347 1440115 1408640 1381398 1358110 1338350 1321605 1307348 1294929 1283874 1274372
59156 1274372 1266938 1261365 1256551 1251471 1245804 1239463 1232178 1223901 1215013 1205770 1196001 1185687 1175320
59143 1175320 1165335 1155711 1146580 1138693 1132684 1128179 1124194 1120301 1116974 1114952 1114512 1115251 1116397 1117511
59129 1117511 1118991 1121605 1125420 1129596 1133345 1136670 1139969 1143447 1147105 1150746 1153626 1154754 1154014 1152523
59115 1152523 1151348 1150352 1148799 1146550 1143972 1140992 1137052 1131853 1125641 1118948 1112522 1107238 1103408 1100314
59101 1100314 1096964 1093223 1089734 1087008 1085198 1084515 1085101 1086555 1088321 1090631 1094392 1100011 1106895 1114321
59087 1114321 1122248 1131049 1140924 1151842 1163703 1176326 1189485 1203118 1217219 1231398 1244824 1256795
59075 1256795 1267200 1276330 1284360 1291006 1295550 1297197 1295626 1291221 1284696 1276571 1267062 1256125 1243347
59062 1243347 1228151 1210619 1191900 1173290 1155014 1136449 1117418 1098566 1080435 1062827 1045299
59051 1045299 1027657 1009694 991089 972041 953590 936747 921482 906929 892397 877841 863552
59040 863552 849815 836896 825011 814192 804351 795494 787808 781538 776777 773290 770516 767922 765368
59027 765368 763006 760758 758180 754999 751567 748551 746285 744576 743017 741271 739193 736940 734965 733658
59013 733658 732911 732182 731090 729826 728911 728644 728871 729264 729684 730250 731178 732688 734973 738124 741945 746003
58997 746003 749990 754033 758601 764152 770949 779171 788975 800361 813134 827222 843048 861349 882367
58984 882367 905240 928463 951117 973512 996478 1020178 1043831 1066437 1087335 1106008 1121686
58973 1121686 1133456 1140711 1143451 1142351 1138581 1133334 1127278 1120468 1112701 1103741 1093247 1080957 1067264
58960 1067264 1053366 1040594 1029648 1020581 1013159 1006935 1001211 995391 989487 984129 980064 977652 976675
58947 976675 976579 977110 978819 982592 988540 995693 1003114 1010943 1019963 1030446 1041966 1054120 1066860 1080163
58933 1080163 1094004 1108714 1124847 1142499 1161180 1180560 1201008 1223232 1247686 1274559 1304149
58922 1304149 1336947 1373396 1413648 1457475 1504390 1553844 1605176 1657177 1707908 1755323 1798232
58911 1798232 1836608 1871148 1902970 1933616 1964800 1997814 2033290 2071579 2113098 2158219 2207108
58900 2207108 2259915 2316900 2378234 2443851 2513592 2587336 2664931 2746235 2831370 2920685 3014221
58889 3014221 3111312 3210831 3311638 3412516 3511807 3607397 3697098 3778936 3851223 3912780 3963330
58878 3963330 4003549 4034480 4056866 4071099 4077633 4077006 4069268 4053694 4029475 3996671 3956151 3908587
58866 3908587 3853969 3792259 3724164 3650953 3573751 3493334 3410370 3325515 3239348 3152476 3065626
58855 3065626 2979335 2893768 2809136 2726160 2645703 2568055 2493049 2420853 2352128 2287274 2225972
58844 2225972 2167750 2112754 2061647 2014957 1972641 1934178 1898920 1866499 1837018 1810719 1787481
58833 1787481 1766821 1748419 1732353 1718646 1706950 1696953 1688892 1683276 1680163 1679072 1679715 1682482 1687950
58820 1687950 1696105 1706313 1718017 1731110 1745593 1761250 1777950 1796004 1815789 1837125 1859417
58809 1859417 1882449 1906601 1932261 1959539 1988770 2020805 2056440 2095847 2138918 2185854 2237050
58798 2237050 2292659 2352665 2417127 2485929 2558576 2634682 2714363 2797598 2883444 2970595 3058676
58787 3058676 3148199 3239060 3329672 3417855 3502123 3581814 3656384 3724894 3785957 3837866 3878973
58776 3878973 3908126 3924632 3927791 3916825 3891492 3852580 3801617 3740198 3669678 3591305 3506429
58765 3506429 3416604 3323406 3228035 3131199 3033524 2935906 2839173 2743657 2649644 2558123 2470410
58754 2470410 2386912 2306911 2229819 2156092 2086489 2020968 1958852 1899778 1843912 1791383 1742009
58743 1742009 1695612 1652178 1611651 1573821 1538490 1505508 1474571 1445180 1416966 1390014 1364794
58732 1364794 1341758 1320992 1302294 1285613 1271316 1259910 1251539 1245961 1242987 1242714 1245227 1250251 1257141
58719 1257141 1264933 1272110 1276488 1275681 1267946 1252675 1230205 1201353 1167233 1129463 1090213 1051634
58707 1051634 1015000 980463 947730 916830 888146 861992 838469 817659 799691 784608 772322
58696 772322 762671 755429 750435 747922 748475 752370 759009 767207 775734 783245 788038 788577 784364 775811 763293
58681 763293 746953 727640 707414 688553 672130 657837 645054 633782 624575 617804 613194 610177
58669 610177 608544 608435 609578 610950 611593 611478 611077 610273 608224 604269 598433 591017 582262 572607 562797
58654 562797 553517 545154 537989 532227 527713 524026 521042 519106 518497 519038 520374 522383 525218 529163 534429
58639 534429 540823 547634 554208 560583 567099 573416 578483 581600 583006 583303 582850 581959 581106 580553 580150 579821
58623 579821 579920 580793 582382 584581 587642 591827 596889 602303 607928 614148 621416 629794 638924 648375 658070
58608 658070 668349 679509 691460 704003 717215 731149 745459 759907 775110 792075 811038
58597 811038 831445 853079 876284 900934 926114 951310 977044 1003770 1030819 1057152 1082551
58586 1082551 1107224 1130628 1151549 1169287 1184070 1196264 1205645 1211546 1213402 1211152 1205288 1196502
58574 1196502 1185213 1171581 1156063 1139584 1122961 1106435 1089880 1073151 1056059 1038448 1020641
58563 1020641 1003485 987623 972950 958946 945230 931559 917661 903404 888892 874181 859144
58552 859144 843723 828029 812178 796430 781471 767944 755566 743305 730581 717676 704858
58541 704858 692003 679451 668278 659033 650876 642632 634154 626028 618612 612118 607127 604035 602217
58528 602217 600500 598404 596384 595089 594849 595655 597057 598222 598437 597340 594558 589730 583296 576549 570337
58513 570337 564326 558185 552702 548860 546439 544579 543272 543182 544252 545659 547100 549105 551965 555289 558739
58498 558739 562486 566696 571199 575763 580235 584444 588438 592673 597324 601535 604043 604555 603935 603045 602014
58483 602014 600575 598506 595677 592144 588234 584137 579662 574812 570282 566720 563770 560613 557247 554422
58469 554422 552397 550603 548558 546316 543975 541441 538836 536474 534389 532518 531338 531563 533095 534950
58455 534950 536358 537321 538030 538427 538565 538771 539187 539610 539942 540366 541012 541960 543647 546677 550999 555665 559550
58438 559550 562096 563516 564730 566959 570766 575478 579994 584038 588132 592568 597155 601835 606666 611153
58424 611153 614455 616553 618532 621425 625260 629355 633007 635792 637842 640010 643221 647483 652012 656409
58410 656409 661084 666397 672016 677466 682787 688305 694114 700019 705771 711251 716617 722227 728099 733630
58396 733630 738225 741996 745390 748384 750795 753195 756693 761676 767399 772929 777931 782490 786827 791375
58382 791375 796602 802549 808921 815633 822819 830322 837712 844848 851994 859328 866746 874078 881160 887874
58368 887874 894478 901569 909287 916940 924040 931242 939509 948712 957961 967010 976370 986182 995959 1005378
58354 1005378 1014516 1023359 1031947 1040887 1050942 1062195 1074344 1087515 1101910 1116917 1131593 1145840
58342 1145840 1160134 1174362 1187954 1200958 1213863 1226651 1239115 1251805 1265337 1279129 1292284
58331 1292284 1305474 1320289 1336686 1352848 1367822 1382702 1398842 1416418 1435178 1455087 1475684
58320 1475684 1496147 1516527 1537751 1560056 1582731 1605688 1629811 1655287 1681096 1706791 1733328
58309 1733328 1761484 1790699 1820141 1849672 1879177 1908202 1936855 1965893 1995391 2024581 2053443
58298 2053443 2083066 2113927 2145248 2176697 2209211 2243407 2278632 2314389 2351382 2390323 2430972
58287 2430972 2473047 2516810 2562089 2608042 2654578 2702690 2752843 2804571 2858233 2915397 2976591
58276 2976591 3040335 3105342 3172099 3241352 3312747 3386082 3462284 3541953 3624384 3709019 3796382
58265 3796382 3886603 3978681 4072365 4169079 4269776 4373518 4479415 4588411 4701880 4819958
58255 4819958 4942496 5070133 5203261 5341487 5485162 5635883 5794557 5960778 6134928
58246 6134928 6318755 6512804 6715600 6926627 7147742 7380425 7624265 7879668 8149298
58237 8149298 8435036 8736239 9052950 9388018 9743963 10120584 10518045 10939565 11388647
58228 11388647 11866485 12374612 12917248 13498468 14120124 14785409 15501413 16275344 17111525
58219 17111525 18015109 18995026 20059831 21214284 22463602 23817396 25286427 26881079
58211 26881079 28618373 30526474 32637941 34984088 37601677 40539923 43855917 47611062
58203 47611062 51880610 56761064 62362080 68802144 76224280 84807163 94749540 106255171
58195 106255171 119534027 134754196 151889779 170572175 190142866 209923155 229443477
58188 229443477 248378675 266242910 282142848 294811947 302900980 305356266 301726975
58181 301726975 292296209 277991871 260129063 240114815 219227139 198494916 178654470
58174 178654470 160164078 143260334 128024429 114431702 102386911 91757466 82400504
58167 82400504 74174837 66944109 60581963 54976996 50031333 45657591 41780452 38338068
58159 38338068 35277443 32549399 30109902 27923087 25959085 24190188 22591635 21143928
58151 21143928 19830956 18636489 17544446 16541123 15615162 14756818 13959187 13218608 12531826
58142 12531826 11893879 11300048 10747885 10235297 9758237 9312234 8894773 8504257 8138037
58133 8138037 7793434 7469452 7165583 6879893 6609983 6354809 6113974 5886260 5670396
58124 5670396 5466184 5273325 5090173 4915166 4748432 4590458 4440246 4296411 4159088
58115 4159088 4028987 3905329 3786505 3672246 3563540 3460687 3362799 3268947 3178603 3091315
58105 3091315 3006986 2926209 2849473 2776425 2706590 2640104 2576962 2516339 2457585 2401191 2347834
58094 2347834 2297163 2248440 2201655 2157058 2114239 2072588 2032065 1992715 1954148 1916259 1879635
58083 1879635 1844327 1809147 1773179 1737153 1702237 1668277 1634409 1600692 1567861 1536019 1504759
58072 1504759 1474150 1444542 1415870 1388149 1362115 1338253 1315732 1293391 1271296 1250221 1230162
58061 1230162 1210558 1191509 1173403 1155686 1137334 1118455 1100142 1082773 1065572 1047924 1030064
58050 1030064 1012392 995101 978613 963424 949322 935525 921760 908549 896325 884923 874051
58039 874051 863639 853583 843624 833647 823827 814476 805952 798442 791533 784314 776329 768022 759881 751645
58025 751645 742951 734209 726060 718342 710426 702325 694642 687596 680915 674622 669146 664671 660990 658039
58011 658039 655910 654376 652970 651592 650537 649933 649625 649609 650053 650917 651892 652838 654042 656027 659203 663456
57995 663456 667960 671759 674771 677854 681698 686230 691411 697861 706096 715687 725864 736500 747899
57982 747899 760081 773004 787082 802712 819529 836724 853778 870295 885530 898811 910004
57971 910004 918850 924201 924717 920072 910771 897215 879771 859459 837556 814662 790888 766784 743275
57958 743275 720835 699515 679600 661474 645041 630031 616667 605285 595686 587733 582165 579635
57946 579635 579147 578634 577089 575021 572950 570720 568355 566217 563934 560366 555130 549101 542966 536354 529029
57931 529029 521982 516488 512655 509584 506525 503380 500480 498400 497685 498495 500727 504494 509927 516490 523222
57916 523222 529825 536790 544189 551058 556256 559268 559898 558004 553890 548226 541054 531590 519589 506291
57902 506291 493415 481644 470604 459814 449092 438442 428108 418502 409637 400924 391806 382310
57890 382310 372680 362983 353394 344442 336545 329676 323698 318550 313839 308915 303813 299537 296910 295691
57876 295691 295264 295554 296646 298200 300032 302743 306848 311674 316034 319743 323558 327777 331889 335558 338980
57861 338980 342030 343876 343868 342271 339787 336770 333194 329080 324610 319895 314814 309121 302860 296726 291686
57846 291686 288011 285020 282156 279918 279219 280139 282009 284439 287477 290809 293743 296147 298663 301703 304989
57831 304989 308412 312523 317529 322369 325645 327281 328560 330513 332771 334047 333196 329721 323813 316399
57817 316399 308956 302758 298120 294496 291347 288735 286971 286022 285693 286325 288777 293378 299301 305426 311699
57802 311699 319136 328593 339991 352825 366776 381459 395905 408815 419350 427413 433210 436780
57790 436780 438019 437000 434074 429613 423699 416204 407246 397413 387309 376959 365912 353913 341200
57777 341200 328181 315204 302721 291210 280665 270586 260807 251935 244521 238120 231850 225709 220565
57764 220565 216811 213825 211005 208577 206874 205463 203743 202012 201122 201204 201504 201543 201691 202408 203552 204833
57748 204833 206400 208510 210956 213318 215588 218109 220994 223900 226377 228222 229573 230893 232692 235068
57734 235068 237587 239808 241767 243788 246075 248711 251801 255199 258329 260763 262888 265494 268716 271810
57720 271810 273980 274965 274817 273705 272129 270813 270072 269642 269348 269507 270310 271259 271707 271744 272030 272893 274057
57703 274057 275235 276538 278180 280138 282273 284562 287066 289880 293267 297671 303406 310342 318074 326357
57689 326357 335273 344927 355195 365922 377290 389711 403356 418070 433954 451839 472939 498119
57677 498119 527725 562078 601891 648274 702535 765986 839777 924905 1022081 1130313 1244080
57666 1244080 1351687 1437960 1490650 1505796 1488178 1447711 1395296 1340155 1288529 1243430 1205401
57655 1205401 1173676 1146883 1123358 1101592 1080640 1059905 1038644 1016039 991691 965763 938688
57644 938688 911062 883724 857468 832523 808606 785572 763706 743308 724351 706706 690393
57633 690393 675431 661677 649082 637887 628347 620337 613463 607465 602346 598185 595017 592853 591669
57620 591669 591444 592349 594816 599174 605206 612280 620026 628721 638855 650479 663186 676670 691058
57607 691058 706641 723510 741595 760862 781277 802612 824438 846154 866893 885622 901688
57596 901688 915215 926595 935621 941494 943697 942315 937356 928434 915589 899868 882392 863086 841042
57583 841042 816036 789012 761091 732867 704910 678172 653308 629974 607322 585053 563549
57572 563549 543218 524133 506281 489683 474151 459182 444310 429557 415582 403394 393678 386127
57560 386127 379532 372837 366071 360066 355325 351519 348104 344987 342347 340128 338070 336125 334520 333361
57546 333361 332469 331697 331251 331495 332525 333980 335298 336103 336503 337092 338584 341239 344586 347855 350779 353855
57530 353855 357788 362832 368816 375637 383408 392078 401188 410211 419058 428171 438194 449566 462345
57517 462345 476310 491289 507361 524646 542889 561536 580341 599631 619702 640115 659898
57506 659898 678336 695230 710461 723809 735348 745546 754613 761923 766423 767533 765403 760435 752880
57493 752880 742922 730856 717042 701839 685618 668755 651535 634146 616760 599570 582795 566719
57481 566719 551646 537677 524582 512145 500572 490368 481787 474676 468863 464396 461236 458983 457166
57468 457166 455700 454855 454897 455927 457970 460958 464618 468661 473157 478633 485674 494505 504925 516554
57454 516554 529072 542294 556209 570988 586900 603980 621747 639403 656483 673189 689809
57443 689809 705924 720479 732727 742764 751030 757536 761714 762749 759936 753070 742828 730456 716732
57430 716732 701407 683973 664724 644660 624595 604863 585723 567412 549732 532198 514772
57419 514772 497983 482189 467268 453242 440615 429614 419537 409436 399191 389369 380210 371405
57407 371405 362944 355528 349775 345345 341262 337023 333049 329997 327945 326463 325308 324604 324241 323492 321670
57392 321670 319003 316439 314538 313049 311658 310657 310531 311230 312272 313368 314577 315913 317196 318299 319266
57377 319266 320215 321301 322722 324523 326458 328264 330038 332094 334519 337110 339659 341988 343792 344846
57363 344846 345497 346560 348562 351279 354160 356923 359560 362013 364126 365833 367245 368679 370695 373869
57349 373869 378226 382987 387107 390123 392391 394651 397506 401165 405376 409641 413696 417806 422381 427351
57335 427351 432231 436786 441266 445895 450553 455247 460468 466593 473128 479134 484379 489544 495176 501104
57321 501104 507178 513948 521983 530845 539438 547291 554834 562421 569861 577134 584861 593532 602737 611709
57307 611709 620322 628942 637562 645807 653827 662506 672515 683605 695086 706628 718291 730117 742076
57294 742076 754282 766929 780086 793806 808265 823454 838854 853731 867853 881601 895344
57283 895344 908982 922191 934863 947069 958842 970197 981230 991921 1001910 1010748 1018348 1024978
57271 1024978 1030787 1035681 1039860 1044194 1049693 1056509 1063670 1069988 1075230 1080344 1086522 1094175 1102862 1112069
57257 1112069 1121668 1131555 1141258 1150402 1159367 1168945 1179289 1189741 1199917 1210400 1221941 1234393
57245 1234393 1246969 1259255 1271363 1283253 1294651 1305722 1317163 1329403 1342243 1355519 1369540
57234 1369540 1384441 1399497 1413719 1426952 1440001 1453688 1468150 1483020 1497928 1512720 1527321
57223 1527321 1541476 1554769 1567084 1579101 1591925 1605997 1620632 1634928 1648813 1662826 1677133
57212 1677133 1691299 1704954 1718147 1730994 1743533 1756041 1769065 1782878 1797230 1811777 1826429
57201 1826429 1841037 1855148 1868518 1881624 1895286 1909788 1924723 1939633 1954402 1968968 1983076
57190 1983076 1996619 2009981 2023664 2037640 2051371 2064515 2077291 2090006 2102552 2114710 2126753
57179 2126753 2139255 2152289 2165347 2178303 2191949 2207070 2223225 2239026 2253667 2267616 2281669
57168 2281669 2295824 2309518 2322688 2336036 2350229 2365159 2380146 2394638 2408546 2422089 2435562
57157 2435562 2449216 2463113 2477043 2490748 2504356 2518384 2533130 2548191 2562848 2576928 2591043
57146 2591043 2605981 2622039 2638993 2656410 2673897 2691238 2708478 2725746 2742987 2760051 2777030
57135 2777030 2794227 2811680 2829134 2846663 2864937 2884585 2905664 2928158 2952620 2979730 3009332
57124 3009332 3040485 3072441 3105152 3138896 3174055 3211389 3251960 3296453 3344908 3397364 3454550
57113 3454550 3517760 3588347 3667530 3756493 3856410 3968453 4093948 4234551 4392421 4570470
57103 4570470 4772426 5002391 5264403 5562742 5902576 6289840 6730344 7229342 7791939
57094 7791939 8423146 9126980 9905477 10758234 11681853 12668978 13708058 14784374 15880893
57085 15880893 16977616 18050581 19072491 20014660 20848510 21546290 22082398 22435748 22591984
57076 22591984 22544641 22295521 21854434 21237962 20467525 19567823 18565960 17490405 16369382
57067 16369382 15229358 14094128 12984105 11915600 10900763 9948339 9064295 8251716
57059 8251716 7510762 6839433 6234469 5691532 5205239 4770004 4381098 4034565 3726180
57050 3726180 3451070 3204548 2982929 2783494 2604217 2443770 2301236 2175293 2064044
57041 2064044 1966073 1881355 1810775 1755344 1716336 1694765 1688092 1686646 1675307 1641316 1581508 1502263
57029 1502263 1413525 1323525 1237644 1159170 1089452 1028024 973659 925370 882321 843473 807907
57018 807907 775168 744925 716715 690425 666575 645613 627192 610553 595228 580823 566536
57007 566536 551678 536557 522110 508656 495752 483344 472235 463046 455325 448252 441760 436351
56995 436351 432039 428219 424650 422018 421173 422057 423755 425489 427228 429263 431527 433651 435470 437049 438130
56980 438130 437968 435968 432220 427150 420885 413409 405245 397468 390871 385376 380445 375812 371631 368103
56966 368103 365317 363488 363077 364408 367236 370891 374936 379520 384872 390552 395517 398930 400597 400574 398771
56951 398771 395194 390238 384351 377641 370226 362799 356340 351229 347058 343322 339958 337210 335387 334929
56937 334929 336308 339617 344475 350508 357652 365759 374095 381498 386972 389980 390309 387880 382763 375276
56923 375276 366021 355716 344896 333832 322843 312506 303258 294889 286857 279172 272491 267139 262491
56910 262491 257716 252869 248744 245769 243548 241596 240096 239559 239898 240205 239622 238216 236794 235931 235570 235709
56894 235709 236979 240011 244411 249023 253319 257945 263636 270079 276256 281500 285728 288883 290723 291152
56880 291152 290320 288368 285458 282089 278972 276421 274145 271813 269668 268417 268673 270590 274006 278812 285196
56865 285196 293494 303751 315521 328193 341433 355112 368790 381456 391787 398631 401363 400092
56853 400092 395608 389014 381313 373342 365841 359334 353991 349931 347590 347496 349653 353651 359533 368187 380503
56838 380503 396395 414970 435427 457344 480102 502478 522898 539844 551950 558100 557742 551038
56826 551038 538664 521705 501867 481349 461970 444399 428519 414518 403205 395186 390249 387838
56814 387838 387833 390487 395855 403742 414083 426787 441123 455604 468591 478687 484625 485414 480974 472190
56800 472190 459986 444640 426422 406521 386733 368291 351443 336084 322290 310173 299763
56789 299763 291254 285045 281385 280194 281329 284735 290204 297228 305163 313232 320290 324937 326182 323842
56775 323842 318254 309913 299563 288229 276728 265279 253879 242900 232979 224391 216825 209771 202979
56762 202979 196564 190843 186003 181820 177835 173970 170789 168849 167887 166944 165217 162623 159568 156506 153729
56747 153729 151350 149356 147748 146555 145640 144698 143635 142739 142139 141327 139700 137565 136031 135768 136288 136620
56731 136620 136289 135398 134221 133138 132714 133322 134692 136173 137474 138892 140788 143021 145010 146241 146666
56716 146666 146623 146391 145871 144803 143244 141649 140465 139824 139705 140128 141039 142170 143209 144019 144602 145038 145559
56699 145559 146473 147798 149107 149924 150139 149939 149570 149405 149921 151232 152824 154195 155638 157948 161401 165513
56683 165513 169819 174358 179170 183858 187979 191554 194801 197590 199576 200754 201542 202299 203074 203854 204801
56668 204801 206009 207205 207945 208146 208315 209054 210393 211785 212781 213510 214347 215333 216182 216687 216828 216607 216130
56651 216130 215714 215445 214703 212711 209759 207270 206278 206230 205727 204121 201922 199886 198228 196691 194965 193025
56635 193025 191291 190311 190038 189644 188470 186904 185833 185317 184501 182873 180995 179749 179371 179519 179857 180267
56619 180267 180779 181607 182926 184366 185063 184583 183550 183023 183386 184156 184683 184611 183862 182602 181260 180226 179478
56602 179478 178739 177940 177218 176472 175296 173517 171559 170143 169719 170221 171268 172531 173975 175712 177647 179432
56586 179432 180936 182502 184479 186669 188564 190027 191333 192584 193539 194056 194345 194676 195222 196194 197699 199375
56570 199375 200637 201499 202639 204409 206312 207809 209122 210685 212258 213308 214049 215351 217573 220080 222046
56555 222046 223255 223997 224617 225353 226260 227145 227765 228167 228587 229064 229419 229553 229395 228671 227225 225482 223973
56538 223973 222365 219634 215419 210498 205632 200691 195417 190350 186241 183000 180026 177275 175179 173651
56524 173651 172022 170042 168201 166875 165752 164378 162799 161408 160492 160098 160042 159906 159355 158531 157850 157443
56508 157443 157168 157166 157839 159093 160138 160322 159787 159059 158426 158057 158295 159351 160886 162294 163269 163838 164038 163867
56490 163867 163419 162798 162037 161277 160816 160730 160699 160439 160086 159854 159610 159160 158700 158533 158451 157912 156790 155622 155155
56471 155155 155879 157837 160492 162976 164895 166807 169449 172645 175514 177642 179419 181168 182686 183867
56457 183867 185085 186552 187744 187995 187339 186397 185676 185325 185298 185346 185094 184509 184159 184639 185860 187229 188369
56440 188369 189268 189843 189810 189056 187781 186221 184479 182686 181028 179524 178081 176830 176125 176045 176151 175988 175703
56423 175703 175899 176855 178045 178610 178254 177635 177734 178815 180125 180672 180240 179434 178892 178701 178605 178478 178397 178414 178456
56404 178456 178457 178472 178708 179447 180826 182621 184350 185672 186590 187193 187383 187109 186714 186714 187256 188098 189225 191023
56386 191023 193574 196141 197872 198939 200444 203088 206374 209326 211609 213627 215772 218041 220278 222394
56372 222394 224224 225461 225896 225591 224772 223689 222563 221504 220415 219200 218065 217441 217510 218013 218645 219424
56356 219424 220466 221634 222657 223581 224779 226452 228350 230122 231783 233662 235911 238283 240455 242431
56342 242431 244444 246539 248382 249546 249915 249809 249838 250615 252379 254763 257095 259039 260821 262726 264593
56327 264593 266036 266991 267777 268722 270016 271815 274188 276976 280023 283495 287603 292032 296058 299387 302474
56312 302474 305796 309143 311950 314170 316509 319839 324528 330240 336261 342080 347680 353215 358474 362964
56298 362964 366531 369609 372856 376767 381635 387444 393662 399596 405099 410575 416161 421459 426294 431076
56284 431076 436030 440754 445209 450517 457798 466539 475127 482978 491200 501055 512641 525385 539101
56271 539101 554106 570870 589948 611814 636427 663406 692964 726224 764216 806989 854189
56260 854189 906128 963654 1027171 1096423 1171251 1251943 1338547 1430147 1525121 1622020 1719953
56249 1719953 1817966 1914070 2005070 2087595 2159295 2218924 2265453 2297607 2314471 2316204 2303910
56238 2303910 2278984 2242809 2196821 2142509 2081369 2014946 1944793 1872224 1798227 1723735 1649735
56227 1649735 1576930 1505449 1435141 1366063 1298633 1233559 1171716 1113773 1059680 1008816 960892
56216 960892 916356 875595 838159 803351 771359 743161 719299 699225 681870 666348 652075
56205 652075 638813 626851 616709 608340 600920 593709 586908 581420 577929 576350 576000 576017 575779 575198 574688
56190 574688 574698 575238 575883 576280 576641 577665 579874 583004 586240 589120 592005 595470 599479 603509 607291 611033
56174 611033 615007 619371 624427 630578 637950 646381 655830 666329 677507 688768 700171 712611 726726
56161 726726 742163 758345 775514 794409 815278 837984 863004 891631 925155 964489 1010772
56150 1010772 1065706 1130856 1206871 1293565 1390162 1494772 1603561 1710986 1811254 1899852
56140 1899852 1974301 2034400 2082384 2122586 2159823 2196913 2233097 2264690 2287428 2298559 2297675 2286591
56128 2286591 2268773 2248091 2227028 2205409 2180483 2147984 2103432 2043672 1968501 1881191 1787175
56117 1787175 1692029 1600492 1516446 1442551 1379561 1326604 1282522 1246594 1217971 1195226 1177048
56106 1177048 1162975 1152952 1146479 1142750 1141412 1142565 1146070 1151343 1157876 1165486 1173922 1182710 1191646
56093 1191646 1201091 1211521 1222913 1234831 1246971 1259394 1272332 1285997 1300616 1316382 1333251
56082 1333251 1350869 1368818 1386972 1405533 1424704 1444454 1464655 1485306 1506359 1527318 1547393
56071 1547393 1566264 1584523 1603038 1621979 1640847 1659509 1678797 1699807 1722795 1747032 1771694
56060 1771694 1796631 1822226 1848827 1876586 1905744 1936695 1969534 2003646 2038040 2072196 2106474
56049 2106474 2141648 2178226 2216309 2255860 2296831 2339078 2382509 2427384 2474244 2523374 2574474
56038 2574474 2627007 2680859 2736572 2794935 2856326 2920414 2986460 3054004 3123250 3194743 3268795
56027 3268795 3345372 3424430 3506058 3590297 3677122 3766768 3859772 3956490 4056812 4160593 4268167
56016 4268167 4380123 4496670 4617577 4742766 4872716 5008216 5149956 5298386 5453782
56007 5453782 5616389 5786622 5965114 6152364 6348397 6553063 6766744 6990488 7225378
55998 7225378 7472081 7731197 8003701 8290714 8593086 8911590 9247465 9602453 9978364
55989 9978364 10376918 10800017 11249884 11728895 12239537 12784571 13367087 13990497 14658854
55980 14658854 15377253 16151559 16987643 17891367 18869584 19930905 21085230 22343085 23716185
55971 23716185 25218848 26868620 28685742 30692787 32915497 35384399 38136275 41215306
55963 41215306 44674130 48575021 52991172 58008098 63724969 70255571 77728460 86285387
55955 86285387 96076768 107253537 119955223 134292509 150319428 167989799 187095707
55948 187095707 207191872 227520179 246968385 264117062 277420330 285507612 287510918
55941 287510918 283280532 273396183 258983746 241433339 222130902 202272452 182775365
55934 182775365 164267186 147122202 131518593 117496712 105008237 93953292 84206255
55927 84206255 75632439 68098358 61478024 55656435 50530774 46010087 42014561 38474855
55919 38474855 35331264 32532512 30034377 27798444 25791246 23983849 22351708 20874195
55911 20874195 19533587 18314031 17201214 16182705 15248233 14389422 13599128 12870786 12198149
55902 12198149 11575538 10998283 10462693 9965381 9502736 9071344 8668856 8294025 7945644
55893 7945644 7621547 7318504 7032699 6760250 6497954 6244331 6000038 5766873 5546130
55884 5546130 5337872 5141507 4956491 4782242 4617697 4461306 4311559 4167494 4028852
55875 4028852 3895898 3769048 3648529 3534333 3426415 3324710 3228798 3137639 3049854 2964408
55865 2964408 2881076 2800302 2722610 2648113 2576519 2507604 2441644 2379222 2320515 2264788 2210804
55854 2210804 2157881 2106479 2057603 2011544 1967391 1923884 1880618 1838166 1797077 1757145 1717851
55843 1717851 1679219 1641810 1605958 1571377 1537634 1504732 1473074 1443037 1414683 1387815 1362139
55832 1362139 1337393 1313403 1290088 1267508 1245936 1225729 1206953 1189281 1172438 1156589 1141932
55821 1141932 1128095 1114409 1100825 1087995 1076226 1064827 1052873 1040250 1027517 1015062 1002920
55810 1002920 991204 980063 969156 957692 945293 932506 920209 908651 897277 885430 873030
55799 873030 860516 848228 836089 824083 812855 803418 796205 790773 786509 782944 779031 772831 762846
55786 762846 749561 734972 720747 707531 695814 686350 679361 674284 670839 669557 670434 671583 670047
55773 670047 663962 653459 639835 624554 608962 594199 581072 570240 562449 558095 556524 556304 556390
55760 556390 556664 557197 557429 556420 553630 549087 542909 535051 525521 514655 503012 491074 479020 466721
55746 466721 453968 440813 427757 415544 404666 394986 385851 376658 367342 358318 350014 342546 335821
55733 335821 329725 324127 318812 313613 308561 303845 299573 295622 291675 287429 282889 278510 274926 272415
55719 272415 270628 268848 266472 263350 259875 256748 254395 252528 250525 248336 246620 245723 244945 243277 240697
55704 240697 238163 236338 234894 233251 231484 230076 229054 227891 226249 224499 223317 222923 222904 222746 222442
55689 222442 222567 223746 226059 228893 231451 233483 235585 238649 242870 247367 250895 252939 254004 254851 255706
55674 255706 256223 256053 255375 254926 255417 256711 257718 257447 256140 254940 254408 253932 252804 251218 249707 248037
55658 248037 245354 241277 236287 231097 226112 221458 217079 212791 208656 205304 203436 202973 203093 203195 203445
55643 203445 204317 206001 208449 211669 215740 220721 226608 233168 239829 245962 251289 255786 259261 261412
55629 261412 262284 262225 261335 259383 256389 252923 249634 246818 244552 242871 241656 240665 239811 239091 238189 236643
55613 236643 234531 232475 230619 228099 223855 217639 209908 201219 192137 183258 174719 165977 156694 147590
55599 147590 139779 133403 127535 121504 115687 110825 107017 103676 100238 96673 93369 90577 87978 84963
55585 84963 81402 77908 75149 73184 71792 71099 71351 72212 72844 72696 71759 70116 67880 65705 64665 65124
55569 65124 66094 66176 65039 63627 63018 63402 64222 64979 65692 66577 67535 68138 68064 67365 66354 65530 65635 67272
55551 67272 70103 72833 74494 75447 76595 77870 78329 77749 77220 77798 79233 80489 81027 81051 80900 80789 80927
55534 80927 81294 81328 80349 78306 75744 73097 70438 67956 66144 65207 64624 63647 62127 60592 59536 58919
55518 58919 58378 57690 56845 55851 54743 53847 53783 54969 57164 59636 61765 63468 65153 67387 70483 74202
55502 74202 77953 81469 85168 89562 94452 99110 103294 107575 112493 117746 122539 126399 129344 131415
55488 131415 132419 132075 130219 126897 122459 117431 112100 106376 100221 93996 88074 82322 76333 70147
55474 70147 64316 59243 54785 50603 46615 43019 40093 38043 36786 35810 34474 32595 30553 28736 27095
55459 27095 25320 23252 20982 18751 16920 15865 15669 15987 16379 16654 16812 16807 16616 16454 16662 17311 18038 18326
55441 18326 17970 17325 17091 17665 18627 19075 18636 17940 17889 18628 19545 20081 20098 19482 17941 15531 13063 11608
55423 11608 11608 12638 13948 15007 15557 15398 14347 12462 10244 8402 7240 6367 5222 3898 3186 3711
55407 3711 5273 7124 8647 9517 9510 8570 7119 5919 5465 5573 5618 5130 4167 3216 2749 2837 3217 3691 4319
55388 4319 5140 5876 6104 5662 4799 3983 3582 3611 3667 3327 2695 2324 2465 2737 2804 3007 3860 5144 6070 6196
55368 6196 5639 4497 2769 960 44 456 1590 2551 2974 2892 2376 1701 1417 1725 2128 2135 1989 2199 2677 2958
55348 2958 3036 3319 3813 3979 3498 2636 1733 830 10 -353 -5 803 1532 1880 1968 2158 2765 3733 4562 4745 4316
55327 4316 3773 3454 3267 3111 3194 3705 4403 4789 4620 4042 3277 2338 1090 -440 -1832 -2442 -1975 -900 -122
55307 -148 -717 -1274 -1608 -1846 -1931 -1420 5 1949 3396 3660 3090 2612 2581 2391 1374 -264 -1709 -2525 -2988 -3489
55287 -3489 -3976 -4010 -3204 -1626 82 1160 1458 1586 1995 2222 1536 159 -821 -828 -395 -229 -297 -270 -321 -868 -1737
55266 -1737 -2170 -1707 -694 171 511 455 345 384 555 792 1133 1578 1911 1869 1505 1192 1214 1535 1938 2144 1827
55245 1827 831 -563 -1826 -2708 -3299 -3628 -3556 -3190 -2951 -3018 -3014 -2464 -1277 321 1973 3093 3102 2061 774 -41
55224 -282 5 1023 2608 3790 3804 3296 3691 5373 7223 8075 7933 7476 7012 6384 5521 4604 3777 3105 2777
55205 2777 3120 4252 5808 7104 7663 7642 7619 7943 8398 8585 8435 8181 8032 8101 8418 8741 8538 7526 6078
55186 6078 4731 3475 2040 772 578 1838 3860 5628 6661 6920 6428 5416 4537 4406 4954 5595 5946
55169 5946 6119 6366 6741 7098 7198 6860 6223 5846 6198 6977 7212 6278 4597 3138 2376 2062 1921 2081 2667
55150 2667 3374 3855 4281 5060 6022 6373 5577 3987 2436 1493 1207 1291 1392 1467 1957 3268 4973 5990
55132 5990 5838 5212 4954 4923 4433 3395 2345 1574 955 553 631 1030 1218 1134 1388 2440 4060 5820 7606
55113 7606 9388 10927 12036 12812 13359 13562 13336 12828 12232 11725 11650 12385 13836 15453 16903 18371 20032
55096 20032 21692 23146 24416 25350 25507 24787 23713 22707 21546 19978 18426 17511 17258 17366 17895 18960
55080 18960 20008 20226 19661 19225 19478 20020 20212 19894 19192 18159 16927 15830 15091 14585 14102 13636 13321 13272
55062 13272 13573 14148 14615 14569 14073 13597 13373 13115 12518 11727 11151 11002 11211 11577 11860 11885 11696 11522 11532 11774
55042 11774 12290 13025 13640 13721 13277 12737 12350 11953 11454 11141 11245 11533 11683 11801 12146 12515 12352 11472 10301
55023 10301 9370 8819 8533 8518 8985 10124 11883 13958 16003 17834 19403 20593 21220 21281 21027 20633 19981
55006 19981 18951 17803 16998 16648 16453 16264 16455 17563 19604 21867 23414 23785 23309 22783 22876 23731 25013
54989 25013 26171 26712 26477 25780 25211 25108 25263 25156 24424 23109 21655 20748 20920 22071 23473 24442 24906
54972 24906 25147 25167 24666 23620 22539 22042 22366 23313 24450 25306 25651 25666 25693 25774 25669 25320 24920 24404 23333
54953 23333 21675 20379 20567 22214 24123 25337 26124 27354 29320 31567 33738 36176 39596 44425 50557
54938 50557 57618 65324 73573 82288 91165 99622 106960 112541 115851 116561 114687 110635 104930 97877 89679
54923 89679 80884 72453 65173 59163 54116 49887 46521 43777 41069 38078 35181 33046 31952 31666 31809
54908 31809 32093 32360 32640 33113 33785 34326 34510 34763 35895 38319 41842 46238 51531 57582 63886 70162
54892 70162 76757 84009 91385 97723 102294 105165 106529 106125 103488 98498 91485 83021 73871 65007 57336
54877 57336 51243 46426 42264 38443 35227 33012 31669 30522 29079 27526 26329 25563 25004 24691 24942
54862 24942 25780 26749 27401 27664 27618 27236 26548 25839 25450 25532 26060 26894 27726 28210 28281 28128 27756 26895 25549 24339
54842 24339 23999 24643 25726 26608 26930 26688 26159 25686 25396 25265 25461 26185 27004 26895 25417 23396 21901 20869
54824 20869 19501 17737 16481 16290 16700 17081 17401 17796 18055 18024 18029 18380 18808 18910 18900 19380 20555 22050 23352
54805 23352 24080 24044 23505 23253 23874 25024 25841 26055 26172 26553 26889 26872 26908 27784 29813 32572 35392 37899
54787 37899 40227 42985 46970 52695 60079 68512 77193 85441 92853 99263 104482 108098 109669 109107 106740
54772 106740 102985 98145 92583 86819 81285 76121 71377 67241 63911 61333 59281 57654 56512 55856
54758 55856 55489 55071 54240 52880 51471 51023 52272 54836 57477 59327 60661 62328 64716 67599 70874
54743 70874 75026 80659 87750 95555 103288 110812 118572 126777 134679 140812 143995 144046 141491 136760 129883
54728 129883 120955 110698 100460 91597 84618 78808 72844 66080 59216 53528 49500 46498 43722 41057
54714 41057 38827 37109 35656 34283 32973 31667 30280 28941 28000 27729 28147 29096 30350 31657 32747
54699 32747 33329 33098 31925 30163 28618 27991 28347 29230 30116 30631 30584 30113 29695 29668 29790 29583 29085 28893 29422
54680 29422 30510 31812 33226 34739 36161 37255 38041 38740 39562 40577 41642 42439 42754 42732 42580 42099 40930
54663 40930 39339 38226 38066 38324 38315 38187 38453 38826 38318 36595 34636 33777 34402 35802 37037 37727 38195 39099
54645 39099 40848 43195 45401 46901 47869 49088 51261 54421 57973 61346 64611 68444 73466 79712 86727
54630 86727 94028 101356 108553 115226 120493 123208 122836 120193 116931 114015 111007 107076 102322 97655 93598
54615 93598 89873 86078 82218 78428 74653 70804 66922 63075 59381 56152 53638 51508 49071 46211
54601 46211 43699 42262 41717 41305 40595 39652 38598 37475 36413 35503 34549 33330 32066 31279 31175 31494 31949
54584 31949 32431 32676 32164 30682 28830 27657 27769 28845 29988 30469 30237 29816 29728 30043 30458 30704 30732 30606
54566 30606 30432 30334 30280 29959 29126 28116 27663 28031 28711 29214 29826 31100 32784 33848 33630 32511 31288 30297
54548 30297 29423 28621 28036 27787 27986 28889 30601 32611 33976 34160 33500 32779 32505 32748 33479 34798 36739
54531 36739 38985 40920 42092 42680 43399 44794 46699 48505 49947 51404 53441 56257 59617 63099 66251
54516 66251 68631 69894 69858 68552 66316 63796 61527 59499 57341 55015 52981 51503 50158 48365 46129
54501 46129 43935 42122 40745 39869 39486 39238 38741 38239 38421 39438 40583 41175 41296 41375 41402 41037 40250 39364
54483 39364 38544 37717 37022 36907 37537 38384 38728 38475 38241 38592 39419 40152 40432 40333 39970 39232 38162 37347 37517
54464 37517 38681 39997 40640 40622 40578 40951 41594 42097 42289 42389 42721 43298 43700 43551 43097 43020 43537 44002 43716
54445 43716 42900 42488 43068 44386 45845 47028 47698 47797 47675 47938 48704 49270 48858 47551 46128 45067 44118
54428 44118 42876 41435 40290 39775 39807 40063 40288 40443 40656 41020 41480 41965 42588 43511 44591 45401 45759 46124
54410 46124 47209 49229 51637 53647 54840 55260 55094 54511 53804 53465 53845 54688 55241 55056 54568 54596 55291 55899
54392 55899 55710 54879 54061 53502 52924 52213 51704 51702 52010 52147 51795 50879 49457 47716 46012 44701 43930 43632
54374 43632 43666 43944 44472 45288 46242 46886 46797 46025 45074 44429 44306 44806 45959 47517 49054 50414 51830 53403
54356 53403 54779 55570 55795 55675 55302 54875 54940 55913 57455 58743 59295 59196 58598 57491 55958 54275 52672
54339 52672 51270 50256 49763 49580 49327 48930 48598 48318 47815 47057 46337 45654 44505 42569 40317 38575 37638
54322 37638 37056 36149 34606 32756 31415 31243 32048 32935 33310 33504 34205 35495 36752 37347 37180 36592 36044
54305 36044 35852 36044 36438 36879 37352 37835 38237 38577 39039 39687 40322 40720 40865 40789 40427 39840 39351 39221 39307 39289
54285 39289 39126 39083 39387 39989 40563 40652 40052 39126 38487 38192 37673 36673 35825 35827 36428 36820 36809 36989 37788 38979
54265 38979 40137 41031 41490 41399 40964 40596 40426 40335 40416 40841 41254 40958 39958 39217 39514 40573 41622 42296 42550
54246 42550 42270 41552 41012 41194 41884 42510 42929 43289 43436 43108 42554 42206 41831 40765 39087 37796 37571 37985
54228 37985 38231 38122 37997 38108 38475 39024 39510 39590 39313 39233 39747 40580 41182 41384 41339 41203 41202 41674 42558 43126 42809
54207 42809 42035 41626 41498 40696 38814 36688 35378 35002 35007 35159 35751 36876 37918 37927 36486 34200 32259 31395
54189 31395 31378 31617 31998 32745 33688 34290 34453 34664 35144 35412 35026 34296 33854 33900 34285 34955 35840 36536 36593 35944
54169 35944 34740 32978 30775 28717 27461 27061 27117 27424 27990 28643 29206 29951 31200 32531 33081 32758 32442
54152 32442 32723 33108 32817 31806 30561 29363 28308 27690 27727 28040 27956 27334 26720 26628 27014 27539 28085 28807 29800
54133 29800 30855 31622 31973 32131 32423 33041 34100 35659 37371 38341 37814 36069 34183 32855 31888 30930 30226
54116 30226 30259 31089 32403 33911 35310 36085 35866 34915 33896 33224 32885 32786 32949 33362 33938 34620 35365 36056
54098 36056 36626 37200 37948 38829 39647 40304 40860 41508 42590 44436 46922 49270 50562 50462 49327 47775 46330
54081 46330 45334 44877 44797 44869 44949 44881 44519 44038 43986 44646 45474 45581 44759 43739 43343 43651 44091 44191 44140 44583 45865
54060 45865 47549 48899 49771 50673 51835 52781 53138 53463 54703 57115 60244 63717 67402 70870 73488 75313
54044 75313 77321 80404 84489 88858 93028 97042 101142 105472 109995 114528 118862 122888 126552 129768
54030 129768 132617 135470 138558 141365 142899 142783 141808 141149 141199 141412 141161 140442 139637 138750 137127 134096 129805
54013 129805 125123 120667 116257 111563 106881 102810 99414 96258 93227 90739 89084 88009 87054 85874
53999 85874 84142 81662 78789 76303 74565 73171 71674 70231 69234 68623 67987 67091 65953 64582 63082
53984 63082 61936 61763 62687 64096 65108 65197 64457 63393 62487 61889 61517 61334 61346 61386 61190 60760 60399 60308 60426
53965 60426 60721 61272 61918 62205 61980 61730 61990 62669 63365 64146 65524 67659 70037 72045 73558 74810 75933
53948 75933 76897 77800 78968 80682 82864 85134 87210 89228 91617 94752 98800 103810 109729 116318 123219
53933 123219 130140 136885 143294 149335 155156 160765 165725 169536 172433 175417 179340 184170 189249 193940
53919 193940 197877 201028 203876 207278 211730 216811 221589 225458 228349 230275 230985 230131 227654 224041 220199
53904 220199 216908 214260 211812 209274 206731 204016 200408 195323 189097 182655 176572 170816 165213 159660
53890 159660 153957 147939 141916 136566 132223 128514 124892 121344 118448 116773 116263 116129 115341 113379 110562
53875 110562 107669 105262 103367 101559 99268 96212 92770 89771 87679 86159 84661 83152 81975 81165
53861 81165 80434 79804 79682 80187 80778 80835 80325 79664 79083 78388 77251 75552 73463 71355 69638 68644 68548 69306
53843 69306 70582 71772 72258 71744 70410 68838 67789 67799 68717 69715 69997 69607 69389 70110 71673 73217 73963
53826 73963 73975 74058 74896 76321 77622 78475 79238 80204 81013 81159 80849 80944 82082 84241 87098 90431 94056 97711
53808 97711 101240 104771 108595 112875 117396 121576 124920 127618 130429 133710 136764 138595 139196 139539 140319
53793 140319 141283 141945 142356 142770 142996 142635 141739 140730 139664 138125 135890 133274 130556 127449 123564 119224
53777 119224 115323 112290 109567 106353 102565 98779 95462 92687 90439 88660 86935 84684 81923 79395
53763 79395 77688 76589 75570 74524 73603 72688 71531 70202 68922 67613 66122 64726 63887 63550 63195 62557
53747 62557 61756 60774 59426 57974 57174 57442 58365 59287 59950 60370 60502 60309 59857 59129 58091 57131 57054 58265
53729 58265 60235 62044 63239 63925 64332 64620 64925 65280 65664 66245 67308 68717 69794 70077 69901 69863 70035
53712 70035 70170 70471 71478 73244 75180 76816 78254 79699 81025 82087 83060 84121 85014 85394 85506 86140
53696 86140 87727 89801 91616 93142 95069 97772 100646 102809 104224 105663 107569 109483 110753 111388 111822
53681 111822 112160 112123 111654 111161 111097 111535 112233 112865 113116 112798 112033 111240 110828 110845 110947 110762 110338 110165 110576 111114
53661 111114 110767 109101 106962 105720 105837 106510 106747 106493 106471 107154 108198 108902 108993 108808 108810 109070 109297 109225 108875
53642 108875 108517 108517 109188 110622 112582 114614 116288 117321 117582 117243 116809 116733 116942 117044 117073 117664 119291 121635
53624 121635 124033 126251 128411 130339 131551 131934 132030 132416 133090 133683 134068 134533 135395 136652 138023 139275
53608 139275 140450 141829 143684 146076 148822 151555 153877 155637 157187 159227 162225 165963 169656 172437
53594 172437 173780 173763 173143 172939 173641 174874 175999 176868 177731 178596 179127 179191 179086 179047 178926 178541 178061 177732 177385
53575 177385 176604 175355 174141 173373 172785 171658 169646 167249 165387 164583 164664 165205 165989 166872 167500 167509 166994 166379
53557 166379 165772 164791 163251 161718 161054 161528 162688 164101 165806 167826 169503 169790 168410 166482 165667 166614
53541 166614 168488 170127 171308 172614 174353 176180 177831 179677 182220 185378 188615 191619 194533 197653
53527 197653 201225 205467 210438 215863 221379 226983 233017 239670 246789 254211 261994 270202 278743 287602
53513 287602 296943 306709 316347 325383 334241 344126 355923 369380 383485 397509 411500 425901 440903
53500 440903 456259 471628 486952 502426 518178 534133 550190 566342 582519 598460 613955
53489 613955 629107 644194 659271 674110 688519 702494 716071 729275 742326 755651 769471
53478 769471 783481 797147 810277 823167 836232 849533 862628 874770 885377 894455 902537 910116
53466 910116 917142 923145 927677 930524 931596 930869 928483 924675 919504 912797 904488 894994 885181 875921
53452 875921 867596 859900 852063 843352 833468 822549 810867 798605 785922 773163 760861 749416
53440 749416 738684 727961 716511 704169 691434 679044 667636 657752 649839 644035 640105 637778
53428 637778 636991 637581 638904 640082 640724 641195 642118 643740 645890 648358 651200 654644 658883 664022 670221
53413 670221 677753 686817 697371 709241 722295 736299 750756 765256 780025 795685 812336 829321
53401 829321 846272 864017 883874 906195 930085 954597 979770 1006389 1035094 1065883 1098253
53390 1098253 1131681 1166008 1201369 1237686 1274425 1311037 1347479 1384006 1420546 1456642 1491947
53379 1491947 1526384 1559807 1591851 1622260 1651112 1678582 1704604 1728751 1750327 1768766 1784177
53368 1784177 1797433 1809353 1819902 1828382 1834194 1837009 1836447 1832124 1823919 1811678 1794803 1772839 1746421
53355 1746421 1716962 1685315 1651509 1615896 1579712 1544123 1509442 1475603 1442695 1410577 1378793
53344 1378793 1347544 1318138 1291676 1267649 1244463 1220960 1196808 1171846 1145932 1119373 1092843
53333 1092843 1066867 1041799 1018062 995859 974857 954710 935740 918576 903346 889762 877751
53322 877751 867361 858189 849533 840970 832169 822410 811153 798970 787067 775848 764805 753857
53310 753857 743823 735296 727951 721366 715707 711101 707091 703376 700494 699123 699169 700120 701851 704347 707121
53295 707121 709794 713078 718283 725781 734737 744561 755862 769496 785191 801718 818190 834630 851250
53282 851250 867756 883632 898784 913467 927639 940763 952427 962798 972281 980897 988311 994283
53270 994283 998786 1001803 1003372 1003769 1003250 1001534 997969 992304 984977 976501 966942 956171 944192 930933
53256 930933 916037 899315 881248 862711 844326 826370 809084 792584 776425 759801 742427
53245 742427 724976 708412 693063 678525 664290 650105 635796 621142 606122 591065 576290
53234 576290 561788 547467 533542 520247 507282 494069 480765 468504 458235 449699 441952 434583
53222 434583 427854 421810 415975 410015 404130 398464 392583 385893 378348 370403 362326 353811 344314 333642
53208 333642 322177 310582 299337 288586 278369 268850 260245 252705 246268 240713 235353 229384 222732
53195 222732 216260 210727 205821 200660 194985 189294 183943 178794 173776 169157 165095 161450 158139 155195
53181 155195 152357 149247 146111 143765 142467 141428 139870 138071 136862 136503 136647 137074 137815 138601 138774 137905
53165 137905 136249 134503 133258 132627 132258 131708 130895 130136 129817 130140 131025 132015 132421 132021 131467 131460 131695 131434
53147 131434 131108 132172 134899 137461 138089 137329 137047 137837 138692 138930 139010 139249 139051 138013 136909 136788 137573
53130 137573 138157 137707 136441 135178 134381 133637 132112 129690 127519 126979 128118 129553 129995 129383 128356 127194
53114 127194 125705 123799 121671 119558 117707 116462 115975 115782 115023 113255 110953 109067 108106 107750 107311 106476
53098 106476 105453 104516 103680 102872 102118 101366 100461 99563 99337 100215 101686 102784 103261 103704 104418 104809 104155 102524
53080 102524 100534 98553 96583 94738 93333 92502 92085 91960 92222 92907 93715 94126 93808 92885 91863 91287 91339
53063 91339 91680 91744 91284 90709 90795 91941 93679 95032 95375 94858 94065 93498 93432 93927 94665 94970 94320 92858 91188
53044 91188 89795 88861 88486 88704 89298 89944 90579 91337 92095 92446 92215 91748 91551 91868 92641 93651 94579 95134
53026 95134 95259 95143 95039 95253 96173 97903 99816 100905 100833 100319 100319 101106 102352 103777 105317 106838 108106
53009 108106 109063 109951 111088 112590 114215 115476 116069 116285 116735 117610 118464 118959 119487 120656 122324 123597
52993 123597 123797 123145 122384 121992 121872 121656 121112 120269 119250 118160 117229 116890 117393 118327 118860 118650 118207 118113
52975 118113 118146 117554 116026 114053 112428 111667 111886 112833 113985 114921 115694 116675 118034 119568 121014 122229
52959 122229 123028 123128 122429 121165 119764 118642 118093 118094 118183 117839 117102 116587 116788 117651 118916 120481 122226 123822
52941 123822 125090 126302 127704 128854 128919 127651 125695 123855 122388 121144 120072 119347 119165 119625 120671
52926 120671 121901 122544 121963 120286 118366 116993 116249 115750 115348 115316 115758 116186 115958 115065 114161 113773 113794 113895
52908 113895 114101 114607 115166 115148 114283 113044 112128 111756 111661 111567 111455 111414 111472 111591 111726 111812 111744 111412 110774 109923 109078
52887 109078 108494 108335 108670 109496 110679 111871 112605 112523 111533 109811 107801 106106 105176 105061 105588 106688 108376
52870 108376 110458 112523 114206 115201 115097 113650 111342 109202 107802 106769 105532 104200 103392 103535 104654
52855 104654 106512 108520 109789 109802 108936 107905 106881 105616 104212 103155 102641 102395 102140 101738 100905 99394
52839 99394 97500 95827 94489 93099 91583 90341 89446 88419 87075 85997 85722 86006 86258 86199 85719 84591
52823 84591 82831 80941 79302 77715 75970 74461 73699 73555 73501 73300 72968 72382 71483 70604 70056 69675 69327
52806 69327 69488 70566 71928 72486 72219 72250 73286 74754 75684 75784 75321 74578 73857 73634 74247 75564 77140
52789 77140 78534 79404 79594 79263 78781 78384 78098 78020 78430 79596 81540 83939 86128 87436 87787 87756 87757 87532
52771 87532 86845 86231 86315 86666 86222 84836 83587 83414 84183 85309 86529 87738 88725 89403 89830 89814 89102 88167
52753 88167 87996 88764 89449 89300 88965 89482 90774 91869 92243 92162 91945 91584 91057 90512 90241 90712 92268 94426
52735 94426 95986 96435 96836 98561 101414 103800 104559 103856 102368 100563 98947 98144 98246 98581 98554 98391 98801
52718 98801 100208 102474 105058 107250 108565 109174 109724 110588 111531 112207 112643 113006 113198 113032 112723 112833 113698
52701 113698 115051 116281 117007 117374 117835 118685 119868 121132 122209 122785 122590 121780 121063 121117 121852 122466 122285
52684 122285 121344 120248 119690 120098 121410 123002 124065 124233 123848 123544 123630 123900 123908 123390 122431 121272 120007 118579
52666 118579 117097 115939 115400 115369 115440 115249 114515 112984 110664 108086 106012 104763 103946 102938 101569 100312
52650 100312 99831 100269 100970 101058 100297 99223 98401 97854 97373 97037 97088 97512 98112 98842 99739 100687 101514 102164 102474
52631 102474 102071 100914 99701 99151 99038 98552 97596 97036 97521 98682 99735 100354 100660 100782 100794 100746 100465 99624
52613 99624 98305 97197 96932 97452 98274 99091 99791 100157 99995 99465 99014 98985 99424 100149 100829 101176 101223 101288 101531
52594 101531 101746 101781 101945 102764 104448 106759 109246 111495 113389 115304 117784 120761 123386 124822 125027 124519
52578 124519 123759 123086 122868 123145 123318 122695 121266 119490 117519 115201 112748 110762 109482 108547 107576 106495
52562 106495 105229 103686 102163 101099 100171 98327 95140 91574 88916 87434 86653 86383 86682 87091 86850 85949
52546 85949 85225 85262 85784 86297 86775 87445 88315 89211 89974 90416 90378 90043 89888 90104 90405 90597 91019 92027 93314
52527 93314 94107 93947 93046 91993 91346 91332 91651 91629 90783 89211 87323 85412 83612 82024 80600 79137 77647
52510 77647 76527 76039 75901 75703 75482 75453 75429 75099 74714 74886 75735 76817 77875 79033 80207 81002 81382 81787
52492 81787 82327 82505 82090 81642 81690 81902 81556 80472 78998 77483 76308 76054 77008 78598 79824 80132 79555
52475 79555 78317 76843 75883 75991 76933 78069 79117 80060 80579 80363 79903 80169 81330 82510 83005 83117 83460
52458 83460 84073 84634 85088 85579 86089 86575 87232 88200 89164 89589 89307 88629 87998 87704 87843 88307 88853 89289 89552
52439 89552 89567 89211 88511 87735 87140 86763 86572 86648 87043 87599 88063 88384 88796 89580 90661 91383 90897 89046 86768
52420 86768 85269 84836 84841 84871 85283 86431 87890 88833 88923 88462 87924 87617 87621 87726 87608 87305 87310 87909 88703 89147 89308
52399 89308 89644 90227 90741 91168 91877 93001 94249 95479 96878 98312 99038 98536 97337 96518 96523 96965 97514 98402
52381 98402 99852 101441 102470 102866 103362 104721 106979 109471 111418 112470 112803 112870 113016 113302 113719 114503 116015
52364 116015 118266 120791 123134 125272 127361 129310 130887 132137 133285 134279 134809 134858 134894 135381 136377 137739
52348 137739 139453 141575 144062 146815 149722 152575 155117 157336 159511 161879 164451 167273 170551 174334
52334 174334 178380 182572 187230 192639 198515 204381 210349 217090 224976 233675 242730 252227 262686 274456
52320 274456 287431 301277 315733 330696 346071 361696 377471 393519 410037 426929 443757
52309 443757 460169 476200 492000 507389 521890 535172 547309 558590 569211 579129 588119 596009
52297 596009 602830 608674 613416 616807 618912 620163 620840 620774 619773 618004 615603 612213 607408 601462 595217
52282 595217 589228 583502 578087 573391 569755 567167 565649 565565 567254 570598 575171 580627 586750 593321 600243
52267 600243 607683 615958 625323 635894 647573 659997 672777 685813 699083 712073 723898 734268
52255 734268 743916 753690 763499 772571 780421 787031 792325 796184 798983 801416 803580 804773 804426 802737
52241 802737 800082 796354 791337 785343 778881 771917 764045 755335 746515 738259 730720 723830 717588 711869
52227 711869 706314 700683 695136 689990 685377 681341 678040 675624 674006 672914 672090 671331 670488 669655 669294
52212 669294 669977 671942 674963 678569 682360 686182 690030 693795 697177 700053 702825 706028 709524 712529
52198 712529 714574 715949 716915 717087 716233 715269 715536 717130 718685 718996 718159 716906 715480 713659 711412 709028
52182 709028 706777 704827 703289 702011 700451 698078 694804 690844 686398 681733 677358 673762 670915 668257
52168 668257 665152 661344 657159 653361 650542 648516 646544 644306 642220 640585 638922 636709 634362 632731
52154 632731 631703 630112 627161 623356 619792 617024 614997 613615 612937 612888 613148 613270 612863 611803 610382 609126
52138 609126 608271 607589 606827 606097 605693 605673 605932 606694 608694 612783 619278 627646 636827 646037 655364 665570
52122 665570 677275 690460 704771 720035 736241 753095 769965 786440 802769 819460 836411
52111 836411 852746 867747 881765 895836 910398 924830 938340 950834 962515 973036 981705 988292
52099 988292 993028 995829 996271 994543 991662 988352 984221 978599 971786 964805 958165 951477 944260 936520
52085 936520 928440 920096 911705 903769 896678 890399 884752 879743 875497 872120 869913 869452 871171 874948
52071 874948 880375 887265 895648 905323 915713 926225 936581 946913 957668 969256 981448 993200
52059 993200 1003441 1012030 1019565 1026291 1031713 1035442 1037803 1039213 1039497 1038320 1035907 1032654 1028297 1022223
52045 1022223 1014500 1005817 996301 985268 972465 958776 945100 931139 916028 899781 883338 867304
52033 867304 851405 835266 819038 803092 787598 772714 758755 745864 733725 721850 709937
52022 709937 697843 685443 672760 660051 647582 635506 624042 613455 603522 593317 581943 569460
52010 569460 556713 544296 532015 519437 506516 493437 480142 466329 451858 436913 421790
51999 421790 406719 391865 377340 363145 349174 335304 321505 307963 295161 283633 273489
51988 273489 264277 255471 246954 238814 230909 223153 216183 211077 208129 206310 204238 201306 197599 193252
51974 193252 188416 183501 178811 174101 169076 164154 160075 156844 153746 150435 147325 144797 142734 140998
51960 140998 139683 138608 137228 135419 133687 132210 130341 127655 124883 123133 122560 122441 122175 121572 120527
51945 120527 119155 117960 117226 116455 115114 113703 113251 113882 114664 114902 114783 114677 114570 114366 114090 113610 112726
51928 112726 111649 110788 110041 108928 107529 106493 105946 105201 103902 102623 101868 101271 100355 99432 98976 98623 97615
51911 97615 95910 94091 92387 90510 88470 86869 86250 86489 86916 86800 85831 84426 83413 83181 83320 83300 83134
51894 83134 82966 82453 81262 79973 79681 80658 82014 82824 82999 82845 82423 81785 81408 81853 83115 84682 86124
51877 86124 87314 88136 88396 88179 88006 88352 89047 89392 88939 87932 86910 86095 85474 85278 85940 87530 89589
51860 89589 91621 93425 94906 95951 96689 97453 98244 98654 98618 98793 99833 101655 103948 106936 110960 115535
51844 115535 119638 122935 126069 129727 134137 139621 146826 155899 165975 176049 186087 196819 208543
51831 208543 220455 231002 238561 241965 240902 236082 228824 220281 210967 201011 190746 180880 172023
51818 172023 164168 156849 149810 143234 137349 132174 127868 124849 123189 122278 121568 121298 121798 122357 121673 119488
51802 119488 116978 115358 114894 115435 116989 119182 120947 121497 121161 120667 120094 119216 118345 117939 117659 116729 115128
51785 115128 113587 112460 111463 110564 110194 110280 109956 108753 107448 107159 108053 109401 110498 111042 110933 110315 109701
51768 109701 109562 109803 109894 109500 108748 108043 107795 108175 108920 109607 110281 111473 113345 115147 115979 115825 115422 115345
51750 115345 115685 116418 117494 118620 119494 120271 121379 122876 124416 125770 126914 127709 128061 128356 129080 129964
51734 129964 130201 129663 129227 129634 130708 131974 133269 134299 134389 133360 132085 131471 131303 130816 129923 129105 128409
51717 128409 127481 126413 125664 125155 124312 123056 121984 121427 121059 120595 120172 119795 119105 118026 117027 116353 115563
51700 115563 114223 112575 111110 109913 108903 108324 108480 109168 109890 110523 111419 112850 114557 115801 115825 114442
51684 114442 112252 110048 107987 105721 103320 101475 100576 100144 99548 98770 98099 97551 97119 97117 97664 98186 98056
51667 98056 97459 96977 96570 95667 94158 92517 91008 89531 88396 88446 90028 92370 94347 95516 96108 96412
51651 96412 96569 96749 97168 97907 98877 99894 100778 101530 102464 103960 105987 108023 109519 110312 110620 110856 111460
51634 111460 112662 114270 115889 117396 119009 120863 122738 124307 125433 126189 126731 127195 127498 127225 125997
51619 125997 124081 122337 121419 121167 120919 120219 119089 117805 116645 115719 114877 113845 112546 111214 110074 109090
51603 109090 108169 107556 107759 109016 110930 112696 113706 113908 113590 112905 111779 110284 108850 107867 107255 106722
51587 106722 106355 106610 107637 108925 109780 109972 109768 109479 109152 108690 108148 107833 108024 108588 109092 109400 109905 110866
51569 110866 111753 111705 110597 109180 108170 107711 107771 108437 109468 110126 109991 109660 110129 111675 113762 115892 117980
51552 117980 119935 121430 122319 122927 123717 124904 126509 128489 130562 132101 132564 132106 131586 131836 132978 134455
51536 134455 135636 136284 136454 136203 135624 135042 134897 135304 135909 136316 136504 136708 137093 137737 138749 140104 141421
51519 141421 142203 142391 142452 142832 143456 143829 143513 142425 140833 139236 138131 137764 138064 138810 139747 140474 140458 139446
51501 139446 137831 136387 135536 135048 134446 133502 132174 130344 127920 125182 122759 121197 120579 120557 120593 120313 119806
51484 119806 119543 119719 119772 118913 117168 115463 114464 113713 112282 109954 107385 105312 104023 103469 103397 103315 102764
51467 102764 101772 100818 100300 100229 100399 100513 100133 98907 97012 95132 93813 93089 92811 93025 93833 95091 96494
51450 96494 97793 98743 99055 98626 97724 96758 95928 95213 94594 94124 93929 94186 94922 95727 95916 95288 94457 94126 94150
51431 94150 93747 92587 91281 90653 90897 91572 92139 92332 92229 92216 92720 93770 94879 95597 96018 96516 97116 97488
51413 97488 97538 97593 97861 98130 98209 98325 98675 98915 98575 97873 97565 97947 98529 98781 98668 98185 96930 94641 91862
51394 91862 89582 88261 87566 86923 85995 84763 83488 82548 82004 81416 80398 79271 78755 79049 79557 79561 78838 77643
51376 77643 76420 75544 75010 74337 73094 71502 70210 69490 69096 68939 69369 70588 72132 73230 73440 72813 71783
51359 71783 71019 71017 71497 71497 70390 68665 67460 67469 68464 69721 70675 71191 71423 71516 71522 71655 72353 73750 75188 75704
51339 75704 75052 73910 73067 72793 72946 73140 72755 71415 69725 68971 69718 71195 72322 72787 72744 72158 71085
51322 71085 70110 69778 69873 69883 69879 70262 70926 71446 71937 72885 74141 74918 74962 74932 75397 76095 76538 76742 76922 76935 76546
51301 76546 75961 75543 75157 74332 73135 72462 73164 75031 76913 77898 78153 78408 78847 78920 78239 77128 76089 75179
51283 75179 74318 73778 73845 74277 74658 75076 75870 76869 77521 77735 77898 78039 77721 76927 76368 76523 76997 77220 77315 77827
51263 77827 78916 80307 81769 83315 85059 87139 89526 91725 93010 93257 93162 93263 93123 92038 90253 88847
51247 88847 88449 88660 88828 88836 88912 89069 89025 88491 87383 85921 84661 84253 84916 86188 87287 87762 87785 87896 88458
51228 88458 89369 90263 90949 91476 91728 91275 89874 88050 86806 86686 87367 88198 88909 89673 90727 92109 93649
51211 93649 94974 95656 95549 94981 94408 93936 93357 92685 92344 92675 93387 93748 93278 92098 90647 89287 88252
51194 88252 87732 87831 88496 89575 90846 91913 92265 91631 90278 88764 87420 86177 84874 83519 82224 81069
51178 81069 80141 79603 79590 80020 80525 80653 80257 79759 79878 80862 82080 82610 82256 81699 81599 81899 82236 82705 83800
51159 83800 85631 87646 89234 90278 90956 91265 91117 90754 90662 90965 91221 91051 90693 90613 90687 90248 89015 87579
51141 87579 86721 86552 86645 86743 86949 87341 87856 88548 89467 90182 89963 88796 87822 88251 89939 91575 92278 92577 93600
51122 93600 95634 97827 99161 99402 99052 98620 98154 97457 96597 95999 95982 96332 96521 96364 96257 96687 97713 99114
51104 99114 100810 102830 104934 106668 107856 108725 109447 109908 110132 110509 111310 112258 113025 113854 115113 116354 116487
51087 116487 115041 112718 110546 108971 108036 107882 108602 109853 111056 111821 111960 111454 110775 110944 112629 115268
51071 115268 117518 118577 118699 118529 118458 118676 119311 120217 120916 121015 120546 119762 118776 117589 116348 115396 115052 115364
51053 115364 116035 116640 116992 117223 117469 117612 117539 117452 117661 118128 118519 118719 119004 119737 121176 123488 126570 129726
51035 129726 131954 132811 132802 132772 133125 133783 134573 135327 135757 135635 135174 135019 135719 137216 138923 140284 141200 141925
51017 141925 142666 143516 144783 147003 150356 154256 157881 161016 164066 167341 170784 174360 178222 182280 186072
51002 186072 189368 192611 196440 201021 206160 211896 218565 226282 234684 243252 251751 260227 268800 277588
50988 277588 286878 297240 309287 323296 339132 356698 376281 398300 422796 449511 478410 509824
50976 509824 544013 580928 620571 663250 709196 758055 809014 861314 914504 968265 1022112
50965 1022112 1075153 1125987 1172995 1214989 1251641 1283265 1310279 1332919 1351254 1365249 1374846
50954 1374846 1380183 1381777 1380491 1377395 1373721 1370767 1369576 1370546 1373363 1377307 1381659 1385768 1388708 1388979
50940 1388979 1384817 1375091 1359878 1340004 1315996 1287640 1254448 1216278 1173493 1126730 1076626 1023668
50928 1023668 968447 912196 856936 804605 755998 710901 669168 631127 596791 565414 536362
50917 536362 509978 486963 467122 449369 433000 418394 406223 396417 388243 381173 375322 370942
50905 370942 367707 364750 361480 358242 355917 354842 354345 353503 352197 351208 351324 352591 354409 356244 358171
50890 358171 360790 364672 369839 375780 381925 388119 394663 401986 410253 419211 428499 438126 448527 459981
50876 459981 472131 484418 496948 510642 526473 544831 565728 589265 615731 645404 678429
50865 678429 714797 754472 797836 846137 901177 964241 1035347 1113614 1198296 1289378 1387363
50854 1387363 1492502 1604180 1721067 1841935 1965972 2091794 2216338 2335415 2445578
50845 2445578 2544945 2632124 2705151 2762129 2802462 2826949 2837117 2835138 2824175 2807943 2789628
50834 2789628 2771441 2755202 2742932 2736711 2738080 2747476 2763946 2785291 2808563 2830390 2846968 2854268
50822 2854268 2848798 2828270 2791549 2738304 2668918 2584463 2486367 2376311 2256665 2130661 2001616
50811 2001616 1872100 1744235 1620571 1504003 1396621 1298937 1210381 1130397 1059022 996522
50801 996522 942504 895518 853859 816840 784860 758045 735380 715552 698103 683116 670220
50790 670220 658666 648176 638938 630842 623430 616579 610465 604754 598526 591216 583070 574513 565652 556567
50776 556567 547537 538722 530079 521804 514375 507906 501932 496036 490303 485017 480418 476920 475014 474654
50762 474654 475279 476767 479778 484770 491227 498440 506556 516208 527475 539994 553964 570281 589575
50749 589575 611645 635997 662607 692064 725312 763300 806530 854727 907112 963073 1022440
50738 1022440 1085109 1150612 1218101 1286658 1355528 1424080 1491529 1556690 1618087 1674254 1723751
50727 1723751 1764895 1795847 1815279 1822862 1819143 1805345 1783521 1756562 1727529 1699041 1673426 1652965
50715 1652965 1639341 1632902 1633017 1639118 1650771 1666684 1684302 1700793 1714023 1722304 1723651 1715907 1697448
50702 1697448 1667380 1625278 1571438 1507589 1436946 1363130 1288938 1216043 1145477 1078131 1014999
50691 1014999 957219 905852 861348 823181 790194 761400 736441 715335 698054 684493 674607
50680 674607 668314 665226 664730 666340 669816 674814 680626 686506 692179 697879 703866 710108 716477 722962
50666 722962 729510 735818 741623 747167 753068 759630 766594 773734 781512 790808 802155 815522 830842
50653 830842 848514 869325 893981 922647 954728 989133 1024951 1061842 1099661 1137915 1175891
50642 1175891 1213073 1248929 1282296 1311679 1336369 1356780 1373417 1385950 1393698 1396664 1395632 1391400
50630 1391400 1384274 1374117 1360652 1343907 1324682 1304474 1284745 1266461 1250356 1237090 1226765
50619 1226765 1218817 1212895 1209513 1209200 1211363 1214749 1218810 1223803 1229613 1235307 1239970 1243157 1244210 1241745
50605 1241745 1234175 1220319 1199394 1171098 1136205 1096650 1054512 1011115 967303 924131 882796
50594 882796 844065 808148 775031 744726 717375 693306 672732 655172 639408 624384 610014
50583 610014 596933 585703 576591 569882 565822 564197 564361 565844 568668 572860 577918 583060 587985 593083
50569 593083 598808 605066 611466 618003 625159 633339 642546 652745 664186 677139 691591 707408 724446
50556 724446 742239 759941 777029 793827 810866 828020 844769 861179 878050 896218 916295
50545 916295 938948 964823 994122 1026783 1063036 1103340 1147871 1196753 1250670 1310490 1376265
50534 1376265 1447422 1523999 1606677 1695202 1787587 1881398 1975058 2067392 2156561 2240158 2315921
50523 2315921 2381864 2436245 2477943 2506524 2521432 2521610 2506457 2476721 2433898 2379211 2313839 2239828
50511 2239828 2160060 2077431 1994456 1913335 1835849 1763400 1697582 1640340 1593026 1555722 1528061
50500 1528061 1510262 1502595 1504263 1513877 1530978 1556103 1589027 1627488 1667761 1705928 1738433 1762036
50488 1762036 1773682 1770590 1750767 1713882 1661633 1597004 1523375 1444382 1363804 1284534 1207745
50477 1207745 1133689 1063160 997530 937613 883367 834627 791228 752426 717232 685618 658609
50466 658609 636792 619418 605202 593367 583635 575990 570907 569100 570458 573674 577451 581641 586803
50453 586803 593167 600570 608987 618391 628304 638089 647620 657219 667017 676752 686097 694741 702255 708346
50439 708346 713329 718041 723172 728895 735167 742109 749939 758695 768210 778419 789622 802354 816934
50426 816934 833224 850887 869838 890369 912991 938329 967016 999357 1035112 1073809 1115180
50415 1115180 1159028 1204822 1251811 1299386 1346873 1392994 1436127 1475176 1509666 1538882 1561534
50404 1561534 1576542 1583539 1582172 1571450 1550388 1519081 1478695 1430629 1376180 1316897 1254721 1191635
50392 1191635 1129328 1069193 1012488 960548 914795 876236 844787 819481 799626 785516 777776
50381 777776 776379 780732 790330 804738 823039 843784 865426 886349 904564 917950 924955 924788 917035
50368 917035 901626 879339 851867 821039 788145 754034 719490 685275 652080 620625 591563
50357 591563 565032 540484 517304 495578 476042 459303 445285 433466 423479 415320 409060 404492
50345 404492 401192 398919 397780 397933 399206 401162 403456 405957 408669 411803 415884 421364 427990 434841
50331 434841 441299 447742 454987 463204 471765 480118 488385 496939 505790 514636 523265 531537 539081 545371
50317 545371 550199 553781 556417 558304 559782 561384 563353 565247 566355 566492 566183 566077 566344 566628 566418 565372
50301 565372 563449 560804 557562 553793 549808 546346 544184 543521 543908 544885 546552 549541 554588 562094 571667
50286 571667 581755 589979 594355 594583 592087 588794 585884 583638 582058 581212 580938 580650 579792 578398 576907
50271 576907 575420 573462 570572 566889 562955 559127 555361 551390 546876 541555 535571 529604 524330 519677
50257 519677 514922 509634 504281 499774 496561 494404 492960 492319 492860 494656 497185 499753 502141 504743 507981
50242 507981 511738 515431 518557 521075 523357 525853 528721 531632 534002 535482 536106 535992 535089 533294 530484
50227 530484 526304 520378 513063 505574 498834 492421 485244 477062 468671 460622 452547 444033 435475 427654
50213 427654 420865 414849 409279 403939 398686 393639 389299 386159 384207 382965 381872 380489 378552 376054
50199 376054 373232 370336 367515 364979 363025 361737 360793 359749 358397 356782 355098 353664 352752 352301 352003
50184 352003 351759 351781 352090 352318 352266 352394 353384 355415 358191 361550 365784 371416 378933 388629 400443 414010
50168 414010 428955 444944 461311 476970 491009 503191 513639 522402 529753 536523 543461 550370
50156 550370 556483 561583 565958 569133 569506 565757 558050 547367 534171 518420 500577 481747 462752
50143 462752 443764 425075 407620 392264 378893 366731 355447 345556 337658 331646 326799 322472
50131 322472 318482 314966 312033 309656 307816 306714 306769 308298 311156 314729 318327 321592 324599 327703 331239
50116 331239 335251 339447 343549 347649 352007 356553 360848 364674 368333 372171 376035 379464 382224 384461
50102 384461 386518 388857 391895 395553 399196 402415 405734 410092 415723 421993 428337 434879 442067 450134
50088 450134 459008 468449 478174 488158 498764 510274 522380 534553 546821 559568 572604 585140
50076 585140 596865 608385 620256 632108 643136 652932 661505 668957 675604 682008 688392 694305 699324
50063 699324 703839 708738 714516 721080 728279 736365 746131 758764 775151 795086 817567 842110 869087
50050 869087 898268 927803 955583 981269 1006063 1030757 1055000 1078470 1101687 1125241 1148909
50039 1148909 1171902 1193395 1212456 1227831 1238155 1242198 1238831 1227326 1208047 1182579 1152785 1119752
50027 1119752 1083707 1044773 1003717 962054 921403 882516 844979 808118 772113 737901 706122
50016 706122 676655 649175 623591 599759 577334 556248 536984 519936 504760 490729 477594
50005 477594 465788 455858 447924 441659 436503 431888 427429 422974 418498 413992 409499 405153 401085 397322
49991 397322 393745 390075 385930 381051 375543 369821 364213 358655 352789 346403 339781 333561 328165 323393
49977 323393 318737 314061 309651 305517 301082 295888 290355 285374 281297 277686 274011 270225 266619 263422
49963 263422 260661 258257 256237 254835 254201 253922 253184 251753 250468 250352 251451 252989 254392 255592 256562
49948 256562 257333 258473 260800 264380 268441 272478 276953 282669 289965 298806 309214 321220 334690 349446
49934 349446 365394 382482 400817 420734 442163 463865 483970 501548 517116 531342 544021
49923 544021 554786 564152 573030 581626 589603 597041 604350 611049 615325 615053 609076 597502 581224 561342
49909 561342 538819 514465 489140 463801 439257 416032 394575 375320 358345 343276 329800
49898 329800 318005 307911 299011 290771 283356 277285 272411 267803 262789 257672 253186 249536 246232 242783
49884 242783 239310 236368 234117 231899 228966 225583 222887 221499 220809 220039 219427 219661 220558 221172 221136 221057 221534
49867 221534 222595 224269 226858 230179 233229 235176 236255 237191 238178 239019 239868 241083 242449 243268 243290 243016
49851 243016 242971 243151 243365 243623 243880 243749 242861 241334 239593 237848 236038 234216 232642 231392 230163 228632
49835 228632 226936 225646 225283 225837 226680 226975 226341 225213 224459 224551 225218 225985 226826 228029 229586 231108 232369
49818 232369 233549 234710 235415 235240 234510 234163 234813 236203 237501 237906 237039 235117 232937 231323 230411 229632
49802 229632 228525 227303 226359 225577 224524 223187 222011 221153 220241 219047 217983 217627 218036 218829 219652 220228
49786 220228 220209 219500 218636 218278 218320 217997 217001 215905 215245 214729 213825 212715 212087 212144 212381 212363 212272 212613 213648
49767 213648 215197 216711 217538 217430 216815 216381 216425 216846 217635 218931 220593 222226 223744 225432 227266 228629
49751 228629 229080 228995 229039 229293 229337 229002 228542 228193 228046 228360 229490 231314 233148 234483 235484 236478 237208 237019
49733 237019 235734 234016 232774 232529 233396 235365 238235 241486 244523 247076 249047 250052 249583 247744 245417
49718 245417 243421 241794 240204 238697 237533 236555 235390 234265 233971 234811 236077 236823 236770 236207 235455 234750
49702 234750 234317 234129 233814 233219 232834 233235 234253 235114 235366 235263 235272 235640 236497 237937 239749 241339 242213 242458
49684 242458 242607 243108 244016 245046 245829 246142 246053 245810 245595 245448 245411 245581 245900 246028 245635 244847 244222 244217 244725 245205
49664 245205 245230 244861 244531 244672 245367 246302 247047 247558 248361 250131 253053 256785 261086 266267 272906 281289 291139
49647 291139 301592 311148 317948 320569 318757 313376 305897 298017 291256 286242 282373 278657 274889 271628
49633 271628 269197 267328 265831 264943 264770 264945 265136 265380 265623 265492 264945 264615 264977 265564 265639 265338 265487 266438
49615 266438 267722 268775 269378 269413 268888 268414 269044 271257 274388 277296 279401 280908 282392 284456 287514 291549
49599 291549 296103 300694 305166 309481 313349 316350 318436 320097 321924 324140 326707 329769 333749 338778
49585 338778 344212 348970 352513 355336 358395 362206 366614 371240 375848 380279 384343 387996 391564 395602
49571 395602 400398 405606 410447 414394 417624 420728 424062 427569 431159 434949 439008 443071 446678 449483
49557 449483 451385 452625 453852 455824 458787 462256 465581 468546 471246 473671 475670 477188 478195 478543
49543 478543 478260 477956 478551 480460 483198 485891 488045 489785 491475 493260 495011 496782 499117 502613 507128
49528 507128 511759 515775 519325 523018 527103 531420 535859 540506 545470 550910 557071 563894 570747 576909
49514 576909 582252 587043 591277 594774 597843 601089 604347 606378 606064 603585 600109 596558 592984 588926
49500 588926 583973 578067 571558 565098 559352 554671 550899 547411 543433 538600 533184 527672 522208 516736
49486 516736 511510 506915 502694 497966 492382 486807 482310 478710 474736 469635 464057 459144 455197 451626
49472 451626 447950 444353 441234 438574 435925 432837 429168 425147 421408 418809 417895 418367 419259 419713 419463
49457 419463 418636 417369 415816 414268 412995 411998 411112 410228 409300 408220 406946 405727 404982 404919 405324 405801 406155
49440 406155 406600 407616 409551 412349 415789 419917 425010 431027 437353 443100 447385 449270 448029 443933
49426 443933 438466 433261 428935 425209 421965 419656 418833 419714 422190 425867 430097 434348 438559 442887 447287
49411 447287 451738 456681 462642 469458 476439 483358 490724 498915 507598 516199 524466 532352 539848 547229
49397 547229 554980 563091 570764 577229 582591 587483 592136 596173 599169 601024 601867 601966 601678 601194 600344 598875
49381 598875 596903 594876 593138 591733 590614 589766 589051 588107 586577 584502 582417 580962 580275 579836 579069 578035
49365 578035 577311 577188 577306 577255 577229 577821 579338 581614 584393 587527 590803 593903 596684 599355 602246 605560
49349 605560 609508 614491 620818 628157 635561 642259 648345 654513 661242 668516 676182 684109 691884 698883
49335 698883 705005 711037 717810 725167 732137 738059 743115 747834 752477 757058 761587 766073 770420 774494
49321 774494 778300 782080 786216 790854 795613 799886 803563 807159 811005 814714 817822 820613 823736 827186
49307 827186 830273 832501 833900 834531 834374 833848 833889 835140 837442 840200 842834 844762 845542 845476 845772 847652
49291 847652 851296 855721 859628 862397 864551 867273 871236 875936 880404 884364 888353 892887 898097 904055
49277 904055 910753 917704 924267 930503 937027 943842 949975 954546 957518 959124 959297 958070 955879 952900
49263 952900 948687 942993 936442 929834 923286 916644 910177 904107 897889 890854 883396 876699 871265 866344
49249 866344 860881 854515 847642 840965 835071 830076 825557 821030 816427 812049 808246 805327 803427 802144
49235 802144 800682 798746 797025 796384 796849 797753 798518 798856 798549 797675 796807 796403 796172 795628 795041 795218 796447
49218 796447 798343 800684 803733 807640 812046 816400 820270 823401 825944 828578 831924 835835 839678 843244
49204 843244 846885 850891 855330 860396 866259 872542 878619 884529 890903 897872 904756 911054 917132 923601
49190 923601 930616 938159 946417 955425 964722 973767 982404 990652 998501 1006311 1014947 1024923 1035613 1045853
49176 1045853 1055234 1064353 1073783 1083298 1092271 1100558 1108726 1117460 1126929 1136767 1146569 1156233 1165874 1175731
49162 1175731 1186287 1198128 1211333 1225219 1239075 1252954 1267231 1281610 1295207 1307687 1319674
49151 1319674 1331903 1344579 1357771 1371782 1386724 1402244 1418167 1435023 1453377 1472900 1492610
49140 1492610 1511841 1530522 1548621 1565908 1582324 1598126 1613529 1628513 1643128 1657686 1672395
49129 1672395 1686923 1700593 1713043 1724617 1736037 1747772 1759807 1771951 1784198 1796708 1809654
49118 1809654 1823248 1837786 1853284 1868991 1883508 1895663 1905419 1913986 1922920 1932651 1941552 1946614
49106 1946614 1945585 1938732 1928481 1917411 1906747 1896461 1886181 1875704 1865029 1854340 1844100 1835064
49094 1835064 1828098 1823742 1821805 1821538 1822352 1824118 1826612 1829065 1830853 1832324 1834238 1836435 1837817 1837799 1836988
49079 1836988 1836093 1834904 1832883 1830178 1827342 1824346 1820607 1815884 1810552 1804915 1798800 1792023 1784908 1778088
49065 1778088 1771911 1766193 1760479 1754367 1747603 1739980 1731382 1721996 1712362 1703037 1694295 1686192 1678696 1671461
49051 1671461 1663821 1655500 1647243 1640160 1634397 1629003 1623217 1617284 1611790 1606891 1602640 1599424 1597399 1595832
49037 1595832 1593698 1590772 1587586 1584476 1581321 1578225 1575752 1574230 1573216 1571945 1570064 1567776 1565469 1563417
49023 1563417 1561731 1560458 1559690 1559584 1560214 1561438 1562974 1564607 1566330 1568451 1571594 1576367 1582753 1589916 1596790
49008 1596790 1602874 1608422 1614024 1620164 1626960 1634101 1641081 1647662 1654031 1660339 1666228 1671130 1674968 1678282
48994 1678282 1681663 1685307 1689169 1693268 1697659 1702206 1706511 1710099 1712677 1714248 1715013 1715196 1715001 1714680 1714454
48979 1714454 1714307 1714052 1713690 1713539 1713804 1714214 1714363 1714413 1715221 1717599 1721503 1726022 1730215 1733985 1738056 1743099
48963 1743099 1749009 1755171 1761268 1767481 1773989 1780662 1787334 1794028 1800728 1807363 1814238 1822131 1831550 1842084
48949 1842084 1852831 1863328 1873806 1884724 1896414 1909134 1923113 1938532 1955613 1974652 1995739
48938 1995739 2018577 2042838 2068659 2096512 2126681 2159104 2193579 2229866 2267663 2306806 2347381
48927 2347381 2389345 2432140 2475087 2518128 2561713 2605919 2650154 2693853 2737001 2779723 2821750
48916 2821750 2862650 2902291 2940683 2977563 3012619 3046056 3078495 3110175 3140546 3168886 3195147
48905 3195147 3220029 3244302 3268222 3291549 3313893 3335007 3354925 3373983 3392565 3410700 3427929
48894 3427929 3443770 3458193 3471429 3483399 3493664 3502072 3509025 3514796 3518859 3520323 3518974 3515492 3510565
48881 3510565 3504074 3495188 3483059 3467378 3448591 3427687 3405491 3381907 3355944 3326660 3294017 3258726
48869 3258726 3221506 3182721 3142588 3101293 3058822 3015019 2970144 2925200 2881403 2839215 2798082
48858 2798082 2757220 2716555 2676872 2639135 2603849 2571009 2540457 2512140 2486022 2461919 2439646
48847 2439646 2419435 2402032 2388151 2377811 2370435 2365551 2363027 2362510 2363134 2364282 2366429 2370686 2377481
48834 2377481 2386153 2395858 2406435 2418107 2430765 2443912 2457202 2470804 2485322 2501431 2519314 2538257
48822 2538257 2557003 2574778 2591849 2608869 2625894 2642421 2658273 2674023 2690430 2707754 2725801
48811 2725801 2744425 2763785 2784171 2805751 2828380 2851532 2874443 2896534 2917778 2938514 2958856
48800 2958856 2978466 2997106 3015207 3033512 3052164 3070556 3088173 3105077 3121336 3136480 3150068
48789 3150068 3162471 3174503 3186448 3197957 3208766 3218800 3227595 3234480 3239644 3244334 3249510 3254682
48777 3254682 3258549 3260428 3260606 3259531 3257147 3252974 3246506 3237570 3226474 3213739 3199485 3183230 3164542
48764 3164542 3143746 3121798 3099461 3076786 3053349 3028917 3003838 2978678 2953394 2927152 2899368
48753 2899368 2870854 2843370 2818028 2794618 2772590 2752004 2733185 2716015 2700074 2685157 2671262
48742 2671262 2658440 2647083 2637991 2631763 2628313 2627308 2628635 2632091 2637085 2643228 2650842 2660225 2670668
48729 2670668 2680896 2690361 2699490 2708760 2718145 2727465 2736626 2745378 2753365 2760582 2767437 2774195 2780601 2786136
48715 2786136 2790539 2794073 2797378 2800833 2803964 2805796 2805935 2804846 2802779 2799140 2793603 2787304 2781933 2777809
48701 2777809 2773694 2768462 2762149 2755396 2748711 2742429 2736639 2730870 2724406 2717109 2709460 2701805 2694178 2686862
48687 2686862 2680357 2674628 2669211 2664357 2661254 2660745 2662534 2666215 2672456 2682469 2696638 2714147 2733578
48674 2733578 2753228 2770993 2784437 2791190 2789297 2777616 2756199 2726141 2688945 2646274 2600240 2553206
48662 2553206 2506878 2461940 2418836 2378323 2340796 2305584 2271592 2238444 2206499 2176029 2146950
48651 2146950 2119213 2092861 2067662 2043147 2019041 1995225 1971313 1946704 1921258 1895640 1870842
48640 1870842 1847501 1825656 1804887 1784601 1764401 1744372 1724912 1706181 1687820 1669384 1651057
48629 1651057 1633700 1617994 1603650 1589769 1575976 1562785 1550669 1539243 1527796 1516243 1505022
48618 1505022 1494299 1483997 1474516 1466578 1460222 1454687 1449548 1445305 1442472 1440687 1439165 1437519 1435708
48605 1435708 1433698 1431704 1430302 1429725 1429368 1428574 1427591 1427107 1427120 1427002 1426567 1426326 1426611 1427106 1427475 1427883 1428607 1429560
48587 1429560 1430541 1431671 1433206 1435041 1436786 1438388 1440402 1443431 1447330 1451216 1454394 1457058 1459840 1462768
48573 1462768 1465047 1465814 1464708 1461620 1456397 1449168 1440731 1432224 1424439 1417498 1410972 1404184 1396763 1389179
48559 1389179 1382506 1377388 1373428 1369755 1365917 1361956 1357936 1353762 1349308 1344464 1339232 1334019 1329556 1326255
48545 1326255 1323849 1321911 1320352 1319084 1317580 1315347 1312641 1310187 1308308 1306767 1305321 1303970 1302742 1301719
48531 1301719 1301231 1301552 1302366 1302953 1302921 1302454 1301882 1301372 1300989 1300668 1300127 1299194 1298145 1297350 1296593 1295198 1292926 1290334
48513 1290334 1288169 1286715 1285809 1285168 1284524 1283638 1282269 1280135 1277090 1273530 1270263 1267580 1264737 1260914 1256469
48498 1256469 1252576 1249717 1247303 1244795 1242371 1240252 1238161 1235856 1233557 1231355 1228761 1225390 1221689 1218423
48484 1218423 1215782 1213509 1211573 1210073 1208613 1206412 1203141 1199252 1195426 1191998 1188944 1186074 1183179 1180217
48470 1180217 1177385 1174826 1172337 1169616 1166778 1164240 1162084 1159804 1156845 1153177 1149243 1145519 1142232 1139343
48456 1139343 1136568 1133467 1129746 1125570 1121486 1117881 1114503 1110671 1106006 1100870 1095918 1091286 1086428 1080813
48442 1080813 1074530 1068090 1061842 1055805 1049938 1044240 1038562 1032577 1026101 1019275 1012290 1005030 997272 989231
48428 989231 981616 974906 968715 962180 954979 947657 940834 934415 927791 920604 912968 905136 897359 890099
48414 890099 883895 878780 874102 869134 863713 858140 852695 847474 842561 837981 833504 828773 823784 819071
48400 819071 815227 812277 809636 806700 803394 800067 796971 793996 790917 787756 784770 782180 780037 778258
48386 778258 776647 774954 773118 771438 770265 769449 768300 766313 763848 761894 761134 761343 761668 761404 760506 759515
48370 759515 759120 759678 761020 762612 763979 764974 765614 765742 765032 763335 760819 757652 753813 749451 745232 741936
48354 741936 739695 737899 735868 733311 730133 726227 721708 717094 713002 709762 707346 705420 703389 700783
48340 700783 697840 695432 694162 693807 693801 693887 693961 693680 692728 691301 689832 688423 686983 685714 684920 684400 683620
48323 683620 682471 681380 680594 679870 678930 677697 675976 673444 670232 667142 664957 663836 663508 663703 664133 664366
48307 664366 664050 663167 661904 660469 659044 657713 656328 654732 653229 652487 652840 653980 655449 657116 659026
$$ [...]
##END NTUPLES=NMR SPECTRUM
##END=
