##TITLE=NES1062_159122.0011_002_9704227_S7YpYeiwKW
##JCAMPDX= 6.0         $$ Bruker NMR JCAMP-DX V2.0
##DATA TYPE= NMR SPECTRUM
##DATA CLASS= NTUPLES
##ORIGIN= BRUKER
##OWNER= Administrator
$$ 1.72 TOPSPIN		Version 2.1
$$ 2016-10-25 16:11:12.466 -0500  Administrator@X
$$ Compression mode = diff/dup
##.OBSERVE FREQUENCY= 400.02188249412
##.OBSERVE NUCLEUS= ^1H
##.ACQUISITION MODE= SIMULTANEOUS (DQD)
##.ACQUISITION SCHEME= undefined
##.AVERAGES= 64
##.DIGITISER RES= 22
##SPECTROMETER/DATA SYSTEM= spect
##.PULSE SEQUENCE= noesygpps1d.comp
##.SOLVENT NAME= COFFEE_meoh
##.SHIFT REFERENCE= INTERNAL, COFFEE_meoh, 1, 14.96105
##AUDIT TRAIL= $$ (NUMBER, WHEN, WHO, WHERE, PROCESS, VERSION, WHAT)
$$ ##TITLE= Audit trail, TOPSPIN		Version 2.1
$$ ##JCAMPDX= 5.01
$$ ##ORIGIN= Bruker BioSpin GmbH
$$ ##OWNER= Administrator
$$ $$ E:\/data/COFFEE/nmr/NES1062_159122.0011_002_9704227_S7YpYeiwKW/12/pdata/1/auditp.txt
$$ ##AUDIT TRAIL=  $$ (NUMBER, WHEN, WHO, WHERE, PROCESS, VERSION, WHAT)
(   1,<2016-04-30 15:29:12.021 -0700>,<Administrator>,<X>,<go>,<TOPSPIN 2.1>,
      <created by zg
	started at 2016-04-30 15:17:42.521 -0700,
	POWCHK enabled, PULCHK disabled,
       configuration hash MD5:
       21 0F 79 D6 B3 7B B4 F6 88 20 88 DB 03 48 BD 9F
       data hash MD5: 64K
       C6 18 56 35 A4 8E 67 4D 35 5D 95 4B 65 04 3C 33>)
(   2,<2016-04-30 15:29:15.333 -0700>,<Administrator>,<X>,<proc1d>,<TOPSPIN 2.1>,
      <Start of raw data processing
       efp LB = 0.3 FT_mod = 6 PKNL = 1 PHC0 = 0 PHC1 = 0 SI = 128K 
       data hash MD5: 128K
       9C 12 87 59 D2 4F AE 6F 35 A1 6D CF B3 B4 BA BB>)
(   3,<2016-04-30 15:29:16.239 -0700>,<Administrator>,<X>,<proc1d>,<TOPSPIN 2.1>,
      <pk PHC0 = -82.89734 PHC1 = 0 
       data hash MD5: 128K
       29 8E 3F FD 56 61 F2 E7 57 4E D0 91 11 77 16 9D>)
(   4,<2016-04-30 15:29:16.630 -0700>,<Administrator>,<X>,<proc1d>,<TOPSPIN 2.1>,
      <abs ABSG = 1 
       data hash MD5: 128K
       8A 69 26 60 E1 1C 1C 3A 6E 7C FE 2F 7B 4A 05 58>)
(   5,<2016-04-30 15:29:16.724 -0700>,<Administrator>,<X>,<proc1d>,<TOPSPIN 2.1>,
      <abs ABSG = 2 
       data hash MD5: 128K
       E8 D1 2B 7C CA 82 A2 C6 D6 F5 79 C4 03 EE D9 DA>)
(   6,<2016-04-30 15:29:16.802 -0700>,<Administrator>,<X>,<proc1d>,<TOPSPIN 2.1>,
      <abs ABSG = 3 
       data hash MD5: 128K
       2A EE 1C B2 6B E5 D7 B8 AE 29 08 C3 16 4B C0 67>)
(   7,<2016-04-30 15:29:16.896 -0700>,<Administrator>,<X>,<proc1d>,<TOPSPIN 2.1>,
      <abs ABSG = 4 
       data hash MD5: 128K
       9F 10 C6 CB 3E E3 20 8B E0 9E F8 EF C6 73 4D 94>)
(   8,<2016-04-30 15:29:17.021 -0700>,<Administrator>,<X>,<proc1d>,<TOPSPIN 2.1>,
      <abs ABSG = 5 
       data hash MD5: 128K
       D0 EB 2A AD D4 61 2B 9F CB E7 66 72 4B 15 BC 10>)
(   9,<2016-04-30 15:29:18.911 -0700>,<Administrator>,<X>,<audit>,<TOPSPIN 2.1>,
      <user comment:
       ICON-NMR User ID: COFFEE
       data hash MD5: 128K
       D0 EB 2A AD D4 61 2B 9F CB E7 66 72 4B 15 BC 10>)
$$ ##END=
$$ 
$$ $$ hash MD5
$$ [...]
##$TP07= 0
##$TPNAME0= <>
##$TPNAME1= <>
##$TPNAME2= <>
##$TPNAME3= <>
##$TPNAME4= <>
##$TPNAME5= <>
##$TPNAME6= <>
##$TPNAME7= <>
##$TPOAL= (0..7)
0.5 0.5 0.5 0.5 0.5 0.5 0.5 0.5
##$TPOFFS= (0..7)
0 0 0 0 0 0 0 0
##$TUNHIN= 0
##$TUNHOUT= 0
##$TUNXOUT= 0
##$USERA1= <user>
##$USERA2= <user>
##$USERA3= <user>
##$USERA4= <user>
##$USERA5= <user>
##$V9= 5
##$VALIST= <valist>
##$VCLIST= <CCCCCCCCCCCCCCC>
##$VD= 0
##$VDLIST= <DDDDDDDDDDDDDDD>
##$VPLIST= <PPPPPPPPPPPPPPP>
##$VTLIST= <TTTTTTTTTTTTTTT>
##$WBST= 2048
##$WBSW= 25
##$XGAIN= (0..3)
0 0 0 0
##$XL= 0
##$YL= 0
##$YMAX_a= 5392622
##$YMIN_a= -9637635
##$ZGOPTNS= <>
##$ZL1= 120
##$ZL2= 120
##$ZL3= 120
##$ZL4= 120
##$ABSF1= 14.96105
##$ABSF2= -5.597132
##$ABSG= 5
##$ABSL= 3
##$ALPHA= 0
##$AQORDER= 0
##$ASSFAC= 0
##$ASSFACI= 0
##$ASSFACX= 0
##$ASSWID= 0
##$AUNMP= <proc_prof1d_extract.lims>
##$AXLEFT= 0
##$AXNAME= <>
##$AXNUC= <1H>
##$AXRIGHT= 0
##$AXTYPE= 0
##$AXUNIT= <>
##$AZFE= 0.1
##$AZFW= 0.1
##$BCFW= 0
##$BC_mod= 0
##$BYTORDP= 0
##$COROFFS= 0
##$CY= 15
##$DATMOD= 1
##$DC= 0
##$DFILT= <>
##$DTYPP= 0
##$F1P= 0
##$F2P= 0
##$FCOR= 0.5
##$FTSIZE= 131072
##$FT_mod= 6
##$GAMMA= 0
##$GB= 0
##$INTBC= 1
##$INTSCL= 1
##$ISEN= 128
##$LB= 0.3
##$LEV0= 0
##$LPBIN= 0
##$MAXI= 10000
##$MC2= 0
##$MEAN= 0
##$ME_mod= 0
##$MI= 0
##$NCOEF= 0
##$NC_proc= -2
##$NLEV= 6
##$NOISF1= 0
##$NOISF2= 0
##$NSP= 0
##$NTH_PI= 0
##$NZP= 0
##$OFFSET= 14.96105
##$PC= 1
##$PHC0= -82.89734
##$PHC1= 0
##$PH_mod= 1
##$PKNL= yes
##$PPARMOD= 0
##$PPDIAG= 0
##$PPIPTYP= 0
##$PPMPNUM= 2147483647
##$PPRESOL= 1
##$PSCAL= 4
##$PSIGN= 0
##$PYNMP= <proc.py>
##$REVERSE= no
##$SF= 400.020009615657
##$SI= 131072
##$SIGF1= 0
##$SIGF2= 0
##$SINO= 400
##$SIOLD= 131072
##$SPECTYP= <>
##$SREGLST= <1H.CDCl3>
##$SSB= 0
##$STSI= 131072
##$STSR= 0
##$SW_p= 8223.68421052631
##$SYMM= 0
##$S_DEV= 0
##$TDeff= 65536
##$TDoff= 0
##$TI= <>
##$TILT= no
##$TM1= 0
##$TM2= 0
##$TOPLEV= 0
##$USERP1= <user>
##$USERP2= <user>
##$USERP3= <user>
##$USERP4= <user>
##$USERP5= <user>
##$WDW= 1
##$XDIM= 131072
##$YMAX_p= 288131869
##$YMIN_p= -11150
##$CURPLOT= <Network HP LaserJet P1505>
##$CURPRIN= <$Network HP LaserJet P1505>
##$DFORMAT= <normdp>
##$LAYOUT= <+/1D_H.xwp>
##$LFORMAT= <normlp>
##$PFORMAT= <normpl>
##$SURQMSG= 1
$$ End of Bruker specific parameters
$$ ---------------------------------
##NTUPLES= NMR SPECTRUM
##VAR_NAME=  FREQUENCY,     SPECTRUM/REAL,   SPECTRUM/IMAG
##SYMBOL=    X,             R,               I
##VAR_TYPE=  INDEPENDENT,   DEPENDENT,       DEPENDENT
##VAR_FORM=  AFFN,          ASDF,            ASDF
##VAR_DIM=   131072,        131072,          131072
##UNITS=     HZ,            ARBITRARY UNITS, ARBITRARY UNITS
##FACTOR=    0.0627417313425164, 1,          1
##FIRST=     8223.62146879497, -1652,        -51358
##LAST=      0,             1381,            -51972
##MIN=       0,             -11150,          0
##MAX=       8223.62146879497, 288131869,    0
$$ Real data points
##PAGE= N=1
##DATA TABLE= (X++(R..R)), XYDATA
$$ [...]
63838A42391l511m109m392m102l457l022k877k560k051k075k983m011m224l687
63824I5330l005k247j084K21Q75N58k24q64j142j091q38o25n71m73k18k02q11
63807H3589j612j752j139m97k36l5K62J35o97j546j584r49m60m93p24q33q29p26
63789F9874m06Q0M64O47Q04J000R91N72m8m36m12j95r5j72k66k93l85o42q84q12
63769F9386m40j28j53l75m96m31l07k06j13n0l6L8L09O90R02Q25O99P90J019J061
63749G2984P95M59K70J07k26n06k45O02J431J637J249P30M13M71J120K308L335
63732H6934L392K608K001K176K627K652K422K536K835K458J115l48r55p04l54
63717A11395l78n90p25r51j520k241k572k324j912j787j776j382o15j51m08q48
$$ y = [142391, 138880, 134771, 130379, 126277, 122820, 119798, 116921, 114361, 112310, 110235, 107252, 103241, 99017, 95330, 92325, 90078, 88994, 89215, 90090, 90648, 90424, 89560, 88418, 87327, 86489, 85864, 85293, 84820, 84602, 84400, 83589, 81977, 80225, 79086, 78589, 78353, 78318, 78580, 78715, 78018, 76472, 74888, 73939, 73479, 72986, 72262, 71429, 70600, 69874, 69468, 69548, 70012, 70659, 71463, 72463, 73454, 74026, 73978, 73542, 73130, 72935, 72840, 72668, 72402, 72109, 71724, 71082, 70198, 69386, 68946, 68818, 68665, 68290, 67794, 67363, 67056, 66850, 66737, 66687, 66651, 66689, 66998, 67688, 68590, 69415, 70114, 70904, 71923, 72984, 73779, 74238, 74508, 74615, 74389, 73883, 73638, 74240, 75671, 77308, 78557, 79287, 79700, 80171, 81291, 83599, 86934, 90326, 92934, 94935, 97111, 99738, 102390, 104812, 107348, 110183, 112641, 113756, 113408, 112453, 111749, 111395, 111017, 110427, 109702, 108751, 107231, 104990, 102418, 100094, 98182, 96395, 94619, 93237, 92622, 92471, 92063, 91215]
63701I1215n92L91J202J158O54N73J184J987K556L042L677M242M320L886L218
63686A22713K415J400M21k0R6J18l61q29n55L59J156J503J730K047K155J837J400
63669A37585J250J333J236O30n48j979l015l188k818k664k895k884k295j642j455
63654A16651j433j082o37o06p62m81J08K25k41m32K25J145J491J300J229J549
63638A18249J909J990J963K280L190M451N489N918N969O139O538O895P264Q208
63624A86452J0022J2164J3833J4873J5726J6723J7823J8963K0192K1452K2460
63613C70683K2985K3005K2558K1540J9668J6615J2315P244K323j613m258n728
63601E07337o216n985n468n113n124n518o379p864r999j2592j5288j7581j8934
$$ y = [91215, 90623, 91014, 92216, 93374, 94028, 94601, 95785, 97772, 100328, 103370, 107047, 111289, 115609, 119495, 122713, 125128, 126528, 126949, 126929, 127025, 127143, 126782, 125953, 125398, 125757, 126913, 128416, 130146, 132193, 134348, 136185, 137585, 138835, 140168, 141404, 142034, 141486, 139507, 136492, 133304, 130486, 127822, 124927, 122043, 119748, 118106, 116651, 115218, 114136, 113499, 112893, 112131, 111650, 111758, 111983, 111742, 111310, 111535, 112680, 114171, 115471, 116700, 118249, 120158, 122148, 124111, 126391, 129581, 134032, 139521, 145439, 151408, 157547, 164085, 170980, 178244, 186452, 196474, 208638, 222471, 237344, 253070, 269793, 287616, 306579, 326771, 348223, 370683, 393668, 416673, 439231, 460771, 480439, 497054, 509369, 516613, 518936, 517323, 513065, 507337, 501121, 495136, 489668, 484555, 479431, 473913, 467534, 459670, 449671, 437079, 421791, 404210, 385276]
63588C85276j9144j8564j7739j6910j6014j4973j3663j1837r584p628o593n959
63576B26668m478j920L76J223J256K061L977N694O179O055O617Q082R525J0285
63562B81600J0718J1483J2633J3757J4716J5826J7305J8948K0435K1701K2717
63551D61839K3023K1911J9132J5237J1004O790K612j299m401o272o913o597n649
63538E30417m481l567l231l537m452o004q213j0956j3930j6720j8853k0035k0410
63525C96028k0429k0353k0071j9468j8677j7714j6175j3784j1182r617r571j0090
63513B08897r804q407o783n768n254m683l936l407l229k998k361j546j054r51
63499A48716q56n01l6K95M33K90l38j402k303k332j444l20L45N50Q82J806L078
$$ y = [385276, 366132, 347568, 329829, 312919, 296905, 281932, 268269, 256432, 246848, 239220, 232627, 226668, 222190, 220270, 220646, 221869, 223125, 225186, 229163, 234857, 241036, 247091, 253708, 261790, 271315, 281600, 292318, 303801, 316434, 330191, 344907, 360733, 378038, 396986, 417421, 439122, 461839, 484862, 506773, 525905, 541142, 552146, 558936, 561548, 560249, 555848, 549576, 542663, 536066, 530417, 525936, 522369, 519138, 515601, 511149, 505145, 496932, 485976, 472046, 455326, 436473, 416438, 396028, 375599, 355246, 335175, 315707, 297030, 279316, 263141, 249357, 238175, 228558, 218987, 208897, 199093, 190686, 183903, 178135, 172881, 168198, 164262, 160855, 157626, 154628, 152267, 150721, 149667, 148716, 147860, 147359, 147323, 147618, 148051, 148341, 148003, 146601, 144298, 141966, 140522, 140202, 140547, 141097, 141979, 143785, 146863]
63482A46863L900L746K945K249J870J333M03l75m31l9R7j01r2K07J05r01k369
63465A59410l424l617l038j960p81nJ04k23n37n41p0R34K156K944K967K660K661
63448A59640L073L639M388N559P017Q211Q775Q819Q666Q630Q981R721J0385J0607
63434B66111J0845J1976J4106J6298J7785J8895K0435K2580K4909K7162K9414
63423D80516L1633L3465L4412L3964L1676K7557K2246J6457J0415M206j470n496
63411G19581p416p861p791p741p889q369r202j0290j1759j4021j7180k0665k3700
63398E65697k5885k7006k6772k5218k3148k1502k0333j8941j6952j4675j2392
63387C32873r984p537n623m583l882k658o16J901M394O457P813Q591R359J0534
$$ y = [146863, 150763, 154509, 157454, 159703, 161573, 162906, 163309, 162934, 162503, 162464, 162561, 162460, 162368, 162575, 162680, 161779, 159410, 155986, 152369, 149331, 147371, 146590, 146585, 146689, 146466, 145929, 145388, 145318, 146252, 148408, 151352, 154319, 156979, 159640, 162713, 166352, 170740, 176299, 183316, 191527, 200302, 209121, 217787, 226417, 235398, 245119, 255504, 266111, 276956, 288932, 303038, 319336, 337121, 356016, 376451, 399031, 423940, 451102, 480516, 512149, 545614, 580026, 613990, 645666, 673223, 695469, 711926, 722341, 726547, 725077, 719581, 712165, 704304, 696513, 688772, 680883, 672514, 663312, 653022, 641263, 627242, 610062, 589397, 565697, 539812, 512806, 486034, 460816, 437668, 416166, 395833, 376892, 359940, 345265, 332873, 322889, 315352, 309729, 305146, 301264, 298606, 297990, 299891, 304285, 310742, 318555, 327146, 336505, 347039]
63373C47039J1877J2879J3453J3889J4363J4924J5778J7161J8994K1035K3170
63362E24562K5118K6176K5816K4386K2549K0140J6386J1275N890J200k696n854
63350F94948p883q588q545q415q204p831p920r272j1820j4788j7727k0717k3664
63337E39574k5996k7179k7121k6048k4366k2570k0894j9081j6840j4412j2340
63326C02727j0786r492q302p339o664o201n945n867n690n131m302l555l000k579
63312B17874k415k582k635j967o44O55J510K060K398K359J969J550J169O18L7
63297B21956j02Q0k56j474k810l431l539l817m306m509m335m096l840l313k542
63282A79666j845j266o06kJ00l00n75k44M08O96K61o94j643k042j664p93L5N54
$$ y = [347039, 358916, 371795, 385248, 399137, 413500, 428424, 444202, 461363, 480357, 501392, 524562, 549680, 575856, 601672, 626058, 648607, 668747, 685133, 696408, 702298, 703498, 700802, 694948, 687065, 678477, 669932, 661517, 653313, 645482, 637562, 628290, 616470, 601682, 583955, 563238, 539574, 513578, 486399, 459278, 433230, 408864, 386294, 365400, 346319, 329479, 315067, 302727, 291941, 282449, 274147, 266808, 260144, 253943, 247998, 242131, 236441, 231310, 227008, 223453, 220453, 217874, 215459, 212877, 210242, 208275, 207631, 208286, 209796, 211856, 214254, 216613, 218582, 220132, 221301, 221919, 221956, 221854, 221934, 221678, 220204, 217394, 213963, 210424, 206607, 202301, 197792, 193457, 189361, 185521, 182208, 179666, 177821, 176555, 175949, 175947, 176047, 175747, 175172, 174928, 175336, 176032, 176293, 175599, 173956, 171914, 170250, 169457, 169492, 170046]
63264A70046R19J348J832K231K505K671K713K626K545K703L253M029M589M606
63250B08616M364M616N704P052P818P980Q334R433J0978J2337J3325J4115J4751
63237C29423J5185J5662J6597J7928J8937J8969J8158J7221J6656J6413J6277
63226E17426J6261J6449J6761J7088J7471J7959J8382J8548J8407J7794J6156
63215G08702J3051Q872M558N86l266p115j0551j3328j5793j8189j9997k0597k0206
63202F06727j9431j8152j5747j2345r081o882n653m835m097l164j637M59K429
63189E08591L827N291P754J0993J3709J5092J5678J6427J7460J8120J7942J7136
63177F68020J6267J5832J6021J6592J6901J6362J4909J2842J0307P204L574l03
$$ y = [170046, 170965, 172313, 174145, 176376, 178881, 181552, 184265, 186891, 189436, 192139, 195392, 199421, 204010, 208616, 212980, 217596, 223300, 230352, 238170, 246150, 254484, 263917, 274895, 287232, 300557, 314672, 329423, 344608, 360270, 376867, 394795, 413732, 432701, 450859, 468080, 484736, 501149, 517426, 533687, 550136, 566897, 583985, 601456, 619415, 637797, 656345, 674752, 692546, 708702, 721753, 730625, 735183, 735769, 732503, 725388, 714837, 701509, 685716, 667527, 647530, 626933, 606727, 587296, 569144, 553397, 541052, 531971, 525089, 519436, 514601, 510504, 507340, 505703, 506162, 508591, 512418, 517709, 525463, 536456, 550165, 565257, 580935, 597362, 614822, 632942, 650884, 668020, 684287, 700119, 716140, 732732, 749633, 765995, 780904, 793746, 804053, 811257, 814831, 814528]
63165H14528m257q375j2621j6697k0439k3975k7188k9429l0208k9885k9098k7829
63153E54527k5724k3160k1085j9692j8126j5898j3731j2431j1647j0452q754p236
63141C66591o203n266m115k873j714p19j50k55o13l35R39K603L834M346M310L967
63125C64347L516L055K406J376J99o31j104j775k912m057m682m840m874m841m607
63110C40576m176l603k847j990j317q68l22L58O51L23M5N39J469J916J747J670
63094C34171K012K330K344K402K769L165L369L578L803L654L198L330M516N759
63080C80400N707M519L681M075N135N966O424O762P016P192P585Q379R277J0015
63066D72133J0836J2076J3511J4647J5553J6841J8883K1381K3775K5810K7664
$$ y = [814528, 810271, 801896, 789275, 772578, 752139, 728164, 700976, 671547, 641339, 611454, 582356, 554527, 528803, 505643, 484558, 464866, 446740, 430842, 417111, 404680, 393033, 382581, 373827, 366591, 360388, 355122, 351007, 348134, 346420, 345701, 345551, 345296, 344683, 344348, 345287, 347890, 351724, 356070, 360380, 364347, 367863, 370918, 373324, 374700, 374899, 374268, 373164, 371389, 368477, 364420, 359738, 354898, 350024, 345183, 340576, 336400, 332797, 329950, 327960, 326643, 325775, 325453, 325811, 326462, 326785, 326830, 327369, 328838, 330754, 332501, 334171, 336183, 338513, 340857, 343259, 346028, 349193, 352562, 356140, 359943, 363597, 366795, 370125, 374641, 380400, 386107, 390626, 394307, 398382, 403517, 409483, 415907, 422669, 429685, 436877, 444462, 452841, 462118, 472133, 482969, 495045, 508556, 523203, 538756, 555597, 574480, 595861, 619636, 645446, 673110]
63055F73110K9718L2169L4720L6759L8011L8795L9417L9598L8923L7607L6376
63044A075203L5683L5500L5759L6431L7178L7541L7523L7413L6950L5359L2384
63033A472924K8547K4068J8288J0743K119o509j4961k3617l2197l9732m5663n0165
63021A343845n3356n4834n4207n1537m7195m1708l5848l0331k5259k0209j4943
63010I14418r662m520O27N900J1183J6318K1093K5088K7954K9933L1593L2983
62998A102908L3664L3656L3670L4087L4367L3954L3112L2284L1133K8969K5793
62987A457597K2160J8113J2953O122k177j1344k0807l0001l8306m5343n1143n5924
62975A261900n9766o2518o3855o3499o1558n8563n5098n1392m7444m3358l9387
$$ y = [673110, 702828, 734997, 769717, 806476, 844487, 883282, 922699, 962297, 1001220, 1038827, 1075203, 1110886, 1146386, 1182145, 1218576, 1255754, 1293295, 1330818, 1368231, 1405181, 1440540, 1472924, 1501471, 1525539, 1543827, 1554570, 1556689, 1550180, 1535219, 1511602, 1479405, 1439673, 1394010, 1343845, 1290489, 1235655, 1181448, 1129911, 1082716, 1041008, 1005160, 974829, 949570, 929361, 914418, 904756, 900236, 900863, 906763, 917946, 934264, 955357, 980445, 1008399, 1038332, 1069925, 1102908, 1136572, 1170228, 1203898, 1237985, 1272352, 1306306, 1339418, 1371702, 1402835, 1431804, 1457597, 1479757, 1497870, 1510823, 1516945, 1514768, 1503424, 1482617, 1452616, 1414310, 1368967, 1317824, 1261900, 1202134, 1139616, 1075761, 1012262, 950704, 892141, 837043, 785651, 738207, 694849, 655462]
62964F55462l5721l2438k9498k6652k3653k0764j8743j7858j7237j5737j3411
62953D03750j1423j0545j0346j0012r377q789q464q324q196p892p325o767o746
62940B89544p331p807p337n871m123k822k198k058k039j863j515j205j032r00
62926B41443p81q75j188j256o67K45O57J84p13j311j311q92m19k25m45q73j132
62909B30441j113j095j416k036k569k635k163j438q23m27o4L38M98J94k43k76
62893B15173K5N2l65n86q8O67R21P52Q97J487J718J003j74q84q66o21o21q33r48
62874B16709q19n26k44j14j89m15o90q97r40p94n09j60J75L42K11o2k5N23J169
62855B12745J356J147J043J132R24K08m65m76J04P67J218J402J193N45k07o46
$$ y = [655462, 619741, 587303, 557805, 531153, 507500, 486736, 467993, 450135, 432898, 417161, 403750, 392327, 381782, 371436, 361424, 352047, 343258, 334794, 326470, 318274, 310382, 303057, 296290, 289544, 282213, 274406, 267069, 261198, 257075, 254253, 252055, 249997, 247958, 246095, 244580, 243375, 242343, 241443, 240662, 239787, 238599, 237343, 236676, 236921, 237578, 237762, 237049, 235738, 234427, 233535, 233116, 232891, 232446, 231573, 230441, 229328, 228233, 226817, 224781, 222212, 219577, 217414, 215976, 215153, 214726, 214662, 215000, 215498, 215692, 215449, 215173, 215198, 215250, 214885, 214299, 214211, 214878, 215799, 216551, 217448, 218935, 220653, 221656, 221482, 220598, 219732, 219111, 218490, 217657, 216709, 215890, 215364, 215120, 215006, 214817, 214402, 213712, 212815, 211875, 211081, 210572, 210412, 210587, 210929, 211140, 211078, 211053, 211576, 212745, 214101, 215248, 216291, 217423, 218347, 218555, 218090, 217614, 217718, 218485, 219703, 221105, 222298, 222843, 222636, 221990]
62839B21990p92r67j271j445j199m41N82J219Q33l10r80l73Q22J353J164J312
62823B21497K237L093L073K539K336K637K972L048L011L122L548M290N039N352
62809B67794N154M815M618M526M602N227O520P957Q893R218R242R282R696J0930
62795C68474J3050J5471J7583J9461K1714K4778K8648L2988L7219M0837M4019
62784F64242M7596N2012N6704O0870O4403O7540O9912P0714O9615O6810O2277
62773A352695N5646M6815L6192K4401J2184L08j0984k2168l3372m3435n1037n6499
62761A310746o1212o5259o7049o5852o3319o1451o0088n7681n3810m9548m5607
62750F59870m1571l7231l3417l0902k9148k6901k3685k0209j7442j5705j4634
$$ y = [221990, 221198, 220231, 218960, 217515, 216316, 215875, 216457, 217676, 218509, 218199, 217219, 216846, 217668, 219021, 220185, 221497, 223734, 226827, 229900, 232439, 234775, 237412, 240384, 243432, 246443, 249565, 253113, 257403, 262442, 267794, 272948, 277763, 282381, 286907, 291509, 296736, 303256, 311213, 320106, 329324, 338566, 347848, 357544, 368474, 381524, 396995, 414578, 434039, 455753, 480531, 509179, 542167, 579386, 620223, 664242, 711838, 763850, 820554, 881424, 945827, 1013367, 1083279, 1153993, 1223608, 1290418, 1352695, 1408341, 1455156, 1491348, 1515749, 1527933, 1528241, 1517257, 1495089, 1461717, 1418282, 1367245, 1310746, 1249534, 1184275, 1117226, 1051374, 988055, 926604, 866516, 808835, 755025, 705477, 659870, 618299, 581068, 547651, 516749, 487601, 460700, 437015, 416806, 399364, 383659, 369025]
62739C69025j3696j2574j1199r593p816o089m764m032l660l207k433j435m22N18
62725B88623J422K361L317M107M531M714N266O776R159J1604J3331J4388J5555
62712C85154J7449J9885K2294K4671K7666L1564L5647L9109M2372M6666N2247
62701G44724N7805O2054O5216O8223P0919P1997P0628O7242O2495N6167M7610
62690A445080L6792K4462J1474j612j4445k6726l8130m8175n6232o1929o5554
62679A205005o7793o9028o9064o7601o4782o1181n7293n3208m8786m4113l9624
62668E62532l5764l2606k9913k7541k5464k3452k1036j8149j5470j3717j2668
62657C06752j1418r668q221p841q080p803o647n417m958n204n477n312m670l678
$$ y = [369025, 355329, 342755, 331556, 321963, 314147, 308058, 303294, 299262, 295602, 292395, 289962, 288527, 288105, 288623, 290045, 292406, 295723, 299830, 304361, 309075, 314341, 321117, 330276, 341880, 355211, 369599, 385154, 402603, 422488, 444782, 469453, 497119, 528683, 564330, 603439, 645811, 692477, 744724, 802529, 864583, 929799, 998022, 1068941, 1140938, 1211566, 1278808, 1341303, 1397470, 1445080, 1481872, 1506334, 1517808, 1516196, 1501751, 1475025, 1436895, 1388720, 1332488, 1270559, 1205005, 1137212, 1068184, 999120, 931519, 866737, 805556, 748263, 695055, 646269, 602156, 562532, 526768, 494162, 464249, 436708, 411244, 387792, 366756, 348607, 333137, 319420, 306752, 295334, 285666, 277445, 269604, 261524, 253721, 247074, 241657, 236699, 231495, 226018, 220706, 216036, 212358]
62643B12358k513j477r02r12j390k029k445k320j648p74r6J82J8n06j106j351
62627A93089j004k18O28J188J294J115J149J762K607K957K776K939M028N409O047
62612B25766N881N707O004O607P455Q828J0687J2513J4088J5895J8341K1051K3361
62599C82184K5198K7072K9346L1834L4004L5346L5580L4678L2702K9658K5588
62588G23190K0739J5370R488L048l565r645j4780j9113k2912k6234k8986l1016
62576F15584l2011l1811l0842k9810k8851k7456k5410k3187k1176j9106j6665
62565C29259j4244j2461j1317j0303r153p999o981o101n341m600l696k739k198
62552B32126k237k315j875j133o39l58J43P02O31j78q45o00K06N82K28j00N11
$$ y = [212358, 209845, 208368, 207466, 206554, 205164, 203135, 200690, 198370, 196722, 195948, 195852, 196034, 196052, 195546, 194440, 193089, 192085, 191867, 192495, 193683, 194977, 196092, 197241, 199003, 201610, 204567, 207343, 210282, 214310, 219719, 225766, 231647, 237354, 243358, 249965, 257420, 266248, 276935, 289448, 303536, 319431, 337772, 358823, 382184, 407382, 434454, 463800, 495634, 529638, 564984, 600564, 635242, 667944, 697602, 723190, 743929, 759299, 768787, 771835, 768270, 758625, 743845, 724732, 701820, 675586, 646600, 615584, 583573, 551762, 520920, 491110, 462259, 434803, 409393, 386206, 365030, 345924, 329259, 315015, 302554, 291237, 280934, 271781, 263782, 256801, 250700, 245359, 240759, 237063, 234324, 232126, 229889, 227574, 225699, 224566, 223927, 223569, 223712, 224414, 225045, 224867, 224022, 223422, 223628, 224210, 224438, 224338, 224849]
62535B24849K029L471M014L950M271N394O714P565Q187R353J1390J3950J6553
62522C21690J8938K1075K3211K5703K8546L1215L3330L5132L6883L8219L8558
62511F52500L7817L6053L2846K7863K1787J5725R781L181m073j0821j6276k0974
62499G85409k5623k9811l2489l3211l2287l0260k7802k5664k4059k2316j9688
62488D82199j6352j3225j0964r566q615p550n944l981k496k098k442k755k872
62475C93339l224l992m855n600o409p345q037q128p789p472p303o932o116n212
62461C04925m930n481o145n941m706l243k391k211k219j982j336l23P36J417J746
62446B67916K386L837N604O576O265N290M568M351M208L736K957K070R69o11k489
$$ y = [224849, 226878, 230349, 234363, 238313, 242584, 247978, 254692, 262257, 270444, 279797, 291187, 305137, 321690, 340628, 361703, 384914, 410617, 439163, 470378, 503708, 538840, 575723, 613942, 652500, 690317, 726370, 759216, 787079, 808866, 824591, 834372, 837553, 833480, 822659, 806383, 785409, 759786, 729975, 697486, 664275, 631988, 601728, 573926, 548262, 524203, 501887, 482199, 465847, 452622, 441658, 432092, 423477, 415927, 409983, 406002, 403506, 401408, 398966, 396211, 393339, 390115, 386123, 381268, 375668, 369259, 361914, 353877, 345749, 337960, 330488, 323185, 316253, 310137, 304925, 299995, 294514, 288369, 282428, 277722, 274479, 272088, 269877, 267658, 265676, 264340, 264017, 264753, 266170, 267916, 270302, 274139, 279743, 286319, 292584, 297874, 302442, 306793, 311001, 314737, 317694, 319764, 320733, 320122, 317633]
62431C17633l865m129l691l557m064m579m582m425m689n193n274m789m224l904
62417B56668l635l180k658k319k175k084k037k204k690l233l223k256p10M88Q43
62402B25595P33P33Q36P05L93L30P12J318J959K677L523M385N035N172M549L356
62386B62011K334K140K678L329L768M100M418M684N080N865O768P076O573O038
62372C26862O472Q098J0369J2696J4856J6900J8994K1386K4256K7540L0916L4115
62360E53460L7207M0498M4003M6960M8179M7020M3931L9822L5088K9500K2869
62349I88537J5522Q083J103n165j0798j5995k0750k4867k8401l1705l4803l7029
62337H03732l7803l7381l6344l4641l1896k8464k5263k2554j9758j6687j4128
$$ y = [317633, 313768, 309639, 305948, 302391, 298327, 293748, 289166, 284741, 280052, 274859, 269585, 264796, 260572, 256668, 253033, 249853, 247195, 244876, 242701, 240617, 238580, 236376, 233686, 230453, 227230, 224974, 224264, 224752, 225595, 226328, 227061, 227897, 228602, 228995, 229325, 230037, 231355, 233314, 235991, 239514, 243899, 248934, 254106, 258655, 262011, 264345, 266485, 269163, 272492, 276260, 280360, 284778, 289462, 294542, 300407, 307175, 314251, 320824, 326862, 333334, 341432, 351801, 364497, 379353, 396253, 415247, 436633, 460889, 488429, 519345, 553460, 590667, 631165, 675168, 722128, 770307, 817327, 861258, 901080, 936168, 965668, 988537, 1004059, 1012142, 1013245, 1008080, 997282, 981287, 960537, 935670, 907269, 875564, 840761, 803732, 765929, 728548, 692204, 657563, 625667, 597203, 571940, 549386, 529628, 512941, 498813]
62326D98813j2780j2347j2165j2068j2116j2007j1431j0762j0709j1381j2124
62315C68923j2206j1388r977q569p610o992o226n075l806k737j966j560j551j595
62301B87665j209m99m4J32O42J472J674R65N93J588K995L215K460K373L467M559
62285C12048M810M784N038N165M903N007O079P470Q226Q446Q793R300R557R631
62271D09257R933J0482J1119J2160J4014J6373J8607K0831K3733K7352L0863L3748
62259F38472L6391L9273M2160M4378M5386M4801M2365L8317L3394K8073K2064
62248A055074J4902O978m62o350j0737j4731j9484k5203l1002l5781l9112m1225
62236H52867m2326m2356m1319l9435l6785l3231k8895k4433k0618j7813j5976
$$ y = [498813, 486033, 473686, 461521, 449453, 437337, 425330, 413899, 403137, 392428, 381047, 368923, 356717, 345329, 335352, 326783, 319173, 312181, 305955, 300880, 297074, 294337, 292371, 290811, 289260, 287665, 286456, 285957, 285913, 286045, 286687, 288159, 289833, 290798, 291391, 292979, 295974, 299189, 301649, 304022, 307489, 312048, 316858, 321642, 326680, 331845, 336748, 341755, 347834, 355304, 363530, 371976, 380769, 390069, 399626, 409257, 419190, 429672, 440791, 452951, 466965, 483338, 501945, 522776, 546509, 573861, 604724, 638472, 674863, 714136, 756296, 800674, 846060, 890861, 933226, 971543, 1004937, 1033010, 1055074, 1069976, 1076954, 1076492, 1070142, 1059405, 1044674, 1025190, 999987, 968985, 933204, 894092, 852867, 810541, 768185, 726866, 687431, 650646, 617415, 588520, 564087, 543469, 525656, 509680]
62225E09680j4863j3997j2776j1029r267q089p446o842o082n381m835m246l572
62212D01255l029k717k456k203k154k214j799n72R39J921K321K736L408L922M039
62197D03397M172M642M949M425L375K884L469M522N309N909O756P686Q107P956
62183D77558P848Q141Q399Q074P293O669O614P203Q467J0322J2403J4403J6671
62170F00065J9900K4103K8236L1209L2985L4367L5749L6470L5381L1935K6646
62159I37046K0668J4938R662M518o68n560r660j2921j5869j9056k2498k5586k7557
62146H47457k8098k7487k6184k4406k2203j9849j7753j5904j3747j0896p744n057
62134F28129l162j859j044r08j451k194k656k907l458m601n982o754o265m720
$$ y = [509680, 494817, 480820, 468044, 457015, 447748, 439659, 432213, 425371, 419289, 413908, 409073, 404827, 401255, 398226, 395509, 393053, 390850, 388696, 386482, 384683, 384111, 385050, 386971, 389292, 392028, 395436, 399358, 403397, 407569, 412211, 417160, 421585, 424960, 427844, 431313, 435835, 441144, 447053, 453809, 461495, 469602, 477558, 485406, 493547, 501946, 510020, 517313, 523982, 530596, 537799, 546266, 556588, 568991, 583394, 600065, 619965, 644068, 672304, 703513, 736498, 770865, 806614, 843084, 878465, 910400, 937046, 957714, 972652, 982314, 986832, 986164, 980604, 970944, 958023, 942154, 923098, 900600, 875014, 847457, 819359, 791872, 765688, 741282, 719079, 699230, 681477, 665573, 651826, 640930, 633186, 628129, 624967, 623108, 622064, 621156, 619705, 617511, 614855, 611948, 608490, 603889, 597907, 591153, 584888, 580168]
62120E80168l134k411k540k931l361m158n434o687p351p348o832n821m452l251
62106E14457k640k381j970j470j452k100k789k737j774m39N65R49J074J549K445
62091E01287L106K964K366K132K476K943L361M171N596P127Q231R090J0157J1346
62077E76353J2190J2649J3189J4144J5453J6978J8668K0346K1754K2946K4289
62066G68959K5886K7254K7739K7105K5509K3097J9777J5388J0008M126j468o117
62054I67263r716j2686j5575j8683k2011k5290k8105l0126l1325l1830l1572l0308
62042F80036k8172k5842k3931k2286k0241j7543j4757j2683j1549j0892j0061
62031D82079q732p016n328m148l739l932m264m367m290m371m820n503o112o438
$$ y = [580168, 577034, 574623, 572083, 569152, 565791, 561633, 556199, 549512, 542161, 534813, 527981, 522160, 517708, 514457, 511817, 509436, 507466, 505996, 504544, 502444, 499655, 496918, 495144, 494705, 495270, 496219, 497293, 498842, 501287, 504393, 507357, 509723, 511855, 514331, 517274, 520635, 524806, 530402, 537529, 545760, 554850, 565007, 576353, 588543, 601192, 614381, 628525, 643978, 660956, 679624, 699970, 721724, 744670, 768959, 794845, 822099, 849838, 876943, 902452, 925549, 945326, 960714, 970722, 974848, 973380, 967263, 957547, 944861, 929286, 910603, 888592, 863302, 835197, 805071, 773746, 741916, 710344, 680036, 651864, 626022, 602091, 579805, 559564, 542021, 527264, 514581, 503032, 492140, 482079, 473347, 466331, 461003, 456855, 453116, 449184, 444920, 440553, 436263, 431892, 427072, 421569, 415457, 409019]
62017D09019o399n998n390m910m786m798m486l728k884k308j941j569j218j027
62003C57577q85n41K2N58Q59P97K42o86j355j211o55p88j985l310l749l458l300
61986C38132l598m081m703n601o289n925m625l652l822m400m165k949j498l58
61972B82466L14K47o75j712j784q58n2j24n23l43M35J112J254R65N24J77J53M54
61954B82030P85R65J194J637K038K159K340L064M169N009N401N787O486P265P854
61939C38183Q353Q931R547J0147J0753J1139J0877R994R171Q910Q882Q479P645
61926D61011O710N721M622L845M024N027N942O199O194O638P742R340J1280J3350
61912E57645J5198J6702J8242K0158K2190K3773K4762K5501K6315K7200K8029
$$ y = [409019, 402620, 396622, 391232, 386322, 381536, 376738, 372252, 368524, 365640, 363332, 361391, 359822, 358604, 357577, 356692, 356151, 356173, 356731, 357590, 358387, 358629, 357943, 356588, 355377, 354722, 353934, 351949, 348639, 344890, 341432, 338132, 334534, 330453, 325750, 320149, 313860, 307935, 303310, 299658, 295836, 291436, 287271, 284322, 282824, 282466, 282780, 283027, 282352, 280640, 278856, 277998, 277946, 277822, 277299, 276956, 277391, 278503, 279757, 280722, 281246, 281423, 281576, 282030, 282815, 283780, 284974, 286611, 288649, 290808, 293148, 296212, 300381, 305390, 310791, 316578, 323064, 330329, 338183, 346536, 355467, 365014, 375161, 385914, 397053, 407930, 417924, 427095, 436005, 444887, 453366, 461011, 467721, 473442, 478064, 481909, 485933, 490960, 496902, 503101, 509295, 515933, 523675, 533015, 544295, 557645, 572843, 589545, 607787, 627945, 650135, 673908, 698670, 724171, 750486, 777686, 805715]
61901H05715K8759K9438L0210L1186L2185L2845L3098L3245L3273L2513L0543
61890A153010K8055K6072K4444K1881J7618J2212O531P48n206j0977j6232k1215
61878A236941k6208l0755l4138l6294l7699l8490l8484l7833l6966l5902l4316
61867H49856l2317l0420k8608k6222k3080k0027j7879j6384j4803j3028j1538
61856F15550j0424r148p253m892k543n46J018K215L122L730M003M019L912L574
61842F06337K679J111p49k403l671m641n392n962o328o204n132l171j164J48J072
61827E66530K538M775O948Q210Q523Q293P734O907N984N076L942K296L12j499
61813F36569k864l993n241o673q037r003r417r338q952q389p673o713n310l236
$$ y = [805715, 834474, 863912, 894122, 925308, 957493, 990338, 1023436, 1056681, 1089954, 1122467, 1153010, 1181065, 1207137, 1231581, 1253462, 1271080, 1283292, 1289823, 1290571, 1285365, 1274388, 1258156, 1236941, 1210733, 1179978, 1145840, 1109546, 1071847, 1033357, 994873, 957040, 920074, 884172, 849856, 817539, 787119, 758511, 732289, 709209, 689182, 671303, 654919, 640116, 627088, 615550, 605126, 595978, 588725, 583833, 581290, 580744, 581762, 583977, 587099, 590829, 594832, 598851, 602763, 606337, 609016, 610127, 609378, 606975, 603304, 598663, 593271, 587309, 580981, 574777, 569645, 566474, 565310, 565458, 566530, 569068, 573843, 580791, 589001, 597524, 605817, 613551, 620458, 626442, 631518, 635460, 637756, 638068, 636569, 633705, 629712, 624471, 617798, 609761, 600758, 591341, 582003, 573051, 564662, 556989, 550276, 544966, 541730]
61799E41730n53K169M171N183N711O501P898R703J1453J2716J3243J3193J3159
61786F46277J3780J5224J7170J9304K1547K3731K5437K6489K7483K9301L2067
61775H97810L5024L7666M0437M3873M7488N0310N2371N4780N8092O1433O3672
61764A442956O4762O5253O5126O3889O1517N8410N4494M9179M2259L4148K5173
61753B027166J5282M644o189j6828k7137l6586m4280n0025n4662n8888o2313o4277
61741A625907o4932o4883o4220o2696o0489n8034n5290n1985m8461m5464m3080
61730A006373m0683l7983l5441l3386l1466k9303k7128k5317k3711k1866j9686
61719F80403j7529j5777j4619j3996j3553j2858j1889j1149j1044j1309j1299
$$ y = [541730, 541177, 543346, 547517, 552700, 558411, 564912, 572810, 582513, 593966, 606682, 619925, 633118, 646277, 660057, 675281, 692451, 711755, 733302, 757033, 782470, 808959, 836442, 865743, 897810, 932834, 970500, 1010937, 1054810, 1102298, 1152608, 1204979, 1259759, 1317851, 1379284, 1442956, 1507718, 1572971, 1638097, 1701986, 1763503, 1821913, 1876407, 1925586, 1967845, 2001993, 2027166, 2042448, 2047092, 2040903, 2024075, 1996938, 1960352, 1916072, 1866047, 1811385, 1752497, 1690184, 1625907, 1560975, 1496092, 1431872, 1369176, 1308687, 1250653, 1195363, 1143378, 1094917, 1049453, 1006373, 965690, 927707, 892266, 858880, 827414, 798111, 770983, 745666, 721955, 700089, 680403, 662874, 647097, 632478, 618482, 604929, 592071, 580182, 569033, 557989, 546680, 535381]
61708E35381j0747r940r254q741q211p564o919o464o224o129o229o639p162p314
61694D27844p009o852p290p748p300o104n290n293n187m118k616j781j774j927
61680C57555j901j925k027j957j862k292l296m168m321l916l377k739j805n93
61666C21376O29J605K136K131J713J114L52p14j938k865l281l478l724l861l656
61651C07539l267k908k365j248L50J879K975L711M207M420M441M636N174N565
61637C35109N034L295Q38j597l614n173o245o787o997p214p379o949n638l995
61623B82688k770j959r94R3N46P2n54n64k46k60l93J8P10N01j128l229m484m520
61605B63527l808k923k281k165k406k328j505m24M0l04q68j112j090j116j305
$$ y = [535381, 524634, 514694, 505440, 496699, 488488, 480924, 474005, 467541, 461317, 455188, 448959, 442320, 435158, 427844, 420835, 413983, 406693, 398945, 391645, 385541, 380251, 374958, 369771, 365653, 363037, 361256, 359482, 357555, 355654, 353729, 351702, 349745, 347883, 345591, 342295, 338127, 333806, 329890, 326513, 323774, 321969, 321376, 322005, 323610, 325746, 327877, 329590, 330704, 331056, 330342, 328404, 325539, 322258, 318780, 315056, 311195, 307539, 304272, 301364, 298999, 297751, 298101, 299980, 302955, 306666, 310873, 315293, 319734, 324370, 329544, 335109, 340143, 343438, 344276, 342679, 339065, 333892, 327647, 320860, 313863, 306649, 299270, 292321, 286683, 282688, 279918, 277959, 276965, 277058, 277604, 277676, 277122, 276558, 276312, 276052, 275659, 275677, 276387, 276888, 275760, 272531, 268047, 263527, 259719, 256796, 254515, 252350, 249944, 247616, 246111, 245687, 245727, 245423, 244555, 243443, 242353, 241237, 239932]
61590B39932j478j303n33O29J513J569J046P63J203K065K767L068L161L315L635
61575B61352M003M232M327M506M870N183N279N459O109P025P664Q087R020J0668
61561C47784J2072J2122J0877R387Q476Q169Q146Q138P844O975N559L951K461
61548D51961J153M5p85j354j815k274k731l193l655l917l740l181k571k127j784
61533D20032j479j357j510j808k042k112j972j554q88j64M15P87J034J341J939
61518D10662K904L998M909N590O213O848P511Q442R923J1793J3564J5114J6759
61505E24230J8521J9940K0882K1970K3683K5599K7050K8106K9221L0265L0783
61494H00250L1014L1644L2425L2003K9586K6020K2655J9707J6394J2386Q243M554
$$ y = [239932, 238454, 237151, 236618, 237247, 238760, 240329, 241375, 242138, 243341, 245406, 248173, 251241, 254402, 257717, 261352, 265355, 269587, 273914, 278420, 283290, 288473, 293752, 299211, 305320, 312345, 320009, 328096, 337116, 347784, 359856, 371978, 382855, 392242, 400718, 408887, 417033, 425171, 433015, 439990, 445549, 449500, 451961, 453114, 453159, 452374, 451020, 449205, 446931, 444200, 441007, 437352, 433435, 429695, 426514, 423943, 421816, 420032, 418553, 417196, 415686, 413878, 411836, 409724, 407752, 406198, 405310, 405146, 405561, 406348, 407382, 408723, 410662, 413566, 417564, 422473, 428063, 434276, 441124, 448635, 457077, 467000, 478793, 492357, 507471, 524230, 542751, 562691, 583573, 605543, 629226, 654825, 681875, 709981, 739202, 769467, 800250, 831264, 862908, 895333, 927336, 956922, 982942, 1005597, 1025304, 1041698, 1054084, 1062327, 1066881]
61482A066881J260j860m629o726q247r510j0355j0125q538o251m234k793j593
61469I93280n04J50K06j37q77k357m419o187p209q227r926j1537j1797j0956j0534
61454I08969j1004j1088r704p357n013k669N7K848N242P632J0655J3993J6723
61441I19284J8557J9684J9644J7417J2741O571J27n800j0584j3692j5120j5282
61429I53547j4306j2029q776n433k451N31L813O980R545J1624J3467J4618J4102
61416I85232J1309O362j41p376j4387k0203k4058k5639k5359k4225k3075k1905
61404H16535k0293j8345j6614j5143j3349j1062q939p471o340n217m466m326m005
61391F80965k521j53J832K791L296M180N679P591R596J1274J2397J3372J4919
$$ y = [1066881, 1068141, 1066281, 1061652, 1054926, 1046679, 1037169, 1026814, 1016689, 1008151, 1001900, 997666, 994873, 993280, 992776, 992926, 993132, 992995, 992118, 989761, 985342, 979155, 971946, 963719, 953793, 942256, 930459, 919503, 908969, 897965, 886877, 877173, 869816, 864803, 862134, 862191, 865039, 870281, 877913, 888568, 902561, 919284, 937841, 957525, 977169, 994586, 1007327, 1013898, 1014025, 1008225, 997641, 983949, 968829, 953547, 939241, 927212, 918436, 913003, 910552, 911083, 914896, 921876, 931421, 943045, 956512, 971130, 985232, 996541, 1002903, 1002762, 995386, 980999, 960796, 936738, 911099, 885740, 861515, 838440, 816535, 796242, 777897, 761283, 746140, 732791, 721729, 712790, 705319, 698979, 693762, 689296, 684970, 680965, 678444, 678291, 680123, 682914, 686210, 690390, 696069, 703660, 713256, 724530, 736927, 750299, 765218]
61378G65218J7141J9285K0578K0932K0693K0222J9848J9832J9983J9633J8303
61367I81668J6200J3825J1307Q444N273K225l60k611m886p282r556j1516j3307
61354I89424j5153j6947j8377j9434k0434k1456k2077k1951k1283k0450j9428
61343G72434j8047j6535j5323j4423j3514j2574j1861j1257j0224q589o899n784
61331F27404n348n327n436n289m432k830j094J35Q57J490K259L042L732M392N134
61316F18689N983O830P427P552P365P357P771Q189P937O812N253L903L131K909
61302G07108K878K638K135J743J801K121K107J388K45o92j139j542k611m366n797
61287G08017n833m655l635l749m416m257k823j094l06o16j176j222p77k97N7M69
$$ y = [765218, 782359, 801644, 822222, 843154, 863847, 884069, 903917, 923749, 943732, 963365, 981668, 997868, 1011693, 1023000, 1031444, 1036717, 1038942, 1038582, 1035971, 1031085, 1023803, 1014247, 1002731, 989424, 974271, 957324, 938947, 919513, 899079, 877623, 855546, 833595, 812312, 791862, 772434, 754387, 737852, 722529, 708106, 694592, 682018, 670157, 658900, 648676, 640087, 633188, 627404, 622056, 616729, 611293, 606004, 601572, 598742, 597648, 597783, 598640, 600130, 602389, 605431, 609163, 613555, 618689, 624672, 631502, 638929, 646481, 653846, 661203, 668974, 677163, 685100, 691912, 697165, 701068, 704199, 707108, 709986, 712624, 714759, 716502, 718303, 720424, 722531, 723919, 724164, 723472, 722333, 720791, 718180, 713814, 708017, 702184, 697529, 693894, 690145, 685729, 681472, 678649, 677555, 677249, 676633, 675457, 674235, 673458, 673161, 673218, 673687]
61271F73687R71J269J281J415J992K669K894K752K798L145L346L310L573M370
61257G09472N153N573O352Q455J1642J4646J6763J8641K1309K4911K8630L1533
61245I03080L3231L3779L3128L0774K6141J9282J1028K340o150j3774j9503k2565
61233A030791k3252k2636k1489j9834j7457j4380j0808p016l380j33K877N788
61221H99071Q002Q327O072J650m013j0278j6742k2734k7365k9983l0405k8850
61209G52752k5883k2285j8714j5398j2259r249o487m142k359j259q15p50p17o02
61195F31833n52o67p50n29k9L99N07L91K00j78q91j679k137k388l030m241n393
61178F10866n853n750n539n304m957m841n369o224o607o342o081o226o289n642
$$ y = [673687, 674658, 675927, 677208, 678623, 680615, 683284, 686178, 688930, 691728, 694873, 698219, 701529, 705102, 709472, 714625, 720198, 726550, 735005, 746647, 761293, 778056, 796697, 818006, 842917, 871547, 903080, 936311, 970090, 1003218, 1033992, 1060133, 1079415, 1090443, 1092783, 1086633, 1072859, 1053356, 1030791, 1007539, 984903, 963414, 943580, 926123, 911743, 900935, 893919, 890539, 890406, 893283, 899071, 907073, 915400, 921472, 923122, 919109, 908831, 892089, 869355, 841990, 812007, 781602, 752752, 726869, 704584, 685870, 670472, 658213, 648964, 642477, 638335, 635976, 634717, 633902, 633152, 632435, 631833, 631281, 630614, 629864, 629335, 629306, 629705, 630212, 630603, 630803, 630625, 629734, 628055, 625918, 623530, 620500, 616259, 610866, 605013, 599263, 593724, 588420, 583463, 578622, 573253, 567029, 560422, 554080, 547999, 541773, 535484, 529842]
61164E29842m483l675l771m467m916m517l486k658k520k642k385k002k418l927
61150D81975n781p230q320r349j0139j0391j0309j0327j0456j0362r890r139q237
61137C62045p358o710o155n197l773k728k876l852m472m141l228k213j182l41
61123C07819j70o56q88L3J947L857N000N350N294N217N371N758O062N931N463
61108C61388N177N356N543M966L484J868R53P55O15J88k03k31j67m38r30j198
61092C87126j207j292j445j210n30j14m98j177j186l68N19Q42P27N37L28Q7K4
61075C81163K55M72L40Pj77j90j70P8P71J461J367N05j46J34R65J644K094K602
61057C93175L086L327L521L981M485M587M433M655N499O679Q004R603J1460J3325
$$ y = [529842, 525359, 521684, 517913, 513446, 508530, 504013, 500527, 497869, 495349, 492707, 490322, 488320, 485902, 481975, 476194, 468964, 460644, 451295, 441156, 430765, 420456, 410129, 399673, 389311, 379421, 370282, 362045, 354687, 347977, 341822, 336625, 332852, 330124, 327248, 323396, 318924, 314783, 311555, 309342, 308160, 307819, 307649, 306993, 306105, 306138, 308085, 311942, 316942, 322292, 327586, 332803, 338174, 343932, 349994, 355925, 361388, 366565, 371921, 377464, 382430, 385914, 387782, 388735, 389490, 390105, 390293, 390090, 389859, 389692, 389254, 388324, 387126, 385919, 384627, 383182, 381972, 381442, 381328, 380830, 379653, 378467, 378099, 378618, 379460, 380187, 380724, 381052, 381139, 381163, 381418, 381890, 382230, 382237, 382060, 381870, 381700, 381778, 382549, 384010, 385377, 385882, 385736, 385870, 386835, 388479, 390573, 393175, 396261, 399588, 403109, 407090, 411575, 416162, 420595, 425250, 430749, 437428, 445432, 455035, 466495, 479820]
61043D79820J5056J6626J7825J8520J9098K0108K1444K2578K3531K4934K7175
61032G06715L0213L4163L9147M4508M9296N3753N9359O7227P7642R1557J11078
61021A364658J37867J72418K15535K68965L33587M09190M97714O03877P28551
61012D732362Q61586R83709J073567J107887J056827Q93198O21411K99432K0918
61003A1650897j37273j57481p8208M0921J44942J83876J11675r2506l96359p17582
60993A0552902r66958j095810j108652j040310r27849p98880o72089n58337m60908
60984B923109l78708l10373k54839k09826j72411j41242j16611r8255q4429p3238
60974A083177o3867n6214n0223m5659m1982l8257l3806k8959k4709k1561j9286
$$ y = [479820, 494876, 511502, 529327, 547847, 566945, 587053, 608497, 631075, 654606, 679540, 706715, 736928, 771091, 810238, 854746, 904042, 957795, 1017154, 1084381, 1162023, 1253580, 1364658, 1502525, 1674943, 1890478, 2159443, 2493030, 2902220, 3399934, 4003811, 4732362, 5593948, 6577657, 7651224, 8759111, 9815938, 10709136, 11330547, 11629979, 11650897, 11513624, 11356143, 11277935, 11318856, 11463798, 11647674, 11759349, 11666843, 11270484, 10552902, 9585944, 8490134, 7381482, 6341172, 5413323, 4614443, 3942354, 3384017, 2923109, 2544401, 2234028, 1979189, 1769363, 1596952, 1455710, 1339099, 1240844, 1156415, 1083177, 1019310, 963096, 912873, 867214, 825232, 786975, 753169, 724210, 699501, 677940, 658654]
60963F58654j7674j6842j6717j6780j6576j6113j5528j4747j3615j2200j0750
60952D91112r467q386p387o417n675n405n408n092m266l539l566m171m702n011
60938D12620n533o419p225p520p411p254p131o862o294n453m486l547k697j882
60924C32906j045j82P14J540J973J715R90M03J40k73j073j641j310m03K08L32
60908C34994M72P31O13M0l24j18N8m02j155j531j666k158k837k844k059j585k313
60891C17916l584m036l453k934l215l629l164j904q23m48m67m82m94m96k50L01
60875B88838Q46J153J308J342J123P85P91J186J418J193R74J156J311R15L07J74
60859C04820M40M38j5n29r89j635k334k555k193j696j272o72R2N75O39P47J159
$$ y = [658654, 640980, 624138, 607421, 590641, 574065, 557952, 542424, 527677, 514062, 501862, 491112, 481645, 473259, 465872, 459455, 453780, 448375, 442967, 437875, 433609, 430070, 426504, 422333, 417631, 412620, 407087, 400668, 393443, 385923, 378512, 371258, 364127, 357265, 350971, 345518, 341032, 337485, 334788, 332906, 331861, 331679, 332393, 333933, 335906, 337621, 338611, 339014, 339154, 338881, 337808, 336167, 334857, 334454, 334662, 334994, 335466, 336197, 336810, 336850, 336526, 336408, 336466, 336064, 334909, 333378, 331712, 329554, 326717, 323873, 321814, 320229, 317916, 314332, 310296, 306843, 303909, 300694, 297065, 293901, 291997, 291174, 290726, 290259, 289777, 289283, 288787, 288537, 288838, 289684, 290837, 292145, 293487, 294610, 295395, 296186, 297372, 298790, 299983, 300957, 302113, 303424, 304339, 304646, 304820, 305260, 305698, 305683, 305154, 304165, 302530, 300196, 297641, 295448, 293752, 292480, 291808, 291900, 292475, 293114, 293861, 295020]
60842B95020J402Q94k78j554k406k509j887j115r90j690k641l314l656l635k998
60827B68643j864r77q90j336j781k074k208j985j463j262j823k709l188l131k793
60812B39159k117j003N8M09J45r4j17k88p28j098j229j209q73J06J427K217K139
60795B36904J798J732J653J149N77O57J423K139K204J731J277J263J637J980J968
60780B60092J764J719J729J233J01r48j171p43m59o24p58l74L90J034J241J038
60764B65264O08J76p1j04l9Rk2j98n88j109j515j586j342j008q27q79r93q58l94
60745B54524K9j12q60j630j877j706j580j578j348q29n64r52j580j768j593j771
60729B34805k453k814k174j034m12m44l25L90J116J113M83j16m10o45j017j420
$$ y = [295020, 296422, 297316, 297038, 295484, 293078, 290569, 288682, 287567, 286577, 284887, 282246, 278932, 275276, 271641, 268643, 266779, 265802, 264912, 263576, 261795, 259721, 257513, 255528, 254065, 252803, 250980, 248271, 245083, 241952, 239159, 237042, 236039, 236097, 236506, 236651, 236557, 236440, 236152, 235424, 234326, 233097, 231888, 231015, 231121, 232548, 234765, 236904, 238702, 240434, 242087, 243236, 243813, 244470, 245893, 248032, 250236, 251967, 253244, 254507, 256144, 258124, 260092, 261856, 263575, 265304, 266537, 266638, 265690, 264519, 263776, 263317, 262693, 261935, 261561, 261951, 262985, 264226, 265264, 265872, 266048, 265977, 265873, 265834, 265843, 265821, 265623, 265035, 263926, 262411, 260825, 259483, 258475, 257648, 256769, 255776, 254918, 254524, 254553, 254441, 253581, 251951, 250074, 248368, 246788, 245210, 243862, 243033, 242469, 241517, 239937, 238169, 236576, 234805, 232352, 229538, 227364, 226330, 225918, 225474, 225149, 225539, 226655, 227768, 228251, 228135, 227725, 227080, 226063, 224643]
60713B24643j789k246k771l018k705k059j652j821k354k701k492j840j146o75
60699A95374l46l4J36k1l37m05j32R4l8l15k80K16R92J834K499K608J940Q28n4
60680B04559l78l26n6N06J274J829J971K054K443K870K785K150J472J089Q99P49
60664B25890O57O03M75L66N69J114J680K087K517L044L259K762J789J010Q00R84
60648B49606J226J352J320J101P07J61n16j229j815k257k801l558m148m049l286
60633B31814k444j912j490r35n62q09j422j541q26j6k3p05j046m65M75Q97O49
60616B19639K16k7mL75J142J896K057J568Q92K70m89j348j844j781j600j570j317
60599B18075o82m46j329k682l152k494j692j354j009l52l3n99j435j545q54%P50
$$ y = [224643, 222854, 220608, 217837, 214819, 212114, 210055, 208403, 206582, 204228, 201527, 199035, 197195, 196049, 195374, 195028, 194994, 195130, 195109, 194772, 194367, 194235, 194329, 194291, 193976, 193696, 193912, 194904, 196738, 199237, 201845, 203785, 204613, 204559, 204181, 203855, 203799, 204305, 205579, 207408, 209379, 211433, 213876, 216746, 219531, 221681, 223153, 224242, 225141, 225890, 226547, 227150, 227625, 227991, 228560, 229674, 231354, 233441, 235958, 239002, 242261, 245023, 246812, 247822, 248622, 249606, 250832, 252184, 253504, 254605, 255312, 255473, 254957, 253728, 251913, 249656, 246855, 243297, 239149, 235100, 231814, 229370, 227458, 225968, 225033, 224471, 223662, 222240, 220699, 219873, 219857, 219834, 219129, 218083, 217618, 218093, 218990, 219639, 219855, 219828, 219824, 220199, 221341, 223237, 225294, 226862, 227754, 228024, 227535, 226187, 224343, 222562, 220962, 219392, 218075, 217393, 216947, 215618, 212936, 209784, 207290, 205598, 204244, 203235, 202883, 202850, 202251, 200816, 199271, 198417, 198417, 199167]
60582A99167J528K083J855R07J21J38O83J128J306J469J703J807J706J694K065
60567B19360K575K564J766Q93R70K063L142L414L262L442L884L965L767M101N287
60552B64455O675P731Q886J0820J3374J5779J7740J9733K2210K4975K7411K9013
60540D68802K9500K8518K5488K0056J2740M888k301q674j4679k0174k4226k6197
60528D93741k6390k5369k3186j9870j6189j3168j1009r122p161n430m172l099
60516C29576j826l03J481L744O495R183J1290J3102J5499J8860K2496K5328K6877
60503D81802K7462K7406K6322K3422J8467J2246N989N36l804o788p966o928l623
60490E94543J497P534J3488J8793K3499K7641L0585L1272K9103K4233J7056P902
$$ y = [199167, 200695, 202778, 204633, 205540, 205661, 205799, 206482, 207610, 208916, 210385, 212088, 213895, 215601, 217295, 219360, 221935, 224499, 226265, 227158, 228128, 230191, 233333, 236747, 240009, 243451, 247335, 251300, 255067, 259168, 264455, 271130, 278861, 287747, 298567, 311941, 327720, 345460, 365193, 387403, 412378, 439789, 468802, 498302, 526820, 552308, 572364, 585104, 589992, 587691, 579017, 564338, 544164, 519938, 493741, 467351, 441982, 418796, 398926, 382737, 369569, 358560, 349438, 342277, 336847, 332675, 329576, 327750, 327447, 328928, 332672, 339167, 348350, 359640, 372742, 388241, 407101, 429597, 454925, 481802, 509264, 536670, 562992, 586414, 604881, 617127, 623116, 623652, 619848, 613060, 605094, 598166, 594543, 596040, 603574, 617062, 635855, 659354, 686995, 717580, 748852, 777955, 802188, 819244, 827146]
60478H27146k667j3605k3747l2191l8400m2204m3850m3744m2047l8850l4739l0657
60466D40445k7029k3498j9801j6484j4281j3145j2360j1319r830p945n958m434
60454B74361l689l398l067k753k848l266l432l052k453k045j834j556j035l59
60440B39574J63K40k9j60R3M14M85N42Q61J103Q29M03N54J094J040J49o80p98
60422B45877o86q73r08k13P17R74O99Q81J803K626K680K332K273K533K654K477
60406B65846K320K540L195M071M851N325N541N724N953O055N924N803O026O460
60392C35634O494N765M716M178M407M863N016M951M987N014M711M152L688L338
60378D01914K850K360K367K874L142K578J472N24K3j77k22j54J0L27Q24J143P03
$$ y = [827146, 824479, 810874, 787127, 754936, 716536, 674332, 630482, 586738, 544691, 505841, 471102, 440445, 413416, 389918, 370117, 353633, 339352, 326207, 313847, 302528, 292698, 284753, 278795, 274361, 270672, 267274, 264207, 261454, 258606, 255340, 251908, 248856, 246403, 244358, 242524, 240968, 239933, 239574, 239737, 239977, 239948, 239788, 239881, 240295, 240780, 241322, 242183, 243286, 244115, 244518, 245072, 246166, 247206, 247355, 246675, 245877, 245191, 244318, 243410, 243197, 243914, 244888, 245587, 246468, 248271, 250897, 253577, 255909, 258182, 260715, 263369, 265846, 268166, 270706, 273901, 277972, 282823, 288148, 293689, 299413, 305366, 311421, 317345, 323148, 329174, 335634, 342128, 347893, 352609, 356787, 361194, 366057, 371073, 376024, 381011, 386025, 390736, 394888, 398576, 401914, 404764, 407124, 409491, 412365, 415507, 418085, 419557, 420081, 420104, 419927, 419705, 419551, 419561, 419888, 420712, 421855, 422558]
60361D22558m26j281j051k4R51J582K077K347K051J350Q40N52j99j783l581m769
60345D21194n378o038o971p625p434o575n819n661n850n771n199m426l715l134
60331C41598k906l415m519n269m927l927l297l292l276k843k332k069j809j199
60317B96518m06J29K00o5l59k04Q28K587M340N561O476P584Q791R429R019P678
60301C58106N790L570J095j478l869n914p659r126j0016r906q788p288o141n590
60287B92786n359n094m578l760k823k125j762j373o98j42l15j105j684j468n96
60272B59904N20J591K297K386K154K342L206M112M384M085L659L215K669K205
60258B98729K125K396K766L161L537L545K843J691Q03N69P86J124J409J449J042
$$ y = [422558, 422132, 420851, 419800, 419776, 420727, 422309, 424386, 426733, 428784, 430134, 430974, 431526, 431327, 429544, 425963, 421194, 415816, 409778, 402807, 395182, 387748, 381173, 375354, 369693, 363843, 358072, 352873, 348447, 344732, 341598, 338692, 335277, 330758, 325489, 320562, 316635, 313338, 310046, 306770, 303927, 301595, 299526, 297717, 296518, 296112, 296241, 296441, 296376, 296017, 295813, 296641, 299228, 303568, 309129, 315605, 323189, 331980, 341409, 350428, 358106, 363896, 367466, 368561, 367083, 363214, 357300, 349641, 340515, 330499, 320593, 311805, 304517, 298376, 292786, 287427, 282333, 277755, 273995, 271172, 269047, 267285, 265912, 265214, 265072, 264757, 263652, 261968, 260500, 259904, 260424, 262015, 264312, 266698, 268852, 271194, 274400, 278512, 282896, 286981, 290640, 293855, 296524, 298729, 300854, 303250, 306016, 309177, 312714, 316259, 319102, 320793, 321596, 322165, 322951, 324075, 325484, 326933, 327975]
60243C27975L65K9M05J173J779K228L011M194N086N163N024N808P628R243R711
60228C88822R752J0747J2728J4379J5019J5583J7214J9695K1942K3397K4244K4670
60216E98192K4750K4848K5282K5689K5360K4276K3110K2111K0651J8199J5173
60205H47641J2473J0503R050P850O835N873M688L137J461J72l39o7O84J642K752
60190I14355M059N518P026Q592J0275J2084J3968J5864J7650J9194K0641K2384
60178A071610K4466K6171K6564K5473K3575K1526J9287J6457J2893Q864M719N75
60166A282180l709q281j2993j7341k0826k3268k4658k4929k4169k2870k1511j9931
60154A057694j7631j4675j1766r235o598l487n44J296K110K949M397N783O014
$$ y = [327975, 328340, 328369, 328774, 329947, 331726, 333954, 336965, 341159, 346245, 351408, 356432, 362240, 369868, 379111, 388822, 398574, 409321, 422049, 436428, 451447, 467030, 484244, 503939, 525881, 549278, 573522, 598192, 622942, 647790, 673072, 698761, 724121, 748397, 771507, 793618, 814269, 832468, 847641, 860114, 870617, 879667, 887517, 894352, 900225, 904913, 908050, 909511, 909683, 909344, 909277, 909961, 911603, 914355, 918414, 923932, 930958, 939550, 949825, 961909, 975877, 991741, 1009391, 1028585, 1049226, 1071610, 1096076, 1122247, 1148811, 1174284, 1197859, 1219385, 1238672, 1255129, 1268022, 1276886, 1281605, 1282180, 1278471, 1270190, 1257197, 1239856, 1219030, 1195762, 1171104, 1146175, 1122006, 1099136, 1077625, 1057694, 1040063, 1025388, 1013622, 1004387, 997789, 994302, 993758, 995054, 997164, 1000113, 1004510, 1010293, 1016307]
60141A016307M830K990J322o6j748m135o839q953j0067j0775j1840j3032j3291
60128I44703j2110j0268q778p611n946l466p09J909M713Q109J1817J5214J8125
60115I55702K0808K3436K6101K9235L3293L7958M2231M5529M8176N0521N2140
60104A365130N2370N1239M9230M6357M2121L6411K9771K2666J4975O528k170j0194
60092A704434j7041k3000k8624l4081l8950m2626m4862m5936m6281m5970m4690
60081A292373m2210l8808l5220l2124k9601k7062k3816j9821j5727j2145r099
60070A006740o412m267k908j962o97R71K338K961L326L998M611M316K985J322
60056A017322k08j897m091o461q391r724j0831j2063j3502j5103j6684j7848j8272
$$ y = [1016307, 1021137, 1024127, 1025449, 1025383, 1023635, 1019500, 1012661, 1003708, 993641, 982866, 971026, 957994, 944703, 932593, 922325, 913547, 905936, 899990, 896524, 895815, 897724, 902437, 910546, 922363, 937577, 955702, 976510, 999946, 1026047, 1055282, 1088575, 1126533, 1168764, 1214293, 1262469, 1312990, 1365130, 1417500, 1468739, 1517969, 1564326, 1606447, 1642858, 1672629, 1695295, 1710270, 1716798, 1714628, 1704434, 1687393, 1664393, 1635769, 1601688, 1562738, 1520112, 1475250, 1429314, 1383033, 1337063, 1292373, 1250163, 1211355, 1176135, 1144011, 1114410, 1087348, 1063532, 1043711, 1027984, 1015839, 1006740, 1000328, 996061, 993153, 991191, 990494, 991465, 993803, 996764, 1000090, 1004088, 1008699, 1013015, 1016000, 1017322, 1017114, 1015217, 1011126, 1004665, 996274, 986550, 975719, 963656, 950154, 935051, 918367, 900519, 882247]
60043H82247j8157j8067j8208j8129j7383j6114j4713j3114j0890q009m950j970
60031G22543J213M776Q238J1021J3283J5668J8379K1017K3329K5527K7637K9014
60019I21645K8938K7447K5174K2518J9332J5435J1031O462J867k711p034j0826
60007A059278j4215j7693k1427k4770k6733k6979k6035k4532k2585k0122j7492
59996H16695j5187j3044j0267o460k244J455M498P507J0927J4596J8219K1823
59984H48518K5502K9018L2022L4460L6454L7824L8128L7145L5064L2034K7999
59973A214168K3103J7888J2749P474J765m011r100j3325j7142k0727k3627k5525
59961A163690k6719k7430k7169k5314k2067j8383j5105j2529j0492q387n393j243
$$ y = [882247, 864090, 846023, 827815, 809686, 792303, 776189, 761476, 748362, 737472, 729463, 724513, 722543, 723756, 728532, 736770, 747791, 761074, 776742, 795121, 816138, 839467, 864994, 892631, 921645, 950583, 978030, 1003204, 1025722, 1045054, 1060489, 1071520, 1077982, 1079849, 1077138, 1070104, 1059278, 1045063, 1027370, 1005943, 981173, 954440, 927461, 901426, 876894, 854309, 834187, 816695, 801508, 788464, 778197, 771737, 769493, 770948, 775446, 782953, 793880, 808476, 826695, 848518, 874020, 903038, 935060, 969520, 1005974, 1043798, 1081926, 1119071, 1154135, 1186169, 1214168, 1237271, 1255159, 1267908, 1275382, 1277147, 1273136, 1264036, 1250711, 1233569, 1212842, 1189215, 1163690, 1136971, 1109541, 1082372, 1057058, 1034991, 1016608, 1001503, 988974, 978482, 970095, 964702, 963459]
59949I63459L347P490J1143J4688J7876K0034K1316K2670K4356K5421K5151K4196
59937A181147K3582K3292K2615K1387J9985J8415J6337J3899J1675R748P763O018
59925A375863N576O845Q802J0227J1177J2652J5182J8416K1852K5181K7962K9702
59913A569437L0395L0483L0105K8819K6307K2877J8910J4261Q706K626l280q825
59901A770821j4285j9545k3978k7289k9859l1893l2824l2072l0121k8107k6493
59890A474355k4686k2042j8701j5239j1951q783n760l050o58J726M385P227R806
59877A386629J1753J3172J4432J5585J6216J5984J5100J4003J2773J1280R707
59866A536634Q488P623O631N326M176L610L330K688J407m09k760n720r022j2126
$$ y = [963459, 966806, 974296, 985439, 1000127, 1018003, 1038037, 1059353, 1082023, 1106379, 1131800, 1156951, 1181147, 1204729, 1228021, 1250636, 1272023, 1292008, 1310423, 1326760, 1340659, 1352334, 1362082, 1369845, 1375863, 1381439, 1388284, 1397086, 1407313, 1418490, 1431142, 1446324, 1464740, 1486592, 1511773, 1539735, 1569437, 1599832, 1630315, 1660420, 1689239, 1715546, 1738423, 1757333, 1771594, 1780300, 1782926, 1779646, 1770821, 1756536, 1736991, 1713013, 1685724, 1655865, 1623972, 1591148, 1559076, 1528955, 1500848, 1474355, 1449669, 1427627, 1408926, 1393687, 1381736, 1372953, 1367193, 1364143, 1363485, 1365211, 1369596, 1376823, 1386629, 1398382, 1411554, 1425986, 1441571, 1457787, 1473771, 1488871, 1502874, 1515647, 1526927, 1536634, 1545122, 1552745, 1559376, 1564702, 1568878, 1572488, 1575818, 1578506, 1579913, 1579504, 1576744, 1571024, 1562002, 1549876]
59852A549876j4726j6925j8840k0470k1950k3623k5513k6971k7122k5687k3207
59841A304842k0456j7812j5241j2783j0797r601r015q452p461o039m392k582n91
59828A179620J502L584N694Q002J0549J3170J5668J7913J9890K1663K3333K4834
59816A345422K5794K5724K4401K2080J9298J6443J3457R964N792J402k310m750
59804A502717o091p006q033r277j0558j1678j2609j3565j4877j6576j8162j9025
59792A355260j9162j9301k0109k1410k2340k2288k1488k0548j9628j8332j6486
59781A134168j4629j3450j2880j2140j0706q820o883m707j847J579M805P286R274
59768A071050J1406J3950J6674J9325K2039K5222K9193L3929L9062M4058M8448
$$ y = [1549876, 1535150, 1518225, 1499385, 1478915, 1456965, 1433342, 1407829, 1380858, 1353736, 1328049, 1304842, 1284386, 1266574, 1251333, 1238550, 1227753, 1218152, 1209137, 1200685, 1193224, 1187185, 1182793, 1180211, 1179620, 1181122, 1184706, 1190400, 1198402, 1208951, 1222121, 1237789, 1255702, 1275592, 1297255, 1320588, 1345422, 1371216, 1396940, 1421341, 1443421, 1462719, 1479162, 1492619, 1502583, 1508375, 1509777, 1507467, 1502717, 1496626, 1489620, 1481587, 1472310, 1461752, 1450074, 1437465, 1423900, 1409023, 1392447, 1374285, 1355260, 1336098, 1316797, 1296688, 1275278, 1252938, 1230650, 1209162, 1188614, 1168986, 1150654, 1134168, 1119539, 1106089, 1093209, 1081069, 1070363, 1061543, 1054660, 1049953, 1048106, 1049685, 1054490, 1061776, 1071050, 1082456, 1096406, 1113080, 1132405, 1154444, 1179666, 1208859, 1242788, 1281850, 1325908, 1374356]
59757A374356N2002N4653N6118N5519N1580M3449L1499J7187K203j2226k5178
59746A701162l5637m2636m5849m5917m4026m1198l7870l4078k9900k5646k1629
59735A296776j7885j4306j0926p910n215k528L54L267N910Q226J0423J2753J5393
59722A294332J8360K1436K4352K7205L0506L4553L8963M3183M7316N2024N7642
59711A689872O3773O9885P5871Q1818Q7616R3042R7958J01997J04370J04425J02353
59700B672980R8824R4002Q7417P8929O9283N9409M9641M0058L1264K4105J8765
59689C324677J4666J1341Q858P184N754M081K434J414J018N54n68k232l777m510
59675C370894m079k637o05J796M667Q076J1835J5946K0856K6845L3366L9495M4992
$$ y = [1374356, 1426358, 1481011, 1537129, 1592648, 1644228, 1687677, 1719176, 1736363, 1738566, 1726340, 1701162, 1665525, 1622889, 1577040, 1531123, 1487097, 1445899, 1408029, 1373951, 1344051, 1318405, 1296776, 1278891, 1264585, 1253659, 1245749, 1240534, 1238006, 1238360, 1241627, 1247537, 1255763, 1266186, 1278939, 1294332, 1312692, 1334128, 1358480, 1385685, 1416191, 1450744, 1489707, 1532890, 1580206, 1632230, 1689872, 1753645, 1823530, 1899401, 1981219, 2068835, 2161877, 2259835, 2361832, 2466202, 2570627, 2672980, 2771804, 2865806, 2953223, 3032152, 3101435, 3160844, 3210485, 3250543, 3281807, 3305912, 3324677, 3339343, 3350684, 3359542, 3366726, 3372480, 3376561, 3378995, 3380409, 3381427, 3381981, 3381413, 3379181, 3375404, 3370894, 3366815, 3364178, 3363573, 3365369, 3370036, 3378112, 3389947, 3405893, 3426749, 3453594, 3486960, 3526455, 3571447]
59662C571447N0319N5627O0298O3623O5437O5840O4730O1855N7037N0191M1415
59651D207819L1118J9656O771q103k4657m1384n6819p0728q3530r4926j03664
59640C781553j08610j09642j07467j02958r6750q9307q1239p3473o6952o2267
59630B882888n9808o0233o4210p1525q0912r0882j00227j07516j11077j10160
59620B026338j05712r9252r1449q2431p3070o4787n8090n2116m5900l9430l3411
59609A280690k8590k5467k4040k3545k2867k1475j9670j7881j6146j4405j2841
59598A053763j1699j0997j0521r920q951p923p641q363r064q498o843n490n134
59585I42719n098m731m412m637n132n601o494q192r965j0750j0476r814q959p696
$$ y = [3571447, 3621766, 3677393, 3737691, 3801314, 3866751, 3932591, 3997321, 4059176, 4116213, 4166404, 4207819, 4238937, 4258593, 4265364, 4257261, 4232604, 4191220, 4134401, 4063673, 3980143, 3885217, 3781553, 3672943, 3563301, 3455834, 3352876, 3256126, 3166819, 3085580, 3012107, 2945155, 2882888, 2823080, 2762847, 2698637, 2627112, 2546200, 2455318, 2355091, 2247575, 2136498, 2026338, 1920626, 1821374, 1729925, 1647494, 1574424, 1509637, 1451547, 1399431, 1353531, 1314101, 1280690, 1252100, 1226633, 1202593, 1179048, 1156181, 1134706, 1115036, 1097155, 1081009, 1066604, 1053763, 1042064, 1031067, 1020546, 1010626, 1001675, 993752, 986111, 977748, 968684, 960186, 953343, 947853, 942719, 937621, 932890, 928478, 923841, 918709, 913108, 906614, 898422, 888457, 877707, 867231, 857417, 848458, 840762]
59571H40762o329n481m963l964k393j082m18K50J388K484L084L836N559P850R565
59556H50148J0476J1528J3392J5567J7186J8097J8821J9855K1390K3353K5374
59545A045187K6992K8212K9700L1921L4227L5322L4527L2118K8341K2894J5986
59534A365427R378N447N020O654Q207Q582P789O015L377L42k378m631o937r637
59520A402655j2281j4352j6150j8346k0760k2319k2518k2287k2816k3887k4050
59509A182889k2534k0265j8667j7953j7050j4972j1817q445n465k719L33L799
59497A047134P110R787J2314J5713K0145K4540K7929L0645L3575L6673L8972L9947
59485A344484M0026L9627L8423L5838L1766K6475K0284J3600O944N03o111j3251
$$ y = [840762, 834433, 828952, 823989, 820025, 817632, 816550, 816132, 816382, 817770, 820254, 823338, 827174, 832733, 840583, 850148, 860624, 872152, 885544, 901111, 918297, 936394, 955215, 975070, 996460, 1019813, 1045187, 1072179, 1100391, 1130091, 1162012, 1196239, 1231561, 1266088, 1298206, 1326547, 1349441, 1365427, 1374805, 1380252, 1385272, 1391926, 1400133, 1408715, 1416504, 1422519, 1425896, 1426238, 1423860, 1419229, 1412292, 1402655, 1390374, 1376022, 1359872, 1341526, 1320766, 1298447, 1275929, 1253642, 1230826, 1206939, 1182889, 1160355, 1140090, 1121423, 1103470, 1086420, 1071448, 1059631, 1051186, 1045721, 1043002, 1043335, 1047134, 1054244, 1064031, 1076345, 1092058, 1112203, 1136743, 1164672, 1195317, 1228892, 1265565, 1304537, 1344484, 1384510, 1424137, 1462560, 1498398, 1530164, 1556639, 1576923, 1590523, 1597467, 1597970, 1591859, 1578608]
59473A578608k0438k6419l0104l1419l1328l0960l0615k9663k7487k4328k0951
59462A274896j7751j4628j1567q817o513m623l274k581k269k082k525m336p068
59449A186862r214j0165j1100j3231j6071j8315j9785k1324k3172k4625k5294
59438I94566k5592k5765k5396k4275k3019k2316k2014k1421k0201j8617j7101
59427G48849j5883j4935j3973j2599j0606q185n761l616j597Q04L946P526J0640
59414F84610J2404J2335J0145N735k03n870r278r538p147l210J265N592R408J2330
59400G18578J3339J1046N173k462r195j3670j6068j6617j5056j1776q253n638
59388F49401l650j479Q70K837M393O057Q078J0250J2360J4261J5635J6254J6480
$$ y = [1578608, 1558170, 1531751, 1501647, 1470228, 1438900, 1407940, 1377325, 1347662, 1320175, 1295847, 1274896, 1257145, 1242517, 1230950, 1222133, 1215620, 1210997, 1207723, 1205142, 1202873, 1200791, 1198266, 1193930, 1186862, 1177648, 1167483, 1156383, 1143152, 1127081, 1108766, 1088981, 1067657, 1044485, 1019860, 994566, 968974, 943209, 917813, 893538, 870519, 848203, 826189, 804768, 784567, 765950, 748849, 732966, 718031, 704058, 691459, 680853, 672668, 666907, 663291, 661694, 662498, 666444, 673970, 684610, 697014, 709349, 719494, 725229, 725026, 719156, 709878, 700340, 693193, 689983, 691248, 696840, 706248, 718578, 731917, 742963, 748136, 745674, 736479, 722809, 706741, 690124, 675068, 663292, 655039, 649401, 645751, 644272, 645142, 647979, 652372, 658429, 666507, 676757, 689117, 703378, 719013, 735267, 751747]
59375G51747J6937J7787J8684J9433K0280K1492K3059K4778K6275K6988K6518
59364I93978K5135K3653K2769K2646K3076K3736K4354K4997K6249K8753L2507
59353A271853L6898M1434M6129N1111N6214O1104O5633O9855P3831P7495Q0569
59342A932126Q2604Q3228Q2382Q0118P6288P0744O3813N6217M8410M0360L1959
59331B648249K3296J4487N637k814j0267j6767k3083k9716l6333m2566m8739n5083
59319B426301o0823o4966o7707p0001p1918p2613p2150p2015p3220p4821p5173
59308A650894p3859p1469o8148o3526n7889n2232m7081m2138l7228l2733k8863
59297A075728k5277k1800j8788j6414j4212j1809r621q201p375o575n695m973
$$ y = [751747, 768684, 786471, 805155, 824588, 844868, 866360, 889419, 914197, 940472, 967460, 993978, 1019113, 1042766, 1065535, 1088181, 1111257, 1134993, 1159347, 1184344, 1210593, 1239346, 1271853, 1308751, 1350185, 1396314, 1447425, 1503639, 1564743, 1630376, 1700231, 1774062, 1851557, 1932126, 2014730, 2097958, 2180340, 2260458, 2336746, 2407490, 2471303, 2527520, 2575930, 2616290, 2648249, 2671545, 2686032, 2691669, 2688855, 2678588, 2661821, 2638738, 2609022, 2572689, 2530123, 2481384, 2426301, 2365478, 2300512, 2232805, 2162804, 2090886, 2018273, 1946123, 1874108, 1800888, 1726067, 1650894, 1577035, 1505566, 1437418, 1373892, 1316003, 1263771, 1216690, 1174552, 1137324, 1104591, 1075728, 1050451, 1028651, 1009863, 993449, 979237, 967428, 957807, 949606, 942231, 935656, 929961, 924988]
59285I24988m281l241j972j006m47J58R65J426J174Q13J370L059N028O331O909
59270I41274P453Q477R714J0423J0198R301Q194O960N391L440J330p79l001n388
59256A012987p759r972j2253j4875j7585j9677k0730k1063k1263k1420k1146k0264
59244H04980j9142j8246j7690j7361j7174j6893j6013j4252j2088j0396r468q794
59232F27463p854o793o113o030o227o087n054l089q79O65J247J321J426J778K523
59217E88297L797N271O189O348O504P376Q639R533J0085J0996J2494J4055J5304
59204G04888J6493J7946J9651K1584K3953K6862L0114L3534L7126M0788M4247
59193A017186M7395N0411N3333N5901N7898N9256N9650N8474N5426N0849M5081
$$ y = [924988, 920707, 917466, 915494, 914488, 914041, 914199, 915164, 916590, 917764, 918577, 919947, 923006, 928034, 934365, 941274, 948727, 957204, 966918, 977341, 987539, 996840, 1005034, 1011994, 1017385, 1020825, 1022155, 1021376, 1018375, 1012987, 1005228, 995256, 983003, 968128, 950543, 930866, 910136, 889073, 867810, 846390, 825244, 804980, 785838, 767592, 749902, 732541, 715367, 698474, 682461, 668209, 656121, 645725, 636257, 627463, 619609, 612816, 606703, 600673, 594446, 588359, 583305, 580216, 579337, 580002, 581249, 582570, 583996, 585774, 588297, 592094, 597365, 603554, 609902, 616406, 623782, 632421, 641954, 652039, 663035, 675529, 689584, 704888, 721381, 739327, 758978, 780562, 804515, 831377, 861491, 895025, 932151, 972939, 1017186, 1064581, 1114992, 1168325, 1224226, 1282124, 1341380, 1401030, 1459504, 1514930, 1565779, 1610860]
59182A610860L7991K9473K0062J0480P35r684k0654l0918l9022m4563m8298n1137
59170A465325n3278n4266n3693n1638m8482m4582m0297l6064l2172k8492k4768
59159I97593k1108j7938j5371j2960j0218p174m291k003l90P96J883K892L406
59146I15117L073K168J379R97O89J61l54n45n71q32j380j906k133k024j738j565
59130I10536j714j949j707p83L99J470K675M249N559N568M220K713K127K310K339
59115I38012J746Q13o6q62j721k735l949n406o953q218q926r189r278r218q839
59100H65211q233p848p961q287q329p892p034n774m323l362l485m229m306l082
59086G81066j335j79K19M46P62R31R26J119J714K453L049L436L531L173K549K237
$$ y = [1610860, 1648851, 1678324, 1698386, 1708866, 1709601, 1699917, 1679263, 1648345, 1609323, 1564760, 1516462, 1465325, 1412047, 1357781, 1304088, 1252450, 1203968, 1159386, 1119089, 1083025, 1050853, 1022361, 997593, 976485, 958547, 943176, 930216, 919998, 912824, 908533, 906530, 906140, 906936, 908819, 911711, 915117, 918190, 920358, 921737, 922734, 923423, 923584, 923230, 922685, 922114, 921282, 919902, 917996, 915863, 913839, 912101, 910536, 908822, 906873, 905166, 904383, 904782, 906252, 908927, 913176, 918735, 924303, 928523, 931236, 933363, 935673, 938012, 939758, 940571, 940505, 939643, 937922, 935187, 931238, 925832, 918879, 910661, 901735, 892546, 883268, 874050, 865211, 856978, 849130, 841169, 832882, 824553, 816661, 809627, 803853, 799530, 796168, 792683, 788454, 784148, 781066, 779731, 779552, 779771, 780217, 780979, 781910, 782836, 783955, 785669, 788122, 791171, 794607, 798138, 801311, 803860, 806097]
59070H06097K511K865K601J758J031P64M10p66k632m218m867n029n597o627p235
59055G81066o850o162o346p595q912r236q395o939n484m524m480n459o936p907
59041F85841p642o359n152n093o265p705q412q243p732p205o541n686m965m621
59027E94220m376l748k682j622j001p67m14N34J901K797K416J064%O2P31Q99K40
59010E90254o31j187j515j729j542p88M7L31R6p1J41M54N48M82N04P18J141J796
58992E89049K597L297L817M440N462O736P829Q577R244J0132J1315J2816J4730
58979F90041J7002J9258K1064K2266K2948K3216K3164K2954K2725K2388K1637
58968I28663K0138J7689J4343J0590P161M340J553j928n895r230j1259j2510j3842
$$ y = [806097, 808608, 811473, 814074, 815832, 816863, 817627, 818037, 817271, 814639, 810421, 805554, 800525, 794928, 788301, 781066, 774216, 768054, 761708, 754113, 745201, 735965, 727570, 720631, 715147, 710623, 706143, 700684, 693748, 685841, 678199, 671840, 666688, 661595, 655330, 647625, 639213, 630970, 623238, 616033, 609492, 603806, 598841, 594220, 589844, 586096, 583414, 581792, 580791, 580024, 579610, 580144, 582045, 584842, 587258, 588322, 588322, 588384, 589115, 590014, 590254, 589623, 588436, 586921, 585192, 583650, 582862, 582909, 583240, 583336, 583265, 583406, 583860, 584408, 584890, 585394, 586112, 587253, 589049, 591646, 594943, 598760, 603200, 608662, 615398, 623227, 631804, 641048, 651180, 662495, 675311, 690041, 707043, 726301, 747365, 769631, 792579, 815795, 838959, 861913, 884638, 907026, 928663, 948801, 966490, 980833, 991423, 998584, 1002924, 1004477, 1002549, 996654, 987424, 976165, 963655, 949813]
58955I49813j5206j5864j5667j5326j5381j5481j4964j3757j2318j1044j0021
58944G94784r155q222p029n686m570l746k796j510l81P4J85P77K076L618N070
58929G63489O405P319P338O784O835Q171J0167J1815J2930J3937J5054J6252J7624
58916I04120J9171K0605K1957K4018K7445L1647L5263L7647L9195M0324M0829
58905A242221M0277L8330L4700K9439K3384J7687J2812Q615N468M436O015R328
58893A472712J3057J6659K0250K3851K7278L0443L3268L5516L7082L8309L9673
58882A788098M1320M3090M4732M5925M6412M6309M5863M4609M1339L5342K7381
58871B250420J8891J0552K253n799j2776j8098k2067k5371k8310l0733l2508l3823
$$ y = [949813, 934607, 918743, 903076, 887750, 872369, 856888, 841924, 828167, 815849, 804805, 794784, 785629, 777407, 770378, 764692, 760122, 756376, 753580, 752070, 751689, 751763, 751948, 752725, 754801, 758419, 763489, 769894, 777213, 784551, 791335, 798170, 806341, 816508, 828323, 841253, 855190, 870244, 886496, 904120, 923291, 943896, 965853, 989871, 1017316, 1048963, 1084226, 1121873, 1161068, 1201392, 1242221, 1282498, 1320828, 1355528, 1384967, 1408351, 1426038, 1438850, 1447465, 1452933, 1457369, 1463384, 1472712, 1485769, 1502428, 1522678, 1546529, 1573807, 1604250, 1637518, 1673034, 1710116, 1748425, 1788098, 1829418, 1872508, 1917240, 1963165, 2009577, 2055886, 2101749, 2146358, 2187697, 2223039, 2250420, 2269311, 2279863, 2282116, 2276317, 2263541, 2245443, 2223376, 2198005, 2169695, 2138962, 2106454, 2072631]
58859B072631l5041l6320l7416l7984l8120l8377l9147m0221m1150m1727m1879
58848A645249m1389m0191l8754l7716l7118l6420l5265l3868l2524l1140k9489
58837A251375k7668k6031k4730k3538k2173k0601j8935j7152j5121j2921j0847
58826A031658q938o870m552k560j464r26p2J315K608L462M308N467O509P012P330
58811A044287P941Q551Q474P711O889O349N910N469N297N637O441P515Q642R633
58797A144746J0582J1868J3700J5863J8178K0882K4051K7067K9286L0998L3024
58786A380245L5518L7906L9937M2000M4273M6209M7171M7013M5907M4059M1727
58775A851965L9047L5563L0486K3690J6111Q888K459l372q844j4031j8908k3292
$$ y = [2072631, 2037590, 2001270, 1963854, 1925870, 1887750, 1849373, 1810226, 1770005, 1728855, 1687128, 1645249, 1603860, 1563669, 1524915, 1487199, 1450081, 1413661, 1378396, 1344528, 1312004, 1280864, 1251375, 1223707, 1197676, 1172946, 1149408, 1127235, 1106634, 1087699, 1070547, 1055426, 1042505, 1031658, 1022720, 1015850, 1011298, 1008738, 1007274, 1006348, 1006276, 1007591, 1010199, 1013661, 1017969, 1023436, 1029945, 1036957, 1044287, 1052228, 1060779, 1069253, 1076964, 1083853, 1090202, 1096112, 1101581, 1106878, 1112515, 1118956, 1126471, 1135113, 1144746, 1155328, 1167196, 1180896, 1196759, 1214937, 1235819, 1259870, 1286937, 1316223, 1347221, 1380245, 1415763, 1453669, 1493606, 1535606, 1579879, 1626088, 1673259, 1720272, 1766179, 1810238, 1851965, 1891012, 1926575, 1957061, 1980751, 1996862, 2005750, 2008209, 2004837, 1995993, 1981962, 1963054, 1939762]
58763A939762k6882k9574l1638l3502l5443l7514l9502m1007m1748m1829m1507
58752A539616m0842l9881l9005l8562l8242l7353l5765l4101l2756l1343k9378
58741A142388k7114k5289k4276k3702k2891k1486j9770j8293j7125j5759j4000
58730I12683j2598j2310j2619j2216j0747r196q370p814o646m637k050Q82L771
58717H18133O050P739R653J2206J4522J5514J5324J4875J4209J2217P989J764
58705I50195n476j2698j9090k4295k8461l1647l3268l2754l0664k8436k6768k4951
58693F51687k2102j8443j4895j1878r079o255l600j308Q67L351O271R314J1990
58680E95920J3970J5153J5456J4564J2069P997L098j519n148p809r800j1057j1128
$$ y = [1939762, 1912880, 1883306, 1851668, 1818166, 1782723, 1745209, 1705707, 1664700, 1622952, 1581123, 1539616, 1498774, 1458893, 1419888, 1381326, 1343084, 1305731, 1269966, 1235865, 1203109, 1171766, 1142388, 1115274, 1089985, 1065709, 1042007, 1019116, 997630, 977860, 959567, 942442, 926683, 912683, 900085, 887775, 875156, 862940, 852193, 842997, 834627, 826813, 820167, 815530, 813480, 814362, 818133, 824183, 831922, 841575, 853781, 868303, 883817, 899141, 914016, 928225, 940442, 948431, 950195, 944719, 932021, 912931, 888636, 860175, 828528, 795260, 762506, 731842, 703406, 676638, 651687, 629585, 611142, 596247, 584369, 575290, 569035, 565435, 564127, 564994, 568345, 574616, 583930, 595920, 609890, 625043, 640499, 655063, 667132, 675129, 678227, 676708, 671560, 663751, 653951, 642894, 631766]
58667F31766r795p506n084l181k124k087l115m928p018q965j0567j1725j2532
58654E43139j3392j4632j5817j5898j4361j1963r928q655p673o651n840n372m750
58641D08207l488j946r45o57l65M65J403J708J434J338J813K476K942L323L692
58626D21400L621K855J999J857K229K114J123J3m12k97l33p22j003o66K75J235
58610D35288J477Q13m3o8J011K524L740M512M961N017M695M427M692N460O323
58595D84829P042P615P996Q169Q465R382J0939J2503J3369J3409J3022J2598J2239
58582F21577J1971J1969J2263J2373J1627J0018Q380P398O746N604L782J860L26
58569G25894q04j553j784j637j623k019k511k704k610k530k721l345m349n253
$$ y = [631766, 621971, 614465, 609381, 606200, 604076, 601989, 598874, 593946, 586928, 577963, 567396, 555671, 543139, 529747, 515115, 499298, 483400, 469039, 457076, 447148, 438493, 430820, 424169, 418329, 412957, 408207, 404719, 402773, 401828, 401171, 400806, 401271, 402674, 404382, 405816, 407154, 408967, 411443, 414385, 417708, 421400, 425021, 427876, 429875, 431732, 433961, 436075, 437198, 437211, 436799, 436502, 436169, 435447, 434444, 433778, 434053, 435288, 436765, 437578, 437535, 437467, 438478, 441002, 444742, 449254, 454215, 459232, 463927, 468354, 473046, 478506, 484829, 491871, 499486, 507482, 515651, 524116, 533498, 544437, 556940, 570309, 583718, 596740, 609338, 621577, 633548, 645517, 657780, 670153, 681780, 691798, 700178, 707576, 714322, 719926, 723708, 725568, 725894, 725090, 723537, 721753, 720116, 718493, 716474, 713963, 711259, 708649, 706119, 703398, 700053, 695704, 690451]
58555F90451n444m856m092l754m063n114o907q892j0124j0337j0347j0944j1835
58542E93742j2135j1614j0840j0358j0214j0227j0193r880r121q019o851n830
58530D78460n016m339l606k691j863j629k100k746k967k649k064j462r40m78M2
58515D43952O56J111J153R98J095J408J430R56L13k43p33r71o00K06P95J012J342
58498D53880J899K157K048K295L105L596L252K931L503M427M689M376M146L919
58484E00223L328K865L150L536K891J491O39N84L55k95m87n1j95j566k990l073
58468E10405k148j630k057k661k584j864j232j321k023k491k018q37K48Q69J233
58453D89889J425J339J208J455J913J940J464J100J059Q34K87J10P35J460J394
$$ y = [690451, 685007, 680151, 676059, 672305, 668242, 663128, 656221, 647329, 637205, 626868, 616521, 605577, 593742, 581607, 569993, 559153, 548795, 538581, 528354, 518161, 508281, 499160, 491141, 484290, 478460, 473444, 469105, 465499, 462808, 460945, 459316, 457216, 454470, 451503, 448854, 446790, 445328, 444388, 443910, 443952, 444608, 445719, 446872, 447870, 448965, 450373, 451803, 452759, 453072, 452829, 452096, 451125, 450525, 450731, 451526, 452538, 453880, 455779, 457936, 459984, 462279, 465384, 468980, 472232, 475163, 478666, 483093, 487782, 492158, 496304, 500223, 503551, 506416, 509566, 513102, 515993, 517484, 518123, 518707, 519062, 518767, 518280, 518229, 518034, 516468, 513478, 510405, 508257, 506627, 504570, 501909, 499325, 497461, 496229, 494908, 492885, 490394, 488376, 487539, 487787, 488656, 489889, 491314, 492653, 493861, 495316, 497229, 499169, 500633, 501733, 502792, 503626, 503913, 504023, 504758, 506218, 507612]
58438E07612P38M62J083K218L142L374K926K333K231K695L201L334L167K868K404
58423E43788J889J709K061K629L055L338L557L568L284K979K978L238L471L497
58409E85041L425L552M112M926N430N292M872M730M868M982N184N833O753P339
58395F56339P480P575P653P229O303N629N661N903N679M981M224L671L439L636
58381G35402M149M733N416O354P220P383O891O480O445O310N939O009O834P602
58367H23167P519P011O968P345P441P143P002P225P411P261O944O700O592O750
58353I22479P418Q610R893J0584J0235R091Q157Q387R711J1090J1741J1857J2035
58340A051288J2456J2935J3369J3723J3908J3991J4245J4704J4921J4557J3903
$$ y = [507612, 508350, 508812, 509895, 512113, 515255, 518629, 521555, 523888, 526119, 528814, 532015, 535349, 538516, 541384, 543788, 545677, 547386, 549447, 552076, 555131, 558469, 562026, 565594, 568878, 571857, 574835, 578073, 581544, 585041, 588466, 592018, 596130, 601056, 606486, 611778, 616650, 621380, 626248, 631230, 636414, 642247, 649000, 656339, 663819, 671394, 679047, 686276, 692579, 698208, 703869, 709772, 715451, 720432, 724656, 728327, 731766, 735402, 739551, 744284, 749700, 756054, 763274, 770657, 777548, 784028, 790473, 796783, 802722, 808731, 815565, 823167, 830686, 837697, 844665, 852010, 859451, 866594, 873596, 880821, 888232, 895493, 902437, 909137, 915729, 922479, 929897, 938507, 948400, 958984, 969219, 978310, 986467, 994854, 1004565, 1015655, 1027396, 1039253, 1051288, 1063744, 1076679, 1090048, 1103771, 1117679, 1131670, 1145915, 1160619, 1175540, 1190097, 1204000]
58329A204000J3561J3711J4012J4097J3982J3946J4179J4533J4768J5014J5772
58318A361575J7155J8531J9340J9894K0833K2060K3016K3671K4475K5387K5884
58307A601821K5903K5938K6242K6738K7610K9019L0299L0503K9863K9477K9536
58296A912949K9129K8074K7539K8291K9559L0350L0740L1139L1399L1442L1882
58285B242493L3166L4834L6298L7603L8977M0369M1935M3976M6051M7216M7668
58274B690586M8966N1913N5444N8327O0783O3579O6712O9948P3531P7389Q0737
58263C397915Q3398Q6405R0310R4174R7158R9869J02995J05989J08417J11316
58253D377946J15655J20660J25221J29837J35583J42125J48485J54884J62213
$$ y = [1204000, 1217561, 1231272, 1245284, 1259381, 1273363, 1287309, 1301488, 1316021, 1330789, 1345803, 1361575, 1378730, 1397261, 1416601, 1436495, 1457328, 1479388, 1502404, 1526075, 1550550, 1575937, 1601821, 1627724, 1653662, 1679904, 1706642, 1734252, 1763271, 1793570, 1824073, 1853936, 1883413, 1912949, 1942078, 1970152, 1997691, 2025982, 2055541, 2085891, 2116631, 2147770, 2179169, 2210611, 2242493, 2275659, 2310493, 2346791, 2384394, 2423371, 2463740, 2505675, 2549651, 2595702, 2642918, 2690586, 2739552, 2791465, 2846909, 2905236, 2966019, 3029598, 3096310, 3166258, 3239789, 3317178, 3397915, 3481313, 3567718, 3658028, 3752202, 3849360, 3949229, 4052224, 4158213, 4266630, 4377946, 4493601, 4614261, 4739482, 4869319, 5004902, 5147027, 5295512, 5450396, 5612609]
58244E612609J70416J78946J88074J98226K08874K19567K31161K44527K58994
58235G511394K73648K89148L06679L26096L46827L69538L95113M23062M52770
58226A0694275M85192N21445N60989O03099O48909O99830P55279Q14164Q77435
58217A6660617R47240J025363J114649J219806J344268J488604J655070J851027
58209B7306644K084537K359737K680631L056098L496938M013021M619404N337834
58201E4954844O179556P128261Q150131R215018J0290589J1321076J2247917J3077154
58193A32564546J3909620J4866835J5965164J7053824J7857765J8064381J7388880
58186B47671015J5617311J2653518Q567938L622087j752086p024514j1680828
$$ y = [5612609, 5783025, 5961971, 6150045, 6348271, 6557145, 6776712, 7007873, 7252400, 7511394, 7785042, 8074190, 8380869, 8706965, 9053792, 9423330, 9818443, 10241505, 10694275, 11179467, 11700912, 12261901, 12865000, 13513909, 14213739, 14969018, 15783182, 16660617, 17607857, 18633220, 19747869, 20967675, 22311943, 23800547, 25455617, 27306644, 29391181, 31750918, 34431549, 37487647, 40984585, 44997606, 49617010, 54954844, 61134400, 68262661, 76412792, 85627810, 95918399, 107239475, 119487392, 132564546, 146474166, 161341001, 177306165, 194359989, 212217754, 230282135, 247671015, 263288326, 275941844, 284509782, 288131869, 286379783, 279355269, 267674441]
58179B67674441j5339705j7821003j9139878j9449991j8976298j7959276j6614820
58172A42373470j5113152j3577111j2089888j0701857r436911q301889p295291
58165F5857371o410319n635633m958624m368610l855947l410291l022221k685273
58157C1510453k394025k141526j920838j727989j560910j416200j289172j176461
58149A7883332j076490r87606r07705q35503p70566p12086o58876o10271n65941
58140A0758288n25200m87623m53774m24023l97178l71600l47248l25210l05624
58131G120808k87500k70421k54917k41115k28317k16090k04697j94197j84135
58122E039419j74358j65261j57028j49295j41817j34811j28495j22744j17390
$$ y = [267674441, 252334736, 234513733, 215373855, 195923864, 176947566, 158988290, 142373470, 127260318, 113683207, 101593319, 90891462, 81454551, 73152662, 65857371, 59447052, 53811419, 48852795, 44484185, 40628238, 37217947, 34195726, 31510453, 29116428, 26974902, 25054064, 23326075, 21765165, 20348965, 19059793, 17883332, 16806842, 15819236, 14911531, 14076028, 13305462, 12593376, 11934500, 11324229, 10758288, 10233088, 9745465, 9291691, 8867668, 8470490, 8098890, 7751642, 7426432, 7120808, 6833308, 6562887, 6307970, 6066855, 5838538, 5622448, 5417751, 5223554, 5039419, 4865061, 4699800, 4542772, 4393477, 4251660, 4116849, 3988354, 3865610, 3748220]
58113C748220j12320j07256j01969r6759r2272q8719q5587q2241p8465p4483p0734
58102B757415o7681o5501o3890o2364o0730n9093n7500n5774n3701n1278m8795
58091B111108m6590m4709m2875m1058l9794l9490l9617l9165l7898l6544l5634
58080A667734l4949l4259l3849l3835l3588l2439l0568k8754k7521k6845k6388
58069A324739k5704k4526k3092k1948k1285k0821k0307j9710j8908j7820j6900
58058A093718j6744j7095j7027j6359j5900j6023j5978j5246j4500j4460j4646
58047I19740j4261j3628j3617j4147j4237j3438j2252j1299j0810j0859j1330
58036G79862j1665j1327j0432r553q970q573q312q228q265q381q679r011q843
$$ y = [3748220, 3635900, 3528644, 3426675, 3329916, 3237644, 3148925, 3063338, 2981097, 2902632, 2828149, 2757415, 2689734, 2624233, 2560343, 2497979, 2437249, 2378156, 2320656, 2264882, 2211181, 2159903, 2111108, 2064518, 2019809, 1976934, 1935876, 1896082, 1856592, 1816975, 1777810, 1739912, 1703368, 1667734, 1632785, 1598526, 1564677, 1530842, 1497254, 1464815, 1434247, 1405493, 1377972, 1351127, 1324739, 1299035, 1274509, 1251417, 1229469, 1208184, 1187363, 1167056, 1147346, 1128438, 1110618, 1093718, 1076974, 1059879, 1042852, 1026493, 1010593, 994570, 978592, 963346, 948846, 934386, 919740, 905479, 891851, 878234, 864087, 849850, 836412, 824160, 812861, 802051, 791192, 779862, 768197, 756870, 746438, 736885, 727915, 719342, 711030, 702802, 694537, 686156, 677477, 668466, 659623]
58023F59623q020p245p247p799q113p925p493o955o332n942o003o000n265m112
58009E65172l553l932m503m491l913l207k634k164j632q43J55R75J385J693K226
57994E40734K729K806K696K979L699M450N203O278P526Q408Q944R780J1115J2349
57980F29696J3156J4163J5963J8029J9332J9772K0297K1544K2882K3098K1741
57969H39673J9393J6651J3294Q813L487j730o339j0670j4964j8726k1447k3315
57957H04120k4736k5607k5680k5246k4748k4100k2979k1487j9885j8003j5677
57946E55972j3393j1675j0124q065n929m867m969n016m233l275k984l139k997
57933D75306k406j828j667k120l174m396n015m612l563k579k117k186k403k106
$$ y = [659623, 651603, 644358, 637111, 629312, 621199, 613274, 605781, 598826, 592494, 586552, 580549, 574549, 569284, 565172, 561619, 557687, 553184, 548693, 544780, 541573, 538939, 536775, 535143, 534300, 534455, 535430, 536815, 538508, 540734, 543463, 546269, 548965, 551944, 555643, 560093, 565296, 571574, 579100, 587508, 596452, 606232, 617347, 629696, 642852, 657015, 672978, 691007, 710339, 730111, 750408, 771952, 794834, 817932, 839673, 859066, 875717, 889011, 897824, 901311, 899581, 893242, 882572, 867608, 848882, 827435, 804120, 779384, 753777, 728097, 702851, 678103, 654003, 631024, 609537, 589652, 571649, 555972, 542579, 530904, 520780, 512715, 506786, 501919, 496950, 491934, 487701, 484426, 481442, 478303, 475306, 472900, 471072, 469405, 467285, 464111, 459715, 454700, 450088, 446525, 443946, 441829, 439643, 437240, 435134]
57919D35134r60N96J942L252N124P240Q371Q038P252P138P590P870P747P317O271
57904E19922M307J930K8j264k685m863p673j0473j2621j3816j4249j4299j4002
57891D30242j3189j2256j2098j2867j3400j2645j1115j0174j0107r903q872p594
57879B96022p006p176p324o706n298l838l215l567m020l678k679j851j375n58
57865B37731J018K735L745L999M068M178L982L218K211J558J496J679J588J053
57851B74259K51o41j597k413k633k149j610j740k349k525j894j082p48o48j07
57836B52374R30J816K089J965J899K006K115K113K087K145K196J862P45j098k976
57821B72268m085m214l787l253k769k552k934l735l944k772q13M66O05P39K007
$$ y = [435134, 434174, 434770, 436712, 439964, 445088, 452328, 460699, 468737, 475989, 483127, 490717, 498587, 506334, 513651, 519922, 524229, 526159, 526187, 524923, 522238, 517375, 509702, 499229, 486608, 472792, 458543, 444244, 430242, 417053, 404797, 392699, 379832, 366432, 353787, 342672, 332498, 322391, 312488, 303616, 296022, 289016, 281840, 274516, 267810, 262512, 258674, 255459, 251892, 247872, 244194, 241515, 239664, 238289, 237731, 238749, 241484, 245229, 249228, 253296, 257474, 261456, 264674, 266885, 268443, 269939, 271618, 273206, 274259, 274510, 273869, 272272, 269859, 267226, 265077, 263467, 261727, 259378, 256853, 254959, 253877, 253129, 252481, 252374, 253304, 255120, 257209, 259174, 261073, 263079, 265194, 267307, 269394, 271539, 273735, 275597, 276342, 275244, 272268, 268183, 263969, 260182, 256929, 254160, 251608, 248674, 244939, 240995, 238223, 237410, 237876, 238481, 239220, 241227]
57806B41227L991N355N695N990P243R333J1333J2538J2890J2793J2685J2678J2475
57793C66226J1696J0385Q967P737O478M669J995j313m456o596p582q125q985j0136
57779C70960j1016j1337j1243j0792r945r056q740r066r385r205q788q550q412
57766B45425q073p564p103o683o240n917n742n257l998k294j098r85j574k028
57752A80869j878j316p93m63k9P79J685K079J743J084N46J46k27m07j55M35R91
57735A85089J235J209J240J700K567L204L038K442K369K963L226K463J373J066
57721B15184J617K255K535K472J918P56m34r05q94j356k449l171k830k082j955
57706B10661k507k975k897k450j895j227l97L75O99M62O0oJ52j50j136j978j771
$$ y = [241227, 245218, 250573, 256268, 262258, 269501, 278834, 290167, 302705, 315595, 328388, 341073, 353751, 366226, 377922, 388307, 397274, 405011, 411489, 416158, 418153, 416840, 412384, 405788, 398206, 390081, 381096, 370960, 359944, 348607, 337364, 326572, 316627, 307571, 298831, 289765, 280380, 271175, 262387, 253837, 245425, 237352, 229788, 222685, 216002, 209762, 203845, 198103, 192846, 188848, 186554, 185456, 184471, 182897, 180869, 178991, 177675, 176882, 176419, 176390, 177169, 178854, 180933, 182676, 183760, 184306, 184452, 184225, 183818, 183663, 184098, 185089, 186324, 187533, 188773, 190473, 193040, 196244, 199282, 201724, 204093, 207056, 210282, 212745, 214118, 215184, 216801, 219056, 221591, 224063, 225981, 226737, 226303, 225398, 224504, 223148, 220699, 217528, 214698, 212616, 210661, 208154, 205179, 202282, 199832, 197937, 196710, 196313, 196688, 197387, 197849, 197909, 197903, 198055, 197905, 196769, 194791, 193020]
57689A93020p91p9M5K79J124K251L269M338N613O827P829R053J0912J3308J6132
57674B73130J9767K4527L0065L5817M1555M6966N1109N2856N1437M5988L5248
57663G08465J9024r8j7551k9793l6150l7800l5986l1580k5602j9281j3576q932
57651D71140n350k577l28J443K640L322L665L673L238K590K262K405K496J937
57637D92556P37o48j908l085m330n702p099q242q920r228r413r414q999q395q278
57622C99632q766q941p992o448n575n710n968n570m699l845l064k315j854j793
57608C27092j691j182n50j82K03J079K161K703K722L082M201N437O002N892N614
57593C62583N512N756O430P216P390O687N764N331N218M836M230L903L712K837
$$ y = [193020, 192229, 192150, 192195, 192474, 193598, 195849, 199118, 203456, 209069, 215896, 223725, 232778, 243690, 256998, 273130, 292897, 317424, 347489, 383306, 424861, 471827, 522936, 575792, 627229, 673217, 708465, 727489, 727391, 709840, 680047, 643897, 606097, 570111, 538531, 512929, 493648, 480072, 471140, 465790, 463213, 462885, 464328, 466968, 470290, 473955, 477628, 480866, 483456, 485718, 488123, 490619, 492556, 493293, 492645, 490737, 487652, 483322, 477620, 470521, 462279, 453359, 444131, 434718, 425304, 416305, 407910, 399632, 390866, 381925, 373933, 367485, 361910, 356200, 350232, 344662, 339963, 336118, 333054, 330739, 328885, 327092, 325401, 324219, 323669, 323487, 323690, 324769, 326930, 329633, 332355, 335437, 339638, 345075, 351077, 356969, 362583, 368095, 373851, 380281, 387497, 394887, 401574, 407338, 412669, 417887, 422723, 426953, 430856, 434568, 437405]
57579D37405R33j345l149m277n008n667o578p888r204r825r631r333r484r756
57565C47193r634r370r610j0288j0583j0030r103q468q140p684o965o315n965
57552B35038n640m872l638k493k010k176k481k476k059j387p17l57m84q43r03
57537B02502l92M03R42Q58J45q26j427j270o37j96k14m53p37j040r26K53K132
57520A99117L102K154L86j95R21K556L781M803N766O014N186M143L884M197M155
57505B49970L644L411L821M396M710M968N499O179O736P155P426P304O640N784
57491C27643N189M771M072L045K202J835J490O14o37j653k299l055m209n382o084
57476C27542o331o434o519o606o843p274p546p341o912o754o826o605n948n309
$$ y = [437405, 438338, 436993, 433844, 429567, 424559, 418892, 412314, 404426, 395222, 385397, 375766, 366433, 356949, 347193, 337559, 328189, 318579, 308291, 297708, 287678, 278575, 270107, 261967, 254283, 247318, 241003, 235038, 229398, 224526, 220888, 218395, 216385, 214209, 211728, 209252, 207193, 205806, 205089, 204732, 204248, 203405, 202502, 202110, 202513, 203455, 204313, 204458, 203632, 202205, 200935, 200298, 200102, 199888, 199435, 198698, 197658, 196732, 196985, 199117, 202219, 204373, 204759, 204564, 205485, 208041, 211822, 216625, 222391, 228405, 233591, 237734, 241618, 245815, 249970, 253614, 257025, 260846, 265242, 269952, 274920, 280419, 286598, 293334, 300489, 307915, 315219, 321859, 327643, 332832, 337603, 341675, 344720, 346922, 348757, 350247, 350861, 350224, 348571, 346272, 343217, 339008, 333626, 327542, 321211, 314777, 308258, 301652, 294809, 287535, 279989, 272648, 265736, 258982, 252156, 245551, 239603, 234294]
57462B34294n030m861m376l485k363j255m97k72k45J66R01J232Q44M22O86J347
57446B17508J702J774K202L114M023M743N639O757P399O998O021N538O078P163
57432B86659P822P419O051M354K904J854J130P56O53L58o46k312m089n560o656
57417C00697p287p327p098p316q261r295r568q921p934p289p244p494p440o879
57403A91344o385o560o901o210m379k914l024l984m156l217k261k047k202k174
57389A34930k020j951j922j950k192k415k029r91q9K6m06q09j053j302j547j736
57373A12544j946k057j702r62n68r22j414j342j052j320j985k129j548j007r41
57358I1649p67M1R60J111M64k30m60m01m28o19p56o07j25M93R22R77P24L64J22
$$ y = [234294, 229264, 224403, 220027, 216542, 214179, 212924, 212427, 212155, 211910, 212076, 212977, 214209, 215053, 215475, 216161, 217508, 219210, 220984, 223186, 226300, 230323, 235066, 240705, 247462, 254861, 261859, 267880, 273418, 279496, 286659, 294481, 301900, 307951, 312305, 315209, 317063, 318193, 318949, 319602, 319960, 319314, 317002, 312913, 307353, 300697, 293410, 286083, 278985, 271669, 263408, 254113, 244545, 235624, 227690, 220401, 213157, 205663, 198223, 191344, 184959, 178399, 171498, 165288, 160909, 157995, 154971, 150987, 146831, 143614, 141353, 139306, 137104, 134930, 132910, 130959, 129037, 127087, 124895, 122480, 120451, 119460, 119371, 119397, 118991, 118182, 117129, 115827, 114280, 112544, 110598, 108541, 106839, 105877, 105309, 104387, 102973, 101631, 100579, 99259, 97274, 95145, 93597, 92590, 91649, 90882, 90923, 91883, 92994, 93458, 93228, 92768, 92367, 91939, 91320, 90564, 89957, 89832, 90325, 91247, 92224, 92948, 93312, 93434]
57339I3434J55M44P25O64K08l84q05q77n46J01Q06J306J505J427J099P21O77J026
57321A01686J159M71o90j319j021l60J17N44J041J165N80k05m26j04Q3j99o56
57304A01866r06p71j49Q94J918K460K554K441J933P47n54p81L51J661J897J300
57288A16861J112J860K789L000K495J924J714J762J777J633J434J381J616K082
57274A43440K547K864L119L398L488L046K102J139N13O6m57q92r42q58j234k113
57258A59226k800k796k399k110j941j722j706k192k786k642j496m1P99O44k65
57243A35773j342j933j685p97K27J068J671J990K021J975J997J805J048P0k81
57228A43607K81J070J336J153J108J439J913K287K520K604K506K226J814J377
$$ y = [93434, 93589, 94033, 94758, 95422, 95630, 95246, 94441, 93564, 93018, 93119, 93925, 95231, 96736, 98163, 99262, 99983, 100660, 101686, 102845, 103316, 102626, 101307, 100286, 99926, 100043, 100587, 101628, 102793, 103373, 103168, 102742, 102638, 102721, 102522, 101866, 100960, 100189, 100040, 100934, 102852, 105312, 107866, 110307, 112240, 112987, 112433, 111652, 112003, 113664, 115561, 116861, 117973, 119833, 122622, 125622, 128117, 130041, 131755, 133517, 135294, 136927, 138361, 139742, 141358, 143440, 145987, 148851, 151970, 155368, 158856, 161902, 164004, 165143, 165656, 165722, 165265, 164373, 163431, 162573, 161339, 159226, 156426, 153630, 151231, 149121, 147180, 145458, 143752, 141560, 138774, 136132, 134636, 134595, 135394, 136038, 135773, 134431, 132498, 130813, 130016, 130243, 131311, 132982, 134972, 136993, 138968, 140965, 142770, 143818, 143888, 143607, 143888, 144958, 146294, 147447, 148555, 149994, 151907, 154194, 156714, 159318, 161824, 164050, 165864, 167241]
57214A67241J158J421K143K943L453L601L484L226L012K983K979K653K083J873
57200B04253K403L233L554L133K505K317K759L515M020L888L279K774K701K767
57186B47101K523J999J580J432J455J696K349L247L786L518K680J975J944K608
57172B79893L572M367M778M960N268N915O791P556P986Q237Q698R503J0326J0813
57158C78663J1091J1453J1739J1484J0785J0507J1263J2645J3762J4245J4343
57147E11980J4386J4620J5302J6421J7463J7967J8221J8910K0133K1255K1814
57136G08472K2088K2641K3694K5136K6806K8563L0292L1958L3597L5316L7354
57125A025917L9972M2983M5723M7826M9848N2512N5555N8076N9985O2321O5920
$$ y = [167241, 168399, 169820, 171963, 174906, 178359, 181960, 185444, 188670, 191682, 194665, 197644, 200297, 202380, 204253, 206656, 209889, 213443, 216576, 219081, 221398, 224157, 227672, 231692, 235580, 238859, 241633, 244334, 247101, 249624, 251623, 253203, 254635, 256090, 257786, 260135, 263382, 267168, 270686, 273366, 275341, 277285, 279893, 283465, 287832, 292610, 297570, 302838, 308753, 315544, 323100, 331086, 339323, 348021, 357524, 367850, 378663, 389754, 401207, 412946, 424430, 435215, 445722, 456985, 469630, 483392, 497637, 511980, 526366, 540986, 556288, 572709, 590172, 608139, 626360, 645270, 665403, 686658, 708472, 730560, 753201, 776895, 802031, 828837, 857400, 887692, 919650, 953247, 988563, 1025917, 1065889, 1108872, 1154595, 1202421, 1252269, 1304781, 1360336, 1418412, 1478397, 1540718, 1606638]
57114A606638P0468P5253Q0117Q5222R0582R6471J03828J13435J24993J37782
57104B584789J52089J69247J90210K14892K43076K75363L12819L56012M04724
57095D903221M58270N15647N75390O35498O93496P46625P92152Q27714Q51344
57086A0999357Q61166Q55256Q31938P90095P29144O48978N50192M34305L03723
57077A7004154J61638J2263j38949k85787m22439n44441o48747p33258p96629
57068A3607805q38545q59903q62593q49044q22021p84609p40024o91093o39891
57059F520082n87880n36361m86600m39514l95394l54190l15998k81100k49566
57050B873479k21090j95368j72353j51902j33405j16140r9892q4861p1116n8771
$$ y = [1606638, 1677106, 1752359, 1832476, 1917698, 2008280, 2104751, 2208579, 2322014, 2447007, 2584789, 2736878, 2906125, 3096335, 3311227, 3554303, 3829666, 4142485, 4498497, 4903221, 5361491, 5877138, 6452528, 7088026, 7781522, 8528147, 9320299, 10148013, 10999357, 11860523, 12715779, 13547717, 14337812, 15066956, 15715934, 16266126, 16700431, 17004154, 17165792, 17178055, 17039106, 16753319, 16330880, 15786439, 15137692, 14404434, 13607805, 12769260, 11909357, 11046764, 10197720, 9375699, 8591090, 7851066, 7159973, 6520082, 5932202, 5395841, 4909241, 4469727, 4074333, 3720143, 3404145, 3123045, 2873479, 2652389, 2457021, 2284668, 2132766, 1999361, 1883221, 1783329, 1698468, 1627352, 1568581]
57040A568581m8862m3350m3542m8634n6010o2799o6964o7509o4571n9411n3700
57029I53229m8455m3790l9583l5885l2615k9422k6154k3147k0788j9050j7724
57018F16616j6756j6117j5569j4914j4291j3901j3575j2972j2113j1453j1343
57007D63612j1732j2309j2697j2554j1781j0751j0058r884r792r261q297p311
56995C37185o588o030n410m631l760k941k256j583o34O00J476J206p6j223j494
56980C03841j626k868n121o950p525p631q213q827q405o999n727n057m239k587
56966B22066n21J051J792K000K082K355L097M284N448N997N706M746L448K051
56952B65602N50j182k974m221m501m166l892l734l194k191j268p31k36N90J734
$$ y = [1568581, 1519719, 1476369, 1432827, 1384193, 1328183, 1265384, 1198420, 1130911, 1066340, 1006929, 953229, 904774, 860984, 821401, 785516, 752901, 723479, 697325, 674178, 653390, 634340, 616616, 599860, 583743, 568174, 553260, 538969, 525068, 511493, 498521, 486408, 474955, 463612, 451880, 439571, 426874, 414320, 402539, 391788, 381730, 371846, 362054, 352793, 344496, 337185, 330597, 324567, 319157, 314526, 310766, 307825, 305569, 303986, 303352, 303952, 305428, 306634, 306558, 305335, 303841, 302215, 299347, 294226, 287276, 279751, 272120, 263907, 255080, 246675, 239676, 233949, 228892, 224653, 222066, 221545, 222596, 224388, 226388, 228470, 230825, 233922, 238206, 243654, 249651, 255357, 260103, 263551, 265602, 266152, 264970, 261996, 257775, 253274, 249108, 245216, 241482, 238288, 236097, 234829, 234098, 233862, 234452, 236186]
56937B36186L235N249P355Q597Q632Q174P703O608M320J604l06j428k852n081
56923B87996p484r272j0110r868q702p419o891o993o833o100n307m664l722k439
56909A92192j635j837k458k668k456k278k159j834j353q83l19M20R32Q77P55J467
56893A76763L106M745N500N371M942M756M987N436N621N151M108K913J773N41
56879B35713p85j767j964j521j010p17l87K87J228K201L268M630O073O993P163
56864B59405P174P813R185J0651J1458J1151R603P063M131J296j476m311o776
56851C26367q085q025p180o105m831l326j887n97J182M136P916J1274J3436J4926
56837C39201J6810J9287K1371K1954K0838J8478J4989J0008L722k611p672j1210
$$ y = [236186, 239421, 244670, 252025, 260622, 269254, 277428, 285131, 291739, 296059, 297663, 297357, 295929, 293077, 287996, 280512, 271240, 261130, 251262, 242560, 235141, 228250, 221257, 214424, 208324, 203017, 198353, 194631, 192192, 190557, 188720, 186262, 183594, 181138, 178860, 176701, 174867, 173514, 172631, 172312, 172732, 173664, 174541, 175296, 176763, 179869, 184614, 190114, 195485, 200427, 205183, 210170, 215606, 221227, 226378, 230486, 233399, 235172, 235713, 234928, 233161, 231197, 229676, 228666, 227949, 227562, 227849, 229077, 231278, 234546, 239176, 245249, 252242, 259405, 266579, 274392, 283577, 294228, 305686, 316837, 326440, 333503, 337634, 338930, 337454, 333143, 326367, 318282, 310257, 303077, 296972, 292141, 288815, 286928, 286331, 287513, 291649, 299565, 310839, 324275, 339201, 356011, 375298, 396669, 418623, 439461, 457939, 472928, 482936, 486658, 484047, 476375, 465165]
56825D65165j3690j5220j5576j5113j4641j4276j3232j1060q275n424k275J419
56813C37802N043P738R455J0697J1558J1743J1322J0667R651P582M033o98n913
56800D30680j0771j4342j6045j6235j5898j5512j4657j2887j0538q341o542m804
56788B84108k844p94J107K859M545N919O443N830M418K801J214m82k285l994n637
56773C03208p505r514j1032j1569j1303j0597r536q314p521p398p218o195m751
56760A90755m086m566n306n390m736l694k576j785j745k241k428j816q32j49O0
56745A49465q6n19j067j329j201j051j092j034p13o26j213k088k528k427k167
56730A30324j865j415j097j274j662j586j026o09m85p5P78J286Q99K82L38P61
$$ y = [465165, 451475, 436255, 420679, 405566, 390925, 376649, 363417, 352357, 344082, 338658, 336383, 337802, 342845, 350583, 360038, 370735, 382293, 394036, 405358, 416025, 425676, 433258, 437291, 436593, 430680, 419909, 405567, 389522, 373287, 357389, 341877, 327220, 314333, 303795, 295454, 288912, 284108, 281264, 280470, 281577, 284436, 288981, 294900, 301343, 307173, 311591, 314392, 315606, 315124, 312839, 308845, 303208, 295703, 286189, 275157, 263588, 252285, 241688, 232152, 223838, 216317, 208919, 201701, 195506, 190755, 186669, 182103, 176797, 171407, 166671, 162977, 160401, 158616, 156871, 154630, 152202, 150386, 149554, 149405, 149465, 149379, 148860, 147793, 146464, 145263, 144212, 143120, 142086, 141373, 140747, 139534, 137446, 134918, 132491, 130324, 128459, 127044, 125947, 124673, 123011, 121425, 120399, 119790, 119305, 119230, 120008, 121294, 122193, 122475, 122813, 123574]
56714A23574N38l11n71L58J427J330L49p1O39J426J146Q9n54l46jk24q00j084
56696A26914q42l15K15N37M22j44p03p50l41J13N46J245K048K209J405M69N34
56679A33562J636K728K968K585K312K505L031L637M119M328M400M801N772O701
56665A85085O530M960K982J902J981K301J906P83l22p74m95K28J032J570J593
56650B11262J159P31P90J321J768J603Q72J01k72k91k93m82p50q92r02r94j340
56633B13391j805k036j834j396j096j075j106r32o29n50q99j455j822j830j658
56618A93268j506j376j221j134j166j110p54l31k34k35M60K003L247K930J288
56603A94129k07o77o65r72j460j509j126r09j130j419j387j091q28p52q50j084
$$ y = [123574, 124112, 123801, 123230, 123588, 125015, 126345, 126694, 126623, 127262, 128688, 129834, 129923, 129369, 129023, 129022, 128798, 127998, 126914, 126072, 125757, 125972, 126509, 126931, 126787, 126084, 125334, 124993, 125106, 125652, 126897, 128945, 131154, 132559, 133028, 133562, 135198, 137926, 140894, 143479, 145791, 148296, 151327, 154964, 159083, 163411, 167811, 172612, 178384, 185085, 191615, 196575, 199557, 201459, 203440, 205741, 207647, 208430, 208108, 207334, 206839, 207067, 208099, 209669, 211262, 212421, 213152, 213942, 215263, 217031, 218634, 219506, 219607, 219335, 219044, 218751, 218269, 217519, 216627, 215725, 214731, 213391, 211586, 209550, 207716, 206320, 205224, 204149, 203043, 202111, 201482, 200932, 200033, 198578, 196756, 194926, 193268, 191762, 190386, 189165, 188031, 186865, 185755, 185001, 184670, 184436, 184201, 184661, 186664, 189911, 192841, 194129, 193922, 193245, 192580, 191608, 190148, 188639, 187513, 186604, 185474, 184055, 182668, 181577, 180749, 179997, 179147, 178063]
56587A78063j472k024k570k680k028q66J18O00R14J341J583J367J151J578K438
56572A77513K867K534J960J618J458J473J956K807L242K822K231K442L337L889
56558B12149L535K742K149J781J293N56l15j189j840j830q62P09J991K264J522
56543B24655K88q88j647j763j234m76j10l08o10o39p59j554k800l525l332k966
56527B02332l229l744l520k453j593j732k418k713k445k176k189k111j645j122
56513A69242j059j482k028k466k754k719k159j265n34j83j9L4j95n74n47L5M65
56496A51792J45m52m67RJ58j56j55M87J033Q34L17K16M86O00N00N26O85O39K26
56477A57423m58j282j847j437J03J718K127J462J029J469K023J888J399J308J519
$$ y = [178063, 176591, 174567, 171997, 169317, 167289, 166423, 166541, 167141, 168055, 169396, 170979, 172346, 173497, 175075, 177513, 180380, 182914, 184874, 186492, 187950, 189423, 191379, 194186, 197428, 200250, 202481, 204923, 208260, 212149, 215684, 218426, 220575, 222356, 223649, 224205, 223890, 222701, 220861, 219031, 218169, 218878, 220869, 223133, 224655, 224943, 224055, 222408, 220645, 219411, 218935, 218825, 218517, 217907, 217268, 216509, 214955, 212155, 208630, 205298, 202332, 199103, 195359, 191839, 189386, 187793, 186061, 183643, 180930, 178485, 176309, 174120, 172009, 170364, 169242, 168183, 166701, 164673, 162207, 159453, 156734, 154575, 153310, 152776, 152593, 152574, 152608, 152413, 151839, 151292, 151327, 151792, 151937, 151485, 151018, 151027, 151185, 151029, 150874, 151361, 152394, 153228, 153545, 153761, 154247, 154847, 155347, 155873, 156558, 157197, 157423, 156965, 155683, 153836, 152399, 152502, 154220, 156347, 157809, 158838, 160307, 162330, 164218, 165617, 166925, 168444]
56462A68444J327N32k89n71l00J53L76J51l28n00J8R33J541J417P28m6m33j43
56444A73010P14J573J786J174N8j171k264k900k632j360K80J239R69k4o46l23
56428A69483M33O77K09k45r6K77R5o75j248j061l46L83Q83J035O78k2m07j2P31
56409A70772R72M95n6rO66J472J864J567P94J96K62O97P84L80R5K78L91j72j037
56390A80411j161j67J180J864J666J174R57R51P06J53n7O86J947K477J692M59
56374A94938M2O38J455J904K026J906J441Q31O61J149J768J877J403P33K19k5
56358B12966o5n2QL97J237J947J709N60m64n45N8O22Q87J011J084J158J432J912
56340B25862K132J676P50l5k12M41J818L140L284K058P07M33R28J141J013J283
$$ y = [168444, 169771, 170303, 170014, 169443, 169143, 169296, 169672, 169823, 169495, 168995, 169013, 169946, 171487, 172904, 173632, 173586, 173153, 173010, 173724, 175297, 177083, 178257, 178315, 177144, 174880, 171980, 169348, 167988, 168268, 169507, 170476, 170452, 169806, 169483, 169916, 170593, 170802, 170557, 170461, 170738, 170833, 170158, 168910, 167849, 167503, 167886, 168769, 169804, 170482, 170460, 170053, 170041, 170772, 171744, 172239, 172183, 172174, 172840, 174312, 176176, 177743, 178537, 178733, 178995, 179692, 180476, 180856, 180951, 181229, 181620, 181448, 180411, 179250, 179083, 180263, 182127, 183793, 184967, 185924, 186875, 187581, 187734, 187677, 188363, 190310, 192787, 194479, 194938, 194980, 195618, 197073, 198977, 201003, 202909, 204350, 205181, 205842, 206991, 208759, 210636, 212039, 212772, 212991, 212966, 212901, 212849, 212857, 213254, 214491, 216438, 218147, 218707, 218243, 217698, 217756, 218378, 219265, 220276, 221360, 222518, 223950, 225862, 227994, 229670, 230420, 230385, 230173, 230614, 232432, 235572, 238856, 240914, 241621, 242054, 242982, 244123, 245136, 246419]
56324B46419J921K042J521J332J897K303J798R95Q23J107J189J237J808K556K542
56309B71490J761J274J678K375K636K610K842L377L768L671L053K143J420J424
56295C05522K224L316M173M686M869M578L891L446L786M569M906M608M463N120
56281C64157O218O963P189P335P628P800P657P436P471P823Q442R343J0394J1218
56267D77074J1608J1893J2631J3971J5654J7544J9883K2879K6345K9907L3481
56256F92870L7407M2066M7475N3217N8756O3796O8319P2397P6062P9336Q2073
56245A373774Q3740Q3568Q1128P6643P0511O2676N2827M1110K8282J5139K048
56234A971446j0739k2621l2827m1092m7923n4028n9491o3647o5910o6518o6227
$$ y = [246419, 248340, 250382, 251903, 253235, 255132, 257435, 259233, 260228, 261051, 262158, 263347, 264584, 266392, 268948, 271490, 273251, 274525, 276203, 278578, 281214, 283824, 286666, 290043, 293811, 297482, 300535, 302678, 304098, 305522, 307746, 311062, 315235, 319921, 324790, 329368, 333259, 336705, 340491, 345060, 349966, 354574, 359037, 364157, 370375, 377338, 384527, 391862, 399490, 407290, 414947, 422383, 429854, 437677, 446119, 455462, 465856, 477074, 488682, 500575, 513206, 527177, 542831, 560375, 580258, 603137, 629482, 659389, 692870, 730277, 772343, 819818, 873035, 931791, 995587, 1063906, 1136303, 1212365, 1291701, 1373774, 1457514, 1541082, 1622210, 1698853, 1769364, 1832040, 1884867, 1925977, 1954259, 1969398, 1971446, 1960707, 1938086, 1905259, 1864167, 1816244, 1762216, 1702725, 1639078, 1573168, 1506650, 1440423]
56223A440423o5421o3907o1656n9152n6713n3950n0461m6691m3498m0993l8524
56212H59457l5765l3124l0886k8632k5858k2691j9689j7215j5352j4085j3192
56201F02968j2195j0717q822o841n104l880l262k888k212j313j019j811k933l122
56187E36849k014l86Q85J560J851J956J963J891J720J489J400J644K267L250M509
56172E60834N603N806M975M055M197N417O698P356P660Q059Q502Q817R204R869
56158F57052J0575J1057J1586J2692J4530J6957K0072K4229K9401L4996M0429
56147H83576M5652N0994N6575O1958O6169O8104O7053O3016N6612M8895M1297
56136A509901L5390L2062L0724K9697K7647K4459K0567J5913J0138L749j749n304
$$ y = [1440423, 1375002, 1311095, 1249439, 1190287, 1133574, 1079624, 1029163, 982472, 938974, 897981, 859457, 823692, 790568, 759682, 731050, 705192, 682501, 662812, 645597, 630245, 616160, 602968, 590773, 580056, 571234, 564393, 559289, 555409, 552147, 549259, 547047, 545734, 544715, 542904, 539971, 536849, 534835, 534449, 535334, 536894, 538745, 540701, 542664, 544555, 546275, 547764, 549164, 550808, 553075, 556325, 560834, 566437, 572243, 577218, 581273, 585470, 590887, 597585, 604941, 612601, 620660, 629162, 637979, 647183, 657052, 667627, 678684, 690270, 702962, 717492, 734449, 754521, 778750, 808151, 843147, 883576, 929228, 980222, 1036797, 1098755, 1164924, 1233028, 1300081, 1363097, 1419709, 1468604, 1509901, 1545291, 1577353, 1608077, 1637774, 1665421, 1689880, 1710447, 1726360, 1736498, 1740247, 1738498, 1733194]
56124A733194p629j0629j5742k3089l1979m1457n0277n6969o0469o0583n7683
56113A316688n2265m5161l7756l1334k6080k1184j6056j1070o991m014j712K75
56101A063340J900L046L921M848N856O659P044P129P191P338P521P739Q078Q543
56087A150153R100R819J0763J1643J2013J1922J2068J2960J4208J5087J5556J6204
56075A301496J7263J8271J8835J9174J9632K0125K0471K0946K1985K3438K4546
56064A526182K4756K4295K3838K3857K4312K4824K4980K4605K3947K3597K4107
56053A793300K5513K7186K8314K8632K8645K9016K9843L0725L1454L2307L3585
56042B118520L5141L6611L7902L9204M0700M2449M4485M6743M8883N0467N1374
$$ y = [1733194, 1725565, 1714936, 1699194, 1676105, 1644126, 1602669, 1552392, 1495423, 1434954, 1374371, 1316688, 1264423, 1219262, 1181506, 1150172, 1124092, 1102908, 1086852, 1075782, 1068791, 1064777, 1063065, 1063340, 1065240, 1068286, 1072207, 1077055, 1082911, 1089570, 1096614, 1103743, 1110934, 1118272, 1125793, 1133532, 1141610, 1150153, 1159253, 1169072, 1179835, 1191478, 1203491, 1215413, 1227481, 1240441, 1254649, 1269736, 1285292, 1301496, 1318759, 1337030, 1355865, 1375039, 1394671, 1414796, 1435267, 1456213, 1478198, 1501636, 1526182, 1550938, 1575233, 1599071, 1622928, 1647240, 1672064, 1697044, 1721649, 1745596, 1769193, 1793300, 1818813, 1845999, 1874313, 1902945, 1931590, 1960606, 1990449, 2021174, 2052628, 2084935, 2118520, 2153661, 2190272, 2228174, 2267378, 2308078, 2350527, 2395012, 2441755, 2490638, 2541105, 2592479]
56031B592479N1990N2948N4775N7699O1545O5731O9549P2647P5282P8055Q1381
56020C314081Q5158Q8873R2033R4588R6932R9605J02943J06985J11493J16010
56010D308701J20135J24011J28452J34276J41443J49074J56427J63675J71606
56001E597800J80652J90475K00467K10440K20717K31709K43649K56855K71888
55992G604652K89164L08356L28568L49326L71168L95024M21271M49793M80795
55983A0998117N14970N52862N94585O40406O91170P47783Q10775Q80778R59120
55974A7390566J047448J146993J258886J385110J528555J692213J879102K093381
55966B9422254K341106K629605K966653L360861L822841M365766N004670N754879
$$ y = [2592479, 2644469, 2697417, 2752192, 2809891, 2871436, 2937167, 3006716, 3079363, 3154645, 3232700, 3314081, 3399239, 3488112, 3580145, 3674733, 3771665, 3871270, 3974213, 4081198, 4192691, 4308701, 4428836, 4552847, 4681299, 4815575, 4957018, 5106092, 5262519, 5426194, 5597800, 5778452, 5968927, 6169394, 6379834, 6600551, 6832260, 7075909, 7332764, 7604652, 7893816, 8202172, 8530740, 8880066, 9251234, 9646258, 10067529, 10517322, 10998117, 11513087, 12065949, 12660534, 13300940, 13992110, 14739893, 15550668, 16431446, 17390566, 18438014, 19585007, 20843893, 22229003, 23757558, 25449771, 27328873, 29422254, 31763360, 34392965, 37359618, 40720479, 44543320, 48909086, 53913756, 59668635]
55958E9668635O629936P639635Q788374J0073037J1478951J2973808J4500634
55951A31753010J5970000J7251775J8170901J8515921J8065344J6628024J4090029
55944B50445004J0462452N921149Q16628m370757r131245j3045250j5868857j7553537
55936B07675587j8207344j8029597j7249408j6082778j4709310j3263984j1839084
55929I8294082j0491870r253842q138498p147017o273100n507277m839347m258710
55921D2384421l754425l316362k936145k606559k320629k071993j855727j667750
55913B1854831j503728j359522j232500j121202j023565r36578q57917p86846
55905A3032973p23079o65737o13972n67599n26253m88629m53482m20909l91866
$$ y = [59668635, 66298571, 73938206, 82726580, 92799617, 104278568, 117252376, 131753010, 147723010, 164974785, 183145686, 201661607, 219726951, 236354975, 250445004, 260907456, 266828605, 267645233, 263274476, 254143231, 241097981, 225229124, 207675587, 189468243, 171438646, 154189238, 138106460, 123397150, 110133166, 98294082, 87802212, 78548370, 70409872, 63262855, 56989755, 51482478, 46643131, 42384421, 38629996, 35313634, 32377489, 29770930, 27450301, 25378308, 23522581, 21854831, 20351103, 18991581, 17759081, 16637879, 15614314, 14677736, 13819819, 13032973, 12309894, 11644157, 11030185, 10462586, 9936333, 9447704, 8994222, 8573313, 8181447]
55896H181447l66703l44920l25949l09286k93977k78900k63659k48586k33927
55887E515540k19642k06016j93719j82887j72743j62537j52490j43398j35551
55878C946557j28474j21805j15964j11666j08797j06159j02559r7927r3017q8252
55868B871937q3408p8466p3981p0327o7255o4544o2512o1267o0061n8169n5975
55857B135972n4337n3166n1606m9503m7697m6654m5769m4315m2455m0855l9915
55846A619700l9612l9611l9230l7927l6102l4858l4566l4301l3135l1422l0048
55835A228888k8951k7197k4450k1535j9478j8549j8406j8609j8786j8659j8285
55824I95983j8061j8260j8566j8311j7252j5985j5398j5616j5731j4825j3125
$$ y = [8181447, 7814744, 7469824, 7143875, 6834589, 6540612, 6261712, 5998053, 5749467, 5515540, 5295898, 5089882, 4896163, 4713276, 4540533, 4377996, 4225506, 4082108, 3946557, 3818083, 3696278, 3580314, 3468648, 3359851, 3253692, 3151133, 3053206, 2960189, 2871937, 2788529, 2710063, 2636082, 2565755, 2498500, 2433956, 2371444, 2310177, 2250116, 2191947, 2135972, 2081635, 2028469, 1976863, 1927360, 1879663, 1833009, 1787240, 1742925, 1700470, 1659615, 1619700, 1580088, 1540477, 1501247, 1463320, 1427218, 1392360, 1357794, 1323493, 1290358, 1258936, 1228888, 1199937, 1172740, 1148290, 1126755, 1107277, 1088728, 1070322, 1051713, 1032927, 1014268, 995983, 977922, 959662, 941096, 922785, 905533, 889548, 874150, 858534, 842803, 827978, 814853]
55813H14853j1760j1372j1432j1084j0248r446q871q157p014n708m793m574m900
55800G05494n321n430n173m804m580m534m570m590m511m323m233m491n045n656
55786F38233o423p869j0217j2863j4818j5447j4692j2897j0685q661o916n081
55774E11664l168j965k162l492n159o760q179q964q682p718o942o506n760m467
55760D31740l281k716k372j563k93Q30J238P71k18r12p21q9l7o86j063p33o75
55743D19220j771l293m022m367n869q670j0888j1014r762q855q894r226r319r202
55729C14068q842q069p153o752p032p414p322o776o017n067m040l463l797m719
55715B27605n329n056m122l085k296j865j838k146k508k623k475k245k025j738
$$ y = [814853, 803093, 791721, 780289, 769205, 758957, 749511, 740640, 732483, 725469, 719761, 714968, 710394, 705494, 700173, 694743, 689570, 684766, 680186, 675652, 671082, 666492, 661981, 657658, 653425, 648934, 643889, 638233, 631810, 623941, 613724, 600861, 586043, 570596, 555904, 543007, 532322, 523661, 516745, 511664, 508496, 506531, 504369, 500877, 495718, 488958, 480779, 471815, 463133, 455415, 448473, 441967, 436207, 431740, 428459, 425743, 423371, 421808, 421515, 422345, 423583, 424354, 424136, 423224, 422503, 422414, 422377, 421691, 420628, 419895, 419220, 417449, 414156, 410134, 405767, 399898, 391228, 380340, 369326, 359564, 350709, 341815, 332589, 323270, 314068, 305226, 297157, 290004, 283252, 276220, 268806, 261484, 254708, 248691, 243624, 239584, 236121, 232324, 227605, 222276, 217220, 213098, 210013, 207717, 205852, 204014, 201868, 199360, 196737, 194262, 192017, 189992, 188254]
55701A88254j396j330j983l336m622m814l628j938j002j230j929k211j822j086
55687A55927l67Q3R8k35m52j39O03J330J815K119K196J882J278P87O32O35O07
55670A68799N92O08L90k50j036j462j361j022p46n02p7N52J063J061N28p6k38
55653A66823Q4M25K92m25j449k336k733k617k262j937j605j144o78m21k79M5N48
55636A50331Q88R36J025J549K605M105N843P269P677O962N969N653O070O465O278
55621B19625N669N071M485L488J865J04j011j346j567k158k663k430j730j381
55607B26021j396j006j43J70o73j907k607k980l676m596n358o287p802r201r288
55592A69271q117o956o512o362o150o230o729o994o498n540m585l586k433j433
$$ y = [188254, 186858, 185528, 183545, 180209, 175587, 170773, 167145, 165207, 164205, 162975, 161046, 158835, 157013, 155927, 155560, 155643, 155741, 155506, 155054, 154915, 155518, 156848, 158663, 160782, 162978, 164860, 166138, 166925, 167557, 168192, 168799, 169391, 169999, 170389, 170139, 169103, 167641, 166280, 165258, 164512, 164010, 163933, 164485, 165548, 166609, 167137, 167061, 166823, 166907, 167332, 167624, 167199, 165750, 163414, 160681, 158064, 155802, 153865, 152260, 151116, 150438, 150017, 149738, 149783, 150331, 151219, 152155, 153180, 154729, 157334, 161439, 167282, 174551, 182228, 189190, 195159, 200812, 206882, 213347, 219625, 225294, 230365, 234850, 238338, 240203, 240307, 239296, 237950, 236383, 234225, 231562, 229132, 227402, 226021, 224625, 223619, 223476, 223646, 222973, 221066, 218459, 215479, 211803, 207207, 201849, 195562, 187760, 178559, 169271, 161154, 154198, 147686, 141324, 135174, 128944, 122215, 115221, 108723, 103183, 98598, 95012, 92579, 91146]
55578I1146q44m53l1K60L31M53O34L30p00j771k096j874j880k358k908l211l272
55561G1756l184l156l580m428m896m268l008k252k260k142j218O2Q60R64P47N11
55545D0508L31K53K35Q5j94k07M05J348J851J560R45O69P74P82M63J46Q5j5m82
55526D9542r62q09j44J13m96j281j387r61p62r41r73p41q43j562k172j773n58
55509C3290L79L98ml4L05M50K82L56R97J731J992J930K047K308K310K209K632
55492E3578L609M320M288M073M301M695M728M707N318O347O801O276N362M591
55478A22994L680K244O12n75j258j986l113m398n414o119o785p445p622o920n748
55463G2147n089n336n794n660n111m862m905m428l047j471o06n17o46p04q29j073
$$ y = [91146, 90302, 89849, 89818, 90078, 90409, 90862, 91496, 91826, 91126, 89355, 87259, 85385, 83505, 81147, 78239, 75028, 71756, 68572, 65416, 61836, 57408, 52512, 48244, 45236, 42984, 40724, 38582, 37364, 37426, 38286, 39250, 39997, 40508, 40839, 41092, 41327, 41412, 41218, 41011, 41416, 42764, 44615, 46175, 47120, 47789, 48563, 49345, 49808, 49954, 50039, 50024, 49542, 48580, 47771, 47627, 47740, 47244, 45963, 44576, 43615, 42853, 41912, 40939, 40198, 39355, 37793, 35621, 33848, 33290, 33669, 34067, 34063, 34029, 34334, 34784, 35066, 35422, 36419, 38150, 40142, 42072, 44119, 46427, 48737, 50946, 53578, 57187, 61507, 65795, 69868, 74169, 78864, 83592, 88299, 93617, 99964, 106765, 113041, 118403, 122994, 126674, 128918, 129530, 128955, 127697, 125711, 122598, 118200, 112786, 106667, 99882, 92437, 84815, 77895, 72147, 67058, 61722, 55928, 50268, 45157, 40295, 35390, 30962, 27915, 26444, 25838, 25321, 24675, 23971, 23142, 22069]
55447B2069j172j000q42j023j343j250o10o7l17j131j559j137m54k69n64q28q89
55430G614q99p98l79K01N59O57P12N81o7r23j133m41L64M80K9m22p57j196j633
55411B549H46e25r93p61n37j61K91O63Q75b59D08L11O4J47M97P10L87l97j027
55392A100A32b34e5C13M11M44K88j28m30k51K05L94R6m16A42g85r50q89o79k96
55372c599J7j36q31j521j489o58K91P41P88R04J209J328R13L7q71j376j361j083
55354f697r05q90q07m80o0J55L3k43k91J99J070J692J505O61j27l61j62M8ol47
55334f013p78r16n31J12M94N18N73Q54J054Q80M67L6m32r19j115q41m17k50k59
55315g483p0M21R65J265J108M35m17q19n24p0q9m93p18n86l84k30J04O23Q81M96
$$ y = [22069, 20897, 19897, 19055, 18032, 16689, 15439, 14829, 14762, 14445, 13314, 11755, 10618, 10164, 9895, 9331, 8503, 7614, 6715, 5917, 5538, 5739, 6298, 6955, 7667, 8248, 8181, 7258, 6125, 5684, 6048, 6528, 6557, 6135, 5378, 4182, 2549, 846, -525, -1518, -2279, -2816, -2977, -2686, -2023, -1148, -259, 408, 719, 783, 930, 1427, 2137, 2524, 2127, 1100, 132, -234, -55, 313, 724, 1168, 1456, 1328, 898, 647, 852, 1246, 1342, 926, 142, -785, -1735, -2624, -3303, -3599, -3582, -3718, -4549, -6070, -7559, -8217, -7926, -7185, -6397, -5493, -4284, -2956, -2043, -2006, -2877, -4253, -5614, -6697, -7602, -8492, -9299, -9779, -9839, -9684, -9651, -9894, -10185, -9986, -8916, -7224, -5719, -5058, -5185, -5546, -5708, -5660, -5666, -6013, -6791, -7707, -8238, -8126, -7632, -7114, -6541, -5687, -4633, -3753, -3286, -3250, -3682, -4601, -5716, -6557, -6974, -7224, -7483, -7553, -7132, -6167, -4902, -3794, -3359, -3776, -4595, -5119, -5189, -5278, -5771, -6489, -7075, -7459, -7689, -7585, -6962, -6081, -5585]
55295e585l14r08p68O8R20R58K6j018j091o5J100J407Q17Q9l5N37J298i41C77
55275A020n8C22g01j062p20k97j39k64m26m74m59m54m35k80K23J092J790a084
55256h31r62j112m42n4m24r76j056p14l53j89k79n62o54o6J085J895J641O18k60
55237c695n94p78j227j688j526n33P22J406J288Q78P00O08J56n45p74r3J106K053
55219b536a96A813J248L70j96k52j11k27o27r53B0a088j288j380j197q83o49l65
55201f850J84P73R38O75N37Q18J122g88a40B16L2b33p40k46M79L44p09j407q20
55182c332M66J259d36A43B6e33l38M06B84J17c58p75O6a84A041J218Q00n2o30
55163B377k52L89j00H28a490j416j04K42j4J94P50P55J74k24j93j51j28K76d26
$$ y = [-5585, -5899, -6807, -7575, -7507, -6587, -5629, -5603, -6621, -7712, -7777, -6677, -5270, -4453, -4364, -4399, -3862, -2564, -941, 377, 1020, 962, 322, -701, -1763, -2483, -2780, -2919, -3183, -3609, -4083, -4542, -4996, -5431, -5711, -5488, -4396, -2606, -1084, -831, -1793, -2905, -3347, -3401, -3825, -4801, -5857, -6571, -6924, -7113, -7392, -7954, -8608, -8674, -7589, -5694, -4053, -3435, -3695, -4289, -5067, -6294, -7982, -9508, -10041, -9319, -7913, -6625, -5747, -5047, -4439, -4283, -4828, -5602, -5695, -4589, -2536, -196, 1813, 3061, 3431, 3235, 2983, 2872, 2645, 2018, 1065, 20, -1088, -2376, -3756, -4953, -5836, -6485, -6850, -6666, -5893, -4955, -4280, -3743, -2925, -1803, -788, -140, 216, 248, -233, -973, -1219, -740, -396, -1105, -2512, -3332, -2866, -1607, -436, 143, 26, -533, -871, -465, 284, 401, -358, -1133, -1067, -184, 1041, 2259, 3059, 3007, 2377, 2125, 2514, 2414, 828, -1490, -2906, -3010, -2768, -2782, -2588, -1838, -1083, -909, -1133, -1326, -1477, -1605, -1329, -426]
55143E52K86C77b66m76l91l12QM37c68A85M69N60P70R11P96L74k14p53j174D37
55122a115j171m51J56L21J74P7J69L77O43A01J009O18j28o41m59J32M19K20J38
55103A409O43J275J244N88J77M82R26P48M8l45J02J025J540J087Ro43j71R14J403
55084A2461P99j48n55m65m39n41l66J39M79L28j24n60r54j326j415q51L12J352
55066H126J388L23q47r92k13K81k11r88j043m53k6n5k37n18j025j265n14Q40J412
55047C983O85k00j01N50O58K01rJ98K24o9j13K79N05K02j61j11P9k4k79l68m09
55026E720o07o63k56K29J11n02q20n01m7N6n5j00j44k49j48K96O35L18n34j197
55006A542D36A23O92J351J401J086R73J327J807J963J722J279O89j1n30n65k08
$$ y = [552, 838, 377, -266, -742, -1133, -1445, -1437, -1000, -368, 185, 654, 1214, 1984, 2895, 3691, 4065, 3851, 3098, 1924, 437, -1115, -2286, -2737, -2581, -2260, -2086, -2009, -1840, -1463, -820, 101, 1110, 1728, 1600, 959, 500, 632, 1051, 1271, 1409, 2052, 3327, 4571, 5159, 5336, 5818, 6744, 7492, 7540, 7195, 7297, 8322, 9862, 10949, 10958, 10315, 10144, 11058, 12461, 13260, 13112, 12557, 12092, 11653, 11112, 10746, 10885, 11364, 11692, 11568, 11008, 10054, 8728, 7313, 6462, 6774, 8126, 9514, 9837, 8990, 7998, 7785, 8066, 7855, 6867, 5824, 5371, 5345, 5290, 5053, 4535, 3510, 2245, 1731, 2571, 3983, 4668, 4468, 4367, 4917, 5575, 5776, 5767, 5965, 6189, 6120, 6007, 6286, 6791, 6993, 6832, 6721, 6800, 6776, 6497, 6129, 5720, 5113, 4450, 4194, 4423, 4534, 4032, 3212, 2711, 2664, 2720, 2665, 2565, 2421, 2172, 2024, 2320, 2955, 3273, 2739, 1542, 436, 123, 815, 2166, 3567, 4653, 5626, 6953, 8760, 10723, 12445, 13724, 14413, 14402, 13872, 13307, 13099]
54989A3099J54K81J63j53n33o60l99l4J42K93O60R35O64J02M8O61J122O95k87
54970A6953q57m96M57J239J307P37O8l66p36j207j397q91m7L78L39M89R77J126
54952A8073N37k46o31p79j015j063n15L44Q23O62J27m35p43n51N2N55N93L55J66
54933A6309R5K53R36J982K584K359K081K635L724M452M766N309O055O180N318
54918F5038L893K178L0k171l384l307l020l562m473m644m051l761m245m694m194
54903B5633k932j832j392j384j488j622j612j066R4J234J612J227O78L66L16O65
54887A8497J612K750L196K698K003J801K006K415L308M624N303M478K839J751
54873E9281J323M44j299k954l670l787m043m463m541l973k836j522o95q82j757
$$ y = [13099, 13253, 13534, 13697, 13544, 13011, 12351, 11952, 11918, 12060, 12353, 13013, 13948, 14612, 14714, 14762, 15423, 16545, 17240, 16953, 16096, 15600, 16057, 17296, 18603, 19340, 19408, 19042, 18306, 17099, 15702, 14811, 14764, 15142, 15481, 15970, 16947, 18073, 18610, 18364, 17733, 16954, 15939, 14876, 14361, 14705, 15528, 16190, 16317, 15882, 15139, 14588, 14640, 15195, 15788, 16143, 16309, 16404, 16657, 17593, 19575, 22159, 24518, 26599, 29234, 32958, 37410, 42176, 47485, 53540, 59720, 65038, 68931, 71109, 71139, 68968, 65584, 62277, 59257, 55695, 51222, 46578, 42527, 38766, 34521, 29827, 25633, 22701, 20869, 19477, 18093, 16605, 14983, 13371, 12305, 12399, 13633, 15245, 16472, 17150, 17516, 17832, 18497, 20109, 22859, 26055, 28753, 30756, 32557, 34563, 36978, 40286, 44910, 50213, 54691, 57530, 59281, 60604, 61048, 59749, 56795, 53125, 49338, 45295, 40832, 36291, 32318, 29482, 27960, 27265, 26383, 24626]
54858B4626k322j950r37L6N27L15n77j576j874j313n26OM18P78O41k05j127j290
54840A3650n73N74J703K373K050P12p30j229p62k23k30n01m12J73Q01R43N75J23
54822A9017j23m17j013j522j289m17K56L32L15N91O85O1r11j356r70j59N49P79
54804A4408L89k14k28N55J219Q19l17j000o55K67J098J477J208L37n61q70o72
54787A7260m96l67J43R52J375J196J011J208J315Q80L58M61J071J522J701K133
54771C1723L022L862M203M279M544M901M791L948K707J514M51o49j739k508k768
54756F2281k674k560k630k819k818k286j261k99Jk90n34l24J01L62M50N50O29
54739D5879N57L58J00k65o87r07q50q44j081j084j87J541L305M395M707M529M227
$$ y = [24626, 22304, 20354, 19417, 19453, 19980, 20295, 19718, 18142, 16268, 14955, 14429, 14435, 14853, 15631, 16272, 16067, 14940, 13650, 13077, 13651, 15354, 17727, 19777, 20489, 19759, 18530, 17768, 17545, 17315, 16814, 16402, 16575, 17376, 18319, 18894, 19017, 18894, 18477, 17464, 15942, 14653, 14236, 14492, 14824, 15139, 15730, 16415, 16476, 15565, 14209, 13239, 13080, 13629, 14408, 14797, 14583, 14355, 14910, 16129, 16948, 16631, 15631, 14976, 15243, 16341, 17818, 19026, 19363, 18802, 17932, 17260, 16764, 16397, 16540, 17492, 18867, 20063, 21074, 22282, 23597, 24477, 24835, 25296, 26367, 27889, 29590, 31723, 34745, 38607, 42810, 47089, 51633, 56534, 61325, 65273, 67980, 69494, 69945, 69296, 67557, 65049, 62281, 59607, 57047, 54417, 51598, 48780, 46494, 45233, 44934, 44935, 44645, 44111, 43787, 43888, 44250, 44700, 45250, 45879, 46436, 46794, 46894, 46629, 45942, 45035, 44185, 43341, 42260, 41176, 40989, 42530, 45835, 50230, 54937, 59466, 63693]
54722F3693M017L721K867J341k19j117j513k125l174m229m971n487n680n202m156
54707C7766l255k904k640j886q56k51l62p96r53n27K72Q07O04p1m92m34m29p98
54689B2795j082p56o9L64M29L61J12m40q35l76P85J629J484P72K89K45L45L94
54671B6446M08L64J96J2J3J86K94J32k32n46n75l19m4l0l00o12p42o40l53P0M76
54650B4204O11L90J06K33J006K166L114L299K597J463O87Q76J966L215L722L142
54634E2797K017J268J245J363Q42k95j274j557j459j639k284l022l386l140k319
54619C9157j299p19r67j719k218k043j443q85n97n65p21r07q78n05J8L47L29J09
54601B4494k4J60O26J061J102O94J22l08m86m41k22K7R0p9k72k82j40O2L64P64
$$ y = [63693, 67710, 71431, 74298, 75639, 75420, 74303, 72790, 70665, 67491, 63262, 58291, 52804, 47124, 41922, 37766, 34511, 31607, 28967, 27081, 26225, 25974, 25612, 24816, 23863, 23336, 23608, 24415, 25019, 24948, 24456, 24022, 23593, 22795, 21713, 20957, 20888, 21252, 21681, 22042, 22154, 21714, 20879, 20503, 21288, 22917, 24401, 25173, 25462, 25707, 26052, 26446, 26854, 27218, 27414, 27426, 27439, 27625, 27919, 28051, 27819, 27273, 26698, 26379, 26335, 26305, 26005, 25393, 24651, 24011, 23658, 23728, 24204, 24815, 25205, 25311, 25544, 26550, 28716, 31830, 35129, 37726, 39189, 39876, 40752, 42718, 45933, 49655, 52797, 54814, 56082, 57327, 58690, 59532, 59237, 57963, 56406, 54947, 53308, 51024, 48002, 44616, 41476, 39157, 37858, 37139, 36172, 34453, 32235, 30192, 28749, 27864, 27267, 26702, 25981, 25074, 24196, 23691, 23709, 24056, 24385, 24494, 24470, 24630, 25256, 26317, 27419, 28113, 28235, 27927, 27441, 27000, 26778, 26805, 26895, 26816, 26544, 26262, 26122, 26184, 26548, 27312]
54581B7312J036R51O12K78m8n44j084j201p12r4j1n10r21n97L96J330J546J055
54563B8794L94J0j42l46o97j002j083r61q06o69m10J08P21J011P90L99K61K86
54545B6658R4k38j86L53Q06Q12P84J098J279O84l56q45m53K24P49J314K047K480
54527C7304K212J537J020P61M84J22o4N1J91q6q03j359j155n01m59j438k416k202
54509C3199j104m96r06j496j479j035m61M70J691K257J430j50j076p81J22P51
54493C0936P23K50j18kK66Op55j165q55n42p59q27QJ096J209M18p2K23O20O44
54473C1304O15O77M16j20j31O72J403J243O08L56N30O15N30N06L45k79r89r92
54455C7309k68K63m2p27r61n90j45o1k83n62p53p73n29o8K77J64k87n02m9P63
$$ y = [27312, 28348, 29299, 29911, 30189, 30141, 29597, 28513, 27312, 26600, 26506, 26495, 25985, 25064, 24467, 24863, 26193, 27739, 28794, 29188, 29198, 29056, 28710, 28013, 27011, 25928, 24967, 24161, 23492, 23082, 23190, 23911, 24922, 25712, 26111, 26372, 26658, 26752, 26514, 26328, 26681, 27487, 28299, 29083, 30181, 31460, 32144, 31788, 30943, 30490, 30714, 31463, 32777, 34824, 37304, 39516, 41053, 42073, 42834, 43318, 43440, 43376, 43427, 43618, 43532, 42729, 41370, 40215, 39714, 39255, 37817, 35401, 33199, 32095, 31599, 30693, 29197, 27718, 26683, 26222, 26692, 28383, 30640, 32070, 31920, 30844, 30063, 30185, 30936, 31659, 31909, 31791, 31789, 32055, 32061, 31306, 30141, 29286, 28744, 27985, 27158, 27166, 28262, 29471, 29889, 29817, 30040, 30660, 31304, 31919, 32596, 33012, 32892, 32761, 33433, 34836, 36079, 36687, 37043, 37573, 38188, 38718, 39224, 39569, 39290, 38301, 37309, 37041, 37304, 37262, 36535, 35574, 34984, 34839, 34778, 34495, 33933, 33180, 32407, 31878, 31810, 32087, 32251, 31964, 31462, 31413, 32176]
54435C2176J136O28l46q89n03M52J155J156P53N36O67Q09O41K10k68o30p37n02
54417C6444j14L7j09j22K74O80N25j24o00m47J52P58J175J479J752J842J441M77
54399D5520n95j133r81n51j99L7O4l36r24r65k56M29L89PO0N19P85O99M89P2o94
54378D2436j255q99N2N04Q5m84n91l74m4M90J073J190P97M72N01N11K81J07R4
54359D4946j90q49j254r44k24M86J180J713J562P34J01J41Q8q65k167k644k054
54342C9760j094k34M85Q51O34K19K07M45J89p32j661j994j763j313r70r58j162
54325C0909j046k98N54P66M55L87P72R99O46Q3j62o6J0k36q52j511j601q99l0
54306B8880K21k6rL95N12J33L0P85J771J960J256L51l48r42j377j303p16j72q5
$$ y = [32176, 33312, 33940, 33594, 32705, 32202, 32654, 33809, 34965, 35718, 36254, 36921, 37730, 38371, 38581, 38313, 37683, 36946, 36444, 36330, 36367, 36258, 36136, 36410, 37090, 37615, 37491, 36891, 36444, 36596, 37354, 38529, 40008, 41760, 43602, 45043, 45520, 44925, 43792, 42811, 42260, 42061, 42098, 42162, 41826, 40902, 39937, 39681, 40110, 40499, 40506, 40566, 41085, 41870, 42569, 43058, 43130, 42436, 41181, 40282, 40334, 40838, 40923, 40439, 39848, 39474, 39430, 39920, 40993, 42183, 42980, 43452, 43953, 44464, 44745, 44852, 44946, 44756, 43907, 42653, 41709, 41485, 41971, 43151, 44864, 46426, 47160, 47261, 47402, 47490, 46625, 44458, 41814, 39760, 38666, 38432, 38917, 39768, 40402, 40621, 40828, 41273, 41462, 40730, 39069, 37075, 35312, 33999, 33029, 32071, 30909, 29863, 29565, 30119, 30885, 31340, 31727, 32499, 33498, 34144, 34227, 34065, 33999, 34009, 33773, 32921, 31410, 29809, 28910, 28880, 29101, 29075, 29066, 29461, 29973, 30106, 30136, 30921, 32692, 34652, 35908, 36259, 35911, 34969, 33592, 32289, 31573, 31401, 31316]
54287C1316j59J60Q48J225P93j41p76p02k49L9K6n0kJ39L15N37P69Q97Q63P12
54267C6560N35M24L85K70o8m64n22j42K57K34j18m39o24p52p08l54P5J75j3j11
54247C4600q5k83p44r97p64m35m59o94p16m58j61J27N77J117J373J129O18K18
54229C3963N0j3r3k14l99o57q43o87j52L70M20O9j86q5P8Kj06J10N12O47M44L03
54207C3533M23N10K87r9k95j82J35N18P76O77K13k33k54R4L40J04n77j373j880
54188C2717j739q26N41J652J876J169Q2o76p15j35N61P57K15o61j182j139j000
54171C1497j172j382j112m50J8N4J8J95L96L76J79j28o15j091r95j19Q82J207
54153B7758R04O93R05J098P56k7o76p64m43k59n32q66n88K90R04O08j63m15J40
$$ y = [31316, 31157, 31317, 32165, 33390, 34183, 34042, 33266, 32564, 32315, 32354, 32380, 32330, 32328, 32467, 32782, 33319, 34088, 34985, 35848, 36560, 37095, 37519, 37904, 38174, 38106, 37642, 37120, 36978, 37235, 37469, 37351, 36912, 36288, 35536, 34828, 34474, 34549, 34724, 34711, 34600, 34515, 34232, 33488, 32491, 31727, 31292, 30833, 30139, 29423, 28965, 28804, 28931, 29508, 30625, 31998, 33127, 33745, 33963, 34013, 34000, 33907, 33693, 33294, 32637, 31794, 31107, 30955, 31325, 31745, 31814, 31628, 31543, 31621, 31623, 31517, 31627, 32139, 32786, 33230, 33533, 33956, 34466, 34753, 34654, 34359, 34177, 34312, 34830, 35606, 36283, 36496, 36263, 36009, 36103, 36443, 36547, 35970, 34597, 32717, 30978, 30152, 30693, 32345, 34221, 35390, 35472, 34796, 34081, 33946, 34507, 35264, 35479, 34818, 33636, 32497, 31497, 30325, 28943, 27831, 27381, 27399, 27453, 27471, 27666, 28062, 28438, 28617, 28489, 27874, 26783, 25788, 25669, 26551, 27758, 28662, 29355, 30260, 31358, 32114, 32087, 31411, 30647, 30204, 29945, 29413, 28547, 27959, 28249, 29153, 29761, 29598, 29183, 29323]
54134B9323Q33Q94K22o39j008o09R6K93k88j011j113o08p2K16M87R41J406J550
54116C0913J170L75l55m99r0K44J39m0Q8K12m7k64K56J269J789J414P44M23M88
54097C8229O85O87k4j674l376l637k070J7J219J555J878K370K369J580P16O48
54081D1172J285J673J218N19N76J304J461L89q66q55L65J461J646J256O66j68
54065E3102r68j034l28K26R0j17L32J151J616J571J319R78N97M76Q41J524K423
54048F3799L688N080N705N044L762K921K817L161L804M540M703L905K868K671
54034A18468L320L894L951L856L767L249K127Q94%o42j144j296j063r48j395k200
54018A34838k904l459m043m401l945k671j553j600k587l213k681j743j664k473
$$ y = [29323, 30156, 31050, 31272, 30633, 29625, 29016, 29112, 29405, 29117, 28106, 26993, 26385, 26313, 26529, 27016, 27957, 29363, 30913, 32083, 32458, 32103, 31604, 31514, 31758, 31897, 31857, 31945, 32157, 32110, 31846, 32102, 33371, 35160, 36574, 37318, 37741, 38229, 38914, 39601, 39577, 37903, 34527, 30890, 28820, 28837, 30056, 31611, 33489, 35859, 38228, 39808, 40524, 41172, 42457, 44130, 45348, 45867, 46443, 47747, 49208, 49597, 48731, 47876, 48241, 49702, 51348, 52604, 53270, 53102, 52134, 51100, 50772, 50998, 51088, 50971, 51303, 52454, 54070, 55641, 56960, 57938, 58535, 59011, 59852, 61376, 63799, 67487, 72567, 78272, 83316, 87078, 89999, 92816, 95977, 99781, 104321, 109024, 112929, 115797, 118468, 121788, 125682, 129633, 133489, 137256, 140505, 142632, 143526, 143526, 142884, 141740, 140444, 139381, 138433, 137038, 134838, 131934, 128475, 124432, 120031, 116086, 113415, 111862, 110262, 107675, 104462, 101781, 100038, 98374, 95901]
54004I5901k948k380j520j441k160k855k940k349j254j44J62p06k029k703k373
53989F8261j440l39N69P66J10o21n27J44L82m6m20m49p41j545k057j574n07L26
53971F0292Q05J196J321Q44Q1k54j8K88L30L22N10Q61J299J834K308K313J656
53954G5988P50K65M12P61Q50Q02J063J623J864J431Q85J028J796K369K348K240
53938I6475K611L366M148M966N966O906P315P077O482N848N336N019M862M751
53924A71128M714M960N406N485M845M073M130N061N805N446M246L076K283J500
53910B32158M16p86j783k495k967l112k843k359k140k557l490m335m490m013l724
53895A91480m397n764o709o590o018n919o227o121n404m777m551l983k461p23
$$ y = [95901, 92953, 90573, 89053, 87612, 85452, 82597, 79657, 77308, 76054, 75910, 76072, 75366, 73337, 70634, 68261, 66821, 66482, 67051, 67817, 67927, 67306, 66779, 66923, 67305, 67259, 66839, 66390, 65649, 64104, 62047, 60473, 59966, 60292, 61097, 62293, 63614, 64458, 64539, 64285, 64267, 64555, 64885, 65207, 65717, 66578, 67877, 69711, 72019, 74332, 75988, 76738, 77003, 77415, 78176, 79026, 79828, 80891, 82514, 84378, 85809, 86694, 87722, 89518, 91887, 94235, 96475, 99086, 102452, 106600, 111566, 117532, 124438, 131753, 138830, 145312, 151160, 156496, 161515, 166377, 171128, 175842, 180802, 186208, 191693, 196538, 200611, 204741, 209802, 215607, 221053, 225299, 228375, 230658, 232158, 232574, 231788, 230005, 227510, 224543, 221431, 218588, 216229, 214089, 211532, 208042, 203707, 199217, 195204, 191480, 187083, 181319, 174610, 168020, 162002, 156083, 149856, 143735, 138331, 133554, 129003, 125020, 122559, 121836]
53881A21836j43j050k488l476l764l443k627j788j662k382l096k900j898r64o99
53866H9456j013j498j831j816j488j154j157j430j558j266p25k96j93l76o88r30
53850G2037r57p82n70m35l33j98j58m39j029j538j506q20J98J010J212P88J54
53833F6634j61n2O7j25l68j96K96N52L82K50N17Q98R76Q77R84J271J440J584K156
53814G7982L236M239M551M191L696L541L747L999M082M184M641N313N536M850
53800A37788L580K437J706J209Q06N37L33N2k18l06l25n51r60j325j732k402l026
53783A37603k919k081j489j945l082l960m227m219m182l943l353k617k141k154
53769I5291k501k708k466k053k022k284k003p10P83J180J92j238k101k186j791
$$ y = [121836, 121693, 120643, 118155, 114679, 110915, 107472, 104845, 103057, 101395, 99013, 95917, 93017, 91119, 90155, 89456, 88443, 86945, 85114, 83298, 81810, 80656, 79499, 78069, 76511, 75245, 74520, 74224, 74031, 73655, 72967, 72037, 71080, 70298, 69728, 69293, 68960, 68762, 68604, 68165, 67136, 65598, 64092, 63272, 63470, 64480, 65692, 66480, 66634, 66473, 66421, 66488, 66363, 65995, 65799, 66095, 66647, 67029, 67279, 67796, 68694, 69670, 70547, 71531, 72802, 74242, 75826, 77982, 81218, 85457, 90008, 94199, 97895, 101436, 105183, 109182, 113264, 117448, 122089, 127402, 132938, 137788, 141368, 143805, 145511, 146720, 147526, 148063, 148396, 148448, 148230, 147924, 147599, 147048, 146088, 144763, 143031, 140629, 137603, 134684, 132603, 131114, 129169, 126087, 122127, 117900, 113681, 109499, 105556, 102203, 99586, 97445, 95291, 92790, 90082, 87616, 85563, 83541, 81257, 79254, 78544, 79327, 80507, 80699, 79461, 77360, 75174, 73383]
53754G3383j207p03n51o98p43n00l28n92j020j037o35m30p92j251j080j81Q55
53737F2490J492J687J628J329P59J58j26r9j05k53j02P44J906K400J700L27p54
53720G5181j086q28j96P61J765K277K115J727J520J272O94J95M25J187J557J228
53704H9794R56J366K063K367K356K483K640K374J799J526J722J875J545Q38J04
53689A15808l56k89L05Q74P58K6n43m77q5J21K7k66p34j203j303r16l96r8L2J92
53669A11477L72N05N67M13j86j029j479j202n76p6L24P67R83O71L7m67p54r05
53651A09442p11J2P95R05L16k65m14l82m52m22J2Q11J691K354K439J780Q39N31
53633A19281J217K219K599K170J417P19J66j08J25P55J331J575J647J722J670
$$ y = [73383, 72176, 71473, 70922, 70224, 69481, 68981, 68653, 68061, 67041, 66004, 65369, 64939, 64147, 62896, 61816, 61635, 62490, 63982, 65669, 67297, 68626, 69385, 69543, 69417, 69318, 69213, 68960, 68858, 69602, 71508, 73908, 75608, 75935, 75181, 74095, 73267, 73071, 73832, 75597, 77874, 79989, 81716, 83236, 84508, 85202, 85397, 85822, 87009, 88566, 89794, 90750, 92116, 94179, 96546, 98902, 101385, 104025, 106399, 108198, 109724, 111446, 113321, 114866, 115704, 115808, 115452, 115163, 115468, 116342, 117100, 117126, 116583, 116106, 116021, 116142, 116169, 115903, 115169, 113966, 112663, 111747, 111351, 111253, 111285, 111477, 111849, 112354, 112921, 113334, 113148, 112119, 110640, 109438, 108862, 108786, 109110, 109877, 110860, 111531, 111568, 111101, 110347, 109442, 108731, 108743, 109538, 110443, 110759, 110494, 110080, 109698, 109246, 108824, 108836, 109647, 111338, 113692, 116131, 117911, 118750, 119281, 120498, 122717, 125316, 127486, 128903, 129622, 129788, 129680, 129805, 130560, 131891, 133466, 135113, 136835, 138505]
53618A38505J376J164J514K386L134L193K744K445K629K904K638J778J023J116
53604A68549K039L097L682L699L229K271J069K68K08K74l27j265j331k02Q74O70
53588A86804m52j218j198r75r34q49o36n88p13o15l08l83j040j621j553j135r44
53571A71642r16o44j99l5k87p16j111j301r26J66J386J822J270M68J46K95M44
53554A71504L81K52J88J18k5n8K89R49J440J370R74Q53J255J910K556L256L982
53537A91194M384M250L924L911M261M711N168N740O450P204P959Q597Q853Q635
53523B75241Q310Q325Q749R433J0356J1446J2261J2442J2330J2659J3603J4626
53511D09781J5307J5772J6248J6673J6959J7177J7295J7076J6499J5986J5895
$$ y = [138505, 139881, 141045, 142559, 144945, 148079, 151272, 154016, 156461, 159090, 161994, 164632, 166410, 167433, 168549, 170588, 173685, 177367, 181066, 184295, 186566, 187635, 187903, 188111, 188385, 188058, 186793, 185462, 185260, 186134, 186804, 186352, 185134, 183936, 182961, 182027, 181178, 180542, 179954, 179241, 178626, 178318, 177935, 176895, 175274, 173721, 172586, 171642, 170726, 170082, 169883, 169848, 169561, 168845, 167734, 166433, 165507, 165673, 167059, 168881, 170151, 170619, 170765, 171060, 171504, 171885, 172137, 172325, 172443, 172418, 172360, 172649, 173598, 175038, 176408, 177382, 178235, 179490, 181400, 183956, 187212, 191194, 195578, 199828, 203752, 207663, 211924, 216635, 221803, 227543, 233993, 241197, 249156, 257753, 266606, 275241, 283551, 291876, 300625, 310058, 320414, 331860, 344121, 356563, 368893, 381552, 395155, 409781, 425088, 440860, 457108, 473781, 490740, 507917, 525212, 542288, 558787, 574773, 590668]
53500E90668J6075J6115J5919J5709J5618J5532J5278J4805J4237J3868J4026
53489G57850J4809J5889J6680J6700J5886J4630J3558J3074J3086J3212J3189
53478I18563J2987J2558J1734J0475R009P585O150M430K291k3k112l827n380p008
53464I77432q558r659j0264j0760j1389j1843j1769j1428j1504j2246j3260j4098
53452H40654j4661j4946j4807j4302j3905j4046j4479j4514j3794j2647j1560
53441F86993j0609r516q130o631n310m326l653l139k516j592n39J98N15R55K026
53426F34726L349M015L837L750M653O334P937R122J0244J1549J2801J3753J4520
53413G40590J5370J6374J7407J8290J8951J9582K0570K2088K3799K5269K6541
$$ y = [590668, 606743, 622858, 638777, 654486, 670104, 685636, 700914, 715719, 729956, 743824, 757850, 772659, 788548, 805228, 821928, 837814, 852444, 866002, 879076, 892162, 905374, 918563, 931550, 944108, 955842, 966317, 975326, 982911, 989061, 993491, 995782, 995759, 993647, 989820, 984440, 977432, 968874, 959215, 948951, 938191, 926802, 914959, 903190, 891762, 880258, 868012, 854752, 840654, 825993, 811047, 796240, 781938, 768033, 753987, 739508, 724994, 711200, 698553, 686993, 676384, 666868, 658738, 652107, 646797, 642471, 638818, 635679, 633163, 631571, 631032, 631230, 631745, 632700, 634726, 638075, 642090, 645927, 649677, 654330, 660664, 668601, 677723, 687967, 699516, 712317, 726070, 740590, 755960, 772334, 789741, 808031, 826982, 846564, 867134, 889222, 913021, 938290, 964831]
53402I64831K8026K9839L1661L3274L4871L6603L8185L9187L9591L9779M0007
53391A355854M0126L9906L9521L9547M0235M0932M0511L8547L5817L3437L1715
53380A776148L0071K7848K4868K1386J7884J4867J2480J0346P966N166J880k165
53368A948745p066j2173j6618k0398k4367k8946l3399l6663l8441l9173l9354
53357A652147l9301l9245l9222l8923l7994l6475l4782l3308l2105l0955k9670
53346A260167k8443k7863k8309k9297k9744k9013k7446k5812k4532k3570k2683
53335I63455k1509j9674j7203j4662j2674j1402j0643j0187r867r468q994q828
53323H08344r316j0202j0845j0902j0597j0241r818r118q055o764n483m416l544
$$ y = [964831, 992857, 1022696, 1054357, 1087631, 1122502, 1159105, 1197290, 1236477, 1276068, 1315847, 1355854, 1395980, 1435886, 1475407, 1514954, 1555189, 1596121, 1636632, 1675179, 1710996, 1744433, 1776148, 1806219, 1834067, 1858935, 1880321, 1898205, 1913072, 1925552, 1935898, 1943864, 1949030, 1950910, 1948745, 1941679, 1929506, 1912888, 1892490, 1868123, 1839177, 1805778, 1769115, 1730674, 1691501, 1652147, 1612846, 1573601, 1534379, 1495456, 1457462, 1420987, 1386205, 1352897, 1320792, 1289837, 1260167, 1231724, 1203861, 1175552, 1146255, 1116511, 1087498, 1060052, 1034240, 1009708, 986138, 963455, 941946, 922272, 905069, 890407, 877733, 866331, 855688, 845501, 835634, 826166, 817172, 808344, 799028, 788826, 777981, 767079, 756482, 746241, 736423, 727305, 719250, 712486, 707003, 702587, 699043]
53310F99043k547j118N97K024K819L370M359N872P252P988Q475R510J1191J2740
53296G71575J3530J3883J4584J5935J7594J9166K0454K1206K1029J9815J8040
53285I66811J6469J5536J5004J4197J2667J0653Q760P196N609L745J792j34k353
53272A075952m956p275q642r405j0503j2134j3641j4683j5675j6943j8118j8796
53260I25181j9142j9519k0010k0559k1146k1544k1398k0794k0246j9847j9106
53249G01870j7925j7058j7024j7168j6529j5227j4213j4011j4321j4745j5048
53238E28601j4925j4176j3155j2438j1974j1213j0012q863q094p469o712n900
53226D03670n183m598m356m799n743o474o709p113q330r875j0663j0451r994r782
$$ y = [699043, 696496, 695378, 695975, 697999, 700818, 704188, 708547, 714419, 721671, 729659, 738134, 747644, 758835, 771575, 785105, 798988, 813572, 829507, 847101, 866267, 886721, 907927, 928956, 948771, 966811, 983280, 998816, 1013820, 1028017, 1040684, 1051337, 1060097, 1067293, 1072902, 1076647, 1078439, 1078305, 1075952, 1070996, 1063721, 1055079, 1045674, 1035171, 1023037, 1009396, 994713, 979038, 962095, 943977, 925181, 906039, 886520, 866510, 845951, 824805, 803261, 781863, 761069, 740823, 720976, 701870, 683945, 666887, 649863, 632695, 616166, 600939, 586726, 572715, 558394, 543649, 528601, 513676, 499500, 486345, 473907, 461933, 450720, 440708, 431845, 423751, 416282, 409570, 403670, 398487, 393889, 389533, 384734, 378991, 372517, 365808, 358695, 350365, 340490, 329827, 319376, 309382, 299600]
53212B99600r384q359p186o654o780o905o744o557o313n492m132l306l941n541
53198B12306o791p086o793o223n296m244l726l837l807l088k177j826k043k368
53184A53001k693l097l253k765j899j384j457j729j878j955j944j623j075p65
53170A25484q88r56m00O17J329J212M79l08q85j309j510j168l41J59m84j963k998
53153A16070k771j736q22l60j18O3J96L56M84K38m68j035q64k64j10o06j002o13
53135A06638L25J005R24K75l62n60l95k60l60n96r21j416j835j632p72m6p6m61
53117I9475n31m00n79q80o81j03M7m94j213j790k353k665k101q57q7l29o38k9
53099H3792J009J324Q03K85J53j0m06o09l86j69m05q84j092r48p91p94o90j82
$$ y = [299600, 290216, 281857, 274671, 268017, 261237, 254332, 247588, 241031, 234718, 229226, 225094, 221788, 217847, 212306, 205515, 198429, 191636, 185413, 180117, 175873, 172147, 168310, 164503, 161415, 159238, 157412, 155369, 153001, 150308, 147211, 143958, 141193, 139294, 137910, 136453, 134724, 132846, 130891, 128947, 127324, 126249, 125484, 124596, 123640, 123240, 123857, 125186, 126398, 126877, 126569, 125684, 124375, 122865, 121697, 121356, 121515, 121031, 119068, 116070, 113299, 111563, 110741, 110381, 110263, 110326, 110522, 110878, 111362, 111600, 111132, 110097, 109233, 108969, 108859, 108253, 107251, 106638, 106963, 107968, 108892, 109167, 108805, 108245, 107850, 107590, 107230, 106634, 105713, 104297, 102462, 100830, 100058, 100012, 99936, 99475, 98944, 98544, 97965, 97085, 96404, 96301, 96348, 95854, 94641, 92851, 90498, 87833, 85732, 84875, 84788, 84459, 83821, 83792, 84801, 86125, 86928, 87213, 87366, 87356, 86950, 86341, 85955, 85786, 85381, 84497, 83405, 82457, 81666, 80872, 80182, 80000]
53081H0000N46R37O75M6l96l91n5M37R29J135Q47L26J53N02Q89P58N7q47j548
53062H5000j748j364p16l41m29o16m90l5N31J027J254R45J13q39j459j583j190
53045G8060l58M34M79k85r57p11J64P58P66O62P27O79K84j76l28j66O7J64k3n55
53025G9685j188j432j051l02M42J081J613J827J449O31q8l07j37L6J9p8q8K4J93
53006H2329L29L09P9k20l01r3J13Ql09m45k22J24K55J25OK66J000J836K189J892
52986H9270J354R18L45o11j396j126J30J225J373J028J023J391J622J550J360
52971I9456R90L32k32j62L42M44j05n43k15M51N94J69q6J30J93n13j581j991j318
52952I6355j32P98J245J351J136N80q7o35j146j685j834j116J28R21Q47M79M20
$$ y = [80000, 80546, 81483, 82158, 82204, 81808, 81417, 81362, 81799, 82728, 83863, 84710, 85036, 85189, 85691, 86580, 87338, 87395, 86548, 85000, 83252, 81888, 81172, 80831, 80402, 79786, 79296, 79261, 79792, 80819, 82073, 83018, 83131, 82292, 80833, 79250, 78060, 77702, 78136, 78615, 78330, 77373, 76662, 76826, 77584, 78350, 79012, 79739, 80418, 80702, 80526, 80198, 80032, 80099, 80263, 80240, 79685, 78497, 77065, 76014, 75712, 76154, 77235, 78848, 80675, 82124, 82755, 82667, 82360, 82223, 82259, 82278, 82200, 82112, 82136, 82329, 82658, 82967, 83046, 82826, 82525, 82432, 82545, 82553, 82244, 81799, 81577, 81701, 81956, 82081, 82087, 82353, 83353, 85189, 87378, 89270, 90624, 91542, 91887, 91276, 89880, 88754, 88884, 90109, 91482, 92510, 93533, 94924, 96546, 98096, 99456, 100446, 100778, 100546, 100384, 100726, 101170, 101065, 100522, 100307, 100758, 101352, 101521, 101435, 101565, 101758, 101245, 99664, 97673, 96355, 96223, 97021, 98266, 99617, 100753, 101333, 101246, 100611, 99465, 97780, 95946, 94830, 94958, 95879, 96726, 97205, 97625]
52935I7625N23L65o9o28j330j994j976j021M2K02l48n49q9K27j51o58n40M1L75
52916I0047K02j77n26q36j012q32l03K86O64P32M28j95p47o96j0O20M78l06r25
52897H6892r23o92p64r89q13k33J28q5m38l33K95J091J727J937J468M77l12l20
52879H8113J62M24L17L07N82O97K83m03q49q63n84k22j8j75n95q86q48p40r22
52860H3780j375j804j966j784j226l97K83L00m30j352j713j260m93j39l63n81
52844F9480k34M40O95K58k97l16R4K72j20o92q21l68J84J99m39j154j198l84P81
52825F6380J673K044J981J563R08L74L01N45N69J87r2K05O86M74n56j490j540
52808G4212j033p28n90L2J100J608R07l46j023q83n95o88j053j316j285j014p79
$$ y = [97625, 98148, 98513, 98444, 97816, 96486, 94492, 92516, 91495, 91537, 91739, 91391, 90842, 90753, 90980, 90829, 90171, 89631, 89672, 90047, 90249, 90072, 89546, 88710, 87698, 86866, 86563, 86849, 87513, 88245, 88673, 88478, 87731, 87035, 87025, 87645, 88123, 87817, 86892, 85969, 85277, 84513, 83524, 82711, 82478, 82606, 82521, 82083, 81750, 82045, 83136, 84863, 86800, 88268, 88745, 88433, 88113, 88275, 88699, 89016, 89323, 89905, 90602, 90885, 90482, 89633, 88770, 88186, 87964, 87946, 87771, 87176, 86290, 85442, 84702, 83780, 82405, 80601, 78635, 76851, 75625, 75228, 75511, 75811, 75381, 74029, 72316, 71056, 70563, 70424, 70061, 69480, 69246, 69686, 70381, 70639, 70342, 70026, 70120, 70392, 70272, 69580, 68759, 68391, 68575, 68774, 68335, 67181, 65983, 65599, 66380, 68053, 70097, 72078, 73641, 74549, 74923, 75224, 75769, 76338, 76525, 76433, 76638, 77324, 77798, 77242, 75752, 74212, 73179, 72451, 71861, 71893, 72993, 74601, 75508, 75162, 74139, 73256, 72661, 71973, 70920, 69604, 68319, 67305, 66526]
52791F6526r09j321j398o47O06J576J870J661J181N40J3j31j10l59p32n31M10
52774F8245J263J212M52j33n7M49R10J021O88J3p31j244j380j140p03m26n51q45
52756F7043q26m10LJ30J32J37p5o02r95p15J92J215J916K137J852J256P23M22
52738G3535J09l75o71l39M92J339J981K452K560K098J346Q92Q44P80N01K87L38
52721H8169M78N75P60R83Q94M26M9R9K80K32K02N59R63O50m50j422j407m75O00
52702I2165J176J085M86k89q21p84k10N66J187J511J556J353R54N32L10L22L84
52685A01483L63L62M65M72J13n39j108j458j781k162k349k238k129k268k336j858
52669H3032r43j76J56K67L52L59L55N67Q13M58o86j851k161j699j146p26j39M93
$$ y = [66526, 65617, 64296, 62898, 62251, 62857, 64433, 66303, 67964, 69145, 69685, 69698, 69567, 69457, 69098, 68366, 67835, 68245, 69508, 70720, 71172, 71039, 70982, 71431, 72341, 73362, 74050, 74063, 73332, 72088, 70708, 69568, 68865, 68439, 67888, 67043, 66217, 65807, 65810, 65940, 66072, 66209, 66134, 65532, 64537, 63822, 64014, 65229, 67145, 69282, 71134, 72390, 73113, 73535, 73644, 73269, 72598, 72259, 72751, 74090, 76071, 78523, 81083, 83181, 84527, 85419, 86263, 87043, 87544, 87831, 88169, 88647, 89222, 89982, 90965, 91859, 92285, 92334, 92433, 92713, 92945, 93147, 93706, 94669, 95319, 94869, 93447, 92040, 91565, 92165, 93341, 94426, 94912, 94623, 93802, 93018, 92808, 93374, 94561, 96072, 97628, 98981, 99935, 100467, 100777, 101099, 101483, 101846, 102208, 102673, 103145, 103258, 102719, 101611, 100153, 98372, 96210, 93861, 91623, 89494, 87226, 84890, 83032, 82089, 81913, 82069, 82336, 82688, 83047, 83402, 83969, 84782, 85240, 84554, 82703, 80542, 78843, 77697, 76971, 76832, 77325]
52651G7325N54n5n54l39J98M17M70R19J622J779J100K04k52k66j24J38N50R07
52633H4593J009R72R58Q93P10O26P21M99n80k168l200l030k048j013k69J78K56
52616G9107Jj96L3M47M28j19n74l93K15O78Q42R99J264J344J031N57L30M67P82
52597H7243J084J230J111P85N52N87N25k10j536k536k357j124K47J000J053P50
52581H8404M30K45J74N4k74p81j293j610j590j222p68o28q47r14m34J78J89l32
52563G8981n11j6L36k05j091j141j85P99J055Q13N88N07O09J035J547J439M98
52546H5058m41n44j31o2l08j03O36J001N21n8J11P59J006N74j02o49r81j010p58
52527H4519o41r95j423j225n08j94p62j559j679j031j86M11O38M28j82q12r86
$$ y = [77325, 77879, 77824, 77270, 76931, 77129, 77546, 78016, 78935, 80557, 82336, 83436, 83640, 83388, 83122, 82998, 83136, 83686, 84593, 85602, 86574, 87532, 88425, 89135, 89761, 90482, 90981, 90401, 88233, 85033, 82003, 79955, 78942, 78673, 78851, 79107, 79108, 78912, 78945, 79392, 79820, 79701, 79127, 78734, 78949, 79627, 80469, 81468, 82732, 84076, 85107, 85664, 85994, 86461, 87243, 88327, 89557, 90668, 91453, 92005, 92592, 93117, 92907, 91371, 88835, 86478, 85354, 85601, 86601, 87654, 88404, 88834, 89079, 89253, 89307, 89033, 88252, 86959, 85349, 83759, 82537, 81769, 81141, 80294, 79380, 78946, 79124, 79313, 78981, 78470, 78454, 78790, 78585, 77494, 76353, 76168, 76967, 78022, 78835, 79423, 79930, 80539, 81574, 83121, 84560, 85058, 84617, 84073, 83942, 83880, 83572, 83469, 84105, 85106, 85627, 85569, 85680, 86439, 87445, 88019, 87917, 87268, 86287, 85277, 84519, 83878, 82883, 81460, 80235, 79727, 79533, 78771, 77212, 75533, 74502, 74316, 74727, 75365, 75793, 75611, 74799, 73813]
52510G3813o53j65K07M65O46O48M43J90K7j23m27q72j201j154p55l12j12j20j17
52491G0428r6k67o34p96m20K33N46L06p7j26J72N13P49R68J153R79J73r50j531
52472G1323r59L89J438J467P26o2m90n75l51J87Q01J049P49J56l86p39q13m92
52454G3418J09N65O09M86N37O12L56m4jM97O30p7q73p25J18L68m36j185p53M39
52434G4650J138J058J010J385J557J042L88L78Q59J082Q30N79O31P09M48j42p80
52417H6822j195j207q67m69k93k55q5K36M52M01J71j06k79j08M77J123J361J255
52399H7434J263J475J441R77N34N05N67K39k78l18L07J114J623J762J620J196
52383A01461O41L82P13J427J984K031J669J263J120J297J667K050K303K329K191
$$ y = [73813, 73160, 72995, 73202, 73667, 74313, 74961, 75404, 75594, 75621, 75498, 75071, 74199, 72998, 71844, 71089, 70777, 70665, 70545, 70428, 70332, 70065, 69431, 68635, 68215, 68448, 68994, 69300, 69223, 69097, 69269, 69782, 70531, 71499, 72652, 73631, 73804, 72854, 71323, 70364, 70753, 72191, 73658, 74384, 74322, 73832, 73257, 72906, 73093, 73894, 74943, 75692, 75848, 75462, 74723, 73910, 73418, 73527, 74092, 74701, 75187, 75724, 76336, 76692, 76648, 76647, 77144, 77774, 77697, 76824, 76099, 76217, 76585, 76149, 74964, 74211, 74650, 75788, 76846, 77856, 79241, 80798, 81840, 82228, 82606, 83465, 84547, 85377, 85956, 86587, 87296, 87744, 87602, 86822, 85627, 84420, 83553, 83084, 82791, 82536, 82451, 82687, 83139, 83540, 83711, 83605, 83326, 83218, 83695, 84818, 86179, 87434, 88697, 90172, 91613, 92590, 93124, 93629, 94196, 94435, 94157, 93839, 94146, 95260, 96883, 98645, 100265, 101461, 102102, 102484, 103197, 104624, 106608, 108639, 110308, 111571, 112691, 113988, 115655, 117705, 120008, 122337, 124528]
52368A24528K113K224K257J791R06L00N10J207J621J477J209J258J593J980K394
52353A47368K910L439L710L522K902K182J902K404L374M068M196M348N267O781
52339A98373P912Q111P966Q467R792J1184J2002J2441J3086J4052J4910J5326
52327C33622J5405J5385J5340J5285J5319J5440J5460J5243J4882J4444J3764
52316D99589J2747J1617J0622R613Q340P011O156N843N488M561L096J446j54j482
52302E84493k280k630l133m225n511o200o130n878n781n492m713l888l589l530
52288E21513k819j239L92J381K119L403N233O915Q183R428J0740J1567J1645J1616
52274F00077J2146J2918J3141J2696J2073J1411J0390R050P889P059O133M910
$$ y = [124528, 126641, 128865, 131122, 132913, 133819, 134119, 134629, 135836, 137457, 138934, 140143, 141401, 142994, 144974, 147368, 150278, 153717, 157427, 160949, 163851, 166033, 167935, 170339, 173713, 177781, 181977, 186325, 191592, 198373, 206285, 214396, 222362, 230829, 240621, 251805, 263807, 276248, 289334, 303386, 318296, 333622, 349027, 364412, 379752, 395037, 410356, 425796, 441256, 456499, 471381, 485825, 499589, 512336, 523953, 534575, 544188, 552528, 559539, 565695, 571538, 577026, 581587, 584683, 586129, 585975, 584493, 582213, 579583, 576450, 572225, 566714, 560514, 554384, 548506, 542725, 537233, 532520, 528632, 525043, 521513, 518694, 517455, 517847, 519228, 521347, 524750, 529983, 536898, 545081, 554509, 565249, 576816, 588461, 600077, 612223, 625141, 638282, 650978, 663051, 674462, 684852, 693902, 701791, 708850, 714983, 719893]
52262G19893L786L059K446J668Q94J96r18k808m905o248o616o634o932p632q553
52247F80696r388r737r411q766q368q280q027p246o130n156m564m100l245j820
52233E86458l87K38P2M6P55J525J376M83lN42J604K430K813K864K708K619K946
52216F09089L630M116M006L478L005K942L352L904L973L369K786K991L623L574
52202F57838K599J653J407J376R85N85O69Q46M25m66j175j558j926k241k250k202
52186F56565k585l152l076k169j287j274k063l047l794m199m265m052l680l226
52172F14696k755k389k179j969j644j353j243j160r53q93j291j855k017j723j300
52157E89972p10L21J390J527N78l51l04L35O45O00R04J725K421K572K531K806
$$ y = [719893, 723679, 726738, 729184, 730852, 731746, 731942, 731024, 728216, 723311, 717063, 710447, 703813, 696881, 689249, 680696, 671308, 661571, 652160, 643394, 635026, 626746, 618719, 611473, 605343, 600187, 595623, 591523, 588278, 586458, 586071, 586309, 586381, 586427, 587182, 588707, 590083, 590566, 590563, 591105, 592709, 595139, 597952, 600816, 603524, 606143, 609089, 612719, 616835, 620841, 624319, 627324, 630266, 633618, 637522, 641495, 644864, 647650, 650641, 654264, 657838, 660437, 662090, 663497, 664873, 665858, 666443, 667112, 667958, 668383, 667917, 666742, 665184, 663258, 661017, 658767, 656565, 653980, 650828, 647752, 645583, 644296, 643022, 640959, 637912, 634118, 629919, 625654, 621602, 617922, 614696, 611941, 609552, 607373, 605404, 603760, 602407, 601164, 600004, 599051, 598158, 596867, 595012, 592995, 591272, 589972, 589262, 589583, 590973, 592500, 593078, 592727, 592423, 592758, 593403, 594003, 594907, 596632, 599053, 601625, 604156, 606962]
52141F06962L430M203N195O612Q265R528R959R830R908J0710J2025J3204J3751
52128G23582J3622J3052J2374J1960J2054J2569J3172J3565J3599J3165J2204
52117H64918J0873R527Q408P507O641N589M176K456P22q24k307l775m810n070
52103I04031n076n751p091q015p884p497p943q982r292q165o187m355l140k500
52089H12153k246j996j195M48K654M777O335P270P911Q751J0061J1609J2902J3655
52075H93089J3988J4071J3823J3090J1993J0925J0193R787R425Q755P517N664
52063A022320L445J269o19k367m316o550q784j0706j2308j3706j4815j5538j6178
52050I21147j7314j9049k0644k1172k0478j9288j8439j8145j8045j7653j6659
$$ y = [606962, 610392, 614595, 619790, 626402, 634667, 644195, 654154, 663984, 673892, 684602, 696627, 709831, 723582, 737204, 750256, 762630, 774590, 786644, 799213, 812385, 825950, 839549, 852714, 864918, 875791, 885318, 893726, 901233, 907874, 913463, 917639, 920095, 920817, 919993, 917686, 913911, 909101, 904031, 898955, 893204, 886113, 878098, 870214, 862717, 854774, 845792, 836500, 828335, 822148, 817793, 814653, 812153, 809907, 807911, 806716, 807164, 809818, 814595, 820930, 828200, 836111, 844862, 854923, 866532, 879434, 893089, 907077, 921148, 934971, 948061, 960054, 970979, 981172, 990959, 1000384, 1009139, 1016656, 1022320, 1025765, 1027034, 1026415, 1024048, 1019732, 1013182, 1004398, 993692, 981384, 967678, 952863, 937325, 921147, 903833, 884784, 864140, 842968, 822490, 803202, 784763, 766618, 748573, 730920, 714261]
52039G14261j4958j2761j0763r806j0081j0682j0416r043p482o656o535o577o575
52026E91926o642o624o212n588n390n921o878p922r027j0025j0457j0198r928
52013D91114j0425j1597j2587j2796j2502j2438j2958j3668j3840j3231j2427
52002C52645j2219j2674j3073j2831j2115j1408j0760r832q534p363o949p349
51990B27538p859p653o709n835n626n629n017l848k957k713k561k000j294q79
51976A66958p40q02j280k143k733k526j894j510j441j401j508k011k561k564k179
51961A39665k137k571k717k015r01k55m84j306k110k359j925j180n75j93J23L58
51945A19418M00L50L75L67J96J14M01P46O19J27j35r3k97q78j182p96k52k44o47
$$ y = [714261, 699303, 686542, 675779, 665973, 655892, 645210, 634794, 625751, 618269, 611613, 605078, 598501, 591926, 585284, 578660, 572448, 566860, 561470, 555549, 548671, 540749, 531722, 521697, 511240, 501042, 491114, 480689, 469092, 456505, 443709, 431207, 418769, 405811, 392143, 378303, 365072, 352645, 340426, 327752, 314679, 301848, 289733, 278325, 267565, 257733, 249199, 241836, 234887, 227538, 219679, 212026, 205317, 199482, 193856, 188227, 183210, 179362, 176405, 173692, 171131, 169131, 167837, 166958, 166218, 165416, 164136, 161993, 159260, 156734, 154840, 153330, 151889, 150488, 148980, 146969, 144408, 141844, 139665, 137528, 134957, 132240, 130225, 129324, 129069, 128585, 127279, 125169, 122810, 120885, 119705, 119130, 118937, 119060, 119418, 119818, 120168, 120543, 120910, 121106, 121220, 121621, 122367, 122986, 123113, 122978, 122885, 122588, 121710, 120528, 119732, 119480, 119236, 118589]
51926A18589q55p05n82q25j419k105k456k095j187m85n67j194j672j706j499j248
51910I7989r33n51k06O5K42J32m19j074j149m24M10M71k73r71r24l53L4j9j38
51891I1909J07P77J659K342K253J231J59L51J948L558M027L927M489N571N823
51876A30131M796L709L913N419P351R011R970R806Q399O202L737J118j614l998
51862A97950n507o118o210o142o194o579p094p074o144m823l968l719l471k763
51848A22144j809j141r93j134j111p36l12k88o11p14k87K78M63L47L53N45N86
51831A15580K93j76o26r95j182j099q20n23k66l0J41K45M68Q88J176R13K22l13
51813A13896m36n33r63j366j074q4P50O88rm46k02K84N00N97J001J600J791J269
$$ y = [118589, 117734, 117029, 116447, 115622, 114203, 112098, 109642, 107547, 106360, 105875, 105308, 104114, 102442, 100736, 99237, 97989, 97056, 96505, 96299, 96364, 96606, 96738, 96319, 95245, 94096, 93672, 94082, 94553, 94280, 93309, 92385, 92032, 92066, 92047, 91909, 92016, 92793, 94452, 96794, 99047, 100278, 100437, 100788, 102736, 106294, 110321, 114248, 118737, 124308, 130131, 134927, 138636, 142549, 147968, 155319, 164330, 174300, 184106, 192505, 198707, 202444, 203562, 201948, 197950, 192443, 186325, 180115, 173973, 167779, 161200, 154106, 147032, 140888, 136065, 132097, 128378, 124907, 122144, 120335, 119194, 118201, 117067, 115956, 115220, 114908, 114620, 114009, 113295, 113008, 113286, 113749, 114096, 114449, 114994, 115580, 115873, 115697, 115071, 114076, 112894, 111795, 110975, 110452, 110186, 110156, 110297, 110542, 111010, 111898, 113074, 113987, 114209, 113896, 113460, 112927, 111964, 110598, 109524, 109440, 110190, 110878, 110869, 110423, 110221, 110505, 111005, 111602, 112603, 114203, 115994, 117263]
51795A17263L57m89j072j327j263j070r85r23o26k25j46l87m52k13k41q49j384
$$ y = [117263, 117620, 117131, 116059, 114732, 113469, 112399, 111414, 110491, 109865, 109640, 109494, 109107, 108655, 108442, 108201, 107352, 105968]
$$ [...]
##END NTUPLES=NMR SPECTRUM
##END=
