##TITLE=NES1062_159122.0011_002_9704227_S7YpYeiwKW
##JCAMPDX= 6.0         $$ Bruker NMR JCAMP-DX V2.0
##DATA TYPE= NMR SPECTRUM
##DATA CLASS= NTUPLES
##ORIGIN= BRUKER
##OWNER= Administrator
$$ 1.72 TOPSPIN		Version 2.1
$$ 2016-10-25 16:11:18.654 -0500  Administrator@X
$$ Compression mode = diff/dup
##.OBSERVE FREQUENCY= 400.02188249412
##.OBSERVE NUCLEUS= ^1H
##.ACQUISITION MODE= SIMULTANEOUS (DQD)
##.ACQUISITION SCHEME= undefined
##.AVERAGES= 64
##.DIGITISER RES= 22
##SPECTROMETER/DATA SYSTEM= spect
##.PULSE SEQUENCE= noesygpps1d.comp
##.SOLVENT NAME= COFFEE_meoh
##.SHIFT REFERENCE= INTERNAL, COFFEE_meoh, 1, 14.96077
##AUDIT TRAIL= $$ (NUMBER, WHEN, WHO, WHERE, PROCESS, VERSION, WHAT)
$$ ##TITLE= Audit trail, TOPSPIN		Version 2.1
$$ ##JCAMPDX= 5.01
$$ ##ORIGIN= Bruker BioSpin GmbH
$$ ##OWNER= Administrator
$$ $$ E:\/data/COFFEE/nmr/NES1062_159122.0011_002_9704227_S7YpYeiwKW/22/pdata/1/auditp.txt
$$ ##AUDIT TRAIL=  $$ (NUMBER, WHEN, WHO, WHERE, PROCESS, VERSION, WHAT)
(   1,<2016-05-01 16:25:03.942 -0700>,<Administrator>,<X>,<go>,<TOPSPIN 2.1>,
      <created by zg
	started at 2016-05-01 16:13:34.255 -0700,
	POWCHK enabled, PULCHK disabled,
       configuration hash MD5:
       21 0F 79 D6 B3 7B B4 F6 88 20 88 DB 03 48 BD 9F
       data hash MD5: 64K
       C6 51 EE B9 29 9B 7E A8 B6 F9 03 F8 E4 60 91 67>)
(   2,<2016-05-01 16:25:07.052 -0700>,<Administrator>,<X>,<proc1d>,<TOPSPIN 2.1>,
      <Start of raw data processing
       efp LB = 0.3 FT_mod = 6 PKNL = 1 PHC0 = 0 PHC1 = 0 SI = 128K 
       data hash MD5: 128K
       58 3A DB 93 46 7E 1A 86 B3 93 25 FE 16 F1 B1 0E>)
(   3,<2016-05-01 16:25:07.911 -0700>,<Administrator>,<X>,<proc1d>,<TOPSPIN 2.1>,
      <pk PHC0 = -82.87537 PHC1 = 0 
       data hash MD5: 128K
       1C 4D 01 1A 98 C7 0F EF BF 79 3A A6 FD DE B2 39>)
(   4,<2016-05-01 16:25:08.302 -0700>,<Administrator>,<X>,<proc1d>,<TOPSPIN 2.1>,
      <abs ABSG = 1 
       data hash MD5: 128K
       C8 F2 84 A1 A2 AE 12 C9 25 8B 35 2C A0 60 C9 3B>)
(   5,<2016-05-01 16:25:08.396 -0700>,<Administrator>,<X>,<proc1d>,<TOPSPIN 2.1>,
      <abs ABSG = 2 
       data hash MD5: 128K
       95 D3 9F D1 D9 57 5F 89 94 BD F3 60 E8 E4 0B 20>)
(   6,<2016-05-01 16:25:08.474 -0700>,<Administrator>,<X>,<proc1d>,<TOPSPIN 2.1>,
      <abs ABSG = 3 
       data hash MD5: 128K
       7A D1 85 B7 D9 02 10 88 0C FA 76 CA 9A E0 E5 C7>)
(   7,<2016-05-01 16:25:08.552 -0700>,<Administrator>,<X>,<proc1d>,<TOPSPIN 2.1>,
      <abs ABSG = 4 
       data hash MD5: 128K
       B4 5C 66 05 7B 4C F7 39 16 F0 C5 F9 21 57 B4 6A>)
(   8,<2016-05-01 16:25:08.630 -0700>,<Administrator>,<X>,<proc1d>,<TOPSPIN 2.1>,
      <abs ABSG = 5 
       data hash MD5: 128K
       13 5F 9F D3 45 4D 21 24 F5 1C F7 82 8D B0 FE 81>)
(   9,<2016-05-01 16:25:10.536 -0700>,<Administrator>,<X>,<audit>,<TOPSPIN 2.1>,
      <user comment:
       ICON-NMR User ID: COFFEE
       data hash MD5: 128K
       13 5F 9F D3 45 4D 21 24 F5 1C F7 82 8D B0 FE 81>)
$$ ##END=
$$ 
$$ $$ hash MD5
$$ [...]
##$TP07= 0
##$TPNAME0= <>
##$TPNAME1= <>
##$TPNAME2= <>
##$TPNAME3= <>
##$TPNAME4= <>
##$TPNAME5= <>
##$TPNAME6= <>
##$TPNAME7= <>
##$TPOAL= (0..7)
0.5 0.5 0.5 0.5 0.5 0.5 0.5 0.5
##$TPOFFS= (0..7)
0 0 0 0 0 0 0 0
##$TUNHIN= 0
##$TUNHOUT= 0
##$TUNXOUT= 0
##$USERA1= <user>
##$USERA2= <user>
##$USERA3= <user>
##$USERA4= <user>
##$USERA5= <user>
##$V9= 5
##$VALIST= <valist>
##$VCLIST= <CCCCCCCCCCCCCCC>
##$VD= 0
##$VDLIST= <DDDDDDDDDDDDDDD>
##$VPLIST= <PPPPPPPPPPPPPPP>
##$VTLIST= <TTTTTTTTTTTTTTT>
##$WBST= 2048
##$WBSW= 25
##$XGAIN= (0..3)
0 0 0 0
##$XL= 0
##$YL= 0
##$YMAX_a= 5251422
##$YMIN_a= -9407771
##$ZGOPTNS= <>
##$ZL1= 120
##$ZL2= 120
##$ZL3= 120
##$ZL4= 120
##$ABSF1= 14.96077
##$ABSF2= -5.597412
##$ABSG= 5
##$ABSL= 3
##$ALPHA= 0
##$AQORDER= 0
##$ASSFAC= 0
##$ASSFACI= 0
##$ASSFACX= 0
##$ASSWID= 0
##$AUNMP= <proc_prof1d_extract.lims>
##$AXLEFT= 0
##$AXNAME= <>
##$AXNUC= <1H>
##$AXRIGHT= 0
##$AXTYPE= 0
##$AXUNIT= <>
##$AZFE= 0.1
##$AZFW= 0.1
##$BCFW= 0
##$BC_mod= 0
##$BYTORDP= 0
##$COROFFS= 0
##$CY= 15
##$DATMOD= 1
##$DC= 0
##$DFILT= <>
##$DTYPP= 0
##$F1P= 0
##$F2P= 0
##$FCOR= 0.5
##$FTSIZE= 131072
##$FT_mod= 6
##$GAMMA= 0
##$GB= 0
##$INTBC= 1
##$INTSCL= 1
##$ISEN= 128
##$LB= 0.3
##$LEV0= 0
##$LPBIN= 0
##$MAXI= 10000
##$MC2= 0
##$MEAN= 0
##$ME_mod= 0
##$MI= 0
##$NCOEF= 0
##$NC_proc= -3
##$NLEV= 6
##$NOISF1= 0
##$NOISF2= 0
##$NSP= 0
##$NTH_PI= 0
##$NZP= 0
##$OFFSET= 14.96077
##$PC= 1
##$PHC0= -82.87537
##$PHC1= 0
##$PH_mod= 1
##$PKNL= yes
##$PPARMOD= 0
##$PPDIAG= 0
##$PPIPTYP= 0
##$PPMPNUM= 2147483647
##$PPRESOL= 1
##$PSCAL= 4
##$PSIGN= 0
##$PYNMP= <proc.py>
##$REVERSE= no
##$SF= 400.020009728886
##$SI= 131072
##$SIGF1= 0
##$SIGF2= 0
##$SINO= 400
##$SIOLD= 131072
##$SPECTYP= <>
##$SREGLST= <1H.CDCl3>
##$SSB= 0
##$STSI= 131072
##$STSR= 0
##$SW_p= 8223.68421052631
##$SYMM= 0
##$S_DEV= 0
##$TDeff= 65536
##$TDoff= 0
##$TI= <>
##$TILT= no
##$TM1= 0
##$TM2= 0
##$TOPLEV= 0
##$USERP1= <user>
##$USERP2= <user>
##$USERP3= <user>
##$USERP4= <user>
##$USERP5= <user>
##$WDW= 1
##$XDIM= 131072
##$YMAX_p= 519816809
##$YMIN_p= -23231
##$CURPLOT= <Network HP LaserJet P1505>
##$CURPRIN= <$Network HP LaserJet P1505>
##$DFORMAT= <normdp>
##$LAYOUT= <+/1D_H.xwp>
##$LFORMAT= <normlp>
##$PFORMAT= <normpl>
##$SURQMSG= 1
$$ End of Bruker specific parameters
$$ ---------------------------------
##NTUPLES= NMR SPECTRUM
##VAR_NAME=  FREQUENCY,     SPECTRUM/REAL,   SPECTRUM/IMAG
##SYMBOL=    X,             R,               I
##VAR_TYPE=  INDEPENDENT,   DEPENDENT,       DEPENDENT
##VAR_FORM=  AFFN,          ASDF,            ASDF
##VAR_DIM=   131072,        131072,          131072
##UNITS=     HZ,            ARBITRARY UNITS, ARBITRARY UNITS
##FACTOR=    0.0627417313425164, 1,          1
##FIRST=     8223.62146879497, 3483,         -94456
##LAST=      0,             7105,            -93334
##MIN=       0,             -23231,          0
##MAX=       8223.62146879497, 519816809,    0
$$ Real data points
##PAGE= N=1
##DATA TABLE= (X++(R..R)), XYDATA
$$ [...]
63547A123657K4341J3249K363o715j3405j7533j8664j6852j3374r963p662o849
$$ 1123657 1147998 1161247 1163610 1156895 1143490 1125957 1107293 1090441 1077067 1067104 1059442 1052593
63535A052593p834j0794j5479k1373k7977l4648m0560m4987m7487m7846m6292
$$ 1052593 1044759 1033965 1018486 997113 969136 934488 893928 848941 801454 753608 707316
63524G07316m3684m0914l8070l4681l0798k7183k4358k2069j9851j7602j5444
$$ 707316 663632 622718 584648 549967 519169 491986 467628 445559 425708 408106 392662
63513C92662j3565j2159j1186j0234r101q259q044p798o731n272m413l872k453
$$ 392662 379097 366938 355752 345518 336417 328158 320114 312316 305585 300313 295900 292028 289575
63500B89575l24O42n21k368k997k418j864j713j278j61J321K806M098M811M509
$$ 289575 289251 289893 289372 287004 284007 281589 279725 278012 276734 276573 277894 280700 284798 289609 294118
63485B94118L273J776Q71J193K755M713N915N926N117L748J655r62l287m809n739
$$ 294118 297391 299167 300038 301231 303986 308699 314614 320540 325657 329405 331060 330098 326811 322002 316263
63470C16263o158n696m581m022m696n584n280l826k339j358n03N40J655K693L464
$$ 316263 310105 304409 299828 295806 291110 285526 280246 276420 274081 272723 272220 272760 274415 277108 280572
63455B80572L665L468L786N155O733P361P223P540Q820J0454J1887J3181J4414
$$ 280572 284237 287705 291491 296646 303379 310740 317963 325503 334323 344777 356664 369845 384259
63442C84259J5484J6617J8209K0030K1336K1912K2326K3110K4494K6928L0859
$$ 384259 399743 416360 434569 454599 475935 497847 520173 543283 567777 594705 625564
63431F25564L5659L9725M2258M4258M7211N1271N5463N9340O3562O8559P3002
$$ 625564 661223 700948 743206 787464 834675 885946 941409 1000749 1064311 1132870 1205872
63420A205872P4069O9445N9075M4903K9254J3863K09j0293j7047k0572k1504j9948
$$ 1205872 1279941 1349386 1408461 1453364 1482618 1496481 1496690 1486397 1469350 1448778 1427274 1407326
63408A407326j6526j3304j2550j4971k0037k7342l6245m4727n0535n3649n5921
$$ 1407326 1390800 1377496 1364946 1349975 1329938 1302596 1266351 1221624 1171089 1117440 1061519
63397A061519n7911n7890n4669m9633m4738l9999l4518k8834k4384k1156j7729
$$ 1061519 1003608 945718 891049 841416 796678 756679 722161 693327 668943 647787 630058
63386F30058j3563r704o936m662k037Q77L675O617J0275J4596J8811K2191K4673
$$ 630058 616495 606791 599855 595193 593156 594033 597708 604325 614600 629196 648007 670198 694871
63373F94871K6728K8724L0454L1510L2120L3182L5290L8213M1679M5961N0898
$$ 694871 721599 750323 780777 812287 844407 877589 912879 951092 992771 1038732 1089630
63362A089630N4959N6358N4914N1702M6967L9571K8900J6297M098o045j3453j7959
$$ 1089630 1144589 1200947 1255861 1307563 1354530 1394101 1423001 1439298 1443396 1437351 1423898 1405939
63350A405939j9847j9874j8762j7013j5427j5266j7365k1522k7128l3896m1438
$$ 1405939 1386092 1366218 1347456 1330443 1315016 1299750 1282385 1260863 1233735 1199839 1158401
63339A158401m8639n4072n6954n7306n5641n2802m9602m6060m1502l5947l0809
$$ 1158401 1109762 1055690 998736 941430 885789 832987 783385 737325 695823 659876 629067
63328F29067k7414k5348k3234k0638j8149j5876j3258j0473q695q563r371j0183
$$ 629067 601653 576305 553071 532433 514284 498408 485150 474677 465982 457419 448048 437865
63316D37865j0695j0561r074o319l752k618k392j689k08J190J880K047K064K295
$$ 437865 427170 416609 407535 401216 397464 394846 392454 390765 390557 391747 393627 395674 397738 400033
63302D00033L236M830N747M490J375j618l275m396o104p936q588p943p253p414
$$ 400033 403269 408099 413846 418336 419711 418093 414818 410422 404318 396382 387794 379851 372598 365184
63288C65184p938p825o790n377m192l404k801k190j731j763k169k109q72R64J774
$$ 365184 357246 349421 342631 337254 333062 329658 326857 324667 322936 321173 319004 316895 316023 316987 318761
63273C18761O52j349k240j246N67J751J997K015K407L173L989M454M240L543L352
$$ 318761 319413 318064 315824 314578 315145 316896 318893 320908 323315 326488 330477 334931 339171 342714 346066
63258C46066M586O870Q704R156Q810Q764R229R767J0428J1777J3811J5639J6602
$$ 346066 350652 357522 366226 375382 384192 392956 402185 411952 422380 434157 447968 463607 480209
63245D80209J7203J8472K0729K3371K5788K8000L0260L2406L3978L4973L5993
$$ 480209 497412 515884 536613 559984 585772 613772 644032 676438 710416 745389 781382
63234G81382L7331L8190L7415L5066L2703L1750L1994L2118L1406L0390K9938
$$ 781382 818713 856903 894318 929384 962087 993837 1025831 1057949 1089355 1119745 1149683
63223A149683L0356L1443L2820L3849L3625L1501K7528K2122J5473P589j150r984
$$ 1149683 1180039 1211482 1244302 1278151 1311776 1343277 1370805 1392927 1408400 1415989 1414839 1404855
63211A404855j8405k6433l3871l9622m2444m2399m0975l9415l7474l4203k9469
$$ 1404855 1386450 1360017 1326146 1286524 1244080 1201681 1160706 1121291 1083817 1049614 1020145
63200A020145k3946j8085j2050o583k792p25Q44K806M861O760R423J3762J9110
$$ 1020145 996199 978114 966064 959481 956689 955964 956808 959614 964475 971235 980658 994420 1013530
63187A013530K3849K7290K9864L1788L2700L2595L2141L1918L2113L2923L4254
$$ 1013530 1037379 1064669 1094533 1126321 1159021 1191616 1223757 1255675 1287788 1320711 1354965
63176A354965L5022L3846L0881K7942K6190K4530K0954J4831P063j487j0760k0767
$$ 1354965 1389987 1423833 1454714 1482656 1508846 1533376 1554330 1569161 1576224 1574737 1563977 1543210
63164A543210l0875m0037m7409n2772n6535n9265o0940o0790n8248n3951m9499
$$ 1543210 1512335 1472298 1424889 1372117 1315582 1256317 1195377 1134587 1076339 1022388 972889
63153I72889m6103m3633m0966l7199l2509k7881k4011k0672j7325j4232j2407
$$ 972889 926786 883153 842187 804988 772479 744598 720587 699915 682590 668358 655951
63142F55951j2214j2460j1343q297m562j836o48k02L94J224K062L239N259P596
$$ 655951 643737 631277 619934 611637 607075 605239 604591 604389 604783 606007 608069 611308 616567 624163
63128F24163Q723P871O192N373N439M844K688j10k196l488m892o742q269q609
$$ 624163 632886 640757 646949 652322 657761 662605 665293 665183 662987 659499 654607 647865 639596 630987
63114F30987p811o593n386m064k669j955k546l674l578j563J053K553K734K436
$$ 630987 623176 616583 611197 607133 604464 602509 599963 596289 592711 591148 592201 594754 597488 599924
63100E99924J925R38k1J80J689L338M252M774N467O151O500O704P005P211P235
$$ 599924 601849 602787 602766 602946 604635 607973 612225 616999 622466 628617 635117 641821 648826 656037 663272
63085F63272P449Q015Q450Q461Q635R555J0710J0994J0214R431R858J1745J4324
$$ 663272 670721 678736 687186 695647 704282 713837 724547 735541 745755 755186 765044 776789 791113
63072G91113J6632J8325J9691K0895K1640K1971K2867K5196K8406L1277L3774
$$ 791113 807745 826070 845761 866656 888296 910267 933134 958330 986736 1018013 1051787
63061A051787L6932M0973M5140M9526N5268O2168O7960P1132P2874P4762P6008
$$ 1051787 1088719 1129692 1174832 1224358 1279626 1341794 1409754 1480886 1553760 1628522 1704530
63050A704530P4991P2469P0926P1100P1338P0469O9378O9177O9597O9935P0411
$$ 1704530 1779521 1851990 1922916 1994016 2065354 2135823 2205201 2274378 2343975 2413910 2484321
63039B484321P1622P3237P3845P1731O5839N6531M5322L3172J9251K298j7019
$$ 2484321 2555943 2629180 2703025 2774756 2840595 2897126 2942448 2975620 2994871 2997169 2980150
63028B980150l6300n3871o9645q3410r3942j00544j04003j04999j02778r6722
$$ 2980150 2943850 2889979 2820334 2736924 2642982 2542438 2438435 2333436 2230658 2133936
63018B133936q8285p9724p1205o0783m7507l3219k0630j0383r14R120J9256K8212
$$ 2133936 2045651 1965927 1894722 1833939 1786432 1753213 1732583 1722200 1721286 1730406 1749662 1777874
63006A777874L5750M2739M9541N5248N9072O1812O5049O9028P2226P3105P1688
$$ 1777874 1813624 1856363 1905904 1961152 2020224 2082036 2147085 2216113 2288339 2361444 2433132
62995B433132O9124O6367O3697O0917N7509N2751M6193L7931K8261J7182M435
$$ 2433132 2502256 2568623 2632320 2693237 2750746 2803497 2849690 2887621 2915882 2933064 2937499
62984B937499j0090k6158m3258o0701p7676r3244j06349j15972j21634j23710
$$ 2937499 2927409 2901251 2857993 2797292 2719616 2626372 2520023 2404051 2282417 2158707
62974B158707j23124j20735j17096j12517j07001j00247r2083q2961p3805o5478
$$ 2158707 2035583 1914848 1797752 1685235 1578234 1477987 1385904 1302943 1229138 1163660
62964A163660n8546n3179m8869m4640m0123l6137l3479l1404k8317k4045k0415
$$ 1163660 1105114 1051935 1003066 958426 918303 882166 848687 817283 788966 764921 744506
62953G44506j9104j9730k0559k0393j9226j7563j5909j4677j3965j3474j2980
$$ 744506 725402 705672 685113 664720 645494 627931 612022 597345 583380 569906 556926
62942E56926j2651j2487j1816j0098q091p277p865q210o888m693l565l863l976
$$ 556926 544275 531788 519972 509874 501783 494506 486641 478431 471543 466850 463285 459422 455446
62929D55446k910j879k310l453l463k244j383j363j001q6l12k354l973l051j003
$$ 455446 452536 450657 448347 444894 441431 439187 437804 436441 435440 435354 435042 432688 428715 425664 424661
62914D24661q40k704l872k968j581j341j791k074k662l991m956m258k359p89j74
$$ 424661 423821 421117 417245 414277 412696 411355 409564 407490 404828 400837 395881 391623 389264 388475 388301
62899C88301J1L56J076K082K686J859l97k456k736j437J11J194J896K127J706
$$ 388301 388312 388668 389744 391826 394512 396371 395974 393518 390782 389345 389456 390650 392546 394673 396379
62884C96379J115J084J439J297L97n79j094j375j737j977j716r94k72o1n57j443
$$ 396379 397494 398578 400017 401314 401711 401132 400038 398663 396926 394949 393233 392239 391967 391906 391349 389906
62868C89906k101k199k012j979k117k064j518m93N85J084Q48P19J686L247L463
$$ 389906 387805 385606 383594 381615 379498 377434 375916 375423 376008 377092 377940 378659 380345 383592 387055
62853C87055J269j874l377k135P07L126L648K011o40k423k358j254m62j94J36
$$ 387055 388324 386450 383073 380938 381645 384771 388419 390430 389790 387367 385009 383755 383293 383099 383235
62838C83235M22p6j296k123j869j007k28M26J100J579J661J561J501J348J049
$$ 383235 383657 383581 382285 380162 378293 377286 377058 377484 378584 380163 381824 383385 384886 386234 387283
62823C87283J075K075M224P089R897J1799J2254J1439J0107Q920Q089P574P417
$$ 387283 388358 390433 394657 401746 411643 423442 435696 447135 457242 466162 474251 481825 489242
62810D89242P706Q433R465J0546J1443J2247J3332J4845J6449J7926J9689K2194
$$ 489242 496948 505381 514846 525392 536835 549082 562414 577259 593708 611634 631323 653517
62798F53517K5148K7958L0837L4702L9854M5422N0283N4084N7382O1366O7380
$$ 653517 678665 706623 737460 772162 812016 857438 907721 961805 1019187 1080553 1147933
62787A147933P5841Q5479R4447J02453J10877J20363J29326J35662J39001J40043
$$ 1147933 1223774 1309253 1403700 1506153 1617030 1737393 1866719 2002381 2141382 2281425
62777B281425J38231J31646J19419J02970Q4253O3713M0796J5903r160l2693n4206
$$ 2281425 2419656 2551302 2670721 2773691 2857944 2921657 2962453 2978356 2969196 2936503 2882297
62766B882297p3805r1105j05282j15989j23583j28437j30393j29247j25470j20092
$$ 2882297 2808492 2717387 2612105 2496116 2372533 2244096 2113703 1984456 1858986 1738894
62756A738894j13896j07072r9723r2331q5378p8695p1641o4030n6527m9886m4139
$$ 1738894 1624998 1517926 1418203 1325872 1240494 1161799 1090158 1026128 969601 919715 875576
62745H75576l8989l4795l2242l0843k8677k4505j9640j6594j5939j5636j3705
$$ 875576 836587 801792 769550 738707 710030 685525 665885 649291 633352 617716 604011
62734F04011j0438p367n112l312j875j013k41J350L673N507O181O529P708R760
$$ 604011 593573 586206 581094 577782 575907 574894 574653 576003 579676 585183 591364 597893 605601 615361
62720F15361J1918J3857J5951J8541K1604K5209K9772L5460M1689M7518N2650
$$ 615361 627279 641136 657087 675628 697232 722441 752213 787673 829362 876880 929530
62709I29530N7718O3455O9914P6821Q4398R3146J02852J12489J21275J29066J35418
$$ 929530 987248 1050703 1120617 1197438 1281836 1374982 1477834 1590323 1711598 1840664 1976082
62698A976082J39192J39620J36872J30876J20605J05624Q7431O7685M5785K0172
$$ 1976082 2115274 2254894 2391766 2522642 2643247 2748871 2836302 2903987 2949772 2969944
62688B969944q133l5394n9027p9616r8382j14542j26532j34299j38751j40009
$$ 2969944 2961811 2926417 2867390 2787774 2689392 2574850 2448318 2314019 2175268 2035259
62678B035259j37801j32827j26139j17774j07632r7227q8766q2477p6546o9836
$$ 2035259 1897458 1764631 1638492 1520718 1413086 1315859 1227093 1144616 1068070 998234
62668I98234o3064n6968n1028m4822l9248l5289l2528k9903k7298k5286k3812
$$ 998234 935170 878202 827174 782352 743104 707815 675287 645384 618086 592800 568988
62657E68988k2081j9655j6946j4752j3699j3811j4096j3020j0082o778n216n865
$$ 568988 546907 527252 510306 495554 481855 468044 453948 440928 430846 424068 418852 412987
62645D12987p237p662o745n154l688k769k281j713p27K31L32n15j387j424p97
$$ 412987 405750 398088 391343 386189 382501 379732 377451 375738 375011 375242 375574 375059 373672 372248 371451
62630C71451k99j98j3O31J268J076N9o41Q7J959L637M423N014O228P645Q331Q450
$$ 371451 371152 370954 370941 371572 372840 373916 373975 373334 373421 375380 379017 383440 388454 394682 402327 410658 419108
62613D19108R125J0782J2653J4318J6694K0692K5549K9372L1349L2697L5276L9724
$$ 419108 428233 439015 451668 465986 482680 503372 528921 558293 589642 622339 657615 697339
62601F97339M5121N0179N4480N8471O2482O6092O8546O9438O8508O5002N8090
$$ 697339 742460 792639 847119 905590 968072 1034164 1102710 1172148 1240656 1305658 1363748
62590A363748M8101L6787K5859J5539M852p032j9892l2550m3390n1227n6070n8963
$$ 1363748 1411849 1448636 1474495 1490034 1494886 1487854 1467962 1435412 1392022 1340795 1284725 1225762
62578A225762o0921o2223o2685o1963n9424n4669m8745m3966m1594m0296l7829
$$ 1225762 1164841 1102618 1039933 977970 918546 863877 815132 771166 729572 689276 651447
62567F51447l3771k9436k5554k1598j7444j4229j2837j2538j1817r978p459n143
$$ 651447 617676 588240 562686 541088 523644 509415 496578 484040 472223 462245 454786 449643
62555D49643l703l172k779j718k36N84L07l49o38o46o02l69j15n82j815k432j207
$$ 449643 445940 442768 439989 438271 438035 438619 438926 438577 437939 437293 436691 436322 436207 435625 433810 431378 430171
62538D30171J154K914L649M556O538R101J1339J3023J4439J5902J7848K0762K4559
$$ 430171 431325 434239 437888 442444 448982 458083 469422 482445 496884 512786 530634 551396 575955
62525E75955K8483L2028L5584L9834M4805M9979N5110O0413O5890P0820P4177
$$ 575955 604438 636466 672050 711884 756689 806668 861778 922191 988081 1058901 1133078
62514A133078P5462P4851P2554O8298O1672N2786M2126K9792J5448o08j6749l0972
$$ 1133078 1208540 1283391 1355945 1424243 1485915 1538701 1580827 1610619 1626067 1625459 1608710 1577738
62502A577738m2433n1545n8710o3578o5735o5519o3694o0644n6416n1459m6692
$$ 1577738 1535305 1483760 1425050 1361472 1295737 1230218 1166524 1105880 1049464 998005 951313
62491I51313m2608l8807l4707l0388k6230k2113j7738j3590j0657q954p247m860
$$ 951313 908705 869898 835191 804803 778573 756460 738722 725132 714475 705521 698274 693414
62479F93414k875k624l628m131l419k521k631l947o115q772j1326j3062j3765
$$ 693414 690539 687915 684287 680156 676737 674216 671585 667638 661523 652751 641425 628363 614598
62466F14598j3644j2628j0692q858q611r833j0557r414p225n440m148k750j664
$$ 614598 600954 588326 577634 568776 560165 550332 539775 530361 523136 517696 513548 510798 509134
62453E09134j961l567m962m637k236J395M718O479O871P463R349J1811J3275J2937
$$ 509134 507173 503606 498644 494007 491771 493166 497884 504363 511234 518697 528046 539857 553132 566069
62439E66069J0930P793M565K517J625J59k992o368p735p176o679p148p762q190
$$ 566069 576999 584792 589357 591874 593499 593658 590666 584298 576563 569387 562708 555560 547798 539608
62425E39608r262j0988j1801j0688q661p212o546o193o213o731p139o793n965
$$ 539608 530346 519358 507557 496869 488208 480996 474450 468257 462044 455313 448174 441381 435416
62412D35416n251m603l656k539j574p14MQ6n66q70J95J891K362J178J42J004L155
$$ 435416 430165 425562 421906 419367 417793 417079 417083 417169 416603 415733 415928 417819 420181 421359 421501 422505 425660
62395D25660M421L826K668K701M110N837P207Q227Q548P569N917N479P036Q926
$$ 425660 430081 433907 436575 439276 443386 449223 456430 464657 473205 480774 486691 492170 499206 508132
62381E08132R226Q368Q246R358J0578J1479J3033J5684J8397K0308K2012K4516
$$ 508132 517358 525726 533972 543330 553908 565387 578420 594104 612501 632809 654821 679337
62369F79337K7992L2229L7234M2662M7671N2143N7318O4386P3074Q2158R0459
$$ 679337 707329 739558 776792 819454 867125 919268 976586 1040972 1114046 1196204 1286663
62358A286663R6704R9470R8338R4457Q8812Q0499O7917N1321L3139J5940J041
$$ 1286663 1383367 1482837 1581175 1675632 1764444 1844943 1912860 1964181 1997320 2013260 2014301
62347B014301j1180k0929k9211l7392m6002n4480o2249o9430p6035q0967q2560
$$ 2014301 2003121 1982192 1952981 1915589 1869587 1815107 1752858 1683428 1607393 1526426 1443866
62336A443866q0222p5210o9480o3875n7684n0108m1748l4291k8997k5948k4532
$$ 1443866 1363644 1288434 1218954 1155079 1097395 1047287 1005539 971248 942251 916303 891771
62325H91771k4005k3625k2990k2429k2499k3054k3327k2933k2085k0867j9215
$$ 891771 867766 844141 821151 798722 776223 753169 729842 706909 684824 663957 644742
62314F44742j7627j6796j6365j5116j2792j0565r176p832n680l201j302j12M26
$$ 644742 627115 610319 593954 578838 566046 555481 546305 538473 532793 529592 528290 528178 528604
62301E28604j53j757k974k589j145J71J283K606L636L844M093N331O514N995M600
$$ 528604 528451 526694 523720 521131 519986 520157 521440 524046 527682 531526 535619 540950 547464 553459 558059
62286E58059M979P733J0556J1808J2530J3898J4827J3935J2304J2286J4288J6634
$$ 558059 563038 570771 581327 593135 605665 619563 634390 648325 660629 672915 687203 703837
62274G03837J8212J9641K1695K3911K5337K5901K6675K9094L3877M0444M7373
$$ 703837 722049 741690 763385 787296 812633 838534 865209 894303 928180 968624 1015997
62263A015997N3708N9690O6026P2945Q0175Q7272R3302R6675R6204R2145Q5431
$$ 1015997 1069705 1129395 1195421 1268366 1348541 1435813 1529115 1625790 1721994 1814139 1899570
62252A899570P6076O3341M7724L1660J7579N742n395j7051k9083m0842n2167o3167
$$ 1899570 1975646 2038987 2086711 2118371 2135950 2141692 2136297 2119246 2090163 2049321 1997154 1933987
62240A933987p3427q1983q7962r0977r0967q8010q2507p5376o7814o0693n4162
$$ 1933987 1860560 1778577 1690615 1599638 1508671 1420661 1338154 1262778 1194964 1134271 1080109
62229A080109m7886m1694l5858l0712k6153k1861j7971j5128j3690j3198j2960
$$ 1080109 1032223 990529 954671 923959 897806 875945 857974 842846 829156 815958 802998
62218H02998j2768j2612j2009j0411q262o874o833p073o037l569j245p88k304
$$ 802998 790230 777618 765609 755198 746936 740062 733229 726156 720119 716550 715305 714517 712213
62205G12213m089m161k105P03K739L798M568N331N927O657Q061R660J0126R238
$$ 712213 708124 703963 701858 702561 705300 709098 713666 718997 724924 731581 739642 749302 759428 768666
62191G68666Q579R616J1812J3501J3965J3823J3920J4658J6055J7565J8126J7163
$$ 768666 777245 786861 798673 812174 826139 839962 853882 868540 884595 902160 920286 937449
62179I37449J5408J4178J4145J5355J7910K1838K6737L2385L9295M7667N6256
$$ 937449 952857 967035 981180 996535 1014445 1036283 1063020 1095405 1134700 1182367 1238623
62168A238623O3417O8981P3747P7274P7652P3705O6142N6120M4054L0545J7344
$$ 1238623 1302040 1371021 1444768 1522042 1599694 1673399 1739541 1795661 1839715 1870260 1887604
62157A887604O356j870q114j3656j9838k7574l6445m4796n1374n6355o0168o2098
$$ 1887604 1893960 1892090 1883976 1870320 1850482 1822908 1786463 1741667 1690293 1633938 1573770 1511672
62145A511672o1094n7385n2309m6672m0305l3164k6005j9774j4943j1516r000
$$ 1511672 1450578 1393193 1340884 1294212 1253907 1220743 1194738 1174964 1160021 1148505 1139505
62134A139505o391l054R1R66j521o137j0480j3016j3615j2690j0730q517p019
$$ 1139505 1133114 1130060 1130151 1131117 1129596 1123459 1112979 1099963 1086348 1073658 1062928 1054411 1047392
62121A047392o747p640r512j2036j4154j4380j2374r736q461q762r068q110o229
$$ 1047392 1040645 1033005 1023493 1011457 997303 982923 970549 960813 952352 943590 934522 926412 920183
62108I20183m552l635l346l461l798m002l797l347k956k472j307Q08L311N118
$$ 920183 915631 911996 908650 905189 901391 897389 893592 890245 887289 884817 883510 884318 887629 892747
62094H92747N458M498L266K930L984O075Q364J0110J1128J1983J3405J5273J6593
$$ 892747 898205 902703 905969 908899 912883 918958 927322 937432 948560 960543 973948 989221 1005814
62081A005814J6925J7426J9593K3256K6785K9208L1090L3226L5699L8502M1813
$$ 1005814 1022739 1040165 1059758 1083014 1109799 1139007 1170097 1203323 1239022 1277524 1319337
62070A319337M5119M7312M8424N0104N3404N6991N8541N6970N2321M4631L4451
$$ 1319337 1364456 1411768 1460192 1510296 1563700 1620691 1679232 1736202 1788523 1833154 1867605
62059A867605K3685J4137N522l665j3499k2419k9513l5533m1559m8018n5037o2239
$$ 1867605 1891290 1905427 1910949 1907284 1893785 1871366 1841853 1806320 1764761 1716743 1661706 1599467
62047A599467o7941o9979o8010o3917n9646n5621n1518m7258m2625l7178l1310
$$ 1599467 1531526 1461547 1393537 1329620 1269974 1214353 1162835 1115577 1072952 1035774 1004464
62036A004464k6475k3501k1390j8585j4915j1581r619q938q685q247p923q542
$$ 1004464 977989 954488 933098 914513 899598 888017 878398 869460 860775 852528 844605 836063
62024H36063j0063j1040j0226q351p144o900o450n494n255o270p258p099o536
$$ 836063 826000 814960 804734 796383 789239 782339 775889 770395 765140 758870 751612 744513 737977
62011G37977o770p497p547o561m977l140j453o70r72j473j581k047l409m343l132
$$ 737977 731207 723710 716163 709602 704625 701485 700032 699362 698390 696917 695336 693289 689880 685537 682405
61996F82405k52J963K086N78j664m226o564p918q221q110p926p662p882r326j1380
$$ 682405 682153 684116 686202 686780 685116 680890 674326 666408 658187 650077 642151 634489 626607 617281 605901
61981F05901j2180j0856q570o874n965n189m297l430k626k084k226k822k765j549
$$ 605901 593721 582865 574295 567421 561456 556267 551970 548540 545914 543830 541604 538782 536017 534468
61967E34468l31m27j338j444m24L98J71l42j90L83P11R40J552K287K510K384K737
$$ 534468 534137 533710 532372 530928 530504 530902 531073 530731 530541 530924 531635 532575 534127 536414 538924 541308 544045
61950E44045L909N509P181Q876J0370J1395J2232J3333J4379J4673J4584J5301
$$ 544045 547954 553463 560644 569520 579890 591285 603517 616850 631229 645902 660486 675787
61938F75787J6825J7557J6715J5845J6673J8451J8884J7157J4569J2553J1575
$$ 675787 692612 710169 726884 742729 759402 777853 796737 813894 828463 841016 852591
61927H52591J1681J2671J3493J2910J1085R443Q822Q811Q971R451J0286J1406
$$ 852591 864272 876943 890436 903346 914431 923874 932696 941507 950478 959929 970215 981621
61915I81621J3526J7508K2488K6262K8201L0142L3541L7343L9946M1659M3530
$$ 981621 995147 1012655 1035143 1061405 1089606 1119748 1153289 1190632 1230578 1272237 1315767
61904A315767M4979M4741M3453M3187M4370M5086M3841M1479L9785L9425L9962
$$ 1315767 1360746 1405487 1448940 1492127 1536497 1581583 1625424 1666903 1706688 1746113 1786075
61893A786075M1015M2434M3713M3902M2207L8528L3370K7314K0552J3018M840
$$ 1786075 1827090 1869524 1913237 1957139 1999346 2037874 2071244 2098558 2119110 2132128 2136968
61882B136968l782j3080k3313l3581m1890m7007m9665n1297n2341n2655n2750
$$ 2136968 2133186 2120106 2096793 2063212 2021322 1974315 1924650 1873353 1821012 1768357 1715607
61871A715607n3316n3849n3115n0995m8601m6515m4139m1087l7995l5291l2281
$$ 1715607 1662291 1608442 1555327 1504332 1455731 1409216 1365077 1323990 1285995 1250704 1218423
61860A218423k8277k3946k0489j7922j5109j1403p385l869r07J823M127N401N443
$$ 1218423 1190146 1166200 1145711 1127789 1112680 1101277 1093892 1090023 1089116 1090939 1095066 1100467 1105910
61847A105910M722L897L504L963N203N948M283l39o045j0296j2349j3208j3484
$$ 1105910 1110632 1114529 1118033 1121996 1127199 1133147 1137430 1137091 1131046 1120750 1108401 1095193 1081709
61834A081709j2593j0156o926l816r51J811M339O753R581J2696J4821J4880J3251
$$ 1081709 1069116 1058960 1052034 1048218 1047267 1049078 1053417 1060170 1069751 1082447 1097268 1112148 1125399
61821A125399J1079R036P331O084M974L160M14k375m678p330j1104j5130j7967
$$ 1125399 1136478 1145514 1152845 1158929 1163903 1167063 1167477 1165102 1160424 1153094 1141990 1126860 1108893
61808A108893j9496k0295j9861j7246j3240r988q186o274k910J066L847M817M964
$$ 1108893 1089397 1069102 1049241 1031995 1018755 1008767 1000581 994307 991397 992463 996310 1001127 1006091
61795A006091N886Q755J3345J7723J9700J9184J8406J9518K2574K6227K9470L2088
$$ 1006091 1011977 1020732 1034077 1051800 1071500 1090684 1109090 1128608 1151182 1177409 1206879 1238967
61783A238967L4078L5550L7031L9261M2551M6599N0784N4586N7846O0757O3626
$$ 1238967 1273045 1308595 1345626 1384887 1427438 1474037 1524821 1579407 1637253 1698010 1761636
61772A761636O6700P0219P4268P8429Q1996Q4880Q7677R0462R2192R2116R1035
$$ 1761636 1828336 1898555 1972823 2051252 2133248 2218128 2305805 2396267 2488459 2580575 2671610
61761B671610R0044Q8633Q5332P9899P3259O5334N4684M0890K5770J1409j973
$$ 2671610 2761654 2850287 2935619 3015518 3088777 3154111 3208795 3249685 3275455 3286864 3284891
61750C284891j5314k8815m1734n3382o3452p1735p8325q3751q8362r1836r3753
$$ 3284891 3269577 3240762 3199028 3145646 3082194 3010459 2932134 2848383 2760021 2668185 2574432
61739B574432r4272r3805r2427r0086q7049q3670p9976p5927p1831o8053o4553
$$ 2574432 2480160 2386355 2293928 2203842 2116793 2033123 1953147 1877220 1805389 1737336 1672783
61728A672783o0945n6904n2336m7580m3609m1405m0696l9840l7545l4343l1719
$$ 1672783 1611838 1554934 1502598 1455018 1411409 1370004 1329308 1289468 1251923 1217580 1185861
61717A185861l0044k8208k5359k2223k0248j9802j9790j9043j7633j6558j6378
$$ 1185861 1155817 1127609 1102250 1080027 1059779 1039977 1020187 1001144 983511 966953 950575
61706I50575j6625j6609j6254j5921j5731j5526j5182j4570j3459j1928j0574
$$ 950575 933950 917341 901087 885166 869435 853909 838727 824157 810698 798770 788196
61695G88196r940r908j0149j0795j1968j2928j2522j0638q416o955o347o138o058
$$ 788196 778256 768348 758199 747404 735436 722508 709986 699348 690932 683977 677630 671492 665434
61682F65434o082o190o365o505o397o016n679n409m589k992j837k670n128o919
$$ 665434 659352 653162 646797 640292 633895 627879 622200 616791 612202 609210 607373 604703 599575 592656
61668E92656o379m112j636O11L094N613O985O291L935J261o96k085l845o398q867
$$ 592656 586277 582165 580529 581140 584234 589847 596832 603123 607058 608319 607623 605538 601693 595295 586428
61653E86428r809q629o073l499j849j020L1K140M648N868N383N002O533R259J0734
$$ 586428 576619 567990 561917 558418 556569 555549 555580 557720 562368 568236 573619 578621 585154 594413 605147
61638F05147R614O610L037j85k451l892n812r216j2882j4403j3328j1608j0768
$$ 605147 614761 621371 624408 624223 621772 617880 612068 602852 589970 575567 562239 550631 539863
61625E39863j0222q999p337n730l857j569K93J073J376J964K461K110J067O4o19
$$ 539863 529641 520642 513305 507575 503718 502149 502442 503515 504891 506855 509316 511426 512493 512557 511938
61610E11938j181j863k978m655o245o810o549o625p223p132n774m233l498l125
$$ 511938 510757 508894 505916 501261 495016 488206 481657 475032 467809 460677 454903 450670 447172 444047
61596D44047k568k362k781k679j065J167K531K953L157L119K528J941J951K054
$$ 444047 441479 439117 436336 433657 432592 433759 436290 439243 442400 445519 448047 449988 451939 453993
61582D53993J729J742K858M178M475M311M993O170O611O725Q015J0218J1425J1211
$$ 453993 455722 457464 460322 464500 468975 473286 478279 484449 491060 497785 505800 516018 527443 538654
61568E38654J1332J2759J4217J4449J4068J4077J4251J4126J4306J5420J6659
$$ 538654 549986 562745 576962 591411 605479 619556 633807 647933 662239 677659 694318
61557F94318J6645J5270J3644J2586J1904J0914R114O552L865J768K54j322l273
$$ 694318 710963 726233 739877 752463 764367 775281 784395 790947 794812 796580 796834 795512 792239
61544G92239n076o061o149n694m926l815k318p23K98J11j159k648l646m081l984
$$ 792239 787163 781102 774953 769259 764333 760518 758200 757477 757775 757886 756727 754079 750433 746352 742368
61529G42368l231k249k036k688k789j293Q35K103K872M628P373R575J0553J1122
$$ 742368 739137 736888 734852 732164 729375 728082 728917 731020 733892 738520 745893 755468 766021 777143
61515G77143J1769J2031J2144J3424J6284J9321K1252K2461K3804K5224K6544
$$ 777143 788912 800943 813087 826511 842795 862116 883368 905829 929633 954857 981401
61504I81401K8422L1331L4528L7213L9833M3002M5866M7008M6641M6511M7541
$$ 981401 1009823 1041154 1075682 1112895 1152728 1195730 1241596 1288604 1335245 1381756 1429297
61493A429297M8862M9293M8642M7015M3933L9033L3186K7877K3317J7953J0515
$$ 1429297 1478159 1527452 1576094 1623109 1667042 1706075 1739261 1767138 1790455 1808408 1818923
61482A818923K068m762q635j0698j2633j4379j4647j3017j0472q052o058m618
$$ 1818923 1820991 1816229 1807594 1796896 1784263 1769884 1755237 1742220 1731748 1723696 1717638 1713020
61470A713020l997l972l748k929k078k013k959m630o710q986j1269j3358j4970
$$ 1713020 1709023 1705051 1701303 1698374 1696296 1694283 1691324 1686694 1679984 1670998 1659729 1646371 1631401
61457A631401j5855j6217j6642j7189j6928j4954j1556p642l433J489P096J2749
$$ 1631401 1615546 1599329 1582687 1565498 1548570 1533616 1522060 1514418 1510985 1512474 1519570 1532319
61445A532319J7954K2441K5781K7870K9313L0152K8589K2525J2398J101q944j7147
$$ 1532319 1550273 1572714 1598495 1626365 1655678 1685830 1714419 1736944 1749342 1750443 1741499 1724352
61433A724352k3227k6346k6443k4782k2225j8266j2604o302m52N111J0740J5847
$$ 1724352 1701125 1674779 1648336 1623554 1601329 1583063 1570459 1564157 1563705 1568816 1579556 1595403
61421A595403J9933K3544K6835K8019K4691J6327M518q641k1388l2236m0294m5432
$$ 1595403 1615336 1638880 1665715 1693734 1718425 1734752 1739270 1730629 1709241 1677005 1636711 1591279
61409A591279m7464m5880m1195l5596l1114k7869k5133k3000k1532j9339j5190
$$ 1591279 1543815 1497935 1456740 1421144 1390030 1362161 1337028 1314028 1292496 1273157 1257967
61398A257967j0572q387q920r229p147l946k041j599q27J407M564P616J0115J2175
$$ 1257967 1247395 1239008 1230088 1220859 1213712 1209766 1207725 1206126 1205299 1206706 1211270 1218886 1229001 1241176
61384A241176J4149J6331J8621K0610K2207K3828K5690K7405K8666K9775L0992
$$ 1241176 1255325 1271656 1290277 1310887 1333094 1356922 1382612 1410017 1438683 1468458 1499450
61373A499450L1785L1540L0669L0117K9696K7922K3940J8833J4334J0764P096
$$ 1499450 1531235 1562775 1593444 1623561 1653257 1681179 1705119 1723952 1738286 1749050 1756146
61362A756146K805j391m716p318r673j1936j4390j7753k2179k6565k9698l1642
$$ 1756146 1758951 1757560 1752844 1745526 1735853 1723917 1709527 1691774 1669595 1643030 1613332 1581690
61350A581690l3101l3995l3848l3145l2874l2770l1524k8924k6380k4847k3653
$$ 1581690 1548589 1514594 1480746 1447601 1414727 1381957 1350433 1321509 1295129 1270282 1246629
61339A246629k1940k0001j8314j6521j4296j2223j0779r418p718o516o589p026
$$ 1246629 1224689 1204688 1186374 1169853 1155557 1143334 1132555 1123137 1115419 1108903 1102314 1095288
61327A095288o313m470k693j337K48K045L173L474L866M875N996O920Q119R654
$$ 1095288 1088975 1084505 1081812 1080475 1080723 1082768 1085941 1089415 1093281 1098156 1104152 1111072 1119191 1128845
61313A128845J0578J0298R750J0210J1486J2144J1267R205O745M341K416J718
$$ 1128845 1139423 1149721 1159471 1169681 1181167 1193311 1204578 1213783 1220528 1224869 1227285 1229003
61301A229003K746M863O483O424M950L341K483K112J389j54k276m407o190p670
$$ 1229003 1231749 1236612 1243095 1249519 1254469 1257810 1260293 1262405 1263794 1263640 1261364 1256957 1250767 1243097
61287A243097q928r557q933p210n618n158n407n257m460l450k108k1K108K944
$$ 1243097 1234169 1224612 1215679 1208469 1202851 1197693 1192286 1187029 1182569 1179119 1177011 1176990 1179098 1182042
61273A182042K616K782M014M795M095L266L918N227N112L345J789J856L259N044
$$ 1182042 1184658 1187440 1191454 1196249 1200344 1203610 1207528 1212755 1217867 1221212 1223001 1224857 1228116 1233160
61259A233160O651Q021R710J2548J6370J9708K1839K4393K9361L6120M2132M6377
$$ 1233160 1239811 1247832 1257542 1270090 1286460 1306168 1328007 1352400 1381761 1417881 1460013 1506390
61247A506390N0153N4493N8520O0644N9639N4125M2822K6321P635r770k3743l3349
$$ 1506390 1556543 1611036 1669556 1730200 1789839 1843964 1886786 1913107 1920742 1910972 1887229 1853880
61235A853880l8468m0142m0003l8653l5496l0549k5107k0006j4576q139j370M769
$$ 1853880 1815412 1775270 1735267 1696614 1661118 1630569 1605462 1585456 1570880 1562741 1561371 1566140
61223A566140J0254J4914J7173J5279R191O6j1435k4791l7970m7888n2863n3628
$$ 1566140 1576394 1591308 1608481 1623760 1632951 1633017 1621582 1596791 1558821 1510933 1458070 1404442
61211A404442n1620m7429m1394l4701k8892k4427k0399j5822j0805o314k985n94
$$ 1404442 1352822 1305393 1263999 1229298 1200406 1175979 1155580 1139758 1128953 1122639 1119654 1119060
61199A119060J187K081J656L19q43j218j082p95k68M72P99J27j249k504l344m314
$$ 1119060 1120247 1122328 1123984 1124303 1123460 1122242 1121160 1120365 1120097 1120569 1121368 1121495 1120246 1117742 1114398 1110084
61183A110084n934p721q395p311n609n338p115r302j0087r687r494r687r238q158
$$ 1110084 1104150 1096429 1088034 1080723 1075114 1069776 1062661 1053359 1043272 1033585 1024091 1014404 1005166 997008
61169I97008p863q761r156p688n606n197o702q196q240p265o372n821n108l889
$$ 997008 989145 980384 971228 963540 957934 952737 946035 937839 929599 922334 915962 910141 905033 901144
61155I01144k581k233l680o551r392j1178j2319j3672j5051j5602j5354j5437
$$ 901144 898563 896330 892650 886099 876707 865529 853210 839538 824487 808885 793531 778094
61143G78094j6521j7861j8231j7265j5579j3979j2919j2382j1873j0742q829o823
$$ 778094 761573 743712 725481 708216 692637 678658 665739 653357 641484 630742 621913 615090
61131F15090n648n415n153l918k109j336k570m686n436l906j436L04J459L444
$$ 615090 609442 604027 598874 594956 592847 591511 588941 584255 578819 574913 573477 573781 575240 578684
61117E78684O592R403J0352R772R236R602J0419J1010J1271J1137J0170Q250O196
$$ 578684 585276 594679 605031 614803 624039 633641 644060 655070 666341 677478 687648 695898 702094
61104G02094M927M342L675K692J721P98k27q70n03K47n0j403k094j278l84q65
$$ 702094 707021 711363 715038 717730 719451 720249 720022 719152 718649 718896 718846 717443 715349 714071 713687 712822
61088G12822j921j906q40J41R40K248L667L984L140K264J867J514J184J303J553
$$ 712822 710901 708995 708155 708296 709236 711484 715151 719135 722275 724539 726406 727920 729104 730407 731960
61073G31960J278J005J842L388L984L102J825R33M38Q60K740M816N113M195M684
$$ 731960 733238 734243 736085 739473 743457 746559 748384 749317 749755 750615 753355 758171 763284 767479 772163
61058G72163P000Q537Q025P613R034J0773J1115J1323J3174J5815J7879K0643
$$ 772163 779163 787700 795725 803338 812372 823145 834260 845583 858757 874572 892451 913094
61046I13094K5861L1977L5783L6839L7231L7711L7203L5858L5779L8637M4577
$$ 913094 938955 970932 1006715 1043554 1080785 1118496 1155699 1191557 1227336 1265973 1310550
61035A310550N3116O3164P2872Q1496R0467J00819J11426J22564J39180J66778
$$ 1310550 1363666 1426830 1499702 1581198 1671665 1772484 1883910 2006474 2145654 2312432
61025B312432K05677K53218L09537L75902M49736N29094O21621P40778Q94028
$$ 2312432 2518109 2771327 3080864 3456766 3906502 4435596 5057217 5797995 6692023
61016F692023J086921J338076J662434K011927K241888K178159J751537J070254
$$ 6692023 7778944 9117020 10779454 12791381 15033269 17211428 18962965 20033219
61008B0033219L53244k05229n08894n37000l09794R0515M88996O66198M81839
$$ 20033219 20386463 20181234 19672340 19135340 18825546 18916061 19405057 20071255 20553094
60999B0553094l3893p07281j333715j774757j984055j984809j839320j621279
$$ 20553094 20519201 19811920 18478205 16703448 14719393 12734584 10895264 9273985
60991I273985j389043j171451r75593q03259o56717n34794m32957l48671k82153
$$ 9273985 7884942 6713491 5737898 4934639 4277922 3743128 3310171 2961500 2679347
60982B679347k31630j92344j61021j37478j20869j07788r5507q4267p5092o7645
$$ 2679347 2447717 2255373 2094352 1956874 1836005 1728217 1632710 1548443 1473351 1405706
60972A405706o1403n6507n2070m5918l7637l0079k6171k5682k6502k7569k8720
$$ 1405706 1344303 1287796 1235726 1189808 1152171 1122092 1095921 1070239 1043737 1016168 987448
60961I87448k9082k7696k5191k3080k1663k0053j7919j5859j4207j2726j1498
$$ 987448 958366 930670 905479 882399 860736 840683 822764 806905 792698 779972 768474
60950G68474j0970j0964j0540r003o574m142k862l630n979p757p036m591l408
$$ 768474 757504 746540 736000 726997 720423 716281 713419 709789 703810 696053 689017 684426 681018
60937F81018n241q589j0726j0960j0809j1450j2266j2083j0710q688o284l640
$$ 681018 675777 667188 656462 645502 634693 623243 610977 598894 588184 579496 573212 569572
60925E69572j407k24L68J517L300M256L210R06r16j590j882k432k731j944j29
$$ 569572 568165 567941 568309 569826 573126 577382 580592 581498 580582 578992 577110 574678 571947 570003 569874
60910E69874J730K778K948K597J778K35j850l567m129l823l519l433l120k614
$$ 569874 571604 574382 577330 579927 581705 581940 580090 576523 572394 568571 565052 561619 558499 555885
60896E55885k565l000k897j721n14o72k224m079n410n916n376l923k500k024k270
$$ 555885 553320 550320 547423 545702 545188 544516 542292 538213 532803 526887 521511 517588 515088 513064 510794
60881E10794k388k210k142k155j875j392q76K62K490M635M805K988J191O75P17
$$ 510794 508406 506196 504054 501899 500024 498632 497756 498018 500508 505143 509948 512936 514127 514802 515519
60866E15519P26J775M619P493P712M986J650k10o53q54j450k290k985l170k607
$$ 515519 516245 518020 522639 530132 537844 542830 544480 544270 543617 542763 541313 539023 536038 532868 530261
60851E30261j496n27k71n78p26k27O86J409J623J327M31j078k456k572j512j076
$$ 530261 528765 528238 527967 527389 526663 526436 527122 528531 530154 531481 531912 530834 528378 525806 524294 523218
60835E23218k652n246o747o831p060q168q944q383p282o784o572n695m281l082
$$ 523218 520566 515320 508573 501742 494682 486514 477570 469187 461905 455121 448549 442854 438573 435491
60821D35491k003m79J108J680J105L11k75j230k772l894l552k133r96q50j126
$$ 435491 433488 433009 434117 435797 436902 437213 436938 435708 432936 429042 425490 423357 422361 421511 420385
60806D20385j012n76n71j289k034j930r00M40J667K827L899M418L815J988k60
$$ 420385 419373 418797 418226 416937 414903 412973 412073 412513 414180 417007 420906 425324 429139 431127 430867
60791D30867j306J42L298N459M968L450L635N394N927M031J799J166J081j95j859
$$ 430867 429561 429703 433001 438460 443428 446878 450513 455907 461834 465865 467664 468830 469911 469716 467857
60776D67857j887m09N95M26J87L54L6r82j466o78M23P10M30N17J214K057K595
$$ 467857 465970 465561 466156 466582 466769 467123 467159 466177 464711 464033 464456 465166 465596 466113 467327 469384 471979
60759D71979K711K621K641K553J486p44k586k310m20Q08K59r83j662j819j822
$$ 471979 474690 477311 479952 482505 483991 483247 480661 478351 477931 478739 478998 478015 476353 474534 472712
60744D72712j519j111j386k267k465j552j137k660n202o756o786o162n343m188
$$ 472712 471193 470082 468696 466429 463964 462412 461275 458615 453413 446657 439871 433709 428366 424178
60730D24178l035k453k133j345l73j15l95q9R68J650J406J134J482J462k84l488
$$ 424178 421143 418690 416557 415212 414839 414724 414329 414240 415208 416858 418264 419398 420880 422342 422058 418570
60714D18570o485q082q392p882o507m170j682m93j290l110m312m249l446k310
$$ 418570 412085 404003 395611 387729 381222 377052 375370 374877 373587 370477 366165 361916 358470 356160
60700C56160o95R38J123p24k829k880j069J97l60j283p78P74J612J036j83j170
$$ 356160 355465 356403 357526 356802 353973 351093 350024 350221 349861 348578 347800 348574 350186 351222 351039 349869
60684C49869j518p51J404M005N256M407K673J757K036K690L099L341L565L628
$$ 349869 348351 347600 349004 353009 358265 362672 365345 367102 369138 371828 374927 378268 381833 385461
60670C85461L484L304L035K366J376P31Q59J266J187O85N83J331K442L207L579
$$ 385461 388945 392249 395284 397650 399026 399757 400616 401882 403069 403754 404337 405668 408110 411317 414896
60655D14896M073M932N675N611M829M325M796N453M858L074J936K558L531K782
$$ 414896 418969 423901 429576 435187 440016 444341 449137 454590 459448 462522 464458 467016 470547 473329
60641D73329N53j121j628k552m786o728o515m699l357l357l911m258m404m355
$$ 473329 473882 472761 471133 468581 463795 457067 450552 445853 442496 439139 435228 430970 426566 422211
60627D22211l855k984k091j157l9P46M44p41j755k031j796j083L96K052K347P44
$$ 422211 418356 415372 413281 412124 412085 412831 413275 412534 410779 408748 406952 405869 406265 408317 410664 411408
60611D11408j083j061O74J957J341k58j034o81n67j634k993l072j648L2R52J155
$$ 411408 410325 409264 409938 411895 413236 412978 411944 411263 410696 409062 406069 402997 401349 401381 402333 403488
60595D03488P87n03k499l881l798l262l732m850n026l956k983k770k287o81J231
$$ 403488 404275 403772 401273 397392 393594 390332 386600 381750 376724 372768 369785 367015 364728 364047 365278
60580C65278K161K105J953K169K612L100L450L474L421L776M300M097L197K915
$$ 365278 367439 369544 371497 373666 376278 379378 382828 386302 389723 393499 397799 401896 405093 408008
60566D08008L784M325L135J295J008K519M139N099O374Q477J0354J1214J1943
$$ 408008 411792 416117 419252 420547 421555 424074 428213 433312 439686 448163 458517 469731 481674
60553D81674J3676J6114J8401K0780K4223K8899L4037L9027M3781M8167N1650
$$ 481674 495350 511464 529865 550645 574868 603767 637804 676831 720612 768779 820429
60542H20429N3302N1818M6032L6063K3459R697m768j9213l1398l9134m2637m3840
$$ 820429 873731 925549 971581 1007644 1031103 1040800 1036032 1016819 985421 946287 903650 859810
60530H59810m3510m0851l6051l1212k7780k4724k0557j5769j1824q750n551k287
$$ 859810 816300 775449 739398 708186 680406 655682 635125 619356 607532 598782 593231 590944
60518E90944J10J877M366P800J0856J2893J5113J8787K3689K9005L4554M0231
$$ 590944 591054 592931 597297 605097 615953 628846 643959 662746 686435 715440 749994 790225
60506G90225M5225M8762N0652N0287M6164L7639K6379J4890M413m443r985j0412
$$ 790225 835450 884212 934864 985151 1031315 1068954 1095333 1110223 1114636 1110193 1100208 1089796
60494A089796o320l43O020J3523K2856L2788M1474M8058N1937N1621M5765L4741
$$ 1089796 1083476 1083133 1089153 1102676 1125532 1158320 1199794 1247852 1299789 1351410 1397175 1431916
60482A431916K0050K532j7470l8294n6591o9474p6504p9070p8287p4310o7704
$$ 1431916 1451966 1454498 1437028 1398734 1342143 1272669 1196165 1117095 1038808 964498 896794
60471H96794o0468n4689n0231m4924l7557k9742k3939k0455j7709j4958j3025
$$ 896794 836326 781637 731406 686482 648925 619183 595244 574789 557080 542122 529097
60460E29097j2263j1508r830p877o623n826m784l640k977k766k823l588n293o917
$$ 529097 516834 505326 495496 487619 480996 475170 470386 466746 463769 461003 458180 454592 449299 442382
60446D42382p163o144m955l891k461q64K6L52J362L247M234K898M48m29J252L770
$$ 442382 435219 429075 424120 420229 417768 416904 416930 417282 418644 421891 426125 429023 429471 429042 430294 434064
60430D34064M790L692J771N99O10J021P60n34k268l384l040j182J320L184L663
$$ 434064 438854 442546 444317 444916 445526 446547 447307 446773 444505 441121 438081 436899 438219 441403 445066
60415D45066L062K263J885J966K186K194K032K370L953O393Q108Q072P243P369
$$ 445066 448128 450391 452276 454242 456428 458622 460654 463024 466977 473370 481478 489550 496793 504162
60401E04162Q644R574R287Q752R240J0533J1511J1722J1450J0672R104P246O339
$$ 504162 512806 522380 531667 540419 549659 560192 571703 583425 594875 605547 614651 621897 628236
60388F28236O806P570P516O980P099Q003Q575Q022O782N581M438L245K654L356
$$ 628236 635042 642612 650128 657108 664207 672210 680785 688807 695589 701170 705608 708853 711507 714863
60374G14863M700N105L980K335J313R23O51M07L14K56K71P65J686K121J560R34
$$ 714863 719563 724668 728648 730983 732296 733219 733870 734277 734591 734847 735118 735883 737569 739690 741250 742184
60358G42184J418K606L040K333J573J507J502O39j077l071n008o791q339r817
$$ 742184 743602 746208 749248 751581 753154 754661 756163 756802 755725 752654 747646 740855 732516 722699
60344G22699j1574j3518j4865j4880j3538j1329q840o698n417m967m861m829n094
$$ 722699 711125 697607 682742 667862 654324 642995 634155 627457 622040 617073 612212 607383 602289
60331F02289n883p053q323r321r403q074n927m418m318m880m916m113k851j361
$$ 602289 596406 589353 581030 571709 562306 554232 548305 543887 539569 534689 529773 525660 522809 521448
60317E21448J99J348J793K137L327N441P658R497J1419J3957J6681J8407J8251
$$ 521448 521647 522995 524788 526925 530252 535693 543351 552848 564267 578224 594905 613312 631563
60304F31563J6176J2596P815K105l809q815j2213j4250j5614j6590j6923j6325
$$ 631563 647739 660335 668150 670255 666446 657631 645418 631168 615554 598964 582041 565716
60292E65716j4765j2554j0374q884p859o239l694j661j768l566m942m650l254
$$ 565716 550951 538397 528023 519139 511280 505041 501347 499686 497918 494352 489410 484760 481506
60279D81506j675l28J48r71k847l201j099J655K990L189L636M273M099L505L979
$$ 481506 479831 479503 479651 478680 475833 472632 471533 473188 476178 479367 483003 487276 491375 494880 498859
60264D98859N667O962O826O033N703N810N657M925L787K642J987K056K386K251
$$ 498859 504526 511488 518314 524347 530050 535860 541517 546442 550229 552871 554858 556914 559300 561551
60250E61551J485M65m87j065p84L88J578K090K575L997N851O769O723P074Q384
$$ 561551 563036 563501 563014 561949 561165 561553 563131 565221 567796 571793 577644 584413 591136 598210 606594
60235F06594R760J0693J1910J3765J5286J5691J5695J6405J7922J9771K1805K3901
$$ 606594 616354 627047 638957 652722 668008 683699 699394 715799 733721 753492 775297 799198
60223G99198K5722K7471K9948L3124L5773L7389L9171M1977M4507M4978M3716
$$ 799198 824920 852391 882339 915463 951236 988625 1027796 1069773 1114280 1159258 1202974
60212A202974M2390M1349L9505L6472L3107K9910K6505K2841J9442J6276J2738
$$ 1202974 1245364 1286713 1326218 1362690 1395797 1425707 1452212 1475053 1494495 1510771 1523509
60201A523509R047O323M792L211P75j450j749L11L734P099R144R217Q111P993
$$ 1523509 1532556 1538879 1543671 1546882 1547657 1546207 1544458 1544769 1548503 1555602 1564746 1573963 1582074 1590067
60187A590067J0568J5386K0472K4463K7606L0803L4303L7512L9805M1279M2552
$$ 1590067 1600635 1616021 1636493 1660956 1688562 1719365 1753668 1791180 1830985 1872264 1914816
60176A914816M3764M3981M2045L7983L3043K8167K2933J6354Q395J99p140j3673
$$ 1914816 1958580 2002561 2044606 2082589 2115632 2143799 2166732 2183086 2191481 2191680 2184540 2170867
60164B170867k0291k7343l3758l7852l9081l8662l8135l7726l6583l4121l0368
$$ 2170867 2150576 2123233 2089475 2051623 2012542 1973880 1935745 1898019 1861436 1827315 1796947
60153A796947k5356j9232j3114q607o019l859p34K944N728P114P930Q970R853
$$ 1796947 1771591 1752359 1739245 1730638 1724619 1720760 1720026 1722970 1728698 1735812 1743742 1752712 1762565
60140A762565R281O296J388l563o827q366r446j0831j2288j3962j6817k0670k3068
$$ 1762565 1771846 1778142 1779530 1775967 1769140 1760774 1751328 1740497 1728209 1714247 1697430 1676760 1653692
60127A653692k1725j7681j4219j2561j0397n325J835Q453J3712J9032K5273L1397
$$ 1653692 1631967 1614286 1600067 1587506 1577109 1571784 1573619 1582072 1595784 1614816 1640089 1671486
60115A671486L6531M1754M8479N5906O1722O5197O8023P1715P5649P8624Q0863
$$ 1671486 1708017 1749771 1798250 1854156 1915878 1981075 2049098 2120813 2196462 2275086 2355949
60104B355949Q2908Q3429Q0121P2763O3555N4120M4002L2665K1132J0328o80j3167
$$ 2355949 2438857 2522286 2602407 2675170 2738725 2792845 2836847 2869512 2890644 2900972 2900292 2887125
60092B887125k6412l8482m8725n7791o5555p0803p3061p3335p2683p1317o9260
$$ 2887125 2860713 2822231 2773506 2715715 2650160 2579357 2506296 2432961 2360278 2288961 2219701
60081B219701o6795o3768n9553n4108m8198m2330l6373l0573k5819k2427j9528
$$ 2219701 2152906 2089138 2029585 1975477 1927279 1884949 1848576 1818003 1792184 1769757 1750229
60070A750229j6275j2776r361n845k258O24K319L468M792N868N916N187M537L987
$$ 1750229 1733954 1721178 1711817 1705972 1703714 1704338 1706657 1710125 1714917 1720785 1726701 1731888 1736425 1740412
60056A740412K780O58j987n062q866j3130j6883j9600k1844k4457k7456k9938
$$ 1740412 1743192 1743850 1741863 1736801 1727935 1714805 1697922 1678322 1656478 1632021 1604565 1574627
60044A574627l0959l0497k9594k9187k8785k7004k3702k0580j8808j7134j3606
$$ 1574627 1543668 1513171 1483577 1454390 1425605 1398601 1374899 1354319 1335511 1318377 1304771
60033A304771q348l094J506O207J1080J5311J9306K4753L1736L7853M1341M3291
$$ 1304771 1296423 1293329 1294835 1301042 1312122 1327433 1346739 1371492 1403228 1441081 1482422 1525713
60021A525713M5314M6812M6304M3994M0922L6797L0992K4684J9368J3798N358
$$ 1525713 1571027 1617839 1664143 1708137 1749059 1785856 1816848 1841532 1860900 1874698 1880056
60010A880056n476j5034k1454k6757l2819l8172m0826m1792m3104m4029m2192
$$ 1880056 1874580 1859546 1838092 1811335 1778516 1740344 1699518 1657726 1614622 1570593 1528401
59999A528401l7628l2860k9105k5071j9770j4175r240m231J815Q350J4124J8927
$$ 1528401 1490773 1457913 1428808 1403737 1383967 1369792 1360552 1356321 1358136 1366486 1380610 1399537
59987A399537K3684K9384L6410M4218N1350N6470N9793O2657O5358O6320O3981
$$ 1399537 1423221 1452605 1489015 1533233 1584583 1641053 1700846 1763503 1828861 1895181 1959162
59976A959162N8705N2182M5504L8416L0097K0318J0168J484n057j1108j8826k8004
$$ 1959162 2017867 2070049 2115553 2153969 2184066 2204384 2214552 2216036 2210979 2199871 2181045 2153041
59964B153041l6323m2419m6810m9496m9015m5226m0793l7884l5010k9512k1982
$$ 2153041 2116718 2074299 2027489 1977993 1928978 1883752 1842959 1805075 1770065 1740553 1718571
59953A718571j5489j0962o180M90P938J4555K0384K6006L1049L5057L8494M1799
$$ 1718571 1703082 1692120 1685940 1686430 1694368 1708923 1729307 1755313 1786362 1821419 1859913 1901712
59941A901712M4312M5173M4570M3357M2035M0598L8697L5650L1171K6350K2802
$$ 1901712 1946024 1991197 2035767 2079124 2121159 2161757 2200454 2236104 2267275 2293625 2316427
59930B316427K0473J7585J3451R886Q772R501J0211J0654J2135J5168J8856K2584
$$ 2316427 2336900 2354485 2367936 2377822 2386594 2396095 2406306 2416960 2429095 2444263 2463119 2485703
59918B485703K6779L1646L6351M0001M2663M4846M6387M6409M4309M0570L6339
$$ 2485703 2512482 2544128 2580479 2620480 2663143 2707989 2754376 2800785 2845094 2885664 2922003
59907B922003L2180K7315K0433J1222P24r752j9417k7688l3970l8234m1188m3308
$$ 2922003 2954183 2981498 3001931 3013153 3013877 3004125 2984708 2957020 2923050 2884816 2843628 2800320
59895B800320m4326m4069m3119m1998m0323l7528l3912l0195k6456k2334j7881
$$ 2800320 2755994 2711925 2668806 2626808 2586485 2548957 2515045 2484850 2458394 2436060 2418179
59884B418179j3398q690l413J990O514R836J2684J5815J9041K1305K1599K0054
$$ 2418179 2404781 2396091 2392678 2394668 2401182 2411018 2423702 2439517 2458558 2479863 2501462 2521516
59872B521516J8286J8032J9172J9819J8820J7232J6424J5815J3859J0663P866
$$ 2521516 2539802 2557834 2577006 2596825 2615645 2632877 2649301 2665116 2678975 2689638 2697504
59861B697504O010L670l22n149r099j1454j2665j3382j4003j4938j6873k0656
$$ 2697504 2703514 2707184 2706862 2701713 2692614 2681160 2668495 2655113 2641110 2626172 2609299 2588643
59849B588643k6645l3811l9935m3353m4209m3411m1001l6667l1426k7159k4375
$$ 2588643 2561998 2528187 2488252 2444899 2400690 2357279 2316278 2279611 2248185 2221026 2196651
59838B196651k1868j8889j6305j4957j4182j2795j0614q236o065m300l055j783
$$ 2196651 2174783 2155894 2139589 2124632 2110450 2097655 2087041 2078805 2072740 2068440 2065385 2063602
59826B063602P47N011R897J4011J7339K0806K4747K8654L2068L4842L6765L7663
$$ 2063602 2064349 2069360 2079257 2093268 2110607 2131413 2156160 2184814 2216882 2251724 2288489 2326152
59814B326152L7649L6667L4091K9474K3469J7324J1672O517K096j176l570n956
$$ 2326152 2363801 2400468 2434559 2464033 2487502 2504826 2516498 2523015 2525111 2523935 2520365 2514409
59802B514409q713j1332j3223j4270j4618j4621j5193j7354k0971k4499k6542
$$ 2514409 2505696 2494364 2481141 2466871 2452253 2437632 2422439 2405085 2384114 2359615 2333073
59791B333073k7241k7649k8164k8309k7889k7612k8283k9840l1398l1951l0901
$$ 2333073 2305832 2278183 2250019 2221710 2193821 2166209 2137926 2108086 2076688 2044737 2013836
59780B013836k8274k4717k1130j7912j4707j1046p015k918J434O441J1672J5839
$$ 2013836 1985562 1960845 1939715 1921803 1907096 1896050 1889035 1886117 1887551 1893992 1905664 1921503
59768A921503J8249J9859K2358K6510L1790L7374M2975M8784N5145O2391P0652
$$ 1921503 1939752 1959611 1981969 2008479 2040269 2077643 2120618 2169402 2224547 2286938 2357590
59757B357590P9654Q8751R6999J02863J03988R7766Q2613N9038K9766j091k9447
$$ 2357590 2437244 2525995 2622994 2725857 2829845 2927611 3010224 3069262 3099028 3097937 3068490
59746C068490n2512o9185p9558q4382q4792q1882p6276o8468n9530n0828m2864
$$ 3068490 3015978 2946793 2867235 2782853 2698061 2616179 2539903 2471435 2411905 2361077 2318213
59735B318213l5209k7807k1389j6021j0508m193J764O116R663J4002J8891K2772
$$ 2318213 2283004 2255197 2233808 2217787 2207279 2203086 2204850 2210966 2220629 2234631 2253522 2276294
59723B276294K5733K9782L5806M2212M7379N1892N7316O3998P1186P8383Q5538
$$ 2276294 2302027 2331809 2367615 2409827 2457206 2509098 2566414 2630412 2701598 2779981 2865519
59712B865519R2658J00269J09461J20514J31906J41828J50212J58162J65570J70577
$$ 2865519 2958177 3058446 3167907 3288421 3420327 3562155 3712367 3870529 4036099 4206676
59702D206676J71714J69523J65322J58922J48639J33757J16148R8659Q2280O6036
$$ 4206676 4378390 4547913 4713235 4872157 5020796 5154553 5270701 5369360 5451640 5517676
59692E517676M9766L5554K5470J9059J4443J1075R704J0021J0318R672Q752P955
$$ 5517676 5567442 5602996 5628466 5647525 5661968 5673043 5682747 5692768 5703086 5712758 5721510 5729465
59680E729465O354L286k80k761l387k087Q93M613P764J0145J2994J7338K2958
$$ 5729465 5735819 5739105 5738825 5736064 5732677 5730590 5731483 5736096 5743860 5754005 5766999 5784337 5807295
59667E807295K9325L6373M3833N1156N8725O7687P7693Q6358R1950R5155R7031
$$ 5807295 5836620 5872993 5916826 5967982 6026707 6094394 6172087 6258445 6350395 6445550 6542581
59656F542581R6868R3671Q8196Q1474P2457N9318M2357K3476L246j9283m3950
$$ 6542581 6639449 6733120 6821316 6902790 6975247 7034565 7076922 7100398 7103644 7084361 7040411
59645G040411o8727r1857j12985j31859j47522j59195j66748j69886j68141j61967
$$ 7040411 6971684 6879827 6766842 6634983 6487461 6328266 6161518 5991632 5823491 5661524
59635E661524j52807j41761j29125j15495j02490r2339q7563r0631j02464j20828
$$ 5661524 5508717 5366956 5237831 5122336 5019846 4927507 4839944 4749313 4646849 4526021
59625D526021j41273j59968j75056j85537j90335j88879j81749j70255j55901
$$ 4526021 4384748 4224780 4049724 3864187 3673852 3484973 3303224 3132969 2977068
59616B977068j40139j23927j07709r2412p9779p0610o3355n6099m9463m5517m4081
$$ 2977068 2836929 2713002 2605293 2512881 2433102 2362492 2299137 2243038 2193575 2148058 2103977
59605B103977m2483l9434l6618l5304l3763k9825k4342k0014j7764j6327j4777
$$ 2103977 2061494 2022060 1985442 1950138 1916375 1886550 1862208 1842194 1824430 1808103 1793326
59594A793326j3456j2512j1407j0248j0079j1251j2585j2776j1827j0531r283
$$ 1793326 1779870 1767358 1755951 1745703 1735624 1724373 1711788 1699012 1687185 1676654 1667371
59583A667371q247q121r727j2724j5549j6920j6914j6320j5574j4797j4214j3678
$$ 1667371 1659124 1651003 1641276 1628552 1613003 1596083 1579169 1562849 1547275 1532478 1518264 1504586
59571A504586j2239r385o465n494o301o355m063q16J223K027L120N189P805J0737
$$ 1504586 1492347 1482962 1476497 1471003 1464702 1458347 1454284 1453468 1454691 1456718 1459838 1465027 1472832 1483569
59557A483569J3987J7017J9415K1866K5000K7800K8803K8606K9431L2241L5974
$$ 1483569 1497556 1514573 1533988 1555854 1580854 1608654 1637457 1666063 1695494 1727735 1763709
59546A763709L9567M3111M7025N1787N8306O6221P1550O8540N5318L6384J8685
$$ 1763709 1803276 1846387 1893412 1945199 2003505 2069726 2141276 2209816 2265134 2301518 2320203
59535B320203O584R69Q71M102P665R508R660Q911P330M860K247Q3k205n402r254
$$ 2320203 2326787 2327756 2328627 2332729 2340394 2349902 2359562 2368473 2375803 2380663 2382910 2382993 2380788 2375386 2366132
59520B366132j3146j7138k1358k5136k7909l0210l2677l4752l5504l5174l4676
$$ 2366132 2352986 2335848 2314490 2289354 2261445 2231235 2198558 2163806 2128302 2093128 2058452
59509B058452l4007l2387k9783k7135k5034k3059k0469j6987j2891q718m789p76
$$ 2058452 2024445 1992058 1962275 1935140 1910106 1887047 1866578 1849591 1836700 1827982 1823193 1822417
59497A822417L987R610J5572K1651K8069L4482L9771M3468M6573N0313N4826N9539
$$ 1822417 1826404 1836014 1851586 1873237 1901306 1935788 1975559 2019027 2065600 2115913 2170739 2230278
59485B230278O3855O6755O6764O3366N7828N1717M5256L7776K8947J8676O838
$$ 2230278 2294133 2360888 2427652 2491018 2548846 2600563 2645819 2683595 2712542 2731218 2738056
59474B738056n834j7398k6484l3803m0739m7040n1145n2339n1367m9233m6512
$$ 2738056 2732222 2714824 2688340 2654537 2613798 2566758 2515613 2463274 2411907 2362674 2316162
59463B316162m3489m0040l5633l0323k5241k1229j7705j3974j0926r956j0698
$$ 2316162 2272673 2232633 2197000 2166677 2141436 2120207 2102502 2088528 2077602 2067646 2056948
59452B056948j1382j1303j1505j3001j5660j8953k2576k6018k8568l0072l1070
$$ 2056948 2045566 2034263 2022758 2009757 1994097 1975144 1952568 1926550 1897982 1867910 1836840
59441A836840l2150l3647l5736l8083l9716m0023l9553l9047l8227l6497l4276
$$ 1836840 1804690 1771043 1735307 1697224 1657508 1617485 1577932 1538885 1500658 1464161 1429885
59430A429885l2448l0766k8154k4428k0661j7909j6359j5378j3658r957m675L10
$$ 1429885 1397437 1366671 1338517 1314089 1293428 1275519 1259160 1243782 1230124 1220167 1215492 1215802
59418A215802M677J1069K1038L0509L2320K3721Q961n734j6995k3611k4483j9611
$$ 1215802 1220479 1231548 1252586 1283095 1315415 1339136 1348097 1342363 1325368 1301757 1277274 1257663
59406A257663j1142j212J0009K2146L1693L3728K6359J2065m867k0593l1918l6749
$$ 1257663 1246521 1245309 1255318 1277464 1309157 1342885 1369244 1381309 1376442 1355849 1323931 1287182
59394A287182l5509l1136k6659k2968j9095j4133q397k960J450M843P529R763
$$ 1287182 1251673 1220537 1193878 1170910 1151815 1137682 1129285 1126325 1127775 1132618 1140147 1149910
59382A149910J1908J4519J7688K0701K2864K4429K6076K7821K9319L0899L3191
$$ 1149910 1161818 1176337 1194025 1214726 1237590 1262019 1288095 1315916 1345235 1376134 1409325
59371A409325L5771L7454L8085L8827M0288M1650M2195M2394M2704M2427M0915
$$ 1409325 1445096 1482550 1520635 1559462 1599750 1641400 1683595 1725989 1768693 1811120 1852035
59360A852035L9065L8457L9479M1364M3659M6600N0288N4490N9309O5162P1970
$$ 1852035 1891100 1929557 1969036 2010400 2054059 2100659 2150947 2205437 2264746 2329908 2401878
59349B401878P9027Q5896R2903J00493J08411J15775J21852J26558J30127J32407
$$ 2401878 2480905 2566801 2659704 2760197 2868608 2984383 3106235 3232793 3362920 3495327
59339C495327J32714J30420J25366J17629J07349R5205Q2443O9791N6749M2749
$$ 3495327 3628041 3758461 3883827 4001456 4108805 4204010 4286453 4356244 4412993 4455742
59329D455742K8560J5555L886p420j8787k9777m0323n0731o0265o7471p2535p7928
$$ 4455742 4484302 4499857 4503743 4496323 4477536 4447759 4407436 4356705 4296440 4228969 4156434 4078506
59317D078506q5873r6360j08155j20192j30998j38355j41122j40445j37779j32837
$$ 4078506 3992633 3896273 3788118 3667926 3536928 3398573 3257451 3117006 2979227 2846390
59307B846390j24922j15357j06524r9001r1385q2904p4454o6952o0244n4081m8753
$$ 2846390 2721468 2606111 2499587 2400586 2309201 2226297 2151843 2084891 2024647 1970566 1921813
59296A921813m4225l9672l4521k9172k4298k0065j6444j3640j1757j0520r576
$$ 1921813 1877588 1837916 1803395 1774223 1749925 1729860 1713416 1699776 1688019 1677499 1667923
59285A667923q725p688o121m096k186r60m85k91M54K367M983O787O852O228O873
$$ 1667923 1659198 1651510 1645389 1641293 1639107 1638147 1637662 1637371 1637825 1640192 1645175 1651962 1658814 1665042 1671915
59270A671915R266J1919J3329J3505J3167J2416J0837Q425N792L584K018O51j526
$$ 1671915 1681181 1693100 1706429 1719934 1733101 1745517 1756354 1764779 1770571 1774155 1776173 1776824 1775298
59257A775298n418j0778j6114k0062k2708k5236k8334l1337l3049l3154l2542
$$ 1775298 1769880 1759102 1742988 1722926 1700218 1674982 1646648 1615311 1582262 1549108 1516566
59246A516566l2218l2145l1483k9954k8404k7785k7994k8148k7703k6649k4797
$$ 1516566 1484348 1452203 1420720 1390766 1362362 1334577 1306583 1278435 1250732 1224083 1199286
59235A199286k1728j7705j3984j1762j1070j1021j0847j0340r507q249o501m451
$$ 1199286 1177558 1159853 1145869 1134107 1123037 1112016 1101169 1090829 1081322 1073073 1066572 1062121
59223A062121k473q64L46J424K777M672O888Q656R197Q577P965Q629J0615J2670
$$ 1062121 1059648 1058784 1059130 1060554 1063331 1068003 1074891 1083547 1092744 1101321 1109286 1117915 1128530 1141200
59209A141200J3730J4189J5472J8395K2177K5144K6472K7269K9701L4680M0656
$$ 1141200 1154930 1169119 1184591 1202986 1225163 1250307 1276779 1304048 1333749 1368429 1409085
59198A409085M5260M8138N1365N6822O3886P0400P5284P9278Q3320Q7186R0051
$$ 1409085 1454345 1502483 1553848 1610670 1674556 1744956 1820240 1899518 1982838 2070024 2160075
59187B160075R1698R2524R2429R0224Q4609P5711O5105N3882M1227K5768Q103
$$ 2160075 2251773 2344297 2436726 2526950 2611559 2687270 2752375 2806257 2847484 2873252 2881355
59176B881355r276k4720l8790n2315o4490p3970q0671q4972q6049q2914p6883
$$ 2881355 2872079 2847359 2808569 2756254 2691764 2617794 2537123 2452151 2366102 2283188 2206305
59165B206305p1103o7304o4420o0749n5937n0359m4130l7626l1910k7537k3785
$$ 2206305 2135202 2067898 2003478 1942729 1886792 1836433 1792303 1754677 1722767 1695230 1671445
59154A671445j9863j6121j3139j0486p481m587k862k318j934j090LJ109K195K920
$$ 1671445 1651582 1635461 1622322 1611836 1604355 1599768 1596906 1594588 1592654 1591564 1591567 1592676 1594871 1597791
59140A597791K923K692L050L697L355J757M05O37J841K430J977J374J284J542
$$ 1597791 1600714 1603406 1606456 1610153 1613508 1615265 1615670 1616307 1618148 1620578 1622555 1623929 1625213 1626755
59126A626755K006K976M438N730O352O572O792O829O391N878N843N703L948J26
$$ 1626755 1628761 1631737 1636175 1641905 1648257 1654829 1661621 1668450 1674841 1680719 1686562 1692265 1696213 1696339
59112A696339m024o241o346o381p956j0227j1159j0281r341j0211j2922j6043
$$ 1696339 1692315 1686074 1679728 1673347 1665391 1655164 1644005 1633724 1624383 1614172 1601250 1585207
59100A585207j8267j9102j8487j6687j4545j3121j2680j2450j1594j0161q800
$$ 1585207 1566940 1547838 1529351 1512664 1498119 1484998 1472318 1459868 1448274 1438113 1429313
59089A429313p901p344o780n804m058j735R0L15p76j401j48K314L842L186J246
$$ 1429313 1421412 1414068 1407288 1401484 1397426 1395691 1395781 1396096 1395320 1393919 1393771 1396085 1399927 1403113 1404359
59074A404359j55k61K91P97J346K183K860K629J382l16j989l517m701n226n201
$$ 1404359 1404204 1403943 1404234 1405031 1406377 1408560 1411420 1414049 1415431 1415115 1413126 1409609 1404908 1399682 1394481
59059A394481n325o270q132j0406j2085j2025j0065p840p401q649r258p892o246
$$ 1394481 1389156 1382886 1374754 1364348 1352263 1340238 1330173 1322333 1314932 1306283 1297025 1289133 1282887
59046A282887o705q916j0396j0108r515r909j0550j0190r067q309q288q569q863
$$ 1282887 1276182 1267266 1256870 1246762 1237247 1227338 1216788 1206598 1197531 1189222 1180934 1172365 1163502
59033A163502r091q993q476q094q375q998r240q887p973o029k662J120L249K796
$$ 1163502 1154411 1145418 1136942 1128848 1120473 1111475 1102235 1093348 1085375 1079346 1076684 1077804 1081053 1083849
59019A083849J237R31K537M480M877L547J832Q24L75q8n74r13j531k863m226m405
$$ 1083849 1085086 1086017 1088554 1093034 1097911 1101458 1103290 1104114 1104489 1104401 1103827 1102914 1101383 1098520 1094294 1089889
59003A089889l470k867l294l585k405j75J629K368K432K086J320O54R59K357M139
$$ 1089889 1086419 1083552 1080258 1076673 1074268 1074093 1075722 1078090 1080522 1082608 1083928 1084582 1085541 1087898 1092037
58988A092037N845P659R623J1344J2767J4622J7620K1535K5347K8125K9705L0837
$$ 1092037 1097882 1105541 1115164 1126508 1139275 1153897 1171517 1193052 1218399 1246524 1276229 1307066
58976A307066L2520L4922L6903L7225L6010L4495L3367L2129L0209K7814K5222
$$ 1307066 1339586 1374508 1411411 1448636 1484646 1519141 1552508 1584637 1614846 1642660 1667882
58965A667882K2001J7671J2698Q028L891k11m376q008j0788j3228j5867j8447
$$ 1667882 1689883 1707554 1720252 1728280 1732171 1731960 1727584 1719576 1708788 1695560 1679693 1661246
58953A661246k0477k2143k3840k5017k4491k2182j9710j8642j8703j8343j6608
$$ 1661246 1640769 1618626 1594786 1569769 1545278 1523096 1503386 1484744 1466041 1447698 1431090
58942A431090j3708j0209o692m056k999k994k700j596k88J072L317O553R073R289
$$ 1431090 1417382 1407173 1400481 1396425 1393426 1390432 1387732 1386136 1385848 1386920 1390237 1396790 1405863 1415152
58928A415152Q047P748R467J2138J4452J6368J8481K0946K3510K5958K8140K9894
$$ 1415152 1423199 1430947 1440414 1452552 1467004 1483372 1501853 1522799 1546309 1572267 1600407 1630301
58916A630301L1268L2618L4414L7126M1161M6492N2409N8100O3404O8523P2946
$$ 1630301 1661569 1694187 1728601 1765727 1806888 1853380 1905789 1963889 2027293 2095816 2168762
58905B168762P5145P3446O7114N6752M4167L1717K1268J3504Q286N548N532Q371
$$ 2168762 2243907 2317353 2384467 2441219 2485386 2517103 2538371 2551875 2560161 2565709 2571241 2579612
58893B579612J3679K0391K6852L1690L5106L8792M3815M9044N2513N4048N5361
$$ 2579612 2593291 2613682 2640534 2672224 2707330 2746122 2789937 2838981 2891494 2945542 3000903
58882C000903N7707O0576O3017O5135O7648P0643P3208P3897P1242O4364N3486
$$ 3000903 3058610 3119186 3182203 3247338 3314986 3385629 3458837 3532734 3603976 3668340 3721826
58871C721826L9711K4373Q926m882j5736k3829l0350l5806l9637m1732m3225m5136
$$ 3721826 3761537 3785910 3794836 3789954 3774218 3750389 3720039 3684233 3644596 3602864 3559639 3514503
58859C514503m7080m8159m8529m9288n1115n3641n5999n7520n8129n8432n9161
$$ 3514503 3467423 3419264 3370735 3321447 3270332 3216691 3160692 3103172 3045043 2986611 2927450
58848B927450o0264o0895o0496n9371n7947n6241n4501n3556n3722n3829n2344
$$ 2927450 2867186 2806291 2745795 2686424 2628477 2572236 2517735 2464179 2410457 2356628 2304284
58837B304284m9188m5659m2733m0208l7474l4357l1029k7696k4513k1531j8688
$$ 2304284 2255096 2209437 2166704 2126496 2089022 2054665 2023636 1995940 1971427 1949896 1931208
58826A931208j6030j3769j1908j0039p855n597l586j674L87K367L961N448P373
$$ 1931208 1915178 1901409 1889501 1879462 1871607 1866010 1862424 1860750 1861137 1863504 1867465 1872913 1880286
58813A880286R711J1878J3340J3710J2682J0669R126R274J0578J1377J0847R470
$$ 1880286 1889997 1901875 1915215 1928925 1941607 1952276 1961402 1970676 1981254 1992631 2003478 2012948
58801B012948P924O817P350J0465J4897J7772J8116J8357K1177K6131L0787L4158
$$ 2012948 2020872 2027689 2035039 2045504 2060401 2078173 2096289 2114646 2135823 2161954 2192741 2226899
58789B226899L7304M1062M5050M8790N2288N5387N7915O0538O3939O7038O7588
$$ 2226899 2264203 2305265 2350315 2399105 2451393 2506780 2564695 2625233 2689172 2756210 2823798
58778B823798O5034O1212N7589N3447M7772M1352L5411K9334K1598J2455L813
$$ 2823798 2888832 2950044 3007633 3061080 3108852 3150204 3185615 3214949 3236547 3249002 3252815
58767C252815l341r742j6026k1697k6426l0940l5875m0688m4425m6998m9087n1262
$$ 3252815 3249474 3239732 3223706 3202009 3175583 3144643 3108768 3068080 3023655 2976657 2927570 2876308
58755B876308n3560n5575n6655n6483n5702n5521n6496n8037n9099n8844n6883
$$ 2876308 2822748 2767173 2710518 2654035 2598333 2542812 2486316 2428279 2369180 2310336 2253453
58744B253453n3722n0948m9862m9652m8100m4485m0565l7949l5882l2829k9200
$$ 2253453 2199731 2148783 2098921 2049269 2001169 1956684 1916119 1878170 1842288 1809459 1780259
58733A780259k6847k6271k5970k4653k2763k1409k0677j9609j7453j4587j2191
$$ 1780259 1753412 1727141 1701171 1676518 1653755 1632346 1611669 1592060 1574607 1560020 1547829
58722A547829j0977j0222q498n477k329J32K727O559J1202J5377J8807K1978K4462
$$ 1547829 1536852 1526630 1518132 1512655 1510326 1510458 1513185 1519744 1530946 1546323 1565130 1587108 1611570
58709A611570K4992K3094J9012J2058R80j3239k6801l6620m3313m9295n4820n7614
$$ 1611570 1636562 1659656 1678668 1690726 1691706 1678467 1651666 1615046 1571733 1522438 1467618 1410004
58697A410004n6173n1741m6670m2017l7429l2491k7340k2241j7431j3367j0326
$$ 1410004 1353831 1302090 1255420 1213403 1175974 1143483 1116143 1093902 1076471 1063104 1052778
58686A052778p506l295K801Q964J2881J4770J7319K2073K6976K8514K5519J9658
$$ 1052778 1045272 1041977 1044778 1053742 1066623 1081393 1098712 1120785 1147761 1176275 1201794 1221452
58674A221452J2712M947l787j2711k0323k5154k6163k3352j8400j3828j1166j0345
$$ 1221452 1234164 1239111 1235324 1222613 1202290 1177136 1150973 1127621 1109221 1095393 1084227 1073882
58662A073882j0848j2398j4453j6172j7399j8778k0459k1690k2089k2209k2159
$$ 1073882 1063034 1050636 1036183 1020011 1002612 983834 963375 941685 919596 897387 875228
58651H75228k0909j8004j4939j3460j3183j2252r944p285n214l549j902m94M00
$$ 875228 854319 836315 821376 807916 794733 782481 772537 765252 760038 756489 754587 754093 754493
58638G54493R49J384J656J808K219L150M332N082M723L129J232O75K202M613O007
$$ 754493 755442 756826 758482 760290 762509 765659 769991 775073 779796 782925 784157 784832 787034 791647 797654
58623G97654O022N990O831P821P824O864N688M392K439n1j904k061q10N34R86
$$ 797654 803676 809666 816497 824318 832142 839006 844694 849086 851525 851474 849570 847509 846699 847233 848219
58608H48219P00N05Q88J684K591L613M865O277P728R178J0409J0916J0530R873
$$ 848219 848919 849424 850312 851996 854587 858200 863065 869342 877070 886248 896657 907573 918103 927976
58594I27976R613R558R229R265J1047J4538J7541J8050J6725J5915J6623J7695
$$ 927976 937589 947147 956376 965641 976688 991226 1008767 1026817 1043542 1059457 1076080 1093775
58582A093775J8085J8435J9661K0970K0504J7642J3714J0554R067R053R533R151
$$ 1093775 1111860 1130295 1149956 1170926 1191430 1209072 1222786 1233340 1242407 1251460 1260993 1270144
58570A270144P204M678L372L581L484J525j407l219l463l531m172m363l269k026
$$ 1270144 1277348 1282026 1285398 1288979 1292463 1293988 1292581 1289362 1285899 1282368 1278196 1273833 1270564 1268538
58556A268538k414m387o185o714o763p579r176j0696j1845j3225j5185j7106j8138
$$ 1268538 1266124 1261737 1255552 1248838 1242075 1234496 1225320 1214624 1202779 1189554 1174369 1157263 1139125
58543A139125j8285j8281j8489j8465j7812j6961j6589j6404j5282j2869j0474
$$ 1139125 1120840 1102559 1084070 1065605 1047793 1030832 1014243 997839 982557 969688 959214
58532I59214r669j0231j0295q795o932o410o840o155l685j343j037k039k245j310
$$ 959214 949545 939314 929019 920224 913292 906882 900042 893887 890202 888859 887822 885783 883538 882228
58518H82228p81j317j633p60L65O82R39K401M410N000L776K610L196N095O589
$$ 882228 881447 880130 878497 877737 878102 878784 879723 882124 886534 891534 895310 897920 901116 906211 912800
58503I12800O556N034K734O49l35q4P28J429K077L070M359N327N468M954M477
$$ 912800 919356 924390 927124 927773 927438 927354 928082 929511 931588 934658 939017 944344 949812 954766 959243
58488I59243M566N185N940O545O805O472N596M970N447O612O894N414L035J084
$$ 959243 963809 968994 974934 981479 988284 994756 1000352 1005322 1010769 1017381 1024275 1029689 1032724 1033808
58474A033808j94j277k187k706l118l656l641k388o67k4o33j051k42J331K738
$$ 1033808 1033614 1032337 1030150 1027444 1024326 1020670 1017029 1014641 1013974 1013950 1013317 1012266 1012024 1013355 1016093
58459A016093L564L617K819J937K286L990N419N095L501K326K465L387M004L525
$$ 1016093 1019657 1023274 1026093 1028030 1030316 1034306 1039725 1044820 1048321 1050647 1053112 1056499 1060503 1064028
58445A064028J817l73j831j916j012K69J827L565M721M494L179K009J902K799
$$ 1064028 1065845 1065472 1063641 1061725 1060713 1060982 1062809 1066374 1071095 1075589 1078768 1080777 1082679 1085478
58431A085478M139N361N887N300L950L061L687N556P374Q289Q610Q905R020Q552
$$ 1085478 1089617 1094978 1100865 1106165 1110115 1113176 1116863 1122419 1129793 1138082 1146692 1155597 1164617 1173169
58417A173169P849P585P527O843N823O110Q503J1462J2779J2048J0549R244Q073
$$ 1173169 1181018 1188603 1196130 1202973 1208796 1214906 1223409 1234871 1247650 1259698 1270247 1279491 1287564
58404A287564P041O827P909R739J1208J1747J1908J2803J4688J6266J6103J4655
$$ 1287564 1294605 1301432 1309341 1319080 1330288 1342035 1353943 1366746 1381434 1397700 1413803 1428458
58392A428458J3818J4137J3899J1822R312Q720J0330J2472J3865J4370J4031J2976
$$ 1428458 1442276 1456413 1470312 1482134 1491446 1500166 1510496 1522968 1536833 1551203 1565234 1578210
58380A578210J1981J1778J2009J1974J1965J2643J3658J4247J4616J5279J5673
$$ 1578210 1590191 1601969 1613978 1625952 1637917 1650560 1664218 1678465 1693081 1708360 1724033
58369A724033J5152J4671J5586J7209J7725J7196J7309J8194J8073J6455J5187
$$ 1724033 1739185 1753856 1769442 1786651 1804376 1821572 1838881 1857075 1875148 1891603 1906790
58358A906790J5472J6196J6252J6454J7762J9338J9900J9753K0038K0914K1753
$$ 1906790 1922262 1938458 1954710 1971164 1988926 2008264 2028164 2047917 2067955 2088869 2110622
58347B110622K2307K2610K2405K1670K1316K2326K4506K6594K7586K7631K7683
$$ 2110622 2132929 2155539 2177944 2199614 2220930 2243256 2267762 2294356 2321942 2349573 2377256
58336B377256K8283K8803K8450K7966K9091L1738L3292L2068L0006L0047L2052
$$ 2377256 2405539 2434342 2462792 2490758 2519849 2551587 2584879 2616947 2646953 2677000 2709052
58325B709052L3647L4200L5267L7443L9433M0382M0796M1055M1118M1684M3583
$$ 2709052 2742699 2776899 2812166 2849609 2889042 2929424 2970220 3011275 3052393 3094077 3137660
58314C137660M6103M7968M9502N1583N3123N2621N1681N3549N7996O1214O1225
$$ 3137660 3183763 3231731 3281233 3332816 3385939 3438560 3490241 3543790 3601786 3663000 3724225
58303C724225O0110O0156O1167O2423O4057O5395O5058O3740O4022O6495O9027
$$ 3724225 3784335 3844491 3905658 3968081 4032138 4097533 4162591 4226331 4290353 4356848 4425875
58292D425875P0547P2259P4377P5362P5452P7233Q1289Q5046Q7368R0474R5574
$$ 4425875 4496422 4568681 4643058 4718420 4793872 4871105 4952394 5037440 5124808 5215282 5310856
58281E310856J00388J03089J05118J08077J11324J14524J18921J24164J27664
$$ 5310856 5411244 5514333 5619451 5727528 5838852 5953376 6072297 6196461 6324125
58272F324125J29205J32215J38281J44620J49359J54792J62522J69921J74847
$$ 6324125 6453330 6585545 6723826 6868446 7017805 7172597 7335119 7505040 7679887
58263G679887J79733J87321J96135K03888K11626K20831K29953K37510K45227
$$ 7679887 7859620 8046941 8243076 8446964 8658590 8879421 9109374 9346884 9592111
58254I592111K54649K64309K73506K84941L00027L15674L29459L43698L60632
$$ 9592111 9846760 10111069 10384575 10669516 10969543 11285217 11614676 11958374 12319006
58245A2319006L78195L94575M12290M33343M55325M76925N02052N33308N66604
$$ 12319006 12697201 13091776 13504066 13937409 14392734 14869659 15371711 15905019 16471623
58236A6471623N97887O30178O68163P10821P55334Q03202Q56436R13083R72624
$$ 16471623 17069510 17699688 18367851 19078672 19834006 20637208 21493644 22406727 23379351
58227B3379351J040164J118873J204124J291249J382478J480169J581837J689464
$$ 23379351 24419515 25538388 26742512 28033761 29416239 30896408 32478245 34167709
58219C4167709J814481J964882K137330K331301K559218K831367L143784L494138
$$ 34167709 35982190 37947072 40084402 42415703 44974921 47806288 50950072 54444210
58211E4444210L894795M355281M871031N450459O132573O952829P919778R062480
$$ 54444210 58339005 62694286 67565317 73015776 79148349 86101178 94020956 103083436
58203A03083436J0454892J2096744J3759761J5057387J5757627J6017724J6279081
$$ 103083436 113538328 125635072 139394833 154452220 170209847 186227571 202506652
58196B02506652J6957690J8251424K0158556K2552636K5205696K7805003K9995216
$$ 202506652 219464342 237715766 257874322 280426958 305632654 333437657 363432873
58189C63432873L1390419L1546270K9985951K6337887K0510496J2790255L822658
$$ 363432873 394823292 426369562 456355513 482693400 503203896 515994151 519816809
58182E19816809n507833j4272168k1707356k7353039l1067519l2962183l3315249
$$ 519816809 514308976 500036808 478329452 450976413 419908894 386946711 353631462
58175C53631462l2485834l0833603k8667231k6233527k3723002k1269096j8951049
$$ 353631462 321145628 290312025 261644794 235411267 211688265 190419169 171468120
58168A71468120j6811890j4875644j3149222j1622280j0278081r102463q079227
$$ 171468120 154656230 139780586 126631364 115009084 104731003 95628540 87549313
58161H7549313p185808o401800n716740n123200m607830m155452l756896l406363
$$ 87549313 80363505 73961705 68244965 63121765 58513935 54358483 50601587 47195224
58153D7195224l095603k816920k567976k347817k151510j973630j813397j671218
$$ 47195224 44099621 41282701 38714725 36366908 34215398 32241768 30428371 28757153
58145B8757153j543554j426073j318748j223174j137637j059078r87155r22378
$$ 28757153 27213599 25787526 24468778 23245604 22107967 21048889 20061734 19139356
58137A9139356q62992q07382p56803p12160o71037o31230n94152n61350n30847
$$ 19139356 18276364 17468982 16712179 16000019 15328982 14697752 14103600 13542250 13011403
58128A3011403n00534m72007m47276m24683m01964l80475l62360l46023l28538
$$ 13011403 12510869 12038862 11591586 11166903 10764939 10384464 10022104 9676081 9347543
58119I347543l10507k94767k81876k70254k59173k48518k37263k25027k13622
$$ 9347543 9037036 8742269 8460393 8190139 7930966 7682448 7445185 7220158 7006536
58110G006536k04585j96911j89294j82295j76139j69045j60338j52545j47607
$$ 7006536 6801951 6605040 6415746 6233451 6057312 5888267 5727929 5575384 5427777
58101E427777j43522j37703j31226j26555j23265j19259j14373j09730j05103
$$ 5427777 5284255 5146552 5015326 4888771 4765506 4646247 4531874 4422144 4317041
58092D317041r9794r4623r0587q7051q3359q0377p8516p6488p3971p2943p4051
$$ 4317041 4217247 4122624 4032037 3944986 3861627 3781250 3702734 3626246 3552275 3479332 3405281
58081C405281p4457p1942o8403o6444o5282o3196o1228o0927o0791n8556n5064
$$ 3405281 3330824 3258882 3190479 3124035 3058753 2995557 2934329 2873402 2812611 2754055 2698991
58070B698991n2381n0149m7205m4724m4175m4061m2467m0840m1397m2605m1366
$$ 2698991 2646610 2596461 2549256 2504532 2460357 2416296 2373829 2332989 2291592 2248987 2207621
58059B207621l8267l6439l6412l6265l5789l6197l6462l4405l1134l0086l1547
$$ 2207621 2169354 2132915 2096503 2060238 2024449 1988252 1951790 1917385 1886251 1856165 1824618
58048A824618l2170l0289k7928k6917k6522k5777k5057k4488k3391k2041k1614
$$ 1824618 1792448 1762159 1734231 1707314 1680792 1655015 1629958 1605470 1582079 1560038 1538424
58037A538424k1893k1384j9949j9126j9453j9801j9644j9747k0287k0377j9819
$$ 1538424 1516531 1495147 1475198 1456072 1436619 1416818 1397174 1377427 1357140 1336763 1316944
58026A316944j9404j9265j8736j7995j7944j8372j8051j6791j5671j5197j4773
$$ 1316944 1297540 1278275 1259539 1241544 1223600 1205228 1187177 1170386 1154715 1139518 1124745
58015A124745j4023j3109j1953j0577r785r986r982q607o831o380o978p061o438
$$ 1124745 1110722 1097613 1085660 1075083 1065298 1055312 1045330 1036723 1029892 1023512 1016534 1009473 1003035
58002A003035o062n746m544k915k075j514L17L069M679M596M336M776N277N699
$$ 1003035 996973 991227 986683 983768 981693 980179 980496 983565 988244 992840 997176 1001952 1007229 1012928
57988A012928O913Q834J0157J0619J1531J3573J5805J7474J9056K1009K2918K4429
$$ 1012928 1019841 1028675 1038832 1049451 1060982 1074555 1090360 1107834 1126890 1147899 1170817 1195246
57976A195246K5870K7652K9878L2358L4035L3091K9002K3804J9757J6525J2385
$$ 1195246 1221116 1248768 1278646 1311004 1345039 1378130 1407132 1430936 1450693 1467218 1479603
57965A479603P183J898l940j1560k0033k6786l1127l4662l8008l9678l8901l7172
$$ 1479603 1486786 1488684 1484744 1473184 1453151 1426365 1395238 1360576 1322568 1282890 1243989 1206817
57953A206817l6119l5676l5048l3838l1720k8564k5235k2838k0989j8366j4976
$$ 1206817 1170698 1135022 1099974 1066136 1034416 1005852 980617 957779 936790 918424 903448
57942I03448j2154j0387q997p903p697p877p167n804n437o442p392p600q010r016
$$ 903448 891294 880907 871910 864007 856310 848433 841266 835462 830025 823583 816191 808591 800581 791565
57928G91565r463q712p913q297r565j0553j0346q554n739l493k613j525J673O037
$$ 791565 782102 773390 765477 757180 747615 737062 726716 718162 712423 708930 706317 704792 706465 712502
57914G12502Q912R945J1195J3190J3920J2528J1054J1216J1876J1228R416P544
$$ 712502 721414 731359 742554 755744 769664 782192 793246 804462 816338 827566 836982 844526
57902H44526N771L733J310k043p130j3174j7781j9748k0351k1057k1687k1752
$$ 844526 850297 854030 855340 853297 846167 832993 815212 795464 775113 754056 732369 710617
57890G10617k1671k1480k0239j8004j6592j7003j7808j7567j7117j7667j8245
$$ 710617 688946 667466 647227 629223 612631 595628 577820 560253 543136 525469 507224
57879E07224j7147j4949j3841j4413j4884j3477j0209o413l464k001j697j631
$$ 507224 490077 475128 461287 446874 431990 418513 408304 401891 398427 396426 394729 393098
57867C93098j145j15J381L061M266M654M924N922P245P892P818P475O374M027
$$ 393098 391953 391838 393219 396280 400546 405200 410124 416046 423291 431183 439001 446476 452850 456877
57853D56877J819J464J856K69l072m788l518k093l014m864n179m180l303k390
$$ 456877 458696 460160 462016 462285 459213 454425 450907 448814 445800 440936 435757 431577 428274 425884
57839D25884r90m27j733k973j547J910M598N721O856Q522R170P720M954J965j136
$$ 425884 424894 424467 422734 419761 418214 420124 424722 430443 437299 445821 454991 462711 467665 469630 468494
57824D68494m485p607r598r626p644n097m104n018n833n005l547k957k437j82
$$ 468494 464009 456402 446804 437178 429534 424437 420333 415315 409482 404477 400930 397973 395536 395354
57810C95354L446O222P079O979P038P608Q985J1270J3580J4937J5739J6969J8280
$$ 395354 398800 405022 412101 419080 426118 433726 442711 453981 467561 482498 498237 515206 533486
57797E33486J8611J8352J8803J9610J8761J5622J1952R217O742L435j34k742m587
$$ 533486 552097 570449 589252 608862 627623 643245 655197 664414 671156 674591 674457 671715 667128
57784F67128p007j0462j3786j5490j5270j4209j3676j4098j4858j5380j5860j6584
$$ 667128 660121 649659 635873 620383 605113 590904 577228 563130 548272 532892 517032 500448
57772E00448j7139j6995j6428j6068j5820j5167j4251j3672j3277j2115r805p178
$$ 500448 483309 466314 449886 433818 417998 402831 388580 374908 361631 349516 339711 332533
57760C32533n314m606m852n603o210n999m750k822q05P91J760K387L147L886L738
$$ 332533 327219 322613 317761 312158 305948 299949 295199 292377 291572 292363 294123 296510 299657 303543 307281
57745C07281K302L91r89j801k321j928J56L031M415L283J254P24K059L267K368
$$ 307281 309583 309974 308985 307184 304863 302935 303091 306122 310537 313820 315074 315798 317857 321124 323492
57730C23492k48k047j006K086M454M608M001M807O756P403N369K029m02j448k278
$$ 323492 323244 321197 320191 322277 326731 331339 335340 340147 346903 354306 359675 361704 361302 359854 357576
57715C57576l653m908m951l691k163j523k137l485m717n247n089m756m707m750
$$ 357576 353923 349015 344064 340373 338210 336687 334550 331065 326348 321101 316012 311256 306549 301799
57701C01799m204k747q83N83J215R40m3j003r53J05Q23L03l59N13K632M129M345
$$ 301799 297595 294848 293965 294548 295763 296703 296660 295657 294704 294809 295632 295935 295576 296089 298721 302850 307195
57684C07195M751O611R284J1485J3128J5137J8203K2311K6944L1517L6284M2745
$$ 307195 311946 318557 327841 339326 352454 367591 385794 408105 435049 466566 502850 545595
57672E45595N2128O3589P5181Q6247R6390J01621R4501P0688L4392m326l6803
$$ 545595 597723 661312 736493 822740 919130 1020751 1115252 1185940 1220332 1216006 1179203
57661A179203n9181p0681p1793o4667n3129m1004l0637k2752j6917j2049p255
$$ 1179203 1120022 1049341 977548 912881 859752 818748 788111 765359 748442 736393 729138
57650G29138k387K269O261Q831R425Q885R063J0472J1347J0090P509N360L708
$$ 729138 726751 729020 735281 744112 753537 762422 771485 781957 793304 803394 810903 816263 819971
57637H19971J432j298l003l211l233m354o509q884j0718j1388j0780r847j0078
$$ 819971 821403 820105 817102 813891 810658 806304 799795 790911 780193 768805 758025 748178 738100
57624G38100j2013j4721j6729j7086j5790j3682j1813j0569r639q819q101o925
$$ 738100 726087 711366 694637 677551 661761 648079 636266 625697 616058 607239 599138 592213
57612E92213m619k077j448l152m613l464o73J204J773K590M025M695L943K739
$$ 592213 587594 585517 584069 580917 576304 572840 572167 573371 575144 577734 581759 586454 590397 593136
57598E93136J894J325J349K742M960O068N313M433N403P947J0215J1191J1452
$$ 593136 595030 596355 597704 600446 605406 611474 616787 621220 626623 634570 644785 655976 667428
57585F67428J1813J1950J0683P554L952J836J259J08k930o350p879p535p099p472
$$ 667428 679241 691191 701874 709428 713380 715216 716475 716583 713653 707303 699424 691889 684790 677318
57571F77318q318r659j1750j3631j3973j3358j3655j5008j5587j4678j3761j3813
$$ 677318 669000 659341 647591 633960 619987 606629 592974 577966 562379 547701 533940 520127
57559E20127j3771j2803j2026j2543j3349j2807j0976q993p216n476m308m406
$$ 520127 506356 493553 481527 468984 455635 442828 431852 422859 415643 410167 405859 401453
57547D01453n257n668n302m652l910k883j747r62n92m73p62j592k486k733k124
$$ 401453 396196 390528 385226 380574 376664 373781 372034 371072 370480 370007 369245 367653 365167 362434 360310
57532C60310q55Q32K350K714J635L23K43J309K132K061K089L441N914P943Q057
$$ 360310 359455 360287 362637 365351 366986 367309 367552 368861 370993 373054 375143 378584 384498 392441 400498
57517D00498O043K998N66M9J731M701P270Q017O850M963L625L252L742N093P083
$$ 400498 406541 409539 410105 410154 411885 416586 423856 431873 438723 443686 447311 450563 454305 459398 466481
57502D66481Q748R037P962O521N566N367O075P688R487J0332R821Q605P501O857
$$ 466481 475229 484266 492228 498749 504315 509682 515757 523445 532932 543264 553085 561690 569191 576048
57488E76048O801P316P816P263N089J790j413l283l353k643l150n727q812j0179
$$ 576048 582849 590165 597981 605244 610333 612123 610710 607427 604074 601431 598281 592554 583742 573563
57474E73563r649q920r031r503r957j0736j1491j0870q590o400n857o236n813
$$ 573563 563914 554994 545963 536460 526503 515767 504276 493406 484816 478416 472559 466323 460510
57461D60510m410l281l130l439l552l411l218l129l144k779j231J517M032M741
$$ 460510 456100 452819 449689 446250 442698 439287 436069 432940 429796 427017 425786 427303 431335 436076
57447D36076L832L143M018N938P516Q269Q864R743J0326R992R344R504J0209R878
$$ 436076 439908 443051 447069 453007 460523 468792 477656 487399 497725 507717 517061 526565 536774 546652
57433E46652Q073O586P072Q674R438R144Q954Q934Q044O338M898L362L6m908q686
$$ 546652 554725 561311 568383 577057 586495 595639 604593 613527 621571 627909 632807 636169 636205 631297 622611
57418F22611r478q681q345q416q166q369r857j1315j0876r084q064q368q746q658
$$ 622611 613133 604452 596107 587691 579525 571156 561299 549984 539108 530024 521960 513592 504846 496188
57404D96188q836r395r401q542p603p048o602o372o784p143n917k979k28O61n2
$$ 496188 487352 477957 468556 460014 452411 445363 438761 432389 425605 418462 412545 409566 409338 409999 409947
57389D09947j136j857j898r82N53J618J539P20k77j439k598k959k166j124r71
$$ 409947 408811 406954 405056 404074 404627 406245 407784 408504 408227 406788 404190 401231 399065 397941 396970
57374C96970j696k523l078l386l306k791k404k677l195l134k494j898j321j19
$$ 396970 395274 392751 389673 386287 382981 380190 377786 375109 371914 368780 366286 364388 363067 362948
57360C62948J533K395J865J129J712L435M702M598L850L671M434N752P143Q140
$$ 362948 364481 366876 368741 369870 371582 375017 379719 384317 388167 391838 396272 402024 409167 417307
57346D17307Q256P380N988M565L123J755J296K560N012O899O999N750M489M039
$$ 417307 425563 432943 438931 443496 446619 448374 449670 452230 457242 464141 471140 476890 481379 485418
57332D85418M246M452M126L401L152M114N744O525N745M406L896M318M927N682
$$ 485418 489664 494116 498242 501643 504795 508909 514653 521178 526923 531329 535225 539543 544470 550152
57318E50152P264R454J0655R686P411N872N958O659O637N902N615O577Q463J0372
$$ 550152 557416 566870 577525 587211 594622 600494 606452 613111 619748 625650 631265 637842 646305 656677
57304F56677J1649J2082J1819J1313J1016J0803J0093Q851Q049Q655J0403J2112
$$ 656677 668326 680408 692227 703540 714556 725359 735452 744303 752352 761007 771410 783522
57292G83522J2948J2854J2038J0854J0004J0020J0424J0371J0176J1226J3908
$$ 783522 796470 809324 821362 832216 842220 852240 862664 873035 883211 894437 908345
57281I08345J6529J7105J5557J3460J2056J1379J1070J1143J1738J2707J3676
$$ 908345 924874 941979 957536 970996 983052 994431 1005501 1016644 1028382 1041089 1054765
57270A054765J4282J4301J3758J3031J2627J2668J2700J2134J0967R894R463R319
$$ 1054765 1069047 1083348 1097106 1110137 1122764 1135432 1148132 1160266 1171233 1181127 1190590 1199909
57258A199909Q750Q053Q480J0266J1652J0942R018Q347R637J1032J0973J0308
$$ 1199909 1208659 1216712 1225192 1235458 1247110 1258052 1267070 1275417 1285054 1296086 1307059 1317367
57246A317367J0651J1921J2686J2323J1594J1435J2066J3160J4118J4373J4071
$$ 1317367 1328018 1339939 1352625 1364948 1376542 1387977 1400043 1413203 1427321 1441694 1455765
57235A455765J4211J5433J6885J6987J5320J3173J2248J3268J5620J7824J8450
$$ 1455765 1469976 1485409 1502294 1519281 1534601 1547774 1560022 1573290 1588910 1606734 1625184
57224A625184J7318J5927J6130J8125K0161K0503J9365J8500J8937J9768J9500
$$ 1625184 1642502 1658429 1674559 1692684 1712845 1733348 1752713 1771213 1790150 1809918 1829418
57213A829418J8182J7262J7408J7564J6834J6151J6913J8601J9455J9215J9424
$$ 1829418 1847600 1864862 1882270 1899834 1916668 1932819 1949732 1968333 1987788 2007003 2026427
57202B026427K0783K2007K2005K1494K1438K1326K0328J9025J8599J9139K0052
$$ 2026427 2047210 2069217 2091222 2112716 2134154 2155480 2175808 2194833 2213432 2232571 2252623
57191B252623K1378K3271K4779K4723K3461K2467K2358K2572K2663K2740K2812
$$ 2252623 2274001 2297272 2322051 2346774 2370235 2392702 2415060 2437632 2460295 2483035 2505847
57180B505847K2915K3530K4733K5327K4320K2848K2901K4283K4895K4166K3998
$$ 2505847 2528762 2552292 2577025 2602352 2626672 2649520 2672421 2696704 2721599 2745765 2769763
57169B769763K5532K7071K6696K5274K5151K6680K7839K6986K4732K3011K3248
$$ 2769763 2795295 2822366 2849062 2874336 2899487 2926167 2954006 2980992 3005724 3028735 3051983
57158C051983K5367K7977K9569K9910L0001L0507L0896L0567L0008L0074L0816
$$ 3051983 3077350 3105327 3134896 3164806 3194807 3225314 3256210 3286777 3316785 3346859 3377675
57147C377675L1949L3787L6550L9202M0320M0064M0009M0902M1892M2305M2959
$$ 3377675 3409624 3443411 3479961 3519163 3559483 3599547 3639556 3680458 3722350 3764655 3807614
57136C807614M4875M7621M9906N1331N2656N4546N6963N9778O3226O7398P1757
$$ 3807614 3852489 3900110 3950016 4001347 4054003 4108549 4165512 4225290 4288516 4355914 4427671
57125D427671P5565P8714Q1936Q6251R2125R9134J06415J13497J20668J28510
$$ 4427671 4503236 4581950 4663886 4750137 4842262 4941396 5047811 5161308 5281976 5410486
57115E410486J37288J46984J57788J70273J84971K01927K20826K41677K65481
$$ 5410486 5547774 5694758 5852546 6022819 6207790 6409717 6630543 6872220 7137701
57106G137701K94153L29392L71526M19780M73906N35180O05335O84946P73367
$$ 7137701 7431854 7761246 8132772 8552552 9026458 9561638 10166973 10851919 11625286
57097A1625286Q69872R73697J082854J193811J302808J406746J502437J585840
$$ 11625286 12495158 13468855 14551709 15745520 17048328 18455074 19957511 21543351
57089B1543351J652865J700428J725845J725341J693925J626825J520913J375263
$$ 21543351 23196216 24896644 26622489 28347830 30041755 31668580 33189493 34564756
57081C4564756J191192R71810P21267M44778J49778j53514m53568p39764j003180
$$ 34564756 35755948 36727758 37449025 37893803 38043581 37890067 37436499 36696735 35693555
57072C5693555j236258j433088j590181j706175j780974j815857j814244j781258
$$ 35693555 34457297 33024209 31434028 29727853 27946879 26131022 24316778 22535520
57064B2535520j722306j642614j547877j444101j336393j228445j123159j022851
$$ 22535520 20813214 19170600 17622723 16178622 14842229 13613784 12490625 11467774
57056A1467774r28672q40757p59222o84401o16088n53468m96070m43969l96880
$$ 11467774 10539102 9698345 8939123 8254722 7638634 7085166 6589096 6145127 5748247
57047E748247l53908l14420k78434k46204k18566j97701j85951j82806j83913
$$ 5748247 5394339 5079919 4801485 4555281 4336715 4139014 3953063 3770257 3586344
57038C586344j83845j79564j71232j60784j50238j40334j30151j18689j06906
$$ 3586344 3402499 3222935 3051703 2890919 2740681 2600347 2470196 2351507 2244601
57029B244601r7044q9650q2960p5857o9698o5917o3408o0018n5637n2049n0221
$$ 2244601 2147557 2057907 1974947 1899090 1829392 1763475 1700067 1640049 1584412 1532363 1482142
57018A482142m9428m8638m7323m5065m1683l7838l4623l2641l1966l2320l2552
$$ 1482142 1432714 1384076 1336753 1291688 1250005 1212167 1177544 1144903 1112937 1080617 1048065
57007A048065l0966k7339k3881k2752k3358k3561k2795k2093k1547j9961j7167
$$ 1048065 1017099 989760 965879 943127 919769 896208 873413 851320 829773 809812 792645
56996G92645j4648j3313j2334j0847r228q033o982n810m918m366l331j514j36
$$ 792645 777997 764684 752350 741503 732275 724242 717260 711450 706532 702166 698835 697321 697185
56983F97185n74k584m782o301p129p328o992o817p756r784j1567j1656r812p110
$$ 697185 696611 694027 689245 682944 675815 668487 661495 654678 646922 637138 625571 613915 604103 596993
56969E96993m923l977m160m792m931l783j322J543L885N714P474Q716Q280O071
$$ 596993 592070 588093 583933 579141 574210 570427 569105 570648 574533 580247 587721 596437 604717 610788
56955F10788L572J965O87j315l814n816p247q839j0639j1710j1192q986n582k034
$$ 610788 614360 616325 617012 615697 611883 606067 598820 589981 579342 567632 556440 547454 541872 539838
56941E39838L22J077J359K444M116N327N986O926Q293R189Q918P683O054M416
$$ 539838 540160 541237 542596 545040 549156 554483 560469 567395 575688 584877 593795 601478 607532 611948
56927F11948K805N28l512r197j4417j7038j7268j6980j7095j6914j5711j3645
$$ 611948 614753 615281 611769 602572 588155 571117 553849 536869 519774 502860 487149 473504
56915D73504j1297r391q571q378p175m480k454l161n103n005k496l74j59m49j90
$$ 473504 462207 452816 444245 435867 428692 424212 421758 418597 413494 408489 405993 405619 405460 405011 404821
56900D04821m83j785k185m05J684J784P95J408M102O722P584P253P321Q627J0546
$$ 404821 404338 402553 400368 399963 401647 403431 404226 405634 409736 416458 424042 431295 438616 447243 457789
56885D57789J1319R569N981K838J384O75m67j647k026j883j928j953j431m12J162
$$ 457789 469108 478677 484658 487496 488880 489555 489088 487441 485415 483532 481604 479651 478220 477808 478970
56870D78970M044Q262J2101J3951J4367J5101J6766J8742K0589K2075K2438K0999
$$ 478970 483014 491276 503377 517328 531695 546796 563562 582304 602893 624968 647406 668405
56858F68405J8066J4074Q645J875m313p895r282j0432j1842j2264j1115r113o427
$$ 668405 686471 700545 709190 711065 706752 698857 689575 679143 667301 655037 643922 634809 628382
56845F28382k211L405Q657J2299J5198J8923K3689K8413L2051L4197L4957L4655
$$ 628382 626171 629576 638233 650532 665730 684653 708342 736755 768806 803003 837960 872615
56833H72615L3280K9968K3614J4328L765o118j4353k0942k6185l0152l2407l2211
$$ 872615 905895 935863 959477 973805 977570 971452 957099 936157 909972 879820 847413 815202
56821H15202k9374k4799j9793j5010j0372n664p03M555R503J2994J4833J6489
$$ 815202 785828 761029 741236 726226 715854 710190 709487 714042 723545 736539 751372 767861
56809G67861J9238K2066K2646K0058J5104Q252p69j1014j9798k5251k8202l0526
$$ 767861 787099 809165 831811 851869 866973 875225 874456 863442 843644 818393 790191 759665
56797G59665l2600l3366l2284k9988k7261k4186k0449j5973j1173o699k867M82
$$ 759665 727065 693699 661415 631427 604166 579980 559531 543558 532385 525686 522819 523301
56785E23301L379N265N870O139P214Q401P387L072k893q028j1540j4030j5711
$$ 523301 526680 531945 537815 543954 551168 559569 566956 570028 567135 559107 547567 533537 517826
56772E17826j6277j6171j6531j7697j8740j8655j7292j5073j2613j0853j0630
$$ 517826 501549 485378 468847 451150 432410 413755 396463 381390 368777 357924 347294
56761C47294j1538j1938j0724q676p236o427m978k544o29p55k514m162m648m142
$$ 347294 335756 323818 313094 304418 297182 290755 285777 283233 282604 281849 279335 275173 270525 266383
56747B66383k997j420k34o71k711m437l949j565O14J067N4j304k258k644k497
$$ 266383 263386 261966 261732 261061 258350 253913 249964 248399 249013 250080 250134 248830 246572 243928 241431
56732B41431j977j429j289j792k642k965j972n7J231Q23m84r98l20L22P3k34N27
$$ 241431 239454 238025 236736 234944 232302 229337 227365 227308 228539 229362 228878 227880 227560 227882 227955 227721 228248
56715B28248J804J863K15j403j029J079K730K374P09n19o44l19pO84J923K789
$$ 228248 230052 231915 232130 230727 229698 230777 233507 235881 236590 236071 235427 235108 235101 235785 237708 240497
56699B40497K236N66q97j484j827k603l259k578l30K167L282K642J310N76Q98
$$ 240497 242733 243299 242402 240918 239091 236488 233229 230651 230321 232488 235770 238412 239722 240298 241196
56684B41196J850K630K590J789J251K103M059N373M832L328K590K974L519L846
$$ 241196 243046 245676 248266 250055 251306 253409 257468 262841 267673 271001 273591 276565 280084 283930
56670B83930M625O097P512Q348Q824Q866P798N724L993L500L588L487L644M496
$$ 283930 288555 294652 302164 310512 319336 328202 336000 341724 345717 349217 352805 356292 359936 364432
56656C64432N029M075K324J393J364R06k55o88M88K043K119N37j038r28R33L066
$$ 364432 369461 373536 375860 377253 378617 379523 379268 378580 379068 381111 383230 383767 382729 381801 382734 385800
56640C85800L945L327J911K9k388m502m704k925j477k164l642l461j901j533l228
$$ 385800 389745 393072 394983 395012 392624 388122 383418 380493 379016 376852 373210 369749 367848 366315 363087
56625C63087m935m828l493k187r57L18O69o26k522l490l500l470l413k535q75
$$ 363087 358152 353324 349831 347644 346687 347005 347674 347048 344526 341036 337536 334066 330653 328118 327243
56610C27243M56P19L19J07N72J607K544K535J463K09l76m78q00j486k250l112
$$ 327243 327699 328418 328737 328844 329416 331023 333567 336102 337565 337774 337398 336920 336120 334634 332384 329272
56594C29272m101m492l317p84J588K405J468n12k571l778l629k533j500j037o99
$$ 329272 325171 320679 317362 316578 318166 320571 322039 321527 318956 315178 311549 309016 307516 306479 305780
56579C05780J05J228K018K176K068K298L022L673L525K589J768J820K502L170
$$ 305780 305885 307113 309131 311307 313375 315673 318695 322368 325893 328482 330250 332070 334572 337742
56565C37742L876N065O404O919O535O432P341Q316P947O126L858J880M41k3Q33
$$ 337742 341618 346683 353087 360006 366541 372973 380314 388630 396577 402703 406561 408441 408882 408859 409692
56550D09692K300K935K089L18j721l836n641o258n315l581k194j632j613j499
$$ 409692 411992 414927 417016 417334 415613 411777 406136 399878 394563 390982 388788 387156 385543 384044
56536C84044o71P01J190m96l435m991m026k321j907k436k508k347l201m862n847
$$ 384044 383373 384074 385264 384768 381333 376342 372316 369995 368088 365652 363144 360797 357596 352734 346887
56521C46887n778n634n644m936l597l044l756m331l688k610k177k116j837j710
$$ 346887 341109 335475 329831 324895 321298 318254 314498 310167 306479 303869 301692 299576 297739 296029
56507B96029k052j926m99J178J332l8j232j311j163j886l153l612k416%K399L740
$$ 296029 293977 292051 291552 292730 294062 294024 292792 291481 290318 288432 285279 281667 279251 279251 281650 285390
56491B85390L776K750R60j080k415k439j726j174m85J262L571M584L633K160J411
$$ 285390 289166 291916 292876 291796 289381 286942 285216 284042 283557 284819 288390 292974 296607 298767 300178
56476C00178P82n19j714j750j172j133j419j047j16N60J070K086L247L480K708
$$ 300178 300960 300441 298727 296977 295805 294672 293253 292206 292090 292650 293720 295806 299053 302533 305241
56461C05241J909J575J436J538K202K945K673J136q07k366l264l148j724M29K132
$$ 305241 307150 308725 310161 311699 313901 316846 319519 320655 319848 317482 314218 311070 309346 309775 311907
56446C11907K824K723K010Q31j31j26N80R66N78j02m43p2J012J962J382q88k909
$$ 311907 314731 317454 319464 320295 320164 320038 320618 321584 322162 322060 321617 321545 322557 324519 325901 325013 322104
56429C22104k887j539q15r48o03M93J167R91Q57J101J022N22L95N16k51j793k266
$$ 322104 319217 317678 316863 315915 315312 315805 316972 317963 318820 319921 320943 321465 321860 322376 322125 320332 318066
56412C18066q06J079J820J863K227K472J592r9j382j744j438n91O38J576J666
$$ 318066 317260 318339 320159 322022 324249 326721 328313 328214 326832 325088 323650 323059 323697 325273 326939
56397C26939J320J371J940K417K224J294R6n70k81M31P97R01J203J263L56o80
$$ 326939 328259 329630 331570 333987 336211 337505 337601 337031 336750 337181 337978 338879 340082 341345 341701 341021
56381C41021M3K617M690M469K971K273K974M307N510N904M853K898J795K202K472
$$ 341021 341064 343681 348371 352840 355811 358084 361058 365365 370875 376779 381632 384530 386325 388527 390999
56366C90999J224j75M05K287K721J004m45M20K571L681L180K360K088J732M34
$$ 390999 392223 392048 392453 394740 397461 398465 398020 398440 401011 404692 407872 410232 412320 414052 414486
56351D14486j392k347j658k3J274J737J695J393P96K80O24K078L930N230N440
$$ 414486 413094 410747 409089 409066 410340 412077 413772 415165 415961 416241 416865 418943 422873 428103 433543
56336D33543M479K920J949K275L063K973K180J982K361J730l06j731p37J908M258
$$ 433543 438022 440942 442891 445166 448229 451202 453382 455364 457725 459455 459149 457418 456681 458589 462847
56321D62847N511N694M469K153P60K058M888O356N474L994L644M087L995K910
$$ 462847 468358 474052 478521 480674 481434 483492 488380 494736 500210 504204 507848 511935 515930 518840
56307E18840J604J356K935N671P632P548O325N852O598P393P367O908O572O251
$$ 518840 520444 521800 524735 530406 538038 545586 551911 557763 564361 571754 579121 586029 592601 598852
56293E98852N709N131M846N150O506R140J2109J3649J2954J1157J0122J0572J1694
$$ 598852 604561 609692 614538 619688 626194 635334 647443 661092 674046 685203 695325 705897 717591
56280G17591J2358J2345J2346J2946J3878J4422J4438J4562J5401J6922J8716
$$ 717591 729949 742294 754640 767586 781464 795886 810324 824886 840287 857209 875925
56269H75925K0391K1671K2673K4241K7241L1232L4688L6997L9508M3984N0544
$$ 875925 896316 917987 940660 964901 992142 1023374 1058062 1095059 1134567 1178551 1229095
56258A229095N7828O4677P1189P8421Q7523R8614J10233J20539J29304J37746
$$ 1229095 1286923 1351600 1422789 1501210 1588733 1687347 1797580 1918119 2047423 2185169
56248B185169J46086J52597J55935J57019J57087J54874J47550J34174J16606
$$ 2185169 2331255 2483852 2639787 2796806 2953893 3108767 3256317 3390491 3507097
56239C507097R6912P5328N1143K4637k410k7598m9193o6998q2068r5355j06773
$$ 3507097 3604009 3679337 3730480 3755117 3752707 3725109 3675916 3608918 3526850 3431495 3324722
56228C324722j15655j21603j24557j24735j23052j20885j18741j15754j11179
$$ 3324722 3209067 3087464 2962907 2838172 2715120 2594235 2475494 2359740 2248561
56219B248561j05565r9741r3566q6809q0411p5423p1173o5940n9346n2747m7304
$$ 2248561 2142996 2043255 1949689 1862880 1782469 1707046 1635873 1569933 1510587 1457840 1410536
56208A410536m2836l8767l5100l2059k9400k6460k2823j8989j6296j5497j5356
$$ 1410536 1367700 1328933 1293833 1261774 1232374 1205914 1183091 1164102 1147806 1132309 1116953
56197A116953j3776j0672q256p747p391n210k188p24r73j005K4J121J656K163
$$ 1116953 1103177 1092505 1084249 1076502 1069111 1063901 1061713 1060989 1060016 1059011 1059035 1060156 1061812 1063975
56183A063975K884L387L735M373M852M504M226N581Q038R400R251R575J1252J2503
$$ 1063975 1066859 1070246 1073981 1078354 1083206 1087710 1091936 1097517 1105555 1114955 1124206 1133781 1145033 1157536
56169A157536J2026J1366J2417J4376J5144J4520J3994J4272J5008J6442J9364
$$ 1157536 1169562 1180928 1193345 1207721 1222865 1237385 1251379 1265651 1280659 1297101 1316465
56158A316465K3406K7021K9507L1942L5680M0725M6131N1508N7712O6052P7000
$$ 1316465 1339871 1366892 1396399 1428341 1464021 1504746 1550877 1602385 1660097 1726149 1803149
56147A803149Q9722J02710J14363J22726J25343J20575J09291R4653Q0058O7700
$$ 1803149 1892871 1995581 2109944 2232670 2358013 2478588 2587879 2682532 2762590 2830290
56137B830290N8804N3813N1849N0604M7501M0842L0223J6900L896n367r432r759
$$ 2830290 2889094 2942907 2994756 3045360 3092861 3133703 3163926 3180826 3184722 3179355 3169923 3160164
56125C160164r349j1217j7802l0256m7214o5009q0031r0550r6120r6289r0967
$$ 3160164 3150815 3139598 3121796 3091540 3044326 2979317 2899286 2808736 2712616 2616327 2525360
56114B525360q1504p0212n8701m7309l6146k6030j8027j2267p665l081J431M928
$$ 2525360 2443856 2373644 2314943 2267634 2231488 2205458 2187431 2175164 2167499 2164418 2165849 2170777
56102B170777P152R064J1395J3583J4872J5770J7316J9340K0758K1256K1477K1746
$$ 2170777 2177929 2186993 2198388 2211971 2226843 2242613 2259929 2279269 2300027 2321283 2342760 2364506
56090B364506K1916K2463K4135K6377K7577K7310K7002K7881K9578L1319L3101
$$ 2364506 2386422 2408885 2433020 2459397 2486974 2514284 2541286 2569167 2598745 2630064 2663165
56079B663165L5044L6693L7856L9050M0445M1401M1798M2660M4566M6471M7173
$$ 2663165 2698209 2734902 2772758 2811808 2852253 2893654 2935452 2978112 3022678 3069149 3116322
56068C116322M7084M7476M8740N0415N2203N3922N5081N5595N6375N8067N9735
$$ 3116322 3163406 3210882 3259622 3310037 3362240 3416162 3471243 3526838 3583213 3641280 3701015
56057C701015N9982N9123N9002O0647O3074O4665O4975O4984O6068O8895P3066
$$ 3701015 3760997 3820120 3879122 3939769 4002843 4067508 4132483 4197467 4263535 4332430 4405496
56046D405496P7638Q1967Q5890Q9317R2218R4918R7715J00230J02075J04145J07935
$$ 4405496 4483134 4565101 4650991 4740308 4832526 4927444 5025159 5125389 5227464 5331609 5439544
56035E439544J13165J17496J19573J21007J24151J28998J33820J38082J42847
$$ 5439544 5552709 5670205 5789778 5910785 6034936 6163934 6297754 6435836 6578683
56026F578683J48558J54283J59526J65435J73423J83427J94027K03715K11706
$$ 6578683 6727241 6881524 7041050 7206485 7379908 7563335 7757362 7961077 8172783
56017H172783K18109K23910K30547K39028K49307K60394K71197K81523K92416
$$ 8172783 8390892 8614802 8845349 9084377 9333684 9594078 9865275 10146798 10439214
56008A0439214L05207L20084L35975L52030L68659L86686M05989M25821M46147
$$ 10439214 10744421 11064505 11400480 11752510 12121169 12507855 12913844 13339665 13785812
55999A3785812M67942M92192N19151N48624N80356O14131O49909O88116P29510
$$ 13785812 14253754 14745946 15265097 15813721 16394077 17008208 17658117 18346233 19075743
55990A9075743P74605Q23387Q75797R32356R94242J062521J137387J218443J305977
$$ 19075743 19850348 20673735 21549532 22481888 23476130 24538651 25676038 26894481 28200458
55981B8200458J401716J507910J625939J756315J899944K058797K235518K433120
$$ 28200458 29602174 31110084 32736023 34492338 36392282 38451079 40686597 43119717
55973D3119717K655115K905343L187725L507062L870164M285494M761798N308233
$$ 43119717 45774832 48680175 51867900 55374962 59245126 63530620 68292418 73600651
55965G3600651N936237O660299P496307Q459753R565551J0827891J2258572J3865143
$$ 73600651 79536888 86197187 93693494 102153247 111718798 122546689 134805261 148670404
55957A48670404J5650283J7611604J9740004K2015686K4399904K6819832K9146404
$$ 148670404 164320687 181932291 201672295 223687981 248087885 274907717 304054121
55950C04054121L1169545L2578447L2961153L1847434K8814893K3644134J6460142
$$ 304054121 335223666 367802113 400763266 432610700 461425593 485069727 501529869
55943E01529869P779506j577252j0677173j8688487k5036348k9462345l1996116
$$ 501529869 509309375 507732123 497054950 478366463 453330115 423867770 391871654
55936C91871654l2873509l2438489l1057107k9060272k6718676k4240131k1775083
$$ 391871654 358998145 326559656 295502549 266442277 239723601 215483470 193708387
55929A93708387j9423099j7241879j5259524j3485264j1914975j0534568r325195
$$ 193708387 174285288 157043409 141783885 128298621 116383646 105849078 96523883
55922I6523883q268374p347148o544637n844189n231301m694183m222606l807491
$$ 96523883 88255509 80908361 74363724 68519535 63288234 58594051 54371445 50563954
55914E0563954l441476l118549k832874k578875k352364k150600j971015j810585
$$ 50563954 47122478 44003929 41171055 38592180 36239816 34089216 32118201 30307616
55906C0307616j666332j535707j416598j307687j208730j119882j041065r72347
$$ 30307616 28641284 27105577 25688979 24381292 23172562 22052680 21011615 20039268
55898B0039268r13871q64082q18712p73367p27256o82973o42570o05375n69978
$$ 20039268 19125397 18261315 17442603 16669236 15941980 15259007 14616437 14011062 13441084
55889A3441084n36575n06158m78482m52117m26221m01323l78343l57439l37953
$$ 13441084 12904509 12398351 11919869 11467752 11041531 10640208 10261865 9904426 9566473
55880I566473l19353l02014k87085k75387k66577k59353k52242k43991k33756
$$ 9566473 9247120 8945106 8658021 8382634 8116057 7856704 7604462 7360471 7126715
55871G126715k21593k08632j96359j85686j76872j69886j64359j59512j54762
$$ 7126715 6905122 6696490 6500131 6314445 6137573 5967687 5803328 5643816 5489054
55862E489054j50224j46212j42481j38445j33809j28568j22718j16522j10723
$$ 5489054 5338830 5192618 5050137 4911692 4777883 4649315 4526597 4410075 4299352
55853D299352j05947j02114r8846r5928r2961q9196q4545q0170p7280p5716p4495
$$ 4299352 4193405 4091291 3992445 3896517 3803556 3714360 3629815 3549645 3472365 3396649 3322154
55842C322154p3203p1915p0309o7994o5511o3870o3086o2094o0123n7370n4423
$$ 3322154 3248951 3177036 3106727 3038733 2973222 2909352 2846266 2784172 2724049 2666679 2612256
55831B612256n1717m9465m7452m5173m2742m1208m1194m1742m1485m0435l9630
$$ 2612256 2560539 2511074 2463622 2418449 2375707 2334499 2293305 2251563 2210078 2169643 2130013
55820B130013l9457l9449l9339l8991l7783l5345l2603l0698k9258k7291k5287
$$ 2130013 2090556 2051107 2011768 1972777 1934994 1899649 1867046 1836348 1807090 1779799 1754512
55809A754512k4538k4544k3307k0473j7964j6897j6031j4320j2917j3132j4081
$$ 1754512 1729974 1705430 1682123 1661650 1643686 1626789 1610758 1596438 1583521 1570389 1556308
55798A556308j4023j2934j2028j1603j0992j0120r474q831p536o150o632j0548
$$ 1556308 1542285 1529351 1517323 1505720 1494728 1484608 1475134 1466303 1458767 1452617 1445985 1435437
55786A435437j7639k6080l3332l7066l6367l2530k8064k4435k0991j6142r417
$$ 1435437 1417798 1391718 1358386 1321320 1284953 1252423 1224359 1199924 1178933 1162791 1153374
55775A153374k279K699L413n86p966j6376k3512k7872k9025k7405k3948j9890
$$ 1153374 1151095 1153794 1157207 1156621 1148655 1132279 1108767 1080895 1051870 1024465 1000517 980627
55763I80627j6503j4366j2702j0140o575l761l372n028o941q067q600q670p757
$$ 980627 964124 949758 937056 926916 920341 916580 913208 908180 901239 893172 884572 875902 868145
55750H68145n681l209j385p08j117k172l290m312n684p561r195j0007j0738j2373
$$ 868145 862464 859255 857870 857162 856045 853873 850583 846271 840587 833026 823831 813824 803086 790713
55736G90713j4348j5335j5582j6639j8520j9045j6903j3872j2740j4074j6065
$$ 790713 776365 761030 745448 728809 710289 691244 674341 660469 647729 633655 617590
55725F17590j6780j5520j2676r442p403p399q770j0070j0364r598q301p306p254
$$ 617590 600810 585290 572614 563172 555769 548370 539600 529530 519166 509568 501267 493961 486707
55712D86707p937q439q129p067n580m110l544m559o318o844n315l125k185k977
$$ 486707 478770 470331 462202 455135 449555 445445 441901 437342 431024 424180 418865 415740 413555 410578
55698D10578m662o185o765o254n620o109p434p871o827n815n943n901m023j252
$$ 410578 405916 399731 392966 386712 381092 374983 367549 359678 352851 347036 341093 335192 331169 329917
55684C29917o5r63j909j288J48P06m3j016r18M15J770J768N95q5O62J796J978
$$ 329917 329852 328889 326980 325692 325840 326546 326503 325487 324569 324984 326754 328522 329117 329032 329694 331490 333468
55667C33468J523J525J850J549P19L08K90k70j326j725j224r55j357j340k78N92
$$ 333468 334991 336516 338366 339915 340634 340942 341232 340962 339636 337911 336687 335732 334375 333035 332757 333349
55651C33349m6j576k434k352k276k541k509j893j352j545k348l171l488k966j705
$$ 333349 333303 331727 329293 326941 324665 322124 319615 317722 316370 314825 312477 309306 305818 302852 301147
55636C01147m52J1j06L73K202M722O603P221P045O982P773R683J2162J3862J3694
$$ 301147 300695 300706 300600 300973 303175 307897 314500 321721 328766 335748 343521 353204 365366 379228 392922
55621C92922J1970R943Q199O196L751J856J276J077k46k549m167m194l392k709
$$ 392922 404892 414835 423034 429230 432981 434837 436113 437190 436944 434395 430228 426034 422642 419933
55607D19933k177j683j637k158k588k588k902m180n878p223q516j0323j1994j2360
$$ 419933 417756 416073 414436 412278 409690 407102 404200 400020 394142 386919 378403 368080 356086 343726
55593C43726j1622j1186j1588j1969j1793j1783j2486j3039j2306j0600r338r228
$$ 343726 332104 320918 309330 297361 285568 273785 261299 248260 235954 225354 216016 206788
55581B06788r665r810r598r386r197q651p473n831m165k862k070j700j520j330
$$ 206788 197123 187313 177715 168329 159132 150481 143008 137177 133012 130150 128080 126380 124860 123530
55567A23530j158j257j861k859l799m226l968l186k258j537j162j079j272j773
$$ 123530 122372 121115 119254 116395 112596 108370 104402 101216 98958 97421 96259 95180 93908 92135
55553I2135k330k337j441q0Q54R03L89J5K68R62J264M88p55r22M71J852J549J09
$$ 92135 89805 87468 86027 85947 86801 87704 88093 88108 88376 89338 90602 91090 90335 89413 89884 91736 93285 93394
55535I3394m90L51J356J611J695K117K169J177k28j025j147j132j196j423k036
$$ 93394 92904 93255 94611 96222 97917 100034 102203 103380 103152 102127 100980 99848 98652 97229 95193
55520I5193k760k720j718p57n26l21N00R68j52k192l293k840j830j011j31R19
$$ 95193 92433 89713 87995 87238 86712 86391 86891 87859 87707 85515 82222 79382 77552 76541 76410 77329
55504G7329J656J921K125K263J704L15r71j086J37J961L298L441K811K806M308
$$ 77329 78985 80906 83031 85294 86998 87313 86342 85256 85393 87354 90652 94093 96904 99710 104018
55489A04018O625Q540R869J1023J1608J0981R884R810J0597J0329Q168N588M102
$$ 104018 110643 119183 129052 140075 151683 162664 172548 182358 192955 203284 211452 217040 221142
55476B21142L170J543n95k183l205m555o381p819q397q659r274j0235j1115j1590
$$ 221142 224312 225855 225260 223077 219872 215317 208936 201117 192720 184061 174787 164552 153437 141847
55462A41847j1554j1055j0208r109p894o859o173n422m071k563k238l556n102
$$ 141847 130293 119238 109030 99921 92027 85168 78995 73573 69502 66939 64701 61145 56043
55449E6043n089l491j851j244j342j353r93l99K47O75O70M48M35N65L41k39n56
$$ 56043 50954 47463 45612 44368 43026 41673 40680 40281 40528 41203 41873 42321 42756 43321 43662 43423 42867
55432D2867m51p64k097l587l807k758j959k446l532l986l691l364l175k598j505
$$ 42867 42416 41652 39555 35968 32161 29403 27444 24998 21466 17480 13789 10425 7250 4652 3147
55417C147m75J16N76J075J149M86l79q18j001j363A010C70J005K204K204J447
$$ 3147 2672 2788 3364 4439 5588 6074 5695 4877 3876 2513 1010 370 1375 3579 5783 7230
55401G230O37n9n39m14K71N92q2r57p03O98J837J696P03j93p34j206j607j601
$$ 7230 7867 7808 7269 6855 7126 7718 7636 6679 5976 6674 8511 10207 10910 10717 9983 8777 7170 5569
55383E569j062j75R03K024K774K670J750O33j28n28q17r32n36M35J440J699R51
$$ 5569 4507 4332 5235 7259 10033 12703 14453 15086 14958 14430 13613 12681 12145 12580 14020 15719 16670
55366A6670k33j020j287j744k921m236G21b600j491l2Q17J513E74L154L292K319
$$ 16670 16437 15417 14130 12386 9465 5229 721 -2600 -4091 -4123 -3306 -1793 574 3728 7020 9339
55350I339L23j897l232A504a8B81J214O06p24D03N81K239J673r49I45a821j276
$$ 9339 9662 7765 4533 1504 -18 281 1495 2101 1377 403 984 3223 4896 3947 945 -1821 -3097
55333c097j91L99R43Q59l07j300p62L94L65m36l1a558G52J345N98J381K401K249
$$ -3097 -3288 -2889 -1946 -1087 -1394 -2694 -3456 -3062 -2697 -3133 -3164 -1558 752 2097 2695 4076 6477 8726
55315H726J627J525J124n10k213k320j428j407k414b58k519j836r82Q88a224C695
$$ 8726 10353 11878 13002 12492 10279 7959 6531 5124 2710 -258 -2777 -4613 -5595 -4707 -1224 3695
55298G683J589o20j885k164j434P6J627K483K405J416k86k011k860k523j416M5
$$ 7683 9272 8652 6767 4603 3169 3245 4872 7355 9760 11176 10890 8879 6019 3496 2080 2125
55282B125J654K885K949J721Q3j015j430j524j420q99J38J374K177K100J335O03
$$ 2125 3779 6664 9613 11334 11417 10402 8972 7448 6028 5129 5267 6641 8818 10918 12253 12856
55266A2856L90M33J05q84k246l320l450A231g46k436l351k807l29K035K330J380
$$ 12856 13246 13679 13784 12900 10654 7334 3884 1231 -746 -3182 -6533 -9340 -9669 -7634 -5304 -3924
55250c924J430B32L352K222N71q9J25K70R6j53n53j262j876A166B98L08J202J626
$$ -3924 -2494 232 3584 5806 6377 6288 6413 6683 6779 6626 6073 4811 2935 1166 298 606 1808 3434
55232C434J774J932J908R96j047l140B089f16j125O5e75A729L079K593R74p23
$$ 3434 5208 7140 9048 10044 8997 5857 2089 -616 -1741 -1676 -575 1729 4808 7401 8375 7652
55216G652j466r17M29J506J426K60j193k358B147a395k945j474j49P4n39q57k66
$$ 7652 6186 5269 5698 7204 8630 8890 7697 5339 2147 -1395 -4340 -5814 -5963 -5889 -6428 -7285 -7551
55199g551P05J114P29K95O78J755A01J708K98n50l71J01J09l06B74a217k423l052
$$ -7551 -6846 -5732 -5003 -4708 -4030 -2275 101 1809 2107 1557 1186 1287 1396 1090 274 -1217 -3640 -6692
55181f692k582j150Ro9p02j92K018M330b76C015J669Q90K86o86j105p4J483J774
$$ -6692 -9274 -10424 -10415 -10484 -11186 -11378 -9360 -5030 -276 3015 4684 5574 5860 5174 4069 3995 5478 7252
55163G252M93r96j564j332q84n73o65C81a953l015k925j734P16L642h9D125K000
$$ 7252 7745 6749 5185 3853 2969 2396 1731 381 -1953 -4968 -7893 -9627 -8911 -5269 -89 4125 6125
55146F125P69R21R76J63m71JQ25P17l63j384j644j290q74p73q47n44L15J060J088
$$ 6125 6894 7815 8791 8954 8483 8484 9309 10026 9663 8279 6635 5345 4471 3698 2851 2307 2622 3682 4770
55127D770Q64J161J505O79j122j980o81J585K630J643m84k507l789F9c696k455
$$ 4770 5634 6795 8300 8979 7857 5877 5196 6781 9411 11054 10570 8063 4274 69 -3696 -6151
55111f151l55J918a283A961K329J516R73L37k94m19k7M92J055J709K044J703J114
$$ -6151 -6506 -4588 -1283 1961 4290 5806 6779 7116 6822 6403 6376 6868 7923 9632 11676 13379 14493
55094A4493P52L35j92K58K147L498K163o22j488K70J922J741J167J511J517K5
$$ 14493 15245 15580 15388 15646 17793 21291 23454 22832 21344 21614 23536 25277 26444 27955 29472 29497
55078B9497j481j310n07r47k023j800l86K81n21j655k086j654k61J887L473L276
$$ 29497 28016 26706 26199 25252 23229 21429 21043 21324 20803 19148 17062 15408 15147 17034 20507 23783
55062B3783J958J176J232J054K64m45q66j576k596l231l273l087k479r83P36J295
$$ 23783 25741 26917 28149 29203 29467 29022 28156 26580 23984 20753 17480 14393 11914 10931 11667 12962
55046A2962P12O66K042L481L125J023r93j402m59K91k12j258j224J59J213N69
$$ 12962 13674 14340 16382 19863 22988 24011 23018 21616 21157 21448 21236 19978 18754 18913 20126 20695
55030B0695q89j377p09o4K01P88J690J899J166N02M20K8j403l059l596k781j376
$$ 20695 19806 18429 17720 17656 17857 18645 20335 22234 23400 23902 24322 24350 22947 19888 16292 13511 12135
55013A2135Q0J579L007L735K983O76k052l487k920j328j05L90N22L15l05p31l37
$$ 12135 12215 13794 16801 20536 23519 24195 22143 18656 15736 14408 14303 14693 15215 15530 15225 14494 14157
54996A4157L34K90k07j5R15J453J280J335J882J811O82j22O06J890J925N43r33
$$ 14157 14491 14781 14574 14559 15474 16927 18207 19542 21424 23235 23917 23795 24401 26291 28216 28759 27826
54979B7826j701j991j956j362l48M92R46J245J305P39k08n48K29J417J931J544
$$ 27826 26125 24134 22178 20816 20468 20960 21906 23151 24456 25195 24987 24439 24668 26085 28016 29560
54963B9560R26O99Q75J114J158Q75J68q57j683j697q65J9J68j49J70J512K537
$$ 29560 30486 31185 32060 33174 34332 35207 35375 34518 32835 31138 30273 30292 30460 30311 30481 31993 34530
54946C4530J387j875m578l989m44K735K872P17r58q24J62R90K018L613M813M540
$$ 34530 35917 34042 29464 25475 25031 27766 30638 31355 30397 29573 29735 30725 32743 36356 41169 45709
54930D5709L353K672K718K471J648J464K984N601P731Q607Q777R020R186Q334
$$ 45709 49062 51734 54452 56923 58571 60035 63019 68620 76351 84958 93735 102755 111941 120275
54916A20275N915K588l11j998k787l506m807o831q964r979r189p496o440o126
$$ 120275 126190 128778 128467 126469 123682 120176 115369 108538 99574 89595 80406 72910 66470 60344
54902F0344n207l365k339l472n468n896m178j673N17K213L008K296O48k33O11
$$ 60344 55137 51772 49433 45961 40493 34597 30419 28746 29263 31476 34484 36780 37428 37195 37806
54887C7806K545M407N487N362M086K769K832M273N629N949N760N752N678N151
$$ 37806 40351 44758 50245 55607 59693 62462 65294 69567 75196 81145 86905 92657 98335 103486
54873A03486M485L958L083J357r46l241n309o884p467p243p399q514r273p968
$$ 103486 107971 111929 115012 116369 115423 112182 106873 99989 92522 85279 77880 69366 60093 52125
54859E2125n029k841k884m031m058k264j9R76N44K9O39J980K470J139j267l110
$$ 52125 47096 44255 41371 37340 33282 31018 30999 31975 32519 32548 33187 35167 37637 38776 37509 34399
54843C4399l433k555j339l25M03Q61J010R77J105J544J830J311O0j050j404j322
$$ 34399 30966 28411 27072 26747 27150 28011 29021 29998 31103 32647 34477 35788 35848 34798 33394 32072
54827C2072j303j085j48J153J798J456Q13L68k65j465k541k387r22N85Q49j58
$$ 32072 30769 29684 29536 30689 32487 33943 34756 35124 34859 33394 30853 28466 27544 28129 28978 28820
54811B8820j334j686j182l94L54J090J678J792J514J402J642J684J075J19o91
$$ 28820 27486 25800 24618 24224 24578 25668 27346 29138 30652 32054 33696 35380 36455 36574 35883
54796C5883j396k072k268j653q64p09q41k13J227K310K255J607J268J418J747
$$ 35883 34487 32415 30147 28494 27630 26921 26080 25867 27094 29404 31659 33266 34534 35952 37699
54781C7699K118K483K640K413J851J145O02P69K034L883M980M405K711J634K602
$$ 37699 39817 42300 44940 47353 49204 50349 50951 51720 53754 57637 62617 67022 69733 71367 73969
54766G3969N417Q299R445Q698P288N901L764K22l633n877o017n266m762m534m227
$$ 73969 79386 87685 97130 105828 113116 119017 122781 123003 119370 113493 107476 102210 97448 92914 88687
54751H8687l850l490k974k110q53P18K161K642J877Q43O52Q86J72j539k439j123
$$ 88687 84837 81347 78373 76263 75410 76128 78289 80931 82808 83651 84303 85189 85361 83822 81383 80260
54735H0260J534L333L088J583N07P09J439J388N46M11J884L877M934N407O411
$$ 80260 81794 85127 88215 89798 90305 91014 92453 93841 94387 94798 96682 100559 105493 110900 117311
54720A17311P263O028K646o04k322l597n500o931o534n263n163o371p112o349
$$ 117311 124574 130602 133248 132644 130322 126725 121225 114294 107760 102497 97334 90963 83851 77502
54706G7502m858l750l226l053l187l492l492k858j870j182j093j139n73N55J098
$$ 77502 72644 68894 65668 62615 59428 55936 52444 49586 47716 46534 45441 44302 43729 44284 45382
54691D5382J91j339j833j048l89o36q45j47O21J76j201k156k113j411p6K032M043
$$ 45382 45573 44234 42401 41353 40964 40328 39483 39336 39957 40133 38932 36776 34663 33252 33176 35208 39251
54674C9251M418K837O74o58j067j170j191r98o27j77M60J378K278K675K309J256
$$ 39251 43669 46506 47180 46522 45455 44285 43094 42096 41469 41292 41752 43130 45408 48083 50392 51648
54658E1648j34j128q80O77K252K100j18k762l773k643m73J507K754L000K095P05
$$ 51648 51514 50386 49506 50183 52435 54535 54417 51655 47882 45239 44766 46273 49027 52027 54122 54827
54642E4827J85J050K235K666K785L578M683M926M468M771O157O865N451K923J388
$$ 54827 55012 56062 58297 60963 63748 67326 72009 76935 81403 86174 92331 99196 104647 107570 108958
54627A08958J170N46j680m360n328m083k447k381l661m369l454j869r79q93r37
$$ 108958 110128 110674 108994 104634 99306 95223 92776 90395 86734 82365 78911 77042 76063 75170 74233
54612G4233q77q13o04l65q23k136l075k587j515j392k118k369j792j100m35L89
$$ 74233 73356 72543 71939 71574 70751 68615 65540 62953 61438 60046 57928 55559 53767 52667 52232 52621
54596E2621M76j064k687j726J472L277J654j125j896n76Q67J479J599J506J438
$$ 52621 53097 52033 49346 47620 49092 52369 54023 52898 51002 50426 51293 52772 54371 55877 57315
54581E7315J836K210J060j629l410k520n55o9r06j164o10o35j346j414o14j32
$$ 57315 59151 61361 62421 60792 57382 54862 54307 54238 53332 52168 51558 50923 49577 48163 47549 47417
54565D7417j83L76J638J954M66j446k108j547p06O6Q46J429J684J947K313K185
$$ 47417 47234 47610 49248 51202 51668 50222 48114 46567 45861 45927 46773 48202 49886 51833 54146 56331
54549E6331J158j44p78o73n05o29o84k54M68R13Q79Q17J141J467J087J47k88K75
$$ 56331 57489 57345 56567 55894 55389 54760 54076 53822 54290 55203 56082 56899 58040 59507 60594 60741 60453 60728
54531F0728R65P77M6k0J069K648L795M005L272K098J273J154J314J272J233J474
$$ 60728 61693 62470 62516 62496 63565 66213 70008 74013 77285 79383 80656 81810 83124 84396 85629 87103
54515H7103J496N01j386l089l748l396k635k015j705j443r34m28n57j356j929
$$ 87103 88599 89100 87714 84625 80877 77481 74846 72831 71126 69683 68749 68321 67764 66408 64479
54500F4479j425l4J322J817J125m51j878k076j064J19Q70J592K460K634J413n49
$$ 64479 63054 63020 64342 66159 67284 66833 64955 62879 61815 61934 62804 64396 66856 69490 70903 70354
54484G0354j980k341j900j084l53k4K56J098K042J733K7j285p70P39J568J413
$$ 70354 68374 66033 64133 63049 62696 62672 62928 64026 66068 67801 67828 66543 65773 66512 68080 69493
54468F9493J052Q65R02J518K616L039J907j11j918l388m441m025j700P41J181
$$ 69493 70545 71410 72312 73830 76446 79485 81392 81281 79363 75975 71534 67509 65809 66550 67731
54453F7731J5p66o38p07j230j128N2J532K706L535L619K526J003K94L14k7q14
$$ 67731 67746 66980 66342 65635 64405 63277 63329 64861 67567 71102 74721 77247 78250 78544 78858 78831 78017
54436G8017j099o72j28N82J823K573J235j631l451k916j287m5P73J301R64j84
$$ 78017 76918 76246 76118 76700 78523 81096 82331 80700 77249 74333 73046 73001 73774 75075 76039 75855
54420G5855q80m07L84N92N11O38P89R32J596K737L388L019K114R03r42k776k869
$$ 75855 74975 74568 74952 75544 76055 76693 77482 78414 80010 82747 86135 89154 91268 92171 91229 88453 85584
54403H5584q34J218J200m95j982k314j813r70j68K56M60R87J633J419K21p38p28
$$ 85584 84750 85968 87168 86673 84691 82377 80564 79594 79426 79682 80142 81129 82762 84181 84402 83664 82936
54386H2936n76j012j329p96j04j2L20J915L719L579J340p77r62K31J075P57j57
$$ 82936 82360 81348 80019 79223 79119 79107 79427 81342 85061 88640 89980 89203 88241 88472 89547 90304 90147
54369I0147o44j79J041K379L163K823J092j379k905k144K35J950J347j225m134
$$ 90147 89503 89324 90365 92744 95907 98730 99822 98443 95538 93394 93629 95579 96926 95701 91567
54354I1567n682m830j919J131K479K413K552L061K422L65j013k09J336J313l59
$$ 91567 85885 81055 79136 80267 82746 85159 87711 90772 93194 93559 92546 92337 93673 94986 94627
54339I4627k016k808l110l103k604j862j218l70Q03J307J96j716k736k514k068
$$ 94627 92611 89803 86693 83590 80986 79124 77906 77536 78339 79646 79842 78126 75390 72876 70808
54324G0808j894j543j006r49j329j162q5R53J047M02l07p21n15O66K326K955J675
$$ 70808 68914 67371 66365 65416 64087 62925 62840 63793 64840 65242 64935 64214 63699 64365 66691 69646 71321
54307G1321m39j433o81O88J312Q50j86j062j114j57J022J218L29k71M06J387J020
$$ 71321 70882 69449 68768 69456 70768 71618 71432 70370 69256 69099 70121 71339 71668 71397 71803 73190 74210
54290G4210n23j449r92l71n27o68M6P98M54n73j381k386m163n255l474P01M126
$$ 74210 73687 72238 71246 70875 70348 69680 69726 70524 70978 70405 69024 66638 62475 57220 53746 54447 58573
54273E8573M731L475K290J777J632J652J516P15n28j193p73J78J001J400J035
$$ 58573 63304 66779 69069 70846 72478 74130 75646 76361 75833 74640 73867 74045 75046 76446 77481
54258G7481j18r80m14Q98J196K83m61p32j766l582m252k880j078k43L93J510J767
$$ 77481 77363 76383 75969 76867 78063 78346 77885 77153 75387 71805 67553 64673 63595 63352 63745 65255 67022
54241F7022K07j370q49P50P64j113k654k437j171R0J089J710J674J044J06j013
$$ 67022 67229 65859 65010 65760 66524 65411 62757 60320 59149 59239 60328 62038 63712 64756 64862 63849
54225F3849j867j594k64O19J53m28L04J518J367j60j476k020k583l258k971j208
$$ 63849 61982 60388 60124 60743 60896 60468 60772 62290 63657 63497 62021 60001 57418 54160 51189 49981
54209D9981J244L328M253L338P85j576j861m56O05M41M3K99Q40J090J006N21n54
$$ 49981 51225 54553 58806 62144 62929 61353 59492 59036 59641 60082 60125 60424 61264 62354 63360 63881 63327
54192F3327j767k169j529m92M20J149J604J722J842K006J355n42k244j967k78
$$ 63327 61560 59391 57862 57370 57790 58939 60543 62265 64107 66113 67468 66926 64682 62715 62437
54177F2437M42o55j849j563l69M32N98M21l29j780l014k970j786n24J77N04P35
$$ 62437 62879 62224 60375 58812 58443 58875 59473 59894 59565 57785 54771 51801 50015 49491 49668 50172 50907
54160E0907P12K14n83j116j026n42r3L22R33J419J144L15M4P25J366J141O56P69
$$ 50907 51619 51833 51250 50134 49108 48566 48473 48795 49728 51147 52291 52606 52650 53375 54741 55882 56538 57307
54142E7307J069O38m54j453j979j835o01J411K640K079Q21M71Q41P56K37O0j42
$$ 57307 58376 59014 58560 57107 55128 53293 52692 54103 56743 58822 59643 60114 60955 61711 61948 62008 61866
54125F1866j284k766l049k033q89J25J605K955K813J531R33J331J135j01p26O6
$$ 61866 60582 57816 54767 52734 51845 51970 53575 56530 59343 60874 61807 63138 64273 64172 63446 63512
54109F3512P29jj048q81K21J164J732K012J547L77l12J58P67M40k80l63J5K11
$$ 63512 64241 64240 63192 62311 62532 63696 65428 67440 68987 69364 69052 69210 69977 70417 70137 69774 69789 70000
54091G0000N11J381K172K012J331J244J816K169J875J253O15J53K10Q11J226Q09
$$ 70000 70511 71892 74064 76076 77407 78651 80467 82636 84511 85764 86379 86532 86742 87553 88779 89588
54075H9588j05o88n94R2J281K561L026K230R33K15L53J015J969K882L089K407
$$ 89588 89483 88795 88201 88293 89574 92135 95161 97391 98324 98539 98892 99907 101876 104758 107847 110254
54059A10254J649J547J685J381J093J871L650N079N168M311L592L693M632O091
$$ 110254 111903 113450 115135 116516 117609 119480 123130 128209 133377 137688 141280 144973 149605 155696
54045A55696P745R379J0787J1590J1466J0542R394Q496P911P430O693N336L503
$$ 155696 163441 172820 183607 195197 206663 217205 226599 235095 243006 250436 257129 262465 265968
54032B65968K066J724K051K100J760J631J663J047m55k123l457m614n507n679
$$ 265968 268034 269758 271809 273909 275669 277300 278963 280010 279555 277432 273975 269361 263854 258175
54018B58175n437n857p150q304q801r252r635q603n759l226l177m786n408m214
$$ 258175 252738 246881 239731 231427 222626 213374 203739 195136 189377 186151 182974 178188 172780 168566
54004A68566k846k659l068k942k211j487j093j064j472k246k996l358l238k633
$$ 168566 165720 163061 159993 157051 154840 153353 152260 151196 149724 147478 144482 141124 137886 135253
53990A35253j491LJ258J643J101K32l31o31j184k067k661k601k349k283j866o09
$$ 135253 133762 133765 135023 136666 137767 137999 137668 137037 135853 133786 131125 128524 126175 123892 122026 121417
53974A21417O27M86q91j970j826q28N30K042K926K272P75M20J761L020K740J755
$$ 121417 122044 122530 121639 119669 117843 117015 117545 119587 122513 124785 125560 125980 127741 130761 133501 135256
53958A35256J443J493Q46k20m25P30K694M772O187O038M315K458J844K332L114
$$ 135256 136699 138192 139038 138818 138393 139123 141817 146589 152776 158814 163129 165587 167431 169763 172877
53943A72877M180N780P301P942P973Q088Q129P701P442Q261R615J0007R131Q289
$$ 172877 177057 182837 190138 198080 206053 214141 222270 229971 237413 245674 255289 265296 274427 282716
53929B82716Q690J0228J1832J2346J1346R915R975J1955J3803J3425J1457J0075
$$ 282716 291406 301634 313466 325812 337158 347073 357048 369003 382806 396231 407688 417763
53917D17763R658Q392N167J196j585k513k264j869k048k738l261l399l876n071
$$ 417763 427421 435813 440980 442176 440591 438078 435814 433945 431897 429159 425898 422499 418623 413552
53903D13552n966n661n240o477r070j0995j1533j2023j3261j4143j3639j2429
$$ 413552 407586 401925 396685 390208 381138 370143 358610 346587 333326 319183 305544 293115
53891B93115j1541j0680r102p120n599m641l745k852k314k180k270k771m135o344
$$ 293115 281574 270894 261792 254672 249073 244432 240687 237835 235521 233341 231071 228300 224165 217821
53877B17821q558r495q342n638l106k145k557l278l912m716n372n059l818k674
$$ 217821 209263 199768 191426 185788 182682 180537 177980 174702 170790 166074 160702 155643 151825 149151
53863A49151k069j378l97k0p83j787j962j623j774k528l089k898j893k7K549M925
$$ 149151 147082 145704 145307 145287 144504 142717 140755 139132 137358 134830 131741 128843 126950 126923 129472 134397
53847A34397N850M942L039J272L8j074k459l694l828k629j244r83j695k075j472
$$ 134397 140247 145189 148228 149500 149538 148464 146005 142311 138483 135854 134610 133627 131932 129857 128385
53832A28385n01J57N06N62O7n75j96J526L265L741L393L445M037M455M535M622
$$ 128385 127884 128041 128547 129109 129176 128601 128405 129931 133196 136937 140330 143775 147812 152267 156802 161424
53816A61424M545M080M065N467P359P525N717M649O672J0622J3271J3062J0988
$$ 161424 165969 170049 174114 179581 186940 194465 200182 204831 211503 222125 235396 248458 259446
53803B59446Q295N169J966N9L64J841K591K035J156Q20Q19O08k5j270l442o136
$$ 259446 267741 272910 274876 274935 275299 277140 279731 281766 282922 283742 284561 285169 285144 283874 280432 274296
53787B74296p955p785o115m583m407n690p777r561r800q118n798m714n262o009
$$ 274296 266341 258556 252441 247858 243451 237761 229984 220423 210623 202505 196707 191993 186731 180722
53773A80722n596m220k914k150j828j940k452k871k743k422k557k958k834k179
$$ 180722 175126 170906 167992 165842 164014 162074 159622 156751 154008 151586 149029 146071 143237 141058
53759A41058k000k749l375k637q73M00M18q3q8M63R39R44N56jm73o33n19m78o11
$$ 141058 139058 136309 132934 130297 129424 129824 130242 130159 130071 130534 131473 132417 132973 132972 132499 131866 131347 130869 130258
53740A30258m85K92J418K219K411K058J096l55j366q28J057K708K940K147J346
$$ 130258 129773 130065 131483 133702 136113 138171 139267 138912 137546 136718 137775 140483 143423 145570 146916
53725A46916Q14L77L15J066K260K945K702J923J079M29L50J168K465L262L180
$$ 146916 147730 148107 148422 149488 151748 154693 157395 159318 160397 160826 161176 162344 164809 168071 171251
53710A71251K859K900L031K798K538K944L913M610M654M510M470M007K747J461
$$ 171251 174110 177010 180041 182839 185377 188321 192234 196844 201498 206008 210478 214485 217232 218693
53696B18693J299K225L095L304L327L397K683O65j569k528k358k403k950k770
$$ 218693 219992 222217 225312 228616 231943 235340 238023 238688 237119 234591 232233 229830 226880 224110
53682B24110j168Q28J972K346K583K398J034j152k599k183m44R67P92p17k066
$$ 224110 222942 223770 225742 228088 230671 233069 234103 232951 230352 228169 227725 228692 229484 228767 226701
53667B26701k020r20j32k71n48j74M76M96l32j494k406k541j522K84J699K020
$$ 226701 224681 223761 223629 223358 222810 222636 223112 223608 223276 221782 219376 216835 215313 215597 217296 219316
53651B19316J777J667J304O4j394j684o11O19J226J676K425K969K751K210K197
$$ 219316 221093 222760 224064 224128 222734 221050 220439 221058 222284 223960 226385 229354 232105 234315 236512
53636B36512K767L250L215K789K200J600J370J965L166L899L317J958J284J940
$$ 236512 239279 242529 245744 248533 250733 252333 253703 255668 258834 262733 266050 268008 269292 271232
53622B71232L098L795M196M856N424N186M661N209O829P761O772M808L542L287
$$ 271232 274330 278125 282321 287177 292601 297787 302448 307657 314486 322247 329019 333827 337369 340656
53608C40656L311L340L624L954L799L281L107L528L966L581J938n27k339j992
$$ 340656 343967 347307 350931 354885 358684 361965 365072 368600 372566 376147 378085 377558 375219 373227
53594C73227K57K208K108O01m36l02K68N38K57q22k545l769l414k083j385j788
$$ 373227 373484 375692 377800 378401 377965 377663 377931 378469 378726 377904 375359 371590 368176 366093 364708 362920
53578C62920k311k347k429l001l607l702l319k634j761j172j468k411l045k891
$$ 362920 360609 358262 355833 352832 349225 345523 342204 339570 337809 336637 335169 332758 329713 326822
53564C26822k224j159M78K102K415J124l65o00K61J065J232J074J087J514K306
$$ 326822 324598 323439 323917 326019 328434 329558 329193 328593 328854 329919 331151 332225 333312 334826 337132
53549C37132L055L290L157L407M377N428N725N251M763N012O255Q083R566R902
$$ 337132 340187 343477 346634 350041 354418 359846 365571 370822 375585 380597 386852 394935 404501 414403
53535D14403R302Q992J0056J2365J4701J5869J5689J5058J5001J5688J6610J7641
$$ 414403 423705 432697 442753 455118 469819 485688 501377 516435 531436 547124 563734 581375
53523E81375J9184K1085K2367K2668K3036K4320K5695K6134K6599K8927L2742
$$ 581375 600559 621644 644011 666679 689715 714035 739730 765864 792463 821390 854132
53512H54132L5431L5556L4584L4581L5615L6366L6091L5094L4015L3430L3522
$$ 854132 889563 925119 959703 994284 1029899 1066265 1102356 1137450 1171465 1204895 1238417
53501A238417L3571L2466L0293K8629K8636K9608L0051K9474K8448K7607K7383
$$ 1238417 1271988 1304454 1334747 1363376 1392012 1421620 1451671 1481145 1509593 1537200 1564583
53490A564583K8204L0040L1951L2780L2165L0596K8837K7582K7065K6529K4642
$$ 1564583 1592787 1622827 1654778 1687558 1719723 1750319 1779156 1806738 1833803 1860332 1884974
53479A884974K1024J6956J3983J2259J0827R069P021M534J079l366p845j1337
$$ 1884974 1905998 1922954 1936937 1949196 1960023 1969092 1976113 1980647 1981726 1978360 1970515 1959178
53467A959178j3846j6295j9282k2239k4128k4848k5365k6273k6904k6510k5686
$$ 1959178 1945332 1929037 1909755 1887516 1863388 1838540 1813175 1786902 1759998 1733488 1707802
53456A707802k5685k6628k7479k7759k8091k8889k9511k9180k7861k5905k3628
$$ 1707802 1682117 1655489 1628010 1600251 1572160 1543271 1513760 1484580 1456719 1430814 1407186
53445A407186k1668k0831k0944k0503j8170j4253j0260p419n904n067m047k485
$$ 1407186 1385518 1364687 1343743 1323240 1305070 1290817 1280557 1273138 1267234 1262167 1258120 1255635
53433A255635q24N26K182N016Q355J0166R719Q994J0328J3393J5845J6727J7829
$$ 1255635 1254811 1255337 1257519 1262535 1270890 1281056 1290775 1299769 1310097 1323490 1339335 1356062 1373891
53420A373891K1164K6065K9751L0606K9988L0463L2870L5983L8643M0930M3010
$$ 1373891 1395055 1421120 1450871 1481477 1511465 1541928 1574798 1610781 1649424 1690354 1733364
53409A733364M4301M4813M6132M9624N4320N8141O0831O3995O8376P2691P5405
$$ 1733364 1777665 1822478 1868610 1918234 1972554 2030695 2091526 2155521 2223897 2296588 2371993
53398B371993P6278P6035P5745P6667P9271Q2218Q3587Q3272Q2702Q2231Q0598
$$ 2371993 2448271 2524306 2600051 2676718 2755989 2838207 2921794 3005066 3087768 3169999 3250597
53387C250597P7325P3680P0565O7177O2718N7720N2753M7350M1278L5352K9847
$$ 3250597 3327922 3401602 3472167 3539344 3602062 3659782 3712535 3759885 3801163 3836515 3866362
53376C866362K3609J5997Q342K151k995q546j5288k3693l4360m6503n7377o5041
$$ 3866362 3889971 3905968 3914310 3916461 3913466 3904920 3889632 3865939 3831579 3785076 3727699 3662658
53364C662658p0583p5987q0942q3815q4615q4732q4360q2545p9430p6156p2761
$$ 3662658 3592075 3516088 3435146 3351331 3266716 3181984 3097624 3015079 2935649 2859493 2786732
53353B786732o8340o3389n9764n8005n6738n5288n4803n5948n7280n7208n6109
$$ 2786732 2718392 2655003 2595239 2537234 2480496 2425208 2370405 2314457 2257177 2199969 2143860
53342B143860n5168n4060n1375m7003m2716m0095l8661l6541l2647k7644k2872
$$ 2143860 2088692 2034632 1983257 1936254 1893538 1853443 1814782 1778241 1745594 1717950 1695078
53331A695078j8989j6246j5407j7184k0559k3071k3342k2349k1459k0386j8175
$$ 1695078 1676089 1659843 1644436 1627252 1606693 1583622 1560280 1537931 1516472 1496086 1477911
53320A477911j5229j2959j1887j1399j0992j0555r621p614m755j870P88L585O528
$$ 1477911 1462682 1449723 1437836 1426437 1415445 1404890 1395269 1387655 1382900 1381030 1381818 1385403 1391931
53307A391931R006J0660J1894J3543J6269J9932K3334K5260K6161K7924L1513
$$ 1391931 1400937 1411597 1423491 1437034 1453303 1473235 1496569 1521829 1547990 1575914 1607427
53296A607427L5721L8902M0772M1781M2027M1753M1625M1197L8682L3752K9073
$$ 1607427 1643148 1682050 1722822 1764603 1806630 1848383 1890008 1931205 1969887 2003639 2032712
53285B032712K7029K6309K4012J9833J5510J1293O114P32k801m861p977j2383
$$ 2032712 2059741 2086050 2110062 2129895 2145405 2156698 2162812 2163544 2160743 2155882 2147905 2135522
53273B135522j5371j6156j7855k2690k8207l0791l0768l1281l3668l6596l8868
$$ 2135522 2120151 2103995 2086140 2063450 2035243 2004452 1973684 1942403 1908735 1872139 1833271
53262A833271m0632m2016m2628m2510m2144m1614m0823m0209m0172m0064l8894
$$ 1833271 1792639 1750623 1707995 1665485 1623341 1581727 1540904 1500695 1460523 1420459 1381565
53251A381565l6852l5095l4252l3964l3703l3118l1831k9852k8100k7639k8277
$$ 1381565 1344713 1309618 1275366 1241402 1207699 1174581 1142750 1112898 1084798 1057159 1028882
53240A028882k8585k7520k5518k3910k3491k3679k2981k0437j6720j3530j1855
$$ 1028882 1000297 972777 947259 923349 899858 876179 853198 832761 816041 802511 790656
53229G90656j1264j0905j0536j0258j0041r962j0407j1542j3022j4688j6982k0046
$$ 790656 779392 768487 757951 747693 737652 727690 717283 705741 692719 678031 661049 641003
53217F41003k2883k3998k2724j9532j5499j1859r618q986r325r977j0799j1527
$$ 641003 618120 594122 571398 551866 536367 524508 514890 505904 496579 486602 475803 464276
53205D64276j1388j0029q438q025q903r855r990r688r735j0180j0526j0560j0503
$$ 464276 452888 442859 434421 426396 417493 407638 397648 387960 378225 368045 357519 346959 336456
53192C36456j0343r559p786n540l884l375l597l848l933l996l867l121j734k70
$$ 336456 326113 316554 308768 303228 299344 295969 292372 288524 284591 280595 276728 273607 271873 271603
53178B71603N88M85n84k306m056n116n050l915k321j228j202j656j384j18R42
$$ 271603 272191 272676 272092 269786 265730 260614 255564 251649 249328 248100 246898 245242 243858 243740 244682
53163B44682P09l95j207j441j582j680j262l84K33J26m89j078j012J84J928K423
$$ 244682 245391 244996 243789 242348 240766 239086 237824 237440 237673 237799 237310 236232 235220 235404 237332 239755
53147B39755O09k044k932j522J54K40r94k265k990l304l403l413l238k287k39
$$ 239755 240364 238320 235388 233866 234020 234260 233266 231001 228011 224707 221304 217891 214653 212366 212127
53132B12127J805K101N49j026j384j328j934k622k158p40K06j00j189k272k890
$$ 212127 213932 216033 216582 215556 214172 212844 210910 208288 206130 205390 205596 205496 204307 202035 199145
53117A99145k848k324j893j907j990j615r50o24q60j330j746k118k529k907l052
$$ 199145 196297 193973 192080 190173 188183 186568 185618 184994 184134 182804 181058 178940 176411 173504 170452
53102A70452k696j726m78L86L73n39j995l258l315j670P81K252J771N8j518k433
$$ 170452 167756 166030 165552 165938 166311 165772 163777 160519 157204 155534 156315 158567 160338 160396 158878 156445
53086A56445l157m073m675l955j638J162K840K891K215J791J673J537J334R09
$$ 156445 153288 149215 144540 140585 138947 140109 142949 145840 148055 149846 151519 153056 154390 155299
53072A55299q0j196j241r6N58l50j398r18O6o25k571l173j626J82J005J741K828
$$ 155299 155219 154023 152782 152686 153244 152894 151496 150578 150644 150019 147448 144275 142649 142831 143836 145577 148405
53055A48405K908J429L30J247K744K237m88l299m416l700j939j89O13M03l7k23
$$ 148405 151313 152742 153072 154319 157063 159300 158812 155513 151097 147397 145458 145269 145882 146285 146248 146025
53039A46025l56k74P34K429L251K304N88m74n60J04J393K532K238O40m69k87j98
$$ 146025 145669 145395 146129 148558 151809 154113 154701 154227 153667 153771 155164 157696 159934 160574 160105 159818 159620
53022A59620j123j614l29J395J573P24O23J126P21m87q79o1O90O28K02k37o35
$$ 159620 158497 156883 156554 157949 159522 160246 160869 161995 162716 162229 161350 161289 161979 162607 162809 162572 161937
53005A61937l98Q15J830J379K24j13j94j727m026m253j646J144J770Q83R9m13
$$ 161937 161539 162354 164184 165563 165787 165674 165480 163753 159727 155474 153828 154972 156742 157625 157724 157311
52989A57311q98n58J098K705K558Q73o98j150o91M2L85j14r14n73J549M213N621
$$ 157311 156413 155855 156953 159658 162216 163089 162391 161241 160550 160592 160977 160863 159949 159376 160925 165138 170759
52972A70759N220L546J202j142k365j725J01J645K079J529M09p16j043l12N25
$$ 170759 175979 179525 180727 179585 177220 175495 175596 177241 179320 180849 181258 180542 179499 179187 179712
52957A79712L50m84n50M86J243O32m57m37O40J192M93k98QP24K62j447k707k193
$$ 179712 180062 179578 179028 179514 180757 181389 180932 180495 181135 182327 182820 182522 182530 183254 183516 182069 179362 177169
52939A77169n28O68O18r9m14J24Q64O44p68k086k029j189j243k315k602j131O29
$$ 177169 176641 177309 177927 177828 177414 177538 178402 179046 178278 176192 174163 172974 171731 169416 166814 165683 166312
52922A66312R01P4k89P1P7p34j711k315k553k292j317j39K85k34r59j300j304
$$ 166312 167213 167287 166998 167069 167146 166412 164701 162386 159833 157541 156224 156085 156370 156136 155177 153877 152573
52905A52573j117o81j2P75J636K236J864L68j146j416o18J2o9l13l16l77o10l84
$$ 152573 151456 150775 150763 151538 153174 155410 157274 157642 156496 155080 154462 154474 154405 154092 153776 153399 152789 152405
52887A52405Q75K633L398J978j140l799m131k611j331j074l36K056M751N548M207
$$ 152405 153280 155913 159311 161289 160149 156350 152219 149608 148277 147203 146867 148923 153674 159222 163429
52872A63429K166K99j484k988l733l852l626k554l70J552J483k35j779k538l353
$$ 163429 165595 165894 164410 161422 157689 153837 150211 147657 147287 148839 150322 150087 148308 145770 142417
52857A42417m258m160l023k241k281j837j72J462J718R78J94p73k349l712l439
$$ 142417 138159 133999 130976 128735 126454 124617 124445 125907 127625 128603 128797 128024 125675 121963 118524
52842A18524j395R10J817J020l15q08l30R9O2M53J651K266J205p5M56J889J547
$$ 118524 117129 118039 119856 120876 120561 119753 119423 119522 119584 120037 121688 123954 125159 125084 125540 127429 128976
52825A28976n25j249O65K595J993n5j012m77M00J291K301K530J234l76m87P06
$$ 128976 128451 127202 127867 130462 132455 132400 131388 130911 131311 132602 134903 137433 138667 138291 137804 138510
52809A38510J386O96n49j358j424p95R9L99k51j060j160p31k77L17J034R44m96
$$ 138510 139896 140592 140043 138685 137261 136466 136565 136964 136713 135653 134493 133762 133485 133802 134836 135780 135284
52792A35284k134k401j318j04N64P36M06o9M05K078L196K082k16j292q65p72j644
$$ 135284 133150 130749 129431 129327 129891 130627 131033 130964 131369 133447 136643 138725 138509 137217 136352 135580 133936
52775A33936j986r78Q8M6k91L06J424J779J139L60M3O8on46j569k422k242j009
$$ 133936 131950 130972 131060 131106 130815 131121 132545 134324 135463 135823 135866 135934 135928 135382 133813 131391 129149 128140
52757A28140L48R98Q50J36p75j123l55P18M94j190k599k477j607j085l76J404
$$ 128140 128488 129486 130336 130472 129697 128574 128219 128937 129431 128241 125642 123165 121558 120473 120097 121501
52741A21501L166K852O17q76J49K309L143K301J578K228L447L688K647J546J652
$$ 121501 124667 127519 128136 127260 127409 129718 132861 135162 136740 138968 142415 146103 148750 150296 151948
52726A51948K873L852L412J711l5p75l84N91J473J707J070q4j110j800k497l250
$$ 151948 154821 158673 162085 163796 163761 162986 162602 163193 164666 166373 167443 167359 166249 164449 161952 158702
52710A58702l363k251m45R09J367J478J798K313K842L426L996M173L585K237N53
$$ 158702 155339 153088 152643 153552 154919 156397 158195 160508 163350 166776 170772 174945 178530 180767 181320
52695A81320o51n26Q32K044J952J289J685L008L141R02k255m284m884m753l805
$$ 181320 180669 180143 180975 183019 184971 186260 187945 190953 194094 194996 192741 188457 183573 178820 175015
52680A75015j846j11k62k029l467l473k791k506k757l010k530p95J620K851J707
$$ 175015 173169 173058 172796 170767 167300 163827 161036 158530 155773 152763 150233 149438 151058 153909 155616
52665A55616n23j643j529j825k868l048j563K27R36Q67O77P4j087j814j332k87
$$ 155616 155093 153450 151921 150096 147228 144180 142617 142844 143780 144647 145324 145398 144311 142497 141165 140878
52649A40878N08J299K300K565J332l70q48J05J339J925J547J36j616k047k89K126
$$ 140878 141386 142685 144985 147550 148882 148512 147664 147769 149108 151033 152580 152716 151100 149053 148764 150890
52633A50890K901J889J017J377J921J407K75k65j59n46j986l393l217j425L20
$$ 150890 153791 155680 156697 158074 159995 161402 161677 161412 161253 160707 158721 155328 152111 150686 151006
52618A51006P00K85L48Q10N56n23j341j508j731j980j082J141K972L213K809K761
$$ 151006 151706 151991 152339 153149 153705 153182 151841 150333 148602 146622 145540 146681 149653 152866 155675 158436
52602A58436K136l4k216j976N47K897L565L149K545J976J695J899J792M57j298
$$ 158436 160572 160538 158322 156346 156893 159790 163355 166504 169049 171025 172720 174619 176411 176868 175570
52587A75570j551O9J857K321J531O3j749l155l172k064j217j147j036n52m73r09
$$ 175570 174019 174088 175945 178266 179797 179860 178111 174956 171784 169720 168503 167356 166320 165768 165295 164386
52571A64386p71N1p8j767k855j375J098J420n76k004j272l3j89j130j213l49L65
$$ 164386 163615 163666 163588 161821 158966 157591 158689 160109 159533 157529 156257 156224 156035 154905 153692 153343 153708
52554A53708O26R34J209R25M04N85J432J847J422R87R78O69k54o41K94J273N82
$$ 153708 154334 155268 156477 157402 157806 158391 159823 161670 163092 164079 165057 165726 165472 164831 165125 166398 166980
52537A66980j280k379k241k078k328k024r26j76j79J74J221J398k70k263k668
$$ 166980 165700 163321 161080 159002 156674 154650 153724 153548 153369 153543 154764 156162 155892 153629 150961
52522A50961j757p55L70J977K801J416j066k103j242l17k81j53O82J340J157O81
$$ 150961 149204 148449 148819 150796 153597 155013 153947 151844 150602 150285 150004 149851 150533 151873 153030 153711
52506A53711K75n84j912k704k525k188k153j697m91M41M10L22J074J864J405M2
$$ 153711 153986 153402 151490 148786 146261 144073 141920 140223 139732 140173 140583 140905 141979 143843 145248 145290
52490A45290p25l38L84O75N90N37P88J396K042K156J592Q58L82M7j68J43R03J030
$$ 145290 144565 144227 144611 145286 145876 146413 147201 148597 150639 152795 154387 155245 155627 155674 155506 155649 156552 157582
52472A57582k69k152l001k355j108j38L80K85q47k882m625m667k674L24K741L553
$$ 157582 157313 155161 152160 149805 148697 148559 148939 149224 148377 145495 140870 136203 133529 133853 136594 140147
52456A40147K886J751J173J456K097K253J479K11n10j08Q16J254J086J060J438
$$ 140147 143033 144784 145957 147413 149510 151763 153242 153453 152943 152835 153651 154905 155991 157051 158489
52441A58489J479O36m44p70l84k14n98p32J81J686K455J840O58J48M33N61O6k64
$$ 158489 159968 160604 160160 159390 159006 158792 158194 157462 157643 159329 161784 163624 164282 164430 164863 165424 165490 165226
52423A65226L16J120Q13o56j910j924j069j88M44Q28P95M48M44J149J853J563
$$ 165226 165542 166662 167475 166819 164909 162985 161916 161728 162172 163000 163795 164243 164687 165836 167689 169252
52407A69252L85m90k10Q66J792K139K234K442K549J970O08q01j344q35P9O64Q00
$$ 169252 169637 169147 168937 169803 171595 173734 175968 178410 180959 182929 183537 182736 181392 180557 180636 181300 182100
52390A82100R86J755K945L649L228K327K202K951L236K269J128J218K260L043
$$ 182100 183086 184841 187786 191435 194663 196990 199192 202143 205379 207648 208776 209994 212254 215297
52376B15297L518M592O025O222M505K285J336J936L158M146M556M472M401M755
$$ 215297 218815 223407 229432 235654 240159 242444 243780 245716 248874 253020 257576 262048 266449 271204
52362B71204N159M949M482M914O470P955Q396Q004P065N157K417M94J015L754
$$ 271204 276363 281312 285794 290708 297178 305133 313529 321533 328598 333755 336172 336666 337681 341435
52348C41435P117R870J1666J2694J3691J5508J7728J8551J7221J5664J6365J9226
$$ 341435 348552 358422 370088 382782 396473 411981 429709 448260 465481 481145 497510 516736
52336E16736K2165K4262K6443K9047L0792L0878L0510L1214L2741L3636L3191
$$ 516736 538901 563163 589606 618653 649445 680323 710833 742047 774788 808424 841615
52325H41615L1820K9995K7826K5571K3752K2559K1603K0416J8988J7738J6949
$$ 841615 873435 903430 931256 956827 980579 1003138 1024741 1045157 1064145 1081883 1098832
52314A098832J6234J4699J1783P943M164R06k065m800o763p630q002q707r716
$$ 1098832 1115066 1129765 1141548 1149491 1153655 1154561 1152496 1147696 1140933 1133303 1125301 1116594 1106878
52301A106878j0323j0421j0830j2017j3049j2506j0321p946o497n372l232Q1L430
$$ 1106878 1096555 1086134 1075304 1063287 1050238 1037732 1027411 1019465 1012968 1007596 1004364 1004445 1007875
52288A007875N991Q165J0644J3309J5603J7479J9348K1276K2860K3869K4436K4584
$$ 1007875 1013866 1022031 1032675 1045984 1061587 1079066 1098414 1119690 1142550 1166419 1190855 1215439
52276A215439K4051K2920K1992K2040K2714K2605K0600J7026J3227J0189P828
$$ 1215439 1239490 1262410 1284402 1306442 1329156 1351761 1372361 1389387 1402614 1412803 1420631
52265A420631N528K865l25l977p555j0149j1344j1765j2273j2894j3144j3138
$$ 1420631 1426159 1429024 1428699 1424722 1417167 1407018 1395674 1383909 1371636 1358742 1345598 1332460
52253A332460j3573j4729j6227j7773j9252j9981j8986j6374j3565j1590j0006
$$ 1332460 1318887 1304158 1287931 1270158 1250906 1230925 1211939 1195565 1182000 1170410 1160404
$$ [...]
##END NTUPLES=NMR SPECTRUM
##END=
