##TITLE=NES1062_159122.0011_002_9704227_S7YpYeiwKW
##JCAMPDX= 6.0         $$ Bruker NMR JCAMP-DX V2.0
##DATA TYPE= NMR SPECTRUM
##DATA CLASS= NTUPLES
##ORIGIN= BRUKER
##OWNER= Administrator
$$ 1.72 TOPSPIN		Version 2.1
$$ 2016-10-25 16:11:25.357 -0500  Administrator@X
$$ Compression mode = diff/dup
##.OBSERVE FREQUENCY= 400.02188249412
##.OBSERVE NUCLEUS= ^1H
##.ACQUISITION MODE= SIMULTANEOUS (DQD)
##.ACQUISITION SCHEME= undefined
##.AVERAGES= 64
##.DIGITISER RES= 22
##SPECTROMETER/DATA SYSTEM= spect
##.PULSE SEQUENCE= noesygpps1d.comp
##.SOLVENT NAME= COFFEE_meoh
##.SHIFT REFERENCE= INTERNAL, COFFEE_meoh, 1, 14.96089
##AUDIT TRAIL= $$ (NUMBER, WHEN, WHO, WHERE, PROCESS, VERSION, WHAT)
$$ ##TITLE= Audit trail, TOPSPIN		Version 2.1
$$ ##JCAMPDX= 5.01
$$ ##ORIGIN= Bruker BioSpin GmbH
$$ ##OWNER= Administrator
$$ $$ E:\/data/COFFEE/nmr/NES1062_159122.0011_002_9704227_S7YpYeiwKW/32/pdata/1/auditp.txt
$$ ##AUDIT TRAIL=  $$ (NUMBER, WHEN, WHO, WHERE, PROCESS, VERSION, WHAT)
(   1,<2016-05-01 13:09:28.724 -0700>,<Administrator>,<X>,<go>,<TOPSPIN 2.1>,
      <created by zg
	started at 2016-05-01 12:57:59.317 -0700,
	POWCHK enabled, PULCHK disabled,
       configuration hash MD5:
       21 0F 79 D6 B3 7B B4 F6 88 20 88 DB 03 48 BD 9F
       data hash MD5: 64K
       27 9C 9D 29 48 2D FD D0 CF 42 86 54 37 EE F4 15>)
(   2,<2016-05-01 13:09:32.114 -0700>,<Administrator>,<X>,<proc1d>,<TOPSPIN 2.1>,
      <Start of raw data processing
       efp LB = 0.3 FT_mod = 6 PKNL = 1 PHC0 = 0 PHC1 = 0 SI = 128K 
       data hash MD5: 128K
       4D D1 BE 06 66 10 18 71 34 8F CD 64 7F B0 E9 9F>)
(   3,<2016-05-01 13:09:33.021 -0700>,<Administrator>,<X>,<proc1d>,<TOPSPIN 2.1>,
      <pk PHC0 = -82.39197 PHC1 = 0 
       data hash MD5: 128K
       E5 82 58 D7 F5 FC 08 39 B6 77 C1 99 83 43 98 F3>)
(   4,<2016-05-01 13:09:33.442 -0700>,<Administrator>,<X>,<proc1d>,<TOPSPIN 2.1>,
      <abs ABSG = 1 
       data hash MD5: 128K
       00 B0 0E 5A 9E D3 9A 7E E2 1C 42 2D A2 95 27 46>)
(   5,<2016-05-01 13:09:33.536 -0700>,<Administrator>,<X>,<proc1d>,<TOPSPIN 2.1>,
      <abs ABSG = 2 
       data hash MD5: 128K
       E0 0C C8 79 E1 7D F2 43 71 ED A9 EC AD 3F A9 94>)
(   6,<2016-05-01 13:09:33.630 -0700>,<Administrator>,<X>,<proc1d>,<TOPSPIN 2.1>,
      <abs ABSG = 3 
       data hash MD5: 128K
       0C CC 3A 1A 4B 98 0E EB 72 93 C4 7D D9 0A 84 53>)
(   7,<2016-05-01 13:09:33.724 -0700>,<Administrator>,<X>,<proc1d>,<TOPSPIN 2.1>,
      <abs ABSG = 4 
       data hash MD5: 128K
       79 55 23 EB 28 B2 A9 6B 4B FD CE 84 67 C5 B8 1E>)
(   8,<2016-05-01 13:09:33.802 -0700>,<Administrator>,<X>,<proc1d>,<TOPSPIN 2.1>,
      <abs ABSG = 5 
       data hash MD5: 128K
       A4 C0 59 40 9E 8A D7 1E DE 64 F4 43 7F 5B DD 55>)
(   9,<2016-05-01 13:09:35.755 -0700>,<Administrator>,<X>,<audit>,<TOPSPIN 2.1>,
      <user comment:
       ICON-NMR User ID: COFFEE
       data hash MD5: 128K
       A4 C0 59 40 9E 8A D7 1E DE 64 F4 43 7F 5B DD 55>)
$$ ##END=
$$ 
$$ $$ hash MD5
$$ [...]
##$TP07= 0
##$TPNAME0= <>
##$TPNAME1= <>
##$TPNAME2= <>
##$TPNAME3= <>
##$TPNAME4= <>
##$TPNAME5= <>
##$TPNAME6= <>
##$TPNAME7= <>
##$TPOAL= (0..7)
0.5 0.5 0.5 0.5 0.5 0.5 0.5 0.5
##$TPOFFS= (0..7)
0 0 0 0 0 0 0 0
##$TUNHIN= 0
##$TUNHOUT= 0
##$TUNXOUT= 0
##$USERA1= <user>
##$USERA2= <user>
##$USERA3= <user>
##$USERA4= <user>
##$USERA5= <user>
##$V9= 5
##$VALIST= <valist>
##$VCLIST= <CCCCCCCCCCCCCCC>
##$VD= 0
##$VDLIST= <DDDDDDDDDDDDDDD>
##$VPLIST= <PPPPPPPPPPPPPPP>
##$VTLIST= <TTTTTTTTTTTTTTT>
##$WBST= 2048
##$WBSW= 25
##$XGAIN= (0..3)
0 0 0 0
##$XL= 0
##$YL= 0
##$YMAX_a= 5488012
##$YMIN_a= -10252494
##$ZGOPTNS= <>
##$ZL1= 120
##$ZL2= 120
##$ZL3= 120
##$ZL4= 120
##$ABSF1= 14.96089
##$ABSF2= -5.597292
##$ABSG= 5
##$ABSL= 3
##$ALPHA= 0
##$AQORDER= 0
##$ASSFAC= 0
##$ASSFACI= 0
##$ASSFACX= 0
##$ASSWID= 0
##$AUNMP= <proc_prof1d_extract.lims>
##$AXLEFT= 0
##$AXNAME= <>
##$AXNUC= <1H>
##$AXRIGHT= 0
##$AXTYPE= 0
##$AXUNIT= <>
##$AZFE= 0.1
##$AZFW= 0.1
##$BCFW= 0
##$BC_mod= 0
##$BYTORDP= 0
##$COROFFS= 0
##$CY= 15
##$DATMOD= 1
##$DC= 0
##$DFILT= <>
##$DTYPP= 0
##$F1P= 0
##$F2P= 0
##$FCOR= 0.5
##$FTSIZE= 131072
##$FT_mod= 6
##$GAMMA= 0
##$GB= 0
##$INTBC= 1
##$INTSCL= 1
##$ISEN= 128
##$LB= 0.3
##$LEV0= 0
##$LPBIN= 0
##$MAXI= 10000
##$MC2= 0
##$MEAN= 0
##$ME_mod= 0
##$MI= 0
##$NCOEF= 0
##$NC_proc= -2
##$NLEV= 6
##$NOISF1= 0
##$NOISF2= 0
##$NSP= 0
##$NTH_PI= 0
##$NZP= 0
##$OFFSET= 14.96089
##$PC= 1
##$PHC0= -82.39197
##$PHC1= 0
##$PH_mod= 1
##$PKNL= yes
##$PPARMOD= 0
##$PPDIAG= 0
##$PPIPTYP= 0
##$PPMPNUM= 2147483647
##$PPRESOL= 1
##$PSCAL= 4
##$PSIGN= 0
##$PYNMP= <proc.py>
##$REVERSE= no
##$SF= 400.020009679379
##$SI= 131072
##$SIGF1= 0
##$SIGF2= 0
##$SINO= 400
##$SIOLD= 131072
##$SPECTYP= <>
##$SREGLST= <1H.CDCl3>
##$SSB= 0
##$STSI= 131072
##$STSR= 0
##$SW_p= 8223.68421052631
##$SYMM= 0
##$S_DEV= 0
##$TDeff= 65536
##$TDoff= 0
##$TI= <>
##$TILT= no
##$TM1= 0
##$TM2= 0
##$TOPLEV= 0
##$USERP1= <user>
##$USERP2= <user>
##$USERP3= <user>
##$USERP4= <user>
##$USERP5= <user>
##$WDW= 1
##$XDIM= 131072
##$YMAX_p= 281362279
##$YMIN_p= -10848
##$CURPLOT= <Network HP LaserJet P1505>
##$CURPRIN= <$Network HP LaserJet P1505>
##$DFORMAT= <normdp>
##$LAYOUT= <+/1D_H.xwp>
##$LFORMAT= <normlp>
##$PFORMAT= <normpl>
##$SURQMSG= 1
$$ End of Bruker specific parameters
$$ ---------------------------------
##NTUPLES= NMR SPECTRUM
##VAR_NAME=  FREQUENCY,     SPECTRUM/REAL,   SPECTRUM/IMAG
##SYMBOL=    X,             R,               I
##VAR_TYPE=  INDEPENDENT,   DEPENDENT,       DEPENDENT
##VAR_FORM=  AFFN,          ASDF,            ASDF
##VAR_DIM=   131072,        131072,          131072
##UNITS=     HZ,            ARBITRARY UNITS, ARBITRARY UNITS
##FACTOR=    0.0627417313425164, 1,          1
##FIRST=     8223.62146879497, -985,         -49668
##LAST=      0,             1962,            -49715
##MIN=       0,             -10848,          0
##MAX=       8223.62146879497, 281362279,    0
$$ Real data points
##PAGE= N=1
##DATA TABLE= (X++(R..R)), XYDATA
$$ [...]
61491I04449K7812K5436K3315K1340J8840J5097J0305N592J838j140l812o050
61479A043022p473q190q442p928o345m369l196l065l022k275j113k74r5n92j769
61464I84874l441n111o469p664q827r691j0009j0020j0029r794q892p462o068
61451H81397m824l275j179J107L275N590Q493J1899J5243J7956J9604J9725J7909
61438I92920J4076Q535J923m717j0066j3197j4226j3938j2866j1044q619o093
61426I22688l780j447J161L883O582R593J3099J6188J7170J4916R648K492n212
61413A006981j2235j7729k1560k4100k5564k5792k4719k2700k0182j7485j5013
61402G79902j3238j2158j1148r708q078o822o073n533m949m162k907j081R21K556
$$ plain form
61491 904449 932261 957697 981012 1002352 1021192 1036289 1046594 1052186 1054024 1052884 1049072 1043022
61479 1043022 1035549 1027359 1018917 1010989 1004644 1000275 997079 994014 990992 988717 987604 987330 987235 986643 984874
61464 984874 981433 976322 969853 962189 953362 943671 933662 923642 913613 903819 894927 887465 881397
61451 881397 876573 873298 872119 873226 876501 882091 890584 902483 917726 935682 955286 975011 992920
61438 992920 1006996 1015531 1017454 1012737 1002671 989474 975248 961310 948444 937400 928781 922688
61426 922688 918908 917461 918622 922505 929087 938680 951779 967967 985137 1000053 1009701 1012193 1006981
61413 1006981 994746 977017 955457 931357 905793 880001 855282 832582 812400 794915 779902
61402 779902 766664 754506 743358 733650 725572 718750 712677 707144 702195 698033 695126 694045 694966 697522
61388F97522L733M713N595O417P557R367J1383J2647J3044J3641J5245J7244J8455
61375H36563J8710J8942J9809K0881K1210K0286J8296J5864J3662J1897J0056
61364A026176P450M103Q14j803l921n932p698q931j0033j1860j4581j7290j9048
61351I37446j9862k0378k0936k1349k1327k0701j9372j7492j5679j4582j4141
61340G31627j3631j2622j1538j1040j1082j0912r875q111o416n447m991m161k496
61327F19305p55j22o92j265q52K15J064J658K669M231N615O273O548P043P716
61312F58651Q033P822P464P234O799N695M113K881K513K585K405K021K119K865
61298G23200L525L371K506J440L15r71k237l177l734l936l658l125l183m246n305
$$ plain form
61388 697522 701255 705968 711563 717980 725537 734904 746287 758934 771978 785619 800864 818108 836563
61375 836563 855273 874215 894024 914905 936115 956401 974697 990561 1004223 1016120 1026176
61364 1026176 1033626 1037729 1038543 1036740 1032819 1026887 1019189 1010258 1000225 988365 973784 956494 937446
61351 937446 917584 897206 876270 854921 833594 812893 793521 776029 760350 745768 731627
61340 731627 717996 705374 693836 682796 671714 660802 650927 642816 636400 630953 625962 621801 619305
61327 619305 618550 618428 617736 616471 615619 615834 616898 618556 621225 625456 631071 637344 643892 650935 658651
61312 658651 666684 674506 681970 689204 696003 701698 705811 708692 711205 713790 716195 718216 720335 723200
61298 723200 726725 730096 732602 734042 734357 733386 731149 727972 724238 720302 716644 713519 710336 706090 700785
61283G00785m977l504k531k696k725j476K68J083J079J501K540L002K259J320
61269F95928J412K370L105L085K683K328K092K055K504L484M539N199N629O509
61255G42922Q267J0591J2779J4493J6108J8305K1409K5049K8418L0892L2363L2935
61243I94531L2205K9203K3251J4924N813k638r816j5516j9430k1360k1697k1173
61231I88297k0167j8526j6102j3107r780o039j764K644O326Q640R475Q684N572
61218I44153m45q587j6660k2658k6142k7778k8008k6833k4586k2028j9497j6642
61206G04289j3322j0095p495n360l326j610p28o91j045j448j782j859j521r65
61192F53042n66l78k27j82n03j179j896k489l039l529l855m190m922o032o868
$$ plain form
61283 700785 695808 692304 689773 687077 684352 682876 683144 684227 685306 686807 689347 692349 694608 695928
61269 695928 697340 699710 702815 705900 708583 710911 713003 715058 717562 721046 725585 730784 736413 742922
61255 742922 751189 761780 774559 789052 805160 823465 844874 869923 898341 929233 961596 994531
61243 994531 1026736 1055939 1079190 1094114 1099927 1097289 1087473 1071957 1052527 1031167 1009470 988297
61231 988297 968130 949604 933502 920395 910615 904576 902812 905456 911782 920422 929897 938581 944153
61218 944153 943708 935121 918461 895803 869661 841883 813875 787042 762456 740428 720931 704289
61206 704289 690967 680872 673377 668017 664691 663081 662353 661662 660617 659169 657387 655528 654007 653042
61192 653042 652476 652098 651871 651689 651186 650007 648111 645622 642583 639054 635199 631009 626087 620055 613187
61177F13187o820o000n158m981n529o210o278n530m523m010m201m753n295n675
61163E38224n823n697n305m553l217j445r6o1j285k934m452n919p347q421r097
61148D72572r771j0514j0758j0156r231q643q322p891p502p553p825p565o474
61135C60367n057l997l602l792m164m121l386k425j944j945j745r44J00R24J616
61120C25885K492L485M248M688N075N611O197O621O862O994O906O308N086L573
61106D00031K282J468J111J222J723K110J740P64J68M76Q57K44j107j938j776
61091D09375j400j416j329n19N77R86N23m7l6N12J148J504J419R54M26K82P39
61074D13698J518J936J410P1j088j071P4J287J693J428J118J001R97J224J910
$$ plain form
61177 613187 606367 600367 595209 590228 584699 578489 572211 566681 562158 558148 553947 549194 543899 538224
61163 538224 532401 526704 521399 516846 513629 512184 512088 512027 510742 507808 503356 497437 490090 481669 472572
61148 472572 462801 452287 441529 431373 422142 413499 405177 397286 389784 382231 374406 366841 360367
61135 360367 355310 351313 347711 343919 339755 335634 332248 329823 327879 325934 324189 323245 323345 324269 325885
61120 325885 328377 331862 336110 340798 345873 351484 357681 364302 371164 378158 385064 391372 396458 400031
61106 400031 402313 403781 404892 406114 407837 409947 411687 412451 412619 413095 413952 414196 413089 411151 409375
61091 409375 407975 406559 405230 404711 405288 406274 406797 406750 406714 407226 408374 409878 411297 412251 412677 412959 413698
61074 413698 415216 417152 418562 418633 417545 416474 416548 417835 419528 420956 422074 423075 424072 425296 427206
61059D27206K813L343L324L308L965N363O900P833P861P488P737R254J1642J3889
61045E21926J5416J6457J7411J8251J8771J9104J9722K0980K2884K5368K8532
61034G44822L2555L7424M2899M8675N4442N9865O4946P0759P9459R2916J11380
61023A440142J34056J60834J92644K30193K73895L25933L91236M75699N84951
61014D209583P24740Q95216J073835J201619J199738J019892O90159L10116n526
61005A1319372j85133k15160j19350N7392K44607L48797K89782N2168k97022o46694
60995A0848759r04988j037230j059267j007441r15178q06082o95489n92244n00018
60986C330822m19473l50216k91440k42010k00923j67527j40954j19763j02518
$$ plain form
61059 427206 430019 433362 436686 439994 443959 449322 456222 464055 471916 479404 487141 496395 508037 521926
61045 521926 537342 553799 571210 589461 608232 627336 647058 668038 690922 716290 744822
61034 744822 777377 814801 857700 906375 960817 1020682 1085628 1156387 1235846 1328762 1440142
61023 1440142 1574198 1735032 1927676 2157869 2431764 2757697 3148933 3624632 4209583
61014 4209583 4934323 5829539 6903374 8104993 9304731 10324623 11014782 11324898 11319372
61005 11319372 11134239 10919079 10799729 10857121 11101728 11450525 11740307 11792475 11495453 10848759
60995 10848759 9943771 8906541 7847274 6839833 5924655 5118573 4423084 3830840 3330822
60986 3330822 2911349 2561133 2269693 2027683 1826760 1659233 1518279 1398516 1295998
60977A295998q8522p7529o8994o2013n5963n0660m5881m1177l6300l1508k7238
60966G10213k3739k1207j9858j9484j9235j8465j7599j7487j7850j7198j4751
60955E03340j1721r946r666r552q722p690p127o702n784m590l891l858l917l632
60941D06542l197l076l604m901o670q082q357p623o835o674o812o445n263l668
60927C25335k238j210m63J86P16R13O72K47J0Q2K39K35nm01o98m99L86J472J862
60908C26841J197J27l57K6O39O61j58j399k413k804k643k303k147k315k700l024
60892C07228l074k942k964l202l244k770k149k013k300k261j527n76N1M10O56
60877B79323N00j51n04L15J946L098L161K723K365J890J134P06J179K046K301
$$ plain form
60977 1295998 1207476 1129947 1060953 998940 942977 892317 846436 805259 768959 737451 710213
60966 710213 686474 665267 645409 625925 606690 588225 570626 553139 535289 518091 503340
60955 503340 491619 481673 472007 462455 453733 446043 438916 432214 426430 421840 417949 414091 410174 406542
60941 406542 403345 400269 396665 391764 385094 377012 368655 361032 354197 347523 340711 334266 329003 325335
60927 325335 323097 321887 321424 321610 322326 323239 323911 324158 324168 324250 324489 324724 324719 324318 323620 323121 323507 324979 326841
60908 326841 328038 328165 327808 327834 328473 329134 328976 327577 325164 322360 319717 317414 315267 312952 310252 307228
60892 307228 304154 301212 298248 295046 291802 289032 286883 284870 282570 280309 278782 278206 278257 278667 279323
60877 279323 279823 279672 279168 279483 281429 284527 287688 290411 292776 294666 295800 296506 297685 299731 302032
60862C02032J837J423J420J241L54q80j724j998k013j940j667j193p10l31j9J72
60846B96004J24m1k6J87K06k02p38r79j016j285j864k373k617k953l708m514m651
60829B69554m026l378l343l604l277k065p30l01r97k081k655k456j846j256q52
60814B36687o34o58r04j089q24r7N94P49M46K10L49O82R06R49Q54N93K84K73P05
60795B40075J193J300J169J211J258P51j63m25N74K053K748K393J696J214Q95
60780B57942O37N44O09O76P89J070J231Q32J48Q2R15J680J285j43j457j768j082
60763B63990M6J032J457J238O63J52o5K6K54K63k62j086j483j080l87j97o20j148
60745B62793j379j301j016p46r69j968l228l798l369k519j795j128l70J19q5p65
$$ plain form
60862 302032 303869 305292 306712 307953 308307 307427 305703 303705 301692 299752 298085 296892 296182 295851 295832 296004
60846 296004 296128 296087 296061 296248 296454 296252 295514 294535 293519 292234 290370 287997 285380 282427 278719 274205 269554
60829 269554 265528 262150 258807 255203 251926 249861 249131 248830 247833 245752 243097 240641 238795 237539 236687
60814 236687 236053 235395 234491 233402 232578 232481 233075 233824 234270 234480 234829 235511 236417 237366 238220 238813 239097 239370 240075
60795 240075 241268 242568 243737 244948 246206 246957 246794 246369 246943 248996 251744 254137 255833 257047 257942
60780 257942 258579 259123 259732 260408 261197 262267 263498 264330 264478 264560 265475 267155 268440 268297 266840 265072 263990
60763 263990 264036 265068 266525 267763 268426 268578 268513 268539 268793 269056 268794 267708 266225 265145 264758 264561 263941 262793
60745 262793 261414 260113 259097 258351 257382 255414 252186 248388 245019 242500 240705 239577 239207 239326 239241 238476
60729B38476j292j375j189q87m72j30k80r70j595j506p93j86j44m14n60o57j111
60712B24915j938k641k837k622k239j781j372j283j555j811j747j490j152m59
60698A99988O58J474J194J23o46p34q32j410j869j411k09Q23J079O42L9r8O28
60681A99439J916K942L238L069K745K143J367J222K155L151K679P28j045j356
60667B24393n75K58Q17J279J486J137N65N50J336K354K918K872K539K327K443
60652B46699K728K724K170J390R81J052J113P10r7r92j830k482k637k080j167
60637B48282o04p34j322k042k803l382l236k153q54l60p36j070p98m16m97o10
60621B26665M1J232J789J175J59l13l03m15p09o93j95L67N53K67l44r68j103n22
$$ plain form
60729 238476 237184 235809 234620 233733 233261 233131 232851 231881 230286 228780 227987 227801 227657 227243 226683 226026 224915
60712 224915 222977 220336 217499 214877 212638 210857 209485 208202 206647 204836 203089 201599 200447 199988
60698 199988 200646 202120 203314 203437 202791 202057 201225 199815 197946 196535 196326 197149 198228 198870 198909 198811 199439
60681 199439 201355 204297 207535 210604 213349 215492 216859 218081 220236 223387 226066 226794 225749 224393
60667 224393 223818 224076 224893 226172 227658 228795 229360 229910 231246 233600 236518 239390 241929 244256 246699
60652 246699 249427 252151 254321 255711 256692 257744 258857 259567 259470 258478 256648 254166 251529 249449 248282
60637 248282 247678 246944 245622 243580 240777 237395 234159 232006 231152 230792 230056 228986 228188 227772 227275 226665
60621 226665 226706 227938 229727 230902 231061 230748 230445 230030 229321 228628 228433 228800 229353 229620 229276 228308 227205 226683
60603B26683K07J95n82j126q14l35p03j725k215j681r75j042j630j813j368j016
60587B10060j275j634j166K51J699K126J395L12k02P9P04J133J217J139J126J257
60571B18221J564K110K907L710M064L682K832K168K081K288K279K024K012K623
60557B54565L692M764N571O157O813P925R686J1757J3441J4476J5536J7591K0789
60544C92763K4194K6717K7988K8197K7255K4499J9382J2254M314l298j0104j5939
60532E58222k0381k2942k3744k3482k2607k0998j8650j6125j3902j1714r138o510
60520C48029m534l151j571M65K306L528M695O462Q591J0486J2296J4694J7725
60507D20021K0730K3336K5752K7803K8466K6833K3187J8522J3352P593J583l427
$$ plain form
60603 226683 226890 227085 226503 225377 224563 224228 223525 221800 219585 217904 216929 215887 214257 212444 211076 210060
60587 210060 208785 207151 205985 206236 207935 210061 211456 211768 211566 211645 212349 213482 214699 215838 216964 218221
60571 218221 219785 221895 224802 228512 232576 236258 239090 241258 243339 245627 247906 249930 251942 254565
60557 254565 258257 263021 268592 274749 281562 289487 299173 310930 324371 338847 354383 371974 392763
60544 392763 416957 443674 471662 499859 527114 551613 570995 583249 587563 584265 574161 558222
60532 558222 537841 514899 491155 467673 445066 424068 405418 389293 375391 363677 354539 348029
60520 348029 343495 340344 338773 339238 341544 345072 349767 356229 364820 375306 387602 402296 420021
60507 420021 440751 464087 489839 517642 546108 572941 596128 614650 628002 635595 637178 633751
60495F33751o158o332m633j768K101P065J2893J8869K4092K7819K9587K9099K6066
60482G92451K0285J1956J942q471j8244k6961l4457m0146m3077m2835m0287l7122
60470E35034l4426l1927k8798k5048k1690j9467j7858j5811j3171j0778r237q201
60458B98622p129o142n623n405m951m204l579l211k767k159j812k022k369k206
60444B45043j441n54k1K8k99p24q67n47J1M57P71J229J889K352K199J524Q45N14
60426B52409M06K54J03J92M38M08j17p27q57m35J63P17J340K114K790L020K696
60409B64914K091J752K107L003L738L882L855M292N053N467N442N603O228O753
60395C24180O687O347O231O230O020N740N672N576N058M365M116M375M564M248
$$ plain form
60495 633751 627593 621261 616628 614860 616961 624026 636919 655788 679880 707699 737286 766385 792451
60482 792451 812736 824692 826634 818163 799919 772958 738501 698355 655278 612443 572156 535034
60470 535034 500608 468681 439883 414835 393145 373678 355820 340009 326838 316060 306823 298622
60458 298622 291493 285351 279728 274323 269372 265168 261589 258378 255611 253452 251640 249618 247249 245043
60444 245043 243602 243048 243027 243055 242756 242032 241165 240618 240629 241086 241857 243086 244975 247327 249526 251050 251895 252409
60426 252409 252815 253069 253172 253364 253802 254210 254093 253366 252509 252074 252237 252954 254294 256408 259198 262218 264914
60409 264914 267005 268757 270864 273867 277605 281487 285342 289634 294687 300154 305596 311199 317427 324180
60395 324180 330867 337214 343445 349675 355695 361435 367107 372683 377741 382106 386222 390597 395161 399409
60381C99409L503K532J539R47J151J869K305K091J648J494J644J850J933J710
60367D25625J015J44j67M19J332J714J362P07J62j31n9M39J100J407J107M44j98
60350D36422p73j586k859m410n728o461o722o856o955o807o331n870n787n939
60336C63338n765m952l861l245l525m401n131n159m485l508k680k279k345k636
60322C09366k736k401j807j309r73n34J89R86J482J559J543J947L030M566O104
60307C21012P440Q604R377R199P797N628L305Q32k074n059p232q262q712r054
60293C32801q979q167p142o703o771o455n279l685k349j477j020j023j381j599
60279B70771j269o66m71q59j224r23N0J276K432L317L622L249K760K913L627L946
$$ plain form
60381 399409 402912 405444 406983 407930 409081 410950 413255 415346 416994 418488 420132 421982 423915 425625
60367 425625 426640 426784 426617 427036 428368 430082 431444 432151 432313 432182 432123 432562 433662 435069 436176 436620 436422
60350 436422 435649 434063 431204 426794 421066 414605 407883 401027 394072 387265 380934 375064 369277 363338
60336 363338 357573 352621 348760 345515 341990 337589 332458 327299 322814 319306 316626 314347 312002 309366
60322 309366 306630 304229 302422 301113 300140 299606 299795 300781 302263 303822 305365 307312 310342 314908 321012
60307 321012 328452 337056 346433 355632 363429 369057 372362 373194 371120 366061 358829 350567 341855 332801
60293 332801 323822 315655 308513 301810 295039 288584 283305 279620 277271 275794 274774 273751 272370 270771
60279 270771 269502 268836 268365 267506 266282 265359 265409 266685 269117 272434 276056 279305 282065 284978 288605 292551
60263B92551L305K310J832J849J802J671J899K405K529K099J741J913K295K487
60249C22688K622K887K913K343J512J076J179J505J910K507L252L933M452M821
60235C59600N051N400O380Q008R375R671R424R950J1541J3078J3691J3910J4778
60222D89857J6448J8381K0352K2474K4416K5474K5545K5364K5458K5367K4360
60211G43496K2591K0967J9918J8892J7266J5255J3476J1930J0080P855N893M618
60199I12237L700K767K054J796J580J040P90J763L683N206N716O100P439R748
60185I65619J2379J4977J7388J9329K0759K2240K4130K5810K6313K5475K3803
60174A198222K1530J8569J5246J2138R149N563J212l145o904j0354j3953j7464
$$ plain form
60263 292551 295856 298166 299998 301847 303649 305320 307219 309624 312153 314252 315993 317906 320201 322688
60249 322688 325310 328197 331110 333453 334965 336041 337220 338725 340635 343142 346394 350327 354779 359600
60235 359600 364651 370051 376431 384439 393814 403485 412909 422859 434400 447478 461169 475079 489857
60222 489857 506305 524686 545038 567512 591928 617402 642947 668311 693769 719136 743496
60211 743496 766087 787054 806972 825864 843130 858385 871861 883791 893871 901726 907619 912237
60199 912237 915937 918704 920758 922554 924134 925174 925964 927727 931410 936616 942332 948432 955871 965619
60185 965619 977998 992975 1010363 1029692 1050451 1072691 1096821 1122631 1148944 1174419 1198222
60174 1198222 1219752 1238321 1253567 1265705 1274854 1280417 1281629 1278484 1271580 1261226 1247273 1229809
60162A229809k0253k2040k2926k3108k2871k2450k1499j9212j5480j1435q290
60151A020245n990l698j257P08J929K827L605L899L542K930K276J237l64k037
60137A029852l323m474n957p659r179j0424j1363j1555j0708r479q861q751p920
60124I20199n617k512L16K723N376Q658J2297J5911J9401K2808K6112K9293L2378
60111A087343L5374L8278M1100M3800M6171M7875M8596M8119M6446M3857M0755
60100A567714L7175L2613K6575J9276J1497L759l957j1590j8537k4289k9159l3854
60088A577223l8314m1657m3352m3863m3807m3048m1190l8494l5561l2410k8734
60077A146793k4971k2159k0427j8562j5581j2010r044o985n304l784k664j843
$$ plain form
60162 1229809 1209556 1187516 1164590 1141482 1118611 1096161 1074662 1055450 1039970 1028535 1020245
60151 1020245 1014255 1010557 1009300 1010008 1011937 1014764 1018369 1022268 1025810 1028740 1031016 1032253 1031889 1029852
60137 1029852 1026529 1022055 1016098 1008439 999260 988836 977473 965918 955210 945731 936870 928119 920199
60124 920199 914582 912070 912386 915109 920485 929143 941440 957351 976752 999560 1025672 1054965 1087343
60111 1087343 1122717 1160995 1202095 1245895 1292066 1339941 1388537 1436656 1483102 1526959 1567714
60100 1567714 1604889 1637502 1664077 1683353 1694850 1698609 1694652 1683062 1664525 1640236 1611077 1577223
60088 1577223 1538909 1497252 1453900 1410037 1366230 1323182 1281992 1243498 1207937 1175527 1146793
60077 1146793 1121822 1099663 1079236 1060674 1045093 1033083 1024039 1017054 1011750 1007966 1005302 1003459
60065A003459p80O86K093L050L634L960L891L292K205O49j338l444n285o933q756
60050A000383j0762j2572j4130j5835j7789j9462k0362k0481j9915j8616j6890
60039H13569j5469j4510j3102j0403o963m206k723j673J66L241P099J0935J4195
60026G80156J6955J9716K2652K5237K6799K7264K6989K6153K4713K2780K0460
60015A039874J7433J3323Q578M291Q87k514o992j2371j7373k1023k3443k5158
60003I75512k6147k5895k4272k1892j9508j7331j5098j2606r861o912l866r54
59991G91170J785M788Q461J2425J5896J8883K2341K6731L1107L4167L5721L6504
59979A039979L6877L6410L4619L1498K7388K2760J8145J3798R452M656o42o065
$$ plain form
60065 1003459 1002679 1003365 1005458 1008508 1012142 1016102 1019993 1023285 1025490 1026139 1024801 1021357 1016072 1009139 1000383
60050 1000383 989621 977049 962919 947084 929295 909833 889471 868990 849075 830459 813569
60039 813569 798100 783590 770488 760085 753122 748916 746193 744520 744686 747927 755026 765961 780156
60026 780156 797111 816827 839479 864716 891515 918779 945768 971921 996634 1019414 1039874
60015 1039874 1057307 1070630 1079208 1083499 1084386 1081872 1074880 1062509 1045136 1024113 1000670 975512
60003 975512 949365 923470 899198 877306 857798 840467 825369 812763 802902 795990 792124 791170
59991 791170 792955 797743 806204 818629 834525 853408 875749 902480 933587 967754 1003475 1039979
59979 1039979 1076856 1113266 1147885 1179383 1206771 1229531 1247676 1261474 1270926 1275582 1274940 1268875
59967A268875j1173j5562j8878k1147k2843k4216k4866k4399k3176k1746j9915
59956A040954j7142j3668j0398p624m747j350K233N588Q742J1702J4223J6333
59944A044846J8500K0900K3037K4476K5392K6036K6144K5273K3442K1073J8565
59933A297684J6178J4022J2037J0242Q922Q224P579O374N158N333P329R955J2032
59920A421069J3772J6016J8882K1926K4924K7588K9119K9055K8191K7701K7507
59909A685750K6403K3542J9057J3405P077Q34m672r631j4634j9501k3322k5757
59897A678551k7467k8998k9941k9571k7813k5252k2604k0315j8326j6143j3473
59886A418648j0723q431o384l906r41J945M612P469J0368J2352J3024J3265J3965
$$ plain form
59967 1268875 1257702 1242140 1223262 1202115 1179272 1155056 1130190 1105791 1082615 1060869 1040954
59956 1040954 1023812 1010144 999746 992122 987375 986025 988258 993846 1002588 1014290 1028513 1044846
59944 1044846 1063346 1084246 1107283 1131759 1157151 1183187 1209331 1234604 1258046 1279119 1297684
59933 1297684 1313862 1327884 1339921 1350163 1359085 1367309 1374888 1381262 1386420 1391753 1399082 1409037 1421069
59920 1421069 1434841 1450857 1469739 1491665 1516589 1544177 1573296 1602351 1630542 1658243 1685750
59909 1685750 1712153 1735695 1754752 1768157 1775234 1776068 1771396 1761765 1747131 1727630 1704308 1678551
59897 1678551 1651084 1622086 1592145 1562574 1534761 1509509 1486905 1466590 1448264 1432121 1418648
59886 1418648 1407925 1399494 1393110 1389204 1388263 1390208 1394820 1402289 1412657 1425009 1438033 1451298 1465263
59873A465263J4765J4791J4027J3169J2441J1408R841Q065O551N613N408N673
59861A587015N524M112J506j433m023o189q030r554j0982j2873j5640j9082k2512
59848A487839k5204k6701k6907k6024k4379k2287k0067j7979j6046j4117j2277
59837A255851j0904j0087r242p675n416l114j257J45J238K213L456N353P776J0152
59823A238489J2182J4188J6569J9247K1727K3471K4122K3638K2399K0865J9032
59812A455929J6464J3049R360O045L157M18k113m097n508o738q078r428j0610
59799A457850j1675j2697j3585j4241j4864j5810j7158j8544j9524j9969k0073
59788A279710j9999j9739j9314j9014j9168j9605j9531j8141j5387j2073r086
$$ plain form
59873 1465263 1480028 1494819 1508846 1522015 1534456 1545864 1555705 1563770 1570321 1575934 1581342 1587015
59861 1587015 1592539 1596651 1598157 1596724 1592701 1586512 1578482 1568928 1557946 1545073 1529433 1510351 1487839
59848 1487839 1462635 1435934 1409027 1383003 1358624 1336337 1316270 1298291 1282245 1268128 1255851
59837 1255851 1244947 1234860 1225618 1217943 1212527 1209413 1208156 1208301 1209539 1211752 1215208 1220561 1228337 1238489
59823 1238489 1250671 1264859 1281428 1300675 1322402 1345873 1369995 1393633 1416032 1436897 1455929
59812 1455929 1472393 1485442 1494802 1500847 1504004 1504422 1502309 1498212 1492704 1485966 1477888 1468460 1457850
59799 1457850 1446175 1433478 1419893 1405652 1390788 1374978 1357820 1339276 1319752 1299783 1279710
59788 1279710 1259711 1239972 1220658 1201644 1182476 1162871 1143340 1125199 1109812 1097739 1088653
59777A088653o685m515k240J19K459M860P345R601J1323J2813J4782J7462K0403
59764A176380K3350K6810L1273L6273M0873M4870M8796N2682N5434N5580N2082
59753A644403M4384L2472J7418J364j3535k5961l5155m0522m2152m1277l9429
59742A502010l7220l4449l1123k7694k4353k0854j7158j3688j0774q269n887l479
59730A267062q78K131N438Q556J1143J3364J5658J8367K1591K5069K8228L0752
59718A446481L3207L6591M1256M6619N2007N7223O2257O7062P1957P7513Q3647
59707B075820Q9391R3951R7397R9858J00705R9187R5394Q9801Q2449P3489O4144
59696C061586N5880M8718M1445L3637K6347K0535J5912J1940Q979P578P236O800
$$ plain form
59777 1088653 1081968 1077453 1075213 1075332 1077791 1082651 1089996 1099597 1110920 1123733 1138515 1155977 1176380
59764 1176380 1199730 1226540 1257813 1294086 1334959 1379829 1428625 1481307 1536741 1592321 1644403
59753 1644403 1688787 1721259 1738677 1740041 1726506 1700545 1665390 1624868 1582716 1541439 1502010
59742 1502010 1464790 1430341 1399218 1371524 1347171 1326317 1309159 1295471 1284697 1276428 1270541 1267062
59730 1267062 1266184 1268315 1273753 1282309 1293452 1306816 1322474 1340841 1362432 1387501 1415729 1446481
59718 1446481 1479688 1516279 1557535 1604154 1656161 1713384 1775641 1842703 1914660 1992173 2075820
59707 2075820 2165211 2259162 2356559 2456417 2557122 2656309 2751703 2841504 2923953 2997442 3061586
59696 3061586 3117466 3166184 3207629 3241266 3267613 3288148 3304060 3316000 3324979 3332557 3339793 3346593
59684C346593N800M620L560K457J241J66o18j179j401q58O78K976N688Q741J2216
59669C390680J6142K0538K5383L0396L5092L9417M4004M9387N4990N9323O1345
59658C826697O1266N9873N7457N3717M8422M1562L2932K2149R276m958j9778l4849
59646D153766m9875o4160p6937q7790r6381j01986j03931j02392r8365r2844q6340
59635C192765p9168p1753o4691n8903n5752n6546o1717p0555q1592r2892j02291
59624B396905j08049j09656j07764j03363r7258r0166q2651p4902o6986n9284
59614A496826n2215m5659l9348l3855l0277k8725k7988k6966k5631k4145k2152
59603A139865j9600j7411j6313j5647j4327j2475j1069j0360r754r017q414p762
$$ plain form
59684 3346593 3352393 3357013 3360573 3363030 3364271 3364437 3363819 3362640 3361239 3360381 3361059 3364035 3369723 3378464 3390680
59669 3390680 3406822 3427360 3452743 3483139 3518231 3557648 3601652 3651039 3706029 3765352 3826697
59658 3826697 3887963 3947836 4005293 4059010 4107432 4148994 4181926 4204075 4213351 4208393 4188615 4153766
59646 4153766 4103891 4039731 3962794 3875004 3778623 3676637 3572706 3470314 3371949 3279105 3192765
59635 3192765 3113597 3041844 2977153 2918250 2862498 2805952 2744235 2673680 2592088 2499196 2396905
59624 2396905 2288856 2179200 2071436 1968073 1870815 1780649 1697998 1623096 1556110 1496826
59614 1496826 1444611 1398952 1359604 1325749 1295472 1266747 1238759 1211793 1186162 1162017 1139865
59603 1139865 1120265 1102854 1086541 1070894 1056567 1044092 1033023 1022663 1012909 1003892 995478 987716
59591I87716o588n335n164o160o845o157m922m630n481o509p125p655q505r551
59577H97089j0311j0288r195p360n752n145n224n013m109l054k398j913j006M08
59563H26729J856L003M033N302O829Q369R869J1572J3568J5464J6732J7339J7775
59550I58440J8504J9602K0939K2465K4201K6166K8452L1214L4304L6848L7306
59539A258441L4220K7397J8572J0734O224N190N975O881P364P563P333O163L882
59526A405939J017j697l956o023q283j0711j2906j4613j6059j7629j9308k0711
59514A275060k1608k2113k2304k1995k1011j9478j7679j5847j4187j2815j1491
59503A074532r676p055l875n72K671N828Q749J1361J3997J7134K0789K4439K7641
$$ plain form
59591 987716 981128 975793 970629 964469 957624 951467 946545 941915 936434 929925 922800 915145 906640 897089
59577 897089 886778 876490 867295 859935 854183 849038 843814 838801 834692 831638 829240 827327 826321 826729
59563 826729 828585 831588 835621 840923 847752 856121 865990 877562 891130 906594 923326 940665 958440
59550 958440 976944 996546 1017485 1039950 1064151 1090317 1118769 1149983 1184287 1221135 1258441
59539 1258441 1292661 1320058 1338630 1349364 1355588 1360778 1366753 1373634 1380998 1388561 1395894 1402057 1405939
59526 1405939 1406956 1405259 1401303 1395280 1386997 1376286 1363380 1348767 1332708 1315079 1295771 1275060
59514 1275060 1253452 1231339 1209035 1187040 1166029 1146551 1128872 1113025 1098838 1086023 1074532
59503 1074532 1064856 1057801 1053926 1053354 1056025 1061853 1070602 1081963 1095960 1113094 1133883 1158322 1185963
59490A185963L0393L2904L5186L7049L8244L8489L7495L5195L1881K7914K3278
59479A553991J7597J0789L490l420r675j5664k1498k6391k9348l0272l0000k9239
59467A390360k7959k5828k2909j9694j6749j4469j2844j1418r710p842o421n628
59455A208889m952m121l784m724o675q588r940j1206j2937j5054j7141j9003k0632
59442A070132k1970k2920k3434k3503k3270k3143k3350k3452k2746k1317k0072
59431H20955j9484j8917j7652j5976j4567j3300j1560r534q115p413o308l877
59419F74252m38L294P201J1082J3509J2576P952J506m266p917r260q702o765l827
59405F90197J47N261J0722J4425J4075R025J024o823j1977j3807j3435j2345j1108
$$ plain form
59490 1185963 1216356 1249260 1284446 1321495 1359739 1398228 1435723 1470918 1502799 1530713 1553991
59479 1553991 1571588 1582377 1585867 1582447 1572772 1557108 1535610 1509219 1479871 1449599 1419599 1390360
59467 1390360 1362401 1336573 1313664 1293970 1277221 1262752 1249908 1238490 1228780 1220938 1214517 1208889
59455 1208889 1203937 1199816 1196032 1191308 1184633 1176045 1166105 1154899 1141962 1126908 1109767 1090764 1070132
59442 1070132 1048162 1025242 1001808 978305 955035 931892 908542 885090 862344 841027 820955
59431 820955 801471 782554 764902 748926 734359 721059 709499 699965 691850 684437 678129 674252
59419 674252 673814 677108 684309 695391 708900 721476 729428 730934 726668 718751 709491 700789 694024 690197
59405 690197 690344 695605 706327 720752 734827 743852 744876 738053 726076 712269 698834 686489 675381
59392F75381r442p199m777k556m30J802L903N438O311O804P287Q129R658J1852
59378G12161J4179J6043J7315J8250J9082J9955K1010K2194K3144K3642K3957
59367I30932K4424K4830K4731K4211K3834K3822K3846K3686K3665K4297K5890
59356A198168K8545L2096L5968L9536M2887M6749N1475N6464O0920O4828O8765
59345A726401P2933P6735P9325Q0291P9764P7984P4886P0219O4058N6977M9569
59334B509142M1958L4028K5953J8110J0552L012m580j1937j8841k5297l1324l7006
59322B513770m2677m8523n3994n8195o0967o3019o4947o6830o8918p1728p4965
59311A839007p7137p6942p4571p1008o6651o1447n5884n0837m6517m2359l8049
$$ plain form
59392 675381 665939 658740 653963 651407 650977 652779 656682 662120 668431 675235 682522 690651 700309 712161
59378 712161 726340 742383 759698 777948 797030 816985 837995 860189 883333 906975 930932
59367 930932 955356 980186 1004917 1029128 1052962 1076784 1100630 1124316 1147981 1172278 1198168
59356 1198168 1226713 1258809 1294777 1334313 1377200 1423949 1475424 1531888 1592808 1657636 1726401
59345 1726401 1799334 1876069 1955394 2035685 2115449 2193433 2268319 2338538 2402596 2459573 2509142
59334 2509142 2551100 2585128 2611081 2629191 2639743 2642755 2638175 2626238 2607397 2582100 2550776 2513770
59322 2513770 2471093 2422570 2368576 2310381 2249414 2186395 2121448 2054618 1985700 1913972 1839007
59311 1839007 1761870 1684928 1610357 1539349 1472698 1411251 1355367 1304530 1258013 1215654 1177605
59300A177605l3973l0570k7804k5323k2754j9787j6418j3159j0608q762p162n620
59288I55665m395l634l119k656k244j789j072j52N45P79P94R61J303J628J943
59273I44557K562L793N538P188Q042Q009P655P473P253O519N268L831K180q5k938
59258A016845n728p918r658j1399j3240j4922j6233j7220j8050j8822j9468j9834
59246H44353j9842j9584j9164j8555j7724j6737j5626j4316j2862j1519j0420
59235F68004r427q522q015p973p827p024n804m771l957k909j558k88P43J695K450
59220F04817K651K458K506L030L644M134M803N768O701P512Q630J0208J1724J2851
59206F91437J4063J5908J8194K0446K2582K4616K6213K7347K8910L1868L5983
$$ plain form
59300 1177605 1143632 1113062 1085258 1059935 1037181 1017394 1000976 987817 977209 968447 961285 955665
59288 955665 951270 947636 944517 941861 939617 937828 936756 936604 937149 937928 938722 939683 940986 942614 944557
59273 944557 947119 950912 956450 963638 971680 979689 987344 994817 1002070 1008589 1013857 1017688 1019868 1019783 1016845
59258 1016845 1011117 1003199 993541 982142 968902 953980 937747 920527 902477 883655 864187 844353
59246 844353 824511 804927 785763 767208 749484 732747 717121 702805 689943 678424 668004
59235 668004 658577 650055 642040 634067 626240 619216 613412 608641 604684 601775 600217 599929 600672 602367 604817
59220 604817 607468 609926 612432 615462 619106 623240 628043 633811 640512 648024 656654 666862 678586 691437
59206 691437 705500 721408 739602 760048 782630 807246 833459 860806 889716 921584 957567
59195I57567M0070M3391M6155M8738N1219N3571N5670N6929N6513N4155N0314
59184A514292M5443L9461L2158K3655J4330M552n262j4591k3005l0366l6700m2004
59172A521963m6113m8738m9641m8934m7052m4426m1273l7883l4709l1927k9159
59161A062108k6036k2810j9915j7196j4149j0835p947n862m277k887j769r10J9
59148I27534J027J493J041L05K10P64J156R28M14k5n71j488k538l199l254k919
59132I20878k501k114j688j099l49L67R15J490K393L431L939L548K697K056J687
59117I35650J275Q62P34O50m5j364k456k829l158m259n841p012p596q109q598
59102H87904q535p911p532p851q262p979p064o130n528n249n205n173m719l690
$$ plain form
59195 957567 997637 1041028 1087183 1135921 1187140 1240711 1296381 1353310 1409823 1463978 1514292
59184 1514292 1559735 1599196 1631354 1655009 1669339 1673891 1668629 1654038 1631033 1600667 1563967 1521963
59172 1521963 1475850 1427112 1377471 1328537 1281485 1237059 1195786 1157903 1123194 1091267 1062108
59161 1062108 1036072 1013262 993347 976151 962002 951167 943220 937358 933081 930194 928425 927515 927534
59148 927534 928561 930054 931095 931400 931610 932374 933530 934458 934872 934847 934276 932788 930250 927051 923797 920878
59132 920878 918377 916263 914575 913476 913127 913494 914409 915899 918292 921723 925662 929210 931907 933963 935650
59117 935650 936925 937787 938521 939171 939126 937762 935306 932477 929319 925060 919219 912207 904611 896502 887904
59102 887904 879369 871458 863926 856075 847813 839834 832770 826640 821112 815863 810658 805485 800766 797076
59088G97076k460j429o08K6K14o3j79M16J322J708J448J175J343J829K378K825
59072H07021K907K442J744J295J035M82m13j215j856k787m097n152n478n407n438
59057G85083n479n310n278n847o708o997o432n662n444n873o523o979p018o615
59043F98918n967n430n267n436n721n987o276o654o987o998o589o004n550n200
59029F14852m715m066l507l121k658j948j198o52j76M75J207J652J670J446J128
59014F00389P25K80r9m47q67j210j169p97o06q68j127p53K00J081J466J502J411
58997E99111J177Q64Q57J384K137K697L124L756M616N433O186P096Q158R162J0251
58982F66009J1869J3921J5600J6393J6850J7870J9579K1396K2840K3741K3861
$$ plain form
59088 797076 794616 793187 792579 792605 792819 792756 792577 792993 794315 796023 797471 798646 799989 801818 804196 807021
59072 807021 809928 812370 814114 815409 816444 816926 816513 815298 813442 810655 806558 801406 795928 790521 785083
59057 785083 779604 774294 769016 763169 756461 749464 743032 737370 731926 726053 719530 712551 705533 698918
59043 698918 692951 687521 682254 676818 671097 665110 658834 652180 645193 638195 631606 625602 620052 614852
59029 614852 610137 606071 602564 599443 596785 594837 593639 592987 592811 593286 594493 596145 597815 599261 600389
59014 600389 601114 601394 601295 600848 599981 598771 597602 596805 596199 595331 594204 593451 593651 594732 596198 597700 599111
58997 599111 600288 601152 602009 603393 605530 608227 611351 615107 619723 625156 631342 638438 646596 655758 666009
58982 666009 677878 691799 707399 723792 740642 758512 778091 799487 822327 846068 869929
58971H69929K2983K1367J9502J7476J5044J2319R761P408M717J469j781m474o779
58958I88941r202j1771j4006j5434j5832j5266j4246j3554j3491j3525j3041j2195
58946H27378j1524j0971r895q027n862l968k485j448j070j253j268m19J066K299
58932G72553K884L316M200N435O491P176P816Q745R961J1266J2502J3573J4520
58919H80438J5641J7222J9033K0430K1269K2453K5078K9085L3167L6121L7905
58908A157842L9161M0098M0135L8474L4734K9201K2692J6351J1253Q031O772P177
58896A451921Q803J1210J4012J6927J9872K2906K5974K8700L0713L2200L3799
58885A697037L5759L7570L8774L9767M1196M2853M3886M4066M3969M3601M1682
$$ plain form
58971 869929 892912 914279 933781 951257 966301 978620 988381 995789 1000506 1001975 1000194 995720 988941
58958 988941 979739 967968 953962 938528 922696 907430 893184 879630 866139 852614 839573 827378
58946 827378 815854 804883 794988 786961 781099 777131 774646 773198 772128 770875 769607 769188 770254 772553
58932 772553 775437 778753 782953 788388 794879 802055 809871 818616 828577 839843 852345 865918 880438
58919 880438 896079 913301 932334 952764 974033 996486 1021564 1050649 1083816 1119937 1157842
58908 1157842 1197003 1237101 1277236 1315710 1350444 1379645 1402337 1418688 1429941 1437972 1444744 1451921
58896 1451921 1460724 1471934 1485946 1502873 1522745 1545651 1571625 1600325 1631038 1663238 1697037
58885 1697037 1732796 1770366 1809140 1848907 1890103 1932956 1976842 2020908 2064877 2108478 2150160
58874B150160L6880K9319K0350J1276K845m462j0428j5267j9229k2185k4028k5343
58862B129888k6978k8996l0735l1920l3072l4587l6086l7029l7528l8038l8590
58851A756329l8838l8691l8453l8334l8177l7752l7034l6116l5016l3723l2294
58840A351901l0793k9197k7495k5868k4584k3550k2235k0230j7877j5922j4596
58829A099554j3376j1750r795p765n679l669k263j707j273j7J876L262L543L341
58815A054282L527M284N385O664P802Q167P512O458N808N682N704N737N959O415
58801A139386O963P593Q385R369J0690J2608J4976J7039J8350J9587K1758K4743
58789A311447K7443K9360L1179L3557L6147L8296L9969M1408M2434M2723M2453
$$ plain form
58874 2150160 2187040 2216359 2236709 2247985 2250830 2246368 2235940 2220673 2201444 2179259 2155231 2129888
58862 2129888 2102910 2073914 2043179 2011259 1978187 1943600 1907514 1870485 1832957 1794919 1756329
58851 1756329 1717491 1678800 1640347 1602013 1563836 1526084 1489050 1452934 1417918 1384195 1351901
58840 1351901 1321108 1291911 1264416 1238548 1213964 1190414 1168179 1147949 1130072 1114150 1099554
58829 1099554 1086178 1074428 1064633 1056868 1051189 1047520 1045257 1043550 1042277 1042260 1044136 1047398 1050941 1054282
58815 1054282 1057809 1062093 1067478 1074142 1081944 1090111 1097623 1104081 1109889 1115571 1121275 1127012 1132971 1139386
58801 1139386 1146349 1153942 1162327 1171696 1182386 1194994 1209970 1227009 1245359 1264946 1286704 1311447
58789 1311447 1338890 1368250 1399429 1432986 1469133 1507429 1547398 1588806 1631240 1673963 1716416
58778A716416M1928M0742L8052L3760K8773K3916J9084J3709P690J514m273r380
58766A951931j3667j7150k0140k3108k6287k9433l2082l3977l5246l6244l7251
58755A647346l8291l9178l9672l9693l9367l8879l8252l7315l5944l4274l2542
58744A233939l0788k8896k6980k5484k4622k3912k2573k0475j8407j7220j6890
58733I77692j6633j5806j4442j3012j1882j1124j0603j0073r250p965o295m468
58721H46139k678r55Q02K706M737O713Q504J0268J2309J4536J6155J6078J3673
58708I48987R099L033l752j0653j7288k3354k8336l1487l2325l1224k9228k7212
58696G26260k5294k3124k0520j7676j4909j2357r892p278m485j855K65K000L848
$$ plain form
58778 1716416 1758344 1799086 1837138 1870898 1899671 1923587 1942671 1956380 1964070 1965584 1961311 1951931
58766 1951931 1938264 1921114 1900974 1877866 1851579 1822146 1790064 1756087 1720841 1684597 1647346
58755 1647346 1609055 1569877 1530205 1490512 1451145 1412266 1374014 1336699 1300755 1266481 1233939
58744 1233939 1203151 1174255 1147275 1121791 1097169 1073257 1050684 1030209 1011802 994582 977692
58733 977692 961059 945253 930811 917799 905917 894793 884190 874117 864867 856902 850607 846139
58721 846139 843461 842506 843308 846014 850751 857464 865968 876236 888545 903081 919236 935314 948987
58708 948987 958086 961119 957367 946714 929426 906072 877736 846249 813924 782700 753472 726260
58696 726260 700966 677842 657322 639646 624737 612380 602488 595210 590725 588870 589135 591135 594983
58683E94983O109Q665J1342J3949J5751J5528J2719Q182L352j187n560r384j1565
58670F62884j1601j0288q736p182n309l288j901j705k588m175o275q814j1488
58657E79534j3659j4693j4480j3587j2701j1980j1186j0339r769r408q592o911
58645D42229m900l384k557k085j838j901k027j754j081n31l61k02L91J349K222
58630D23570K695K806K873L218L779M062L695K947K362K000J485P57K16L8j14
58615D56389n04q84q70m08L40J184J816J972J908K301L340M404M895M954M977
58600D85814M924M683M625N139N903O337O538P061P856Q266Q164Q295R220J0569
58586E83394J1631J2221J2532J2624J2451J2135J1791J1297J0471R363Q137O832
$$ plain form
58683 594983 601092 609757 621099 635048 650799 666327 679046 687228 690580 689393 683833 674449 662884
58670 662884 651283 640995 632259 625077 619768 616480 614579 612874 610286 606111 599836 591022 579534
58657 579534 565875 551182 536702 523115 510414 498434 487248 476909 467140 457732 449140 442229
58645 442229 437329 433945 431388 429303 427465 425564 423537 421783 420702 420171 419810 419608 419999 421348 423570
58630 423570 426265 429071 431944 435162 438941 443003 446698 449645 452007 454007 455492 456249 456465 456503 456389
58615 456389 455885 455001 454131 453723 454063 455247 457063 459035 460943 463244 466584 470988 475883 480837 485814
58600 485814 490738 495421 500046 505185 511088 517425 523963 531024 538880 547146 555310 563605 572825 583394
58586 583394 595025 607246 619778 632402 644853 656988 668779 680076 690547 699910 708047 714879
58574G14879N446M088K842J632M67m28r02j221j819k762l670m128m027l566l012
58559G03819k517k146k044k424l224l959m255m467n284o650p681p853p781q294
58545F35240r269r940j0054j0045j0180j0241j0096r884r477q503p096o035n724
58532E18696n667n370n200n548n706m610k563j218j481k390k550j940j515j575
58518D71363j505r70l52J20Q24J886K609K331J451R22R62R58N14Qn7K42M40K55
58500D82001j59l78l4Q20J642J969J998K366L314M411N159N460N427N167M949
58485E24112N071N316M940L600J933Q22L83J54j25m09p63j218j436j198j044j738
58469E38400l016l740l458k956k924k881k075p96K1J54K33O46J128J464J838K302
$$ plain form
58574 714879 720325 724413 727255 728887 729354 728926 728024 726803 724984 722222 718552 714424 710397 706831 703819
58559 703819 701302 699156 697112 694688 691464 687505 683250 678783 673499 666849 659168 651315 643534 635240
58545 635240 625971 616031 605977 595932 585752 575511 565415 555531 546054 537551 530455 524420 518696
58532 518696 513029 507659 502459 496911 491205 486595 484032 482814 481333 478943 476393 474453 472938 471363
58518 471363 469858 468888 468536 468656 469480 471366 473975 476306 477757 478679 479641 480599 481113 481121 481064 481306 481746 482001
58500 482001 481842 481464 481430 482250 483892 485861 487859 490225 493539 497950 503109 508569 513996 519163 524112
58485 524112 529183 534499 539439 543039 544972 545794 546177 546331 546206 545797 545034 543816 542380 541182 540138 538400
58469 538400 535384 531644 528186 525230 522306 519425 517350 516554 516575 516729 516962 517608 518736 520200 522038 524340
58453E24340K437J952J130L97j94p06q80m44L00O64L91o2j39K44Q67J623K429
58436E34349K945K838K319K054K406L030L391L414L372L386L374L385L540L740
58422E77543L731L517L350L335L408L658M205M729M705M228M061M520N011N009
58408F35010M915N292N828N850N442N280N512N665N562N561N878O398P080P815
58394G17088P952O904N335M688N319O041N854N129M620M382M349M975O324P407
58380G96367P391O841O752O984O778O277O250O634O657O322O480P331Q085Q293
58366H93442Q421Q769Q939Q730Q544Q520Q136P274O734P147Q085Q792R175R472
58352A010180R587R429R368R751J0356J0866J1423J2209J2900J3089J2935J2901
$$ plain form
58453 524340 526777 528729 529859 530256 530062 529356 528476 528032 528332 528996 529387 529325 529186 529430 530297 531920 534349
58436 534349 537294 540132 542451 544505 546911 549941 553332 556746 560118 563504 566878 570263 573803 577543
58422 577543 581274 584791 588141 591476 594884 598542 602747 607476 612181 616409 620470 624990 630001 635010
58408 635010 639925 645217 651045 656895 662337 667617 673129 678794 684356 689917 695795 702193 709273 717088
58394 717088 725040 731944 737279 741967 747286 753327 759181 764310 768930 773312 777661 782636 788960 796367
58380 796367 803758 810599 817351 824335 831113 837390 843640 850274 856931 863253 869733 877064 885149 893442
58366 893442 901863 910632 919571 928301 936845 945365 953501 960775 967509 974656 982741 991533 1000708 1010180
58352 1010180 1019767 1029196 1038564 1048315 1058671 1069537 1080960 1093169 1106069 1119158 1132093 1144994
58340A144994J3119J3393J3537J3466J3262J3348J4066J4934J5063J4500J4355
58329A298037J5119J5818J5553J4937J5099J6012J6851J7435J8214J9129J9648
58318A481852J9724J9818K0136K0636K1523K2857K4026K4545K5028K6322K7999
58307A734466K8919K9039K9320K9935K9986K9292K8977K9799L1081L1963L2604
58296B065381L3410L4005L3864L3341L3293L3984L5070L6248L7438L8588L9760
58285B454382M1161M2772M4308M5720M7373M9420N1434N2982N4219N5624N7360
58274B996755N9233O0998O2613O4324O6537O9383P2452P5259P7877Q0749Q4015
58263C770195Q7498R1124R4869R8503J02007J05972J10844J16067J20756J25062
$$ plain form
58340 1144994 1158113 1171506 1185043 1198509 1211771 1225119 1239185 1254119 1269182 1283682 1298037
58329 1298037 1313156 1328974 1344527 1359464 1374563 1390575 1407426 1424861 1443075 1462204 1481852
58318 1481852 1501576 1521394 1541530 1562166 1583689 1606546 1630572 1655117 1680145 1706467 1734466
58307 1734466 1763385 1792424 1821744 1851679 1881665 1910957 1939934 1969733 2000814 2032777 2065381
58296 2065381 2098791 2132796 2166660 2200001 2233294 2267278 2302348 2338596 2376034 2414622 2454382
58285 2454382 2495543 2538315 2582623 2628343 2675716 2725136 2776570 2829552 2883771 2939395 2996755
58274 2996755 3055988 3116986 3179599 3243923 3310460 3379843 3452295 3527554 3605431 3686180 3770195
58263 3770195 3857693 3948817 4043686 4142189 4244196 4350168 4461012 4577079 4697835 4822897
58253D822897J29871J35354J40932J46594J52994J60164J67336J74388J82278
58244F212808J91634K01916K12428K23254K34852K47548K61667K77301K93823
58235H357231L10558L28098L47836L70154L94257M19846M47653M78190N11389
58226A1965212N47693N88020O32448O80382P31947P87683Q47201R10535R80763
58217A8671884J062792J159375J271051J399909J549961J723497J921216K146882
58209C0906567K407674K709374L056921L461405L940738M512410N193396O004011
58201F2192496O945404P949833Q868549R554796R991699J0337661J0832319J1647679
58193A38320436J2808543J4211100J5672974J6955609J7765385J7772028J6666738
$$ plain form
58253 4822897 4952768 5088122 5229054 5375648 5528642 5688806 5856142 6030530 6212808
58244 6212808 6404442 6606358 6818786 7042040 7276892 7524440 7786107 8063408 8357231
58235 8357231 8667789 8995887 9343723 9713877 10108134 10527980 10975633 11453823 11965212
58226 11965212 12512905 13100925 13733373 14413755 15145702 15933385 16780586 17691121 18671884
58217 18671884 19734676 20894051 22165102 23565011 25114972 26838469 28759685 30906567
58209 30906567 33314241 36023615 39080536 42541941 46482679 50995089 56188485 62192496
58201 62192496 69137900 77087733 85956282 95511078 105502777 115840438 126672757 138320436
58193 138320436 151128979 165340079 181013053 197968662 215734047 233506075 250172813
58186B50172813J4254360J0549043N822674N63389m649422r294087j3013089j5648260
58178B38757421j7216345j7852732j7749747j7108362j6110207j4905532j3609905
58171A24204591j2305964j1048615r871086q790334p812193o936014o157464n469582
58163E5813339m863851m331451l863679l452005l089021k769385k488982k243379
58155B8711586k027867j838405j671354j522748j389186j269096j161801j065567
58147A6765562r78068q98418q27044p63492p05972o53194o05167n61749n22011
58138A0250447m85376m52053m21909l94226l68896l46486l26673l08018k89862
58129F856948k73042k58083k44049k30078k16746k04919j94272j84033j74326
$$ plain form
58186 250172813 264427173 274976216 280798890 281362279 276712857 267418770 254405681 238757421
58178 238757421 221541076 203688344 185938597 168830235 152720028 137814496 124204591
58171 124204591 111898627 100850012 90978926 82188592 74376399 67440385 61282921 55813339
58163 55813339 50949488 46618037 42754358 39302353 36213332 33443947 30954965 28711586
58155 28711586 26683719 24845314 23173960 21651212 20262026 18992930 17831129 16765562
58147 16765562 15787494 14889076 14062032 13298540 12592568 11939374 11334207 10772458 10250447
58138 10250447 9765071 9313018 8891109 8496883 8127987 7781501 7454828 7146810 6856948
58129 6856948 6583906 6325823 6081774 5851696 5634950 5430031 5235759 5051726 4877400
58120D877400j65691j57879j50221j42772j36233j30848j26070j21080j15368
58111C631238j09148j03437r9184r5965r2301q7595q2957p9610p7286p4922p2197
58100B656636o9520o6992o4307o1475n8809n6327n3764n1105m8668m6638m4913
58089B034118m3284m1630l9997l8640l7745l7075l6297l5501l4979l4516l3677
58078A620777l2742l2434l2506l1696k9550k7329k6393k6462k6364k5723k4979
58067A304599k4281k3404k2478k1871k1505k1011k0418j9957j9382j8256j6902
58056A075134j6302j6939j8175j8936j8668j7643j6602j6071j5870j5449j4735
58045H89744j4247j4175j3971j3254j2532j2366j2357j1741j0656r895r658r389
$$ plain form
58120 4877400 4711709 4553830 4403609 4260837 4124604 3993756 3867686 3746606 3631238
58111 3631238 3522090 3418653 3319469 3223504 3131203 3043608 2960651 2881041 2803755 2728833 2656636
58100 2656636 2587116 2520124 2455817 2394342 2335533 2279206 2225442 2174337 2125669 2079031 2034118
58089 2034118 1990834 1949204 1909207 1870567 1832822 1795747 1759450 1723949 1688970 1654454 1620777
58078 1620777 1588035 1555601 1523095 1491399 1461849 1434520 1408127 1381665 1355301 1329578 1304599
58067 1304599 1280318 1256914 1234436 1212565 1191060 1170049 1149631 1129674 1110292 1092036 1075134
58056 1075134 1058832 1041893 1023718 1004782 986114 968471 951869 935798 919928 904479 889744
58045 889744 875497 861322 847351 834097 821565 809199 796842 785101 774445 764550 754892 745503
58033G45503q911q757r217r805r983r894j0000j0387j0753j0775j0305r383q261
58020F19072p293o711o555o697o811o450n501m471m033m250m486m120l172k212
58006E46310j793j992k412k631k571k346j928j256n49m2N38J638K955L578L347
57991E40846L287M188N472O220O619P520Q925J0001J0439J0876J1843J3099J4293
57978F53628J5532J7035J8648J9983K0739K0777K0145J9043J7524J5274J2045
57967H50373Q171M225L21l826q205j2404j6140j9373k1841k3078k3071k2488k2123
57954F90541k2255k2598k2491k1259j8819j5948j3632j2151j1084j0076r105q134
57942E02989p038n883m870l936k907j988j622j851k270k651l071l477l685l875
$$ plain form
58033 745503 736592 727835 718618 708813 698830 688936 678936 668549 657796 647021 636716 627333 619072
58020 619072 611779 605068 598513 591816 585005 578555 573054 568583 564550 560300 555814 551694 548522 546310
58006 546310 544517 542525 540113 537482 534911 532565 530637 529381 528832 528790 529328 530966 533921 537499 540846
57991 540846 544133 548321 553793 560013 566632 574152 583077 593078 603517 614393 626236 639335 653628
57978 653628 669160 686195 704843 724826 745565 766342 786487 805530 823054 838328 850373
57967 850373 858544 862769 863090 859264 851059 838655 822515 803142 781301 758223 735152 712664 690541
57954 690541 668286 645688 623197 601938 583119 567171 553539 541388 530304 520228 511123 502989
57942 502989 495951 490068 485198 481262 478355 476367 474745 472894 470624 467973 464902 461425 457740 453865
57928D53865m442n251n601n120m218l419k791k136j229K23K311M342N247M828
57914D36609M160M339N383O599P549Q207Q576Q595Q136O797M100K31l724o689
57900D98868q461r522j0344j1172j2046j2714j2821j2531j2496j2881j2911j1912
57888C59057j0405r493r461r582r245q662q336q350q343q008p362o589n692m504
57874B45025l186k437k757l515l451k169n54M88R81J279J335J220J567K652L538
57859B40016L160J968J446K113K978L040K366J476N69l02r28j315j800k440k753
57844B49594k447j967j833j803j231r4Q63J032O04K61L85P62J009J159J689K852
57828B50835M112M464L345J119j342l321m492m796m402l696l107k796k530j943
$$ plain form
57928 453865 449423 444172 438571 433451 429233 425814 423023 420887 419658 419881 422192 426534 431781 436609
57914 436609 440769 445108 450491 457090 464639 472846 481422 490017 498153 504950 509050 509281 505557 498868
57900 498868 490407 480885 470541 459369 447323 434609 421788 409257 396761 383880 370969 359057
57888 359057 348652 339159 329698 320116 310871 302209 293873 285523 277180 269172 261810 255221 249529 245025
57874 245025 241839 239402 236645 233130 229679 227510 226956 227444 228425 229704 231039 232259 233826 236478 240016
57859 240016 243176 245144 246590 248703 251681 254721 257087 258563 259132 258830 257902 256587 254787 252347 249594
57844 249594 247147 245180 243347 241544 240313 240219 241082 242114 242718 242979 243364 244126 245135 246294 247983 250835
57828 250835 254947 259411 262756 263875 262533 259212 254720 249924 245522 241826 238719 235923 233393 231450
57814B31450r62P2P61J085J361J843K565L546M773O001O891P527Q334R351J0074
57799B94672J0283J0516J1244J2035J2188J1695J0951R910Q308O452M804K923
57787D05981m9l810o867q353q859r154r155q729q461q744r012q800q773r617j0566
57772B87032j0320r082q292q464q649q215p741p694p412o279m932m407m619m539
57758A86387l585k098p38n3l91j495k364k069p85M94J076J029O82L00J21J72J30
57741A76813j06O1J083K150J990P96K54J200K460K660K150K036K238J846J007
57726A98638R36K021L200L467K937K093J078K18K38J210K001J556K32r02j568
57711B17355k283l196l813l836l516l143k813k703k959l205k740j453j26M19J55
$$ plain form
57814 231450 230488 230560 231321 232406 233767 235610 238175 241721 246494 252495 259386 266913 275247 284598 294672
57799 294672 304955 315471 326715 338750 350938 362633 373584 383494 391802 398254 403058 405981
57787 405981 405932 402122 395255 386902 378043 368889 359734 351005 342544 333800 324788 315988 307215 297598 287032
57772 287032 276712 267630 259338 250874 242225 234010 226269 218575 211163 204884 199952 195545 190926 186387
57758 186387 182802 180704 179966 179913 179522 178027 175663 173594 172809 173303 174379 175408 176090 176390 176511 176683 176813
57741 176813 176707 176768 177851 180001 181991 182787 183041 184241 186701 189361 191511 193547 195785 197631 198638
57726 198638 199574 201595 204795 208262 211199 213292 214370 214588 214826 216036 218037 219593 219825 218923 217355
57711 217355 215072 211876 208063 204227 200711 197568 194755 192052 189093 185888 183148 181695 181569 181988 182143
57696A82143l28n46m79l93m67n50k85M13J191J713K138K831L799M750N604O535
57680B08069P571Q669J0126J2309J5004J7639K0284K3819K8791L4713M0819M6763
57668D74576N1760N3451M8816L6668J9060J87j5917k6887l2245l2896l0394k6249
57656E19930k1557j7029j3071r760o829l923j020J434K919L401L420L518L769
57643D65202L882L621K874J584q2j560k363k755l490m731n709n759n332n536o776
57628D33070q232q676p678o045n139n646o867p432o770n611m933m810m661m245
57614C46325l861l685l459k913k103j230m34J71N06P15J090J762K608L463M173
57599C43128M500M307L861L699M049M594M878M724M288L937M111M965N970O213
$$ plain form
57696 182143 181815 181269 180790 180397 179930 179380 179095 179508 180699 182412 184550 187381 191180 195930 201534 208069
57680 208069 215640 224309 234435 246744 261748 279387 299671 323490 352281 386994 427813 474576
57668 474576 526336 579787 628603 665271 684331 684518 668601 641714 609469 576573 546179 519930
57656 519930 498373 481344 468273 458513 451684 447761 446741 448175 451094 454495 457915 461433 465202
57643 465202 469084 472705 475579 477163 477081 475521 473158 470403 466913 462182 456473 450714 445382 439846 433070
57628 433070 424838 416162 408484 402439 397300 391654 384787 377355 370585 364974 360041 355231 350570 346325
57614 346325 342464 338779 335320 332407 330304 329074 328640 328811 329317 330032 331122 332884 335492 338955 343128
57599 343128 347628 351935 355796 359495 363544 368138 373016 377740 382028 385965 390076 395041 401011 407224
57585D07224N318L819K495J605J012O12K32o35k365m510o105o802p244q099r160
57570C77397r733r655r476r632r858r566q618p546p044p314p899q126p688o854
57556B58388o175n958n969n647m669l393k626k723l080k741j614o05m27o76m87
57541B11598K04O05K18n37r74r19o03k20R8J55k6l6M68J245J679J439P27N0r1
57522B15080N01J449K039J967J732J875K237K329K250K547L341M153M659M941
57508B51100M952M447L687L523M295N231N379M849M560N021N823O251O019N411
57494C20548M933M818M805M489L873L268K754K157J586J358J192K49j576l195
57480C51259l691l569l863m650n350o001p029p954p679o212m927m708m817m248
$$ plain form
57585 407224 412542 416361 418856 420461 421473 422085 422317 421682 419317 414807 408702 401900 394656 386557 377397
57570 377397 367664 358009 348533 338901 329043 319477 310859 303313 296269 288955 281056 272930 265242 258388
57556 258388 252213 246255 240286 234639 229970 226577 223951 221228 218148 215407 213793 213188 212761 212085 211598
57541 211598 211802 212407 212625 212088 211114 210195 209592 209372 209470 209625 209599 209563 210031 211276 212955 214394 215121 215171 215080
57522 215080 215581 217030 219069 221036 222768 224643 226880 229209 231459 234006 237347 241500 246159 251100
57508 251100 256052 260499 264186 267709 272004 277235 282614 287463 292023 297044 302867 309118 315137 320548
57494 320548 325481 330299 335104 339593 343466 346734 349488 351645 353231 354589 355781 356030 354454 351259
57480 351259 347568 343999 340136 335486 330136 324135 317106 309152 301473 295261 290334 285626 280809 276561
57466B76561l230k678k817l144l382l618l689l230k242j118n9R73J762J808J043
57451B52940J73J6O53J474J962K223K656L312L794L862L840M247N135O106O840
57436B99233P315P556P525P292O980O447N427M015K708J768J003K92j21j61l28
57421C56951j119k362l539m483n361o102o387o164n767n483n384n574o196p070
57407B85960p588p240o131m935m325m451m865m936m397l472k516j789j503j756
57393B26056k231k274j606p81n87j131j814k065j778j169n48k15k65m47m64l53
57377B08328l11j71M50J485K247K198J599J177J268J545J530J253J225J834K804
57362B28461L408L237K566J934J573J432J519J880K354K677K826K950L008K758
$$ plain form
57466 276561 273331 270653 267836 264692 261310 257692 254003 250773 248531 247413 247354 248327 250089 251897 252940
57451 252940 253113 253129 253782 255256 257218 259441 262097 265409 269203 273065 276905 281152 286287 292393 299233
57436 299233 306548 314104 321629 328921 335901 342348 347775 351790 354498 356266 357269 357561 357440 357279 356951
57421 356951 355832 353470 349931 345448 340087 333985 327598 321434 315667 310184 304800 299226 293030 285960
57407 285960 278372 271132 265001 260066 255741 251290 246425 241489 237092 233620 231104 229315 227812 226056
57393 226056 223825 221551 219945 219164 218577 217446 215632 213567 211789 210620 210072 209857 209592 209145 208681 208328
57377 208328 208017 207846 208296 209781 212028 214226 215825 217002 218270 219815 221345 222598 223823 225657 228461
57362 228461 231869 235106 237672 239606 241179 242611 244130 246010 248364 251041 253867 256817 259825 262583
57348B62583K141J431R73R78J491K330L061L321L190K999K837K531K110J875J906
57333B95757J859J448R12P73J272K135K786K784K194J543J283J328J447J803K683
57318C22007L701L958L242K479K590L361L901L899L821M074M481M639M305L477
57304C73935K379J522J463K366L880N434O528O853O456N786N387N420N631N730
57290D38770N678N618N732O111O693P178P257O931O577O650P271Q044Q286P666
57276E34462O736O494P240Q113Q058P066O014N548N583N789N938N711M821L618
57262F21191L019L440M177M317L873L569L734M011M046L900L712L513L477L942
57248F73921M890N717N863N440N071N214N817O454O656O220N453N033N428O439
$$ plain form
57348 262583 264724 266155 267128 268106 269597 271927 274988 278309 281499 284498 287335 289866 291976 293851 295757
57333 295757 297616 299064 299976 300749 302021 304156 306942 309726 311920 313463 314746 316074 317521 319324 322007
57318 322007 325708 329666 332908 335387 337977 341338 345239 349138 352959 357033 361514 366153 370458 373935
57304 373935 376314 377836 379299 381665 385545 390979 397507 404360 410816 416602 421989 427409 433040 438770
57290 438770 444448 450066 455798 461909 468602 475780 483037 489968 496545 503195 510466 518510 526796 534462
57276 534462 541198 547692 554932 563045 571103 578169 584183 589731 595314 601103 607041 612752 617573 621191
57262 621191 624210 627650 631827 636144 640017 643586 647320 651331 655377 659277 662989 666502 669979 673921
57248 673921 678811 684528 690391 695831 700902 706116 711933 718387 725043 731263 736716 741749 747177 753616
57234G53616P350P517O857N929N537O059P038P622P456O955O630O564O619O820
57220H48569P169P385P279P048O930O831O714O979P803Q445Q055P059O799P696
57206I50761Q669Q723Q166P836P891Q124Q649R536J0186R993R264Q752Q537Q184
57192A073271P747P722Q053Q155P892P769P916P873P526P497Q109Q741Q771Q554
57178A185596Q848R631J0207J0255J0209J0523J1037J1200J0719R915R445R650
57166A307235J0200J0512J0496J0545J0921J1487J2049J2546J2773J2470J1860
57155A433094J1673J2292J3259J3906J4124J4273J4640J5326J6277J7140J7429
57144A593433J7170J7075J7704J8801J9818K0758K1976K3495K5041K6555K8111
$$ plain form
57234 753616 760966 768483 775340 781269 786806 792865 799903 807525 814981 821936 828566 835130 841749 848569
57220 848569 855738 863123 870402 877450 884380 891211 897925 904904 912707 921152 929207 936266 943065 950761
57206 950761 959430 968153 976319 984155 992046 1000170 1008819 1018355 1028541 1038534 1047798 1056550 1065087 1073271
57192 1073271 1081018 1088740 1096793 1104948 1112840 1120609 1128525 1136398 1143924 1151421 1159530 1168271 1177042 1185596
57178 1185596 1194444 1204075 1214282 1224537 1234746 1245269 1256306 1267506 1278225 1288140 1297585 1307235
57166 1307235 1317435 1327947 1338443 1348988 1359909 1371396 1383445 1395991 1408764 1421234 1433094
57155 1433094 1444767 1457059 1470318 1484224 1498348 1512621 1527261 1542587 1558864 1576004 1593433
57144 1593433 1610603 1627678 1645382 1664183 1684001 1704759 1726735 1750230 1775271 1801826 1829937
57133A829937K9525L0588L1566L2907L4548L6060L7445L9207M1518M3950M6172
57122B233423M8416N1040N4039N7313O1060O5609P1048P7288Q4388R2592J02147
57111B998363J13158J25647J39748J55907J74851J97231K23357K53435K87946
57102D669643L27642L73182M24977M83300N48281O19788O97419P80513Q67853
57093I792598R57391J046494J132328J211734J280697J334305J367452J375526
57085A9498525J354560J301124J212576J087867R28583P39511N28056L02777P2088
57076B7025667j56111l74461n76476p57010r12324j039953j138747j208824j251219
57067A9610542j267742j261222j235388j193914j139845j076154j006370r33935
$$ plain form
57133 1829937 1859462 1890050 1921616 1954523 1989071 2025131 2062576 2101783 2143301 2187251 2233423
57122 2233423 2281839 2332879 2386918 2444231 2505291 2570900 2641948 2719236 2803624 2896216 2998363
57111 2998363 3111521 3237168 3376916 3532823 3707674 3904905 4128262 4381697 4669643
57102 4669643 4997285 5370467 5795444 6278744 6827025 7446813 8144232 8924745 9792598
57093 9792598 10749989 11796483 12928811 14140545 15421242 16755547 18122999 19498525
57085 19498525 20853085 22154209 23366785 24454652 25383235 26122746 26650802 26953579 27025667
57076 27025667 26869556 26495095 25918619 25161609 24249285 23209332 22070585 20861761 19610542
57067 19610542 18342800 17081578 15846190 14652276 13512431 12436277 11429907 10495972
57059A0495972q61221p89807p21363o57346n97927n42297m90262m42715m00263
57050D992771l62201l27315k95035k65340k37972k12234j87497j63892j43002
57041B798283j27767j20602j20829j24504j27266j27052j23874j18108j10085
57032A698196j00830r1814q3747p6362o9482o3528n8730n4517n0187m5755m1761
57021I61483l8459l5643l3141l1082k9568k8371k7158k5905k4797k3766k2471
57010F41122k0849j9396j8554j8011j7101j5770j4668j4218j4081j3686j2832
56999D61956j1621j0231q975q195p802p249o250n200m619m440m177l487k398j220
56985C76092m82o35j549k568l276l901m772n787o722p571q207q202p454o596o234
$$ plain form
57059 10495972 9634751 8844944 8123581 7466235 6868308 6326011 5835749 5393034 4992771
57050 4992771 4630570 4303255 4008220 3742880 3504908 3292674 3105177 2941285 2798283
57041 2798283 2670516 2549914 2429085 2304581 2177315 2050263 1926389 1808281 1698196
57032 1698196 1597366 1505552 1421805 1345443 1275961 1212433 1153703 1099186 1048999 1003244 961483
57021 961483 923024 887381 854240 823158 793590 765219 738061 712156 687359 663593 641122
57010 641122 620273 600877 582323 564312 547211 531441 516773 502555 488474 474788 461956
56999 461956 450335 440104 431129 422934 415132 407883 401633 396433 391814 387374 383197 379710 377312 376092
56985 376092 375610 374975 373426 370858 367582 363681 358909 353122 346400 338829 330622 322420 314966 308370 302136
56970C02136o122n625m697l755k850j624j7J618L051M311N336N960O190O058N357
56955C15327L969K272O97r58l133n567p378q042p699o625n104l744l116k942k357
56940B65600j096L05J576L120N042O631P344P594P957Q112P243N112K214q52l657
56925C22245n912p629r147j0601j1591j1738j1244j0463r306p609n884m955m907
56912B11259m938m419l573k979k774k653k381k056j898j963k040j870j461j096
56898A75158r09n87K91J669K998L767L947L902M037M527N222N729N739N281M646
56883B25417L975L089J764J25j300j996j866j256n69O2P10J437K215L017L891
56868B38715M958O398Q279J0342J2120J3407J4317J4750J4118J2091R245O430
$$ plain form
56970 302136 296014 290389 285692 281937 279087 277463 277446 279064 282115 286426 291762 297722 303912 309970 315327
56955 315327 319296 321568 322265 321307 318174 312607 305229 297187 289488 282863 277759 274015 270899 267957 265600
56940 265600 264504 264809 266385 269505 274547 281178 288522 296116 304073 312185 319428 324540 326754 325902 322245
56925 322245 316333 308704 299557 288956 277365 265627 254383 243920 234614 227005 221121 216166 211259
56912 211259 206321 201902 198329 195350 192576 189923 187542 185486 183588 181625 179585 177715 176254 175158
56898 175158 174249 173662 173953 175622 178620 182387 186334 190236 194273 198800 204022 209751 215490 220771 225417
56883 225417 229392 232481 234245 234370 233070 231074 229208 227952 227383 227445 228155 229592 231807 234824 238715
56868 238715 243673 250071 258350 268692 280812 294219 308536 323286 337404 349495 358740 365170
56856C65170L660M15l059n642o825p379q013q149o868m492k257n88J254L761O421
56841C27409Q675J0832J3463J6431J9069K0988K2049K1785J9647J5834J1325O672
56829E14179J466m588j0461j4535j6392j7192j7959j8300j7277j4919j2094r271
56817C62657o258l090k83K009M334P115J0031J2471J4099J4660J3812J1538Q270
56804D51365M298m38n540r865j2591j4203j5624j6868j7217j6426j4898j2852
56792C19141j0246p464n194l510j820J01J786K965M005N175O079O238N615M221
56778C27092J805j526m864p259q684r768j0881j1881j2522j2602j1904j0431q667
56765B17908p254o447o066n788n363m720m149m065m374m454m070l822m197m567
$$ plain form
56856 365170 368830 369245 366186 360544 353719 346340 338327 330178 323310 318818 316561 315973 317227 320988 327409
56841 327409 336084 346916 360379 376810 395879 416867 438916 460701 480348 496182 507507 514179
56829 514179 515645 511057 500596 486061 469669 452477 434518 416218 398941 384022 371928 362657
56817 362657 356399 353309 353026 355035 359369 366484 376515 388986 403085 417745 431557 443095 451365
56804 451365 455663 455225 449685 439820 427229 413026 397402 380534 363317 346891 331993 319141
56792 319141 308895 301431 296237 292727 290907 291008 292794 295759 299764 304939 311018 317256 322871 327092
56778 327092 328897 327371 322507 315248 306564 296796 285915 274034 261512 248910 237006 226575 217908
56765 217908 210654 204207 198141 192353 186990 182270 178121 174056 169682 165228 161158 157336 153139 148572
56751A48572l916k319r24m72o19p61q14r48j213j734k691l800m284l760k755k016
56735A15546j718j635j649j595j093k7J001J240O36k88j108j556j237mJ482K279
56719A10274K243J959J645Q42m99j510j393m76K92M83L54J51j49n42q80j100j239
56702A10455j219q70k07N48J174J556J635J438J135Q50N63K60J06K52N57O96N28
56685A19457K66L12R35J904K529K330J765J806K649L390L332L036L417M318M818
56670A56264M691M609M916N105M732M043L346K516J513P77N97N82K76j17j38J28
56654A93840K26J03K31R45K028K946L265K923K209J432O02l46j058j009l37J23
56638B08123j08o40j046j513k167k403j703o65l12p02j053j087j243j615j742
$$ plain form
56751 148572 144656 142337 141413 140941 140322 139561 138747 137799 136586 134852 132161 128361 124077 120317 117562 115546
56735 115546 113828 112193 110544 108949 107856 107829 108830 110070 110706 110418 109310 107754 106517 106513 107995 110274
56719 110274 112517 114476 116121 116963 116464 114954 113561 113085 113377 113860 114214 114365 114216 113674 112794 111694 110455
56702 110455 109236 108366 108159 108707 109881 111437 113072 114510 115645 116495 117058 117318 117424 117676 118233 118929 119457
56685 119457 119723 120035 120970 122874 125403 127733 129498 131304 133953 137343 140675 143711 147128 151446 156264
56670 156264 160955 165564 170480 175585 180317 184360 187706 190222 191735 192512 193109 193691 193967 193850 193712 193840
56654 193840 194066 194169 194400 195345 197373 200319 203584 206507 208716 210148 210750 210404 209346 208337 208000 208123
56638 208123 208015 207375 206329 204816 202649 200246 198543 197878 197566 196864 195811 194724 193481 191866 190124
56623A90124j554j636k100k142j272k90l30j376k392k612k117j296l64N43J211
56608A72397J497J423J123Q18P40Q74Q61L50n50j360j738j783j828k077k351k220
56592A66176j449l89J72k74j413k393k598k076j255m36L56J118J692J961K052
56577A61244K159K219K019J649J496J698J949K043K187K437K349J700J193J613
56563A87955K501K626J826J417K305L595L748K597J367J009J231J212N99k92r02
56548B12794q33j93L92K92m91j383j872j947j837j584j029j65O31Q65M12l91j156
56531B02505j848k546l084l259l316l691m238m239l418k484k283k789l349l532
56517A58429l339k871k286j965k107k314k012j240o14m48m51k96r4j37m69q43
$$ plain form
56623 190124 188570 186934 184834 182692 181420 181130 180800 179424 177032 174420 172303 171007 170643 171186 172397
56608 172397 173894 175317 176440 177258 177998 178872 179733 180083 179533 178173 176435 174652 172824 170747 168396 166176
56592 166176 164727 164338 164510 164236 162823 160430 157832 155756 154501 154065 154421 155539 157231 159192 161244
56577 161244 163403 165622 167641 169290 170786 172484 174433 176476 178663 181100 183449 185149 186342 187955
56563 187955 190456 193082 194908 196325 198630 202225 205973 208570 209937 210946 212177 213389 213988 213696 212794
56548 212794 211961 211768 212160 212452 211961 210578 208706 206759 204922 203338 202309 202144 202775 203640 204052 203661 202505
56531 202505 200657 198111 195027 191768 188452 184761 180523 176284 172866 170382 168099 165310 161961 158429
56517 158429 155090 152219 149933 147968 145861 143547 141535 140295 139681 139233 138782 138486 138392 138255 137786 136943
56501A36943r07m71J89L92k27j054j042K2J175J319L76p82j211o13N47J437J525
56484A37618J010M64J43j02k47K5P68J477J733J714J815J955J727J039L12j6J00
56467A51535L53L85P4l16l51R2O49Q81P17L57r2o23j095j261r85l67L56Q68R20
56448A52097O24M22N64P41M99Oo6N87J401J535P70l26r54p28N6P04O75O5n35o28
56428A57509k50J94L60K02p2j84m4J66J82On7J55L91K94m6j81O1K84O7m11n44
56407A58082j04M53N91L96M07R30J679K086J802R19m9m81k09K72L37J2j51O2K53
56388A67287J31L7L81R74J409J716K108K290J763P54J06J37K94J21n7J34M47N09
56370A80541N55R80J585J842J753J727J788J566J089Q67J027R98L77l66m93P3
$$ plain form
56501 136943 136036 135565 135754 136146 135919 134865 133823 133845 135020 136339 136715 135933 134722 134109 134656 136093 137618
56484 137618 138628 139092 139235 139133 138886 138911 139679 141156 142889 144603 146418 148373 150100 151139 151451 151435 151535
56467 151535 151888 152273 152347 152031 151680 151772 152421 153302 154019 154376 154284 153661 152566 151305 150320 149953 150309 151177 152097
56448 152097 152721 153143 153707 154448 154947 154953 154887 155474 156875 158410 159180 158854 157900 157172 157228 157932 158607 158672 158137 157509
56428 157509 157259 157453 157813 158015 157943 157759 157715 157881 158063 158069 158012 158167 158558 158852 158806 158625 158686 158970 159037 158626 158082
56407 158082 157978 158431 159022 159418 159825 160755 162434 164520 166322 167241 167192 166711 166502 166774 167111 167123 166972 167034 167287
56388 167287 167418 167455 167836 168810 170219 171935 174043 176333 178096 178850 178956 179093 179387 179508 179451 179585 180032 180541
56370 180541 181096 182076 183661 185503 187256 188983 190771 192337 193426 194293 195320 196318 196695 196329 195836 195909
56354A95909P51J066J014Q47P62Q31R71R99Q30N96N05O18Q59J067J025O22J18
56337B09390JM60J171J730K093K360K457K341K310K621K936K694K007J667K044
56322B38282K478K146J203N63O92J120J242J162J446K266L126L475L269K868K535
56307B67873K282K075J964J986K142K538L295M186M625M285L600L300L512L660
56293C11323L342K894K845L184L565M016M890O117O985P006O612O585P004P289
56279C83657P195P161P531P925P868P639P978R052J0284J1222J2043J3039J4086
56266E06680J4985J5974J7500J9664K2221K5028K8187L1748L5635L9825M4425
56255H01872M9454N4755O0144O5568P1057P6501Q1493Q5410Q7847Q8973Q9180
$$ plain form
56354 195909 196660 197726 198740 199587 200349 201180 202151 203150 203980 204576 205081 205699 206558 207625 208650 209272 209390
56337 209390 209391 209851 211022 212752 214845 217205 219662 222003 224313 226934 229870 232564 234571 236238 238282
56322 238282 240760 242906 244109 244672 245364 246484 247726 248888 250334 252600 255726 259201 262470 265338 267873
56307 267873 270155 272230 274194 276180 278322 280860 284155 288341 292966 297251 300851 304151 307663 311323
56293 311323 314665 317559 320404 323588 327153 331169 336059 342176 349161 356167 362779 369364 376368 383657
56279 383657 390852 398013 405544 413469 421337 428976 436954 446006 456290 467512 479555 492594 506680
56266 506680 521665 537639 555139 574803 597024 622052 650239 681987 717622 757447 801872
56255 801872 851326 906081 966225 1031793 1102850 1179351 1260844 1346254 1434101 1523074 1612254
56244A612254Q8286Q5331P9417P0571N9630M7492L4727K1585Q016o043k0000l2482
56232B048784m2474n0381n7382o3765o8643p1382p2472p2620p1822o9923o7494
56221A340426o5319o3221o0280n6196n1841m8200m5314m2505l9342l6037l3051
56210G99120l0540k8235k5746k3029k0540j8795j7740j6656j4776j2060r311p483
56198E74209o832o733o352n403m173k994j958j171q19p64m29N54J691K079J497
56183E42402O57L07M67P89J292K253L520M447M684M624M783N021M892M526M652
56168E89316N551O604P152P339P682Q184Q470Q600R094J0190J1582J2996J4511
56155G07271J6238J8192K0572K3697K7562L2042L7536M4692N3147O1231O7315
$$ plain form
56244 1612254 1700540 1785871 1865288 1935859 1995489 2042981 2077708 2099293 2107309 2101266 2081266 2048784
56232 2048784 2006310 1955929 1898547 1834782 1766139 1694757 1622285 1549665 1477843 1407920 1340426
56221 1340426 1275107 1211886 1151606 1095410 1043569 995369 950055 907550 868208 832171 799120
56210 799120 768580 740345 714599 691570 671030 652235 634495 617839 603063 591003 581692 574209
56198 574209 567377 560644 554292 548889 544716 541722 539764 538593 537774 537010 536581 537135 538826 540905 542402
56183 542402 543059 543366 543833 544622 545914 548167 551687 556134 560818 565442 570225 575246 580138 584664 589316
56168 589316 594867 601471 608623 615962 623644 631828 640298 648898 657992 668182 679764 692760 707271
56155 707271 723509 741701 762273 785970 813532 845574 883110 927802 980949 1042180 1109495
56144A109495P0892P1874O9742O4237N6433M8236M1084L5825L3219L3225L3848
56133A668110L2125K6796J9289J1762N194k40m039n829o539q170j2308j9311k8567
56120A678273l8806m8184n4917n8226n8482n6354n2220m6425l9691l2925k6729
56109A165314k1272j6473j2264q737o066m157k400j25K632N046O437P012P440
56096A122387P974Q377Q583Q851R200R289R185R615J0956J2368J2672J2018J1769
56083A253244J2709J4139J5106J5756J6754J7946J8509J8302J8190J8859J9943
56072A439457K0648K0809K1031K1870K3224K4441K4955K4803K4518K4539K4930
56061A695225K5675K6888K8443K9688L0045K9783K9705L0131L0670L0974L1202
$$ plain form
56144 1109495 1180387 1252261 1322003 1386240 1442673 1490909 1531993 1567818 1601037 1634262 1668110
56133 1668110 1700235 1727031 1746320 1758082 1763276 1763036 1758997 1753168 1746629 1738459 1726151 1706840 1678273
56120 1678273 1639467 1591283 1536366 1478140 1419658 1363304 1311084 1264659 1224968 1192043 1165314
56109 1165314 1144042 1127569 1115305 1106568 1100502 1096345 1093945 1093820 1096452 1101498 1107935 1114947 1122387
56096 1122387 1130361 1138738 1147321 1156172 1165372 1174661 1183846 1193461 1204417 1216785 1229457 1241475 1253244
56083 1253244 1265953 1280092 1295198 1310954 1327708 1345654 1364163 1382465 1400655 1419514 1439457
56072 1439457 1460105 1480914 1501945 1523815 1547039 1571480 1596435 1621238 1645756 1670295 1695225
56061 1695225 1720900 1747788 1776231 1805919 1835964 1865747 1895452 1925583 1956253 1987227 2018429
56050B018429L1662L2472L3708L5431L7374L9025M0225M1360M2800M4509M6352
56039B443347M8326N0278N1868N3107N4501N6344N8308O0008O1608O3464O5557
56028C066716O7719P0048P2677P5459P8378Q1858Q6085R0393R3999R7118J00562
56017C981012J04406J07969J11131J14779J19608J25280J31169J37286J43934
56008E076574J50967J58049J65275J72993J81157J89454J97994K07409K18193
55999F718065K30295K43358K57049K71180K85907L01877L19857L39986L61611
55990I329185L84148M07896M33782M62316M93232N26187N61612O00610O44238
55981A3843206O93163P47857Q08720Q75940R49797J031479J123245J227372J345179
$$ plain form
56050 2018429 2050091 2082563 2116271 2151702 2189076 2228101 2268326 2309686 2352486 2396995 2443347
56039 2443347 2491673 2541951 2593819 2646926 2701427 2757771 2816079 2876087 2937695 3001159 3066716
56028 3066716 3134435 3204483 3277160 3352619 3430997 3512855 3598940 3689333 3783332 3880450 3981012
56017 3981012 4085418 4193387 4304518 4419297 4538905 4664185 4795354 4932640 5076574
56008 5076574 5227541 5385590 5550865 5723858 5905015 6094469 6292463 6499872 6718065
55999 6718065 6948360 7191718 7448767 7719947 8005854 8307731 8627588 8967574 9329185
55990 9329185 9713333 10121229 10555011 11017327 11510559 12036746 12598358 13198968 13843206
55981 13843206 14536369 15284226 16092946 16968886 17918683 18950162 20073407 21300779 22645958
55972B2645958J477560J626411J795101J987698K208467K462227K754646L091922
55964D0049990L480846L929544M447599N044729N729570O510146P394982Q392671
55956H4980077R509808J0748677J2104309J3558045J5065746J6541550J7840169
55949A80348381J8744050J8969050J8206842J6210868J2903049Q450322L261501
55942B77094063k106604p093958j1267800j4390246j6415108j7438725j7637297
55935A90744325j7213131j6358738j5238507j3982690j2687596j1418805j0216962
55928I3627896r105013q094155p186971o379602n664738n034396m480601l994692
55920D3687728l567649l191646k860689k569687k313557k087595j888021j711574
$$ plain form
55972 22645958 24123518 25749929 27545030 29532728 31741195 34203422 36958068 40049990
55964 40049990 43530836 47460380 51907979 56952708 62682278 69192424 76587406 84980077
55956 84980077 94489885 105238562 117342871 130900916 145966662 162508212 180348381
55949 180348381 199092431 218061481 236268323 252479191 265382240 273832562 277094063
55942 277094063 274987459 267893501 256625701 242235455 225820347 208381622 190744325
55935 190744325 173531194 157172456 141933949 127951259 115263663 103844858 93627896
55928 93627896 84522883 76428728 69241757 62862155 57197417 52163021 47682420 43687728
55920 43687728 40120079 36928433 34067744 31498057 29184500 27096905 25208884 23497310
55912B3497310j554989j415346j290751j180018j081674r93614r13790q40920
55904A4226208p74377p13662o58175o07502n61715n21113m85663m54728m27457
55895I021816m03136l80972l59860l38928l18345k99072k81596k65374k49706
55886F124827k34670k20839k08388j96958j86171j75855j65954j56672j48679
55877D430641j42610j38224j34353j29835j24403j18608j13113j08110j03375
55868C318010r8779r4542r0846q7322q3394p9244p5806p3487p1366o8275o4290
55857B430659o0528n7781n5925n4484n3016n1067m8570m6370m5388m5176m4204
55846A868150m1987l9964l9574m0203m0012l8352l6336l5081l4330l3138l1214
$$ plain form
55912 23497310 21942321 20526975 19236224 18056206 16974532 15980918 15067128 14226208
55904 14226208 13451831 12738169 12079994 11472492 10910777 10389664 9904001 9449273 9021816
55895 9021816 8618680 8237708 7877848 7538920 7220575 6921503 6639907 6374533 6124827
55886 6124827 5890157 5669318 5460930 5263972 5077801 4901946 4735992 4579320 4430641
55877 4430641 4288031 4149807 4015454 3885619 3761216 3642608 3529495 3421385 3318010
55868 3318010 3219231 3124689 3033843 2946521 2863127 2783883 2708077 2634590 2563224 2494949 2430659
55857 2430659 2370131 2312350 2256425 2201941 2148925 2097858 2049288 2002918 1957530 1912354 1868150
55846 1868150 1826163 1786199 1746625 1706422 1666410 1628058 1591722 1556641 1522311 1489173 1457959
55835A457959k9097k7323k5871k4528k3405k2846k2781k2543k1622k0446j9918
55824A197579k0235k0626k0455k0000j9843j9936j9740j9002j7961j6955j6207
55813I86619j5779j5400j4554j3105j1624j0668r999q995p704o815o662o825o867
55800H51622o865o996p131p106p117p440p943q111p496o097m515l788m831p708
55786G58478j1548j5208j7909j9266j9144j7773j5769j3667j1495r013o365m198
55774E97123l113l216m216n753p392q562q802q215p449p072p055o913o219m852
55760E08294l007j216k10l21j014j381j179r68j107j191p67j71q2n30r64j200
55744D92986j746l070m932o654p857q730r653j0637j1185j0878j0037r470r453
$$ plain form
55835 1457959 1428862 1401539 1375668 1351140 1327735 1304889 1282108 1259565 1237943 1217497 1197579
55824 1197579 1177344 1156718 1136263 1116263 1096420 1076484 1056744 1037742 1019781 1002826 986619
55813 986619 970840 955440 940886 927781 916157 905489 895490 886495 878791 871976 865314 858489 851622
55800 851622 844757 837761 830630 823524 816407 808967 801024 792913 785417 779320 774805 771017 766186 758478
55786 758478 746930 731722 713813 694547 675403 657630 641861 628194 616699 607686 601321 597123
55774 597123 594010 590794 586578 580825 573433 564871 556069 547854 540405 533333 526278 519365 513146 508294
55760 508294 505287 504071 503861 503540 502526 501145 499966 498998 497891 496700 495933 495762 495680 495150 494186 492986
55744 492986 491240 488170 483238 476584 468727 459997 450344 439707 428522 417644 407607 398137 388684
55731C88684r401q873q336q413q783q593p797p230p294p431p020o157n192m207
55717B83957l314k884l009l186k978k640k613k839l012l171l503l785l609l012
55703B40402k406j967j586j341j461j899k363k766l162l239k564j419q22j330
55689B12077k317k757k339j370q8J336K322K231J337P97J316K244K418J622O80
55674B19509K53O9m54j262j707j413p55m15o49j094j216q72m45m17q75j454j760
55657B05043j705j419j065q38r73j464j897j807j256q04q47j187j371j223r54
55642A86233p78o36l57M2L46M81P84J639K829L589L556L361L864M980N785N801
55626B21519N603N960O807P455P441O754N487L749J859K36j011k075l008l545
$$ plain form
55731 388684 379283 370410 362074 353661 344878 336285 328488 321258 313964 306533 299513 293356 288164 283957
55717 283957 280643 277759 274750 271564 268586 265946 263333 260494 257482 254311 250808 247023 243414 240402
55703 240402 237996 236029 234443 233102 231641 229742 227379 224613 221451 218212 215648 214229 213407 212077
55689 212077 209760 207003 204664 203294 203206 204542 206864 209095 210432 211229 212545 214789 217207 218829 219509
55674 219509 219762 219831 219377 218115 216408 214995 214240 213825 213176 212082 210866 209994 209549 209132 208257 206803 205043
55657 205043 203338 201919 200854 200016 199043 197579 195682 193875 192619 191815 190968 189781 188410 187187 186233
55642 186233 185455 184819 184462 184504 184850 185331 186115 187754 190583 194172 197728 201089 204953 209933 215718 221519
55626 221519 227122 233082 239889 247344 254785 261539 267026 270775 272634 272870 271859 269784 266776 263231
55612B63231l457k881k137j443q60m44k61l83q77j729k690l334l469l463l975
55597B31828n309p056q452r031q960q742q679q579q032p003o058n860o360o757
55583A26950o340n209m011l192k818k831l002k753j657k55K84l87j259j347j079
55568I1094j613l114m435m496l315j704m94j42n09q96o90j78j64p85j262j016
55552F6281m55k58m54o14n81m65k45J01K86K6m68o93m93p4M93J302K122K380J819
55533G0010Q84J87j66n05r67j223r15k43J36j20n87o25k30rk89p01p97o95q09
55514F2336j182j486j503j313j037p04l93k09p5K83R90J752K006J521P90O43J307
55497F3726K125K409K354K597L142L425L364L587M341M942M788M229L973M112
$$ plain form
55612 263231 259774 256893 254756 253313 252453 252009 251748 251365 250488 248759 246069 242735 239266 235803 231828
55597 231828 226519 219463 211011 201980 193020 184278 175599 167020 158988 151985 145927 140067 133707 126950
55583 126950 120610 115401 111390 108198 105380 102549 99547 96794 95137 94882 95166 94779 93520 92173 91094
55568 91094 89481 86367 81932 77436 74121 72417 71923 71781 71272 70376 69686 69508 69344 68559 67297 66281
55552 66281 65826 65568 65114 64500 63919 63454 63209 63310 63596 63622 63154 62461 61968 61894 62387 63689 65811 68191 70010
55533 70010 70894 71081 70915 70410 69443 68220 67305 67062 67198 67078 66491 65866 65636 65627 65338 64637 63840 63145 62336
55514 62336 61154 59668 58165 56852 55815 55111 54718 54509 54434 54717 55707 57459 59465 60986 61776 62419 63726
55497 63726 65851 68260 70614 73211 76353 79778 83142 86729 91070 96012 100800 105029 109002 113114
55483A13114M332M593M898M871M201L265K542J764L40j551l137m147m877n340
55469A24868n317n263o062p571q422p807o595o006n928n360m048k799k291k311
55455D9088k253j872j397j172j317j657j949k191k491k722k623k326k248k370
55441B0500k025q47N55J282J159O83K34j09k32p6O1j42m30l01J03M9o53j246j019
55422A7546k71K27L22M69P73O92j20j128j400p16J55K95l79j092j076l70L09L29
55404A4565k31p42o61m2O31R48Q65N10l7o38r50p00j30J39j77p02r15p46m69j90
55384A0328J75N09M47r0o46o88k23K65L44L0l65n44m26j48Mj67m97n75k25J98
55364G706K43j1n6K49L65j97j083j383p13L53R37O89o6p78j091r76o58m04l03
$$ plain form
55483 113114 117446 122039 126937 131808 136009 139274 141816 143580 143920 142369 139232 135085 130208 124868
55469 124868 119551 114288 108226 100655 92233 84426 77831 71825 65897 60537 56489 53690 51399 49088
55455 49088 46835 44963 43566 42394 41077 39420 37471 35280 32789 30067 27444 25118 22870 20500
55441 20500 18475 17628 18183 19465 20624 21307 21541 21432 21200 21124 21185 21043 20613 20312 20415 20464 19811 18565 17546
55422 17546 17275 17502 17824 18293 19066 19758 19638 18510 17110 16394 16549 16844 16465 15373 14297 13927 14236 14565
55404 14565 14334 13592 12931 12889 13520 14468 15333 15843 15806 15168 14218 13518 13388 13527 13350 12648 11733 10987 10518 10328
55384 10328 10503 11012 11459 11369 10723 10035 9812 10077 10421 10451 10086 9542 9116 8968 8972 8805 8308 7733 7508 7706
55364 7706 7949 7938 7882 8131 8496 8299 7216 5833 5120 5473 6410 7099 7033 6255 5164 4188 3530 3126 2823
55345B823k50j53q6j80m18n56k92L34Q02N29l76j052C18R5P96R23P97P07M95J6
55325D147m15m45j97o6j57k44j55R0M27P14P00L10k6K88J267K147K101J012m93
55306A1005j628j927j378l81M08M79j12p62r27o61m36n01n57j68O39J285J117
55289E495L4j266j726r41L17Q63M53J8L57J104J322P37j00o10n80L6J018J678
55271H209J438N96J4p1j91o06q39n84l10m96q68r25p04m95k20K94P34O41J18l39
55251E396n49o75p05n02k76m34r85a82j388o57O67E74K951K607J588Q46O16K50
55233I432o94j722j985j187J76J202J174J80q11q60j13M99M86K36J56J26L5J52
55215F482N64P49K41o48j214j173p02l5N19N25n7n22k40L35J80p95j490j076r0
$$ plain form
55345 2823 2573 2420 2334 2154 1736 1180 888 1222 2024 2553 2177 1125 318 413 1209 2132 2929 3636 4131 4147
55325 4147 3732 3287 3090 3024 2867 2623 2468 2558 2985 3699 4399 4709 4683 4971 6238 8385 10486 11498 11005
55306 11005 9377 7450 6072 5691 6099 6578 6466 5704 4777 4116 3680 3179 2622 2454 3093 4378 5495
55289 5495 5529 4263 2537 1596 1913 2776 3229 3247 3604 4708 6030 6767 6667 6057 5477 5513 6531 8209
55271 8209 9647 10243 10257 10186 9995 9389 8550 7966 7656 7160 6292 5367 4663 4168 3948 4242 4976 5617 5735 5396
55251 5396 4847 4172 3467 2965 2689 2255 1270 -182 -1570 -2227 -1560 574 3525 6132 7720 8566 9182 9432
55233 9432 8738 7016 5031 3844 4020 5222 6396 6576 5765 4905 4792 5291 5777 6013 6169 6295 6330 6482
55215 6482 7046 7795 8036 7388 6174 5001 4299 4264 4783 5308 5251 4729 4489 4824 5004 4209 2719 1643 1553
55196A553L62L6l06J9Q50J472J334M57o29j249j152p03m33l50NP49J282R71O7
55177D335n22l78J0M9j20j4L96O77O52N87O71P49O79N72N56N49M88M49M19J67
55157A0971m55j198j658j614j083k05O95J153Q89P9q07j356j366q97k81J44L95
55140C406P52J163J110L27o46j007o18o9N4l11q32j019n23N12J438J745J561J249
55122H292P80Ro07l44O60J315R56J52j76%L9l05o58o92m81k00L0O6j15j80K31
55101H772R29J307J123P34M64K38LP7N89R72N68l82q91m39M41R46R28Q00P94P59
55081A8732N33J88j62m93p67q77p78n44j98L27R80J447J375P34j56r00j254j156
55063A7031o47Q2P05R20O64J91j50k72m27q32j261j161l23P81J353J050K21m92
$$ plain form
55196 1553 1915 1951 1645 1664 2514 3986 5320 5777 5148 3899 2747 2044 1611 1261 1266 2015 3297 4268 4335
55177 4335 3813 3435 3445 3494 3374 3360 3756 4433 5085 5672 6343 7092 7771 8343 8899 9448 9936 10385 10804 10971
55157 10971 10516 9318 7660 6046 4963 4758 5453 6606 7495 7574 6767 5411 4045 3148 2867 3011 3406
55140 3406 4158 5321 6431 6758 6112 5105 4487 4418 4472 4161 3329 2310 1787 2299 3737 5482 7043 8292
55122 8292 9072 9081 8474 8130 8790 10105 11061 11213 11037 11037 11076 10771 10113 9421 8940 8740 8770 8836 8721 8541 8772
55101 8772 9701 11008 12131 12865 13329 13567 13570 13647 14236 15208 15776 15394 14503 14064 14505 15451 16379 17179 17973 18732
55081 18732 19265 19453 19291 18798 18031 17154 16376 15832 15634 15961 16941 18388 19763 20497 20341 19441 18187 17031
55063 17031 16384 16466 17171 18091 18755 18946 18796 18524 18097 17265 16004 14843 14520 15301 16654 17704 17925 17433
55045A7433o65l12K37O34Q37J123J635J984J554L42q27j130o70l14o63j432j837
55028A7929j380k06J057J673J240J09q11q73l38Rj17k39O9N23O05L79L01L71R5
55009B0396n67q06L0J462K341K107J186K78k23k21Q7J84l50j138j310o49K2n1
54991B2778n65p64n63m74o31o32l15o8j84m16m31k72j47n7J25L91O22P17O02L31
54971B0047J68K75L73K4o36r30o33k91l24k95L01R99Q40k46j225j221m48K28K81
54952A7287j03l59j14L88M98l1n90m62J87N40L06N5L29R55J475J738J727J297
54934B5123N32jK74J265K297K768K611K320K591L656M925N549N411N034M567L567
54918G2489J981N72k21j103k764m559n246m736m096l962l950l638l176k669j933
$$ plain form
55045 17433 16768 16456 16693 17327 18164 19287 20922 22906 24460 24802 23975 22845 22175 21861 21198 19766 17929
55028 17929 16549 16343 17400 19073 20313 20422 19611 18738 18400 18409 18292 18053 18122 18645 19250 19629 19930 20301 20396
55009 20396 19829 19023 19053 20515 22856 24963 26149 26427 26204 25983 26070 26254 25904 24766 23456 22807 22829 22778
54991 22778 22213 21449 20886 20412 19781 19149 18834 18766 18582 18166 17735 17463 17316 17259 17384 17775 18397 19114 19716 20047
54971 20047 20215 20490 20863 20887 20251 19321 18688 18397 18073 17778 18079 19078 19918 19672 18447 17226 16778 17006 17287
54952 17287 17184 16825 16711 17099 17597 17566 16976 16514 16701 17241 17547 17602 17931 18886 20361 22099 23826 25123
54934 25123 25655 25654 25928 27193 29490 32258 34869 37189 39780 43436 48361 53910 59321 64355 68922 72489
54918 72489 74470 75042 74821 73718 70954 66395 61149 56413 52317 48355 44405 40767 37591 34922 32989
54903C2989j116q12j138j404j106n58j99P9L91L68j46m56P6R46J204R20J036J860
54885C2934K636K766K631K835L354L832M174M327L884K522O96o24r41p17q30j692
54869F1787k905l608l277k333j815k276l164l496l061k494k258k024j341m70q9
54854B7176l94r61j464j944k317k112j143n7K24m29j269j539j065l3J287K422
54838A6382K747J994O45m76r36q93p11n95n00k94OJ88J08pK46Q29J114N89m03
54819B0033r48n84K04N75L00l1K42R92J361P76k85p99m18J79K09k76o81p61q35
54800A9253j134j358r90M2J202J789J543Q31J99j40k87k31J26N54N34rm30j34
54782B1360O76J364J662J721J638J471J535K108K860L193L164L429M176M699M342
$$ plain form
54903 32989 31873 31061 29923 28519 27413 26855 26656 26735 27126 27494 27348 26892 26968 27914 29118 30038 31074 32934
54885 32934 35570 38336 40967 43802 47156 50988 55162 59489 63373 65895 66591 65967 65026 64309 63479 61787
54869 61787 58882 55274 51997 49664 47849 45573 42409 38913 35852 33358 31100 29076 27735 27265 27176
54854 27176 26782 25821 24357 22413 20096 17984 16841 16784 17008 16579 15310 13771 12706 12673 13960 16382
54838 16382 19129 21123 21768 21292 20356 19463 18752 18157 17657 17363 17369 17557 17665 17658 17904 18733 19847 20436 20033
54819 20033 19085 18501 18705 19280 19580 19549 19791 20783 22144 22920 22635 21836 21418 21597 21806 21530 20849 20088 19253
54800 19253 18119 16761 15771 15813 17015 18804 20347 21178 21377 21237 20950 20719 20845 21399 21933 21924 21494 21360
54782 21360 22036 23400 25062 26783 28421 29892 31427 33535 36395 39588 42752 46181 50357 55056 59398
54767E9398L350K454J995J813J648J277M56q36k267l429m080m025l108j694p78
54752E2174j066k042k437j588K1J474K231K171J432M43j60o8L78N51J87m54r56
54735E2291j155j165j107r24m29M28J427K282K921L446L797L684L003K132J613
54720G2244J473J120L1j553k920l684l996l960l436k584k133k505l047k794j906
54705D0350j519k115k765k388j130MM16K33k25p36j069j099q78l78M97J350J273
54688B9821J7j261j293m18o3o81j302j176p02l69J23J011J648J380N83M2k07n65
54670B6588q46n29J75M59J52n4K57O05M09j48m48k25K42N07L45p7l36j66K53O41
54650B7804R76J249J131M32k32O1J316K529K958K839K629K314J860J701K130K672
$$ plain form
54767 59398 62748 65202 67197 69010 70658 71935 72391 71555 69288 65859 61779 57754 54646 52952 52174
54752 52174 51108 49066 46629 45041 45062 46536 48767 50938 52370 52813 52653 52585 52963 53514 53701 53247 52291
54735 52291 51136 49971 48864 47940 47511 47939 49366 51648 54569 58015 61812 65496 68499 70631 72244
54720 72244 73717 74837 74868 73315 70395 66711 62715 58755 55319 52735 50602 48097 45050 42256 40350
54705 40350 38831 36716 33951 31563 30433 30437 30853 31086 30861 30125 29056 27957 27079 26701 27198 28548 29821
54688 29821 29838 28577 27284 26866 26803 26122 24820 23644 22942 22573 22696 23707 25355 26735 27318 27360 27153 26588
54670 26588 25742 25213 25388 25847 25999 25945 26202 26807 27216 27068 26620 26395 26637 27144 27489 27412 27076 26910 27163 27804
54650 27804 28780 30029 31160 31592 31360 31421 32737 35266 38224 41063 43692 46006 47866 49567 51697 54369
54634E4369K664K129J512Q60n8r94j403j290j240j547j879j960j943j921j640
54619D5659j075p40j023j539j597j089n28l33n00q22j118j196r57n38j58J36L84
54602C2966M52K04j98m70o25q98j219j174o20L0L60L42J19k66n67l41M25R80P49
54583C0249K10K20P17R18O62N79Q14N78m50j275q47L78J075Q24L37J30q6n96j084
54564C3353j123p59l50k13n53j267j746j320k9J361K138K089J278J2r35q36K8
54547C1128N78L64Q3L65P83O75K45J12K40J35j72j81J87M70M29K89K21J71K67
54528C6389Q34J811K595K599J782N85l78o48l02N5m9l87m65l25m02o90o88j93
54510D2123L21K96l48j272j958j912j106k20l7m81p65m25K59Q45J138R70L00l74
$$ plain form
54634 54369 57033 59162 60674 61534 61476 60482 59079 57789 56549 55002 53123 51163 49220 47299 45659
54619 45659 44584 43844 42821 41282 39685 38596 38068 37735 37235 36413 35295 34099 33142 32604 32446 32582 32966
54602 32966 33418 33622 33424 32954 32329 31431 30212 29038 28418 28448 28808 29150 29269 29003 28436 28095 28520 29500 30249
54583 30249 30459 30679 31396 32314 32976 33555 34369 34947 34497 33222 32375 32753 33828 34652 34989 35119 35033 34437 33353
54564 33353 32230 31471 31121 30908 30355 29088 27342 26022 25993 27354 29492 31581 32859 32871 31936 31100 31128
54547 31128 31706 32070 32153 32518 33301 33976 34221 34333 34573 34708 34536 34355 34542 35012 35441 35730 35951 36122 36389
54528 36389 37223 39034 41629 44228 46010 46595 46217 45569 45267 45322 45273 44886 44421 44096 43694 43004 42316 42123
54510 42123 42444 42740 42392 41120 39162 37250 36144 35924 35887 35406 34641 34216 34475 35320 36458 37428 37728 37354
54492C7354m01J4l0o85r50k29N79L66m61n76L45J241J196M99rQ2N04O83J71q31
54472C8862j425q64M97J514J547R70M17N1k39l60k07kp5l63m62k16ok58p95r30
54452C7656k99N71Q46L84k15m74n42o10m98q9K43J89L6J95M14K09j91qQ67J591
54432D0275J500R31N81N38L38k56r82j404j306q22l05n6m1K0K89O40Q29O98K96
54413D1763n0J17P95J280Q76j13o00j5J036J596J345O07j87o77o35k56j36n89
54395D6157j192j314q44j54M18O62L69l47q38n79R8M22K77K77P24J196J270J100
54377D7702R55P40L91K40M75O19J57o08q59m37l6j59m92m92j77j0k40p00j088
54358D5981j220j049o33r3L91O09M32L2j14K68Q26R69O05J36k38o32r07o68q8
$$ plain form
54492 37354 36953 36967 36937 36252 35302 35073 35652 36018 35557 34981 35326 36567 37763 38262 38253 38335 38839 39522 39693 38862
54472 38862 37437 36573 37070 38584 40131 41101 41518 41569 41330 40970 40763 40761 40686 40323 39861 39645 39639 39381 38586 37656
54452 37656 37357 37928 38774 39158 38943 38469 37927 37317 36819 36730 36973 37162 37198 37393 37807 38016 37825 37817 38684 40275
54432 40275 41775 42706 43287 43825 44163 43907 42925 41521 40215 39393 39088 39032 38991 39011 39300 39940 40769 41467 41763
54413 41763 41713 41830 42625 43905 44781 44668 44068 44053 45089 46685 48030 48637 48450 47773 47138 46882 46746 46157
54395 46157 44965 43651 42807 42653 43071 43733 44102 43755 42917 42338 42436 42858 43135 43412 44136 45332 46602 47702
54377 47702 48657 49397 49788 50028 50503 51122 51279 50671 49812 49375 49339 49180 48688 48196 48019 48009 47769 47069 45981
54358 45981 44761 43712 43079 42986 43377 43986 44418 44450 44336 44604 45430 46399 47004 47140 46902 46270 45363 44695 44607
54339D4607j8q01j578j432o75k74m33o33p01q86r77m76L35N22j07o45n18k09j91
54320C4910j80O0P0l88o51j95L74K89j01j6L35K06k55k81R5J12k50j96L60M78
54300C4776k10p20j54R68J499J068Q0j014j788j729q18J47M16K78N75J421K048
54283C6843J846J076M40K88L25Nq20j585j539o58K28L96K6j53K07Q14J198J167
54265D0104Q73N74L24n4n94r22p27l18k41l34Q9R81J312N06n87p98k06K19P3j96
54245D0078k74l70n87o42m56l92o55r44r50p79o61n22j84K73O08P18O57M17j9
54226C5316n10q40r02p34l49K58Q72J012M04n44j054q81n87o81q46m93K01M92
54208C0134K57J94O86J179J069N50Q9k96p05p77j94O24R75Q07N29J85m15j003
$$ plain form
54339 44607 44589 43788 42210 40778 40103 39829 39396 38763 38062 37176 36199 35723 36058 36580 36473 35828 35310 35101 34910
54320 34910 34730 34790 34860 34472 33821 33626 34000 34289 34188 34172 34507 34713 34458 34177 34272 34384 34134 33938 34298 34776
54300 34776 34566 33846 33692 34660 36159 37227 37307 36293 34505 32776 31958 32105 32521 32799 33374 34795 36843
54283 36843 38689 39765 40205 40493 40818 40823 40003 38418 36879 36221 36449 36845 36871 36718 36925 37739 38937 40104
54265 40104 40977 41551 41875 41821 41227 40305 39578 39260 39019 38685 38774 39755 41067 41573 40986 40188 39982 40201 40274 40078
54245 40078 39804 39434 38847 38205 37749 37357 36702 35758 34808 34029 33368 32846 32662 32935 33543 34261 34918 35335 35316
54226 35316 34806 33966 33064 32330 31981 32239 33111 34123 34527 33983 32929 32048 31461 30780 29934 29441 29642 30134
54208 30134 30391 30585 31271 32450 33519 34069 34158 33862 33157 32380 32186 32810 33785 34592 35121 35306 34891 33888
54190C3888j045o60m76n34j70Q15J649J641J102P43O65M15j96q09r89p39m71n17
54172C4312o18j34R44J545P34q63j630j007j16n9n40p27o31p69j012p38J9N12
54154B9222L58o6l25m25m44k84pM1k66n80n24j39L23P44J060J110Q65N91N34N77
54134C2365M62K59K52M01K41m85j340j595j054k74N7j51m41l59Q9O03R77J231
54116C1238J416J430J099N05N6J15N52Q06M86j68n48l09L33Q84J040Q97P64P36
54098D1332N34p6o96n30N39J537J421M07l77l83j49j77j11N14J238J187L78j94
54080D6394J40R16J254R98P35R42J450J732J492Q80K44k06n15p93r75q58l80K16
54062E3666N92P15Q78J313J836K045J852J615J726K170K681L098L444L690L681
$$ plain form
54190 33888 32843 32183 31707 31173 31003 31818 33467 35108 36210 36953 37618 38033 37837 37028 36039 35300 34829 34312
54172 34312 33694 33560 34504 36049 36783 35920 34290 33283 33167 33108 32568 31841 31210 30441 29429 28691 28710 29222
54154 29222 29580 29514 29189 28764 28320 28036 28029 28070 27804 27224 26700 26561 26884 27628 28688 29798 30663 31254 31788 32365
54134 32365 32827 33086 33338 33739 33980 33495 32155 30560 29506 29232 29289 29138 28697 28338 28427 29030 30007 31238
54116 31238 32654 34084 35183 35688 35744 35859 36411 37217 37703 37535 36987 36678 37011 37895 38935 39832 40596 41332
54098 41332 41866 41790 41094 40564 41103 42640 44061 44468 44091 43708 43559 43382 43271 43785 45023 46210 46588 46394
54080 46394 46534 47450 48704 49702 50437 51379 52829 54561 56053 56933 57177 56971 56456 55663 54688 53830 53450 53666
54062 53666 54258 54973 55851 57164 59000 61045 62897 64512 66238 68408 71089 74187 77631 81321 85002
54047H5002L354K860K456K374K794L737M980O165O961P080O308M769L148K258
54033A44246K261K500K285J625J062R69J188J271R12J51p23j511k318l312m328
54018A46278m893m773m304l997m012m137m135l919l484k897k310j876j621j503
54004I8417j525j633j682j590j468j426j316r15k81K31L17j8n77j162j603j753
53988H2016j526j009m66k26m22q42j135j214j255j279j007l90M5k04p60p13J63
53971F9776J015R80K63k40o1N13J045J321J125K83q72j480j011P8Q56R52P88R26
53953G6257J484K141K441K173J653J529J966K233J615O27O74K281M337N427N323
53938A12161M784M440M473N003N927O637O598O171O148O547O566N806M803M255
$$ plain form
54047 85002 88356 91216 93672 96046 98840 102577 107557 113722 120683 127763 134071 138840 141988 144246
54033 144246 146507 149007 151292 152917 153979 154948 156136 157407 158319 158470 157747 156236 153918 150606 146278
54018 146278 141385 136612 132308 128311 124299 120162 116027 112108 108624 105727 103417 101541 99920 98417
54004 98417 96892 95259 93577 91987 90519 89093 87777 86862 86581 86812 87129 87111 86534 85372 83769 82016
53988 82016 80490 79481 79015 78789 78367 77525 76390 75176 73921 72642 71635 71245 71290 71086 70326 69613 69776
53971 69776 70791 71771 72034 71794 71733 72246 73291 74612 75737 76020 75148 73668 72657 72735 73591 74543 75331 76257
53953 76257 77741 79882 82323 84496 86149 87678 89644 91877 93492 94119 94793 97074 101411 106838 112161
53938 112161 116945 121385 125858 130861 136788 143425 150023 156194 162342 168889 175455 181261 186064 190319
53924A90319M304M833N681O348O179N331M850N296N850N411M044K664J611M69
53910B53190r19k051k534k592k599k652k745k978l429m015m706n493o137o236
53896B04104n756n209n121n430n643n425m931m521m354m329m386m611m892m737
53882A34759l849k828k653l389l910l351k296j941k468k977k804k166j544j136
53868I7447j099j598k371k757k484j975j671j404p94O2O92Q23N08p2p07j137j236
53851H0227j110r03o52l83k36l16n66q53j020q40k51L19K55l86p56k52O76J197
53833G4150J218J298J575J510P52k45q00p71n10k31J40O08R47J028J045J292J775
53816H4781K257K633L109L855M633M961M654M035L602L588L900M337M723M919
$$ plain form
53924 190319 194623 199456 205137 211485 217664 222995 227845 233141 238991 244402 248446 251110 252721 253190
53910 253190 252271 250220 247686 245094 242495 239843 237098 234120 230691 226676 221970 216477 210340 204104
53896 204104 198348 193139 188018 182588 176945 171520 166589 162068 157714 153385 148999 144388 139496 134759
53882 134759 130910 128082 125429 122040 118130 114779 112483 110542 108074 105097 102293 100127 98583 97447
53868 97447 96348 94750 92379 89622 87138 85163 83492 82088 81294 81356 82048 82871 83379 83307 82600 81463 80227
53851 80227 79117 78214 77562 77179 76943 76627 76061 75208 74188 73348 73097 73416 73671 73285 72529 72277 72953 74150
53833 74150 75368 76666 78241 79751 80503 80258 79458 78687 78177 77946 78086 78694 79641 80669 81714 83006 84781
53816 84781 87038 89671 92780 96635 101268 106229 110883 114918 118520 122108 126008 130345 135068 139987
53802A39987M803M289L410K406J659J369J332J146P11L18J95J51j97r41j780k390
53786A56468k784l239l888m466m600m286l909l732l615l429l379l617l809l504
53772A04211k844k351k161j974j765j879k283k410j997j503j311j097m83J70K08
53757H0531l50q96j053r25p26o37q20j138j119o44m01r73j790j688n11P34J275
53740F8869J310J204Q96M37L54Q61J314J065M55L00P28J103R75N37J93J29K93
53723H1023N08N71N15O18J024J443J550J484J588J805J699J093L87J35N04J089
53707I7036J224O61K3K46J379K325K200J512J303J549J296L66j57N06J660K104
53691A15233J655J063Q58R93J327J692J607O35q32j746j520n65L98J093J539J577
$$ plain form
53802 139987 144790 149079 152489 154895 156554 157923 159255 160401 161112 161430 161625 161776 161579 160638 158858 156468
53786 156468 153684 150445 146557 142091 137491 133205 129296 125564 121949 118520 115141 111524 107715 104211
53772 104211 101367 99016 96855 94881 93116 91237 88954 86544 84547 83044 81733 80636 80153 80323 80531
53757 80531 80181 79285 78232 77307 76581 75944 75124 73986 72867 72223 71822 70849 69059 67371 66860 67594 68869
53740 68869 70179 71383 72279 72716 73070 73931 75245 76310 76765 77065 77793 78896 79871 80408 80601 80730 81023
53723 81023 81531 82102 82617 83235 84259 85702 87252 88736 90324 92129 93828 94921 95308 95443 95947 97036
53707 97036 98260 98921 98944 99190 100569 102894 105094 106606 107909 109458 110754 111120 110963 111469 113129 115233
53691 115233 116888 117951 118809 119802 121129 122821 124428 125063 124231 122485 120965 120400 120798 121891 123430 125007
53675A25007J018M7q48j297j211p20j31J58nk55j42K35L04j95q15r77p18n71q14
53656A18070j158j150p02q9L52M48K58M8N3K38L59L76N44J013J529J721J542J203
53638A24655R05Q19J105J581J584P52k36l06N81J346J255Q23Q68J380J850K177
53622A41139K534K727K495K206K473L132L397L023K583K416K137J457Q22P98J364
53607A74703K188L109L934M207L721K935K393K044J559J018O93M46m2o24q66q28
53591B00590j014j495j721j320o28j95j54l29n91q54r80r19p81o33m57l25l81
53574A87813n56n74l79k45l60n59o08m90k95j31k57q55j429j033M87J856J685
53557A84070J99j046j115o32o04r67q19L07J917L208L737L532K900K338K286K748
$$ plain form
53675 125007 126025 126072 125224 123927 122716 121996 121865 122023 122018 121763 121621 121856 122160 121965 121150 120173 119455 118884 118070
53656 118070 116912 115762 115060 114971 115323 115771 116029 116077 116130 116368 116727 117103 117647 118660 120189 121910 123452 124655
53638 124655 125560 126379 127484 129065 130649 131401 131165 130859 131440 132786 134041 134864 135732 137112 138962 141139
53622 141139 143673 146400 148895 151101 153574 156706 160103 163126 165709 168125 170262 171719 172541 173339 174703
53607 174703 176891 180000 183934 188141 191862 194797 197190 199234 200793 201811 202504 202950 202908 202284 201418 200590
53591 200590 199576 198081 196360 195040 194412 194217 194063 193734 193143 192289 191309 190390 189609 188976 188519 188194 187813
53574 187813 187257 186683 186304 186059 185699 185140 184532 184042 183747 183616 183359 182504 181075 180042 180529 182385 184070
53557 184070 184269 183223 182108 181476 180872 179905 179086 179393 181310 184518 188255 191787 194687 197025 199311 202059
53541B02059L217L189K702K312K484L167L947M551N048N639O386P169P790Q098
53527B67758Q085P961Q065Q574R331R980J0333J0495J0667J0967J1446J2169J3164
53514C98995J4286J5243J5897J6437J7182J8166J9052J9543J9705J9768J9634
53503E93908J8960J7700J6368J5522J5196J5051J5014J5375J6171J6810J6641
53492G72716J5853J5411J5925J6891J7291J6834J6153J5805J5572J5012J4296
53481I47759J3996J4218J4461J4257J3554J2345J0448P912N284L181J771P97j40
53468A059843j458l434n820p889r164r901j0582j1182j1380j1276j1366j1806
53456I54585j2257j2555j3077j4135j5418j6296j6456j6011j5165j4151j3352
$$ plain form
53541 202059 205276 208465 211167 213479 215963 219130 223077 227628 232676 238315 244701 251870 259660 267758
53527 267758 275843 283804 291869 300443 309774 319754 330087 340582 351249 362216 373662 385831 398995
53514 398995 413281 428524 444421 460858 478040 496206 515258 534801 554506 574274 593908
53503 593908 612868 630568 646936 662458 677654 692705 707719 723094 739265 756075 772716
53492 772716 788569 803980 819905 836796 854087 870921 887074 902879 918451 933463 947759
53481 947759 961755 975973 990434 1004691 1018245 1030590 1041038 1048950 1054234 1057415 1059186 1059983 1059843
53468 1059843 1058385 1054951 1049131 1041242 1032078 1022177 1011595 1000413 989033 977757 966391 954585
53456 954585 942328 929773 916696 902561 887143 870847 854391 838380 823215 809064 795712
53445G95712j3146j3478j3750j3247j1740r684p808o454n339m059k737j912j806
53432F90552j949j697r05J26J138K123L101L995M786N642O806Q348J0022J1379
53418G43467J2148J2618J3423J4821J6312J7219J7555J8023J9155K0762K2328
53407I27831K3587K4628K5628K6772K8243L0054L2009L3935L5863L7770L9406
53396A265726M0582M1513M2486M3316M3557M3213M2788M2531M2129M1332M0391
53385A729564L9545L8543L7111L5474L3865L1819K8723K4895K1341J8412J5481
53374B054773J2126Q804N945L100m73m865r741j4964k0323k5106k8804l1962l5453
53361A913057l8966m1202m1654m1320m1288m1415m0931l9651l7972l6086l3991
$$ plain form
53445 795712 782566 769088 755338 742091 730351 720667 712859 706405 701066 697007 694270 692358 690552
53432 690552 688603 686906 686001 686127 687265 689388 692489 696484 701270 706912 713718 722066 732088 743467
53418 743467 755615 768233 781656 796477 812789 830008 847563 865586 884741 905503 927831
53407 927831 951418 976046 1001674 1028446 1056689 1086743 1118752 1152687 1188550 1226320 1265726
53396 1265726 1306308 1347821 1390307 1433623 1477180 1520393 1563181 1605712 1647841 1689173 1729564
53385 1729564 1769109 1807652 1844763 1880237 1914102 1945921 1974644 1999539 2020880 2039292 2054773
53374 2054773 2066899 2075703 2081648 2084748 2084275 2079410 2069669 2054705 2034382 2009276 1980472 1948510 1913057
53361 1913057 1874091 1832889 1791235 1749915 1708627 1667212 1626281 1586630 1548658 1512572 1478581
53350A478581l2046l0848l0510l0570l0651l0809l1085l1180l0786k9949k8945
53339A141202k7853k6534k4910k3073k1084j8856j6467j4433j3366j3177j2950
53328I28499j1989j0766j0361j1015j1753j1679j1011j0493j0273r892r171q473
53316H01623q067p719p039n931m610l354k343j520o02O76K235L749N008O070P104
53301G85280Q180R250J0279J1409J2960J5080J7323J8946J9688J9995K0254K0254
53289I68898J9717J8924J8301J7741J6881J5808J4818J3669J1876R641P758O449
53277A140481N099L268J204q56l102n515p567r030j0420j2144j3871j5244j6548
53264A055755j7993j9051j9325j9485k0352k1511k1908k1544k1421k1870k2073
$$ plain form
53350 1478581 1446535 1415687 1385177 1354607 1323956 1293147 1262062 1230882 1200096 1170147 1141202
53339 1141202 1113349 1086815 1061905 1038832 1017748 998892 982425 967992 954626 941449 928499
53328 928499 916510 905744 895383 884368 872615 860936 849925 839432 829159 819267 810096 801623
53316 801623 793556 785837 778798 772867 768257 764903 762560 761040 760438 761114 763349 767098 772106 778176 785280
53301 785280 793460 802710 812989 824398 837358 852438 869761 888707 908395 928390 948644 968898
53289 968898 988615 1007539 1025840 1043581 1060462 1076270 1091088 1104757 1116633 1126274 1134032 1140481
53277 1140481 1145580 1148848 1150052 1149196 1146094 1140579 1133012 1123982 1113562 1101418 1087547 1072303 1055755
53264 1055755 1037762 1018711 999386 979901 959549 938038 916130 894586 873165 851295 829222
53253H29222k1424k0286j9111j7824j6551j6000j6513j7375j7693j7429j7010
53242F32006j6502j5828j5316j5306j5454j5168j4510j3980j3507j2381j0373
53231D73681q246o909o470o372o165n858n711n977o750p865q870r293r088q748
53217C71359q895r607j0337j0527j0223r867r655r407q929q173p084n752m692
53204B58211m517n091n570n449n099m982m966m810m801n229n674n516m876m345
53190A87286m005l553l198l501m179m035k532p34j22r24k156k883k921k524k008
53175A48011j732j927k408k672k403j756j127p74p01p67q04o54k53K23M04R3l96
53158A30357n44l04j26k31k44L0R4n63j486j803j522j445j780j740q71J30M62
$$ plain form
53253 829222 807798 787512 768401 750577 734026 718026 701513 684138 666445 649016 632006
53242 632006 615504 599676 584360 569054 553600 538432 523922 509942 496435 484054 473681
53231 473681 465435 458526 452056 445684 439519 433661 427950 421973 415223 407358 398488 389195 380107 371359
53217 371359 362464 352857 342520 331993 321770 311903 302248 292841 283912 275739 268655 262903 258211
53204 258211 253694 248603 243033 237584 232485 227503 222537 217727 212926 207697 202023 196507 191631 187286
53190 187286 183281 179728 176530 173029 168850 164815 162283 161549 161427 160503 158347 155464 152543 150019 148011
53175 148011 146279 144352 141944 139272 136869 135113 133986 133212 132511 131744 130940 130286 130033 130256 130660 130753 130357
53158 130357 129813 129509 129383 129152 128908 128938 129032 128469 126983 125180 123658 122213 120433 118693 117822 117952 118414
53141A18414L41L78M18j53j202j775j335l67L04L62L3k84k65J36N80O24J96l53
53123A16052o73o84m79j77M7K8k12n02p28r25j128j302j341j152p69n03p35j381
53105A03436j797j496p59k93l93p94j192j473j503j203q31p72q93o36Q7N32J3
53088I0033j179k065k003j143j1R28J442J523J350J120Q89O38M04K14M0j23k16
53071I1841k81m98q77j124j019p41n43k52M06J055Q75k69j403j602j138r56j255
53054H2219j317p24J1K92K66L34L69N9k70N7R52J494J125L44j02j86l67p44r85
53035H2827q69m99m4L14L08j33n96n15R7O21N93K72K26O46J144J166N48k89o52
53016H5165k45M88Q85Q33P93R95J059N50l29r32r20n07p2K58N64R53J403J666
$$ plain form
53141 118414 118755 119133 119551 119398 118196 116421 115086 114719 115023 115385 115418 115134 114869 115005 115585 116209 116405 116052
53123 116052 115379 114695 114216 114039 114086 114114 113902 113400 112672 111747 110619 109317 107976 106824 106055 105552 104817 103436
53105 103436 101639 100143 99384 99091 98698 97904 96712 95239 93736 92533 91702 90930 90037 89401 89488 90020 90033
53088 90033 88854 86789 84786 83643 83632 84560 86002 87525 88875 89995 90884 91522 91926 92140 92180 92057 91841
53071 91841 91560 91062 90185 89061 88042 87301 86758 86506 86912 87967 88842 88573 87170 85568 84430 83474 82219
53054 82219 80902 80178 80189 80481 80747 81081 81450 81509 81239 81296 82248 83742 84867 85211 85109 84923 84556 83812 82827
53035 82827 81958 81459 81415 81729 82037 81904 81308 80793 80890 81511 82104 82376 82602 83248 84392 85558 86106 85817 85165
53016 85165 84920 85408 86293 87126 87919 88914 89973 90523 90194 89262 88342 87835 87763 88021 88585 89538 90941 92607
52998I2607J329K15j154j808j305k97K39K56N83J532K190J604K68l32L83J416
52982I7726J594R48L43K93O80J271J852K054J609Q11K53Q5k4k48l95l67l70n06
52964A07609n80m48k57j49p4l6k39p32j193j277r79n38j63k7j98m24k36M47J055
52945A01561J012M35j01k90k14M6M86Q78Q73N18K88M25N36J11p66j495j668j470
52927A01165j291j214j013n74j61j47n35q97q49m75k09k67m36m09j99r0j99l35
52909I1865k50Q0M81P46P39M75J77N6K3k15o57q85o64l89n15q04p15l47l44p90
52889H8067j038p78n38o67o37KP00P27M06N50J025J048O76Q55J677J944R23m36
52871I4506q43m71m85j215j774j467p74o55j281j896j800j203r13j196j387q86
$$ plain form
52998 92607 93936 94151 92997 91189 89884 89587 89826 90082 90665 92197 94387 95991 96259 95927 96310 97726
52982 97726 99320 100268 100611 100904 101584 102855 104707 106761 108370 109181 109434 109519 109495 109247 108852 108485 108115 107609
52964 107609 107029 106581 106324 106175 106101 106065 105826 105094 103901 102624 101645 101107 100944 100917 100719 100295 100059 100506 101561
52945 101561 102573 103008 102907 102617 102403 102449 102935 103813 104686 105204 105492 105917 106453 106564 105798 104303 102635 101165
52927 101165 99874 98660 97647 97073 96912 96765 96230 95333 94484 94009 93800 93533 93097 92688 92489 92399 92200 91865
52909 91865 91615 91695 92176 92922 93661 94136 94313 94369 94392 94177 93520 92635 91971 91582 91067 90263 89548 89201 88857 88067
52889 88067 87029 86251 85713 85046 84409 84411 85111 85838 86244 86794 87819 88867 89543 90398 92075 94019 94942 94506
52871 94506 93663 93192 92707 91492 89718 88251 87477 86822 85541 83645 81845 80642 79729 78533 77146 76260
52855G6260j91k60j043j473r83k01J03mj72m35q00q21l30M2k20o27n00j47k76
52836F7922o46m67J33K64j69k60K76N73J09l35P7R55J435J450J439J338Q39K64
52818G5197K37O45Q13O47P55J274J478Q45j58q03j035j120r27k29M91L35p00j445
52800G6300r90J00N43O0l39N6O19L19p17j282o85M03Q55L79m62j113j450j449
52782G1147r74o0Q13J088O72K9k88j27K78O37Q51R16P93M72J16K3K92O43N58j77
52762G7702j133j534j059l09j74p01r53j61J236K073J839J115O53M80J55m19q42
52745G7968p98m51j57k7Q4K35K76J42R9N06J259J768J607J009N90N97P94R33J046
52726H7480J209J331J342J321J278J005M00j86l05k2J46l8j98N6M92N21Ln64o56
$$ plain form
52855 76260 76069 75809 74766 73293 72310 72109 72212 72208 72036 71601 70801 69980 69650 69692 69472 68845 68345 68198 67922
52836 67922 67276 66809 66942 67206 67037 66777 67053 67626 67735 67400 67477 68432 69867 71317 72756 74094 74933 75197
52818 75197 75434 76079 76892 77539 78294 79568 81046 81891 81733 80930 79895 78775 77848 77619 78110 78445 77745 76300
52800 76300 75310 75410 75953 76013 75674 75730 76349 76668 75951 74669 73984 74387 75242 75621 75159 74046 72596 71147
52782 71147 70173 70113 70926 72014 72686 72715 72427 72300 72578 73215 74066 74982 75775 76247 76363 76386 76678 77321 77879 77702
52762 77702 76569 75035 73976 73667 73493 72792 71839 71678 72914 74987 76826 77941 78594 79074 79229 78810 77968
52745 77968 77170 76719 76562 76535 76619 76854 77130 77272 77371 77877 79136 80904 82511 83520 84110 84707 85501 86434 87480
52726 87480 88689 90020 91362 92683 93961 94966 95366 95180 94875 94853 94999 94961 94763 94819 95311 95832 95835 95271 94615
52707I4615j75O26J385J673J263N22J81M25N65O5n26k77O64J131N08m80q53n69
52689A00743k51k48m68p38q60n90l6K33q1m58k78K02K30l20q56j042j105j178
52671I2899j003n30k29n11j178j663j546q13J17N46J67m21l37L81P47J57q35j360
52653H4588j284j032p93m87j09L10Q52J387J397O11m15q35n45j60OL36J148K008
52635H6983K129J295J47m78l40P5J61j94o94j132j527j778j586r06j83J55K07
52618H2334L49O73R45R45O14M6m54m57P1N74N35K14K49P07R70O61J66J02N27R46
52598I0717Q96L88r8q1M28Q96R24P56Q62J132R72K08n83q73q14q30r19p90m92
52579I2699l92o22q84r02p48o17n57n31n90p70r72j069j055r67p52l32J81N05
$$ plain form
52707 94615 94440 95066 96451 98124 99387 99909 100090 100515 101080 101145 100619 100342 101006 102137 102645 102165 101312 100743
52689 100743 100492 100244 99776 99038 98178 97588 97552 97785 97704 97246 96968 97170 97400 97080 96224 95182 94077 92899
52671 92899 91896 91366 91137 90626 89448 87785 86239 85426 85543 86089 86256 85835 85498 85879 86626 86783 85948 84588
52653 84588 83304 82272 81479 80992 80883 81193 82045 83432 84829 85440 85025 84190 83645 83485 83491 83827 84975 86983
52635 86983 89112 90407 90554 90076 89736 89811 89972 89778 89084 87952 86425 84647 83061 82155 81972 82127 82334
52618 82334 82683 83356 84301 85246 85860 85906 85452 84995 85066 85640 86175 86389 86638 87345 88315 88976 89142 89244 89771 90717
52598 90717 91613 92001 91903 91822 92250 93146 94070 94826 95688 96820 97792 98000 97417 96544 95730 94900 93981 93191 92699
52579 92699 92307 91685 90801 89899 89151 88534 87977 87446 86856 86086 85114 84045 82990 82023 81271 80939 81120 81625
52561H1625M87K88J86L00N36P27P76O70M46K05N5R7L97Q77J240J106M07m67j082
52542H8876j326j249p63J18Q04N53n38j405j238l96K24L82N07Q06R62P30L12m2
52524H7317l06m24k60k8l48j417k423k282r25N49J063N08m66j220j421r50J1Q81
52506G7859J050N14j38m55n65p56r25p78l71m6J24L93P68Q30L74j49j45L67Q90
52487G8841J111J128J048P74K47l93r21j167r93l91L40P17N19J9k44N4P72J374
52469H2835J335O18k93q76j052j065j033q62n17n1N31J166J487J117K80k79j85
52452H3156J57K43J72L18N89N85L24K80O31R12O62M1m22m74k86r8ON2J07K51M17
52431H7623L01l07j100j348o60N48J439J580J194P32M80N43R21J372J431Q19j90
$$ plain form
52561 81625 82112 82400 82586 82886 83422 84149 84925 85595 86041 86246 86301 86398 86795 87672 88912 90018 90425 89958 88876
52542 88876 87550 86301 85538 85656 86460 87013 86475 85070 83832 83436 83660 84042 84549 85355 86317 87047 87359 87317
52524 87317 87011 86587 86327 86299 85951 84534 82111 79829 78904 79453 80516 81024 80558 79338 77917 76967 76978 77859
52506 77859 78909 79423 79285 78830 78265 77509 76584 75806 75435 75389 75513 75906 76674 77504 77878 77729 77584 77951 78841
52487 78841 79952 81080 82128 82902 83149 82756 81835 80668 79675 79284 79624 80341 80860 80879 80635 80689 81461 82835
52469 82835 84170 84788 84495 83619 82567 81502 80469 79607 79090 79039 79570 80736 82223 83340 83620 83341 83156
52452 83156 83313 83556 83728 84046 84635 85220 85544 85824 86455 87367 88029 88070 87648 87174 86888 86790 86796 86848 86955 87206 87623
52431 87623 87924 87617 86517 85169 84509 85057 86496 88076 89270 90002 90482 91025 91946 93318 94749 95568 95378
52414I5378r65j063m97L99J157J319P30k56r93j084n73K63J106J581J381O26j21
52397I8388l95k21J89Q42J762K574K728K163J374P80L70Q7J39O58J313J613J506
52380A15870J359J384J405J222R66R54J323J910K443K722K704K486K181J883J705
52365A42517J775K102K473K630K481K075J528J083J116J765K586K919K654K365
52351A72069K568L151L697M060M372M690M936N121N336N599N904O394P304Q766
52337B43967J0643J2514J3794J4139J3875J3767J4199J4868J5382J5869J6598
52326C99615J7349J7589J7108J6154J5124J4491J4710J5616J6122J5199J3061
52315E72138J0869R344Q381P824P692P490O304M067J935Q92N37j65j502k996m276
$$ plain form
52414 95378 94413 93350 92853 93252 94409 95728 96458 96202 95209 94125 93552 93815 94921 96502 97883 98509 98388
52397 98388 97993 97772 97961 98803 100565 103139 105867 108030 109404 110184 110554 110641 110780 111438 112751 114364 115870
52380 115870 117229 118613 120018 121240 122206 123160 124483 126393 128836 131558 134262 136748 138929 140812 142517
52365 142517 144292 146394 148867 151497 153978 156053 157581 158664 159780 161545 164131 167050 169704 172069
52351 172069 174637 177788 181485 185545 189917 194607 199543 204664 210000 215599 221503 227897 235201 243967
52337 243967 254610 267124 280918 295057 308932 322699 336898 351766 367148 383017 399615
52326 399615 416964 434553 451661 467815 482939 497430 512140 527756 543878 559077 572138
52315 572138 583007 592351 600732 608556 616248 623738 630042 634109 636044 636936 637473 637308 635806 632810 628534
52300F28534n287n899n988n789n663n614n421n075m683m139l255k057o52R69K641
52285E72622L940M774N672O973Q208Q859R328J0315J1574J2267J2432J2988J4165
52272F94117J4922J4351J2805J1203R877Q617P426O478N660M612L134J391k12
52259G94381j213j502j656k520m261o144p429q118q575q869q871q739q820r200
52245G08464r595r651r149q148o995o084n423m693l812l089k626k064j138j66
52231F35831M60Q95J471K010K068J779J838K550L306L363K793K406K777L629M186
52216F71362M055L612L511L959M569M828M505L720K845K303K200K127J710J232
52202G16538J316J902K153J591P87M72M77J99l04m05r3k61j578l523m874m939
$$ plain form
52300 628534 623247 617348 611360 605571 599908 594294 588873 583798 579115 574976 571721 569664 569012 569981 572622
52285 572622 576562 581336 587008 593981 602189 611048 620376 630691 642265 654532 666964 679952 694117
52272 694117 709039 723390 736195 747398 757275 765892 773318 779796 785456 790068 793202 794593 794381
52259 794381 793168 791666 790010 787490 783229 777085 769656 761538 752963 744094 735223 726484 717664 708464
52245 708464 698869 689218 680069 671921 664926 658842 653419 648726 644914 641825 639199 637135 635997 635831
52231 635831 636291 637186 638657 640667 642735 644514 646352 648902 652208 655571 658364 660770 663547 667176 671362
52216 671362 675417 679029 682540 686499 691068 695896 700401 704121 706966 709269 711469 713596 715306 716538
52202 716538 717854 719756 721909 723500 724287 724759 725236 725435 725131 724726 724633 724372 722794 719271 714397 709458
52186G09458m075l179k830k972l229l398l549l672l545l055k437k004j774j569
52172F68170j324j094q91p88j025j722k541k912k609j987j615j790k217k163j144
52157F42348L80J334J213O60N01O86O99O47J111K048K644K515K294K761L887N136
52141F70864O198P020P502P666P907Q585R566J0522J1502J2730J3920J4385J3957
52128H02324J3341J3353J4018J4680J4816J4444J3833J3116J2256J1247J0233
52117I47661R415Q862Q333P384N773L868K403J706J292L15j572l953o115p543
52103I77829q097q047q040q604r580j0211r965r013p812o509n057l529k051o07
52089H80707P29J682K177K730L960N852P913R792J1376J2391J2576J2237J2055
$$ plain form
52186 709458 705383 702204 699374 696402 693173 689775 686226 682554 679009 675954 673517 671513 669739 668170
52172 668170 666846 665752 664861 664073 663048 661326 658785 655873 653264 651277 649662 647872 645655 643492 642348
52157 642348 642728 644062 645275 645935 646436 647122 647821 648468 649579 651627 654271 656786 659080 661841 665728 670864
52141 670864 677062 684082 691584 699250 707157 715742 725308 735830 747332 760062 773982 788367 802324
52128 802324 815665 829018 843036 857716 872532 886976 900809 913925 926181 937428 947661
52117 947661 957076 965938 974271 981655 987428 991296 993699 995405 996697 997012 995440 991487 985372 977829
52103 977829 969732 961685 953645 945041 935461 925250 915285 906272 898460 891951 886894 883365 881314 880707
52089 880707 881436 883118 885295 888025 891985 897837 905750 915542 926918 939309 951885 964122 976177
52076I76177J2315J2780J3332J4042J4507J3940J2250J0376R096Q077O619M756
52064A108267K887Q81j577m090n895p083q521j0527j2470j3904j5232j6807j8170
52051I97759j8829j9170j9827k0513k0367j9428j8829j9327k0290k0496j9516
52040G81167j7853j6088j4380j2745j1301j0086r001q032p398p232p287p120o635
52027F46009o250o455p257q131q498q251p813p730q236r115r958j0563j1085j1762
52013E24905j2519j3020j3143j3238j3731j4532j5095j5050j4529j3887j3350
52002C72811j3031j3012j3162j3097j2570j1757j1009j0426r909r436r011q491
51990B37900p751p000o524o224n749n056m464m072l618k975k406k123j990j850
$$ plain form
52076 976177 988492 1001272 1014604 1028646 1043153 1057093 1069343 1079719 1088815 1096892 1103511 1108267
52064 1108267 1111154 1112035 1110458 1106368 1100473 1093390 1084869 1074342 1061872 1047968 1032736 1015929 997759
52051 997759 978930 959760 939933 919420 899053 879625 860796 841469 821179 800683 781167
52040 781167 763314 747226 732846 720101 708800 698714 689713 681681 674283 667051 659764 652644 646009
52027 646009 639759 633304 626047 617916 609418 601167 593354 585624 577388 568273 558315 547752 536667 524905
52013 524905 512386 499366 486223 472985 459254 444722 429627 414577 400048 386161 372811
52002 372811 359780 346768 333606 320509 307939 296182 285173 274747 264838 255402 246391 237900
51990 237900 230149 223149 216625 210401 204652 199596 195132 191060 187442 184467 182061 179938 177948 176098
51976A76098j805j936k023j877j654j581j671j892k321k773k694j842q13m13p23
51961A50080j240j704k228k674k620k019j357j041j015j096j259j460j593j745
51947A27029k118k520k368j435k31O11J013J284J567J743J659J206M17l54o29
51932A26874m30l83r36j689j882j361o72l38m01o00o84n61l98n62j216k007k435
51915A10319k412k240k064j748j248q06n85m59k96k04l00m23k90J20N13O17M38
51898I8932J90P7J55L47N22N70M61K57Q9J12L70P07Q72P89P26J136K222L669M843
51879A17046N298N076M589M351M738N808P221Q491R385R889R704Q220N339K034
51865B07189m58k019l653o010q377r504q970p451n869m668l820l152k588k247
$$ plain form
51976 176098 174293 172357 170334 168457 166803 165222 163551 161659 159338 156565 153871 152029 151216 150803 150080
51961 150080 148840 147136 144908 142234 139614 137595 136238 135197 134182 133086 131827 130367 128774 127029
51947 127029 124911 122391 120023 118588 118357 118968 119981 121265 122832 124575 126234 127440 127857 127503 126874
51932 126874 126444 126061 125125 123436 121554 120193 119521 119183 118782 118182 117498 116937 116539 115977 114761 112754 110319
51915 110319 107907 105667 103603 101855 100607 99801 99216 98757 98461 98257 97957 97534 97244 97364 97877 98494 98932
51898 98932 99122 99199 99354 99701 100223 100793 101254 101511 101600 101712 102082 102789 103661 104450 105176 106312 108534 112203 117046
51879 117046 122344 127420 132009 136360 141098 146906 154127 162618 172003 181892 191596 199816 205155 207189
51865 207189 206731 204712 201059 195049 186672 177168 168198 160747 154878 150210 146390 143238 140650 138403
51851A38403k252k449k476k166j722j399j197r73o38j66L65N91J76o22j064q77
51835A21534n80o04n93j43L53K77j19j24K06J40l95o00j12M18M02J46J06R7j69
51816A20240l93k24K0j37m57l68O5K82J64J00J84Q3k38l36J0M59O13M05r3p84
51796A19595j305j209n87j45l23p64q65n39j88j71n56j095j331r65k90Q9R3K51
51778A09695P61J066Q31O58J142J661J026o88j968j731n62K81L85J72q4m64q19
51761A11362p16j20L47J46m70p94n24n3Q4j80m86n05k31J62N04P00P08N51K92
51742A10777L7K0N40J564K461K494J690Q81O97R43J182J450J902K105J433O7j011
51725A29232j182p93m97m97o38q36j059j236j337j397j398j383j669k465l251
$$ plain form
51851 138403 136151 133702 131226 129060 127338 125939 124742 123769 123131 122965 123330 123921 124097 123475 122411 121534
51835 121534 120954 120350 119757 119614 119967 120244 120125 120001 120207 120347 119952 119352 119240 119658 120060 120206 120312 120409 120240
51816 120240 119847 119623 119643 119506 119049 118681 118746 119028 119192 119292 119476 119559 119321 118985 118995 119454 120067 120472 120379 119595
51796 119595 118290 117081 116494 116349 116026 115262 114397 113858 113670 113499 112943 111848 110517 109552 109262 109351 109444 109695
51778 109695 110456 111522 112353 113011 114153 115814 116840 116152 114184 112453 111891 112172 112557 112729 112645 112181 111362
51761 111362 110646 110526 110873 111019 110549 109755 109231 109178 109262 109082 108596 108091 107860 108022 108526 109226 109934 110485 110777
51742 110777 110814 110834 111374 112938 115399 117893 119583 120464 121161 122104 123286 124736 126638 128743 130176 130243 129232
51725 129232 128050 127257 126760 126263 125625 124789 123730 122494 121157 119760 118362 116979 115310 112845 109594
51710A09594l123j951o90j95l05m44n52q72j239j264r87p16m54j5M39N65M25M06
51692I8622O36R55J305J615J441M00j049j910j767j090l65L75J041J245Q93N27
51676A02874O51J162J699K157K534K707K642K520K294J547J25j394k284k525k675
51661A14034l076l487l428k664j442l99m4k31l97l09k37k95j75J78K76j64o66
51644I7474p58p64j173j627j443q19o44j090j320p56R0M57L46L29O85J179J408
51627I1574J149N27L9Q6M88P16O39N99O52M16j33l21K45R17Q31J85n7M25R62R93
51607A00932P81P89R42R38Q78J077J424J389P39p7m35k20J14R8k48m92k94K33
51589A08568O40N79R8m67p69o87l61q1k3l7K12Q24J416J510J085O42N79P62Q18
$$ plain form
51710 109594 106471 104520 103830 103635 103330 102886 102334 101462 100223 98959 97972 97256 96802 96787 97226 97791 98216 98622
51692 98622 99258 100213 101518 103133 104574 104974 103925 102015 100248 99158 98793 99168 100209 101454 102347 102874
51676 102874 103525 104687 106386 108543 111077 113784 116426 118946 121240 122787 122912 121518 119234 116709 114034
51661 114034 110958 107471 104043 101379 99937 99538 99494 99263 98866 98557 98320 98025 97850 98028 98304 98140 97474
51644 97474 96716 95952 94779 93152 91709 90890 90246 89156 87836 87080 87170 87627 87973 88302 88987 90166 91574
51627 91574 92723 93250 93289 93375 93863 94579 95218 95817 96469 96885 96752 96431 96676 97593 98424 98609 98552 98977 99939 100932
51607 100932 101713 102502 103444 104382 105260 106337 107761 109150 109889 109812 109377 109157 109271 109369 109121 108629 108335 108568
51589 108568 109208 109787 109885 109418 108649 107962 107601 107520 107497 107460 107672 108496 109912 111422 112507 113149 113728 114490 115308
51570A15308P04P35J050J399J576J764K191K544K158Q41p34j707j857j588j216
51555A23168o23L12J262J690J433Q52L80R0k20o74j108j234r52m86j53m4K1K20
51537A23934M78N98M61O8m82q85p16O2Q33R57N97L95L99l2j012j623j191m60o17
51518A21764j541j993j435p03o45j013j140r32o43k62K73O19M95J92J09N4l47
51501A12852p89o08J00M47k2p58j116j269j756k552l012k631j536l00M67M41j83
51484I7775q45j067q25l96lL06N45P40R26J064J025P23K51k28o00q10p93n76l36
51465I6876k16j20J39N18P49O90N00K91j68j145k356k982k461j113J45O86O15
51448I0648L98K47k5o21j391j856j689j091n53k36J32O60R35O18J24J74P54J076
$$ plain form
51570 115308 116012 116747 117797 119196 120772 122536 124727 127271 129429 130270 129536 127829 125972 124384 123168
51555 123168 122545 122857 124119 125809 127242 128094 128474 128564 128344 127670 126562 125328 124376 123890 123737 123693 123714 123934
51537 123934 124412 125010 125471 125539 125057 124172 123456 123518 124351 125308 125905 126300 126699 126667 125655 124032 122841 122381 121764
51518 121764 120223 118230 116795 116092 115447 114434 113294 112362 111719 111457 111730 112349 112844 113036 113145 113199 112852
51501 112852 112063 111455 111555 112002 111980 111222 110106 108837 107081 104529 101517 98886 97350 97050 97517 97958 97775
51484 97775 96930 95863 95038 94642 94639 94945 95490 96230 97156 98220 99245 99968 100219 99991 99391 98581 97788 97212 96876
51465 96876 96660 96540 96679 97197 97946 98636 99136 99427 99259 98114 95758 92776 90315 89202 89347 90033 90648
51448 90648 91046 91293 91268 90647 89256 87400 85711 84620 84067 83831 83963 84623 85558 86176 86300 86474 87228 88304
51430H8304P06J08r8K3R7Q4J22N3k96n93l68J98M36J28k16j58J17K03k1m28q36
51409H7565r64o00k2R4n55j508k198k548k653k246j110K15Q41O72N55J051J616
51392G8205J412N07k58m12k97l38m35l13j01j24l27k73L46J344K222K481J877
51375H5516P01l19o57n65o41r50r93n77j65j44k79k47k49n86j016j037o83l96
51357G6713k90j26N1j37o55r14n77m3J83J32J35J84J5m43r78j346j402j081n39
51338F8882j20JK6J83L64L63K96M53Q14J054J025Q65O38K41k51m78k99j00k55
51319G3702n20l37L02P83O76K04k09m61n50k77M14R95Q28Kp38r11p62o84o58m81
51299G1318j35K71P00J005Q62K05n25p85n00OM45O51M87%m16l06L54J131J542
$$ plain form
51430 88304 89010 89118 89020 89043 89140 89224 89346 89399 89103 88510 88142 88340 88776 88904 88688 88530 88647 88850 88829 88401 87565
51409 87565 86601 86001 85979 86073 85518 84010 81812 79264 76611 74365 73255 73470 74311 74983 75538 76589 78205
51392 78205 79617 80124 79866 79454 79157 78819 78384 78071 77970 77846 77519 77246 77592 78936 81158 83639 85516
51375 85516 86217 85898 85241 84676 84035 83085 82092 81515 81350 81206 80927 80680 80431 79845 78829 77792 77109 76713
51357 76713 76423 76297 76348 76211 75556 74642 74065 74022 74205 74337 74472 74656 74671 74228 73250 71904 70502 69421 68882
51338 68882 68762 68763 68789 68972 69336 69699 69995 70448 71262 72316 73341 74206 74844 75085 74834 74356 74057 73957 73702
51319 73702 73182 72845 73147 73930 74606 74810 74601 74140 73590 73313 73727 74722 75550 75552 74814 73903 73141 72457 71799 71318
51299 71318 71183 71454 72154 73159 74021 74226 73701 72916 72416 72422 72867 73518 74005 74005 73589 73283 73637 74768 76310
51280G6310J425R97O82P57J067J219J151J153J338J398J074N11n2n24p38n10j34
51263H7124k70q72j029l05L98J38n88o11N1L32j88q37j075j049p98q1Q16J073
51245H2229N58Q4J04Q3l64o41j97M88O16K25p6j9K82P85J420J853J857J581J139
51226I2007L89n23r94p96m58m01l21k4Km58n77K64J161Q05m01p50L56J639J802
51207I2722J016K56kJ09L36M69M28L42K73j63j247k281k114o95O03O61j05n56
51189I0052l21Q5K11P1j68m10n31m35k10j3J37K52K67J59R8K71N62N97J29o22
51169I0181j051p34O1N81M61J19Q5K22O7l22m50k84l52p73r02k61O05P31o4j002
51149H6918j228o12K89P96P33N33O29Q19N60n9k11N76J651K037J650J185R75O49
$$ plain form
51280 76310 77735 78732 79414 80171 81238 82457 83608 84761 86099 87497 88571 89082 89030 88506 87768 87258 87124
51263 87124 86854 85982 84953 84648 85046 85184 84596 83985 84036 84368 84180 83343 82268 81219 80421 80340 81156 82229
51245 82229 82787 82871 82975 83058 82694 82053 81856 82344 82960 83185 83109 83090 83372 84157 85577 87430 89287 90868 92007
51226 92007 92396 91873 90879 90083 89625 89224 88903 88879 88881 88423 87846 88110 89271 90076 89675 88925 89281 90920 92722
51207 92722 93738 93994 93992 94101 94437 94906 95334 95676 95949 95786 94539 92258 90144 89449 90052 90713 90608 90052
51189 90052 89731 89816 90027 90098 89930 89520 88989 88554 88344 88331 88468 88720 88987 89146 89244 89515 90077 90674 90803 90181
51169 90181 89130 88396 88457 89038 89499 89618 89703 89925 89992 89670 89220 88936 88584 87811 86909 86648 87253 87984 87920 86918
51149 86918 85690 85078 85367 86163 86896 87429 88058 88877 89437 89378 89167 89743 91394 93431 95081 96266 97241 97890
51131I7890n0p60j043j044j164j339j123m54J37K30J59O37J803K987L425K982
51115A03273K104J281P29M42K68N1j54n3M61J021J081N08l10q69q54k11P13J189
51097A10670O86l76q48q0J269J943J450M85M1L69R46J221J140R61Q34P99R76J392
51079A23878J650J193R8p55n78M80J569J944J372J41r28q94K56J209O19j286k922
51062A27046l139k222j121m53l49o01o35N5J067J272K69q99r63J4R24J131J046
51045A22442J255J699J845J322K65o81q19n7Q77J214J014R47J257J403R12Q9l70
51028A34614k27K49Q29J450J865J660R25M14P20J474J884J883K122K758K995K249
51012A57864J177Q64J412K054K439K923L560L779L388L150L756M760N153M737
$$ plain form
51131 97890 97840 97080 96037 94993 93829 92490 91367 90913 91050 91280 91439 92076 93879 96866 100291 103273
51115 103273 105377 106658 107387 107829 108097 108148 107994 107941 108402 109423 110504 111012 110702 109833 108979 108768 109481 110670
51097 110670 111356 110980 110132 110052 111321 113264 114714 115199 115240 115609 116555 117776 118916 119877 120711 121510 122486 123878
51079 123878 125528 126721 126819 126064 125486 125966 127535 129479 130851 130992 130064 129170 129426 130635 131254 129968 127046
51062 127046 123907 121685 120564 120111 119762 119161 118526 118581 119648 120920 121189 120290 119327 119341 120265 121396 122442
51045 122442 123697 125396 127241 128563 128828 128147 127328 127271 128148 129362 130376 131323 132580 133983 134895 134984 134614
51028 134614 134387 134636 135465 136915 138780 140440 141365 141779 142499 143973 145857 147740 149862 152620 155615 157864
51012 157864 159041 159905 161317 163371 165810 168733 172293 176072 179460 182610 186366 191126 196279 201016
50998B01016M364M887O288P759Q429Q104P546P807R075J0433J1000J0983J1151
50985C08842J1631J1927J2034J2749J4568J6869J8622J9623K0614K2375K5109
50974D94963K8599L2483L6254L9400M1887M4344M7358N0648N3171N4258N4308
50963I77673N4163N4016N3242N1182M7775M3355L8219L2558K6635K0809J5422
50952A415049J0672O548K914j95k451l529l530k903j978q06N38J710K176J373
50938A425588j083n032r662j4107j8291k2744k7696l2735l7495m2106m6675n0753
50926A117209n3763n5578n6278n5693n3643n0469m6803m2984l9103l5476l2500
50915E94919l0032k7422k4360k1277j8755j6785j4907j2875j0941r482q478p476
$$ plain form
50998 201016 205380 210267 216555 224314 232743 240847 248393 256200 265275 275708 286708 297691 308842
50985 308842 320473 332400 344434 357183 371751 388620 407242 426865 447479 469854 494963
50974 494963 523562 556045 592299 631699 673586 717930 765288 815936 869107 923365 977673
50963 977673 1031836 1085852 1139094 1190276 1238051 1281406 1319625 1352183 1378818 1399627 1415049
50952 1415049 1425721 1432269 1435183 1434988 1432537 1429008 1425478 1422575 1420597 1419791 1420329 1422039 1424215 1425588
50938 1425588 1424505 1419473 1409811 1395704 1377413 1354669 1326973 1294238 1256743 1214637 1167962 1117209
50926 1117209 1063446 1007868 951590 895897 842254 791785 744982 701998 662895 627419 594919
50915 594919 564887 537465 513105 491828 473073 456288 441381 428506 417565 408083 399605 392129
50903C92129o118m646l675l357l070k160q52K7J38k2Q1L41M34N18J041J964K686
50886C75459K907L143M095N675P034P530P383P339P993R436J1238J2574J2817
50873D74623J2347J2409J3775J5785J7264J8196J9720K2485K5831K8957L2168
50862F93560L6367M1721M7495N3123N8812O5083P2043P9353Q6589R3581J00378
50851A428105J06991J13184J18509J22577J25134J25998J25006J21913J16145
50842B503562J06951R4276P9422O4205M9444L4805K0248O841m207j2580j8418
50831B924549k1493k1518j8769j3747o659J840R801J4885J6225J4580J0576L620
50819B913890p065k1068l6882n2941o8277q2520r5638j07550j17767j25454j29971
$$ plain form
50903 392129 386011 381365 377690 374333 371263 369103 368251 368278 368416 368394 368475 368816 369250 369768 370809 372773 375459
50886 375459 378366 381509 385604 391279 398313 405843 413226 420565 428558 437994 449232 461806 474623
50873 474623 486970 499379 513154 528939 546203 564399 584119 606604 632435 661392 693560
50862 693560 729927 771648 819143 872266 931078 996161 1068204 1147557 1234146 1327727 1428105
50851 1428105 1535096 1648280 1766789 1889366 2014500 2140498 2265504 2387417 2503562
50842 2503562 2610513 2704789 2784211 2848416 2897860 2932665 2952913 2959754 2955547 2942967 2924549
50831 2924549 2903056 2881538 2862769 2849022 2842363 2844203 2854004 2868889 2885114 2899694 2910270 2913890
50819 2913890 2906825 2885757 2848875 2795934 2727657 2645137 2549499 2441949 2324182 2198728 2068757
50808B068757j31163j29267j24771j18409j10883j02498r3347q3866p4825o6647
50798A033081n9039n1520m4083l7170l1247k6496k2711j9422j6330j3631j1721
50787F99711j0537r542q431p499p158p372p752p991p950p654p398p604q319r005
50773E85499r155q909q803q978r042q743q335q181q108p504n964l759j556J49
50759D88611J332K264L240M439N954P766R752J1749J3642J5419J7246J9386K1919
50746F22719K4548K6932K9246L2092L5795L9954M3915M7416N0628N3796N7025
50735A064066O0195O2891O4659O5567O6211O6853O6866O5422O2375N8001N2153
50724A755259M4336L4579K3587J1992J86j1038k0306k6560k9772l0509k9141k5733
$$ plain form
50808 2068757 1937594 1808327 1683556 1565147 1454264 1351766 1258419 1174553 1099728 1033081
50798 1033081 974042 922522 878439 841269 810022 783526 760815 741393 725063 711432 699711
50787 699711 689174 679632 671201 663702 656544 649172 641420 633429 625479 617825 610427 602823 594504 585499
50773 585499 576344 567435 558632 549654 540612 531869 523534 515353 507245 499741 493777 490018 488462 488611
50759 488611 489943 492207 495447 499886 505840 513606 523358 535107 548749 564168 581414 600800 622719
50746 622719 647267 674199 703445 735537 771332 811286 855201 902617 953245 1007041 1064066
50735 1064066 1124261 1187152 1251811 1317378 1383589 1450442 1517308 1582730 1645105 1703106 1755259
50724 1755259 1799595 1834174 1857761 1869753 1869939 1858901 1838595 1812035 1782263 1751754 1722613 1696880
50712A696880k0400j3534n881J352O939J0450J2389J3162J2195Q415J470p967
50700A715470j8938l0708m2476n3105o1664o8009p2445p4810p4423p1181o6274
50689A081437o1278n6654n1692m5909l9847l4235k9021k3751j8451j3525r043
50678F98031m792q55K450N143P487R335J0156R893R244Q914Q951Q935Q507P673
50664G89072O941P122Q542J0412J1519J1692J1987J3286J5277J7147J8779K0754
50652I42530K3512K6961L0822L4853L8798M2301M5034M6864M7955M8575M8650
50641A376855M7641M5145M1436L7075L2059K6001J9150J2598P153K451k443p982
50629A637139j3838j9322k3693k6314k6961k5975k4053k1800j9409j6589j2934
$$ plain form
50712 1696880 1676480 1662946 1657065 1658417 1665356 1675806 1688195 1701357 1713552 1721967 1723437 1715470
50700 1715470 1696532 1665824 1623348 1570243 1508579 1440570 1368125 1293315 1218892 1147711 1081437
50689 1081437 1020159 963505 911813 865904 826057 791822 762801 739050 720599 707074 698031
50678 698031 693239 692384 694834 699977 707464 716799 726955 736848 746092 755006 763957 772892 781399 789072
50664 789072 796013 803135 811677 822089 833608 845300 857287 870573 885850 902997 921776 942530
50652 942530 966042 993003 1023825 1058678 1097476 1139777 1184811 1231675 1279630 1328205 1376855
50641 1376855 1424496 1469641 1511077 1548152 1580211 1606212 1625362 1637960 1645113 1647564 1645121 1637139
50629 1637139 1623301 1603979 1580286 1553972 1527011 1501036 1476983 1455183 1435774 1419185 1406251
50618A406251q583m298n65K994O768J0102J1906J2152J1702J0646P858K564m638
50605A464859j2710k1154k9505l6847m2632m7270n1169n3834n4619n3728n1773
50594A009618m8947m5519m2421m0336l8597l5983l2303k8319k4504k0840j7561
50583F34288j4951j2558r664o519m115k673j400J64J573K448L099L825M377M562
50569F02456M690N081N723O687Q224J0184J1906J3088J4155J5488J6805J7673
50557G32160J8160J8559J8898J9108J9240J9337J9345J9438J9957K0927K2037
50546I47166K3338K5407K8549L2355L6340M0519M5034M9815N4963O0906O7673
50535A412065P4574Q1129Q7846R5288J02829J09044J13189J15441J15884J14067
$$ plain form
50618 1406251 1397668 1393370 1392805 1395799 1402567 1412669 1424575 1436727 1448429 1459075 1466933 1469497 1464859
50605 1464859 1452149 1430995 1401490 1364643 1322011 1274741 1223572 1169738 1115119 1061391 1009618
50594 1009618 960671 915152 872731 832395 793798 757815 725512 697193 672689 651849 634288
50583 634288 619337 606779 597115 590596 586481 583808 582408 582572 584145 586593 589692 593517 597894 602456
50569 602456 607146 612227 617950 624637 632861 643045 654951 668039 682194 697682 714487 732160
50557 732160 750320 768879 787777 806885 826125 845462 864807 884245 904202 925129 947166
50546 947166 970504 995911 1024460 1056815 1093155 1133674 1178708 1228523 1283486 1344392 1412065
50535 1412065 1486639 1567768 1655614 1750902 1853731 1962775 2075964 2191405 2307289 2421356
50525B421356J09809J03701R6325Q7351P5833O1298M4361K6254P958j0218k8170
50514B995858m5361o0884p4146q5076r3478r8624r9934r7776r3068q6271p7252
50503B083988o6124n3644m0562k7112j3346K58J2954K4245L3912M1508M6042M6374
50491B088493M1898L2783J9599K922j6497l7128n6603p2638q4205r1749r6272
50480A730603r8349r7990r5279r0842q5604q0154p4531o8602o2474n6374n0310
50469H70094m4148l8025l2444k7823k4083k0741j7356j3790j0259p176m796k970
50457F26483j310L55J904L274M612N943O979P505P698P923Q276Q608Q775Q630
50443G05655P927O615N168M277M106M196M160M209M756N768O809P691Q770J0506
$$ plain form
50525 2421356 2531165 2634866 2731191 2818542 2894375 2955673 3000034 3026288 3034246 3024028 2995858
50514 2995858 2950497 2889613 2815467 2730391 2636913 2538289 2438355 2340579 2247511 2161240 2083988
50503 2083988 2017864 1964220 1923658 1896546 1883200 1883458 1896412 1920657 1954569 1996077 2042119 2088493
50491 2088493 2130391 2163174 2182773 2185695 2169198 2132070 2075467 2002829 1918624 1826875 1730603
50480 1730603 1632254 1534264 1438985 1348143 1262539 1182385 1107854 1039252 976778 920404 870094
50469 870094 825946 787921 755477 727654 703571 682830 665474 651684 641425 634249 629453 626483
50457 626483 625173 625528 627432 630706 635318 641261 648240 655745 663443 671366 679642 688250 697025 705655
50443 705655 713582 720197 725365 729642 733748 737944 742104 746313 751069 756837 763646 771337 780107 790613
50429G90613J2864J5313J7334J8856K0248K2018K4509K7743L1419L5105L8592
50418A054614M2049M5750M9610N3164N6017N8217N9988O1138O0901N8606N4429
50407A654483M9264M3798L7847L0785K2390J2948K679q435k0156l1782m2633n2486
50395A698702o1187o8186p2744p4475p3419o9872o4484n8170n1490m4282l6327
50384A024066k8028j9943j1939l612M579J1526J6798K0885K3844K4728K2726J8139
50372A103769J1637L367o386j6315k4879l1697l7321m1837m4552m5101m3974m1883
50360G84828l9287l6664l4452l2460k9941k6673k3418k0947j9084j7138j4930
50349D89834j2812j0991r336p738o189m520k570o36P13J404K007K925L865M476
$$ plain form
50429 790613 803477 818790 836124 854980 875228 897246 921755 949498 980917 1016022 1054614
50418 1054614 1096663 1142413 1192023 1245187 1301204 1359421 1419409 1480547 1541448 1600054 1654483
50407 1654483 1703747 1747545 1785392 1816177 1838567 1851515 1854194 1845759 1825603 1793821 1751188 1698702
50395 1698702 1637515 1569329 1496585 1422110 1348691 1278819 1214335 1156165 1104675 1060393 1024066
50384 1024066 996038 976095 964156 960544 965123 976649 993447 1014332 1038176 1062904 1085630 1103769
50372 1103769 1115406 1118773 1112387 1096072 1071193 1039496 1002175 960338 915786 870685 826711 784828
50360 784828 745541 708877 674425 641965 612024 585351 561933 540986 521902 504764 489834
50349 489834 477022 466031 456695 448957 442768 438248 435678 435042 435755 437159 439166 442091 445956 450432
50335D50432N071O100P132P158O086N228N726P032P601O886N821N355N354N209
50321E36191M810M365L760K764J660R90P96O60M31M06P28J116J369J733K536L774
50305E68089N153O284O786O541N992N800O058O197N918N718O000O199N435L904
50291F50074K856L054L983M855N743P198R292J1720J4520J7721K0035J8904J2580
50278G82535K118r167j8125k3553k5979k6453k5685k3977k1539j8817j6386j4399
50266E60573j2396r940p350n365m101k868j170O08J824K476L056L790M454M813
50252E38404M827M530L982L369K816K194J351M02m54j339k520l906n135o119p091
50237E35311q085q799r053r027q872q510q002p680p639p449o755n806n060m465
$$ plain form
50335 450432 455503 461603 468735 475893 481979 487207 492933 499965 507566 514452 520273 525628 530982 536191
50321 536191 541001 545366 549126 551890 553550 554540 555336 555996 556427 556833 557561 558677 560046 561779 564315 568089
50305 568089 573242 579526 586312 592853 598845 604645 610703 616900 622818 628536 634536 640735 646170 650074
50291 650074 652930 655984 659967 664822 670565 677763 687055 698775 713295 731016 751051 769955 782535
50278 782535 784653 775486 757361 733808 707829 681376 655691 631714 610175 591358 574972 560573
50266 560573 548177 538237 530887 525522 521421 518553 517383 517991 519815 522291 525347 529137 533591 538404
50252 538404 543231 547761 551743 555112 557928 560122 561473 561875 561421 560082 557562 553656 548521 542402 535311
50237 535311 527226 518427 509374 500347 491475 482965 474963 467283 459644 452195 445440 439634 434574 430109
50223D30109l639k502j283L9J765L890N973P734R412J1297J3283J5108J6778J8411
50209E26375J9824K0566K0306J8991J6757J3949J1162Q930P319N999M696L383
50197F78257K034M44j601m207p549j1836j6888k1833k5542k7422k7703k6990k5767
50184D83397k4290k2731k1248j9890j8472j6641j4247j1688r769q965q917q859
50172B97680q422p807p197o410n286m102l284k886k576k071j379o52m1K63J32
50157B45962k76n24k97K65P44Q93R00J176J938K966L736L823L291K633K381K707
50141B72318L392M100M589M773M712M646M858N405O059O527O699O562O101N429
50127C46170M878M699M722M675M729N322O349P048O918O347N917N550M888M245
$$ plain form
50223 430109 426470 423968 422685 422724 424489 428379 434352 442086 451498 462795 476078 491186 507964 526375
50209 526375 546199 566765 587071 606062 622819 636768 647930 656860 664179 670178 674874 678257
50197 678257 680291 680735 679134 674927 667378 655542 638654 616821 591279 563857 536154 509164 483397
50184 483397 459107 436376 415128 395238 376766 360125 345878 334190 324421 315456 306539 297680
50172 297680 289258 281451 274254 267844 262558 258456 255172 252286 249710 247639 246260 245608 245567 245830 245962
50157 245962 245686 245162 244865 245130 245874 246767 247667 248843 250781 253747 257483 261306 264597 267230 269611 272318
50141 272318 275710 279810 284399 289172 293884 298530 303388 308793 314852 321379 328078 334640 340741 346170
50127 346170 351048 355747 360469 365144 369873 375195 381544 388592 395510 401857 407774 413324 418212 422457
50113D22457M417N550O818P455P641Q088R126J0561J2153J3972J6222J8914K1675
50100E65049K4049K6154K8871L2937L7840M2046M4492M5453M5748M5588M4598
50089I82825M2578L9709L6270L2623K9408K7194K5773K4120K1327J7346J2714
50078A291887P602J481o120j4647k2663k9167l4430l9149m3052m5072m4910m3609
50066I78151m2199m0492l7801l4266l0756k7713k4901k2162j9651j7273j4586
50055F66351j1465q373n778l742k303j660j722j886j740j617k050k898l537l781
50041F13799m151n143o626q147r506j0711j1617j2024j2047j2061j2134j1929
50029D97703j1342j0860j0861j0955j0500r622r043q888q495p543o603o123n614
$$ plain form
50113 422457 426874 432424 439242 446697 454338 462426 471552 482113 494266 508238 524460 543374 565049
50100 565049 589098 615252 644123 677060 714900 756946 801438 846891 892639 938227 982825
50089 982825 1025403 1065112 1101382 1134005 1163413 1190607 1216380 1240500 1261827 1279173 1291887
50078 1291887 1299489 1300970 1294850 1280203 1257540 1228373 1193943 1154794 1111742 1066670 1021760 978151
50066 978151 935952 895460 857659 823393 792637 764924 740023 717861 698210 680937 666351
50055 666351 654886 646513 640735 636993 634690 633030 631308 629422 627682 626065 624015 621117 617580 613799
50041 613799 609648 604505 597879 589732 580226 569515 557898 545874 533827 521766 509632 497703
50029 497703 486361 475501 464640 453685 443185 433563 424520 415632 407137 399594 392991 386868 381254
50016C81254m527l298k736k759k649k316k344k819l098k907k728k825k687j919
50002C41642j069r09j408j917k054j905j597j210r75j096j445j732j872j904j722
49987C18827j179l93L50R86J703K693M047N827P894R872J1492J2964J4680J6628
49973D06391J8342J9396J9700J9346J8447J7151J5558J3592J1264R150Q178Q608
49961E85123R443R261P576N069K421o86n039j0669j6528k1392k4722k6598k7201
49948D86058k6735k5589k4205k2734k1100j9348j7651j5939j3904j1493r192p644
49936B70524p019o867o478n425l909k601k001j908j637q28J73P21M93l50j301
49921B31587j763j392m77K01J03m65o90j42P37J081N32l54o97k79J73j79j307
$$ plain form
50016 381254 376727 373429 370693 367934 365285 362969 360625 357806 354708 351801 349073 346248 343561 341642
50002 341642 340573 339664 338256 336339 334285 332380 330783 329573 328598 327502 326057 324325 322453 320549 318827
49987 318827 317648 317255 317605 318591 320294 322987 327034 332861 340755 350627 362119 375083 389763 406391
49973 406391 424733 444129 463829 483175 501622 518773 534331 547923 559187 568337 576515 585123
49961 585123 594566 603827 611403 616472 618893 618207 613168 602499 585971 564579 539857 513259 486058
49948 486058 459323 433734 409529 386795 365695 346347 328696 312757 298853 287360 278168 270524
49936 270524 263505 256638 250160 244735 240826 238225 236224 234316 232679 231851 232024 232745 233238 232888 231587
49921 231587 229824 228432 227955 228156 228259 227794 227104 226962 227699 228780 229312 228958 228261 227982 228155 227976 226669
49904B26669k361k616k134j547j372j583j731j482j113j221j862k295j960j361
49890B02031j349j834j897j215n11m33p37r07q35n01K58J136J258L82m28j58O61
49873A94921Q30L44K84R77J581J632J759K354K585J628J01o12q7Q83J497J598
49857B12275J285O72J64K67Q83J255R28K85j22l89r23j615j875j530j115j132
49841B09313j357j243p12k65l30p48r95p61k22J83K66K73N13Q34P86L24J0K61
49823B06130P72J034J109J360J663J555J135J063J476J656J118L68J33L05K79
49808B21156r8m91p45j018j331j514j511j327q60k26k6p01j742k132j580p03m8
49791B05103L90N36l5j267k223k040j047l44m60r22j072p89l85p9J82N25Q94J042
$$ plain form
49904 226669 224308 221692 219558 218011 216639 215056 213325 211843 210730 209509 207647 205352 203392 202031
49890 202031 200682 198848 196951 195736 195225 194792 194055 193148 192313 191812 192070 193206 194464 194846 194418 194260 194921
49873 194921 195751 196095 196379 197356 198937 200569 202328 204682 207267 208895 208996 208384 208297 209180 210677 212275
49857 212275 213560 214232 214396 214663 215546 216801 217729 218014 217892 217503 216580 214965 213090 211560 210445 209313
49841 209313 207956 206713 206001 205736 205406 204658 203663 202902 202680 202863 203129 203402 203915 204749 205535 205859 205869 206130
49823 206130 206902 207936 209045 210405 212068 213623 214758 215821 217297 218953 220071 220439 220572 220877 221156
49808 221156 221058 220567 219822 218804 217473 215959 214448 213121 212261 212035 212009 211308 209566 207434 205854 205151 205103
49791 205103 205493 206029 205994 204727 202504 200464 199417 199073 198613 197691 196619 195830 195445 195366 195548 196073 196967 198009
49773A98009Q65O34P73J275J651J478Q53J28n31j083j306r29j24M90M72P5m8L75
49755B03057R18R86N68K80O62J577K433K785K593J921Q67k69r53q72k35N09J136
49738B17963J614J781J296J28j122j587r96PN36M01J74L63Q36J312J979L218M727
49721B32630N506M829K980Q74q12j974k785l363l673l599l133k457j800j103j37
49706B21983J002J725J478M60n28r01q15q00j025j136q16k34K37N76J074J738
49690B24018K125J948J522J297J233R99O66P47J505K666L772M463M336L097J044
49675B55438r47k187k653k581j964p96M98J311J487J369J332J449J594J555J125
49660B56030K81p03j496j995k240k131j510m65O46J618K634M081O171Q715J1099
$$ plain form
49773 198009 198874 199508 200281 201556 203207 204685 205538 205666 205135 204052 202746 201817 201693 202183 202655 202730 202682 203057
49755 203057 203975 204961 205529 205809 206471 208048 210481 213266 215859 217780 218647 218378 217425 216553 216318 216827 217963
49738 217963 219577 221358 222654 222782 221660 220073 219077 219084 219620 220021 220195 220558 221394 222706 224685 227903 232630
49721 232630 238136 242965 245945 246819 246007 244033 241248 237885 234212 230613 227480 225023 223223 222120 221983
49706 221983 222985 224710 226188 226648 226120 225219 224404 223604 222579 221443 220627 220393 220630 221206 222280 224018
49690 224018 226143 228091 229613 230910 232143 233142 233808 234555 236060 238726 242498 246961 251297 254394 255438
49675 255438 254491 252304 249651 247070 245106 244310 244808 246119 247606 248975 250307 251756 253350 254905 256030
49660 256030 256311 255608 254112 252117 249877 247746 246236 245771 246417 248035 250669 254750 260921 269636 280735
49645B80735J2445J1950R298M871l46n072q224r373q964p966p157o656o088n221
49631B54232m297l697l383k966k288j647j268r60n31k04k09k06K32Q02Q19M03
49615B34832M68J330K139K132J733J743K049J996J657J793K567L172K894J993
49601B62498J225J022J297J736K015J975J780J754K019K475K994L384L257K428
49587B91859J409J006J400K017K437K788L140L113K512J790J461J407J301J306
49573C18946J766K447K728K549K505K937L383L251K623K116K081K241K061J350
49559C52984M69j5Q4M21N89N26L84J76j03j69L20J204J838J774J227O88M31M26
49541C63254N25N30M02M49J064K098K885L122L268L736M167M088L953M680O166
$$ plain form
49645 280735 293180 305130 314428 319299 318953 313881 305657 296284 287320 279354 272197 265541 259453 254232
49631 254232 249935 246238 242855 239889 237601 235954 234686 233726 233195 232991 232782 232576 232808 233610 234429 234832
49615 234832 235300 236630 238769 240901 242634 244377 246426 248422 250079 251872 254439 257611 260505 262498
49601 262498 263723 264745 266042 267778 269793 271768 273548 275302 277321 279796 282790 286174 289431 291859
49587 291859 293268 294274 295674 297691 300128 302916 306056 309169 311681 313471 314932 316339 317640 318946
49573 318946 320712 323159 325887 328436 330941 333878 337261 340512 343135 345251 347332 349573 351634 352984
49559 352984 353453 353438 353522 353943 354532 355058 355442 355618 355515 355346 355666 356870 358708 360482 361709 362397 362828 363254
49541 363254 363779 364309 364711 365160 366224 368322 371207 374329 377597 381333 385500 389588 393541 398221 404387
49526D04387P119O605N114L735K925K528K488K933L734M592N404O137O502O269
49512D70472N726N302M829L780K195P19l55j391k568l383l449l230l521m469n549
49497D65108o299o678o854p017p208p162o562n628n061n080n033m432l828l936
49483C84330m351m096l155k496k516k599k405k494l125l455k752j658j309j725
49469C46194j999j795j651j869k013j666r68k39L17L21n68j933k634k086j007
49454C26404m86o37p60m73j74l11p21q83o19l47o18j382j862j357j91N94N63M76
49436C17216J180K358L022K990L162M212N700O840P548Q211Q661Q004N649K184
49422C86937r61k677k943k517k017j431n54M26J055J284J661K636M042N392O449
$$ plain form
49526 404387 411506 418111 423225 426960 429885 432413 434901 437834 441568 446160 451564 457701 464203 470472
49512 470472 476198 481500 486329 490109 492304 493023 492668 491277 488709 485326 481877 478647 475126 470657 465108
49497 465108 458809 452131 445277 438260 431052 423890 417328 411700 406639 401559 396526 392094 388266 384330
49483 384330 379979 375883 372728 370232 367716 365117 362712 360218 357093 353638 350886 349228 347919 346194
49469 346194 344195 342400 340749 338880 336867 335201 334233 333994 334311 334632 334064 332131 329497 327411 326404
49454 326404 325918 325281 324521 324048 323874 323563 322842 321959 321340 320993 320375 318993 317131 315774 315583 316177 316740 317216
49436 317216 318396 320754 323776 326766 329928 334140 339840 346680 354228 362439 371100 379104 384753 386937
49422 386937 385976 383299 380356 377839 375822 374391 373837 374263 375318 376602 378263 380899 384941 390333 396782
49407C96782P272P920Q414Q852R256R417R244R112R496J0222J0549J0104R351
$$ plain form
49407 396782 404054 411974 420388 429240 438496 447913 457157 466269 475765 485987 496536 506640 515991
$$ [...]
##END NTUPLES=NMR SPECTRUM
##END=
