##TITLE=NES1062_159122.0011_002_9704227_S7YpYeiwKW
##JCAMPDX= 6.0         $$ Bruker NMR JCAMP-DX V2.0
##DATA TYPE= NMR SPECTRUM
##DATA CLASS= NTUPLES
##ORIGIN= BRUKER
##OWNER= Administrator
$$ 1.72 TOPSPIN		Version 2.1
$$ 2016-04-30 13:39:24.208 -0700  Administrator@X
$$ Compression mode = diff/dup
##.OBSERVE FREQUENCY= 400.02188249412
##.OBSERVE NUCLEUS= ^1H
##.ACQUISITION MODE= SIMULTANEOUS (DQD)
##.ACQUISITION SCHEME= undefined
##.AVERAGES= 8
##.DIGITISER RES= 22
##SPECTROMETER/DATA SYSTEM= spect
##.PULSE SEQUENCE= zg30
##.SOLVENT NAME= COFFEE_meoh
##.SHIFT REFERENCE= INTERNAL, COFFEE_meoh, 1, 14.98509
##AUDIT TRAIL= $$ (NUMBER, WHEN, WHO, WHERE, PROCESS, VERSION, WHAT)
$$ ##TITLE= Audit trail, TOPSPIN		Version 2.1
$$ ##JCAMPDX= 5.01
$$ ##ORIGIN= Bruker BioSpin GmbH
$$ ##OWNER= Administrator
$$ $$ E:\/data/COFFEE/nmr/NES1062_159122.0011_002_9704227_S7YpYeiwKW/20/pdata/1/auditp.txt
$$ ##AUDIT TRAIL=  $$ (NUMBER, WHEN, WHO, WHERE, PROCESS, VERSION, WHAT)
(   1,<2016-04-30 13:39:15.974 -0700>,<Administrator>,<X>,<go>,<TOPSPIN 2.1>,
      <created by zg
	started at 2016-04-30 13:38:09.505 -0700,
	POWCHK enabled, PULCHK disabled,
       configuration hash MD5:
       21 0F 79 D6 B3 7B B4 F6 88 20 88 DB 03 48 BD 9F
       data hash MD5: 64K
       68 16 10 9A C0 AD 79 6C 61 98 72 C0 17 9E B6 F2>)
(   2,<2016-04-30 13:39:19.396 -0700>,<Administrator>,<X>,<proc1d>,<TOPSPIN 2.1>,
      <Start of raw data processing
       efp LB = 0 FT_mod = 6 PKNL = 1 PHC0 = 0 PHC1 = 0 SI = 32K 
       data hash MD5: 32K
       0E C4 CF EF 31 07 2E EB AB 21 1A 83 04 7E 86 62>)
(   3,<2016-04-30 13:39:19.724 -0700>,<Administrator>,<X>,<proc1d>,<TOPSPIN 2.1>,
      <pk PHC0 = 95.03723 PHC1 = 0 
       data hash MD5: 32K
       8D EC 34 8D 6D D4 3B AA ED 96 FD A5 E3 35 B9 86>)
(   4,<2016-04-30 13:39:19.864 -0700>,<Administrator>,<X>,<proc1d>,<TOPSPIN 2.1>,
      <abs ABSG = 1 
       data hash MD5: 32K
       73 24 41 AA 48 02 C0 2F 75 AA CA 9B A8 25 E5 99>)
(   5,<2016-04-30 13:39:19.989 -0700>,<Administrator>,<X>,<proc1d>,<TOPSPIN 2.1>,
      <abs ABSG = 2 
       data hash MD5: 32K
       74 33 C7 FF 42 55 F1 AE 87 DC 1C F6 91 65 15 50>)
(   6,<2016-04-30 13:39:20.052 -0700>,<Administrator>,<X>,<proc1d>,<TOPSPIN 2.1>,
      <abs ABSG = 3 
       data hash MD5: 32K
       78 0D B6 74 0D 6D 55 70 73 C2 F1 BE 57 C1 EB 43>)
(   7,<2016-04-30 13:39:20.114 -0700>,<Administrator>,<X>,<proc1d>,<TOPSPIN 2.1>,
      <abs ABSG = 4 
       data hash MD5: 32K
       CE 4C F1 6F 60 41 16 87 A0 42 23 BF 7F 81 82 07>)
(   8,<2016-04-30 13:39:20.192 -0700>,<Administrator>,<X>,<proc1d>,<TOPSPIN 2.1>,
      <abs ABSG = 5 
       data hash MD5: 32K
       6D AB 17 14 48 D0 ED 92 5E 3F 7D 7A 11 E7 7A FD>)
$$ ##END=
$$ 
$$ $$ hash MD5
$$ $$ C9 ED 33 19 DF 99 92 AE 31 7D C4 04 94 4C B9 88
##$RELAX= 
##$RELAX= 
##$RELAX= 
##$RELAX= 
##$RELAX= 
##$RELAX= 
##$RELAX= 
$$ Bruker specific parameters
$$ --------------------------
##$DU= <E:\>
##$EXPNO= 20
$$ [...]
150 150 150 150 150 150 150 150
##$TP07= 0
##$TPNAME0= <>
##$TPNAME1= <>
##$TPNAME2= <>
##$TPNAME3= <>
##$TPNAME4= <>
##$TPNAME5= <>
##$TPNAME6= <>
##$TPNAME7= <>
##$TPOAL= (0..7)
0.5 0.5 0.5 0.5 0.5 0.5 0.5 0.5
##$TPOFFS= (0..7)
0 0 0 0 0 0 0 0
##$TUNHIN= 0
##$TUNHOUT= 0
##$TUNXOUT= 0
##$USERA1= <user>
##$USERA2= <user>
##$USERA3= <user>
##$USERA4= <user>
##$USERA5= <user>
##$V9= 5
##$VALIST= <valist>
##$VCLIST= <CCCCCCCCCCCCCCC>
##$VD= 0
##$VDLIST= <DDDDDDDDDDDDDDD>
##$VPLIST= <PPPPPPPPPPPPPPP>
##$VTLIST= <TTTTTTTTTTTTTTT>
##$WBST= 2048
##$WBSW= 25
##$XGAIN= (0..3)
0 0 0 0
##$XL= 0
##$YL= 0
##$YMAX_a= 605312
##$YMIN_a= -513411
##$ZGOPTNS= <>
##$ZL1= 120
##$ZL2= 120
##$ZL3= 120
##$ZL4= 120
##$ABSF1= 14.98509
##$ABSF2= -5.573092
##$ABSG= 5
##$ABSL= 3
##$ALPHA= 0
##$AQORDER= 0
##$ASSFAC= 0
##$ASSFACI= 0
##$ASSFACX= 0
##$ASSWID= 0
##$AUNMP= <proc_prof1d_extract_pilot.lims>
##$AXLEFT= 0
##$AXNAME= <>
##$AXNUC= <1H>
##$AXRIGHT= 0
##$AXTYPE= 0
##$AXUNIT= <>
##$AZFE= 0.1
##$AZFW= 0.1
##$BCFW= 0
##$BC_mod= 0
##$BYTORDP= 0
##$COROFFS= 0
##$CY= 15
##$DATMOD= 1
##$DC= 0
##$DFILT= <>
##$DTYPP= 0
##$F1P= 0
##$F2P= 0
##$FCOR= 0.5
##$FTSIZE= 32768
##$FT_mod= 6
##$GAMMA= 0
##$GB= 0
##$INTBC= 1
##$INTSCL= 1
##$ISEN= 128
##$LB= 0
##$LEV0= 0
##$LPBIN= 0
##$MAXI= 10000
##$MC2= 0
##$MEAN= 0
##$ME_mod= 0
##$MI= 0
##$NCOEF= 0
##$NC_proc= -8
##$NLEV= 6
##$NOISF1= 0
##$NOISF2= 0
##$NSP= 0
##$NTH_PI= 0
##$NZP= 0
##$OFFSET= 14.98509
##$PC= 1
##$PHC0= 95.03723
##$PHC1= 0
##$PH_mod= 1
##$PKNL= yes
##$PPARMOD= 0
##$PPDIAG= 0
##$PPIPTYP= 0
##$PPMPNUM= 2147483647
##$PPRESOL= 1
##$PSCAL= 4
##$PSIGN= 0
##$PYNMP= <proc.py>
##$REVERSE= no
##$SF= 400.02
##$SI= 32768
##$SIGF1= 0
##$SIGF2= 0
##$SINO= 400
##$SIOLD= 32768
##$SPECTYP= <>
##$SREGLST= <1H.CDCl3>
##$SSB= 0
##$STSI= 32768
##$STSR= 0
##$SW_p= 8223.68421052631
##$SYMM= 0
##$S_DEV= 0
##$TDeff= 65536
##$TDoff= 0
##$TI= <>
##$TILT= no
##$TM1= 0
##$TM2= 0
##$TOPLEV= 0
##$USERP1= <user>
##$USERP2= <user>
##$USERP3= <user>
##$USERP4= <user>
##$USERP5= <user>
##$WDW= 1
##$XDIM= 32768
##$YMAX_p= 421636123
##$YMIN_p= -710261
##$CURPLOT= <Network HP LaserJet P1505>
##$CURPRIN= <$Network HP LaserJet P1505>
##$DFORMAT= <normdp>
##$LAYOUT= <+/1D_H.xwp>
##$LFORMAT= <normlp>
##$PFORMAT= <normpl>
##$SURQMSG= 1
$$ End of Bruker specific parameters
$$ ---------------------------------
##NTUPLES= NMR SPECTRUM
##VAR_NAME=  FREQUENCY,     SPECTRUM/REAL,   SPECTRUM/IMAG
##SYMBOL=    X,             R,               I
##VAR_TYPE=  INDEPENDENT,   DEPENDENT,       DEPENDENT
##VAR_FORM=  AFFN,          ASDF,            ASDF
##VAR_DIM=   32768,         32768,           32768
##UNITS=     HZ,            ARBITRARY UNITS, ARBITRARY UNITS
##FACTOR=    0.250966925370066, 1,           1
##FIRST=     8223.43324360094, 61991,        -186827
##LAST=      0,             -19539,          -48155
##MIN=       0,             -710261,         0
##MAX=       8223.43324360094, 421636123,    0
$$ Real data points
##PAGE= N=1
##DATA TABLE= (X++(R..R)), XYDATA
$$ [...]
$$ plain form
19528 -164493 -208384 -130226 35919 318573 -426731 140373 -242738 51693 248333 -318467
19517 156518 -215174 -146585 -51186 -6643 81473 32102 -219837 141763 47059 -68626 -381317
19506 -381317 203785 -143609 -79972 -19156 -128916 -30998 13749 -123129 102877 -92022
19495 -177025 -9374 -101773 -235760 152095 -301404 -136330 -10887 -100351 -215919 -6014 16831
19483 -87320 153500 -192731 40384 -265564 -56135 24125 154076 112412 74346 -46429 -253551
19472 -253551 -134284 71677 -39357 -57709 -305360 223778 -40618 137848 -367941 59186
19461 -28155 -368221 3306 -90542 107678 -66283 201779 -206641 -155836 -48253 128253 -129618
19449 52684 133309 -235733 -254944 115718 127450 40463 83408 152380 149179 -82981 29963
$$ packed form
19528a64493m3891P8158C5919K82654d26731A40373b42738E1693J96640c18467
19517A56518b15174O8589e1186f643H1473C2102b19837A41763D7059f8626l12691
19506c81317B03785a43609O3637a9156j09760c0998A3749a23129A02877i2022
19495a77025i374r2399j33987A52095c01404a36330a0887q9464j15568f014A6831
19483h7320A53500a92731D0384b65564e6135B4125J29951m1664l8066d6429k07122
19472b53551J19267G1677c9357j8352k47651B23778d0618A37848c67941E9186
19461b8155l40066C306i0542A07678f6283B01779b06641N0805d8253A28253a29618
19449E2684Q0625b35733j9211A15718J1732D0463M2945O8972l201h2981B9963
$$ plain form
19437 78106 -145943 -131565 62903 -217080 -60080 492 86523 32926 -194481 -152193 27013
19425 -202949 153222 10940 300393 132025 -181212 -101628 -23113 -61860 -89298 -117735 -3328
19413 26323 -282469 -247345 218768 -172370 92195 4339 -8304 -99352 -64037 -116869 161880
19401 -149188 -3199 50867 197611 -141339 -7808 -95348 -186259 -8890 28595 170515 -36822
19389 86093 -233275 23680 184198 -166470 -5005 -98441 -291623 -93836 -187675 60265 -169530
19377 -152167 -209034 -186537 -207633 -323220 131866 17389 35590 -344141 -320213 116398 107780
19366 107780 -79427 8224 -171836 -129699 -16093 -269636 -329529 -280794 21906 -77544 -106057
19355 -106057 -58247 -80533 -138132 288740 -26911 -109506 46936 101452 -266483 -97980 -75215
$$ packed form
19437G8106a45943J4378F2903b17080f0080D92Q6031C2926a94481M2288B7013
19425b02949A53222A0940K89453A32025a81212P9584b3113l8747k7438k8437c328
19413B6323b82469L5124B18768a72370I2195D339h304r1048L5315n2832A61880
19401a49188c199E0867J46744a41339g808q7540r0911h890B8595J41920c6822
19389H6093b33275B3680J60518a66470e005r3436j93182i3836r3839F0265a69530
19377a52167n6867K2497k1096j15587A31866A7389J8201c44141K3928A16398q618
19366A07780g9427H224a71836M2137a6093k53543n9893M8735B1906g7544k8513
19355a06057M7810k2286n7599B88740b6911q2595D6936N4516b66483i7980K2765
$$ plain form
19344 -75215 -157973 72354 -60208 45924 -263754 -289366 -97055 -5326 -134099 102953 -200815
19332 -271981 133446 47147 41015 -460793 -77950 -336868 185611 210066 178635 -72590 -365362
19321 -365362 -57185 38770 -219466 -214307 -324959 147534 -3230 220076 -23223 -268025 -203043
19310 -203043 261282 -26459 -204562 -114838 153507 -265945 200325 -33876 190775 -213435
19299 -163866 -66547 29315 -112638 -7167 -43798 39316 19798 12592 -136375 -130630 -54561 110754
19286 51414 284417 -497321 158572 158158 20203 -63743 148556 -246777 -132924 -40123 94483
19274 139731 -352911 62630 -220993 142915 -273807 121691 224157 -41511 34949 108899
19264 108899 12321 -348621 16810 447712 -62077 -179958 -309449 -198092 -51762 72734
$$ packed form
19344g5215q2758G2354f0208D5924b63754k5612i7055e326j28773A02953b00815
19332b71981A33446D7147o132d60793g7950k58918A85611K4455l1431g2590k92772
19321c65362e7185C8770b19466N159j10652A47534c230B20076b3223k44802O4982
19310b03043B61282b6459j78103Q9724A53507b65945B00325c3876A90775b13435
19299a63866f6547B9315a12638g167l6631C9316j9518p206a36375N745e4561A10754
19286E1414K33003d97321A58572m14B0203f3743A48556b46777J13853d0123I4483
19274A39731c52911F2630b20993A42915b73807A21691J02466d1511C4949P3950
19264A08899A2321c48621A6810M30902f2077j17881j29491J11357e1762G2734
$$ plain form
19253 -80884 19933 16292 47886 121607 107703 18263 153260 212898 -206206 -343299 -82721
19241 95939 -324967 -290524 -452252 -271344 -61004 -339707 -68113 -89287 -21378 -28631 -115095
19230 -115095 -485551 217008 192245 -63073 -287712 75288 -208990 193120 -16393 -326557
19220 -326557 -165023 62215 -65641 -99742 370692 -89470 -89297 -74336 -195114 45610 -220561
19208 -147678 -114730 -187718 -107356 -65792 -3571 45863 6343 -59878 136326 -157654 41334
19196 -203819 102438 -577979 -80537 -34725 78424 -28940 -339607 -119218 -178576 95160 -551775
19184 174229 83405 369865 -152849 -162485 -121923 -46314 283649 -154917 -94149 -52549 100832
19172 8788 91237 144060 197396 -14686 -39670 -194105 -56107 108870 138309 121646 24295
$$ packed form
19253h0884A9933l641L1594P3721j3904A8263J34997N9638b06206j37093h2721
19241I5939c24967L4443j61728J80908f1004k78703f8113k1174b1378p253q6464
19230a15095l70456B17008k4763f3073k24639G5288b08990A93120a6393l10164
19220c26557J61534F2215f5641l4101C70692h9470J73J4961j20778D5610b20561
19208a47678L2948p2988Q0362M1564c571D5863F343e9878A36326a57654D1334
19196b03819A02438e77979h0537c4725G8424b8940l10667a19218n9358I5160e51775
19184A74229H3405K86460a52849r636M0562d6314B83649a54917O0768M1600A00832
19172H788Q2449N2823N3336a4686k4984j54435e6107A08870K9439j6663B4295
$$ plain form
19160 -134999 -66859 47307 -251640 -47716 -202807 -103776 -21149 -149730 -250052 223308
19149 52362 -423592 154336 -235602 -48885 -70623 -67717 -11475 -27324 -18108 64223 61062 -214566
19136 -40260 96394 -384302 164358 -206283 19785 -38036 -27580 47264 27078 -38222 -278148
19125 -278148 -47915 -99904 132314 -1795 -47290 55239 -72743 -53192 103821 117837 -145419
19113 -77421 -120938 -164630 61741 35050 3022 -71521 151392 -225627 51598 -244733 239240
19101 -65302 -253506 53672 160886 -75627 -196982 114684 -284451 -71989 -55556 -231482
19091 -231482 -236133 193770 -37315 45644 -139660 -90778 590219 -208 -151267 207666 104605
19080 104605 -112009 -132966 -98660 -200625 337604 24511 -395524 -255369 -98121 -28641
$$ packed form
19160a34999f6859D7307b51640d7716j55091R9031b1149j28581j00322B23308
19149E2362d23592A54336b35602d8885k1738K906a1475j5849R216F4223l161b14566
19136d0260I6394c84302A64358b06283A9785c8036J0456D7264k0186c8222k39926
19125b78148d7915n1989A32314a795m5495E5239g2743J9551A03821J4016a45419
19113g7421m3517m3692F1741k6691C022g1521A51392b25627E1598b44733B39240
19101f5302j88204E3672J07214g5627j21355A14684b84451g1989J6433j75926
19091b31482m651A93770c7315D5644a39660M8882E90219b08j51059B07666j03061
19080A04605a12009k0957L4306j01965C37604B4511c95524J40155i8121b8641
$$ plain form
19069 272670 77441 90487 -116492 -170000 67241 -79330 301587 -88865 54631 193646 61072
19057 -86693 -77922 -408650 237504 278847 -247914 95515 -281069 366254 -468644 -154972
19046 -65038 -28418 92723 35105 -249333 -308205 46241 39574 -42444 -52306 -192538 -82322 81811
19033 175154 -132548 -14353 37962 -54837 458592 191439 -48827 -75298 421289 -70457 77465
19021 -109375 234576 28836 -121301 -64362 9482 -109424 -53276 123486 -190365 96130 -17385
19009 -276265 45546 -49487 191333 -97289 -20036 -38619 308068 -7340 -274522 166699 2134
18997 21575 -105851 229578 -344892 -336293 -132745 -81351 -28183 -39586 126170 -237145 1383
18985 -245912 -506879 -254436 -68975 138324 87138 -132599 57173 -95979 -52544 -281517
$$ packed form
19069B72670G7441J3046a16492n3508F7241g9330C01587h8865E4631J39015F1072
19057h6693Q771l30728B37504M1343b47914I5515b81069C66254d68644a54972
19046f5038b8418I2723C5105b49333n8872D6241o667d2444r862j40232h2322H1811
19033A75154a32548a4353C7962e4837D58592A91439d8827k6471D21289g0457G7465
19021a09375B34576B8836a21301N6939I482a09424e3276A23486a90365I6130a7385
19009b76265D5546d9487A91333i7289b0036j8583C08068g340k67182A66699B134
18997B1575a05851B29578c44892Q599a32745N1394b8183j1403A26170b37145A383
18985b45912k60967K52443f8975A38324n1186a32599E7173i5979M3435k28973
$$ plain form
18975 -281517 -186886 75151 128919 -42574 40612 -97381 82216 -128367 172307 150467 4812
18963 -147898 -105385 169990 -93502 -177893 -169820 -252984 81192 45561 -185992 37811 -116852
18951 91680 -117407 117418 32315 -111366 -217420 -47843 12344 -221468 232048 -181140
18940 109069 139040 191096 75727 274245 -160980 -77459 -154091 -96329 -14616 -72986 161359
18928 132745 -225992 -19462 -38363 117394 79294 -178498 -186685 62341 31317 -59992 -391950
18917 -391950 -163508 45534 -7601 1500 -230825 -211809 -103421 -10584 -64831 427039 -375810
18905 5933 -246314 156656 1020 -181030 -14487 -62717 -95945 228586 -113503 -115709 -1673
18893 -295015 100214 133772 -404276 277490 189607 34862 34028 20283 -186850 -391627 -78592
$$ packed form
18975b81517R4631G5151N3768d2574D0612i7381H2216a28367A72307k1840D812
18963a47898M2513A69990i3502q4391Q073q3164H1192l5631a85992C7811a16852
18951I1680a17407A17418C2315a11366j06054d7843A2344b21468B32048a81140
18940A09069K9971N2056G5727J98518a60980g7459p6632N7762a4616n8370A61359
18928A32745b25992a9462j8901A17394l8100a78498q187F2341l1024e9992l31958
18917c91950a63508D5534g601A500b30825J9016a03421a0584n4247D27039c75810
18905E933b46314A56656A020a81030a4487m8230l3228B28586a13503k206a673
18893b95015A00214L3558d04276B77490q7883C4862q34j3745a86850k04777g8592
$$ plain form
18881 107363 58275 18964 -87969 63322 156821 116717 -17800 -124693 -159349 -2289 2172 -44206
18868 -36803 -55520 -523186 -404243 -191520 -213870 70009 -277781 -55053 123492 -43775 -303955
18857 -303955 197770 108151 256283 406594 131880 43291 -206757 241833 -147000 -71947
18846 -122978 76950 112829 272315 -9284 -427868 -89857 76522 56967 -91214 -100045 213804
18834 218804 -91442 -154001 -105027 127200 -199033 -79154 70701 -93890 -136453 -53744 118219
18822 224340 164595 34350 262468 -21228 125742 -86541 -88761 -108391 -7144 -46198 -66815
18811 -66815 222770 150568 -85557 -91860 92710 12924 -327543 -228813 -68474 -38852 -21109
18800 -21109 243926 -102086 -171228 179717 -140417 45369 1842 -25878 -175045 313743 -14052
$$ packed form
18881A07363m9088A8964h7969F3322R3499m0104a7800j06893l4656b289B172d4206
18868c6803j8717m67666J18943a91520k2350G0009b77781e5053A23492d3775k60180
18857c03955A97770q9619J48132J50311A31880D3291b06757B41833a47000g1947
18846a22978G6950L5879J59486i284m18584h9857G6522j9555i1214q831B13804
18834B18804i1442o2559M8974A27200a99033g9154G0701i3890m2563e3744A18219
18822B24340n9745C4350K28118b1228A25742h6541k220j9630g144l9054k0617
18811f6815B22770p2202h5557o303I2710A2924c27543R8730f8474K9622J7743
18800b1109B43926a02086o9142A79717a40417D5369A842b5878j49167C13743a4052
$$ plain form
18788 -198315 -231217 -77494 -5875 -84062 -88983 -250871 108041 207561 6024 -328885 -53914
18776 99285 287625 121035 -32173 -260843 -274614 -401758 26323 -243116 128737 -71354
18765 132162 -96838 272170 159153 -315469 135896 13973 -81312 53901 135279 -52444 27301
18753 -47900 -435983 151880 -95276 -42178 -368405 396227 -123670 -25966 10009 -60233 -148132
18742 -148132 222622 74796 -308872 -100447 48333 45575 -224011 15173 47307 -216732 17328
18730 -44339 119528 55774 -300657 -94203 -30182 -231988 49407 194502 -122894 -71125 -133943
18719 -133943 -225937 11021 -196220 -151713 -385038 -351955 -335228 -55924 -134574 182132 94225
18708 94225 -130088 -152344 120762 -82300 -118819 112386 -78788 316001 -19290 -283033 -157435
$$ packed form
18788a98315l2902g7494e875p8187m921j61888A08041R9520F024c28885e3914
18776I9285J88340A21035c2173k28670j3771j27144B6323b43116A28737g1354
18765A32162i6838B72170j13017c15469A35896A3973h1312E3901Q1378e2444B7301
18753d7900l88083A51880i5276d2178l26227C96227a23670b5966A0009f0233q7899
18742a48132B22622G4796c08872a00447D8333k758b24011A5173L2134b16732A7328
18730d4339A19528E5774c00657i4203c0182k01806D9407J45095a22894N1769o2818
18719a33943r1994A1021a96220M4507k33325L3083J6727e5924p8650A82132q7907
18708I4225a30088k2256A20762h2300l6519A12386g8788C16001a9290k63743J25598
$$ plain form
18697 -157435 93705 -47224 32688 142499 -424239 225658 27019 -267046 4814 146075 38473
18685 -44739 102761 -188969 -334262 -18035 20505 162848 -152737 21065 246029 -75081
18674 30869 -151686 64799 -169073 159697 -124443 -157105 -228743 77023 239360 82521 -422612
18662 -298492 -85653 -2273 236713 133089 26399 -204438 -70734 151203 -59748 234576 -262898
18650 -306842 -335864 -220551 -199341 -109988 94644 -222828 280863 -210600 -16205 78433 -77315
18638 -186730 109357 -310392 -181860 120334 -23649 -262558 -19211 7131 -34510 -89965 148416
18626 29689 -192365 1687 -193183 11025 21415 -112246 -197959 -297630 82565 -125778 28929
18614 76981 -186171 -167329 -159698 92979 88597 -120207 -129439 -141455 -263576 -24823 -143252
$$ packed form
18697a57435I3705d7224C2688J09811d24239B25658B7019b67046D814J41261C8473
18685d4739A02761a88969j45293a8035B0505J42343a52737B1065K24964g5081
18674C0869a51686F4799a69073A59697a24443l2662p1638G7023J62337H2521d22612
18662b98492h5653b273B36713j03624B6399b04438g0734A51203e9748B34576b62898
18650c06842k9022J15313K1210Q9353I4644b22828B80863b10600a6205G8433g7315
18638a86730A09357c10392J28532A20334b3649k38909a9211G131c4510n5455A48416
18626B9689a92365A687a93183A1025J0390a12246q5713r9671H2565a25778B8929
18614G6981a86171J8842P631I2979m382a20207r232j2016j22121b4823j18429
$$ plain form
18603 -143252 -127356 -220699 -257770 -65343 -77062 76340 -90908 34001 -164426 1991 64352
18592 64352 -69163 -82111 106818 -213114 162557 -87101 119531 -10074 -199367 -149909 81020
18580 -102310 -379142 215046 -334377 -49510 87199 -34582 -2432 -7416 10219 -83886 -395988
18569 -395988 92481 -193580 -90742 -269337 364282 -96145 -87463 -90680 -160943 79817 84119
18558 84119 -374859 -145973 -206449 -149596 -76099 38958 70589 232907 -140315 72965 -143753
18546 -176440 -193634 97062 122537 -14795 102653 -69963 180639 -88926 -29583 -201797 -24405
18534 132566 192440 -246126 -229098 285779 38612 201018 -130688 -49429 -199078 13222
18523 197101 156211 135158 -310632 -97599 -66307 -277129 -157364 235370 -2046 106721 -55830
$$ packed form
18603a43252J5896r3343l7071f5343j1719G6340i0908C4001a64426A991O2361
18592F4352f9163j2948A06818b13114A62557h7101A19531a0074j89293M9458H1020
18580a02310k76832B15046c34377d9510H7199c4582b432m984A0219h3886l12102
18569c95988I2481a93580i0742j78595C64282i6145Q682l217p0263G9817M302
18558H4119c74859a45973o0476N6853P3497C8958L1631J62318a40315G2965a43753
18546a76440j7194I7062K5475a4795A02653f9963A80639h8926b9583j72214b4405
18534A32566N9874b46126J7028B85779C8612J62406a30688d9429j49649A3222
18523A97101m0890k1053c10632i7599L1292k10822J19765B35370b046A06721e5830
$$ plain form
18511 3487 -87009 93260 283779 -124494 14685 -11240 -65959 49219 -170590 -236383 -10442
18499 -245097 -149807 82585 -21587 37899 -408814 83750 53249 130508 34585 99825 -56959
18487 -198485 -208977 64372 -330430 159566 -255418 104171 -266469 115256 113219 157192
18477 157192 -87642 247858 34805 255710 262215 207906 102595 -72929 223164 -344868 80267
18465 -346359 212747 -185924 -19064 66746 -12987 -72087 -49783 -56394 9620 18517 18031 -260612
18452 -155139 -139885 85154 -212758 -189854 24422 90689 -135418 -31298 -76171 -17615 -26184
18441 -26184 -220032 -103298 -66965 -78333 -47028 -196999 307612 221690 -54270 -65998 -66603
18430 -66603 183858 -74184 -78855 -210621 82355 -35040 13225 -318769 -50292 -463536 -59543
$$ packed form
18511C487h7009I3260J90519a24494A4685a1240n4719D9219a70590o5793a0442
18499b45097R5290H2585b1587C7899d08814H3750l0501P7259C4585O5240e6959
18487a98485j0492F4372c30430A59566b55418A04171b66469A15256k037M3973
18477A57192h7642B47858C4805K20905O505n4309A02595g2929B23164c44868H0267
18465c46359B12747a85924a9064F6746a2987n9100K2304o611I620Q897m86b60612
18452a55139J5254H5154b12758K2904B4422O6267a35418c1298m4873a7615q569
18441b6184j93848a03298L6333j1368L1305j49971C07612q5922e4270j1728o05
18430f6603A83858g4184m671j31766H2355c5040A3225c18769e0292m13244e9543
$$ plain form
18418 -217531 179446 235427 -145278 -445763 -249159 265447 217103 22927 105055 -110516
18407 -60217 262618 192797 -342317 -140690 -142980 207152 -25771 93378 217640 105971 -80144
18395 69674 -85774 -190543 -300872 -11962 -216051 -246518 -31613 -81181 -14427 169037 143371
18384 143371 -45039 -212201 159959 61387 -177795 26505 32779 -200871 148587 -15353 -83241
18373 -83241 12841 41570 206616 74579 58393 218801 -342633 -33296 146844 -317385 8432
18361 -188702 70614 228084 38721 -139607 189018 273725 52308 -279635 140329 -65723
18350 -19791 -102267 -210369 -24568 118448 -34888 159400 194322 -24464 -102308 276748 149852
18339 149852 -16144 160883 185345 399456 -198099 -143452 -36951 -30095 -242820 -87826 28804
$$ packed form
18418b17531A79446N5981a45278l00485J96604B65447m8344B2927Q2128a10516
18407f0217B62618o9821c42317a40690k290B07152b5771I3378J24262A05971h0144
18395F9674h5774j04769j10329a1962k04089l0467c1613m9568a4427A69037k5666
18384A43371d5039j67162A59959F1387a77795B6505O274b00871A48587a5353o7888
18373h3241A2841K8729J65046G4579j6186J60408c42633c3296A46844c17385H432
18361a88702G0614J57470C8721a39607A89018Q4707E2308b79635A40329f5723
18350a9791q2476j08102b4568A18448c4888A59400L4922b4464p7844B76748j26896
18339A49852a6144A60883K4462K14111a98099N4647c6951O856k12725h7826B8804
$$ plain form
18327 -47829 -35622 -108851 -284197 120485 -268915 -103458 -449908 -160726 -119348 -139816
18317 -139816 26145 242176 -44492 249716 27452 -238277 -234709 -235627 159351 -170585 -42411
18305 -252615 89887 76695 -205229 -174765 -21439 -172908 -42047 59004 18780 -70575 -115567
18294 -115567 -302247 -235852 -535 -127776 -238975 99019 -69455 85629 -105294 -326136 267176
18282 155352 -32101 -314303 -143671 82716 -320225 69367 232391 6882 -99741 270634 51950
18270 60419 -55409 3174 -110525 -56224 4692 -42457 -199371 -62240 238689 157445 17447
18258 231910 106216 -121188 8501 373777 -13075 62273 190383 -111468 -252309 -29647
18247 62211 87141 -95331 -76922 259480 253399 253205 191308 183061 -206322 69004 199149 -296709
$$ packed form
18327d7829J2207p3229j75346A20485b68915a03458l46450a60726M1378k0468
18317a39816B6145K16031d4492B49716B7452b38277L568r18A59351a70585d2411
18305b52615H9887j3192b05229L0464b1439j51469d2047E9004A8780g0575m4992
18294a15567j86680O6395e35j27241j11199I9019f9455H5629a05294k20842B67176
18282A55352c2101k82202a43671H2716c20225F9367J63024F882i9741B70634E1950
18270F0419e5409C174a10525N4301D692d2457j56914f2240B38689q1244A7447
18258B31910A06216a21188H501L65276a3075F2273J28110a11468j40841b9647
18247F2211K4930i5331J8409B59480o081j94o1897q247b06322F9004J30145b96709
$$ plain form
18234 -183107 -33224 29537 79660 250127 -93960 251711 73845 -288908 -304635 -176044 -84780
18222 -63742 -134647 -66614 -159225 156519 -13087 -286960 -21883 98596 -42760 170954 -239803
18210 139504 -52154 162938 -202359 176404 100024 92876 143387 -196542 207811 6357 -60190
18198 58424 -289692 -19859 133134 -96490 4422 71733 316248 42914 291300 -109820 -180783
18187 -180783 -23317 -46470 -45755 -222890 47938 -287184 -87134 208153 -176337 -34325 132469
18175 -84388 -121003 108384 124454 -23204 208140 -110764 -252527 164491 -229891 -25104
18164 -104217 201968 -90893 -201710 59040 -122291 39534 -123615 196389 -53276 -110748
18154 -110748 -300113 144425 25883 -279161 73471 -100280 -51566 151221 83463 150214
$$ packed form
18234a83107c3224B9537N0123J70467i3960B51711G3845b88908j5727J28591h4780
18222f3742p0905f6614r2611A56519a3087k73873b1883I8596d2760A70954b39803
18210A39504e2154A62938b02359A76404p6380p148N0511a96542B07811F357f0190
18198E8424b89692a9859A33134i6490D422O7311K44515D2914K48386a09820p0963
18187a80783b3317k3153P15j77135D7938b87184h7134B08153a76337c4325A32469
18175h4388l6615A08384J6070b3204B08140a10764j41763A64491b29891b5104
18164a04217B01968i0893j10817E9040a22291C9534a23615A96389e3276n7472
18154a10748j89365A44425B5883b79161G3471a00280M8714A51221o7758O6751
$$ plain form
18144 150214 -279515 37880 -61245 112457 -266192 312966 -70113 304414 -102427 -182776
18134 -182776 -160751 -115876 107333 59813 -190130 -129182 -41089 140159 128395 -28628 -151608
18123 -151608 11675 -298233 -93211 -71932 89041 177249 -276830 226598 57952 52110 -46702
18111 -166286 -301800 -480829 17687 30068 -112908 18795 186534 -50609 114164 93188
18101 93188 -323071 -17287 37743 59152 -7463 59710 146567 180032 61509 79648 -9929 27613
18088 -87322 -168504 -67586 -48361 -176833 54881 -242621 244391 58738 -39353 211122 -217433
18076 259205 -96013 -83947 -171531 -92259 6267 130366 -122016 214872 -201496 103171 -153900
18064 12854 129024 360093 26971 -25103 -135365 -62795 124614 394773 -126349 101584
$$ packed form
18144A50214b79515C7880f1245A12457b66192C12966g0113C04414a02427q0349
18134a82776K2025M4875A07333m7520a90130O0948d1089A40159j1764b8628j22980
18123a51608A1675b98233i3211K1279H9041Q8208b76830B26598E7952n842d6702
18111a66286j35514j79029A7687J2381a12908A8795J67739e0609A14164k0976
18101I3188c23071a7287C7743K1409g463E9710Q6857L3465F1509J8139i929B7613
18088h7322q1182f7586J9225j28472E4881b42621B44391E8738c9353B11122b17433
18076B59205i6013J2066q7584P9272F267J24099a22016B14872b01496A03171a53900
18064A2854J16170K31069B6971b5103j10262f2795A24614K70159a26349A01584
$$ plain form
18053 13081 34028 153766 -95974 -89496 -40599 31166 144909 176222 107264 -52568 108916
18041 204962 122751 -333906 -316998 57887 -52545 -159136 110068 336506 -65698 -210518
18031 -210518 253530 -69691 -407574 173096 40269 -111944 -134332 11968 97690 -11661 -25238
18020 -25238 -288243 105273 -259077 -200664 -10600 267046 -145308 -149698 99733 -77675 -256461
18009 -256461 65369 100844 433835 166401 -241985 -52630 -205572 -986 72993 19527 -71136
17997 270812 132727 -23674 -20451 27296 96920 -3256 200148 -142362 64073 -533023 14154
17985 -174354 -259467 -80140 -91763 -232006 -289315 -12564 -298774 -100632 489444 -227469
17974 30618 -89489 120120 22320 37054 -41549 -352996 41121 235015 -170879 -154122 -163123
$$ packed form
18053A3081K0947J19738i5974O478d0599C1166J13743L1313o8958e2568A08916
18041B04962q2211c33906J6908E7887e2545j06591A10068K26438f5698j44820
18031b10518B53530f9691l37883A73096D0269a11944k2388A1968Q5722a1661j3577
18020b5238k63005A05273b59077N8413a0600B67046a45308m390I9733g7675j78786
18009b56461F5369L5475L32991A66401b41985e2630j52942i86G2993A9527g1136
17997B70812A32727b3674L223B7296O9624c256B00148a42362F4073e33023A4154
17985a74354q5113h0140j1623j40243n7309a2564k86210a00632D89444b27469
17974C0618h9489A20120B2320J4734d1549l11447D1121J93894a70879J6757r001
$$ plain form
17963 -163123 -1585 -269128 215645 -314883 16527 -98497 51941 -121475 14055 -64494 -345765
17952 -345765 76376 -7044 -89607 121197 -89083 59059 -91447 -237923 81370 36726 -121067
17940 -125210 -135043 -217972 193216 -34536 35558 102790 -15316 207925 244614 134277 40311
17928 61093 -22096 39853 -47140 -19324 191313 -17732 172839 -5680 168204 276074 -14672
17916 283828 111641 54545 128057 -19161 -30224 168259 -189416 17545 -2299 -146633 68233
17904 -225377 -46803 50103 -248482 115940 45458 168971 -180418 -91563 64985 66279 -133200
17892 91703 402198 -217639 -61010 -154089 327689 -163939 241155 33844 -115929 90268
17881 309806 265396 260990 -129416 103150 -103060 -41805 -155814 213985 -50818 324145
$$ packed form
17963a63123a585k67543B15645c14883A6527i8497E1941a21475A4055f4494k81271
17952c45765G6376g044q2563A21197h9083E9059i1447j46476H1370C6726a21067
17940a25210r833q2929A93216c4536C5558O7232a5316B07925L6689j10337D0311
17928F1093b2096C9853d7140a9324A91313a7732A72839e680A68204J07870a4672
17916B83828A11641E4545P3512a9161j1063A68259a89416A7545b299j44334F8233
17904b25377d6803E0103b48482A15940D5458J23513a80418Q8855F4985J294a33200
17892I1703L10495b17639f1010r3079C27689a63939B41155C3844a15929I0268
17881C09806m4410m406a29416A03150a03060d1805j14009B13985e0818C24145
$$ plain form
17870 -33113 455090 -26380 -157888 366574 192389 -77085 -64983 156945 67253 89671 -85924
17858 -174357 42416 -145351 -115180 -267639 -275044 -88254 46012 35112 2242 -51385 -224978
17847 -224978 236458 -121914 -68439 -148445 -11685 118821 113251 -73109 33008 -238058 59374
17835 -338711 -111510 -102663 42348 159454 104276 -66929 4527 101672 -233327 -40416 146293
17823 253783 207336 -48031 30929 280139 -98832 -92901 -136725 -120822 223462 105487 -220982
17811 119542 292225 203489 -45409 -89803 111252 -32600 -264478 146610 195252 -34427 -21339
17800 -21339 89631 -162245 76171 229167 -17685 -36819 -237577 -271553 144203 -259467 -20027
17788 124273 201779 44501 288819 -23647 75259 48428 86118 182131 26735 -174532 569360
$$ packed form
17870c3113D55090b6380j31508C66574j74185g7085J2102A56945F7253K2418h5924
17858a74357D2416a45351L0171j52459p405h8254D6012j0900B242e1385j73593
17847b24978B36458a21914N3475q0006a1685A18821n570g3109C3008b38058E9374
17835c38711a11510Q847D2348J17106n5178f6929D527R7145b33327d0416A46293
17823B53783m6447d8031C0929K49210i8832N931m3824J5903B23462A05487b20982
17811A19542J72683q8736d5409m4394A11252c2600k31878A46610M8642c4427J3088
17800b1339H9631a62245G6171J52996a7685j9134k00758l3976A44203b59467b0027
17788A24273P7506D4501K44318b3647G5259k6831L7690R6013B6735a74532E69360
$$ plain form
17776 -88848 19665 -110845 78604 139927 -128839 166857 -201057 -145793 -105409 -41502 -3067
17764 -186670 -150860 128412 -19432 107273 -87959 -36892 10167 -46075 -98762 -318166 233332
17752 109855 -324378 39441 4733 -313155 83510 317750 234827 6655 -107577 -119906 35684
17740 189765 -17179 170579 195816 133782 -151864 -96248 -110780 -139532 84787 17196 -31363
17728 164778 -208051 217189 44995 -187970 137470 71268 128615 241408 200231 -179498
17717 -134196 110821 -95531 290182 155388 -146505 -319700 -111544 179936 -190805 -195418
17707 -195418 -55617 -334076 146904 439168 194212 237753 -228555 172443 108437 83442
17697 83442 -198718 218244 50622 -16984 268037 118885 107928 -1652 69855 -89261 252903
$$ packed form
17776h8848A9665a10845G8604O1323a28839A66857b01057N5264M0384d1502c067
17764a86670L5810A28412a9432A07273h7959c6892A0167d6075n2687k19404B33332
17752A09855c24378C9441D733c13155H3510K34240q2923F655a07577j2329C5684
17740A89765a7179A70579K5237o2034a51864N5616j4532k8752H4787A7196c1363
17728A64778b08051B17189D4995a87970A37470o6202N7347J12793m1177a79498
17717a34196A10821i5531B90182j34794a46505j73195a11544A79936a90805m613
17707a95418e5617k78459A46904K92264A94212M3541b28555A72443o4006k4995
17697H3442a98718B18244E0622a6984B68037A18885j0957a652F9855h9261B52903
$$ plain form
17685 -110029 -163000 -11311 -19564 -230793 -37805 -191555 273301 -152995 -92867 -161820 180674
17673 116238 -219065 78192 -56700 361878 197149 159515 -229837 -7020 5745 341058 324488
17662 324488 56659 -75761 78993 112877 -64916 72663 -36497 117639 174535 -113697 -18171
17650 235516 198867 -209834 46933 -44455 -273782 -76115 130201 200759 135027 -9721 95640
17638 452786 14007 40370 -122514 51518 60577 74886 99705 38998 18311 207987 -63776
17626 93065 235867 -288841 197020 -98529 -385397 231699 166896 217838 79213 -108547
17615 -39412 42484 125480 80620 -16901 37325 -76039 65009 297151 -208987 -1500 28417
17603 -77079 79575 -161979 192931 45155 115776 -93347 258196 -87223 -141519 -145085 96679
$$ packed form
17685a10029n2971a1311q253k11229c7805j53750B73301a52995O0128o8953A80674
17673A16238b19065G8192e6700C61878j64729l7634b29837g020E745L35313j6570
17662C24488E6659g5761G8993L3884f4916G2663c6497A17639N6896a13697a8171
17650B35516l6649b09834D6933d4455k29327g6115A30201P0558o5732i721I5640
17638D52786A4007K6363a22514E1518R059J4309K4819C8998A8311J89676f3776
17626I3065J42802b88841A97020i8529k86868B31699o4803N0942G9213a08547
17615c9412D2484Q2996m4860a6901C7325g6039F5009K32142b08987a500B8417
17603g7079G9575a61979A92931D5155P0621i3347B58196h7223n4296l566I6679
$$ plain form
17591 -86740 198496 -208880 379899 207515 186092 58163 327683 298083 -63405 126867
17580 255063 160129 186260 -190504 32221 -39528 -4092 10861 -94289 270552 161880 199770
17569 199770 -30278 100646 -179577 199013 216054 301084 -100524 106594 74942 120951
17559 120951 86751 294138 -110726 -45974 305598 -55794 11855 86593 198544 55318 67012
17548 67012 -33873 -230645 206977 -107099 196580 108742 176310 -241666 202304 -248519
17537 -239413 -277082 43941 -98249 384019 127830 76834 109391 -20931 189085 319101 29850
17525 80931 -136552 -268406 239549 92636 65893 246392 194734 -216852 273646 337430
17515 337430 218040 79535 85548 105887 4431 101902 40703 149658 -145170 -222136 86168
$$ packed form
17591h6740A98496b08880C79899j72384k1423E8163K69520k9600f3405A26867
17580B55063r4934K6131a90504C2221c9528d092A0861i4289B70552j08672L7890
17569A99770c0278A00646a79577A99013J7041Q5030a00524A06594l1652M6009
17559A20951l4200K07387a10726d5974C05598e5794A1855P4738J11951E5318J1694
17548F7012c3873j96772B06977a07099A96580q7838O7568b41666B02304b48519
17537b39413l7669D3941i8249C84019A27830n0996L2557b0931A89085J30016B9850
17525H0931a36552j31854B39549I2636k6743J80499n1658b16852B73646O3784
17515C37430j19390G9535O013K0339D431R7471D0703J08955a45170p6966H6168
$$ plain form
17503 275624 143562 2934 405296 283710 115306 346084 235525 41097 -167896 231953
17492 308925 139563 96508 269024 215377 -73736 130896 -9139 147253 609456 147825
17481 98305 154002 -126563 -96315 156734 67432 -22633 367062 511212 316406 288511 -124365
17469 161302 -81671 235444 -188913 304813 227379 182894 98034 104320 -77800 425648 51996
17457 -104596 262987 190342 90456 205410 -114204 311829 330948 124653 204786 166481
17447 166481 65090 1925 117243 -43084 161888 132534 55100 269377 393523 436515 452075
17436 452075 -56722 236582 12359 382209 106141 -69345 356618 362119 35812 312065 191505
17425 191505 300199 111107 112570 5630 237408 247844 -214528 70698 216862 262934 72494
$$ packed form
17503B75624j32062B934M02362j21586A15306K30778j10559D1097a67896B31953
17492C08925A39563m3055J72516n3647g3736A30896i139A47253M62203A47825
17481I8305N5697a26563L0248A56734F7432b2633C67062J44150j94806k7895a24365
17469A61302h1671B35444a88913C04813p7434m4485q4860O286g7800D25648E1996
17457a04596B62987p2645I0456J14954a14204C11829J9119A24653Q0133l8305
17447A66481F5090A925J15318d3084A61888k9354E5100K14277J24146M2992J5560
17436D52075e6722B36582A2359L69850A06141f9345C56618N501C5812K76253j20560
17425A91505J08694A11107J463E630K31778J0436b14528G0698J46164M6072G2494
$$ plain form
17413 163687 282659 160079 376152 196356 -112922 303042 245456 136064 125729 -139212
17402 -190289 274319 232712 -60038 139900 25925 328639 -81052 256695 39529 13990 261248
17391 261248 -106193 265842 457169 356103 21411 -59307 251241 167534 100646 107410 271041
17380 271041 148063 42883 83992 -132613 44697 363204 105389 200318 146008 73665 153608
17369 153608 -6605 183911 190291 254104 17370 313951 -17790 10924 -50424 145825 -71091
17357 11499 245676 -142866 232009 -125278 104722 187810 117402 22492 -66088 189676
17346 293838 109359 390592 -36799 267057 -53283 297805 173146 29222 397193 199762
17336 199762 256722 227104 322378 185491 62626 81966 301869 -31658 -31725 330479 182733
$$ packed form
17413A63687J18972j22580K16073j79796a12922C03042n7586j09392j0335a39212
17402a90289B74319m1607f0038A39900B5925L02714h1052B56695C9529A3990K47258
17391B61248a06193B65842J91327j01066B1411e9307B51241q3707o6888O764J63631
17380B71041j22978D2883M1109a32613D4697L18507A05389R4929n4310p2343P9943
17369A53608f605A83911O380O3813A7370K96581a7790A0924e0424A45825g1091
17357A1499K34177a42866B32009a25278A04722Q3088p0408B2492f6088A89676
17346B93838A09359K81233c6799B67057e3283B97805j24659B9222L67971j97431
17336A99762N6960k9618R5274j36887F2626J9340K19903c1658o7C30479j47746
$$ plain form
17325 182733 156484 298087 427581 372583 301218 19984 -133582 279080 -108099 274091
17314 223458 14936 161566 263398 293410 -75345 307615 69053 -183926 94301 -95642 14009
17302 42877 568128 97323 87769 282941 55999 388476 210555 142211 35951 291891 -99786
17290 176714 284284 170446 34318 -20402 236573 233457 -14793 95235 308844 208501 242833
17279 242833 -197050 -16332 -86638 94219 296032 132731 228591 -2760 -155082 103510 92710
17268 92710 34645 -204999 156148 -44302 87190 25169 373779 263399 118634 242616
17258 242616 -35609 420613 219251 448077 170386 311852 48764 257278 117012 97561
17248 97561 225751 8463 37478 -110154 299618 106639 156718 258000 36016 -358586 11196
$$ packed form
17325A82733k6249J41603J29494n4998p1365A9984a33582B79080a08099B74091
17314B23458A4936J46630J01832L0012g5345C07615F9053a83926I4301i5642A4009
17302D2877N25251I7323r554J95172E5999L32477j77921o8344C5951K55940i9786
17290A76714J07570j13838C4318b0402B36573l116a4793I5235K13609j00343L4332
17279B42833a97050a6332p0306I4219K01813A32731R5860b760j52322A03510j0800
17268I2710C4645b04999A56148d4302H7190B5169L48610j10380A18634J23982
17258B42616c5609D20613k01362K28826A70386J41466D8764K08514A17012j9451
17248I7561J28190H463K9015a10154B99618A06639N0079J01282C6016c58586A1196
$$ plain form
17236 16290 321596 7425 264193 87077 295081 12003 244024 417785 57974 493224 289033
17225 289033 128461 381084 386862 482174 -135944 275536 450568 -2954 62929 492798 470906
17214 470906 167127 258555 108982 -38703 249762 253329 19417 245422 481502 -177265
17203 453085 -89077 265728 165318 200612 1724 -35526 111742 58374 -76750 275292 183932
17192 183932 227062 174840 -6411 308703 406828 -166967 105258 457067 325084 344808 194354
17181 194354 27802 130595 106308 328427 417656 176816 368385 191123 346029 244383
17171 244383 152503 159963 259258 512038 -3318 225525 287745 140397 142740 343723 390835
17160 390835 325515 446523 239987 319719 400714 46311 467309 252724 329532 197949
$$ packed form
17236A6290L05306G425K56768H7077K08004A2003K32021J73761E7974M35250k04191
17225B89033A28461K52623N778R5312a35944B75536J75032b954F2929M29869k1892
17214D70906A67127R1428A08982c8703B49762L567A9417K26005K36080a77265
17203D53085h9077B65728j00410L5294A724c5526A11742n3368g6750B75292r1360
17192A83932M3130n2222f411C08703R8125a66967A05258L51809j31983J9724j50454
17181A94354B7802J02793k4287K22119Q9229A76816J91569j77262J54906j01646
17171B44383r1880P460R9295K52780c318B25525O2220A40397K343K00983M7112
17160C90835o5320J21008k06536P9732Q0995D6311M20998k14585P6808j31583
$$ plain form
17150 197949 126126 66750 437890 184293 276047 382432 130121 167969 287206 38811
17139 76493 183815 260674 500947 -130532 508920 646752 369706 198442 -167457 191462
17128 66322 42763 380954 359828 226775 806281 266879 229367 178379 132106 170718 46461
17116 109608 330590 152321 94927 80056 121075 282599 181979 583542 461412 304029
17106 304029 85972 179728 381268 97865 222785 455522 336058 525073 255374 170523
17096 170523 314738 390537 232731 421349 412898 396481 700653 308349 388551 568035
17086 568035 414129 420746 258785 426976 530643 497072 359163 336659 589563 476001
17076 476001 593004 489474 316873 318924 633150 684888 206993 578513 503712 399300
$$ packed form
17150A97949p1823n9376L71140A84293R1754J06385A30121L7848J19237C8811
17139G6493J07322P6859K40273a30532E08920J37832k77046j71264a67457A91462
17128F6322k3559L38191k1126j33053N79506B66879l7512n0988m6273L8612D6461
17116A09608K20982A52321n7394j4871M1019J61524j00620M01563j22130j57383
17106C04029H5972R3756K01540I7865J24920K32737j19464J89015B55374q4851
17096A70523J44215P5799j57806J88618q451j6417L04172C08349Q0202J79484
17086E68035j53906O617j61961J68191J03667l3571j37909k2504K52904j13562
17076D76001J17003j03530j72601K051L14226N1738B06993L71520p4801j04412
$$ plain form
17066 399300 624512 142169 557354 702231 380989 361395 326238 539990 356852 345880
17056 345880 361702 537574 620329 427322 787960 361775 552694 692288 386062 296456
17046 296456 657746 197214 624384 512006 352144 257872 476062 643538 583721 442055
17036 442055 337940 344749 486641 510111 383228 516751 377994 660824 120154 555544
17026 555544 737404 706864 683443 706888 628780 926752 369134 638552 509770 692080
17016 692080 783641 856156 487923 731471 599482 254062 631656 323147 732919 491371
17006 491371 738588 489665 522738 827876 561238 798746 973066 778680 657495 710981
16996 710981 540514 344372 710327 494135 714440 611500 821386 672019 656038 733331
$$ packed form
17066C99300K25212A42169M15185J44877l21242j9594l5157K13752j83138j0972
17056C45880J5822J75872Q2755j93007L60638C61775J90919J39594l06226q9606
17046B96456L61290A97214M27170j12378j59862r4272K18190J67476n9817j41666
17036D42055j04115O809J41892K3470j26883J33523j38757K82830A20154M35390
17026E55544J81860l0540k3421K3445p8108K97972C69134K69418j28782J82310
17016F92080R1561P2515l68233K43548j31989B54062L77594l08509M09772k41548
17006D91371K47217k48923L3073L05138k66638K37508J74320j94386j21185N3486
16996G10981j70467j96142L65955k16192K20305j02940K09886j49367j5981P7293
$$ plain form
16986 733331 365027 787959 585617 901306 596624 703650 855135 693827 494209 664338
16976 664338 776581 1039196 502489 949968 1011507 681249 1014790 659682 782958 696686
16966 696686 795735 1042252 863367 838456 794654 825813 1139695 1263919 1325358 1003389
16956 1003389 882374 1115678 991810 856593 828137 1065991 1083949 963130 1121957 912066
16946 912066 1083595 1208707 893430 842466 1115158 930484 1165164 1170148 1112123 1268274
16936 1268274 805218 1052459 1125545 1340559 1173657 1463696 1223538 986809 1402184 1440096
16926 1440096 1543116 1550716 1208310 1554221 1313495 1551677 1470144 1260078 1548381 1352664
16916 1352664 1674475 1406199 1586147 1426632 1782266 1638405 1301923 1548802 1630865 1301330
$$ packed form
16986G33331C65027M22932k02342L15689l04682J07026J51485j61308j99618J70129
16976F64338J12243K62615E02489M47479O1539l30258L33541l55108J23276q6272
16966F96686R9049K46517j78885k4911m3802L1159L13882J24224O1439l21969
16956A003389j21015K33304j23868j35217k8456K37854J7958j20819J58827k09891
16946I12066J71529J25112l15277n0964K72692j84674K34680M984n8025J56151
16936A268274m63056K47241P3086K15014j66902K90039k40158k36729M15375L7912
16926A440096J03020P600l42406L45911k40726K38182q1533k10066K88303j95717
16916A352664L21811k68276J79948j59515L55634j43861l36482K46879Q2063l29535
$$ plain form
16906 1301330 1491770 1591565 1423378 1487503 1552865 1675648 1465986 1534874 1732279 1730645
16896 1730645 1721966 1485984 1750478 1825950 1992898 1811123 1984737 2125072 1917412 2069092
16886 2069092 1843641 2270912 2147068 1928514 2171869 2386569 2152657 2292794 2272630 2363027
16876 2363027 2343667 2281027 2294690 2173878 2556860 2362665 2478024 2387509 2527118 3041997
16866 3041997 3014865 2612600 2718225 2838502 2853793 2678885 2750353 3015086 2865989 2992454
16856 2992454 3000843 3130327 3347540 3370572 3198246 3262266 3664982 3491635 3595934 3637803
16846 3637803 3581661 3750303 3697279 3706286 4001627 4190805 4387026 4250098 4305393 4363851
16836 4363851 4700203 4214668 4504424 4595996 4579787 4834144 4676969 5229063 4911200 5347826
$$ packed form
16906A301330J90440R9795j68187O4125O5362J22783k09662O8888J97405j634
16896A730645q679k35982K64494P5472J66948j81775J73614J40335k07660J51680
16886B069092k25451M27271j23844k18554K43355K14700k33912J40137k0164R0397
16876B363027j9360o2640J3663j20812L82982j94195J15359r0515J39609N14879
16866C041997k7132m02265J05625J20277J5291j74908P1468K64733j49097J26465
16856B992454Q389J29484K17213K3032j72326O4020M02716j73347J04299M1869
16846C637803n6142J68642n3024R007K95341J89178J96221j36928N5295N8458
16836D363851L36352m85535K89756R1572j6209K54357j57175N52094l17863M36626
$$ plain form
16826 5347826 5406367 5425060 5447274 5889176 5749998 6357074 5948355 6360509 6575303 6644420
16816 6644420 6507677 7106566 6982195 7166149 7575573 7641085 7801333 7765561 8198287 8236202
16806 8236202 8522313 8972637 8917464 9223407 9701636 9725750 9899583 10202983 10431989 10735294
16796 10735294 11319374 11406119 11841072 12184270 12289320 12849278 13093538 13644554 14167958
16787 14167958 14691697 14458947 15406806 15960448 16402061 16883450 17269201 18074756 18573678
16778 18573678 19276935 19964842 20731738 21498975 22422486 23178016 23567743 24881887 25383697
16769 25383697 26686522 27713058 28530206 29911934 30935949 32262261 33396906 35023214
16761 35023214 36643840 38103751 39903672 41468666 43164138 45225039 46952101 49175533
$$ packed form
16826E347826N8541J8693K2214M41902j39178O07076m08719M12154K14794O9117
16816F644420j36743N98889j24371J83954M09424O5512J60248l5772M32726L7915
16806H236202K86111M50324n5173L05943M78229K4114J73833L03400K29006L03305
16796A0735294N84080Q6745M34953L43198J05050N59958K44260N51016N23404
16787A4167958N23739k32750R47859N53642M41613M81389L85751Q05555M98922
16778A8573678P03257O87907P66896P67237R23511P55530L89727J314144N01810
16769B5383697J302825J026536Q17148J381728J024015J326312J134645J626308
16761C5023214J620626J459911J799921J564994J695472K060901J727062K223432
$$ plain form
16753 49175533 51361032 53823565 56398147 59207156 61985429 64650671 67837306 70986964
16745 70986964 74527896 78032855 81597958 85399361 89168259 92743005 97279204 101331170
16737 101331170 105152292 109473865 113071440 117451875 121573188 125140935 128581651 131839875
16729 131839875 134479590 136750922 138601431 140285459 140759285 141096923 141204119 140282890
16721 140282890 139014625 137228141 134968799 132602503 129504356 126395551 122790198 119015230
16713 119015230 115354718 111407140 107462056 103303108 99120772 95457613 91543623 87638212
16705 87638212 84221514 80620248 77337384 73908908 70640848 67579304 65068987 62005801
16697 62005801 59472167 56906606 54640827 52240521 50003415 48461944 46166956 44103123
$$ packed form
16753D9175533K185499K462533K574582K809009K778273K665242L186635L149658
16745G0986964L540932L504959L565103L801403L768898L574746M536199M051966
16737A01331170L821122M321573L597575M380435M121313L567747L440716L258224
16729A31839875K639715K271332J850509J684028M73826L37638J07196r21229
16721A40282890j268265j786484k259342k366296l098147l108805l605353l774968
16713A19015230l660512l947578l945084m158948m182336l663159l913990l905411
16705H7638212l416698l601266l282864l428476l268060l061544k510317l063186
16697F2005801k533634k565561k265779k400306k237106j541471k294988k063833
$$ plain form
16689 44103123 42696366 41047293 39410525 37669088 36127515 35147266 33557022 32424893
16681 32424893 31447093 30352142 29081909 28089831 27145763 25801637 25582421 24440042 23795665
16672 23795665 22597437 22026335 21451514 20663744 19965932 19469351 18865334 18052532 17982568
16663 17982568 16848412 16606043 15738061 15622015 15178037 14470527 14374054 14058545 13902706
16654 13902706 13380649 12934770 12633849 12118490 12137613 11485973 11079109 10855029 10520984
16645 10520984 10558104 10199446 10050952 9738526 9478621 9495847 9213169 8688251 8381507 8379911
16635 8379911 8244408 8070327 7775650 7529079 7399705 7297781 7071729 6985107 6863507 6978883
16625 6978883 6723244 6535036 6365196 6155881 6222184 5846348 5866317 5626697 5626538 5508380
$$ packed form
16689D4103123j406757j649073j636768j741437j541573r80249j590244j132129
16681C2424893r77800j094951j270233r92078r44068j344126k19216j142379o44377
16672B3795665j198228n71102n74821p87770o97812m96581o04017q12802o9964
16663A7982568j134156k42369q67982j16046m43978p07510r6473l15509j55839
16654A3902706n22057m45879l00921n15359J9123o51640m06864k24080l34045
16645A0520984L7120l58658j48494l12426k59905J7226k82678n24918l06744j596
16635H379911j35503j74081k94677k46571j29374j01924k26052q6622j21600J15376
16625F978883k55639j88208j69840k09315O6303l75836J9969k39620j59j18158
$$ plain form
16615 5508380 5390655 5187335 4817130 4886657 4897534 4984474 4742952 4751014 4781172 4570686
16605 4570686 4397860 4230386 4153886 3784370 3983538 3753337 4129338 3777303 3671998 3659355
16595 3659355 3641842 3580043 3492623 3427935 3515105 3274127 3384253 2888851 2858296 2975392
16585 2975392 3382475 3351595 2843688 2949279 2780383 2813031 3110576 2286972 2730736 2727354
16575 2727354 2862127 2803122 2652721 2440719 2576759 2458565 2443035 1950800 2207786 2435198
16565 2435198 2233427 2020325 2493086 2149269 2021900 2467617 2352416 1895233 2002446
16556 2002446 2181523 2192384 1972985 2077204 1968319 2347257 1960736 1716646 2123147 1923270
16546 1923270 1429584 2037082 1716198 1670959 1679561 1916631 1828844 1990033 1798969 1556343
$$ packed form
16615E508380j17725k03320l70205O9527J0877Q6940k41522Q062L0158k10486
16605D570686j72826j67474p6500l69516J99168k30201L76001l52035j05305j2643
16595C659355j7513o1799q7420o4688Q7170k40978J10126m95402l0555J17096
16585B975392M07083l0880n07907J05591j68896L2648K97545q23604M43764l382
16575B727354J34773n9005j50401k12002J36040j18194j5530m92235K56986K27412
16565B435198k01771k13102M72761l43817j27369M45717j15201m57183J07213
16556B002446J79077J0861k19399J04219j08885L78938l86521k44090M06501j99877
16546A923270m93686O07498l20884m5239Q602K37070q7787J61189j91064k42626
$$ plain form
16536 1556343 1427958 1673004 1514484 1520529 1416420 1681498 1722872 1543175 1618402 1331594
16526 1331594 1602163 1489597 1674259 1512286 1424748 1271816 1323944 1306334 1163374 1288644
16516 1288644 1465822 1050478 1189719 1788594 1213520 1332953 1441776 961889 1029901 1266540
16506 1266540 1287083 1199049 1420336 1340123 1025155 1080641 1305653 950730 982186 1635233
16496 1635233 746804 1357288 1195423 970504 1078337 1190035 717185 983805 1101063
16487 1101063 1059050 1219402 1162991 1013942 1203948 1104382 943986 1019532 1032370 1154969
16477 1154969 1181072 1049897 1061136 1163040 501923 1212960 922017 1059054 951245 1112884
16467 1112884 1124198 1257994 956153 959763 640133 1028197 1077443 566596 1007877 957447
$$ packed form
16536A556343j28385K45046j58520O045j04109K65078M1374j79697P5227k86808
16526A331594K70569j12566J84662j61973q7538j52932N2128j7610j42960J25270
16516A288644J77178m15344J39241N98875n75074J19433J08823m79887O8012K36639
16506A266540K0543q8034K21287q0213l14968N5486K25012l54923L1456O53047
16496A635233G46804O10484j61865k24919J07833J11698m72850K66620J17258
16487A101063m2013J60352n6411j49049J90006r9566j60396P5546J2838J22599
16477A154969K6103j31175J1239J01904E01923P11037k90943J37037j07809J61639
16467A112884J1314J33796l01841L610l19630L88064M9246n10847M41281n0430
$$ plain form
16457 957447 793485 955984 988787 1151555 1112074 743248 987929 688310 728631 834844
16447 834844 878022 906028 834112 1001952 855056 877631 614414 861802 793681 524401
16437 524401 929960 1011786 480125 871861 742646 763757 594206 917751 1164290 639674
16427 639674 1083554 932412 579461 795644 720868 940319 985871 741719 1041573 832178
16417 832178 828010 842763 650206 494575 1104483 727336 641455 867295 487965 833355
16407 833355 935676 768526 951437 798817 480426 781117 763709 710068 753109 648620
16397 648620 965371 987192 852085 563458 750957 1057262 694632 835865 771202 609340
16387 609340 756676 850353 1416260 689782 741054 913039 586584 855510 965689 659729
$$ packed form
16457I57447j63962J62499L2803J62768l9481l68826K44681k99619M0321J06213
16447H34844M3178K8006p1916J67840j46896K2575k63217K47388o8121k69280
16437E24401M05559Q1826D80125L91736j29215K1111j69551L23545K46539n24616
16427F39674M43880j51142l52951K16183p4776K19451M5552k44152K99854k09395
16417H32178m168J4753j92557j55631O09908l77147q5881K25840l79330L45390
16407H33355J02321j67150J82911j52620l18391L00691j7408n3641M3041j04489
16397F48620L16751K1821j35107k88627J87499L06305l62630J41233o4663j61862
16387F09340J47336R3677N65907F89782N1272J71985l26455K68926J10179l05960
$$ plain form
16377 659729 897353 856839 887949 941906 697136 925165 663733 616768 1134704 725633
16367 725633 745855 636254 865932 785223 381494 554796 407058 883981 668609 922378
16357 922378 368159 718802 903687 648596 822227 600526 672851 751277 798172 830658
16347 830658 1051196 849142 844022 730576 638088 642064 953218 939242 1128110 973782 921119
16336 921119 814450 815981 767300 830337 1027849 590463 863273 817484 680731 525683
16326 525683 919976 875612 954725 728846 753728 855542 823005 670732 659987 783351
16316 783351 419653 745449 634492 646553 567810 933923 763028 944790 671970 1089349
16306 1089349 637024 872765 717242 916368 711235 862367 445025 644604 625770 1084946
$$ packed form
16377F59729K37624m0514L1110N3957k44770K28029k61432m6965N17936m09071
16367G25633K0222j09601K29678q0709C81494J73302j47738M76923k15372K53769
16357I22378C68159L50643J84885k55091J73631k21701P2325P8426M6895L2486
16347H30658K20538k02054n120j13446r2488L976L11154j3976J88868j54328n2663
16336I21119j06669J531m8681O3037J97512m37386K72810m5789j36753j55048
16326E25683L94293m4364P9113k25879K4882J01814l2537j52273j0745J23364
16316G83351l63698L25796j10957J2061p8743L66113j70895J81762k72820M17379
16306A089349m52325K35741j55523J99126k05133J51132m17342J99579j8834M59176
$$ plain form
16296 1084946 533337 685186 656433 622560 735493 946063 621861 690611 774868 780277
16286 780277 499242 952864 562265 490083 944699 618809 599101 1000470 860909 391952
16275 809243 568392 599291 801045 316015 540074 813540 823540 993218 759152 686730
16265 686730 579778 847433 951431 816667 597730 967375 510568 538024 749968 617497
16255 617497 655508 589282 663827 502277 678212 947120 841301 283961 636724 325827
16245 325827 786203 753551 618788 638673 747154 783079 542696 405726 304525 773839
16235 773839 548786 752170 538360 501804 601991 596000 418104 426491 510527 598189 377575
16224 377575 637105 553443 538493 415790 223402 516509 461563 742869 682273 541412
$$ packed form
16296A084946E33337J51849k8753l3873J12933K10570l24202O8750Q4257N409
16286G80277k81035M53622l90599p2182M54616l25890j9708M01369j39561C91952
16275H09243k40851L0899K01754C16015K24059K73466J0000J69678k34066p2422
16265F86730j06952K67655J03998j34764k18937L69645m56807K7456K11944j32471
16255F17497L8011o6226P4545j61550J75935K68908j05819B83961L52763l10897
16245C25827M60376l2652j34763J9885J08481L5925k40383j36970j01201M69314
16235G73839k25053K03384k13810l6556J00187n991j77896Q387Q4036Q7662k20614
16224C77575K59530q3662j4950j22703j92388K93107n4946K81306o0596j40861
$$ plain form
16214 541412 613835 637025 628872 728285 351895 686305 819572 525350 609932 464555 640683
16203 640683 649721 543283 638922 688205 554044 159835 337949 486268 552028 307027
16193 307027 573534 496115 507027 601093 613921 306583 465813 265587 652883 500046
16183 500046 534098 485361 357808 430466 260714 354168 37307 404742 159471 443379
16173 443379 105450 240794 214452 334929 210556 64410 -49566 240006 345659 343127
16163 343127 133841 173400 16708 150373 132589 64562 139960 313498 286378 294004 161876
16152 161876 555211 492878 12709 -63825 498750 405230 422023 403213 88326 134415 222867
16141 222867 378452 754470 140407 166417 314346 229011 -8345 -16394 -1637 95194 156167
$$ packed form
16214E41412P2423K3190q153R9413C51895L34410J33267k94222Q4582j45377J76128
16203F40683R038j06438R5639M9283j34161A59835J78114J48319O5760k45001
16193C07027K66507p7419J0912R4066J2828C06583J59230k00226L87296j52837
16183E00046L4052m8737j27553P2658j69752R3454C7307L67435A59471K83908
16173D43379A05450J35344k6342J20477j24373F4410d9566B40006J05653k532
16163C43127A33841L9559A6708J33665j7784F4562P5398J73538k7120P626j32128
16152A61876L93335o2333A2709f3825D98750r3520J6793j8810H8326M6089Q8452
16141B22867J55585L76018A40407K6010J47929q5335h345q049a637I5194O0973
$$ plain form
16130 156167 548729 301754 37110 73712 -45315 300748 262859 462415 117084 186727
16120 186727 176318 515300 261711 464916 -24993 269004 119310 155944 -47052 -28335
16110 -28335 569154 1916 268889 226488 335835 96088 315231 487258 429200 204520 148323
16099 148323 305925 292109 58173 141122 67068 -56972 1245 401435 176959 -277514 240308
16087 420761 67979 -478188 179670 -173179 26220 101423 85434 321257 247214 66110 301923
16076 301923 -145563 287135 28719 162174 282437 65603 -379172 190439 167216 176484
16066 176484 197665 358797 75727 193795 -160017 239768 71383 339539 99781 -9602 -74467
16055 -74467 -47896 368560 30521 -149233 180655 16082 70103 442836 97550 -242315 68626
$$ packed form
16130A56167L92562k46975C7110L6602d5315C00748l7889J99556A17084O9643
16120A86727j0409L38982k53589K03205b4993B69004A19310L6634d7052J8717
16110b8335E69154A916K66973m2401J09347I6088K19143J72027n8058B04520n6197
16099A48323J57602j3816E8173Q2949F7068e6972A245M00190A76959b77514B40308
16087D20761F7979d78188A79670a73179B6220P5203j5989K35823p4043F6110K35813
16076C01923a45563B87135B8719J33455J20263F5603c79172A90439k3223R268
16066A76484K1181J61132G5727J18068a60017B39768G1383K68156I9781i602o4865
16055g4467K6571C68560C0521a49233A80655A6082N4021L72733I7550b42315F8626
$$ plain form
16043 145068 74896 -17197 -621 -134015 106471 -156357 382607 -301399 43662 155499 47698
16031 -74141 159839 -270743 -48494 -227352 210858 -31485 -294384 112439 158780 7046 83066
16020 83066 -149925 222869 -201180 27256 155524 -162415 70732 125159 -69481 100818
16009 -147532 313587 202645 224140 174874 234278 59017 -176848 -202814 36231 11789 124343
15998 124343 -241658 204443 -365853 138285 -57301 -77156 -223515 -157067 66049 -94737
15987 56949 111905 227126 71412 80405 120544 89413 203226 -50745 135105 34368 39615
15976 39615 376938 511248 99545 339334 -195027 -9452 428722 -94776 -21309 -3831 -149376
15965 -149376 153582 -86207 17249 155420 383540 118938 -87543 -107411 -88438 54240 84651
$$ packed form
16043A45068p0172a7197f21j33394A06471a56357C82607c01399D3662J11837D7698
16031g4141A59839b70743d8494j78858B10858c1485k62899A12439M6341G046P6020
16020H3066a49925B22869b01180B7256J28268a62415G0732N4427f9481A00818
16009a47532C13587j10942K1495m9266N9404E9017a76848k5966C6231A1789J12554
15998A24343b41658B04443c65853A38285e7301j9855j46359O6448F6049i4737
15987E6949N4956J15221G1412Q993M0139l1131J13813e0745A35105C4368N247
15976C9615L37323J34310I9545K39789a95027i452D28722i4776b1309c831j45545
15965a49376A53582h6207A7249J38171K28120A18938h7543j9868J8973E4240L0411
$$ plain form
15954 84651 103123 39958 106570 -183343 -194771 62083 -159096 -92360 -231227 -36856 -294688
15943 -294688 -636 -198174 -71689 24457 246839 17370 666 415608 280727 -168587 -142701
15932 -142701 232797 40470 18220 -242012 -197008 14886 -330374 -224812 -52129 175013
15921 245316 201011 -78260 -134723 313338 -242497 -229870 29562 -259583 -72422 32234 -147447
15909 117347 190505 -91829 -247310 91677 -275767 245156 34544 -202852 -474101 83045
15898 189826 -158127 228094 -344722 54671 -120908 -77458 -49172 -130301 -194797 112689
15887 49273 13152 94183 -53604 -110016 209990 -48781 -139662 -52894 49321 -283388 111446
15875 -88841 -101071 124327 200366 -130291 30440 -113043 -136617 -328596 68086 66412 -401443
$$ packed form
15954H4651J8472C9958O6612a83343j1428F2083a59096O6736j38867c6856k57832
15943b94688f36j97538g1689B4457K22382A7370F66M14942j34881a68587K5886
15932a42701B32797D0470A8220b42012M5004A4886c30374J05562e2129A75013
15921B45316m4305g8260n6463C13338b42497J2627B9562b59583g2422C2234a47447
15909A17347P3158i1829j55481I1677b75767B45156C4544b02852k71249H3045
15898A89826a58127B28094c44722E4671a20908M3450K8286q1129o4496A12689
15887D9273A3152Q1031e3604n6412B09990d8781r0881e2894D9321b83388A11446
15875h8841j2230A24327P6039a30291C0440a13043k3574j91979F8086j674d01443
$$ plain form
15863 -373223 -27544 331453 -136595 -51358 -251034 -71322 -168593 216483 -302654 157457
15852 166503 125066 -189663 40795 -154579 18425 65064 -51731 -91209 -44573 -350709 -157754
15840 -59193 49635 249417 -73668 -124078 -88989 -57702 35378 82116 -195168 -62595 -249625
15829 -249625 55001 -142504 -67034 17548 -176946 107196 18780 -292398 -45974 168462
15818 188975 31643 -13259 -419083 255068 -181928 -109680 190679 -97363 92305 -111646
15807 101838 -80876 -76746 17210 94841 -336720 56421 -258586 -31270 69411 -19797 -174624
15796 -174624 -14565 -373089 282821 -238847 -15851 240211 -145186 30520 47284 22196
15785 -219178 4260 80417 -82175 -14665 -6996 193426 -166677 48842 -151222 6118 -154312
$$ packed form
15863c73223b7544C31453a36595e1358j99676g1322r7271B16483c02654A57457
15852A66503m1437a89663D0795a54579A8425M6639e1731l9478d4573l06136a57754
15840e9193D9635J99782g3668n0410L5089L1287C5378M6738a95168f2595j87030
15829b49625E5001a42504f7034A7548a76946A07196A8780b92398d5974A68462
15818A88975C1643a3259m05824B55068a81928P2248A90679i7363I2305a11646
15807A01838h0876M130A7210P7631c36720E6421b58586c1270F9411a9797j54827
15796a74624a4565l58524B82821b38847a5851B40211a45186C0520J6764B2196
15785b19178D260P6157h2175a4665f996A93426a66677D8842a51222F118a54312
$$ plain form
15773 -114731 -80996 80743 -14837 317327 -29186 135229 -168264 -279322 -144583 183056
15762 -116656 145169 -136051 -221445 -12365 -147905 -355693 -164295 -20325 254116 -71138
15751 -150481 199436 -196693 -26969 -88018 158495 283291 166579 141204 -113995 -46683
15740 45968 -326437 -334770 -6031 -150996 7705 -43897 -58000 -317060 156356 -417129 -168400
15728 -47423 1741 -31013 -43900 -109785 -89634 78627 232044 68985 162 324756 204318 -202120
15715 298842 67365 -60492 -22650 101780 111156 -202891 -83626 -143340 -303206 94110 -152458
15703 -9083 -240935 -664303 -273318 -122667 -39682 127 -119320 -117341 -106317 144864 172393
15692 172393 -318496 -134862 -146367 79438 309143 -51529 -152624 -238756 -190240 -69651 -256689
$$ packed form
15773a14731L3735H0743a4837C17327b9186A35229a68264j11058J34739A83056
15762a16656A45169a36051q5394a2365j35540k07788a64295b0325B54116g1138
15751a50481A99436a96693b6969o1049A58495J24796j16712k5375a13995d6683
15740D5968c26437q333f031j44965G705d3897j4103k59060A56356d17129a68400
15728d7423A741c1013j2887o5885K0151G8627J53417F8985A62L24594j20438b02120
15715B98842F7365f0492b2650A01780R376b02891h3626n9714j59866I4110a52458
15703i083k31852m23368b73318a22667c9682A27a19320J979J1024A44864K7529
15692A72393c18496a34862j1505G9438K29705e1529j01095q6132M8516f9651j87038
$$ plain form
15681 -256689 147330 -241074 55569 -23338 -30175 182173 8878 12011 -19856 126738 -50874
15669 66550 -41540 -250879 43268 -96995 56499 24192 -181014 32034 -88342 -220601 -243498
15658 -243498 -43938 -215832 24742 110699 -252687 -155440 -332024 174558 -29876 -116923 -69081
15647 -69081 -56788 -2299 -134415 28464 252930 15815 -150436 -143431 -159166 -273126 -379467
15636 -379467 -287030 106277 -147056 -315151 131232 -173835 53097 -107332 -210236 147562
15625 405136 -22224 -343947 171096 175784 70614 345522 47197 -64159 339777 5290 44688
15614 44688 32511 158904 171546 61416 -81261 151435 -77968 -238274 140579 -225622 -173960
15603 -173960 -251804 32297 65590 132283 86971 -196815 -181732 -136617 138889 103203 -151328
$$ packed form
15681b56689A47330b41074E5569b3338o837A82173H878L133a9856A26738e0874
15669F6550d1540k09339D3268i6995E6499B4192a81014C2034h8342j32259k2897
15658b43498d3938j71894B4742Q5957b52687R7247j76584A74558b9876q7047M7842
15647f9081J2293b299j32116B8464K24466A5815a50436P005j5735j13960j06341
15636c79467R2437A06277a47056j68095A31232a73835E3097a07332j02904A47562
15625D05136b2224l21723A71096M688G0614K74908D7197f4159C39777E290L9398
15614D4688j2177J26393J2642F1416h1261A51435g7968j60306A40579b25622N1662
15603a73960p7844C2297L3293O6693m5312a96815J5083M5115A38889l5686a51328
$$ plain form
15591 -79621 -96133 185815 18904 -25475 -170549 139452 -49358 -22725 -219141 -185866 -6247
15579 -216649 88741 -199024 175756 -106573 186656 -28787 -319559 -247624 122421 -270099
15568 355908 -25826 -122406 3880 31370 75839 134936 -173789 -112658 350228 -123673 -98091
15557 -98091 -166506 -29592 414474 -524815 -95296 168242 -288315 3404 -45513 444 58850
15546 58850 -47407 -314820 234687 108719 -175580 133072 347985 -321250 31312 -119568
15535 -196272 111541 -178052 -23804 35481 -12729 -124777 -240255 -95425 -112239 232216
15524 -92739 -165940 55630 166067 -167759 -16458 -30735 152013 -9644 -318322 73447 16148
15512 -41425 258378 -217845 27912 46162 -215903 -6288 15146 -69738 -51506 20980 -200690
$$ packed form
15591g9621j6512A85815A8904b5475j45074A39452d9358b2725j96416L3275f247
15579b16649H8741a99024A75756a06573A86656b8787k90772P1935A22421b70099
15568C55908b5826r6580C880K7490M4469N9097a73789O1131C50228a23673K5582
15557i8091o8415b9592D14474e24815i5296A68242b88315C404d5513D44N8406
15546E8850d7407k67413B34687A08719a75580A33072K14913c21250C1312a19568
15535a96272A11541a78052b3804C5481a2729j12048j15478i5425j6814B32216
15524i2739p3201E5630J10437a67759a6458j4277A52013i644l08678G3447A6148
15512d1425B58378b17845B7912J8250b15903f288A5146f9738J8232B0980b00690
$$ plain form
15500 -63945 78935 -26043 -4426 -87775 57589 10058 190977 -566836 35775 -77933 27332
15488 230533 267999 34345 130916 -158604 258776 223387 -28104 -180742 78741 121941 -108271
15476 291716 20819 -7187 180515 -139031 -101821 -101798 -179903 105925 -66812 101291 127388
15465 127388 88669 -6040 199033 35089 -253829 16088 218324 31025 -155921 -155154 5367
15453 339179 -446605 -109737 73826 -256940 -199227 -52250 -114786 -195112 -288161 -99372 222331
15441 148199 -58420 108165 64728 234410 -187871 -101290 -162541 -256425 -35631 -19829 7848
15429 -124586 -129115 145818 -355764 70761 9638 -275736 63821 -415223 274452 8525 -87934
15417 68770 42476 -11588 150346 -112840 95235 -283834 168998 -7847 -190832 -8061 254087
$$ packed form
15500f3945G8935b6043d426q3349E7589A0058J80919e66836C5775g7933B7332
15488B30533L7466C4345R6571a58604B58776l5389b8104j52638G8741M3200a08271
15476B91716B0819g187A80515a39031L7210K3p8105A05925f6812A01291K6097
15465A27388l8719f040A99033C5089b53829A6088K02236C1025a55921P67E367
15453C39179d46605a09737G3826b56940N7713e2250o2536q0326r3049i9372B22331
15441A48199e8420A08165m3437J69682a87871Q6581o1251r3884c5631J5802G848
15429a24586m529A45818c55764G0761I638b75736F3821d15223B74452H525h7934
15417F8770k6294a1588A50346a12840I5235b83834A68998g847j82985h061B54087
$$ plain form
15405 -114888 65685 116265 -38223 419117 -206720 9799 170953 -188178 188726 59350 4778
15393 61345 63365 -101565 65551 164435 -92865 220681 118457 -102432 -10594 -127207 -46806
15381 270450 238398 63679 -53708 46654 89205 15493 -110745 -4344 82080 -7096 32968 -14398
15368 -19850 74854 169245 133171 -74686 -102346 -4009 125963 -36418 -134836 173464 -96730
15356 240273 -211597 115732 -58070 162379 -105584 71074 21177 116463 -64699 72066 21124
15344 14656 50287 -2157 -152310 -8799 309568 28916 614384 104751 151686 38793 -34910
15332 106644 -74166 -156741 78245 -329250 214945 131058 -77677 48376 -405318 23736 -148998
15320 60722 -263383 -79190 130548 60684 -64266 78751 111006 100782 94202 -122170 -246408
$$ packed form
15405a14888F5685N0580c8223D19117b06720I799J61154a88178A88726E9350D778
15393F1345K020a01565F5551R8884i2865B20681j02224a02432a0594j16613d6806
15381B70450l2052F3679e3708D6654M2551A5493a10745d344H2080g096C2968a4398
15368a9850G4854R4391l6074g4686k7660d009A25963c6418r8418A73464i6730
15356B40273b11597A15732e8070A62379a05584G1074B1177R5286f4699G2066B1124
15344A4656L5631b157j50153h799C09568B8916N85468A04751M6935C8793c4910
15332A06644g4166q2575G8245c29250B14945q3887g7677D8376d05318B3736a48998
15320F0722b63383g9190A30548F0684f4266G8751L2255j0224o580a22170j24238
$$ plain form
15309 -246408 234865 256888 9043 136565 -35773 -300768 -52537 57122 12499 -195901 118245
15297 23843 40314 147539 -79291 65892 39925 121484 -165432 971 1531 -27497 -177707 951
15284 79885 -140728 100136 352690 -275764 60020 -198963 -99069 244705 459947 183607
15273 233002 132060 -129867 128627 -21061 138706 -67206 -158971 410622 -43420 -157518
15263 -157518 32977 -251654 142218 -77458 -352825 26313 -29940 126109 -64754 433717
15252 289947 696431 598356 555189 641192 282046 -133232 69722 322315 364584 405411 136244
15240 383979 186216 -184430 66855 245351 -83663 -115256 305440 -133334 229055 -71236
15229 -198955 -67299 -9910 294586 185057 126540 86305 -187246 487868 26414 15259 75968
$$ packed form
15309b46408B34865K2023I043J27522c5773k64995e2537E7122A2499a95901A18245
15297B3843J6471J07225g9291F5892k5967Q1559a65432I71N60b7497j50210I51
15284G9885a40728A00136K52554b75764F0020a98963i9069B44705K15242A83607
15273B33002j00942a29867A28627b1061A38706f7206r1765D10622d3420j14098
15263a57518C2977b51654A42218g7458k75367B6313b9940A26109f4754D33717
15252B89947M06484r8075m3167Q6003B82046a33232F9722K52593M2269M0827A36244
15240C83979A86216a84430F6855J78496h3663l1593C05440a33334B29055g1236
15229a98955f7299i910B94586j09529n8517m0235a87246D87868B6414j1155O0709
$$ plain form
15218 75968 241742 3481 29066 215907 -82642 32243 42345 301841 342455 -188532 -44055
15206 113224 -19149 -169720 173925 246144 -155980 224229 -332270 304805 181346 125884
15196 125884 66906 -35938 278754 -21008 -250113 276110 32493 144207 116403 -60496 206696
15184 122801 77798 12104 293978 345012 -157208 -372530 75064 -30477 -210243 -215312 46876
15172 141553 204465 41475 90834 208192 119810 196294 -39100 444566 -55031 52516 -116438
15160 -88379 -45613 565157 -114710 296840 464920 90237 271438 131837 275671 202360
15150 202360 77130 -252610 316527 124468 581525 -68189 57008 40756 183604 -68215
15139 14605 -24004 10931 524691 21492 163698 -15933 157654 -2927 78666 60756 209462
$$ packed form
15218G5968J65774C481K5585J86841h2642C2243J0102K59496M0614a88532d4055
15206A13224a9149j50571A73925P2219a55980B24229c32270C04805j23459n5462
15196A25884n8978c5938B78754b1008k29105B76110C2493J11714k7804f0496B06696
15184A22801m5003A2104K81874N1034a57208k15322G5064c0477j79766n069D6876
15172A41553O2912D1475M9359J17358q8382P6484c9100D44566e5031E2516a16438
15160h8379M2766E65157a14710B96840J68080I0237J81201A31837J43834p3311
15150B02360G7130b52610C16527A24468M57057f8189E7008j6252J42848f8215
15139A4605b4004A0931N13760B1492J42206a5933A57654b927G8666j7910J48706
$$ plain form
15128 209462 154688 -27313 -71731 72723 257853 -21006 77549 195891 49537 -4142 43647
15116 169990 251706 25057 461949 -130579 216483 -121412 -70383 98231 -261654 89141
15105 212966 -163812 13089 -160507 251470 -82974 -247872 -35585 -213583 56399 149329
15095 149329 255956 188696 97207 88472 -10102 77628 -15092 236420 329567 198654 113939
15084 113939 -3136 37588 166593 72879 -6280 46350 71720 -32052 276811 -67832 292188
15072 114417 100088 -727 138673 9976 172725 37449 470984 -228449 220977 538495 47688
15060 -118624 435324 133709 145158 139078 -219472 130724 103285 -69498 80429 293974 28514
15048 284210 -112110 141371 -79102 340439 184024 172941 155940 20239 328765 30382
$$ packed form
15128B09462n4774b7313m4418G2723J85130b1006G7549J18342D9537d142D3647
15116A69990Q1716B5057M36892a30579B16483a21412N1029I8231b61654H9141
15105B12966a63812A3089a60507B51470h2974j64898c5585j77998E6399R2930
15095A49329J06627o7260r1489q735a0102G7628a5092B36420R3147j30913q4715
15084A13939c136C7588J29005G2879f280D6350K5370c2052B76811f7832B92188
15072A14417j4329g27A38673I976J62749C7449M33535b28449B20977L17518D7688
15060a18624D35324A33709J1449o080b19472A30724k7439f9498H0429K13545B8514
15048B84210a12110A41371g9102C40439j56415j1083j7001B0239L08526C0382
$$ plain form
15037 455476 341962 200644 300862 165691 -86934 403223 261653 363415 201529 270541
15027 270541 276630 537682 -25000 423251 192970 31232 436884 101157 -98779 311168
15016 152348 -45754 37813 25982 71012 476187 -9335 160837 -74644 -137532 86527 390057
15005 390057 176217 46134 89098 -59845 -22954 204450 235793 211991 102229 45247 583637
14994 583637 17146 324432 392681 232429 305760 469586 196148 371590 136212 331874
14984 331874 660926 242835 151141 283190 271783 245359 514218 258524 51166 461248
14974 461248 350448 311174 -67508 602192 447778 425795 320347 497465 208771 244827
14964 244827 178969 430929 408537 336694 198565 266887 232204 374305 348303 168958 302914
$$ packed form
15037D55476j13514j41318J00218j35171h6934D03223j41570J01762j61886O9012
15027B70541O089K61052b5000D23251A92970C1232M05652A01157i8779C11168
15016A52348d5754C7813j1831M5030M05175i335A60837g4644o2888H6527L03530
15005C90057A76217D6134M2964e9845b2954B04450L1343k3802A02229D5247N38390
14994E83637A7146L07286O8249j60252P3331J63826A96148J75442A36212J95662
14984C31874L29052B42835r1694J32049j1407k6424K68859k55694E1166M10082
14974D61248j10800l9274f7508F02192j54414k1983j05448J77118B08771L6056
14964B44827o5858K51960k2392p1843j38129O8322l4683J42101k6002A68958J33956
$$ plain form
14953 302914 19210 271181 561542 341500 266736 378318 289262 -107346 449896 394508
14943 394508 124358 436122 414276 143761 162834 227072 166335 91700 1906 394543 95133
14931 406202 280959 295021 90448 203669 463870 328348 369832 574498 660987 289700
14920 459043 526626 468693 297858 409801 514134 321031 578039 556824 296146 564530
14910 564530 598949 594240 526521 113943 509782 447528 260624 464651 249760 213383 303951
14899 303951 237539 334212 420683 384158 426170 351943 249560 506283 397603 418841 397939
14888 397939 503386 70614 67625 516503 193195 329284 440637 638312 437539 474687
14878 474687 565541 454031 378107 112786 223577 230244 206912 517505 400173 509955
$$ packed form
14953C02914A9210K51971K90361k20042p4764J11582q9056a07346D49896n5388
14943C94508A24358L11764k1846A43761J9073O4238o0737p4635A906L92637I5133
14931D06202j25243J4062I0448J13221K60201j35522M1484K04666Q6489B89700
14920D59043O7583n7933j70835J11943J04333j93103K57008k1215k60678K68384
14910E64530L4419m709o7719A13943L95839o2254j86904K04027k14891l6377R0568
14899C03951o6412R6673Q6471l6525M2012p4227j02383K56723j08680K1238k0902
14888C97939J05447G0614k989M48878A93195J36089J11353J97675k00773L7148
14878D74687R0854j11510p5924A12786J10791O667k3332L10593j17332J09782
$$ plain form
14868 509955 340484 335638 596597 -9533 404548 645276 319270 330795 442958 434370 234286
14857 234286 234853 326179 501059 367043 498843 310672 287681 473380 334010 465282
14847 465282 456195 355558 27497 51753 458115 253833 323873 347636 296882 383624 383774
14836 383774 466674 420724 451061 474475 500491 441622 473813 480128 525628 463363 388513 624311
14824 624311 531109 506455 489592 527037 210837 385926 439932 315393 402142 304969 177344
14813 177344 460882 355084 625845 587152 764213 592645 252477 490084 375025 462001
14803 462001 669050 327981 405344 266534 521327 736292 409587 849469 511423 636630
14793 636630 579912 586729 509670 595599 368397 430989 684006 461101 532536 341454 661005
$$ packed form
14868E09955j69471m846K60959i533D04548K40728C19270J1525J12163q588k00084
14857B34286N67R1326J74880j34016J31800j88171k2991J85699j39370J31272
14847D65282r087j00637B7497K4256M06362k04282P0040K3763n0754Q6742J50
14836C83774Q2900m5950L0337K3414K6016n8869L2191O315M5500o2265p4850K35798
14824F24311r3202k4654j6863L7445B10837J75089N4006j24539Q6749r7173j27625
14813A77344K83538j05798K70761l8693J77061j71568B52477K37607j15059Q6976
14803D62001K07049C27981P7363j38810K54793K14965l26705M39882l38046J25207
14793F36630n6718O817p7059Q5929k27202O2592K53017k22905P1435j91082L19551
$$ plain form
14782 661005 422796 574702 352884 531822 385786 444721 325608 390136 651208 773208
14772 773208 596743 719951 747171 545313 626446 479660 571728 802073 568775 618093
14762 618093 805193 784351 634783 361001 772384 435276 445300 660080 628648 748158
14752 748158 616567 826365 625768 451558 536730 842362 756197 384904 656467 831510
14742 831510 762178 729498 752211 730317 617315 755944 314660 688785 589458 746480
14732 746480 862023 427052 805561 595486 288674 831152 982786 737996 914082 862369
14722 862369 709239 830614 976931 937722 745074 1039756 665737 763824 1102278 592480
14712 592480 949693 597696 833093 422454 893145 749613 740011 810180 790680 732854
$$ packed form
14782F61005k38209J51906k21818J78938j46036N8935j19113O4528K61072J22000
14772G73208j76465J23208K7220k01858Q1133j46786R2068K30345k33298M9318
14762F18093J87100k0842j49568k73782M11383l37108J0024K14780l1432J19510
14752G48158j31591K09798k00597j74210Q5172L05632q6165l71293K71563J75043
14742H31510o9332l2680K2713k1894j13002J38629C14660L74125r9327J57022
14732G46480J15543D27052L78509k10075B88674N42478J51634k44790J76086n1713
14722H62369j53130J21375J46317l9209j92648K94682l74019R8087L38454n09798
14712E92480L57213l51997K35397m10639M70691j43532r602P0169j9500n7826
$$ plain form
14702 732854 983322 1072941 702177 839086 889000 702569 607956 864650 1043735 1063299
14692 1063299 944945 998089 911377 736303 829942 1039759 879106 860480 755894 969879
14682 969879 1024863 908296 981605 710942 631803 1143179 943687 863861 950770 1152390
14672 1152390 817167 1008600 880724 877728 1204476 597150 1000957 798431 933976 973052
14662 973052 1078174 844794 900497 921346 1079330 948142 1073984 1374298 1101490 685294
14652 685294 963170 956882 1069520 981320 1293972 1094099 1353722 1023146 1145475 923686
14642 923686 804083 1099108 1229312 1177743 1251180 1406096 1475465 1190588 1355221 1144175
14632 1144175 1344710 1255550 1486379 1354195 1147220 1506736 1243365 1174923 1185874 1123630
$$ packed form
14702G32854K50468Q9619l70764J36909M9914j86431r4613K56694J79085J9564
14692A063299j18354N3144q6712j75074R3639K09817j60653j8626j04586K13985
14682I69879N4984j16567P3309k70663p9139N11376j99492p9826Q6909K01620
14672A152390l35223J91433j27876k996L26748E97150M03807k02526J35545L9076
14662I73052J05122k33380N5703K0849J57984j31188J25842L00314k72808m16196
14652F85294K77876o288J12638q8200L12652j99873K59623l30576J22329k21789
14642I23686j19603K95025J30204n1569P3437J54916O9369k84877J64633k11046
14632A144175K00535q9160K30829j32184k06975L59516k63371o8442J0951o2244
$$ plain form
14622 1123630 1646608 1411887 1167720 1438845 1171813 1013441 1413871 1552379 1643142 1276740
14612 1276740 1140414 1585440 1065215 1413444 1294718 1153373 1604486 1096325 1575539
14603 1575539 1932896 1532965 1607641 1745597 1557872 1439130 1612395 1942351 1543674 1325377
14593 1325377 1743377 1666469 1905715 1737616 1711142 1937778 1868521 1860703 1814716 1927078
14583 1927078 1504964 1912025 2085017 2045565 1994449 2179662 2290946 2053722 2434085 1933139
14573 1933139 2039936 2263197 2001247 2062850 2394222 2320402 2372774 2316702 2273638 2283029 2469695
14562 2469695 2356997 2741214 2519624 2927155 3165479 3063067 3623342 3379003 3848189
14553 3848189 4072540 4698991 5517837 7454649 9694585 12480879 17362696 23960512 24565862
$$ packed form
14622A123630N22978k34721k44167K71125k67032j58372M00430J38508R0763l66402
14612A276740j36326M45026n20225L48229j18726j41345M51113n08161M79214
14603A575539L57357l99931P4676J37956j87725j18742J73265L29956l98677k18297
14593A325377M18000p6908K39246j68099k6474K26636o9257p818m5987J12362
14583A927078m22114M07061J72992l9452n1116J85213J11284k37224L80363n00946
14573A933139J06797K23261k61950O1603L31372p3820N2372n6072m3064R391J86666
14562B469695j12698L84217k21590M07531K38324j02412N60275k44339M69186
14553C848189K24351O26451Q18846J936812K239936K786294M881817O597816O05350
$$ plain form
14544 24565862 18037568 11557478 7427440 5296579 4142918 3632817 2871775 2725139
14536 2725139 2586019 2191320 2111307 2371579 2074002 2253234 2385666 2003752 2416392 2358198
14526 2358198 2407120 2064487 2175444 2514689 2448943 2277504 2601488 2403957 2580177 2460882
14516 2460882 2602667 2600846 2588831 2624541 2520826 2491352 2079454 2298707 2635421 2919498
14506 2919498 2670093 2845032 2687840 3065562 2987358 3418565 2848166 3272368 3122308 2952762
14496 2952762 2887687 3345804 3289702 3253432 3301833 3213011 3226482 3522326 3741366 3641117
14486 3641117 3599106 3376312 3351267 3596842 3646580 3806119 3547589 3768654 3970203 3856024
14476 3856024 3803230 3904683 3904361 4093372 3747717 4232942 4000172 3900700 4212958 3884768
$$ packed form
14544B4565862o528294o480090m130038k130861j153661n10101p61042j46636
14536B725139j39120l94699q0013K60272k97577J79232J32432l81914M12640n8194
14526B358198M8922l42633J10957L39245o5746j71439L23984j97531J76220j19295
14516B460882J41785j821j2015L5710j03715k9474m11898K19253L36714K84077
14506B919498k49405J74939j57192L77722p8204M31207n70399M24202j50060j69546
14496B952762o5075M58117n6102l6270M8401q8822J3471K95844K19040j00249
14486C641117m2011k22794k5045K45575M9738J59539k58530K21065K01549j14179
14476C856024n2794J01453l22J89011l45655M85225k32770r9472L12258l28190
$$ plain form
14466 3884768 3993336 4574732 4309164 4362580 4668123 4978183 4491499 4712725 4804546 4958391
14456 4958391 4832202 4891735 4719266 5284133 5334076 5175662 5310675 5208561 5352712 5530493
14446 5530493 5425698 5589479 5379586 5618370 5469765 5844143 5956933 5468769 6089396
14437 6089396 6445239 6139769 6403426 6307238 6302847 6676098 6680747 6805616 6930074 6944728
14427 6944728 7109407 7045692 7147763 7289120 7452418 7774643 7861225 7870459 8208980 7843033
14417 7843033 7820764 8061306 8453820 8494186 8235977 8681307 8931133 8910333 9190178 9254206
14407 9254206 9119863 9463901 9442323 9739170 10041323 9744880 10322218 10385781 10981722 10990158
14397 10990158 10739580 11160191 11528414 11228858 11878508 11931146 11836487 12460512 12212636 12526564
$$ packed form
14466C884768J08568N81396k65568N3416L05543L10060m86684K21226R1821J53845
14456D958391j26189N9533j72469N64867M9943j58414J35013j02114J44151J77781
14446E530493j04795J63781k09893K38784j48605L74378J12790m88164O20627
14437F089396L55843l05470K63657r6188m391L73251M649J24869J24458J4654
14427F944728J64679o3715J02071J41357J63298L22225Q6582R234L38521l65947
14417G843033k2269K40542L92514M0366k58209M45330K49826k0800K79845O4028
14407I254206j34343L44038k1578K96847L02153k96443N77338O3563N95941Q436
14397A0990158k50578M20611L68223k99556O49650N2638r4659O24025k47876L13928
$$ plain form
14387 12526564 12814198 12992526 13294672 13648260 13943941 14090694 14433496 14803835 14628234
14378 14628234 15247658 15616055 15734647 16085078 16481345 16543648 17247884 17364364 17514622
14369 17514622 18274394 18481129 19045281 19110611 19597422 20045803 20604857 20562789 21353422 21747189
14359 21747189 22283934 22784867 23367016 24067900 24093785 24836369 25539952 26029769 26887840
14350 26887840 27166158 28018193 28708698 29523912 30051128 30919897 31623944 32238374 33061429
14341 33061429 34106996 35385284 35888233 37393880 38099928 39318973 40367903 41482331
14333 41482331 43232712 44247961 45680254 46854534 48199167 49460037 51153902 52853608
14325 52853608 54798051 56429540 58127801 60041019 61964445 63962205 66416650 68598059
$$ packed form
14387A2526564K87634J78328L02146L53588K95681J46753L42802L70339j75601
14378A4628234O19424L68397J18592L50431L96267O2303P04236J16480J50258
14369A7514622P59772K06735N64152O5330M86811M48381N59054m2068P90633L93767
14359B1747189N36745N00933N82149P00884K5885P42584P03583M89817Q58071
14350B6887840K78318Q52035O90505Q15214N27216Q68769P04047O14430Q23055
14341C3061429J045567J278288N02949J505647P06048J219045J048930J114428
14333D1482331J750381J015249J432293J174280J344633J260870J693865J699706
14325E2853608J944443J631489J698261J913218J923426J997760K454445K181409
$$ plain form
14317 68598059 71030023 73917035 76645099 79276565 82244616 85744710 88829418 92119098
14309 92119098 96265472 99883812 104195930 108419520 112769205 117835399 122969794 128616983
14301 128616983 133936940 140161497 146607051 153339113 160512686 168295740 176267327 184550293
14293 184550293 193509456 202746761 212370536 222750781 233543917 245011524 256452393
14286 256452393 268641790 281183928 293758186 306906409 319762207 333017653 345920364
14279 345920364 358940553 371066258 382777223 393520063 402996033 411021243 416882639
14272 416882639 420158850 421636123 421263221 419575931 416243657 411698535 405407049 397759937
14264 397759937 389364169 379946858 369765056 358695589 346523004 334191751 320464136
$$ packed form
14317F8598059K431964K887012K728064K631466K968051L500094L084708L289680
14309I2119098M146374L618340M312118M223590M349685N066194N134395N647189
14301A28616983N319957O224557O445554O732062P173573P783054P971587Q282966
14293A84550293Q959163R237305R623775J0380245J0793136J1467607J1440869
14286B56452393J2189397J2542138J2574258J3148223J2855798J3255446J2902711
14279C45920364J3020189J2125705J1710965J0742840R475970Q025210N861396
14272D16882639L276211J477273l72902j687290l332274m545122o291486p647112
14264C97759937q395768r417311j0181802j1069467j2172585j2331253j3727615
$$ plain form
14257 320464136 306948234 293536697 279916272 267001960 254442067 242234466 230398549
14250 230398549 219643885 208875872 198928119 189129277 180155762 171910716 163747887 156099023
14242 156099023 149087823 142224333 135786695 129829369 124176565 118517878 113379512 109141675
14234 109141675 104496259 100105832 95914396 92555874 88802148 85077721 81859531 78834876
14226 78834876 75705897 72944094 70052885 67611627 65011610 63190451 60539097 58555748
14218 58555748 56590864 54834476 53024662 51166322 49826538 48408121 46826925 45427770
14210 45427770 43749361 42710459 41482278 40332363 39372119 37966673 36992476 36182455
14202 36182455 34940617 33978571 32954030 32324693 31463462 30464151 29831387 29027774 28353680
$$ packed form
14257C20464136j3515902j3411537j3620425j2914312j2559893j2207601j1835917
14250B30398549j0754664j0768013r947753r798842q973515q245046q162829p648864
14242A56099023p011200o863490o437638n957326n652804n658687n138366m237837
14234A09141675m645416m390427m191436l358522l753726l724427l218190l024655
14226G8834876l128979k761803k891209k441258k600017j821159k651354j983349
14218E8555748j964884j756388j809814j858340j339784j418417j581196j399155
14210D5427770j678409j038902j228181j149915r60244j405446r74197q10021
14202C6182455j241838r62046j024541o29337q61231r99311o32764q03613o74094
$$ plain form
14193 28353680 27570587 27073069 26292677 25645183 25154713 24371757 23709728 23279422 23012552
14184 23012552 22355287 21812758 21301926 20348312 20265921 19753455 19506969 19111459 18536731
14175 18536731 18187929 17715244 17550503 17085788 16685093 16633170 16042375 15927786 15565108
14166 15565108 15059382 15289514 14994128 14431910 14505863 14159610 13708761 13731904 13393895 13031060
14156 13031060 12735648 12731183 12411066 12347365 12026124 11921840 11638032 11174645 11150121 10829939
14146 10829939 10742394 10649521 10463933 10202257 9732524 10318625 9985319 9797232 9304385 9079460
14136 9079460 9265041 9464760 8844451 9011329 8825605 8384387 8424856 8514535 8249328 7908901
14126 7908901 7705133 7993220 7963640 7510791 7557119 7580221 7420027 7434666 7145827 7354887
$$ packed form
14193B8353680p83093m97518p80392o47494m90470p82956o62029m30306k66870
14184B3012552o57265n42529n10832r53614q2391n12466k46486l95510n74728
14175A8536731l48802m72685j64741m64715m00695n1923n90795j14589l62678
14166A5565108n05726K30132k95386n62218P3953l46253m50849K3143l38009l62835
14156A3031060k95412m465l20117o3701l21241j04284k83808m63387k4524l20182
14146A0829939q7545r2873j85588k61676m69733N86101l33306j88087m92847k24925
14136I079460J85581J99719o20309J66878j85724m41218M0469Q9679k65207l40427
14126G908901k03768K88087k9580m52849M6328K3102j60194J4639k88839K09060
$$ plain form
14116 7354887 7139251 6949269 6933155 6616225 6642723 6860579 6569152 6357714 6394611 6017919
14106 6017919 6083560 6153810 5737577 6208651 6164832 5861404 5704542 5574573 5519040 5599627
14096 5599627 5365186 5280069 5375143 5378672 5125495 4984405 5067667 5185405 5029986 5036345 5039133
14085 5039133 4831269 4490757 4828332 4656929 4767366 4764708 5051533 4628094 4291744 4493692
14075 4493692 4348152 4151159 3979004 4416749 4135516 4315282 4107980 4188493 4039066 3857460
14065 3857460 3776907 3719520 3842117 4007106 3788834 3959222 3668002 3857843 3674844 3503086
14055 3503086 3639066 3348294 3710080 3400630 3636489 3282701 3510856 3676393 3801698
14046 3801698 3388539 3408010 3072397 3266156 3361968 3433932 3323016 3032048 3238965 2979271
$$ packed form
14116G354887k15636j89982j6114l16930K6498K17856k91427k11438L6897l76692
14106F017919O5641P0250m16233M71074m3819l03428j56862j29969n5533Q0587
14096E599627k34441q5117R5074L529k53177j41090Q3262J17738j55419O359K788
14085E039133k07864l40512L37575j71403J10437k658K86825m23439l36350K01948
14075D493692j45540j96993j72155M37745k81233J79766k07302Q0513j49427j81606
14065C857460q0553n7387J22597J64989k18272J70388k91220J89841j82999j71758
14055C503086J35980k90772L61786l09450K35859l53788K28155J65537J25305
14046C801698m13159J9471l35613J93759R5812P1964j10916k90968K06917k59694
$$ plain form
14036 2979271 3082742 2893066 2998176 2959447 3042633 2924953 2533474 2773886 2618334 3074395
14026 3074395 2876275 2578675 2651706 2830118 2724796 2907462 2264058 2671358 2694209 2440281
14016 2440281 2163390 2684543 2735688 2264692 2682996 2543490 2202203 2409649 2625211 2584964
14006 2584964 2401754 2282647 2070619 2318257 2166550 2197735 2588905 2045656 2275485 2207978
13996 2207978 2162634 2750614 2663870 2624200 3125893 3559060 4527011 5848111 8378379 13228043
13986 13228043 21038256 25017538 20825500 14780423 10281550 7542031 6193937 5127198
13978 5127198 4685234 3732220 3332450 2919963 3017997 3019559 3014810 2749184 2766899 2753558 2223651
13967 2223651 2504044 2309235 2323805 2239834 2005295 2273870 2070239 2154719 1908901 1888513
$$ packed form
14036B979271J03471j89676J05110l8729Q3186j17680l91479K40412j55552M56061
14026C074395j98120k97600P3031J78412j05322J82666o43404M07300K2851k53928
14016B440281k76891N21153N1145m70996M18304j39506l41287K07446K15562m0247
14006B584964j83210j19107k12028K47638j51707L1185L91170n43249K29829o7507
13996B207978m5344N87980q6744l9670N01693M33167R67951J321100K530268M849664
13986A3228043P810213L979282m192038o045077m498873k739519j348094j066739
13978E127198m41964r53014l99770m12487R8034J562m749k65626J7715j3341n29907
13967B223651K80393j94809J4570q3971k34539K68575k03631Q4480k45818k0388
$$ plain form
13957 1888513 2053538 1958995 1606572 1930681 2034552 1541611 1736451 2043573 1673921 1647794
13947 1647794 1840277 1475576 1942957 1996082 1810119 1875619 1658219 1651486 1779714 1712115
13937 1712115 1920762 1512862 1513208 1807312 1801550 1738242 1518607 1545464 1564665 1320331 1436375
13926 1436375 1331601 1525039 1612796 1660026 1436917 1540607 1370234 1504209 1399625 1180986
13916 1180986 1459657 1375433 1317156 1464023 1421573 1324347 1276829 1402335 1331687 1384320 1142789
13905 1142789 1325275 1533388 1289338 1000276 915269 1093311 1559601 1356820 1176276 1241360
13895 1241360 1449703 1231171 1326163 1136236 1200147 1321846 1146108 1182711 1001498 1261314
13885 1261314 1290450 950371 1101433 998892 968812 1296280 1359444 892159 1024139 946250
$$ packed form
13957A888513J65025r4543l52423L24109J03871m92941J94840L07122l69652k6127
13947A647794J92483l64701M67381N3125j85963O5500k17400o733J28228o7599
13937A712115K08647m07900L46K94104n762o3308k19635K6857J9201k44334J16044
13926A436375j04774J93438Q7757M7230k23109J03690j70373J33975j04584k18639
13916A180986K78671q4224n8277J46867m2450r7226m7518J25506p0648N2633k41531
13905A142789J82486K08113k44050k89062q5007J78042M66290k02781j80544O5084
13895A241360K08343k18532R4992j89927O3911J21699j75738L6603j81213K59816
13885A261314K9136l40079J51062j02541l0080L27468O3164m67285J31980p7889
$$ plain form
13875 946250 1064404 1051630 1500600 1306836 1252190 1057688 828548 1213160 1104424 1431311
13865 1431311 1449651 1177684 1014704 586157 1033832 858492 811691 1085582 729464 1160166
13855 1160166 1172465 880896 1340866 807008 764190 945103 1381502 892809 937892 1136877
13845 1136877 910881 919418 977212 985414 523960 1265950 663570 723996 904597 782367
13835 782367 1013580 788782 678772 751971 1049233 832501 642746 774932 828099 651099
13825 651099 844536 464079 752116 1086530 643431 715086 838203 910999 716864 896648
13815 896648 728114 497011 843234 1078663 729881 847439 1062135 810101 888264 760661
13805 760661 630196 697369 668615 771496 584830 1098261 785362 944132 862792 728232
$$ packed form
13875I46250J18154j2774M48970j93764n4646j94502k29140L84612j08736L26887
13865A431311J8340k71967j62980m28547M47675j75340m6801K73891l56118M30702
13855A160166J2299k91569M59970n33858m2818J80913M36399m88693M5083J98985
13845A136877k25996Q537N7794Q202m61454P41990o02380O0426J80601j22230
13835G82367K31213k24798j10010P3199K97262k16732j89755J32186N3167j77000
13825F51099J93437l80457K88037L34414m43099P1655J23117P2796j94135J79784
13815H96648j68534k31103L46223K35429l48782J17558K14696k52034P8163j27603
13805G60661j30465O7173k8754J02881j86666N13431l12899J58770q1340j34560
$$ plain form
13795 728232 670960 714498 426465 615416 795181 418180 905224 620682 446011 998626
13785 998626 292046 666190 811138 928001 555958 588344 667294 678020 932106 685480
13775 685480 681485 825729 733814 672538 531884 803907 333677 400672 836053 519348
13765 519348 395942 812751 714806 764861 639787 883401 849437 875075 726434 734224 719906
13754 719906 1041850 431689 513221 649726 763624 291635 688492 616351 479137 516893
13744 516893 537859 428234 471765 625391 782523 560692 581629 477069 913750 640141
13734 640141 592842 721573 747457 359245 240545 853440 765024 796848 308331 709724
13724 709724 486068 866213 512255 564800 641921 613850 464009 665888 340040 601031
$$ packed form
13795G28232n7272M3538k88033J88951J79765l77001M87044k84542j74671N52615
13785I98626B92046L74144J44948J16863l72043L2386P8950J0726K54086k46626
13775F85480l995J44244r1915o1276j40654K72023C33677O6995M35381l16705
13765E19348j23406M16809r7945N0055j25074K43614l3964K5638j48641P790j4318
13754G19906L21944D31689Q1532J36505J13898B91635L96857p2141j37214L7756
13744E16893K0966j09625M3531J53626J57132k21831K0937j04560M36681k73609
13734F40141m7299J28731K5884C59245j18700O12895q8416L1824C08331M01393
13724G09724k23656L80145l53958N2545P7121k8071j49841K01879l25848K60991
$$ plain form
13714 601031 490142 679481 509844 582375 343495 476245 509972 604141 629233 390703
13704 390703 424156 880354 677408 244598 740323 520433 810970 289253 611854 310871
13694 310871 475403 814561 642198 450601 -79966 921588 457933 608674 437961 576775
13684 576775 487784 519204 532559 606885 116391 663248 514167 646442 316331 300420
13674 300420 371038 351064 198153 293442 403984 282234 381998 248028 66019 137653 776576
13663 776576 280287 658028 700079 156788 179932 422956 693661 488102 419966 487739
13653 487739 300759 356662 383431 288542 448816 516333 288078 500388 280839 618128
13643 618128 373008 387087 616790 442782 121784 411295 408380 711381 469506 571133
$$ packed form
13714F01031j10889J89339j69637P2531k38880J32750L3727R4169K5092k38530
13704C90703L3453M56198k02946B44598M95725k19890K90537B89253L22601l00983
13694C10871J64532L39158j72363j91597g9966I21588D57933J50741j70713J38814
13684E76775q8991L1420J3355P4326A16391N46857j49081J32275C16331j5911
13674C00420P0618j9974j52911R5289J10542j21750R9764j33970F6019P1634O38923
13663G76576B80287L77741M2051A56788K3144K43024K70705k05559o8136O7773
13653D87739j86980N5903K6769r4889J60274O7517k28255K12310k19549L37289
13643F18128k45120J4079K29703j74008A21784K89511k915L03001k41875J01627
$$ plain form
13633 571133 552055 468611 600842 302728 498410 304236 182695 111949 680493 802353
13623 802353 88049 277535 392115 703201 503066 480794 242657 196350 537195 241352
13612 475789 628107 323930 338416 395707 426334 396427 311072 243255 411019 281410 448965
13601 448965 403119 296063 264637 307014 421373 496392 435600 237391 246039 520865 373177
13590 373177 287966 325424 354554 431845 474697 205738 324709 327319 612656 378212 288094
13579 288094 481289 468278 143425 359193 194439 264072 153456 501934 502159 284927
13569 284927 8573 153906 288935 334490 403686 471290 294110 231910 505672 335883 221393
13558 221393 373424 306454 555256 486494 538771 138711 105497 336289 346129 419417 245158
$$ packed form
13633E71133j9078q3444J32231k98114J95682j94174j21541p0746N68544J21860
13623H02353H8049J89486J14580L11086k00135k2272k38137m6307L40845B41352
13612D75789J52318l04177J4486N7291L0627k9907q5355o7817J67764j29609J67555
13601D48965m5846j07056l1426M2377J14359P5019o0792j98209Q648K74826j47688
13590C73177q5211L7458K9130P7291M2852B05738J18971K610K85337k34444r0118
13579B88094J93195j3011A43425K15768j64754O9633j10616L48478K25k17232
13569B84927H573J45333J35029M5555O9196O7604j77180o2200K73762j69789j14490
13558B21393J52031o6970K48802o8762N2277A38711l3214K30792R840P3288j74259
$$ plain form
13547 245158 246330 291224 396432 326889 226363 400529 351094 370887 305796 196035 -1537
13535 471974 186449 84515 343052 280981 305927 128513 389115 362917 172148 226929
13525 226929 277104 163920 401994 144275 361699 95414 243348 291554 230270 -103017
13514 99198 548812 335821 235626 98703 277678 395717 132374 165252 384073 156334
13503 347031 493088 203964 423787 196364 374319 158834 599374 197448 313755 451678
13493 451678 623852 375607 89214 266621 227262 418242 247511 214459 118059 -5349 109620
13481 449125 107645 344333 580523 -1649 275569 114791 414879 146105 232300 435389
13471 435389 342 298278 128208 422764 193434 244158 126361 135130 241805 338562 125165
$$ packed form
13547B45158J172M4894J05208o9543j00526J74166m9435J9793o5091j09761a537
13535D71974A86449H4515K58537o2071K4946A28513K60602k6198A72148N4781
13525B26929N0175j13184K38074A44275K17424I5414J47934M8206o1284a03017
13514I9198M49614k12991j00195I8703J78975J18039A32374L2878K18821A56334
13503C47031J46057B03964K19823A96364J77955A58834M40540A97448J16307J37923
13493D51678J72174k48245H9214J77407l9359J90980j70731l3052r6400e349A09620
13481D49125A07645K36688K36190a649B75569A14791L00088A46105Q6195K03089
13471D35389C42K97936A28208K94556A93434N0724j17797Q769J06675R6757A25165
$$ plain form
13459 405158 8853 286260 -89346 166241 244989 354600 317944 99923 -59070 659044 439053
13448 439053 276605 -75874 585434 -149494 89241 192643 199783 233101 522718 231215
13437 297574 613716 -23507 230917 207813 203689 194743 206351 179913 572773 271538 156647
13426 156647 172863 -34504 -161269 434883 -30853 220794 -139236 284314 29187 -44047
13415 -94193 249584 259348 142804 370180 400116 234242 14354 164768 170071 313136 446225
13404 446225 182801 -28739 308440 113992 105797 434621 2317 164878 390179 395274 448044
13393 448044 503381 385836 386988 -956 138316 66771 370662 211824 62339 -20570 43644
13381 172789 26971 48578 43027 157092 15398 130560 427550 265872 239355 231281 247186
$$ packed form
13459D05158H853K77407h9346A66241P8748J09611l6656I9923e9070F59044k19991
13448D39053j62448g5874E85434a49494H9241J03402P140L3318K89617B31215
13437B97574L16142b3507B30917k3104m124q946J1608k6438L92860B71538j14891
13426A56647J6216c4504j26765D34883c0853B20794a39236B84314B9187d4047
13415i4193B49584R764j16544K27376K9936j65874A4354J50414N303J43065J33089
13404D46225A82801b8739C08440A13992q195L28824B317J62561K25301N095N2770
13393D48044N5337j17545J152i56A38316F6771L03891j58838F2339b0570D3644
13381A72789B6971K1607n551J14065A5398J15162K96990j61678k6517q074J5905
$$ plain form
13370 247186 360825 481019 108344 64521 225566 116026 70455 310715 -11048 225418
13359 322330 -2864 170654 231932 -18256 427153 409722 279753 148127 359050 140592
13348 63002 406466 462660 178655 262777 180304 243321 478294 260752 374582 133697
13337 -52124 229291 589636 -116984 226946 97609 345136 27323 454927 34070 52403
13327 52403 123604 279759 203030 -34442 402075 168477 339511 396804 177116 396960
13317 396960 286481 154673 -52693 143087 288100 376937 77046 139467 -210451 310525
13306 214231 37726 248096 29834 34473 16411 340104 182330 165312 -47180 220550 144816
13295 144816 501660 216253 101893 129902 282848 315638 238143 -155318 23543 -123396
$$ packed form
13370B47186J13639J20194A08344m3823J61045j09540m5571K40260a1048B25418
13359C22330b864A70654O1278a8256D27153j7431j29969j31626K10923A40592
13348F3002L43464N6194A78655Q4122q2473O3017K34973k17542J13830A33697
13337e2124B29291L60345a16984B26946I7609K47527B7323M27604C4070J8333
13327E2403P1201J56155p6729c4442D02075A68477J71034N7293A77116K19844
13317C96960j10479j31808e2693A43087J45013Q8837G7046O2421b10451C10525
13306B14231C7726K10370B9834M639A6411L23693j57774j7018d7180B20550p5734
13295A44816L56844B16253A01893K8009J52946L2790p7495a55318B3543a23396
$$ plain form
13284 -113366 125804 93243 184214 265738 83410 458082 256427 -23863 47731 -21102 15323
13272 147985 -159673 -87749 228169 -54776 219161 -135539 -496731 275948 -16004 260592
13261 317781 68400 56541 190201 -32902 233554 32019 -56067 50202 227826 71770 22373
13249 -88864 173773 130416 -227272 335218 -175395 52592 98302 -191397 114120 -174257
13238 -148404 116532 -19690 146806 128696 -60377 250675 -7850 -258787 148980 125748 38736
13226 -210699 253119 223658 150182 69233 96290 33359 -19847 -30789 172296 382771 -71826
13214 342731 1462 128601 -65245 459511 69154 20376 -226105 277705 -237147 39887 541604
13203 541604 124186 43428 -9700 -15569 -26248 224284 -1693 19562 -328105 -159 275436 211689
$$ packed form
13284a13366A25804l2561R0971Q1524H3410L74672k01655b3863D7731b1102A5323
13272A47985a59673P1924B28169e4776B19161a35539l61192B75948a6004B60592
13261C17781F8400j1859J33660c2902B33554C2019e6067E0202J77624G1770B2373
13249h8864A73773m3357b27272C35218a75395E2592M5710a91397A14120a74257
13238a48404A16532a9690A46806j8110f0377B50675g850k50937A48980k3232C8736
13226b10699B53119k9461p3476F9233K7057C3359a9847j0942A72296K10475g1826
13214C42731A462J27139f5245D59511F9154B0376b26105B77705b37147C9887N01717
13203E41604A24186D3428i700n869j0679B24284a693A9562c28105a59B75436o3747
$$ plain form
13191 211689 -79154 60434 9998 95576 234265 123453 313062 -34600 -17585 -80799 41546
13179 35705 -90211 263932 246924 137934 -148094 -28814 49357 189570 91554 342537 29822
13167 270205 378053 -33313 81995 58009 313835 -34141 142411 203148 498927 625780
13157 625780 -241312 345665 -144988 -43329 321486 141917 114999 363648 128296 29450
13146 21293 316422 163117 196196 -44333 -121338 -244631 203720 -102803 135129 -348253
13135 -11284 270103 176031 231386 80368 201016 171384 -1872 46392 57429 -61246 227840
13123 33746 -245661 -330503 -53203 -127453 388516 340895 -161810 -2395 217982 395473 435957
13112 435957 -62327 209747 85063 207808 650092 -3006 220337 -391884 85189 -37051 79194
$$ packed form
13191B11689g9154F0434I998Q5578J38689j10812J89609c4600J7015o3214D1546
13179C5705i0211B63932j7008j08990a48094b8814D9357J40213I1554K50983B9822
13167B70205J07848c3313H1995k3986K55826c4141A42411O0737K95779J26853
13157F25780b41312C45665a44988d3329C21486A41917k6918K48649A28296B9450
13146B1293K95129j53305L3079d4333p7005j23293B03720a02803A35129c48253
13135a1284B70103r4072N5355H0368J20648k9632a872D6392J1037f1246B27840
13123C3746b45661q4842e3203p4250C88516m7621a61810b395B17982J77491M0484
13112D35957f2327B09747H5063J22745M42284c006B20337c91884H5189c7051G9194
$$ plain form
13100 319794 337693 282575 -96285 71284 203413 276658 121009 33262 109593 -66832 11781
13088 -152725 36625 -104663 101357 59930 291638 -68143 -22485 -119463 256213 -6533 -39977
13077 -39977 105245 -49492 -44683 90447 48221 -205533 1574 114521 -221984 424637 204897
13065 -141344 296978 75715 -51063 6479 -69813 93676 -80229 -119894 -171079 -15411 -191951
13054 -191951 86704 54391 -129765 -44566 -88557 59375 113476 129166 -18269 -76773 279460
13042 132095 34325 -105690 570371 -21840 250255 -84930 168501 -298510 -14532 210609
13031 207850 -457978 93244 24125 35611 152305 113452 395575 372707 56793 -194332 391172
13019 195952 310100 306721 137582 123884 241781 -290175 18417 227619 -47636 166957
$$ packed form
13100C19794J7899n5118i6285G1284J32129P3245A21009C3262P6331f6832A1781
13088a52725C6625a04663A01357m1427K31708f8143b2485r6978B56213f533l3444
13077c9977A05245d9492M809I0447m2226b05533A574J12947b21984D24637B04897
13065a41344B96978G5715e1063F479f9813I3676h0229l9665n1185a5411j76540
13054a91951H6704l2313a29765d4566m3991E9375N4101J5690a8269n8504B79460
13042A32095C4325a05690E70371b1840B50255h4930A68501b98510a4532B10609
13031B07850d57978I3244B4125J1486J16694l8853K82123k2868E6793a94332C91172
13019A95952J14148l379A37582j3698J17897b90175A8417K09202d7636A66957
$$ plain form
13008 -189434 -219010 -31760 -137099 233690 6321 32337 174591 107798 413910 -216225 57404
12996 227136 42479 -50925 2745 -69542 206304 256526 -127604 -103211 14644 231821 -1018
12984 141199 195863 -36203 125489 176028 -60863 224829 262061 76314 -51420 234163 -74562
12972 56015 -83279 24545 -12232 -122865 -193071 26793 -64164 -135568 164806 71429 -198356
12960 113948 -150953 66172 -286551 406371 275367 -174922 222940 242865 -96805 247761
12949 91473 -8828 -359412 -326177 102051 -120396 -97594 -81545 201227 168093 -69486 -101249
12938 -101249 39737 95195 -42713 96243 -79014 156583 122935 83165 24427 107041 85415
12927 85415 17653 397318 127588 76275 63080 193778 -65647 190519 38598 -180146 41385
$$ packed form
13008a89434k9576c1760j05339B33690F321K6016J42254o6793L06112b16225E7404
12996B27136D2479e0925B745f9542B06304N0222a27604K4393A4644K17177a018
12984A41199N4664c6203A25489N0539f0863B24829L7232G6314e1420B34163g4562
12972E6015h3279B4545a2232j10633p0206B6793f4164p1404A64806G1429a98356
12960A13948a50953F6172b86551D06371j31004a74922B22940J9925i6805B47761
12949I1473h828l50584L3235A02051a20396K2802J6049B01227l3134f9486l1763
12938a01249C9737N5458d2713I6243g9014A56583l3648l9770B4427Q2614k1626
12927H5415A7653L79665A27588n1313j3195J30698f5647A90519C8598a80146D1385
$$ plain form
12915 -190380 25251 -53198 -80068 -57133 206656 51623 221071 143955 198858 301581 148572
12903 35050 -135197 -10656 -134330 -120429 -222945 -17155 -158309 -306419 364193 43807
12892 -58378 -196422 -81547 -119026 -183861 -185702 58428 -43594 -124259 -154859 128625 -68999
12880 312935 164513 188847 -83311 15520 -257091 -8661 -13146 176046 145382 -138214 -352177
12869 -352177 -83148 -2790 42339 -89931 108569 169816 312803 295671 9068 20024 92441
12858 92441 142409 -119993 300366 112430 21685 231157 322979 276400 -20017 195198 149557
12847 149557 30543 136902 -32414 -168136 -173652 204389 -42370 141401 -11981 -44897 52233
12835 278489 5370 -208387 143589 149233 249356 -207885 70163 279973 122429 207597 199891
$$ packed form
12915a90380B5251e3198k6870K2935B06656E1623J69448p7116N4903J02723A48572
12903C5050a35197a0656j23674J3901j02516a7155j41154j48110C64193D3807
12892e8378j38044h1547l7479o4835j841E8428d3594q0665l0600A28625f8999
12880C12935j48422K4334h3311A5520b57091h661m485A76046l0664a38214k13963
12869c52177h3148b790D2339h9931A08569O1247J42987j7132I068J0956P2417
12858I2441M9968a19993C00366A12430B1685K09472R1822m6579b0017A95198m5641
12847A49557C0543J06359c2414j35722n516B04389d2370A41401a1981l2916E2233
12835B78489E370b08387A43589N644J00123b07885G0163K09810A22429Q5168p706
$$ plain form
12824 199891 -206849 182793 145637 4429 80910 100286 -52962 44065 15595 -3068 346506
12812 56237 275938 86925 161975 -69954 -37348 -142118 -139755 163879 -200880 -42639 -203761
12801 -203761 -137748 -151722 -29454 -35555 -218625 178972 -84830 -188625 184768 130379 28249
12789 -20668 -11130 85081 -121706 58098 58035 126223 15946 -10986 -41259 -210917 48061 -46562
12776 9455 -138228 -187009 281088 229910 223972 -49081 -89917 92205 53469 106065 -132144
12764 76503 142261 32392 -75485 -281226 -45358 -6837 -223787 352493 149027 146603 -768 203493
12751 147320 284953 152676 45558 204805 -22387 -117573 301616 203814 -89518 -157625 234630
12739 135003 35896 -199687 -102679 99506 39757 286499 119586 -116855 245226 12488
$$ packed form
12824A99891b06849A82793l7156D429P6481J9376e2962D4065A5595c068C46506
12812E6237K19701H6925P5050f9954L2606j04770K363A63879b00880d2639j61122
12801b03761O6013j3974b9454o101j83070A78972h4830j03795A84768n4389B8249
12789b0668R538H5081a21706E8098o3O8188A5946a0986l0273j69658D8061d6562
12776I455a38228m8781B81088n1178n938d9081m0836I2205l8736N2596a32144
12764G6503O5758C2392g5485k05741d5358f837k16950C52493A49027k424g68B03493
12751A47320J37633j32277D5558J59247b2387r5186C01616r7802h9518o8107B34630
12739A35003C5896a99687R7008I9506C9757K46742A19586a16855B45226A2488
$$ plain form
12728 11150 197344 -61882 206534 270429 76647 -190510 -268134 -118170 -203286 53081 53329
12717 53329 318422 30821 293451 232244 88697 250346 84179 -13136 17662 -61823 164909
12705 134500 16572 151180 -40872 71462 27261 48521 51837 204283 -88835 -255785 19374
12693 -30951 155255 133542 -192988 55237 -183063 -132732 -73601 -227109 31228 327081 234286
12682 234286 -147838 -175679 335201 57100 19732 425998 155221 -347847 58917 -7238 151191
12670 2379 110887 55972 153980 232262 157973 324490 78821 114064 152736 196431 187944 163840
12658 163840 262303 -133025 276611 -66194 320806 295885 -70839 257762 -232716 -226527 16543
12646 -64413 -198954 -196486 186670 173947 -84298 -115762 -160816 -178425 -142289 42661 -75244
$$ packed form
12728A1150J86194f1882B06534O3895G6647a90510p7624a18170q5116E3081K48
12717E3329K65093C0821K62630o1207H8697J61649H4179a3136A7662f1823A64909
12705A34500A6572J34608d0872G1462B7261K1260L316J52446h8835j66950A9374
12693c0951A55255k1713a92988E5237a83063N0331N9131j53508C1228K95853r2795
12682B34286a47838k7841C35201E7100A9732M06266A55221c47847E8917g238A51191
12670B379J08508n4915R8008P8282p4289J66517G8821L5243L8672M3695q487k4104
12658A63840R8463a33025B76611f6194C20806k4921g0839B57762b32716O189A6543
12646f4413j34541K468A86670j2723h4298l1464m5054j7609L6136D2661g5244
$$ plain form
12634 -174702 270240 121253 68571 8540 294238 295451 103512 134605 224105 -87705 30666
12622 -299952 309983 211653 286532 189021 239465 216825 28887 -74051 183705 -404201 180873
12610 -182680 -207194 -68512 171544 -60785 75349 -15824 185820 -113415 163666 356812
12600 356812 -2778 -44532 46650 -377493 -41240 77371 70023 82556 85731 98400 250389 51206
12587 20308 -26266 88440 256811 -103565 -297380 -76349 -64589 515384 -200847 121166
12576 -171220 208187 -201218 77436 172913 9740 241195 -32637 216956 80745 14624 -6727
12564 -57731 -76523 100020 -102148 339924 100197 9059 17070 254042 55382 -128437 -139276
12553 -139276 83843 -284697 30264 183179 252433 17053 202182 270004 31289 44270 352783
$$ packed form
12634a74702B70240A21253n2682H540K85698J213A03512L1093Q9500h7705C0666
12622b99952C09983r8330P4879r7511N0444k2640B8887g4051A83705d04201A80873
12610a82680k4514f8512A71544f0785G5349a5824A85820a13415A63666J93146
12600C56812b778m1754D6650c77493d1240G7371p348J2533L175J2669J51989E1206
12587B0308b6266H8440J68371a03565j93815g6349J1760E15384b00847A21166
12576a71220B08187b01218G7436R5477I740K31455c2637B16956H0745A4624f727
12564e7731j8792A00020a02148C39924A00197I059Q011K36972E5382a28437j0839
12553a39276H3843b84697C0264J52915O9254A7053J85129O7822C1289J2981L08513
$$ plain form
12542 352783 -22732 -191746 28759 93465 138607 -230126 123376 570 -169026 -212934 -26303
12530 87089 40546 92049 41261 -494603 58051 -271232 43457 -30347 353319 102814 -92845
12518 235287 -152607 -221121 -44058 49036 -205184 -287524 -73573 87840 188848 14693 58062
12507 58062 139437 61677 270906 -63777 20190 257439 106994 51278 48913 -221550 -33373
12495 274659 141444 134822 28827 -55916 300814 123366 115210 -511354 -8812 44640 -52299
12483 49171 -270724 171308 -340864 56565 411295 23439 116353 191513 -350159 -43828 -289537
12472 -289537 46274 25403 78278 8796 233864 -106620 39841 -130046 58231 143888 23839
12460 -78702 -1306 -66033 -109633 123490 -144777 -338742 -40777 441518 -207407 -49011 -147870
$$ packed form
12542C52783b2732j69014B8759O4706M5142b30126A23376E70a69026m3908b6303
12530H7089D0546N1503D1261d94603E8051b71232D3457c0347C53319A02814i2845
12518B35287a52607o8514d4058D9036b05184q2340g3573H7840J01008A4693M3369
12507E8062Q1375F1677K09229f3777B0190K37249A06994E1278k365b21550c3373
12495B74659j33215o622B8827e5916C00814A23366q156e11354h812D4640e2299
12483D9171b70724A71308c40864E6565L54730B3439R2914P5160c50159d3828k45709
12472b89537D6274k0871N2875H796K25068a06620C9841a30046E8231Q5657B3839
12460g8702a306o4727m3600A23490a44777j93965d0777D41518b07407d9011r8859
$$ plain form
12449 -147870 156344 -104531 137309 -196225 -8178 -147479 -302259 84906 -2965 -26012 151149
12437 -140320 26932 -55787 37288 104352 -251396 8527 198629 -291288 -306949 -88388 -43338
12425 -16457 -11400 -105817 -31471 -1110 -3474 361970 44619 -156793 -56523 -184549 288934
12413 -303006 242138 -181109 285314 -11026 215590 -203129 201531 343885 100416 200790
12403 200790 -425669 -10401 -124129 58499 -219730 195136 132545 -383928 254582 -242202
12392 -334418 12905 115499 -287178 -75494 44243 -15238 175852 382277 323217 34997 38867
12381 38867 153058 -115140 268316 114149 -135743 -159325 45248 93744 -234273 -3103 -228533
12370 -228533 205060 265729 198717 -341836 34490 85988 -30971 -46601 -21593 -346299 140520
$$ packed form
12449a47870A56344a04531A37309a96225h178j39301j54780H4906b965k3047A51149
12437a40320B6932e5787C7288O7064b51396H527J90102b91288j5661h8388d3338
12425a6457N057r4417c1471a110k364C61970D4619a56793e6523j28026B88934
12413c03006B42138a81109B85314a1026B15590b03129B01531J42354A00416J00374
12403B00790d25669a0401j13728E8499b19730A95136o2591c83928B54582b42202
12392c34418A2905J02594b87178g5494D4243a5238A75852K06425n9060C4997L870
12381C8867J14191a15140B68316A14149a35743k3582D5248M8496b34273c103k25430
12370b28533B05060O0669o7012c41836C4490N1498c0971j5630b1593l24706A40520
$$ plain form
12358 163361 14895 126990 1351 -50283 -104321 104450 -131261 174529 -314403 -22443 -118445
12347 -118445 176137 88855 67054 -273563 234458 -49898 127419 93508 57084 192673
12337 192673 40664 -105411 -64047 -142534 136302 18934 114029 -186247 262200 13707 147994
12326 147994 373023 310856 -358943 -256392 -126111 -325741 -128921 117564 -108464 -36682
12315 -8506 246906 104829 -127538 -7770 -52933 26701 121249 -150458 -30179 -19526 57761
12303 247780 -133478 -199840 -6668 -353676 56592 196065 -24398 169272 226210 -91061 -17892
12291 -57926 93298 228874 -45945 -122600 -5504 -113023 -88670 -65291 216495 243351 4957
12279 203850 -183284 199103 -43290 -25284 316113 -77806 232699 -48990 -153496 -113159
$$ packed form
12358A63361A4895J12095A351e0283n4038A04450a31261A74529c14403b2443r6002
12347a18445A76137q7282k1801b73563B34458d9898A27419l3911l6424J35589
12337A92673D0664a05411M1364p8487A36302A8934R5095a86247B62200A3707J34287
12326A47994K25029o2167c58943J02551a26111j99630a28921A17564a08464c6682
12315h506B46906A04829a27538g770m5163B6701R4548a50458c0179J0653E7761
12303B47780a33478o6362f668l47008E6592J39473b4398A69272N6938i1061a7892
12291e7926I3298J35576d5945p6655e504j07519K4353K3379B16495K6856D957
12279B03850a83284A99103d3290J8006C16113g7806B32699d8990j04506M0337
$$ plain form
12269 -113159 29031 171317 358004 288627 99944 159680 71681 -84143 112246 168062 -21024
12257 -147350 -45493 151407 -302164 -74588 200060 22767 -53961 166379 7314 106250 -113279
12245 256992 -67899 237409 216813 21282 -76937 -68895 135538 54068 -29796 -55470 369421
12233 280816 210650 53706 489958 296766 -175133 169503 244991 216402 -25697 27442 -200706
12221 175982 154095 -31996 -20148 81241 69530 1784 -160451 -157129 42644 -186515 124895
12209 74434 -239877 -435338 203654 222561 243298 101126 -45426 113376 232825 71625
12198 355218 271918 413654 92216 147598 327215 -269004 86142 315419 261047 125082
12187 249648 107004 95940 93448 48474 -58201 -12378 -34671 141596 118491 -11268 -100625
$$ packed form
12269a13159B9031J42286J86687o9377I9944N9736G1681h4143A12246N5816b1024
12257a47350d5493A51407c02164g4588B00060B2767e3961A66379G314R8936a13279
12245B56992f7899B37409k0596B1282g6937Q042A35538E4068b9796k5674C69421
12233B80816p0166E3706M36252j93192a75133A69503P5488k8589b5697B7442b00706
12221A75982k1887c1996J1848H1241j1711A784a60451L322D2644a86515A24895
12209G4434b39877j95461B03654J8907K0737A01126d5426A13376J19449G1625
12198C55218q3300J41736I2216N5382J79617b69004H6142K29277n4372A25082
12187B49648A07004j1064k492m4974e8201a2378k2293A41596k3105a1268q9357
$$ plain form
12176 -100625 -26380 -15516 61797 225270 -175947 79479 280146 26223 -42679 132886 -74067
12164 -39542 172583 -214688 28390 5348 -300147 -21374 147722 -109953 -311597 -191138
12154 -191138 -168326 -148339 -185763 -3139 342875 54199 -14369 261895 95977 159896 144587
12143 144587 113542 33115 238586 -394730 212905 26456 72891 33887 -155476 -46823 36153
12131 229356 31771 66067 -167550 148679 10984 -205838 197600 100933 -7988 82351 309935
12120 309935 72405 -20295 -96670 126646 -101393 14807 -134610 169537 102856 298074
12110 298074 108527 861 27275 58165 -40749 -56306 -179684 12827 -15155 -246991 -156943
12099 -156943 -139789 55066 -45365 328873 -216217 96591 37368 501233 330527 -296908
$$ packed form
12176a00625b6380J0864F1797J63473a75947G9479K00667B6223d2679A32886g4067
12164c9542A72583b14688B8390E348c00147b1374A47722a09953k01644J20459
12154a91138K2812J9987l7424c139C42875E4199a4369B61895I5977O3919j5309
12143A44587l1045C3115K05471c94730B12905B6456M6435C3887a55476d6823C6153
12131B29356C1771L4296a67550A48679A0984b05838A97600r6667g988H2351K27584
12120C09935G2405b0295p6375A26646a01393A4807a34610A69537o6681J95218
12110B98074A08527H61K6414L0890d0749j5557j23378A2827a5155k31836R0048
12099a56943J7154E5066d5365C28873b16217I6591C7368M63865j70706b96908
$$ plain form
12088 -121806 79004 144539 -274691 306324 126144 235483 -27409 69405 -13739 99239 -29380
12076 155054 15276 -99987 6152 -46925 -182731 90180 -5665 -102697 150406 73341 -9934 -139532
12064 -139532 -146791 -45688 192661 203863 83407 125804 -352262 -77225 81149 10228 -123244
12052 277852 167096 -24307 72895 -66462 -274398 -40109 -106573 -99048 -142229 20175 752 376147
12040 376147 264750 358030 245221 86279 -51208 -161874 -186844 -199969 65239 368177 -17228
12028 231732 151820 -132311 -13019 -125071 162078 -22494 -94336 65055 -50469 -196809 -129100
12017 -129100 -132589 -353816 132543 -86429 -47143 238003 156575 -97193 61302 28021 41889
12006 41889 139808 -137735 8860 -142769 -45139 147031 -331971 89158 -74403 -18886 -432645
$$ packed form
12088a21806G9004O5535b74691C06324A26144J09339b7409F9405a3739I9239b9380
12076A55054A5276i9987F152d6925j35806I0180e665r7032A50406G3341i934j29598
12064a39532p259d5688A92661J1202H3407M2397c52262g7225H1149A0228a23244
12052B77852j10756b4307G2895f6462k07936d0109o6464P525m3181B0175G52L75395
12040C76147j11397R3280j12809H6279e1208j10666k4970j3125F5239L02938a7228
12028B31732p9912a32311a3019j12052A62078b2494p1842F5055e0469j46340O7709
12017a29100l489k21227A32543h6429L9286B38003q1428i7193F1302B8021J3868
12006D1889R7919a37735H860a42769d5139A47031c31971H9158g4403a8886m13759
$$ plain form
11995 -432645 -191654 -270830 -138533 -189598 103537 235869 -197341 146023 49780 -208133
11984 27858 -11101 170453 209432 -179161 63086 -262642 -115988 -202074 -260866 153944 257594
11973 257594 -135193 -247772 207608 -3985 -156766 100149 -276419 108021 117363 10746
11962 -218715 -91336 263279 -410050 315472 -84696 -205257 227560 99909 105446 -186939
11951 133830 94997 -60081 38355 18076 141184 -243661 -145020 175039 67521 271899 -302619
11939 -111696 -144656 123584 163814 -221880 -112066 238535 -90281 64930 13046 -366629
11928 206880 -197546 -143409 -215440 -13257 -109801 187872 -78738 -121975 83510 253494 -148539
11916 -115317 205895 224951 271756 -180165 -332316 117794 83224 -64420 -189351 -203378
$$ packed form
11995d32645a91654p9176J32297n1065A03537J32332a97341A46023D9780b08133
11984B7858a1101A70453L8979a79161F3086b62642a15988q6086n8792A53944J03650
11973B57594a35193j12579B07608c985j52781A00149b76419A08021R342A0746
11962b18715i1336B63279d10050C15472h4696j20561B27560I9909N537a86939
11951A33830l8833f0081C8355A8076J23108b43661R8641A75039F7521K04378c02619
11939a11696l2960A23584M0230b21880J09814B38535i0281F4930A3046c66629
11928B06880a97546N4137p2031a3257r6544A87872g8738m3237H3510J69984a48539
11916a15317B05895J9056M6805a80165j52151A17794l4570f4420j24931j4027
$$ plain form
11906 -203378 -86678 -24348 -198295 27786 -386759 59349 -14107 -229810 -93854 -377641 -94920
11894 206512 -155257 -41079 22038 -94149 31791 16367 -43218 156446 -92625 17354 50180
11883 50180 106766 79636 -59782 5373 -179514 139217 228092 24122 -45347 144508 -312818
11871 -97506 -86181 -140519 177806 48636 226251 -123405 3406 23809 193456 -156591 -30565
11859 -165378 -78702 -58029 169245 45954 126911 105884 51814 -56508 33674 -261237 199191
11847 242175 -84524 76902 -59577 -194332 27679 8502 -65927 70350 60034 -164793 -12472
11835 -283703 226676 -113938 -154647 123255 -95290 -49376 -198817 -173880 137390 -240460
11824 18266 -173739 228406 -55853 -141380 -123338 -117029 -111457 -108172 -124803 -93209 -110772 136362
$$ packed form
11906b03378h6678b4348j73947B7786c86759E9349a4107k15703i3854k83787i4920
11894B06512a55257d1079B2038i4149C1791j5424d3218A56446i2625A7354L2826
11883E0180N6586k7130e9782E373a79514A39217Q8875B4122d5347A44508c12818
11871i7506J1325n4338A77806D8636J77615a23405C406K0403J69647a56591c0565
11859a65378g8702K0673A69245D5954Q0957k1027E1814e6508C3674b61237A99191
11847B42175h4524G6902e9577j34755B7679H502f5927G0350j0316a64793a2472
11835b83703B26676a13938m0709A23255i5290M5914j49441K4937A37390b40460
11824A8266a73739B28406e5853q5527J8042O309N572L285j6631L1594j7563A36362
$$ plain form
11811 -272496 78114 -188531 187036 67196 -369466 29699 -19503 -105236 -266420 -110941
11800 -43108 -74783 63102 123128 277563 -39491 8288 137801 -9956 386632 -19714 -4043 38176
11787 -55288 72069 -88717 341584 242705 -15777 151922 51965 14916 165851 -99705 157189
11775 -220346 -96238 -464553 -229021 112827 -234372 54143 92030 41908 44198 16441 -167594
11763 -114268 -31241 -79044 62547 -40946 99421 58442 223827 196055 -51138 -25646 -218270
11752 -218270 104729 -217845 -44980 123365 310284 99043 -268898 -59447 173103 -114742
11741 -161026 -147438 -17444 39900 -37395 233861 105317 -33262 -290138 -137246 111649
11730 -286473 -155275 -6991 321300 -113692 -22356 -88919 -246542 -113692 124731 134148 50683
$$ packed form
11811b72496G8114a88531A87036F7196c69466B9699a9503q5733j61184a10941
11800d3108l1675F3102O0026J54435c9491H288J29513i956C86632a9714d043C8176
11787e5288G2069h8717C41584r8879a5777A51922E1965A4916J50935i9705A57189
11775b20346i6238l68315b29021A12827b34372E4143L7887D1908K290A6441a67594
11763a14268c1241m7803F2547d0946I9421m0979J65385k7772e1138K5492j92624
11752b18270A04729b17845d4980A23365J86919I9043b68898e9447A73103a14742
11741a61026J3588a7444C9900c7395B33861A05317c3262k56876a37246A11649
11730b86473J31198f991C21300a13692b2356o6563j57623a13692A24731R417E0683
$$ plain form
11718 -20995 -208588 -47615 -194066 4206 143792 196600 -153851 65179 -111157 -11970 55609
11706 63182 133526 189146 -294283 46277 -141740 70069 73084 48223 -41711 -136804 -58872
11694 241489 -447496 400251 -4016 -210392 409772 95996 295691 14321 19682 54151 17362
11682 -37648 -66473 89291 -1695 207210 -57371 5636 186034 325248 -88708 85512 23522
11670 -4527 174120 -7539 133598 -143499 172102 81467 -61490 34695 -113440 -151286 -157185
11659 -157185 28159 -358870 -61553 -190328 82598 -54507 109118 -251959 -246143 -128718 179784
11647 234043 -73464 -149012 -177476 218047 332098 -258407 42688 -50678 -49277 -448192 6154
11635 398398 -143957 -53458 502403 54496 70563 -76100 367080 160489 -169984 290452
$$ packed form
11718b0995j87593d7615j46451D206J39586N2808a53851F5179a11157a1970E5609
11706F3182P0344N5620b94283D6277a41740G0069L015k4861d1711r5093e8872
11694B41489d47496D00251d016k06376D09772I5996J99695A4321N361L4469A7362
11682c7648k8825H9291a695B07210e7371E636J80398J39214h8708H5512B3522
11670d527A74120g539A33598a43499A72102H1467f1490C4695a13440l7846n899
11659a57185B8159c58870f1553j28775H2598e4507A09118b51959N816J17425A79784
11647B34043g3464p5548k8464B18047J14051b58407D2688e0678J401l98915F154
11635C98398a43957e3458E02403E4496J6067g6100C67080A60489a69984B90452
$$ plain form
11624 -67216 384484 -24854 -324932 399771 -2440 251885 -369599 -53607 -36692 -15996 67932
11612 250497 83609 -236891 204348 44403 173511 164855 2119 139697 124557 11846 190483
11601 190483 79896 144016 -87618 -61377 -72088 -43917 -39574 125415 -63293 162342 -176817
11589 225491 -114873 103594 -95980 377640 -377868 -89602 16058 71478 220459 -88735
11578 97076 224755 80895 193704 153344 75412 -100735 81145 121844 113672 152983 -70541
11566 127341 -118942 272038 -68123 -53920 176509 317688 323136 -157245 6654 17397 54953
11555 54953 126771 170618 101257 95115 114423 165032 -38087 202212 352312 111696 -62979
11543 -340161 -112992 133319 232637 249953 153314 -80187 31454 -120327 -338317 286628
$$ packed form
11624f7216C84484b4854l00078C99771b440B51885c69599e3607J6915a5996F7932
11612B50497H3609b36891B04348D4403J29108q656B119J37578j5140A1846J78637
11601A90483G9896O4120h7618K6241j0711K8171M343A25415f3293A62342a76817
11589B25491a14873A03594i5980C77640c77868h9602A6058N5420J48981h8735
11578I7076J27679H0895J12809m0360G5412a00735H1145M0699q172L9311g0541
11566A27341a18942B72038f8123J4203A76509J41179N448a57245F654J0743L7556
11555E4953P1818M3847o9361o142J9308N0609c8087B02212J50100A11696f2979
11543c40161a12992A33319R9318J7316r6639h0187C1454a20327k17990B86628
$$ plain form
11532 56107 -99546 65676 341688 311601 -206307 -25158 261079 42195 129255 -115851 35222
11520 182089 106282 145797 -44755 55860 -63434 28269 135369 -25030 -251437 -144321 350984
11508 235366 -206388 2960 225566 -49035 359440 80860 295619 224201 189661 -402697 262742
11496 65445 103106 149880 29615 -10208 153788 -227190 -59304 89496 -39969 313185 197656
11485 197656 11860 12418 -63176 179881 184348 104395 -171031 -71743 218213 108851 226021
11474 226021 145019 86006 262743 42386 -88511 59552 317946 264462 5508 -11330 8943
11462 -194694 106803 113793 -16998 48911 465101 8291 -107087 -313929 -24957 -67514 -3798
11450 10067 58088 -289415 -34696 -535 -26107 -80592 -28436 -87496 -111743 83927 90459 172991
$$ packed form
11532E6107i9546F5676K76012l0087b06307b5158B61079D2195Q7060a15851C5222
11520A82089p5807L9515d4755E5860f3434B8269J07100b5030k26407J07116C50984
11508B35366b06388B960K22606d9035C59440H0860K14759p1418l4540d02697B62742
11496F5445L7661M6774B9615a0208A53788b27190e9304H9496c9969C13185j15529
11485A97656A1860N58f3176A79881M467p9953a71031g1743B18213A08851J17170
11474B26021q1002n9013J76737D2386h8511E9552K58394n3484E508a1330H943
11462a94694A06803O990a6998D8911M16190H291a07087k06842b4957m2557c798
11450A0067M8021b89415c4696e35k5572n4485b8436n9060k4247H3927O532Q2532
$$ plain form
11438 172991 287128 -978 -189533 249712 4403 364457 -48650 76199 34531 -26181 -32305
11427 -32305 -124427 4133 -2424 -125327 107837 -227113 280578 32648 -93408 -18443 14376
11415 -160242 343543 215017 -60340 -199270 -114360 -138279 -3942 111241 -42961 8567 -91541
11403 -73929 3803 -135945 46954 -205641 -101097 -110749 -126080 154781 112596 -55088 148144
11391 223067 -103625 -198350 81676 -220134 16835 -83687 -54502 73954 -351473 -90756 -16069
11379 -213956 329921 56025 -22992 250069 38324 -324082 -12565 29435 20652 94062 14178
11367 312545 -172529 317281 -6017 73260 -81019 87268 61930 -244194 -264996 -161327 95266
11355 -65962 -53055 34909 68984 -203767 169883 -105567 41170 44395 58011 -115194 -86255
$$ packed form
11438A72991J14137i78j88555B49712D403L60054d8650G6199C4531b6181o124
11427c2305r2122D133b424j22903A07837b27113B80578C2648i3408a8443A4376
11415a60242C43543j28526f0340j38930Q4910k3919c942A11241d2961H567i1541
11403g3929C803a35945D6954b05641a01097r652j5331A54781m2185e5088A48144
11391B23067a03625r4725H1676b20134A6835h3687K9185G3954c51473i0756a6069
11379b13956C29921E6025b2992B50069C8324c24082a2565B9435q783P3410A4178
11367C12545a72529C17281f017G3260h1019H7268k5338b44194k0802J03669I5266
11355f5962J2907C4909L4075b03767A69883a05567D1170L225J3616a15194K8939
$$ plain form
11344 -86255 211962 115043 132503 29967 22767 221015 -243062 -51578 84361 53785 249251
11333 249251 147610 -51711 -84055 -153949 45159 145866 -77005 -116989 -49649 16725 45802
11322 45802 -5172 -123612 -163855 -101224 79342 -104206 -45842 -134699 -191424 114209 15508
11310 -306738 -151137 119179 -10138 87591 52427 -133173 262822 -218288 -229137 97958
11299 119254 -157232 69187 -97786 -179554 -118226 -53065 51130 34629 -35361 312151 8256
11287 41395 -114507 -72614 184484 371523 8199 -43439 -181461 -165433 228586 -76082 -84929
11276 -84929 71569 102798 -268685 -163565 -64641 -467290 33488 -68113 111331 119308 74459
11265 74459 -100379 151141 -877 165874 -159697 13320 -47202 108964 -373343 -221804 -61213
$$ packed form
11344h6255B11962r6919J7460B9967p200J98248b43062e1578H4361l0576J95466
11333B49251j01641e1711l2344o9894D5159J00707g7005l9984d9649A6725K9077
11322D5802e172j18440m0243O2631G9342a04206d5842q8857n6725A14209A5508
11310c06738a51137A19179a0138H7591l5164a33173B62822b18288j0849I7958
11299A19254a57232F9187i7786q1768O1328e3065E1130j6501c5361C12151H256
11287D1395a14507M1893A84484J87039H199d3439j38022J6028B28586g6082q847
11276h4929G1569L1229b68685J05120f4641m02649C3488f8113A11331P977m4849
11265G4459a00379A51141h77A65874a59697A3320d7202A08964c73343J51539f1213
$$ plain form
11253 -277990 39357 181710 -125928 112508 104190 -167918 -48340 42371 35827 -317887 -244776
11242 -244776 12466 -264822 300824 -104508 58345 -57804 -103881 36005 202330 -92382 -249726
11231 -249726 -25636 216466 46607 97612 -35734 -306473 -373717 -105972 -282227 -92725 -146793
11220 -146793 -284951 -82483 88480 45198 147243 142434 94150 10480 -73512 59415 64244
11209 64244 -106687 142651 108858 42442 -297394 -194109 2044 -156941 139804 -105100
11198 -422834 53254 -30928 -122532 -257226 71416 237869 6312 -92793 144929 -300589 54940
11186 -176306 80585 -91947 260546 202857 146645 -239933 -258007 -125842 -111790 50921 -207675
11174 211855 -523189 39098 -237975 -99645 -101880 40270 -156517 -51435 -182978 -281976 -201624
$$ packed form
11253b77990C9357J42353a25928A12508q318a67918d8340D2371o544c17887P3111
11242b44776A2466b64822C00824a04508E8345e7804m6077C6005J66325i2382j57344
11231b49726b5636B16466D6607N1005c5734k70739o7244a05972j76255i2725n4068
11220a46793j38158h2483H8480m3282J02045m809m8284A0480g3512E9415M829
11209F4244a06687A42651l3793D2442b97394J03285B044a56941A39804a05100
11198d22834E3254c0928r1604j34694G1416J66453F312i2793A44929c00589E4940
11186a76306H0585i1947B60546n7689n6212b39933j8074a25842J4052E0921b07675
11174B11855e23189C9098b37975i9645k235D0270a56517e1435j31543r8998Q0352
$$ plain form
11163 -201624 -87451 195875 -19043 -158776 -46791 -185062 -77536 283273 100539 -120339
11152 105068 -44635 -154684 -83802 32800 -359305 107326 -172192 -1846 135755 -8817 -151234
11141 -151234 -128922 -111080 -44423 173202 -146836 28437 212565 -114455 66032 458206
11131 458206 25354 321482 -56951 39456 199345 4578 -2082 -48989 -354839 -167072 -172604
11120 -172604 122626 -290577 -336411 -178452 211628 -347221 2299 200584 -44143 170685
11109 -141313 -335778 342972 67694 -33124 37384 240461 231212 -61914 243684 145440 61012
11097 130346 -51508 84194 225688 -64014 302564 182062 181318 214773 59238 324358 323585
11086 323585 406180 22092 140385 98277 -5135 241226 -38785 207973 263161 219183 152799
$$ packed form
11163b01624h7451A95875a9043j39733d6791j38271g7536B83273A00539a20339
11152A05068d4635j10049P0882C2800c59305A07326a72192a846A35755h817j42417
11141a51234K2312J7842d4423A73202a46836B8437J84128a14455F6032L92174
11131D58206B5354K96128e6951C9456J59889D578b082m6907l05850a67072n532
11120a72604A22626b90577m5834J57959B11628c47221B299J98285d4143A70685
11109a41313j94465C42972F7694c3124C7384K03077r249f1914B43684r8244F1012
11097A30346e1508H4194J41494f4014C02564j20502p44L3455E9238K65120p73
11086C23585Q2595B2092J18293m2108e135B41226c8785B07973N5188m3978o6384
$$ plain form
11075 152799 229104 116768 134168 249244 301380 314448 176154 333016 242367 489525
11065 489525 252659 322471 363152 333009 537079 534202 245744 189376 374250 433981 276379
11054 276379 583266 368695 439230 504851 534315 631074 617786 614620 550757 729502 427568
11043 427568 409807 730054 195799 301722 591096 240254 230463 630727 624167 727362
11033 727362 369485 219003 508438 774301 447760 403747 166459 368081 414441 714219
11023 714219 467612 625626 600729 344941 362802 225799 151194 140284 342102 469368
11013 469368 372769 -33501 641185 424057 405117 505102 291686 297830 274891 580513 451520
11002 451520 285352 79165 519319 593038 337627 376073 665419 370970 257543 436904
$$ packed form
11075A52799P6305j12336J7400J15076N2136J3068j38294J56862r0649K47158
11065D89525k36866O9812M0681l0143K04070k877B45744n6368J84874N9731j57602
11054B76379L06887k14571P0535O5621K9464R6759j3288l166o3863J78745l01934
11043D27568j7761L20247A95799J05923K89374B40254r791M00264o560J03195
11033G27362l57877j50482K89435K65863l26541m4013A66459K01622M6360K99778
11023G14219k46607J58014k4897k55788J7861j37003p4605j0910K01818J27266
11013D69368r6599c3501F41185k17128j8940R9985k13416O144k2939L05622j28993
11002D51520j66168G9165M40154P3719k55411L8446K89346k94449j13427J79361
$$ plain form
10992 436904 345483 504616 481091 274762 553824 593837 887075 621538 701083 663773
10982 663773 887914 667897 743677 816412 971767 967171 1149678 1481356 1574834 1460844
10972 1460844 1497585 2025325 1673796 1488286 1675457 1423514 1374862 1238389 1271320 1118905
10962 1118905 1005705 1083745 1196024 1045935 1171936 1342326 1389624 1186920 1524795 1130483
10952 1130483 821287 785569 426501 850652 107182 406094 324513 501747 119224 188464
10942 188464 36259 -31291 87384 112875 5898 -68731 84336 107633 274862 88327 15959
10930 26380 -81488 24444 132890 169615 -170780 -212301 52091 200071 76960 -22044 -97315
10919 -97315 -458907 -31287 193884 -346107 178345 -37776 157021 67761 86151 -102194
$$ packed form
10992D36904r1421J59133k3525k06329K79062M0013K93238k65537P9545l7310
10982F63773K24141k20017P5780P2735J55355m596J82507L31678R3478j13990
10972A460844L6741N27740l51529j85510J87171k51943m8652j36473L2931j52415
10962A118905j13200P8040J12279j50089J26001J70390M7298k02704L37875l94312
10952A130483l09196l5718l59068M24151A07182K98912q1581J77234A19224O9240
10942A88464C6259c1291H7384K5491E898f8731H4336K3297J67229H8327A5959
10930B6380h1488B4444J08446L6725a70780m1521E2091J47980G6960b2044p5271
10919i7315l61592c1287A93884c46107A78345c7776A57021F7761J8390a02194
$$ plain form
10908 112709 -240928 23905 54611 78598 -122947 131301 -305948 -7889 198820 -161530
10897 -213961 261319 -71167 -212566 22236 -34744 -123022 92198 3028 -481 -221178 -271714
10886 -271714 36975 -90054 975 188870 172384 -24103 -264837 166760 -11364 63671 -117599
10874 222164 59611 -165927 212468 245386 -269119 -73329 15935 53891 -24086 -143400 -144850
10863 -144850 -214230 -126500 -201205 -110651 -68406 -162367 326645 -333851 8856 -80490 195251
10851 -51595 167876 -373312 7151 23794 -234862 103394 -114027 -49799 -169229 -100452 11560
10839 81682 215091 -14175 -22308 -196370 -103986 -6584 93692 442665 26769 -87872 163958
10827 -126704 23176 40191 -226436 -84189 -393307 -246274 86553 -112689 108490 -23795
$$ packed form
10908A12709b40928B3905L0706K3987a22947A31301c05948g889A98820a61530
10897b13961B61319g1167j41399B2236c4744q8278I2198C028d81k20697n0536
10886b71714C6975i0054I75J87895j6486b4103k40734A66760a1364F3671a17599
10874B22164E9611a65927B12468L2918b69119g3329A5935L7956b4086j19314j450
10863a44850o9380Q7730p4705R0554M2245r3961C26645c33851H856h0490A95251
10851e1595A67876c73312G151J6643b34862A03394a14027d9799j19430O8777A1560
10839H1682J33409a4175q133j74062R2384f584I3692L48973B6769h7872A63958
10827a26704B3176J7015b26436h4189l09118J47033H6553a12689A08490b3795
$$ plain form
10816 -36197 10460 -402851 14653 -177064 224990 -166366 7474 79705 -5552 23879 117892
10805 117892 128205 -215168 87073 129458 191911 -43813 242655 -239171 151888 88956 -352557
10793 -45889 127381 31052 -147928 -106743 -54793 25369 28021 -87084 21688 139480 -62036
10781 -145120 -17558 206921 82977 -225363 -74191 -93532 -202226 -122948 -290714 -130007
10770 -65552 157128 -28811 -89392 48796 15074 -59790 112026 294864 -87312 43152 -132268
10758 -279305 -127680 -189571 -120189 -86604 -102871 12365 185013 -108733 -91507 134112 -20695
10746 285300 275563 47188 -47051 -109746 -147522 -157903 -35648 -228000 -255441 -96543 -14072
10734 -117224 -107304 -78787 -132336 -78806 88316 55348 -15622 33409 6216 -243890 -53131 -35696
$$ packed form
10816c6197A0460d02851A4653a77064B24990a66366G474P2231e552B3879R4013
10805A17892J0313b15168H7073M2385O2453d3813B42655b39171A51888o2932c52557
10793d5889A27381C1052a47928M1185N1950B5369K652h7084B1688J17792f2036
10781a45120a7558B06921H2977b25363g4191j9341j08694P9278j67766a30007
10770f5552A57128b8811o0581D8796A5074e9790A12026J82838h7312D3152a32268
10758b79305a27680o1891O9382L3585j6267A2365J72648a08733J7226A34112b0695
10746B85300r737D7188d7051o2695l7776j0381c5648j92352k7441i6543a4072
10734a17224R920K8517n3549N3530H8316l2968a5622C3409F216b43890e3131J7435
$$ plain form
10722 -35696 -72193 -157786 -220785 150235 204993 -166409 -40638 -197039 -115367 -126796 78709
10710 160775 -115215 83389 146384 109483 -109000 -285020 -34600 133239 -74632 -13936 160263
10698 -292854 -138968 -171910 -200534 17839 -12175 69659 -245148 66471 -333793 -200099 14378
10686 36563 -118636 -132310 -30539 38453 -282723 -16344 -73899 11883 -108987 173245 -104567
10674 -34912 -116376 -195470 -181731 257186 -22446 -50748 -217859 26951 77902 -178857 -85101
10662 -111527 -205766 -106262 123058 235116 -39981 93601 -293214 -76834 -51123 -350409 -188376
10651 -188376 2113 -90996 -296211 -467338 -425851 16782 61487 -140297 -66164 -164306 -52011
10639 -164894 191362 -303606 -307948 177672 1259 -37403 -267654 -52985 -334829 76561 356127
$$ packed form
10722c5696l6497q5593o2999A50235N4758a66409d0638j56401Q1672j1429G8709
10710A60775a15215H3389O2995l6901a09000j76020c4600A33239g4632a3936A60263
10698b92854a38968l2942k8624A7839a2175F9659b45148F6471c33793J33694A4378
10686C6563a18636j3674c0539C8453b82723a6344n7555A1883a08987A73245a04567
10674c4912q1464p9094J3739B57186b2446k8302j67111B6951N0951a78857h5101
10662a11527r4239R9504A23058J12058c9981I3601b93214g6834K5711k99286J62033
10651a88376B113i0996k05215j71127M1487A6782M4705a40297f6164r8142e2011
10639a64894A91362c03606m342A77672A259c7403k30251e2985k81844G6561K79566
$$ plain form
10628 356127 -283575 83231 -35725 26795 -196689 -181688 317233 330121 19818 -261614 -188469
10617 -188469 -93890 -10014 149847 -18831 -136711 194712 7179 156446 -233481 -253403 282282
10605 157679 -159614 -95315 55943 -75394 -56176 -77175 7326 -5235 116263 -163170 -172811
10594 -172811 25698 209664 73622 -90735 -184955 -1891 209660 -147303 37359 283796 -86230
10582 19461 99786 34410 -115092 63603 240337 -12289 -158744 -22855 -237883 -182118 -16104
10570 114428 -52277 -38953 5564 29469 -6698 172592 329757 212383 141054 151704 -181130
10558 -241375 170920 -2384 -207919 70169 -405854 -76474 233725 117206 -156892 11399
10547 66581 -195942 141127 -119619 -34088 256247 142004 -60985 23129 154009 -4688 -43850
$$ packed form
10628C56127b83575H3231c5725B6795a96689J5001C17233J2888A9818b61614P3145
10617a88469i3890a0014A49847a8831j17880A94712G179J49267b33481j9922B82282
10605A57679a59614O4299E5943g5394J9218k0999G326e235A16263a63170r641
10594a72811B5698J83966G3622i0735r4220a891B09660a47303C7359K46437h6230
10582A9461Q0325C4410a15092F3603J76734a2289j46455b2855k15028N5765a6104
10570A14428e2277J3324E564K3905f698A72592J57165j17374p1329J0650a81130
10558b41375A70920b384k05535G0169d05854g6474B33725j16519a56892A1399
10547F6581a95942A41127a19619c4088B56247j14243f0985B3129J30880d688l9162
$$ plain form
10536 -43850 -244282 150203 69932 -207166 142410 80738 -94294 179184 -40183 50867 -57144
10524 -57231 253455 6093 -298959 -128185 -256743 -21583 -84841 -36062 91737 -38888 -375532
10513 -375532 -270105 -346411 -384641 22350 3784 -61926 436432 200690 -13457 89891 6381
10501 -162465 -134681 -137500 -3136 154096 -272954 -198675 9608 184954 -180200 -31415 -78991
10490 -78991 -545999 -196964 87951 -31834 286438 177771 67204 685973 373595 182612
10479 129239 7563 -199351 -50697 157077 -189518 -279434 -281226 311577 199 173052 132048
10468 132048 -60224 148295 -207179 -288855 70677 21091 157763 82248 42491 42226 -57890
10456 -75267 139169 -194632 155046 218616 20161 -131278 -127846 -198897 -102801 -182813 67893
$$ packed form
10536d3850k00432A50203F9932b07166A42410o1672i4294A79184d0183E0867e7144
10524e7231B53455F093b98959a28185j28558b1583o3258c6062I1737c8888l36644
10513c75532J05427p6306l8230B2350C784f1926D36432B00690a3457H9891F381
10501a62465K7784k819c136A54096b72954P4279I608J75346a80200c1415m7576
10490g8991m67008a96964H7951c1834B86438j08667F7204O18769l12378A82612
10479A29239G563a99351e0697A57077a89518q9916j792C11577A99J72853m1004
10468A32048f0224A48295b07179q1676G0677B1091J36672p5515l9757k65e7890
10456g5267A39169a94632A55046O3570B0161a31278L432p1051R6096q0012F7893
$$ plain form
10444 150269 -96453 107832 -83028 -140375 -97354 190997 -251831 457801 70332 -315703
10433 -236364 227319 136655 -35083 6755 -118918 -93313 -369806 -130226 6758 -13644 87048
10421 -311825 -80388 113611 -44333 130187 -111628 -151826 -166074 -74632 -149654 212341 37176
10409 -27390 -303442 114192 152118 92519 230618 -184399 -101882 -291758 -162324 -51377
10398 -266877 -2482 -392706 61476 219636 -418484 42760 404886 187457 162501 -101305
10387 402895 59661 30378 -117110 266135 47708 -1280 -40438 112061 456337 -23082 -221829
10376 -221829 58832 -133745 130172 393277 -89099 324701 181110 16307 437839 601650
10366 601650 483394 264971 -159441 72230 119416 318649 210921 26440 -314848 57806
$$ packed form
10444A50269i6453A07832h3028n7347M3021A90997b51831D57801G0332c15703
10433b36364B27319r0664c5083F755a18918K5605k76493a30226F758a3644H7048
10421c11825h0388A13611d4333A30187a11628m0198j4248g4632p5022B12341C7176
10409b7390k76052A14192L7926n9599J38099a84399Q2517j89876J29434e1377
10398b66877b482l90224F1476J58160d18484D2760L62126A87457k4956a01305
10387D02895E9661k9283a17110B66135D7708a280l9158A12061L44276b3082j98747
10376b21829E8832a33745A30172K63105h9099C24701j43591A6307M21532J63811
10366F01650j18256k18423a59441G2230M7186J99233j07728B6440c14848E7806
$$ plain form
10355 163847 -102505 65147 361827 137179 366913 495333 258145 207402 154987 159446
10345 159446 423053 191647 398988 239609 484606 133433 408675 249427 37974 185288
10335 185288 414794 -29052 -33155 377319 286078 233033 322242 227417 -153017 -91547 17235
10323 -124224 205286 -61093 192436 191311 -106909 177634 82488 100747 -2635 -39372 337375
10311 -89550 -10493 83699 -82617 -78093 -33362 74903 157109 297186 -95040 -23110 -363298
10300 -363298 11210 79663 -180831 -76428 274871 247293 -170392 -109392 -234713 -153537 15750
10288 192519 -141023 152092 -252883 -130065 -49136 -10009 -377052 235478 48207 -205560
10277 407 -168472 -281974 -89321 -52212 -368988 -220669 -360970 39427 -50925 -42663 76966
$$ packed form
10355A63847a02505F5147K96680A37179K29734J28420k37188n0743n2415M459
10345A59446K63607A91647K07341j59379K44997A33433K75242j59248C7974J47314
10335A85288K29506b9052m103C77319r1241n3045Q9209r4825a53017O1470A7235
10323a24224B05286f1093A92436j125a06909A77634H2488J8259b635l6737C37375
10311h9550a0493H3699h2617M524c3362G4903Q2206J40077i5040b3110l40188
10300c63298A1210O8453a80831g6428B74871k7578a70392O1000j25321Q1176A5750
10288A92519a41023A52092b52883J22818d9136a0009l67043B35478D8207b05560
10277D07a68472j13502h9321L7109l16776J48319j40301C9427e0925Q262G6966
$$ plain form
10265 166741 -99267 256307 302981 266492 204503 32978 290586 -164602 265769 -174850
10254 -137871 131761 -20858 55968 -138150 405704 273303 -104570 118749 193186 -162194
10243 -307063 -113731 316913 145674 -61405 -74219 -35659 85576 152870 71940 -66287 -70567
10232 -70567 6913 -304254 169902 193534 -12425 -134406 52317 58344 -268744 -204474 -133883
10221 -133883 194587 -106137 103676 108987 -147523 223217 -449888 -328080 -65391 1030
10210 -154516 -138318 174145 -115002 156978 -541822 -269217 -178897 -31532 58062 -115383
10199 -161520 -105156 -28824 142661 51391 -134155 139778 118471 -85839 -91583 -67872 -44623
10188 -44623 148096 157980 -123709 -40309 -61954 115521 -87427 -103798 -106105 -361199 -60424
$$ packed form
10265A66741i9267B56307M6674l6489o1989C2978K57608a64602B65769a74850
10254a37871A31761b0858E5968a38150D05704j32401a04570A18749P4437a62194
10243c07063a13731C16913A45674f1405j2814c5659H5576O7294G1940f6287m280
10232g0567F913c04254A69902K3632a2425j21981E2317O027b68744O4270P0591
10221a33883A94587a06137A03676N311a47523B23217d49888J21808f5391A030
10210a54516J6198A74145a15002A56978e41822b69217R0320c1532E8062a15383
10199a61520N6364b8824A42661E1391a34155A39778k1307h5839n744K3711K3249
10188d4623A48096R884a23709d0309k1645A15521h7427j6371k307k55094f0424
$$ plain form
10176 245175 -203110 -214541 54296 34076 -64309 91710 105865 258553 33741 -194491 -155496
10165 -155496 173413 26767 180895 -31834 -24669 102666 -146226 -389229 -56913 -119521 -87951
10154 -87951 -82434 150352 70390 150987 -86932 -72331 -255449 121947 -173258 -221636 17961
10142 -181950 -250123 216822 -47852 -179363 -191226 -35899 318927 -139236 -394374 116409
10131 380855 -141891 -55529 89426 -5842 9927 17255 165081 -296392 -24897 -107875 -51343
10119 -350381 -125185 -11891 -359271 196230 -73371 164602 12762 -110789 176862 -239755
10108 50257 -23551 -46829 -103979 -103554 -76646 94387 -261957 6687 -348351 -31123 -49525 -47080
10096 -47080 61658 -34720 -155458 5076 -19953 -250470 38950 237228 -136372 -177402 160745
$$ packed form
10176B45175b03110j1431E4296k0220f4309I1710J4155J52688C3741a94491L8995
10165a55496A73413B6767J54128c1834P165A02666a46226k43003e6913o2608L1570
10154h7951N517A50352G0390Q0597h6932J4601j83118A21947a73258m8378A7961
10142a81950o8173B16822d7852j31511j1863c5899C18927a39236k55138A16409
10131C80855a41891e5529H9426e842I927P328J47826b96392b4897q2978e1343
10119c50381a25185a1891l47380A96230g3371A64602A2762a10789A76862b39755
10108E0257b3551k3278n7150M25K6908I4387b61957F687c48351c1123j8402K445
10096d7080F1658c4720j20738E076a9953k30517C8950J98278a36372m1030A60745
$$ plain form
10084 -269675 135697 -122782 16643 -160721 31087 -28934 -23901 -13196 -84447 -198359 18944
10072 -137755 -228231 -189508 -166653 -279352 150866 -127178 -91650 -66390 201053 -161847
10061 -209147 28449 51659 204170 -79596 66878 -175696 -255935 188728 -211992 -1749 -327807
10050 -327807 6267 -54054 67774 215006 -117511 -84018 13232 -265955 -21409 -410032 -323597
10039 -323597 -186663 -86087 88352 66035 82090 -299490 5329 -16556 112860 -85996 6387
10027 65476 -199920 -127430 223712 -60764 -233944 -121137 -97901 -102077 -130794 -367534 -61194
10015 -30014 -267204 -114840 9303 -175302 -210470 -63271 -230797 147689 125304 214169 -319407
10003 -180728 -75923 -104111 209758 64754 -8786 47636 55106 -125000 62410 207329 -186551
$$ packed form
10084b69675A35697a22782A6643a60721C1087b8934N033J0705p1251j13912A8944
10072a37755r0476L8723K2855j12699A50866a27178L5528K5260B01053a61847
10061b09147B8449K3210J52511g9596F6878a75696q0239A88728b11992a749l26058
10050c27807F267e4054F7774J47232a17511L3493A3232b65955b1409l88623Q6435
10039c23597J36934h6087H8352k2317J6055b99490E329a6556A12860h5996F387
10027F5476a99920P2490B23712f0764j73180J12807K3236m176k8717k36740f1194
10015c0014k37190a14840I303a75302l5168f3271j67526A47689k2385Q8865c19407
10003a80728g5923k8188B09758F4754h786D7636P470a25000F2410J44919a86551
$$ plain form
9991 -152911 -90455 100755 -315474 -118701 -162968 34380 62488 -94191 -198128 16438 81214
9980 81214 -292184 -58138 97550 -42454 152466 126249 -75981 -74241 294602 28804 -284155
9968 -98385 -132926 9730 -184605 50143 26656 -327599 -2075 -117864 10237 335556 118193
9956 -107022 -86810 34076 41400 -127460 -51465 -293429 130796 -92201 -271658 -62662 -31810
9945 -31810 128397 -156133 -289147 59651 20514 -110376 -107063 -216544 10472 -272029 91770
9933 -211457 44910 -21979 -154286 -265439 -77500 122227 86349 39003 -140086 43268 -175140
9921 -137979 -15750 -248444 97447 52516 197051 5238 258177 -265458 -89361 -43364 -83324
9910 -83324 89195 -57261 -280013 198458 -196993 -204669 -326800 -150741 -78618 109718 -55181
$$ packed form
9991a52911O2456A00755c15474a18701m4267C4380K8108i4191j03937A6438O4776
9980H1214b92184e8138I7550d2454A52466k6217g5981J740B94602B8804b84155
9968i8385l4541I730a84605E0143k3487c27599b075j15789A0237L25319A18193
9956a07022K0212C4076P324a27460e1465k41964A30796i2201j79457f2662L0852
9945c1810A28397a56133j33014E9651B0514a10376L313j09481A0472b72029I1770
9933b11457D4910b1979j32307j11153g7500A22227l5878C9003a40086D3268a75140
9921a37979a5750k32694I7447m4931J44535E238K52939b65458h9361d3364l9960
9910h3324H9195e7261k22752A98458a96993p676j22131a50741P2123A09718e5181
$$ plain form
9898 -141946 -109312 11488 132786 -142804 -72334 76405 -263126 -25600 208159 62638 9065
9886 -117074 -50658 -143781 -250520 139434 -39571 10049 -50621 254138 32297 -314018 74368
9874 -74887 -166843 -240411 -312488 5275 -111204 -33926 -396725 -78328 132983 -193576 -576388
9863 -576388 90061 87183 -51638 -107192 176150 -253371 -206462 327481 -33125 -138669 -59999
9851 -94881 119231 -75184 -301650 -206211 77191 -194649 -242080 -97333 -57694 164376 -120260
9839 -100355 -206200 63279 -194718 95347 83 -39802 252533 -34663 -60294 -9308 -85219 -249906
9827 -249906 -173542 -168827 -86703 -120521 32536 -267074 -154523 127817 19158 -171215 -83579
9815 90109 24032 -79156 -158413 24507 -450996 -116174 -115309 -214268 -45716 -148547 102497
$$ packed form
9898a41946L2634A1488J21298a42804P0470G6405b63126b5600B08159F2638I065
9886a17074e0658r3123j06739A39434c9571A0049e0621B54138C2297c14018G4368
9874g4887r1956p3568p2077E275a11204c3926l62799g8328A32983a93576l82812
9863e76388I0061k878e1638n5554A76150b53371M6909C27481c3125j05544e9999
9851i4881A19231g5184k26466R5439G7191a94649m7431i7333L9639A64376a20260
9839a00355j05845F3279a94718I5347H3c9802B52533c4663k5631i308p5911j64687
9827b49906P6364M715Q2124l3818C2536b67074J12551A27817A9158a71215h3579
9815I0109B4032g9156p9257B4507d50996a16174Q65r8959d5716j02831A02497
$$ plain form
9803 -5974 -118996 -99894 -172630 -85735 -229236 -345323 260042 -64084 -30339 -97455 -290882
9792 -290882 -141365 -225637 146245 -123323 53436 198366 -1026 -212968 -249520 -67041 -209369
9781 -209369 -26172 112999 -356063 9802 -192335 -160770 158834 -1210 48644 -83144 6335
9769 -25569 -65608 37926 -234450 61653 1390 68848 -272832 -244150 69110 59431 37289 104919
9757 104919 22721 -328878 -148251 -321833 304796 -162521 152209 104787 20583 195443
9747 195443 51024 33173 -210536 67348 -292485 96159 219593 43514 171867 -279496 -102847
9735 -229531 77274 -152238 83116 -227455 -340861 -66954 283581 -144280 1147 -388857 -27290
9723 -106794 178364 64470 -62588 -137868 2250 -106366 87822 -123176 37162 -457163 -393149
$$ packed form
9803e974j13022J9102p2736h5735j43501j16087B60042f4084c0339o7116j93427
9792b90882a41365q4272A46245a23323E3436J44930a026k11942l6552f7041j42328
9781b09369b6172A12999c56063I802a92335L1565A58834a210D8644h3144F335
9769b5569m0039C7926b34450F1653A390O7458b72832K8682F9110r679k2142O7630
9757A04919B2721c28878a48251j73582C04796a62521A52209m7422B0583J74860
9747A95443E1024j7851b10536F7348b92485I6159J23434D3514J28353b79496a02847
9735b29531G7274a52238H3116b27455j13406f6954B83581a44280A147c88857b7290
9723a06794A78364F4470f2588p5280B250a06366H7822a23176C7162d57163O4014
$$ plain form
9712 -393149 -151260 -231277 -364525 -83502 -190445 -273535 -155486 -119756 -14018 28211 -221476
9700 -106535 -141374 -9137 -142143 67748 -49969 -311700 63683 -81308 138048 -76671 -30621
9688 104761 51360 -73485 -97660 -292346 -222507 -261619 -407319 -201570 -108109 -264538 223264
9676 206698 -88672 9128 156422 66635 -186614 -273035 -142603 66288 -82041 -32091 27230
9664 -173291 -344597 15163 96908 177074 -91293 53727 -396287 -223971 -419759 -107815 -104408
9653 -104408 -106713 64902 -451046 2015 107703 -182524 202575 -336214 20549 -40536 79545
9641 62566 -119668 18086 109398 276685 113963 86974 -251419 4879 172443 94411 -147620
9629 -176258 459176 -40162 -17151 -34027 -107364 -161908 -168105 159154 -230261 -371715 32849
$$ packed form
9712c93149a51260q0017j33248h3502j06943q3090J18049L5730a4018B8211b21476
9700a06535l4839i137j33006F7748d9969k61731F3683h1308A38048g6671c0621
9688A04761E1360g3485k4175j94686O9839l9112j45700b01570R3461j56429B23264
9676B06698h8672I128J47294F6635a86614q6421J30432F6288h2041c2091B7230
9664a73291j71306A5163Q1745Q0166i1293E3727c96287J72316j95788a07815L407
9653a04408k305F4902d51046B015J05688a82524B02575c36214B0549d0536G9545
9641F2566a19668A8086R1312J67287A13963k6989b51419D879J67564p8032a47620
9629a76258D59176d0162a7151j6876p3337n4544o197A59154b30261j41454C2849
$$ plain form
9617 -19184 56971 -243735 -113100 -184729 -310680 189791 29109 23519 -289759 52442 -119421
9605 -265878 186731 160562 26622 59238 -12039 -369734 -159221 -31431 -259371 -233022 78873
9593 36222 -202362 -96774 110226 -116503 -10726 108937 -1436 119994 124799 -235600 -468614
9582 -468614 91773 51462 -394992 -10663 7727 -183969 51033 -170074 -35085 -127197 -225551
9571 -225551 -167149 -59816 -149719 79164 -109576 -24988 70222 103677 -55307 -76557 -222910
9560 -222910 -75193 -70294 37515 -30455 -18894 -239657 30810 99516 -70431 162950 65090
9548 -128693 -140569 -25572 181669 -284252 279360 -75381 99296 -92101 -11134 52502 -784
9536 97398 -121103 -282910 -146458 215199 11765 171392 -244580 -165643 214513 -11056
$$ packed form
9617a9184E6971b43735a13100p1629j25951A89791B9109n590b89759E2442a19421
9605b65878A86731k6169B6622L2616a2039l57695a59221c1431k27940K6349G8873
9593C6222b02362i6774A10226a16503a0726A08937a436A19994M805b35600k33014
9582d68614I1773m0311c94992a0663G727a83969E1033a70074c5085r2112r8354
9571b25551N8402e9816q9903G9164a09576b4988G0222L3455e5307k1250j46353
9560b22910g5193M899C7515c0455J1561k20763C0810O8706g0431A62950F5090
9548a28693j1876b5572A81669b84252B79360g5381I9296i2101a1134E2502g84
9536I7398a21103j61807J36452B15199A1765J59627b44580P8937B14513a1056
$$ plain form
9525 -195016 190254 -304508 -132785 -26166 71263 14847 -64106 -140409 -48949 -307717 233168
9513 194807 -99420 -314699 -98357 -115838 189093 37634 25073 11204 -140963 67726 -101636
9501 -49569 -352200 -250254 -274204 -311395 153105 33006 -167140 8383 -127161 -224396 -65166
9489 -178806 -262048 -6563 24377 82103 -54806 158336 40185 -94870 -12287 21019 -24456 -282655
9477 -282655 111917 41064 -57587 211764 -139093 -274744 -209650 -45845 225633 -151510
9466 88752 -110240 -267797 -413213 -321349 -328044 76774 -122140 -138266 -162225 -272951 169140
9454 377468 189992 -14956 -324287 -210445 -87178 -53987 -11095 75125 -219091 -150050 -236257
9443 -236257 -12773 -153500 263877 -406451 92832 -290368 -271221 791 -182182 -70457 -91410
$$ packed form
9525a95016A90254c04508a32785b6166G1263A4847f4106p6303d8949k58768B33168
9513A94807i9420k15279i8357j7481A89093C7634j2561A1204a40963F7726a01636
9501d9569l02631J01946k3950l7191A53105C3006a67140H383a27161r7235f5166
9489a78806q3242f563B4377N7726e4806A58336D0185i4870a2287B1019b4456k58199
9477b82655A11917D1064e7587B11764a39093j35651O5094d5845B25633a51510
9466H8752a10240j57557j45416R1864o695G6774a22140j6126k3959j10726A69140
9454C77468j87476a4956l09331J13842h7178L3191a1095G5125b19091O9041q6207
9443b36257a2773j40727B63877d06451I2832b90368J9147G91a82182g0457k0953
$$ plain form
9432 -91410 7066 253526 -104913 -217745 -137549 -101809 39978 -21274 94615 -192360 76813
9420 124425 37518 -18792 -121796 35255 127058 -76647 -281171 -2868 113329 90738 148701
9409 148701 167741 202454 -128025 -41176 396693 -350501 189427 6009 45422 -77888 -276210
9398 -276210 -32971 -169770 -193948 260599 -24853 -91960 -206590 -267012 39165 157022 -82543
9386 79883 -200048 43833 394679 101488 -75571 34314 21982 -308484 381155 79619 -225505
9374 26318 -673948 63499 369927 -468934 164829 -164193 27570 -85097 -35065 171214 -38088
9362 -141879 65512 -1355 20872 33814 -263928 -122030 -451003 -46104 53301 -196474 27692
9350 160474 -18131 135038 22460 -102693 -42213 -51085 -108711 -33179 -382428 -144944 -131648
$$ packed form
9432i1410G066K46460a04913j12832Q0196L5740C9978b1274I4615a92360G6813
9420A24425C7518a8792j03004C5255R1803g6647k04524b868A13329k2591N7963
9409A48701J9040L4713a28025d1176C96693c50501A89427F009L9413g7888j98322
9398b76210c2971j36799k4178B60599b4853o7107j14630o0422C9165J17857h2543
9386G9883b00048D3833L50846A01488g5571C4314j2332c08484C81155G9619b25505
9374B6318f73948F3499L06428d68934A64829a64193B7570h5097c5065A71214c8088
9362a41879F5512a355B0872J2942b63928a22030l28973d6104E3301a96474B7692
9350A60474a8131A35038B2460a02693d2213q872n7626c3179l49249a44944J3296
$$ plain form
9339 -131648 161992 -292107 -268109 23538 112668 -47980 -4389 -127464 -41936 -212633 51409
9327 -27542 -43122 -36276 15473 15588 135696 254305 107252 -123522 -51295 -287138 159898
9315 29328 -174916 226934 79896 132990 234428 173402 66828 -92494 18399 263701 -124693
9303 -73335 -129056 -47276 2652 185636 71102 -30110 -231418 -313830 -318887 102994 -42758 -340057
9291 -340057 -339363 -147026 -356254 -80820 -468491 -56288 -10476 -238595 -446755 4829 -86121
9279 59937 2168 -76301 -288236 156796 313003 -45774 271159 -218354 -344424 -260531 1066
9267 5606 140192 14456 59456 -256762 -94676 271562 33736 95280 63224 28046 -110522
9255 -206760 -240443 63694 -325423 142339 -65111 -163652 -184768 -249066 65299 -107544 -148300
$$ packed form
9339a31648A61992b92107K3998B3538Q9130d7980d389j23075d1936j70697E1409
9327b7542j5580O846A5473J15J20108J18609A07252a23522e1295k35843A59898
9315B9328a74916B26934G9896N3094J01438o1026F6828i2494A8399K45302a24693
9303g3335n5721d7276B652J82984G1102c0110k01308q2412n057A02994d2758k97299
9291c40057O94a47026k09228h0820l87671e6288a0476k28119k08160D829h6121
9279E9937B168g6301k11935A56796J56207d5774B71159b18354j26070Q3893A066
9267E606J34586A4456M5000b56762i4676B71562C3736O1544l2056B8046a10522
9255b06760l3683F3694c25423A42339f5111r8541k1116o4298F5299a07544m0756
$$ plain form
9244 -148300 116369 40860 149452 51829 14256 -127405 -29607 -155697 -88183 -16023 44773
9232 -201978 -214646 -457840 -249823 -125687 -261627 73650 24493 -119018 216103 34958
9221 -50843 87151 68615 -24953 344127 -92640 -30560 -211694 111200 49943 -258312 -33967
9209 181759 -219986 113867 118007 -25788 -50577 -137715 -82339 212813 218363 178911 48353
9197 -40585 -232971 -197255 258562 -117143 143460 -112714 287416 -336088 -221226 330138
9186 187377 -3072 16282 126624 113058 -72971 -159437 47736 -179044 -424320 -102869 -314440
9175 -314440 167772 10939 -176414 135619 -218900 -187077 27702 -55894 51028 121373 374988
9164 374988 111371 -244179 -19278 -52983 -280516 25477 56009 88263 -191680 32036 -152995
$$ packed form
9244a48300A16369D0860J08592E1829A4256a27405b9607j26090O7514a6023D4773
9232b01978j2668k43194K08017J24136j35940G3650B4493a19018B16103C4958
9221e0843H7151j8536b4953C44127i2640c0560j81134A11200D9943b58312c3967
9209A81759b19986A13867M140b5788k4789q7138N5376B12813N550l9452D8353
9197d0585j92386L5716B58562a17143A43460a12714B87416c36088J14862C30138
9186A87377c072A6282J10342j3566g2971q6466D7736a79044k45276a02869k11571
9175c14440A67772A0939a76414A35619b18900L1823B7702e5894E1028P0345K53615
9164C74988A11371b44179a9278l3705k27533B5477L0532L2254a91680C2036a52995
$$ plain form
9152 182872 -210492 48391 85240 -79416 118270 187214 -34640 -244183 12954 -178894 -5058
9140 -59341 139176 -100755 105916 46892 174881 251225 285828 -233898 -79837 113415 -116247
9128 -13167 24956 -63552 -175686 6261 358968 -51565 -48293 -137201 240629 226866 89495 21907
9115 103072 169696 -85992 -135685 -201285 -136404 -270223 66494 -302862 -397963 239025 235379
9104 235379 165527 298211 56352 189075 -282168 -193293 -254336 386534 43752 -170327 -122448
9093 -122448 179226 -198929 25043 7286 100872 -276749 -86427 28014 46918 12161 -147811
9081 7449 1124 -219992 47168 -160591 -307989 162217 -194356 -354803 -186738 -254888 102747
9069 -112399 -204310 -16966 232885 -313337 -101623 43491 -57479 181436 -198540 190084
$$ packed form
9152A82872b10492D8391L6849g9416A18270O8944c4640k09543A2954a78894e058
9140e9341A39176a00755A05916D6892J27989P6344L4603b33898g9837A13415a16247
9128a3167B4956f3552j12134F261L52707e1565L272q8908B40629j3763H9495B1907
9115A03072O6624h5992m9693o5600O4881j33819F6494c02862r5101B39025l646
9104B35379o9852J32684E6352J32723b82168Q8875o1043C86534D3752a70327M7879
9093a22448A79226a98929B5043G286R3586b76749h6427B8014J8904A2161a47811
9081G449A124b19992D7168a60591j47398A62217a94356j60447J68065o8150A02747
9069a12399r1911a6966B32885c13337a01623D3491e7479A81436a98540A90084
$$ plain form
9058 -144500 -130211 -160866 -34705 -279527 -220060 -50265 -151339 -236282 -45901 118539 -59785
9046 141344 347012 -197048 -52079 -25385 105450 96568 136472 327931 -54302 -28673 11386
9034 102582 112696 -269826 514490 351247 -21929 90813 139089 -103888 -28726 22289 -242398
9022 -312194 70442 -106110 -80483 -245230 -149137 -128444 269510 -162986 -268562 -37285 -206512
9011 -206512 -256917 -89801 -281162 -50574 250489 81131 -339336 75848 -82280 93941 -466204
8999 -225857 157985 -182237 -360452 -85492 -403311 -335170 174119 -75574 -69032 -318906 -79092
8987 -197688 130183 -253822 102986 -93304 -157291 -400814 -65289 117050 24889 238803
8977 238803 -180892 -428956 -15275 -293123 175171 -74983 -11553 -81872 -102221 90436 231338
$$ packed form
9058a44500J4289l0655c4705k44822N9467e0265j01074q4943d5901A18539e9785
9046A41344K05668a97048e2079b5385A05450q882L9904J91459e4302K5629A1386
9034A02582J0114b69826E14490j63243b1929I0813M8276a03888b8726B2289b42398
9022c12194G0442a06110K5627j64747R6093K0693B69510a62986j05576c7285j69227
9011b06512n0405h9801j91361e0574B50489H1131c39336G5848h2280I3941d66204
8999b25857A57985a82237j78215h5492l17819O8141A74119g5574O542k49874g9092
8987a97688A30183b53822A02986i3304o3987k43523f5289A17050B4889K13914
8977B38803a80892k48064a5275k77848A75171g4983a1553p0319k0349I0436J40902
$$ plain form
8966 231338 -248393 -202747 5590 1806 -82567 -40572 -56427 150537 -125566 35739 -138816
8954 118280 -414209 90828 -97245 -70927 -105917 -56533 -80041 -300770 -65719 -467073 166516
8942 -231638 -389827 -7359 286907 -104769 -104346 180577 156244 145128 298151 232022 -52119
8930 297304 -230356 -162620 10023 184060 464015 421890 774194 2311577 9070687 15950958
8920 15950958 5077903 1817718 967293 1158138 542599 257030 -287044 210035 317763
8911 317763 128948 135369 148941 419959 222955 76196 -13523 -64621 268675 289019 195516
8900 195516 184282 -157043 -34274 -102195 122688 -202602 234365 50804 166553 88302 -11139
8888 54161 284041 20712 103876 131137 10254 -94614 -245394 -61915 -103797 -382402 161159
$$ packed form
8966B31338b48393M5646E590A806h2567d0572j5855A50537a25566C5739a38816
8954A18280d14209I0828i7245K6318l4990M9384k3508k20729f5719m01354A66516
8942b31638j58189g359B86907a04769M23A80577k4333j1116J53023o6129e2119
8930B97304b30356O7736A0023J74037K79955m2125L52304J537383O759110O880271
8920A5950958E077903A817718q50425J90845E42599B57030b87044B10035J07728
8911C17763A28948O421J3572K71018j97004G6196a3523n1098B68675K0344r3503
8900A95516j1234a57043c4274o7921A22688b02602B34365E0804J15749p8251a1139
8888E4161K29880B0712Q3164K7261A0254i4614j50780f1915m1882k78605A61159
$$ plain form
8876 269736 -139279 -283096 185557 -278665 204900 -191292 -66022 -118480 83971 -437569
8865 -224852 61417 -17530 -101031 -60822 -203885 -157988 93429 54337 -286819 -153882 47370
8853 137669 308906 -50602 -34917 260007 -32358 177189 9683 120454 20683 -115104 -319656
8842 -319656 -17798 -243824 73935 1011 101953 154358 -14960 -91024 -85801 -166017 -35142 -22357
8830 -22357 13598 22109 120340 171893 -107533 1574 -318349 -304969 342161 -382880 25288
8818 172823 150944 -129531 -60053 -257675 54921 135995 -8707 432974 63944 -375591 163981
$$ packed form
8876B69736a39279j43817A85557b78665B04900a91292f6022n2458H3971d37569
8865b24852F1417a7530q3501M0209j43063M5897I3429l9092b86819J32937D7370
8853A37669J71237e0602J5685B60007c2358A77189I683J10771B0683a15104k04552
8842c19656a7798k26026G3935A011J00942N2405a4960p6064N223q0216c5142J2785
8830b2357A3598Q511R8231N1553a07533A574c18349J3380C42161c82880B5288
8818A72823k1879a29531f0053j97622E4921Q1074h707D32974F3944c75591A63981
$$ [...]
##END NTUPLES=NMR SPECTRUM
##END=
